
##TITLE=AC1217_HTEAH12048_7160707_EEUpWFWHyQ
##JCAMPDX= 6.0         $$ Bruker NMR JCAMP-DX V2.0
##DATA TYPE= NMR SPECTRUM
##DATA CLASS= NTUPLES
##ORIGIN= BRUKER
##OWNER= Administrator
$$ 1.72 TOPSPIN		Version 2.1
$$ 2012-11-30 23:48:24.127 -0500  Administrator@X
$$ Compression mode = diff/dup
##.OBSERVE FREQUENCY= 400.02188249412
##.OBSERVE NUCLEUS= ^1H
##.ACQUISITION MODE= SIMULTANEOUS (DQD)
##.ACQUISITION SCHEME= undefined
##.AVERAGES= 64
##.DIGITISER RES= 22
##SPECTROMETER/DATA SYSTEM= spect
##.PULSE SEQUENCE= noesygpps1d.comp
##.SOLVENT NAME= COFFEE_meoh
##.SHIFT REFERENCE= INTERNAL, COFFEE_meoh, 1, 14.9625
##AUDIT TRAIL= $$ (NUMBER, WHEN, WHO, WHERE, PROCESS, VERSION, WHAT)
$$ ##TITLE= Audit trail, TOPSPIN		Version 2.1
$$ ##JCAMPDX= 5.01
$$ ##ORIGIN= Bruker BioSpin GmbH
$$ ##OWNER= Administrator
$$ $$ E:\/data/COFFEE/nmr/AC1217_HTEAH12048_7160707_EEUpWFWHyQ/12/pdata/1/auditp.txt
$$ ##AUDIT TRAIL=  $$ (NUMBER, WHEN, WHO, WHERE, PROCESS, VERSION, WHAT)
(   1,<2012-11-30 23:48:17.072 -0500>,<Administrator>,<X>,<go>,<TOPSPIN 2.1>,
      <created by zg
	started at 2012-11-30 23:37:01.593 -0500,
	POWCHK enabled, PULCHK disabled,
       configuration hash MD5:
       86 BA 57 50 F2 9D 5C 9B 26 00 A9 28 5F 66 2E 89
       data hash MD5: 64K
       60 75 C4 E0 B7 6B 17 42 CA 11 F6 4D 57 31 89 ED>)
(   2,<2012-11-30 23:48:20.523 -0500>,<Administrator>,<X>,<proc1d>,<TOPSPIN 2.1>,
      <Start of raw data processing
       efp LB = 0.3 FT_mod = 6 PKNL = 1 PHC0 = 0 PHC1 = 0 SI = 128K 
       data hash MD5: 128K
       B8 D5 AD F2 EF DC 7D 0D 77 95 50 8B B9 7F 42 4E>)
(   3,<2012-11-30 23:48:21.834 -0500>,<Administrator>,<X>,<proc1d>,<TOPSPIN 2.1>,
      <pk PHC0 = -83.07312 PHC1 = 0 
       data hash MD5: 128K
       A9 5F CF 11 F2 8F 6E 16 87 F6 D5 8B 1C 19 A9 6B>)
(   4,<2012-11-30 23:48:22.759 -0500>,<Administrator>,<X>,<proc1d>,<TOPSPIN 2.1>,
      <abs ABSG = 1 
       data hash MD5: 128K
       59 6A 09 3F BD FA 87 1F 22 7B 11 49 19 03 AF D1>)
(   5,<2012-11-30 23:48:23.009 -0500>,<Administrator>,<X>,<proc1d>,<TOPSPIN 2.1>,
      <abs ABSG = 2 
       data hash MD5: 128K
       D0 40 AA BB 2F 31 E9 EB 87 86 19 89 88 86 D0 1F>)
(   6,<2012-11-30 23:48:23.241 -0500>,<Administrator>,<X>,<proc1d>,<TOPSPIN 2.1>,
      <abs ABSG = 3 
       data hash MD5: 128K
       99 8E B7 91 6E 4E D3 10 D6 5E 21 81 72 E2 87 02>)
(   7,<2012-11-30 23:48:23.452 -0500>,<Administrator>,<X>,<proc1d>,<TOPSPIN 2.1>,
      <abs ABSG = 4 
       data hash MD5: 128K
       EE F6 E2 9A 88 D5 75 51 1C 15 26 3B B6 B2 17 00>)
(   8,<2012-11-30 23:48:23.684 -0500>,<Administrator>,<X>,<proc1d>,<TOPSPIN 2.1>,
      <abs ABSG = 5 
       data hash MD5: 128K
       ED AE 0D 52 43 6E 4E E5 86 7C 1B 4F B3 B0 DF B6>)
$$ ##END=
$$ 
$$ $$ hash MD5
$$ $$ 23 88 1F E3 79 0A 57 6C 21 59 60 2A 3C 8E 76 C4
##$RELAX= 
##$RELAX= 
##$RELAX= 
##$RELAX= 
##$RELAX= 
##$RELAX= 
##$RELAX= 
##$RELAX= 
$$ Bruker specific parameters
$$ --------------------------
##$DU= <E:\>
##$EXPNO= 12
$$ [...]
150 150 150 150 150 150 150 150
##$TP07= 0
##$TPNAME0= <>
##$TPNAME1= <>
##$TPNAME2= <>
##$TPNAME3= <>
##$TPNAME4= <>
##$TPNAME5= <>
##$TPNAME6= <>
##$TPNAME7= <>
##$TPOAL= (0..7)
0.5 0.5 0.5 0.5 0.5 0.5 0.5 0.5
##$TPOFFS= (0..7)
0 0 0 0 0 0 0 0
##$TUNHIN= 0
##$TUNHOUT= 0
##$TUNXOUT= 0
##$USERA1= <user>
##$USERA2= <user>
##$USERA3= <user>
##$USERA4= <user>
##$USERA5= <user>
##$V9= 5
##$VALIST= <valist>
##$VCLIST= <CCCCCCCCCCCCCCC>
##$VD= 0
##$VDLIST= <DDDDDDDDDDDDDDD>
##$VPLIST= <PPPPPPPPPPPPPPP>
##$VTLIST= <TTTTTTTTTTTTTTT>
##$WBST= 1024
##$WBSW= 4
##$XGAIN= (0..3)
0 0 0 0
##$XL= 0
##$YL= 0
##$YMAX_a= 8272575
##$YMIN_a= -17692596
##$ZGOPTNS= <>
##$ZL1= 120
##$ZL2= 120
##$ZL3= 120
##$ZL4= 120
##$ABSF1= 14.9625
##$ABSF2= -5.595682
##$ABSG= 5
##$ABSL= 3
##$ALPHA= 0
##$AQORDER= 0
##$ASSFAC= 0
##$ASSFACI= 0
##$ASSFACX= 0
##$ASSWID= 0
##$AUNMP= <proc_prof1d_extract.lims>
##$AXLEFT= 0
##$AXNAME= <>
##$AXNUC= <1H>
##$AXRIGHT= 0
##$AXTYPE= 0
##$AXUNIT= <>
##$AZFE= 0.1
##$AZFW= 0.1
##$BCFW= 0
##$BC_mod= 0
##$BYTORDP= 0
##$COROFFS= 0
##$CY= 15
##$DATMOD= 1
##$DC= 0
##$DFILT= <>
##$DTYPP= 0
##$F1P= 0
##$F2P= 0
##$FCOR= 0.5
##$FTSIZE= 131072
##$FT_mod= 6
##$GAMMA= 0
##$GB= 0
##$INTBC= 1
##$INTSCL= 1
##$ISEN= 128
##$LB= 0.3
##$LEV0= 0
##$LPBIN= 0
##$MAXI= 10000
##$MC2= 0
##$MEAN= 0
##$ME_mod= 0
##$MI= 0
##$NCOEF= 0
##$NC_proc= -2
##$NLEV= 6
##$NOISF1= 0
##$NOISF2= 0
##$NSP= 0
##$NTH_PI= 0
##$NZP= 0
##$OFFSET= 14.9625
##$PC= 1
##$PHC0= -83.07312
##$PHC1= 0
##$PH_mod= 1
##$PKNL= yes
##$PPARMOD= 0
##$PPDIAG= 0
##$PPIPTYP= 0
##$PPMPNUM= 2147483647
##$PPRESOL= 1
##$PSCAL= 4
##$PSIGN= 0
##$PYNMP= <proc.py>
##$REVERSE= no
##$SF= 400.020009037256
##$SI= 131072
##$SIGF1= 0
##$SIGF2= 0
##$SINO= 400
##$SIOLD= 131072
##$SPECTYP= <>
##$SREGLST= <1H.CDCl3>
##$SSB= 0
##$STSI= 131072
##$STSR= 0
##$SW_p= 8223.68421052631
##$SYMM= 0
##$S_DEV= 0
##$TDeff= 65536
##$TDoff= 0
##$TI= <>
##$TILT= no
##$TM1= 0
##$TM2= 0
##$TOPLEV= 0
##$USERP1= <user>
##$USERP2= <user>
##$USERP3= <user>
##$USERP4= <user>
##$USERP5= <user>
##$WDW= 1
##$XDIM= 131072
##$YMAX_p= 441532521
##$YMIN_p= -11691
##$CURPLOT= <Network HP LaserJet P1505>
##$CURPRIN= <$Network HP LaserJet P1505>
##$DFORMAT= <normdp>
##$LAYOUT= <+/1D_H.xwp>
##$LFORMAT= <normlp>
##$PFORMAT= <normpl>
##$SURQMSG= 1
$$ End of Bruker specific parameters
$$ ---------------------------------
##NTUPLES= NMR SPECTRUM
##VAR_NAME=  FREQUENCY,     SPECTRUM/REAL,   SPECTRUM/IMAG
##SYMBOL=    X,             R,               I
##VAR_TYPE=  INDEPENDENT,   DEPENDENT,       DEPENDENT
##VAR_FORM=  AFFN,          ASDF,            ASDF
##VAR_DIM=   131072,        131072,          131072
##UNITS=     HZ,            ARBITRARY UNITS, ARBITRARY UNITS
##FACTOR=    0.0627417313425164, 1,          1
##FIRST=     8223.62146879497, 2615,         -65735
##LAST=      0,             4428,            -65349
##MIN=       0,             -11691,          0
##MAX=       8223.62146879497, 441532521,    0
$$ Real data points
##PAGE= N=1
##DATA TABLE= (X++(R..R)), XYDATA
$$ [...]
60961B8114307J1760L88542O42257N70244P3258p44126j621261k302736k667482
60952B2464763k736182k598108k345472k049277j756414j490044j255626j052176
60944G181464q78662p32675o09519n05422m19360l50656k96950k55292k23236
60935B909692j98105j76954j58183j41914j28311j16637j06123r6436q7041p7500
60925A622488o8747o2615n9611n8351n7483n6852n6281n4746n1669m7881m4351
60914A003901m0853l6836l2722k9325k6681k4394k2594k1423k0073j7550j4261
60903G17189j1743j0688j0177r195p942p221p163p164o714n768m482l035j678
60890F24219o02J94Q10J318J907K914M371N684O143N713M969M299L589K688J700
$$ y = [28114307, 28126067, 28514609, 29156866, 29727110, 29800368, 29056242, 27434981, 25132245, 22464763, 19728581, 17130473, 14785001, 12735724, 10979310, 9489266, 8233640, 7181464, 6302802, 5570127, 4960608, 4455186, 4035826, 3685170, 3388220, 3132928, 2909692, 2711587, 2534633, 2376450, 2234536, 2106225, 1989588, 1883465, 1787029, 1699988, 1622488, 1553741, 1491126, 1431515, 1373164, 1315681, 1258829, 1202548, 1147802, 1096133, 1048252, 1003901, 963048, 926212, 893490, 864165, 837484, 813090, 790496, 769073, 749000, 731450, 717189, 705446, 694758, 684581, 675386, 667444, 660223, 653060, 645896, 639182, 633414, 628932, 625897, 624219, 623617, 623811, 624621, 625939, 627846, 630760, 635131, 640815, 646958, 652671, 657640, 661939, 665528, 668216, 669916]
60875F69916O87m89j823l062m123n208o279o907o919o767o801o640n801m538l463
60860F01783k668j848j035m62J22J162K401L115L312L842N089O405P202P896R202
60845F45518J1061J2890J4451J5963J7527J8971K0051K0444J9663J7459J4295
60834H28293J1180Q964P885P606P514P144O429N525M309K417o4k296l402l364
60820H88140k918k655k569k451k319k422k932l863n071o228o966p173p194p481
60806H25898p991q226p948p672q080r100r954j0044r405q321p013n818n100m654
60792G16572l727k024k50Q15J352K097L282M580N861P276Q706R732J0238J0542
60778G75052J0948J1504J2199J2924J3328J3130J2539J1970J1470J0840J0166
$$ y = [669916, 670603, 670114, 668291, 665229, 661106, 655898, 649619, 642712, 635793, 629026, 622225, 615585, 609784, 605246, 601783, 599115, 597267, 596232, 595770, 595892, 597054, 599455, 602570, 605882, 609724, 614813, 621218, 628420, 636316, 645518, 656579, 669469, 683920, 699883, 717410, 736381, 756432, 776876, 796539, 813998, 828293, 839473, 848437, 856322, 863928, 871442, 878586, 885015, 890540, 894849, 897266, 897202, 894906, 891504, 888140, 885222, 882567, 879998, 877547, 875228, 872806, 869874, 866011, 860940, 854712, 847746, 840573, 833379, 825898, 817907, 809681, 801733, 794061, 785981, 776881, 766927, 756883, 747478, 739157, 732144, 726326, 721226, 716572, 712845, 710821, 710571, 711386, 712738, 714835, 718117, 722697, 728558, 735834, 744540, 754272, 764510, 775052, 786000, 797504, 809703, 822627, 835955, 849085, 861624, 873594, 885064, 895904, 906070]
60767I06070R697R305Q582P533O573N885N240M530L936L477K880K039J212O38
60753I77597L02R1n8k18m12m90l88k90l49m01l32m52j048j883k630l495m750o006
60735I54788o712p075p635q138p851o908o238o068n580m427l461l410l677l200
60721H74408j855m00N90J146J527J851J972J584P25j1j53j87r82k496l804m501
60705H69414n110n908o345o085n649n459n115m243l299k813k557k177j998k335
60691H10321k689k510k303k935m235n300o001p058q650j0011j0615j0843j1040
60678G26131j0806r786q601q247q745r048q353p003n901n239m297k546m94Q77
60664F37942J347J628K340L291M001M433M810N077N022M763M667M730M518L864
$$ y = [906070, 915767, 925072, 933654, 941187, 947760, 953645, 958885, 963415, 967351, 970828, 973708, 975747, 976959, 977597, 977899, 977990, 977932, 977714, 977302, 976812, 976424, 976134, 975785, 975384, 975052, 974600, 973552, 971669, 969039, 965544, 960794, 954788, 948076, 941001, 933366, 925228, 917377, 910469, 904231, 898163, 892583, 888156, 884695, 881285, 877608, 874408, 872553, 872153, 872743, 873889, 875416, 877267, 879239, 880823, 881548, 881537, 881384, 881197, 880215, 877719, 873915, 869414, 864304, 858396, 852051, 845966, 840317, 834858, 829743, 825500, 822201, 819388, 816831, 814654, 812656, 810321, 807632, 805122, 802819, 799884, 795649, 790349, 784348, 777290, 768640, 758629, 748014, 737171, 726131, 715325, 705539, 696938, 688691, 679946, 670898, 662545, 655542, 649641, 644402, 640105, 637559, 637065, 637942, 639289, 640917, 643257, 646548, 650549, 654982, 659792, 664869, 669891, 674654, 679321, 684051, 688569, 692433]
60650F92433L342L688M802N671N511M757M523N099N532M926L647K780K764L199
60636G52674L711M292M844N186N611O708Q388R761J0253J0311J0651J1355J2131
60623H55876J2976J3949J4634J4454J3430J2165J1004R609P518M897K454O75o48
60610I72993j981l289m025l944l488l198l090k900k567k173j783j771k884n370
60596I30530q391j0864j2529j3570j3699j2582j0878r744r284q504o858m855k930
60583H05842q61J296K713K828K195J748J730J845J879J820J659J479J385J273
60569H28831J102J330K396L732M219L755L426L816M087L305J724J48j240k618
60555H58013l795m485m891n355n747n795n572n179m294k614m08J777L789N855
$$ y = [692433, 695775, 699463, 704265, 709936, 715447, 720204, 724727, 729826, 735358, 740284, 743931, 746711, 749475, 752674, 756385, 760677, 765521, 770707, 776318, 783026, 791414, 801175, 811428, 821739, 832390, 843745, 855876, 868852, 882801, 897435, 911889, 925319, 937484, 948488, 958097, 965615, 970512, 972966, 973641, 972993, 971012, 967723, 963698, 959754, 956266, 953068, 949978, 947078, 944511, 942338, 940555, 938784, 935900, 930530, 922139, 911275, 898746, 885176, 871477, 858895, 848017, 838273, 828989, 820485, 813627, 808772, 805842, 804981, 806277, 808990, 811818, 814013, 815761, 817491, 819336, 821215, 823035, 824694, 826173, 827558, 828831, 829933, 831263, 833659, 837391, 841610, 845365, 848791, 852607, 856694, 859999, 861723, 861871, 860631, 858013, 854218, 849733, 844842, 839487, 833740, 827945, 822373, 817194, 812900, 810286, 809878, 811655, 815444, 821299]
60541H21299Q267J1250J4818J8603K2283K6295L1429L7516M3203M7304M9444M9114
60529A180825M5226L7400K6860J5100K470j0895k3362l2338l6571l7049l5552
60518A132114l2978k9128k3610j6736r643l448J699O215R807J1430J0845R391
60506A065958Q553Q512Q761R419J1001J3407J6150J9396K3880K9883L7056M5168
60494A297144N4367O4716P6013Q8065J00691J13604J26719J40492J55641J72757
60484B390209J92513K15976K44147K77194L14130L52616L88209M13791M20383
60475E209168L99616L46772K62991J55102L3102r2424k10727l10616l82719m23463
60465D986802m36187m27716m04488l71865l34879k97627k62202k29356j99782
$$ y = [821299, 829566, 840816, 855634, 874237, 896520, 922815, 954244, 991760, 1034963, 1082267, 1131711, 1180825, 1226051, 1263451, 1290311, 1305411, 1307881, 1296986, 1273624, 1241286, 1204715, 1167666, 1132114, 1099136, 1070008, 1046398, 1029662, 1020019, 1016571, 1018270, 1024485, 1034292, 1045722, 1056567, 1065958, 1074511, 1083023, 1091784, 1101203, 1112204, 1125611, 1141761, 1161157, 1185037, 1214920, 1251976, 1297144, 1351511, 1416227, 1492240, 1580305, 1680996, 1794600, 1921319, 2061811, 2217452, 2390209, 2582722, 2798698, 3042845, 3320039, 3634169, 3986785, 4374994, 4788785, 5209168, 5608784, 5955556, 6218547, 6373649, 6406751, 6314327, 6103600, 5792984, 5410265, 4986802, 4550615, 4122899, 3718411, 3346546, 3011667, 2714040, 2451838, 2222482, 2022700]
60456B022700j73980j51558j31768j14392r9344q6003p3943o3683n5701m9148
60446A023180m2678l6169l0649k6670k3780k1300j8842j6280j4030j3005j3507
60435G66270j4484j4719j4248j3802j3381j2445j1096r916q960p947p089o701
60423F31482o335n461m560m329m155k896r59Rl91o74K25J509J977J820K078L086
60407F12426M167M549M081L334L089L499L888L676L223L139L279L226L380M361
60393F63317N698O308O287O775P930Q375P192N307M225M195M312L756K369M95
60379G36541j278k538l424m308n137n513n362m863l908k399r27k77k72q9L66M08
60363F97020M1J78J093J823J728J615K467L926M868M974M886N152N685O101O122
$$ y = [2022700, 1848720, 1697162, 1565394, 1451002, 1351658, 1265655, 1191712, 1128029, 1072328, 1023180, 980502, 944333, 913684, 887014, 863234, 841934, 823092, 806812, 792782, 779777, 766270, 751786, 737067, 722819, 709017, 695636, 683191, 672095, 662179, 653219, 645272, 638183, 631482, 625147, 619686, 615126, 610797, 606642, 603746, 602787, 602796, 602405, 601731, 601956, 603465, 605442, 607262, 609340, 612426, 616593, 621142, 625223, 628557, 631646, 635145, 639033, 642709, 645932, 649071, 652350, 655576, 658956, 663317, 669015, 675323, 681610, 688385, 696315, 704690, 711882, 717189, 721414, 725609, 729921, 733677, 736046, 736541, 735263, 732725, 729301, 724993, 719856, 714343, 708981, 704118, 700210, 697811, 696884, 696607, 696335, 696246, 696612, 697020, 697061, 697239, 698332, 700155, 701883, 703498, 705965, 709891, 714759, 719733, 724619, 729771, 735456, 741557, 747679]
60348G47679N777N512N864O819P793Q382Q762R088R043Q198O614M737K976J546
60334H38790M35n69j632k538k863k504j771r84k27N92J674L155M700N527N210
60319H46995M184L016J595l84k539m178n265o167o716o406n429m636m415m393
60305H05262m181l655k632j142O8K35k58l44K12P72J235K267L866M898M591L534
60289H14728K746K492K457K364K090J737J783K543L438L571L078K995L644M226
60275H53892M212M008L932L618K981K728L227L768L660L302L498M391N694P303
60261I10214R091J0583J1564J2558J4193J6533J9249K2021K4466K6271K7819L0047
60249A134609L3434L7645M2386M7823N3840N9777O5374P1184P7573Q4099R0454
$$ y = [747679, 753456, 758968, 764832, 771651, 779444, 787826, 796588, 805676, 814719, 822917, 829531, 834268, 837244, 838790, 839225, 838656, 837024, 834486, 831623, 829119, 827348, 826364, 826137, 826729, 828403, 831558, 836258, 841785, 846995, 851179, 854195, 855790, 855406, 852867, 848689, 843424, 837257, 830541, 824135, 818706, 814070, 809655, 805262, 801081, 797426, 794794, 793652, 793720, 793955, 793697, 793353, 793565, 794337, 795572, 797839, 801705, 806603, 811194, 814728, 817474, 819966, 822423, 824787, 826877, 828614, 830397, 832940, 836378, 839949, 843027, 846022, 849666, 853892, 858104, 862112, 866044, 869662, 872643, 875371, 878598, 882366, 886026, 889328, 892826, 897217, 902911, 910214, 919305, 929888, 941452, 954010, 968203, 984736, 1003985, 1026006, 1050472, 1076743, 1104562, 1134609, 1168043, 1205688, 1248074, 1295897, 1349737, 1409514, 1474888, 1546072, 1623645, 1707744, 1798198]
60238A798198R7142J04480J11596J17275J21293J24098J25532J24625J20570J13416
60228B958225J03920R3032Q1362O8778N4782L9350K3178P155p964k1435l2795
60217C367588m2281n0256n6080n8465n7121n3168m7617m0449l1549k1468j0727
60206B898407Q47J3325K6113L8829N1973O5983Q0243R3695J05813J16280J24338
60195C615846J29298J31165J30058J25502J16924J04489Q8879P0743N0877L0349
60185D594130R776j1030l2034n2074o9605q3907r5042j02994j07498j08275j05062
60174C836385r7814q7274p4725o0785m5127k7936j0637N574K1134L7030N2892
60163C548717O7267P9246Q8702R5160R7593R5474Q9194P9365O6382N0908L4188
$$ y = [1798198, 1895340, 1999820, 2111416, 2228691, 2349984, 2474082, 2599614, 2724239, 2844809, 2958225, 3062145, 3155177, 3236539, 3305317, 3360099, 3399449, 3422627, 3429782, 3421818, 3400383, 3367588, 3325307, 3275051, 3218971, 3160506, 3103385, 3050217, 3002600, 2962151, 2930602, 2909134, 2898407, 2899254, 2912579, 2938692, 2977521, 3029494, 3095477, 3175720, 3269415, 3375228, 3491508, 3615846, 3745144, 3876309, 4006367, 4131869, 4248793, 4353282, 4442161, 4512904, 4563781, 4594130, 4603906, 4592876, 4560842, 4508768, 4439163, 4355256, 4260214, 4157220, 4049722, 3941447, 3836385, 3738571, 3651297, 3576572, 3515787, 3470660, 3442724, 3432087, 3437661, 3458795, 3495825, 3548717, 3615984, 3695230, 3783932, 3879092, 3976685, 4072159, 4161353, 4240718, 4307100, 4358008, 4392196]
60152D392196J7697K502j1060k3244l4098m2720m7684m8363m5266l8949k9435
60141D091576j7108l251J1120K6282M2941O0996Q0007J00266J22344J45917J70082
60130D831172J94739K20771K48754K78068L07248L34677L59069L79696L96048
60121G550242M07036M10974M06821L94931L76080L50270L17209K77416K31955
60112A0722934J81394J26024O6980O199n4811j15346j74446k30090k79606l20525
60102I928707l51019l70178l78213l76194l65349l46673l21132k90037k55095
60093F874817k17987j79755j40652j00900o1408k3463J2059M4631P3312R6824
60083F377478J14419J25971J31113J29242J20514J06101Q7110O4207L8542J2031
$$ y = [4392196, 4409893, 4412395, 4401335, 4378091, 4343993, 4301273, 4253589, 4205226, 4159960, 4121011, 4091576, 4074468, 4071217, 4082337, 4108619, 4151560, 4212556, 4292563, 4392829, 4515173, 4661090, 4831172, 5025911, 5246682, 5495436, 5773504, 6080752, 6415429, 6774498, 7154194, 7550242, 7957278, 8368252, 8775073, 9170004, 9546084, 9896354, 10213563, 10490979, 10722934, 10904328, 11030352, 11097332, 11103531, 11048720, 10933374, 10758928, 10528838, 10249232, 9928707, 9577688, 9207510, 8829297, 8453103, 8087754, 7741081, 7419949, 7129912, 6874817, 6656830, 6477075, 6336423, 6235523, 6174115, 6150652, 6162711, 6207342, 6280654, 6377478, 6491897, 6617868, 6748981, 6878223, 6998737, 7104838, 7191948, 7256155, 7294697, 7306728]
60073G306728j3841l8620o1900q2768j00917j17253j32584j46497j58337j68316
60063F285695j76775j83044j86069j85543j81573j73961j62811j49267j34630
60054D752022j19132j02428q4744o6615m8050k8917r679R185K8065M7479O6907
60043D444093Q5234J01925J16817J29181J37977J42670J42885J37723J26528J10134
60033E675167R0293O8073M3617J7224j0216l7665o4071q8340j09903j28866j44870
60022E310443j56378j62028j62179j58182j50755j40062j26868j12230r6440p9493
60012C965828o2218m5660k9524j2597N380K3577M1780O0819Q1140J02014J22520
60001D253059J42313J61091J78052J92022K01653K05614K03268J94975J81184
$$ y = [7306728, 7292887, 7254267, 7192367, 7109599, 7008682, 6891429, 6758845, 6612348, 6454011, 6285695, 6108920, 5925876, 5739807, 5554264, 5372691, 5198730, 5035919, 4886652, 4752022, 4632890, 4530462, 4445718, 4379103, 4331053, 4302136, 4292457, 4301642, 4329707, 4377186, 4444093, 4529327, 4631252, 4748069, 4877250, 5015227, 5157897, 5300782, 5438505, 5565033, 5675167, 5765460, 5833533, 5877150, 5894374, 5884158, 5846493, 5782422, 5694082, 5584179, 5455313, 5310443, 5154065, 4992037, 4829858, 4671676, 4520921, 4380859, 4253991, 4141761, 4045321, 3965828, 3903610, 3857950, 3828426, 3815829, 3821209, 3844786, 3886566, 3947385, 4028525, 4130539, 4253059, 4395372, 4556463, 4734515, 4926537, 5128190, 5333804, 5537072, 5732047, 5913231]
59992E913231J61759J36991J08658P8882M8343J6720j5575m7418p8209j07509
59982F215873j33611j54145j68256j76728j79847j76789j67441j53357j36295
59973D769404j16954r5718p3465n1021k8635o509J4840L5057N4022P1281Q6257
59962D658559R9130J10511J20025J26234J28179J26032J20164J10800R8958Q6382
59952E784974P3942O1006M7087L3122K0541R939J420m450o779m998J099J1507
59940F028410K5939M4124O6457R3739J25931J61706J99601K38981K79573L20610
59930G585071L60805L98542M31662M57328M72451M74038M59309M26145L73806
59921A1439157L03203K16818J18895J5309q7660j84613k70931l42315l95888m31617
$$ y = [5913231, 6074990, 6211981, 6320639, 6399521, 6447864, 6464584, 6449009, 6401591, 6323382, 6215873, 6082262, 5928117, 5759861, 5583133, 5403286, 5226497, 5059056, 4905699, 4769404, 4652450, 4556732, 4483267, 4432246, 4403611, 4397102, 4411942, 4446999, 4501021, 4572302, 4658559, 4757689, 4868200, 4988225, 5114459, 5242638, 5368670, 5488834, 5599634, 5698592, 5784974, 5858916, 5919922, 5967009, 6000131, 6020672, 6030611, 6032031, 6027581, 6020802, 6015804, 6016903, 6028410, 6054349, 6098473, 6164930, 6258669, 6384600, 6546306, 6745907, 6984888, 7264461, 7585071, 7945876, 8344418, 8776080, 9233408, 9705859, 10179897, 10639206, 11065351, 11439157, 11742360, 11959178, 12078073, 12093382, 12005722, 11821109, 11550178, 11207863, 10811975, 10380358]
59911A0380358m51436m56911m48890m29363m01969l70025l35062k97739k58993
59902F929970k19720j80264j40975j02555o5342k8973O741M1373P4579J06427
59892F421261J36472J63312J85505K02203K12430K14548K07039J89155J60421
59883H092346J20502P0472J3626m5777j04348j59831k10164k53124k86777l09995
59873F926930l22806l26480l22835l13184k98321k79485k58578k37047k15150
59864D353044j92737j70284j48700j28562j09931r2691p6817o2574n0572m1399
59854C278777l5179l1716l0712l1445l2633l3360l3832l4305l3716l0549k4984
59843B926346j8861j3478q751m715k430k788n602j0451j7336k5735l4039m0734
$$ y = [10380358, 9928922, 9472011, 9023121, 8593758, 8191789, 7821764, 7486702, 7188963, 6929970, 6710250, 6529986, 6389011, 6286456, 6221114, 6192141, 6198882, 6240255, 6314834, 6421261, 6557733, 6721045, 6906550, 7108753, 7321183, 7535731, 7742770, 7931925, 8092346, 8212848, 8283320, 8296946, 8251169, 8146821, 7986990, 7776826, 7523702, 7236925, 6926930, 6604124, 6277644, 5954809, 5641625, 5343304, 5063819, 4805241, 4568194, 4353044, 4160307, 3990023, 3841323, 3712761, 3602830, 3510139, 3433322, 3370748, 3320176, 3278777, 3243598, 3211882, 3181170, 3149725, 3117092, 3083732, 3049900, 3015595, 2981879, 2951330, 2926346, 2907485, 2894007, 2885256, 2880541, 2878111, 2875323, 2869721, 2859270, 2841934, 2816199, 2782160, 2741426]
59831B741426m5549m8765n0151m9231m6057m1109l4929k8168k1408j4585p302
59820B354172KN938R671J1868J3877J6692K0955K7011L4410M2121M9531N6509
59808B642757O2271O5396O5479O3732O1319N8097N3582M8066M1894L4670K6133
59797C223396J7087Q643J298m462p553p460n199k082K035Q221J6724K6802L7990
59784C315440N0486O4520Q0199R7932J18274J41446J67588J97174K30624K67571
59774D731254L06870L46911L85296M18400M41355M47979M30767L82699L01291
59765H192822J91815O6532n9299j71506k59811l19477l51325l59657l49732l26776
59755F253586k96061k62381k28880j96719j65928j36427j08474q2570n8987l7459
$$ y = [2741426, 2695877, 2647112, 2596961, 2547730, 2501673, 2460564, 2425635, 2397467, 2376059, 2361474, 2354172, 2354174, 2360112, 2369783, 2381651, 2395528, 2412220, 2433175, 2460186, 2494596, 2536717, 2586248, 2642757, 2705028, 2770424, 2835903, 2899635, 2960954, 3019051, 3072633, 3120699, 3162593, 3197263, 3223396, 3240483, 3249126, 3250424, 3245962, 3238409, 3230949, 3225750, 3223668, 3225703, 3233924, 3250648, 3277450, 3315440, 3365926, 3430446, 3510645, 3608577, 3726851, 3868297, 4035885, 4233059, 4463683, 4731254, 5038124, 5385035, 5770331, 6188731, 6630086, 7078065, 7508832, 7891531, 8192822, 8384637, 8451169, 8391870, 8220364, 7960553, 7641076, 7289751, 6930094, 6580362, 6253586, 5957525, 5695144, 5466264, 5269545, 5103617, 4967190, 4858716, 4776146, 4717159, 4679700]
59745D679700j7466J189J8599L5438N2669P0359Q7582J03875J20049J37133J55301
59734E444428J74376J94683K16677K40266K65330K92494L22637L55922L91848
59725G898661M30021M70232N11962N54166N95419O33867O67251O93243P09591
59716A3164413P14001P04663O81555O47038O05041N60087N17195M81771M58450
59707A8534214M49768M55863M74991N04066N38962N74729O05636O25656O29716
59698B3393601O14661N78758N20847M41146L42900K32209J16001Q93j06345j99087
59688B5935584k72535l24462l54074l61259l47291l14935k67005k05457j32208
59679B3356358m9596M0663J38017K41992L51483M65499N83243P02389Q18137R24714
$$ y = [4679700, 4662234, 4663423, 4682022, 4717460, 4770129, 4840488, 4928070, 5031945, 5151994, 5289127, 5444428, 5618804, 5813487, 6030164, 6270430, 6535760, 6828254, 7150891, 7506813, 7898661, 8328682, 8798914, 9310876, 9865042, 10460461, 11094328, 11761579, 12454822, 13164413, 13878414, 14583077, 15264632, 15911670, 16516711, 17076798, 17593993, 18075764, 18534214, 18983982, 19439845, 19914836, 20418902, 20957864, 21532593, 22138229, 22763885, 23393601, 24008262, 24587020, 25107867, 25549013, 25891913, 26124122, 26240123, 26241016, 26134671, 25935584, 25663049, 25338587, 24984513, 24623254, 24275963, 23961028, 23694023, 23488566, 23356358, 23306762, 23347425, 23485442, 23727434, 24078917, 24544416, 25127659, 25830048, 26648185, 27572899]
59669B7572899J016694J087943J130197J133855J090005R91740Q35579O23779
59661C5482691L65478P5301k28679n25940p95391j019510j187919j297309j349327
59652B9519395j349486j306723j231825j135622j028653r21337q23283p42869
59644B0979597o88061o65966o79245p22398p82397q43456q91849r18626r20469
59635A3867130q99025q58866q05568p44848o81828o19919n60673n05009m53778
59626G737616m06855l63175l22482k85984k54401k26529k00784j77076j55920
59617E344410j36809j18877j02315q7747p4886o3196n3234m6062m1776l9833m0267
59606D539408m3387m8769n5633o3709p2634q1152q7944r2736r5677r6479r5148
$$ y = [27572899, 28589593, 29677536, 30807733, 31941588, 33031593, 34023333, 34858912, 35482691, 35848169, 35923470, 35694791, 35168851, 34373460, 33353950, 32166031, 30868722, 29519395, 28169909, 26863186, 25631361, 24495739, 23467086, 22545749, 21722466, 20979597, 20291536, 19625570, 18946325, 18223927, 17441530, 16598074, 15706225, 14787599, 13867130, 12968105, 12109239, 11303671, 10558823, 9876995, 9257076, 8696403, 8191394, 7737616, 7330761, 6967586, 6645104, 6359120, 6104719, 5878190, 5677406, 5500330, 5344410, 5207601, 5088724, 4986409, 4898662, 4823776, 4760580, 4707346, 4661284, 4619508, 4579675, 4539408, 4496021, 4447252, 4391619, 4327910, 4255276, 4174124, 4086180, 3993444, 3897767, 3801288, 3706140]
59595C706140r2630q9486q4878p8098p0165o2458n4820m6537l8200l0733k3511
59584C034624j5445p294p94M151R223J4902J9878K3327K5755K7438K7833K6986
59572C190584K5941K5346K4936K4645K5006K6186K7875L0365L4611M0878M8256
59561C524629N5722O2977P0392P8779Q8998J01046J13981J27410J42251J59043
59551D525228J76587J93609K10775K29330K48445K65862K80602K93074L02864
59542F726376L08525L09541L06561K99600K87848K71443K51935K30767K08613
59533I201209J85742J61419J33508J01037O7210L7724J5793P48q522j1318o906
59522I877644L858J9880M1059O6969R5556J23918J49169J67980J76731J73035
$$ y = [3706140, 3613510, 3524024, 3439146, 3361048, 3290883, 3228425, 3173605, 3127068, 3088868, 3058135, 3034624, 3019179, 3011885, 3011091, 3015242, 3024465, 3039367, 3059245, 3082572, 3108327, 3135765, 3163598, 3190584, 3216525, 3241871, 3266807, 3291452, 3316458, 3342644, 3370519, 3400884, 3435495, 3476373, 3524629, 3580351, 3643328, 3713720, 3792499, 3881497, 3982543, 4096524, 4223934, 4366185, 4525228, 4701815, 4895424, 5106199, 5335529, 5583974, 5849836, 6130438, 6423512, 6726376, 7034901, 7344442, 7651003, 7950603, 8238451, 8509894, 8761829, 8992596, 9201209, 9386951, 9548370, 9681878, 9782915, 9850125, 9887849, 9903642, 9904390, 9895868, 9884550, 9877644, 9881502, 9901382, 9942441, 10009410, 10104966, 10228884, 10378053, 10546033, 10722764, 10895799]
59512A0895799J56163J25845Q2083K6589l7039j05189j75006k43187l05699l59472
59502A0060887m03075m35325m54804m61427m56961m43334m21753l94002l63001
59493F227205l31009k98538k65775k33844k03913j76294j51162j28827j08618
59484D329225q8793o8518m8764l0534j3344L732K0676L7125N3359O9875Q6805
59473D350844J04419J23248J43164J63236J83045K03024K23059K41742K57562
59464E993343K69643K76769K77005K68996K52495K27100J91807J46768R4271L7232
59454H035429k2145q1521j37615j87522k29989k64455k89879l05563l12403l12284
59444E892053l06694k96619k83099k67184k49714k31540k13401j95418j77510
$$ y = [10895799, 11051962, 11177807, 11259890, 11286479, 11249440, 11144251, 10969245, 10726058, 10420359, 10060887, 9657812, 9222487, 8767683, 8306256, 7849295, 7405961, 6984208, 6590206, 6227205, 5896196, 5597658, 5331883, 5098039, 4894126, 4717832, 4566670, 4437843, 4329225, 4240432, 4171914, 4123150, 4092616, 4079272, 4083004, 4103680, 4140805, 4194164, 4264039, 4350844, 4455263, 4578511, 4721675, 4884911, 5067956, 5270980, 5494039, 5735781, 5993343, 6262986, 6539755, 6816760, 7085756, 7338251, 7565351, 7757158, 7903926, 7998197, 8035429, 8013284, 7931763, 7794148, 7606626, 7376637, 7112182, 6822303, 6516740, 6204337, 5892053, 5585359, 5288740, 5005641, 4738457, 4488743, 4257203, 4043802, 3848384, 3670874]
59435C670874j60355j44890j30829j16936j03008r0205p9157o9217n9965n1883
59425B664429m4958l8248l1431k5270j9864j4155p898k348J920O103J0988J5450
59413B514718J8425K0723K3614K7137L1049L5449L8922L8062L1302K1967J5365
59402B816733J3755J6051K1091K8683L8119M8313N9262P1109Q1793Q7909Q8569
59391C371387Q6985Q7835R4174J06757J24639J45861J68717J93022K19681K49200
59381D848258K81352L16084L53694L94025M36239M79293N21773N61266N94603
59372H786587O18832O31597O31059O16362N88252N48928N01440M49419L96570
59363A3769046L45610K97931K54475K16047J82106J50283J17960Q3773M6876N785
$$ y = [3670874, 3510519, 3365629, 3234800, 3117864, 3014856, 2924651, 2845494, 2776277, 2716312, 2664429, 2619471, 2581223, 2549792, 2524522, 2504658, 2490503, 2482605, 2480257, 2482177, 2488280, 2499268, 2514718, 2533143, 2553866, 2577480, 2604617, 2635666, 2671115, 2710037, 2748099, 2779401, 2801368, 2816733, 2830488, 2846539, 2867630, 2896313, 2934432, 2982745, 3042007, 3113116, 3194909, 3282818, 3371387, 3458372, 3546207, 3640381, 3747138, 3871777, 4017638, 4186355, 4379377, 4599058, 4848258, 5129610, 5445694, 5799388, 6193413, 6629652, 7108945, 7630718, 8191984, 8786587, 9405419, 10037016, 10668075, 11284437, 11872689, 12421617, 12923057, 13372476, 13769046, 14114656, 14412587, 14667062, 14883109, 15065215, 15215498, 15333458, 15417231, 15464107, 15469892]
59353A5469892m0651r1667j45024j98550k50256k97580l37962l70193l94431m11295
59343A2932283m21970m28826m34646m40992m47773m54059m58592m59933m57089
59334H928403m49902m38449m22502m02230l78828l53630l27027k99086k70698
59325E586051k43235k17465j93498j71330j50709j31013j12139r4914p9891o6320
59315D125537n3131m0279k8176j6679n633M309J2738K0656K9160L7530M4133M8917
59303D179082N3376N8164O2149O3949O3092N9576N3685M6535L9525L2884K5665
59292D737682J7509R421K503l043p102q832p441l306K425R192J7505K8092M0870
59279D835475N4942O9445Q4264R9697J15599J31099J45100J56624J64693J68285
$$ y = [15469892, 15429241, 15337574, 15192550, 14994000, 14743744, 14446164, 14108202, 13738009, 13343578, 12932283, 12510313, 12081487, 11646841, 11205849, 10758076, 10304017, 9845425, 9385492, 8928403, 8478501, 8040052, 7617550, 7215320, 6836492, 6482862, 6155835, 5856749, 5586051, 5342816, 5125351, 4931853, 4760523, 4609814, 4478801, 4366662, 4271748, 4191857, 4125537, 4072406, 4032127, 4003951, 3987272, 3981639, 3985948, 3998686, 4019342, 4048502, 4086032, 4130165, 4179082, 4232458, 4290622, 4352771, 4416720, 4479812, 4539388, 4593073, 4639608, 4679133, 4712017, 4737682, 4755191, 4764612, 4767115, 4764072, 4756970, 4748138, 4740697, 4737391, 4739816, 4749008, 4766513, 4794605, 4835475, 4890417, 4959862, 5044126, 5143823, 5259422, 5390521, 5535621, 5692245, 5856938, 6025223]
59269F025223J66317J57357J39738J13122P9942M4361R576k2908n1710p5100r2710
59258F493208j05895j15424j20160j19209j14018j06916r8757q9404p9572p0376
59248E473477o1823n3515m6404m2096m0545m0062l9571l9401l9782l9980l9197
59237D991101l7112l3183k6548j7100n792O657K0852L8120N9109Q3312J09869
59226E189285J38654J70339K05157K41930K78938L15406L51008L83804M09970
59217G684491M25984M29748M19175L91588L45851K83940K09060J23421K9323o8782
59207A0273799j65143k55054l34908m00897m49796m80912m95733m95930m83210
59198F712216m60740m32657m01772l68999l35062l01408k69267k39141k11511
$$ y = [6025223, 6191540, 6348897, 6488635, 6601757, 6681699, 6726060, 6735636, 6712728, 6661018, 6585918, 6493208, 6387313, 6271889, 6151729, 6032520, 5918502, 5811586, 5712829, 5623425, 5543853, 5473477, 5411654, 5358139, 5311735, 5269639, 5229094, 5189032, 5149461, 5110060, 5070278, 5030298, 4991101, 4953989, 4920806, 4894258, 4877158, 4871366, 4878023, 4898875, 4936995, 4996104, 5079416, 5189285, 5327939, 5498278, 5703435, 5945365, 6224303, 6539709, 6890717, 7274521, 7684491, 8110475, 8540223, 8959398, 9350986, 9696837, 9980777, 10189837, 10313258, 10342581, 10273799, 10108656, 9853602, 9518694, 9117797, 8668001, 8187089, 7691356, 7195426, 6712216, 6251476, 5818819, 5417047, 5048048, 4712986, 4411578, 4142311, 3903170, 3691659]
59189C691659j86997j65638j46853j30260j15764j02962r1429q1392p3154o5964
59179B531246n8557n0777m3655l7841l2883k8131k3435j8871j4464j0271o176
59168B206185j870K521O209Q900J1633J5604K0538K5160K8861L2041L5199L8649
59156B429630M2738M7364N1726N5424N9305O4168O9237P3096P5594P7534P8967
59145C124783P9162P7979P5887P2790O8093O1802N4352M5586L5214K4044J3482
59134C733174L898n222j3645k0323k4980k8345l0583l0718k7979k2824j6292r035
59122C507126j078Q068J8928L1221M3789N5944O8288Q1491R5026J08062J20881
59111D137746J34209J47894J61532J75636J90710K05800K19539K32022K43881
$$ y = [3691659, 3504662, 3339024, 3192171, 3061911, 2946147, 2843185, 2751756, 2670364, 2597210, 2531246, 2472689, 2421912, 2378257, 2340416, 2307533, 2279402, 2255967, 2237096, 2222632, 2212361, 2206185, 2204315, 2206836, 2213045, 2221945, 2233578, 2249182, 2269720, 2294880, 2323741, 2355782, 2390981, 2429630, 2472368, 2519732, 2571458, 2626882, 2686187, 2750355, 2819592, 2892688, 2968282, 3045816, 3124783, 3203945, 3281924, 3357811, 3430601, 3498694, 3560496, 3614848, 3660434, 3695648, 3719692, 3733174, 3737072, 3731850, 3718205, 3697882, 3672902, 3644557, 3613974, 3583256, 3555277, 3532453, 3516161, 3507126, 3506048, 3514116, 3533044, 3564265, 3608054, 3663998, 3732286, 3813777, 3908803, 4016865, 4137746, 4271955, 4419849, 4581381, 4757017, 4947727, 5153527, 5373066, 5605088, 5848969]
59102E848969K53843K59080K57899K50327K36083K13742J82311J42281R5041M2675
59092G782251j1537o3835j11689j53991j89900k18725k40839k57353k68810k75188
59082E990384k76907k74679k68771k59629k48786k37723k26328k13987k01571
59073C782003j90396j79818j68008j55052j43014j32836j23339j13617j04374
59064B471549r6288q8920q1874p5431o9482o3366n7244n2133m8142m4196l9923
59053A754550l6228l3575l1210k8616k6321k4706k3429k2439k2198k2475k2305
59042A461048k1499k0916k0859k0549j9439j7758j5606j2878j0166q191o296l245
59030A283646M36K904M026N797R196J2769J5086J6523J7600J7598J6034J3854
$$ y = [5848969, 6102812, 6361892, 6619791, 6870118, 7106201, 7319943, 7502254, 7644535, 7739576, 7782251, 7770714, 7706879, 7595190, 7441199, 7251299, 7032574, 6791735, 6534382, 6265572, 5990384, 5713477, 5438798, 5170027, 4910398, 4661612, 4423889, 4197561, 3983574, 3782003, 3591607, 3411789, 3243781, 3088729, 2945715, 2812879, 2689540, 2575923, 2471549, 2375261, 2286341, 2204467, 2129036, 2059554, 1996188, 1938944, 1886811, 1838669, 1794473, 1754550, 1718322, 1684747, 1653537, 1624921, 1598600, 1573894, 1550465, 1528026, 1505828, 1483353, 1461048, 1439549, 1418633, 1397774, 1377225, 1357786, 1340028, 1324422, 1311544, 1301378, 1293187, 1286891, 1283646, 1284082, 1286986, 1291012, 1296809, 1306005, 1318774, 1333860, 1350383, 1367983, 1385581, 1401615, 1415469]
59018A415469J1881R469O050K603M22n09q53o86M3Q67J598K949N443Q479J1091
59003A474316J2851J3560J3053J1792J0578R200O544K449j707m836p271r527j1163
58990A519839j1582j0902r463p434n297l662k320n33J507K900L734N036O758P622
58976A496203P423P650R161J0979J2186J3272J4753J6113J7149J8764K1326K3674
58964A668653K4930K5905K7617K9576L0712L0898L0602K9993K9334K9180K9505
58953A986905K9613K9571L0415L2336L4117L5180L6840M0437M5439N0405N4793
58942B406051N8917O3103O7742P3262P9458Q5665R1928R8872J06202J12900J19233
58931C363333J26919J36707J47569J58934J71893J87358K04737K23476K44173
$$ y = [1415469, 1427350, 1436819, 1442869, 1445472, 1445894, 1445385, 1444532, 1443846, 1443889, 1444756, 1446354, 1449303, 1454746, 1463225, 1474316, 1487167, 1500727, 1513780, 1525572, 1536150, 1545350, 1551894, 1554343, 1552636, 1547800, 1540529, 1531002, 1519839, 1508257, 1497355, 1487892, 1480458, 1475161, 1471499, 1469179, 1468646, 1470153, 1473053, 1476787, 1481823, 1488581, 1496203, 1503626, 1511276, 1520437, 1531416, 1543602, 1556874, 1571627, 1587740, 1604889, 1623653, 1644979, 1668653, 1693583, 1719488, 1747105, 1776681, 1807393, 1838291, 1868893, 1898886, 1928220, 1957400, 1986905, 2016518, 2046089, 2076504, 2108840, 2142957, 2178137, 2214977, 2255414, 2300853, 2351258, 2406051, 2464968, 2528071, 2595813, 2669075, 2748533, 2834198, 2926126, 3024998, 3131200, 3244100, 3363333, 3490252, 3626959, 3774528, 3933462, 4105355, 4292713, 4497450, 4720926, 4965099]
58922D965099K67174K91697L17461L45656L77220M11643M48411M88023N30489
58913H442873N74471O18988O64268P09570P51651P86505Q11120Q22436Q16417
58904A4998299P89674P40619O67886N69625M46206L02516J46167j5254j74255
58895A8471483l22994m55097n67160o57249p23422p65241p85289p87415p74428
58886A2633188p48866p14408o74678o31644n86624n41659m98304m56408m15769
58877G364828l77866l44361l15040k88882k66039k46983k30757k15795k01638
58868D877467j88389j75501j62590j50411j39505j28966j17977j07399r8258q9899
58858C518572q1321p3139o6401o0544n4391m8132m2520l7077l0987k4852j9613
$$ y = [4965099, 5232273, 5523970, 5841431, 6187087, 6564307, 6975950, 7424361, 7912384, 8442873, 9017344, 9636332, 10300600, 11010170, 11761821, 12548326, 13359446, 14181882, 14998299, 15787973, 16528592, 17196478, 17766103, 18212309, 18514825, 18660992, 18645738, 18471483, 18148489, 17693392, 17126232, 16468983, 15745561, 14980320, 14195031, 13407616, 12633188, 11884322, 11169914, 10495236, 9863592, 9276968, 8735309, 8237005, 7780597, 7364828, 6986962, 6642601, 6327561, 6038679, 5772640, 5525657, 5294900, 5079105, 4877467, 4689078, 4513577, 4350987, 4200576, 4061071, 3932105, 3814128, 3706729, 3608471, 3518572, 3437251, 3364112, 3297711, 3237167, 3182776, 3134644, 3092124, 3055047, 3024060, 2999208, 2979595]
58847B979595j4569q390j439M900J0578J6647K3202K9341L4926M0695M6910N3284
58835C215680N9976O7343P5056Q2580R0117R8181J06778J15886J25867J36554
58825D174018J47123J57760J70182J85336K01979K18916K37242K58802K83728
58816F035086L11177L41296L74734M11266M50541M93036N38629N85292O30788
58807A0171845O74434P15504P51032P76931P90020P87167P63896P16142O42806
58798A6789777N45034M24407K83964J29954k9635j87642l37349m71261n83032
58789A6564217o70272p33657p74236p93398p94297p80835p55715p21301o81345
58780I859161o39580n97225n54018n10944m70018m32009l96567l63919l34649
$$ y = [2979595, 2965026, 2956636, 2955197, 2960097, 2970675, 2987322, 3010524, 3039865, 3074791, 3115486, 3162396, 3215680, 3275656, 3342999, 3418055, 3500635, 3590752, 3688933, 3795711, 3911597, 4037464, 4174018, 4321141, 4478901, 4649083, 4834419, 5036398, 5255314, 5492556, 5751358, 6035086, 6346263, 6687559, 7062293, 7473559, 7924100, 8417136, 8955765, 9541057, 10171845, 10846279, 11561783, 12312815, 13089746, 13879766, 14666933, 15430829, 16146971, 16789777, 17334811, 17759218, 18043182, 18173136, 18143501, 17955859, 17618510, 17147249, 16564217, 15893945, 15160288, 14386052, 13592654, 12798357, 12017522, 11261807, 10540506, 9859161, 9219581, 8622356, 8068338, 7557394, 7087376, 6655367, 6258800, 5894881, 5560232]
58771E560232l08349k84348k62970k44451k27588k11252j96098j82889j70477
58762C471810j57541j45004j34381j24971j15198j05547r7511r0555q2914p4611
58752B343577o7083o0527n4168m8390m4002m0120l5365l0478k7102k4756k1720
58741A889866j8244j6056j5238j4389j3425j3385j3972j4032j4027j5253j7017
58730A724828j7491j6924j7100j8001j8045j7366j7759j9418k0771k1541k2975
58719A517437k5040k6366k7102k8817l1365l2755l2492l2118l2113l1113k8761
58708A189395k6558k5278k4049k2485k1300k0378j8673j6353j4811j4231j3434
58697I71845j2258j1719j1732j1158j0163j0044j0625j0396r275q616q469p528
$$ y = [5560232, 5251883, 4967535, 4704565, 4460114, 4232526, 4021274, 3825176, 3642287, 3471810, 3314269, 3169265, 3034884, 2909913, 2794715, 2689168, 2591657, 2501102, 2418188, 2343577, 2276494, 2215967, 2161799, 2113409, 2069407, 2029287, 1993922, 1963444, 1936342, 1911586, 1889866, 1871622, 1855566, 1840328, 1825939, 1812514, 1799129, 1785157, 1771125, 1757098, 1741845, 1724828, 1707337, 1690413, 1673313, 1655312, 1637267, 1619901, 1602142, 1582724, 1561953, 1540412, 1517437, 1492397, 1466031, 1438929, 1410112, 1378747, 1345992, 1313500, 1281382, 1249269, 1218156, 1189395, 1162837, 1137559, 1113510, 1091025, 1069725, 1049347, 1030674, 1014321, 999510, 985279, 971845, 959587, 947868, 936136, 924978, 914815, 904771, 894146, 883750, 874475, 865859, 857390, 849862]
58685H49862n816m703m132k690n04P81J077J869L022K663O29j039j553k269l568
58670H33629l927k860j890j763j448n76j45j84N23J832K051R09j13p39k217m273
58654H18809m981m250m129m917m397j916K39Q14J618M058O743Q160Q999J0238
58640H35088J1491J2546J4142J6021J6778J6665J7863K0965K4003K5999K8469
58629A040030L2267L6059L9309M3737N0214N7160O3582P0802P9443Q7634R4098
58618A694335J00415J08425J17849J28255J40777J56007J72497J89009K05882
58609C013451K22648K36721K46026K50345K48484K36854K12960J78029J34521
58600D980039Q3638K7309k9871q3014j29559j68046j96616k14656k23937k26358
$$ y = [849862, 844046, 839343, 835211, 832521, 832017, 832798, 833875, 835744, 838766, 841429, 842058, 841019, 839466, 837197, 833629, 829702, 826842, 824952, 823189, 821741, 821165, 821020, 820836, 821359, 823191, 825242, 826151, 826038, 825299, 823082, 818809, 813828, 809578, 805449, 800532, 796135, 794219, 794458, 795272, 796890, 800948, 807691, 815851, 824850, 835088, 846579, 859125, 873267, 889288, 906066, 922731, 940594, 961559, 985562, 1011561, 1040030, 1072297, 1108356, 1147665, 1191402, 1241616, 1298776, 1362358, 1433160, 1512603, 1600237, 1694335, 1794750, 1903175, 2021024, 2149279, 2290056, 2446063, 2618560, 2807569, 3013451, 3236099, 3472820, 3718846, 3969191, 4217675, 4454529, 4667489, 4845518, 4980039, 5063677, 5090986, 5061115, 4978101, 4848542, 4680496, 4483880, 4269224, 4045287, 3818929]
58590C818929k22423k13221k01503j89208j76015j61858j48292j35890j22868
58581B247651j08281r4160q2479p2404o2435n3067m5295l8643l2691k8449k6299
58570A603448k4630k2342k0577k0177j9700j7902j5998j5441j5503j5130j5154
58559A400894j6609j8676k0344k2273k5193k8117k9926l0889l1166k9734k6460
58548A121507k3147k0916j8607j5331j2445j1255j0884j0155r510r401q911p651
58536I63294o867p185p385o862o887q032q865q739r135j0620j1304j0246r494
58523H51673j0614j2038j2074j1786j2566j3420j3122j2601j2744j2319j0347
58512G18042q305p548o952n367l974l886l793k393q57n38n22K64Q52L78R4J101
$$ y = [3818929, 3596506, 3383285, 3181782, 2992574, 2816559, 2654701, 2506409, 2370519, 2247651, 2139370, 2045210, 1962731, 1890327, 1827892, 1774825, 1729530, 1690887, 1658196, 1629747, 1603448, 1578818, 1556476, 1535899, 1515722, 1496022, 1478120, 1462122, 1446681, 1431178, 1416048, 1400894, 1384285, 1365609, 1345265, 1322992, 1297799, 1269682, 1239756, 1208867, 1177701, 1147967, 1121507, 1098360, 1077444, 1058837, 1043506, 1031061, 1019806, 1008922, 998767, 989257, 979856, 970945, 963294, 956427, 949242, 941857, 934995, 928108, 920076, 911211, 902472, 893337, 882717, 871413, 861167, 851673, 841059, 829021, 816947, 805161, 792595, 779175, 766053, 753452, 740708, 728389, 718042, 709737, 702189, 695237, 689870, 685896, 682010, 678217, 675824, 674967, 674429, 673907, 674171, 675023, 675401, 675495, 676596]
58496F76596K348K924L796N314N812M742M293N698P006O797O831Q376R314P885
58482G57732O106O292P149O531N211M644L869J915N36J136J714K03j843k344k641
58467G96210m816p603q695q727r476j0353j0145r893j0631j0689q581o176n602
58454F84823n547m067k384k339k683j656n77j121j636p8J967K145J686K882M745
58439F76160N246N415P135R258J0018J0815J3311J5328J3979J0608Q268O599L697
58426G95837O18n84j139l238n489n206l221j991j037J213L337L299K737M157O091
58411G95384N768M414M941O583O817O509P985J0002R787Q269Q127Q525O916M143
58397H94170K644J407j952o024p791q044r336j0550r052o259n357n401l446o30
$$ y = [676596, 678944, 681868, 685664, 690978, 696790, 701532, 705825, 711523, 718529, 725326, 732157, 740533, 749847, 757732, 763838, 770130, 777279, 783810, 789021, 793665, 797534, 799449, 799985, 801121, 802835, 803038, 801195, 798851, 796210, 791394, 783791, 775096, 766369, 756893, 746540, 736395, 726502, 715871, 705182, 696601, 690425, 684823, 679276, 675209, 672825, 670486, 667803, 666147, 665570, 664449, 662813, 662735, 664702, 666847, 668533, 671415, 676160, 681406, 686821, 693956, 703214, 713232, 724047, 737358, 752686, 766665, 777273, 785541, 792140, 795837, 796455, 795871, 794732, 791494, 786005, 780799, 777578, 775587, 774550, 775763, 779100, 782399, 785136, 789293, 795384, 801152, 805566, 810507, 817090, 823907, 830416, 838401, 848403, 858190, 866459, 874586, 883111, 890027, 894170, 896814, 898221, 896269, 890245, 882454, 874410, 865074, 854524, 845472, 839213, 833856, 828455, 825009, 824379]
58383H24379j62r82L81L164L758K309J853K220J014n91O07L538M376L365M008
58368H53237O360P397P135Q213J0111R960Q389Q601J0341J0650R725J0102J1158
58355I71379J0402R028J0035J2134J1886J0368J1124J3014J2082R148Q239Q616
58343A097455O020J032j479q67j093k869k922j011l44r50K87L059M081L847N834
58328A110080R376J0477R410J0186J2934J4137J3956J5704J8605J8836J7271J8285
58316A279257K1294K1585J9189J8679K0516K0848J9561K0011K1182J8817J4072
58305A495011J2152J2686J0591O250N233P906Q979P690Q732J2530J4356J3707
58293A615823J4947J8070J8531J6758J7916K1850K3283K2197K3657K7179K7232
$$ y = [824379, 824217, 823235, 823616, 826780, 830538, 832847, 834700, 836920, 837934, 837343, 837950, 841488, 845864, 849229, 853237, 859597, 866994, 874129, 882342, 892453, 902413, 910802, 919403, 929744, 940394, 950119, 960221, 971379, 981781, 990809, 1000844, 1012978, 1024864, 1035232, 1046356, 1059370, 1071452, 1080600, 1088839, 1097455, 1103475, 1104507, 1103028, 1102161, 1101068, 1098199, 1095277, 1094266, 1093922, 1092972, 1093259, 1096318, 1100399, 1104246, 1110080, 1119456, 1129933, 1139343, 1149529, 1162463, 1176600, 1190556, 1206260, 1224865, 1243701, 1260972, 1279257, 1300551, 1322136, 1341325, 1360004, 1380520, 1401368, 1420929, 1440940, 1462122, 1480939, 1495011, 1507163, 1519849, 1530440, 1536690, 1541923, 1549829, 1558808, 1566498, 1575230, 1587760, 1602116, 1615823, 1630770, 1648840, 1667371, 1684129, 1702045, 1723895, 1747178, 1769375, 1793032, 1820211, 1847443]
58282A847443K4609K5921L1219L3650L2197L2937L6825L8331L7256L9549M5094
58271B225031M7339M6289M8859N4972N6778N3407N2624N5815N5645N1023M9807
58260B797589N3723N5284N2859N3956O0140O3752O3211O6168P3831P7877P6940
58249C495330P9962Q8935R4773R4919R8110J06917J12849J13880J18984J29878
58239D534537J36642J37255J42616J56048J67164J72484J82006J98448K10906
58230F038106K16678K27932K48682K67115K79085K96363L22746L45918L62580
58221H605205L86736M22900M56997M84534N20593N70386O18844O62003P18274
58212A3446472P94727Q74240R51154J045888J167934J300565J440422J613950
$$ y = [1847443, 1872052, 1897973, 1929192, 1962842, 1995039, 2027976, 2064801, 2103132, 2140388, 2179937, 2225031, 2272370, 2318659, 2367518, 2422490, 2479268, 2532675, 2585299, 2641114, 2696759, 2747782, 2797589, 2851312, 2906596, 2959455, 3013411, 3073551, 3137303, 3200514, 3266682, 3340513, 3418390, 3495330, 3575292, 3664227, 3759000, 3853919, 3952029, 4058946, 4171795, 4285675, 4404659, 4534537, 4671179, 4808434, 4951050, 5107098, 5274262, 5446746, 5628752, 5827200, 6038106, 6254784, 6482716, 6731398, 6998513, 7277598, 7573961, 7896707, 8242625, 8605205, 8991941, 9414841, 9871838, 10356372, 10876965, 11447351, 12066195, 12728198, 13446472, 14241199, 15115439, 16066593, 17112481, 18280415, 19580980, 21021402, 22635352]
58204B2635352J834900K087119K371652K726606L176679L712820M350337N153984
58196D8049449O175214P427117Q961301J0903845J3368879J6401647K0036368
58189A31323820K4298112K9078534L4114222L9090050M3416028M5580684M3039056
58182C89940506L3588478J7461070j991508k0007903l3040712m0060117m1980719
58175C03909095m0410630l6862917l2504039k8078644k3935478k0197692j6928051
58168A04991644j4147848j1803422r809494q113304o681891n459711m382650l415574
58160D1177750k540975j723682r19632j15479O70880J436560K205227K937394
58152D3128043L407459L231055K131833K49361j851323l537115m492096m778180
$$ y = [22635352, 24470252, 26557371, 28929023, 31655629, 34832308, 38545128, 42895465, 48049449, 54224663, 61651780, 70613081, 81516926, 94885805, 111287452, 131323820, 155621932, 184700466, 218814688, 257904738, 301320766, 346901450, 389940506, 423528984, 440990054, 438998546, 418990643, 385949931, 345889814, 303909095, 263498465, 226635548, 194131509, 166052865, 142117387, 121919695, 104991644, 90843796, 79040374, 69230880, 61117576, 54435685, 48975974, 44593324, 41177750, 38636775, 36913093, 35993461, 35877982, 36548862, 37985422, 40190649, 43128043, 46535502, 49766557, 51898390, 52147751, 50296428, 46759313, 42267217, 37489037]
58144C7489037m617330m203311l678351l154116k687397k275297j907693j598408
58136A3367134j354047j152477r74196q24840p08908o10327n17464m41343l90981
58127F392551l53795l17064k87098k71000k59485k43333k28378k19617k08064
58118D004717j87356j66763j54263j42606j24862j08216r9771r3585q4244p8938
58108B764113q3556r0192r0422q8308q9030q7341p8709o9779o6490o3302n4896
58097A902088m7125m5717m5260m0135l5542l6956l9001l5573l1248l2079l4337
58086A479115l2704l0672l2683l4491l1380k7722k8679l0379k7836k4829k6317
58075A151423k8591k6389k2777k2689k3386k0426j6609j6275j6785j4186j1212
$$ y = [37489037, 32871707, 28668396, 24990045, 21835929, 19148532, 16873235, 14965542, 13367134, 12013087, 10860610, 9886414, 9061574, 8352666, 7742339, 7224875, 6783532, 6392551, 6038756, 5721692, 5434594, 5163594, 4904109, 4660776, 4432398, 4212781, 4004717, 3817361, 3650598, 3496335, 3353729, 3228867, 3120651, 3020880, 2927295, 2843051, 2764113, 2680557, 2590365, 2499943, 2411635, 2322605, 2235264, 2156555, 2086776, 2020286, 1956984, 1902088, 1854963, 1809246, 1763986, 1723851, 1688309, 1651353, 1612352, 1576779, 1545531, 1513452, 1479115, 1446411, 1415739, 1383056, 1348565, 1317185, 1289463, 1260784, 1230405, 1202569, 1177740, 1151423, 1122832, 1096443, 1073666, 1050977, 1027591, 1007165, 990556, 974281, 957496, 943310, 932098]
58064I32098j1586j2363r870p209q105r301o862m041n112p345o817o272r367j2784
58050H15064j2001r515r635j0453q521o253o994p915n387k458l325n317l937j152
58036G22201j056j956l82J518K98j459K79L082K410n5O3J663R84q57n40N66o67
58019G26092k391j088J417J152p88r26k58j655l433k352k67j032l480m028l558
58004G03405n058p108o437m471m698n952m862k708l146n287n667n005o425q868
57990F27713q823o988o799p935p443n709n191m837k030J546K137O50R25K757K869
57975E82842J564K044M033M294K892K875M312M341K737J892J808M59j460j555
57961F13078q27k267n001n340l278k446l795m710m345m665n981o402n872o111
$$ y = [932098, 920512, 908149, 898279, 891070, 882965, 873664, 866802, 862761, 857649, 850304, 843487, 837215, 827848, 815064, 803063, 793548, 783913, 773460, 764939, 758686, 751692, 743777, 738390, 735932, 732607, 727290, 723353, 722201, 721145, 719189, 718807, 720325, 720623, 719164, 719443, 722525, 724935, 724880, 724943, 726606, 727590, 726733, 726193, 726759, 726092, 723701, 722613, 724030, 725182, 724394, 723468, 723210, 721555, 718122, 715770, 715503, 714471, 710991, 706963, 703405, 698347, 691239, 684802, 680331, 675633, 669681, 664819, 662111, 658965, 653678, 648011, 643006, 636581, 627713, 618890, 611902, 605103, 597168, 589725, 584016, 578825, 573988, 571958, 573504, 575641, 576291, 577216, 579973, 582842, 584406, 586450, 590483, 594777, 597669, 600544, 604856, 609197, 611934, 613826, 615634, 616093, 614633, 613078, 612251, 609984, 604983, 599643, 596365, 593919, 590124, 585414, 581069, 576404, 570423, 564021, 558149, 552038]
57947E52038o530m753j237J037J383J722K423K115J257J564K335J504j72l51K40
57932E54575j085l814m939m353m818o788q041q320r603j1690j2131j0715r652
57919D58626r164p306m314k701k740k172n60K69L97K046N204P234P428P892R389
57904D69528J0152R543R103R409R215Q245P562P025N603M073M034M515L172N01
57890E61680q96q44j483l018l723l889n436p699p956o295n531o158n823m134l364
57875D95431l862l338j493q52j955k119k05J602K004K559M109N107M936N166O221
57860E13311O362N197M638N171M780K818J361J341R22q50k260k261k245k983l100
57845E32202k131j914l316m534m194l327k891k281j499j910l457m054l056k430
$$ y = [552038, 545508, 540755, 539518, 540555, 541938, 543660, 546083, 548198, 549455, 551019, 553354, 554858, 554686, 554335, 554575, 553490, 549676, 544737, 540384, 535566, 528778, 520737, 512417, 502814, 491124, 478993, 468278, 458626, 449462, 442156, 437842, 435141, 432401, 430229, 429669, 429938, 430335, 432381, 437585, 444819, 452247, 460139, 469528, 479680, 489223, 498326, 507735, 516950, 525195, 532757, 539782, 545385, 549458, 553492, 558007, 561179, 561680, 560784, 559940, 558457, 555439, 551716, 547827, 542391, 534692, 526736, 520441, 514910, 508752, 502929, 498795, 495431, 491569, 488231, 486738, 485886, 483931, 481812, 481607, 483209, 485213, 487772, 491881, 496988, 501924, 507090, 513311, 519673, 524870, 529508, 534679, 539459, 542277, 543638, 544979, 545901, 545051, 542791, 540530, 538285, 535302, 532202, 530071, 528157, 524841, 520307, 516113, 512786, 509895, 507614, 506115, 504205, 500748, 496694, 493638, 491208]
57831D91208l260l992l503l024l536m154m436n544p641q944q757q733r756j0331
57817D05597r469q430q096p309n408l836l676l915l550l157l054k330r08j89m93
57802C41777k78J031J970J858K051L318M641N742P891J0944J2455J1172Q743O560
57788D19875L888N08j696j648r08q38n84M45P99m16j776k115k486l728m655m480
57772D00185m550n721o486n666m624m775n167m599l810l565k860j120K9n68j307
57757C45396m61Q93Q71j07n06k83j56J60J006J552J461K184M757P886R962J1262
57741C85877J2438J2644J1167R182P963O970N517M548M847N234M541L588L372
57728D77888L076K031J694L284N203N305M295M344N614O647P090P693Q418Q882
$$ y = [491208, 487948, 483956, 480453, 477429, 473893, 469739, 465303, 459759, 452118, 443174, 434417, 425684, 415928, 405597, 396128, 387698, 379602, 372293, 366885, 363049, 359373, 355458, 351908, 348751, 345697, 343367, 342459, 342270, 341777, 341499, 342530, 344500, 346358, 348409, 351727, 356368, 362110, 370001, 380945, 393400, 404572, 413315, 419875, 423763, 424271, 422575, 420927, 420019, 419181, 418597, 419042, 419841, 419425, 417649, 415534, 413048, 409320, 404665, 400185, 395635, 389914, 383428, 377762, 373138, 368363, 363196, 358597, 354787, 351222, 348362, 347242, 347271, 346703, 345396, 344935, 345828, 346699, 346592, 346086, 345803, 345647, 345807, 346813, 348365, 349826, 352010, 356767, 364653, 374615, 385877, 398315, 410959, 422126, 431308, 439271, 446241, 451758, 456306, 461153, 466387, 470928, 474516, 477888, 480964, 482995, 484689, 487973, 493176, 498481, 502776, 507120, 512734, 519381, 526471, 534164, 542582, 551464]
57714E51464R820J2034J4589J5920J6032J5954J5946J5867J6269J7473J8590J9082
57702G39040K0151K2875K6187K8492L0140L2474L5518L8482M1625M5807N1045
57691A111836N7120O4597P3707Q3295R2476J02253J14017J27634J42548J59302
57681B128785J78143J97401K15128K31143K45658K57063K62856K61680K52699
57672D230556K34527K06995J72894J36027R8624O2352K9882K101k5648o1462j10018
57661D976830j68235k26659k73797l01049l06680k95763k75309k49872k21971
57652B657495j94294j69016j46269j25489j07332r2425p9479o6822n4769m4478
57642A577122l5587k7164j9735j4077r064l168L019Q207J3283K0005K7721L4340
$$ y = [551464, 561284, 573318, 587907, 603827, 619859, 635813, 651759, 667626, 683895, 701368, 719958, 739040, 759191, 782066, 808253, 836745, 866885, 899359, 934877, 973359, 1014984, 1060791, 1111836, 1168956, 1233553, 1307260, 1390555, 1483031, 1585284, 1699301, 1826935, 1969483, 2128785, 2306928, 2504329, 2719457, 2950600, 3196258, 3453321, 3716177, 3977857, 4230556, 4465083, 4672078, 4844972, 4980999, 5079623, 5141975, 5171857, 5173958, 5148310, 5086848, 4976830, 4808595, 4581936, 4308139, 4007090, 3700410, 3404647, 3129338, 2879466, 2657495, 2463201, 2294185, 2147916, 2022427, 1915095, 1822670, 1743191, 1676369, 1621600, 1577122, 1541535, 1514371, 1494636, 1480559, 1471495, 1468327, 1471346, 1479553, 1492836, 1512841, 1540562, 1574902]
57630A574902M0038M7037N5971O5308P4406Q4451R6084J08508J21302J34999J49547
57619B552553J63937J77424J89397J98164K01622J98854J89351J71239J42547
57610D185088J04135N9412J1474l7446q4180j24920j57625j82212j98456k05816
57600C369454k05420k00054j91805j81404j69727j57929j46001j33270j20457
57591A863387j09282r9945r0975q1783p3383o6414o0236n4349m8890m3648l8237
57580A096245l3339l0009k7748k5108k2093j9939j8614j6758j4212j2323j1423
57569H64679j0320q707p749p628o837m763k876k295k088j059N12J966L572N610
57555H22017P450Q548R224R751R883R888J0726J2609J4599J6261J8288K0925K3234
$$ y = [1574902, 1614940, 1661977, 1717948, 1783256, 1857662, 1942113, 2038197, 2146705, 2268007, 2403006, 2552553, 2716490, 2893914, 3083311, 3281475, 3483097, 3681951, 3871302, 4042541, 4185088, 4289223, 4348635, 4360109, 4322663, 4238483, 4113563, 3955938, 3773726, 3575270, 3369454, 3164034, 2963980, 2772175, 2590771, 2421044, 2263115, 2117114, 1983844, 1863387, 1754105, 1654160, 1563185, 1481402, 1408019, 1341605, 1281369, 1227020, 1178130, 1134482, 1096245, 1062906, 1032897, 1005149, 980041, 957948, 938009, 919395, 902637, 888425, 876102, 864679, 854359, 845652, 837903, 830275, 823438, 818675, 815799, 813504, 811416, 810357, 810869, 812835, 816407, 822017, 829467, 838015, 847239, 856990, 866873, 876761, 887487, 900096, 914695, 930956, 949244, 970169, 993403]
57542I93403K4717K6279K8731L1625L4453L7848M2536M8102N3681N9179O5122
57531A445676P1955Q0023Q9520J00005J10629J21107J31726J42269J51805J59562
57521B604277J64931J66479J62177J50863J32477J06918P4161L5869m417m3224
57511C550511p8293j07788j30149j45298j54622j59006j58019j51755j42181j31744
57501B191656j21495j11316j01123r1071q1241p1800o3068n5062m7486m0300l3694
57490A374000k7523k1555j6190j1950q293l985J169O055R821J2718J5288J7852
57478A347407K0899K4836K9229L3396L7819M3689N0959N8269O5073P2418Q1185
57467A865179R0924J00959J11358J22149J32621J41957J49621J54643J55376J50402
$$ y = [993403, 1018120, 1044399, 1073130, 1104755, 1139208, 1177056, 1219592, 1267694, 1321375, 1380554, 1445676, 1517631, 1597654, 1687174, 1787179, 1897808, 2018915, 2150641, 2292910, 2444715, 2604277, 2769208, 2935687, 3097864, 3248727, 3381204, 3488122, 3562283, 3598152, 3593735, 3550511, 3472218, 3364430, 3234281, 3088983, 2934361, 2775355, 2617336, 2465581, 2323400, 2191656, 2070161, 1958845, 1857722, 1766651, 1685410, 1613610, 1550542, 1495480, 1447994, 1407694, 1374000, 1346477, 1324922, 1308732, 1296782, 1288489, 1284504, 1285673, 1291728, 1301549, 1314267, 1329555, 1347407, 1368306, 1393142, 1422371, 1455767, 1493586, 1537275, 1588234, 1646503, 1711576, 1783994, 1865179, 1956103, 2057062, 2168420, 2290569, 2423190, 2565147, 2714768, 2869411, 3024787, 3175189]
57457C175189J38870J19920R2948N8922K0473j9488n8478r3897j23190j45031
57447C166238j59464j66829j67616j63300j55910j46599j35714j24160j13231
57438A833415j03086r2940q2940p4170o6638n9058n1122m4208l9190l5203l1270
57427A153590k7628k4652k1889j9023j6512j4566j2698j0778r311q148o488m570
57415I77327l732m218m514l713k807k729k763k006q41J56J344K829L601L145K682
57400I63761L392M615N111N043N305N760N646N073M879N369O229P225Q164Q652
57386A044224Q569Q289Q029P650P391P853Q868R464R338R202R302Q970Q191Q020
57372A163360Q771R310R020Q892R600J0165R733R207R680J0567J0809J0775J1381
$$ y = [3175189, 3314059, 3433979, 3526927, 3585849, 3606322, 3586834, 3528356, 3434459, 3311269, 3166238, 3006774, 2839945, 2672329, 2509029, 2353119, 2206520, 2070806, 1946646, 1833415, 1730329, 1637389, 1554449, 1480279, 1413641, 1354583, 1303461, 1259253, 1220063, 1184860, 1153590, 1125962, 1101310, 1079421, 1060398, 1043886, 1029320, 1016622, 1005844, 996533, 988385, 981897, 977327, 973595, 969377, 964863, 961150, 958343, 955614, 952851, 950845, 950004, 950160, 951504, 954333, 957934, 961079, 963761, 967153, 971768, 976879, 981922, 987227, 992987, 998633, 1003706, 1008585, 1013954, 1020183, 1027408, 1035572, 1044224, 1052793, 1061082, 1069111, 1076761, 1084152, 1092005, 1100873, 1110337, 1119675, 1128877, 1138179, 1147149, 1155340, 1163360, 1172131, 1181441, 1190461, 1199353, 1208953, 1219118, 1228851, 1238058, 1247738, 1258305, 1269114, 1279889, 1291270]
57359A291270J2286J2461J1893J1324J1016J0918J1400J2631J3896J4529J4846
57348A428470J5310J5670J5747J5994J6382J5916J4386J3292J3842J5174J5881
57337A596064J6077J6459J6638J6040J5535J6327J7982J9192J9748K0164K0134
57326A790360J9158J8081J8209J9301K0061K0277K0823K1839K2578K2847K3084
57315B016618K3125K2372K1241K1010K2152K3851K5221K6041K6345K6281K6331
57304B280588K6819K7389K7622K7846K8645K9940L1329L2758L4159L5000L5097
57293B617192L5195L6001L7261L8608M0392M2741M4785M5963M7164M9300N1664
57282C086266N3047N3648N4411N5190N5119N4166N2893N1109M8290M4831M1466
$$ y = [1291270, 1303556, 1316017, 1327910, 1339234, 1350250, 1361168, 1372568, 1385199, 1399095, 1413624, 1428470, 1443780, 1459450, 1475197, 1491191, 1507573, 1523489, 1537875, 1551167, 1565009, 1580183, 1596064, 1612141, 1628600, 1645238, 1661278, 1676813, 1693140, 1711122, 1730314, 1750062, 1770226, 1790360, 1809518, 1827599, 1845808, 1865109, 1885170, 1905447, 1926270, 1948109, 1970687, 1993534, 2016618, 2039743, 2062115, 2083356, 2104366, 2126518, 2150369, 2175590, 2201631, 2227976, 2254257, 2280588, 2307407, 2334796, 2362418, 2390264, 2418909, 2448849, 2480178, 2512936, 2547095, 2582095, 2617192, 2652387, 2688388, 2725649, 2764257, 2804649, 2847390, 2892175, 2938138, 2985302, 3034602, 3086266, 3139313, 3192961, 3247372, 3302562, 3357681, 3411847, 3464740, 3515849, 3564139, 3608970, 3650436]
57271C650436L7872L3237K7688K1894J5840R396L593k36k186l289l786l286k164
57258C785009j208k22J568M094O751R593J2796J5524J6980J8070K0286K3323K5546
57245C938110K6529K7276K8198K8650K8543K8662K9214K9596K9659K9824K9931
57234D254192K9323K8084K6939K6050K5106K4345K4159K4103K3559K2999K3186
57223D532045K3762K4083K4777K6632K8611K9081K8509K8821L0289L1390L1537
57212D839537L1694L2124L1879L0846L0170L0245L0209K9798K9755L0016K9521
57201E175794K8228K7379K7314K6950K5906K5201K5217K4914K3737K2547K1978
57190E455165K1482K0714K0215K0249K0426K0899K2305K4193K5391K6226K8366
$$ y = [3650436, 3688308, 3721545, 3749233, 3771127, 3786967, 3796363, 3799956, 3799720, 3797534, 3794245, 3790459, 3787173, 3785009, 3783801, 3783579, 3785147, 3789241, 3795992, 3805585, 3818381, 3833905, 3850885, 3868955, 3889241, 3912564, 3938110, 3964639, 3991915, 4020113, 4048763, 4077306, 4105968, 4135182, 4164778, 4194437, 4224261, 4254192, 4283515, 4311599, 4338538, 4364588, 4389694, 4414039, 4438198, 4462301, 4485860, 4508859, 4532045, 4555807, 4579890, 4604667, 4631299, 4659910, 4688991, 4717500, 4746321, 4776610, 4808000, 4839537, 4871231, 4903355, 4935234, 4966080, 4996250, 5026495, 5056704, 5086502, 5116257, 5146273, 5175794, 5204022, 5231401, 5258715, 5285665, 5311571, 5336772, 5361989, 5386903, 5410640, 5433187, 5455165, 5476647, 5497361, 5517576, 5537825, 5558251, 5579150, 5601455, 5625648, 5651039, 5677265, 5705631]
57179E705631L1918L4805L5729L5652L5546L4700L2429K9560K7028K4640K2258
57168F049896K0597J9809J8848J7206J5694J4624J2951J0199P558N877M211J601
57156F199071j268l483n612q652j2478j6511k0727k5054k8825l1788l4447l6705
57144E973521l7530l6692l5275l3723l0977k6489k1434j6853j2310p494l526j508
57132E709710j301k812o816j3270k0389k6588l1841l6095l8162l7450l5026l1671
57120E428289k6657j9768j2709p177l325j273j881m513o214m820q63N139J4590
57107E358818K8030M3116N7962P4361R5449J22528J56835K01752K60182L31800
57097F730833M16025N15688O34897P75713R39842J130066J345245J575895J808527
$$ y = [5705631, 5737549, 5772354, 5808083, 5843735, 5879281, 5913981, 5946410, 5975970, 6002998, 6027638, 6049896, 6070493, 6090302, 6109150, 6126356, 6142050, 6156674, 6169625, 6179824, 6187382, 6193259, 6197470, 6199071, 6197803, 6194320, 6188708, 6180056, 6167578, 6151067, 6130340, 6105286, 6076461, 6044673, 6010226, 5973521, 5935991, 5899299, 5864024, 5830301, 5799324, 5772835, 5751401, 5734548, 5722238, 5714744, 5711218, 5709710, 5708409, 5705597, 5698781, 5685511, 5665122, 5638534, 5606693, 5570598, 5532436, 5494986, 5459960, 5428289, 5401632, 5381864, 5369155, 5361978, 5358653, 5357380, 5355499, 5350986, 5344772, 5339952, 5339089, 5344228, 5358818, 5386848, 5429964, 5487926, 5562287, 5657736, 5780264, 5937099, 6138851, 6399033, 6730833, 7146858, 7662546, 8297443, 9073156, 10012998, 11143064, 12488309, 14064204, 15872731]
57088A5872731K031353K231356K389982K488408K513754K453894K294471K038624
57080C4314573J731613J447145J233900J078000R22300P14521M30965O8568l62644
57071D1578941q34293j301359j720423k065688k327374k502449k592499k605989
57063B5628867k555705k453457k309477k135118j942661j742639j543376j352397
57055I594037j175881j016681q74673p49375o41068n49361m72250m07233l52571
57046C354944l06959k68706k36053k08152j85052j66562j51492j38267j26052
57037A567649j14943j05154r6400q8245q0582p3472o6826o0551n4843m9938m5576
57026G31119m1129l6304l1543k7598k4788k2722k0646j8137j5448j3103j1199
$$ y = [15872731, 17904084, 20135440, 22525422, 25013830, 27527584, 29981478, 32275949, 34314573, 36046186, 37493331, 38727231, 39805231, 40727531, 41442052, 41873017, 41941585, 41578941, 40744648, 39443289, 37722866, 35657178, 33329804, 30827355, 28234856, 25628867, 23073162, 20619705, 18310228, 16175110, 14232449, 12489810, 10946434, 9594037, 8418156, 7401475, 6526802, 5777427, 5136359, 4586998, 4114748, 3707515, 3354944, 3047985, 2779279, 2543226, 2335074, 2150022, 1983460, 1831968, 1693701, 1567649, 1452706, 1347552, 1251152, 1162907, 1082325, 1008853, 942027, 881476, 826633, 776695, 731119, 689990, 653686, 622143, 594545, 569757, 547035, 526389, 508252, 492804, 479701, 468502]
57015D68502r323p156m833k462K61L626P406J1412J6362K3467L2975M4018N6263
57002F40518P0935Q9507J12221J38621J67585J93506K02449J77153J11161J8636
56992A922292p2508j38818j73271j82146j74890j58481j37694j16066r5560p6875
56982E95983o0611m7614l8514l3627l2891l5181l8208m0064m0553m0226l8752
56971A49742l5297l0099k4538j9628j5331j1200F818j861L654Q866J3030J6586
56959D7093K0589K5155K9375L2656L5023L5889L3484K6277J4750J559r932j7549
56947B74369k1219k2171k1299j8683j4772j0997q406o384l639q7L344O371R745
56934A66172J4007J8846K3814K8821L3722L7866L9947L7964K9941J5793j556j7704
$$ y = [468502, 459179, 452023, 447190, 444728, 444989, 448615, 456021, 467433, 483795, 507262, 540237, 584255, 640518, 711453, 800960, 913181, 1051802, 1219387, 1412893, 1615342, 1792495, 1903656, 1922292, 1849784, 1710966, 1537695, 1355549, 1180659, 1022178, 884484, 768418, 672858, 595983, 535372, 487758, 449244, 415617, 382726, 347545, 309337, 269273, 228720, 188494, 149742, 114445, 84346, 59808, 40180, 24849, 13649, 6818, 4957, 8611, 17477, 30507, 47093, 67682, 92837, 122212, 154868, 189891, 225780, 259264, 285541, 300291, 301850, 291918, 274369, 253150, 230979, 209680, 190997, 176225, 165228, 156822, 150438, 146799, 146712, 150056, 156427, 166172, 180179, 199025, 222839, 251660, 285382, 323248, 363195, 401159, 431100, 446893, 445337, 427633]
56922D27633k9520l6177l8187l6612l2985k8794k4721k0870j7548j5079j3117
56911A34023j1025q811o936n394l865k477j500n57Q31K138K475K181K523L869
56897A07475N316O296P287Q646R994J1091J2350J4038J5825J7502J9379K1670
56885B56869K4158K6437K7631K5903J9530R110k279j1590j7900k1768k3477k2701
56873B89923j9412j4509r499n551k519R36N786J1434J6689K1624K7491L4916M3177
56860D00486N1440N9626O7433P2909P2389O2122M1008J2646j5729l7599n0757
56849G35974n6521n6564n1892m4084l5316k6774j8275r592r15Q014J7770K8285
56837D90110L9270N1523O6064Q1963R6757J08945J17600J18864J05784P4295K8653
$$ y = [427633, 398113, 361936, 323749, 287137, 254152, 225358, 200637, 179767, 162219, 147140, 134023, 122998, 114187, 107251, 101857, 97992, 95515, 94015, 93458, 94289, 96427, 98902, 101083, 103606, 107475, 112791, 119087, 126374, 135020, 145014, 156105, 168455, 182493, 198318, 215820, 235199, 256869, 281027, 307464, 335095, 360998, 380528, 389638, 387359, 375769, 357869, 336101, 312624, 289923, 270511, 256002, 246503, 240952, 238433, 239369, 245155, 256589, 273278, 294902, 322393, 357309, 400486, 451926, 511552, 578985, 651894, 724283, 786405, 827413, 840059, 824330, 786731, 735974, 679453, 622889, 570997, 526913, 491597, 464823, 446548, 436956, 436041, 444055, 461825, 490110, 529380, 580903, 646967, 728930, 825687, 934632, 1052232, 1171096, 1276880, 1351175, 1379828]
56826A379828k0400o2291r1094j05638j08031j02145r1828p9526o6410n3206m0404
56815E58855k8193j6760o307L524J3705K4904L6940M9344O1788P3545Q2770Q6308
56803I40423Q0032O0545K8499r602m4389o9305q3012q7178q4026p6308o7110n8128
56791E30441m9119l9853l1249k3801j6500q441k92P105J4302K2137L0075L6928
56779D71733M2154M4991M3148L4133J7965k286k2255l8078m7525n0769m9867m6698
56767C96646m1834l5751k9940k5664k2480j9247j5985j3546j1969j0457q703p153
56755A53917o066n266m611l991l157k146j492j414j282o04O9l8p80j455j801j820
56739A18063j313m45j22q96j988k318k035k064k556k823k495j832j161o91p54
$$ y = [1379828, 1359428, 1297137, 1206043, 1100405, 992374, 890229, 798401, 718875, 652465, 599259, 558855, 530662, 513902, 507595, 511119, 524824, 549728, 586668, 636012, 697800, 771345, 854115, 940423, 1020455, 1081000, 1109499, 1099897, 1055508, 986203, 903191, 816013, 731987, 655679, 588569, 530441, 481322, 441469, 410220, 386419, 369919, 361478, 361186, 368291, 382593, 404730, 434805, 471733, 513887, 558878, 602026, 636159, 654124, 651838, 629583, 591505, 543980, 493211, 443344, 396646, 354812, 319061, 289121, 263457, 240977, 221730, 205745, 192199, 180230, 169773, 161070, 153917, 147851, 142585, 137974, 133983, 130826, 128680, 127188, 125774, 124492, 123888, 123957, 123919, 123139, 121684, 119883, 118063, 116750, 116305, 116183, 115287, 113299, 110981, 108946, 106882, 104326, 101503, 99008, 97176, 96015, 95324, 94570]
56724I4570j447k269k653k550k132j378m81o5l96q99r62o91l64J23O94P54R8n48
56706G9404n63l69o29j249j847k360k613k090r58l19o54r61l94L46L55J13M39
56689F5651P99K67n90l97Q74K009K518L010L684L825K975J615N22J79O56J435
56673H9032J661J220J056J812K728K753K064J512J250R55Q13J092J313J032Q86
56658A11179J652K663K533J168j85o58m00K90J243K012K207K222K702L436L643
56643A35707L182K671K575K805K992K536R38j277k662k577k131k564l592m275
56629A34328m561m780m510l436k535k882l787l651k280q89k16j3r6m76o83k94
56613I9239J49j17p39q57o20p26q91k29J103J988J932J384P11k3m86m15j27J40
$$ y = [94570, 93123, 90854, 88201, 85651, 83519, 82141, 81660, 81595, 81199, 80300, 79338, 78647, 78283, 78406, 79100, 79854, 79952, 79404, 78841, 78472, 77843, 76594, 74747, 72387, 69774, 67684, 66726, 66407, 65753, 64792, 64398, 64744, 65099, 65212, 65651, 66450, 66717, 66127, 65730, 66604, 68613, 71131, 74141, 77825, 81650, 84625, 86240, 86762, 86941, 87597, 89032, 90693, 91913, 92969, 94781, 97509, 100262, 102326, 103838, 105088, 106043, 106856, 107948, 109261, 110293, 111179, 112831, 115494, 118027, 119195, 119010, 118352, 117952, 118242, 119485, 121497, 123704, 125926, 128628, 132064, 135707, 138889, 141560, 144135, 146940, 149932, 152468, 153406, 152129, 149467, 146890, 144759, 142195, 138603, 134328, 129767, 124987, 120477, 117041, 114506, 111624, 107837, 104186, 101906, 101017, 100801, 100788, 100692, 100216, 99533, 99239, 99388, 99271, 98532, 97675, 97055, 96329, 95438, 95209, 96312, 98300, 100232, 101616, 102327, 102304, 101818, 101403, 101276, 101416]
56595A01416P98J816K043R29r6M80J835K135J362Q49P39J75m57L9J172J101l43
56578A15993j223m61Q35J533J984K731L398L561L438L170K601K098K368L255L925
56563A49206M260M871N742O212O241O371O501O133N687O014O754O738N962N563
56549B32255N827N951N649N359M800L184R34n77j097j705k799l596l781l973m440
56534B41991m875n443o367o736n648m240m475o001o492n198l703k914j960n79
56520A77360n4q66j706j713j665k056k162j825k119l239l789l134k459k539k434
56505A45600j535q61j124j365q17l21n73p01J16J098J241Q34M51k04j249j830
56489A38760j471r68r01o41K23Q93Q01P13J358K233K697K934L018K451J435J188
$$ y = [101416, 102214, 104030, 106073, 107002, 106906, 107386, 109221, 111356, 112718, 113567, 114306, 114481, 114024, 114063, 115235, 116336, 115993, 114770, 114309, 115144, 116677, 118661, 121392, 124790, 128351, 131789, 134959, 137560, 139658, 142026, 145281, 149206, 153466, 158337, 164079, 170291, 176532, 182903, 189404, 195537, 201224, 207238, 213992, 220730, 226692, 232255, 238082, 244033, 249682, 255041, 259841, 263025, 263959, 263382, 262285, 260580, 257781, 254185, 250404, 246431, 241991, 237116, 231673, 225306, 218570, 212922, 208682, 204207, 198206, 191714, 186516, 182813, 179899, 177939, 177360, 177306, 176440, 174734, 173021, 171356, 169300, 167138, 165313, 163194, 159955, 156166, 153032, 150573, 148034, 145600, 144065, 143204, 142080, 140715, 139898, 139577, 139004, 138303, 138419, 139517, 140758, 141592, 142043, 141839, 140590, 138760, 137289, 136321, 135420, 134779, 135002, 135895, 136696, 137409, 138767, 141000, 143697, 146631, 149649, 152100, 153535, 154723]
56473A54723K090K950K913K605K569K294J662J653K557L193K934K944M141N512
56459A94740N696M827L712K571J594J367J678J371K69l31P0K18o29j414j340j293
56443B13106j839j856o60L39j76j232j322p87o86p78l87J0j84k49N32J253O98
56426B05782o34j383j256q13l33n2n46j651k178j689j349j912k361j703o64l13
56410A86945m19m21o93j517k186k259k352k633k187r14k07n49m71P78J623Q27
56394A73365l50m36r7k71J5J702L471L735L295L802N155O573Q541J1275J2870
56379B32645J1546Q439N755L529P04j941k758k128j734j730j106j32L8l54j65
56364B50608M49M51MP0N03M76K18M61Q37O10K54N82J082R01N37Q15J192Q43L67
$$ y = [154723, 156813, 159763, 162676, 165281, 167850, 170144, 171806, 173459, 176016, 179209, 182143, 185087, 189228, 194740, 200436, 205263, 208975, 211546, 213140, 214507, 216185, 217556, 217825, 217494, 217564, 217782, 217153, 215739, 214399, 213106, 211267, 209411, 208751, 209090, 208914, 207682, 206360, 205573, 204887, 204109, 203722, 203732, 203548, 203299, 203831, 205084, 205782, 205148, 203765, 202509, 201696, 201363, 201311, 200765, 199114, 196936, 195247, 193898, 191986, 189625, 187922, 187258, 186945, 186526, 186105, 185412, 183895, 181709, 179450, 177098, 174465, 172278, 171364, 171157, 170608, 170137, 170915, 172538, 173365, 173015, 172579, 172482, 172211, 172226, 173928, 177399, 181134, 184429, 188231, 193386, 199959, 208500, 219775, 232645, 244191, 252630, 258385, 261914, 262618, 260677, 257919, 255791, 254057, 252327, 251221, 251089, 251127, 250773, 250608, 251057, 251508, 251512, 251582, 252085, 252561, 252779, 253240, 254077, 254687, 254941, 255523, 256605, 257506, 258043, 258858, 260050, 260893, 261260]
56345B61260O65J202J174J169J795K082J194L24P88J677J632J462K591M308N124
56330B88447N492O558P534P068O068O288P190P096O415O820Q046Q542Q532R424
56316C89520J0794J0908R867R381R753R740R049Q438P730O241M619L871L207J310
56302D94428r87j917j757j905j993q55M89Q2j343j285M10J618J771K338L645M449
56286D97188M803O119Q181R213R169J0036J2479J4951J6528J8002J9805K1324
56274F47798K2687K4892K7875L0597L3058L6165L9797M3179M6850N2058N8547
56263A063503O5254P2555Q1432R1135J00274J09507J20399J32380J43734J54759
56253B134932J66695J78281J86784J91970J95544J97017J93694J84767J71811
$$ y = [261260, 261925, 263127, 264301, 265470, 267265, 269347, 270541, 270865, 271653, 273330, 274962, 276424, 279015, 283323, 288447, 293939, 300497, 308031, 315099, 321167, 327455, 334645, 341741, 348156, 354976, 363022, 371564, 380096, 389520, 400314, 411222, 421089, 430470, 440223, 449963, 459012, 467450, 475180, 481421, 486040, 489911, 493118, 494428, 493441, 491524, 489767, 487862, 485869, 485014, 485503, 485585, 484242, 482957, 483367, 484985, 486756, 489094, 492739, 497188, 501991, 508110, 516291, 525504, 534673, 544709, 557188, 572139, 588667, 606669, 626474, 647798, 670485, 695377, 723252, 753849, 786907, 823072, 862869, 906048, 952898, 1004956, 1063503, 1128757, 1201312, 1282744, 1373879, 1474153, 1583660, 1704059, 1836439, 1980173, 2134932, 2301627, 2479908, 2666692, 2858662, 3054206, 3251223, 3444917, 3629684, 3801495]
56244C801495J55235J33751J07685P9514N0780K1691o231l0434n0523o8059q3033
56233D111871r3771j00376j04937j08162j09089j08235j07630j07629j07087j06714
56223C058241j08616j12289j14842j15507j16264j17611j17611j15708j13646
56214B026147j11798j08313j02863r7556r3212q8203q1917p5910p0668o4651n7551
56203A073505n1205m6301m1467l6409l2627l0175k7150k3256k0472j9304j7819
56192G27320j5329j3575j3202j2497j0723r305q661p162m373k155j421q84P6M56
56178F28565L61J485L999O040O940P936R271R872J0230J2075J4830J5973J5292
56165G42869J5067J5741J5436J4020J3420J3435J1686Q294O172N878M776K161
$$ y = [3801495, 3956730, 4090481, 4198166, 4277680, 4328460, 4350151, 4343920, 4313486, 4262963, 4194904, 4111871, 4018100, 3917724, 3812787, 3704625, 3595536, 3487301, 3379671, 3272042, 3164955, 3058241, 2949625, 2837336, 2722494, 2606987, 2490723, 2373112, 2255501, 2139793, 2026147, 1914349, 1806036, 1703173, 1605617, 1512405, 1424202, 1342285, 1266375, 1195707, 1131056, 1073505, 1022300, 975999, 934532, 898123, 865496, 835321, 808171, 784915, 764443, 745139, 727320, 711991, 698416, 685214, 672717, 661994, 652689, 644028, 636866, 632493, 630338, 628917, 628033, 628109, 628565, 628926, 630411, 634410, 640450, 647390, 655326, 664597, 674469, 684699, 696774, 711604, 727577, 742869, 757936, 773677, 789113, 803133, 816553, 829988, 841674, 849968, 856140, 862018, 866794, 868955]
56153H68955N57R39J241P79J562M043O161P770J1382J7290K2649K6753L2487M1134
56139A043702N0461N9351O9528Q1378R2788J03475J15397J27398J34580J34472
56129B012530J29004J19384J04775Q7511P3488O5144N9303N3571M8858M3893L3936
56118B831397J7962J247j1942k2571l1540l6794l9010m3949n5360p0683q6611
56107B452146j02999j18260j27242j27626j22989j16182j05460r0386p5343o3319
56097A402340n2143m0465l1398k6365k1721j5450j1044j0647j0734q864q166j0475
56085A154868j1706r077o507p493q859p063m567m372m073j080K002K716L786P315
56071A105890R774Q384O703Q255J0414J0222J0318J3124J5222J3609J1749J3266
$$ y = [868955, 869512, 870451, 871692, 872471, 874033, 878076, 884237, 892007, 903389, 920679, 943328, 970081, 1002568, 1043702, 1094163, 1153514, 1223042, 1304420, 1397208, 1500683, 1616080, 1743478, 1878058, 2012530, 2141534, 2260918, 2365693, 2453204, 2526692, 2591836, 2651139, 2704710, 2753568, 2797461, 2831397, 2849359, 2850606, 2838664, 2816093, 2784553, 2747759, 2708749, 2664800, 2609440, 2538757, 2452146, 2349147, 2230887, 2103645, 1976019, 1853030, 1736848, 1631388, 1541002, 1465659, 1402340, 1350197, 1309732, 1278334, 1251969, 1230248, 1214798, 1203754, 1193107, 1182373, 1173509, 1165343, 1154868, 1143162, 1134085, 1127578, 1120085, 1111226, 1104163, 1099596, 1095224, 1091151, 1090071, 1092073, 1094789, 1098575, 1105890, 1115664, 1124048, 1130751, 1139006, 1149420, 1159642, 1169960, 1183084, 1198306, 1211915, 1223664, 1236930]
56059A236930J5429J5033J4765J7480K0083J9540J8967K1414K3551K2086K0341
56048A445619K1945K4029K3244K2308K4089K5568K4294K4088K7686L0673K9591
56037A723134K8743L1810L4405L2593L0887L3791L7271L7105L7630M3249M9306
56026B119924N0595N1002N5276N9350N8590N7589O1555O6110O5957O5382O9547
56015B780877P3823P2835P1540P5883Q1093Q1020Q0314Q5257R1413R2763R4009
56004C680827J00938J08101J09352J10822J19575J29500J32971J36101J47142
55995D775329J60292J67098J73088J86404K01010K08746K16821K34752K55445
55986F578985K68475K80482L02266L27708L46688L66384L97522M32242M59096
$$ y = [1236930, 1252359, 1267392, 1282157, 1299637, 1319720, 1339260, 1358227, 1379641, 1403192, 1425278, 1445619, 1467564, 1491593, 1514837, 1537145, 1561234, 1586802, 1611096, 1635184, 1662870, 1693543, 1723134, 1751877, 1783687, 1818092, 1850685, 1881572, 1915363, 1952634, 1989739, 2027369, 2070618, 2119924, 2170519, 2221521, 2276797, 2336147, 2394737, 2452326, 2513881, 2579991, 2645948, 2711330, 2780877, 2854700, 2927535, 2999075, 3074958, 3156051, 3237071, 3317385, 3402642, 3494055, 3586818, 3680827, 3781765, 3889866, 3999218, 4110040, 4229615, 4359115, 4492086, 4628187, 4775329, 4935621, 5102719, 5275807, 5462211, 5663221, 5871967, 6088788, 6323540, 6578985, 6847460, 7127942, 7430208, 7757916, 8104604, 8470988, 8868510, 9300752, 9759848]
55977I759848M86808N28672N77293O20740O68925P36200Q13438Q87189R70256
55968A6049369J081340J211819J347276J503542J704182J942481K207122K524478
55960B9571609K930733L426098M008034M725297N643329O785717Q177324R917457
55952G5185598J2136080J4905054J8260574K2247389K6824101L1781172L6852858
55945B38192826M1683041M5237522M5256114L9013962K5443199O705857j2616750
55938D28915771k8146243l7775489m1756703m1529650l8695569l4594893l0164364
55931A76252860k5898731k1988005j8523440j5560181j3071627j0973869r208447
55924F1028560p747620o541311n524847m669181l970484l401071k917515k505339
$$ y = [9759848, 10246656, 10775328, 11352621, 11973361, 12642286, 13378486, 14191924, 15079113, 16049369, 17130709, 18342528, 19689804, 21193346, 22897528, 24840009, 27047131, 29571609, 32502342, 35928440, 39936474, 44661771, 50305100, 57090817, 65268141, 75185598, 87321678, 102226732, 120487306, 142734695, 169558796, 201339968, 238192826, 279875867, 325113389, 370369503, 409383465, 434826664, 441532521, 428915771, 400769528, 362994039, 321237336, 279707686, 241012117, 206417224, 176252860, 150354129, 128366124, 109842684, 94282503, 81210876, 70237007, 61028560, 53280940, 46739629, 41214782, 36545601, 32575117, 29174046, 26256531, 23751192]
55916B3751192k171170j900785j665279j458896j292487j157942j034203r20319
55908A2150111q29121p55498o82277o10620n54649n11997m68047m23555l90851
55899F923496l67611l40309l09357k86398k70618k51238k29538k15909k08368
55890D444150j95621j78428j67244j61563j51601j37899j29811j26733j19433
55881C075817j08150j01584r9688r4467q6143q1978q0989p5772o7738o4759o5546
55870B149003o1830n4281n0979n1567m8251m1379l8986m1450m1135l6845l4621
55859A647679l4416k9792k1019j5242j3358r606m462n243j3074k1133k6627l3015
55847A420692l9844m1869l9188l7471l7348l3877k7065k2495k0974j7675j2180
$$ y = [23751192, 21580022, 19679237, 18013958, 16555062, 15262575, 14104633, 13070430, 12150111, 11320990, 10565492, 9883215, 9272595, 8717946, 8205949, 7737902, 7314347, 6923496, 6555885, 6215576, 5906219, 5619821, 5349203, 5097965, 4868427, 4652518, 4444150, 4248529, 4070101, 3902857, 3741294, 3589693, 3451794, 3321983, 3195250, 3075817, 2967667, 2866083, 2766395, 2671928, 2585785, 2503807, 2422818, 2347046, 2279308, 2214549, 2149003, 2087173, 2032892, 1981913, 1930346, 1882095, 1840716, 1801730, 1760280, 1719145, 1682300, 1647679, 1613263, 1583471, 1562452, 1547210, 1533852, 1524246, 1519784, 1514541, 1501467, 1480334, 1453707, 1420692, 1380848, 1338979, 1299791, 1262320, 1224972, 1191095, 1164030, 1141535, 1120561, 1102886, 1090706]
55836A090706r387r867q996o333o299r085j0172r409j1292j5710j7631j6542j7166
55823I42817k0257k1597k0653k1410k3953k4034k1606k1064k2512k1423j7671
55812G06637j6040j7019j5817j1587q909q926p508l680j505j957j032K346M385
55799F19388M084N115Q179R024O037K697P15k362o904r572r677j0497j2689j2912
55785E90626j0609r458j0581j0746q860p678p657n714j676N27k93r99q84l312
55771E12686q798j3024j3820j3971j5105j4990j2923j1641j1749j0164o324m050
55759C76127n076o366o030o216p939q675p512p274r208j0698j0364j0285j1155
55746B69329j0468p627n644n669n068k950k293m210n368l697j664j335j034N19
$$ y = [1090706, 1081319, 1071452, 1062456, 1056123, 1049824, 1040739, 1030567, 1021158, 1009866, 994156, 976525, 959983, 942817, 922560, 900963, 880310, 858900, 834947, 810913, 789307, 768243, 745731, 724308, 706637, 690597, 673578, 657761, 646174, 637265, 628339, 620831, 617151, 615646, 613689, 612657, 615003, 619388, 623472, 628587, 636766, 645790, 651827, 654524, 655239, 652877, 645973, 636401, 626724, 616227, 603538, 590626, 580017, 570559, 559978, 549232, 540372, 532694, 525037, 519323, 517647, 518174, 517881, 516882, 515998, 512686, 503888, 490864, 477044, 463073, 447968, 432978, 420055, 408414, 396665, 386501, 380177, 376127, 371051, 364685, 358655, 352439, 344500, 335825, 328313, 321039, 311831, 301133, 290769, 280484, 269329, 258861, 251234, 245590, 239921, 234853, 231903, 229610, 225400, 220032, 216335, 214671, 213336, 212302, 212821]
55732B12821J440O82L71J679K558J805J207J496N51k272m339m314m279n300n252
55717A98854l198j584j893k236j380r27j536j187P69K033J718K063L923M999M451
55702B04869M685O462O892M567K103J244P8k384l545j995l74n63l71J975M219
55687B27862M200L629M515N477M767L536L105K307M03o86J87J029L32l11K60K23
55671B60835j574k988k358j469j927k188r76j36j039j608o5J698J602J068J982
55656B50857L103K731K023K462K865J948J103J598J861N17p39m10l69k579n348
55641B61623o230o063o819p926p996p903q822r441q223o449o032o399o361o738
55627A60221q171q728o837m449m121n000m781l632l036k687j665r65j783k942
$$ y = [212821, 214261, 214943, 215314, 216993, 219551, 221356, 222563, 224059, 224610, 222338, 217999, 213685, 209406, 204106, 198854, 195656, 194072, 192179, 189943, 188563, 187636, 186100, 184913, 185682, 187715, 189433, 191496, 195419, 200418, 204869, 209554, 216016, 222908, 227475, 229578, 230822, 230900, 228516, 224971, 222976, 222602, 222039, 221668, 223643, 227862, 232062, 235691, 240206, 245683, 250450, 253986, 257091, 259398, 259801, 259115, 259302, 260331, 260663, 260352, 260612, 260835, 259261, 256273, 253915, 252446, 250519, 248331, 247355, 247219, 246180, 244572, 244507, 246205, 247807, 248875, 250857, 253960, 256691, 258714, 261176, 264041, 265989, 267092, 268690, 270551, 271068, 270329, 269919, 269550, 266971, 261623, 255393, 249330, 242511, 234585, 226589, 218686, 209864, 200423, 192200, 185751, 179719, 173320, 166959, 160221, 152050, 143322, 136485, 132036, 127915, 122915, 118134, 114502, 111466, 108779, 107114, 106149, 104366, 101424]
55613A01424k795k067k107k179j159o1j04j72R58J850P73j029j326m99k70n38
55597I0699l06q9o26q23K73J166K38j304j577j257j863k628k082j102j280j863
55581G5576j336n39j050j917j229L37O18l55q83q02j209j811j435m24l7j76l9
55564F3289M3l43o5J598K791J501r85j824p78L8l87j319k226k934k758j623j016
55547E3002j704k009n21J165J011Q9O22K025K153J232J224K143K287J520J243
55532F5482J558J362P85R16J536J695J898L134M408L896K041Q23N41j37j389k212
55516H6337k700l849n390o152o256o696p276p104o526o367n906l876p99J843L946
55501B3229O045P261O514M876M150L900K525M07p07p71j088j570j124k87o02j811
$$ y = [101424, 98629, 96562, 94455, 92276, 91117, 91056, 90952, 90780, 91738, 93588, 94361, 93332, 92006, 91507, 91237, 90699, 90393, 90304, 89678, 88855, 89128, 90294, 90532, 89228, 87651, 86394, 84531, 81903, 79821, 78719, 77439, 75576, 74240, 73701, 72651, 70734, 69505, 69842, 70460, 70105, 69222, 68420, 67211, 65400, 63965, 63541, 63504, 63328, 63289, 63332, 62989, 62924, 64522, 67313, 68814, 67829, 66005, 65227, 65265, 64878, 63559, 61333, 58399, 55641, 54018, 53002, 51298, 49289, 48768, 49933, 50944, 51033, 51655, 53680, 55833, 57065, 58289, 60432, 62719, 64239, 65482, 67040, 68402, 69187, 70103, 71639, 73334, 75232, 78366, 82774, 86670, 88711, 89534, 90075, 89938, 88549, 86337, 83637, 79788, 74398, 68246, 61990, 55294, 48018, 40914, 34388, 28021, 22115, 18239, 17440, 19283, 23229, 29274, 36535, 43049, 47925, 52075, 55975, 58500, 58907, 58200, 57429, 56341, 54771, 53647, 53360, 52758, 50947]
55485E0947k300j942j815j691n74O98L69j058j447n49j01o06q69p05j110j813
55469C5434j455l71l33j375j624o10J1n40j056p31l06k51n8K35k2m57L7J085J158
55450B8771J52m75k65j52k56L39J366J358K59l51N4K80j14NR89J417L06j469k622
55431B9592k784k063p87Mn01j352q06J121K722L067K635J689P6j400j461m10K61
55414B9603K41N31J203J181L62j46m0r1k93J86J099J189L80j29m4k60q81r87n35
55395C2569m52p45n23P1J0n18l28M11L43m89n94J72K45q42j644j322p06l64J99
55376B5493Q91O97l85j103j105j305j804j601p48n96j392j818j278n69P7J263
55360A4717K407J978L04l45P75J855J679J265J470J451O75J09K59K10l74m48J97
$$ y = [50947, 48647, 46705, 44890, 43199, 42625, 43323, 43692, 42634, 41187, 40638, 40537, 39931, 39062, 38357, 37247, 35434, 33979, 33608, 33275, 31900, 30276, 29666, 29677, 29137, 28081, 27350, 27044, 26793, 26735, 26970, 26948, 26491, 26528, 27613, 28771, 28923, 28448, 28183, 28031, 27775, 28114, 29480, 30838, 31097, 30746, 30800, 31080, 30966, 30971, 31960, 33377, 33683, 32214, 29592, 26808, 24745, 23958, 23962, 23461, 22109, 21303, 22424, 25146, 28213, 30848, 32537, 32613, 31213, 29752, 29342, 29603, 29844, 30375, 31578, 32759, 33121, 32975, 32935, 32844, 32551, 32737, 33836, 35025, 35405, 35276, 35232, 34972, 34091, 33104, 32569, 32117, 31372, 30849, 30920, 30930, 30412, 30084, 30495, 30838, 30349, 29755, 29927, 30172, 29330, 27686, 26364, 25658, 25294, 25493, 26384, 27081, 26696, 25593, 24488, 23183, 21379, 19778, 19030, 18434, 17042, 15224, 13946, 13377, 13454, 14717, 17124, 19102, 19406, 19061, 19836, 21691, 23370, 24635, 26105, 27556, 28231, 28340, 28599, 28809, 28435, 27987, 28184]
55343B8184K03p54r73L12J316N61q08j202j037j338j668j319r45j269j475n59
55327A7229Q67J559J465J236R47M02j91p24j369j705r05N67J011j2q55l03P41
55310A9960J103J134J458J530P90o3k58k50o76j121r84n92l84r3M49P10M03J9
55292B3135j68m09l96O26K125K352Q84n54o42j76k92p17q74j079j475j286k89
55275B0765M35L22M09J490K670K928K590K087Q28j314k873k679j645j225j297
55260B3491r78m40l50m32QP95J296J460J485J189N61J40J29lm57o72m79m84p78
55241B5481o08R6L75N1K26J201J666Q71j39m64p30j384j516o96j93q27j360o51
55223B1399K79R3m67k9R62J199Q64J002J443J227M73J34L83P29J126J697J969
$$ y = [28184, 28387, 27633, 26660, 26972, 28288, 28849, 28041, 26839, 25802, 24464, 22796, 21477, 20532, 19263, 17788, 17229, 18096, 19655, 21120, 22356, 23303, 23705, 23514, 22790, 21421, 19716, 18811, 19378, 20389, 20377, 19522, 19219, 19960, 21063, 22197, 23655, 25185, 25975, 25912, 25654, 25404, 24728, 23607, 22623, 22031, 21647, 21554, 22003, 22713, 23116, 23135, 22967, 22558, 22162, 22788, 24913, 27265, 28149, 27595, 26953, 26777, 26485, 25768, 24894, 23815, 22340, 21054, 20765, 21200, 21522, 21931, 23421, 26091, 29019, 31609, 33696, 34524, 33210, 30337, 27658, 26013, 24788, 23491, 22513, 22073, 21723, 21291, 21299, 22094, 23390, 24850, 26335, 27524, 28085, 28225, 28354, 28351, 27894, 27222, 26743, 26259, 25481, 24873, 24969, 25344, 25395, 25621, 26822, 28488, 29359, 29220, 28756, 28026, 26642, 25126, 24430, 24237, 23410, 22050, 21399, 21678, 21771, 21304, 21275, 22237, 23436, 24300, 25302, 26745, 27972, 28445, 28579, 28962, 29691, 30817, 32514, 34483]
55206C4483J557R78P42M86r4m62l58m87j091j123o6Q91P19K25L77M93k21p86m3
55187C6220J095J019P5j76L68M31m57j574k370k652j998m99N66K08p46r64o12
55170B7934o38r22p87m81n82o30K4P88P85M82P11R48K74p60r99p20r17j312r99
55151B2199l87m98q61j54J384K238K023J639J281L08r72j419r97p83r14l73R28
55134B4642J664J072n6p35p92l34N60J320J248O07K98M83N34L46M96J095J618
55117C4066J885K129K220J847J367J372J562J095%q70j114j036p78l00j5l65r32
55100D2133r44m35K4L97R85J500J447J062Q78P42L35R5N13J039R01M59M79P20
55082E2330N91N87J456K506K416J354N86L43j18o36k76O98Q75p8r38r03m66q4
$$ y = [34483, 36040, 37018, 37760, 38246, 38152, 37690, 37332, 36845, 35754, 34631, 34565, 35456, 36175, 36400, 36777, 37270, 37049, 36263, 36220, 37315, 38334, 38409, 38233, 38601, 39032, 38575, 37001, 34631, 31979, 29981, 29482, 30048, 30256, 29510, 28546, 27934, 27296, 26374, 25587, 25106, 24524, 23894, 23918, 24706, 25491, 25973, 26684, 27632, 27906, 27146, 26147, 25427, 24510, 23198, 22199, 21812, 21314, 20453, 20299, 21683, 23921, 25944, 27583, 28864, 29172, 28200, 26781, 25784, 25001, 24087, 23714, 24642, 26306, 27378, 27322, 26587, 25795, 25461, 26021, 27341, 28589, 29196, 29494, 29977, 30511, 30857, 31353, 32448, 34066, 35951, 38080, 40300, 42147, 43514, 44886, 46448, 47543, 47543, 46673, 45559, 44523, 43745, 43445, 43430, 43065, 42133, 41189, 40754, 40778, 41175, 42160, 43660, 45107, 46169, 47047, 47789, 48124, 48219, 48732, 49771, 50672, 51131, 51610, 52330, 52921, 53508, 54964, 57470, 59886, 61240, 61826, 62169, 62051, 61415, 61139, 61837, 62712, 62634, 61696, 60793, 60327, 60243]
55064F0243M09P44J56j111j709j026L0N19N16L34j19p30r37n90j82pJ30J70k36
55045E6604r50j355j295j199j241j245j271j435j291l78P98J328J205J052R09
55030E0236M43M5L18P26J97j002j492q85q8M75J371K539K812J666J57n18l68k9
55012E6603J99K71J63J14L80O31L11l42n21p0L88N22N42M75Q2m71q14j122j656
54993E5685j881j114R5N34Q1l22l15l04j93N77J560J476J39j107j238o37j8M35
54975E3453N81K40r6M10J552K137J696J012O56K93k53l84K75J288K156K813L090
54958G0919K717K064J965K558L180L530L906M299M364M415N316P144R015J0410
54944A35802J1631J2812J3554J3692J3328J2036R121M853L61l676p214r885j1203
$$ y = [60243, 60652, 61396, 61552, 60441, 58732, 57706, 57736, 58255, 58771, 59105, 58986, 58256, 57319, 56729, 56547, 56540, 56670, 56840, 56604, 55654, 54299, 53004, 51805, 50564, 49319, 48048, 46613, 45322, 44944, 45742, 47070, 48275, 49327, 50236, 50679, 50724, 51042, 51768, 51965, 50963, 49471, 48586, 48498, 48973, 50344, 52883, 55695, 57361, 57518, 57000, 56632, 56603, 56802, 57073, 57236, 57350, 57730, 58361, 58672, 58330, 57809, 57739, 58127, 58649, 59191, 59666, 59748, 59277, 58463, 57341, 55685, 53804, 52690, 52785, 53319, 53400, 53078, 52763, 52459, 52266, 52843, 54403, 55879, 56018, 54911, 53673, 53036, 53018, 53453, 54034, 54274, 54178, 54588, 56140, 58277, 59973, 60985, 61641, 61934, 61681, 61297, 61572, 62860, 65016, 67829, 70919, 73636, 75700, 77665, 80223, 83403, 86933, 90839, 95138, 99502, 103917, 109233, 116377, 125392, 135802, 147433, 160245, 173799, 187491, 200819, 212855, 221976, 226829, 227190, 223514, 216300, 206415, 195212]
54931A95212j1663j2301j3083j3073j2081j0781r270p196n214m580n055m993l834
54918H2088k742k459k242j498o72M2J147K455K931K573K702L813M835N261O084
54903A04318P768R211R834J0819J2908J4651J4384J2494J0231P566L781p52m985
54890B12228q539j1391j3054j3260j2734j2183j1318r841q488p963p738o962n768
54877H2989m699l674k588j998k092j917q02K88P7j064j758j534r27k75L35M19
54861F0780l49j285j428q22k04J51L72K76l66j139j462j352j103o54q1l0q35j723
54843D8746j757j058l60R7M04L33k13o08k63M35P56P14P20O74K95p0J17P02J167
54824E0831J483J806J817J165K22l64n57o44m85J82J020J439J404J248J101J022
$$ y = [195212, 183549, 171248, 158165, 145092, 133011, 122230, 112960, 105764, 100550, 95970, 90915, 85922, 82088, 79346, 76887, 74645, 73147, 72475, 72517, 73664, 76119, 79050, 81623, 84325, 88138, 92973, 98234, 104318, 112086, 121297, 131131, 141950, 154858, 169509, 183893, 196387, 206618, 214184, 217965, 217213, 212228, 203689, 192298, 179244, 165984, 153250, 141067, 129749, 119908, 111420, 103457, 95719, 88757, 82989, 78290, 74616, 72028, 70030, 67938, 66021, 65219, 65507, 65584, 64520, 62762, 61228, 60301, 60026, 60361, 60780, 60431, 59146, 57718, 56896, 56692, 56843, 57215, 57491, 57125, 55986, 54524, 53172, 52069, 51415, 51334, 51304, 50469, 48746, 46989, 45931, 45571, 45668, 46072, 46405, 46192, 45584, 45321, 45756, 46512, 47226, 47946, 48620, 48915, 48845, 48962, 49664, 50831, 52314, 54120, 55937, 57102, 57324, 56960, 56403, 55759, 55274, 55456, 56476, 57915, 59319, 60567, 61668, 62690]
54808F2690J294J892K190J856J531J841K333K209J706J766K617L669M610N737
54794I7941P230Q762R938J0625J0942J1228J1860J2715J3094J2448J0872Q681
54782B26336N949K795l99l415o315q800j0120j0110r596r301q962q052o772n678
54768A47560m915m386m131l937l205j804n02K2R0L96J137K240L793N559O720O876
54752A51513O850P719R534J1543J3275J4792J6324J8085J9947K0971J9879J6434
54740C26866J1659O345L92n938j1250j4521j6442j8215j9729j9990j8852j7197
54728B03128j5692j4206j2358j0045p685o132n909o281n922m692l796l796l739
54715A02875k901k019j867j876j317p25q47j109n75L47N77Q2l70o39j029j226
$$ y = [62690, 63984, 65876, 68066, 69922, 71453, 73294, 75627, 77836, 79542, 81308, 83925, 87594, 92204, 97941, 105171, 113933, 123871, 134496, 145438, 156666, 168526, 181241, 194335, 206783, 217655, 226336, 232285, 235080, 234681, 231266, 224951, 216151, 206031, 195921, 186325, 177024, 168062, 160010, 153238, 147560, 142645, 138259, 134128, 130191, 126986, 125182, 124680, 124702, 124792, 125188, 126325, 128565, 132358, 137917, 144637, 151513, 158363, 166082, 175616, 187159, 200434, 215226, 231550, 249635, 269582, 290553, 310432, 326866, 338525, 344870, 345262, 339324, 328074, 313553, 297111, 278896, 259167, 239177, 220325, 203128, 187436, 173230, 160872, 150827, 143142, 137010, 131101, 124820, 118898, 114206, 110410, 106614, 102875, 99974, 97955, 96088, 94212, 92895, 92170, 91323, 90214, 89639, 89986, 90563, 90645, 90275, 89636, 88607, 87381]
54699H7381o93K04O22M90L35L16L82Q06J531J663P13l65m84o4k6n7O11J330P94
54680I5489o81j404p48K77R47J657K612L128K768K047J687J882K490L181L408
54665A18740L003K633K933L452L369K863K733K980K953K629K570K767K694K453
54651A58772K645L075K897K105J813K790M656O650Q330R425R867J0138J0845J1947
54637B45955J2984J3892J4777J5153J4273J2026Q744M485n95n525r186j1495j3085
54624C02403j4187j4801j5343j5971j5743j3853j1261r626q917p748n884m655
54612A64414m652m733l812k268j063n95q66j648k198j756o74j07m34r64j294j776
54596A35574k475k829k720k796l361l926m092l977l580k698j686j294j545j714
$$ y = [87381, 86688, 86892, 87514, 88004, 88339, 88655, 89037, 89843, 91374, 93037, 93750, 93385, 92901, 92837, 92811, 92754, 93365, 94695, 95489, 94808, 93404, 92656, 92933, 93880, 95537, 98149, 101277, 104045, 106092, 107779, 109661, 112151, 115332, 118740, 121743, 124376, 127309, 130761, 134130, 136993, 139726, 142706, 145659, 148288, 150858, 153625, 156319, 158772, 161417, 164492, 167389, 169494, 171307, 174097, 178753, 185403, 193733, 203158, 213025, 223163, 234008, 245955, 258939, 272831, 287608, 302761, 317034, 329060, 337804, 342289, 341694, 336169, 326983, 315488, 302403, 288216, 273415, 258072, 242101, 226358, 212505, 201244, 191618, 182701, 174953, 169069, 164414, 159762, 155029, 151217, 148949, 147886, 147291, 146425, 144777, 142579, 140823, 140149, 140042, 139608, 138644, 137350, 135574, 133099, 130270, 127550, 124754, 121393, 117467, 113375, 109398, 105818, 103120, 101434, 100140, 98595, 96881]
54582I6881j548j557j956k353k590k833k834k211j462j426j744j221Q3P63L16
54567G4308j43L7m7j025j875j500m66L2MK60Q94J321J342J259J210J126J056J022
54549G8815Q46N16L80O06R75J249J340J064M30K05J206K853L599L052K530L024
54533A02690L838M052M222N456P521Q950Q798P471O026N259N220N198M291K330
54519A81322k2k155m009n617o750p284p333o862n802m705m466n055n343m555l217
54504A08147k263j951k054k428k836k840k345j805j537j375j172j046q20l6J065
54489H4704J407M45r16j408q23J55R78J524J769J784J841K077K277K215J935J595
54473A01559J275J051R07O09O7l09j55J19j66q22j014n37pK54N97J141J371Q82
$$ y = [96881, 95333, 93776, 91820, 89467, 86877, 84044, 81210, 78999, 77537, 76111, 74367, 73146, 73229, 73992, 74308, 74165, 74202, 74155, 73130, 71255, 69755, 69289, 69321, 69325, 69585, 70479, 71800, 73142, 74401, 75611, 76737, 77793, 78815, 79661, 80177, 80557, 81163, 82138, 83387, 84727, 85791, 86221, 86426, 87632, 90485, 94084, 97136, 99666, 102690, 106528, 110580, 114802, 120258, 127779, 136729, 145527, 152998, 159024, 164283, 169503, 174701, 178992, 181322, 181300, 179145, 175136, 169519, 162769, 155485, 148152, 141290, 135488, 130783, 126317, 121262, 115919, 111364, 108147, 105884, 103933, 101879, 99451, 96615, 93775, 91430, 89625, 88088, 86713, 85541, 84495, 83675, 83639, 84704, 86111, 86556, 85640, 84232, 83409, 83564, 84542, 86066, 87835, 89619, 91460, 93537, 95814, 98029, 99964, 101559, 102834, 103885, 104792, 105401, 105468, 105159, 105004, 105123, 104957, 104135, 103121, 102584, 102577, 102831, 103428, 104569, 105940, 106822]
54455A06822j95j567k793l021j766P1R52N92J5k41o54j364j689j430j250j415
54439I1067j411j190j349j633r38N69J041l55j952k023j202j027j398j208m59
54424G6532l1L0M03J012J169R24R78J382J479J043M94J63J61P32J855K801K876
54407I4003K387K093J988J602J155J392K337L088K995K387K023K283K972L603
54393A26308L890M005M129L865K754J278M49K36m83k018l189l225l022l541m160
54378A27276l858l047k759k827k388j643j512j907j910j431j223j332j027l23
54364A00089j71q21j381j331j234j442j270k35Q28Q19m2n40r9P01J172J373J697
54347I8113K041J891J190O17P42J302J729K114K916L888M186L677L177L090K805
$$ y = [106822, 106627, 105060, 102267, 99246, 97480, 97551, 98503, 99095, 99110, 98869, 98215, 96851, 95162, 93732, 92482, 91067, 89656, 88466, 87117, 85484, 84546, 85115, 86156, 85801, 83849, 81826, 80624, 79597, 78199, 76991, 76532, 76501, 76531, 76934, 77946, 79115, 80039, 81017, 82399, 83878, 84921, 85415, 85578, 85739, 86471, 88326, 91127, 94003, 96390, 98483, 100471, 102073, 103228, 104620, 106957, 110045, 113040, 115427, 117450, 119733, 122705, 126308, 130198, 134203, 138332, 142197, 144951, 146229, 146678, 146914, 146431, 144413, 141224, 137999, 134977, 131436, 127276, 123418, 120371, 117612, 114785, 112397, 110754, 109242, 107335, 105425, 103994, 102771, 101439, 100412, 100089, 99918, 99097, 97716, 96385, 95151, 93709, 92439, 92204, 93032, 93851, 93809, 93269, 93170, 93871, 95043, 96416, 98113, 100154, 102045, 103235, 103852, 104594, 105896, 107625, 109739, 112655, 116543, 120729, 124406, 127583, 130673, 133478]
54332A33478J882R24N41K97m92j537k126k385k993l991m697m615l831k717j853
54317A05885j835k558l089k798k214k109k336k305k064k013j997j622j170j240
54303G6535j733j988j799j471j110o85n34r79j562j531r27m38k83o7L47N97M60
54286F2832O1m71r65r81k86O02R74Q90Q34O95n0j206j808j358m14J86K04k0l3
54267E9686L56Q93J205J441K146L186L469K311N50m72n13k34Q5N78R22N69k68
54250G5910p93p56n57l09K36R41J315J303J284J246Q18M6o06j040j481j698j182
54233G4677j47M83L10j21l11m62q64j284j316r01l01J44K03km3K58N63O60Q81
54214G2427J398J557P84l08o02K5P65J155J305J085K43o97p63J9O25N14K35K60
$$ y = [133478, 135360, 136284, 136825, 137122, 136630, 135093, 132967, 130582, 127589, 123598, 118901, 114286, 110455, 107738, 105885, 104050, 101492, 98403, 95605, 93391, 91282, 88946, 86641, 84577, 82564, 80567, 78945, 77775, 76535, 74802, 72814, 71015, 69544, 68434, 67749, 67215, 66236, 64674, 63143, 62216, 61778, 61495, 61428, 61775, 62372, 62832, 62893, 62422, 61457, 60476, 60190, 60792, 61766, 62656, 63490, 64185, 64135, 62929, 61121, 59763, 59349, 59535, 59739, 59719, 59686, 60042, 60935, 62140, 63581, 65727, 68913, 72382, 74693, 75243, 74771, 74258, 74024, 74109, 74687, 75609, 76178, 75910, 75117, 74361, 73804, 73495, 73731, 74672, 75987, 77290, 78574, 79820, 80638, 80684, 80078, 79038, 77557, 75859, 74677, 74530, 75013, 75323, 75202, 74891, 74429, 73565, 72281, 70965, 70064, 69763, 69907, 70110, 70108, 70065, 70323, 70886, 71546, 72427, 73825, 75382, 76166, 75858, 75256, 75281, 76046, 77201, 78506, 79591, 79834, 79137, 78374, 78393, 79018, 79532, 79767, 80027]
54196H0027K13l06r90j278j065n95j99k24p58j329j401j098r15q94p56o42q77
54179F6913j166r96p19j133k001k129j133oM13M48O48Q51P81O57O46M28j43o12
54161F1747o61n67m68O8J152J949J723R06L78J54l55j055j164n13lm23j311j544
54143F0013q22n8r5o07o51n7M90O56Q35J079O66o31j698j474m91j4k21m08m96
54124E6016r49j498j349p17o77j298j311n0J502K167J953J408O46k50o74k25N70
54107E5264R11O97L66K19L22O48R84J042Q63P22N73R3o07r74q58o14l75O1M59
54088E9796K05n96j002o24k35m82q64o24N4M73M77M02M22M85O10P69P36M50J60
54069F0612J02K88P40J391J719J195J85k70R0L82j1n32m15K37Q52J275J585J686
$$ y = [80027, 80240, 79934, 78944, 77666, 76601, 76006, 75807, 75583, 74825, 73496, 72095, 70997, 70082, 69188, 68432, 67790, 66913, 65747, 64751, 64032, 62899, 60898, 58769, 57636, 57630, 58043, 58491, 59139, 59990, 60771, 61428, 62074, 62502, 62359, 61747, 61086, 60519, 60051, 60119, 61271, 63220, 64943, 65849, 66227, 66381, 66026, 64971, 63807, 63294, 63291, 62868, 61557, 60013, 59191, 59133, 59038, 58431, 57780, 57723, 58213, 58869, 59704, 60783, 61449, 60818, 59120, 57646, 57155, 57141, 56920, 56512, 56016, 55067, 53569, 52220, 51503, 50826, 49528, 48217, 48167, 49669, 51836, 53789, 55197, 55843, 55593, 54919, 54694, 55264, 56175, 56872, 57238, 57457, 57779, 58427, 59411, 60453, 61316, 62038, 62611, 62704, 62097, 61123, 60265, 59651, 59276, 59337, 59796, 60001, 59405, 58403, 57779, 57544, 57062, 56198, 55574, 55628, 56101, 56578, 56980, 57402, 57887, 58497, 59266, 60002, 60452, 60612, 60714, 61002, 61742, 63133, 64852, 66047, 66232, 65962, 66052, 66434, 66423, 65891, 65476, 65713, 66565, 67840, 69425, 71111]
54051G1111J577J555J674J494Q55L65N82J211J615J721J887K280K809L298L440
54036I7474K978K284K211L075M276N186N787O176O180N820N532N435N107M472
54022A61993M112M195L977L001K047K063K826L439L541L216K368J086J14K7K88
54007A98293L1o46j063j270j927l059l928m136l981l748l427l178l236l339k922
53992A58464k127j908k835m268n013m453k919j265k32J3j21j59o6j81p04j443
53976A30783j931j727p90L35R35Q09M16K27K64L24K91O9l88q18p99l15J40K09
53958A28034k5l67o97o93l7Q74J124N15m9J88Q60J197J070P69M35K45O41J643
53940A35727K520K753K853L512M452M896M767M600M535M255L712L159K576J764
$$ y = [71111, 72688, 74243, 75917, 77411, 78266, 78631, 79213, 80424, 82039, 83760, 85647, 87927, 90736, 94034, 97474, 100452, 102736, 104947, 108022, 112298, 117484, 123271, 129447, 135627, 141447, 146979, 152414, 157521, 161993, 166105, 170300, 174277, 177278, 179325, 181388, 184214, 187653, 191194, 194410, 196778, 197864, 197978, 198005, 198293, 198324, 197678, 196615, 195345, 193418, 190359, 186431, 182295, 178314, 174566, 171139, 167961, 164725, 161386, 158464, 156337, 154429, 151594, 147326, 142313, 137860, 134941, 133676, 133444, 133457, 133336, 133177, 133111, 132930, 132226, 130783, 128852, 127125, 126335, 126670, 127605, 128414, 128830, 129057, 129321, 129645, 129936, 130005, 129617, 128799, 128000, 127685, 127825, 128034, 128009, 127642, 126945, 126252, 126215, 127089, 128213, 128728, 128679, 128867, 129727, 130924, 131994, 132763, 133198, 133443, 134084, 135727, 138247, 141000, 143853, 147365, 151817, 156713, 161480, 166080, 170615, 174870, 178582, 181741, 184317, 186081]
53926A86081R01L33n6o59j322j409o62M72J450K085K448K739L221L961M645M981
53910B09209N088N217N327N320N431N901O413O343N539M487L727L334K911J981
53896B76228N58o45r38o01o07j302k077k540l154m211n050n073m796n078n805
53881B34909o287o484o861p352p403o907o223n467m562l847l779m095m047l409
53867A58186k620k055j854k244l191l939l714k848k302k232j972j451j470k335
53853A23959l174l080k181j144l62m7m61j445k211k166j578j055o73j45M35N42
53837A05214k2p73j117j065j190j752k117j406K48J529J388K59n40l64L14Q18
53821I9424R29P21L22L0K11P76J144R15L72J69O16J397J909J869J567J490J741
$$ y = [186081, 186982, 187315, 187259, 186600, 185278, 183869, 183207, 183679, 185129, 187214, 189662, 192401, 195622, 199583, 204228, 209209, 214297, 219514, 224841, 230161, 235592, 241493, 247906, 254249, 259788, 264275, 268002, 271336, 274247, 276228, 276786, 276141, 275203, 274602, 273995, 272693, 270616, 268076, 264922, 260711, 255661, 250588, 245792, 240714, 234909, 228622, 222138, 215277, 207925, 200522, 193615, 187392, 181925, 177363, 173516, 169737, 165642, 161595, 158186, 155566, 153511, 151657, 149413, 146222, 142283, 138569, 135721, 133419, 131187, 129215, 127764, 126294, 123959, 120785, 117705, 115524, 114380, 114018, 113971, 113510, 112065, 109854, 107688, 106110, 105055, 104382, 104237, 104672, 105214, 105192, 104419, 103302, 102237, 101047, 99295, 97178, 95772, 96020, 97549, 98937, 99196, 98656, 98292, 98606, 99424, 100353, 101074, 101396, 101426, 101637, 102413, 103557, 104472, 104844, 105013, 105629, 107026, 108935, 110804, 112371, 113861, 115602]
53804A15602K038K232K451K659K587K289K324K955L727M178M529N012N124M317
53790A62024L164K851L577M288M103L327K783K749K869K718K195J540J183J307
53776B00678J605J569J041K46o04j456k200k638k701k574k566k890l463l860l702
53761A76485l098k533k227k019j896k087k476k537k101j632j369q86L3P33N48
53746A52938k19p80q74p00l26Q3K4o94j434j617j591j901k254k083j654j559j550
53729A33809r97j77P1k17k36J76M01K74K02P4o85j736j822n57R37J616J721J888
53711A34742K057K043K166K595K747K232J793K401L739M475L905K708J948J949
53697A71500K317K716L194L740L892L206K111J720K474L461L512K551J342M26
$$ y = [115602, 117640, 119872, 122323, 124982, 127569, 129858, 132182, 135137, 138864, 143042, 147571, 152583, 157707, 162024, 165188, 168039, 171616, 175904, 180007, 183334, 186117, 188866, 191735, 194453, 196648, 198188, 199371, 200678, 202283, 203852, 204893, 205139, 204535, 203079, 200879, 198241, 195540, 192966, 190400, 187510, 184047, 180187, 176485, 173387, 170854, 168627, 166608, 164712, 162625, 160149, 157612, 155511, 153879, 152510, 151624, 151657, 152390, 152938, 152719, 151939, 151065, 150365, 150039, 150122, 150146, 149452, 148018, 146401, 144810, 142909, 140655, 138572, 136918, 135359, 133809, 132812, 132635, 132706, 132489, 132253, 132429, 132830, 133104, 133306, 133380, 132695, 130959, 129137, 128580, 129517, 131133, 132854, 134742, 136799, 138842, 141008, 143603, 146350, 148582, 150375, 152776, 156515, 160990, 164895, 167603, 169551, 171500, 173817, 176533, 179727, 183467, 187359, 190565, 192676, 194396, 196870, 200331, 203843, 206394, 207736, 208162]
53683B08162J4M52J738K892K833J911J507K122K866K988K760K487J741K82j071
53668B33684j329n54L39P28O86N80O45Q27P82K10o96j348j402r82l62K03L69p5
53650B32305q65j542k009k357k330j609n85o3j78k36K04P75R75Q17O30O89J106
53633B25727J569J336J49r98q41M59J523J657J543J807K072J888J624J829K325
53618B43669K557K335J886J569J806K663L469L391K618K184K559L178L524L742
53604B81150L949L923L827M275N244N950O203O730P634P731O303M490L860M366
53590C55635M862M913M945N015M603L564K470J967K326L376M473M810M256L491
53576D10706K991K405J414M89J99L32L76L93O58R16P27K13k61p41j389j924k028
$$ y = [208162, 208176, 208628, 210366, 213258, 216091, 218002, 219509, 221631, 224497, 227485, 230245, 232732, 234473, 234755, 233684, 232355, 231801, 232140, 232868, 233554, 234134, 234779, 235606, 236388, 236598, 235902, 234554, 233152, 232170, 231808, 232011, 232380, 232305, 231440, 229898, 227889, 225532, 223202, 221593, 221008, 220945, 220767, 220531, 220735, 221510, 222485, 223302, 223932, 224621, 225727, 227296, 228632, 228781, 227783, 226942, 227401, 228924, 230581, 232124, 233931, 236003, 237891, 239515, 241344, 243669, 246226, 248561, 250447, 252016, 253822, 256485, 259954, 263345, 265963, 268147, 270706, 273884, 277408, 281150, 285099, 289022, 292849, 297124, 302368, 308318, 314521, 321251, 328885, 336616, 342919, 347409, 351269, 355635, 360497, 365410, 370355, 375370, 379973, 383537, 386007, 387974, 390300, 393676, 398149, 402959, 407215, 410706, 413697, 416102, 417516, 418005, 418204, 418536, 418912, 419305, 419963, 420879, 421606, 421819, 421558, 420817, 419428, 417504, 415476]
53559D15476j911j851j623j043n67n88o39j26N73O67K42J1Q4j5k70q6O59J420
53541D10413J791J840J567R45M51P73J809K649K715K244J659J101P83J139K253
53526D34132L620M690N347N796O326P197Q337R202R290Q879Q828R617J0921J2075
53512E44257J2642J2668J2675J3332J4694J5998J6676J7190J8304J9781K0674
53501G18891K0895K1480K3073K4926K5941K6112K6411K7490K9032L0227L0544
53490A005022L0105K9484K9141K9049K8891K8634K8577K8900K9377K9635K9503
53479A326318K9144K8965K9383L0330L1028L0546K8831K6937K6007K6055K5926
53468A639470K4597K2365K0542J9948J9962J9382J7908J6254J4963J3803J2528
$$ y = [415476, 413565, 411714, 410091, 409048, 408481, 407893, 407254, 407128, 407701, 408368, 408610, 408621, 408705, 408690, 408420, 408334, 408993, 410413, 412204, 414044, 415611, 416556, 417007, 417780, 419589, 422238, 424953, 427197, 428856, 429957, 430740, 431879, 434132, 437752, 442442, 447789, 453585, 459911, 467108, 475445, 484647, 493937, 502816, 511644, 521261, 532182, 544257, 556899, 569567, 582242, 595574, 610268, 626266, 642942, 660132, 678436, 698217, 718891, 739786, 761266, 784339, 809265, 835206, 861318, 887729, 915219, 944251, 974478, 1005022, 1035127, 1064611, 1093752, 1122801, 1151692, 1180326, 1208903, 1237803, 1267180, 1296815, 1326318, 1355462, 1384427, 1413810, 1444140, 1475168, 1505714, 1534545, 1561482, 1587489, 1613544, 1639470, 1664067, 1686432, 1706974, 1726922, 1746884, 1766266, 1784174, 1800428, 1815391, 1829194, 1841722]
53457A841722J1421J0579R183O297K196j718m387o009p535r627j2190j4594j6255
53444A809083j7131j7748j8789k0655k3252k5909k7610k7832k7225k7076k7874
53433A547982k8919k9484k9693k9909k9858k8963k7210k5071k2894k0804j8974
53422A256203j7444j5972j4398j2928j1638j0172q416o985o310n599l644m55K713
53409A144955M957O613Q431J0637J2992J5222J7127J8667K0147K1934K3918K5648
53397A331248K7088K8814L1224L3899L6052L7420L8503L9949M1900M4026M6116
53386A736239M8446N1325N4445N7129N9272O1477O4045O6384O7822O8556O9256
53375B404396P0103P0770P1091P1147P0854P0008O8589O6648O4040O0732N7118
$$ y = [1841722, 1853143, 1863722, 1872905, 1879202, 1881398, 1879680, 1875293, 1869284, 1861749, 1852122, 1839932, 1825338, 1809083, 1791952, 1774204, 1755415, 1734760, 1711508, 1685599, 1657989, 1630157, 1602932, 1575856, 1547982, 1519063, 1489579, 1459886, 1429977, 1400119, 1371156, 1343946, 1318875, 1295981, 1275177, 1256203, 1238759, 1222787, 1208389, 1195461, 1183823, 1173651, 1165235, 1158250, 1151940, 1146341, 1142697, 1142242, 1144955, 1149912, 1156525, 1164956, 1175593, 1188585, 1203807, 1220934, 1239601, 1259748, 1281682, 1305600, 1331248, 1358336, 1387150, 1418374, 1452273, 1488325, 1525745, 1564248, 1604197, 1646097, 1690123, 1736239, 1784685, 1836010, 1890455, 1947584, 2006856, 2068333, 2132378, 2198762, 2266584, 2335140, 2404396, 2474499, 2545269, 2616360, 2687507, 2758361, 2828369, 2896958, 2963606, 3027646, 3088378, 3145496]
53364C145496N3513M9598M4914L9783L5051L0981K7003K2599J7846J2990Q048
53353C487822K986k109p205j2341j7436k2369k7365l2955l9405m6371n3172n9223
53341C170857o4226o8046p0413p0893o9460o7155o5552o5256o5294o4482o2862
53330B437218o1307o0146n9017n7829n7002n6578n5804n3907n0999m7976m5702
53319A830951m4143m2232l8867l4247k9891k6981k5238k3915k3212k3752k4965
53308A493508k5206k3614k0906j8116j5426j2670j0191q551p711p109o352n486
53296A332170m599l561k223p00O61J720K786M267O116P912R517J1313J3626J6292
53282A395297J8993K1670K4409K7192K9979L2630L4584L5157L4412L3202L2120
$$ y = [3145496, 3199009, 3248607, 3293521, 3333304, 3368355, 3399336, 3426339, 3448938, 3466784, 3479774, 3487822, 3490808, 3488699, 3481494, 3469153, 3451717, 3429348, 3401983, 3369028, 3329623, 3283252, 3230080, 3170857, 3106631, 3038585, 2968172, 2897279, 2827819, 2760664, 2695112, 2629856, 2564562, 2500080, 2437218, 2375911, 2315765, 2256748, 2198919, 2141917, 2085339, 2029535, 1975628, 1924629, 1876653, 1830951, 1786808, 1744576, 1705709, 1671462, 1641571, 1614590, 1589352, 1565437, 1542225, 1518473, 1493508, 1468302, 1444688, 1423782, 1405666, 1390240, 1377570, 1367379, 1358828, 1351117, 1344008, 1337656, 1332170, 1327571, 1324010, 1321787, 1321087, 1321748, 1323468, 1326254, 1330521, 1336637, 1344549, 1354066, 1365379, 1379005, 1395297, 1414290, 1435960, 1460369, 1487561, 1517540, 1550170, 1584754, 1619911, 1654323, 1687525, 1719645]
53271A719645L1051L0035K9609K9705K9057K6671K3252K0293J8256J6586J4995
53260A989155J3587J2040R791O959M207J741p55l383o075r158j2957j6971k0317
53247A967864k2876k5206k7502k9519l1344l3272l5104l6376l7155l7719l7828
53236A613963l7256l6694l6900l7213l6307l4263l2472l1541l0754k9796k9378
53225A241389k9758l0076k9706k9032k8354k7312k5954k5159k5227k5140k3901
53214I41770k1716j9297j6995j5175j4404j4586j4861j4876j5213j5989j6311
53203G62347j5755j5249j5599j6267j6529j6643j6832j6239j4301j2150j1270
53192E95513j1388j1192j0553j0502j1280j1944j1927j1700j1760j1998j2272
$$ y = [1719645, 1750696, 1780731, 1810340, 1840045, 1869102, 1895773, 1919025, 1939318, 1957574, 1974160, 1989155, 2002742, 2014782, 2024573, 2031532, 2035739, 2037480, 2036725, 2033342, 2027267, 2018109, 2005152, 1988181, 1967864, 1944988, 1919782, 1892280, 1862761, 1831417, 1798145, 1763041, 1726665, 1689510, 1651791, 1613963, 1576707, 1540013, 1503113, 1465900, 1429593, 1395330, 1362858, 1331317, 1300563, 1270767, 1241389, 1211631, 1181555, 1151849, 1122817, 1094463, 1067151, 1041197, 1016038, 990811, 965671, 941770, 920054, 900757, 883762, 868587, 854183, 839597, 824736, 809860, 794647, 778658, 762347, 746592, 731343, 715744, 699477, 682948, 666305, 649473, 633234, 618933, 606783, 595513, 584125, 572933, 562380, 551878, 540598, 528654, 516727, 505027, 493267, 481269, 468997]
53181D68997j2654j2897j2483j1384j0218r555r509r913j0343j0136r027p704
53169C43174p122p274p225o324m905l734l315l705m539n197n232m710m021l515
53155B72356l435l820m226m013l151k416k332k469k179j550j114j093j449k148
53141B36961k775k494j167k9l27j635k493k409k158k252k201j520n58Q5K94K72
53125B15594J39k7n7J28M08N84M80M9l72k30N47J289J407J146J010Q82M28J5L17
53106B23737J133J503J144Q51J222J749J708J283J234J626J587M09j466k824l031
53091B31865k708k795l254l273k688k408l030l864l942l401l075l132l078k857
53077A88360k930l260l160k345j402r75j066j331j547j542j233r58j262k072k522
$$ y = [468997, 456343, 443446, 430963, 419579, 409361, 399806, 390297, 380384, 370041, 359905, 350878, 343174, 336052, 328778, 321553, 315229, 310324, 306590, 303275, 299570, 295031, 289834, 284602, 279892, 275871, 272356, 268921, 265101, 260875, 256862, 253711, 251295, 248963, 246494, 244315, 242765, 241651, 240558, 239109, 236961, 234186, 231692, 230525, 230496, 230169, 228534, 226041, 223632, 221474, 219222, 217021, 215501, 214943, 215028, 215322, 215594, 215733, 215706, 215649, 215777, 216185, 216769, 217249, 217298, 216926, 216696, 217243, 218532, 219939, 221085, 222095, 222977, 223405, 223420, 223737, 224870, 226373, 227517, 228368, 229590, 231339, 233047, 234330, 235564, 237190, 238777, 239186, 237720, 234896, 231865, 229157, 226362, 223108, 219835, 217147, 214739, 211709, 207845, 203903, 200502, 197427, 194295, 191217, 188360, 185430, 182170, 179010, 176665, 175263, 174288, 173222, 171891, 170344, 168802, 167569, 166611, 165349, 163277, 160755]
53062A60755j954q16k32p84j846k182j224J68M92o48j927j896p90p6m48j115j175
53045A44302p75n75p45r77j086j070q68m96k26l12n95o78m39j53j51m54q16j049
53027A32837j198j392j512j210l87N71J180J265Q53k9j142j913j938j467j019
53012A23499o99l40r8l20q34r69m45K37M53J45k63l64n8M55Q07Q00N68L37J44
52993A23055NJ48O29R05L61p50j407r93L3Q16J023R18Q59J008J270J360J089O35
52975A30964L99N05O36M36m0l30L5J088K247K796K663K483K705K998K909K711
52959A55205K952L481L678L492L528L971M238L890L219K603J962J210O96O59P03
52944A95487K97m52j062j390j655j865j719j103l59nk90j018j683j925j875j903
$$ y = [160755, 158801, 157985, 157753, 156969, 155123, 152941, 151717, 151885, 152377, 151729, 149802, 147906, 147116, 147040, 146592, 145477, 144302, 143527, 142952, 142207, 141230, 140144, 139074, 138206, 137710, 137484, 137172, 136577, 135899, 135460, 135307, 135156, 134702, 133886, 132837, 131639, 130247, 128735, 127525, 127138, 127709, 128889, 130154, 131007, 130978, 129836, 127923, 125985, 124518, 123499, 122800, 122460, 122362, 122042, 121208, 120239, 119794, 120031, 120484, 120629, 120366, 120002, 119944, 120399, 121206, 122006, 122574, 122911, 123055, 123060, 123208, 123837, 124742, 125103, 124353, 122946, 121953, 121986, 122802, 123825, 124743, 125602, 126610, 127880, 129240, 130329, 130964, 131363, 131868, 132504, 132940, 132900, 132570, 132605, 133693, 135940, 138736, 141399, 143882, 146587, 149585, 152494, 155205, 158157, 161638, 165316, 168808, 172336, 176307, 180545, 184435, 187654, 190257, 192219, 193429, 194125, 194784, 195487, 195784, 195332, 194270, 192880, 191225, 189360, 187641, 186538, 186179, 186174, 185884, 184866, 183183, 181258, 179383, 177480]
52928A77480j960j577o67J10J39l07m92k55l8j6J11L78K84l90r63o71K36P75N53
52909A72730K01L07N70M05o2j43L94J054J301J066N35q4m62l39K7M1l57m81J27
52890A76830R70J293J157J192J564J783J519J040P43O69O00L81J4k89k46J58N05
52873A89883L94l6l14k94k15j76K1M52Q72J072J097R41M08m73j173j131m38K49
52855A91139M60L36K67L23L27L26O55J387J992J872J094L50K26Q68K136L690M869
52838B12317N027M199L108K351J943J719J692J816J787J436R30M52Qk94l25m64
52822B37702j371k909l972l852l156k842k993l204l513m078m470m185l534l138
52808A90485k944k525k062k009k104j753j214j279j845j982j461j092j282j440
$$ y = [177480, 175520, 173943, 173276, 173386, 173525, 173218, 172726, 172471, 172433, 172417, 172528, 172906, 173190, 172800, 171837, 171166, 171402, 172177, 172730, 172931, 173238, 173808, 174213, 174151, 174008, 174402, 175456, 176757, 177823, 178358, 178274, 177812, 177473, 177500, 177541, 177184, 176703, 176830, 177800, 179093, 180250, 181442, 183006, 184789, 186308, 187348, 188091, 188760, 189360, 189741, 189755, 189466, 189220, 189378, 189883, 190277, 190241, 189927, 189633, 189418, 189242, 189263, 189715, 190587, 191659, 192756, 193697, 194105, 193632, 192459, 191328, 190890, 191139, 191599, 191935, 192202, 192525, 192852, 193178, 193833, 195220, 197212, 199084, 200178, 200528, 200754, 201622, 203758, 207448, 212317, 217344, 221543, 224651, 227002, 228945, 230664, 232356, 234172, 235959, 237395, 238325, 238777, 238785, 238491, 238166, 237702, 236331, 233422, 229450, 225598, 222442, 219600, 216607, 213403, 209890, 205812, 201342, 197157, 193623, 190485, 187541, 185016, 182954, 180945, 178841, 177088, 175874, 174595, 172750, 170768, 169307, 168215, 166933, 165493]
52794A65493j180j052j537k181k361k186k036j861j532j298j329j287r09n65p23
52779A43456j147j277j073r77j184j419j386j081p12n35o95j099j472j598j436
52764A26365j061o96o98j092j295p37K22N53j92j383k161k323k204k196k475k827
52748A05800k640j622n37n35j633k556k327j340m52J27N53O45K37k28k39p0m48
52731I2735j428k204k069j124K4Q20J040P83L77J54K56N47P03M49r4m16k27O5
52713I0391j74q94j432j447j277j254j140n38N08J508J916J484N58m0J50O48P84
52696H9751Q14J450K399K447J250J1j55M43R57J333J904K437K481K202J994J730
52680A13448J182P75R88J330R14j05o59l82j04n62j455k109k409k518k264j419
$$ y = [165493, 164313, 163261, 161724, 159543, 157182, 154996, 152960, 151099, 149567, 148269, 146940, 145653, 144744, 144179, 143456, 142309, 141032, 139959, 138982, 137798, 136379, 134993, 133912, 133200, 132665, 131970, 130871, 129399, 127801, 126365, 125304, 124608, 123910, 122818, 121523, 120786, 121008, 121561, 121369, 119986, 117825, 115502, 113298, 111102, 108627, 105800, 103160, 101538, 101001, 100466, 98833, 96277, 93950, 92610, 92158, 92285, 92838, 93483, 93720, 93492, 93253, 93183, 92735, 91307, 89103, 87034, 85910, 85934, 86754, 87794, 88577, 88954, 89108, 89364, 89911, 90614, 91063, 90969, 90553, 90326, 90391, 90217, 89323, 87891, 86444, 85167, 83913, 82773, 82235, 82743, 84251, 86167, 87651, 88209, 88169, 88319, 88967, 89751, 90565, 92015, 94414, 96861, 98111, 98122, 97967, 98410, 99367, 100700, 102604, 105041, 107522, 109724, 111718, 113448, 114630, 115405, 116393, 117723, 118637, 118532, 117873, 117491, 117387, 116825, 115370, 113261, 110852, 108334, 106070, 104651]
52664A04651m28k71j387k949l555k651j205o53j300k064j925j132o10o21n19K21
52648H3602J213J613J070O8o53q74q95q56m40M56J115P33l54r07l63N88J126J296
52630H7538J487J661J689J741J782J247j18j522k042j857j801j986j802j194q76
52615H3947j139j326q31m3K38r1m17l00P4K80K25J57K54L89M18M70P74J230J477
52596H5786J360R92M33l07r03q92l75%k7R1Q49J898K557K672K512K211J806J546
52578A02209J645J854J749J308Q60O44P07J012J326J332J099J137J672K237K364
52563A23155K220K164K072J685J196R46Q60P32P50J091J327R48K75J14O16J162
52547A41313J283J112Q90O90N94O49O28K84j34j96M8K18K98N73R42R15M07j52
$$ y = [104651, 104223, 103952, 102565, 99616, 96061, 93410, 92205, 91552, 90252, 88188, 86263, 85131, 84521, 83900, 83381, 83602, 84815, 86428, 87498, 87566, 86913, 86039, 85144, 84288, 83848, 84304, 85419, 86152, 85798, 84891, 84528, 85116, 86242, 87538, 89025, 90686, 92375, 94116, 95898, 97145, 97027, 95505, 93463, 91606, 89805, 87819, 86017, 84823, 83947, 82808, 81482, 80651, 80608, 80846, 80755, 80338, 80038, 80112, 80392, 80617, 80774, 81028, 81417, 81835, 82305, 83079, 84309, 85786, 87146, 88138, 88571, 88264, 87361, 86469, 86094, 86094, 86067, 86158, 87007, 88905, 91462, 94134, 96646, 98857, 100663, 102209, 103854, 105708, 107457, 108765, 109625, 110269, 110976, 111988, 113314, 114646, 115745, 116882, 118554, 120791, 123155, 125375, 127539, 129611, 131296, 132492, 133438, 134298, 135030, 135780, 136871, 138198, 139146, 139421, 139535, 140151, 141313, 142596, 143708, 144598, 145288, 145882, 146531, 147159, 147443, 147309, 147113, 147161, 147379, 147677, 148250, 149192, 150107, 150514, 150362]
52529A50362n26r21j326j182j28J344K251J995Q04n36j256j084l52L69O20K01
52513A50635p19j516j529q08n3K75L51L11q2p61j117r96j154j911k189r79R15
52496A38673J848J643J531J992K104J325M50M21J099J749J880J340L37l58p5O69
52480A56628O67j91o67k4R09J118Q50R02J224J113L01q36j723j763o80Q14J312
52463A59954L75p10n60M97J064P54M73Q54J374J304P25K31P3Jk38n06m18J93J013
52444A66453J559J715J724J717J562J213Q08L89q6l95k48M8k30j097j542q14N25
52427A73301J346J307Q37K22n95j447j895j783j410j117j034j120j171r41m89
52412A64011k56m67p72p29m12j29J37N01P13N23K81N12J011J086O70M61Q20J201
$$ y = [150362, 149836, 148915, 147589, 146407, 146279, 147623, 149874, 151869, 152673, 152137, 150881, 149797, 149445, 149814, 150434, 150635, 149916, 148400, 146871, 146063, 146010, 146285, 146636, 146947, 146865, 146104, 144987, 143991, 142837, 140926, 138737, 137758, 138673, 140521, 142164, 143695, 145687, 147791, 149116, 149566, 149987, 151086, 152835, 154715, 156055, 156392, 156034, 155959, 156628, 157295, 157104, 156437, 156413, 157322, 158440, 159290, 160192, 161416, 162529, 162830, 161994, 160271, 158508, 157828, 158642, 159954, 160329, 159619, 159059, 159556, 160620, 161374, 161847, 162701, 164075, 165379, 166104, 166335, 166408, 166409, 166171, 165665, 165247, 165440, 166453, 168012, 169727, 171451, 173168, 174730, 175943, 176751, 177140, 177054, 176659, 176411, 176459, 176229, 175132, 173590, 172776, 173301, 174647, 175954, 176791, 177013, 176418, 174971, 173076, 171293, 169883, 168766, 167732, 166612, 165441, 164500, 164011, 163755, 163288, 162516, 161787, 161375, 161246, 161383, 161884, 162597, 163120, 163401, 163913, 164924, 166010, 166680, 167141, 167961, 169162]
52394A69162J012M35pj98l32l88j58L35Q80J395J898K229K167J814J538J476J347
52377A84605Q85K82kK32P45J143J228J088J013J319K064K851L095K661K082K007
52361B07298K478L010L241L208L039K711K294K034K009J912J488R95R23J321J773
52346B39734K069K484L203L760L471K356J282J003J377J752J886K093K504K706
52332B71680K344J767J657K149K653K590K092J810K155K874L362L281K821K323
52318C05558J987K046K859M406N844O228N705N405N952O791P238P474P945Q526
52304C83964Q988R713J1050J2341J2688J2472J3027J4675J6176J6493J6194J6555
52292E44336J7923J9528K0462K0424J9782J9317J9606K0402K0906K0743K0308
$$ y = [169162, 170174, 170609, 170602, 170404, 170072, 169684, 169526, 169861, 170741, 172136, 174034, 176263, 178430, 180244, 181782, 183258, 184605, 185490, 185772, 185770, 186002, 186747, 187890, 189118, 190206, 191219, 192538, 194602, 197453, 200548, 203209, 205291, 207298, 209776, 212786, 216027, 219235, 222274, 224985, 227279, 229313, 231322, 233234, 234722, 235717, 236640, 237961, 239734, 241803, 244287, 247490, 251250, 254721, 257077, 258359, 259362, 260739, 262491, 264377, 266470, 268974, 271680, 274024, 275791, 277448, 279597, 282250, 284840, 286932, 288742, 290897, 293771, 297133, 300414, 303235, 305558, 307545, 309591, 312450, 316856, 322700, 328928, 334633, 340038, 345990, 352781, 360019, 367493, 375438, 383964, 392952, 402665, 413715, 426056, 438744, 451216, 464243, 478918, 495094, 511587, 527781, 544336, 562259, 581787, 602249, 622673, 642455, 661772, 681378, 701780, 722686, 743429, 763737]
52281G63737J9996J9661J9091J8464J7913J7079J5623J3867J2432J1408J0382
52270I39653R122P794O552N295L859K234N58r35j998k655l261m152n189n894n970
52255I45013n567m969m259l423k709k575l063l422k739r73J070K813M397O009
52241I25603P363Q353R588J1475J3342J4249J4361J4614J5206J5515J5330J5187
52229A080186J5275J5025J4084J2804J1481R934Q127O465N066L551J795K09j054
52216A182948k298l516m363n156o764r042j0579j0794j0968j2265j3872j4401
52204A078930j4094j4105j4376j3887j2644j1726j1389j0711r321q099p728p709
52192I43141p331o635n960n262m451l684l015k293j681j661k183k508k169j538
$$ y = [763737, 783733, 803394, 822485, 840949, 858862, 875941, 891564, 905431, 917863, 929271, 939653, 948775, 956569, 963121, 968416, 972275, 974509, 975067, 974132, 972134, 969479, 966218, 962066, 956877, 950983, 945013, 939446, 934477, 930218, 926795, 924086, 921511, 918448, 915026, 912287, 911314, 912384, 915197, 919594, 925603, 932966, 941319, 950907, 962382, 975724, 989973, 1004334, 1018948, 1034154, 1049669, 1064999, 1080186, 1095461, 1110486, 1124570, 1137374, 1148855, 1158789, 1166916, 1173381, 1178447, 1181998, 1183793, 1184002, 1182948, 1180650, 1177134, 1172771, 1167615, 1160851, 1151809, 1141230, 1130436, 1119468, 1107203, 1093331, 1078930, 1064836, 1050731, 1036355, 1022468, 1009824, 998098, 986709, 975998, 966677, 958578, 950850, 943141, 935810, 929175, 923215, 917953, 913502, 909818, 906803, 904510, 902829, 901168, 898985, 896477, 894308, 892770]
52178H92770j098q13o30r17j780k491k288j484j123j568k133k169j966k204k900
52163H67206l344l080k489k155k037j772j598k183l365l945l247k186k016k555
52149H31234k659k142k054k998m257m981n220n320n111m437l854l988m526m594
52135G75093l974l267k979l044l234l496l627l244k388j809k210l319m087l882
52121G30533l109k611k653k798k619k121j492q05j54K84O18J392K975M879O118
52106G28437O331O227O811Q387J0451J2325J3737J4824J5873J7068J8466K0000
52094H78937K1420K2469K3208K4110K5513K6980K7653K7220K6255K5418K4727
52083A153910K3875K2808K1577J9970J7798J5449J3550J2129J0505Q214N648L555
$$ y = [892770, 891672, 890859, 890229, 889312, 887532, 885041, 882753, 881269, 880146, 878578, 876445, 874276, 872310, 870106, 867206, 863862, 860782, 858293, 856138, 854101, 852329, 850731, 848548, 845183, 841238, 837991, 835805, 833789, 831234, 828575, 826433, 824379, 821381, 817124, 812143, 806923, 801603, 796492, 792055, 788201, 784213, 779687, 775093, 771119, 767852, 764873, 761829, 758595, 755099, 751472, 748228, 745840, 744031, 741821, 738502, 734415, 730533, 727424, 724813, 722160, 719362, 716743, 714622, 713130, 712325, 712171, 712455, 713073, 714465, 717440, 722319, 728437, 734768, 740995, 747806, 756193, 766644, 778969, 792706, 807530, 823403, 840471, 858937, 878937, 900357, 922826, 946034, 970144, 995657, 1022637, 1050290, 1077510, 1103765, 1129183, 1153910, 1177785, 1200593, 1222170, 1242140, 1259938, 1275387, 1288937, 1301066, 1311571, 1319785, 1325433, 1328988]
52071A328988K144R02p41k786m780o459q074r893j1631j2625j2582j1815j0786
52058A239862r896r600j0108j0778j0462q917p277o644o670o139m545k427m31
52045A145968J254K575L445L975M483N196O194P474Q748R434R315Q963R027R327
52031A235378R212Q605Q007P614P102O294N350M248K790J172r0j006k220m044
52017A288412n893p047p523p849q385r162j0185j1488j3019j4611j6089j7382
52005A159779j8595j9820k0844k1255k1127k1206k2102k3546k4833k5668k6077
51994I14706k5908k5171k4588k4921k5840k6229k5656k4696k3832k2951k2037
51983F42877k1457k1178k0640j9717j9013j8825j8642j8080j7473j6949j5812
$$ y = [1328988, 1331132, 1332034, 1331293, 1328507, 1323727, 1317268, 1309194, 1299301, 1287670, 1275045, 1262463, 1250648, 1239862, 1229966, 1220366, 1210258, 1199480, 1189018, 1180101, 1172824, 1166180, 1159510, 1153371, 1148826, 1146399, 1145968, 1147222, 1149797, 1153242, 1157217, 1161700, 1166896, 1173090, 1180564, 1189312, 1198746, 1208061, 1217024, 1226051, 1235378, 1244590, 1253195, 1261202, 1268816, 1275918, 1282212, 1287562, 1291810, 1294600, 1295772, 1295682, 1294676, 1292456, 1288412, 1282519, 1275472, 1267949, 1260100, 1251715, 1242553, 1232368, 1220880, 1207861, 1193250, 1177161, 1159779, 1141184, 1121364, 1100520, 1079265, 1058138, 1036932, 1014830, 991284, 966451, 940783, 914706, 888798, 863627, 839039, 814118, 788278, 762049, 736393, 711697, 687865, 664914, 642877, 621420, 600242, 579602, 559885, 540872, 522047, 503405, 485325, 467852, 450903, 435091]
51972D35091j3692j1577j0733j0984j0958r858q213o920o337o339o659o939o830
51959C19052o283n587n084m937n024m970m510l894l701m033m226l642k453j398
51945B59310r75j169j773k549l155l262k748j820r54o80j145j889k320k384k463
51930B30024k693k863k972l223l392k943j917j022n50l3O74R05L50j52J41O09
51914B10943K38p30j234j104j124j575j859j685j538j727j883j746j617j699j614
51899A90046j074m26j88l89p36j112j592k236k971l494l328k323j112n00m54k76
51883A67835J96L16k50q98j047r33r13o79J33J036J239Q08M55L63J36j82O3R91
51865A68669J738J563Q72N81R07J319J417J394J562J873J974J640J073P67R81
$$ y = [435091, 421399, 409822, 399089, 388105, 377147, 367289, 359076, 352156, 345819, 339480, 332821, 325882, 319052, 312769, 307182, 302098, 297161, 292137, 287167, 282657, 278763, 275062, 271029, 266803, 263161, 260708, 259310, 258335, 257166, 255393, 252844, 249689, 246427, 243679, 241859, 240905, 240225, 239080, 237191, 234871, 232487, 230024, 227331, 224468, 221496, 218273, 214881, 211938, 210021, 208999, 208449, 208416, 209090, 209995, 210345, 210193, 210334, 210943, 211181, 210451, 209217, 208113, 206989, 205414, 203555, 201870, 200332, 198605, 196722, 194976, 193359, 191660, 190046, 188972, 188546, 188358, 187969, 187233, 186121, 184529, 182293, 179322, 175828, 172500, 170177, 169065, 168565, 168111, 167835, 168031, 168347, 168097, 167199, 166152, 165219, 164306, 163627, 163760, 164796, 166035, 166843, 167298, 167661, 167797, 167615, 167678, 168669, 170407, 171970, 172842, 173423, 174330, 175649, 177066, 178460, 180022, 181895, 183869, 185509, 186582, 187349, 188330]
51850A88330J340J281Q85Q70J470J788Q60r43k179j968q06L11R30J112R61O01
51834A94843L43M48Q58J336J639J472O45m30q09kJ325K020J603N12m43n55M31
51817B05236J868K448J532Qq29r62j343k125k266j174L16J027P82J58m07o69l17
51800B03283O05J339J174L26m04o78q01j020j190j121p96k03O64J620K286K374
51784B07458J830R07J73J41O21P33k6r43q58L69J596J725Q38q5l00J12N44N40
51766B15375K20J15O20J587K475K866K773K537K453K486K414K300K599L556M680
51751B49056N220N119M895M632L797K312J051O80O17o3j143j561r81j90J69L17
51735B73927N64O38K51k58m13l60m61m79K16J543K514K367J498Q53P46O53J96
$$ y = [188330, 189670, 190951, 191836, 192706, 194176, 195964, 196824, 195881, 193702, 191734, 190928, 191239, 192169, 193281, 194242, 194843, 195186, 195634, 196492, 197828, 199467, 200939, 201584, 201154, 200345, 200343, 201668, 203688, 205291, 205803, 205360, 204805, 205236, 207104, 209552, 211084, 211092, 210263, 209301, 207958, 205833, 203567, 202393, 202709, 203736, 204518, 204676, 204269, 203600, 203283, 203888, 205227, 206401, 206727, 206323, 205645, 204844, 203824, 202634, 201513, 200717, 200514, 201178, 202798, 205084, 207458, 209288, 210195, 210368, 210509, 211130, 211863, 211837, 210894, 210036, 210405, 212001, 213726, 214564, 214479, 214179, 214291, 214835, 215375, 215595, 215710, 216330, 217917, 220392, 223258, 226031, 228568, 231021, 233507, 235921, 238221, 240820, 244376, 249056, 254276, 259395, 264290, 268922, 272719, 275031, 276082, 276762, 277379, 277316, 276173, 274612, 273631, 273441, 273610, 273927, 274491, 275129, 275380, 275122, 274709, 274349, 273888, 273409, 273625, 275168, 277682, 280049, 281547, 282400, 283146, 283799, 283995]
51718B83995k46pJ015K223K875K569J396j79j599k601l266l578l228k122q63l17
51702B76067p47j708k706l491l831l562k959k558k400j949r46J11O02N24L56N06
51686B51309J114K057K980L648M361N603P143P964P336N517L245J142k06l67K91
51671C03137O62J84n31p87q53j269j749j724j458j665k213k194j257n5O96R35
51655B89859R53Q65M87n70k521m804o281o494o287o573p002o649n541m484l704
51640B31254k809j918j620j779j641j215j365k178k532j788q12o13r56j078r70
51625B07980j044j141p88n3N25O60L91j80p60p94j12O56P91L66qK1M21J105J840
51606B09876K106J549M77m43p24j45J218K659L060K076Q27P17J867L195L880M015
$$ y = [283995, 283749, 283742, 284757, 286980, 289855, 292424, 293820, 293641, 292042, 289441, 286175, 282597, 279369, 277247, 276384, 276067, 275320, 273612, 270906, 267415, 263584, 260022, 257063, 254505, 252105, 250156, 249210, 249321, 249923, 250447, 250803, 251309, 252423, 254480, 257460, 261108, 265469, 271072, 278215, 286179, 293515, 299032, 302277, 303419, 303213, 302846, 303137, 303799, 303983, 303452, 302665, 301812, 300543, 298794, 297070, 295612, 293947, 291734, 289540, 288283, 288228, 288924, 289859, 290812, 291677, 292164, 291594, 289073, 284269, 277988, 271494, 265207, 258634, 251632, 244983, 239442, 234958, 231254, 228445, 226527, 224907, 223128, 221487, 220272, 218907, 216729, 214197, 212409, 211597, 210984, 210028, 208950, 207980, 206936, 205795, 205007, 204954, 205479, 206139, 206530, 206350, 205590, 204796, 204684, 205340, 206131, 206497, 206489, 206510, 206931, 208036, 209876, 211982, 213531, 214008, 213565, 212841, 212696, 213914, 216573, 219633, 221709, 222536, 223253, 225120, 228315, 232195, 236210]
51590B36210L987L905L810L872M128M348M311M026L665L356L064K518J475J95
51576B82870o43o80l68l17n63p72r27j232j510j230k23R89J668J516Q72M88Q99
51559B80837J861K566K641K572K872L237L023K310J868K185K964L555L501K760
51545C18752J768J131R67P37N3o91r45q67r37j093r84p33n76j0J520L218L434
51528C24744J876J25n05n17j005j853k159j802j501j677k045k274k292k080j667
51513C05368j325j333j611k024k663l547m282m479m290m003l446k408j368j081
51499B67508j502j762j307n22j25m15j165j823j787r39P2M62K43N8K53O70J256
51482B59175K130K976L154K726K630L413M386M593M157M041M722N687O190O014
$$ y = [236210, 240197, 244102, 247912, 251784, 255912, 260260, 264571, 268597, 272262, 275618, 278682, 281200, 282675, 282870, 282227, 281547, 281179, 280862, 280299, 279527, 278600, 277368, 275858, 274628, 274405, 275394, 277062, 278578, 279450, 279938, 280837, 282698, 285264, 287905, 290477, 293349, 296586, 299609, 301919, 303787, 305972, 308936, 312491, 315992, 318752, 320520, 321651, 322618, 323355, 323408, 322717, 321772, 320905, 319968, 318875, 317891, 317158, 316582, 316572, 318092, 321310, 324744, 326620, 326745, 326240, 325723, 324718, 322865, 320706, 318904, 317403, 315726, 313681, 311407, 309115, 307035, 305368, 304043, 302710, 301099, 299075, 296412, 292865, 288583, 284104, 279814, 275811, 272365, 269957, 268589, 267508, 266006, 264244, 262937, 262415, 262290, 261875, 260710, 258887, 257100, 256161, 256233, 256695, 256938, 256996, 257249, 257919, 259175, 261305, 264281, 267435, 270161, 272791, 276204, 280590, 285183, 289340, 293381, 298103, 303790, 309980, 315994]
51468C15994N505N028M609M037L386L201L807M585M555L704L016K982K903K087
51454C69399R74L44Q9l41q03p30k77j18k20J31R31J127M2j676k986l668m084m340
51436C53794m289m140m379n116n851n992n432m620m055l740l222k420k012k637
51422B95889l843m459l971k882j730n42N33R30N14J22O04J756K731L145L188K983
51406B94968K538K120K039K059J597N30o51j528k208k973l808m441m704m741m898
51391B75899n326n742n768n520n537n938o142n682m946m598m625m429l741k878
51377B05027k177j717j533j644j772j463o25K48N42J6j085k242k987l262l381
51362A81945l549l560l167k477j765j154p63q49j356j675j390r76j117j524j205
$$ y = [315994, 321499, 326527, 331136, 335173, 338559, 341760, 345567, 350152, 354707, 358411, 361427, 364409, 367312, 369399, 370373, 370717, 370806, 370465, 369662, 368932, 368655, 368537, 368317, 368448, 369379, 370506, 370548, 368872, 365886, 362218, 358134, 353794, 349505, 345365, 340986, 335870, 330019, 324027, 318595, 313975, 309920, 306180, 302958, 300538, 298526, 295889, 292046, 287587, 283616, 280734, 279004, 278462, 278995, 279925, 280439, 280561, 281165, 282921, 285652, 288797, 291985, 294968, 297506, 299626, 301665, 303724, 305321, 305851, 305200, 303672, 301464, 298491, 294683, 290242, 285538, 280797, 275899, 270573, 264831, 259063, 253543, 248006, 242068, 235926, 230244, 225298, 220700, 216075, 211646, 207905, 205027, 202850, 201133, 199600, 197956, 196184, 194721, 194096, 194344, 194886, 194902, 193817, 191575, 188588, 185326, 181945, 178396, 174836, 171669, 169192, 167427, 166273, 165510, 164661, 163305, 161630, 160240, 159264, 158147, 156623, 155418]
51347A55418R0J403J783J285O19L02M10P64J054J080R39Q03O28M63Q11J986L294
51330A73132L655L092K719L085L487L351L279L990M985N164M299K990J611J66
51316B19005j013j410j182j107j579k289k961l691m395m675m484m375m662m841
51302A76341m302l171k085j425j247j617k397k882k384j205m79p71j382j364p77
51287A48853l92m91o12m02p7J37M42R66J294R21K0p08q25n21k02r9l03q13j396
51268A45792j631j219l01N80Q58M31k18m91l39k22l66m00kN24O40K63l21j008
51250A42570j764k189j830r10j91k4p9o0j41m59p55p67o32n78n50l85o1L47P44
51231A32286R27P73N22M95N06J16l73j1J339K382J946O23j5M53R13M06o22j098
$$ y = [155418, 155508, 156911, 158694, 159979, 160598, 160900, 161310, 162074, 163128, 164208, 165147, 165950, 166578, 167041, 167852, 169838, 173132, 176787, 179879, 182598, 185683, 189170, 192521, 195800, 199790, 204775, 209939, 214238, 217228, 218839, 219005, 217992, 216582, 215400, 214293, 212714, 210425, 207464, 203773, 199378, 194703, 190219, 185844, 181182, 176341, 172039, 168868, 166783, 165358, 164111, 162494, 160097, 157215, 154831, 153626, 153147, 152376, 150994, 149630, 148853, 148461, 147970, 147358, 146956, 146879, 147016, 147458, 148424, 149718, 150639, 150659, 149951, 149126, 148605, 148403, 148304, 148001, 147188, 145792, 144161, 142942, 142641, 143221, 144079, 144510, 144292, 143801, 143462, 143240, 142874, 142474, 142472, 142996, 143636, 143899, 143578, 142570, 140806, 138617, 136787, 135877, 135686, 135662, 135583, 135523, 135382, 134923, 134168, 133401, 132769, 132191, 131641, 131256, 131195, 131542, 132286, 133213, 133986, 134508, 135003, 135509, 135625, 135252, 135241, 136580, 138962, 140908, 141531, 141516, 141969, 142882, 143288, 142666, 141568]
51213A41568o48K53R37J003L78n64j045m86Q23J836J730P02k80m70k9L22J78j50
51195A46058j12L65Q47R83Q87Q43Q29N74J44J5M26Q27M82m64r93m26P73J642J750
51176A55450J305O08j71q30j243j482j608j492j155r94j276j651j597j129o26
51161A42109k52o6l32j051j495j018j48J8o27j176j223j250j360q70L68J325J198
51144A34150N49L38N55O84Q13J335J940J889J095K32k28l63l69k79j63j22j52
51127A41904k34m38o74o81m84m93q32j017p29m08o19j207j674j898j920j427k83
51110A26886Q26J039N52L43Q05J319J283Q24L93K29L79P81J219J440J379J084
51094A40781N84J68L94J390K350K416J809J490J789K067J794J209Q03O13L54j38
$$ y = [141568, 140920, 141173, 142110, 143113, 143491, 142927, 141882, 141396, 142219, 144055, 145785, 146487, 146207, 145737, 145708, 146030, 146208, 146058, 145946, 146311, 147158, 148141, 149028, 149871, 150700, 151274, 151418, 151433, 151859, 152686, 153168, 152704, 151711, 151285, 152058, 153700, 155450, 156755, 157363, 157192, 156362, 155119, 153637, 152029, 150537, 149382, 148388, 147112, 145461, 143864, 142735, 142109, 141857, 141791, 141459, 140408, 138913, 137895, 137747, 137765, 137138, 135962, 134739, 133489, 132129, 131259, 131627, 132952, 134150, 134699, 135037, 135592, 136276, 137089, 138424, 140364, 142253, 143348, 143580, 143352, 142989, 142620, 142341, 142178, 142056, 141904, 141670, 141232, 140558, 139877, 139393, 138900, 138068, 137051, 136322, 135914, 135295, 134088, 132414, 130516, 128596, 127169, 126886, 127712, 128751, 129303, 129646, 130451, 131770, 133053, 133877, 134270, 134499, 134878, 135659, 136878, 138318, 139697, 140781, 141365, 141533, 141927, 143317, 145667, 148083, 149892, 151382, 153171, 155238, 157032, 158241, 159044, 159657, 160011, 159873]
51078A59873p64j227j225p80l02p4J33O11J153J426J530J740J851J464P58L42
51062A66509M58Q72J446K083K300J649N75P5L66P73R09J160J673J818J211M68
51046A84345M08R69J456J565J499J447J373J254J156J061Q61M92L6k86k79n8j4
51029A97285k55l94j78j5k75m74K0P52O54k55q15n60m07r84j412o57P85J576J406
51010A95797J071J060J057Q02N91P16J116J714K568L507M072M056L813L864M349
50995B30153N021N557N796N781N664N579N609N895O691Q117R870J1257J1716J1406
50981C34112J1152J1627J2620J3454J4121J5434J7811K0535K2799K4920K7734
50970E26319L1111L4270L7340M1404M6639N1686N5432N8512O2247O6739P0892
$$ y = [159873, 159109, 157882, 156657, 155877, 155575, 155501, 155634, 156245, 157398, 158824, 160354, 162094, 163945, 165409, 166167, 166509, 166967, 167839, 169285, 171368, 173668, 175317, 175892, 175967, 176333, 177106, 178015, 179175, 180848, 182666, 183877, 184345, 184753, 185722, 187178, 188743, 190242, 191689, 193062, 194316, 195472, 196533, 197394, 197886, 197922, 197636, 197357, 197299, 197285, 197030, 196636, 196458, 196443, 196168, 195694, 195714, 196466, 197120, 196865, 196050, 195490, 195083, 194099, 192687, 192030, 192815, 194391, 195797, 196868, 197928, 198985, 199787, 200378, 201094, 202210, 203924, 206492, 209999, 214071, 218127, 221940, 225804, 230153, 235174, 240731, 246527, 252308, 257972, 263551, 269160, 275055, 281746, 289863, 299733, 310990, 322706, 334112, 345264, 356891, 369511, 382965, 397086, 412520, 430331, 450866, 473665, 498585, 526319, 557430, 591700, 629040, 670444, 717083, 768769, 824201, 882713, 944960, 1011699, 1082591]
50959A082591P3845P5609P6527P6748P6125P4141P0181O4217N6990M9115M0514
50948A816603L1159K1858J3633O588N4o396j2571j7993k1950k3598k2771k0599
50936A764017j8572j7116j5744j4459j4070j5141j7372k0211k3373k6616k9778
50925A551565l3237l7616m2745m7581n1457n4670n7427n9050n8934n7678n6312
50914I94858n4803n2267m8478m4255m0236l6278l2345k9090k6854k4746k1650
50903E83856j7889j4982j3639j2844j1316r140p351o321n407m091k712j737j009
50890D75418p8J013J825K232K524K870L060K970K941L364M115M699M915N112N607
50875E22587O203O584O979Q000R740J1487J2621J3391J4458J5960J7477J8785
$$ y = [1082591, 1156436, 1232045, 1308572, 1385320, 1461445, 1535586, 1605767, 1669984, 1726974, 1776089, 1816603, 1847762, 1869620, 1883253, 1889841, 1889895, 1883499, 1870928, 1852935, 1830985, 1807387, 1784616, 1764017, 1745445, 1728329, 1712585, 1698126, 1684056, 1668915, 1651543, 1631332, 1607959, 1581343, 1551565, 1518328, 1480712, 1437967, 1390386, 1338929, 1284259, 1226832, 1167782, 1108848, 1051170, 994858, 940055, 887788, 839310, 795055, 754819, 718541, 686196, 657106, 630252, 605506, 583856, 565967, 550985, 537346, 524502, 513186, 504046, 496695, 490374, 484967, 480876, 478164, 476427, 475418, 475340, 476353, 478178, 480410, 482934, 485804, 488864, 491834, 494775, 498139, 502254, 506953, 511868, 516980, 522587, 528790, 535374, 542353, 550353, 560093, 571580, 584201, 597592, 612050, 628010, 645487, 664272]
50863F64272K0109K1737K3795K6469K9957L4095L8439M2852M7658N3169N9509
50852A062061O6894P5596Q5401R5529J05449J15335J25542J35920J45987J55355
50842B169069J63615J70133J74375J76259J75724J72053J64060J51024J33289
50833C649601J12008Q8464O3633L8301J3496r313k8824m4615n6852o5263o8983
50822C691653o7692o2406n4764m5868l6329k7058j9468j4896j4231j7823k5392
50811C305726l5969m8323o1524p4978q8133j00479j11690j21495j29388j34641
50801B399106j36617j35073j30469j23890j16317j07863r8177q7640p7430o8126
50791A317504n8980m9174l9112k9786k1400j3567o399m18M459Q841J2716J5345
$$ y = [664272, 684381, 706118, 729913, 756382, 786339, 820434, 858873, 901725, 949383, 1002552, 1062061, 1128955, 1204551, 1289952, 1385481, 1490930, 1606265, 1731807, 1867727, 2013714, 2169069, 2332684, 2502817, 2677192, 2853451, 3029175, 3201228, 3365288, 3516312, 3649601, 3761609, 3850073, 3913706, 3952007, 3965503, 3956190, 3927366, 3882751, 3825899, 3760636, 3691653, 3623961, 3561555, 3506791, 3460923, 3424594, 3397536, 3378068, 3363172, 3348941, 3331118, 3305726, 3269757, 3221434, 3159910, 3084932, 2996799, 2896320, 2784630, 2663135, 2533747, 2399106, 2262489, 2127416, 1996947, 1873057, 1756740, 1648877, 1550700, 1463060, 1385630, 1317504, 1258524, 1209350, 1170238, 1140452, 1119052, 1105485, 1099086, 1098668, 1103127, 1111968, 1124684, 1140029]
50779A140029J6356J6143J5033J2871R727O182K604j226n329q968j1353j2612
50767A179457j3604j5031j6921j8720j9706j9680j9327j9573k0382k0720j9761
50756I76032j7719j5209j2429r377o394l907j824L20K736N214P471R417J1162
50743I45493J2949J4974J7231J9753K3007K7541L3129L8831M4168M9789N6461
50732A283326O3989P1705P9593Q8090R6831J04464J09876J12976J14101J13219
50722B238170J10067J04601R6916Q6976P4753O0546M4794K7708R385r669k8279
50711B815968m4873n7970o6579p0534p0507o7525o2291n5056m6212l6805k8132
50700B209484k0893j5050j0700q665r866j4302k1047k9242l8597m8746n8612o6843
$$ y = [1140029, 1156385, 1172528, 1187561, 1200432, 1210159, 1216341, 1218945, 1217719, 1212390, 1203422, 1192069, 1179457, 1165853, 1150822, 1133901, 1115181, 1095475, 1075795, 1056468, 1036895, 1016513, 995793, 976032, 958313, 943104, 930675, 921298, 914904, 910997, 909173, 909493, 912229, 917443, 924914, 934331, 945493, 958442, 973416, 990647, 1010400, 1033407, 1060948, 1094077, 1132908, 1177076, 1226865, 1283326, 1347315, 1419020, 1498613, 1586703, 1683534, 1787998, 1897874, 2010850, 2124951, 2238170, 2348237, 2452838, 2549754, 2636730, 2711483, 2772029, 2816823, 2844531, 2853916, 2844247, 2815968, 2771095, 2713125, 2646546, 2576012, 2505505, 2437980, 2375689, 2320633, 2274421, 2237616, 2209484, 2188591, 2173541, 2162841, 2154176, 2144310, 2130008, 2108961, 2079719, 2041122, 1992376, 1933764, 1866921]
50688A866921p2712p6299p7903p7622p5502p1696o6419n9911n2582m5049l7785
50677A153441l0834k3857j6551q909j152O568J4312K2148K9850L7031M3576M9733
50665A275356N5552O0376O3207O3594O1909N8778N4465M8971M2492L5598K9016
50654A849314K3328J8708J4800J0989O948K910p13l835o622r022j0657j1264j0947
50641A873937r942q351o208l614n29L353Q253J3769J8942K2975K5802K7753K8778
50628A994918K8292K5960K2370J8537J4789J0683O153K133m36j796k825l544l015
50615B112219o91K987P509J2831J8531K3280K6011K7008K7092K6183K3542J9086
50603B325588J3553P494R61n922j2999k0627k9282l8506m7109n4606o1584o8401
$$ y = [1866921, 1794209, 1717910, 1640007, 1562385, 1486883, 1415187, 1348768, 1288857, 1236275, 1191226, 1153441, 1122607, 1098750, 1082199, 1073290, 1072138, 1078706, 1093018, 1115166, 1145016, 1182047, 1225623, 1275356, 1330908, 1391284, 1454491, 1518085, 1579994, 1638772, 1693237, 1742208, 1784700, 1820298, 1849314, 1872642, 1891350, 1906150, 1917139, 1924087, 1926997, 1926284, 1922449, 1915827, 1906805, 1896148, 1884884, 1873937, 1863995, 1855644, 1849436, 1845822, 1845293, 1848646, 1856899, 1870668, 1889610, 1912585, 1938387, 1966140, 1994918, 2023210, 2049170, 2071540, 2090077, 2104866, 2115549, 2121702, 2123835, 2123399, 2121603, 2118778, 2115234, 2112219, 2111528, 2114515, 2122024, 2134855, 2153386, 2176666, 2202677, 2229685, 2256777, 2282960, 2306502, 2325588, 2339141, 2346635, 2347596, 2341674, 2328675, 2308048, 2278766, 2240260, 2193151, 2138545, 2076961, 2008560]
50591B008560p4322p8424q0606q1255q0490p8272p4811p0448o5536o0601n6118
50580A207677n1847m7064m1751l6855l3004k9694k6271k2922j9993j7066j3558
50569H67652r735o248l084J51L329O053Q561J1378J4340J6789J8723K0806K3297
50556I72012K5853K8439L1569L5464L9682M3835M7983N2202N6361O0388O4132
50545A457920O6835O7549O6281O4038O1441N7983N3094M7273M1615L6736L2761
50534B053526L0002K8915K9364L0498L1482L2170L2944L4114L5632L7499M0243
50523B416389M4610N0637N7289O3332O8329P2495P5860P8057P8677P7289P3287
50512C156251O6399N7273M6985L5817K3181Q826o515k1863l6770n0962o3787p4449
$$ y = [2008560, 1934238, 1855814, 1775208, 1693953, 1613463, 1535191, 1460380, 1389932, 1324396, 1263795, 1207677, 1155830, 1108766, 1067015, 1030160, 997156, 967462, 941191, 918269, 898276, 881210, 867652, 857917, 851669, 848585, 848736, 852065, 858118, 866679, 878057, 892397, 909186, 927909, 948715, 972012, 997865, 1026304, 1057873, 1093337, 1133019, 1176854, 1224837, 1277039, 1333400, 1393788, 1457920, 1524755, 1592304, 1658585, 1722623, 1784064, 1842047, 1895141, 1942414, 1984029, 2020765, 2053526, 2083528, 2112443, 2141807, 2172305, 2203787, 2235957, 2268901, 2303015, 2338647, 2376146, 2416389, 2460999, 2511636, 2568925, 2632257, 2700586, 2773081, 2848941, 2926998, 3005675, 3082964, 3156251, 3222650, 3279923, 3326908, 3362725, 3385906, 3394732, 3388217, 3366354, 3329584, 3278622, 3214835, 3140386]
50500C140386q2575q8106r0773q9952q5074p6269o4637n1762l8659k5329j1570
50489B435680J977J4048K3766L0887L5265L6706L5249L0857K2844J0374o228k5312
50477B646113m5036o4005q0802r4015j03247j09266j12684j13174j10524j05665
50467A707695r9927r3815q7194q0202p3217o6228n9011n1769m5043l9054l3577
50456I78658k8349k3283j8466j4218j0846q109n306k150Q76L394N760Q345J0747
50443H97053J2473J3912J5858J8315K0569K2257K3669K5091K6574K8266L0253
50432A134290L1979L2632L2217L1729L1934L2539L2756L2266L1379L0557K9998
50421A484276K9523K8772K7622K6385K5401K4577K3674K2886K2791K3666K5263
$$ y = [3140386, 3057811, 2969705, 2878932, 2788980, 2703906, 2627637, 2563000, 2511238, 2472579, 2447250, 2435680, 2437657, 2451705, 2475471, 2506358, 2541623, 2578329, 2613578, 2644435, 2667279, 2677653, 2671425, 2646113, 2601077, 2537072, 2456270, 2362255, 2259008, 2149742, 2037058, 1923884, 1813360, 1707695, 1607768, 1513953, 1426759, 1346557, 1273340, 1207112, 1148101, 1096332, 1051289, 1012235, 978658, 950309, 927026, 908560, 894342, 883496, 875387, 870081, 867931, 868807, 872201, 877961, 886306, 897053, 909526, 923438, 939296, 957611, 978180, 1000437, 1024106, 1049197, 1075771, 1104037, 1134290, 1166269, 1198901, 1231118, 1262847, 1294781, 1327320, 1360076, 1392342, 1423721, 1454278, 1484276, 1513799, 1542571, 1570193, 1596578, 1621979, 1646556, 1670230, 1693116, 1715907, 1739573, 1764836]
50410A764836K7242K9461L1741L3767L5386L6715L7843L8549L8437L7200L4714
50399B145891L1102K6742K2011J6976J1420N139j935r860j8709k8341l8270m7742
50387B114424n6051o2860o8323p2712p5939p7525p7077p4467o9667o2943n5249
50376A361611m7728m0452l2275k2476j1943k173O297J3531J8958K1683K1930K0885
50364A307848J8863J4800Q022n26r364j7928k6183l3461l8700m1661m3067m3592
50352A095051m3227m1713l9110l5924l2895l0554k8744k6746k4155k1449j9324
50341G51210j7700j5839j3409j0895q851p266n863m597l506k389r17R67L088N338
50327F69371P672R872J1695J3268J4929J6548J7412J7127J6379J6230J6849J7474
$$ y = [1764836, 1792078, 1821539, 1853280, 1887047, 1922433, 1959148, 1996991, 2035540, 2073977, 2111177, 2145891, 2176993, 2203735, 2225746, 2242722, 2254142, 2259281, 2257346, 2247486, 2228777, 2200436, 2162166, 2114424, 2058373, 1995513, 1927190, 1854478, 1778539, 1701014, 1623937, 1549470, 1479803, 1416860, 1361611, 1313883, 1273431, 1241156, 1218680, 1206737, 1204564, 1210861, 1224392, 1243350, 1265033, 1286963, 1307848, 1326711, 1341511, 1349533, 1349007, 1339643, 1321715, 1295532, 1262071, 1223371, 1181710, 1138643, 1095051, 1051824, 1010111, 971001, 935077, 902182, 871628, 842884, 816138, 791983, 770534, 751210, 733510, 717671, 704262, 693367, 684516, 677250, 671387, 666790, 663284, 660895, 659978, 660945, 664033, 669371, 677043, 686915, 698610, 711878, 726807, 743355, 760767, 777894, 794273, 810503, 827352, 844826]
50315H44826J7711J8208J9625K1471K2591K2643K2420K2669K3127K3011K2030
50304A080332K0573J9124J7884J6844J5834J4453J2220R070N618K717P25p20k182
50291A212492l834n382o516p263p998r237j1420j4604j8234k1402k3534k4819
50279A058249k5832k6800k7340k6937k5576k3803k2259k1138k0221j9305j8451
50268H00587j7731j6962j5878j4444j2814j1038r140p348n965m964m000k827j437
50255F76039J32J726K819K921K336J964K153K273J843J360J485J847J475K15j045
50240F99543j574j579j661k076k695l363l955m390m700m965n123m993m594m268
50226F49607m356m822n159m698l252j502m53l35l34K88J250J853K156K820L958
$$ y = [844826, 862537, 880745, 900370, 921841, 944432, 967075, 989495, 1012164, 1035291, 1058302, 1080332, 1100905, 1120029, 1137913, 1154757, 1170591, 1185044, 1197264, 1206334, 1211952, 1214669, 1215394, 1214674, 1212492, 1208658, 1203276, 1196760, 1189497, 1181499, 1172262, 1160842, 1146238, 1128004, 1106602, 1083068, 1058249, 1032417, 1005617, 978277, 951340, 925764, 901961, 879702, 858564, 838343, 819038, 800587, 782856, 765894, 750016, 735572, 722758, 711720, 702580, 695232, 689267, 684303, 680303, 677476, 676039, 676171, 677897, 680716, 683637, 685973, 687937, 690090, 692363, 694206, 695566, 697051, 698898, 700373, 700588, 699543, 697969, 696390, 694729, 692653, 689958, 686595, 682640, 678250, 673550, 668585, 663462, 658469, 653875, 649607, 645251, 640429, 635270, 630572, 627320, 625818, 625365, 625030, 624696, 624984, 626234, 628087, 630243, 633063, 637021]
50211F37021M959N469N846O309O367N554M251L209K531J699M65p52j534k083k946
50196F76365m274n626o537p019p351p502p143o266n452n234n483n726n824n882
50182E91046n733n089m253m064m889o054o623o352n647m845m026l338l049l134
50168E23950l096k455j285j49N07O81N71J92n36j456k249k867l588m449n003m932
50152D93836m638m800n446n877n513m511l398k473j684r65m90n38j082j593j449
50137D49379o36J96N23M99N66P69R07J078J634K591L543M166M505M734M934N105
50121D84493N161M991M728M824N458O089O022N369M923N035N128M479L189K078
50107E51967J878K547L272L192K284J406J248J540J653J657K069K866L475L725
$$ y = [637021, 641980, 647449, 653295, 659604, 665971, 671525, 675776, 678985, 681516, 683215, 683680, 682928, 681394, 679311, 676365, 672091, 666465, 659928, 652909, 645558, 638056, 630913, 624647, 619195, 613961, 608478, 602752, 596928, 591046, 585313, 580224, 575971, 571907, 567018, 560964, 554341, 547989, 542342, 537497, 533471, 530133, 527084, 523950, 520854, 518399, 517114, 516965, 517472, 518153, 518724, 518916, 518380, 516924, 514675, 511808, 508220, 503771, 498768, 493836, 489198, 484398, 478952, 473075, 467562, 463051, 459653, 457180, 455496, 454531, 454041, 453503, 452421, 450828, 449379, 448743, 448939, 449462, 449961, 450527, 451296, 452203, 453281, 454915, 457506, 461049, 465215, 469720, 474454, 479388, 484493, 489654, 494645, 499373, 504197, 509655, 515744, 521766, 527135, 532058, 537093, 542221, 546700, 549889, 551967, 553845, 556392, 559664, 562856, 565140, 566546, 567794, 569334, 570987, 572644, 574713, 577579, 581054, 584779]
50093E84779L959M201M058L692L933N054O277O943P369Q018Q531Q425Q111Q384
50079F71734R223R942J0232J0310J0292J0213J0474J1421J2542J2954J2773J3085
50067H05195J4294J5351J5113J3826J2681J2367J2680J3239J3947J4737J5464
50056I58894J6124J6867J7656J8231J8531J8926J9843K1300K3007K4737K6495
50045A180611K8368L0500L3164L6569M0532M4476M7969N1030N3724N5584N5701
50034A658228N3422M8707M1879L3363K3840J4448O476P60k617m061l950k464M5
50021A868076K570L623J983k725j0178j9764l0578m1406n1052n8736o3913o6086
50009A531814o5245o2396n8990n5678n2020m7516m2505l7861l4229l1728k9988
$$ y = [584779, 588738, 592939, 596997, 600689, 604622, 609676, 615953, 622896, 630265, 638283, 646814, 655239, 663350, 671734, 680957, 690899, 701131, 711441, 721733, 731946, 742420, 753841, 766383, 779337, 792110, 805195, 819489, 834840, 849953, 863779, 876460, 888827, 901507, 914746, 928693, 943430, 958894, 975018, 991885, 1009541, 1027772, 1046303, 1065229, 1085072, 1106372, 1129379, 1154116, 1180611, 1208979, 1239479, 1272643, 1309212, 1349744, 1394220, 1442189, 1493219, 1546943, 1602527, 1658228, 1711650, 1760357, 1802236, 1835599, 1859439, 1873887, 1880363, 1881123, 1878506, 1874445, 1870495, 1868031, 1868076, 1870646, 1874269, 1876252, 1873527, 1863349, 1843585, 1813007, 1771601, 1720549, 1661813, 1597900, 1531814, 1466569, 1404173, 1345183, 1289505, 1237485, 1189969, 1147464, 1109603, 1075374, 1043646, 1013658]
49998A013658k8274k5994k3415k1533k0894k0882k0463j9350j8014j6895j6061
49987G81883j5489j5126j4759j4177j3508j2994j2454j1372r688q079p289p293
49975F39655p385o949n943m743l672k841k281j981j728j106N6J318J979J842J375
49960F07596J048Q91Q73J293K315L337L401K326J051O12J095J854K453L051L873
49945F37069M763N418N891O536P557Q812J0121J1496J3078J4956J7231J9956K2878
49932G85762K5454K7433K9424L2642L7993M5389N3816O2077O9577P6597Q3727
49921A329891R0912R7162J01245J02392J00338R5125Q7254P7754O7732N8053M9630
49910B257488M3510M0068L8396L7076L5360L2959K9065K2541J3088J350j2199
$$ y = [1013658, 985384, 959390, 935975, 914442, 893548, 872666, 852203, 832853, 814839, 797944, 781883, 766394, 751268, 736509, 722332, 708824, 695830, 683376, 672004, 662316, 654237, 646948, 639655, 632270, 625321, 619378, 614635, 610963, 608122, 605841, 603860, 602132, 601026, 601082, 602400, 604379, 606221, 607596, 608644, 609535, 610408, 611701, 614016, 617353, 620754, 623080, 624131, 624743, 625838, 627692, 630145, 633196, 637069, 641832, 647250, 653141, 659677, 667234, 676046, 686167, 697663, 710741, 725697, 742928, 762884, 785762, 811216, 838649, 868073, 900715, 938708, 984097, 1037913, 1099990, 1169567, 1246164, 1329891, 1420803, 1517965, 1619210, 1721602, 1821940, 1917065, 2004319, 2082073, 2149805, 2207858, 2257488, 2300998, 2341066, 2379462, 2416538, 2451898, 2484857, 2513922, 2536463, 2549551, 2550901, 2538702]
49899B538702k7528m3883n9256p1670q0609q6716r0715r3021r4007r3965r2973
49888A704359r1084q8491q5191q0919p5645o9892o4271n9050n4332n0236m6533
49877I38715m2605l8200l3849l0141k6941k3798k0777j8349j6714j5713j5137
49866F56491j4741j4155j3300j2643j2564j2672j2187j0919r352p943o840o222
49854E22953o231o531o394n461m118k962k205j731j494j591j995k440k664k719
49840D74417k835k921k558j664q81q02j041p36J65Q80J080J279J719J840J398
49825D69340J157J737K561K799K775L402M722O023P085Q305R713J0921J1985J3386
49811E55911J5084J6576J8045K0504K4413K8962L3199L7220M1773M7184N3226
$$ y = [2538702, 2511174, 2467291, 2408035, 2336365, 2255756, 2169040, 2078325, 1985304, 1891297, 1797332, 1704359, 1613275, 1524784, 1439593, 1358674, 1283029, 1213137, 1148866, 1089816, 1035484, 985248, 938715, 896110, 857910, 824061, 793920, 766979, 743181, 722404, 704055, 687341, 671628, 656491, 641750, 627595, 614295, 601652, 589088, 576416, 564229, 553310, 543958, 536015, 529175, 522953, 516722, 510191, 503797, 498336, 494218, 491256, 489051, 487320, 485826, 484235, 482240, 479800, 477136, 474417, 471582, 468661, 466103, 464439, 463558, 462756, 461715, 460979, 461144, 462024, 463104, 464383, 466102, 467942, 469340, 470497, 472234, 474795, 477594, 480369, 483771, 488493, 494516, 501601, 509906, 519619, 530540, 542525, 555911, 570995, 587571, 605616, 626120, 650533, 679495, 712694, 749914, 791687, 838871, 892097]
49800H92097N9631O6099P1793P5342P5605P2464O6784N9495N0801M0528K9343
49789A559982J9152J1855P911O405O204O584P091P344O860M582j016j0650k3167
49776A609137l6407m9003o0579p0407p7084p9844p9326p6606p2160o6277n9754
49765H81690n3495m7699m2063l6599l1810k8082k5241k2719k0029j7147j4462
49754E42344j2294j0481q673o924n703n261n293n189m477l086j563q06j198k054
49740D69342k362j925j316q16j50P14J217J047O75P20J192J689J992K111K012
49725D76142J599Q62r0r62j340j048m59j11o7q0j98o72j281j461j164r01p71k35
49707D67763Q24J583J349O08L37P02J003P29J71J3O16J642K278J986J138O73J031
$$ y = [892097, 951728, 1017827, 1089620, 1164962, 1240567, 1313031, 1379815, 1439310, 1490111, 1530639, 1559982, 1579134, 1590989, 1598900, 1605305, 1611509, 1618093, 1625184, 1632528, 1639388, 1643970, 1642954, 1632304, 1609137, 1572730, 1523727, 1463148, 1392741, 1315657, 1235813, 1156487, 1079881, 1007721, 941444, 881690, 828195, 780496, 738433, 701834, 670024, 641942, 616701, 593982, 573953, 556806, 542344, 530050, 519569, 510896, 503972, 498269, 493008, 487715, 482526, 478049, 474963, 473400, 472594, 471396, 469342, 466980, 465055, 463739, 462923, 462773, 463487, 464704, 465751, 466426, 467146, 468338, 470027, 472019, 474130, 476142, 477741, 478603, 478513, 477551, 476211, 475163, 474704, 474593, 474526, 474446, 474248, 473576, 472295, 470834, 469670, 468769, 467998, 467763, 468587, 470170, 471519, 472127, 472464, 473166, 474169, 474898, 475069, 475082, 475698, 477340, 479618, 481604, 482742, 483415, 484446]
49690D84446J767K236K289K200K277K629L023K995K507K262K746L155K275M10
49676E17217p31l91K44K5m88k64L42L19j32R6J131J888J729J177Q49P27P00R55
49658E25393J425J620J328R22P50O62M30J64Kj70n03r35j274j312p94K58J265
49641E29231J567J224R39J094J360J457J654K223K800K801K194J521J241J369
$$ y = [484446, 486213, 488449, 490738, 492938, 495215, 497844, 500867, 503862, 506369, 508631, 511377, 514532, 516807, 517217, 516486, 516095, 516339, 516364, 515876, 515612, 515954, 516273, 516141, 516237, 517368, 519256, 520985, 522162, 523011, 523738, 524438, 525393, 526818, 528438, 529766, 530688, 531438, 532100, 532530, 532694, 532696, 532526, 532023, 531088, 529814, 528502, 527708, 527966, 529231, 530798, 532022, 532961, 534055, 535415, 536872, 538526, 540749, 543549, 546350, 548544, 550065, 551306, 552675]
$$ [...]
##END NTUPLES=NMR SPECTRUM
##END=
