
##TITLE=AC1218_CiNAH12059_6667049_dl3JWW661S
##JCAMPDX= 6.0         $$ Bruker NMR JCAMP-DX V2.0
##DATA TYPE= NMR SPECTRUM
##DATA CLASS= NTUPLES
##ORIGIN= BRUKER
##OWNER= Administrator
$$ 1.72 TOPSPIN		Version 2.1
$$ 2012-08-14 12:05:52.046 -0500  Administrator@TOPSPIN
$$ Compression mode = diff/dup
##.OBSERVE FREQUENCY= 400.02188249412
##.OBSERVE NUCLEUS= ^1H
##.ACQUISITION MODE= SIMULTANEOUS (DQD)
##.ACQUISITION SCHEME= undefined
##.AVERAGES= 64
##.DIGITISER RES= 22
##SPECTROMETER/DATA SYSTEM= spect
##.PULSE SEQUENCE= noesygpps1d.comp
##.SOLVENT NAME= COFFEE_meoh
##.SHIFT REFERENCE= INTERNAL, COFFEE_meoh, 1, 14.96232
##AUDIT TRAIL= $$ (NUMBER, WHEN, WHO, WHERE, PROCESS, VERSION, WHAT)
$$ ##TITLE= Audit trail, TOPSPIN		Version 2.1
$$ ##JCAMPDX= 5.01
$$ ##ORIGIN= Bruker BioSpin GmbH
$$ ##OWNER= Administrator
$$ $$ C:\Bruker\TOPSPIN/data/COFFEE/nmr/AC1218_CiNAH12059_6667049_dl3JWW661S/12/pdata/1/auditp.txt
$$ ##AUDIT TRAIL=  $$ (NUMBER, WHEN, WHO, WHERE, PROCESS, VERSION, WHAT)
(   1,<2012-08-14 12:05:46.062 -0500>,<Administrator>,<TOPSPIN>,<go>,<TOPSPIN 2.1>,
      <created by zg
	started at 2012-08-14 11:54:15.781 -0500,
	POWCHK enabled, PULCHK disabled,
       configuration hash MD5:
       6B 1B 68 BB D9 2E 58 E2 7F 35 AD 54 07 DF 0E 41
       data hash MD5: 64K
       AF 71 B3 C1 68 9D 8C B6 4C EC AE 8D 34 0D 08 D0>)
(   2,<2012-08-14 12:05:49.796 -0500>,<Administrator>,<TOPSPIN>,<proc1d>,<TOPSPIN 2.1>,
      <Start of raw data processing
       efp LB = 0.3 FT_mod = 6 PKNL = 1 PHC0 = 0 PHC1 = 0 SI = 128K 
       data hash MD5: 128K
       9C 89 4F 1A CE 8F 18 E3 D6 07 F2 9A FE 61 65 BC>)
(   3,<2012-08-14 12:05:50.890 -0500>,<Administrator>,<TOPSPIN>,<proc1d>,<TOPSPIN 2.1>,
      <pk PHC0 = 4.855957 PHC1 = 0 
       data hash MD5: 128K
       1A D4 89 9B A2 DA 29 6F AE 50 04 FA 60 F0 A9 64>)
(   4,<2012-08-14 12:05:51.734 -0500>,<Administrator>,<TOPSPIN>,<proc1d>,<TOPSPIN 2.1>,
      <abs ABSG = 1 
       data hash MD5: 128K
       90 AD 63 EB 21 CD 64 63 4B A2 3E 47 DD 99 63 18>)
(   5,<2012-08-14 12:05:51.812 -0500>,<Administrator>,<TOPSPIN>,<proc1d>,<TOPSPIN 2.1>,
      <abs ABSG = 2 
       data hash MD5: 128K
       A7 D0 3A 32 89 A5 B4 54 6C DE C5 58 1C 54 72 A8>)
(   6,<2012-08-14 12:05:51.859 -0500>,<Administrator>,<TOPSPIN>,<proc1d>,<TOPSPIN 2.1>,
      <abs ABSG = 3 
       data hash MD5: 128K
       D2 1F 61 91 6D 22 DB E7 31 A4 E4 2C 04 7B BB B5>)
(   7,<2012-08-14 12:05:51.921 -0500>,<Administrator>,<TOPSPIN>,<proc1d>,<TOPSPIN 2.1>,
      <abs ABSG = 4 
       data hash MD5: 128K
       8D 0E D9 E8 A3 E1 39 55 97 17 32 3B 2A 26 35 3F>)
(   8,<2012-08-14 12:05:51.968 -0500>,<Administrator>,<TOPSPIN>,<proc1d>,<TOPSPIN 2.1>,
      <abs ABSG = 5 
       data hash MD5: 128K
       ED 5E 21 C3 DB 9A E6 BA A4 CD 3E C9 F0 90 04 11>)
$$ ##END=
$$ 
$$ $$ hash MD5
$$ $$ 3D 85 CC DA 35 86 0E 2D 0E 46 C5 B4 02 98 06 58
##$RELAX= 
##$RELAX= 
##$RELAX= 
##$RELAX= 
##$RELAX= 
##$RELAX= 
##$RELAX= 
##$RELAX= 
$$ Bruker specific parameters
$$ [...]
150 150 150 150 150 150 150 150
##$TP07= 0
##$TPNAME0= <>
##$TPNAME1= <>
##$TPNAME2= <>
##$TPNAME3= <>
##$TPNAME4= <>
##$TPNAME5= <>
##$TPNAME6= <>
##$TPNAME7= <>
##$TPOAL= (0..7)
0.5 0.5 0.5 0.5 0.5 0.5 0.5 0.5
##$TPOFFS= (0..7)
0 0 0 0 0 0 0 0
##$TUNHIN= 0
##$TUNHOUT= 0
##$TUNXOUT= 0
##$USERA1= <user>
##$USERA2= <user>
##$USERA3= <user>
##$USERA4= <user>
##$USERA5= <user>
##$V9= 5
##$VALIST= <valist>
##$VCLIST= <CCCCCCCCCCCCCCC>
##$VD= 0
##$VDLIST= <DDDDDDDDDDDDDDD>
##$VPLIST= <PPPPPPPPPPPPPPP>
##$VTLIST= <TTTTTTTTTTTTTTT>
##$WBST= 1024
##$WBSW= 4
##$XGAIN= (0..3)
0 0 0 0
##$XL= 0
##$YL= 0
##$YMAX_a= 16121171
##$YMIN_a= -8433603
##$ZGOPTNS= <>
##$ZL1= 120
##$ZL2= 120
##$ZL3= 120
##$ZL4= 120
##$ABSF1= 14.96232
##$ABSF2= -5.595861
##$ABSG= 5
##$ABSL= 3
##$ALPHA= 0
##$AQORDER= 0
##$ASSFAC= 0
##$ASSFACI= 0
##$ASSFACX= 0
##$ASSWID= 0
##$AUNMP= <proc_prof1d_extract.lims>
##$AXLEFT= 0
##$AXNAME= <>
##$AXNUC= <1H>
##$AXRIGHT= 0
##$AXTYPE= 0
##$AXUNIT= <>
##$AZFE= 0.1
##$AZFW= 0.1
##$BCFW= 0
##$BC_mod= 0
##$BYTORDP= 0
##$COROFFS= 0
##$CY= 15
##$DATMOD= 1
##$DC= 0
##$DFILT= <>
##$DTYPP= 0
##$F1P= 0
##$F2P= 0
##$FCOR= 0.5
##$FTSIZE= 131072
##$FT_mod= 6
##$GAMMA= 0
##$GB= 0
##$INTBC= 1
##$INTSCL= 1
##$ISEN= 128
##$LB= 0.3
##$LEV0= 0
##$LPBIN= 0
##$MAXI= 10000
##$MC2= 0
##$MEAN= 0
##$ME_mod= 0
##$MI= 0
##$NCOEF= 0
##$NC_proc= -2
##$NLEV= 6
##$NOISF1= 0
##$NOISF2= 0
##$NSP= 0
##$NTH_PI= 0
##$NZP= 0
##$OFFSET= 14.96232
##$PC= 1
##$PHC0= 4.855957
##$PHC1= 0
##$PH_mod= 1
##$PKNL= yes
##$PPARMOD= 0
##$PPDIAG= 0
##$PPIPTYP= 0
##$PPMPNUM= 2147483647
##$PPRESOL= 1
##$PSCAL= 4
##$PSIGN= 0
##$PYNMP= <proc.py>
##$REVERSE= no
##$SF= 400.020009107841
##$SI= 131072
##$SIGF1= 0
##$SIGF2= 0
##$SINO= 400
##$SIOLD= 131072
##$SPECTYP= <>
##$SREGLST= <1H.CDCl3>
##$SSB= 0
##$STSI= 131072
##$STSR= 0
##$SW_p= 8223.68421052631
##$SYMM= 0
##$S_DEV= 0
##$TDeff= 65536
##$TDoff= 0
##$TI= <>
##$TILT= no
##$TM1= 0
##$TM2= 0
##$TOPLEV= 0
##$USERP1= <user>
##$USERP2= <user>
##$USERP3= <user>
##$USERP4= <user>
##$USERP5= <user>
##$WDW= 1
##$XDIM= 131072
##$YMAX_p= 399205792
##$YMIN_p= -14874
##$CURPLOT= <Network HP LaserJet P1505>
##$CURPRIN= <$Network HP LaserJet P1505>
##$DFORMAT= <normdp>
##$LAYOUT= <+/1D_H.xwp>
##$LFORMAT= <normlp>
##$PFORMAT= <normpl>
##$SURQMSG= 1
$$ End of Bruker specific parameters
$$ ---------------------------------
##NTUPLES= NMR SPECTRUM
##VAR_NAME=  FREQUENCY,     SPECTRUM/REAL,   SPECTRUM/IMAG
##SYMBOL=    X,             R,               I
##VAR_TYPE=  INDEPENDENT,   DEPENDENT,       DEPENDENT
##VAR_FORM=  AFFN,          ASDF,            ASDF
##VAR_DIM=   131072,        131072,          131072
##UNITS=     HZ,            ARBITRARY UNITS, ARBITRARY UNITS
##FACTOR=    0.0627417313425164, 1,          1
##FIRST=     8223.62146879497, 2510,         -53793
##LAST=      0,             4252,            -53659
##MIN=       0,             -14874,          0
##MAX=       8223.62146879497, 399205792,    0
$$ Real data points
##PAGE= N=1
##DATA TABLE= (X++(R..R)), XYDATA
$$ [...]
67451 74975 73947 73967 74972 76081 76762 77225 77675 77895 77759 77488 77193 76676 75943 75348 74937 74279 73329 72930
67433 72930 73890 75921 78038 79743 81266 82758 83810 83878 82898 81408 80208 79814 80123 80640 81082 81550 82045
67416 82045 82207 81758 80918 80085 79398 78934 79065 80131 81832 83282 83772 83294 82486 82204 82889 84096 84819 84538
67398 84538 83749 83232 83121 83072 82996 83053 83108 82798 82159 81583 81194 80738 80149 79677 79365 78943 78466 78507 79412 80768
67378 80768 81899 82562 82811 82560 81747 80709 79924 79490 79209 79125 79575 80650 81967 83065 83813 84286 84459 84253
67360 84253 83793 83433 83448 83823 84390 85078 85878 86602 86902 86674 86259 86044 85974 85742 85461 85794 87259 89640 92242
67341 92242 94542 96366 97638 98271 98371 98284 98315 98467 98486 98119 97341 96454 95974 96288 97260 98246 98579 98126 97338
67322 97338 96765 96547 96436 96252 96218 96754 97949 99352 100317 100517 100065 99216 98096 96788 95545 94745 94621 95179
67304 95179 96397 98313 100762 103191 104936 105700 105658 105202 104759 104717 105187 105819 106152 106256 106681 107626 108448 108317
67286 108317 107151 105670 104603 104094 103784 103264 102485 101856 101842 102336 102672 102494 102340 102931 104070 104757 104434 103615
67268 103615 103150 103323 103877 104569 105324 106085 106824 107619 108526 109429 110163 110631 110719 110260 109297 108258 107689 107862 108724
67249 108724 110042 111533 113006 114545 116274 117833 118399 117600 116151 115126 114793 114675 114637 115188 116544 118051
67233 118051 118986 119481 120178 121241 122266 123027 123761 124713 125818 126905 127798 128150 127671 126699 126106 126362 126990
67216 126990 127260 127090 126911 126986 127353 128207 129727 131531 132875 133506 133823 134091 134092 133810 133887 134886 136459 137795
67198 137795 138682 139606 140909 142348 143520 144311 144820 145193 145631 146286 147047 147572 147594 147064 146159 145423 145669 147237
67180 147237 149366 150814 151218 151277 151492 151462 150862 150438 151220 153130 155142 156707 158179 159815 161210 162088 162954
67163 162954 164455 166518 168599 170408 171896 172829 173039 172995 173466 174534 175442 175578 175193 174976 175333 176302 177783
67146 177783 179478 180908 181914 182997 184853 187592 190659 193359 195241 196149 196278 196151 196290 196934 198252
67131 198252 200561 203899 207582 210765 213366 215883 218301 219928 220534 220948 222053 223727 225268 226420 227356
67116 227356 228004 228125 227967 228195 229142 230616 232472 234829 237657 240626 243518 246368 249030 250985 251858 251965
67100 251965 252135 253099 255041 257523 259801 261410 262510 263483 264400 265195 266255 268232 271141 274194 276788
67085 276788 279208 281983 284996 287720 290020 292145 294139 295858 297593 300025 303253 306380 308445 309598
67071 309598 310989 313512 316971 320519 323627 326426 329279 332363 335665 339067 342259 344803 346614 348320
67057 348320 350821 354475 358885 363438 367751 371608 374914 377897 381042 384569 388220 391788 395498 399437
67043 399437 402901 404962 405824 407002 409829 414088 418460 422091 425252 428546 432040 435485 439014 443100
67029 443100 447852 452736 457185 461273 465580 470476 475667 480431 484251 487374 490782 495449 501489 508166
67015 508166 514682 520724 526198 530940 535056 539164 543858 549127 554743 560904 567846 575007 581412 587006
67001 587006 592840 599656 607000 614103 620941 627893 634886 641640 648422 655773 663577 671082 677939 684659
66987 684659 691885 699654 707571 715475 723622 732338 741600 750989 760111 769022 778094 787407 796584 805487
66973 805487 814717 824976 836037 846790 856355 864825 872916 881333 890582 901000 912578 924785 936807
66960 936807 948065 958614 969106 980312 992524 1005394 1018316 1030898 1043055 1054920 1066848
66949 1066848 1079254 1092189 1105223 1118029 1130941 1144626 1159268 1174368 1189253 1203463 1216730
66938 1216730 1229006 1240621 1252132 1263933 1276149 1288792 1301765 1314789 1327687 1340685 1354118
66927 1354118 1367945 1381963 1396325 1411316 1426618 1441450 1455567 1469519 1483713 1497861 1511686
66916 1511686 1525545 1539852 1554387 1568737 1582991 1597344 1611361 1624386 1636552 1648667 1661148
66905 1661148 1673732 1686291 1699193 1712541 1725610 1737456 1747805 1757111 1766056 1775226 1784891 1794746
66893 1794746 1804022 1812211 1819541 1826548 1833396 1839873 1845796 1851055 1855488 1859169 1862721 1866763 1870974 1874222
66879 1874222 1875851 1876361 1876512 1876251 1875045 1873013 1871067 1869823 1868908 1867466 1864979 1861430 1857084 1852410 1847902
66864 1847902 1843530 1838544 1832179 1824525 1816364 1808170 1799660 1790359 1780213 1769449 1758206 1746639 1735155
66851 1735155 1724111 1713317 1702188 1690468 1678466 1666470 1654262 1641487 1628239 1614906 1601560
66840 1601560 1587926 1574025 1560346 1547148 1533977 1520206 1505788 1491102 1476281 1461192 1445944
66829 1445944 1430897 1416121 1401302 1386286 1371220 1356134 1340920 1325960 1312100 1299559 1287358
66818 1287358 1274357 1260528 1246604 1232825 1218688 1203834 1188531 1173292 1158571 1144798 1132105
66807 1132105 1119899 1107287 1094063 1080787 1067789 1054702 1041251 1027912 1015373 1003711 992533
66796 992533 981576 970735 959754 948377 936736 925232 914078 903210 892567 882171 871982
66785 871982 861921 851978 842102 832076 821741 811341 801429 792343 783884 775482 766677 757502 748495
66772 748495 740208 732649 725289 717695 709974 702520 695519 688845 682244 675427 668158 660467 652681 645069
66758 645069 637588 630098 622678 615520 608655 602000 595541 589296 583215 577290 571578 565903 559778 553027
66744 553027 546297 540527 535889 531674 527158 522146 516591 510225 502990 495584 489127 484232 480576 477315
66730 477315 473780 469811 465691 461866 458607 455749 452721 449005 444664 440320 436457 432823 428797 424316
66716 424316 420064 416570 413487 410069 406123 402081 398260 394528 390771 387222 384170 381547 379046 376489
66702 376489 373915 371393 368904 366335 363522 360321 356685 352673 348394 344065 340101 337018 335077 334050
66688 334050 333359 332432 330904 328548 325200 320949 316371 312310 309221 306820 304595 302473 300655 298960 296879
66673 296879 294363 292001 290141 288320 285964 283196 280515 277996 275433 273038 271288 270092 268666 266384
66659 266384 263332 260020 257002 254822 253823 253711 253599 252657 250627 247817 244925 242731 241470 240488 238990
66644 238990 237099 235631 234793 233787 231893 229312 226593 223907 221310 219133 217516 216000 214181 212457
66630 212457 211499 211284 211225 211038 210805 210342 209273 207757 206494 205791 205200 204260 203070 201804 200193 197957 195514
66613 195514 193735 193044 193087 193325 193609 193998 194222 193721 192311 190589 189390 188906 188570 187818 186630 185266 183838
66596 183838 182394 181104 180062 179077 178021 177191 176982 177286 177546 177330 176561 175315 173778 172377 171532 171205
66580 171205 171017 170859 171035 171748 172753 173590 173862 173292 171888 170233 169199 169122 169516 169736 169625 169304 168636 167328
66562 167328 165446 163566 162330 162024 162414 162802 162340 160626 158136 155907 154659 154206 153793 152927 151790 150825
66546 150825 150148 149575 149043 148612 148005 146710 144858 143484 143409 144128 144421 143861 142972 142043 140660 138638 136621
66529 136621 135264 134439 133722 133105 132673 132039 130797 129329 128502 128626 129234 129763 129980 129787 129173 128416 127883 127535
66511 127535 126975 126003 124772 123358 121581 119411 117236 115572 114671 114445 114558 114606 114450 114361 114607 114960 114964 114634
66493 114634 114414 114449 114414 114147 113914 113768 113216 111986 110688 110167 110407 110626 110346 109819 109395 109005 108447 107791 107214
66474 107214 106696 106144 105613 105145 104512 103429 102021 100789 100049 99639 99368 99503 100483 102182 103738 104280 103588
66457 103588 102005 100017 98161 97103 97306 98555 100031 100932 100933 100139 98871 97536 96458 95734 95378 95500
66441 95500 96129 96838 96928 96122 94881 93890 93432 93323 93196 92728 91846 90922 90536 90832 91278 91304 90968 90742 90839 91152
66421 91152 91753 93005 95035 97384 99403 100824 101793 102446 102684 102446 102056 102066 102606 103010 102346 100400 97907
66404 97907 95740 94054 92417 90568 88778 87515 86997 87042 87175 86918 86140 85159 84377 83837 83309 82709 82219
66387 82219 81998 81996 82138 82486 83082 83754 84218 84338 84249 84217 84409 84825 85398 86108 86886 87412 87215 86153 84729 83764
66367 83764 83723 84396 85210 85745 85985 86125 86136 85601 84119 81958 80060 79210 79316 79658 79713 79482 79135 78699 78250
66348 78250 78169 78964 80747 82923 84467 84677 83706 82234 80600 78548 75943 73403 71833 71499 71886 72339
66332 72339 72441 71953 70912 69867 69493 69848 70377 70812 71561 72914 74337 75017 74898 74686 74886 75241 75201 74612
66314 74612 73828 73226 72770 72046 70768 69270 68309 68249 68577 68452 67646 66698 66163 66019 65944 65880 65991 66161 65987
66295 65987 65426 65098 65600 66619 67140 66562 65236 63835 62660 61791 61494 61969 62875 63589 63904 64129 64569 65231
66277 65231 65910 66167 65430 63673 61945 61593 62785 64333 65090 65003 64675 64563 64923 65927 67302 68292 68435
66260 68435 68047 67531 66748 65647 65023 65817 67769 69517 70049 69474 68405 67249 66299 65876 66018 66349 66487
66243 66487 66383 66186 66010 65916 65832 65473 64676 63836 63593 63949 64144 63646 62878 62594 62863 63138 63239 63727 65077
66224 65077 66795 67746 67365 66278 65552 65540 65818 66113 66740 67842 68746 68596 67450 66165 65289 64607 63840 63245
66206 63245 63254 63867 64697 65400 65909 66346 66816 67227 67307 66981 66604 66554 66714 66683 66412 66180 65983 65505 64767 64215 63944
66185 63944 63412 62305 61192 60829 61178 61662 62092 62826 64100 65678 67140 68099 68242 67560 66554 65850 65557
66168 65557 65313 64986 64960 65590 66625 67343 67198 66261 65135 64430 64246 64168 63803 63234 62849 62816 62846 62389 60999
66149 60999 58704 56213 54535 54148 54607 55138 55454 55783 56308 56909 57380 57612 57666 57941 59058 61132 63220
66132 63220 63979 62976 61005 59146 58002 57872 59009 61220 63584 65018 65099 64076 62330 60134 57874
66117 57874 56125 55383 55770 56946 58191 58713 58101 56576 54819 53599 53451 54367 55608 56121 55498 54468
66101 54468 54133 54742 55489 55597 55252 55253 55910 56693 57019 57031 57286 57842 58076 57557 56698 56285 56557 57131 57623 57922
66081 57922 57895 57334 56320 55250 54373 53666 53227 53308 53779 54076 54011 54119 54717 55169 54766 53969 53964 55081 56484
66062 56484 57400 57866 58150 58303 58654 59913 62148 64218 64903 64236 63178 62343 61735 61465 61850 62663 63019 62314
66044 62314 60873 59474 58584 58214 58202 58356 58540 58765 59079 59361 59498 59741 60488 61596 62394 62634 63033 64420
66026 64420 66602 68498 69297 69085 68459 67988 68076 68917 70336 71908 73348 74616 75599 76010 75790 75416 75494 76144
66008 76144 76985 77616 77867 77610 76746 75531 74595 74277 74007 72819 70605 68548 68011 69167 70965 72276 72729
65991 72729 72510 71858 70954 69994 69049 68032 67014 66455 66862 68210 69844 70962 71116 70374 69128 67752 66422
65974 66422 65271 64621 64723 65265 65479 64986 64243 63921 64091 64358 64539 64790 65211 65756 66474 67355 67999 67873 67003
65955 67003 66031 65553 65739 66537 67710 68638 68738 68410 68944 71019 73699 75424 75708 75325 75087 75163 75587 76774
65937 76774 79157 82572 86206 89037 90329 90010 88733 87377 86333 85394 84396 83744 84080 85490 87224 88255
65921 88255 88065 86949 85689 84942 84830 84936 84686 83871 82870 82292 82349 82692 82952 83239 83834 84568 84896 84628
65903 84628 84138 83706 83004 81595 79674 77993 77095 76882 76863 76649 76309 76340 77146 78374 79019 78440 77098 75998
65885 75998 75596 75611 75739 76052 76709 77671 78759 79657 79872 79187 78200 77874 78320 78521 77599 75933 74566 73910
65867 73910 73575 73248 73029 72861 72335 71382 70688 71028 72425 74265 75987 77288 77895 77656 76887 76139 75528 74671
65849 74671 73441 72388 72128 72667 73602 74698 75806 76520 76548 76414 77126 79001 81261 82983 83941 84319 84168
65832 84168 83593 83094 83183 83826 84689 85688 86845 87838 88301 88494 89086 90181 91071 91165 90753 90581 90978 91636 92042
65813 92042 91950 91582 91470 91944 92673 92928 92391 91490 90888 90842 91193 91704 92204 92585 92893 93299 93830 94213 94161 93737
65793 93737 93322 93298 93758 94397 94618 93964 92604 91278 90646 90813 91550 92699 94134 95523 96464 96841 96856 96688
65775 96688 96326 95704 94843 93836 92783 91744 90643 89272 87566 85830 84507 83642 82748 81312 79328 77184
65759 77184 75136 73144 71260 69831 69073 68575 67671 66391 65669 66276 67807 69013 69022 67869 66010 63814
65743 63814 61665 60084 59400 59436 59669 59628 59121 58332 57802 58084 59215 60650 61776 62306 62211 61590 60770 60206
65725 60206 60065 60128 60261 60636 61279 61782 61872 61979 62731 64036 65196 65919 66687 67948 69375 70227 70259 69992 70158
65706 70158 70995 72084 72839 73112 73271 73608 73865 73448 72055 69954 67759 66122 65410 65372 65195 64205 62605
65689 62605 61267 60863 61456 62858 64887 67092 68644 68921 68121 67035 66239 65657 64876 63761 62714 62331
65673 62331 62829 63860 64932 65832 66522 66795 66425 65601 64831 64297 63644 62527 61095 59754 58805 58496 59091
65656 59091 60506 62131 63400 64398 65481 66453 66627 65754 64416 63311 62549 61931 61636 62170 63683 65640
65640 65640 67310 68416 69248 70188 71214 71894 71833 71096 70162 69478 69118 68792 68139 67067 65938 65328 65414 65618
65622 65618 65082 63585 61755 60317 59431 58942 58925 59537 60498 61191 61355 61280 61264 61252 61153 61113 61207 61156 60675 59889 59082
65601 59082 58269 57375 56741 56962 58170 59821 61302 62433 63292 63846 63964 63630 62948 62039 61027 60063 59299
65584 59299 58916 59126 59953 61028 61857 62315 62613 62744 62314 61056 59258 57520 56338 56011 56549 57356 57433 56331
65566 56331 54740 53706 53444 53325 52890 52374 52306 53000 54471 56384 58053 58902 59033 59005 59058 59006 58857 58923 59126
65547 59126 58846 57880 57045 57249 58296 59184 59340 59011 58553 57968 57225 56497 55935 55586 55635 56324 57474 58466 58920
65528 58920 59095 59353 59558 59318 58649 58103 58303 59523 61577 63861 65693 66950 68282 70372 72972 74991
65512 74991 75609 75048 74227 73915 74323 75239 76348 77542 78998 80869 82882 84466 85312 85544 85313 84609 83666
65495 83666 83163 83626 84852 86332 87950 89833 91672 92816 93153 93406 94364 96161 98410 100728 102960 105174
65479 105174 107622 110490 113592 116541 119171 121467 123095 123555 122980 122192 121626 120727 118865 116339 113907
65464 113907 111680 109212 106469 103984 102041 100328 98441 96150 93156 89274 85122 82008 80697 80606 80539
65449 80539 79900 78864 77650 76101 74028 71647 69539 68139 67268 66326 65134 64414 64985 66506 67516 66940
65433 66940 65158 63353 62186 61458 60796 60199 59949 60230 60855 61272 61039 60408 60168 60685 61360 61369 60730 60272 60637
65414 60637 61688 62871 63832 64580 65273 65917 66222 65853 64965 64298 64490 65400 66373 67047 67540 67967 68262 68540
65396 68540 69193 70386 71763 72893 73792 74769 75908 76994 77871 78593 79204 79599 79769 80067 81043 82914 85324
65379 85324 87692 89744 91587 93303 94736 95732 96388 96933 97533 98374 99745 101850 104644 108063 112235 117214
65363 117214 122665 128168 133738 139661 145843 151745 157022 161762 165916 168919 170258 170153 169274 167953 166051
65348 166051 163570 160993 158887 157316 155768 153586 150474 146657 142606 138571 134402 129888 125118 120431
65334 120431 116077 112058 108255 104577 101017 97661 94629 91898 89245 86465 83572 80665 77698 74634
65320 74634 71772 69648 68517 68115 67975 67729 67071 65831 64367 63562 64003 65282 66520 67440 68415 69422
65304 69422 69698 68816 67535 66953 67028 66666 65310 63753 63114 63507 64131 64377 64349 64389 64509 64435 63931 63003 61907
65285 61907 61037 60673 60745 60929 61015 61155 61689 62721 63857 64357 63643 61798 59589 57956 57385 57766 58738 60133
65267 60133 62036 64480 67095 69157 70148 70277 70346 71003 72212 73540 74849 76517 78938 81942 84780 86746
65251 86746 87806 88515 89276 89856 89845 89415 89172 89194 88677 86864 84012 81087 78743 76968 75551 74417 73486
65234 73486 72552 71413 69976 68329 66862 66101 66070 66075 65566 64991 65145 65794 65710 64220 61994 60032 58596 57525
65216 57525 56891 56714 56526 55921 55215 54879 54636 53812 52399 51062 50186 49658 49561 50240 51523 52620 53150 53676
65198 53676 54853 56543 58126 59250 59884 59984 59558 58766 57642 56015 54070 52644 52422 53065 53623 53662 53494
65181 53494 53406 53289 53091 53086 53496 54186 54950 55783 56740 57817 59100 60786 62803 64626 65664 65750 65210 64569
65163 64569 64242 64236 64133 63559 62747 62321 62464 62708 62687 62651 62909 63182 62990 62445 62177 62582 63593 65007 66534
65144 66534 67592 67683 67065 66507 66270 65846 64893 63848 63294 63226 63384 63864 64816 65878 66528 66820 67173 67528 67384
65125 67384 66708 66126 66023 66047 65891 66013 67063 68832 70276 70557 69760 68681 68218 68887 70540 72434 73761
65108 73761 74227 74075 73644 73113 72655 72553 73021 74016 75344 76895 78738 81036 83876 87214 90936 94941
65092 94941 99076 103070 106750 110371 114434 119019 123604 127845 132223 137429 143188 148271 151796 154024
65078 154024 155687 156997 157682 157600 156775 155019 152032 147948 143420 139074 135053 131085 126784 121909 116611
65063 116611 111428 106822 102724 98761 94904 91499 88619 85756 82374 78529 74740 71462 68909 67134
65049 67134 66018 65298 64813 64605 64566 64201 63117 61627 60484 60006 59831 59624 59591 60033 60723 61125 61127 61198 61736
65030 61736 62584 63283 63639 63761 63669 63148 62082 60747 59608 58961 58881 59315 59929 60007 59008 57274 55754 54866
65012 54866 54125 53190 52671 53306 54682 55631 55755 55717 55973 56128 55899 55843 56486 57336 57577 57358 57565 58454 59326
64993 59326 59609 59503 59339 59009 58395 57817 57566 57322 56584 55519 54909 55177 55762 55633 54282 52154 50206 49130
64975 49130 48990 49495 50404 51558 52679 53438 53770 53907 54057 54236 54463 54851 55394 55893 56262 56711 57409 58123
64957 58123 58418 58116 57369 56368 55281 54435 54252 54819 55639 56002 55675 55152 55129 55719 56318 56376 56135 56307 57063
64938 57063 57720 57579 56743 55836 55202 54695 54083 53305 52406 51567 51148 51402 52187 53182 54306 55550 56501 56514 55510
64919 55510 54189 53310 53047 53167 53452 53708 53643 53121 52387 51823 51621 51783 52234 52743 52991 53046 53489 54698 56124
64900 56124 56718 55997 54324 52239 50047 48193 47415 48019 49246 49834 49310 48412 48127 48571 49058 49166 49315
64883 49315 50094 51320 52220 52484 52623 53113 53676 53800 53589 53551 53791 53983 54054 54253 54580 54756 54853 55252 55764 55584
64863 55584 54567 53835 54401 55726 56442 56195 55843 55917 55886 55187 54179 53597 53587 53745 53759 53615 53421 53428 54001 55230
64843 55230 56665 57681 57981 57566 56540 55244 54325 54201 54572 54785 54617 54307 53914 53156 51977 50857 50356
64826 50356 50644 51590 52966 54337 55095 54978 54466 54321 54803 55561 56245 56905 57710 58536 59035 59025 58696 58408 58393
64807 58393 58686 59288 60228 61344 62078 61797 60492 58982 58173 58166 58359 58382 58535 59134 59805 59850 59195 58520 58390
64788 58390 58575 58418 57626 56456 55372 54800 55117 56467 58471 60355 61465 61613 60992 59990 59093 58650 58565
64771 58565 58413 57993 57568 57374 57199 56764 56295 56296 56789 57261 57420 57516 57756 57801 57245 56307 55615 55450 55626 56069
64751 56069 57026 58533 60014 60739 60535 59872 59312 59032 58803 58299 57425 56443 55747 55478 55450 55480 55631 56022 56624
64732 56624 57415 58579 60214 61915 62938 62869 61889 60412 58784 57390 56638 56622 57064 57802 58988 60490 61516
64715 61516 61427 60727 60593 61378 62258 62553 62735 63631 65104 66162 66166 65366 64350 63558 63388 64111 65371 66217 66097
64696 66097 65578 65658 66491 67226 67136 66464 65979 65999 66177 66162 66120 66530 67620 69154 70657 71740 72183 71895 70941
64677 70941 69635 68402 67440 66523 65329 63937 62820 62254 61994 61731 61680 62285 63421 64368 64761 65142 66232
64660 66232 67929 69447 70283 70586 70628 70392 69793 68913 67871 66760 65875 65678 66303 67290 67979 67995 67288 66084
64642 66084 64976 64670 65245 65923 66000 65730 65790 66063 65668 64287 62817 62330 62853 63579 63992 64294 64828 65552 66195
64623 66195 66657 67077 67626 68340 69119 69809 70318 70669 70896 70884 70384 69296 67899 66734 66171 66156 66377 66631 66940
64604 66940 67422 68195 69371 70894 72353 73128 72896 71922 70809 70075 69957 70370 70919 71132 70873 70342 69595 68351
64586 68351 66518 64667 63610 63619 64367 65467 66697 67805 68576 69120 69749 70495 71073 71318 71323 71167 70918 70873 71340
64567 71340 72110 72646 72843 73033 73118 72470 71048 69867 69701 69914 69381 68146 67232 67095 67301 67764 69132 71488
64549 71488 73590 74145 73363 72531 72372 72507 72347 71815 71149 70544 70166 70115 70154 69824 69065 68463 68608 69377 70123
64530 70123 70491 70740 71286 72169 73057 73606 73730 73586 73386 73127 72467 71009 68855 66785 65737 66020 67062
64513 67062 67982 68349 68433 68722 69261 69567 69256 68579 68089 67837 67320 66370 65659 65890 66781 67382 67302 66990 66747 66182
64493 66182 64994 63713 63103 63147 63272 63350 63818 64770 65608 65877 65983 66622 67804 68810 69030 68494 67627 66792
64475 66792 66142 65662 65236 64772 64366 64250 64538 65107 65726 66212 66411 66237 65873 65786 66335 67365 68364 69016 69463
64456 69463 70041 70937 72128 73455 74648 75456 75881 76163 76488 76812 77059 77271 77460 77560 77665 78046 78681 79064
64438 79064 78846 78384 78231 78292 78045 77476 77111 77045 76687 75799 75195 75884 77811 79898 81076 81008 80076 79103 78914
64419 78914 79792 81401 83441 86051 89249 92354 94580 96019 97386 98821 99634 99305 98111 96472 94357
64404 94357 91805 89605 88748 89297 90253 90569 89937 88637 87056 85554 84472 83921 83587 82944 81731 80172
64388 80172 78791 78092 78319 79333 80621 81581 81967 82090 82445 83166 83922 84351 84459 84527 84752 85074 85289 85259 84975
64369 84975 84483 83750 82666 81287 80089 79790 80783 82682 84503 85340 84956 83822 82664 81978 81927 82560 83910
64352 83910 85770 87591 88784 89106 88690 87912 87354 87561 88417 88948 88260 86653 85360 85116 85449 85473 84857 83826
64334 83826 82713 81798 81252 80925 80518 80166 80462 81643 83213 84712 86401 88716 91432 93953 96180 98548
64318 98548 101326 104306 107051 109047 109838 109464 108661 108152 107874 107264 106096 104624 103115 101765 100872 100538
64302 100538 100371 100029 99837 100312 101243 101998 102552 103380 104363 104690 104028 102984 102162 101615 101562 102803 105786 109832
64284 109832 113874 117599 121324 125128 128665 131667 134219 136604 139085 141731 144354 146868 149690 153317
64270 153317 157326 160331 161220 160102 157869 155352 153107 151421 150018 148188 145673 143071 140975 139129
64256 139129 136912 134286 131689 129270 126836 124398 122259 120630 119549 119085 119283 119983 120927 121904 122643 122880
64240 122880 122804 123071 124043 125372 126732 128497 131195 134662 138305 141907 145578 149218 152678 156245 160291
64225 160291 164561 168451 171777 174614 176525 176842 175764 174395 173445 172457 170528 167296 163100 158664 154735
64210 154735 151603 148877 146142 143729 142232 141382 140244 138667 137656 137994 139256 140677 142231 144261 146631
64195 146631 148951 151251 153714 155966 157317 157637 157453 157159 156542 155145 152847 150099 147711 146258 145536
64180 145536 144847 143980 143549 144031 144905 145282 145122 145170 145793 146592 147254 148042 149073 149686 149159 147876 147171 147919
64162 147919 149654 151292 152478 153920 156447 160068 164126 168154 172269 176733 181435 186002 190206 194023
64148 194023 197366 200029 202001 203647 205359 207020 207961 207589 206023 203982 202093 200470 198936 197314 195360
64133 195360 192807 189832 187207 185504 184278 182635 180587 179203 179220 180058 180569 180299 179647 179175 179225 179906 180901
64116 180901 181469 181105 180157 179379 179011 178744 178519 178785 179918 181858 184436 187605 191231 195112 199446 204813
64100 204813 211357 218319 224815 230831 237094 244142 251956 260333 269142 278249 287632 297617 308572 320266
64086 320266 331928 343092 353980 364831 375229 384396 391793 397027 399484 398705 395046 389468 382636
64073 382636 374682 365922 357157 348985 341213 333351 325391 317757 310736 304413 298997 294777 291742 289634
64059 289634 288358 288025 288492 289206 289735 290302 291611 294156 297788 301955 306376 311451 317920 326111 335647
64044 335647 345913 356574 367552 378863 390728 403618 417741 432559 447144 460963 474068
64033 474068 486682 498971 511035 522573 532518 539619 543548 545056 544921 543280 540239 536524 532964
64020 532964 529591 525784 521220 516295 511625 507475 503718 500170 496948 494623 493889 494929 497217 500110
64006 500110 503485 507609 512572 518222 524580 531939 540452 549942 560234 571474 583911 597525 612055
63993 612055 627408 643859 661797 681407 702704 725846 751224 779147 809617 842564 878209
63982 878209 916944 958907 1003924 1051920 1103163 1158041 1216873 1280067 1348216 1421854 1501244
63971 1501244 1586688 1679022 1779745 1890723 2013896 2151251 2305015 2477850 2672762 2892815
63961 2892815 3141240 3422225 3741518 4105805 4521479 4994366 5530544 6136408 6817022
63952 6817022 7574278 8406633 9310001 10278269 11303308 12375341 13483300 14614140 15751209
63943 15751209 16873317 17955374 18970132 19890424 20691659 21353895 21862485 22207286 22381721
63934 22381721 22382389 22208861 21863344 21350974 20681244 19869616 18937652 17911122 16817066
63925 16817066 15681310 14527304 13375951 12245617 11151970 10108017 9124508 8210114
63917 8210114 7370903 6609771 5926781 5320026 4785971 4319222 3912842 3559551 3252709
63908 3252709 2986352 2754901 2553320 2377364 2223296 2087513 1966831 1859097 1763109 1677711
63898 1677711 1601095 1531074 1465939 1404903 1347755 1294176 1243504 1195099 1148720 1104319 1061513
63887 1061513 1019598 978200 937658 898482 860558 823194 785986 749408 714452 681851 651782
63876 651782 624208 599183 576688 556297 537271 519163 502230 487053 473713 461481 449456
63865 449456 437459 426250 416887 409860 404736 400483 396147 391338 386265 381474 377690 375677 375860 377845
63851 377845 380473 382679 384358 386326 389383 393474 397748 401348 404086 406427 408753 410628 410808 408081
63837 408081 402208 394120 385285 376789 368729 360314 350668 339783 328576 317858 307466 296761 285805
63824 285805 275441 266139 257397 248648 240200 232738 226330 220589 215615 211935 209423 207003 203667 199326
63810 199326 194473 189571 185084 181557 179161 177444 175890 174396 172933 171163 168913 166680 165091 164114
63796 164114 163343 162793 162730 162852 162389 161094 159505 158103 156788 155321 153737 152160 150703 149711 149563 150041
63780 150041 150428 150415 150304 150058 148926 146567 143929 142309 141891 141885 141759 141585 141301 140481 139029 137486 136369
63763 136369 135621 134919 134211 133696 133448 133281 132917 132229 131384 130714 130410 130419 130701 131424 132689 134209 135479 136255
63745 136255 136671 136974 137292 137546 137466 136800 135746 135028 135353 136886 139405 142683 146471 150340 154002 157742
63729 157742 162179 167599 173812 180531 187519 194394 200744 206545 212148 217696 222812 226892 229548 230663
63715 230663 230287 228649 226204 223549 221150 218989 216445 212846 208301 203748 199901 196453 192690 188569
63701 188569 184660 181190 177812 174373 171294 168917 166895 164534 161531 158204 155198 153072 151992 151715
63687 151715 151925 152494 153253 153736 153609 153322 153891 155920 159137 162907 166871 171043 175615 180723 186187 191554
63671 191554 196750 202464 209291 216553 222701 227003 230112 232708 234285 233820 231120 226950 222139 217023
63657 217023 211551 205511 198797 191740 185012 179018 173622 168617 164090 160158 156844 154540 154011 155417
63643 155417 157755 159802 161260 162455 163360 163760 164104 165239 167276 169525 171785 174890 179591 185504 191678
63628 191678 197840 204592 212548 221673 231438 241371 251451 262151 274039 287222 301259 315749 330943
63615 330943 347631 366461 387451 410144 434052 458753 483570 507323 528611 546348 559943
63604 559943 569042 573413 573232 569324 562925 555264 547354 539960 533461 527766 522482 517208 511614 505342
63590 505342 497931 488870 477727 464445 449581 434175 419291 405634 393361 381955 370402 357982
63578 357982 345111 333070 322779 314190 306957 301116 296652 292893 289045 285269 282709 282405 284442 288097
63564 288097 292520 297357 303035 310424 320010 331527 344562 359190 375577 393283 411615 430651
63552 430651 451328 474325 499221 524799 549787 573188 594281 612556 627488 638409 644918 647488
63540 647488 647334 645643 643185 640607 638583 637392 636624 635546 633546 630132 624706 616555 604995 589611
63526 589611 570586 548820 525423 501051 475906 450402 425429 401935 380436 360964 343178
63515 343178 326591 311080 297194 285542 275887 267344 259539 252947 247881 243808 240055 236639 233931
63502 233931 231972 230683 230311 231002 232249 233459 234907 237391 240995 244910 248651 252784 258159 264905 272482
63487 272482 280371 288320 296238 304196 312397 320817 328914 335935 341531 345951 349647 352771 354988 355739
63473 355739 354708 352048 348111 342964 336354 328264 319375 310835 303576 297858 293369 289611 286204 283042
63459 283042 280248 278011 276434 275437 274746 273972 272804 271178 269236 267160 265172 263699 263261 263978 265311
63444 265311 266638 268124 270761 275364 281727 288936 296388 304354 313685 325244 339444 355890 373403
63431 373403 390737 407556 424560 442624 462085 482929 505226 529008 554013 580054 607538
63420 607538 637096 668568 700647 731496 759370 782638 799805 810033 813597 811611 805369 796040
63408 796040 784734 772463 759926 747441 735108 722923 710672 697745 683179 666025 645799
63397 645799 622676 597340 570794 544265 518935 495438 473693 453439 434853 418369 404089
63386 404089 391758 381317 372984 366695 361934 358387 356419 356575 358839 362677 367643 373683 381020 389989
63372 389989 400847 413496 427517 442706 459461 478400 499691 522943 547659 573524 600387
63361 600387 628211 657028 686658 716446 745347 772169 795667 814663 828394 836623 839276 836283
63349 836283 828165 816482 803132 789258 775275 761730 749347 738099 726921 714724 701170 686199
63337 686199 669395 650353 629251 606504 582205 556540 530556 505820 483243 462730 443938
63326 443938 426762 411005 396197 382155 369323 358201 348703 340374 333010 326769 321853 318324 316030
63313 316030 314447 312801 310756 308822 307682 307205 306526 305104 303274 301671 300527 299669 298776 297363 294916
63298 294916 291472 287881 285060 283024 281032 278627 276206 274457 273559 273142 272844 272654 272766 273258 274011 274879
63282 274879 275889 277202 278873 280685 282197 282986 282963 282657 283066 284865 287623 290116 291644 292728 294203
63267 294203 295928 297006 297164 297281 298287 300073 301842 303219 304560 306317 308569 311229 314322 317865 321632
63252 321632 325311 328875 332605 336694 340967 345196 349604 354756 360901 367711 374852 382529 391246 401271
63238 401271 412726 425941 441144 457854 475230 493149 512417 533617 556266 579460 602921
63227 602921 626864 651120 675011 698083 720486 742460 763792 783955 802613 819870 836095
63216 836095 851618 866604 881202 895676 910131 924045 936243 945505 951049 952390 949070 940884
63204 940884 928155 911414 890846 866417 838650 808967 779032 749821 721431 693741 667110
63193 667110 642373 620279 601116 584948 571923 562080 555040 550269 547620 547172 548614 551365 555469
63180 555469 561731 570525 581006 591934 602878 614019 625231 636119 646768 657633 668624 679051
63168 679051 688610 697805 707142 716392 724904 732180 737879 741646 743306 743039 741026 737011 730394 720741
63154 720741 708285 694055 679411 665155 651113 636817 622403 608496 595373 582826 570859
63143 570859 559907 550246 541744 534343 528273 523542 519744 516586 514082 512022 509891 507721 506401 506576
63129 506576 507721 508888 509937 511412 513565 516226 519359 523027 526925 530630 534232 538134 542326 546508
63115 546508 550884 556031 561867 567441 572028 575933 579952 584475 589419 594654 600205 606173 612518 618683
63101 618683 623570 626474 628066 629830 632325 634596 635585 635448 635067 634855 634670 634478 634344 634030 633284 632446 632123
63084 632123 632299 632422 632416 632930 634415 636563 639004 641989 645939 650735 656066 662254 670031 679418 689403 699064
63068 699064 708621 719070 731047 744476 759163 775128 792275 810263 829077 849447 872288 897879
63056 897879 925883 955981 988072 1021941 1057285 1094195 1133179 1174524 1217955 1263068 1309645
63045 1309645 1357274 1404980 1451654 1496769 1540448 1583028 1624778 1665753 1705641 1743974 1780802
63034 1780802 1816961 1853285 1889774 1925932 1961583 1996637 2030038 2059632 2083340 2100026 2109012
63023 2109012 2109295 2099687 2079490 2048776 2008284 1959399 1904059 1844298 1781824 1718045 1654301 1591866
63011 1591866 1531926 1475719 1424464 1378918 1339214 1305374 1277696 1256222 1240083 1227924 1219053
63000 1219053 1213709 1212079 1213550 1217267 1223075 1231408 1242288 1254860 1268027 1281263 1294604 1308090
62988 1308090 1321544 1334826 1347852 1360177 1370894 1379279 1385380 1389545 1391466 1390093 1384506 1374400
62976 1374400 1359643 1339944 1315372 1286775 1255220 1221228 1184972 1147037 1108502 1070371 1033319
62965 1033319 997869 964328 932569 902363 873957 847929 824441 803130 783823 766793 752133
62954 752133 739372 728057 718264 710155 703323 697038 690953 685274 680396 676611 673924 671775 669132 665243
62940 665243 660216 654609 648731 642683 636823 631542 626665 621613 616245 611048 606369 601936 597352 592641
62926 592641 588063 583747 579773 576308 573380 570727 568242 566323 565422 565342 565352 565026 564645 564670 565039 565153 564575
62909 564575 563641 563310 564233 565962 567283 567453 566915 566609 566823 567090 567075 567092 567609 568635 569793 570721 571141 570782
62891 570782 569587 567926 566213 564292 561491 557462 552767 548505 545422 543485 542056 540309 537623 533938
62877 533938 529861 526252 523566 521640 520095 518772 517720 516937 516221 515198 513510 511134 508556 506426 504832
62862 504832 503153 500811 498025 495532 493684 492161 490525 488630 486463 483952 481188 478564 476523 475289
62848 475289 474897 475218 475866 476366 476637 477034 477737 478479 479154 480294 482410 485100 487423 489077 490635 492559
62832 492559 494611 496364 497804 499110 500296 501386 502596 503991 505248 506110 506811 507715 508805 509891 511089
62817 511089 512608 514225 515530 516627 518131 520339 522862 525154 527051 528677 530165 531681 533438 535542
62803 535542 538044 541158 545095 549631 554292 559184 565163 572841 581791 591195 601055 612199 625210 639835
62789 639835 655534 672142 689781 708453 728089 748976 771948 797976 827493 860211 895773
62778 895773 934571 977603 1025388 1077383 1132839 1191960 1255637 1324087 1396330 1471063 1547487
62767 1547487 1624833 1701426 1774819 1842792 1903890 1956875 2000015 2031250 2049048 2052941 2043206 2020277
62755 2020277 1984742 1937770 1881147 1816675 1745773 1669848 1590735 1510399 1430298 1351365 1274538
62744 1274538 1200933 1131441 1066427 1005846 949488 897197 849137 805812 767478 733514 702755
62733 702755 674441 648520 625118 604207 585929 570577 557939 547010 536740 526759 517201 508247
62721 508247 500163 493359 487914 483293 478972 475075 471978 469586 467644 466600 467417 470398 474736 479465
62707 479465 484454 490237 497241 505493 514880 525410 537244 550613 565681 582428 600657 620107
62695 620107 640624 662431 686298 713130 743054 775048 807791 840825 874543 909116 943803
62684 943803 977299 1008326 1035851 1059198 1078201 1092927 1102960 1107160 1104371 1094321 1077678 1055493
62672 1055493 1028735 998195 964554 928548 891193 853705 816959 781009 745355 709869 675412
62661 675412 643431 614851 589410 566176 544627 525087 508114 493751 481479 470527 459987
62650 459987 448980 437225 425395 414473 404783 396002 388033 381237 375657 370513 364806 358195 351085
62637 351085 344151 337947 332665 327951 323195 318273 313826 310540 308301 306325 304000 301348 298756 296537
62623 296537 294756 293293 292021 290975 290298 290002 289940 290105 290742 292057 294002 296587 300098 304704 309921 314895
62607 314895 319288 323627 328670 334620 341173 348241 356412 366540 378854 392675 407175 422426 439435
62594 439435 459120 481435 505623 531170 558326 587796 620091 655136 692367 731150 771037
62583 771037 811544 851801 890685 927259 960754 990041 1013515 1029819 1038473 1039626 1033466 1020281
62571 1020281 1000899 976639 948700 917810 884492 849488 813854 778708 744834 712465 681502
62560 681502 651985 624235 598477 574646 552729 533034 515781 500557 486458 472730 459091
62549 459091 445605 432539 420247 408876 398228 388089 378584 369959 362250 355518 350143 346277 343092
62536 343092 339208 334135 328811 324536 321827 320534 320487 321468 322881 324052 324869 325735 326944 328487 330485
62521 330485 333379 337448 342395 347600 352716 357942 363863 371176 380430 391720 404557 418189 432227
62508 432227 446971 463054 480835 500177 520759 542370 564755 587319 609124 629223 646918
62497 646918 661732 673279 681226 685366 685705 682427 675730 665697 652467 636607 619120 600912 582298
62484 582298 563160 543582 524136 505593 488558 473390 460264 449105 439532 431072 423565 417376
62472 417376 413126 411078 410763 411301 412133 413356 415403 418621 423179 429031 435736 442561 449165 456006 463678
62457 463678 471927 479799 486809 493469 500491 507936 515550 523549 532480 542340 552353 561782 570602 579102
62443 579102 587002 593324 597135 598219 596917 593502 587881 579814 569258 556515 542219 527134 511752
62430 511752 496040 479894 463927 449488 437598 428064 419973 412828 406765 401786 397464 393601 390626
62417 390626 388994 388567 388990 390384 393065 396713 400457 403988 408114 413864 421261 429324 437126 444482 451631
62402 451631 458663 465455 471887 477830 483055 487414 491052 494096 496059 495945 493232 488644 483543 478565
62388 478565 473137 466484 458882 451565 445457 440413 435971 432491 430933 431511 433238 435329 438605 444802
62374 444802 454559 466859 480569 495778 513166 532726 553937 576951 602843 632582 666340 703977
62362 703977 745605 791238 840186 891278 943713 997357 1052041 1106712 1159511 1208681 1253153
62351 1253153 1292064 1323993 1347100 1360078 1362750 1355874 1340828 1319507 1293741 1264362 1231215 1194421
62339 1194421 1155156 1114745 1073573 1031604 989614 949073 910946 875360 842411 812493 785713
62328 785713 761681 739976 720132 701135 681881 662520 644598 629325 616286 604345 593190
62317 593190 583338 575133 568496 563405 559879 557524 555726 554275 553308 552585 551303 548717 544617 539142 532521
62302 532521 525207 517930 511356 505650 500468 495334 490005 484527 479089 473954 469573 466488 464949 464740
62288 464740 465646 467809 471251 475305 479170 483015 487819 494010 501007 508335 516376 525555 535552 546028
62274 546028 557498 570714 585591 601507 618266 635920 654009 672003 690449 710671 733218
62263 733218 757505 783196 811103 842265 876848 914412 954758 997994 1044028 1092344 1141968
62252 1141968 1191353 1238469 1281219 1317670 1346000 1364830 1373895 1373978 1365905 1349993 1326723 1297462
62240 1297462 1263951 1227207 1187362 1144614 1100088 1055707 1013275 973570 936341 901383 869532
62229 869532 842163 819677 801000 784913 771356 760896 753271 747156 741424 736094 731848 728921 726705
62216 726705 724344 721513 718503 715588 712434 708395 703351 697914 692744 688026 683870 680860 679747 680720
62202 680720 683294 686828 690840 694974 699119 703694 709514 717199 726767 737795 749834 762754 776882
62189 776882 792827 810935 830900 852018 873752 895811 917686 938465 957319 974048 989003
62178 989003 1002513 1014559 1025092 1034567 1044014 1054436 1066246 1079553 1094960 1113675 1136598 1163504
62166 1163504 1193397 1225411 1259029 1293671 1328506 1362574 1394610 1422839 1445599 1462385 1473839
62155 1473839 1480544 1482345 1479211 1472213 1463025 1452560 1440575 1426486 1410173 1392115 1373305 1355079
62143 1355079 1338537 1323876 1310650 1298790 1288997 1281890 1277150 1273851 1271346 1269388 1267619 1265595 1263451
62130 1263451 1262109 1262532 1264966 1269049 1274387 1280817 1288316 1297001 1307145 1318920 1332141 1346493 1362013
62117 1362013 1379098 1397974 1418355 1439790 1462156 1485569 1509874 1534493 1558964 1583495 1608824
62106 1608824 1635526 1663571 1692620 1722528 1753358 1785028 1817260 1849977 1883464 1917925 1953120
62095 1953120 1988748 2025083 2062854 2102518 2143982 2187015 2231422 2276463 2320536 2362045 2400717
62084 2400717 2437838 2475287 2514588 2556674 2601773 2649036 2696658 2742975 2787454 2830331 2871465
62073 2871465 2910196 2946519 2981838 3018125 3056594 3097563 3141264 3188127 3238300 3291466 3347215
62062 3347215 3404989 3463430 3520363 3573931 3623470 3668904 3709698 3744980 3774443 3798486 3817522
62051 3817522 3831731 3841496 3847427 3849762 3848269 3842961 3834394 3823003 3808644 3791287 3771783 3751469
62039 3751469 3731140 3710784 3690154 3669231 3648283 3627842 3608547 3590702 3574023 3558077 3542781
62028 3542781 3528180 3513994 3499944 3486410 3474195 3463527 3453847 3444729 3436448 3429375 3423256 3417584
62016 3417584 3412430 3408506 3406477 3406444 3407991 3410500 3413547 3417198 3421839 3427563 3433841 3440025 3446000 3452102
62002 3452102 3458533 3465153 3471750 3478173 3484139 3489115 3492386 3493071 3490231 3483278 3472296 3457598 3438924
61989 3438924 3415409 3386461 3352494 3314723 3274510 3232982 3190910 3148598 3106051 3063454 3021379
61978 3021379 2980391 2940620 2901930 2864304 2827867 2792651 2758620 2725835 2694340 2664032 2634820
61967 2634820 2606807 2580092 2554570 2530283 2507775 2487599 2469477 2452440 2435874 2419921 2404699
61956 2404699 2389699 2374370 2358921 2344096 2330365 2317709 2305975 2294992 2284462 2274249 2264802
61945 2264802 2256921 2251020 2246839 2243795 2241369 2239290 2237809 2237804 2240132 2244788 2251111 2258881 2268691 2281019
61931 2281019 2295551 2311958 2330900 2353621 2380680 2411750 2446699 2486297 2531646 2583337 2641567
61920 2641567 2706864 2780482 2864185 2959834 3069118 3193557 3334798 3494951 3676613 3882557
61910 3882557 4115535 4378420 4674371 5006842 5379591 5796819 6263038 6782578 7359021
61901 7359021 7994765 8690204 9441986 10240743 11069237 11901543 12703419 13433960 14048802
61892 14048802 14504980 14767199 14814349 14643820 14271245 13725846 13044469 12267118 11433787
61883 11433787 10580964 9738224 8927027 8162006 7452502 6803000 6213780 5682948 5208252
61874 5208252 4786797 4413819 4083103 3789041 3527809 3296498 3091885 2910414 2748843
61865 2748843 2604445 2474935 2358600 2254292 2160936 2077164 2001655 1933636 1872771 1818814
61855 1818814 1771613 1731158 1697102 1668289 1643158 1620721 1600950 1584255 1570835 1560453 1552447
61844 1552447 1545818 1539600 1533382 1527436 1522254 1518006 1514451 1511320 1508684 1506897 1506172 1506286 1506922 1508266 1510932
61829 1510932 1515138 1520285 1525647 1531213 1537457 1544453 1551694 1558744 1565597 1572352 1578977 1585553 1592416 1599922
61815 1599922 1608380 1618301 1630408 1645144 1662439 1682113 1704288 1729265 1757340 1788997 1824977 1865843
61803 1865843 1911617 1962127 2017575 2078588 2145871 2220039 2301538 2390452 2486625 2590402 2703133
61792 2703133 2826542 2961719 3109292 3270607 3448202 3644921 3863132 4105213 4374336
61783 4374336 4674159 5007905 5378437 5789435 6246160 6754843 7321671 7952628 8654152
61774 8654152 9433592 10298903 11257787 12316555 13478690 14743102 16102099 17538826 19024042
61765 19024042 20513131 21945216 23246204 24336109 25139411 25596112 25670864 25358100 24682236
61756 24682236 23693312 22459011 21054625 19553210 18018505 16501807 15041844 13665846
61748 13665846 12390831 11225245 10170945 9225090 8381664 7632768 6969689 6383541 5865495
61739 5865495 5407041 5000417 4638956 4317090 4030204 3774401 3546268 3342664 3160685
61730 3160685 2997736 2851484 2719769 2600721 2492900 2395181 2306519 2225996 2152984 2086897
61720 2086897 2026647 1970624 1917478 1866830 1819065 1774487 1732841 1693543 1656208 1620877 1587885
61709 1587885 1557501 1529691 1504070 1480004 1456768 1433816 1411116 1389092 1368021 1347544 1326990
61698 1326990 1306210 1285831 1266620 1248823 1232167 1216247 1200725 1185355 1169966 1154464 1138904
61687 1138904 1123724 1109729 1097465 1086606 1076382 1066682 1058225 1051361 1045262 1038830 1032018 1025613 1019848
61674 1019848 1013963 1007303 1000259 993738 988047 982690 977106 971184 965034 958636 952033 945686 940202 935484
61660 935484 930452 923995 916157 908051 900655 894113 888295 883421 879739 876961 874526 872248 870276 868603
61646 868603 867134 866158 866180 867197 868588 869909 871436 873731 876986 881007 885591 890576 895695 900684 905528
61631 905528 910447 915618 920944 926097 930735 934790 938504 942052 945116 947104 947905 948121 948229 947660 945148
61616 945148 940122 933439 926568 920225 914019 907256 899724 891590 882936 873698 864027 854426 845455 837429
61602 837429 830395 824235 818684 813363 807988 802640 797872 794443 792736 792332 792322 792258 792700 794630 798472 804011
61586 804011 811094 819880 830264 841610 853414 865935 879878 895641 913153 932209 952682 974537
61574 974537 997967 1023398 1051060 1080637 1111565 1143601 1176865 1211397 1246894 1282879 1318938
61563 1318938 1354810 1390324 1425120 1458434 1489450 1518079 1545032 1570805 1594904 1616486 1635577
61552 1635577 1653149 1669957 1685683 1699188 1709311 1715430 1717598 1716224 1711504 1703294 1691666 1677306
61540 1677306 1661026 1643138 1623750 1603469 1583315 1564047 1546045 1529702 1515335 1502796 1491836
61529 1491836 1482902 1476946 1474354 1474724 1477913 1484694 1496073 1512498 1534054 1560966 1593556 1632093 1677112
61516 1677112 1729573 1790424 1860254 1939596 2029301 2130315 2243419 2369412 2509362 2664528
61506 2664528 2836296 3026174 3235271 3463583 3710145 3973934 4253777 4546781 4847096
61497 4847096 5146265 5434001 5698367 5926610 6107591 6234031 6302499 6312338 6265781 6168623
61487 6168623 6029159 5855826 5656342 5438829 5212304 4985204 4763821 4552465 4354389
61478 4354389 4171923 4006166 3857321 3725454 3610802 3513599 3433929 3371548 3325557 3294416
61468 3294416 3276619 3271357 3278349 3297051 3326183 3364014 3408952 3459867 3515916 3576095 3639025 3703157
61456 3703157 3767090 3829633 3889845 3947314 4002269 4055106 4105855 4154443 4201487 4248399 4296574
61445 4296574 4346710 4398904 4452923 4508146 4563601 4618372 4671833 4723263 4771473 4815078 4852979
61434 4852979 4884371 4908446 4924446 4932002 4931180 4922165 4905055 4879955 4847178 4807433 4762033 4712909
61422 4712909 4662158 4611389 4561495 4513087 4467101 4424878 4387588 4355663 4328950 4307431 4291522
61411 4291522 4281440 4276458 4275097 4276016 4278348 4281082 4282579 4281046 4275379 4265389 4251433 4234075 4214001
61398 4214001 4192086 4169707 4149190 4133696 4126224 4128637 4141848 4166880 4205460 4259734 4331837 4423837
61386 4423837 4537566 4674109 4833677 5016288 5222435 5452720 5706880 5983379 6279721
61377 6279721 6592428 6916180 7243056 7562826 7864026 8134912 8364215 8542237 8662233
61368 8662233 8721264 8720003 8661879 8552118 8396781 8201875 7972960 7715564 7435856 7140626
61358 7140626 6836381 6528323 6220189 5915141 5616911 5330082 5059091 4806694 4573311
61349 4573311 4357851 4159205 3977121 3812028 3664346 3533981 3420229 3322037 3238453 3168899
61339 3168899 3113033 3070407 3040349 3022196 3015423 3019425 3033266 3055797 3086060 3123484 3167618 3217730
61327 3217730 3272682 3331129 3391714 3453086 3513926 3573084 3629645 3682734 3731412 3775012 3813604
61316 3813604 3847867 3878417 3905413 3928898 3949225 3966921 3982305 3995505 4006726 4016089 4023073 4026332
61304 4026332 4024252 4015696 4000274 3978037 3949035 3913117 3870087 3820023 3763454 3701382 3635296 3567097
61292 3567097 3498589 3430741 3363612 3297253 3232623 3171363 3114810 3063534 3017731 2977633 2943415
61281 2943415 2915034 2892302 2874820 2861652 2851282 2842116 2832946 2822864 2811070 2797048 2780864 2763079
61269 2763079 2744444 2725785 2707983 2691763 2677591 2666079 2658504 2656643 2661960 2675065 2695935 2724433
61257 2724433 2760521 2804255 2855920 2916188 2986078 3066769 3159478 3265180 3383911 3514088 3652655
61246 3652655 3796063 3940858 4083013 4216827 4334911 4429519 4493829 4522279 4510744 4457492
61236 4457492 4364326 4236444 4080925 3905240 3716791 3522915 3330426 3144739 2969407 2806335
61226 2806335 2656317 2519427 2395284 2283329 2183023 2093764 2014576 1944040 1880819 1824364
61216 1824364 1774925 1732653 1696824 1666142 1639705 1617403 1599434 1585785 1576287 1570847 1569369 1571561
61204 1571561 1577057 1585676 1597415 1612179 1629618 1649076 1669564 1689879 1708970 1726277 1741546 1754253
61192 1754253 1763322 1767591 1766636 1761045 1751883 1739957 1725626 1709120 1690721 1670614 1648831 1625565
61180 1625565 1601331 1576612 1551562 1526335 1501576 1478087 1455963 1434415 1412628 1390484 1368216
61169 1368216 1345629 1322076 1297120 1270884 1243659 1215352 1185528 1154026 1121511 1089378 1059003
61158 1059003 1030912 1004585 979035 953747 929225 906695 887128 870403 855445 841184 827223
61147 827223 813528 799766 785238 769379 752183 734267 716707 700538 686080 672998 661316
61136 661316 651990 645852 642313 639989 638579 639126 642213 646916 652094 657843 664855 673026 681590 690238
61122 690238 699180 708356 717467 726691 736454 746482 755921 764534 773018 781946 791175 800672 811121 823152
61108 823152 836389 849796 862675 874850 886024 895386 901798 904237 902319 896755 889105 880689 871663
61095 871663 861301 849156 835835 822687 810748 799926 789182 777687 765777 754611 744957 736579
61083 736579 728706 720694 712239 703463 695049 687890 682318 677939 674304 671345 669034 667168 665791 665325
61069 665325 665891 666961 668115 669615 671669 673598 674478 674299 673691 672716 670764 667593 663631 659174 654063
61054 654063 648417 642891 637922 633277 628753 624749 621803 620015 619326 619847 621455 623569 625922 629227 634447
61039 634447 641504 649418 657708 667064 678314 691117 704060 716000 727073 738337 750518 763274
61027 763274 775636 786941 797177 806645 815675 824597 833543 842202 850178 857758 865987 875774 887211
61014 887211 899919 913728 928793 945424 964064 985136 1008666 1034350 1062268 1093145 1127702
61003 1127702 1166137 1208526 1255194 1306133 1360512 1417490 1477387 1541626 1611864 1689770 1777424
60992 1777424 1877221 1991479 2122590 2273099 2444684 2637236 2850042 3084248 3343792 3634421
60982 3634421 3963217 4339423 4774592 5281391 5873452 6567394 7384596 8351105 9498079
60973 9498079 10863846 12490955 14408314 16598355 18965460 21329420 23458233 25133289
60965 25133289 26220989 26719388 26759257 26558707 26348664 26295828 26448689 26722852 26929253
60956 26929253 26837229 26254049 25092971 23400115 21327229 19068379 16799005 14645431
60948 14645431 12683836 10950659 9452581 8176348 7099459 6197931 5448654 4829338
60940 4829338 4319082 3898865 3550945 3258894 3009244 2792407 2601207 2429311 2271955
60931 2271955 2127257 1995291 1875802 1767534 1669350 1580748 1501106 1429262 1364021 1304332
60921 1304332 1248763 1195530 1143533 1093010 1044895 999827 958023 919668 884963 853860 826010
60910 826010 800958 778231 757326 737825 719591 702798 687731 674550 663164 653249 644389 636298
60898 636298 628963 622557 617134 612478 608440 605481 604615 606536 610839 616369 622308 628738 636228 645179
60884 645179 655567 666928 678377 688900 697904 705367 711388 715804 718373 719074 718055 715435 711325
60871 711325 705823 698858 690297 680463 670304 660742 651952 643527 635163 626955 619239 612459 607033 602960
60857 602960 599672 596644 594129 592918 593427 595389 598427 602478 607576 613701 621060 630130 641077 653395
60843 653395 666421 680110 694983 711390 728973 746794 763762 779063 792420 803990 813926 822197
60831 822197 828950 834875 840795 846865 852460 856941 860326 863101 865630 867904 869656 870560 870490 869841 869374
60816 869374 869392 869147 867383 863480 857773 850861 843051 834553 825659 816414 806491 795680 784224 772296
60802 772296 759568 745880 732121 719777 709545 700924 693226 686426 680756 676033 671883 668438 666391
60789 666391 666326 668160 671246 674981 679305 684584 690980 698193 706035 714972 725591 737649 750292 763268
60775 763268 777279 792932 809998 828008 846895 866435 885614 903353 919625 935177 950316
60764 950316 964685 978076 990566 1001679 1010223 1015510 1018288 1020000 1021350 1021966 1021280 1019311 1016572 1013575
60750 1013575 1010563 1007579 1004608 1001651 998773 996145 993956 992129 990111 987209 983266 978862 974633 970546
60736 970546 966005 960508 953945 946327 937631 927983 917832 907779 898323 889757 882187 875645 870221 866098
60722 866098 863451 862425 863223 865990 870452 875928 881929 888603 896284 904664 912704 919345 924122 927149
60708 927149 928746 929099 928124 925650 921842 917260 912348 907064 901269 895279 889692 884837 880819 877976 876758
60693 876758 877017 877765 877763 876148 872585 867150 860123 851602 841358 829431 816722 804421 792710 780627
60679 780627 767443 753699 740554 728542 717406 706883 697238 689117 683179 679705 678334 678302 679167
60666 679167 681167 684668 689447 694729 699749 704035 707369 709811 711719 713451 714990 716000 716212 715676 714742
60651 714742 713956 713762 714124 714538 714635 714655 715124 716190 717596 719193 721160 723617 726309 728732 730491 731568
60635 731568 732449 733953 736628 740189 743826 747264 751353 757364 765767 775999 787350 799721 813310
60622 813310 827921 843045 858556 874837 892042 909627 926856 943425 959218 973761 986431
60611 986431 997142 1006343 1014289 1020709 1025189 1027531 1027738 1026084 1023210 1019609 1014924 1008339 999803 990187
60597 990187 979840 967734 952764 935447 917622 900698 884996 870598 857972 847507 839220 833189
60585 833189 829739 828731 829073 829401 829081 828298 827337 826160 824557 822349 819412 815696 811295 806458 801573
60570 801573 797250 794299 793351 794477 797332 801716 807756 815431 824093 832766 840890 848559 855987 863061
60556 863061 869564 875576 881294 886657 891476 895926 900483 905303 910034 914402 918715 923604 929531 936751
60542 936751 945483 955860 967885 981744 998144 1018177 1042833 1072578 1107004 1144623 1183143 1220164
60530 1220164 1253535 1281071 1300409 1309670 1308206 1296667 1276613 1250334 1220485 1189229 1157828 1127474
60518 1127474 1100253 1078549 1063497 1054620 1050969 1051922 1056745 1064229 1073363 1083941 1096088 1109507 1123624
60505 1123624 1138178 1153239 1168933 1185693 1204727 1227750 1256181 1290882 1332676 1382727 1442271
60494 1442271 1512209 1593090 1685348 1789343 1905227 2033014 2173114 2326965 2497018 2685931
60484 2685931 2895981 3129643 3390512 3682605 4007566 4361703 4734728 5109996 5465307
60475 5465307 5774745 6012385 6156905 6194880 6121984 5943158 5672246 5330161 4941289 4529615
60465 4529615 4116148 3717536 3345183 3005184 2699652 2428699 2191586 1986660 1811105
60456 1811105 1661266 1533266 1423468 1328829 1247187 1177100 1117212 1065792 1021058 981884 947917
60445 947917 918894 893960 871814 851423 832394 814571 797469 780397 763155 746314 730632
60434 730632 716333 703180 691114 680428 671231 663088 655446 648250 641910 636766 632803 629749 627159
60421 627159 624480 621398 618276 615969 615010 615134 615756 616722 618349 620809 623782 626747 629446 631946 634380
60406 634380 636760 639026 641171 643313 645662 648496 652111 656652 661930 667535 673250 679254 685715 692265
60392 692265 698265 703589 708762 714087 718979 722524 724456 725172 724998 723981 722356 720599 718756 716254 712774
60377 712774 708928 705574 702703 699590 696027 692817 690844 690041 689584 688838 687805 686840 686275 686313 686963 687933
60361 687933 688767 689203 689335 689505 690121 691533 693784 696474 699137 701916 705558 710504 716228 721889 727484
60346 727484 733905 741761 750625 759623 768464 777580 787493 798278 809437 819942 828590 834738 838740
60333 838740 841430 843264 844306 845022 846508 849687 854645 861053 868835 877965 887818 897347 905892 913308
60319 913308 919131 922235 921729 917832 911432 903029 892689 880907 868843 857478 847111 837948 830658
60306 830658 825785 822895 820904 819249 818269 818500 820091 822956 826884 831235 835038 837907 840565 844069 848702
60291 848702 854064 860006 866822 874491 882354 889883 897291 904920 912270 918218 922205 924784 926875 928888
60277 928888 930786 932649 934725 937103 939782 943095 947658 953771 961190 969690 979502 990969 1004105 1018897
60263 1018897 1035829 1055662 1078745 1104922 1134068 1166308 1201708 1240202 1281948 1327407 1377056
60252 1377056 1431436 1491523 1558475 1632705 1713704 1801167 1895911 1999239 2111688 2232805 2361879
60241 2361879 2498270 2640996 2788383 2938138 3087552 3233782 3374265 3506792 3629005
60232 3629005 3738165 3831912 3909045 3969080 4011231 4034520 4038897 4025722 3997070 3955224 3902915
60221 3902915 3843289 3779176 3712832 3646771 3584347 3529076 3483620 3449732 3428689 3421234 3427467 3447472
60209 3447472 3482017 3532148 3598216 3679791 3776383 3887538 4012016 4147397 4290703 4438948
60199 4438948 4588749 4735888 4875758 5004239 5117942 5213897 5289522 5342984 5373320 5380194
60189 5380194 5363756 5324783 5264690 5185379 5089331 4979999 4861803 4739383 4616832 4497773
60179 4497773 4385920 4285029 4198085 4126809 4072191 4035244 4016892 4017218 4035290 4069866 4119989
60168 4119989 4184606 4261774 4348471 4441173 4536377 4630522 4719775 4800346 4869231 4924619 4965555
60157 4965555 4991356 5001511 4996125 4976334 4944304 4903000 4855939 4806823 4759127 4716067 4681035
60146 4681035 4657835 4650244 4661299 4693027 4746614 4822610 4921205 5042809 5188418 5359195 5555722
60135 5555722 5778059 6026553 6302140 6605644 6937044 7295509 7679540 8086455 8511851
60126 8511851 8949933 9394377 9838551 10275108 10695918 11092606 11457080 11781801 12060225
60117 12060225 12287402 12459965 12575327 12631043 12625126 12556847 12427155 12238670 11995660 11704031
60107 11704031 11371159 11005705 10617567 10217537 9816312 9423469 9047399 8695918 8376273
60098 8376273 8094101 7852639 7653358 7497358 7385766 7318792 7294854 7311010 7364129 7451224
60088 7451224 7568486 7710271 7869309 8037847 8208284 8372712 8522491 8649100 8745837 8808730
60078 8808730 8835974 8826961 8782023 8702695 8591613 8451990 8287283 8101157 7897398 7679665
60068 7679665 7451534 7216817 6979700 6744423 6514830 6294204 6085484 5891571 5715345
60059 5715345 5559134 5424126 5310615 5219043 5150554 5106298 5086523 5090879 5119328 5172018 5248148
60048 5248148 5345583 5461760 5594345 5740608 5896561 6057064 6216520 6369279 6509892 6633509
60038 6633509 6735956 6813366 6862252 6880358 6867111 6822924 6748522 6645421 6516616 6366199
60028 6366199 6198621 6018810 5832475 5645307 5461882 5285932 5121312 4971616 4838810
60019 4838810 4723254 4625420 4546867 4489253 4453274 4439032 4446817 4477005 4529775 4605471 4704727
60008 4704727 4827606 4972989 5139334 5325595 5530512 5751009 5981690 6215681 6445462
59999 6445462 6663301 6862060 7036215 7181972 7296397 7376888 7421583 7429731 7401371 7337038
59989 7337038 7238261 7108298 6952128 6775740 6585504 6387963 6189663 5996777 5814680 5647766
59979 5647766 5499525 5372619 5268837 5189027 5133232 5101082 5092228 5106572 5144101 5204368 5285865
59968 5285865 5385828 5500764 5627223 5762030 5901858 6042816 6180730 6311833 6433120 6542119
59958 6542119 6636646 6715025 6776610 6821909 6852092 6868455 6872565 6866844 6854723 6840188 6827485 6821379
59946 6821379 6827130 6849657 6892808 6959842 7054455 7180845 7342671 7542400 7781754 8062405
59936 8062405 8385870 8752776 9162142 9610982 10094290 10605217 11134928 11671769 12200507
59927 12200507 12702774 13158645 13548202 13852806 14056836 14149904 14128149 13993946 13755024 13423952
59917 13423952 13017406 12554488 12054657 11536326 11016074 10507885 10022650 9568541 9151927
59908 9151927 8777831 8449579 8168455 7934121 7745721 7602731 7504830 7451164 7440175 7470233
59898 7470233 7539944 7647365 7789284 7961832 8161365 8383650 8622028 8867166 9108756 9336513
59888 9336513 9539314 9704719 9820731 9878058 9870684 9795510 9652855 9447163 9186163 8879086
59878 8879086 8535911 8167520 7785014 7398274 7015474 6643681 6288954 5955570 5646008
59869 5646008 5362138 5105889 4878388 4678995 4505779 4356747 4230259 4124464 4036896 3964770
59859 3964770 3905413 3856197 3814066 3775392 3736672 3695727 3652338 3607789 3563872 3522199 3483980
59848 3483980 3450108 3421456 3399091 3383877 3375619 3372796 3373162 3374173 3372741 3365367 3349342 3323664 3288440
59835 3288440 3243895 3190709 3130972 3067880 3004433 2942986 2885819 2835075 2791856 2756115 2727749
59824 2727749 2707277 2695339 2692202 2698034 2712982 2736538 2767380 2804293 2846866 2894936 2947897 3005197
59812 3005197 3067187 3134749 3207980 3285533 3365097 3443932 3518830 3586182 3642788 3686943 3718666
59801 3718666 3738883 3748637 3749302 3743256 3733607 3723052 3713514 3707146 3706935 3715674 3734910 3765756 3810212
59788 3810212 3870588 3947918 4042332 4155250 4289978 4449820 4636892 4853512 5103559 5391245
59778 5391245 5719074 6087722 6496851 6944038 7421902 7915956 8404193 8857796 9243612
59769 9243612 9529677 9692352 9721308 9620359 9405335 9100649 8734850 8335805 7927203 7527440
59759 7527440 7150048 6804349 6496036 6227752 5999617 5809816 5655611 5534419 5444100 5382438
59749 5382438 5346947 5335487 5346821 5380298 5435221 5510805 5606590 5722671 5859529 6017841 6198345
59738 6198345 6401717 6628648 6880280 7158531 7465835 7804542 8176789 8584883 9031386
59729 9031386 9518539 10047845 10620561 11238331 11902426 12611752 13361585 14144189 14949980
59720 14949980 15767563 16583239 17381956 18149828 18876262 19554706 20183136 20765065 21309945
59711 21309945 21831650 22345888 22868187 23412687 23990754 24609290 25269602 25967217 26692116
59702 26692116 27429070 28158298 28856546 29498466 30058575 30514066 30847915 31051030 31122724
59693 31122724 31069967 30906290 30650711 30326546 29959890 29577770 29206305 28869271 28587162
59684 28587162 28376792 28251552 28222299 28298178 28486716 28793587 29222871 29777693 30460121 31269968
59674 31269968 32203407 33251821 34400234 35625234 36893596 38162448 39380219 40488036
59666 40488036 41422869 42123523 42537963 42629510 42381120 41797968 40907342 39754741 38397531
59657 38397531 36899023 35323690 33732187 32176152 30695027 29315833 28053803 26911839
59649 26911839 25879694 24935002 24046614 23179291 22299309 21380516 20409224 19385892 18323209
59640 18323209 17241860 16165609 15116916 14114116 13170481 12294424 11489987 10757560 10095109
59631 10095109 9499281 8965798 8489570 8065289 7688110 7353508 7056666 6792798 6558360
59622 6558360 6351553 6171195 6015296 5880943 5765218 5665748 5580428 5507089 5443573 5387813
59612 5387813 5337523 5289897 5241728 5189927 5131985 5066144 4991301 4906936 4813249 4711417 4603560
59601 4603560 4492213 4379701 4267983 4158871 4054167 3955567 3864628 3782697 3710527 3647867
59591 3647867 3593809 3547819 3510188 3481307 3460865 3448169 3442980 3445306 3454352 3468299 3485540 3505727
59579 3505727 3529161 3555416 3583089 3610953 3638942 3667816 3698087 3729623 3762323 3797022 3835529
59568 3835529 3879722 3930736 3989206 4056176 4133362 4222311 4323587 4437084 4563063 4702574
59558 4702574 4856942 5027255 5214497 5419818 5644393 5889109 6154557 6441086 6748460
59549 6748460 7075414 7419741 7778835 8149863 8529321 8912735 9295114 9671650 10037928
59540 10037928 10389837 10723912 11037950 11331130 11603454 11855141 12086342 12296917 12486415
59531 12486415 12654887 12804298 12939036 13064779 13186932 13310050 13437773 13571870 13710690
59522 13710690 13848643 13977243 14086388 14164902 14201003 14183416 14102806 13952702 13730015 13435388
59512 13435388 13073186 12650892 12178317 11667017 11129672 10579054 10026938 9483498 8957066
59503 8957066 8453927 7978310 7532911 7119608 6739736 6393911 6082007 5803460 5557414
59494 5557414 5342460 5156441 4996820 4861344 4748363 4656657 4585196 4533126 4499755 4484315
59484 4484315 4485881 4503817 4538308 4590130 4659773 4747042 4851716 4974317 5115990 5277786 5460353
59473 5460353 5664083 5889125 6135141 6401315 6686422 6988365 7303330 7625470 7947317
59464 7947317 8260268 8554700 8820162 9046025 9222338 9340621 9394658 9381150 9299914 9153740
59454 9153740 8948251 8691604 8393465 8063674 7711594 7346293 6976592 6610421 6254166
59445 6254166 5912702 5589784 5288170 5009514 4754258 4521686 4310278 4118448 3945129
59436 3945129 3789575 3650736 3527203 3417768 3321632 3237933 3165486 3103228 3050623 3007409
59426 3007409 2973138 2947074 2928318 2915956 2909361 2908397 2913003 2922518 2935845 2952408 2972436 2996087
59414 2996087 3022838 3052269 3085129 3122995 3166738 3215485 3266983 3318862 3369787 3419843 3470181
59403 3470181 3522665 3580106 3646499 3726249 3822832 3938380 4074314 4231547 4409819 4607628
59393 4607628 4823500 5057365 5310928 5587677 5892999 6233436 6614797 7040884 7514079
59384 7514079 8036229 8607980 9227360 9889408 10586619 11308828 12042810 12772981 13483226
59375 13483226 14158690 14787013 15359176 15869650 16315797 16697565 17017751 17281352 17493176
59366 17493176 17655749 17769744 17835567 17853325 17821346 17735850 17592515 17388186 17121871 16795730
59356 16795730 16415993 15992669 15538184 15066336 14591529 14127051 13682714 13263746 12871290
59347 12871290 12503005 12153347 11814718 11479483 11141034 10793429 10431513 10052501 9657347
59338 9657347 9250234 8836895 8423324 8015168 7617498 7234950 6871894 6531921 6217061
59329 6217061 5927905 5664617 5427291 5215302 5027048 4860743 4715074 4588895 4480810
59320 4480810 4389371 4313236 4250950 4201132 4163170 4137166 4122794 4118752 4123821 4138099 4162640 4198033
59308 4198033 4243621 4297818 4358941 4425933 4498433 4575879 4656545 4737890 4817898 4895436 4969207
59297 4969207 5037194 5097576 5149588 5193134 5228319 5255942 5277780 5295703 5311100 5325841 5343096
59286 5343096 5366175 5396945 5436351 5486208 5549261 5627457 5721102 5829844 5953524 6091679 6242933
59275 6242933 6405190 6575768 6750819 6925082 7092630 7247685 7384520 7497044 7579149 7625767
59265 7625767 7633974 7603773 7538233 7442729 7323749 7188251 7043665 6897438 6755847 6623235
59255 6623235 6502584 6396377 6306450 6233155 6175328 6131303 6099779 6079712 6069792 6068377 6073784
59244 6073784 6084536 6099574 6118743 6143227 6175353 6217883 6273583 6345374 6436486 6550208 6689701
59233 6689701 6858311 7059790 7297708 7574488 7891068 8247126 8640809 9067681 9519787
59224 9519787 9985621 10450728 10898458 11310821 11669540 11957086 12157771 12259116 12253208 12137282
59214 12137282 11913495 11588700 11174513 10686851 10144402 9566611 8972081 8377427 7796372
59205 7796372 7239393 6714109 6225877 5777918 5371149 5004408 4675226 4380712 4118109
59196 4118109 3884931 3678755 3496995 3336888 3195634 3070448 2958706 2858351 2768173 2687364
59186 2687364 2614778 2548939 2488797 2434090 2384732 2340219 2299897 2263574 2231553 2204116 2181168
59175 2181168 2162309 2147115 2135484 2127854 2125022 2127607 2135709 2148992 2166894 2188778 2214195 2243137
59163 2243137 2275842 2312284 2352143 2395403 2442686 2494736 2551717 2613171 2678563 2747754 2821082
59152 2821082 2899082 2981986 3069409 3160589 3254866 3351674 3450016 3548246 3644407 3736574 3822898
59141 3822898 3901686 3971554 4031321 4079834 4116272 4140595 4153373 4155286 4147409 4131958 4112025 4090307
59129 4090307 4068714 4049443 4035609 4030216 4035029 4051098 4079978 4123709 4183808 4260941 4355525 4468164
59117 4468164 4599453 4749832 4919696 5109419 5319145 5548564 5796637 6061364 6339894
59108 6339894 6628782 6923568 7217700 7502034 7765636 7997102 8185586 8321901 8399877 8417112
59098 8417112 8374684 8276790 8130794 7946596 7734662 7504204 7262872 7017064 6771498 6528693
59088 6528693 6289484 6054020 5822046 5592968 5366590 5143691 4925336 4711927 4503589
59079 4503589 4301116 4105656 3917651 3737011 3564268 3400626 3246713 3102122 2966442
59070 2966442 2840002 2723336 2616511 2519257 2431158 2351389 2278749 2212327 2151794 2096931 2047329
59059 2047329 2002754 1963239 1928449 1897387 1869078 1843164 1819407 1796904 1774264 1750447 1725081
59048 1725081 1698021 1668897 1637140 1602463 1565469 1527906 1492037 1459375 1429923 1402705 1377048
59037 1377048 1353389 1332991 1316930 1305261 1297057 1291281 1287670 1286760 1289223 1295262 1304477 1316043 1329051
59024 1329051 1342890 1357308 1371887 1385536 1396832 1404989 1410291 1413418 1414584 1413609 1410782 1407249 1404313
59011 1404313 1402496 1401656 1402000 1404465 1409798 1417640 1427001 1437407 1449013 1461775 1475230 1488997 1502668
58998 1502668 1515111 1524965 1532335 1539146 1547071 1555704 1563526 1570143 1576614 1583919 1592001 1600327 1608666 1617194
58984 1617194 1626372 1636770 1648653 1661792 1675906 1690991 1706958 1723396 1740193 1757961 1777292
58973 1777292 1798051 1820059 1844021 1870917 1900827 1933247 1968191 2005975 2046105 2087518 2129900
58962 2129900 2173705 2218858 2264535 2310347 2356540 2402774 2447950 2491840 2535813 2581304 2628507
58951 2628507 2677448 2729533 2787015 2851303 2922592 3000857 3086457 3179924 3281831 3392926 3514058
58940 3514058 3646085 3790040 3947050 4117755 4302207 4500853 4715455 4948666 5202894
58931 5202894 5479947 5781517 6109489 6465851 6852737 7272671 7728477 8222906 8758499
58922 8758499 9337792 9963406 10637730 11362320 12137374 12961509 13831686 14742713 15686170
58913 15686170 16649450 17615619 18563617 19468311 20301066 21031844 21632002 22076239 22343923
58904 22343923 22421436 22305111 22002101 21528082 20904113 20155064 19308935 18395153 17441816
58895 17441816 16473549 15510801 14570041 13664250 12803440 11994893 11243034 10549383 9913109
58886 9913109 9331959 8803023 8323024 7888219 7494245 7136351 6810031 6511325 6236479
58877 6236479 5981690 5743716 5520600 5311437 5115549 4932275 4761316 4602524 4455294
58868 4455294 4318697 4192232 4075918 3969582 3872618 3784465 3704720 3632774 3567992 3510403
58858 3510403 3460517 3418203 3382437 3352441 3328418 3310772 3299247 3293349 3293180 3299361 3312471 3332986
58846 3332986 3361455 3398314 3443586 3496948 3557912 3625977 3701079 3784040 3876114 3977973 4089623
58835 4089623 4211436 4344653 4490598 4650014 4823561 5012483 5218312 5442394 5686114
58826 5686114 5951284 6239925 6553937 6895334 7266604 7670652 8110552 8589369 9109807
58817 9109807 9674032 10284206 10942997 11652695 12413486 13222914 14076499 14967439 15885046
58808 15885046 16814103 17735778 18627864 19463750 20212986 20845017 21333099 21655552 21796084
58799 21796084 21745983 21506814 21090255 20515343 19806127 18990421 18097892 17157218 16194060
58790 16194060 15230454 14284455 13369762 12496050 11669882 10895121 10172979 9502765 8883096
58781 8883096 8312398 7788650 7309390 6872070 6473943 6111676 5781584 5480312 5204870
58772 5204870 4951956 4717635 4497883 4289529 4090990 3902307 3724270 3557255 3401047
58763 3401047 3255602 3121214 2997645 2883881 2779374 2684750 2600455 2525222 2456853 2394202
58753 2394202 2337383 2286271 2239912 2197539 2159130 2124570 2092998 2063467 2035784 2010289 1987088
58742 1987088 1965826 1945999 1927247 1909436 1892596 1876732 1861597 1846603 1830987 1814278 1796829
58731 1796829 1779715 1763683 1748249 1732226 1714947 1696264 1675530 1651734 1624972 1596691 1567828
58720 1567828 1537627 1505112 1470853 1436344 1402385 1369196 1337510 1308292 1281554 1256550 1233018
58709 1233018 1211273 1191299 1172840 1156309 1142500 1131286 1121528 1112437 1104143 1096822 1090183 1084104
58697 1084104 1078961 1074978 1071888 1069578 1068525 1069284 1071985 1076455 1082354 1088883 1094678 1098163 1097889 1092749
58683 1092749 1082390 1067472 1049275 1029151 1008527 988903 971141 955032 940216 927314 917446
58672 917446 910841 906709 904294 903181 902719 902211 901924 903079 906572 912290 919730 928467 937687 945964 951868
58657 951868 954443 953163 948190 940872 933272 926785 921597 917560 915034 914704 917230 923312 933513 947696
58643 947696 965127 985379 1008661 1035020 1063778 1094174 1126217 1160557 1197797 1238260 1282276
58632 1282276 1330461 1383670 1442678 1507856 1579330 1657654 1744110 1840099 1946566 2064377 2194902
58621 2194902 2339686 2499812 2676171 2870096 3083013 3315499 3567059 3836345 4120543
58612 4120543 4414423 4710599 5000553 5274649 5521345 5727691 5881618 5974132 6000303 5959644
58602 5959644 5856217 5697804 5494395 5257107 4997637 4727281 4455680 4190367 3937061
58593 3937061 3699690 3480283 3279496 3097261 2932643 2783744 2648786 2527175 2418813
58584 2418813 2322776 2237604 2162541 2097304 2040869 1991692 1948984 1912499 1881121 1853011 1827113
58573 1827113 1802948 1778714 1751261 1718602 1681200 1640314 1596484 1550381 1503774 1458609 1415868
58562 1415868 1375953 1339173 1305205 1273142 1242876 1215501 1191523 1169716 1148648 1128482 1110290
58551 1110290 1094410 1080508 1068523 1058482 1049864 1042056 1035032 1028839 1022992 1017204 1012061 1008055 1004527
58538 1004527 1000625 996839 994481 993869 994054 994204 994270 994239 993541 991374 987079 980200 970560 958288 943467
58523 943467 926115 906894 887352 868758 850896 832684 813872 795568 779154 765202 753406
58512 753406 743053 733464 724368 716005 708806 702997 698558 695357 693254 692198 692203 692977 693845 694519 695720
58497 695720 698245 701409 703319 702992 701389 700083 699668 699808 699955 699461 697788 695299 693297 692704 693208 694166
58481 694166 695668 698142 701571 705798 711118 717864 725823 734615 744269 754939 766455 778632 791494
58468 791494 804672 817089 827813 836772 844220 850039 854052 856395 856905 854683 848875 839523 827196
58455 827196 812354 795613 778042 760500 743204 726456 711236 698310 687282 677246 667926 659548
58443 659548 652093 645474 640105 636529 634682 634099 634489 635570 636709 637447 638133 639501 641735 644278 646272
58428 646272 647044 646687 646425 647744 650841 654619 658500 663321 669888 677649 685648 694027 703659 714843 727115
58413 727115 739901 752678 765089 777531 790983 805540 819710 831870 841683 849438 854861 857557
58401 857557 857985 856975 854795 851450 847231 842150 835590 827517 819367 812643 807273 802479 798638 797001
58387 797001 797853 800140 802784 805446 808198 811273 814911 818789 821974 824104 825978 828276 830446 831800
58373 831800 832977 835192 838607 842602 847191 852937 859793 867091 874423 881582 887933 892779 896065 898055
58359 898055 898820 898770 898998 900141 901539 902400 903097 904341 905943 907574 909863 913369 917123 919662 921011 922293
58343 922293 923921 925565 927460 930244 933763 937392 941346 946451 952865 960168 968394 977907 988640 1000411
58329 1000411 1013403 1027287 1040641 1052481 1063609 1075127 1086385 1095933 1103782 1111179 1118749 1126422
58317 1126422 1134617 1143858 1153717 1163598 1174021 1185665 1197838 1209489 1221018 1233421 1246376 1258890
58305 1258890 1271029 1283193 1294565 1304312 1313490 1323619 1334152 1343693 1352927 1363826 1376520 1389663
58293 1389663 1403445 1419420 1437476 1455759 1473704 1492442 1511969 1530626 1547886 1565194 1583591
58282 1583591 1602776 1622960 1645313 1669990 1695819 1722401 1750493 1780018 1809825 1839841 1871438
58271 1871438 1905291 1940873 1978314 2018678 2062074 2107380 2154142 2202945 2253932 2306813 2362188
58260 2362188 2421013 2483100 2548044 2616780 2689794 2764628 2837988 2909655 2981467 3053397 3124101
58249 3124101 3194629 3267695 3343473 3420105 3498407 3582043 3672721 3769049 3870460 3978296 4092630
58238 4092630 4212150 4337831 4472804 4618050 4772168 4935881 5112508 5303400 5507220
58229 5507220 5724310 5957454 6207859 6475105 6761565 7072023 7408429 7770214 8160347
58220 8160347 8585560 9050090 9555133 10105257 10709245 11374124 12105538 12915447 13822855
58211 13822855 14846544 16005746 17330149 18861422 20642936 22715466 25122861 27911190
58203 27911190 31121047 34793300 38986651 43780303 49261640 55531756 62733163 71063164
58195 71063164 80764866 92134815 105555395 121506771 140549858 163322165 190493815
58188 190493815 222492466 258914753 297897120 335926734 368368708 390579637 399205792
58181 399205792 393182789 374000598 345065715 310486446 273952270 238190760 204956130
58174 204956130 175208574 149286014 127091905 108313798 92584075 79531189 68782113
58167 68782113 59980511 52808368 46985921 42269431 38463782 35427289 33054785 31264615
58159 31264615 30006046 29263965 29045907 29374644 30297121 31871690 34100413 36838569 39749810
58150 39749810 42344149 44089953 44566716 43602931 41327333 38097733 34353020 30480496
58142 30480496 26755338 23341920 20318523 17702401 15471727 13585299 11997953 10668481
58134 10668481 9559743 8635897 7863002 7212711 6663128 6195545 5792696 5440691 5129650
58125 5129650 4850774 4594895 4355175 4128905 3915038 3711900 3518729 3337304 3170014
58116 3170014 3017625 2880167 2758330 2652456 2561459 2483810 2417959 2360569 2306080 2249697
58106 2249697 2189964 2127615 2063437 1998335 1933918 1871476 1811202 1753210 1698138 1645956 1595506
58095 1595506 1546087 1498320 1452744 1408930 1366773 1327318 1291430 1258857 1229217 1202537 1178046
58084 1178046 1153885 1128830 1103102 1076953 1050030 1022879 997424 974868 954480 935374 918057
58073 918057 903257 890609 879596 870435 862922 855650 847528 839095 831348 824409 818219 813311 809766
58060 809766 806421 802189 797244 792011 786061 778960 771227 763431 755343 746856 738709 731355 724119 716472
58046 716472 709067 702477 696015 689025 682400 677528 674438 672253 670782 670480 671251 672423 673639 675010 676762
58031 676762 679202 682404 685409 686587 685430 683105 680601 677477 673284 668984 665721 663140 660214 656897
58017 656897 653621 649913 645065 639763 635550 632736 630030 626186 621009 614782 607707 599991 591844 583343
58003 583343 574761 566798 559996 554180 548851 543685 538309 532300 526035 520803 517279 514517 511293 507902
57989 507902 505768 505689 507298 509876 512835 515756 518741 522494 527421 533015 538639 544326 550139 555405 559448
57974 559448 562537 565251 567422 568581 568926 568836 567945 565749 562728 559762 556746 552946 548540 544626 541769
57959 541769 539577 537725 536311 535127 533568 531462 529170 526683 523430 519222 514765 511016 508502 507334
57945 507334 507338 508175 509814 512794 517489 523238 528812 533635 537871 541468 543973 545352 546120 546319 544951 540790
57929 540790 533487 523804 513098 502589 492695 483027 473250 463883 455903 449755 445153 441707 439273 437912
57915 437912 437967 440024 444196 449576 455003 460260 465994 472493 479197 485416 490937 495832 500161 503968 507237
57900 507237 509834 511747 513206 514191 514134 512695 510626 509059 507971 506031 502143 496565 490382 484415 478782
57885 478782 473099 466899 460152 453408 447188 441351 435499 429816 424949 421051 417581 414156 411094 408948
57871 408948 407963 408198 409808 412933 417537 423495 430619 438527 446681 454671 462406 470061 477868 485716 492839
57856 492839 498194 501404 503033 503658 503087 500828 496968 492123 486825 481433 476164 470697 464178 456330 448199
57841 448199 441003 434599 427956 420912 414358 408809 403848 399159 395075 391775 388768 385581 382277 379033
57827 379033 375810 372721 369933 366891 362374 355863 348366 341385 335436 329922 324036 317431 310402 303747
57813 303747 298229 293917 290297 287091 284521 282633 280958 279173 277644 276996 277491 279084 281679 285021 288729
57798 288729 292781 297645 303668 310597 317923 325366 332773 339845 346259 351876 356739 361181 365918 371548
57784 371548 377821 383936 389670 395567 401656 406718 409451 409901 409086 407492 404574 399673 392936 385307 377917
57769 377917 371351 365280 358932 352215 346120 341795 339446 338462 338318 338883 339989 341200 342132 342817 343698 345366
57753 345366 348136 351747 355535 358997 362049 364754 367132 369337 371655 374138 376510 378637 380765 383089
57739 383089 385446 387717 390184 393211 396865 401137 406196 412071 418423 425116 432760 442226 453741 466827
57725 466827 480871 495303 509403 522558 534805 546751 558941 571577 584756 598667 613526
57714 613526 629591 647141 666240 686707 708691 733084 760840 791879 825130 859806 896326
57703 896326 935964 980021 1029557 1085544 1148883 1220181 1299680 1387506 1484170 1590982 1709895
57692 1709895 1842778 1990853 2154987 2336356 2536554 2757027 2998512 3260840 3542786
57683 3542786 3841630 4152550 4468104 4778119 5070241 5331147 5548105 5710680 5812549
57674 5812549 5852926 5836736 5773475 5675671 5557326 5431565 5307230 5186050 5062233 4924725
57664 4924725 4761109 4562305 4326716 4061421 3779213 3493827 3216992 2957986 2723500
57655 2723500 2516766 2337461 2183294 2051813 1940878 1848395 1772479 1711764 1665045 1630740
57645 1630740 1607126 1593035 1587976 1591660 1603749 1624082 1652834 1690387 1737169 1793610 1860029 1936605
57633 1936605 2023737 2122512 2234648 2361780 2504786 2663865 2839150 3031088 3240000 3465224
57623 3465224 3704597 3954441 4209461 4462155 4702455 4918522 5098381 5231232 5308176 5323204
57613 5323204 5274587 5165549 5003386 4797866 4560113 4301816 4033921 3765181 3501799 3248347
57603 3248347 3008620 2785460 2580135 2392379 2221221 2065754 1925283 1799003 1685765
57594 1685765 1584277 1493476 1412565 1340564 1275953 1217100 1163170 1114334 1070861 1032199 997185
57583 997185 965046 935759 909406 885613 863848 843940 825972 809875 795508 783011 772626
57572 772626 764069 756500 749265 742450 736569 731992 728863 727274 727220 728586 731448 736270 743510 753080 764404
57557 764404 776951 790454 804835 820286 837395 856737 878331 901889 927745 957053 990731
57546 990731 1028572 1069821 1114515 1163896 1219536 1282375 1352638 1430399 1516094 1610675 1715431
57535 1715431 1831618 1960179 2101715 2256522 2424468 2604875 2796670 2998469 3207956
57526 3207956 3420666 3629207 3823817 3993956 4129922 4223752 4269597 4264107 4207104 4102181
57516 4102181 3956556 3779825 3582113 3372567 3158759 2946793 2741607 2547138 2366242
57507 2366242 2200484 2050114 1914608 1793383 1685910 1591142 1507333 1432967 1367772 1312275
57497 1312275 1266230 1228009 1195815 1169103 1148408 1134091 1125806 1123038 1125542 1133085 1145242 1161750
57485 1161750 1182786 1208690 1239616 1275722 1317556 1366104 1422502 1487765 1562508 1646795 1740529
57474 1740529 1844300 1959669 2088306 2230924 2387230 2556613 2738235 2930219 3128837
57465 3128837 3328323 3521066 3698021 3849572 3966641 4041377 4067507 4041252 3962829 3837093
57455 3837093 3672321 3478082 3263906 3038924 2811457 2588216 2373970 2172039 1984832
57446 1984832 1813733 1658797 1519066 1393371 1280806 1180528 1091411 1012050 941064 877294
57436 877294 819813 767911 721185 679518 642755 610284 581069 554176 529223 506181 484869
57425 484869 464915 446288 429477 414926 402388 391107 380521 370459 360747 350974 340848 330485
57413 330485 320199 310243 300946 292896 286612 282011 278424 275194 272152 269474 267236 265183 262985 260659
57399 260659 258635 257229 256157 254872 253378 252315 252043 252068 251694 250885 250005 249028 247626 245892 244271 242749
57383 242749 240822 238425 236255 234823 233764 232382 230420 227931 224916 221602 218605 216220 213790 210417
57369 210417 206170 202044 198813 196423 194466 192746 191274 190097 189258 188677 188084 187251 186248 185297 184586 184419
57353 184419 185242 187153 189652 192270 195077 198037 200300 201053 200924 201565 203745 206714 209631 212636 216043
57338 216043 219356 221784 223191 223939 224286 224541 225317 226905 228665 229724 230103 230564 231482 232514 233317 234039
57322 234039 235069 236753 239319 242636 246075 249052 251732 254763 258354 262094 265699 269414 273526 277982
57308 277982 282771 288332 295217 303484 312591 321804 330663 339307 348494 359107 371429 384974 399104
57295 399104 413709 429249 446214 464646 484183 504603 526276 549909 575721 603099 631233
57284 631233 659913 689415 719852 750965 782362 813457 843284 870886 895864 917950 935962
57273 935962 947846 952134 948912 938999 922665 899750 870744 837099 800465 762072 722964 684362
57261 684362 647464 612982 581003 551288 523706 498449 475801 455717 437759 421592 407386
57250 407386 395500 385747 377254 369142 361254 354073 348105 343448 339912 337230 334991 332597 329601 326215
57236 326215 323243 321428 320919 321354 322251 323186 323906 324456 325040 325594 325759 325547 325721 327124 329716 332710 335496
57219 335496 337992 340231 342239 344470 347741 352416 358013 363851 369735 375754 381870 388117 394940 402881
57205 402881 411963 421674 431447 440975 450162 459071 467889 476798 485832 494942 504098 513349 522882 533054
57191 533054 544135 556029 568406 581153 594425 608206 622156 635967 649630 663237 676830
57180 676830 690504 704399 718508 732860 747914 764328 782281 801454 821739 843310 865843
57169 865843 888443 910818 933889 958632 984838 1011591 1038514 1065940 1094262 1123880 1155441
57158 1155441 1189443 1225782 1264248 1305118 1348507 1393405 1438232 1482275 1525873 1569251 1611959
57147 1611959 1653420 1693303 1731319 1767430 1802412 1837420 1872783 1907859 1942303 1976808 2012187
57136 2012187 2048276 2084137 2119028 2152848 2185893 2218505 2250896 2283212 2315726 2348843 2382829
57125 2382829 2417836 2454417 2493595 2536079 2581823 2630887 2684210 2742872 2807014 2876197 2950380
57114 2950380 3029752 3114133 3203712 3300146 3405988 3523421 3654756 3803899 3976147 4177142
57104 4177142 4413792 4696177 5036623 5446341 5933994 6507067 7172670 7937088 8807145
57095 8807145 9792991 10907809 12164103 13571654 15138272 16868606 18760339 20804100
57087 20804100 22989640 25312331 27775543 30388865 33157149 36054253 38996559 41849364
57079 41849364 44472158 46757763 48619804 49948503 50601811 50458151 49480757 47732588
57071 47732588 45341249 42458377 39239547 35834300 32373968 28963471 25684034 22599782
57063 22599782 19759108 17192568 14913102 12918636 11194657 9717469 8458915 7390146
57055 7390146 6483015 5711238 5052533 4489362 4007115 3592588 3234797 2925818 2659373
57046 2659373 2428934 2227948 2051333 1895798 1758872 1638102 1530869 1434480 1346644 1266024
57036 1266024 1191935 1123310 1058585 996810 938145 882794 830093 779240 730352 684133 640788
57025 640788 599895 561140 524679 490920 460344 433366 409983 389753 372425 358384 348099
57014 348099 341492 338275 338742 343631 353263 367279 385352 407808 435495 469300 509958 558291 615739
57001 615739 684839 769003 871435 993682 1134244 1286856 1438628 1570153 1659948 1692230
56991 1692230 1663296 1582110 1465193 1330001 1190841 1058013 938318 835216 748841 676679
56981 676679 614969 559982 508714 459242 410933 364237 320017 278927 241327 207545 177990
56970 177990 152982 132576 116600 104900 97556 94878 97102 104064 115197 129839 147652 168839
56958 168839 193897 222779 253848 283666 308139 324241 330892 328665 319158 304634 287599 270113
56946 270113 253412 238251 225414 215650 209237 205921 205312 207181 211398 217876 226760 238587 254106
56933 254106 273914 298224 326747 358366 390603 419446 440093 448557 443221 425428 398702 367129
56921 367129 333954 301222 270349 242563 218559 198000 179906 163733 149782 138408 129214 121320
56909 121320 114256 108233 103627 100443 98309 96801 95785 95562 96583 98919 102152 105899 110230 115373
56895 115373 121309 127984 135710 144978 156042 169159 185107 204925 229068 257082 287835 319316
56883 319316 348198 370543 383666 387325 383086 373066 359493 344714 330712 318509 308361 300589
56871 300589 295947 295249 298871 306683 318482 334601 356065 383987 418841 460604 509447 565506
56859 565506 627335 690677 748948 794938 822504 828107 812200 779392 736493 689657 642963 599029
56847 599029 560176 528681 506117 492772 487908 490814 501716 521559 551045 590382 640243 702418
56835 702418 778802 869399 970911 1076248 1174670 1253182 1299893 1308045 1278150 1217085 1135282
56824 1135282 1043592 950880 862997 783304 713757 655400 608395 572406 547128 532268 527282
56813 527282 531758 546084 571313 608420 657975 719955 792506 870247 944310 1004548 1042021 1050578
56801 1050578 1028347 979090 911364 834895 757104 682555 614381 554872 504943 464192 431838
56790 431838 407200 389420 377624 371711 372547 381057 397389 421083 451573 488013 528396 568850
56778 568850 603812 627309 634894 625126 599778 562863 519299 473651 429174 387596 349729 316145
56766 316145 287111 262240 240747 222131 206294 192996 181572 171305 161919 153603 146735 141516
56754 141516 137718 134845 132622 131126 130180 129004 127003 124750 123483 123561 124003 123729 122652 121321 120053
56739 120053 118824 117602 116363 115059 113849 113040 112520 111711 110436 109337 108896 108495 107214 105253 103744
56724 103744 103206 103065 102808 102751 103279 103990 104088 103195 101346 98673 95671 93418 92832 93728 95083 96146 96778
56707 96778 96791 95775 93889 92237 91864 92593 93349 93526 93517 93850 94299 94194 93315 92103 91058 90299 89778 89590
56689 89590 89807 90152 90206 89992 90069 90789 91600 91444 89939 87977 86987 87729 89914 92719 95364 97264 98192 98531
56671 98531 99018 99955 100855 101157 101022 101058 101400 101612 101472 101312 101362 101247 100539 99497 98878 99112 99960 100875 101357
56652 101357 101075 100091 99066 98889 99837 101224 102035 101914 101467 101675 102989 104933 106567 107325 107367 107146 106893
56635 106893 106676 106715 107202 107803 107742 106576 104692 102922 101857 101664 102280 103425 104548 105100 105077 105115 105911 107537
56617 107537 109367 110675 111255 111492 111890 112584 113299 113687 113621 113262 113000 113290 114353 115893 117228 117857 117885 117854
56599 117854 118178 118779 119243 119284 118992 118675 118447 118093 117461 116876 116978 118014 119523 120847 121815 122726 123789 124870
56581 124870 125788 126600 127449 128321 129111 129864 130803 132102 133692 135297 136670 137928 139656 142542 146746 151733
56565 151733 156833 161857 167001 172289 177352 181774 185459 188606 191571 194812 198752 203514 208848 214355
56551 214355 219630 224241 227880 230679 233014 234788 235288 234131 232040 230128 228566 226572 223690 220414
56537 220414 217364 214423 211155 207636 204412 201772 199470 197117 194577 192021 189748 187906 186275 184401
56523 184401 182016 179208 176206 173296 170900 169328 168293 167088 165444 163757 162196 160186 157294 154113
56509 154113 151597 149856 148286 146622 145043 143405 141292 138987 137513 137366 137882 138203 138284 138497 138787 138750
56493 138750 138282 137687 137322 137422 138056 138963 139694 140158 140805 142056 143839 145937 148438 151442 154622 157483
56477 157483 159933 162193 164257 165854 166931 167857 169100 170851 172952 175081 177078 179114 181292 183096
56463 183096 183674 182967 182113 182314 183616 185306 187159 189579 192590 195499 197792 199832 202296 205274 208254
56448 208254 210822 213073 215387 217973 220690 223337 226149 229788 234595 239946 244599 247709 249283 249737
56434 249737 249324 248032 245719 242265 237770 232672 227431 222175 216837 211558 206507 201358 195554 189264
56420 189264 183528 179079 175487 171984 168796 166943 166755 167177 166750 164873 161950 158702 155715 153458 152310
56405 152310 152445 153891 156757 161169 166792 172510 176964 179642 181293 183053 185171 186854 187354 186908 186487
56390 186487 186835 187937 189237 190125 190331 190134 190141 190671 191447 192166 193247 195573 199404 203984 208418 212567 216756
56373 216756 220973 224891 228463 231917 235096 237412 238725 239812 241518 243700 245432 246181 246337 246539 246850
56358 246850 246861 246393 245843 245807 246548 247879 249500 251271 253198 255279 257523 259956 262493 264876 266926 268718
56342 268718 270335 271565 272211 272592 273280 274315 275234 276087 277883 281720 287853 295885 305320 315456 325323
56327 325323 334514 343835 354437 366477 379234 392297 405775 419417 432511 444833 456901 468904
56315 468904 480008 489078 495572 499529 501285 501490 500756 498887 495081 489358 483172 478025 473963 470134
56301 470134 466421 463714 462674 462915 463494 463729 463530 463321 463741 465211 467798 471566 476800 483612 491567 500079
56285 500079 509060 518922 530109 542920 557568 574019 591896 610917 631358 653862 678889 706670
56273 706670 737517 771865 810031 852188 898659 950093 1007418 1071585 1143166 1222191 1308748
56262 1308748 1403787 1508888 1625053 1752252 1890406 2040182 2202240 2376108 2560300 2753193
56252 2753193 2953175 3158163 3365434 3571672 3772644 3963108 4137746 4292250 4423262
56243 4423262 4527658 4602621 4646572 4659812 4644473 4604110 4542891 4464580 4372345 4269647 4160619
56232 4160619 4048934 3936747 3825223 3715323 3607120 3499004 3388946 3276519 3162644
56223 3162644 3047580 2930426 2810675 2688933 2565797 2441224 2315606 2190520 2067776
56214 2067776 1948431 1833218 1723145 1618998 1520839 1428695 1343292 1265467 1195077 1131021
56204 1131021 1072220 1018259 969299 925658 887308 853535 823204 795443 769910 746509 725248
56193 725248 706417 690372 677009 665826 656579 649389 644112 640164 637208 635530 635539 637315 640787 645865
56179 645865 652251 659673 668534 679729 693500 708934 724888 740873 756725 772000 786196 799161
56167 799161 810826 820837 828865 834916 838990 840728 839893 836980 832935 828332 823193 817617 812318 808432
56153 808432 806762 807193 809000 811871 816430 823587 833698 846819 863390 883925 908217 935750 966965
56140 966965 1003236 1045417 1093287 1146873 1207643 1277882 1359392 1453078 1558958 1675688 1800198
56129 1800198 1928214 2055114 2176343 2287828 2386866 2472834 2547014 2611884 2670139 2723229
56119 2723229 2769999 2806934 2830235 2837907 2830360 2809887 2779847 2743401 2702017 2654898 2599813 2534333
56107 2534333 2456548 2365615 2262432 2149897 2032401 1914981 1802352 1697836 1602893 1517926
56097 1517926 1443317 1379164 1324334 1276724 1234599 1197034 1163242 1132512 1104942 1081261 1061574
56086 1061574 1045004 1030684 1018258 1007321 997377 988613 981740 976723 972671 969324 967646 968470 971499
56073 971499 976121 982297 990095 999189 1009276 1020168 1031124 1041078 1050000 1059019 1068666 1078058 1086410
56060 1086410 1094306 1102740 1111892 1121620 1132255 1144072 1156715 1169868 1183775 1198461 1213232 1227583
56048 1227583 1241860 1256494 1271347 1286333 1301889 1318450 1336370 1356618 1380275 1406868 1434441
56037 1434441 1461828 1489558 1518094 1546802 1575503 1605492 1638007 1673066 1710683 1751665 1796078
56026 1796078 1842437 1889620 1938189 1988737 2040618 2093718 2149882 2210889 2276202 2344166 2413966
56015 2413966 2484871 2555036 2622988 2689270 2755059 2820295 2884745 2949651 3016613 3085969 3157868
56004 3157868 3233675 3314608 3400247 3490066 3585255 3687421 3796792 3913244 4037691 4170904
55994 4170904 4312631 4463525 4626137 4802160 4990599 5190558 5403706 5631941 5875015
55985 5875015 6133025 6409103 6707027 7028475 7375413 7752743 8165511 8615868 9106043
55976 9106043 9642181 10232304 10883487 11604909 12411284 13320121 14349466 15523448 16877404
55967 16877404 18452901 20290044 22428022 24908267 27771897 31059938 34824541 39137846
55959 39137846 44086164 49765696 56298348 63852319 72644744 82940132 95068361 109446380
55951 109446380 126577827 147046997 171503504 200511623 234106364 271132820 308777816
55944 308777816 342758438 368288761 381471980 380499783 366115364 341155952 309464268
55937 309464268 274761520 239970634 207066351 177204895 150899125 128190924 108843938
55930 108843938 92515775 78847876 67483947 58075291 50296568 43856973 38502664
55923 38502664 34021136 30244323 27040061 24299481 21934442 19879975 18088502 16519782
55915 16519782 15138907 13919433 12840919 11883478 11028577 10262971 9576857 8959416 8400105
55906 8400105 7892413 7431954 7012170 6625831 6269256 5941079 5638053 5355782 5092397
55897 5092397 4847884 4620636 4407856 4208297 4021449 3845183 3677269 3518132 3369041
55888 3369041 3228730 3094927 2968052 2850114 2740783 2637728 2540064 2448360 2361822 2278668
55878 2278668 2198938 2124040 2053782 1986643 1922799 1864195 1811758 1764919 1723643 1688306 1657609
55867 1657609 1628958 1601069 1574198 1548060 1521673 1495139 1469501 1444972 1421321 1399847 1382773
55856 1382773 1370607 1361913 1355512 1350899 1346458 1339315 1327262 1309519 1285928 1257161 1225476 1193454
55844 1193454 1162072 1131540 1103391 1079565 1059659 1041323 1023441 1006797 991486 975957 959097
55833 959097 941292 922900 903474 883161 863203 844326 825951 807590 789784 773124 757432
55822 757432 742320 727589 712841 697672 682417 667836 654229 641812 631501 623906 617888 611772
55810 611772 605804 601687 599752 598554 597397 597241 598506 599922 600391 600454 600922 601289 600325 597198 591393 582639
55794 582639 571600 559597 547080 533292 517980 502319 487586 473975 461325 449975 440131 431280
55782 431280 422995 415656 409833 405616 403008 402205 402953 404231 404961 404459 401991 396780 388840 379142 368604
55767 368604 357637 346859 337356 329800 324056 319951 317634 316810 316369 315105 312181 306864 298835 289003
55753 289003 279038 269712 260583 251562 243619 237468 232589 228219 224340 221073 218033 215010 212503 210907
55739 210907 209876 209071 208692 208664 208170 206803 205460 205206 205848 206487 206928 207613 208509 208887 208099 205984 202752
55722 202752 198922 195092 191376 187403 183226 179715 177600 176624 176122 175960 176336 177165 178278 179860 182143
55707 182143 184992 188357 192743 198645 205776 213371 220929 228091 234146 238401 240980 242676 243993 244736
55693 244736 244546 243515 242180 241063 240189 239016 237048 234452 231714 228720 224785 219802 214758 210734 207863
55678 207863 205649 203793 202197 200523 198311 195414 191943 187965 183552 178890 174149 169469 165231 161971
55664 161971 159761 157990 156064 153991 152211 151250 151692 153838 157085 160215 162671 164988 167523 169485 169960
55649 169960 169362 168928 168949 168352 166065 162120 157294 152208 147047 141852 136800 132224 128341 124974 121718
55634 121718 118403 115189 112157 109114 105910 102672 99631 97012 95162 94273 93854 92990 91429 89893 88975
55619 88975 88251 86977 85259 83903 83354 83286 83151 82694 81980 81240 80637 80013 79045 77784 76729 76148 75661 74813
55601 74813 73739 72896 72350 71678 70423 68497 66353 64893 64789 65682 66473 66634 66809 67743 69133 70034 70016
55584 70016 69407 68699 68251 68366 69105 70113 71014 71797 72546 73039 73058 72878 72989 73502 74154 74770 75369 76072 77277
55565 77277 79626 83313 87567 91267 93970 95971 97519 98426 98366 97153 94853 91915 89087 86767 84539
55550 84539 81616 77736 73374 69268 65973 63678 62079 60564 58776 56936 55466 54584 54381 54926 55989
55535 55989 57098 58167 59597 61366 62626 62796 62601 63199 64626 65915 66587 67086 67723 68032 67469 66107
55519 66107 64347 62390 60245 57894 55254 52257 49127 46322 44162 42677 41814 41483 41415 41195 40425 38796
55503 38796 36257 33378 31159 30018 29244 27946 26315 25259 24970 24663 23808 22939 22987 24413 27198 31117
55487 31117 35693 40305 44748 49369 54378 59252 63098 65422 66328 66160 65176 63503 61249 58656 56104
55472 56104 53815 51611 49254 46976 45434 44985 45280 45641 45643 45255 44636 43947 43285 42656 42021 41305 40345 38970
55454 38970 37269 35614 34242 32972 31595 30400 30005 30713 32276 34253 36319 38208 39651 40412 40279
55439 40279 39150 37289 35356 33888 32854 31975 31288 31103 31463 32020 32420 32536 32496 32767 34017 36363 38820
55422 38820 40014 39550 38295 37226 36466 35559 34290 32978 32176 32262 33146 34246 34870 34691 33832 32678 31771
55405 31771 31638 32266 32862 32611 31690 31081 31316 31887 32042 31740 31562 31986 33032 34392 35672 36642 37383 38060
55387 38060 38506 38236 37037 35331 33854 33003 32577 32050 31117 30045 29395 29284 29068 28079 26549 25493 25611
55370 25611 26652 27893 28894 29659 30301 30785 30904 30472 29585 28675 28113 27812 27403 26699 25765 24677 23542
55353 23542 22771 22942 24271 26363 28559 30324 31344 31523 31004 30084 29064 28253 27919 28084 28475 28881 29327
55336 29327 29653 29271 27801 25815 24392 23970 24068 24156 24253 24591 25174 25884 26645 27312 27601 27302 26418 25111 23672
55317 23672 22383 21193 19695 17788 16124 15422 15568 15972 16590 17805 19332 20172 19940 19470 19690 20489 21198
55300 21198 21637 22142 22868 23582 24030 24180 24226 24564 25523 26982 28408 29376 29809 29732 29202 28587 28401 28657 28827
55281 28827 28642 28460 28588 28715 28375 27548 26474 25326 24427 24327 25134 26085 26346 26005 25783 25982 26267 26390
55263 26390 26601 27238 28251 29239 29772 29701 29268 28890 28740 28709 28760 29022 29430 29636 29541 29552 30047 30808 31282 31126
55243 31126 30284 28873 27355 26495 26760 27943 29615 31533 33247 33802 32582 30251 28199 27026 26215 25267
55227 25267 24518 24556 25367 26437 27422 28319 29101 29494 29258 28575 27992 27890 28074 28085 27837 27663 27731 27800 27765 28034
55207 28034 29056 30721 32598 34529 36629 38827 40805 42293 43203 43571 43685 44067 44942 45820 45940 45107
55191 45107 43839 42750 42061 41552 40722 39139 37026 35397 35156 36099 37208 37855 38218 38497 38344 37376 35833
55174 35833 34345 33274 32628 32475 33017 34171 35307 35626 34810 33246 31629 30398 29632 29344 29639 30517 31739
55157 31739 32954 33882 34291 34041 33305 32615 32458 32831 33287 33375 33053 32700 32658 32676 32038 30539 29070 28674 29107
55138 29107 29105 28212 27466 27883 29068 30049 30806 31996 33559 34677 35085 35464 36337 37371 38067 38515 39097 39846
55120 39846 40456 40693 40677 40965 42330 44988 47992 49798 49721 48506 47305 46485 45667 44583 43450 42618 42169
55103 42169 41942 41803 41785 41964 42255 42532 43005 44213 46369 48929 51078 52538 53603 54533 55294 55828 56168
55086 56168 56362 56617 57411 58985 60773 61865 62123 62329 63089 64049 64403 63853 62885 62370 62931 64397 65820
55069 65820 66380 66319 66543 67316 67882 67535 66474 65365 64575 64166 64193 64583 65009 65191 65099 64719 64043 63467 63641
55050 63641 64561 65312 65144 64328 63425 62302 60560 58586 57284 56918 57003 57323 58180 59500 60472 60510 60009 59747
55032 59747 59948 60356 60887 61687 62627 63171 62840 61650 60066 58612 57552 56878 56602 56896 57797 58902 59681
55015 59681 60172 60989 62463 64051 64971 65198 65479 66303 67268 67630 67281 66880 67040 67628 67999 67823 67472 67526 68064
54996 68064 68653 68920 68842 68391 67277 65393 63319 61968 61665 61913 62159 62368 62644 62675 62017 60786 59626 59039
54978 59039 59093 59719 60814 62013 62821 63193 63596 64354 65350 66576 68422 70998 73624 75584 77061 78701
54962 78701 80487 81804 82654 84023 86814 90968 95943 101601 108255 116138 125147 134935 145127 155639
54948 155639 166917 179520 193310 207303 220432 232032 241320 246947 247684 243503 235589 225276 213242
54935 213242 199672 184881 169696 155337 142907 132785 124521 117344 110694 104326 98257 92845 88670
54922 88670 86007 84520 83672 83248 83253 83587 84237 85646 88378 92391 97058 101982 107432 113832 121208 129349
54906 129349 138263 148187 159258 171377 184226 197153 209038 218551 224673 226972 225405 220018 211028
54893 211028 199176 185826 172465 160015 148627 138097 128345 119465 111477 104239 97602 91553 86253
54880 86253 81957 78840 76754 75175 73482 71339 68853 66478 64786 64154 64482 65230 65829 66049 65953 65614
54864 65614 65020 64163 63074 61781 60345 58928 57701 56715 55972 55578 55702 56305 57004 57250 56697 55478 54147
54847 54147 53241 52825 52502 51909 51041 50061 48986 47791 46672 45952 45705 45643 45479 45289 45462 46262 47446 48368
54829 48368 48621 48534 48780 49463 49964 49920 49937 50865 52612 54228 55159 55801 56709 57808 58719 59458 60331 61387 62456
54810 62456 63690 65647 68622 72188 75566 78438 81272 84894 89793 95811 102424 109230 116230 123763
54796 123763 132236 141861 152537 164071 176464 189749 203366 215967 226264 233992 239580 242914
54784 242914 242943 238788 230872 220689 209763 199098 189208 180118 171476 163142 155635 149589 144842 140581
54770 140581 136412 132805 130313 128841 127994 127707 128122 129098 130351 132057 134896 139367 145298 152171 159810
54755 159810 168613 179112 191332 204698 218652 233372 249590 267667 286999 306409 324783 341011
54743 341011 353608 361027 362536 358587 350230 338369 323613 306568 288073 269173 250789 233291
54731 233291 216474 200205 185033 171863 160995 151882 143871 136787 130643 125238 120365 116099 112475
54718 112475 109210 106102 103514 101917 101130 100528 99964 99893 100411 100702 99823 97778 95531 94094 93755 94048 94280
54701 94280 94160 94057 94541 95630 96639 96889 96412 95808 95536 95527 95474 95354 95555 96449 97849 99093 99831 100541 101985
54682 101985 104211 106562 108671 110911 113609 116268 118125 119176 120190 121797 124082 127029 130797 135324
54668 135324 140046 144414 148534 153054 158454 164566 170754 176456 181603 186607 191955 197790 203890 209883
54654 209883 215323 219606 222209 223210 223478 224137 225890 228889 233007 238006 243574 249586 256398 264589 274378
54639 274378 285490 297689 311097 325698 340774 355206 368233 379500 388314 393328 393227 387564
54627 387564 376778 361775 343818 324495 305173 286354 267895 249918 233230 218782 207056
54616 207056 198047 191488 186786 183089 179849 177287 176018 176225 177423 178985 180644 182466 184585 186996
54602 186996 189397 191124 191505 190468 188654 186732 184686 181938 178088 173290 167887 161963 155485 148795
54588 148795 142661 137716 133885 130434 126608 122241 117794 113885 110706 107882 104897 101657 98609 96248
54574 96248 94542 92950 90976 88618 86216 84006 81956 80043 78483 77573 77388 77799 78709 80062 81589
54559 81589 82807 83461 83790 84186 84769 85495 86475 87768 88988 89610 89719 90027 90978 92340 93902 95960 98650
54542 98650 101235 102784 103394 104076 105446 107222 109141 111711 115625 120844 126711 132835 139443 146894 155088
54527 155088 163505 171742 179861 188024 195714 201533 204086 203073 199315 193797 186943 178785 169458 159424
54513 159424 149463 140417 132650 125740 119079 112786 107651 104017 101212 98299 94975 91538 88359 85810
54499 85810 84326 84008 84280 84300 83698 82606 81167 79391 77474 75873 74903 74483 74371 74501 75027 76042 77312
54482 77312 78360 78894 79136 79549 80300 81206 82204 83484 85076 86664 88047 89443 91079 92740 94050 94959
54466 94959 95606 95914 95695 95076 94469 94128 93935 93610 93012 92367 92265 93173 94787 96114 96379 95582 94074 92067
54448 92067 89878 88072 86818 85515 83709 82025 81402 81589 81291 79866 78088 76971 76497 75885 74671 73158
54432 73158 72126 72319 73903 76191 78068 78869 78736 78199 77731 77659 78045 78540 78739 78781 79213 80215 81347 82194
54414 82194 82839 83577 84624 86259 88766 91908 94864 97016 98493 99779 101174 102949 105577 109309 113789
54399 113789 118484 123388 128963 135505 142862 150562 158019 164767 170814 176566 182155 187087 190871 193748
54385 193748 196306 198491 199421 198284 195124 190739 186058 181611 177363 172918 168021 162882 157969 153553
54371 153553 149558 145768 142022 138256 134458 130617 126760 123115 120123 118003 116430 115003 114003 114114
54357 114114 115263 116385 116736 116857 117683 119155 120404 121019 121418 122139 123422 125488 128456 131951 135383 138803
54341 138803 142902 148031 153764 159613 165616 171928 178320 184408 189927 194520 197683 199322 199985 200093 199257
54326 199257 196770 192495 186848 180217 172986 165966 160057 155268 150493 144505 137064 129030 121590 115350
54312 115350 109938 104502 98816 93739 90214 87958 85652 82532 79251 76992 76196 76450 77099 77504 77057
54297 77057 75550 73459 71421 69512 67463 65432 63952 63050 62035 60439 58695 57510 56924 56415 55743
54282 55743 55220 55208 55742 56692 57942 59308 60480 61173 61317 61066 60727 60640 60941 61433 61789 61895 61874 61864 61943 62222
54262 62222 62751 63274 63352 62904 62476 62765 63936 65525 66972 68097 69041 69908 70570 70808 70525 69790 68781 67785
54244 67785 67129 66914 66872 66666 66362 66333 66648 66921 66976 67272 68281 69677 70555 70336 69043 66852 63991 61159
54226 61159 59408 59203 59865 60243 59793 58839 58068 57958 58470 59017 58908 58026 57006 56598 57034 58038 59208 60156
54208 60156 60554 60357 59890 59485 59144 58733 58334 58144 58193 58486 59313 60987 63228 65113 65816 65286 64179 63294
54190 63294 63125 63682 64500 64886 64395 63242 62214 62044 62733 63528 63626 62814 61353 59457 57271 55288 54327
54173 54327 54807 56311 58010 59282 59804 59486 58679 58132 58280 58685 58611 58026 57613 57790 58161 58048 57219 55967
54155 55967 54758 53931 53523 53245 52840 52542 52935 54257 56027 57500 58322 58686 59055 59856 61143 62330 62428
54138 62428 60978 58752 57258 57370 58585 59689 59937 59429 58543 57443 56197 55022 54092 53276 52382 51567
54122 51567 51189 51270 51411 51296 50940 50411 49685 48917 48457 48332 48114 47661 47588 48476 49834 50461 49890 48964 48869 50012
54102 50012 51935 53900 55334 56057 56419 57092 58500 60424 62163 63030 62803 61958 61449 61938 63096 63895 63660
54085 63660 62659 61590 60803 60191 59602 59085 58802 58951 59653 60767 61838 62405 62359 61947 61434 60854 60054 58913
54067 58913 57560 56423 56004 56516 57743 59259 60740 62115 63487 64908 66191 66942 66946 66450 65951 65700 65557
54050 65557 65391 65431 66080 67457 69219 70825 72025 73151 74897 77586 80676 83146 84508 85276 86415 88473
54034 88473 91382 94907 98960 103425 107960 112215 116235 120455 125122 129833 133858 136966 139758 143061
54020 143061 147127 151558 155846 159729 163092 165819 167904 169593 171288 173238 175268 176803 177331 176871 175872
54005 175872 174660 173257 171786 170598 169705 168534 166730 164871 163722 162964 161420 158617 155378 152629 150322
53990 150322 147966 145653 143981 143190 142871 142358 141089 138793 135780 132947 131058 129949 128676 126450 123288
53975 123288 119878 117064 115370 114707 114449 113979 113201 112472 112123 112176 112464 112878 113452 114271 115257 116128 116734 117381
53957 117381 118458 119640 119869 118491 116244 114729 114973 116744 119181 121739 124458 127556 130916 134015 136408
53942 136408 138310 140428 143145 146171 149211 152627 157026 162337 167806 172849 177498 181905 185816 188704
53928 188704 190238 190471 189709 188226 186103 183414 180706 179025 179088 180499 182187 183655 185434 188192 191809
53913 191809 195586 199121 202718 206991 212219 218025 223593 228355 232565 237072 242386 248069 253155 257070
53899 257070 260013 262407 264109 264326 262500 259290 256392 255082 255003 254611 252698 249233 244854 240090 235213
53884 235213 230386 225593 220590 215139 209202 202795 195954 189026 182735 177589 173343 169309 165174 161240
53870 161240 157868 154985 152238 149417 146515 143459 140011 136117 132248 129155 127142 125756 124348 122699
53856 122699 120848 118580 115609 112290 109538 107823 106761 105926 105522 105709 105750 104620 102348 100024 98418
53841 98418 97193 95674 93797 91926 90209 88586 87194 86285 85801 85477 85363 85931 87479 89624 91522 92551
53825 92551 92692 92342 91921 91672 91740 92252 93255 94627 96094 97331 98021 97982 97375 96661 96202 95908 95517 95124
53807 95124 95173 95849 96794 97601 98350 99459 101174 103492 106468 110267 114862 119918 125065 130123 134986 139466
53791 139466 143391 146823 150070 153475 157167 160937 164304 166830 168450 169542 170614 171941 173475 175003
53777 175003 176283 177020 176920 175946 174503 173115 171869 170375 168341 165917 163183 159637 154783 149198 144380
53762 144380 141236 139262 137526 135895 134651 133407 131352 128624 126535 126098 126940 128015 128824 129363 129352 128306
53746 128306 126407 124673 123946 123947 123595 122200 120157 118425 117425 116717 115830 115053 115013 115695 116494 117246 118423
53729 118423 120036 121150 121119 120735 121330 123055 124901 126261 127510 128999 130485 131874 133624 135832 137642
53714 137642 138318 138394 138966 140125 140914 140833 140541 140874 141807 142772 143542 144352 145341 146310 147072 147731 148525 149537 150701
53695 150701 152020 153628 155585 157682 159610 161343 163184 165310 167368 168768 169367 169703 170460 171855 173636
53680 173636 175501 177289 178851 180044 181049 182443 184659 187371 189683 191017 191638 192232 193196 194467 195786
53665 195786 196865 197476 197703 197999 198655 199263 199008 197551 195345 193068 191073 189481 188403 187814 187436 186958
53649 186958 186242 185201 183714 181880 180140 178921 178247 177843 177476 177043 176540 176128 176039 176185 176045 175224 174009
53632 174009 173094 172833 173017 173351 173821 174554 175516 176469 177155 177554 178026 179081 180938 183394 186150 189019 191712
53615 191712 193820 195336 196917 199211 202081 204972 207828 211113 214941 218799 222317 225794 229699 234039
53601 234039 238477 242772 246857 250766 254688 258811 262926 266506 269459 272455 276119 280168 283749 286521
53587 286521 288941 291563 294502 297542 300307 302205 302700 301961 300971 300709 301333 302365 303434 304498 305418 305797
53571 305797 305421 304652 304076 303833 303502 302671 301479 300490 300126 300284 300484 300362 300054 300114 300977 302484 304013 305115
53553 305115 305892 306676 307564 308499 309659 311419 313859 316612 319312 321962 324727 327567 330293 332860 335362
53538 335362 337828 340290 343018 346435 350700 355523 360524 365598 370774 375889 380703 385365 390456 396404
53524 396404 403028 409918 417115 425077 433946 443215 452357 461477 471037 481141 491487 501984 513014
53511 513014 524935 537654 550861 564478 578707 593771 609803 626852 644804 663392 682414
53500 682414 701961 722333 743811 766519 790335 814801 839291 863445 887316 910953 934048
53489 934048 956348 978255 1000572 1023587 1046770 1069522 1091869 1114130 1136176 1157468 1177759
53478 1177759 1197441 1217115 1237082 1257315 1277600 1297460 1316170 1333246 1349005 1364313 1379607
53467 1379607 1394331 1407554 1419097 1429660 1439785 1448959 1456039 1460414 1462438 1462785 1461683 1458918 1454214
53454 1454214 1447417 1438493 1427645 1415395 1402287 1388536 1374049 1358680 1342285 1324711 1306058 1286866
53442 1286866 1267592 1247859 1226719 1203870 1180177 1156698 1133589 1110426 1087280 1064848 1043621
53431 1043621 1023500 1004319 986219 969366 953787 939722 927739 918097 910286 903507 897458 892314
53419 892314 888154 884787 882106 880329 879859 881094 884231 888973 894519 900199 906195 913363 922300 932911
53405 932911 945013 958957 975297 994029 1014550 1036359 1059435 1083828 1109250 1135382 1162442
53394 1162442 1191032 1221379 1253034 1285534 1319187 1354912 1393348 1434246 1476763 1520185 1564402
53383 1564402 1609737 1656333 1703778 1751510 1799511 1848212 1897481 1946208 1993445 2039700 2086357
53372 2086357 2133754 2180430 2224441 2264834 2301662 2335183 2365537 2392724 2416359 2435654 2450078
53361 2450078 2459899 2465794 2468145 2466955 2462051 2452974 2438982 2419703 2395673 2367888 2337044 2303546
53349 2303546 2267886 2230366 2190701 2148532 2104252 2058819 2012862 1966615 1920536 1875105 1829948
53338 1829948 1784082 1737452 1691518 1647828 1606464 1566359 1526762 1487874 1450297 1414346 1379978
53327 1379978 1347080 1315777 1286358 1258884 1233023 1208602 1186139 1166376 1149306 1134201 1120604
53316 1120604 1108612 1098025 1087921 1077523 1066934 1056586 1046482 1036468 1026801 1017924 1009985 1003062
53304 1003062 997470 993327 990226 987965 987254 988851 992224 995932 999377 1003348 1008709 1015371 1022951 1031731
53290 1031731 1042344 1054879 1068837 1083825 1099848 1117038 1135515 1155547 1177544 1201661 1227454
53279 1227454 1254005 1280457 1306456 1332036 1357113 1381317 1404456 1426816 1448632 1469326 1487762
53268 1487762 1503316 1516289 1527140 1535806 1542075 1546155 1548307 1548154 1545020 1539004 1531169 1522403 1512495
53255 1512495 1500631 1486538 1470763 1454023 1436633 1418490 1399232 1378460 1356138 1332790 1308991
53244 1308991 1284674 1259446 1233618 1208296 1184176 1160820 1137577 1114675 1092731 1071657 1050872
53233 1050872 1030364 1010586 991376 972062 952889 935279 920057 906304 892680 879230 867004
53222 867004 856405 846908 838231 830738 824529 818953 813400 807960 802911 797939 792292 785602 778243 770879
53208 770879 763751 756433 748275 739091 729327 719518 709826 700241 690969 682236 673864 665391 656629 647765
53194 647765 638956 630150 621333 612626 604029 595272 586023 576119 565584 554536 543089 531189 518709
53181 518709 505890 493544 482429 472405 462539 452134 441364 430824 420818 411340 402520 394702
53169 394702 387945 381659 374896 367189 359001 351230 344209 337430 330296 322897 315845 309561 304005 298936
53155 298936 294146 289510 285094 281101 277485 273706 269213 264164 259360 255502 252695 250619 248822 246895
53141 246895 244708 242578 241018 240261 240126 240218 240123 239628 239033 238989 239683 240440 240643 240819 242121 244853 248257 251825
53123 251825 255946 260926 266159 270928 275553 281009 287548 294195 299560 302825 304059 303942 303154 301796 299396
53108 299396 295565 290491 284685 278482 272073 265779 259912 254371 248699 242554 235957 229060 221950 214783
53094 214783 207964 201940 196775 191983 186934 181461 176010 171179 167242 164132 161670 159607 157658 155771
53080 155771 154188 153015 151958 150808 149912 149602 149333 148118 145798 143294 141458 140341 139757 139750 140033 139668
53064 139668 138057 135855 134227 133416 132688 131531 130210 129108 128169 127240 126529 126402 126904 127644 128058 127677 126311
53047 126311 124249 122323 121546 122303 123766 124393 123372 121433 119909 119170 118504 117383 116143 115198 114384 113512
53031 113512 112925 112877 112840 112118 110867 109819 109123 108187 106678 105095 104177 104147 104654 105138 105180 104865 104820 105665 107324
53012 107324 109065 110163 110357 109808 109003 108667 109364 111041 113134 115080 116598 117599 118171 118609 119184 119843
52996 119843 120346 120603 120677 120637 120667 121151 122285 123723 125001 126187 127734 129803 132246 135180 138968 143495
52980 143495 147960 151665 154723 157906 162050 167656 174636 182269 189716 196645 203133 209029 213912 217721
52966 217721 220838 223393 224986 225380 224936 224014 222389 219691 216090 212071 207823 203289 198552 193726 188707
52951 188707 183517 178744 175024 172031 168524 163606 157680 151995 147522 144363 142029 140067 138476 137581
52937 137581 137425 137325 136254 133828 130789 128375 127249 127143 127453 127919 128680 129820 131102 132143 132692 132677
52921 132677 132195 131570 131233 131280 131239 130521 129105 127570 126488 126058 126279 127087 128156 128918 129086 128979 129082 129450
52903 129450 129807 130064 130433 131022 131662 132211 132768 133472 134179 134514 134226 133529 133139 133874 135966 138659 140694 141418
52885 141418 141375 141620 142536 143622 144402 145066 145920 146653 146790 146748 147639 149747 151877 152694 152293 151856 152066 152574
52867 152574 152877 153017 153306 153989 155395 157890 161371 165150 168621 171749 174765 177730 180680 183901 187785
52852 187785 192492 197918 203765 209646 215422 221504 228413 235842 242563 247479 250409 251700 251634 250626 249459
52837 249459 248657 247845 246267 243693 240388 236480 231955 227060 222042 216621 210421 203949 198400 194285 190881
52822 190881 187282 183493 180111 177352 174779 171807 168268 164642 161819 160340 159759 159017 157530 155577 153581
52807 153581 151533 149399 147555 146355 145552 144612 143493 142688 142580 143031 143578 143731 143124 141680 139751 137979
52791 137979 136906 136622 136631 136123 134686 132741 131005 129489 127570 125257 123739 124072 125732 127120 127357 126890
52775 126890 126461 126269 126234 126396 126628 126480 125684 124528 123508 122926 122960 123649 124503 124572 123419 121725 120483 119865
52757 119865 119292 118389 117219 115692 113438 110487 107534 105267 103692 102382 101063 99732 98439 97276 96476
52742 96476 96316 96891 97975 99000 99263 98513 97365 96722 96593 95939 94085 91927 91115 92198 94139 95669
52726 95669 96530 97194 97959 98733 99375 99820 100002 100021 100302 101303 103071 105274 107475 109224 110136 110293 110512 111709
52708 111709 113992 116737 119587 122878 126915 131412 136017 140920 146375 151865 156411 159668 162129 164099
52694 164099 165022 164161 161637 158359 155058 151695 147815 143275 138523 134229 130658 127462 124144 120656 117351
52679 117351 114433 111734 109131 106833 105069 103696 102319 100621 98456 95830 93028 90562 88739 87401
52665 87401 86267 85294 84480 83577 82433 81385 80856 80665 80183 79164 77924 76808 75952 75596 76001 76860 77351
52648 77351 77065 76453 76031 75603 74639 73096 71438 70078 69153 68660 68434 68119 67499 66820 66599 67215 68741 70877
52630 70877 72881 73948 74004 73794 73877 73898 73277 72168 71140 70246 69116 67884 67239 67503 68260 68977 69444 69555
52612 69555 69287 69038 69348 70052 70373 70124 70229 71550 73691 75493 76385 76675 76704 76300 75145 73343 71552
52595 71552 70623 70988 72259 73571 74403 74824 74944 74600 73903 73602 74339 75761 76876 77205 77111 77126 77500 78386
52577 78386 79893 81730 83173 83683 83374 82777 82341 82317 82835 83833 85003 86001 86737 87398 88212 89168 89951 90195
52559 90195 89892 89465 89303 89377 89506 89884 90967 92790 94741 96206 97192 98108 99129 100063 100764 101370 102083 102868
52541 102868 103474 103670 103467 103124 102942 102968 102936 102607 102126 101899 102117 102548 102899 103179 103569 104055 104496 105009 105936
52522 105936 107321 108653 109380 109470 109242 108815 108097 107273 106850 107033 107356 107227 106676 106302 106528 107150 107710 108113
52504 108113 108686 109625 110587 111006 110808 110586 110956 111844 112584 112591 111780 110467 109151 108374 108453 109248 110375 111705
52486 111705 113424 115541 117616 119177 120253 121339 122876 124816 126578 127451 127246 126612 126513 127298 128453 129298
52470 129298 129688 129991 130625 131724 133012 133976 134405 134747 135528 136429 136505 135576 134737 135047 136207 137133 137432 137626
52452 137626 138124 138747 139307 140052 141312 143128 145303 147476 149164 150146 150876 152057 153724 155178 155950 156416
52436 156416 157273 158770 160645 162504 164017 165023 165757 166779 168443 170495 172359 173729 174809 176119 178089
52421 178089 180603 182804 183504 182086 179013 175504 172737 171308 171128 171655 172234 172310 171438 169403 166569 163903
52405 163903 162254 161586 161243 160829 160437 160065 159405 158463 157880 158300 159694 161578 163541 165272 166377 166593 166078
52388 166078 165184 164085 162867 161789 161106 160741 160460 160300 160562 161384 162551 163683 164446 164721 164758 165092 166042
52371 166042 167381 168727 170079 171663 173377 174817 175857 176807 177889 178947 179810 180624 181557 182423 182967 183387
52355 183387 184272 185944 188097 190187 192015 193785 195636 197349 198639 199661 201003 203044 205358 206942
52341 206942 207140 206324 205598 205830 207011 208541 209992 211428 213029 214656 215961 216788 217321 217909 218912 220582
52325 220582 222859 225318 227567 229706 232161 235070 238087 240838 243337 245862 248644 251750 255041 258232
52311 258232 261293 264801 269441 275021 280494 285308 290267 296589 304450 313030 321698 330446 339292 348083
52297 348083 357065 366949 378021 389656 401121 412525 424592 437709 451583 465684 479718 493756
52285 493756 508147 523226 538845 554272 568790 582365 595510 608614 621704 634786 647940
52274 647940 660885 672767 682701 690493 696695 702039 706956 711518 715585 718863 720984 721686 721050 719507
52260 719507 717569 715483 713152 710349 706905 702631 697271 690889 684330 678909 675305 672936 670777 668730
52246 668730 667767 668706 671255 674558 678335 683022 688869 695403 701917 708258 714915 722476 731173 740898 751403
52231 751403 762369 773362 783945 793847 802934 810946 817491 822484 826399 829709 832125 832841 831649 829375
52217 829375 826969 824446 821037 816005 809028 800181 790126 780019 770564 761183 750697 738778 726219
52204 726219 713793 701554 689333 677179 665058 652770 640601 629463 619916 611467 603362 595662
52192 595662 588989 583493 578644 573890 569074 564313 559940 556375 553661 551249 548677 546267 544660 543802
52178 543802 542966 541715 540324 539152 538116 536912 535349 533372 531114 528960 527235 525720 523885 521651
52164 521651 519508 517805 516325 514761 513177 511727 510302 508737 507168 505868 504950 504440 504421 504850 505337 505383
52148 505383 504826 503926 503111 502638 502328 501508 499471 496203 492578 489657 487838 486700 485526 483888 481894 480028
52132 480028 478649 477563 476183 474118 471463 468564 465757 463329 461398 459679 457704 455511 453846 453413
52118 453413 454107 455199 456064 456506 456669 457024 458289 460893 464439 468094 471568 475486 480696 487399 495115
52103 495115 503252 511558 520095 529069 538824 549899 562773 577350 592805 608257 623641 639693
52091 639693 657022 675429 694251 713023 731535 749472 766426 782311 797527 812625 827814
52080 827814 842651 856141 867408 876497 884370 891886 898910 904618 908369 909940 909157 905995 901099 895608
52066 895608 890129 884214 877084 868523 858832 848290 837132 825875 815161 805190 795725 786707 778570
52053 778570 771719 765928 760515 755091 749948 745762 743051 741892 741959 742821 744330 746767 750505 755497 761286
52038 761286 767560 774374 781697 789047 795999 802839 810236 818267 826217 833444 839941 845874 851085 855442
52024 855442 859219 862619 865154 866061 865253 863326 860688 857208 852828 848026 843340 838682 833380 826728 818407
52009 818407 808539 797506 785618 772924 759377 745067 730085 714264 697458 680091 662983 646478
51997 646478 630135 613468 596617 579991 563598 547174 530777 514812 499495 484663 470060
51986 470060 455496 440696 425397 409777 394564 380452 367420 354755 341801 328719 316499
51975 316499 306153 297756 290332 282679 274307 265618 257445 250531 245204 241157 237598 233827 229716 225543
51961 225543 221534 217836 214774 212694 211404 210087 207994 205078 201891 198996 196588 194504 192446 190262
51947 190262 188056 185985 184001 181967 179938 178093 176387 174653 173108 172338 172544 173124 173341 173153 173010 173079
51931 173079 173095 172881 172538 172098 171442 170735 170593 171517 173328 175352 177102 178626 180262 182151 183994 185260
51915 185260 185621 185130 184004 182400 180522 178663 176891 174891 172476 170046 168060 166188 163670 160624 158187
51900 158187 157000 156226 154702 152533 150774 149830 149070 148008 146979 146349 145743 144562 142922 141573 141035 141092
51884 141092 141085 140508 139422 138408 137990 138016 137757 136759 135432 134654 134974 136272 137991 139480 140317 140592 140819 141389
51866 141389 142158 142725 142957 142985 142769 142097 141095 140446 140775 141918 143051 143581 143758 144311 145635 147535 149717
51849 149717 152184 154930 157508 159270 160107 160654 161695 163535 165932 168467 170893 173393 176472 180318 184223
51834 184223 187002 188057 187729 186533 184623 182264 180146 178598 176925 174261 170848 167776 165563 163827
51820 163827 162301 161301 160918 160620 160114 159914 160512 161536 162386 163242 164691 166696 168726 170751 173198 175858
51804 175858 177736 178408 178790 179978 181771 183029 183299 183352 184003 184946 185183 184288 182814 181439 180118 178335
51788 178335 175958 173447 171195 169121 167099 165443 164555 164259 164032 163835 164169 165125 165948 165928 165368 165144 165551
51771 165551 166060 166166 165933 165651 165415 165240 165209 165250 165061 164540 164135 164474 165752 167671 169893 172229 174477 176392
51753 176392 177935 179396 181117 183203 185598 188392 191921 196449 201727 206956 211399 215051 218590 222727
51739 222727 227813 234079 241808 250977 261102 271862 283689 297307 312869 330089 349087 370355
51727 370355 393695 417879 441689 464645 486190 504679 517922 524674 525113 520200 511240 499921
51715 499921 487883 475828 463468 450555 437546 425041 413100 401537 390670 381315 373992 368326
51703 368326 363233 357647 351224 344518 338404 333265 328834 324748 321016 317879 315548 314216 314062 314951 316358
51688 316358 317813 319311 321059 323056 325161 327443 330152 333413 337162 341276 345442 348941 350896 350899 349351
51673 349351 347208 345420 344402 343853 343251 342707 343118 345150 348339 351673 354926 358878 364193 370681 377859
51658 377859 385738 394626 404446 414538 423870 431252 435659 436840 435509 432612 428453 422726 415269 406448
51644 406448 396841 386828 376539 366038 355476 345129 335293 326090 317542 309797 303050 297097 291238
51631 291238 284913 278275 271880 266047 260807 256283 252610 249544 246590 243605 240907 238718 236751 234461
51617 234461 231438 227646 223638 220542 219276 219540 219952 219461 218324 217425 217042 216697 215993 215084 214346 213928 213704
51600 213704 213371 212576 211198 209547 208134 207186 206535 205974 205570 205539 205910 206480 207121 208080 209837 212534 215701
51583 215701 218777 221812 225371 229762 234778 240303 246662 254000 261734 269070 275871 282563 289417 296382
51569 296382 303477 310709 317526 322855 325902 326674 325693 323547 320752 317588 313864 309164 303544 297725 292425
51554 292425 287757 283410 279141 274892 270766 267175 264830 264288 265534 268107 271495 275274 279114 282930
51540 282930 286950 291486 296648 302367 308516 314929 321400 327810 334076 339895 344690 347956 349615 350027
51526 350027 349799 349537 349484 349279 348302 346378 343957 341596 339575 338059 337187 336798 336501 336270 336612 337827 339520
51509 339520 341213 342982 344992 346761 347561 347375 346804 346059 344654 342130 338514 333920 328263 321688 314853
51494 314853 308430 302419 296227 289451 282504 276393 271700 267770 263199 257382 251293 246443 243375 241535
51480 241535 240271 239328 238528 237728 237187 237399 238424 239846 241433 243342 245648 248222 251162 254760 258913
51465 258913 263182 267548 272415 277695 282718 287474 293065 300303 308538 316662 324712 333517 343101 352438
51451 352438 360804 368540 376324 384284 392001 398925 404686 409365 413449 417213 420207 421790 422033 421618 420939
51436 420939 419924 418724 417904 417757 418034 418610 419819 421783 423939 425736 427493 430067 433870 438573 443541
51421 443541 448113 451565 453392 453725 453127 451823 449356 445227 439611 433279 426891 420610 414376 408272 402464
51406 402464 396940 391597 386581 382354 379265 377200 375716 374374 372864 371026 368950 366960 365270 363721
51392 363721 362057 360375 359061 358308 357933 357732 357812 358530 360151 362551 365253 367850 370469 373477 376600 378649
51376 378649 378578 376595 373773 370631 366600 360826 353007 343404 332657 321726 311441 301737 291761 280993
51362 280993 269886 259163 249067 239750 231821 225714 220722 215423 209192 202779 197294 193077 189699
51349 189699 186676 183899 181546 179749 178306 176747 174803 172672 170593 168380 165793 163292 161794 161497
51335 161497 161506 160980 160236 160223 161127 162056 162114 161342 160490 160155 160364 160842 161488 162558 164357 166729 169009 170711
51317 170711 172187 174309 177425 180923 183983 186561 189370 193047 197581 202515 207450 212296 217226 222492
51303 222492 228222 234363 240806 247415 253875 259687 264613 268969 273167 276963 279578 280588 280236 278694
51289 278694 275583 270689 264728 258751 252883 246286 238440 229915 221633 213888 206470 199453 193372 188623
51275 188623 184939 181533 177680 173193 168425 163827 159505 155336 151428 148163 145679 143604 141538 139608
51261 139608 138170 137070 135625 133505 131277 129799 129237 129066 128957 129197 130019 130951 131381 131480 131891 132418 131907
51244 131907 129882 127672 127129 128573 130842 133151 135841 139126 142156 143949 144581 144776 144724 144013 142511 140653
51228 140653 138964 137746 137195 137315 137730 137939 137780 137352 136623 135529 134353 133520 133008 132384 131496 130662 130115
51211 130115 129664 129104 128555 128182 127894 127575 127367 127435 127708 128041 128510 129270 130275 131339 132375 133316 133892 133750
51193 133750 132862 131683 130783 130321 129954 129283 128429 128000 128374 129137 129456 128903 127646 125947 123970 122155 121261
51176 121261 121577 122414 122757 122342 121798 121816 122466 123242 123537 123143 122512 122436 123187 124083 124231 123640 123224 123714 124972
51157 124972 126538 128353 130597 133081 135200 136440 136701 136210 135368 134569 133823 132542 130060 126466 122703
51142 122703 119675 117483 115681 114029 112655 111575 110521 109434 108814 109189 110241 110810 110015 108260 106883
51127 106883 106796 107739 108960 110287 112134 114580 117041 119020 120779 122867 125339 127881 130500 133506 136824
51112 136824 139923 142540 144933 147155 148646 149043 148960 149340 150204 150610 149875 148282 146470 144637 142685 140787
51096 140787 139425 138927 139140 139593 139853 139852 139958 140619 141880 143300 144479 145519 146801 148279 149217 148795 146984
51079 146984 144628 142565 140847 139028 137065 135494 134693 134469 134571 135121 136110 136937 137099 137070 137738 139019 139804
51062 139804 139478 138676 138178 137806 137030 136141 135962 136589 137190 137147 136756 136616 136870 137417 138428 140125 142188 143920
51044 143920 145119 146427 148579 151553 154757 157872 161046 164308 167293 169862 172529 175845 179576 182970
51030 182970 185674 187888 189707 190917 191489 191750 191920 191932 191791 191553 190782 188644 184968 180758 177219 174623
51014 174623 172468 170352 168241 166217 164471 163322 162803 162470 162026 161841 162407 163602 165051 166900 169509
50999 169509 172558 175274 177570 180233 183810 187977 192235 196611 201317 206147 210719 215129 220119 226644
50985 226644 235217 245364 255736 265173 273812 282941 293675 306188 320175 335558 352440 370832
50973 370832 390780 412582 436642 463236 492496 524435 559036 596570 637738 682958 731479
50962 731479 781771 832992 885547 939955 995739 1051736 1106892 1160195 1210270 1255733 1295766
50951 1295766 1329831 1357021 1376308 1387424 1391110 1388455 1380278 1367021 1348889 1326139 1299560 1270653
50939 1270653 1241049 1211758 1183148 1155446 1128925 1103650 1079357 1055637 1032186 1008973 986184
50928 986184 963747 940875 916493 890283 862812 834358 804299 772224 739017 705994 673389
50917 673389 640679 608247 577597 549752 524356 500675 478628 458421 439909 422964 407955
50906 407955 395267 384631 375464 367655 361512 357031 353615 350557 347594 345000 343267 342646 342925 343719
50892 343719 344932 346729 349109 351796 354543 357228 359655 361696 363659 366080 369058 372248 375602 379486
50878 379486 383889 388201 392189 396603 402259 409073 416573 424886 434446 445042 455961 467047 478959
50865 478959 492408 507743 525212 545024 567078 591210 617813 647780 681801 720151 763149
50854 763149 811308 865000 924598 991001 1065327 1147804 1237468 1333289 1435075 1542939 1656402
50843 1656402 1774568 1896756 2022335 2149849 2276641 2399339 2514614 2619671 2712232 2789980
50833 2789980 2850137 2890118 2908906 2907547 2888056 2852234 2801873 2739617 2668933 2593242 2515512
50822 2515512 2438517 2364880 2296626 2234925 2180190 2132090 2089389 2050103 2012002 1973013 1931538
50811 1931538 1886777 1838695 1787240 1731659 1671017 1605369 1535871 1463678 1389372 1313782 1238812
50800 1238812 1166736 1098790 1034918 974925 919403 869402 825409 786951 753095 723175 697036
50789 697036 674754 656317 641588 630428 622626 617747 615214 614598 615684 618194 621526 624893 627738
50776 627738 630034 632138 634278 636133 637000 636431 634600 631977 628851 625324 621504 617321 612371 606391 599850
50761 599850 593623 588058 582917 578332 575155 573916 573942 574160 574505 575981 579435 584879 592075 601234 612909
50746 612909 627555 645428 666629 690926 717725 746557 777610 811583 848984 889754 933705
50735 933705 981251 1033481 1091432 1155404 1225058 1300053 1380297 1465482 1554554 1645652 1736457
50724 1736457 1824576 1907903 1984807 2053935 2113865 2163152 2200734 2225949 2237969 2235658 2218375
50713 2218375 2186741 2142378 2087195 2023354 1953738 1881761 1810460 1741987 1677888 1619411 1567305
50702 1567305 1521530 1481394 1445927 1414173 1385308 1358506 1332605 1306068 1277475 1246058 1211547
50691 1211547 1173773 1132758 1089115 1043914 998157 952621 908180 865821 826341 790352 758495
50680 758495 731139 707867 687875 670981 657750 648405 642222 638318 636568 637380 641005 647475 656855
50667 656855 669125 684021 701319 720902 742169 763732 784276 803522 821948 839800 856968
50656 856968 873656 890497 907829 925303 942387 959001 975560 992654 1010779 1030217 1051080
50645 1051080 1073533 1097999 1125121 1155650 1190257 1229074 1271278 1315617 1361693 1410399 1462643
50634 1462643 1517932 1574689 1631668 1688390 1744308 1798266 1848974 1895528 1937285 1973586 2003856
50623 2003856 2027780 2045357 2057036 2063811 2066923 2067362 2065799 2062886 2059481 2056734 2056219 2059661 2067916 2080191
50609 2080191 2094668 2109817 2124775 2138722 2150560 2159267 2163986 2163671 2157165 2143694 2122789 2093739
50597 2093739 2055782 2009015 1954453 1893047 1825352 1752580 1677146 1601559 1527081 1454045 1383043
50586 1383043 1315180 1251299 1191556 1135774 1083832 1035732 991518 951107 914150 880278 849632
50575 849632 822813 800055 780730 763988 749640 738085 729647 724316 721985 722466 725307 729916 736015
50562 736015 743879 754117 767121 782551 799432 817109 836086 857469 881488 907154 933598 961143
50550 961143 990608 1022044 1054781 1088330 1122611 1157411 1192190 1226417 1259754 1292031 1323360
50539 1323360 1354117 1384475 1414204 1443300 1472594 1503339 1536503 1572938 1613840 1660195 1711770
50528 1711770 1767406 1826533 1889950 1959010 2034490 2116386 2204279 2297538 2395312 2496511 2599737
50517 2599737 2703264 2805173 2903451 2995855 3079936 3153500 3214819 3262120 3293232 3306408 3301439
50506 3301439 3279474 3241819 3189410 3123398 3045720 2958968 2866274 2771471 2678830 2592204 2514381
50495 2514381 2447205 2392009 2349998 2322414 2310202 2313032 2328706 2353884 2385403 2420556 2456287
50484 2456287 2488752 2513770 2527327 2525893 2507032 2470122 2416105 2346577 2263554 2169978 2069497
50473 2069497 1965302 1859626 1754515 1652331 1555053 1463601 1378300 1299639 1228136 1163824
50463 1163824 1106329 1055200 1009946 970071 935440 906318 882654 863558 847810 834758 824503
50452 824503 817420 813718 813228 815476 820205 827902 839348 854485 872162 891275 911680 933704 957246
50439 957246 981895 1007565 1034484 1062743 1092259 1122902 1154292 1185789 1217113 1248671 1280777
50428 1280777 1312832 1343811 1373311 1401545 1428478 1453706 1477167 1499246 1519950 1538476 1553997
50417 1553997 1566604 1577263 1587053 1596674 1606625 1617607 1630591 1646412 1665338 1687138 1711471 1738003
50405 1738003 1766230 1795590 1825873 1857128 1888883 1919791 1948240 1973119 1993829 2009929 2020992
50394 2020992 2026473 2025396 2016447 1998584 1971223 1933823 1886025 1828773 1764699 1696749 1626764 1555976
50382 1555976 1486304 1420195 1359383 1304720 1257186 1218085 1188049 1166601 1153030 1147069 1148382 1155921
50370 1155921 1168190 1183810 1201450 1219369 1235382 1247362 1253734 1253556 1246226 1231263 1208697 1179637
50358 1179637 1146047 1109728 1071842 1033520 996167 960588 926434 893230 861521 832210 805256
50347 805256 780005 756582 735809 717854 702055 688095 676177 665876 656077 646538 638417 632655
50335 632655 628802 626106 624833 625646 628429 632706 638717 647096 657742 669871 683019 697281 712635
50322 712635 728671 744956 761207 777199 792932 808789 825118 841809 858652 875893 893994
50311 893994 912998 932485 952015 971197 989625 1007143 1023938 1039835 1053733 1064395 1071697 1076529
50299 1076529 1079515 1080418 1078853 1074988 1069330 1062215 1053677 1043513 1031416 1017351 1001859 985656 968893
50286 968893 951161 932213 912268 891518 869830 847216 824219 801562 779634 758575 738654
50275 738654 720170 703039 686767 670919 655457 640573 626341 612621 599267 586293 573818
50264 573818 561983 550982 541099 532581 525560 520195 516688 514831 513676 512091 509747 507256 505284 503969
50250 503969 503306 503552 504847 506783 508800 510822 513075 515402 517112 517519 516471 514492 512513 511173 510179
50235 510179 508571 505864 502589 499450 496378 492868 488875 484824 480954 477252 473919 471367 469748 468942
50221 468942 468865 469329 469770 469726 469577 470231 472012 474383 476796 479283 482171 485691 489913 494508 498556 501186
50205 501186 502539 503516 504474 504866 504359 503491 502790 501890 500163 497790 495592 494082 493168 492561 492042 491497 491119
50188 491119 491395 492580 494355 496298 498381 500616 502498 503340 503022 501894 499986 496886 492506 487570 483071
50173 483071 479411 476185 472807 469299 466477 465198 465480 466602 468144 470399 473495 476538 478129 477551 474994
50158 474994 470901 465622 459543 452909 445486 436987 427906 419338 411829 405060 398898 394101 391368 390154
50144 390154 389175 387947 387141 387267 387631 386975 384907 382327 380539 380203 381112 382670 384445 386410 388809 391769
50128 391769 395015 398089 400980 404364 409007 414958 421579 428344 435316 442704 450323 457782 465049 472500
50114 472500 480398 488575 496603 504066 510602 515912 519901 522858 525445 528406 532066 536004 539370 541687
50100 541687 543258 544583 545553 545600 544610 543286 542327 541554 540201 538023 535764 534433 534372 535271 536905 539447
50084 539447 542929 546726 550019 552774 555936 560513 566626 573610 580866 588419 596761 606378 617468 629944
50070 629944 643576 658054 672981 687929 702706 717460 732256 746607 759785 771659 782778
50059 782778 793439 803119 811229 817988 823955 828966 832233 833507 833454 832734 831265 828694 825065 820677 815633
50044 815633 809930 803715 797035 789529 780758 770765 759984 748683 736855 724612 712348 700424 688964
50031 688964 677998 667575 657569 647665 637721 628080 619354 611889 605551 600009 595109 590874 587273
50018 587273 584159 581500 579436 577969 576721 575277 573684 572269 570896 568866 565819 562467 559971 558705
50004 558705 557976 556923 555248 553050 550453 547787 545772 544986 545076 544856 543370 540716 537721 535077 533052
49989 533052 531861 531868 533247 535756 539177 543818 550214 558385 567812 578255 590206 604188 619852 636066
49975 636066 651737 666286 679458 691114 701208 709643 716060 720052 721750 722042 722132 722939 724796 727334
49961 727334 729537 730195 728584 724624 718338 709445 697630 682947 665671 645946 623862 599843 574745
49948 574745 549688 525822 503957 484061 465327 447203 430319 416006 404940 396602 390006 384454
49936 384454 379534 374996 370971 367869 365666 363664 361315 359010 357559 357211 357670 358902 361217 364505 368027
49921 368027 371153 373843 376141 377695 378160 377799 377270 376988 377059 377663 379004 380840 382405 382986 382438 381094
49905 381094 379299 377155 374622 371754 368836 366304 364479 363412 362952 362883 363010 363281 363876 364935 366087 366557
49889 366557 366120 365681 366485 368776 371766 374898 378521 383020 387878 392179 395766 399375 403798 409460 416688
49874 416688 425667 435896 446336 456530 467326 480082 495380 512794 531738 552112 574227 598487
49862 598487 625145 653958 683974 713896 742731 769955 795150 817907 838220 856571 873359
49851 873359 888575 902244 914910 927252 939323 950553 960404 968647 974902 978307 977792 972602 962533
49838 962533 947910 929464 908011 884113 858099 830475 802112 773922 746458 719869 694128
49827 694128 669205 645176 622215 600412 579604 559598 540597 523116 507372 493034 479770
49816 479770 467677 456853 446870 437283 428520 421605 416749 412723 408029 402414 396833 392148 388365 385163
49802 385163 382621 381091 380556 380441 380023 378853 376832 374159 371296 368782 366860 365266 363487 361235 358659
49787 358659 356225 354402 353312 352492 351112 348687 345567 342612 340469 339337 339244 340133 341617 343078 344142
49772 344142 344798 344965 344428 343402 342704 342933 343856 344959 346259 348059 350237 352446 354833 357836 361315 364646
49756 364646 367748 371252 375400 379642 383761 388708 395614 404455 414373 424967 436512 449119 462550
49743 462550 476998 493320 512175 533307 555951 579598 604079 629021 653468 676043 695576
49732 695576 711718 724962 736000 745204 752891 759783 766725 773934 780894 787021 792111 796118 798886
49719 798886 800079 798954 794183 784468 769647 750790 729054 704985 679213 653161 628327 605166
49707 605166 583306 562674 543764 526882 511887 498820 488108 479847 473382 467969 463496 460127
49695 460127 457566 455162 452640 450273 448297 446556 444869 443466 442786 442923 443485 444027 444459 444933 445442 445744
49679 445744 445726 445637 445816 446230 446523 446489 446338 446466 447127 448377 450105 451952 453347 453933 453999 454342 455570 457570
49661 457570 459704 461544 463239 465143 467179 468804 469580 469528 468822 467471 465574 463668 462394 461853 461620 461335
49645 461335 460889 460087 458701 457025 455802 455275 454818 453951 453207 453370 454195 454752 454939 455715 457603 459696 460716
49628 460716 460574 460339 460913 462270 463867 465245 466132 466400 466292 466577 468186 471493 475928 480407 484264 487765
49612 487765 491632 496208 501279 506623 512297 518261 524100 529442 534440 539524 544850 550235 555594 561107
49598 561107 567042 573623 581026 589229 597911 606781 616023 626162 637459 649715 662754 676826 692327
49585 692327 709260 727181 745651 764692 784813 806637 830413 855881 882609 910352 938953
49574 938953 968071 997421 1027335 1058677 1091970 1126831 1162567 1199080 1236849 1276139 1316633
49563 1316633 1357905 1399873 1442689 1486515 1531646 1578476 1626971 1676255 1725154 1773157 1820488
49552 1820488 1867163 1912416 1955328 1995634 2033393 2068048 2098462 2124004 2145054 2162069 2174571
49541 2174571 2181542 2182652 2178657 2170617 2159099 2144208 2126073 2105252 2082883 2060420 2038903 2018423
49529 2018423 1998640 1979893 1963416 1950270 1940441 1933332 1928795 1927256 1928997 1933866 1941700 1952552 1966282
49516 1966282 1982342 2000215 2019895 2041687 2065708 2091782 2119599 2148585 2177700 2205852 2232733
49505 2232733 2258920 2284861 2309900 2332511 2351337 2365770 2375745 2381463 2383264 2381185 2374426 2361682
49493 2361682 2342301 2316766 2285761 2249314 2207435 2161219 2112318 2061310 2007435 1950317 1891296
49482 1891296 1832571 1775433 1719725 1664695 1609868 1555405 1502145 1451200 1403055 1357146 1312662
49471 1312662 1269639 1228818 1190648 1154977 1121662 1090849 1062481 1036146 1011672 989327 969098
49460 969098 950263 932174 915162 900076 887091 875504 864629 854343 844620 835122 825614 816577
49448 816577 808970 803350 799317 795838 792097 788093 784492 781819 779799 777601 774801 771970 770204 770177 771721
49433 771721 774194 777059 780237 784120 789311 796111 804216 812995 822131 831948 843191 856638 872899
49420 872899 892178 913967 937014 959655 980090 996449 1007158 1011797 1011568 1008633 1004934 1001757 1000055
49407 1000055 1000514 1003222 1007698 1013552 1020823 1029636 1039844 1051255 1063796 1077154 1090548 1103258 1115272
49394 1115272 1127057 1138761 1149983 1160259 1169488 1177865 1185679 1193223 1200745 1208405 1216349 1224680 1233227
49381 1233227 1241600 1249755 1258385 1268356 1279789 1292018 1304425 1316954 1329720 1342627 1355637 1369136
49369 1369136 1383708 1399601 1416650 1434623 1453512 1473437 1494387 1516132 1538430 1561324 1585045
49358 1585045 1609514 1634206 1658794 1683790 1710084 1737910 1766753 1796330 1827175 1859972 1894752
49347 1894752 1931138 1969084 2008939 2050908 2094801 2140310 2187370 2236327 2287902 2342736 2400683
49336 2400683 2460645 2521423 2582720 2645139 2709345 2775447 2843065 2911654 2980807 3050550 3121394
49325 3121394 3193921 3268233 3343883 3420211 3496475 3571815 3645473 3717137 3786719 3853678 3916824
49314 3916824 3974983 4027609 4074500 4115086 4148329 4173366 4190072 4198872 4200211 4194414 4182060 4164164
49302 4164164 4141749 4115379 4085429 4052793 4018939 3985113 3951799 3919218 3888034 3859210 3833305
49291 3833305 3810334 3790299 3773457 3760139 3750652 3745447 3745026 3749486 3758387 3771145 3787357 3806685
49279 3806685 3828729 3853222 3880084 3908995 3939061 3969202 3998834 4027923 4056285 4082991 4106561
49268 4106561 4125697 4139726 4148425 4151610 4149083 4140800 4126813 4106929 4080709 4047991 4009201 3964969
49256 3964969 3915661 3861598 3803499 3742255 3678387 3612220 3544617 3476949 3410071 3343708 3277219
49245 3277219 3210746 3145411 3082614 3023422 2968372 2917425 2869994 2825229 2782415 2741222 2701753
49234 2701753 2664372 2629249 2595977 2563832 2532540 2502511 2474222 2447657 2422529 2398688 2375992
49223 2375992 2354087 2332808 2312635 2294248 2277599 2261805 2246019 2230085 2214285 2198806 2183613
49212 2183613 2168557 2153430 2138084 2122682 2107685 2093405 2079678 2066144 2052839 2040405 2029624
49201 2029624 2020716 2013116 2006017 1999184 1993081 1988214 1984508 1981590 1979495 1978773 1979874 1982712 1986863 1991956
49187 1991956 1997721 2003901 2010316 2016946 2023851 2031135 2039109 2048294 2059002 2070907 2083275 2095699 2108493
49174 2108493 2122268 2137293 2153460 2170830 2189854 2210850 2233429 2256750 2280346 2304431 2329368
49163 2329368 2355186 2381804 2409429 2438366 2468567 2499720 2531784 2565038 2599482 2634460 2669230
49152 2669230 2703884 2739395 2776547 2814842 2852744 2889204 2924790 2961019 2998594 3036594 3073331
49141 3073331 3107419 3137881 3163886 3185114 3202201 3216287 3228253 3238772 3248747 3258891 3268833 3277445
49129 3277445 3284337 3290455 3296955 3304113 3311674 3319683 3328299 3337148 3345455 3352779 3359205 3365007 3370557 3376435
49115 3376435 3383146 3390648 3398465 3406252 3414010 3421798 3429576 3437243 3444605 3451383 3457547 3463520 3469624 3475453
49101 3475453 3480309 3484320 3488616 3494189 3500954 3508081 3514775 3520501 3524965 3528403 3531657 3535458 3539671 3543634
49087 3543634 3547172 3550849 3555195 3560120 3565262 3570637 3576702 3583920 3592413 3601895 3611791 3621483 3630600 3639032
49073 3639032 3646642 3653086 3658078 3661790 3664763 3667343 3669224 3669655 3668108 3664696 3659918 3653978 3646509 3637040
49059 3637040 3625639 3612864 3599113 3584279 3568166 3550953 3533002 3514435 3495229 3475639 3456141
49048 3456141 3436913 3417687 3398208 3378536 3358827 3339188 3319909 3301549 3284465 3268516 3253463
49037 3253463 3239423 3226605 3214888 3204162 3194931 3187955 3183227 3179763 3176617 3173657 3171140 3169038 3167193
49024 3167193 3165881 3165686 3166786 3168695 3170751 3172606 3174175 3175382 3176152 3176595 3176956 3177259 3177138 3176230 3174798 3173646
49008 3173646 3173163 3172659 3171102 3168408 3165549 3163258 3161137 3158337 3154633 3150337 3145403 3139261 3131623 3123061
48994 3123061 3114599 3106919 3099941 3092936 3084968 3075495 3064744 3053442 3042085 3030539 3018275 3004790
48982 3004790 2989720 2972768 2953762 2932760 2910002 2885750 2860220 2833625 2806201 2778144 2749573
48971 2749573 2720575 2691270 2661755 2632071 2602379 2573208 2545258 2518775 2493260 2468152 2443742
48960 2443742 2421100 2401024 2383403 2367689 2353576 2340965 2329647 2319484 2310850 2304477 2300827 2299828
48948 2299828 2301151 2304442 2309222 2314864 2320891 2327268 2334390 2342793 2352822 2364422 2377272 2391187 2406331
48935 2406331 2422957 2440964 2459832 2479014 2498400 2518495 2540094 2563619 2588665 2614298 2639845
48924 2639845 2665260 2690829 2716890 2743942 2772560 2802836 2834122 2865651 2897301 2929542 2962869
48913 2962869 2997492 3033319 3069956 3106968 3144497 3183335 3223958 3265764 3307749 3349690 3392064
48902 3392064 3435006 3478002 3520642 3563115 3605820 3649000 3692774 3737024 3781209 3824788 3867834
48891 3867834 3910622 3952539 3992132 4028542 4062334 4094567 4125515 4154627 4181271 4205116 4226068
48880 4226068 4244218 4259657 4272133 4281120 4286357 4287979 4286070 4280521 4271425 4259024 4243042 4222704
48868 4222704 4197762 4168969 4137188 4102602 4065237 4025644 3984479 3941933 3898102 3853404 3807950
48857 3807950 3761139 3712674 3663500 3614755 3566222 3516970 3467359 3419165 3373547 3329969 3287478
48846 3287478 3246065 3206269 3168295 3132178 3098253 3066783 3037463 3009846 2984054 2960710 2940385
48835 2940385 2923404 2909898 2899647 2892014 2886288 2881996 2878790 2876342 2874636 2874150 2875512 2879101 2885041
48822 2885041 2893249 2903257 2914318 2926039 2938784 2953180 2969390 2987030 3005652 3025056 3045287
48811 3045287 3066497 3088698 3111568 3134750 3158446 3183404 3210057 3237959 3266343 3294916 3323777
48800 3323777 3352830 3381831 3410913 3440545 3470943 3501906 3533275 3565112 3597282 3629205 3660306
48789 3660306 3690567 3720460 3750459 3780710 3810987 3840755 3869447 3896932 3923724 3950565 3977664
48778 3977664 4004424 4029965 4053889 4076461 4098054 4118550 4137368 4153981 4168237 4180178 4189653
48767 4189653 4196169 4199157 4198406 4194215 4186948 4176325 4161389 4141489 4117150 4089606 4059483 4026417
48755 4026417 3990098 3951184 3910843 3869738 3827882 3785187 3741590 3696699 3649883 3600940 3550412
48744 3550412 3499191 3448105 3397935 3349328 3302390 3256628 3211761 3168560 3128538 3092731 3060971
48733 3060971 3032444 3006751 2984285 2965683 2951115 2940121 2932084 2926832 2924809 2926536 2931849 2939755
48721 2939755 2949196 2959848 2971947 2985437 2999711 3014302 3029457 3045728 3063241 3081692 3100883
48710 3100883 3120855 3141560 3162729 3184012 3204936 3224797 3242995 3259530 3274882 3289409 3303213
48699 3303213 3316587 3330110 3344261 3359348 3375875 3394400 3414861 3436642 3459675 3484872 3513041
48688 3513041 3543885 3576754 3611930 3650404 3692598 3738161 3787009 3839762 3896915 3958222 4023226
48677 4023226 4091944 4164659 4241359 4321622 4404803 4490036 4576246 4662333 4747301 4830204 4910183
48666 4910183 4986546 5058500 5124788 5183905 5234729 5276534 5308319 5328632 5336349 5331240 5313504 5283200
48654 5283200 5240602 5186878 5123880 5053327 4976469 4894406 4808338 4719572 4629537 4539609 4450563
48643 4450563 4362314 4274620 4188007 4103567 4021941 3943023 3866726 3793494 3723734 3657163 3593101
48632 3593101 3531184 3471416 3413762 3358137 3304740 3254007 3206014 3160154 3115591 3071941 3029400
48621 3029400 2988213 2948267 2909291 2871320 2834707 2799566 2765460 2731815 2698513 2665890 2634251
48610 2634251 2603721 2574508 2546879 2520709 2495426 2470648 2446638 2423801 2401932 2380325 2358604
48599 2358604 2337119 2316466 2296894 2278320 2260719 2244255 2229019 2214770 2201005 2187394 2174178
48588 2174178 2162104 2151904 2143837 2137700 2133076 2129450 2126314 2123485 2121292 2120180 2120080 2120400 2120770 2121616
48574 2121616 2123874 2128216 2134558 2142237 2150610 2159548 2169413 2180514 2192701 2205574 2218940 2232783 2246820
48561 2246820 2260355 2272655 2283280 2292146 2299606 2306474 2313538 2320925 2328290 2335700 2343784 2352740 2361769
$$ [...]
##END NTUPLES=NMR SPECTRUM
##END=
