
##TITLE=AC1219_Punto_6074594_2hvtUaqCzT
##JCAMPDX= 6.0         $$ Bruker NMR JCAMP-DX V2.0
##DATA TYPE= NMR SPECTRUM
##DATA CLASS= NTUPLES
##ORIGIN= BRUKER
##OWNER= Administrator
$$ 1.72 TOPSPIN		Version 2.1
$$ 2012-05-07 19:40:08.609 -0500  Administrator@TOPSPIN
$$ Compression mode = diff/dup
##.OBSERVE FREQUENCY= 400.13188235
##.OBSERVE NUCLEUS= ^1H
##.ACQUISITION MODE= SIMULTANEOUS (DQD)
##.ACQUISITION SCHEME= undefined
##.AVERAGES= 64
##.DIGITISER RES= 22
##SPECTROMETER/DATA SYSTEM= spect
##.PULSE SEQUENCE= noesygpps1d.comp
##.SOLVENT NAME= COFFEE_meoh
##.SHIFT REFERENCE= INTERNAL, COFFEE_meoh, 1, 14.96683
##AUDIT TRAIL= $$ (NUMBER, WHEN, WHO, WHERE, PROCESS, VERSION, WHAT)
$$ ##TITLE= Audit trail, TOPSPIN		Version 2.1
$$ ##JCAMPDX= 5.01
$$ ##ORIGIN= Bruker BioSpin GmbH
$$ ##OWNER= Administrator
$$ $$ C:\Bruker\TOPSPIN/data/COFFEE/nmr/AC1219_Punto_6074594_2hvtUaqCzT/12/pdata/1/auditp.txt
$$ ##AUDIT TRAIL=  $$ (NUMBER, WHEN, WHO, WHERE, PROCESS, VERSION, WHAT)
(   1,<2012-05-07 19:40:03.703 -0500>,<Administrator>,<TOPSPIN>,<go>,<TOPSPIN 2.1>,
      <created by zg
	started at 2012-05-07 19:28:33.406 -0500,
	POWCHK enabled, PULCHK disabled,
       configuration hash MD5:
       AF F2 23 6B 01 CD 40 DD E5 A1 38 A0 06 EA F7 77
       data hash MD5: 64K
       0D D0 DF 1E E9 9E 0D C2 4F 54 4B E8 84 5F F8 48>)
(   2,<2012-05-07 19:40:06.609 -0500>,<Administrator>,<TOPSPIN>,<proc1d>,<TOPSPIN 2.1>,
      <Start of raw data processing
       efp LB = 0.3 FT_mod = 6 PKNL = 1 PHC0 = 0 PHC1 = 0 SI = 128K 
       data hash MD5: 128K
       3E 8E C5 21 39 AB E8 C1 6B 16 05 BB 17 4A 66 FF>)
(   3,<2012-05-07 19:40:07.765 -0500>,<Administrator>,<TOPSPIN>,<proc1d>,<TOPSPIN 2.1>,
      <pk PHC0 = 29.86633 PHC1 = 0 
       data hash MD5: 128K
       75 6C 96 BD 6B 14 DD CF 97 C5 08 01 6F 94 3A C2>)
(   4,<2012-05-07 19:40:08.296 -0500>,<Administrator>,<TOPSPIN>,<proc1d>,<TOPSPIN 2.1>,
      <abs ABSG = 1 
       data hash MD5: 128K
       2B EE D4 1E 87 57 51 88 2B E8 F7 5F 3F B1 73 8E>)
(   5,<2012-05-07 19:40:08.375 -0500>,<Administrator>,<TOPSPIN>,<proc1d>,<TOPSPIN 2.1>,
      <abs ABSG = 2 
       data hash MD5: 128K
       A7 94 7D 01 E3 2D CD F7 14 6C 82 DA 82 7C C0 B5>)
(   6,<2012-05-07 19:40:08.421 -0500>,<Administrator>,<TOPSPIN>,<proc1d>,<TOPSPIN 2.1>,
      <abs ABSG = 3 
       data hash MD5: 128K
       9B 42 92 6B A5 38 32 D2 5B 09 63 99 49 98 F9 18>)
(   7,<2012-05-07 19:40:08.484 -0500>,<Administrator>,<TOPSPIN>,<proc1d>,<TOPSPIN 2.1>,
      <abs ABSG = 4 
       data hash MD5: 128K
       47 D3 F9 8D C8 D9 99 B7 0A DF 0D 57 88 44 56 33>)
(   8,<2012-05-07 19:40:08.531 -0500>,<Administrator>,<TOPSPIN>,<proc1d>,<TOPSPIN 2.1>,
      <abs ABSG = 5 
       data hash MD5: 128K
       0B 79 55 B9 E4 20 E2 4D 9B 87 69 57 96 E7 23 D0>)
$$ ##END=
$$ 
$$ $$ hash MD5
$$ $$ 6E DF 05 FD E4 B5 8A 85 87 32 A6 9D 0B 92 D0 B5
##$RELAX= 
##$RELAX= 
##$RELAX= 
##$RELAX= 
##$RELAX= 
##$RELAX= 
##$RELAX= 
##$RELAX= 
$$ Bruker specific parameters
$$ [...]
150 150 150 150 150 150 150 150
##$TP07= 0
##$TPNAME0= <>
##$TPNAME1= <>
##$TPNAME2= <>
##$TPNAME3= <>
##$TPNAME4= <>
##$TPNAME5= <>
##$TPNAME6= <>
##$TPNAME7= <>
##$TPOAL= (0..7)
0.5 0.5 0.5 0.5 0.5 0.5 0.5 0.5
##$TPOFFS= (0..7)
0 0 0 0 0 0 0 0
##$TUNHIN= 0
##$TUNHOUT= 0
##$TUNXOUT= 0
##$USERA1= <user>
##$USERA2= <user>
##$USERA3= <user>
##$USERA4= <user>
##$USERA5= <user>
##$V9= 5
##$VALIST= <valist>
##$VCLIST= <CCCCCCCCCCCCCCC>
##$VD= 0
##$VDLIST= <DDDDDDDDDDDDDDD>
##$VPLIST= <PPPPPPPPPPPPPPP>
##$VTLIST= <TTTTTTTTTTTTTTT>
##$WBST= 1024
##$WBSW= 4
##$XGAIN= (0..3)
0 0 0 0
##$XL= 0
##$YL= 0
##$YMAX_a= 11143688
##$YMIN_a= -6075837
##$ZGOPTNS= <>
##$ZL1= 120
##$ZL2= 120
##$ZL3= 120
##$ZL4= 120
##$ABSF1= 14.96683
##$ABSF2= -5.5857
##$ABSG= 5
##$ABSL= 3
##$ALPHA= 0
##$AQORDER= 0
##$ASSFAC= 0
##$ASSFACI= 0
##$ASSFACX= 0
##$ASSWID= 0
##$AUNMP= <proc_prof1d_extract.lims>
##$AXLEFT= 0
##$AXNAME= <>
##$AXNUC= <1H>
##$AXRIGHT= 0
##$AXTYPE= 0
##$AXUNIT= <>
##$AZFE= 0.1
##$AZFW= 0.1
##$BCFW= 0
##$BC_mod= 0
##$BYTORDP= 0
##$COROFFS= 0
##$CY= 15
##$DATMOD= 1
##$DC= 0
##$DFILT= <>
##$DTYPP= 0
##$F1P= 0
##$F2P= 0
##$FCOR= 0.5
##$FTSIZE= 131072
##$FT_mod= 6
##$GAMMA= 0
##$GB= 0
##$INTBC= 1
##$INTSCL= 1
##$ISEN= 128
##$LB= 0.3
##$LEV0= 0
##$LPBIN= 0
##$MAXI= 10000
##$MC2= 0
##$MEAN= 0
##$ME_mod= 0
##$MI= 0
##$NCOEF= 0
##$NC_proc= -3
##$NLEV= 6
##$NOISF1= 0
##$NOISF2= 0
##$NSP= 0
##$NTH_PI= 0
##$NZP= 0
##$OFFSET= 14.96683
##$PC= 1
##$PHC0= 29.86633
##$PHC1= 0
##$PH_mod= 1
##$PKNL= yes
##$PPARMOD= 0
##$PPDIAG= 0
##$PPIPTYP= 0
##$PPMPNUM= 2147483647
##$PPRESOL= 1
##$PSCAL= 4
##$PSIGN= 0
##$PYNMP= <proc.py>
##$REVERSE= no
##$SF= 400.130005515511
##$SI= 131072
##$SIGF1= 0
##$SIGF2= 0
##$SINO= 400
##$SIOLD= 131072
##$SPECTYP= <>
##$SREGLST= <1H.CDCl3>
##$SSB= 0
##$STSI= 131072
##$STSR= 0
##$SW_p= 8223.68421052632
##$SYMM= 0
##$S_DEV= 0
##$TDeff= 65536
##$TDoff= 0
##$TI= <>
##$TILT= no
##$TM1= 0
##$TM2= 0
##$TOPLEV= 0
##$USERP1= <user>
##$USERP2= <user>
##$USERP3= <user>
##$USERP4= <user>
##$USERP5= <user>
##$WDW= 1
##$XDIM= 131072
##$YMAX_p= 446843769
##$YMIN_p= -7695550
##$CURPLOT= <Network HP LaserJet P1505>
##$CURPRIN= <$Network HP LaserJet P1505>
##$DFORMAT= <normdp>
##$LAYOUT= <+/1D_H.xwp>
##$LFORMAT= <normlp>
##$PFORMAT= <normpl>
##$SURQMSG= 1
$$ End of Bruker specific parameters
$$ ---------------------------------
##NTUPLES= NMR SPECTRUM
##VAR_NAME=  FREQUENCY,     SPECTRUM/REAL,   SPECTRUM/IMAG
##SYMBOL=    X,             R,               I
##VAR_TYPE=  INDEPENDENT,   DEPENDENT,       DEPENDENT
##VAR_FORM=  AFFN,          ASDF,            ASDF
##VAR_DIM=   131072,        131072,          131072
##UNITS=     HZ,            ARBITRARY UNITS, ARBITRARY UNITS
##FACTOR=    0.0627417313425165, 1,          1
##FIRST=     8223.62146879498, -2343,        -95460
##LAST=      0,             1515,            -96107
##MIN=       0,             -7695550,        0
##MAX=       8223.62146879498, 446843769,    0
$$ Real data points
##PAGE= N=1
##DATA TABLE= (X++(R..R)), XYDATA
$$ [...]
64732 411075 405561 400774 395446 389122 382172 374872 367677 361723 357863 355446 352977 349918 347139 345704
64718 345704 345937 347649 350520 353994 357279 359915 362308 365510 370332 376629 383489 390229 397068 404661
64704 404661 413161 422136 431215 440192 448512 455434 460995 466155 471602 477023 481954 486550 490806 493762
64690 493762 494627 494398 495147 497529 499986 500721 499557 497304 494153 489542 483197 475419 466385 456019 444766
64675 444766 433909 424664 417212 410886 405069 399548 394236 389132 384687 381771 380862 381435 382422 383231 383974
64660 383974 384800 385393 385321 384608 383780 383506 384459 387328 392423 398992 405127 408811 409315 407508 404784 401870
64644 401870 398861 396055 394161 393460 393233 392357 390262 387045 382976 378426 374099 370627 367761 364561 360727
64629 360727 357329 355632 355393 354954 353264 351301 351022 353047 355996 358415 360789 364902 371245 377942 382802
64614 382802 385899 389440 395337 403665 413443 423906 434520 444421 452685 459062 463839 466924 467540 465064
64600 465064 459877 453101 445608 437596 429220 421260 414782 410129 406600 403377 400504 398645 398062 398310 399002
64585 399002 400427 403112 407030 411559 416186 421031 426694 433783 442632 453324 465756 479636 494455
64572 494455 509547 524192 537751 549800 560236 569093 576114 580608 582119 581194 579022 576068 571449
64559 571449 564094 554328 543816 533998 525037 516329 507553 498949 490895 483707 477751 473340 470241 467476
64545 467476 463981 459656 455648 453388 453413 455143 457497 459434 460140 459376 457718 455973 454205 451855 448888
64530 448888 446032 443514 440417 436082 431483 428237 426550 425246 423748 422921 423657 425550 427545 429301 431290
64515 431290 433858 436752 439530 442065 444526 446899 448647 449045 447860 445372 441620 436183 429134 421628
64501 421628 414769 408322 401460 394416 388190 382651 376388 368917 361787 356669 353305 350318 347317 345105
64487 345105 344140 343904 343776 343727 344046 344955 346598 348945 351607 354074 356103 357652 358515 358332 356838 353905
64471 353905 349657 344900 341175 339789 340774 343015 345199 346304 345603 343048 339706 337211 336558 337719 340252
64456 340252 343716 347481 350865 353763 356600 359463 361836 363586 365605 368845 373116 377517 381851 386906
64442 386906 393382 401180 409849 419015 428145 436633 444628 453260 463373 474247 484126 491738 496757 499175
64428 499175 499165 497518 495209 492302 488109 482753 477578 473464 469708 465438 461269 458382 456502 454180 450930
64413 450930 447797 445627 444009 442258 440408 438724 437216 436272 436951 439760 443661 447170 450230 454230 460181
64398 460181 467447 474330 479565 483201 486318 490015 494606 499710 504922 510163 515577 521536 528790 538093
64384 538093 549560 562729 577294 593274 610435 628220 646464 665549 685640 706592 729072
64373 729072 755001 785996 821819 861133 903500 949852 1001156 1057471 1118483 1184361 1255858
64362 1255858 1333958 1419705 1514142 1618090 1731700 1853777 1981348 2110171 2236162 2356507
64352 2356507 2469562 2574091 2668774 2751972 2821415 2874317 2908266 2922158 2916245 2891644 2850091
64341 2850091 2793775 2724628 2643436 2549927 2444049 2327424 2203620 2076899 1950457 1825906
64331 1825906 1704521 1588522 1480517 1381820 1292064 1210503 1136976 1071393 1013117 961310 915261
64320 915261 873983 836094 800624 767549 737240 709878 685659 664805 646955 631186 616954
64309 616954 604138 591856 578505 563791 549445 536750 524520 511007 496894 484504 474648 466237
64297 466237 458858 453597 450891 449495 448397 448250 449964 453088 456570 460168 464154 468385 472555 476723
64283 476723 480769 483781 484800 483748 481110 477273 472916 469478 468250 469082 470615 471551 471210 469314 466239
64268 466239 463404 462414 463455 465067 465699 465015 463466 461188 457855 453394 448402 443780 440170 437692 435999
64253 435999 434517 432806 430798 428690 426628 424625 422684 420649 417798 413109 406399 398970 392494 387356
64239 387356 382706 378043 373869 370620 367975 365810 364944 366026 368258 370154 371247 372250 373919 376660
64225 376660 380929 386894 393747 400332 406538 413201 420594 428019 435016 441931 448917 455394 461131 467077
64211 467077 474319 482550 490176 495755 498932 500152 499835 497921 494246 489448 485179 482957 482892 483911 484936
64196 484936 485317 484555 482600 480358 478907 478094 476753 474158 470198 464248 455462 444660 434413 426359
64182 426359 419581 412503 405179 398604 392895 387745 384020 383186 385113 387680 388792 387954 385970 384028 383171
64167 383171 383745 384953 385440 384522 382522 380072 377636 375693 374780 375112 376383 377910 378833 378520 377148 375586
64151 375586 374372 373266 372307 372576 374839 377758 378742 376812 373701 371816 371954 373445 375634 378407 381630
64136 381630 384882 387878 390796 394073 398065 403004 409229 417308 427723 440352 454503 469552 485196
64123 485196 500895 515538 528218 538989 548150 554895 557540 555280 549042 540240 529380 516547 502818
64110 502818 490219 479976 471273 462211 451877 441116 431207 422214 413175 403895 395939 391309 390179
64097 390179 390359 389253 386265 383158 382057 383278 385281 386623 387497 389109 392038 395778 399658 403509 407384
64082 407384 411289 415335 419574 423483 426221 427555 428004 427955 427400 426702 426507 426388 424706 420927 417217 416461
64066 416461 419079 422967 426327 429256 432627 436728 441443 446835 453008 459948 467795 476783 486864 497978
64052 497978 510695 525697 542367 558700 573066 585466 596706 606972 615747 622602 627450 630436
64040 630436 632234 634340 638389 644979 653282 661882 669879 677246 684244 690580 695333 697741 697764 695544 690712
64025 690712 682811 672299 660399 647915 634803 621035 607117 593496 580118 567139 555598 546665
64013 546665 540337 535393 530671 526093 522346 519789 517883 515816 513564 511951 511511 511720 511755 511599 511735 512157
63997 512157 512616 513730 516773 522120 528814 535934 543475 551531 559719 568094 577609 588621 599699 609078
63983 609078 616990 625529 636345 649396 663717 678358 692449 705301 716839 727416 737047 745317
63971 745317 752060 757512 761631 763854 763769 761595 757868 753079 747781 742706 738635 736336 736353 738246 740161
63956 740161 739963 737000 732181 726253 718900 709826 699800 689923 680538 671552 663350 656539 651087 646470
63942 646470 642478 639284 637017 636025 637304 641659 648304 655084 660417 664531 668758 674264 681635 690867
63928 690867 701237 711732 722178 733686 747638 764439 783429 803579 824048 844626 866171
63917 866171 890262 917875 948573 981140 1014505 1047752 1080070 1111614 1143998 1179028 1217230
63906 1217230 1258453 1303443 1353533 1408862 1468280 1531365 1599282 1673196 1753125 1839251 1933294
63895 1933294 2037395 2152432 2278824 2418662 2575472 2751500 2946254 3158247 3387462
63886 3387462 3635464 3903300 4189769 4491668 4805315 5127514 5455057 5783584 6107399
63877 6107399 6420393 6716662 6990107 7234239 7443123 7612440 7739338 7821696 7858097 7848161
63867 7848161 7792106 7690114 7542971 7353504 7126901 6869444 6587308 6286461 5972897 5652352
63857 5652352 5329908 5009983 4696580 4393551 4104788 3833883 3583146 3353028 3142908
63848 3142908 2952329 2780924 2627336 2489045 2363611 2249642 2146383 2052921 1968124 1890977
63838 1890977 1820664 1756519 1697946 1644062 1593482 1545025 1498755 1455690 1416214 1379345 1343902
63827 1343902 1309827 1277857 1248353 1221101 1196024 1173581 1154547 1139763 1129832 1124517 1122557 1122587
63815 1122587 1124345 1128670 1136286 1146856 1159202 1172149 1185149 1198435 1212752 1228692 1245943 1263102
63803 1263102 1278369 1290639 1299961 1306886 1311438 1313036 1311471 1307473 1301841 1294299 1283809 1270003 1253728
63790 1253728 1236075 1217406 1197479 1175973 1152651 1127492 1100977 1073853 1046358 1018123 989127
63779 989127 960217 932182 904670 876618 847546 818065 789275 762113 737056 714001 692441
63768 692441 672088 653201 636078 620391 605359 590418 575502 560986 547655 536353 527049 518475
63756 518475 509227 499115 488947 479275 470173 462227 456670 453978 452869 451320 448484 445251 443044 442329
63742 442329 442209 441152 438147 433334 427762 422627 418791 416699 416289 416679 416260 413614 408644 402736 397645
63727 397645 394175 391962 390401 389411 389137 389311 389395 389178 388700 387639 385475 382527 380202 379735 381026 383005
63711 383005 384706 385604 385491 384757 384448 385225 386320 386153 384000 380536 376960 374269 373245 374166 376205 377891
63695 377891 378595 379048 380173 382020 384254 386944 390126 393036 394626 394853 394809 395524 397174 399520 402527 406115
63679 406115 409632 412203 413727 415212 417776 421425 425128 428146 430942 434592 439602 445687 452446 459631
63665 459631 466733 472912 477703 481583 485668 490919 497545 504743 510971 514995 516985 518213 519471 520194
63651 520194 519456 517289 514480 511384 507680 503265 498770 494990 492192 490215 488992 488792 489988 492554 495662
63636 495662 497918 498318 497080 495434 494681 495612 498529 503272 509098 514922 520003 524320 528305 532382 536702
63621 536702 541000 544722 547626 550215 553137 556098 557986 558361 558289 559225 561454 564166 566681 568939 570917
63606 570917 572329 572986 572935 572224 571067 570264 570632 571688 571564 568757 563541 557257 550803 544551 539210 535663
63590 535663 533866 532747 531462 530222 529754 530588 533018 536951 541411 545049 547895 552043 559652 570545
63576 570545 582615 594272 605430 616201 626136 635460 645928 659284 675300 692236 708963 725783
63564 725783 743434 762359 782979 805647 829998 855245 881572 910489 943255 979564 1018366
63553 1018366 1059304 1102564 1147921 1194922 1243726 1294675 1347062 1399187 1449577 1497177 1540269
63542 1540269 1576351 1603584 1621746 1631574 1634116 1631024 1624242 1614649 1601886 1586289 1569897 1554350
63530 1554350 1538546 1519692 1496122 1467761 1434481 1396083 1354165 1312074 1272096 1233951 1196830
63519 1196830 1161677 1130364 1103432 1079932 1059012 1040559 1024545 1010827 999682 991751 987325 986216
63507 986216 988359 993943 1002838 1014332 1027539 1041857 1057104 1073648 1092375 1114132 1139068 1166756
63495 1166756 1196943 1229859 1265723 1304319 1345312 1388878 1435804 1486873 1542093 1600494 1660530
63484 1660530 1720286 1776987 1826634 1864992 1889516 1900277 1899206 1888943 1872404 1852435 1831000
63473 1831000 1808779 1785876 1762534 1738804 1713989 1686926 1656433 1621072 1579239 1530547 1476895
63462 1476895 1421232 1365328 1309522 1254322 1200934 1150012 1101175 1054471 1011337 973202 939712
63451 939712 909226 880669 854086 829602 806954 786262 768379 753823 741732 730505 719494
63440 719494 709532 701572 695186 688900 681935 675006 669163 664257 659054 652736 645887 640059 636632 635927
63426 635927 636982 638201 638597 638491 638849 640181 642492 645923 650594 655701 659672 661682 662537 663588 665183
63411 665183 666583 666978 666045 663798 660597 657220 654263 651355 647582 643092 639764 639593 642460 646197 649159
63396 649159 652094 656803 663433 670365 676965 685062 696612 710780 724819 737655 751050 767030 785672
63383 785672 806203 828929 854654 882825 911786 941011 972107 1007317 1047685 1092827 1141651
63372 1141651 1192555 1243198 1290801 1333143 1369414 1400169 1426665 1450546 1474170 1500540 1531945
63361 1531945 1568555 1609069 1652958 1701245 1754606 1811602 1869676 1927215 1983358 2036041 2081628
63350 2081628 2116835 2140188 2151564 2151665 2142573 2127737 2110259 2091431 2071329 2050002 2027106 2000994
63338 2000994 1969422 1931204 1886460 1835673 1779747 1720972 1662528 1606441 1552812 1501293 1452071
63327 1452071 1404981 1359225 1315334 1276214 1244375 1218645 1195595 1174137 1156610 1144842 1137328
63316 1137328 1131661 1128077 1128685 1134140 1143083 1154600 1169331 1187878 1209674 1233999 1261078 1291678
63304 1291678 1326417 1365690 1409237 1455449 1502289 1549564 1599385 1653552 1711249 1769964 1827726
63293 1827726 1883345 1935128 1980798 2018615 2047703 2067410 2077332 2077976 2070553 2056087 2035510 2010537
63281 2010537 1983477 1955868 1927822 1898627 1867093 1831290 1789287 1740915 1688257 1633948 1579550
63270 1579550 1525846 1473653 1423430 1374734 1327131 1281403 1239101 1201239 1168273 1140930 1119666
63259 1119666 1103022 1087547 1069980 1048997 1024653 997134 966935 935671 905486 877413 850941
63248 850941 825422 801402 780181 762203 746300 730718 714874 699908 687375 677478 668889 660344
63236 660344 651952 644649 638702 633278 627416 620923 614314 608228 602940 597964 592123 584684 576809 571297
63222 571297 570118 572295 574669 574819 572889 570774 570104 571098 572756 573759 573455 572391 571917 573034 575560
63207 575560 578367 580410 581617 582984 585770 590431 596354 602677 609142 615832 622510 629031 636403 646361
63193 646361 659219 672804 684407 693637 702700 714007 728168 744196 760773 777072 793170 810299
63181 810299 830279 854059 880846 908995 937725 967727 1000193 1035486 1072693 1110334 1147521
63170 1147521 1184481 1221819 1259272 1295534 1329450 1361114 1391703 1422674 1455364 1490635 1528028
63159 1528028 1565464 1600702 1633246 1664132 1693699 1720273 1741341 1755353 1762060 1761846 1755379 1743355
63147 1743355 1725826 1702152 1672255 1637630 1600399 1561849 1522816 1485057 1450775 1420599 1393341
63136 1393341 1368232 1346241 1328440 1314228 1302353 1293009 1287562 1286365 1288047 1291186 1295821 1303074 1313925
63123 1313925 1328575 1346402 1366173 1386619 1407074 1427467 1447741 1467547 1486420 1503904 1519629
63112 1519629 1533720 1546978 1559979 1571828 1580457 1584486 1584429 1581690 1576631 1567952 1553834 1533468 1507469
63099 1507469 1477027 1442939 1405686 1366288 1326423 1287377 1249417 1212580 1177453 1144488 1113238
63088 1113238 1083345 1055769 1031710 1010500 990109 969904 951409 935951 923169 912489 904288
63077 904288 898384 892952 886711 881080 878242 877828 877610 877140 878284 881779 885498 887304 888037 890293 895181
63062 895181 901591 908105 914346 920574 926912 933158 938856 943503 947034 950105 953630 958020 962987 967983
63048 967983 972735 977481 982650 988093 992835 996149 998757 1002234 1007009 1011747 1015165 1017739 1020956 1025320
63034 1025320 1029839 1033285 1035392 1037049 1039745 1044528 1050961 1057307 1062269 1066323 1070864 1076468 1082762 1089740
63020 1089740 1098096 1108096 1119046 1130273 1141940 1154462 1167767 1181692 1196667 1213419 1232261
63009 1232261 1253162 1276294 1302000 1330365 1361332 1395163 1432269 1472506 1515064 1559312 1605604
62998 1605604 1655220 1709623 1769612 1834779 1903706 1975050 2048609 2125122 2204942 2287305 2371136
62987 2371136 2456131 2542515 2629829 2716580 2801367 2884071 2965671 3047093 3128449 3209224 3288810
62976 3288810 3366744 3442581 3515632 3584647 3647598 3701826 3744605 3773893 3788786 3789343 3775759 3747606
62964 3747606 3704126 3645658 3574687 3495023 3409690 3319963 3226590 3131535 3038045 2949247 2867176
62953 2867176 2792930 2726992 2669134 2618630 2575074 2538859 2510669 2490773 2479070 2475437 2479531 2490329
62941 2490329 2506243 2525738 2547651 2571169 2595902 2621949 2649524 2678468 2708269 2738404 2768289
62930 2768289 2797083 2824019 2848845 2871353 2890429 2904163 2910944 2909841 2899767 2879272 2847868 2807004
62918 2807004 2758881 2704500 2643456 2575425 2501187 2422426 2341340 2260473 2182068 2107151 2035600
62907 2035600 1967292 1902724 1842385 1786025 1732928 1682569 1634762 1589607 1547690 1509886 1476248
62896 1476248 1445123 1414015 1381569 1348396 1315897 1284787 1255135 1227227 1201440 1177184 1152921
62885 1152921 1127784 1102613 1078719 1056147 1034104 1012867 993997 978440 965454 953860 943205
62874 943205 933029 922205 910267 898640 889130 881632 874712 868123 863087 860014 857656 855070 852845
62861 852845 851420 849484 845341 839167 832735 827309 822801 818674 814643 810546 806304 802106 798129 794150
62847 794150 789895 785586 781650 778038 774377 770639 767112 763797 760344 756645 753095 750219 748267 747029
62833 747029 745890 744387 743003 742946 744639 746818 747828 747491 746951 746906 746978 746942 747539 749499 752339 754764 756079
62816 756079 756780 757763 759191 760234 759933 758303 756344 754791 753194 750630 747147 744021 742530 742869 744315
62801 744315 746135 748250 751126 754917 758689 760966 761459 761757 763544 766463 768674 769425 769924 771464 773820
62786 773820 776127 778260 780313 781406 780429 777939 776122 776458 778182 779503 779608 778823 777469 775636 774046
62771 774046 774046 776219 779669 783211 786803 791168 796490 802312 808553 815582 823183 830422 836968 843775 851949
62756 851949 861592 872274 883881 896263 908619 920237 931633 944128 958385 974022 990481 1007503
62744 1007503 1024790 1042032 1059440 1077712 1097348 1118465 1141312 1166436 1194274 1225017 1258886
62733 1258886 1296057 1336308 1379220 1424865 1473970 1527493 1586307 1651027 1721627 1797568 1878961
62722 1878961 1967222 2063651 2167487 2276461 2389305 2506444 2627840 2751267 2873360 2991414
62712 2991414 3103303 3206426 3297850 3375276 3436984 3480894 3504525 3506245 3486316 3446701 3390035
62701 3390035 3318683 3234422 3138828 3033878 2922125 2806341 2689039 2572133 2456714 2343338
62691 2343338 2232910 2127135 2027646 1934749 1847601 1765522 1688540 1616733 1549975 1488540 1433033
62680 1433033 1383188 1337419 1294267 1253904 1217652 1186367 1159829 1137367 1118385 1102221 1087997
62669 1087997 1074960 1062964 1052569 1044535 1039045 1035513 1033324 1032498 1033362 1035919 1040133 1046594 1056230 1069423
62655 1069423 1085936 1105447 1127345 1150363 1173618 1198055 1225784 1257922 1294316 1335335 1382227
62644 1382227 1435147 1492569 1553648 1619585 1691251 1766828 1843630 1921396 2001855 2085333 2169593
62633 2169593 2252053 2331576 2407567 2478546 2542111 2595615 2636595 2663209 2674623 2670728 2651700
62622 2651700 2618364 2572687 2517021 2452780 2380397 2300575 2215105 2126632 2037972 1951236 1866980
62611 1866980 1784600 1704130 1627004 1554296 1485199 1418712 1356218 1300471 1251989 1208199 1166479
62600 1166479 1126531 1089244 1054906 1023413 994990 969625 946756 926328 909108 894942 881746
62589 881746 867564 852934 839782 828461 817480 806133 795730 787570 780853 773670 765691 758974
62577 758974 755906 756684 759004 760167 759395 758106 758136 759958 762580 764762 766070 766960 768173 770016 772143
62562 772143 774049 775718 777602 780059 783309 788013 795293 805744 818701 832908 847679 863074 879239
62549 879239 896161 914002 933157 953853 976142 1000387 1027309 1057169 1089128 1121940 1155495
62538 1155495 1191437 1231967 1277935 1328288 1381369 1436382 1493149 1550652 1606651 1659151 1707744
62527 1707744 1752778 1793309 1826671 1850397 1863964 1868138 1863058 1847963 1822861 1789527 1750236 1706110
62515 1706110 1657512 1605616 1552471 1499404 1446418 1393610 1342194 1293326 1246690 1201426 1158194
62504 1158194 1119071 1085165 1055383 1028019 1002747 980273 960613 942709 925733 909936 895903
62493 895903 883541 872236 861628 851755 842573 833932 826139 819995 816001 813810 812820 813010 814805 818368
62479 818368 823421 829527 835972 841662 845863 849068 852429 856360 860527 865336 872374 882855 896377 911787
62465 911787 928628 947163 967619 990167 1015186 1042880 1073035 1105790 1142120 1182833 1227479
62454 1227479 1274962 1324851 1377346 1432313 1489122 1546993 1604655 1660020 1711126 1757242 1798295
62443 1798295 1833682 1862628 1885242 1902058 1912869 1917427 1917173 1914715 1911411 1906886 1901268 1896501 1894911
62430 1894911 1897806 1906110 1921011 1942946 1970915 2003861 2042135 2086844 2138420 2196598 2260873 2329966
62418 2329966 2401369 2472544 2542253 2609704 2672570 2726809 2768689 2796563 2810808 2812521 2802015
62407 2802015 2778051 2738570 2682654 2611835 2529381 2438672 2342510 2243351 2143352 2044119 1946808
62396 1946808 1852408 1761766 1675672 1595289 1522111 1456981 1399352 1347957 1302034 1261516 1226267
62385 1226267 1195645 1168818 1145148 1124332 1106326 1091038 1078079 1067103 1058418 1052595 1049139 1046136
62373 1046136 1041773 1035845 1029281 1022616 1015423 1006867 996124 982587 966461 949181 932640 917927
62361 917927 905154 894267 885371 878114 871293 863414 853670 842474 831200 821319 813583 807962 804021
62348 804021 800927 797296 792012 785585 779915 776152 773382 770025 765933 762361 760414 760457 762636 766917 772607
62333 772607 778719 784818 790822 796105 799847 802585 806555 813844 824469 836585 848363 859490 871062
62320 871062 884216 898946 914361 930061 946734 965135 985102 1006164 1028642 1053263 1079990
62309 1079990 1108274 1138486 1172006 1209530 1250228 1293278 1339713 1391928 1451346 1517008 1586639
62298 1586639 1658924 1734594 1815219 1901149 1990946 2082663 2174757 2265244 2350710 2427218 2492126
62287 2492126 2544291 2582709 2606042 2613819 2607362 2589042 2560869 2523865 2478325 2424536 2363578 2297441
62275 2297441 2228068 2156541 2083808 2011832 1942977 1878218 1817031 1759298 1706164 1658477 1615481
62264 1615481 1575897 1539337 1505546 1472991 1439674 1405296 1371370 1339004 1307638 1276261 1244862
62253 1244862 1214065 1184158 1155288 1128123 1103330 1080524 1058710 1037865 1019179 1003326 989341
62242 989341 976030 963883 954497 948278 943840 939857 936354 933669 931339 929099 928181 930166 934666 939461
62228 939461 943217 947011 952731 960801 970165 979902 990070 1001168 1013396 1026570 1040509 1055359 1071541
62215 1071541 1089279 1108222 1127731 1147560 1168054 1189828 1213675 1240839 1272757 1310055 1352028
62204 1352028 1397586 1446730 1500799 1561098 1627475 1698620 1773839 1854048 1940435 2032327 2127312
62193 2127312 2223587 2321055 2419275 2515199 2604053 2681840 2745736 2792737 2820259 2828804 2822373 2804963
62181 2804963 2777342 2737908 2685737 2621787 2548038 2466804 2380505 2290865 2198356 2103382 2007952
62170 2007952 1915345 1828092 1747129 1672743 1605212 1544126 1488132 1436128 1388240 1345066 1306389
62159 1306389 1271300 1239376 1210949 1186059 1163723 1142734 1123129 1106400 1093970 1085527 1079051 1072477
62147 1072477 1065021 1056966 1048724 1040716 1033967 1030044 1029894 1032798 1036693 1039661 1041371 1043346 1047797 1055882
62133 1055882 1066824 1078761 1090498 1102367 1115496 1130505 1147103 1164761 1183418 1203427 1224958
62122 1224958 1247643 1270818 1293923 1316577 1338362 1358957 1378683 1398778 1420748 1445375 1472600
62111 1472600 1502487 1535860 1573599 1615560 1660876 1709457 1762557 1821378 1885501 1953189 2022741
62100 2022741 2092609 2160237 2221922 2274419 2316241 2347042 2366392 2373809 2369646 2355292 2332582 2303181
62088 2303181 2268062 2227091 2179653 2126430 2070120 2013624 1957879 1902481 1848114 1796976 1750662
62077 1750662 1708983 1671424 1638604 1611300 1588840 1569556 1552544 1538093 1526484 1517086 1508763 1500798
62065 1500798 1493369 1487340 1483470 1481706 1481486 1482744 1485925 1490539 1494300 1494536 1490392 1483202 1474984 1467164
62051 1467164 1460490 1455182 1450808 1446342 1440651 1432791 1422151 1408856 1394065 1379281 1365216 1351701
62039 1351701 1338829 1327668 1319543 1314952 1313427 1314203 1316671 1320444 1325485 1332217 1341050 1351519 1362163
62026 1362163 1371773 1380878 1391540 1405280 1421336 1437498 1452626 1467869 1485384 1506487 1531378 1559873
62014 1559873 1591608 1625797 1661611 1698910 1738037 1778959 1821185 1864643 1909991 1957778 2007745
62003 2007745 2059237 2111800 2164985 2217823 2268808 2316085 2357312 2389761 2411309 2421475 2421177 2411591
61991 2411591 2393625 2368331 2336896 2299749 2256112 2205049 2146819 2082854 2014739 1943907 1872217
61980 1872217 1801852 1734067 1668475 1604149 1541258 1481210 1425376 1374147 1327079 1283421 1242495
61969 1242495 1204085 1168672 1136940 1108906 1083771 1060608 1038857 1018138 998096 978743 960618
61958 960618 944349 930134 917675 906302 895151 883684 872306 862132 853973 847825 843363 840286
61946 840286 837914 835152 831532 827954 825889 826113 828679 833517 840151 847087 852529 855928 858108 859722
61932 859722 860376 859584 857884 856330 855158 853398 849606 842802 833025 821484 810032 799987 791231 782521
61918 782521 772707 761730 750605 740620 732438 725883 720474 715924 711922 707696 702451 696389 690749 686462
61904 686462 683142 679896 676854 675277 676049 678521 681060 682492 682886 683209 684402 686688 689616 692810 696649
61889 696649 701980 709097 717355 726053 735427 746246 758462 770902 782587 794035 806817 822038
61877 822038 839607 858758 878634 898249 916508 932752 947147 960305 972779 985083 997682
61866 997682 1010324 1021567 1029758 1034658 1037559 1039584 1040462 1039399 1036601 1033184 1029780 1026106 1022167 1019295
61852 1019295 1019421 1023486 1030808 1039879 1049549 1059612 1070535 1082624 1095356 1107650 1118850 1129092
61840 1129092 1138385 1145648 1149228 1148395 1143967 1137442 1129895 1121673 1112511 1101737 1088849 1074261 1059216
61827 1059216 1044719 1030885 1017559 1005079 993915 983867 974178 964344 954393 944427 934228 923378
61815 923378 911627 899318 887531 877416 869063 861491 854088 847585 843031 840424 839264 839984 843524
61802 843524 849463 855878 861625 867896 876837 889259 904271 920629 937790 956026 976096 998677
61790 998677 1023704 1050340 1077729 1105485 1133290 1160579 1186993 1212656 1237431 1260207 1279481
61779 1279481 1294413 1304892 1310884 1312448 1310404 1306295 1301356 1295773 1289141 1281507 1273881 1267884 1265031
61766 1265031 1266147 1271107 1278821 1287603 1296113 1304234 1312683 1321333 1328250 1330929 1328296 1320936 1309660 1294780
61752 1294780 1276694 1256096 1233265 1207996 1180675 1152670 1125278 1099002 1074201 1051565 1031347
61741 1031347 1012944 995858 980301 966122 952028 936862 921090 906091 892525 880321 869694
61730 869694 860999 853923 847852 842716 838442 834088 828830 823601 820265 819133 818633 817571 816255 815015
61716 815015 813147 810216 807237 805546 805102 804749 803637 801740 799428 797237 795772 795391 796221 798593 802759
61701 802759 807845 811958 814139 815607 818265 822347 826438 829506 831937 834489 837077 838875 839055 837135
61687 837135 833105 827685 822273 818177 815694 814114 812715 811618 811325 811478 810686 808106 804797 802792 802798 803574
61671 803574 803674 803022 802396 802075 801708 801057 800216 799337 798715 798950 800397 802554 804591 806436 808773 811916 815316
61654 815316 818364 821034 823340 824714 824593 823392 822167 821262 819888 817238 813465 809194 804606 799602 794469
61639 794469 789547 784341 777934 770548 763842 759149 756129 753689 751447 749374 746598 741900 735387 728617
61625 728617 722813 717766 712707 707398 701973 696470 691154 686764 683794 681714 679368 676001 671714 667215
61611 667215 663436 661092 660176 659922 659537 658913 658580 659106 660624 662718 664665 665997 666885 667842 669139 670853
61595 670853 673292 676691 680430 683338 685111 686785 689307 692230 694438 695712 696742 697862 698662 698936 699210
61580 699210 699933 700642 700484 699376 698157 697540 697272 696603 695347 694034 693073 692292 691533 691017 690520 688679 684168
61563 684168 677547 670932 665528 660381 654107 647037 640839 636572 633986 632468 631665 631069 629779 627131 623218
61548 623218 618587 613737 609090 605045 601554 597673 592089 584520 576590 570816 568365 567815 566412 562490
61534 562490 556508 549982 543991 538765 534063 529493 524692 519591 514420 509408 504658 500382 496868 494021
61520 494021 491286 488378 485813 484431 484590 486070 488447 491162 493463 494758 495064 494807 494266 493495 492671 492082
61504 492082 491695 491077 489995 488991 489124 491025 494135 496866 497640 496025 493095 490778 490611 492726 495836
61489 495836 498406 499993 501308 502976 504699 505932 506832 507950 509259 510262 510908 511717 512969 514461 516096
61474 516096 518022 520080 521816 523279 525162 527897 531118 534147 536410 537294 536377 534077 531378 528765 526199
61459 526199 524249 524021 525422 526684 526483 525450 524640 523608 521463 519042 518339 519887 522260 524144 525471
61444 525471 526282 526025 524731 523716 524117 525399 526236 526481 527338 529642 532726 535225 536545 537132 537473 537335
61428 537335 536290 534775 534011 534669 536064 537090 537637 538630 540790 543907 547367 550941 554812 558986 562893
61413 562893 565648 566764 566602 566072 565947 566570 567950 569661 570820 570854 570349 570438 571207 571540 570865 570075 570115 570576
61395 570576 570606 570468 571053 572391 573765 575056 576721 578535 579637 580066 581120 583651 586833 589220 590419
61380 590419 591202 592379 594106 596056 597765 598893 599471 600036 601289 603407 605623 606746 606419 605711 605951 607093
61364 607093 607913 607898 607964 608981 610612 612296 614322 616857 618770 618846 617788 617626 619191 621343 622677 622918
61348 622918 622585 622319 622623 623309 623182 621265 618336 616151 615111 613911 611708 609378 608165 608252 609208 610799
61332 610799 612645 614013 614684 615379 616653 618026 618740 618852 619058 619975 621966 624988 628182 630329 631221 631962
61316 631962 633439 635287 636952 639020 642560 647601 653050 657871 661748 664835 667429 669759 671806 673593
61302 673593 675745 679217 684071 689139 693351 696909 700764 705511 711209 717745 724831 732145 739899 748679
61288 748679 758335 767769 776292 784317 792006 798275 802336 805488 809996 816373 822970 828160 831861 834835
61274 834835 837598 840353 843238 846187 848879 850974 852153 852033 850425 847559 843754 839219 834605 831304
61260 831304 830441 831738 833978 836390 838956 841694 844519 847798 852240 858158 865397 873914 883736 894405
61246 894405 905230 916218 928136 941500 955881 970126 982828 992841 1000055 1005503 1009912 1012257
61234 1012257 1010675 1004892 996855 988790 981541 974932 968636 962086 954475 945705 936893 929245 922737 916436
61220 916436 909862 903579 898725 896346 896910 899937 904151 908329 912036 915604 919726 925028 931493 938049
61206 938049 943338 947243 951208 956597 963231 969951 976093 981665 986538 990434 993801 997807 1003106 1009012
61192 1009012 1014231 1018096 1020901 1023335 1025830 1028328 1030402 1031633 1031954 1031673 1031156 1030492 1029446 1027763 1025642
61177 1025642 1023788 1022675 1021680 1019489 1015762 1011956 1009884 1009733 1010333 1011290 1013695 1018244 1023653 1027957 1030900
61162 1030900 1034005 1038477 1044135 1050517 1057855 1066379 1075445 1084118 1092140 1099748 1107092 1114614 1123458 1134352
61148 1134352 1146079 1156126 1163157 1168033 1172220 1176140 1179693 1183523 1188733 1195664 1203835 1213132 1224284
61135 1224284 1237931 1253653 1270191 1286402 1301833 1316495 1330279 1342618 1352722 1360070 1364647 1366862
61123 1366862 1367499 1367616 1368050 1368868 1369584 1369931 1369925 1369092 1366382 1361369 1355032 1348652 1342221 1334619 1325179 1314307
61107 1314307 1302580 1290028 1276643 1263037 1250124 1238307 1227201 1215973 1203838 1190565 1176803
61096 1176803 1163819 1152565 1142891 1133826 1124696 1115941 1108664 1103348 1099290 1095511 1091954 1089235 1087174
61083 1087174 1084274 1079030 1071303 1062051 1052178 1042262 1033006 1025170 1019049 1014629 1012106 1011558 1012182 1012785 1013353
61068 1013353 1015348 1020007 1027056 1035782 1046705 1061178 1079420 1099953 1121269 1143277 1166721 1191850
61056 1191850 1218377 1246337 1276096 1307437 1339309 1370737 1401527 1431895 1461991 1492164 1523125
61045 1523125 1555163 1587295 1617645 1644569 1667222 1685468 1699879 1711403 1720229 1725097 1724556 1718893
61033 1718893 1709993 1699276 1686635 1671466 1653733 1633695 1611587 1588142 1564595 1541558 1518653
61022 1518653 1495795 1474001 1454175 1435850 1418079 1401104 1386195 1374165 1364802 1357539 1351942 1347745
61010 1347745 1345016 1344097 1344987 1347230 1350906 1357139 1366934 1380020 1395524 1413207 1433214 1455166 1478491
60997 1478491 1503363 1530531 1560654 1594453 1632742 1675242 1720028 1765397 1811861 1861206 1914190
60986 1914190 1970482 2030280 2094379 2163032 2236375 2315627 2402042 2494719 2591278 2690866 2794902
60975 2794902 2904932 3021612 3145844 3278707 3419716 3567106 3720397 3880701 4048039
60966 4048039 4220759 4398816 4585425 4784058 4995610 5220067 5459346 5717014 5996739
60957 5996739 6302475 6638840 7010093 7420411 7876338 8386981 8960625 9603808 10325312
60948 10325312 11137717 12052753 13079783 14233564 15539500 17025579 18714201 20628966
60940 20628966 22793507 25182560 27644159 29885930 31590192 32590510 32958113 32927036
60932 32927036 32746794 32599335 32603886 32817959 33178826 33458172 33334771 32567680 31128856
60923 31128856 29187364 26983473 24714717 22502316 20411373 18473836 16700475 15091806
60915 15091806 13647419 12365747 11238254 10248931 9379898 8615272 7940803 7343271 6811324
60906 6811324 6335838 5909484 5526542 5182250 4871395 4588438 4329714 4093988 3879819
60897 3879819 3684083 3504488 3341466 3195153 3061867 2936183 2815752 2701681 2594777
60888 2594777 2494217 2399797 2312685 2233147 2159593 2090617 2026225 1966369 1909905 1855926 1804796
60877 1804796 1756985 1711830 1668188 1625527 1583860 1543392 1504567 1467626 1431859 1396253 1361147
60866 1361147 1328232 1298651 1272143 1248223 1226771 1206885 1186671 1165226 1143813 1124111 1106169
60855 1106169 1089096 1072874 1058286 1045656 1034836 1026029 1019495 1014619 1010223 1005779 1001509 997361 992733
60842 992733 987363 981923 977582 975156 974577 974933 975192 975068 974911 974718 973943 972489 970969 969355 966272 960624
60826 960624 953219 945523 937219 926487 912821 898196 884905 873236 861998 850594 839712 830192
60814 830192 821952 814196 806351 798595 791488 785334 780123 775981 773206 771755 771256 771748 773682 776725 779288
60799 779288 780088 779588 778968 778276 776876 775344 775235 776786 778395 778923 779098 779796 780318 779590 778205 777826 778980
60782 778980 780695 782145 783414 784456 784347 782108 777816 772658 768108 764986 762882 760609 757681 755183
60768 755183 754485 755113 754772 751917 747624 744354 743251 743307 742991 741837 740196 738095 735092 731167 727054 723233
60752 723233 719017 713271 706035 698816 692982 688342 683668 678238 672378 666749 661782 657789 654991 653043
60738 653043 650875 647324 641978 635426 628943 623867 620782 618928 616621 612714 607706 603280 600715 599912
60724 599912 599887 599859 599626 599159 598384 597529 597375 598762 601889 606273 611225 616036 619843 622003 622907 624062 626842
60707 626842 631277 636282 640813 644412 646856 647961 647957 647671 648058 649605 652210 655250 657666 658349 656994 654628
60691 654628 652981 653036 654131 654551 653081 650062 646973 645092 644635 645073 645785 646058 644735 640637 633715 625379
60675 625379 617246 609839 602945 596880 592429 589310 585741 580346 574005 568832 565557 563076 560665 559347
60661 559347 560279 562698 564516 564584 563466 562247 561479 561231 561297 561239 560865 560707 561362 562418 562813 562331 561941 562535
60643 562535 564190 566795 570380 574469 578188 581583 585935 591994 598707 604436 608689 611887 614272 616067
60629 616067 617989 620433 622657 623910 624789 626208 627561 627598 626881 627524 630200 633231 635262 637093 639793
60614 639793 642565 644102 645032 647103 650132 651487 649021 643390 636948 631220 626164 621331 616842 613132
60600 613132 610320 608098 606044 603775 600934 597407 593714 590947 590021 591039 593430 596517 599802 603002
60586 603002 606156 609509 612917 615559 616606 616039 614454 612266 609571 606540 603345 599834 595902 592090
60572 592090 589179 587264 585850 584719 583845 582663 580551 578154 577019 577533 578407 578738 579289 580803 582296
60557 582296 582392 581575 581555 582727 583783 583845 583597 584007 585132 586750 589207 592896 597445 602110 606644 611313
60541 611313 616187 620776 624263 626053 626390 626517 627814 630521 633620 636125 637976 639297 639454 637762 635010
60526 635010 633307 633987 636241 638353 639875 641841 645000 648720 652106 655656 661146 669889 681536 694597
60512 694597 707797 720798 733900 747358 761092 775044 789617 805376 822177 838862 854003
60501 854003 866620 875983 881296 882312 880003 875836 870502 864073 857259 851456 847333 844457 842894 844253
60487 844253 850143 860102 872015 884431 897696 912794 929932 948591 968544 990285 1014365 1040350
60475 1040350 1066486 1090581 1111261 1128362 1142199 1152774 1159625 1162075 1159688 1153023 1144067 1135139
60463 1135139 1126971 1118444 1108704 1098888 1091001 1085520 1081092 1076554 1072366 1069807 1069482 1071132 1074646 1080668
60449 1080668 1090047 1102724 1117478 1133122 1150039 1170151 1195125 1224941 1258544 1295562 1336807
60438 1336807 1383202 1434750 1490667 1550050 1611960 1674869 1736305 1793368 1843731 1886028 1919187
60427 1919187 1941862 1953045 1952933 1942273 1920769 1887036 1840659 1783676 1719617 1651692 1582316 1513479
60415 1513479 1446466 1381474 1318416 1258080 1201945 1151024 1105507 1065330 1030267 999457 971596
60404 971596 945949 922742 902395 884670 868761 853905 839720 826046 812629 799166 785794
60393 785794 773376 762926 754716 748244 742920 738221 733294 727297 720416 713787 708154 703368 699384 696634
60379 696634 694925 693123 690620 688022 685576 682273 677678 673423 671332 670994 670782 670289 669929 668978 666351
60364 666351 662997 661160 661214 661367 660721 660344 660845 661130 660485 659910 660343 661321 662392 664113 666505 668333 669255
60347 669255 670977 674636 678575 680648 681447 683134 686032 688691 690854 694002 698803 704015 708322 711702
60333 711702 714656 717480 720862 725925 732873 740275 746253 750108 752730 755858 760743 766902 772318 775478
60319 775478 776971 778491 780775 783491 786528 790023 793385 795857 798123 801812 807059 812038 815413 817862
60305 817862 820525 823344 825940 828898 832942 837684 842335 847085 852704 859363 866920 875800 886364 897801
60291 897801 908974 920157 932456 945375 956441 963781 967887 970077 970278 967427 961402 953332 944107
60278 944107 933688 922230 911094 902131 896082 891965 887998 883029 877182 871305 865949 861000 856270
60265 856270 852096 848999 846906 845185 843560 842589 843015 844960 848048 852044 856975 862790 869501 877665 888250
60250 888250 901788 917984 936270 956240 977261 998275 1018664 1038882 1059249 1078017 1091742
60239 1091742 1098109 1097701 1092307 1082235 1066529 1045614 1022243 999256 977410 956272 936456 919601
60227 919601 906188 894559 882670 870265 858831 849760 842988 837292 831576 825828 820900 817384 814833
60214 814833 812279 809324 806323 803518 800513 796770 792203 787118 781916 777055 772907 769475 766485 763854
60200 763854 761676 759801 758068 756943 756955 757143 755255 750454 745030 742211 742658 744233 744933 744768 744688 745043
60184 745043 745778 747351 750672 756192 763257 770234 775357 777892 778537 778506 778487 778766 779838 782058 784984 787877
60168 787877 790713 793902 797196 799807 801534 802875 804167 805576 807722 810987 814259 815987 816835 819608
60154 819608 825822 833946 842091 850941 862415 876418 890612 902974 913157 921614 928889 935897 943737
60141 943737 952817 962672 972637 982266 991391 1000407 1010145 1020749 1031034 1039686 1046665 1052487 1056680 1058282
60127 1058282 1057704 1056642 1055837 1054118 1050139 1044067 1037024 1029786 1022660 1015929 1009581 1003037 995799 988250
60113 988250 981355 975761 971455 967997 964690 960775 955912 950512 945353 940843 936753 932533 927959 923592
60099 923592 920566 919563 919958 920322 919881 919136 918988 919765 921356 923700 926463 928610 929100 928180 927367 927900 929693
60082 929693 932047 934767 937934 941046 943367 945234 948172 953327 960451 968757 977969 987847 997431 1005846
60068 1005846 1013473 1021169 1028483 1033866 1036857 1038898 1041662 1045595 1050523 1056507 1063333 1070099 1076182 1081940
60054 1081940 1087718 1092940 1097047 1100510 1103836 1106260 1106726 1105730 1104722 1103941 1102357 1099840 1097861 1097425 1097576
60039 1097576 1096719 1094395 1090908 1086060 1079504 1072114 1065887 1062140 1060314 1058742 1056217 1052619 1048417 1044060
60025 1044060 1039937 1036542 1034277 1033020 1032077 1030697 1028539 1025686 1022377 1018776 1014803 1010194 1004922 999399
60011 999399 993916 988016 980993 972953 964670 956353 947316 937094 926096 914950 904122 894478 887021
59998 887021 881318 875389 868247 861578 857632 856208 855170 853336 851279 849631 848380 847957 849403 852979
59984 852979 857722 862731 867847 872969 877918 883278 890065 898021 905404 911125 916069 921574 927446 932322
59970 932322 935349 936786 937300 937195 936027 932793 927074 919979 913119 906472 898434 888462 878342 869855
59956 869855 862247 853302 842314 830712 820059 810694 802360 795007 788553 782533 776420 770137 764151
59943 764151 759148 755458 752635 749903 747225 745481 745298 746152 747082 747698 747910 747311 745921 745257 747333 752311
59927 752311 758053 762461 765509 768463 771883 775310 778579 782290 786671 790769 793412 794622 795448 796471
59913 796471 797057 796232 793772 790181 786043 781756 777670 774098 771322 769783 769939 771644 773987 776124 778036
59898 778036 780114 782346 784294 785555 785847 785114 784043 783860 784864 785667 784754 782332 779719 777524 775685
59883 775685 774849 776021 778861 781867 784427 787170 790057 791910 792389 792715 793596 794132 793876 794333 796888 800552
59867 800552 803507 805818 808814 812556 816008 819316 823822 829700 835472 840404 845676 852303 859126 863877
59853 863877 865594 865249 864551 864830 866686 869896 873539 876566 878488 879667 881030 883331 886429 889454 891903
59838 891903 894363 897769 902274 907312 912560 918183 924174 930063 935428 940384 945572 951891 960053 969896
59824 969896 980255 989920 998658 1006966 1015164 1023313 1031703 1040490 1048832 1055234 1059109 1061443 1063598 1065920
59810 1065920 1067711 1068131 1066877 1064341 1061424 1058919 1056844 1054515 1051340 1047385 1043262 1039889 1038322 1039200
59796 1039200 1042008 1045240 1047756 1049868 1052933 1058074 1065504 1074768 1085034 1094954 1102705 1106802 1107116 1104957
59782 1104957 1102038 1099430 1097429 1095848 1093904 1090206 1083702 1074864 1065356 1056390 1047941 1039670 1031824 1024795
59768 1024795 1018490 1012683 1007393 1002386 997047 991556 987478 985954 985609 983576 978643 972218 965960 959779
59754 959779 952893 945741 939553 934432 929031 922339 914934 908144 902601 898265 895359 894262 894265 893333 889997
59739 889997 885133 881012 878652 877008 874900 872714 871558 871575 871920 872006 871951 871999 872225 872643 873046 872884 871890 870657
59721 870657 869981 869804 869432 868729 868401 869146 871131 874251 878163 881925 884339 885032 884856 884973 885923 887695 890302
59704 890302 893930 898672 904347 910551 916850 922907 928390 932981 936932 941499 948023 956234 964339 971487
59690 971487 979282 989805 1002721 1015729 1027593 1039232 1051675 1064449 1076603 1088059 1099052 1109106
59678 1109106 1117540 1124485 1130504 1135497 1138773 1140089 1140026 1139375 1138568 1137527 1135637 1132023 1126392 1119717 1113760
59663 1113760 1109731 1107529 1106213 1104902 1103102 1100452 1096639 1091786 1086686 1082202 1078422 1074789 1071150 1068114
59649 1068114 1066041 1064253 1061876 1059107 1056949 1055892 1055562 1055581 1056050 1057132 1058868 1061477 1065148 1069358 1072979
59634 1072979 1075286 1076356 1076461 1075761 1074771 1074369 1074837 1075352 1074750 1072537 1069084 1065423 1062922 1062320 1062551 1061262
59618 1061262 1057182 1051570 1046760 1043637 1041093 1037584 1032487 1026161 1019425 1013042 1007199 1001397 995234 989249
59604 989249 984493 981280 978941 977022 976185 977339 980042 982403 982886 981946 981528 983023 986102 989507 992407
59589 992407 994637 996148 996951 997480 998366 999645 1000555 1000197 998132 994369 989252 983481 977886 972964 968710
59574 968710 964819 960805 956112 950540 944522 938644 933036 927663 922839 918777 914887 910427 905720 901630
59560 901630 897741 892385 885033 877448 871497 866696 861045 853763 846124 839824 835491 832670 830434 828056
59546 828056 825852 825199 826956 829979 832087 832492 832336 832782 833715 834698 835985 837709 838956 838727 837379 836078
59530 836078 835124 833909 832449 831645 831753 831804 831166 830624 830861 830682 828151 823289 818336 815065 812997 810663
59514 810663 807673 804808 802677 801081 799453 797461 795352 793987 794180 795692 797310 798189 798605 799096 799566
59499 799566 799779 800059 800707 801176 800650 799176 797584 796712 797330 800206 805290 811275 816962 822695 829392 836672
59483 836672 843371 849768 857740 868484 881481 896121 912952 932445 953366 972922 987965 996049
59471 996049 996630 992010 986110 981408 977445 972676 966962 961686 958241 957089 957770 959250 960797 962832 966176
59456 966176 970108 972265 971132 967696 963806 959837 955092 949610 944104 938418 931418 922573 912666 902784
59442 902784 893317 884099 875028 866401 858858 852844 847862 842723 836968 831650 828236 827108 827573 828796
59428 828796 830159 831291 832523 834755 838078 841047 842358 842838 844723 849203 855731 863438 871843 880017
59414 880017 886421 890269 892363 894115 896376 899481 903617 908570 913546 917737 920914 923305 925253 927145
59400 927145 929309 931819 934629 937851 941504 945086 948035 950724 954360 959756 966772 975109 984796 995437
59386 995437 1005683 1014271 1021302 1027779 1033967 1038817 1040992 1039971 1036143 1030332 1023412 1016011 1008419 1001020
59372 1001020 994828 990989 989472 988820 987934 987809 990541 996572 1003869 1010303 1016066 1023057 1032632 1044904
59358 1044904 1059852 1077774 1098422 1120638 1143504 1167695 1195641 1230121 1271558 1315463 1353076
59347 1353076 1376478 1383963 1379936 1369895 1356860 1342462 1329088 1319525 1315689 1318658 1328307 1341236
59335 1341236 1350350 1348911 1335237 1312480 1284712 1254964 1226230 1201422 1181288 1164007 1147898 1133462
59323 1133462 1122126 1114190 1108999 1106226 1105925 1107763 1111098 1115535 1120720 1125890 1130313 1134078 1137830 1141763
59309 1141763 1145401 1148436 1151284 1154481 1157825 1160559 1162437 1164146 1166345 1168603 1169981 1170703 1172521 1177053
59295 1177053 1184241 1192821 1201761 1210744 1219877 1229620 1240591 1252770 1265255 1277567 1290733 1306015
59283 1306015 1322775 1338731 1352519 1365039 1378016 1392042 1406386 1419979 1432104 1442540 1451351
59272 1451351 1458226 1462033 1461576 1456901 1449247 1439623 1428105 1414787 1400660 1386961 1374091 1361638 1349151
59259 1349151 1336469 1323611 1310906 1299095 1288799 1279741 1270769 1260918 1250391 1240324 1231526 1223785
59247 1223785 1216755 1211124 1207974 1206902 1206055 1204899 1205923 1212031 1222347 1231785 1234875 1229199 1215419 1195699
59233 1195699 1172850 1149808 1128563 1109597 1092668 1077774 1065013 1054086 1044542 1036217 1028994 1022393
59221 1022393 1015963 1010061 1005940 1004880 1007120 1011543 1016534 1021332 1026421 1032507 1039641 1047916 1058383 1072165
59207 1072165 1088656 1105673 1121626 1136648 1151338 1165396 1178053 1188986 1198112 1205087 1209701 1212224
59195 1212224 1212684 1210315 1204513 1196145 1187146 1178911 1171620 1164946 1158739 1152965 1147543 1142605 1138649 1136308
59181 1136308 1135939 1137322 1139645 1141967 1143962 1146270 1149945 1155543 1162615 1169956 1176424 1181816 1186847 1191947
59167 1191947 1196206 1198177 1197823 1196853 1196558 1195937 1192762 1186241 1177774 1169085 1160473 1151319 1141702 1132693 1125001
59152 1125001 1117839 1109533 1099240 1087953 1077753 1070097 1064765 1060316 1055491 1050147 1044884 1040017 1035330
59139 1035330 1030901 1027558 1025912 1025241 1024162 1022335 1020718 1020014 1019916 1020232 1021651 1024577 1028068 1031055 1034059
59124 1034059 1038587 1045154 1052968 1061300 1069984 1078566 1086117 1092165 1096988 1100867 1103858 1106401 1109361 1113291
59110 1113291 1118361 1124912 1133117 1142016 1149882 1155795 1160050 1163055 1165011 1166801 1169701 1173555 1176451 1176922
59096 1176922 1175400 1172686 1168179 1160803 1150814 1139459 1127524 1115435 1104146 1094380 1085130 1074321 1061235
59083 1061235 1047207 1033738 1020918 1008161 995621 984183 974415 966099 958725 952210 947081 943840
59071 943840 941997 939984 936510 932046 928528 927441 928533 930527 932716 935517 939646 945159 951530 958441
59057 958441 966147 974910 984406 994159 1004486 1016435 1030490 1045612 1059900 1071995 1081631 1089192 1095355
59044 1095355 1101162 1107769 1115592 1123760 1130766 1135711 1138761 1140448 1140957 1140377 1139234 1138096 1136643 1133902
59030 1133902 1129797 1125945 1124310 1125167 1126773 1126950 1124770 1120901 1116665 1112809 1109085 1105070 1101051 1097482
59016 1097482 1093687 1088160 1080544 1072356 1065055 1058310 1051095 1043592 1036692 1030147 1022760 1014352 1006275 999796
59002 999796 994963 991205 988070 985176 982287 979678 977835 976716 975872 975076 974179 972718 970581 968712 968098
58987 968098 968367 968538 968771 969909 971421 971461 969284 966244 964159 963978 965996 969694 973041 973751 972035 970728
58971 970728 972060 975639 980074 984924 990233 995775 1001857 1009570 1019139 1029326 1039537 1051267 1066134
58958 1066134 1083519 1101376 1118451 1134550 1149471 1162892 1174637 1184174 1190576 1193772 1194858 1194472
58946 1194472 1192201 1188602 1186212 1186942 1189676 1192121 1193975 1196416 1199434 1201896 1203916 1206983 1211581 1216270
58932 1216270 1219483 1221048 1221814 1222815 1224868 1228091 1231698 1234783 1236998 1238039 1237350 1235171 1232987 1231877
58918 1231877 1231409 1231304 1232934 1237425 1243326 1248378 1253101 1260334 1271327 1284413 1297684 1310816 1323699
58905 1323699 1335316 1345092 1353963 1363076 1372252 1380468 1387225 1392957 1398513 1404227 1408925 1410127 1406210 1398204
58891 1398204 1388526 1378225 1366543 1352790 1337142 1319691 1300357 1280067 1260575 1242801 1226491
58880 1226491 1211606 1198631 1187294 1176561 1166438 1158317 1152827 1148642 1144229 1139756 1136580 1135793 1137859
58867 1137859 1142575 1148618 1153995 1157750 1160504 1162827 1164081 1163676 1162596 1162722 1165063 1169211 1173956 1177878
58853 1177878 1180103 1181277 1183316 1187483 1193074 1198545 1203391 1208311 1214086 1221166 1230064 1241198 1254177
58840 1254177 1267732 1280658 1292662 1304231 1315770 1326982 1337291 1346964 1357390 1369786 1383920
58829 1383920 1398722 1414094 1431381 1451824 1475028 1499060 1521701 1541687 1559288 1575759 1591741
58818 1591741 1606241 1617523 1624850 1628737 1629717 1627743 1622908 1615940 1607545 1597702 1585837 1571481 1554821
58805 1554821 1536925 1519344 1503108 1488248 1474555 1462224 1451126 1439957 1427125 1412276 1396061
58794 1396061 1378612 1359359 1338379 1316950 1296500 1277651 1260355 1244246 1228780 1213705 1199413
58783 1199413 1186258 1173632 1160428 1146374 1132321 1119394 1108413 1099706 1092596 1085377 1076780 1067270
58771 1067270 1058098 1049446 1040545 1031278 1022448 1014583 1007567 1001355 996138 992055 989672 990138 993546 997782
58757 997782 1000630 1002588 1005793 1010563 1015119 1018580 1021842 1025084 1026880 1026732 1026394 1027412 1029035 1029796 1029690
58742 1029690 1029343 1028178 1024830 1018883 1011294 1003620 997176 992143 987134 980629 973160 966886 962755 959452
58728 959452 955651 951724 948540 946056 944040 942912 942973 943923 945840 949376 954397 959842 965660 973190 982602
58713 982602 991504 997303 999519 998666 994628 987763 980106 973452 967186 959709 951200 943257 936558 930566
58699 930566 924949 919794 914946 910612 907948 907479 907523 905952 903237 902083 904244 909159 915513 922367 928736
58684 928736 933727 937679 941918 946886 951523 955001 958241 962997 969774 977085 982737 985851 987728 990645
58670 990645 995816 1002746 1010290 1017547 1023835 1028957 1033865 1039868 1046591 1051878 1054477 1055705 1057593 1060594
58656 1060594 1064243 1068846 1074895 1081670 1088145 1094867 1103270 1113174 1122310 1128490 1131288 1131560 1130206 1127376
58642 1127376 1122236 1113678 1101804 1088265 1074523 1060359 1044907 1028427 1011938 995614 978817 961475
58630 961475 944275 927617 911430 896038 882257 870601 860974 852987 845928 838737 830876 823134 816862
58617 816862 812476 809189 806002 802514 799098 796701 796084 796819 797650 798245 799794 803292 808278 814163 821853
58602 821853 832641 845966 859488 871236 880680 888024 893517 897417 899739 899979 897686 893226 887567
58589 887567 881601 876031 871373 867420 863103 857465 850585 843403 837088 832577 829844 827480 824061 820109
58575 820109 817394 816131 814593 812061 810140 809996 810253 809289 807981 808193 809683 810603 810355 810111 810891 812453
58559 812453 813635 812892 809471 805119 803242 805019 807796 808960 809710 812956 819007 825953 833075 841002 849196
58544 849196 856264 862516 869503 877085 883491 888288 892672 896632 898517 897943 896788 896516 896623 896446 896615
58529 896615 897890 900295 904047 909820 917474 926045 935521 947157 961456 977192 992857 1007749 1021397
58516 1021397 1033451 1044637 1056376 1068974 1081490 1093661 1106495 1120543 1135097 1149656 1164973
58505 1164973 1182104 1201522 1223409 1247710 1273658 1300470 1328631 1359129 1391239 1422520 1451332
58494 1451332 1477996 1503123 1526048 1545276 1559401 1567498 1569774 1567847 1563212 1555714 1544952 1532681
58482 1532681 1521747 1512618 1503085 1491626 1478866 1465089 1448565 1427571 1402652 1375937 1349417 1324469
58470 1324469 1301565 1279659 1257142 1234118 1212620 1194134 1178148 1163611 1150378 1138605 1128010
58459 1128010 1118392 1109843 1102094 1094792 1088525 1084154 1080882 1076627 1070780 1065016 1060808 1057694 1054631 1051623
58445 1051623 1049212 1047593 1046872 1047149 1047949 1048613 1049413 1051029 1052946 1053864 1053778 1054005 1055042 1056174 1057300 1059217
58429 1059217 1061886 1064546 1067845 1073549 1081555 1089627 1096869 1105041 1115342 1126385 1136854 1147950 1161448
58416 1161448 1177211 1194413 1213512 1234938 1256960 1276702 1292542 1304169 1311306 1313946 1313221 1310733
58404 1310733 1307331 1303164 1298305 1292886 1287532 1283873 1283266 1284694 1285557 1285129 1285554 1288747 1294165 1300565 1308046
58389 1308046 1317053 1326923 1336766 1346360 1354975 1360683 1362065 1359431 1353461 1344164 1332285 1320128 1309543
58376 1309543 1300281 1291518 1283710 1277837 1274126 1272595 1273475 1276021 1278377 1279897 1282250 1287112 1294174 1302452
58362 1302452 1311816 1321903 1331310 1339511 1347993 1357714 1366836 1372854 1375694 1376846 1376530 1373752 1368433 1361592
58348 1361592 1353831 1345097 1335571 1325674 1315758 1306716 1299985 1295860 1292729 1289156 1285780 1284009 1283823 1284250
58334 1284250 1285299 1288033 1293100 1300126 1308152 1316020 1322907 1328980 1334937 1340725 1345717 1350192 1355221 1360846
58320 1360846 1366028 1370782 1376481 1383411 1389977 1395258 1400467 1406851 1413870 1420721 1428063 1436964 1447353 1458521
58306 1458521 1470024 1481502 1492905 1505267 1519627 1534938 1548957 1561482 1574569 1589404 1605484
58295 1605484 1622984 1642697 1662898 1679893 1693113 1706364 1722243 1738460 1751730 1762340 1772670
58284 1772670 1783948 1796837 1812630 1831284 1850368 1868213 1886195 1906035 1927169 1948698 1971545
58273 1971545 1996498 2022360 2048013 2074122 2101009 2127327 2152595 2178322 2204858 2230054 2252956
58262 2252956 2275559 2298833 2320585 2339725 2358944 2380158 2400888 2418536 2434890 2452877 2472085
58251 2472085 2491218 2511798 2535466 2560524 2585154 2611302 2641316 2673525 2705377 2738286 2774911
58240 2774911 2814039 2852695 2891142 2931313 2972408 3012577 3053169 3096799 3142822 3188976 3235914
58229 3235914 3285924 3338802 3392883 3448418 3506039 3563949 3620672 3678580 3740633 3805764 3871526
58218 3871526 3938969 4010605 4085926 4163323 4244079 4330038 4419832 4511968 4608928 4713405 4823295
58207 4823295 4935506 5051900 5176125 5307369 5442899 5584114 5734197 5892215 6055526
58198 6055526 6225649 6405853 6595365 6792127 6998816 7219766 7454024 7697606 7950303
58189 7950303 8214185 8488013 8769732 9062092 9369569 9692525 10030714 10389090 10773125
58180 10773125 11181905 11613227 12071703 12563726 13088077 13640039 14221287 14837150 15488054
58171 15488054 16173236 16899369 17675813 18504666 19384880 20321781 21321818 22382107 23496616
58162 23496616 24668987 25908311 27217244 28596920 30058931 31619259 33285172 35061877
58154 35061877 36966541 39020360 41232015 43604943 46154986 48903672 51861582 55039900
58146 55039900 58474585 62220472 66329858 70861269 75903033 81562225 87935354 95115193
58138 95115193 103218271 112378334 122727163 134418211 147652710 162632895 179496006
58131 179496006 198339486 219299458 242573898 268438573 297294162 329414098 364016578
58124 364016578 398131983 426596627 443906097 446843769 435845042 414199906 386101498
58117 386101498 355119110 323706687 293350424 264855891 238611620 214790355 193430753
58110 193430753 174435663 157599458 142681167 129445747 117661146 107114035 97648074
58103 97648074 89164224 81580035 74808605 68770597 63394817 58600530 54300483 50424710
58095 50424710 46923638 43748378 40847515 38184038 35736790 33483539 31398966 29469407
58087 29469407 27692018 26056869 24544404 23141436 21844421 20645061 19527029 18479510
58079 18479510 17501196 16588636 15732580 14927760 14174726 13469970 12804960 12176575 11588108
58070 11588108 11038546 10521138 10033780 9580290 9159530 8763160 8386145 8029984 7693644
58061 7693644 7370823 7058874 6761860 6482151 6216630 5963106 5722663 5493808 5271922
58052 5271922 5056420 4851084 4655715 4465075 4277924 4099480 3932682 3774253 3621643
58043 3621643 3476651 3339619 3206979 3077621 2955453 2842795 2737043 2636480 2543489 2459017
58033 2459017 2379269 2301037 2225757 2155728 2090787 2030874 1977386 1929678 1884403 1840182 1798862
58022 1798862 1760638 1722477 1683072 1644920 1609713 1575951 1542812 1511987 1483833 1455936 1427379
58011 1427379 1400353 1375736 1351133 1325116 1299504 1275607 1252118 1228508 1206651 1187242 1168334
58000 1168334 1149173 1131690 1116338 1100299 1081927 1063340 1046431 1029794 1011912 994270 978970
57989 978970 966034 955011 946442 939801 932642 923769 914845 907315 900188 892261 883885 875075 864542
57976 864542 852168 839954 829130 818793 808567 799883 793129 786175 777341 767569 758333 749648 741349
57963 741349 733979 727181 719405 710336 701478 693559 685707 677851 671356 666413 661435 655826 650642 645789
57949 645789 639556 631958 625537 621596 618440 614482 610224 605968 600586 594133 588856 585958 583803 580635
57935 580635 576564 571632 564792 556383 548866 543396 538137 531545 524856 519713 515790 512409 510101 508884
57921 508884 507330 504960 503341 503268 503146 501697 499964 499086 498403 497315 496611 496280 494394 490053 485328 482466
57905 482466 481130 479974 478860 477906 476448 474621 473924 474602 474476 471971 468339 465473 463600 462514 462733
57890 462733 463835 463944 462537 461537 462008 462180 460524 458423 457916 459096 461576 466033 472127 477293 480027
57875 480027 482457 487397 494726 502619 510229 516997 521485 523307 524375 525993 526640 524699 521189 517519
57861 517519 512811 506141 499275 494303 490444 486055 481965 479739 478300 475471 471557 468306 465529 461941
57847 461941 458466 457486 459299 462043 464678 467574 470728 473704 476673 479379 480137 478254 476341 477586 481572
57832 481572 485338 487658 489586 491684 493642 496043 499631 503211 504998 505645 507266 509863 511468 511431 510723
57817 510723 509237 505796 500852 496299 492424 487861 482806 479317 477788 476021 472771 469633 468223 467720
57803 467720 466502 464402 462073 459791 458068 458030 459854 461949 462884 463301 464820 467722 470725 472830 474625
57788 474625 477525 481955 486540 489450 490444 490878 491707 492610 493382 494595 495954 495594 492566 488790 486849 486708
57772 486708 486289 484469 481751 478727 475730 473574 472838 472660 471745 470168 468766 467372 465325 463192 462228
57757 462228 462487 462942 462955 462117 459370 454113 447615 441434 435036 426922 417517 408735 401106 393664 386522
57742 386522 381148 377774 374664 370410 365346 360498 356775 355222 356327 358965 361540 364100 367732 372164
57728 372164 375919 378657 381381 384348 386893 389461 393662 399998 407333 414847 422562 429810 435286 439056
57714 439056 442591 446492 450118 453682 458446 464236 468936 471217 471874 471856 471153 470450 471647 475443 480097
57699 480097 483756 486401 488438 489184 488154 486396 485144 484286 483310 482525 482148 481351 479580 477786 476963 476258
57683 476258 473942 469832 465621 462992 462158 461996 461038 458664 455666 453253 451400 448905 445253 441587 439476
57668 439476 439413 440777 442536 443774 444236 444529 445146 445491 444719 443248 442269 442020 441966 442511 444747 448291 451178
57651 451178 452496 453562 455791 458867 461782 464296 466414 467540 467141 465633 464013 463176 463663 465013 465364
57636 465364 463003 458564 454357 451336 448252 444062 439355 434867 430453 426528 424688 425669 428002 429904
57622 429904 431309 433024 435190 437822 441779 447996 456673 468118 483173 501617 521373 540874 561477
57609 561477 586183 616593 652344 692645 736301 779936 817448 842107 849518 839413 815436 783021
57597 783021 746840 709911 674345 641640 611944 584299 558361 535191 515968 500841 489453
57586 489453 481513 476205 472100 468390 465406 463322 461320 458607 455222 451184 446072 440337 435890 434214
57572 434214 434751 436103 437882 440127 441722 440984 437722 433721 431137 430957 432670 434783 435810 435196 433229
57557 433229 430271 426816 424219 424065 426301 428941 430119 429523 427567 424489 420959 418283 417008 416213 414934
57542 414934 413405 412200 411221 410274 409635 409291 408711 408053 408351 409545 409713 407553 404513 403072 403723 404978
57526 404978 405550 405299 404606 404066 404294 405118 405617 405807 407324 411282 416297 419881 421150 421022 420553 420429 421459
57509 421459 424039 427221 429378 429671 428356 426343 425159 426347 429800 433527 436155 438712 442676 447295
57495 447295 450562 452181 453788 456509 459952 463558 467438 471639 475713 479316 482546 485745 489482 494369
57481 494369 500277 506239 511748 517370 523313 528322 531117 532232 533289 535251 538501 543681 550853 558361
57467 558361 564130 567827 570531 572887 575104 578253 583733 591349 599307 606154 611584 615517 617758 618645
57453 618645 618909 618731 617672 615323 611288 605107 597209 589425 583379 578805 574472 570190 566708 564354 563197
57438 563197 563921 566919 570936 574163 576366 578509 580829 583007 585753 590283 596375 602827 609677 618041
57424 618041 627770 637287 646008 654980 664692 674104 682439 690282 698343 706588 715097 724239 733489 741513
57410 741513 748014 754023 759850 764341 766949 769040 772092 775761 778833 781207 783908 787758 792801 798652
57396 798652 804912 811534 818823 826621 833795 839529 844829 851438 859321 866678 872596 878072 884067 890214
57382 890214 896161 902668 910316 918268 925380 931832 938886 947620 958340 970461 982562 993392 1003224
57369 1003224 1013464 1024731 1036318 1047666 1059098 1070749 1082105 1093159 1104740 1117033 1129108
57358 1129108 1140567 1152338 1164933 1177288 1188460 1199226 1210576 1221597 1230597 1237956 1246372 1258109
57346 1258109 1272941 1288871 1304088 1318131 1331727 1345786 1360478 1375276 1389762 1404038 1418381
57335 1418381 1432971 1447911 1463074 1478141 1493426 1510205 1529095 1548380 1565426 1579992 1594655
57324 1594655 1611528 1630012 1648489 1666706 1685298 1704061 1722091 1739084 1755439 1771445 1787288
57313 1787288 1803590 1821095 1839803 1858703 1876219 1890982 1902856 1913457 1924939 1937950 1951435
57302 1951435 1964646 1978409 1993981 2011526 2030217 2049066 2067025 2083044 2096836 2109378 2122300
57291 2122300 2136957 2153832 2172156 2190252 2207272 2224518 2243993 2265710 2287850 2309517 2331539
57280 2331539 2354153 2375952 2396180 2416305 2437898 2460303 2481947 2502920 2524754 2548361 2573547
57269 2573547 2599939 2627068 2654013 2680135 2705813 2731547 2756897 2781339 2805534 2830521 2856021
57258 2856021 2880764 2904456 2928389 2954057 2981828 3010967 3040456 3069823 3099480 3130064 3161429
57247 3161429 3192854 3224254 3256323 3289269 3322465 3355707 3389650 3424411 3458968 3492693 3526286
57236 3526286 3560285 3593898 3626402 3658549 3691250 3723926 3755592 3786752 3818704 3851527 3884233
57225 3884233 3916472 3948721 3981089 4013187 4044838 4075819 4105310 4132914 4159849 4187850 4217153
57214 4217153 4246836 4276940 4308805 4343235 4379632 4417269 4456431 4497918 4542097 4588621 4636595
57203 4636595 4684996 4733392 4782174 4831738 4881691 4931103 4978992 5024286 5066161 5105095 5142628
57192 5142628 5179077 5212212 5239398 5260611 5278369 5295177 5312094 5329365 5347228 5366106 5386728
57181 5386728 5409918 5435893 5464425 5496248 5533212 5576093 5623366 5673521 5727663 5788172 5855419
57170 5855419 5927596 6003431 6083195 6166934 6253226 6339958 6425145 6506950 6584144 6656773 6725490
57159 6725490 6790327 6851054 6908379 6963507 7016655 7067376 7116310 7165175 7214711 7263838 7311181
57148 7311181 7356359 7399473 7440445 7479550 7517978 7557293 7598337 7640409 7681101 7717268 7746862
57137 7746862 7769794 7786823 7798238 7804164 7805263 7802113 7794457 7782081 7765916 7747210 7726096 7701933
57125 7701933 7674563 7644213 7610831 7574789 7537847 7502379 7470053 7442038 7419573 7403137 7392083
57114 7392083 7386446 7388248 7399413 7419195 7445220 7475888 7509593 7542394 7569058 7586538 7594737 7594386
57102 7594386 7586377 7572988 7557326 7541108 7524547 7508230 7493160 7479046 7464505 7449143 7433786
57091 7433786 7419000 7405378 7395014 7390385 7391487 7395681 7400007 7401715 7397241 7383339 7359272 7325620
57079 7325620 7281459 7225484 7159575 7087949 7012422 6931480 6844110 6751107 6651900 6543580 6424353
57068 6424353 6295159 6156860 6008663 5850249 5682469 5504617 5313660 5107186 4884476
57059 4884476 4643922 4382293 4097364 3788091 3451298 3081481 2674853 2230224 1745168
57050 1745168 1215249 638276 15591 -651564 -1362243 -2110749 -2885646 -3674441 -4463358 -5230396
57040 -5230396 -5944268 -6572747 -7087342 -7460086 -7666150 -7695550 -7555611 -7256096 -6795608 -6162725
57030 -6162725 -5340992 -4311013 -3057419 -1568153 198089 2334687 4898761 7713136
57022 7713136 10256688 11842226 11997534 10723293 8424468 5649346 2899608 588737
57013 -966660 -1599578 -1330262 -322351 1208902 3061746 5064410 7067431 8932219 10526888
57004 10526888 11741890 12521674 12883712 12905238 12692483 12356702 11999068 11695678 11487006
56995 11487006 11381348 11367289 11423065 11521874 11638817 11757207 11868077 11965585 12045363 12105414
56985 12105414 12144933 12162392 12156706 12129255 12082549 12017958 11936964 11843468 11742178 11635034 11521343
56974 11521343 11400952 11275375 11146548 11017320 10893680 10784042 10693972 10620320 10549468 10461419
56964 10461419 10338393 10173253 9971518 9745535 9506824 9262937 9018297 8775099 8533798
56955 8533798 8294826 8060059 7831566 7609275 7391067 7174777 6958768 6740900 6518514
56946 6518514 6289737 6054040 5811715 5563821 5312420 5059905 4808133 4558811 4314041
56937 4314041 4075474 3843527 3618648 3402693 3197667 3003723 2820132 2647973 2489996
56928 2489996 2347774 2220768 2108324 2010662 1927251 1855943 1794530 1741681 1695507 1652637 1610010
56917 1610010 1566848 1524106 1482943 1444429 1409561 1378402 1349998 1324045 1301765 1283972 1269159
56906 1269159 1254965 1241132 1229693 1222350 1218761 1217288 1216362 1215178 1214052 1214196 1216142 1218121 1216676 1209124
56892 1209124 1194985 1175286 1151501 1125353 1098587 1072102 1045656 1018923 992686 968729 948730
56881 948730 933441 922613 915501 911572 910953 914144 921240 931455 943475 956315 969891 984604 1000023
56868 1000023 1013906 1022959 1024735 1018541 1004622 983499 956669 926995 897244 868497 840843 815022
56856 815022 792052 771530 752007 733365 717347 705048 695273 686402 678702 673445 670543 668562 666694
56843 666694 665163 663736 661373 657920 654941 654090 655327 657424 659664 662332 665877 670229 674888 679207
56829 679207 682659 685114 686751 687559 687260 685955 684378 682861 680300 674892 665977 654699 642868 631653
56815 631653 621322 611585 602126 593473 587526 586428 590526 598200 608258 621703 640219 663486 689165
56802 689165 715583 743523 775259 812391 854389 898060 938032 968621 986244 990451 983137 967556
56790 967556 947841 928080 910798 896488 884959 876744 872953 874295 880674 891458 905843 923393
56778 923393 944574 970542 1002308 1040448 1085387 1136902 1192712 1248030 1296774 1332848 1350773
56767 1350773 1347238 1323502 1285514 1240336 1192580 1144687 1099248 1059207 1026025 999171 977601
56756 977601 960740 948109 939282 934564 934957 941228 953546 971819 995519 1023278 1053458 1084662
56744 1084662 1114404 1137490 1147684 1142057 1122942 1095181 1062402 1026455 989130 952827 919431
56733 919431 889314 861724 836169 813510 795593 783458 776179 772060 770682 772816 778501 786490 795901
56720 795901 807086 820104 833220 843672 849205 848231 839543 823113 800827 775463 749030 722681
56708 722681 697667 675275 655792 638472 622740 608804 596830 586139 575674 565041 554555
56697 554555 544288 533598 522087 510792 501609 495163 489843 483570 476028 468471 461735 455574 449843
56684 449843 445126 441855 439668 437989 436386 434079 430070 424342 418219 412922 408463 404578 401959 401489
56670 401489 402474 402502 399435 393435 387132 383718 384355 387175 389080 388648 386950 385745 385706 386505 387590 388222
56654 388222 387495 385178 382274 380238 379784 380621 381993 383245 384238 385394 387030 388804 390412 392584 396303
56639 396303 401040 404985 407404 409573 412783 416666 420192 423246 426164 428580 429784 429726 428898 427812 427188
56624 427188 427913 430027 432480 434650 437256 441014 445363 449556 453966 458933 463120 464676 463772 462591 462975
56609 462975 465195 468751 472978 476844 479439 480982 482503 484455 486393 487941 489219 490322 491135 491642 491808
56594 491808 491262 489740 487502 484610 480194 473430 465062 457024 450632 445882 442228 439075 435655 431449
56580 431449 426805 422459 418633 415220 412494 410649 409005 406732 404129 402153 400904 399763 398809 398782 399623
56565 399623 400333 400448 400406 400186 398872 396027 392475 389221 386427 383830 381235 378143 373747 367969 361907
56550 361907 356796 352957 350062 347922 346529 345685 345019 344360 344114 345238 348324 352449 355578 356780 357315
56535 357315 358595 359873 359473 357815 357342 359247 362014 363763 364505 365330 366584 367819 368553 368244 366418 363781
56519 363781 362440 363921 367352 370543 372569 374382 376913 379544 380972 381278 382548 387010 394562 402639
56505 402639 408857 413322 417731 422821 427875 432717 438831 447765 459179 471100 481697 490202 496400
56492 496400 499945 500499 498444 495246 492648 491230 489911 487122 482250 475805 468762 462191 456983 453206
56478 453206 450116 447361 445706 445800 446759 447017 446222 445261 444611 443790 442412 440789 439375 438418 438087 438153 437656
56461 437656 435814 433236 431421 431041 431363 431113 429277 425523 420723 416668 414291 412614 410281 407350 404435
56446 404435 401155 397203 394102 393660 395007 395471 394361 393564 394183 394982 394762 394041 393496 392764 391694 390907 390143
56429 390143 388033 384667 382505 383246 385309 385871 384082 380940 377318 373701 370892 369457 369104 369629 371563
56414 371563 374854 377953 379468 379920 380810 382753 385517 388863 392252 394632 395670 396329 397168 397194 395676 394043
56398 394043 394357 396593 398904 400051 400171 399717 399092 399004 399765 400423 399791 398211 397315 398227 400941 405013 409821
56381 409821 414373 417890 420433 422269 423027 422351 420878 419551 418295 416433 414105 412181 410909 409637 407890
56366 407890 405908 404191 403201 403433 405094 407717 410581 413379 416097 418565 420581 422217 423654 425135 427319
56351 427319 430895 435255 438315 438538 436777 435348 435597 436857 437449 436247 433702 431754 432215 434793 437187
56336 437187 437467 435697 433094 430660 429157 429231 430570 431661 431316 429910 428500 427510 426996 427384 428944 430997
56320 430997 432363 432253 430372 426870 422678 419168 417019 416099 416555 418841 422391 425786 428818 432862 438401
56305 438401 443722 447138 448997 450348 451230 451797 453692 458385 464976 471223 476070 479852 482878 485197 487031
56290 487031 488274 488416 488022 489014 492207 495968 498969 502679 508924 516201 521069 522651 523288 524960 527477
56275 527477 530335 533965 538329 542008 543774 544273 545558 549274 555372 562385 569147 576197 584495 592758
56261 592758 597975 599401 600079 602868 606741 608974 609361 609792 610754 610930 609810 608344 607320 607163 608976 613658
56245 613658 620165 626552 632509 639097 646356 653243 659653 666584 674348 682435 690927 700272 709891 718806
56231 718806 727367 736682 746723 756758 767074 778306 789704 800319 811440 825336 841816 858443
56219 858443 874120 890025 907007 924583 942750 962374 983365 1004731 1026789 1051068 1077732
56208 1077732 1105448 1134314 1166488 1203130 1242828 1283923 1326484 1371250 1418461 1468629 1522850
56197 1522850 1581721 1645404 1715058 1792412 1877548 1968942 2066180 2170734 2283627 2404351 2532682
56186 2532682 2669494 2814699 2966092 3121116 3278357 3436529 3593307 3745715 3890312
56177 3890312 4022748 4138744 4235904 4313065 4367827 4396856 4399294 4377936 4336211 4275616 4196806
56166 4196806 4101553 3992716 3873476 3747077 3616058 3481339 3343352 3204230 3067584 2936049
56156 2936049 2810413 2690738 2576476 2465847 2357530 2253223 2156406 2068422 1987790 1913226
56146 1913226 1844568 1780545 1718669 1658429 1602120 1551404 1505265 1462204 1422223 1385630 1352046
56135 1352046 1321698 1295680 1273842 1254227 1235494 1218179 1202966 1189637 1178368 1169971 1164068 1158924
56123 1158924 1153705 1148977 1144656 1139837 1135099 1132413 1132063 1132208 1132183 1133523 1136878 1140776 1144538 1149497 1155990
56108 1155990 1162065 1166882 1172778 1182050 1193850 1205909 1217255 1227791 1237399 1247107 1259159 1274499
56096 1274499 1292013 1311297 1333885 1360656 1390503 1422756 1458312 1497123 1537440 1579193 1625376
56085 1625376 1678322 1737361 1802061 1874900 1958416 2051929 2153002 2259542 2368303 2474017
56075 2474017 2572694 2663879 2747641 2821803 2884661 2938240 2986168 3029963 3069561 3105389 3137276
56064 3137276 3162942 3180039 3188551 3189601 3183660 3171531 3154737 3132719 3101524 3057414 3000114 2931033
56052 2931033 2850898 2761493 2667490 2573950 2483526 2397739 2318632 2247073 2181882 2122998 2073205
56041 2073205 2034373 2004289 1979606 1959546 1944211 1931847 1920767 1911881 1906320 1902538 1898580 1895328
56029 1895328 1894708 1896555 1899972 1905820 1914996 1925954 1936741 1947906 1960925 1975588 1991378 2009380
56017 2009380 2030132 2051540 2071666 2091707 2113581 2136554 2159038 2181928 2207323 2235469 2265379
56006 2265379 2296822 2329473 2361867 2393367 2425358 2458741 2492524 2526469 2562309 2600556 2639202
55995 2639202 2677552 2717886 2761143 2804806 2847675 2892776 2942448 2994317 3045319 3095895 3147078
55984 3147078 3197520 3247068 3299172 3355828 3414057 3471325 3530341 3594390 3662169 3731770 3805538
55973 3805538 3886118 3971626 4059592 4151780 4250220 4352450 4455690 4561758 4672974 4787452
55963 4787452 4903644 5025058 5155002 5291153 5430874 5577196 5733805 5899193 6071939
55954 6071939 6256504 6457003 6670444 6893169 7128534 7380589 7645547 7917734 8198845
55945 8198845 8493161 8799250 9115621 9449327 9809115 10194694 10602178 11034855 11498170
55936 11498170 11989013 12501209 13037559 13605849 14207525 14841541 15514645 16235860 17004861
55927 17004861 17817556 18678639 19596333 20569380 21592062 22667722 23804778 25005044 26269981
55918 26269981 27613017 29051236 30590772 32235367 34002104 35911716 37970306 40178726
55910 40178726 42552531 45113510 47870930 50834999 54042886 57549789 61404628 65662162
55902 65662162 70410801 75758811 81800096 88622616 96338474 105070036 114920294 126002038
55894 126002038 138488657 152595298 168533293 186545612 206965003 230152753 256377547
55887 256377547 285767782 318126695 352255929 385118258 411947074 427912538 430367734
55880 430367734 419910172 399571315 373104428 343722617 313713675 284538771 257033338
55873 257033338 231624922 208522235 187791735 169356005 153028199 138587407 125811584
55866 125811584 114468095 104334007 95242293 87084805 79772573 73218525 67350930 62108979
55858 62108979 57419665 53201097 49389047 45939946 42809799 39951589 37332877 34935512
55850 34935512 32736981 30709474 28836724 27113797 25529207 24062797 22701347 21440821
55842 21440821 20272743 19182974 18164587 17218113 16338128 15512347 14734527 14005999 13324068
55833 13324068 12680923 12074432 11508115 10979709 10481132 10010653 9573840 9171016 8793957
55824 8793957 8436216 8096654 7771609 7453766 7141214 6839132 6550735 6274292 6009814
55815 6009814 5760351 5525284 5299992 5083080 4876567 4678599 4483913 4292295 4108827
55806 4108827 3934845 3766370 3602539 3447952 3305027 3170996 3043872 2924730 2812896
55797 2812896 2705576 2603519 2510589 2426472 2346118 2267580 2194059 2126989 2063481 2002067 1944737
55786 1944737 1891604 1839539 1787890 1739869 1696398 1653921 1610162 1567095 1526676 1488494 1453005
55775 1453005 1422158 1395307 1369150 1342863 1318745 1297056 1275362 1253874 1235994 1222018 1207550
55764 1207550 1189944 1171497 1154494 1137852 1120591 1104080 1088761 1072743 1055502 1039158 1024582
55753 1024582 1010085 995301 982354 971828 961659 951286 942768 936446 929843 922448 917257 915679
55741 915679 915011 912923 910506 908903 906836 903752 901908 902993 905650 908175 910679 912972 913552 912494 912316
55726 912316 914270 916567 917544 917469 915932 910812 901502 890007 877350 862067 843905 825826 810528
55713 810528 797848 787109 779002 773452 768440 762576 756218 748945 738942 726208 713285 701461 689313
55700 689313 676285 664276 654229 644521 634311 625136 617500 609349 599673 590142 581406 571532 560191
55687 560191 550464 543920 537621 529033 520369 514675 510777 505725 499647 494521 490337 486038 482368 480310
55673 480310 478250 473984 468261 463341 459309 454694 449521 444752 439606 432323 423137 414161 406825 401307
55659 401307 397665 395516 393253 389465 384684 380513 377888 377219 378795 381759 384199 385682 388099 392633
55645 392633 397667 401299 403918 406425 407857 407051 404969 403020 400583 396470 391496 387236 383489 379317
55631 379317 375416 373156 372255 371680 371759 373091 374350 373681 371590 370201 370257 371058 372606 375462 378868 381305
55615 381305 382715 384207 385843 386626 386452 386243 386408 386877 388362 391725 396142 399467 400420 399252 396713 393798
55599 393798 391994 392099 392981 392866 391564 390157 388998 387537 385802 384548 384141 384525 385905 388174 390087
55584 390087 390402 389411 388003 385750 381609 376201 371590 368647 366150 362709 358257 353361 348299 343308 338752
55569 338752 334410 329118 321753 312661 303982 298199 295844 294767 292389 288559 285276 283803 283553 283866 284952
55554 284952 286367 286431 284355 281413 278853 276146 272575 268945 266235 264017 261780 260267 259734 258408 254816
55539 254816 250457 247890 247188 246585 245681 245395 245309 243823 240969 238605 237602 237060 236605 237216 239077 240585
55523 240585 240481 239585 239658 241543 244944 248907 252162 254043 255557 258562 263483 268663 272285 274189 275625
55508 275625 278008 282064 287298 292026 294626 295074 294751 294631 294239 292479 288971 284329 279403 274402 268895
55493 268895 262914 257775 254870 253582 251621 247980 244289 242376 241747 240722 239058 237878 237626 237595 237177
55478 237177 236380 235343 234420 234369 235432 236647 237091 237291 238334 240105 241677 243038 245107 248175 251339 253432
55462 253432 253862 253019 252387 253383 255282 255475 252876 249800 248931 249755 249890 248746 247497 246253 243961 240865
55446 240865 238410 236571 233830 230074 226917 224450 220374 213685 206917 202922 201048 198388 193683 188072
55432 188072 182736 177754 173243 169927 167982 166263 163463 159709 156485 154905 154505 154079 153368 153186 153917
55417 153917 154912 155790 157277 159970 163162 165851 168054 170036 171118 170757 170174 171253 174089 177170 179729
55402 179729 182175 184273 184913 184177 183868 185023 186207 185339 182348 179109 177285 177082 177820 179038 180796 182945
55386 182945 184367 183658 180971 178459 178022 179164 180087 180396 181362 183679 186354 188053 188479 188159 187688 187343
55370 187343 186774 185146 182314 179582 178481 179060 180366 182093 184518 187104 188655 188847 188224 186724 183777
55355 183777 180079 177719 177967 180043 182390 184040 184540 184008 183789 185668 189538 192910 193564 191909 190087
55340 190087 189515 190006 190608 190526 189663 188874 189380 191509 194187 195822 195501 193404 190518 187904 185911 184246
55324 184246 183024 183096 184708 186594 187405 187384 187415 187104 185450 183145 182412 184369 187914 191270 193169 192562 189096
55307 189096 184438 181512 181624 183377 184841 185515 185762 185692 185332 184905 184414 183812 183632 184279 184744 183688 181951
55290 181951 182020 184416 186623 186571 185232 184509 184418 184163 184358 185980 187952 188043 186125 184749 186165 189887 193516
55273 193516 195217 195096 194556 194481 194198 192548 189809 187672 187207 187881 188813 189780 190440 189904 188089 186417 186087
55256 186087 186453 186197 185373 185048 185443 185656 185109 184251 183774 183748 183543 182310 179832 177137 175737 175998 176857 177435
55238 177435 178041 179121 180174 180546 180508 180666 180857 180444 179282 177722 176145 175109 175423 177304 179887 182078
55222 182078 183387 183599 182584 181147 181107 183377 186538 188282 187805 185953 183595 181042 178672 176967 175905
55207 175905 175163 174874 175518 177131 179151 180899 181788 181472 180371 179551 179483 179357 178323 176912 176396 177180 178690
55190 178690 180427 182029 182496 180642 176618 172155 168919 167257 166900 168207 171900 177546 182905 185388 184358
55175 184358 181621 179427 178407 177904 177623 177862 178393 178501 178331 178941 180605 182285 183277 184155 185465 186784
55159 186784 187856 189309 191115 191652 189812 187033 185663 186016 186699 187108 187618 187594 185463 181288 177407 175601
55143 175601 174926 173385 170780 168777 168645 170039 171937 173863 175810 177524 178512 178831 179341 180768 182766
55128 182766 184390 185350 186107 186729 186474 184844 182467 180554 179963 180936 183031 184996 185409 184009 181944 180448
55112 180448 179832 179890 180379 180762 180446 179819 180077 181438 182540 182341 181641 181817 182947 184184 185157 186001 186717 187487
55094 187487 188960 191242 193365 194666 195790 197219 197864 196628 194506 193399 193439 193285 192732 192996 194355 195313
55078 195313 194591 192485 189801 186835 184004 182316 182465 184101 186425 188881 190967 192050 191807 190561 189173
55063 189173 188857 190574 193825 196328 195927 192816 189189 186907 186372 187313 189320 191442 192440 191967 190888 190295
55047 190295 190760 192389 194760 196852 197990 198956 201221 204848 208004 208842 207264 204674 202613 201784 201879 202136
55031 202136 202264 202673 203581 204518 205197 206222 208141 210429 212310 213821 215018 215007 213275 211297 211051 212287
55015 212287 213062 212757 212592 213145 213462 213019 212580 212459 211794 210387 209540 210050 210808 210475 209292 208241 207598 207312
54997 207312 207625 208240 207944 206202 204191 203190 202851 202142 201033 200017 198853 197179 195758 195695 196773 197867
54981 197867 198771 200344 202877 205384 206702 206586 205695 205128 205830 207744 209608 210156 209492 208820 209005 209850 210551
54964 210551 210344 208936 206847 205214 204811 205370 206133 206733 207108 206984 206118 204949 204452 205239 207000 208755 209687
54947 209687 209968 210733 212696 214905 215689 214915 214179 214343 214127 212081 208933 206711 206238 206805 207806 209217
54931 209217 210599 211140 210931 211048 211990 213040 213464 213426 213284 212978 212700 213365 215570 218568 221042 222563 223587
54914 223587 224207 223813 222108 219871 218359 218314 219736 222211 225010 227082 227563 226481 224738 223336 222940 224106
54898 224106 227218 231666 235549 237021 235974 233851 231829 229826 227443 225133 223832 223749 224014 223532 221836
54883 221836 219253 216594 214803 214589 216026 218420 220780 222703 224653 227023 229023 229225 227477 225552 225291
54868 225291 226668 228372 229705 230920 232121 233141 234559 237570 242437 248001 253172 258139 263757 270496
54854 270496 278325 286733 294431 299913 303021 305292 308140 311296 313489 313839 311830 306865 299140 290552
54840 290552 283485 278648 274979 271589 268718 266608 264570 261827 258649 255898 253718 251411 248714 246665
54826 246665 246771 249409 253381 257040 259583 261175 262303 263382 264726 266428 268354 270573 273588 277690
54812 277690 282260 286248 289220 291495 293482 295455 297648 299839 301089 300697 299180 297369 294878 290775
54798 290775 285570 280927 277226 273119 268012 263175 259509 256017 251837 248226 246691 246341 245060 242620
54784 242620 240555 239281 237511 234711 232173 230956 230287 228899 226883 225211 224137 222969 221188 219192
54770 219192 217946 218085 219156 219730 218611 216044 213445 211951 211531 211463 211222 210886 210982 211962 213638 215283 216512
54753 216512 217731 219349 221038 222397 223817 225685 227012 226124 223012 219923 219024 220181 221676 222519 223292
54738 223292 224946 227505 230133 232110 233417 234325 234599 233466 230594 226793 223321 220635 218324 216309 215422
54723 215422 216386 218554 220208 220320 219737 220354 223096 227026 230673 233837 237476 241888 245908 248279 249147
54708 249147 249741 251193 254287 259675 267313 275936 284028 291283 298268 304784 309613 312175 313489 314973
54694 314973 316896 318497 319073 318366 316229 312627 307960 302922 297883 292705 287216 281683 276658 272477 269089
54679 269089 266323 264044 261913 259346 256151 253107 251420 251504 252730 254385 256306 258403 260194 261273 261758
54664 261758 261887 261680 261478 262310 264967 269013 273346 277629 282544 288678 295660 302359 307609 310912 312730
54649 312730 313905 314534 313870 311564 308366 305048 301418 297171 292900 289054 284580 278260 271224 266415 265161
54634 265161 265703 265611 264243 262019 258646 253446 246853 240342 235090 231559 230017 230466 232068 233553 234323
54619 234323 234632 234717 234484 234134 234229 234648 234168 231892 228825 227163 227849 229509 230100 228969 226829 224374 221887
54602 221887 219963 219482 220598 222586 224926 227716 230697 232894 233858 234317 234759 234283 231981 228819 226745
54587 226745 226203 225914 225078 224427 224800 225840 226641 226913 227107 228019 230410 234187 237711 238868 237336 235102
54571 235102 234274 234977 235785 235393 233326 229713 225260 221122 218108 216096 214626 213794 214038 215279 216813 218044
54555 218044 218917 219698 220651 221991 223926 226558 229666 232581 234472 234954 234279 232770 230378 227193 224111
54540 224111 222349 222353 223661 225628 227645 228951 229181 229130 229949 231364 231706 230131 227771 226135 225284 224462 223790
54523 223790 224240 226167 228722 230683 231370 230863 229781 228811 228245 228120 228767 230558 232870 234160 233744 232858
54507 232858 233135 234569 235890 236527 237049 237768 238123 237754 237221 237134 237277 237209 237240 238129 239961 241855 242863 242793
54489 242793 242009 240716 238757 236167 233708 232650 233919 237376 241783 245486 247459 248055 248611 250005 251721
54474 251721 252642 252599 252503 253008 253733 254043 253833 253083 251308 248246 244774 242322 241347 240968 240237 239295 239031 239904
54456 239904 241381 242521 242895 242796 242560 241956 240541 238564 237137 237360 239400 242433 245205 246636 246314 244685
54440 244685 242675 241040 240121 240022 240583 241270 241604 241777 242437 243853 245791 248163 250990 253532 254287 252529
54424 252529 249410 247031 246648 247963 249610 249960 248099 244616 241200 239108 238422 238936 240925 244400 248319
54409 248319 251457 253682 255645 257657 259738 262328 265893 269899 273131 275088 276145 276343 275070 272330
54395 272330 269499 268134 268410 269156 269226 268532 267802 267565 267508 266938 265787 264709 264018 263167 261785 260588 260461
54378 260461 261118 261661 262165 263412 265076 265603 264428 263142 263580 265514 267128 267271 266372 265534 265581 266902 269382
54361 269382 272223 274307 275009 274585 273845 273626 274323 275546 276305 275914 274776 273932 273829 273825 273114 271844 271070 271625
54343 271625 273345 275484 277611 279781 281935 283656 284737 285595 286734 288028 288958 289328 289325 289073 288698 288709 289545
54326 289545 290691 291034 290380 289871 290534 292100 293791 295520 297557 299531 300669 300700 299727 297652 294897 293374
54310 293374 295215 300076 305095 308267 310674 314266 318548 321150 321286 320833 321599 323120 324035 324443 325631
54295 325631 327912 329986 330403 328761 325440 321116 316927 314246 313445 313060 310893 306135 300171 295182 292299
54280 292299 291142 290787 290654 290538 290325 290002 289680 289353 288913 288668 289412 291394 293467 294090 293053 291375 289575
54263 289575 287284 284907 284165 285861 288131 288381 286455 284468 283909 284409 285297 286537 287582 286974 284224 281076
54247 281076 279697 280135 280606 279981 278973 278813 279519 279826 278718 276791 275826 276717 278158 278022 275938 273588
54231 273588 272464 272468 273111 274775 277724 280743 282029 281211 279505 278100 277157 276305 275316 274240 273385 273133 273527
54214 273527 274355 275831 278570 282371 285757 287470 287795 287610 286899 285373 283913 283832 284898 285665 285786 286440
54198 286440 288140 289704 290170 290400 291734 293953 295639 295925 294958 293098 290695 288577 287874 289198 292271
54183 292271 296245 300069 302853 304439 305530 306854 308217 308711 307835 306107 304549 303763 303614 303706 303981 304625
54167 304625 305356 305258 303764 301556 299877 298996 297991 296095 293584 291181 289285 288086 287723 287810 287353 285768
54151 285768 283616 281808 280427 278932 277275 276102 275861 276241 276625 276736 276708 276736 276757 276459 275675 274798 274530 275149
54133 275149 276335 277771 279440 281141 282267 282589 282763 283446 284258 284360 283874 283954 285462 288242 291710 295334
54117 295334 298360 299813 299358 297715 295880 294323 293231 292980 293720 294697 294613 292733 289427 285840 283353 283029
54101 283029 284876 287609 289641 290496 290852 291257 291346 290548 288912 286868 284642 282442 280859 280391 280719 281054
54085 281054 281119 281233 281486 281588 281755 283002 286010 290037 293420 294989 294737 293459 292165 291641 292057 292972 293916
54068 293916 294938 296277 297695 298550 298579 298301 298444 299127 299790 299975 300024 300693 302015 303013 303004 302781 303661 305451
54050 305451 306474 305911 305002 305244 306473 307770 309376 312205 315839 318665 320108 321339 323338 325565 327160
54035 327160 328364 329929 331940 334132 336799 340474 345043 349944 355000 360241 364972 367741 367505 364532
54021 364532 360097 355522 351432 347681 343962 340491 337901 336476 336027 336657 338878 342289 344806 344460 341953
54006 341953 340343 341656 344566 346066 344960 342909 342276 343760 346369 348917 350987 352813 354997 358368
53992 358368 363398 369407 374791 378525 381257 384514 388980 393937 398187 401059 402700 404049 406571 411216
53978 411216 417252 422642 425996 427881 429913 433026 437064 441616 446466 451304 455687 459493 462986 466187
53964 466187 468447 468959 467606 465139 462655 461050 460930 462585 465644 468768 470190 469039 466040 462554 458974
53949 458974 454489 448467 441587 435262 430230 426004 421590 416514 411268 406836 403675 401023 397573 393077
53935 393077 389002 387110 387451 388177 387343 384541 380700 376782 373070 369474 366028 362889 360208 358269 357570
53920 357570 358312 359816 360859 360906 360788 361843 364467 367719 370179 370905 369789 367572 365605 365172 366717 369839
53904 369839 374033 379188 385359 392409 400007 407695 414839 420843 425685 430121 435145 441309 448672 457273
53890 457273 467426 479338 492259 504043 511963 514446 512075 506780 500284 493582 487470 482823 480301
53877 480301 480177 482338 485941 489408 491670 493431 496222 500036 503030 503998 504065 505090 507347 509845 512284
53862 512284 515415 519710 524922 531045 538574 547484 556718 565129 572416 578892 584912 590853 597127 603715
53848 603715 609855 614504 617019 617414 616340 614988 614488 614940 615169 613847 610788 606981 603478 600594 598068
53833 598068 595526 592513 588294 582021 573360 562987 552375 542896 534871 527415 519318 510276 501301 493842
53819 493842 488493 484636 481296 478063 475039 472124 468739 464344 459021 453417 448179 443449 438849 433937
53805 433937 428636 423183 417798 412730 408575 406012 404821 403576 400888 396777 392337 388314 384765 382018
53791 382018 380894 381435 382161 381466 379566 378290 378852 380366 380900 379658 377621 376131 375501 375444 376258 378540
53775 378540 381676 383725 383412 381480 379448 377814 376322 375139 374482 373654 371953 370299 370312 371775 372693 372226
53759 372226 371843 372920 374871 376694 378839 382123 385991 389427 392768 396956 401512 404937 407052 409458
53745 409458 413545 419218 425712 432482 438908 444058 447416 449539 451844 455859 462288 470226 477585 483017
53731 483017 487178 491366 495289 497216 496280 493641 491274 490464 491563 494151 497022 498731 498632 497001 494104
53716 494104 489819 484314 478380 472775 467731 463217 459073 454726 449489 443389 437197 431486 426337 422114
53702 422114 419623 418982 419013 418337 416611 414245 411508 408605 406124 404505 403104 400537 396198 391084 387008
53687 387008 385165 385468 386940 388595 390010 391242 392405 393546 394863 396658 398856 400745 401552 401335 401149
53672 401149 402183 404724 408057 411349 414380 417314 420123 422706 425301 428124 430642 432077 432860 434658
53658 434658 438389 442996 446858 449697 452163 454248 455358 455769 456823 459567 464000 469567 475521 480877
53644 480877 485071 488757 492997 497615 501406 504158 507243 511780 517311 522903 528418 533786 537972 539952
53630 539952 540391 541207 543375 545967 547557 547987 548434 549966 552247 553711 553000 550167 546399 542790 539645
53615 539645 536777 533981 531220 528808 527360 527083 527219 526789 525898 525602 526387 527521 528123 528123 527817 527253 526593
53598 526593 526513 527544 529230 530454 530492 529598 528751 528977 530583 532937 535177 537085 538938 540787 542577 544731
53582 544731 547668 550772 552960 554596 557609 563101 569856 575984 581142 586160 591235 595683 599240 602627
53568 602627 606782 612115 618432 625155 631719 638076 644541 650953 656606 661410 666499 673038 680810 688529
53554 688529 695174 700520 704885 708990 713694 719276 725240 731123 736840 741915 745362 747243 749433 753642
53540 753642 759205 763964 766867 768435 769130 768814 767764 766688 765409 762890 759078 755579 753862 753656 753699
53525 753699 753324 752744 752415 752668 753369 753487 751616 747485 742414 737688 733090 727805 722226 717862 715523 714621
53509 714621 714395 714935 716456 718285 719362 719504 719437 719641 719996 720689 722540 725772 729154 731222 731934 732237 732518
53492 732518 732795 734150 738190 744622 751074 756261 761863 769966 779949 789616 798437 807621 817363 826217
53478 826217 833548 840757 849429 859676 871036 883789 898552 915503 934743 956454 979947 1003369
53466 1003369 1025357 1046402 1067866 1090297 1113585 1138107 1164481 1192467 1221271 1250995 1282796
53455 1282796 1317348 1353904 1391227 1428888 1467369 1507313 1548867 1591363 1633446 1674028 1713489
53444 1713489 1753542 1795418 1838394 1880585 1920907 1959583 1996763 2031721 2064061 2094934 2125938
53433 2125938 2156947 2186166 2212770 2238513 2266005 2295990 2327072 2357672 2387222 2415541 2442193
53422 2442193 2466964 2490311 2512732 2533954 2553137 2569684 2583441 2594215 2601606 2605486 2606353 2604770
53410 2604770 2600434 2592212 2579447 2562923 2544123 2523744 2501693 2478429 2455176 2432186 2407760 2380133
53398 2380133 2349955 2319808 2291385 2264153 2236973 2209908 2183661 2157854 2130833 2101435 2070650
53387 2070650 2041184 2015244 1992705 1971675 1950883 1931193 1914647 1902510 1894568 1889822 1887204 1885889
53375 1885889 1885688 1887108 1890588 1895834 1902334 1910221 1920012 1931808 1945582 1961970 1981779 2004758 2029920
53362 2029920 2057228 2087870 2122424 2159712 2198077 2237078 2277358 2319507 2363847 2410916 2461327
53351 2461327 2515056 2571298 2629143 2688346 2749529 2813578 2880671 2950052 3021148 3094580 3171425
53340 3171425 3251644 3334139 3418329 3504599 3592854 3681670 3769596 3856591 3943499 4030604 4117269
53329 4117269 4202486 4285233 4364787 4441178 4514821 4585222 4650704 4710042 4763647 4812288 4855293
53318 4855293 4891178 4919613 4941388 4956428 4963148 4960294 4948514 4929561 4904527 4873259 4834900 4788431
53306 4788431 4733264 4670099 4601028 4528146 4451962 4371699 4287140 4199557 4110617 4021111 3931475
53295 3931475 3843058 3757807 3676570 3598636 3523241 3450553 3380543 3311854 3243022 3174446 3108022
53284 3108022 3044948 2985014 2927868 2873615 2821820 2771245 2721365 2673332 2628804 2588435 2552008
53273 2552008 2519258 2489790 2462800 2437624 2414211 2392497 2371812 2351539 2331858 2313251 2295691
53262 2295691 2279009 2263627 2250144 2238392 2227534 2217030 2207115 2198541 2192057 2187745 2184642 2181664
53250 2181664 2179362 2179911 2184680 2192572 2201680 2211881 2224588 2240459 2258815 2279216 2302282 2328600
53238 2328600 2357745 2388676 2420390 2452151 2484024 2517459 2554421 2595204 2637420 2677545 2713481
53227 2713481 2745673 2776116 2806144 2834830 2859570 2878492 2891960 2901338 2906878 2907639 2903103 2893777
53215 2893777 2880252 2862695 2841430 2817110 2790027 2759940 2726719 2690517 2651297 2609091 2564903
53204 2564903 2520457 2476591 2432504 2386864 2339069 2289338 2238347 2187128 2136581 2086699 2036822
53193 2036822 1986828 1937384 1888888 1841093 1794193 1749264 1706901 1666108 1625394 1584545 1544719
53182 1544719 1507158 1472377 1440211 1409986 1380774 1351987 1323668 1296166 1269862 1245329 1223159
53171 1223159 1203295 1185027 1167887 1151995 1137257 1122905 1108205 1092927 1076711 1058805 1039050
53160 1039050 1018430 997897 977329 956363 935526 915555 896202 876871 858122 841439 827479
53149 827479 815377 803685 791201 777173 761671 745858 730958 716838 702293 686779 671120
53138 671120 656403 642857 629986 617227 604373 591833 580524 571030 562983 555720 549280 544029
53126 544029 539567 535011 530278 526026 522219 517834 512380 506743 502045 498505 495927 494496 494354 494917 495267
53111 495267 494884 493639 491553 489031 486838 485376 484300 483190 482056 480793 478720 475312 471021 466914
53097 466914 463766 461936 461571 462301 463066 462924 461905 460689 459709 458944 458246 457399 456176 454703 453344 451879
53081 451879 449584 446727 445125 446065 448241 449132 448208 447335 447933 449213 449760 449603 449796 450788 452134 453403
53065 453403 454581 455743 456893 457967 458684 458600 457685 456651 456399 457308 459177 461519 463622 464716 464565 463785
53049 463785 463287 463443 463952 464323 464277 463789 462923 461661 459994 458290 457272 457088 456561 454099 449506 444267 439831
53032 439831 436424 433889 432728 433381 435014 436076 435979 435481 435425 435784 436058 436003 435818 435894 436464 437214 437395 436640
53014 436640 435546 435016 435100 435065 434577 434260 434839 436032 436639 435727 433650 431834 431369 431851 431880 430701 428831 426984
52996 426984 425129 423061 421086 419429 417639 415639 414864 417050 421906 427180 431159 433970 436204 437530
52982 437530 437408 436268 435058 434063 432854 431108 428937 426630 424534 423020 422246 421910 421329 419746 417011
52967 417011 414338 413887 416596 420609 423061 423515 424409 427683 432287 435703 436787 436192 435028 434262 434648 436080
52951 436080 437479 438275 439371 441642 444254 445707 445958 446010 445879 444692 442714 441538 441957 443106 444115 445169
52935 445169 446443 447345 447563 447724 448210 448369 447712 446945 446831 446923 446542 446376 447879 451282 455242 458381 460353
52918 460353 461400 461628 461001 459768 458813 459503 462648 467325 471425 473906 475877 478744 481960 483740 483621
52903 483621 483053 483338 484133 484340 483652 482724 482334 482782 483758 484586 484855 484712 484209 482704 479787 476616 475036
52886 475036 475027 474283 471169 467061 464614 464431 464774 464229 463153 462312 461456 459863 457400 454356 450968 447846
52870 447846 446219 446824 448750 450234 450558 450413 450405 450122 449032 447519 446337 445497 444470 443363 443120 444313
52854 444313 446278 447732 447855 446465 443602 439630 435709 433412 433440 434970 436598 437698 438486 439025 438853 437766
52838 437766 436466 435988 436764 438542 440898 443306 444893 444969 443979 443320 443751 444414 444021 442748 442232 443575 445940
52821 445940 447469 447241 445985 445106 445460 447059 449438 452010 454291 456187 458089 460475 463332 466107 468186
52806 468186 469233 469073 467732 465792 464356 464216 465235 466928 469283 472383 475357 476656 475745 473791 472209
52791 472209 471056 469435 467018 464355 461890 459482 457005 454790 453146 451791 449923 446736 441998 436480
52777 436480 431740 428889 427391 425507 422219 418388 415730 414921 415071 414949 414387 414350 415689 418005 419927 420538
52761 420538 420269 420195 420747 421498 421924 421720 420511 418040 414946 412699 412350 413742 416215 419393 422794 425320
52745 425320 426071 425425 424474 423481 421807 419469 417694 417320 417383 416233 413834 412080 412582 414687 416104 415295
52729 415295 412971 411273 411675 413766 415912 416852 416506 415448 414069 412454 410743 409180 407905 407066 407006 407848
52713 407848 408851 408772 407228 405335 404621 405572 407499 409372 410317 409722 407690 405323 403846 403367 403053 402487
52697 402487 402077 402076 402071 401799 401613 401695 401678 401692 402876 405832 409241 411347 412501 414897 419601 425054 428975 430805
52679 430805 431740 433114 435470 438699 442354 445865 448949 451765 454502 456921 458497 458910 458368 457646 457748
52664 457748 459092 460877 461640 460659 458545 456318 454280 452049 449397 446701 444588 443223 441930 439744 436699
52649 436699 434236 433704 434588 435081 434529 434184 435046 436092 435755 434490 434502 437064 441189 445128 448136 450389
52633 450389 452051 453042 453251 452427 450251 447052 444186 443067 443758 444839 444722 442868 439878 436860 434751
52618 434751 433814 433463 432847 431826 431110 431206 431544 431183 430186 429721 430728 433002 435647 437801 438685 437710 435242
52601 435242 432855 432180 433598 436387 439822 443589 447497 451420 455407 459377 462981 466188 469472 472681
52587 472681 474400 473585 471413 470051 469688 468483 465840 463992 465271 469005 472408 473749 473503 472876 472446
52572 472446 472181 471848 471270 470711 470990 472913 476740 482309 489106 495856 500686 502442 501605 499539 497218 494942
52556 494942 492546 489428 485125 480438 477201 476125 475780 474603 472981 472110 471691 470506 468903 468860 471303
52541 471303 474809 477297 477860 476703 474525 472449 471442 471206 470433 468547 466428 465156 464913 465466 466682
52526 466682 468042 468473 467407 465414 463302 461241 459271 457981 458031 459436 461823 464862 467975 470261 471329
52511 471329 471821 472471 473024 472629 471071 469104 467764 467728 469064 471188 473119 473913 472835 469427 464182 459158
52495 459158 456886 458055 460862 463045 463875 463763 462907 461307 459528 458377 457911 457459 456470 454835 452688 450527
52479 450527 449256 449506 451135 453805 457506 461866 465584 467538 468114 468401 468444 467550 466244 466410 468979 472602
52463 472602 475266 476415 476840 477217 477583 477830 477944 477867 477673 477818 478818 480804 483581 486957 490782 494908
52447 494908 499316 503988 508476 512050 514626 517030 519678 521443 520727 517576 513719 510324 506709 501826
52433 501826 496147 491155 487518 484837 482945 482138 481874 480509 477169 473197 470842 470956 472649 474810 477036
52418 477036 479311 481797 485000 489235 493694 496799 497818 497507 496923 496222 494904 492685 489851 487309 486483
52403 486483 488434 492670 497440 501578 505397 509435 513212 515910 517492 518251 517914 516095 513123 509497 505071
52388 505071 499865 495154 492387 491180 489701 487064 484007 481114 477892 474195 471190 469937 469893 469762 469243
52373 469243 469142 470214 472601 475903 479142 481029 481121 480493 480628 481798 483100 483819 484094 484383 484997 486233
52357 486233 488361 491291 494606 498051 501727 505793 510252 515035 520045 525268 531091 538337 547454 557684
52343 557684 567501 575994 583361 589812 594414 595492 592278 586008 579240 573918 570018 566153 561538 557046
52329 557046 554097 552871 552203 551084 549630 548438 547646 547001 546316 545413 544032 542442 541922 543859 548211 553405
52313 553405 558075 562520 568144 575738 584737 594000 602868 611341 619583 627547 634946 641337 646167 649013
52299 649013 650083 650485 651633 654110 657143 659502 660901 662190 664166 666638 668966 671222 674327 679128
52285 679128 685752 693858 703129 713343 724199 735167 745427 754202 761553 768817 777827 789538 803762
52272 803762 820110 838566 858918 880434 902564 925509 949597 974654 1000552 1027868 1057153
52261 1057153 1087904 1119123 1150733 1183480 1217426 1251542 1284957 1317571 1349085 1378484 1405316
52250 1405316 1430843 1456927 1483980 1510616 1535176 1557014 1576518 1594519 1611648 1627750 1641893
52239 1641893 1653369 1662696 1671216 1679664 1687479 1693497 1696991 1698049 1697375 1695795 1693539 1689836 1683524 1674362
52225 1674362 1663597 1653078 1643915 1636125 1629416 1624024 1620727 1620162 1622326 1626816 1633369 1641960 1652500
52212 1652500 1664806 1678840 1694470 1710930 1727223 1743500 1761303 1781633 1803254 1823945 1843115
52201 1843115 1861895 1880662 1898014 1912907 1926422 1940143 1953661 1965143 1973987 1981324 1987815 1992499
52189 1992499 1994483 1994643 1994631 1994756 1993641 1989615 1981746 1969873 1954514 1936806 1918012 1898945 1880047
52176 1880047 1861638 1843556 1824881 1804922 1784483 1765337 1748261 1732467 1717233 1703119 1690837
52165 1690837 1679831 1669122 1659113 1651286 1646013 1641877 1637560 1633491 1631028 1630665 1631780 1633697 1636232
52152 1636232 1639378 1643134 1647681 1653202 1659430 1665725 1671671 1677314 1682838 1688263 1693529 1698595 1703454 1708159
52138 1708159 1712738 1716971 1720581 1723970 1728398 1734731 1742051 1748158 1751582 1752688 1752847 1753233 1754477 1756667
52124 1756667 1759191 1761169 1762466 1763701 1764828 1764416 1761091 1755311 1748884 1742951 1737133 1730485 1722581 1713809
52110 1713809 1705201 1697845 1691874 1686326 1680753 1676496 1675207 1676355 1677758 1678769 1681312 1686939 1694271 1700628
52096 1700628 1705248 1709457 1714310 1719562 1724839 1730352 1736099 1741290 1745074 1747410 1749229 1752144 1757659 1765823
52082 1765823 1774755 1782462 1789161 1796858 1806574 1817087 1826842 1835988 1845829 1857114 1869809 1883981 1899981
52069 1899981 1917976 1938160 1961264 1988123 2018649 2051828 2086826 2123649 2162635 2203664 2246053
52058 2246053 2288968 2331805 2374243 2415976 2456489 2495333 2532651 2568943 2603983 2636211 2663597
52047 2663597 2684975 2700360 2710336 2715627 2717026 2715192 2710491 2703369 2694709 2685295 2674982 2662938 2648800
52034 2648800 2633184 2617042 2601000 2585478 2570877 2557156 2543439 2528491 2511630 2493147 2473991
52023 2473991 2455208 2437555 2421366 2406701 2393749 2383186 2376134 2373541 2375345 2380238 2386545 2393559
52011 2393559 2401940 2412811 2426728 2443575 2462896 2483839 2505010 2525033 2543376 2560426 2576719
52000 2576719 2592250 2606302 2617668 2625407 2629855 2632698 2635387 2637413 2636651 2631513 2622421 2611206 2599533
51987 2599533 2587845 2575228 2560092 2541393 2519284 2494368 2466687 2436188 2403923 2371602 2339812
51976 2339812 2307790 2275358 2243858 2214439 2186598 2159463 2133660 2110611 2090662 2073294 2058648
51965 2058648 2047149 2037593 2027380 2015215 2002297 1990104 1978168 1964985 1950302 1935444 1921730
51954 1921730 1909371 1897687 1885755 1872920 1859110 1844477 1828533 1810172 1789015 1766224 1743259
51943 1743259 1720254 1696252 1670721 1643958 1616182 1587138 1556692 1525103 1492590 1459459 1426926
51932 1426926 1397025 1371182 1349151 1329593 1311291 1293634 1276492 1260150 1245117 1231612 1219295
51921 1219295 1207567 1195904 1183790 1170680 1156281 1140678 1124194 1107336 1090734 1074506 1057769
51910 1057769 1039672 1021204 1004998 992767 983736 976352 970710 968142 968946 971801 975434 979731 985069
51897 985069 991508 998874 1006844 1014630 1021243 1026285 1029886 1031783 1031236 1028093 1023195 1017486 1011436 1005682
51883 1005682 1001392 999449 999865 1002505 1007780 1016123 1027340 1041035 1057136 1075440 1095148 1115539 1136642
51870 1136642 1158473 1179955 1199392 1215916 1229835 1241635 1251052 1257013 1258110 1253356 1242791 1227037
51858 1227037 1206099 1179436 1147860 1114515 1082866 1054098 1027450 1002500 979643 958466 937372
51847 937372 915546 894369 876320 863026 854580 849881 847251 845471 844701 845935 849427 854366 860162
51834 860162 866939 874199 880060 882724 882156 879476 875143 868573 859387 848369 837262 827914 821309 817016
51820 817016 813820 811114 809271 808507 808273 808378 809960 814293 821049 828632 835956 842922 849358 854658 858687
51805 858687 862087 865250 867631 868433 867451 864964 861299 856810 851848 846406 840223 833546 827465 823195 821340
51790 821340 822041 825279 830373 835540 838792 839405 838034 835281 830784 824137 816221 808863 803144 798488 793546
51775 793546 787518 780433 772732 765171 758827 754398 751349 748327 744726 741384 739458 738948 738740 737849 736173
51760 736173 734088 731734 728895 725469 721895 718933 716915 715406 713978 713201 714233 717153 720299 721863
51746 721863 721841 721925 723591 726787 730349 733092 734439 734501 733926 733464 733492 733924 734469 734713 733920 731084 725577 717955
51728 717955 710095 704250 701494 700953 700806 700209 699958 701085 703233 704940 705331 704991 705155 706498 708858 711728
51712 711728 714606 717064 718889 720512 723151 728111 735612 744551 753830 763761 775546 789272 803087
51699 803087 814705 823235 829268 833736 837237 839967 841489 840698 836631 829415 820184 810327 801007 792943
51685 792943 786019 779408 772588 765955 759976 754381 749183 745984 746892 752093 759690 768274 778560 791943
51671 791943 808292 825686 841576 853818 861534 865863 869357 873945 879780 886358 893692 901300 906716
51658 906716 906680 900187 889539 878138 867908 859040 851277 844623 839024 833965 828449 821325 811955 800963
51644 800963 790252 781857 776685 774511 774952 777901 782757 787800 791035 791662 790223 787419 783526 779190
51630 779190 775942 775057 776226 777999 779306 779914 779703 778469 776507 774560 772988 771643 770669 770687 771971 774200
51614 774200 777273 781507 786688 791892 796858 802702 810513 819983 830355 842126 856711 874695 895254
51601 895254 916787 936989 952545 960340 959526 951721 939070 923006 905035 887501 872747 861957
51589 861957 855155 851644 849977 848264 845331 841261 836289 829696 820629 809753 799084 789962 781763 772898
51575 772898 762735 752335 743596 737839 734959 733635 732363 730471 728343 726868 726739 728067 730265 732162
51561 732162 732426 730194 725556 719526 713459 708342 704518 702042 701033 701410 702413 702867 702102 700351 698092
51546 698092 695404 692248 689050 686492 684960 684637 686023 689636 695119 701245 707198 713447 721058 730485
51532 730485 741337 752868 764043 773311 779150 781194 780516 778642 776582 774889 774099 774591 776231 778580
51518 778580 781413 784785 788849 794132 801957 813901 830419 850314 871840 894019 916610 939318
51506 939318 961902 985004 1009882 1036693 1063496 1087643 1108206 1126704 1145724 1167306 1192550
51495 1192550 1221933 1255451 1292608 1332333 1372617 1410287 1442020 1466179 1483247 1493941 1497427
51484 1497427 1492250 1478635 1458608 1433732 1403957 1369291 1331512 1293207 1255659 1218734 1182512
51473 1182512 1147921 1115681 1085672 1057794 1032770 1011529 994068 979352 966187 953943 942596
51462 942596 932365 923307 915019 906616 896989 885280 871482 856728 842662 830165 818839 808050
51450 808050 798169 790194 784225 778948 772852 765579 757975 751153 745541 740440 734606 727815 721745 718428
51436 718428 717630 716833 714396 711747 711452 713821 716775 718744 720125 721611 722551 721983 720356 718984 718091 716520
51420 716520 713468 709498 705446 701179 696194 690931 686507 683179 679928 675894 671531 667896 665287 663120
51406 663120 660781 658052 655076 652525 651526 652591 654711 656224 656451 655720 654019 650899 647019 644485 644786
51391 644786 647219 650092 652800 655891 659786 664543 670477 677925 686522 695632 705466 716992 730761 746400
51377 746400 762924 778657 791175 798644 801525 802099 802183 802204 802438 803625 805733 807214 806462 803366 798720
51362 798720 792954 786361 779929 774775 770928 767558 764237 761185 758526 756293 755103 755754 757880 759899
51348 759899 760796 761315 762863 765748 769031 771727 773464 774048 773125 770755 768128 767293 769808 775485 782533
51333 782533 789100 794770 800612 808008 817714 829911 844642 861759 880522 899679 918373 937247
51321 937247 958616 985209 1018457 1057910 1102212 1150296 1201559 1255525 1312061 1371522 1433486
51310 1433486 1494818 1549790 1593161 1623311 1642233 1652751 1656140 1651948 1639053 1616564 1584374 1543573
51298 1543573 1496323 1445026 1391510 1336994 1282499 1228985 1177147 1127393 1080094 1035730 994772
51287 994772 957534 924119 894361 867825 844091 823159 805364 790629 777870 765514 752851
51276 752851 740680 730326 722113 715152 708571 702382 696919 692123 687994 685277 684669 685304 685058 682828
51262 682828 679788 677791 677105 676455 674869 672586 670231 667945 665527 662868 660022 657287 655284 654522 654742
51247 654742 655034 654659 653400 651194 648047 644438 641163 638512 636154 634072 633008 633570 635417 637796 640423
51232 640423 643273 645871 647461 647740 647025 645788 644351 642726 640508 637433 634534 634249 638530 646955 657272
51217 657272 667563 677204 685970 693314 698757 702339 704460 705809 707411 709909 712545 713683 712841 711677
51203 711677 712397 715603 720112 724465 727928 730264 731244 730643 728428 724786 720075 714838 709779 705522 702019
51188 702019 698074 691929 682955 672715 663811 657681 653930 651638 650397 649866 649294 648175 646793 645493
51174 645493 643962 641897 639922 638917 638765 638682 638725 639859 642269 644625 645715 646143 647454 649808 651501 651113
51158 651113 649438 648627 649659 651458 652654 653349 654405 655527 655264 653149 650835 650477 652615 656290 660612
51143 660612 665227 669569 672782 674655 675821 676825 677683 678635 680513 683788 687711 690994 693030 693913 693717
51128 693717 692485 690854 689901 690152 691253 692729 694558 696673 698401 698880 697893 695922 693541 691168 689288
51113 689288 688340 688194 688162 687900 688069 689609 692370 694884 695886 695872 696706 699507 703276 706094 707581 709453
51097 709453 713321 718490 722682 724617 724970 724704 723561 720808 716675 712082 707375 702381 697621 694345 692954
51082 692954 692192 690454 687558 684777 683443 683822 685030 685684 684923 683241 682267 683382 686593 690778 694717
51067 694717 697641 699225 699765 700263 701693 703982 706102 707366 708250 709655 711738 713920 715918 718236 721527
51052 721527 725807 730587 735473 740240 744435 747415 749049 750109 751708 754427 757999 761648 764557 766217
51038 766217 766604 766019 764844 763718 763778 765969 769842 773764 776889 780193 784753 789679 793069 794654 795950
51023 795950 797572 798048 796220 793633 793244 796241 801168 805965 809940 813712 817943 822486 826620 830059 833508
51008 833508 837944 843530 850021 858159 869520 884460 901294 918393 936255 956589 980133 1006434
50996 1006434 1034856 1064166 1091625 1114483 1132814 1149486 1166973 1185509 1204680 1225028 1246679
50985 1246679 1267460 1284031 1294794 1300657 1302935 1301474 1295206 1283937 1269107 1252966 1237273 1222794
50973 1222794 1209670 1197683 1185971 1172970 1157389 1139295 1119824 1099914 1079896 1060402 1042888
50962 1042888 1028781 1018379 1010850 1005089 1000397 996644 994157 993447 995004 999281 1006462 1015922 1026314
50949 1026314 1036912 1048640 1062948 1079666 1096800 1112590 1126936 1140735 1154866 1170213 1187462
50938 1187462 1206008 1223949 1240102 1255361 1271007 1286226 1298566 1306771 1312144 1317000 1322645 1328996
50926 1328996 1335363 1341245 1346912 1353595 1362887 1375880 1393029 1414526 1440167 1468854 1498882 1528911
50914 1528911 1558386 1587147 1615410 1644352 1676051 1712356 1754098 1801630 1855595 1916580 1984159
50903 1984159 2056832 2133050 2212070 2293827 2378410 2465905 2556480 2650017 2745371 2840204 2931905
50892 2931905 3018573 3098913 3171628 3235736 3291539 3340333 3382506 3416518 3440481 3454455 3460576
50881 3460576 3461335 3458482 3453242 3446266 3436964 3423758 3405598 3382974 3357233 3329443 3300187 3269763
50869 3269763 3237925 3203707 3166100 3124894 3080523 3033186 2982339 2926952 2866171 2800120 2730393
50858 2730393 2659345 2588352 2516989 2444519 2371983 2302011 2236429 2174884 2116296 2060907 2010045
50847 2010045 1964227 1922522 1883927 1848362 1815863 1785576 1756438 1728518 1702882 1680174 1660082
50836 1660082 1642192 1626526 1612967 1600867 1589796 1580131 1572421 1566584 1562307 1559841 1559729 1561866 1565469
50823 1565469 1569846 1574712 1579852 1585174 1591186 1598933 1609222 1622122 1637193 1653875 1671808 1691199
50811 1691199 1712801 1737085 1763584 1791636 1821614 1854572 1890681 1929066 1969669 2014355 2065302
50800 2065302 2122706 2184912 2250681 2320677 2396547 2478942 2566848 2659157 2756979 2863904 2983240
50789 2983240 3115146 3257328 3408475 3569660 3741838 3923421 4111668 4305606 4505906
50780 4505906 4712203 4922032 5132351 5340418 5542667 5734098 5909764 6066153 6200653
50771 6200653 6310808 6395118 6453952 6488680 6500319 6489959 6460171 6414984 6358523 6294413 6226241
50760 6226241 6157561 6091265 6029640 5974784 5927636 5886157 5845590 5801389 5751300 5694104 5627372
50749 5627372 5547762 5453231 5343813 5220367 5083734 4935308 4777282 4611746 4440331 4265407
50739 4265407 4090824 3920572 3756877 3600399 3452122 3314173 3188564 3075639 2974095
50730 2974095 2882265 2799271 2725258 2660784 2605889 2559658 2520728 2488065 2460986 2438456 2418861
50719 2418861 2400755 2383632 2367670 2352764 2338041 2322438 2305710 2288759 2272770 2257960 2243265
50708 2243265 2227382 2209981 2191727 2173281 2154612 2135197 2114584 2092771 2070401 2048671 2028751
50697 2028751 2011006 1994901 1979745 1965482 1952872 1943106 1937165 1935248 1936847 1941653 1950292 1963753
50685 1963753 1982207 2004959 2031630 2062718 2098764 2139733 2185669 2237370 2295651 2360232 2429981
50674 2429981 2504035 2582158 2664295 2750619 2841950 2939203 3041951 3148026 3254923 3361433
50664 3361433 3467618 3573454 3677827 3778867 3874962 3965214 4048837 4124332 4189533 4242391
50654 4242391 4281279 4304538 4310536 4298873 4271363 4231414 4182698 4128700 4072912 4018351 3966825
50643 3966825 3919227 3876450 3839343 3807924 3781485 3759401 3740811 3723394 3703610 3678725 3647739
50632 3647739 3609897 3563445 3506844 3440517 3366407 3286333 3201787 3114876 3028243 2944105 2864223
50621 2864223 2790514 2724417 2665612 2612702 2565763 2527286 2499913 2483786 2476673 2476105 2480789 2490488
50609 2490488 2505445 2526008 2552187 2583296 2617967 2654393 2690658 2725417 2758634 2791326 2824316
50598 2824316 2857602 2891260 2926339 2963990 3003995 3045053 3086705 3130310 3177705 3229323 3284002
50587 3284002 3340506 3399040 3461466 3530032 3605598 3686849 3771410 3857841 3946456 4038212 4133121
50576 4133121 4229812 4326147 4419920 4509205 4592668 4669726 4740242 4803925 4860063 4907908 4947454
50565 4947454 4979913 5007035 5029080 5042895 5042474 5022327 4981002 4921853 4851231 4776411 4704250 4639869
50553 4639869 4585520 4541051 4505908 4480267 4463933 4454963 4450322 4447613 4445234 4440893 4430981 4411756
50541 4411756 4380486 4335237 4274545 4198369 4109067 4010422 3905398 3795275 3681003 3564724
50531 3564724 3449409 3337326 3229400 3126013 3027851 2935710 2849848 2769987 2695877 2627516
50521 2627516 2564802 2507386 2454999 2407602 2365091 2327211 2294057 2266216 2243958 2226608 2213415
50510 2213415 2204899 2202445 2206226 2214244 2223987 2234773 2248095 2265861 2288668 2315462 2344557 2375134
50498 2375134 2408099 2445294 2487613 2534073 2582999 2633726 2686574 2741536 2797773 2854483 2911599
50487 2911599 2969406 3028030 3087699 3149159 3213400 3281009 3351965 3426070 3503697 3586394 3676807
50476 3676807 3777590 3890075 4013926 4147997 4291343 4443684 4605551 4778284 4963378
50467 4963378 5161192 5370130 5587241 5809693 6035834 6265063 6496627 6728199 6955519
50458 6955519 7173708 7379033 7569111 7741399 7892100 8016917 8112478 8176653 8207930 8205292
50448 8205292 8168781 8099726 8000307 7873350 7722945 7555139 7377577 7197976 7022535 6855602
50438 6855602 6700850 6562608 6445629 6353441 6287037 6245150 6225433 6225203 6241459 6270396 6306614
50427 6306614 6342574 6369280 6378099 6362110 6316126 6236692 6123217 5978939 5809874 5622502 5422523
50416 5422523 5215064 5004695 4794854 4588003 4386706 4193919 4011863 3841362 3682824
50407 3682824 3537313 3405800 3287562 3180049 3080487 2987295 2900125 2819226 2745135 2678585
50397 2678585 2620209 2570073 2527486 2491223 2459983 2432875 2409744 2391193 2378238 2371529 2370602 2373943
50385 2373943 2380056 2388559 2400053 2414997 2433050 2453567 2476245 2500797 2526096 2550072 2570671 2586998
50373 2586998 2599743 2610705 2621885 2634680 2649661 2666900 2686373 2708042 2731670 2756784 2782945
50362 2782945 2810148 2839002 2870545 2905970 2946542 2993469 3047434 3108153 3174875 3247525 3326986
50351 3326986 3413907 3507759 3607590 3713214 3824734 3940969 4059230 4176691 4291222 4400865
50341 4400865 4503722 4598829 4686109 4764639 4831662 4884095 4920296 4939425 4939766 4919053 4876467
50330 4876467 4813394 4732334 4636114 4528207 4412715 4293644 4174819 4060501 3954919 3860721
50320 3860721 3778691 3709406 3654184 3613714 3586720 3571045 3565482 3569405 3580812 3595842 3610228 3620332
50308 3620332 3622651 3613486 3589848 3550329 3494829 3424098 3340213 3247015 3149058 3049711 2950422 2851816
50296 2851816 2755062 2661971 2573980 2491346 2413483 2340082 2271919 2210466 2156685 2110347 2070691
50285 2070691 2037475 2010739 1989284 1969905 1948877 1924372 1897192 1869282 1842143 1816701 1793769
50274 1793769 1773733 1756033 1739799 1725143 1713161 1704424 1698026 1692648 1688246 1686121 1687266 1691017 1695517
50261 1695517 1699353 1702584 1706240 1711017 1716524 1721663 1725460 1727527 1728037 1727571 1726856 1726393 1726334 1726830 1728307 1731128
50245 1731128 1735224 1740326 1746361 1753224 1760541 1768298 1777548 1789663 1804825 1821889 1839864 1858858 1879687
50232 1879687 1903489 1931651 1964709 2000905 2037311 2073330 2111796 2155686 2205366 2260425 2321726
50221 2321726 2387805 2449515 2492354 2506435 2492936 2460163 2415735 2364130 2309110 2254789 2204113
50210 2204113 2158312 2118047 2083670 2054425 2029012 2007199 1989657 1976042 1964504 1953554 1943468
50199 1943468 1935623 1931469 1932359 1939152 1951299 1967093 1985329 2005956 2028803 2052665 2076346 2099773
50187 2099773 2123239 2146228 2167845 2188001 2207420 2226734 2246180 2265641 2284058 2298971 2307619
50176 2307619 2308784 2303162 2291935 2275411 2253140 2225062 2192511 2158069 2124100 2091262 2058862 2026893
50164 2026893 1996903 1970152 1945424 1919554 1889980 1856123 1818693 1778651 1736884 1693986 1650191
50153 1650191 1606198 1564103 1526727 1495685 1470565 1449907 1432232 1416099 1400227 1384277 1369079
50142 1369079 1355682 1344533 1335639 1328753 1322964 1316791 1309356 1301122 1293074 1285567 1278385 1271399 1264575
50129 1264575 1257739 1250967 1244868 1239764 1234755 1228373 1220216 1211358 1203048 1195594 1188691 1182258 1176429 1171019
50115 1171019 1165592 1160255 1155977 1153689 1153124 1153071 1152974 1153755 1156538 1161044 1166052 1171197 1177195 1184253 1191597
50100 1191597 1199204 1208733 1221601 1236880 1252392 1267381 1282729 1298816 1314839 1330726 1348296 1369474
50088 1369474 1394093 1420328 1446850 1473671 1501165 1529291 1558023 1587898 1619633 1653472 1689259
50077 1689259 1727088 1767598 1811519 1859114 1910064 1963631 2018762 2074213 2128919 2182237 2233787
50066 2233787 2283284 2330803 2376740 2420727 2460629 2493468 2517561 2533024 2539965 2537169 2523223 2498094
50054 2498094 2462903 2418953 2368018 2312911 2256411 2199797 2143552 2089249 2039304 1994685 1954147
50043 1954147 1916152 1880519 1847695 1817525 1789520 1763650 1740195 1719224 1700611 1683986 1668277
50032 1668277 1652061 1634975 1618298 1603668 1591802 1582800 1576718 1572920 1569706 1565936 1562829 1562892 1566849
50019 1566849 1572533 1577018 1579100 1579356 1578567 1576855 1574093 1570393 1565846 1560076 1552540 1543547 1534638 1527465
50005 1527465 1522243 1517669 1512313 1505530 1497113 1487129 1476689 1468016 1462653 1459823 1457363 1454184 1451117 1449533
49991 1449533 1450022 1452556 1457066 1463306 1470536 1477900 1485192 1493158 1502982 1515299 1529613 1544795 1560178
49978 1560178 1575746 1591117 1605088 1616858 1627266 1638012 1649887 1662563 1675803 1689752 1703949
49967 1703949 1717256 1729315 1741190 1754001 1767645 1781522 1795823 1811248 1827936 1845650 1864847
49956 1864847 1886523 1910898 1937076 1964223 1992205 2020474 2046998 2069121 2085511 2096812 2104618
49945 2104618 2110422 2115359 2119878 2123019 2122503 2116234 2103576 2084911 2060489 2030497 1996022 1958936 1920655
49932 1920655 1881733 1842770 1804815 1768544 1733978 1701559 1672460 1646880 1622807 1597731 1571252
49921 1571252 1544838 1519222 1493443 1466713 1439878 1414247 1389840 1365692 1341488 1318079 1296470
49910 1296470 1276903 1259018 1242507 1227390 1213756 1201412 1189952 1179140 1168994 1159449 1150252 1141448
49898 1141448 1133602 1127190 1122107 1118193 1115735 1114747 1114235 1113256 1112681 1114816 1121048 1130744 1142604 1156096
49884 1156096 1171112 1187152 1203455 1219243 1233322 1244304 1251979 1257832 1263474 1269064 1273902 1277691
49872 1277691 1280142 1279878 1275081 1265259 1251377 1234448 1215085 1194460 1174331 1155569 1137684 1120462
49860 1120462 1105189 1093433 1085222 1079371 1075163 1072700 1071777 1071642 1072155 1074132 1077900 1082292 1085983 1089265
49846 1089265 1093472 1098866 1104361 1109515 1115562 1123873 1134413 1146432 1159705 1174006 1188285 1201828
49834 1201828 1215667 1231087 1246786 1259333 1266875 1270870 1273574 1275432 1275887 1275204 1273904 1271296 1266160
49821 1266160 1258486 1249258 1238791 1226501 1212164 1196343 1179662 1162648 1146240 1131462 1118507 1106931
49809 1106931 1096646 1087931 1080554 1073832 1067604 1062310 1058088 1054704 1052452 1052228 1054527 1059127 1065766 1074242
49795 1074242 1083757 1093272 1102871 1113865 1127057 1141717 1156679 1171579 1186492 1201139 1215174 1228611
49783 1228611 1241286 1252291 1260604 1266011 1268975 1269873 1268816 1265915 1261302 1255124 1247735 1239566 1230663 1220781
49769 1220781 1210149 1199560 1189480 1179672 1170069 1161436 1154702 1150095 1147240 1145552 1144283 1143003 1142662
49756 1142662 1145378 1152354 1162505 1173855 1185691 1198469 1212214 1226113 1239483 1252025 1263150 1272120
49744 1272120 1279166 1285709 1293035 1300957 1307916 1312235 1313497 1313060 1313021 1314263 1315650 1315263 1311838 1304592 1292629
49729 1292629 1275700 1255267 1233712 1212518 1192078 1173023 1156520 1143109 1132208 1122995 1114952 1107473
49717 1107473 1099959 1092603 1086223 1081107 1076924 1073958 1073236 1074867 1077348 1079439 1082017 1087167 1095843 1107107
49703 1107107 1119170 1130456 1140137 1148531 1156815 1165543 1173476 1178621 1180639 1181718 1184739 1190612 1197467
49690 1197467 1202305 1203341 1200574 1194368 1184411 1170887 1156032 1143160 1133921 1127599 1123191 1120731 1119978
49677 1119978 1119429 1117972 1116493 1116416 1117315 1117462 1116368 1115342 1115731 1118025 1122605 1129798 1138793 1147782 1155726
49662 1155726 1163117 1170659 1178312 1186227 1195608 1207702 1222346 1238165 1253959 1269513 1285303 1301545
49650 1301545 1317274 1330307 1338627 1341828 1340804 1336346 1329057 1320480 1312789 1306770 1301361 1295958 1291909
49637 1291909 1290644 1291273 1291435 1289921 1287065 1282885 1276430 1267251 1256494 1246183 1238039 1232972 1230887 1230823
49623 1230823 1231916 1234285 1238499 1244449 1251587 1260112 1270872 1284049 1299089 1316224 1336937 1362263
49611 1362263 1391271 1421555 1450281 1474419 1491231 1499869 1502175 1501092 1498527 1495162 1491579 1488559 1486794
49598 1486794 1487383 1492322 1503033 1517930 1532237 1540629 1539779 1528721 1508172 1480451 1449337 1418728
49586 1418728 1390881 1365966 1343152 1321775 1301608 1282655 1265271 1250516 1239805 1233621 1230629 1228677
49574 1228677 1226850 1225879 1226192 1226341 1224246 1219681 1214533 1210585 1207768 1204527 1199086 1190442 1179174 1167554
49560 1167554 1157842 1149974 1141802 1132167 1122826 1116549 1114010 1113473 1112958 1111741 1110121 1108868 1108818 1110076 1111541
49545 1111541 1111947 1111342 1110894 1111442 1113028 1115623 1119101 1122473 1124350 1124670 1124931 1126334 1128661 1131464 1135087
49530 1135087 1139603 1143823 1146751 1149364 1153451 1158823 1163107 1164614 1164285 1164398 1166127 1168857 1171221 1172292
49516 1172292 1172168 1171909 1172743 1175108 1178597 1182892 1188329 1195354 1203739 1212619 1221093 1228787 1236144 1244273 1254108
49501 1254108 1265444 1277029 1287763 1297434 1306083 1313088 1317370 1318493 1317223 1314903 1312356 1309451 1305781
49488 1305781 1301703 1298369 1296496 1295597 1294997 1295228 1297422 1301349 1305281 1308260 1311434 1316362 1322913 1329782 1336384
49473 1336384 1342985 1349434 1355144 1360427 1366730 1375320 1386558 1400496 1417183 1436162 1456714 1478917
49461 1478917 1503403 1529436 1554229 1575068 1591550 1605076 1616812 1627025 1635817 1643378 1649595 1654341
49449 1654341 1658246 1662655 1668901 1678103 1691196 1708118 1726857 1744019 1756519 1762289 1759865 1748550
49437 1748550 1729377 1704969 1677850 1649346 1620275 1591834 1565269 1541311 1520401 1502813 1488023
49426 1488023 1474656 1461867 1450301 1440997 1433908 1428413 1424752 1423593 1424284 1424918 1424532 1424187 1425239 1427421
49412 1427421 1429379 1430480 1431273 1432536 1434691 1438016 1442639 1448136 1453592 1458258 1461975 1465022 1467911 1471278
49398 1471278 1475570 1480580 1485470 1489428 1492347 1494901 1497931 1501536 1504621 1505675 1504284 1501632 1499094 1496630
49384 1496630 1493269 1489097 1485796 1484726 1485178 1485355 1484799 1485162 1488584 1495882 1506266 1518151 1530117 1541755
49370 1541755 1554069 1568681 1586279 1606247 1628041 1652299 1679835 1710154 1742051 1775612 1812580
49359 1812580 1854808 1903769 1961592 2029758 2103966 2171033 2214288 2224301 2204427 2166221 2120981
49348 2120981 2075727 2034225 1998441 1968781 1944921 1927294 1917005 1914155 1917127 1923676 1931833 1939768
49336 1939768 1946181 1951494 1957657 1965971 1975799 1985923 1996088 2006247 2015256 2021785 2026082 2029371 2031556
49323 2031556 2030943 2026535 2019338 2010827 2001194 1989907 1977333 1964919 1953958 1944660 1936248 1927817 1919455
49310 1919455 1912677 1909070 1908301 1908307 1908065 1909139 1913424 1920041 1925966 1929592 1932158 1935230 1938084 1938447 1935077
49295 1935077 1928753 1921196 1913790 1907048 1900497 1893072 1884213 1874756 1866470 1860733 1857863 1857445 1858671 1860278
49281 1860278 1860810 1859530 1856963 1854206 1851674 1848851 1845417 1842324 1841172 1842275 1843829 1843612 1841422 1839115
49267 1839115 1838100 1837552 1835663 1832083 1828418 1826583 1827442 1830945 1836812 1844931 1855647 1869817 1887944 1909024
49253 1909024 1930788 1951415 1970461 1987726 2001785 2010370 2012029 2006955 1996312 1981366 1963291 1943229
49241 1943229 1922059 1900190 1877859 1855691 1834881 1816572 1800930 1787054 1774161 1762764 1754147
49230 1754147 1748751 1745684 1744068 1744049 1745885 1748664 1750752 1751251 1750318 1748415 1746139 1744510 1744213 1744326 1742834
49215 1742834 1738854 1733590 1728661 1724429 1720669 1718025 1717618 1719364 1721663 1722961 1723032 1722625 1722367 1722235 1721894 1721358
49199 1721358 1721331 1722758 1726020 1730841 1737163 1745617 1756902 1771343 1789655 1813481 1843916 1879561 1917124
49186 1917124 1954135 1989927 2023504 2051671 2070576 2078734 2077580 2069257 2054945 2035555 2013022 1990006
49174 1990006 1968413 1948687 1930444 1913524 1898423 1886120 1877555 1872959 1871383 1871108 1871046 1871804 1874910
49161 1874910 1880761 1887861 1894479 1900532 1907041 1914098 1920511 1925710 1930960 1938134 1948102 1960977 1977012
49148 1977012 1996035 2016301 2035236 2051641 2066557 2081934 2099219 2119213 2142140 2167228 2192914
49137 2192914 2218155 2243179 2268554 2294083 2319241 2344191 2369519 2395055 2419755 2442822 2464418
49126 2464418 2485175 2505507 2525615 2545845 2566781 2589087 2613182 2638854 2665305 2691894 2718860
49115 2718860 2747159 2777752 2811400 2848907 2891023 2938186 2990877 3050118 3116687 3189346 3264139
49104 3264139 3335491 3397557 3444940 3473883 3484271 3480241 3467866 3452117 3436266 3423193 3415575 3414368
49092 3414368 3418179 3424839 3433176 3442972 3453968 3465677 3477899 3490721 3504070 3517770 3532144 3548125
49080 3548125 3566505 3587208 3609456 3632610 3656785 3682638 3710607 3740447 3771559 3803704 3837238
49069 3837238 3872631 3909867 3948373 3987437 4026705 4066420 4107251 4149751 4193907 4239326 4285866
49058 4285866 4333862 4383636 4435100 4488287 4544217 4604765 4671492 4744959 4825669 4915401 5017019
49047 5017019 5132916 5264450 5413524 5584307 5782133 6009162 6259337 6516516 6759456
49038 6759456 6973937 7164375 7351747 7553017 7757309 7923511 8006450 7989482 7894014 7759496
49028 7759496 7614637 7463814 7294485 7094212 6862981 6613912 6365002 6130131 5915911
49019 5915911 5723890 5553408 5402916 5270957 5156729 5058774 4973406 4896418 4826801 4766712
49009 4766712 4716850 4673875 4633822 4596201 4562739 4533520 4506712 4481285 4457667 4436036 4416171
48998 4416171 4398927 4385637 4375740 4366926 4358088 4350367 4344759 4340538 4336898 4334432 4333804 4334317 4335191 4337225
48984 4337225 4341733 4348515 4356280 4364656 4374445 4385944 4398166 4409831 4420124 4428130 4432439 4432205 4428569
48971 4428569 4424440 4422391 4422668 4423580 4423895 4424308 4426055 4428746 4430683 4431175 4431353 4432471 4434536 4437101 4440335
48956 4440335 4444556 4449507 4454992 4461687 4470558 4481805 4495011 4509784 4525615 4541582 4556973 4571841
48944 4571841 4586327 4599903 4612087 4623447 4634971 4646644 4657577 4667359 4676270 4684108 4689786 4692381
48932 4692381 4691916 4688866 4683620 4676786 4669439 4662467 4655695 4647935 4637996 4625839 4612984 4601642 4593178
48919 4593178 4587379 4583275 4580269 4578217 4576936 4576336 4576787 4578645 4581559 4584941 4588914 4593971 4599755 4605227
48905 4605227 4610341 4616471 4624470 4633055 4640077 4645037 4649488 4655060 4661998 4669945 4679360 4691397 4706533
48892 4706533 4724085 4743372 4764987 4790382 4820329 4854347 4891762 4932795 4978164 5027910 5081137
48881 5081137 5136917 5195060 5255899 5319524 5385394 5452790 5521677 5592953 5667524 5745241 5825266
48870 5825266 5907464 5992596 6080771 6170625 6260826 6351804 6444929 6540322 6636554 6732461 6828153
48859 6828153 6924026 7019679 7114172 7206691 7296808 7384812 7471881 7558824 7644244 7725071 7799746
48848 7799746 7870048 7938786 8006420 8071146 8131797 8189091 8243877 8295555 8342948 8385856 8424991
48837 8424991 8460950 8493920 8523980 8550934 8574011 8592356 8605694 8613917 8616185 8611328 8599303 8581424
48825 8581424 8558770 8531094 8498000 8460514 8420414 8378137 8332402 8282166 8227997 8171026 8111295
48814 8111295 8047887 7980341 7909104 7834679 7757015 7675952 7591776 7505009 7415897 7324553 7231784
48803 7231784 7139586 7050476 6966118 6886707 6811686 6740726 6673774 6610772 6552056 6498720 6451599
48792 6451599 6409875 6371733 6336673 6306127 6281268 6261308 6244781 6231574 6222594 6218102 6217710 6221698
48780 6221698 6230937 6245323 6263307 6283275 6304700 6327927 6353569 6382258 6414167 6448602 6484553
48769 6484553 6521649 6559881 6598477 6635974 6671674 6706288 6740929 6776207 6812373 6849377 6886333
48758 6886333 6921815 6955358 6988067 7021135 7054255 7086106 7116005 7144522 7172884 7202419 7234189
48747 7234189 7268278 7303387 7337689 7370340 7401927 7433526 7465681 7498267 7530964 7563539 7595864
48736 7595864 7627958 7660194 7693242 7727468 7762282 7796351 7828611 7858740 7886436 7910841 7931271
48725 7931271 7948147 7962318 7973501 7980173 7981149 7976502 7966642 7951154 7929013 7899589 7862908 7818925
48713 7818925 7766864 7705548 7634836 7556868 7475229 7392152 7306870 7217475 7124041 7028925 6934219
48702 6934219 6840237 6746677 6653913 6562537 6472842 6385606 6302461 6224326 6150040 6077639 6006890
48691 6006890 5939749 5878257 5822578 5771196 5722757 5677644 5637757 5604624 5577833 5555680 5537108
48680 5537108 5522318 5511490 5503864 5498307 5493919 5489739 5484889 5479720 5475973 5475061 5476749 5479984 5484065 5488235
48666 5488235 5491170 5492146 5492115 5492372 5492579 5491372 5488657 5485903 5484108 5482741 5480896 5478364 5475090 5470655 5465045
48651 5465045 5459332 5454863 5451930 5449629 5446846 5443237 5439475 5436663 5435244 5434316 5432391 5429067 5425668 5423863
48637 5423863 5423731 5423607 5422082 5419894 5419335 5421714 5426002 5430472 5435144 5441695 5451085 5462318 5473783 5484749
48623 5484749 5495090 5504560 5513170 5521553 5530018 5537667 5543237 5546402 5547602 5547185 5545663 5544224 5543674 5542917
48609 5542917 5539641 5532715 5523001 5511683 5498776 5483718 5466456 5447091 5424587 5396513 5360387 5315509
48597 5315509 5263580 5207374 5148622 5087251 5022600 4954792 4884625 4812980 4741152 4671271 4605248
48586 4605248 4543329 4484506 4428355 4375628 4326986 4282082 4240250 4201343 4165370 4131712 4099229
48575 4099229 4067011 4034836 4002995 3971738 3940784 3909520 3877959 3847379 3819490 3794843 3772340
48564 3772340 3750439 3728565 3707251 3687148 3668112 3649264 3629856 3609780 3589143 3567864 3546539
48553 3546539 3527451 3513436 3505092 3500012 3495451 3491020 3488011 3487050 3487677 3489620 3492996 3497270 3501271 3504378
48539 3504378 3506681 3507908 3507343 3505149 3502819 3501795 3502323 3504013 3506766 3510462 3514165 3516262 3515491 3511605 3504945
48524 3504945 3495359 3481661 3462554 3438260 3410733 3381969 3352685 3323147 3294502 3268322 3245178
48513 3245178 3224591 3206072 3189272 3173491 3158222 3144146 3132468 3123274 3115632 3109348 3105314 3103663
48501 3103663 3102780 3100820 3097451 3093451 3089249 3084438 3078167 3069322 3056689 3039741 3019435 2997987 2977551
48488 2977551 2958827 2940779 2922045 2902851 2885107 2870237 2857501 2845087 2832127 2818667 2804174
48477 2804174 2787556 2768708 2748807 2728860 2709002 2689434 2670994 2654408 2639872 2627759 2618913
48466 2618913 2613730 2611587 2611658 2613826 2618531 2626063 2635985 2646650 2655179 2658535 2654877 2643835 2626121 2603702
48452 2603702 2579881 2557806 2538585 2521503 2505971 2492462 2481826 2474782 2471960 2473387 2478078 2485275
48440 2485275 2495860 2511269 2531302 2554456 2579930 2606947 2631795 2647998 2651005 2641563 2623733 2601086
48428 2601086 2575790 2549775 2524944 2502537 2483026 2466128 2450545 2434695 2418151 2401426 2384171
48417 2384171 2365167 2344694 2325104 2307932 2291966 2275442 2258726 2243325 2229463 2216395 2204222
48406 2204222 2193598 2184104 2174519 2164501 2154793 2146088 2138857 2133903 2131812 2131908 2132803 2133902 2135640 2138443
48392 2138443 2142214 2146546 2150775 2154111 2156325 2157895 2158899 2158349 2155205 2149419 2141429 2131528 2120642 2110834
48378 2110834 2103795 2099240 2095694 2092148 2087935 2081779 2072568 2060870 2048455 2036311 2024196 2011968 2000172
48365 2000172 1989123 1978340 1967284 1956129 1945535 1935856 1926648 1916920 1906206 1895359 1885642 1876901
48353 1876901 1867574 1856949 1846380 1837457 1829848 1821914 1812926 1803626 1795014 1787497 1781103 1775707 1770979
48340 1770979 1766491 1761791 1756418 1750387 1744699 1740548 1737767 1734922 1731250 1727470 1724192 1720607 1715500 1708840
48326 1708840 1701764 1695666 1691708 1690338 1690748 1691485 1691885 1692200 1692471 1692598 1693492 1696472 1701178 1705828 1710009 1715290
48310 1715290 1722342 1729544 1735566 1741390 1748455 1756530 1764892 1774141 1785363 1798726 1814082 1831719 1851442
48297 1851442 1872311 1894215 1918320 1945202 1974189 2005229 2039387 2076817 2116528 2158896 2205619
48286 2205619 2255996 2306090 2353005 2397191 2439395 2479119 2518125 2561477 2612113 2667643 2725510
48275 2725510 2787866 2857913 2934734 3015810 3102074 3196621 3300722 3414694 3540340 3678966
48265 3678966 3829344 3990811 4165736 4356008 4560617 4780015 5019000 5282196 5571833
48256 5571833 5894146 6262130 6686876 7172213 7723262 8352807 9072400 9885847 10800416
48247 10800416 11835545 13010640 14336028 15830049 17533018 19487818 21722841 24272203
48239 24272203 27166152 30307832 33324893 35616124 36649115 36265713 34717841 32444487
48231 32444487 29836035 27152762 24551937 22119974 19891124 17874716 16076825 14496531
48223 14496531 13116700 11912697 10864686 9953971 9156282 8449310 7822142 7269773 6783425
48214 6783425 6353267 5975232 5646997 5360458 5104978 4875538 4671810 4491586 4330405
48205 4330405 4185498 4055114 3935706 3824189 3721354 3629159 3546270 3469776 3399490 3336947
48195 3336947 3281700 3231943 3187273 3147666 3111143 3075467 3041010 3009310 2980264 2953408 2930336
48184 2930336 2912841 2899614 2887265 2873401 2856257 2832905 2801149 2762830 2722628 2683626 2645815
48173 2645815 2608290 2570811 2533631 2497617 2464246 2433950 2404894 2374659 2342704 2310191 2278285
48162 2278285 2247719 2218926 2191172 2162503 2131865 2100427 2069690 2039397 2008658 1978015 1948804
48151 1948804 1921181 1894114 1866645 1838097 1807901 1776372 1744877 1714273 1683978 1653390 1623049
48140 1623049 1593539 1564479 1535676 1508025 1482182 1457589 1433926 1412134 1392732 1374471 1356079
48129 1356079 1338170 1322106 1308214 1296427 1287214 1280188 1273068 1263911 1253514 1244004 1235904 1228303 1220989
48116 1220989 1214657 1209555 1205427 1202236 1199646 1196579 1192516 1188411 1185018 1181380 1176501 1171452 1168075 1166462
48102 1166462 1165472 1164887 1165202 1165954 1166199 1166236 1167072 1168516 1169492 1169963 1170888 1172523 1174211 1175640 1176925 1177830 1178293
48085 1178293 1179289 1181727 1184933 1187569 1189548 1191626 1193832 1196006 1199202 1204567 1211116 1216574 1220238 1223282
48071 1223282 1226560 1230019 1234073 1239355 1245102 1249859 1254023 1259725 1267869 1277268 1286958 1297221 1307750
48058 1307750 1317106 1325089 1333754 1344805 1357533 1370520 1383864 1398341 1413672 1429275 1445807 1464382
48046 1464382 1484731 1505537 1526323 1547771 1570183 1592594 1613598 1632571 1650212 1668376 1689146
48035 1689146 1713409 1740195 1767648 1794531 1820612 1845949 1870275 1893078 1914011 1933092 1950560
48024 1950560 1966532 1981072 1994817 2009242 2025611 2043534 2061079 2076590 2090088 2102644 2114750
48013 2114750 2125678 2134422 2140994 2146594 2152571 2159376 2166674 2174148 2181674 2188794 2194795 2199592 2203909 2208269
47999 2208269 2212436 2216306 2220528 2225446 2229866 2231758 2229955 2224518 2215782 2203922 2189346 2172665 2154126
47986 2154126 2133520 2110713 2085884 2059373 2031665 2003388 1974956 1946428 1917831 1889232 1860242
47975 1860242 1830106 1798778 1767265 1736338 1705607 1674691 1644593 1616832 1591620 1567933 1545086
47964 1545086 1523200 1502318 1482150 1462658 1443936 1425491 1406591 1387391 1368921 1351889 1336277
47953 1336277 1322084 1309652 1298962 1289345 1280105 1271001 1262057 1253438 1245647 1239417 1235169 1232614 1230762
47940 1230762 1228367 1224795 1220610 1216758 1213134 1208928 1204581 1201978 1201712 1201490 1198698 1193641 1188611 1184478
47926 1184478 1180111 1174955 1170213 1167071 1165165 1163268 1160494 1156632 1152351 1149089 1147641 1146769 1144329 1139836
47912 1139836 1134776 1130370 1126456 1122838 1120291 1119518 1120247 1122018 1124833 1128238 1130636 1130529 1128189 1125519 1124441
47897 1124441 1125656 1128535 1131779 1134425 1136552 1139148 1143424 1150190 1159350 1169733 1180035 1190443 1202585
47884 1202585 1217243 1232929 1247723 1261694 1276248 1291699 1306876 1320720 1332857 1342973 1351211
47873 1351211 1358974 1367772 1377294 1386054 1393614 1400530 1406293 1409355 1409424 1407812 1405179 1400758 1394226 1386442
47859 1386442 1377707 1367260 1355341 1343938 1334437 1326054 1317544 1308882 1300180 1290604 1279854 1269447 1261145
47846 1261145 1254999 1250044 1245871 1242399 1239293 1236950 1237052 1240638 1246269 1251337 1254673 1256922 1259228 1262770
47832 1262770 1268813 1277814 1288789 1300483 1312702 1325685 1339003 1352220 1365813 1380110 1393850 1405186
47820 1405186 1413802 1420802 1426880 1431894 1436133 1440602 1445657 1450172 1452416 1451432 1447590 1442134 1435954 1428630
47806 1428630 1419056 1407112 1393896 1379979 1364534 1346970 1328497 1311060 1295399 1281050 1267494
47795 1267494 1254267 1240671 1226585 1213150 1201535 1191449 1181787 1172225 1163165 1154727 1147061 1141188
47783 1141188 1138105 1137227 1137044 1137209 1138695 1141860 1145747 1149595 1153865 1159196 1165148 1170565 1174720 1177766 1180404
47768 1180404 1183317 1186681 1190117 1193303 1196565 1200701 1206284 1213100 1220018 1225559 1229326 1232840 1238054 1244926
47754 1244926 1251620 1257374 1263705 1272052 1281798 1291983 1303676 1318951 1338260 1360390 1384431 1410202
47742 1410202 1437263 1465146 1494418 1526105 1560173 1595609 1631445 1666296 1697637 1723452 1744465
47731 1744465 1762940 1779318 1791767 1798989 1801588 1800498 1796128 1789529 1782392 1774917 1765294 1752194 1736392
47718 1736392 1719114 1700429 1680563 1661405 1644998 1631219 1618360 1605654 1594045 1584621 1577215 1570491
47706 1570491 1562868 1553557 1543106 1532670 1522471 1511574 1499577 1487775 1477882 1470065 1463047 1455820
47694 1455820 1448495 1441654 1435816 1431769 1430745 1433560 1439522 1446532 1452684 1457905 1463864 1472145 1482821 1494974
47680 1494974 1508064 1522219 1537598 1554239 1572392 1592212 1613142 1634288 1655309 1676196 1696301
47669 1696301 1714521 1730548 1745044 1758340 1769845 1778999 1785898 1790550 1792338 1790818 1786471 1780116 1771922
47656 1771922 1761473 1748471 1733108 1715992 1697818 1678778 1658406 1636554 1614373 1593473 1574060
47645 1574060 1554941 1535752 1518146 1504050 1493469 1484773 1476747 1469700 1464811 1462935 1463939 1466933 1471293
47632 1471293 1477544 1486853 1499469 1514083 1528910 1543080 1556985 1571817 1588816 1608258 1628879 1648839
47620 1648839 1667337 1684741 1701194 1716144 1729567 1742541 1755864 1768815 1779950 1788486 1794256 1796977
47608 1796977 1796460 1793100 1787349 1778955 1767466 1753166 1736791 1718598 1698624 1677826 1658027 1640220
47596 1640220 1623404 1605610 1586079 1566152 1547962 1532434 1518873 1506441 1495486 1486978 1480986 1476363
47584 1476363 1471809 1466747 1461375 1456593 1453815 1453964 1456454 1459719 1462736 1465413 1467761 1469806 1472416 1476982
47570 1476982 1483824 1491929 1500645 1510572 1522223 1534936 1547971 1561744 1577176 1594592 1614115 1636259
47558 1636259 1661118 1687632 1714697 1742325 1770555 1797740 1821322 1840241 1855493 1868168 1877730
47547 1877730 1882280 1879883 1869750 1852810 1831026 1805562 1775729 1740333 1699750 1656002 1611030 1565730
47535 1565730 1520616 1476500 1434281 1394584 1357723 1323642 1291963 1262444 1235295 1210659 1188101
47524 1188101 1167116 1147849 1130709 1115473 1101386 1087933 1074963 1062291 1049910 1038526 1029206
47513 1029206 1022419 1017706 1014013 1009971 1004483 997858 991978 988403 986568 984700 982155 979625 977242 973957
47499 973957 969274 964406 960995 959316 958214 956237 952512 947259 941878 937919 935464 933016 929386 925113
47485 925113 921536 919034 916825 914268 911589 909309 907476 905823 904504 904233 905289 906519 906069 903460 900277
47470 900277 898168 896876 895265 893563 892968 893184 892369 890186 889027 890866 894311 896468 896849 897476 899439
47455 899439 901419 901990 901636 901611 902103 902591 903100 903923 904601 904428 903835 904179 905999 908323 909945 910640 910842 910974
47437 910974 911609 913505 916575 919206 919642 918027 916224 915558 915627 915621 915848 917219 919861 923127 926633 930409
47421 930409 934096 936925 938793 940639 943232 946039 947966 949104 951032 955044 960392 964771 966592 966431
47407 966431 966155 966937 968498 970004 971239 972810 975498 979517 984293 989012 993417 997771 1001884 1004745 1005788
47392 1005788 1006084 1007398 1010208 1013621 1017200 1021723 1027897 1035490 1044210 1054360 1065924 1078091 1090516
47379 1090516 1104188 1120136 1138081 1157429 1178733 1202845 1229216 1256407 1284029 1312845 1343140
47368 1343140 1374227 1405420 1436145 1465066 1490476 1511838 1529836 1544717 1555759 1562542 1565428 1564362
47356 1564362 1558515 1547824 1533737 1517607 1499318 1478372 1455502 1432237 1409437 1387215 1365870
47345 1365870 1346085 1328370 1312857 1299289 1286737 1273892 1260451 1247778 1237417 1229245 1221938 1215052
47333 1215052 1209658 1206770 1205972 1206080 1206675 1208538 1212550 1218391 1224449 1229192 1232682 1236525 1242189 1249562 1257275
47318 1257275 1264103 1269712 1274264 1277795 1280145 1281300 1281480 1280743 1278588 1274254 1267569 1259147 1249530 1238585
47304 1238585 1226188 1212995 1199658 1185604 1169704 1152157 1134629 1118245 1102495 1086467 1070163
47293 1070163 1054092 1038519 1023706 1009934 996689 982914 968976 957248 949444 944127 938342 931211
47281 931211 924480 919784 916904 914743 912583 910013 906842 903622 901417 900738 901325 903065 906208 910555 915403
47266 915403 920554 926337 932331 937228 940551 943483 947212 951338 954654 956660 957396 956617 954384 952022 951147
47251 951147 951773 952423 952169 951612 951803 953187 955854 959808 964391 968205 970425 971928 974470 978795 984071
47236 984071 989204 994273 1000409 1008449 1018157 1028932 1040944 1054968 1071025 1087800 1103799 1118648
47224 1118648 1132768 1146372 1159607 1173248 1188020 1203141 1216824 1228632 1240257 1253335 1267669
47213 1267669 1282488 1298273 1315748 1333657 1349418 1362162 1373695 1386156 1400035 1414783 1429636
47202 1429636 1442715 1450547 1450122 1441250 1426054 1406758 1384930 1362213 1340130 1318985 1298233 1278220
47190 1278220 1260482 1245849 1233245 1221002 1208696 1196996 1186334 1176619 1168128 1161884 1158800 1158584
47178 1158584 1159639 1160273 1160273 1161190 1164597 1170164 1176069 1181364 1187071 1194602 1204030 1214688 1226658 1240441
47164 1240441 1255459 1270070 1283168 1294847 1305369 1314571 1322706 1330829 1339483 1347562 1353352 1356440 1357902
47151 1357902 1358798 1359261 1359026 1357950 1355660 1351329 1344404 1335399 1325646 1316446 1308613 1302431 1297626 1293630 1290298
47136 1290298 1288280 1288284 1290087 1292792 1296018 1300275 1306112 1313472 1322166 1332506 1345130 1360516 1378823 1399628
47122 1399628 1421512 1442689 1462811 1483731 1507532 1533993 1560886 1586718 1612098 1638086 1664164
47111 1664164 1688633 1710473 1730055 1748187 1765071 1780160 1792654 1802107 1808733 1813040 1814936 1813470
47099 1813470 1807934 1799240 1789751 1781442 1774312 1766827 1757878 1748070 1738907 1730877 1722775 1713159 1702258 1692132
47085 1692132 1684984 1681470 1680424 1679877 1678360 1675703 1672805 1670576 1669200 1668502 1668737 1670463 1673704 1677691 1681555
47070 1681555 1684922 1687792 1690170 1691842 1692205 1690423 1686198 1680212 1673202 1664692 1653449 1639242 1623227
47057 1623227 1606313 1588117 1568103 1546943 1525985 1506041 1487440 1470669 1456000 1442798 1430074
47046 1430074 1417558 1405467 1393451 1380668 1366805 1352230 1337220 1321987 1307533 1295482 1286640
47035 1286640 1280327 1275405 1271303 1267785 1264581 1261892 1260710 1261872 1265029 1269046 1273168 1277299 1281410 1285354
47021 1285354 1289239 1293450 1298319 1304234 1311953 1322021 1333585 1344418 1352648 1358232 1362476 1366598 1371236
47008 1371236 1376784 1383189 1389431 1394163 1397217 1399764 1402709 1405741 1408494 1411829 1417020 1424157 1432282 1440824
46994 1440824 1449872 1459175 1467967 1475960 1483606 1491135 1498192 1504775 1511779 1520219 1530404 1542103 1554828
46981 1554828 1567699 1579794 1590984 1601820 1612436 1622445 1632195 1643062 1655818 1669640 1683396
46970 1683396 1697054 1711095 1725478 1740031 1754879 1769429 1781871 1791013 1797823 1803795 1808588 1810976
46958 1810976 1811462 1811830 1812162 1810469 1805736 1799401 1793008 1786107 1777681 1768387 1760061 1753715 1749050 1745372 1742083
46943 1742083 1738738 1735428 1732823 1731318 1730655 1730837 1732701 1736813 1742367 1748030 1753546 1759710 1767142 1775883
46929 1775883 1785959 1797365 1809491 1821471 1833401 1846602 1862275 1880127 1898587 1916202 1932670
46918 1932670 1948699 1965181 1982664 2001451 2021746 2043289 2065042 2085755 2104922 2122830 2139713
46907 2139713 2155377 2169743 2183164 2195867 2207436 2217199 2224965 2231290 2237207 2243588 2250461 2257039 2262802
46894 2262802 2268215 2273742 2278652 2282031 2284860 2289522 2296834 2305131 2313035 2321552 2332034 2343527 2354017
46881 2354017 2363591 2374279 2386924 2400159 2412818 2425547 2439375 2454147 2469289 2484897 2500915
46870 2500915 2516075 2528891 2539299 2548276 2555977 2561260 2563026 2561173 2556031 2547719 2536514 2523174 2508191
46857 2508191 2491041 2470952 2448505 2425815 2404776 2385511 2366952 2348612 2331229 2315789 2302489
46846 2302489 2290872 2280663 2272448 2267735 2268110 2273806 2283215 2294517 2307843 2325073 2347327 2373592
46834 2373592 2402202 2432657 2465125 2498930 2532742 2566098 2599719 2634189 2668973 2702833 2734752
46823 2734752 2764428 2792215 2818513 2842976 2864658 2883201 2899344 2913824 2926510 2937411 2947735
46812 2947735 2958668 2969610 2979162 2987887 2998519 3012935 3030145 3047936 3065480 3083615 3103379 3125009
46800 3125009 3147836 3170595 3192349 3213550 3235544 3258548 3280926 3301036 3318980 3335583 3350275
46789 3350275 3361164 3367007 3368157 3365640 3360225 3352547 3343345 3333194 3322373 3311155 3299970 3289284
46777 3289284 3279558 3271180 3264087 3257612 3251192 3245218 3240855 3239151 3240625 3245406 3253162 3262969 3273864 3285602
$$ [...]
##END NTUPLES=NMR SPECTRUM
##END=
