
##TITLE=AC1221_Punto_6074838_avRdzygsig
##JCAMPDX= 6.0         $$ Bruker NMR JCAMP-DX V2.0
##DATA TYPE= NMR SPECTRUM
##DATA CLASS= NTUPLES
##ORIGIN= BRUKER
##OWNER= Administrator
$$ 1.72 TOPSPIN		Version 2.1
$$ 2012-05-07 20:46:50.968 -0500  Administrator@TOPSPIN
$$ Compression mode = diff/dup
##.OBSERVE FREQUENCY= 400.13188235
##.OBSERVE NUCLEUS= ^1H
##.ACQUISITION MODE= SIMULTANEOUS (DQD)
##.ACQUISITION SCHEME= undefined
##.AVERAGES= 64
##.DIGITISER RES= 22
##SPECTROMETER/DATA SYSTEM= spect
##.PULSE SEQUENCE= noesygpps1d.comp
##.SOLVENT NAME= COFFEE_meoh
##.SHIFT REFERENCE= INTERNAL, COFFEE_meoh, 1, 14.96675
##AUDIT TRAIL= $$ (NUMBER, WHEN, WHO, WHERE, PROCESS, VERSION, WHAT)
$$ ##TITLE= Audit trail, TOPSPIN		Version 2.1
$$ ##JCAMPDX= 5.01
$$ ##ORIGIN= Bruker BioSpin GmbH
$$ ##OWNER= Administrator
$$ $$ C:\Bruker\TOPSPIN/data/COFFEE/nmr/AC1221_Punto_6074838_avRdzygsig/12/pdata/1/auditp.txt
$$ ##AUDIT TRAIL=  $$ (NUMBER, WHEN, WHO, WHERE, PROCESS, VERSION, WHAT)
(   1,<2012-05-07 20:46:45.937 -0500>,<Administrator>,<TOPSPIN>,<go>,<TOPSPIN 2.1>,
      <created by zg
	started at 2012-05-07 20:35:15.625 -0500,
	POWCHK enabled, PULCHK disabled,
       configuration hash MD5:
       AF F2 23 6B 01 CD 40 DD E5 A1 38 A0 06 EA F7 77
       data hash MD5: 64K
       35 17 26 9C 12 BD A3 EB B7 A2 9D DD A2 55 31 8F>)
(   2,<2012-05-07 20:46:48.812 -0500>,<Administrator>,<TOPSPIN>,<proc1d>,<TOPSPIN 2.1>,
      <Start of raw data processing
       efp LB = 0.3 FT_mod = 6 PKNL = 1 PHC0 = 0 PHC1 = 0 SI = 128K 
       data hash MD5: 128K
       4B 79 7B 85 54 D7 D8 42 53 AE A1 AB B5 32 B8 F7>)
(   3,<2012-05-07 20:46:50.078 -0500>,<Administrator>,<TOPSPIN>,<proc1d>,<TOPSPIN 2.1>,
      <pk PHC0 = 32.49207 PHC1 = 0 
       data hash MD5: 128K
       0D 28 87 9B 5A 13 58 F1 EB 83 8D EE 9F 49 53 C4>)
(   4,<2012-05-07 20:46:50.625 -0500>,<Administrator>,<TOPSPIN>,<proc1d>,<TOPSPIN 2.1>,
      <abs ABSG = 1 
       data hash MD5: 128K
       C5 E9 2C 79 9E AC 10 B9 8F 55 D6 89 D7 38 0E 9E>)
(   5,<2012-05-07 20:46:50.703 -0500>,<Administrator>,<TOPSPIN>,<proc1d>,<TOPSPIN 2.1>,
      <abs ABSG = 2 
       data hash MD5: 128K
       DA E6 EF 61 B0 BE 9B 7F 2C 68 C1 BA 25 E7 81 7A>)
(   6,<2012-05-07 20:46:50.750 -0500>,<Administrator>,<TOPSPIN>,<proc1d>,<TOPSPIN 2.1>,
      <abs ABSG = 3 
       data hash MD5: 128K
       32 1B 17 B4 64 9E 17 1B 2E 0C B9 A5 FC 20 EC 50>)
(   7,<2012-05-07 20:46:50.843 -0500>,<Administrator>,<TOPSPIN>,<proc1d>,<TOPSPIN 2.1>,
      <abs ABSG = 4 
       data hash MD5: 128K
       5A 97 30 91 BF 7B 1D 63 36 55 EA 30 9A 9F 09 52>)
(   8,<2012-05-07 20:46:50.890 -0500>,<Administrator>,<TOPSPIN>,<proc1d>,<TOPSPIN 2.1>,
      <abs ABSG = 5 
       data hash MD5: 128K
       C9 1D 47 6A E6 82 5E 79 B1 5A 28 E8 C9 56 3F E9>)
$$ ##END=
$$ 
$$ $$ hash MD5
$$ $$ 62 6E 1A 92 5F 68 15 BB 06 0A 57 87 E4 68 6F FC
##$RELAX= 
##$RELAX= 
##$RELAX= 
##$RELAX= 
##$RELAX= 
##$RELAX= 
##$RELAX= 
##$RELAX= 
$$ Bruker specific parameters
$$ [...]
##$TP07= 0
##$TPNAME0= <>
##$TPNAME1= <>
##$TPNAME2= <>
##$TPNAME3= <>
##$TPNAME4= <>
##$TPNAME5= <>
##$TPNAME6= <>
##$TPNAME7= <>
##$TPOAL= (0..7)
0.5 0.5 0.5 0.5 0.5 0.5 0.5 0.5
##$TPOFFS= (0..7)
0 0 0 0 0 0 0 0
##$TUNHIN= 0
##$TUNHOUT= 0
##$TUNXOUT= 0
##$USERA1= <user>
##$USERA2= <user>
##$USERA3= <user>
##$USERA4= <user>
##$USERA5= <user>
##$V9= 5
##$VALIST= <valist>
##$VCLIST= <CCCCCCCCCCCCCCC>
##$VD= 0
##$VDLIST= <DDDDDDDDDDDDDDD>
##$VPLIST= <PPPPPPPPPPPPPPP>
##$VTLIST= <TTTTTTTTTTTTTTT>
##$WBST= 1024
##$WBSW= 4
##$XGAIN= (0..3)
0 0 0 0
##$XL= 0
##$YL= 0
##$YMAX_a= 11680175
##$YMIN_a= -6359626
##$ZGOPTNS= <>
##$ZL1= 120
##$ZL2= 120
##$ZL3= 120
##$ZL4= 120
##$ABSF1= 14.96675
##$ABSF2= -5.58578
##$ABSG= 5
##$ABSL= 3
##$ALPHA= 0
##$AQORDER= 0
##$ASSFAC= 0
##$ASSFACI= 0
##$ASSFACX= 0
##$ASSWID= 0
##$AUNMP= <proc_prof1d_extract.lims>
##$AXLEFT= 0
##$AXNAME= <>
##$AXNUC= <1H>
##$AXRIGHT= 0
##$AXTYPE= 0
##$AXUNIT= <>
##$AZFE= 0.1
##$AZFW= 0.1
##$BCFW= 0
##$BC_mod= 0
##$BYTORDP= 0
##$COROFFS= 0
##$CY= 15
##$DATMOD= 1
##$DC= 0
##$DFILT= <>
##$DTYPP= 0
##$F1P= 0
##$F2P= 0
##$FCOR= 0.5
##$FTSIZE= 131072
##$FT_mod= 6
##$GAMMA= 0
##$GB= 0
##$INTBC= 1
##$INTSCL= 1
##$ISEN= 128
##$LB= 0.3
##$LEV0= 0
##$LPBIN= 0
##$MAXI= 10000
##$MC2= 0
##$MEAN= 0
##$ME_mod= 0
##$MI= 0
##$NCOEF= 0
##$NC_proc= -3
##$NLEV= 6
##$NOISF1= 0
##$NOISF2= 0
##$NSP= 0
##$NTH_PI= 0
##$NZP= 0
##$OFFSET= 14.96675
##$PC= 1
##$PHC0= 32.49207
##$PHC1= 0
##$PH_mod= 1
##$PKNL= yes
##$PPARMOD= 0
##$PPDIAG= 0
##$PPIPTYP= 0
##$PPMPNUM= 2147483647
##$PPRESOL= 1
##$PSCAL= 4
##$PSIGN= 0
##$PYNMP= <proc.py>
##$REVERSE= no
##$SF= 400.130005546391
##$SI= 131072
##$SIGF1= 0
##$SIGF2= 0
##$SINO= 400
##$SIOLD= 131072
##$SPECTYP= <>
##$SREGLST= <1H.CDCl3>
##$SSB= 0
##$STSI= 131072
##$STSR= 0
##$SW_p= 8223.68421052632
##$SYMM= 0
##$S_DEV= 0
##$TDeff= 65536
##$TDoff= 0
##$TI= <>
##$TILT= no
##$TM1= 0
##$TM2= 0
##$TOPLEV= 0
##$USERP1= <user>
##$USERP2= <user>
##$USERP3= <user>
##$USERP4= <user>
##$USERP5= <user>
##$WDW= 1
##$XDIM= 131072
##$YMAX_p= 435121664
##$YMIN_p= -21226378
##$CURPLOT= <Network HP LaserJet P1505>
##$CURPRIN= <$Network HP LaserJet P1505>
##$DFORMAT= <normdp>
##$LAYOUT= <+/1D_H.xwp>
##$LFORMAT= <normlp>
##$PFORMAT= <normpl>
##$SURQMSG= 1
$$ End of Bruker specific parameters
$$ ---------------------------------
##NTUPLES= NMR SPECTRUM
##VAR_NAME=  FREQUENCY,     SPECTRUM/REAL,   SPECTRUM/IMAG
##SYMBOL=    X,             R,               I
##VAR_TYPE=  INDEPENDENT,   DEPENDENT,       DEPENDENT
##VAR_FORM=  AFFN,          ASDF,            ASDF
##VAR_DIM=   131072,        131072,          131072
##UNITS=     HZ,            ARBITRARY UNITS, ARBITRARY UNITS
##FACTOR=    0.0627417313425165, 1,          1
##FIRST=     8223.62146879498, 8420,         -100750
##LAST=      0,             10965,           -99909
##MIN=       0,             -21226378,       0
##MAX=       8223.62146879498, 435121664,    0
$$ Real data points
##PAGE= N=1
##DATA TABLE= (X++(R..R)), XYDATA
$$ [...]
63555A111765L6254L7989M1049M5363M9370N2152N4356N6734N8754N9289N8091
63544A661166N5702N2092M6310L7778K7330J6665P232k19n626r682j3263j6324
63532A859161j8019j8490j9658k3125k7927l1836l4452l7349m1167m4495m5997
63521A516646m5955m4746m1732l6906l2255k9559k7859k4936k0755j7360j5451
63510A179132j3193r031m031k52K071M561Q325J2644J6011J7947J9389K1530K4486
63497A279589K7489L0214L3326L7283M1381M4746M7849N1957N7266O2748O7860
63486A781708P3174P8690Q2427Q1358P3509N9106M0510K1334M805p850j7222k3882
63474B247667k7505k8184k7542k7524k8640l0265l2369l5853m1143m7372n3140
$$ y = [1111765, 1148019, 1186008, 1227057, 1272420, 1321790, 1373942, 1428298, 1485032, 1543786, 1603075, 1661166, 1716868, 1768960, 1815270, 1853048, 1880378, 1897043, 1904275, 1904056, 1898430, 1888748, 1875485, 1859161, 1841142, 1822652, 1802994, 1779869, 1751942, 1720106, 1685654, 1648305, 1607138, 1562643, 1516646, 1470691, 1425945, 1384213, 1347307, 1315052, 1285493, 1257634, 1232698, 1211943, 1194583, 1179132, 1165939, 1156908, 1152877, 1152625, 1154696, 1159257, 1167582, 1180226, 1196237, 1214184, 1233573, 1255103, 1279589, 1307078, 1337292, 1370618, 1407901, 1449282, 1494028, 1541877, 1593834, 1651100, 1713848, 1781708, 1854882, 1933572, 2015999, 2097357, 2170866, 2229972, 2270482, 2291816, 2296621, 2288771, 2271549, 2247667, 2220162, 2191978, 2164436, 2136912, 2108272, 2078007, 2045638, 2009785, 1968642, 1921270, 1868130]
63463A868130n7592o0577o2306o3087o3096o2200o0170n7163n3753n0634m8296
63452A229256m6731m5089m1978l6823l0920k6554k4814k4595k3927k1960j9464
63441H86401j7781j7458j7687j6960j4563j1529r650r417r473q421o597n378n134
63428G36353m885l973k980k476j775J37K885M935N526N453N665N996N843N390
63414G62094N305N501N097L775K328J568J212M29p97j446o84J123K822L659L842
63399G95828L979M270M486M574M953O043P653R095R862J0136J0592J1817J3855
63386H97143J6135J7921J8967J9855K1609K4883K9563L5026M0586M5743N0282
63375A217713N4498N9148O4675P0061P2680O9935O1599N0281L9369L0623K4091
$$ y = [1868130, 1810538, 1749961, 1687655, 1624568, 1561472, 1499272, 1439102, 1381939, 1328186, 1277552, 1229256, 1182525, 1137436, 1095458, 1058635, 1027715, 1001161, 976347, 951752, 927825, 905865, 886401, 868620, 851162, 833475, 816515, 801952, 790423, 780773, 771356, 761883, 753462, 746865, 741487, 736353, 731468, 727495, 724515, 722039, 720264, 720401, 723286, 728221, 733747, 739200, 744865, 750861, 756704, 762094, 767399, 772900, 777997, 781772, 784100, 785668, 786880, 787309, 786512, 785066, 784382, 785505, 788327, 791986, 795828, 799807, 804077, 808563, 813137, 818090, 824133, 831786, 840881, 850743, 860879, 871471, 883288, 897143, 913278, 931199, 950166, 970021, 991630, 1016513, 1046076, 1081102, 1121688, 1167431, 1217713, 1272211, 1331359, 1396034, 1466095, 1538775, 1608710, 1670309, 1720590, 1759959, 1790582, 1814673]
63364A814673J9826J8664K1014K5760L1113L6165M1177M6651N2595N8308O2214
63353B228160O2322N7732M9646M0166L0146J9149P457l068j0696j5643j9402k2946
63341B423023k6351k9728l3534l7947m2686m7575n2779n8211o3239o7059o9129
63330A894785o9090o6828o2953n8802n5373n2274m8228m2733l6776l1575k7041
63319A343112k2159j6755j2122r347p571m651N16O838J2290J5894J8368K1256
63307A345669K5494L0617L5239L8609M1593M5696N1181N6770O1327O4985O8250
63296A865430P0788P1955P1948P1363O9670O5220N7048M5990L3680K1118Q726
63285B452936k714j1966j8242k1879k4126k6374k9336l2746l6007l9322m3792
$$ y = [1814673, 1834499, 1853163, 1874177, 1899937, 1931050, 1967215, 2008392, 2055043, 2107638, 2165946, 2228160, 2290482, 2348214, 2397860, 2438026, 2468172, 2487321, 2494778, 2491710, 2481014, 2465371, 2445969, 2423023, 2396672, 2366944, 2333410, 2295463, 2252777, 2205202, 2152423, 2094212, 2030973, 1963914, 1894785, 1825695, 1758867, 1695914, 1637112, 1581739, 1529465, 1481237, 1438504, 1401728, 1370153, 1343112, 1320953, 1304198, 1292076, 1282729, 1275158, 1270507, 1271023, 1277861, 1290151, 1306045, 1324413, 1345669, 1371163, 1401780, 1437019, 1475628, 1517221, 1562917, 1614098, 1670868, 1732195, 1797180, 1865430, 1936218, 2008173, 2080121, 2151484, 2221154, 2286374, 2343422, 2389412, 2423092, 2444210, 2452936, 2450222, 2438256, 2420014, 2398135, 2374009, 2347635, 2318299, 2285553, 2249546, 2210224, 2166432]
63274B166432m9912n6380o1093o3306o3929o3696o2023n8340n3652m9664m6670
63263A537767m3323l8508l2460k5958j9558j4292j2271j5358k3072l2344l9562
63252A241061m2930m3093m1929m0773l9654l8000l5677l3006l0076k6799k3656
63241H45468k1514k0461j9571j8188j6622j5167j3356j0926q658p383o830o458
63229F80334o563p361p793o795n266m990n780n719m314l323l730m043k747p59
63215F11151J31j0J96J046J695K051K974M508N430N002M115M175N372O547O504
63200F60887N313M343M924O920Q982J0259J1199J2430J3534J3626J2626J1419
63188G76462J1059J2191J4595J6901J7580J6910J7076J9444K2649K4580K5337
$$ y = [2166432, 2116520, 2060140, 1999047, 1935741, 1871812, 1808116, 1746093, 1687753, 1634101, 1584437, 1537767, 1494444, 1455936, 1423476, 1397518, 1377960, 1363668, 1351397, 1336039, 1312967, 1280623, 1241061, 1198131, 1155038, 1113109, 1072336, 1032682, 994682, 959005, 925999, 895923, 869124, 845468, 823954, 803493, 783922, 765734, 749112, 733945, 720589, 709663, 701005, 693622, 686792, 680334, 673771, 666410, 658617, 651822, 646556, 641566, 635786, 630067, 625753, 622430, 618700, 614657, 611910, 611151, 611282, 611272, 611468, 612514, 614209, 616260, 619234, 623742, 629172, 634174, 638289, 642464, 647836, 654383, 660887, 666200, 670543, 675467, 682387, 691369, 701628, 712827, 725257, 738791, 752417, 765043, 776462, 787521, 799712, 814307, 831208, 848788, 865698, 882774, 902218, 924867, 949447, 974784]
63177I74784K6720K9289L1744L3111L3799L4289L4376L4182L4429L5052L4823
63166A336598L3283L1967L2615L4690L5763L4281L1211K8859K8382K8684K7822
63155A684155K5300K2351J9714J6103R911J727o256j2926j8844k4275k8574l1892
63143A656494l5493l9448m1709m0733l7729l4840l2258k8713k4011j9285j5093
63132A307182j0940o691l007j33K543N375P934R957J2037J4866J8236K1110K2480
63119A400949K2179K1174K0893K1825K2929K2737K0843J7836J4353J0941Q397
63108A605056P039N703K579k709q700j4004j8701k3478k8283l2492l5805l8309
63096A417896m0018m0889m1161m1219m1142m0519l8662l5087l0254k5791k3376
$$ y = [974784, 1001504, 1030793, 1062537, 1095648, 1129447, 1163736, 1198112, 1232294, 1266723, 1301775, 1336598, 1369881, 1401848, 1434463, 1469153, 1504916, 1539197, 1570408, 1599267, 1627649, 1656333, 1684155, 1709455, 1731806, 1751520, 1767623, 1777534, 1779261, 1773005, 1760079, 1741235, 1716960, 1688386, 1656494, 1621001, 1581553, 1539844, 1499111, 1461382, 1426542, 1394284, 1365571, 1341560, 1322275, 1307182, 1296242, 1289551, 1286544, 1286411, 1288954, 1294329, 1302263, 1312220, 1324257, 1339123, 1357359, 1378469, 1400949, 1423128, 1444302, 1465195, 1487020, 1509949, 1532686, 1553529, 1571365, 1585718, 1596659, 1605056, 1612095, 1617798, 1620377, 1617668, 1608968, 1594964, 1576263, 1552785, 1524502, 1492010, 1456205, 1417896, 1377878, 1336989, 1295828, 1254609, 1213467, 1172948, 1134286, 1099199, 1068945, 1043154, 1019778]
63085A019778k3038k3028k1666j8927j5927j3338j0885q193n600l979l879m877
63073H66441n760n548m300k724j218J94J124R45m6m02Q23K728L608L051K288K603
63057H63807M048N669O438N952M796M246N147O936Q121P783O355N000M573N172
63043I44043O172O694O380N771N663O191P000Q054R554J1028J1394J0280Q645
63030A046869P586P017N994L992J494m52r58M7J596K598L165M405O598Q419Q802
63015A107172Q736J0176J3466J7034J9422K0547K1036K1527K2807K5438K8755
63004A316116L1247L2415L3447L5567L8696M2303M6633N2097N8046O3181O6984
62993A816732P0002P2967P6261P9911Q3361Q5524Q5748Q4689Q3737Q3743Q4581
$$ y = [1019778, 996740, 973712, 952046, 933119, 917192, 903854, 892969, 884776, 879176, 875197, 871318, 866441, 860681, 855133, 850833, 848109, 846891, 847085, 848209, 849154, 849108, 848706, 849529, 852257, 855865, 858916, 861204, 863807, 867855, 873524, 879962, 885914, 890710, 894956, 900103, 907039, 915160, 922943, 929298, 934298, 938871, 944043, 950215, 956909, 963289, 969060, 974723, 980914, 987914, 995968, 1005522, 1016550, 1027944, 1038224, 1046869, 1054455, 1061472, 1067466, 1071458, 1072952, 1072500, 1071542, 1071589, 1073185, 1075783, 1078948, 1083353, 1089951, 1098370, 1107172, 1115908, 1126084, 1139550, 1156584, 1176006, 1196553, 1217589, 1239116, 1261923, 1287361, 1316116, 1347363, 1379778, 1413225, 1448792, 1487488, 1529791, 1576424, 1628521, 1686567, 1749748, 1816732, 1886734, 1959701, 2035962, 2115873, 2199234, 2284758, 2370506, 2455195, 2538932, 2622675, 2707256]
62982B707256Q5610Q6002Q5134Q3273Q1500Q0336P8949P6388P2865O8821O3442
62971C569576N5583M5689L5145K3754R763p182k4750m0334n3420o4687p4175q1492
62959C393470q6867r0632r2278r1107q7389q1926p5035o6883n8327n0222m2261
62948B570543l3592k4368j5592p591J07P353J3044J6668J9188K1880K4892K7403
62936B619935K8746K8955K8580K8232K8021K7394K5881K3959K2513K1375J9046
62925B902637J4229P080j364j0359j9494k8179l6065m3761n2291o1520o9780p5437
62913B525696p8441p9829q0053p8636p5520p1894o8894o6000o1778n6259n1448
62902A756944m8903m7657m5482m1857l8568l7197l6983l5747l2573k8913k6870
$$ y = [2707256, 2792866, 2878868, 2964002, 3047275, 3128775, 3209111, 3288060, 3364448, 3437313, 3506134, 3569576, 3625159, 3670848, 3705993, 3729747, 3739510, 3732328, 3707578, 3667244, 3613824, 3549137, 3474962, 3393470, 3306603, 3215971, 3123693, 3032586, 2945197, 2863271, 2788236, 2721353, 2663026, 2612804, 2570543, 2536951, 2512583, 2496991, 2489400, 2489507, 2496860, 2509904, 2526572, 2545760, 2567640, 2592532, 2619935, 2648681, 2677636, 2706216, 2734448, 2762469, 2789863, 2815744, 2839703, 2862216, 2883591, 2902637, 2916866, 2923946, 2922582, 2912223, 2892729, 2864550, 2828485, 2784724, 2732433, 2670913, 2601133, 2525696, 2447255, 2367426, 2287373, 2208737, 2133217, 2061323, 1992429, 1926429, 1864651, 1808392, 1756944, 1708041, 1660384, 1614902, 1573045, 1534477, 1497280, 1460297, 1424550, 1391977, 1363064, 1336194]
62891A336194k6818k7129k6304k4796k4120k4571k4758k3643k1911k0727k0037
62880A071380j9052j7719j6546j5332j3373j0971r480r566j0352j0552r699q031
62868I20707o028m389l663l562l365l139l614m540m514l148k100k777l990l447
62854H68431j016J139J553R48M49p8j182k442l052l188l726m866n761n569m264
62839H37376k464q68L9K14K1k84r29j997k615j551R87L016K907J341K88M91J062
62822H37034J375J852K471K071K13j457j138N93J688J650J750K358K004k24k960
62807H49280m324m166l515k856k160j916k641l677l634k049K06K023K883K741
62793H26195J868P96r5q13j251q90L86J736K328K351K364K288K027K244L225L609
$$ y = [1336194, 1309376, 1282247, 1255943, 1231147, 1207027, 1182456, 1157698, 1134055, 1112144, 1091417, 1071380, 1052328, 1034609, 1018063, 1002731, 989358, 978387, 968907, 959341, 948989, 938437, 928738, 920707, 914679, 910290, 906627, 903065, 899700, 896561, 892947, 888407, 883893, 880745, 878645, 875868, 871878, 868431, 867415, 868554, 870107, 871055, 871504, 871426, 870244, 867802, 864750, 861562, 857836, 852970, 847209, 841640, 837376, 834912, 834044, 834083, 834297, 834318, 834034, 833105, 831108, 828493, 826942, 827929, 830945, 833852, 835193, 835481, 835972, 837034, 838409, 840261, 842732, 844803, 845016, 843559, 842421, 843014, 844702, 846352, 848102, 850460, 852464, 852240, 849280, 844956, 840790, 837275, 834419, 832259, 830343, 827702, 824025, 820391, 818342, 818548, 820571, 823454, 826195, 828063, 828859, 828764, 827951, 826700, 825810, 826196, 827932, 830260, 832611, 834975, 837263, 839290, 841534, 844759, 848368]
62777H48368K069j41l58J648L174K484J071R76J810K036J672J907L028M505O373
62762H80622Q656J0006Q933O303M762N489P153Q360R328J0497J1211J0946J0657
62749I92923J1551J3205J4176J4091J4096J5337J7859K0916K3553K4939K4897
62738A187543K4283K4360K5618K7568K9659L1921L4626L7873M1797M6732N2727
62727A564707N9092O4890O9936P5016Q1003Q8020R5572J03190J10520J16912J21511
62716B550369J23997J24827J24334J21977J16967J09258R9249Q6677P0836N2057
62706C580548L2076J2319p383k7596m7377o4672p8512q9781r9567j07620j12967
62695B989468j15474j16048j15498j13848j10857j06808j02488r8393r4171q9008
$$ y = [848368, 850437, 850296, 849938, 851586, 854760, 857244, 858315, 859291, 861101, 863137, 864809, 866716, 869744, 874249, 880622, 889278, 899284, 908217, 914520, 919282, 924771, 931924, 940284, 949612, 960109, 971320, 982266, 992923, 1004474, 1017679, 1031855, 1045946, 1060042, 1075379, 1093238, 1114154, 1137707, 1162646, 1187543, 1211826, 1236186, 1261804, 1289372, 1319031, 1350952, 1385578, 1423451, 1465248, 1511980, 1564707, 1623799, 1688689, 1758625, 1833641, 1914644, 2002664, 2098236, 2201426, 2311946, 2428858, 2550369, 2674366, 2799193, 2923527, 3045504, 3162471, 3271729, 3370978, 3457655, 3528491, 3580548, 3612624, 3624943, 3617560, 3589964, 3542587, 3477915, 3399403, 3309622, 3210055, 3102435, 2989468, 2873994, 2757946, 2642448, 2528600, 2417743, 2310935, 2208447, 2110054, 2015883, 1926875]
62685A926875q2693p6131p0501o5867o1080n5266m9103m4073m0606l7564l3753
62674A310238k9417k5670k2784j9828j6199j2824j1120j1018j0772q921n791k690
62662A133204k55J714L188L755L795M835P957J2251J5671J7364J8477K0598K4109
62649A266663K8380L2919L7566M1916M5457M8512N2312N7635O3785O9363P3829
62638A818337P7605Q0849Q2896Q3257Q2566Q1823Q0877P8328P3130O5788N7456
62627B662912M8095L6253K1066M003j2139k6056l8861n1810o3923p2970p8478
62616B428092q2383q6385q9809r0860q9032q5341q0831p6006p1414o7554o4121
62605A544356o0306n5988n1837m8179m4678m1269l8400l6058l3542l0617k7939
$$ y = [1926875, 1844182, 1768051, 1697550, 1631683, 1570603, 1515337, 1466234, 1422161, 1381555, 1343991, 1310238, 1280821, 1255151, 1232367, 1212539, 1196340, 1183516, 1172396, 1161378, 1150606, 1141685, 1135894, 1133204, 1132949, 1134663, 1137851, 1141606, 1145401, 1150236, 1158193, 1170444, 1186115, 1203479, 1221956, 1242554, 1266663, 1295043, 1327962, 1365528, 1407444, 1452901, 1501413, 1553725, 1611360, 1675145, 1744508, 1818337, 1895942, 1976791, 2059687, 2142944, 2225510, 2307333, 2388210, 2466538, 2539668, 2605456, 2662912, 2711007, 2747260, 2768326, 2772329, 2760190, 2734134, 2695273, 2643463, 2579540, 2506570, 2428092, 2345709, 2259324, 2169515, 2078655, 1989623, 1904282, 1823451, 1747445, 1676031, 1608477, 1544356, 1484050, 1428062, 1376225, 1328046, 1283368, 1242099, 1203699, 1167641, 1134099, 1103482, 1075543]
62594A075543k5713k3108j9820j7213j6625j7223j6913j5062j2920j1501j0439
62583H89006r167p926p079o424n722n093m541l748k790k231k069j508k67P88J054
62568H32283J281K276L280K965J568O77R63J502J574J866L277N426P046P475P231
62553H80690P440Q960J1677J4474J6282J7292J8612K0613K2438K3475K4446K6307
62541A092706K8754L0840L2608L5083L8712M2849M6873N0812N4515N7109N7913
62530A568774N7377N6332N4629N1193M5420L7851K9299J9839R214k013j2353k0757
62518A894805k7658l4180m0545m5884m9649n2359n4521n5667n5161n3468n1554
62507A374159m9383m6117m1926l8334l6315l5043l3166l0551k7984k5737k3330
$$ y = [1075543, 1049830, 1026722, 1006902, 989689, 973064, 955841, 938928, 923866, 910946, 899445, 889006, 879839, 871913, 864834, 858410, 852688, 847595, 843054, 839306, 836516, 834285, 832216, 830708, 830441, 831229, 832283, 833564, 835840, 839120, 842085, 843653, 844330, 845293, 846795, 848369, 850235, 853512, 858938, 865984, 873459, 880690, 888130, 897090, 908767, 923241, 939523, 956815, 975427, 996040, 1018478, 1041953, 1066399, 1092706, 1121460, 1152300, 1184908, 1219991, 1258703, 1301552, 1348425, 1399237, 1453752, 1510861, 1568774, 1626151, 1682483, 1737112, 1788305, 1833725, 1871576, 1900875, 1920714, 1929928, 1927915, 1915562, 1894805, 1867147, 1832967, 1792422, 1746538, 1696889, 1644530, 1590009, 1534342, 1479181, 1425713, 1374159, 1324776, 1278659, 1236733, 1198399, 1162084, 1127041, 1093875, 1063324, 1035340, 1009603, 986273]
62496I86273k0441j7246j4067j1321r613r181r312q925p758o505n807n613n394
62483H55090m508k501K90K530L072K509K801N032Q028R551Q509N772L234K403
62469I01812L592O080Q926J1592J3888J5720J7300J9178K1587K4111K6625L0040
62457A100451L5066M0491M4073M5286M5949M7741N0321N2428N3522N3447N1676
62446A620451M8093M3642L9030L3412K5659J6435P709N00n685j1242j5671j8473
62434A783860j9878k0311j9899j8537j5909j1579n847k86L555N990Q781J2965
62422A702905J8002K3051K7834L2094L5369L7716L9610M0715L9690L5775K9634
62411B062395K2231J3902N139k891r734j6732k5574l5999m5917n3638n9178o3434
$$ y = [986273, 965832, 948586, 934519, 923198, 913585, 904404, 895092, 886167, 878409, 871904, 866097, 860484, 855090, 850582, 848081, 848371, 850901, 853973, 856482, 859283, 864315, 872343, 881894, 890403, 896175, 899409, 901812, 905404, 911484, 920410, 932002, 945890, 961610, 978910, 998088, 1019675, 1043786, 1070411, 1100451, 1135517, 1176008, 1220081, 1265367, 1311316, 1359057, 1409378, 1461806, 1515328, 1568775, 1620451, 1668544, 1712186, 1751216, 1784628, 1810287, 1826722, 1834431, 1834931, 1829246, 1818004, 1802333, 1783860, 1763982, 1743671, 1723772, 1705235, 1689326, 1677747, 1671900, 1671614, 1675169, 1681159, 1689940, 1702905, 1720907, 1743958, 1771792, 1803886, 1839255, 1876971, 1916581, 1957296, 1996986, 2032761, 2062395, 2084626, 2098528, 2103667, 2100776, 2091042, 2074310, 2048736, 2012737, 1966820, 1913182, 1854004, 1790570]
62399A790570o6733o8424o7688o4829o1591n9628n8549n6151n1022m4223l8024
62388A153708l3596l0454k7500k3974j9959j6487j4594j3850j2507r705o572m468
62376I40042l146j748o65r26k356l772m757n758o681o911o799p471q936r785r280
62361H61051q464q460q802q311o882n471m747m362l507j963p26j336m000o645
62347G87375o829m487j851o44o24r74j572k146j677K52K372L176K817K651L432
62332G81271M920O736Q679J0361J1269J1020R329O411L923M435Q714J4251J7729
62319H99048J8620J9004K0249K1497K1748K1784K3101K5768K8402K9983L0997
62308A160201L2678L5527L8918M2207M5840N0805N7022O3192O8557P3936Q0281
$$ y = [1790570, 1723837, 1655413, 1587725, 1522896, 1461305, 1401677, 1343128, 1286977, 1235955, 1191732, 1153708, 1120112, 1089658, 1062158, 1038184, 1018225, 1001738, 987144, 973294, 960787, 951082, 944510, 940042, 936896, 935148, 934483, 933557, 931201, 927429, 922672, 916914, 910233, 903322, 896523, 889052, 880116, 870331, 861051, 852587, 844127, 835325, 827014, 820132, 814661, 809914, 805552, 802045, 800082, 799356, 798020, 794020, 787375, 780546, 776059, 774208, 773564, 772940, 771966, 770394, 768248, 766571, 766823, 769195, 772371, 775188, 777839, 781271, 786191, 792927, 801606, 811967, 823236, 834256, 843585, 849996, 853919, 858354, 867068, 881319, 899048, 917668, 936672, 956921, 978418, 1000166, 1021950, 1045051, 1070819, 1099221, 1129204, 1160201, 1192879, 1228406, 1267324, 1309531, 1355371, 1406176, 1463198, 1526390, 1594947, 1668883, 1749164]
62297A749164Q7019R2800R7293J01037J03879J04768J02997R8486R0791P9129
62287B707363O3709M6216K8628J2256k185j4592k5823l7114m8822o0234p0480
62276B598922p8754q3953q5497q4602q3191q1350p7479p1480o5805o2190n9080
62265A765541n4131m8041m3822m2809m3271m2920m1163l8668l6168l4165l2891
62254A307492l2092l1278l0387k9652k9048k8387k7642k6490k3953j9538j4593
62243A014432j1295j0127r384p502n065l967n151p500q780p572m509j498M40K056
62229I34578M205O225P004O887P043P427P146O751Q120J1508J4554J5279J4551
62216A051278J4398J5196J5886J6206J7114J9223K2019K4616K6630K8433L0969
$$ y = [1749164, 1836183, 1928983, 2026276, 2127313, 2231192, 2335960, 2438957, 2537443, 2628234, 2707363, 2771072, 2817288, 2845916, 2858172, 2855987, 2841395, 2815572, 2778458, 2729636, 2669402, 2598922, 2520168, 2436215, 2350718, 2266116, 2182925, 2101575, 2024096, 1952616, 1886811, 1824621, 1765541, 1711410, 1663369, 1619547, 1576738, 1533467, 1490547, 1449384, 1410716, 1374548, 1340383, 1307492, 1275400, 1244122, 1213735, 1184083, 1155035, 1126648, 1099006, 1072516, 1048563, 1029025, 1014432, 1003137, 993010, 983626, 976124, 971059, 967092, 961941, 954441, 945661, 938089, 933580, 932082, 932522, 934578, 938783, 945008, 952012, 958899, 965942, 973369, 980515, 987266, 995386, 1006894, 1021448, 1036727, 1051278, 1065676, 1080872, 1096758, 1112964, 1130078, 1149301, 1171320, 1195936, 1222566, 1250999, 1281968]
62205A281968L5022M0239M5457N0296N5738O2689P0774P9059Q6959R3771R8459
62194B000431J01074J03265J06074J07909J06032R9312Q8191P3059N4650L5485
62184B875482J8544M309r076k2722l5990m8515o0899p2720q2211q8885r4357r9258
62172B283702j01452r9236r4494r0369q6931q1802p4463o7250o1842n7181n1721
62161A416961m5825m0829l7093l4216l2193l0990k9519k6370k1744j7737j6288
62150A084157j7144j8162j7391j4733j1588r219p655o077l987j727j52J42n27
62137I75937q64M39L370O418Q156Q728R433J1118J3550J6087J8257J9621J9853
62124A110103J9288J9020J9962K1966K3979K5027K5027K4759K5050K5962K7009
$$ y = [1281968, 1316990, 1357229, 1402686, 1452982, 1508720, 1571409, 1642183, 1721242, 1808201, 1901972, 2000431, 2101505, 2204770, 2310844, 2418753, 2524785, 2624097, 2712288, 2785347, 2839997, 2875482, 2894026, 2898335, 2889259, 2866537, 2830547, 2782032, 2721133, 2648413, 2566202, 2477317, 2382960, 2283702, 2182250, 2083014, 1988520, 1898151, 1811220, 1729418, 1654955, 1587705, 1525863, 1468682, 1416961, 1371136, 1330307, 1293214, 1258998, 1226805, 1195815, 1166296, 1139926, 1118182, 1100445, 1084157, 1067013, 1048851, 1031460, 1016727, 1005139, 995920, 988265, 982188, 978201, 976474, 976322, 976464, 975937, 975073, 975512, 978882, 985300, 993456, 1002184, 1011617, 1022735, 1036285, 1052372, 1070629, 1090250, 1110103, 1129391, 1148411, 1168373, 1190339, 1214318, 1239345, 1264372, 1289131, 1314181, 1340143, 1367152]
62113A367152K8210L0468L4369L9176M3726M8103N3427N9994O6678P2555P8008
62102A921866Q3432Q7596Q8306Q4504P6959O7156N6245M4959L3715K2549J1590
62091B578877J638o413j3000j9965k8611l8089m6306n2128n6004n8560n9506n8291
62079B143642n5261n1619m8359m5617m2915l9729l5965l2112k8838k6126k3101
62068A714000j9121j4833j1439r019o422l027L05K692M722P419J0176J1020R151
62055A695624O044L615K148P20j104k844m135n247o584q274j0380j2911j5405
62042A641267j6840j6298j3640r563n157j314J827M916Q483J1956J4070J4502
62030A634209J4543J5599J7444J8586J8247J7136J6218J5584J5038J5264J7501
$$ y = [1367152, 1395362, 1425830, 1460199, 1499375, 1543101, 1591204, 1644631, 1704625, 1771303, 1843858, 1921866, 2005298, 2092894, 2181200, 2265704, 2342663, 2409819, 2466064, 2511023, 2544738, 2567287, 2578877, 2580515, 2574102, 2561102, 2541137, 2512526, 2474437, 2428131, 2376003, 2319999, 2261439, 2201933, 2143642, 2088381, 2036762, 1988403, 1942786, 1899871, 1860142, 1824177, 1792065, 1763227, 1737101, 1714000, 1694879, 1680046, 1668607, 1659588, 1653166, 1650139, 1650444, 1653136, 1657858, 1665277, 1675453, 1686473, 1695624, 1701668, 1705283, 1707431, 1708151, 1707047, 1704203, 1700068, 1694821, 1688237, 1679963, 1669583, 1656672, 1641267, 1624427, 1608129, 1594489, 1584926, 1579769, 1578455, 1580282, 1585198, 1593681, 1605637, 1619707, 1634209, 1648752, 1664351, 1681795, 1700381, 1718628, 1735764, 1751982, 1767566, 1782604, 1797868, 1815369]
62019A815369K2005K7263L1076L2476L2549L3418L6227M0146M3396M5047M5584
62008B204556M5868M6361M7394M9340N1988N4366N5730N6138N5504N2808M7243
61997B767296L9486L0786K1288J0642j17r040j5805k2181k9496l7258m4905n3140
61985B657556o2181p0134p4843p6664p7859p9703q1508q2128q1059p8320p4504
61974A818653p0790o7729o4272n9204n3314m8651m5712m2998l9573l6363l4277
61963A255770l2547l0016k6957k4545k3198k2391k1587k0577j9168j7251j5007
61952A002526j2740j0746r393q746q054o456m333l004k697k000K7K289L175K771
61938I42619K419K745L200L194K598J430o8j269j880k548l930n635o903p799q656
$$ y = [1815369, 1837374, 1864637, 1895713, 1928189, 1960738, 1994156, 2030383, 2070529, 2113925, 2158972, 2204556, 2250424, 2296785, 2344179, 2393519, 2445507, 2499873, 2555603, 2611741, 2667245, 2720053, 2767296, 2806782, 2837568, 2858856, 2869498, 2869381, 2860341, 2844536, 2822355, 2792859, 2755601, 2710696, 2657556, 2595375, 2525241, 2450398, 2373734, 2295875, 2216172, 2134664, 2052536, 1971477, 1893157, 1818653, 1747863, 1680134, 1615862, 1556658, 1503344, 1454693, 1408981, 1365983, 1326410, 1290047, 1255770, 1223223, 1193207, 1166250, 1141705, 1118507, 1096116, 1074529, 1053952, 1034784, 1017533, 1002526, 989786, 979040, 969647, 960901, 952847, 946391, 942058, 939054, 936357, 934357, 934384, 936673, 939848, 942619, 945038, 947783, 950983, 954177, 956775, 958205, 958137, 956868, 954988, 952440, 948510, 942875, 935972, 928173, 919517]
61923I19517q898p896o633o852q463r499r009q288q478q551p004m403k651k328
61909H20564k325j903j708k401l449l850l369k518j682q07K58J416K310K493J872
61894H04901J141J422L034M854N517N268N825Q028J0462J1315J1116J2220J5476
61881I00579J8936K0601K1251K3027K6020K7957K7386K5542K4472K4526K4597
61870A164894K3828K2046J9139J5350J1936J0278J0007R073O167K255r78l455
61858A290540o353r670j1433r826n371l56L325N319O389P743J0408J4247J7616
61845A312578J8890J8395J7907J8109J7665J5272J1417P340L294j035n152q178
61833A426502j0347j2790j5892j8840k0811k1580k1059j9352j7413j6520j6734
$$ y = [919517, 910619, 902723, 896090, 889238, 880775, 871276, 862267, 853979, 845501, 836950, 829946, 825543, 822892, 820564, 818239, 816336, 814628, 812227, 808778, 804928, 801559, 799041, 797359, 796552, 796810, 798226, 800536, 803029, 804901, 806042, 807464, 810498, 815352, 820869, 826137, 831962, 839990, 850452, 861767, 872883, 885103, 900579, 919515, 940116, 961367, 984394, 1010414, 1038371, 1065757, 1091299, 1115771, 1140297, 1164894, 1188722, 1210768, 1229907, 1245257, 1257193, 1267471, 1277478, 1286551, 1292718, 1294973, 1293995, 1290540, 1284187, 1274517, 1263084, 1253258, 1247887, 1247531, 1250856, 1256175, 1262564, 1270307, 1280715, 1294962, 1312578, 1331468, 1349863, 1367770, 1385879, 1403544, 1418816, 1430233, 1437573, 1440867, 1439832, 1434680, 1426502, 1416155, 1403365, 1387473, 1368633, 1347822, 1326242, 1305183, 1285831, 1268418, 1251898, 1235164]
61822A235164j6879j6357j6051j6875j8366j9340j9239j8213j6485j4375j2440
61811A050544j0891r237p019m515k225k5K477N124P347Q935J0166J1340J2634
61798A074655J4234J6234J8585K1476K5334L0043L4558L7862M0057M1933M3704
61787A398675M4837M4974M4253M2794M0576L7836L4868L1195K5694J8160J0303
61776A774165M430J047j715n880j1056j4625j4627j1853q674o366m353j787J320
61763A700026M556P536R455R295P119M160R63l453r667j6260k1572k6093l1322
61750A634743l6863m0654m2033m2593m3540m4136m3447m1937m0254l7884l4270
61739A187132l0282k7277k5387k3882k2560k1543k0205j7648j4211j1383j0178
$$ y = [1235164, 1218285, 1201928, 1185877, 1169002, 1150636, 1131296, 1112057, 1093844, 1077359, 1062984, 1050544, 1039653, 1030416, 1023397, 1018882, 1016657, 1016632, 1019109, 1024233, 1031580, 1040515, 1050681, 1062021, 1074655, 1088889, 1105123, 1123708, 1145184, 1170518, 1200561, 1235119, 1272981, 1313038, 1354971, 1398675, 1443512, 1488486, 1532739, 1575533, 1616109, 1653945, 1688813, 1720008, 1745702, 1763862, 1774165, 1778595, 1779642, 1777927, 1772047, 1760991, 1746366, 1731739, 1719886, 1711212, 1704846, 1700493, 1698706, 1700026, 1704582, 1712118, 1721573, 1730868, 1737987, 1742147, 1743110, 1739657, 1729990, 1713730, 1692158, 1666065, 1634743, 1597880, 1557226, 1515193, 1472600, 1429060, 1384924, 1341477, 1299540, 1259286, 1221402, 1187132, 1156850, 1129573, 1104186, 1080304, 1057744, 1036201, 1015996, 998348, 984137, 972754, 962576]
61728I62576j0289j0744j0610r293p005m911m082m369m900n308n571n085l230
61715H77179r40k29j683l465l488j714K66J183R02L2m65K50K066L828M616M700
61699H83038M800M933M767M651N257O389P032O597N399L977K620J614J203J217
61685I43494J330J578J960J738K04j836k598j637m16k9K11J000J323P7j606j591
61669I43202J45J558J646J488J862J925J220J115K740M895N662N186N073N548
61655I83265N237L716K289J816J374j07k161l743m930o536q502r753r577q364
61641I44024o996n950n204m664m538n130o121o432n424m163m433o198p116n452
61627H66203k568j421k966n298o160n125l207j467n14n48j271k122k935l840m440
$$ y = [962576, 952287, 941543, 930933, 921640, 914635, 909724, 905642, 901273, 896373, 891065, 885494, 880409, 877179, 876239, 876010, 874327, 870862, 867374, 865660, 865926, 867109, 868011, 868043, 867578, 867828, 869894, 873722, 878338, 883038, 887838, 892771, 897538, 902189, 907446, 913835, 920867, 927464, 932863, 936840, 939460, 941074, 942277, 943494, 944824, 946402, 948362, 950100, 950304, 948468, 945870, 944233, 943817, 943788, 943999, 944999, 946322, 946399, 944793, 943202, 943347, 944905, 946551, 948039, 949901, 951826, 953046, 954161, 956901, 961796, 967458, 972644, 977717, 983265, 988502, 992218, 994507, 996323, 997697, 997590, 995429, 991686, 986756, 980220, 971718, 961965, 952388, 944024, 937028, 931078, 925874, 921210, 916672, 911542, 905421, 898989, 893565, 889402, 884969, 878771, 871655, 866203, 863635, 862214, 859248, 853950, 847790, 842665, 839458, 837991, 837477, 836929, 835658, 833536, 830601, 826761, 822321]
61612H22321l846k007l47l25j760l226l856l999m205m255l529j958l49K19o41
61597G88237k148k974k526j468p48m09J73J073J567J262Q63J210K008K176J424
61582G89720P20Q88J340R16l46j158p91j04k31r45j160p58q37k039l450l653k468
61565G75644j175j192k687m331m365k358K3N32j187l227l751k906j844q18N93
61550G46951J780J176j658n083p127p538p450p649p892p760p399p202p259p476
61536F68414p935q726r397r103p652o070n455n453m683k817j270j310k444l486
61522E92613m342n512o445o028m543l556l573l406k391j698k429l729m053l375
61508E37533k708k174j080L61R14J12j078j720j973k325k535j991o19R15J704
$$ y = [822321, 818475, 816468, 816121, 815796, 814036, 810810, 806954, 802955, 798750, 794495, 790966, 789008, 788659, 788878, 788237, 786089, 783115, 780589, 779121, 778373, 777964, 778137, 779210, 780777, 782039, 782902, 784112, 786120, 788296, 789720, 790440, 791328, 792668, 793584, 793238, 792080, 791289, 791185, 790954, 790009, 788849, 788091, 787254, 785215, 781765, 778112, 775644, 774469, 773277, 770590, 766259, 761894, 759536, 759559, 760091, 758904, 755677, 751926, 749020, 747176, 746358, 746951, 748731, 749907, 748249, 743166, 736039, 728501, 721051, 713402, 705510, 697750, 690351, 683149, 675890, 668414, 660479, 651753, 642356, 633253, 625601, 619531, 614076, 608623, 603940, 601123, 599853, 598543, 596099, 592613, 588271, 582759, 576314, 570286, 565743, 562187, 558614, 555208, 552817, 551119, 548690, 544961, 540908, 537533, 534825, 532651, 531571, 531932, 532846, 532958, 531880, 530160, 528187, 525862, 523327, 521336, 520717, 521632, 523336]
61493E23336J208k46j524j738j205r12j129j192p27k33j80j76M18J582K719L343
61477E23344L274K467J140o6m10L49J703K722K787K164J644J354M01j734l946
61462E37193m650l956l413l541l172j739o51j196k340k178p47K39Q1k18J09N64
61446E10385O83Q16J025M99j109k695l017k313j745j788k026k215k516k812k532
61431D88640j376K22J479J905J593J090Q84R47R84J045J399J661R16p61j741o92
61415D98195J539K988L102K993L328L391K616J660J274J118O55L25Q12J700J947
61400E27643J437R96J006R60M80j25m92n91k88P40K218L116K762J748J157J255
61384E44022J374Q80j92j368k083j799k51K199M515N672N572N252N836P079P265
$$ y = [523336, 524544, 524298, 522774, 521036, 519831, 518919, 517790, 516598, 515871, 515638, 515458, 515282, 515700, 517282, 520001, 523344, 526618, 529085, 530225, 530159, 529749, 530098, 531801, 534523, 537310, 539474, 541118, 542472, 542873, 541139, 537193, 532543, 528587, 525174, 521633, 518461, 516722, 516071, 514875, 512535, 510357, 509610, 509849, 509930, 509712, 509821, 510385, 511068, 511884, 512909, 513408, 512299, 509604, 506587, 504274, 502529, 500741, 498715, 496500, 493984, 491172, 488640, 487264, 487486, 488965, 490870, 492463, 493553, 494437, 495384, 496368, 497413, 498812, 500473, 501389, 500628, 498887, 498195, 499734, 502722, 505824, 508817, 512145, 515536, 518152, 519812, 521086, 522204, 522859, 523184, 523996, 525696, 527643, 529080, 530076, 531082, 532042, 532522, 532397, 531905, 531314, 531026, 531766, 533984, 537100, 539862, 541610, 542767, 544022, 545396, 546276, 546084, 544716, 542633, 540834, 540583, 542782, 547297, 552969, 558541, 563793, 569629, 576708, 583973]
61369E83973N017J138j926k509j180L13R38R67J118J711K576L464M284M933M964
61354F09781L869K044R81J718L303L712K229O0j520k391k745k474k095k942n225
61339F08305p012o455m235k458j839j551j267j469j899j576n16J58J02J70O00
61324E79058N11k73n68J32N72k35j245r28N70K071L160M043M449M123L691L828
61308F02959M067L739L366L748M275L836K945L141M446N298N167N255O115O548
61294F64905N922N950Q564J2921J6040J6146J4206J2250J1147J0388R429Q776
61282G96644R385J1158J2525J2154J0598R317Q389O573L816K003K313L251K686
61269H90812Q23m79p73j459l108m195l288j192J92L15K49Q58J781K220J952J421
$$ y = [583973, 588990, 590128, 588202, 585693, 584513, 584826, 585764, 586731, 587849, 589560, 592136, 595600, 599884, 604817, 609781, 613650, 615694, 616675, 618393, 621696, 625408, 627637, 627697, 626177, 623786, 621041, 618567, 616472, 613530, 608305, 601293, 594838, 590603, 588145, 586306, 584755, 583488, 582019, 580120, 578544, 578028, 578186, 578288, 578458, 579058, 579569, 579296, 578728, 578860, 579432, 579197, 577952, 577024, 577594, 579665, 582825, 586868, 591317, 595440, 599131, 602959, 607026, 610765, 614131, 617879, 622154, 625990, 628935, 632076, 636522, 641820, 646987, 652242, 658357, 664905, 670827, 676777, 685341, 698262, 714302, 730448, 744654, 756904, 768051, 778439, 787868, 796644, 806029, 817187, 829712, 841866, 852464, 861781, 870170, 876743, 880559, 882562, 884875, 888126, 890812, 891635, 891156, 890383, 888924, 885816, 881621, 878333, 877141, 877333, 877648, 877897, 878755, 880536, 882756, 884708, 886129]
61253H86129J394K665N499Q884J0854J0171P631N312M625N523P390R842J2431
61240I78350J4277J4623J3446J1093P730L773L91j338j775k406m048o060p558
61227A020498q646r957j1497j2500j2148j0084o566k606K85J087J35j181j579
61214I45241o86J050K902M377N398O067O383O388O568P623R522J1158J1369J0245
61200A033605R078R020J0022J1158J1747J1947J2280J2730J2606J1384R417P531
61188A162525O085M775L309J855P34K9m45r89j830k787l292l157l180m304o123
61173A153205o968n865l725k104j423r54j53P96J605K299K904L298L614M386N878
61158A156793P465Q109P665P302Q163R718J0231R039P544P288P912Q086P755P905
$$ y = [886129, 887523, 890188, 895687, 904571, 915425, 925596, 933227, 938539, 943164, 948687, 956077, 965919, 978350, 992627, 1007250, 1020696, 1031789, 1039519, 1043292, 1043683, 1042345, 1040570, 1038164, 1034116, 1028056, 1020498, 1011852, 1001895, 990398, 977898, 965750, 955666, 949100, 946494, 946779, 947866, 948001, 946820, 945241, 944555, 945605, 948507, 952884, 958282, 964349, 970732, 977120, 983688, 991311, 1000833, 1011991, 1023360, 1033605, 1042683, 1051703, 1061725, 1072883, 1084630, 1096577, 1108857, 1121587, 1134193, 1145577, 1154994, 1162525, 1168610, 1173385, 1176694, 1178549, 1179283, 1179312, 1178867, 1177878, 1176048, 1173261, 1169969, 1166812, 1163632, 1159328, 1153205, 1146237, 1140372, 1136647, 1134543, 1133120, 1132166, 1132013, 1132809, 1134414, 1136713, 1139617, 1142915, 1146529, 1150915, 1156793, 1164258, 1172367, 1180032, 1187334, 1195497, 1205215, 1215446, 1224485, 1232029, 1239317, 1247229, 1255315, 1263070, 1270975]
61144A270975Q396P825O015M830N640P421Q521R162J0852J4104J8124K2104K5453
61131A419422K7291K7126K5924K5184K4994K4142K2050J9547J7667J6761J6707
61120A666815J6954J6366J4174J1142Q749P168N360L204J992K134J787j097o131
61107A748617j0945j3751j4697j5068j6041j8041k0650k2938k4123k4053k3209
61096A545101k2506k2788k3946k4651k3650k1308j9050j7324j5205j2233r374
61085A333066p614o736o289o747q532j0684j1802j1852j1814j1730j0594q261
61073A220411o081m963l859j204K732O002P387P721Q578J0513J3176J6419K0223
61060A297055K3795K6100K7587L0159L4589L9099M1673M2927M5091M8596N1470
$$ y = [1270975, 1279371, 1287196, 1293211, 1298041, 1303681, 1311102, 1319623, 1328785, 1339637, 1353741, 1371865, 1393969, 1419422, 1446713, 1473839, 1499763, 1524947, 1549941, 1574083, 1596133, 1615680, 1633347, 1650108, 1666815, 1683769, 1700135, 1714309, 1725451, 1734200, 1741368, 1746728, 1749932, 1751924, 1754058, 1755845, 1754748, 1748617, 1737672, 1723921, 1709224, 1694156, 1678115, 1660074, 1639424, 1616486, 1592363, 1568310, 1545101, 1522595, 1499807, 1475861, 1451210, 1427560, 1406252, 1387202, 1369878, 1354673, 1342440, 1333066, 1325452, 1318716, 1312427, 1305680, 1297148, 1286464, 1274662, 1262810, 1250996, 1239266, 1228672, 1220411, 1214330, 1209367, 1205508, 1204304, 1207036, 1213038, 1220425, 1228146, 1236724, 1247237, 1260413, 1276832, 1297055, 1320850, 1346950, 1374537, 1404696, 1439285, 1478384, 1520057, 1562984, 1608075, 1656671, 1708141]
61049A708141N2156N1245M9964M8556M6962M5564M4292M2077L8304L3856K9669
61038B190786K5171J9416J2898O805R62n764j3134j9249k3007k5550k8610l2342
61026B108382l5621l7802l9222m0188m0428l9853l9191l9201l9443l8582l6011
61015A682840l2561k9281k6389k3930k2535k2370k1986j9730j6020j2732j0433
61004A444873p889m420r42J751M048O194P763R209J2093J6568K0496K2495K4229
60991A556468K7868L2690L6317L8272M0273M3590M7998N2836N7516O1429O4857
60980B060114O9295P5544Q2376Q8583R5147J03363J11870J18007J21546J24830
60970C050675J29652J36033J43442J50947J56890J60995J66145J75333J87452
$$ y = [1708141, 1760297, 1811542, 1861506, 1910062, 1957024, 2002588, 2046880, 2088957, 2127261, 2161117, 2190786, 2215957, 2235373, 2248271, 2255076, 2256038, 2250274, 2237140, 2217891, 2194884, 2169334, 2140724, 2108382, 2072761, 2034959, 1995737, 1955549, 1915121, 1875268, 1836077, 1796876, 1757433, 1718851, 1682840, 1650279, 1620998, 1594609, 1570679, 1548144, 1525774, 1503788, 1484058, 1468038, 1455306, 1444873, 1436984, 1432564, 1431622, 1433373, 1437421, 1443615, 1451378, 1460587, 1472680, 1489248, 1509744, 1532239, 1556468, 1584336, 1617026, 1653343, 1691615, 1731888, 1775478, 1823476, 1876312, 1933828, 1995257, 2060114, 2129409, 2204953, 2287329, 2375912, 2471059, 2574422, 2686292, 2804299, 2925845, 3050675, 3180327, 3316360, 3459802, 3610749, 3767639, 3928634, 4094779, 4270112, 4457564]
60961D457564J99152K10283K24017K41725K61607K82829L07385L37265L73415
60952F895242M18168M74832N44241O25589P20934Q33758R62591J102401J253249
60943A3831005J419667J600261J790078J996653K229906K449139K530588K333079
60935C0180376J828942J162183N54600J51370l6134n9741M1036K17741L49867
60926C4390240K67431j25127p52682j413607j921887k207363k302461k270439
60918B3664105k160725k008052j839364j670338j504929j344516j193463j055095
60910A0887623r28887q14782p15684o32933n63263n02984m51839m10023l74296
60901E492932l40419l07604k77767k51583k27696k05046j84006j65651j50957
$$ y = [4457564, 4656716, 4866999, 5091016, 5332741, 5594348, 5877177, 6184562, 6521827, 6895242, 7313410, 7788242, 8332483, 8958072, 9679006, 10512764, 11475355, 12577756, 13831005, 15250672, 16850933, 18641011, 20637664, 22867570, 25316709, 27847297, 30180376, 32009318, 33171501, 33726101, 33877471, 33841337, 33781596, 33822632, 34040373, 34390240, 34657671, 34532544, 33779862, 32366255, 30444368, 28237005, 25934544, 23664105, 21503380, 19495328, 17655964, 15985626, 14480697, 13136181, 11942718, 10887623, 9958736, 9143954, 8428270, 7795337, 7232074, 6729090, 6277251, 5867228, 5492932, 5152513, 4844909, 4567142, 4315559, 4087863, 3882817, 3698811, 3533160, 3382203]
60892C382203j39985j31007j21620j11586j03163r7746r3672q8594q2517p6936
60882B335377p2196o7380o2206n7504n4137n2237n1187m9912m7893m6060m5590
60871A729075m5770m4626m2010l9978l9429l8549l5940l2980l1315k9991k7437
60860A321050k4700k3992k4868k4592k2036j8864j6771j5576j4425j3136j1825
60849A110265j0463r236q392p567o135m434l632m170n007m777l274j668j328k421
60835A037761l734m138l997m393n334n955o332p364q643q470o721n732p033r112
60821I50803r890r670r813j0159r804r129q812p931n351k122j77N66J546K620
60807H72677K315P21l20J92J769M145P292R914J0400R406R134R865R686P963O562
$$ y = [3382203, 3242218, 3111211, 2989591, 2878005, 2774842, 2677096, 2583424, 2494830, 2412313, 2335377, 2263181, 2195801, 2133595, 2076091, 2021954, 1969717, 1918530, 1868618, 1820725, 1774665, 1729075, 1683305, 1638679, 1596669, 1556691, 1517262, 1478713, 1442773, 1409793, 1378478, 1348487, 1321050, 1296350, 1272358, 1247490, 1222898, 1200862, 1181998, 1165227, 1149651, 1135226, 1122090, 1110265, 1099802, 1090566, 1082174, 1074607, 1068472, 1064038, 1060406, 1056236, 1051229, 1046452, 1043178, 1041510, 1040182, 1037761, 1034027, 1029889, 1025892, 1021499, 1016165, 1010210, 1003878, 996514, 987871, 979401, 972680, 966948, 959915, 950803, 940913, 931243, 921430, 911271, 901467, 892338, 883526, 875595, 870244, 868122, 867945, 868511, 870057, 872677, 874992, 875713, 875393, 875585, 877354, 881499, 888791, 898705, 909105, 918511, 927645, 937510, 947196, 955159, 961721]
60792I61721O805P638P764P509P460P135O105M821L524J925O29R30K353K493M26
60777A029238j621j444K3L89q87k563l852m869n511n260l838j449J044K021M82
60762A001903k096k902j383J68L23N34K103L578L319K694M066O895Q561Q309P779
60747A043851Q045Q579R083R974J0970J1242J1256J2599J5561J8591K0475K1527
60735A201753K2227K2386K2232K2870K4690K6480K6943K6358K5963K6361K7040
60724A475303K7113K6077K4322K2984K2857K3244K2528K0034J6862J4696J4133
60713A710153J4267J3526J0954P038L197K26k393n393q593j1529j4527j7992k1056
60700A677878k2210k1339k0118k0266k2226k5393k8664l0743l0937k9877k8700
$$ y = [961721, 968526, 976164, 983928, 991437, 998897, 1006032, 1012137, 1016958, 1020482, 1022407, 1023036, 1023966, 1026319, 1028812, 1029238, 1027617, 1026173, 1026196, 1026585, 1025698, 1023135, 1019283, 1014414, 1008903, 1003643, 999805, 998356, 999400, 1001421, 1001903, 999807, 996905, 995522, 995690, 996013, 996547, 998650, 1002228, 1005547, 1008241, 1012307, 1019202, 1027763, 1036072, 1043851, 1051896, 1060475, 1069558, 1079532, 1090502, 1101744, 1113000, 1125599, 1141160, 1159751, 1180226, 1201753, 1223980, 1246366, 1268598, 1291468, 1316158, 1342638, 1369581, 1395939, 1421902, 1448263, 1475303, 1502416, 1528493, 1552815, 1575799, 1598656, 1621900, 1644428, 1664462, 1681324, 1696020, 1710153, 1724420, 1737946, 1748900, 1755938, 1759135, 1759361, 1756968, 1751575, 1742982, 1731453, 1716926, 1698934, 1677878, 1655668, 1634329, 1614211, 1593945, 1571719, 1546326, 1517662, 1486919, 1455982, 1426105, 1397405]
60689A397405k7567k5918k4023k2984k2935k2609k1121j9154j7788j7148j6891
60678A159267j7063j7773j8706j9662k0872k2039k1828j9341j5660j2886j1773
60667I61664j1200j0023q546p840q188q765q681p917p155o883o922o755o062m847
60653H51880l357k116j742k316l151l509l416l352l493l719m146m905n576n608
60639H01474n322n635o656p380p108o475o519p298p881p418n878m013k829k779
60625G18283l324l577l393l238l024j948J28J993K401J514M61J7L11J191K062
60610G09857J923O18l93L30J920J986j37k342k590j461p27n03M29J999K562J637
60594G15108J124K707N286O499N969N421N840O285N883N443O100P419P909O899
$$ y = [1397405, 1369838, 1343920, 1319897, 1296913, 1273978, 1251369, 1230248, 1211094, 1193306, 1176158, 1159267, 1142204, 1124431, 1105725, 1086063, 1065191, 1043152, 1021324, 1001983, 986323, 973437, 961664, 950464, 940441, 931895, 924055, 915867, 907102, 898421, 890504, 883349, 876466, 869544, 862789, 856727, 851880, 848523, 846407, 844665, 842349, 839198, 835689, 832273, 828921, 825428, 821709, 817563, 812658, 807082, 801474, 796152, 790517, 783861, 776481, 769373, 762898, 756379, 749081, 741200, 733782, 727904, 723891, 721062, 718283, 714959, 711382, 707989, 704751, 701727, 699779, 699907, 701900, 704301, 705815, 706276, 706293, 706604, 707795, 709857, 711780, 712398, 712005, 712335, 714255, 716241, 716104, 713762, 711172, 709711, 708984, 708481, 708910, 710909, 713471, 715108, 716232, 718939, 724225, 730724, 736693, 742114, 747954, 754239, 760122, 765565, 771665, 779084, 786993, 793892]
60580G93892M972K980J474Q05Q02N37q16k761l857l343j882o63l39q55j743k402
60564G86801k547k476k598k831k935l192m042n051n162m090k711j728q59J10L55
60549G47044r53l036m069l325j927j260j517k141k926l810m119l097j215M5P2
60534G13766j51L37J074J281J441K326L100K178jj012J07J409J072K10R35L007
60518G31079M482M848N264N923N591M263M115O761J1007J4509J6476J7604J8202
60505H50124J7846J6536J5012J3710J2180R752O391K759l82k758m626o199p142
60492I23203o876n300k979o89R23J542J684K812O088J0721J4329J5355J4654J4277
60478I89744J5109J6199J6128J4496J1980R305O490L174m46l358m586m130k890
$$ y = [793892, 798864, 801844, 803318, 804123, 804925, 805462, 804646, 801885, 798028, 794685, 792803, 792140, 791801, 790946, 789203, 786801, 784254, 781778, 779180, 776349, 773414, 770222, 766180, 761129, 755967, 751877, 749166, 747438, 746579, 746689, 747044, 746091, 743055, 738986, 735661, 733734, 732474, 730957, 728816, 725890, 722080, 717961, 714864, 713649, 713694, 713766, 713615, 713952, 715026, 716307, 717748, 720074, 723174, 725352, 725351, 724339, 724446, 725855, 726927, 727137, 728072, 731079, 735561, 740409, 745673, 751596, 757187, 761450, 765565, 772326, 783333, 797842, 814318, 831922, 850124, 867970, 884506, 899518, 913228, 925408, 935160, 941551, 944310, 943928, 941170, 936544, 930345, 923203, 916327, 911027, 908048, 907359, 908282, 909824, 911508, 914320, 920408, 931129, 945458, 960813, 975467, 989744, 1004853, 1021052, 1037180, 1051676, 1063656, 1072961, 1079451, 1082625, 1082179, 1078821, 1074235, 1070105, 1067215]
60465A067215j860j429j082J69K506M349L724J030p73L42K840L777K699J721K301
60450A087529L833N356O801Q213R367J0668J3059J6586K0290K3844K8018L3117
60438A266681L8357M3211M7903N2078N4477N4626N3391N1026M6146L7577K5899
60427A771372J2239k947j8753l3008m4068n2201n7955o0545n9514n6647n4175
60416A343798n1941m8379m3642l9599l6996l4661l1656k8443k5710k3529k1913
60405I57329k0928k0059j8630j6780j5029j3126j0715q742q520r431r360p643
60393G98366n879n415n766o120o633p294p123n701m268m042m354l789k398j480
60379G28104j541j800j621j363j622k408l277l793l710k988j884q93n48j076k029
$$ y = [1067215, 1065355, 1063926, 1062844, 1063013, 1065519, 1069868, 1073592, 1074622, 1073849, 1074191, 1077031, 1080808, 1083507, 1085228, 1087529, 1091362, 1096718, 1103519, 1111732, 1121099, 1131767, 1144826, 1161412, 1181702, 1205546, 1233564, 1266681, 1305038, 1348249, 1396152, 1448230, 1502707, 1557333, 1610724, 1661750, 1707896, 1745473, 1771372, 1783611, 1780664, 1761911, 1728903, 1684835, 1632634, 1574679, 1514134, 1454620, 1397973, 1343798, 1291857, 1243478, 1199836, 1160237, 1123241, 1088580, 1056924, 1028481, 1002771, 979242, 957329, 936401, 916342, 897712, 880932, 865903, 852777, 842062, 833320, 824800, 815369, 806009, 798366, 792487, 787072, 781306, 775186, 768553, 761259, 754136, 748435, 744167, 740125, 735771, 731982, 729584, 728104, 726563, 724763, 723142, 721779, 720157, 717749, 714472, 710679, 706969, 703981, 702097, 701204, 700656, 699580, 697551]
60364F97551k326j125J167L019L168J765J32m95L2P86R29P74J380K910M133M085
60348G17885L432L267L284K439J033M02N99J42j390k241r46J348K326J423J14
60333G33117k09N35J734K900L817M490M926M817L825K479K095L158M446M563L780
60318G80473L377L582L349K144Q88Q39K172L931M851M168K208L60m4J023K443
60303H15764L316L651L753L637L372L413M143N353O472P147P396P432P600Q237
60289H90686R302J0321J0909J1254J1787J2443J2500J1232Q554M981J093k722
60277I92340o098q517r574r456q905q506q136p257n796m433l923m260m614m190
60263H98675l065k155k209k811k664j071J094K322K287K152K899M101M904N648
$$ y = [697551, 695225, 694100, 695267, 698286, 701454, 703219, 703351, 702856, 702888, 703674, 704603, 705377, 706757, 709667, 713800, 717885, 721317, 724584, 727868, 730307, 731340, 731742, 732341, 732483, 731093, 728852, 727906, 729254, 731580, 733003, 733117, 732908, 733443, 735177, 738077, 741894, 746384, 751310, 756127, 759952, 762431, 764526, 767684, 772130, 776693, 780473, 783850, 787432, 790781, 792925, 793813, 794652, 796824, 800755, 805606, 809774, 811982, 812342, 812298, 813321, 815764, 819080, 822731, 826484, 830121, 833493, 836906, 841049, 846402, 852874, 860021, 867417, 874849, 882449, 890686, 899988, 910309, 921218, 932472, 944259, 956702, 969202, 980434, 988988, 993969, 995062, 992340, 986242, 977725, 968151, 958695, 949790, 941284, 933148, 925891, 920095, 915662, 911739, 907479, 902865, 898675, 895610, 893455, 891246, 888435, 885771, 884700, 885794, 888116, 890403, 892555, 895454, 899555, 904459, 910107]
60249I10107P508J0625J3638J5435J6580J8509K1786K5610K8463K8765K5568J9483
60237A142077J2654O921K220k549p491j1503j3877j4914j4988j4245j3397j3504
60225A057404j4453j4883j4212j3610j4072j4728j4148j2385j0548r156q231q225
60213I08753r224r743q125n206l794n116p315q061p237o240n841n889o266o888
60199H13808p158o456n108l988l213k017r2J637K002J021j12l99P8O96J289K102
60183G94090L014L460L279K984K972L072L219L780M644M736L437J945K013L585
60169H40230M813M421K958J566O60K46M72J280K150K709L019L040K492J695J771
60154H73522L369N680P419Q322R059R963J0480R948Q483O967O307O666P404P850
$$ y = [910107, 917615, 928240, 941878, 957313, 973893, 992402, 1014188, 1039798, 1068261, 1097026, 1122594, 1142077, 1154731, 1161652, 1163872, 1161323, 1153832, 1142329, 1128452, 1113538, 1098550, 1084305, 1070908, 1057404, 1042951, 1028068, 1013856, 1000246, 986174, 971446, 957298, 944913, 934365, 925209, 916978, 908753, 899529, 889786, 881661, 876455, 872661, 867545, 860230, 852169, 844932, 838692, 832851, 826962, 820696, 813808, 806650, 800194, 795086, 791098, 787885, 785868, 785776, 787413, 789415, 790436, 790324, 789925, 790003, 790699, 791988, 794090, 797104, 800564, 803843, 806827, 809799, 812871, 816090, 819870, 824514, 829250, 832687, 834632, 836645, 840230, 845043, 849464, 852422, 853988, 854648, 854894, 855366, 856646, 858796, 861505, 864524, 867564, 870056, 871751, 873522, 876891, 882571, 889990, 898312, 907371, 917334, 927814, 937762, 946245, 953212, 959519, 966185, 973589, 981439]
60140I81439Q023Q317Q734Q931Q933R157R573R441Q179O096M034K578J734J076
60126A076245J66r14j576j646k046l815o492q346q345p244o472o614p194p404
60112A008303o722n320l988l360l296l482m222n650o539n246k015J041K522L044
60098I65070L506L525K544J317J092K015L223M046M323M121L728L488L211K531
60084A007740K136L424O347Q826R314Q735Q765R343R392Q951Q928R311R321Q985
60070A119518Q896Q692P375N083L055J835J024P41J581K794K391j12k416k085
60056A158372M90K695K676Q79r62j538q01L23R28R18P26N36K35j01l24o95j554
60039A162803k526k844k531k396k773l106l078l162l569l552k448q30J28J11j22
$$ y = [981439, 989462, 997779, 1006513, 1015444, 1024377, 1033534, 1043107, 1052548, 1060727, 1066823, 1070857, 1073435, 1075169, 1076245, 1076411, 1075497, 1073921, 1072275, 1070229, 1066414, 1059922, 1051576, 1043231, 1035987, 1029515, 1022901, 1015707, 1008303, 1001581, 996261, 992273, 988913, 985617, 982135, 977913, 972263, 965724, 960478, 958463, 959504, 962026, 965070, 968576, 972101, 974645, 975962, 977054, 979069, 982292, 986338, 990661, 994782, 998510, 1001998, 1005209, 1007740, 1009876, 1013300, 1019647, 1028473, 1037787, 1046522, 1055287, 1064630, 1074022, 1082973, 1091901, 1101212, 1110533, 1119518, 1128414, 1137106, 1144481, 1149564, 1152619, 1154454, 1155478, 1156219, 1157800, 1160594, 1162985, 1162873, 1160457, 1158372, 1158862, 1161557, 1164233, 1165112, 1164150, 1162612, 1161811, 1162134, 1163062, 1163980, 1164706, 1165242, 1165477, 1165376, 1165052, 1164357, 1162803, 1160277, 1157433, 1154902, 1152506, 1149733, 1146627, 1143549, 1140387, 1136818, 1133266, 1130818, 1129988, 1130116, 1130227, 1130105]
60024A130105K21J272K678L982M784M820M087K974K156K134K532K227O08j592
60010A162988l355m953p428j0548j2580j2635j2141j2949j4714j5333j3789j1461
59998A031102j0354j0896j1852j1884j0651q632o389m158k033l41L24l14j598
59985I52324k113q55J691L922M729M597M940O536Q908J0942J1602J0235P035L420
59971A027913J241J111J817J695J41k385n150p383q381q119p513p532q313r506
59957I69636j0963j2520j3618j3860j3453j2575j0908q616o970o882p344o673
59945H45254m973l863l969m255l921l287k363k83K913N383N601M456M006M750
59931H45449N348M754L548K996L563M600N123M754L991L572L690M070M551N099
$$ y = [1130105, 1130326, 1131598, 1134276, 1138258, 1143042, 1147862, 1151949, 1154923, 1157079, 1159213, 1161745, 1163972, 1164580, 1162988, 1159633, 1154680, 1147252, 1136704, 1124124, 1111489, 1099348, 1086399, 1071685, 1056352, 1042563, 1031102, 1020748, 1009852, 998000, 986116, 975465, 966833, 960444, 956286, 954253, 953912, 954236, 953922, 952324, 950211, 949356, 951047, 954969, 959698, 964295, 969235, 975771, 984679, 995621, 1007223, 1017458, 1024493, 1027913, 1029154, 1030265, 1032082, 1033777, 1033918, 1031533, 1026383, 1019000, 1010619, 1002500, 994987, 987455, 979142, 969636, 958673, 946153, 932535, 918675, 905222, 892647, 881739, 873123, 866153, 859271, 851927, 845254, 840281, 836418, 832449, 828194, 824273, 820986, 818623, 818340, 821253, 826636, 832237, 836693, 840699, 845449, 850797, 855551, 859099, 862095, 865658, 870258, 875381, 880135, 884126, 887698, 891388, 895458, 900009, 905108]
59917I05108N310M597K996J154m98j927k858k928k533k584l006k632j071L88N39
59902I00055p4k42M2m9n31n88M8Q87J643K317K352J016j099k053p52J467K140
59885I06579L53k398l890l317j673k87N53J323J962J599k56k806m672n192m697
59870H83181l900l398l475l868l933l359k485j629n35R75K207K214J160K99M62
59855H63916J142J328Q72O69J534L169M382M407L752L496L903M378M707N422O578
59840I13655P178O542N512N322N791N766N015M481M687N034M969M795M930N245
59826I88922N536N946O493O877P182P983R218R721Q660O937O155O565O873O027
59812A089095M185J896p05l355n098n128l994l275l930n366o335o357n954n626
$$ y = [905108, 910418, 915015, 918011, 919165, 918667, 916740, 913882, 910954, 908421, 905837, 902831, 900199, 899128, 899516, 900055, 899981, 899739, 899781, 899732, 899201, 898613, 898661, 899548, 901191, 903508, 905860, 906876, 905777, 903724, 902972, 904439, 906579, 906932, 904534, 900644, 897327, 895654, 895367, 895920, 897243, 899205, 900804, 900548, 897742, 893070, 887878, 883181, 879281, 875883, 872408, 868540, 864607, 861248, 858763, 857134, 856599, 857574, 859781, 861995, 863155, 863454, 863916, 865058, 866386, 867258, 867927, 869461, 872630, 877012, 881419, 885171, 888667, 892570, 896948, 901655, 907077, 913655, 920833, 927375, 932887, 938209, 944000, 949766, 954781, 959262, 963949, 968983, 973952, 978747, 983677, 988922, 994458, 1000404, 1006897, 1013774, 1020956, 1028939, 1038157, 1047878, 1056538, 1063475, 1069630, 1076195, 1083068, 1089095, 1093280, 1095176, 1094471, 1091116, 1086018, 1080890, 1076896, 1073621, 1069691, 1064325, 1057990, 1051633, 1045679, 1040053]
59798A040053n108l827j751N27K464L950N035N747O387P512R057R736Q079M317
59784A092178O19j074r98p92j150j156m7J364J610K85j907m360o927r140j0058
59769A058447r174o951m295j993p94j233k964m826o061o954p821q200p837p784
59755I81560r241j1438j2075j0246p736o795p448p939p253o124n652n777n480
59742H78356m034j867j80K16l13r24j678l399n885p290o445m912n063o463o194
59727H23925l207k25K0j436j625r5R23K79o35n03M2Ok94k28q2j12M05J964L535
59708H22657L803K993K260J985J853K005K695L297L055K546K942M099M750M522
59694H65462M302M592N009N554O800Q467R329R122R037R587R442P453M699L281
$$ y = [1040053, 1034945, 1031118, 1029367, 1029894, 1032358, 1036308, 1041343, 1047090, 1053477, 1060989, 1070046, 1079782, 1087861, 1092178, 1092797, 1091723, 1090725, 1089933, 1088783, 1087627, 1087580, 1088944, 1090554, 1090839, 1088932, 1084572, 1077645, 1068505, 1058447, 1049273, 1042322, 1038027, 1036034, 1035240, 1034007, 1031043, 1026217, 1020156, 1013202, 1005381, 997181, 989344, 981560, 972319, 960881, 948806, 938560, 930824, 924029, 916581, 908642, 901389, 895265, 889613, 883836, 878356, 874322, 872455, 872275, 872491, 872178, 871254, 869576, 866177, 860292, 853002, 846557, 841645, 836582, 830119, 823925, 820718, 820493, 820513, 819077, 817452, 817357, 818280, 818559, 817924, 817421, 817463, 817469, 817175, 816947, 816865, 816753, 817158, 819122, 822657, 826460, 829453, 831713, 833698, 835551, 837556, 840251, 843548, 846603, 849149, 852091, 856190, 860940, 865462, 869764, 874356, 879365, 884919, 891719, 900186, 909515, 918637, 927674, 937261, 946703, 954156, 958855, 962136]
59680I62136L870N429O643O655N132K782J249J431K287K228J230N07M51K16o88
59665A001558j478j084N86K523L381K496O76l15L32J389J126l98j465q96P61K256
59649A011448K890K680K119J928K370K670J845O9j497k301k788l148k827j770
59635A013688r86j113j291m03J281K634L231L279K515M69k136l584l115j807j111
59620A011551j264j595j624j345j009j199k509m530n788n426m477m443n158n270
59606I65914m636m657n887o898o394n134m563m484l584j790m30j29J2P71J615
59591I19726J783J508J457J593J420R11N37M68L80l1o04q97o21L3M74K56m15r06
59573I27072q85n86m46o36r52r14k25O98J007N80L09O78O37r94l425m537l604
$$ y = [962136, 966006, 971435, 978078, 984733, 989865, 992647, 993896, 995327, 997614, 999842, 1001072, 1001579, 1002030, 1002246, 1001558, 1000080, 998996, 999582, 1002105, 1005486, 1007982, 1008658, 1008343, 1008675, 1010064, 1011190, 1010792, 1009327, 1008431, 1009192, 1011448, 1014338, 1017018, 1019137, 1021065, 1023435, 1026105, 1027950, 1028019, 1026522, 1024221, 1021433, 1018285, 1015458, 1013688, 1012702, 1011589, 1010298, 1009895, 1011176, 1013810, 1017041, 1020320, 1022835, 1023304, 1021168, 1017584, 1014469, 1012662, 1011551, 1010287, 1008692, 1007068, 1005723, 1004714, 1003515, 1001006, 996476, 990688, 985262, 980785, 976342, 971184, 965914, 961278, 956621, 950734, 943836, 937442, 932308, 927745, 923261, 919677, 917887, 917457, 917328, 917340, 918111, 919726, 921509, 923017, 924474, 926067, 927487, 928398, 928935, 929403, 929783, 929752, 929148, 928251, 927630, 927663, 928137, 928393, 927978, 927072, 926187, 925601, 925155, 924519, 923567, 922653, 922428, 923126, 924133, 924713, 925022, 925700, 926337, 925343, 921918, 917381, 913777]
59556I13777j968q44O0J131J534L75j697l116l048j645O92L296N000M920L440
59541I21907J783Q03N61O35M03n58j834k386j868j166j108j396j398j247j322
59526I11809j375j159j271k206l052k478q23P6q14k684m245n061n294n080m656
59511H71687m343m016l066j260P26J919J946J206L58j42j34M74J773L380M187
59496H74695L351J675J112K457M439N681O445P433P881O463L740K032K678M683
59482I34765O482P823R454J1724J4191J6220J7418J7587J6368J3158P882J998
59470A075070k048l057k219j332o19O73K313L289L744M947P120Q775Q758P742
59456A113156O919O261M943K833P01q91k285m243o912r368j0559j0789j1633j3772
$$ y = [913777, 911809, 910965, 911025, 912156, 913690, 914065, 912368, 909252, 906204, 904559, 905251, 908547, 913547, 918467, 921907, 923690, 924493, 925054, 925689, 926092, 925534, 923700, 921314, 919446, 918280, 917172, 915776, 914378, 913131, 911809, 910434, 909275, 908004, 905798, 902746, 900268, 899445, 899521, 898707, 896023, 891778, 886717, 881423, 876343, 871687, 867344, 863328, 860262, 859002, 859728, 861647, 863593, 864799, 865157, 865015, 864881, 865355, 867128, 870508, 874695, 878046, 879721, 880833, 883290, 887729, 893410, 899855, 907288, 915169, 921632, 925372, 927404, 930082, 934765, 941247, 949070, 958524, 970248, 984439, 1000659, 1018077, 1035664, 1052032, 1065190, 1073072, 1075070, 1073022, 1069965, 1067746, 1066414, 1065795, 1066468, 1068781, 1072070, 1075814, 1080761, 1087881, 1096656, 1105414, 1113156, 1120075, 1126336, 1131279, 1134112, 1134813, 1133922, 1131637, 1127394, 1120482, 1111114, 1100555, 1089766, 1078133, 1064361]
59442A064361j5672j5406j3268j1328j0702j0603j0040q937p384n233l007j911
59430I50870k283k888k385o96J356K994L749L737L864M821N767N262L778L716
59416I81662O214R471J1186J1311J1106J0707R278O880M655L331K833L109M215
59403A075958N606O331O037N198M535M693O111Q450J0549J1689J2546J4126J6175
59390A188004J7668J8533J9720K1566K3123K3295K1632J7874J1781M080l227q320
59378A355729j1142j3110j5402j7816j9236j8944j7493j6240j5867j5519j3888
59367A181072j0950q000n785l458p9L660O328Q075J0689J5040J9794K3424K6243
59354A266053K9201L1814L3227L4576L7665M0790L8582K7708J1179m628j5776
$$ y = [1064361, 1048689, 1033283, 1020015, 1008687, 997985, 987382, 977342, 968405, 961021, 955788, 952781, 950870, 948587, 945699, 943314, 942618, 943974, 946968, 950717, 954454, 958318, 963139, 968906, 974168, 977946, 981662, 987876, 997347, 1008533, 1019844, 1030950, 1041657, 1050935, 1057815, 1062470, 1065801, 1068634, 1071743, 1075958, 1081564, 1087895, 1093932, 1099130, 1103665, 1108358, 1114469, 1122919, 1133468, 1145157, 1157703, 1171829, 1188004, 1205672, 1224205, 1243925, 1265491, 1288614, 1311909, 1333541, 1351415, 1363196, 1367276, 1364049, 1355729, 1344587, 1331477, 1316075, 1298259, 1279023, 1260079, 1242586, 1226346, 1210479, 1194960, 1181072, 1170122, 1162122, 1156337, 1152879, 1152800, 1156460, 1162788, 1170863, 1181552, 1196592, 1216386, 1239810, 1266053, 1295254, 1327068, 1360295, 1394871, 1432536, 1473326, 1511908, 1539616, 1550795, 1546167, 1530391]
59343A530391k2039k4178k2764j9164j4943j0088m084R61Q16o245j7110k7049
59331A364504l3701l7070l7525l5537l2328k9141k6208k3286k0531j8148j5914
59320A055115j3754j2016j0602q793o668n557o094o833n907l266j82K545M683
59307I82671N759N623N362O212P906R158R413Q911P604N552M230N736J0205J5213
59293A089555J8272J9141J9259J9664K0108J9968J9510J9992K2403K6178K9636
59282A323686L1656L2363L2128L0859K8641K6099K3452K0118J5915J1581P327
59271A583825K061m710j1328j5846j8565k1085k3674k5578k7209k9570l1527l0372
59259A346422k5815k1162j9253j9117j8111j5757j3548j1989r992p032m125k220
$$ y = [1530391, 1508352, 1484174, 1461410, 1442246, 1427303, 1417215, 1413131, 1414092, 1414908, 1408663, 1391553, 1364504, 1330803, 1293733, 1256208, 1220671, 1188343, 1159202, 1132994, 1109708, 1089177, 1071029, 1055115, 1041361, 1029345, 1018743, 1009950, 1003282, 997725, 991631, 984798, 978891, 975625, 975443, 977988, 982671, 988430, 994053, 999415, 1005627, 1013533, 1022691, 1032104, 1041015, 1048619, 1054171, 1058401, 1064137, 1074342, 1089555, 1107827, 1126968, 1146227, 1165891, 1185999, 1205967, 1225477, 1245469, 1267872, 1294050, 1323686, 1355342, 1387705, 1419833, 1450692, 1479333, 1505432, 1528884, 1549002, 1564917, 1576498, 1583825, 1585886, 1581176, 1569848, 1554002, 1535437, 1514352, 1490678, 1465100, 1437891, 1408321, 1376794, 1346422, 1320607, 1299445, 1280192, 1261075, 1242964, 1227207, 1213659, 1201670, 1191678, 1184646, 1180521, 1178301]
59247A178301r64L94J813K961M303O791J0502J4160J6257J6176J3995R742L558
59234A277989l530r750j3848j5818j6313j5901j5055j4159j2966j0666p118l515
59222A139350j242m68m07m73m32J70J713L801N616O997Q595J0922J3787J6514
59208A204443J8308J8672J7968J7329J7422J7507J6268J3252R087M632N80k575
59196A352893m963p420j0468j3475j5524j6576j7060j6863j5760j4349j3464j3017
59184A193954j2416j1688j0972r458o334k506K42J668L047M762N778N770N823
59171A167670O382O270M775L046K295J956R46m42j320k003l505n878q340j0646
59157A161206j3032j5086j5960j5617j4839j4109j3398j2905j2918j2959j2061
$$ y = [1178301, 1177337, 1177731, 1179544, 1182505, 1186808, 1193599, 1204101, 1218261, 1234518, 1250694, 1264689, 1274431, 1277989, 1274459, 1264709, 1250861, 1235043, 1218730, 1202829, 1187774, 1173615, 1160649, 1149983, 1142865, 1139350, 1138108, 1137640, 1137233, 1136760, 1136328, 1136498, 1138211, 1142012, 1147628, 1154625, 1163220, 1174142, 1187929, 1204443, 1222751, 1241423, 1259391, 1276720, 1294142, 1311649, 1327917, 1341169, 1350256, 1354888, 1355468, 1352893, 1347930, 1340510, 1330042, 1316567, 1301043, 1284467, 1267407, 1250544, 1234784, 1220435, 1206971, 1193954, 1181538, 1169850, 1158878, 1149420, 1143086, 1140580, 1140822, 1142490, 1145537, 1150299, 1156077, 1161847, 1167670, 1174052, 1180322, 1185097, 1188143, 1190438, 1192394, 1193340, 1192898, 1191578, 1189575, 1186070, 1180192, 1171852, 1161206, 1148174, 1133088, 1117128, 1101511, 1086672, 1072563, 1059165, 1046260, 1033342, 1020383, 1008322]
59146A008322j0108p975o231m644l257k793l304l317j391J780L966M140L626M168
59132I82982N697O785O799O463O372O085N187M331M383N108N570N500N273M790
59118A061325L511J792J034J984L766N144O047P099Q324R215R823J0680J1752
59105A141496J2369J2472J2975J4400J5771J5740J4380J2917J1730R772O423K819
59093A283264L75j316l798p231r974j0962j1114j1798j2940j3528j3187j2327
59081A175464j1311j0482j0499j1657j3018j3127j1564r187p059n806n670o313
59069A059771o583n408l066r34N0J83K58P20J686L265N550Q323J0869J2191J1879
59054A098754J0768J0246J0695J1305J1570J1968J2632J2521J0895Q734P551P469
$$ y = [1008322, 998214, 990239, 984008, 979364, 976107, 973314, 970010, 966693, 965302, 967082, 971048, 975188, 978814, 982982, 988679, 995464, 1002263, 1008726, 1015098, 1021183, 1026370, 1030701, 1035084, 1040192, 1045762, 1051262, 1056535, 1061325, 1064836, 1066628, 1067662, 1069646, 1073412, 1078556, 1084603, 1091702, 1100026, 1109241, 1119064, 1129744, 1141496, 1153865, 1166337, 1179312, 1193712, 1209483, 1225223, 1239603, 1252520, 1264250, 1274022, 1280445, 1283264, 1283639, 1282323, 1278525, 1271294, 1261320, 1250358, 1239244, 1227446, 1214506, 1200978, 1187791, 1175464, 1164153, 1153671, 1143172, 1131515, 1118497, 1105370, 1093806, 1084619, 1077560, 1071754, 1066084, 1059771, 1053188, 1047780, 1044714, 1043780, 1043830, 1044013, 1044271, 1044991, 1046677, 1049942, 1055492, 1063815, 1074684, 1086875, 1098754, 1109522, 1119768, 1130463, 1141768, 1153338, 1165306, 1177938, 1190459, 1201354, 1210088, 1217639, 1225108]
59042A225108P532P308O985O394N185L551J834j38k223l362l027k463k948l574
59028A246162k663p55p6j267k739l306l401l586l931n056p683j0727j1949j1102
59014A177921j0390j1141j2090j1753j0568r579q907q540q906r553r008p082n637
59001A054767n841o443o052n230m751l735j514L03j86k248l707l962l728k859
58987A004814q43J171J383J74l19N47J255Q43J79J23L15M46J103K453L463L331
58971A020438K791L114M431N720O162O027O324P687R609J1033J1816J2914J4719
58958A122785J6107J6103J5671J6367J7750J7624J4922J0795O667K791o75k589
58946A254318k138n20N2r19j453N14M526Q092R642J0103J1032J2030J1423R284
$$ y = [1225108, 1232640, 1239948, 1246933, 1253327, 1258512, 1262063, 1263897, 1263759, 1261536, 1258174, 1255147, 1252684, 1249736, 1246162, 1243499, 1242744, 1242668, 1241401, 1238662, 1235356, 1231955, 1228369, 1224438, 1219382, 1211699, 1200972, 1189023, 1177921, 1167531, 1156390, 1144300, 1132547, 1121979, 1112400, 1103493, 1094953, 1086047, 1076494, 1067486, 1060404, 1054767, 1048926, 1042483, 1036431, 1031201, 1026450, 1022715, 1021201, 1021504, 1021318, 1019070, 1015363, 1011401, 1007673, 1004814, 1003971, 1005142, 1006525, 1006699, 1006380, 1006927, 1008182, 1009025, 1009204, 1009327, 1009642, 1010088, 1011191, 1013644, 1017107, 1020438, 1023229, 1026343, 1030774, 1036494, 1042656, 1048683, 1055007, 1062694, 1072303, 1083336, 1095152, 1108066, 1122785, 1138892, 1154995, 1170666, 1187033, 1204783, 1222407, 1237329, 1248124, 1254791, 1257582, 1256907, 1254318, 1252180, 1251660, 1251712, 1250793, 1249340, 1249854, 1254380, 1262472, 1272114, 1282217, 1293249, 1305279, 1316702, 1325986]
58932A325986P999R111J1045J1180R272P396P018P452P088N085J766j854m836
58919A403708o920q255q432o649l399p79j35j93J066L516N413O332P703J0376
58905A403352J3244J4777J4713J3909J3459J4126J5612J6249J4558J1190Q174
58894A553363O051L278j039n469q439j0828j4684j9871k3796k4695k3821k3550
58882A406500k4203k3866k1191j7226j4040j2437j1837j1750j2078j2154j0884
58871A234834q309n793m174k885j538r75j679k368j740o72q73j997k060o06O69
58856A199834Q03J082K727M653M974L832L267M543O783Q419R124R813J1220J3084
58842A284158J4847J6451J8057J9324J9754J9628J9772K0278K0396J9945J9806
$$ y = [1325986, 1333985, 1343096, 1354141, 1365321, 1374593, 1381989, 1389007, 1396459, 1403547, 1408632, 1410398, 1408544, 1403708, 1396788, 1388533, 1380101, 1373452, 1370053, 1369274, 1369139, 1368946, 1370012, 1373528, 1378941, 1385273, 1392976, 1403352, 1416596, 1431373, 1446086, 1459995, 1473454, 1487580, 1503192, 1519441, 1533999, 1545189, 1553363, 1559414, 1562692, 1561653, 1556184, 1547745, 1536917, 1522233, 1502362, 1478566, 1453871, 1430050, 1406500, 1382297, 1358431, 1337240, 1320014, 1305974, 1293537, 1281700, 1269950, 1257872, 1245718, 1234834, 1226525, 1220732, 1216558, 1213673, 1212135, 1211160, 1209481, 1207113, 1205373, 1204701, 1203828, 1201831, 1199771, 1199165, 1199834, 1200637, 1201719, 1204446, 1209099, 1214073, 1217905, 1221172, 1225715, 1232498, 1240917, 1250041, 1259854, 1271074, 1284158, 1299005, 1315456, 1333513, 1352837, 1372591, 1392219, 1411991, 1432269, 1452665, 1472610, 1492416]
58831A492416K0526K1439K1970K2767K4733K7702L1007L4421L7531L9069L8134
58820A811715L5433L2129K8193K3088J7272J1555N720p19p101j2736j8651k6086
58808A899812l3635l8230l9001l7943l6612l4568l1657k9349k8503k7879k6303
58797A536132k4813k4977k6279k6743k5531k3528k1840k0784k0189j9736j9102
58786A282610j8239j7324j6266j4710j2752j1038j0000r566r654j0116j0252r404
58774A133289q218q078r079r751r240q310p625o579m750l193k947l304k874j709
58760A047632r81j100j301q27N35K709N094O380N698L909K812L150M070M510M248
58745A086538L551K578J336k16k089l904m797m255l119l048m720o923p856p076
$$ y = [1492416, 1512942, 1534381, 1556351, 1579118, 1603851, 1631553, 1662560, 1696981, 1734512, 1773581, 1811715, 1847148, 1879277, 1907470, 1930558, 1947830, 1959385, 1965105, 1964386, 1957285, 1944549, 1925898, 1899812, 1866177, 1827947, 1788946, 1751003, 1714391, 1679823, 1648166, 1618817, 1590314, 1562435, 1536132, 1511319, 1486342, 1460063, 1433320, 1407789, 1384261, 1362421, 1341637, 1321448, 1301712, 1282610, 1264371, 1247047, 1230781, 1216071, 1203319, 1192281, 1182281, 1172715, 1163061, 1152945, 1142693, 1133289, 1125071, 1116993, 1107914, 1098163, 1088923, 1080613, 1072988, 1066409, 1061659, 1058466, 1055519, 1052215, 1049341, 1047632, 1046651, 1045551, 1044250, 1043423, 1043958, 1046667, 1051761, 1058141, 1063839, 1067748, 1070560, 1073710, 1077780, 1082290, 1086538, 1090089, 1092667, 1094003, 1093787, 1091698, 1087794, 1082997, 1078742, 1075623, 1072575, 1067855, 1060932, 1053076, 1046000]
58731A046000n794n274n352m895l402j537l5J168K320L093L181L076L408L835
58717A039792L678L268L575M512M853L927K255L06k049m440n726n578n227n737
58703A037409o459o171m952l812l067k250j323q29p70l41R52K550L591M019M564
58688A023111N775P345Q552R148R449R525Q860P238N511M849N434O597P802Q717
58674A127913Q664P201N301M701N831P338P931P714P363P144P297Q316J0000J1046
58660A233760J0459Q851P655P444P721P896P840P676P570P633P740P603P114O320
58646A343282N051L084O89j521l445n600q370j1591j4959j8159k0647k2021k2609
58633A223184k2935k2748k1521j9824j9003j9257j9259j8013j5964j3894j1899
$$ y = [1046000, 1040206, 1034932, 1029580, 1024685, 1021283, 1019746, 1019711, 1020879, 1023199, 1026292, 1029473, 1032549, 1035957, 1039792, 1043470, 1046738, 1050313, 1054825, 1059678, 1063605, 1065860, 1066166, 1064117, 1059677, 1053951, 1048373, 1043146, 1037409, 1030950, 1024779, 1019827, 1016015, 1012948, 1010698, 1009375, 1008546, 1007776, 1007435, 1008387, 1010937, 1014528, 1018547, 1023111, 1028886, 1036231, 1044783, 1053931, 1063380, 1072905, 1081765, 1089003, 1094514, 1099363, 1104797, 1111394, 1119196, 1127913, 1136577, 1143778, 1149079, 1153780, 1159611, 1166949, 1174880, 1182594, 1189957, 1197101, 1204398, 1212714, 1222714, 1233760, 1244219, 1253070, 1260725, 1268169, 1275890, 1283786, 1291626, 1299302, 1306872, 1314505, 1322245, 1329848, 1336962, 1343282, 1348333, 1351417, 1352106, 1350585, 1347140, 1341540, 1333170, 1321579, 1306620, 1288461, 1267814, 1245793, 1223184, 1200249, 1177501, 1155980, 1136156, 1117153, 1097896, 1078637, 1060624, 1044660, 1030766, 1018867]
58622A018867j0026q848q613q653q314p811p637p735p652o910n096k305M90K317
58608I32074L435M623N576N523N284O776J0123J3220J4649J4999J4655J2608Q809
58595A052354N403L943L148J302q18j489j029j056j850k704l907o089q235q696
58581A030277p791p245p340o773n225l866l172k243n93J165K751M627O619P692
58567A008883P589P168O745N594L681K291K225K707K987L756N886Q605J0191J0069
58553A088377R343R475J0998J3313J5150J5442J4025J1585Q848O157L821K283
58541A208817J526P14j105l839o222p056o541o077o621p485p214n457l356k051
58527A148033j563j167j63J958N214Q675J1051J2158J3009J4093J4596J3943J3001
$$ y = [1018867, 1008841, 999993, 991380, 982727, 974413, 966602, 958965, 951230, 943578, 936668, 931572, 929267, 929757, 932074, 935509, 940132, 945708, 951231, 956515, 963291, 973414, 986634, 1001283, 1016282, 1030937, 1043545, 1052354, 1057757, 1061700, 1064848, 1066150, 1065332, 1063843, 1062814, 1061758, 1059908, 1057204, 1053297, 1047208, 1038973, 1030277, 1022486, 1015241, 1007901, 1001128, 995903, 992037, 988865, 986622, 986029, 987194, 989945, 994572, 1001191, 1008883, 1016472, 1023640, 1030385, 1035979, 1039660, 1041951, 1044176, 1046883, 1049870, 1053626, 1059512, 1068117, 1078308, 1088377, 1097720, 1107195, 1118193, 1131506, 1146656, 1162098, 1176123, 1187708, 1196556, 1202713, 1206534, 1208817, 1210343, 1211057, 1209952, 1206113, 1199891, 1192835, 1186294, 1180217, 1173596, 1166111, 1158897, 1153440, 1150084, 1148033, 1146470, 1145303, 1145140, 1147098, 1152312, 1160987, 1172038, 1184196, 1197205, 1211298, 1225894, 1239837, 1252838]
58514A252838J2824J3082J2816J2037J1559J1756J2480J3671J5107J6121J6592
58503A400883J7605K0096K3307K5703K7024K8216K9690L0756L0678K9224K6252
58492A689434K1800J6565J1459O743K267j749m908p361r459j0860j0956r981q956
58479A684038q675r505j1870j5924k0746k4673k6698k7075k6657k6094k5558k4780
58467A435783k3314k0992j8005j4580j0973p651m823k054P59K344J590LN16L327
58453A341930N146L657N39j429k083k654k853j785m69q01k670m448n605o583o839
58438A313053n587l981l961n036m905l276k516m003o193p060o396m908k872n79
58424A251780J259K422L503M903O396P810R087R813R902J0522J2878J6160J8243
$$ y = [1252838, 1265662, 1278744, 1291560, 1303597, 1315156, 1326912, 1339392, 1353063, 1368170, 1384291, 1400883, 1418488, 1438584, 1461891, 1487594, 1514618, 1542834, 1572524, 1603280, 1633958, 1663182, 1689434, 1711234, 1727799, 1739258, 1746001, 1748268, 1746519, 1741611, 1734250, 1724791, 1713931, 1702975, 1692994, 1684038, 1675363, 1665858, 1653988, 1638064, 1617318, 1592645, 1565947, 1538872, 1512215, 1486121, 1460563, 1435783, 1412469, 1391477, 1373472, 1358892, 1347919, 1340268, 1335445, 1333391, 1334150, 1336494, 1338084, 1338087, 1338603, 1341930, 1347076, 1350733, 1351272, 1349843, 1347760, 1345106, 1342253, 1340468, 1339999, 1339198, 1336528, 1332080, 1326475, 1319892, 1313053, 1307466, 1303485, 1299524, 1294488, 1289583, 1286307, 1283791, 1279788, 1273595, 1266535, 1260139, 1255231, 1252359, 1251780, 1253039, 1255461, 1258964, 1263867, 1270263, 1278073, 1287160, 1296973, 1306875, 1317397, 1330275, 1346435, 1364678]
58411A364678J8294J7143J5231J2087P969M126R54k429o338r669j1261j0860q581
58398A391344m877j150J067J763K145K867L975O036R233J1572J0427O289K713
58385A443404J868K214J278j302m381p070q764q946p951o797n685l941j689pJ006
58370A393237K412M288N339N310N671P017P979P981Q863J1913J5090J5395J2977
58357A503472J0685J0053R682P630L979N09j435k300l560n649p235p072n951n729
58343A507079o826q135r127j0301j1388j0948q449n299l144k191j696r97K25J748
58329A430551K657K396J855K162K675J880Rj088p01J27Q31J941L226L485K796
58314A454802K770L876M639M265L933M607N648O576Q108J0370J2058J2660J3641
$$ y = [1364678, 1382972, 1400115, 1415346, 1427433, 1435402, 1439528, 1440482, 1438053, 1431715, 1422046, 1410785, 1399925, 1391344, 1386467, 1385317, 1386384, 1388147, 1390292, 1393159, 1397134, 1403170, 1412403, 1423975, 1434402, 1440691, 1443404, 1445272, 1447486, 1448764, 1447462, 1443081, 1436011, 1427247, 1418301, 1410350, 1403553, 1397868, 1393927, 1392238, 1392231, 1393237, 1395649, 1399937, 1405276, 1410586, 1416257, 1423274, 1431253, 1439234, 1448097, 1460010, 1475100, 1490495, 1503472, 1514157, 1524210, 1533892, 1541522, 1545501, 1546010, 1544575, 1542275, 1538715, 1533066, 1525831, 1518759, 1512808, 1507079, 1500253, 1492118, 1482991, 1472690, 1461302, 1450354, 1441905, 1436606, 1433462, 1431271, 1429575, 1428578, 1428803, 1430551, 1433208, 1435604, 1437459, 1439621, 1442296, 1444176, 1444185, 1443097, 1442396, 1442523, 1443354, 1445295, 1448521, 1452006, 1454802, 1457572, 1461448, 1466087, 1470352, 1474285, 1478892, 1484540, 1491116, 1499224, 1509594, 1521652, 1534312, 1547953]
58301A547953J6167J9306K1602K2784K2961K1862K0065J9165J9481J9264J7286
58290A767896J4567J2448J0740R013P881P638P327O576O690Q442J0372J0890J0642
58277A891122J1221J2726J4127J5078J6053J7397J9224K1367K2853K2630K1358
58266B085156K0988K2002K2724K1962K0567J9527J8454J7051J6253J6686J7487
58255B298857J7765J7885J8356J8815J8893J8839J8759J8571J8925K0583K2938
58244B509186K4874K6851K9882L2962L4332L4902L7070M0194M1112L9470L8464
58233B889299L9516M0506M0409M1229M3738M5589M5779M6729M9730N2377N3058
58222C387959N3798N6023N7641N7461N8475O3152O9074P2861P5224P8602Q2828
$$ y = [1547953, 1564120, 1583426, 1605028, 1627812, 1650773, 1672635, 1692700, 1711865, 1731346, 1750610, 1767896, 1782463, 1794911, 1805651, 1814664, 1822545, 1830183, 1837510, 1844086, 1850776, 1859218, 1869590, 1880480, 1891122, 1902343, 1915069, 1929196, 1944274, 1960327, 1977724, 1996948, 2018315, 2041168, 2063798, 2085156, 2106144, 2128146, 2150870, 2172832, 2193399, 2212926, 2231380, 2248431, 2264684, 2281370, 2298857, 2316622, 2334507, 2352863, 2371678, 2390571, 2409410, 2428169, 2446740, 2465665, 2486248, 2509186, 2534060, 2560911, 2590793, 2623755, 2658087, 2692989, 2730059, 2770253, 2811365, 2850835, 2889299, 2928815, 2969321, 3009730, 3050959, 3094697, 3140286, 3186065, 3232794, 3282524, 3334901, 3387959, 3441757, 3497780, 3555421, 3612882, 3671357, 3734509, 3803583, 3876444, 3951668, 4030270, 4113098]
58211D113098Q6670R0793R5690R9553J01399J03596J08024J12742J15748J18843
58201E146156J24342J31035J37015J43556J52436J62188J70496J77657J84507
58192F529388J90037J94306K00536K10860K23094K34724K46653K60126K74234
58183H563958K89584L09703L35116L60866L83849M07516M35189M64434M92907
58174A2043122N23774N59660N97107O33209O71991P17444P65879Q12468Q59986
58165A8184640R13672R72554J033279J097261J166172J235792J302309J369519
58157B7275198J442283J519220J600277J694361J810017J945332K096385K267565
58149D1650638K462805K675591K900565L147262L430056L753736M122749M554367
$$ y = [4113098, 4199768, 4290561, 4386251, 4485804, 4587203, 4690799, 4798823, 4911565, 5027313, 5146156, 5270498, 5401533, 5538548, 5682104, 5834540, 5996728, 6167224, 6344881, 6529388, 6719425, 6913731, 7114267, 7325127, 7548221, 7782945, 8029598, 8289724, 8563958, 8853542, 9163245, 9498361, 9859227, 10243076, 10650592, 11085781, 11550215, 12043122, 12566896, 13126556, 13723663, 14356872, 15028863, 15746307, 16512186, 17324654, 18184640, 19098312, 20070866, 21104145, 22201406, 23367578, 24603370, 25905679, 27275198, 28717481, 30236701, 31836978, 33531339, 35341356, 37286688, 39383073, 41650638, 44113443, 46789034, 49689599, 52836861, 56266917, 60020653, 64143402, 68697769]
58141F8697769N067226N667882O365910P190482Q173323R328661J0669261J2222419
58133A33382933J4000942J5973501J8090017K0316209K2626583K5020933K7574510
58126B76985628L0295137L2645930L3171929K9964129K1971993J0086918l105622
58119D32016042j4754329k3111106k7882082k9708887k9512166k8122749k6154463
58112B52770260k3982542k1794245j9678344j7684499j5837804j4148690j2626622
58105A27017514j1274853j0077290r007889q051429p202832o452226n785428n195131
58097F3970436m677989m223802l819576l461001l148709k876322k632443k411588
58089C6719006k213491k034653j869773j718896j584499j464020j352824j251491
$$ y = [68697769, 73764995, 79432877, 85798787, 92989269, 101162592, 110491253, 121160514, 133382933, 147383875, 163357376, 181447393, 201763602, 224390185, 249411118, 276985628, 307280765, 339926695, 373098624, 403062753, 425034746, 435121664, 432016042, 417261713, 394150607, 366268525, 336559638, 307047472, 278924723, 252770260, 228787718, 206993473, 187315129, 169630630, 153792826, 139644136, 127017514, 115742661, 105665371, 96657482, 88606053, 81403221, 74950995, 69165567, 63970436, 59292447, 55068645, 51249069, 47788068, 44639359, 41763037, 39130594, 36719006, 34505515, 32470862, 30601089, 28882193, 27297694, 25833674, 24480850, 23229359]
58081B3229359j162608j083596j010065r43010q85202q33803p84098p37369o97486
58072A5092122o62634o28223n95345n68390n46146n23032m97772m73638m51215
58063A0145727m28049m04713l84606l67918l51672l35118l19531l03541k84619
58054F965960k64700k48611k36968k25951k14013k03588j95912j89053j81684
58045E005480j74656j68376j62248j56767j52802j49115j43791j37562j32466
58036C627697j28134j22797j17036j12983j10595j08088j05096j02013r7526r0481
58026B532948q3083p8469p6087p3176o9544o6938o4876o1370n6852n3117m9328
58015A800108m3626l7842l5673l6419l5661l2322k9989l0394l0657k8593k6230
$$ y = [23229359, 22066751, 20983155, 19973090, 19030080, 18144878, 17311075, 16526977, 15789608, 15092122, 14429488, 13801265, 13205920, 12637530, 12091384, 11568352, 11070580, 10596942, 10145727, 9717678, 9312965, 8928359, 8560441, 8208769, 7873651, 7554120, 7250579, 6965960, 6701260, 6452649, 6215681, 5989730, 5775717, 5572129, 5376217, 5187164, 5005480, 4830824, 4662448, 4500200, 4343433, 4190631, 4041516, 3897725, 3760163, 3627697, 3499563, 3376766, 3259730, 3146747, 3036152, 2928064, 2822968, 2720955, 2623429, 2532948, 2449865, 2371396, 2295309, 2222133, 2152589, 2085651, 2020775, 1959405, 1902553, 1849436, 1800108, 1756482, 1718640, 1682967, 1646548, 1610887, 1578565, 1548576, 1518182, 1487525, 1458932, 1432702]
58004A432702k5885k6472k5991k4696k3513k1789j8805j5722j4200j4292j4961
57993A206376j5561j5886j5716j4988j3711j1848r875q870q979q794p584o840
57981A067724p806q981q440p205p579r326j0497j1068j2319j3367j2021r003p634
57968I42478q998j0732j1168j1373j2295j2893j2289j1340j0913j0607j0022r523
57956H10325r243q939q917r415r313p461m904l529l050j877m53o65k256l046k745
57941G34512l128m192l739j518k25j259k822l497m439o414p740p131n931n620
57927F76857n445m385l241k845k288q00M63L97L8P56J897J958R19k39j151j784
57911F61107j654o48L23N51M28L89K88L77J379K916L618L565M424O227O411L702
$$ y = [1432702, 1406817, 1380345, 1354354, 1329658, 1306145, 1284356, 1265551, 1249829, 1235629, 1221337, 1206376, 1190815, 1174929, 1159213, 1144225, 1130514, 1118666, 1108791, 1099921, 1090942, 1082148, 1074564, 1067724, 1059918, 1050937, 1042497, 1035292, 1027713, 1018387, 1007890, 996822, 984503, 971136, 959115, 950112, 942478, 933480, 922748, 911580, 900207, 887912, 875019, 862730, 851390, 840477, 829870, 819848, 810325, 801082, 792143, 783226, 773811, 764498, 757037, 752133, 748604, 745554, 743677, 743224, 742559, 740303, 737257, 734512, 731384, 727192, 723453, 721935, 721710, 720451, 717629, 714132, 709693, 703279, 695539, 688408, 682477, 676857, 671412, 667027, 663786, 660941, 658653, 657853, 658316, 658713, 658751, 659507, 661404, 663362, 664281, 664042, 662891, 661107, 659453, 658805, 659128, 659679, 660107, 660496, 660784, 661161, 662540, 665456, 669074, 672639, 677063, 683290, 689701, 693403]
57895F93403P32O24K691L810K778J008j62o77p42m60k80n18o85l36O2l8k34O4
57877G01040O57J249K172L474M390M693N480P319Q690P694M544J028j729l653
57863G47048m661m680m323m270m397m409m812o137p692q209p380n947m713m184
57849F71234m506m977m311k291m32j22q15j111r24j329k783m530n649n790n162
57834F26502m447m335m619m184k486m94L99j56j464k631k996k559k275l081m353
57819E86821m538l549k964l355l274j965j135k355m313m660l439k663l173l922
57805E41516m009l637l204k820k522j860R1L105M978L956J355O8R06K205K647
57790E42775K606K749L117L801M906N652N074L745L295L956M124K721N72j102
$$ y = [693403, 694135, 694759, 697450, 701260, 704038, 705046, 704884, 704207, 703465, 703005, 702725, 702207, 701522, 701186, 701248, 701210, 700976, 701040, 701697, 702946, 705118, 708592, 712982, 717675, 723155, 730474, 739164, 746858, 751402, 752430, 750701, 747048, 742387, 737707, 733384, 729114, 724717, 720308, 715496, 709359, 701667, 693458, 686078, 680131, 675418, 671234, 666728, 661751, 657440, 655149, 654717, 654595, 653780, 652669, 651745, 650416, 647633, 643103, 637454, 631664, 626502, 622055, 617720, 613101, 608917, 606431, 605937, 606336, 606180, 604716, 602085, 599089, 596530, 594255, 591174, 586821, 582283, 578734, 575770, 572415, 569141, 567176, 566041, 563686, 559373, 554713, 551274, 548611, 545438, 541516, 537507, 533870, 530666, 527846, 525324, 523464, 523555, 526660, 531638, 535594, 536949, 537017, 537923, 540128, 542775, 545381, 548130, 551247, 555048, 559954, 565606, 570680, 574425, 577720, 581676, 585800, 588521, 589093, 587991]
57776E87991k098k524k075q16K59M41K97P73J906L005L557L425K732K054K183
57761F01110L163L984L706K550J439Q36M99J20l47r84k068l740n588o826p018
57746E90836o564o278o508o945p288p640q091q315p894o785n304l963l332l566
57732E02363l915l322j653K18J565K270K128R76j66L78K419L372J567j147j677
57717E05376K87K372L073L203L794M489M521L936L103J929J90j905l827n039n231
57702E20271m711m293m286l972k869j975k622m336n193m309k811k099k317k848
57688D71630l206k988j826n3J160R11m73j822k172j407k89J44m04j103r62MR86
57671D58130J477J546J334J021J007J404J541P30p40j993k561k255o98J872L817
$$ y = [587991, 585893, 583369, 581294, 580478, 580737, 581178, 581475, 582248, 584154, 587159, 590716, 594141, 596873, 598927, 601110, 604273, 608257, 611963, 614513, 615952, 616788, 617287, 617407, 617060, 616076, 614008, 610268, 604680, 597854, 590836, 584272, 577994, 571486, 564541, 557253, 549613, 541522, 533207, 525313, 518528, 513224, 509261, 505929, 502363, 498448, 495126, 493473, 493691, 495256, 497526, 499654, 500630, 500464, 500842, 503261, 506633, 508200, 507053, 505376, 505663, 508035, 511108, 514311, 518105, 522594, 527115, 531051, 534154, 536083, 536273, 534368, 530541, 525502, 520271, 515560, 511267, 506981, 503009, 500140, 498165, 495543, 491207, 486014, 481705, 478894, 476795, 474478, 471630, 468424, 465436, 463610, 463557, 464717, 465628, 465155, 463333, 461161, 459754, 459465, 459609, 459205, 458102, 457140, 457144, 458130, 459607, 461153, 462487, 463508, 464515, 465919, 467460, 468190, 467450, 465457, 462896, 460641, 459943, 461815, 465632]
57656D65632L603J885P55R13J051J24j207j774j261J9J530K351J820P33P38K023
57640D78935K837J937L57j0J313L210M288L863K406J404J887K858K202m50l033
57625E04004l657k523n69K053M996O814O781O596Q403J1723J4256J5359J6840
57612E91076K0106K4367K8247L1780L5818M0171M3154M2713L7615K8013J5286
57601I38346J372j1950k3206l1133l5031l5348l3473l0764k7910k5040k2112j9138
57589F44613j6392j4398j3501j3322j2939j1797j0296r307r055q691p272n091
57577E12552l523l258l231k009J20J417J016o4n03k84l0K78R95J673J334j24j522
57560E04837j690o57N22Q88L61l74o57n11m32n98o35k01N03J046J259J284J346
$$ y = [465632, 469235, 471120, 471875, 472788, 473839, 473963, 472756, 470982, 469721, 469740, 471270, 473621, 475441, 476174, 476912, 478935, 481772, 483709, 484066, 484056, 485369, 488579, 492867, 496730, 499136, 500540, 502427, 505285, 507487, 507037, 504004, 500347, 497824, 497255, 499308, 504304, 511118, 517899, 524495, 532898, 544621, 558877, 574236, 591076, 611182, 635549, 663796, 695576, 731394, 771565, 814719, 857432, 895047, 923060, 938346, 939718, 927768, 904562, 873429, 838398, 803050, 769577, 738813, 710903, 685863, 663751, 644613, 628221, 613823, 600322, 587000, 574061, 562264, 551968, 542661, 533606, 524915, 517643, 512552, 509029, 505771, 502540, 500531, 500651, 502068, 503084, 503020, 502517, 502233, 502203, 502481, 503476, 505149, 506483, 506359, 504837, 503147, 502490, 503012, 503900, 504261, 503887, 503230, 502719, 502287, 501689, 501054, 500853, 501356, 502402, 503661, 504945, 506291]
57543E06291J633K117K330J613j41k202l629m040l688l017k311j599q22j11K20
57528D92644J26l9j48o81j812k572j845j20Q05L3j435k147j676l91J166K097J449
57511D85454n15k107k055q17N13J768L094L735K856J181L27N36M35o18j304j96
57495D92287K071L566L569L302M034N317N685M703L517L236L566L581L288L516
57481E45238M445N206N084M342L655L436L918N095O192O029M417K587J733J758
57467F03135J974K275K830L159K620J576J226K102L350L659K620J055J70L40P88
57452F32879N96j22m68j5P58J326J669J862J794J499J125N08m06p95K93K232L146
57435F47881K409J479J597K049J729J160J577K873L815L797L219K608K392L015
$$ y = [506291, 507924, 510041, 512371, 513984, 513843, 511641, 508012, 503972, 500284, 497267, 494956, 493357, 492535, 492424, 492644, 492770, 492731, 492583, 491902, 490090, 487518, 485673, 485553, 486358, 486391, 484956, 482809, 481133, 480742, 481908, 484005, 485454, 484939, 482832, 480777, 479960, 480473, 482241, 485335, 489070, 491926, 493107, 493434, 493970, 494405, 493787, 492483, 492287, 494358, 497924, 501493, 504795, 508829, 514146, 519831, 524534, 528051, 531287, 534853, 538434, 541722, 545238, 549683, 554889, 559973, 564315, 567970, 571406, 575324, 580419, 586611, 592640, 597057, 599644, 601377, 603135, 605109, 607384, 610214, 613373, 615993, 617569, 618795, 620897, 624247, 627906, 630526, 631581, 631751, 632091, 632879, 633475, 633353, 632885, 632870, 633628, 634954, 636623, 638485, 640279, 641778, 642903, 643411, 643005, 642210, 642503, 644735, 647881, 650290, 651769, 653366, 655415, 657144, 658304, 659881, 662754, 666569, 670366, 673585, 676193, 678585, 681600]
57421F81600M327N357N535N468N797O173O401P361R461J1217J1131J0116J0190
57408G80134J1421J2197J2068J2138J2666J2589J1638J0862J0516R414P212N535
57396I08390N773P164Q092Q078P481O374M918M083M827O803Q682R467Q969P536
57382A006637N831M664M504N250O492P769Q581Q518P506N734L661K300K800N028
57368A085275P241P998P854Q100Q576Q142O846N901N762N854O071O840P765P952
57354A186177P724Q122Q653P735N694M961O540Q558R369R780J0765J1238J0082
57341A295398Q552Q573R949J1266J2349J3596J3943J2027Q961P548Q576R958R889
57328A430585R079R213J0597J2143J2885J2787J2395J2135J1915J1425J0810J0658
$$ y = [681600, 685927, 691284, 696819, 702287, 708084, 714257, 720658, 728019, 737480, 748697, 759828, 769944, 780134, 791555, 803752, 815820, 827958, 840624, 853213, 864851, 875713, 886229, 895643, 902855, 908390, 914163, 921327, 929419, 937497, 944978, 951352, 956270, 960353, 965180, 971983, 980665, 990132, 999101, 1006637, 1012468, 1017132, 1021636, 1026886, 1033378, 1041147, 1049728, 1058246, 1065752, 1071486, 1075147, 1077447, 1080247, 1085275, 1092516, 1100514, 1108368, 1116468, 1125044, 1133186, 1140032, 1145933, 1151695, 1157549, 1163620, 1170460, 1178225, 1186177, 1193901, 1202023, 1210676, 1218411, 1224105, 1229066, 1235606, 1244164, 1253533, 1263313, 1274078, 1285316, 1295398, 1303950, 1312523, 1322472, 1333738, 1346087, 1359683, 1373626, 1385653, 1394614, 1402162, 1410738, 1420696, 1430585, 1439664, 1448877, 1459474, 1471617, 1484502, 1497289, 1509684, 1521819, 1533734, 1545159, 1555969, 1566627]
57316A566627J1190J2091J3321J5122J6838J6839J4622J2072J1510J3161J5417
57305A718810J6922J7274J6529J5301J4832J5676J6743J6784J6244J6275J6485
57294A897875J5419J3127J1458J1492J2203J2188J1487J1082J1538J2776J4348
57283B034993J5430J5174J3711J2394J2529J4044J5661J6294J6096J6095J6814
57272B199235J7529J7301J6539J6638J7899J8843J8233J6828J6254J6873J7731
57261B389903J8050J7817J7338J7084J7482J8095J7645J5821J4358J5058J7307
57250B575958J8906J8942J8370J7980J7356J6103J4823J4435J5269J6969J8688
57239B763799J9551J9619K0081K1742K3679K4405K3904K3398K3385K3178K2153
$$ y = [1566627, 1577817, 1589908, 1603229, 1618351, 1635189, 1652028, 1666650, 1678722, 1690232, 1703393, 1718810, 1735732, 1753006, 1769535, 1784836, 1799668, 1815344, 1832087, 1848871, 1865115, 1881390, 1897875, 1913294, 1926421, 1937879, 1949371, 1961574, 1973762, 1985249, 1996331, 2007869, 2020645, 2034993, 2050423, 2065597, 2079308, 2091702, 2104231, 2118275, 2133936, 2150230, 2166326, 2182421, 2199235, 2216764, 2234065, 2250604, 2267242, 2285141, 2303984, 2322217, 2339045, 2355299, 2372172, 2389903, 2407953, 2425770, 2443108, 2460192, 2477674, 2495769, 2513414, 2529235, 2543593, 2558651, 2575958, 2594864, 2613806, 2632176, 2650156, 2667512, 2683615, 2698438, 2712873, 2728142, 2745111, 2763799, 2783350, 2802969, 2823050, 2844792, 2868471, 2892876, 2916780, 2940178, 2963563, 2986741, 3008894]
57228C008894K0406J8302J6505J6161J7784K0173K1643K2128K2801K3954K4794
57217C233545K5285K6422K8422L0201L1111L1845L3071L4355L4956L4791L4177
57206C578181L3378L2629L1931L0791K8847K6530K4351K2134J9915J8867J9759
57195C867313K1080K0628J8527J6692J5582J3921J1652J0540J1097J1395J0174
57184D028601R029J0119J3234J6567J9029K0684K1814K2694K3541K4182K4622
57173D234116K5944K9154L2949L4580L3289L0998K9103K6993K4613K3658K4498
57162D549895K4338K0779J5508J2013J1017J0522R388Q311P710O918N557M114
57150D686070K933J910J073O35O81J542L822P422J1247J4628J8017K1531K4058
$$ y = [3008894, 3029300, 3047602, 3064107, 3080268, 3098052, 3118225, 3139868, 3161996, 3184797, 3208751, 3233545, 3258830, 3285252, 3313674, 3343875, 3374986, 3406831, 3439902, 3474257, 3509213, 3544004, 3578181, 3611559, 3644188, 3676119, 3706910, 3735757, 3762287, 3786638, 3808772, 3828687, 3847554, 3867313, 3888393, 3909021, 3927548, 3944240, 3959822, 3973743, 3985395, 3995935, 4007032, 4018427, 4028601, 4037630, 4047749, 4060983, 4077550, 4096579, 4117263, 4139077, 4161771, 4185312, 4209494, 4234116, 4260060, 4289214, 4322163, 4356743, 4390032, 4421030, 4450133, 4477126, 4501739, 4525397, 4549895, 4574233, 4595012, 4610520, 4622533, 4633550, 4644072, 4653460, 4661771, 4669481, 4676399, 4681956, 4686070, 4689003, 4690913, 4691986, 4692621, 4693302, 4694844, 4698666, 4706088, 4717335, 4731963, 4749980, 4771511, 4795569]
57137D795569K4992K5587K7183K9049K9503K8223K6036K3273J9766J5893J2156
57126E057230Q428M783K151P65j042m761r194j1724j1636j0425r263p883n837
57113E001592l248j41L742Q295J3121J8139K3474K8829L3585L7209L9233L9426
57101E243256L8121L5479L0294K0974Q183n016j6157k4775l0429l1789k8957k4360
57089E214824j9675j4029o999j071J220P14j25o53j419j964j875k479m908p816
57075E153745r543j1150j4774k0413k6767l3615m0862m6931n0898n4484n9313
57064D784995o4218o8155p3170q0892q8562r2795r5060r9003j04473j09477j16372
57053C792818j30512j53319j81601k13111k47958k85301l23493l62965m04632
$$ y = [4795569, 4820561, 4846148, 4873331, 4902380, 4931883, 4960106, 4986142, 5009415, 5029181, 5045074, 5057230, 5065658, 5070441, 5072592, 5073357, 5072315, 5067554, 5058360, 5046636, 5035000, 5024575, 5015312, 5007429, 5001592, 4998344, 4998203, 5001945, 5010240, 5023361, 5041500, 5064974, 5093803, 5127388, 5164597, 5203830, 5243256, 5281377, 5316856, 5347150, 5368124, 5376307, 5371291, 5355134, 5330359, 5299930, 5268141, 5239184, 5214824, 5195149, 5181120, 5174121, 5173050, 5174270, 5174984, 5174859, 5174206, 5172787, 5170823, 5168948, 5166469, 5161561, 5153745, 5144202, 5133052, 5118278, 5097865, 5071098, 5037483, 4996621, 4949690, 4898792, 4844308, 4784995, 4720777, 4652622, 4579452, 4498560, 4409998, 4317203, 4222143, 4123140, 4018667, 3909190, 3792818, 3662306, 3508987, 3327386, 3114275, 2866317, 2581016, 2257523, 1894558, 1489926]
57044A489926m46734m87800B4419e55915o34806o90201p43636p89222q13590q03981
57034e031351p57967o78045n62883m14682k47543p2131J22698L51689N94958P93952
57024e901305Q79891P81908M19502k52422j153279k062551k740199l057947k998132
57015a6084534k568567j791420p81857K30346J009047J437202J533483J385396
57007a5630904J097338P75051N05318L30170K51235K59609L49780N08754P09972
56998a0843677R22938J120140J275375J368097J394384J367232J303918h73996
56989B45369J019329R22431Q28540P38139O54003N77096N05809M40137L82567
56980F313420L34219K93792K60496K34395K13713J95414J78977J66498J58884
$$ y = [1489926, 1043192, 555392, 24419, -555915, -1190721, -1880922, -2624558, -3413780, -4227370, -5031351, -5789318, -6467363, -7030246, -7444928, -7692471, -7764602, -7641904, -7290215, -6695257, -5901305, -5021414, -4239506, -3820004, -4072426, -5225705, -7288256, -10028455, -13086402, -16084534, -18653101, -20444521, -21226378, -20996032, -19986985, -18549783, -17016300, -15630904, -14533566, -13758515, -13253197, -12923027, -12671792, -12412183, -12062403, -11553649, -10843677, -9920739, -8800599, -7525224, -6157127, -4762743, -3395511, -2091593, -873996, 245369, 1264698, 2187129, 3015669, 3753808, 4407811, 4984907, 5490716, 5930853, 6313420, 6647639, 6941431, 7201927, 7436322, 7650035, 7845449, 8024426, 8190924, 8349808]
56971H349808J54594J52227J52043J54916J60665J65324J58406J27101O8453l885
56961I639652o9278j15760j43628j57494j61403j60414j59491j58902j55295j48257
56951H209730j41388j36228j30094j21541j13425j08635j06654j06450j09134
56942G136181j15437j23497j31480j40006j49964j60115j68619j75146j80070
56933E791847j83545j86590j91049j97212k03295k08198k12729k17148k19799
56924C972282k19507k17254k14250k10293k05209j99966j95036j89366j82064
56915B139337j73400j63320j51046j37206j24227j13350j03216r2537q2157p3179
56905I25699o5189n7704n1292m5765l9414l1639k4351j9058j4677j0069o585n893
$$ y = [8349808, 8504402, 8656629, 8808672, 8963588, 9124253, 9289577, 9447983, 9575084, 9643537, 9639652, 9570374, 9454614, 9310986, 9153492, 8992089, 8831675, 8672184, 8513282, 8357987, 8209730, 8068342, 7932114, 7802020, 7680479, 7567054, 7458419, 7351765, 7245315, 7136181, 7020744, 6897247, 6765767, 6625761, 6475797, 6315682, 6147063, 5971917, 5791847, 5608302, 5421712, 5230663, 5033451, 4830156, 4621958, 4409229, 4192081, 3972282, 3752775, 3535521, 3321271, 3110978, 2905769, 2705803, 2510767, 2321401, 2139337, 1965937, 1802617, 1651571, 1514365, 1390138, 1276788, 1173572, 1081035, 998878, 925699, 860510, 802806, 751514, 705749, 666335, 634696, 610345, 591287, 576610, 566541, 559956, 554063]
56893E54063p200r016j1813j6369k1071k3674k4552k5430k5909k4265k0907j8075
56881C25782j6337j4215j1199q382n843k173K748O891Q948J0157J2305J5548J8901
56868C43131K1307K1292J7116Q664j541j0145j5466j7976j9086k0055k1292k2133
56856B83816k1567j9410j6401j3330j0719r190r141r903j0129r319q209p473o815
56843A32210n668m073k518j459j103j230j142l13J039K612M887Q193J1232J2128
56829A54795J1293J1646J5096K0061K3663K5172K5824K5979K4341K0094J4355
56818C72319Q999N003K321O59j86k54O16K409M406N719O526Q035J0817J3926J6299
56803D57614J8299K1038K4692K8488L1959L4983L6618L5124K9529K0385Q962l238
$$ y = [554063, 546863, 537847, 526034, 509665, 488594, 464920, 440368, 414938, 389029, 364764, 343857, 325782, 309445, 295230, 284031, 275649, 269806, 267633, 270381, 277272, 286220, 296377, 308682, 324230, 343131, 364438, 385730, 402846, 411510, 409969, 399824, 384358, 366382, 347296, 327241, 305949, 283816, 262249, 242839, 226438, 213108, 202389, 193199, 184058, 174155, 164026, 154707, 146498, 139025, 132210, 126542, 122469, 119951, 118492, 117389, 116159, 115017, 114704, 115743, 118355, 123242, 131435, 142667, 154795, 166088, 177734, 192830, 212891, 236554, 261726, 287550, 313529, 337870, 357964, 372319, 381318, 386321, 388642, 389301, 389115, 388861, 389477, 391886, 396292, 402011, 408537, 416572, 427389, 441315, 457614, 475913, 496951, 521643, 550131, 582090, 617073, 653691, 688815, 718344, 738729, 747691, 744453]
56791G44453j3981k0800k2943k2039k0110j7571j3780q662k947K513O947J0119
56779F21199J3211J8256K5640L3191L8866M3218M7722N1716N2785M9340M1002
56768A036146K7430R445r159k3716l3024l9353m3969m5373m2593l7491l2289k7109
56756G38945k1478j6260j2211q172k607M152J0728J6685K2147K6487K8908K9453
56744H16777K8042K3440J4741L230q568j8858k6643l1051l2272l2227l2543l2484
56732F71584l0425k6576k2557j8937j5070j0918p265m366j898K8J380L222O469
56719E44671R904J1107R182N002p96q015j5282k0448k3030k4468k5635k5821k4566
56706D11805k2739k1164j9702j8271j7252j6277j4145j0801q080p564q652r593
$$ y = [744453, 730472, 709672, 686729, 664690, 644580, 627009, 613229, 604567, 601620, 604133, 611080, 621199, 634410, 652666, 678306, 711497, 750363, 793581, 841303, 893019, 945804, 995144, 1036146, 1063576, 1073021, 1063862, 1040146, 1007122, 967769, 923800, 878427, 835834, 798343, 766054, 738945, 717467, 701207, 688996, 680824, 678217, 682369, 693097, 709782, 731929, 758416, 787324, 816777, 844819, 868259, 883000, 886230, 877662, 858804, 832161, 801110, 768838, 736611, 704068, 671584, 641159, 614583, 592026, 573089, 558019, 547101, 539836, 535470, 533572, 533600, 534980, 538202, 544671, 554575, 565682, 574864, 579866, 579070, 571055, 555773, 535325, 512295, 487827, 462192, 436371, 411805, 389066, 367902, 348200, 329929, 312677, 296400, 282255, 271454, 263374, 255810, 247158, 237565]
56694B37565r453q414o922n392m225l633l704m569n868o388n322l659l019l278
56680A63719k963j928j699k690l275k474j590j982k882k936k387k023j281O37
56666A34246K672L052K108J987L526N237N634M965M057K912J411L65O34J641J895
56651A76342J022K90O84J342P87o47j009M43J856J257n74j134L34J964K037J082
56635A86076O62J185J759J622Q57R2m7O08J496J797J326P64Q74J730K666K753
56619B06220J638K14o2R12J282m40l085m188l275k240k425l045k940k410k455
56604A83701l317m372m804m056k457j557k665m824n500l685j102K23L03M48J284
56589A47620K422L189L079K107J155J232K183L040L543M152M554L832K373J822
$$ y = [237565, 228112, 219698, 212776, 207384, 203159, 199526, 195822, 191253, 185385, 178997, 173675, 170016, 166997, 163719, 160756, 158828, 157129, 154439, 151164, 148690, 147100, 145118, 142236, 139300, 136913, 134890, 133609, 134246, 136918, 139970, 142078, 144065, 147591, 152828, 158462, 163427, 167484, 170396, 171807, 172172, 172806, 174447, 176342, 177364, 177654, 178338, 179680, 180467, 179820, 178811, 179254, 181110, 182367, 181793, 180659, 180993, 182957, 184994, 186076, 186738, 187923, 189682, 191304, 192161, 192253, 192206, 192814, 194310, 196107, 197433, 198197, 199071, 200801, 203467, 206220, 207858, 208072, 208010, 208922, 210204, 209764, 206679, 202491, 199216, 196976, 194551, 191506, 188566, 186156, 183701, 180384, 176012, 171208, 167152, 164695, 163138, 160473, 155649, 150149, 146464, 145362, 145585, 145888, 146336, 147620, 150042, 153231, 156310, 158417, 159572, 160804, 162987, 166027, 169570, 173722, 178276, 182108, 184481, 186303]
56575A86303K616L314K951K259J846J198L82O28J980K517J405O18J705K974K149
56560B14845J27n65L13J033J179J830K992L587L797M812O255O266M531K956K772
56545B56730K860J753k70j856k290j864j312j115q57M24K583L754K610M61m12
56530B61199j0l27k103l788l934k818j345R9J213J584J423J404J457Q26m48j221
56514B53211p33N06J586K107K164K201K795L875M495M228M159N324O860P193O524
56499C06495O404P250Q034Q208P993O968M490J545J19L42L68o15j461j586k141
56484C52413l668m715m078k701k137k532l267m130m749m339l160k835m006n003
56470C01093m250k657k079k551k746k401k429k939k833j502J75R50N79n5K3P43
$$ y = [186303, 188919, 192233, 195184, 197443, 199289, 200487, 200869, 201497, 203477, 205994, 207399, 208017, 209722, 212696, 214845, 214972, 214407, 214720, 215753, 216932, 218762, 221754, 225341, 229138, 233950, 240205, 246471, 251002, 253958, 256730, 259590, 261343, 261073, 259217, 256927, 255063, 253751, 252636, 251779, 252203, 254786, 258540, 261150, 261611, 261199, 261189, 260862, 258759, 254971, 251037, 248219, 246874, 246973, 248186, 249770, 251193, 252597, 254054, 254880, 254432, 253211, 252478, 252984, 254570, 256677, 258841, 261042, 263837, 267712, 272207, 276435, 280594, 285918, 292778, 299971, 306495, 312899, 320149, 328183, 336391, 344384, 351352, 355842, 357387, 357506, 357848, 358216, 357601, 356140, 354554, 352413, 348745, 344030, 339952, 337251, 335114, 332582, 329315, 325185, 320436, 316097, 312937, 310102, 306096, 301093, 296843, 294186, 292107, 289556, 286810, 284409, 281980, 279041, 276208, 274706, 274881, 275831, 276410, 276355, 276378, 277121]
56454B77121R23k25j750j957o60O87J212J565K220K324J153o07k032l258m522
56439B72194m870l253l57J854K149P96j169k588k535j026Q32J936K252K343K315
56424B70873J737L53j503k936l004j686k72K2l59j10P80J216J179J852L234L672
56408B75048K671J999K799L560K654J108Q08J306P59q40j794j585j356j588j412
56393B84137n75j51p28j364j010Q3J125K015L116M328M969M430K808R46k16o08
56377C03305j047k075l093l085j853j12J305J975J940J629J484J517J549J789
56363C05228K463K950K403J334J301K643L872L903L384L068K576J936K530M761
56349C44352O264M650J128q72k27R28O45o00j419j398q51j2R33J760K500L088
$$ y = [277121, 278044, 277819, 276069, 274112, 273452, 274139, 275351, 276916, 279136, 281460, 282613, 282006, 279974, 276716, 272194, 267324, 264071, 263714, 265568, 267717, 268513, 267344, 264756, 262221, 261195, 262027, 263963, 266215, 268558, 270873, 272610, 272963, 271460, 268524, 265520, 263834, 263562, 263584, 263225, 263115, 263895, 265111, 266290, 268142, 271376, 275048, 277719, 279718, 282517, 286077, 288731, 289839, 290647, 291953, 292712, 291872, 290078, 288493, 287137, 285549, 284137, 283562, 283411, 282683, 281319, 280309, 280392, 281517, 283532, 286648, 290976, 295945, 300375, 303183, 304129, 303913, 303305, 302258, 300183, 297090, 294005, 292152, 292040, 293345, 295320, 297260, 298889, 300373, 301890, 303439, 305228, 307691, 310641, 313044, 314378, 315679, 318322, 322194, 326097, 329481, 332549, 335125, 337061, 339591, 344352, 350616, 355266, 356394, 355522, 355295, 356223, 356868, 356268, 354849, 353451, 352600, 352588, 353521, 355281, 357781, 360869]
56333C60869K946J776N37M57J227J412N99j18J37J044J998K801L219K969K469
56318C84342K543L181L481L123K827L104L544L750L888L822K814Q83m49K13K145
56303D23211L176K251O38L49J956M149N256M746L316J853P23j47r62j958l074
56288D45483l695l221j989j076r39q82j51J081K168K810L016K885K766L043L464
56273D54763L432L203L730M910N199L800K035J490J850J819J299J248J854K344
56259D92976K304K050J843J713J783J878J264k54j405p85J181K658K569J519P86
56244E12080J251K991N067O041N559M972N621P054P847P572O953O532O403O755
56230E92698P585Q139P757O957O762P336Q152R018R934J0483J0341J0049J0352
$$ y = [360869, 363815, 365591, 366128, 366585, 367812, 369224, 369823, 369705, 369842, 370886, 372884, 375685, 378904, 381873, 384342, 386885, 390066, 393547, 396670, 399497, 402601, 406145, 409895, 413783, 417605, 420419, 421302, 420853, 421066, 423211, 426387, 428638, 429276, 429625, 431581, 435730, 440986, 445732, 449048, 450901, 451624, 451477, 450515, 448557, 445483, 441788, 438567, 436578, 435502, 434563, 433681, 433530, 434611, 436779, 439589, 442605, 445490, 448256, 451299, 454763, 458195, 461398, 465128, 470038, 475237, 479037, 481072, 482562, 484412, 486231, 487530, 488778, 490632, 492976, 495280, 497330, 499173, 500886, 502669, 504547, 505811, 505557, 504152, 503367, 504548, 507206, 509775, 511294, 512080, 513331, 516322, 521389, 527430, 532989, 537961, 543582, 550636, 558483, 566055, 573008, 579540, 585943, 592698, 600283, 608422, 616179, 623136, 629898, 637234, 645386, 654404, 664338, 674821, 685162, 695211, 705563]
56217G05563J1396J3235J6129J9341K0805J9563J7616J7715K0052K2778K4959
56206I09152K7123K9441L1446L3294L5514L7689L9149M0693M3839M8490N3184
56195A329014N7564O2663O8761P4782Q0213Q5886R2591J00263J08658J17361J25025
56184B302781J30177J32946J34682J35730J34967J31438J25063J15746J03395
56175C446925Q8830P3123N6013L6465J4944o436k6154m4284o1283p7107r1507
56164C409529j03750j12322j16385j17372j17455j16869j14545j10893j07561
56155B392377j04498r9850r3302q7085q2776p9209p4657o9372o4735o1097n7570
56144A518226n3256m8133m3190l9620l7212l4075k9167k4300k1996k1998k1871
$$ y = [705563, 716959, 730194, 746323, 765664, 786469, 806032, 823648, 841363, 861415, 884193, 909152, 936275, 965716, 997162, 1030456, 1065970, 1103659, 1142808, 1183501, 1227340, 1275830, 1329014, 1386578, 1449241, 1518002, 1592784, 1672997, 1758883, 1851474, 1951737, 2060395, 2177756, 2302781, 2432958, 2565904, 2700586, 2836316, 2971283, 3102721, 3227784, 3343530, 3446925, 3535755, 3608878, 3664891, 3701356, 3716300, 3709864, 3683710, 3639426, 3578143, 3501036, 3409529, 3305779, 3193457, 3077072, 2959700, 2842245, 2725376, 2610831, 2499938, 2392377, 2287879, 2188029, 2094727, 2007642, 1924866, 1845657, 1771000, 1701628, 1636893, 1575796, 1518226, 1464970, 1416837, 1373647, 1334027, 1296815, 1262740, 1233573, 1209273, 1187277, 1165279, 1143408]
56133A143408k0539j8908j7318j4899j1760r407q529q356q404q857r078p907n735
56120I93711m097l151j724l1L73m21l57J236K709L196M046O118Q195R247R997
56105A029047J1004J1342J0399R159Q599Q613R336J1574J5041J8046J9794K1169
56093A183123K2728K4020K5374K7951L1290L3408L4316L6872M2806N0205N6421
56082A568514O1386O6680P3074Q0319Q7833R4649J00028J04447J08167J08999
56072B454096J04118R4361Q3854P4940O6686N8920N3957N2477N0948M5365L5232
56061C174954K2469Q960l260j2121j7841k3129k9920l7935m7159n8659p1665q2991
56049B821703r0760r5862r8495r6729r0194q1813p3956o6002n7481n0171m4908
$$ y = [1143408, 1122869, 1103961, 1086643, 1071744, 1059984, 1050577, 1042048, 1033692, 1025288, 1016431, 1007353, 999446, 993711, 989614, 986463, 984739, 984708, 985081, 984660, 984303, 985539, 988248, 991444, 995490, 1001608, 1009803, 1019050, 1029047, 1040051, 1051393, 1061792, 1070951, 1079550, 1088163, 1097499, 1109073, 1124114, 1142160, 1161954, 1183123, 1205851, 1229871, 1255245, 1283196, 1314486, 1347894, 1382210, 1419082, 1461888, 1512093, 1568514, 1629900, 1696580, 1769654, 1849973, 1937806, 2032455, 2132483, 2236930, 2345097, 2454096, 2558214, 2652575, 2736429, 2811369, 2878055, 2936975, 2990932, 3043409, 3094357, 3139722, 3174954, 3197423, 3206383, 3203123, 3191002, 3173161, 3150032, 3120112, 3082177, 3035018, 2976359, 2904694, 2821703, 2730943, 2635081, 2536586, 2439857, 2349663, 2267850, 2193894, 2127892, 2070411, 2020240, 1975332]
56038A975332l9765l3725k8793k6020k2846j7218j1122p177m716k215n52o53o52
56025A779878J397M295O102P374R264J0865J1242J1713J3439J5201J5972J7047
56013A903789J9067J9936J8497J7399J9231K2495K4312K4554K4570K4498K4536
56002B142884K6070K9046L1059L1309L2090L4286L5486L4996L6063L9924M2522
55991B515735M1024L8799L9629M1555M1342M0604M2168M4313M4170M3442M5295
55980B978076M8679N0898N2705N5932N9246O1219O4221P0218P6246P9098Q0876
55969C677414Q4753Q9216R1823R4431R8962J02435J02476J03234J09148J17224
55959D671116J22596J27255J35618J45635J52616J58196J67062J77977J86627
$$ y = [1975332, 1935567, 1901842, 1873049, 1847029, 1824183, 1806965, 1795843, 1788666, 1783950, 1781735, 1781183, 1780530, 1779878, 1781275, 1785570, 1791672, 1799046, 1808310, 1819175, 1830417, 1842130, 1855569, 1870770, 1886742, 1903789, 1922856, 1942792, 1961289, 1978688, 1997919, 2020414, 2044726, 2069280, 2093850, 2118348, 2142884, 2168954, 2198000, 2229059, 2260368, 2292458, 2326744, 2362230, 2397226, 2433289, 2473213, 2515735, 2556759, 2595558, 2635187, 2676742, 2718084, 2758688, 2800856, 2845169, 2889339, 2932781, 2978076, 3026755, 3077653, 3130358, 3186290, 3245536, 3306755, 3370976, 3441194, 3517440, 3596538, 3677414, 3762167, 3851383, 3943206, 4037637, 4136599, 4239034, 4341510, 4444744, 4553892, 4671116, 4793712, 4920967, 5056585, 5202220, 5354836, 5513032, 5680094, 5858071, 6044698]
55950F044698J94367K05588K19076K30463K40797K54279K70026K84392K98868
55941H242554L17314L38120L57455L77411M02394M30523M57262M84229N15640
55932A1922902N49888N83641O19948O62549P06983P47814P89713Q40192Q96504
55923A8320134R51624J007684J070431J135845J196410J255895J323590J399027
55915B7660640J477446J564993J672459J799399J940503K100808K286591K489079
55907D2991918K698147K925672L194110L509897L871334M293141M796076N381852
55899G3662147O048819O823080P740931Q811554J0034767J1441923J3073558J4930110
55891A52566889J6995569J9286905K1808543K4476440K7155692K9671447L1520784
$$ y = [6044698, 6239065, 6444653, 6663729, 6894192, 7134989, 7389268, 7659294, 7943686, 8242554, 8559868, 8897988, 9255443, 9632854, 10035248, 10465771, 10923033, 11407262, 11922902, 12472790, 13056431, 13676379, 14338928, 15045911, 15793725, 16583438, 17423630, 18320134, 19271758, 20279442, 21349873, 22485718, 23682128, 24938023, 26261613, 27660640, 29138086, 30703079, 32375538, 34174937, 36115440, 38216248, 40502839, 42991918, 45690065, 48615737, 51809847, 55319744, 59191078, 63484219, 68280295, 73662147, 79710966, 86534046, 94274977, 103086531, 113121298, 124563221, 137636779, 152566889, 169562458, 188849363, 210657906, 235134346, 262290038, 291961485, 323482269]
55884C23482269L1516097K8077625K0358704R247455k876559j3502991k1206645
55877C75095955k5819752k7865695k8037996k6998716k5292516k3271250k1118500
55870A96691530j8957158j6898612j5011223j3312662j1809323j0507404r386843
55863A00808305q405278p535062o769721o096556n492909m949715m471469m051896
55855E3035699l673450l330478l029600k767022k527513k306376k111597j943063
55847C1346600j789239j645753j518829j408407j305220j206852j120547j047545
55839B0304208r79529r12970q53097q01429p52508p05136o64405o30423n96785
55830A3407926n62202n32513n09481m87982m65695m45320m26445m05556l84872
$$ y = [323482269, 354998366, 383075991, 403434695, 412682150, 409805591, 396302600, 375095955, 349276203, 321410508, 293372512, 266373796, 241081280, 217810030, 196691530, 177734372, 160835760, 145824537, 132511875, 120702552, 110195148, 100808305, 92403027, 84867965, 78098244, 72001688, 66508779, 61559064, 57087595, 53035699, 49362249, 46031771, 43002171, 40235149, 37707636, 35401260, 33289663, 31346600, 29557361, 27911608, 26392779, 24984372, 23679152, 22472300, 21351753, 20304208, 19324679, 18411709, 17558612, 16757183, 16004675, 15299539, 14635134, 14004711, 13407926, 12845724, 12313211, 11803730, 11315748, 10850053, 10404733, 9978288, 9572732, 9187860]
55821I187860l70692l61999l51024l35940l22365l11268k96509k76469k57627
55812F303967k43749k31404k18877k09753k04389j97149j85997j76461j72091
55803D464097j68769j62336j54740j48694j42820j35861j29870j25793j21198
55794C174016j15236j10560j07993j04607r9351r5157r3378r1375q7693q4217
55784B184449q1321p6453o9612o4673o3069o1423n7675n4073n1865m8532m2956
55773A512797l8159l6036l4218l0973k8514k8508k8687k6930k4673k3453k1951
55762A190695j9257j7388j7809j8752j8475j7914j7961j7412j5757j4757j5127
55751A000086j4871j2841j0656r287p222l945j877k496l811l761l173l170k723
$$ y = [9187860, 8817168, 8455169, 8104145, 7768205, 7445840, 7134572, 6838063, 6561594, 6303967, 6060218, 5828814, 5609937, 5400184, 5195795, 4998646, 4812649, 4636188, 4464097, 4295328, 4132992, 3978252, 3829558, 3686738, 3550877, 3421007, 3295214, 3174016, 3058780, 2948220, 2840227, 2735620, 2636269, 2541112, 2447734, 2356359, 2268666, 2184449, 2103128, 2026675, 1957063, 1892390, 1829321, 1767898, 1710223, 1656150, 1604285, 1555753, 1512797, 1474638, 1438602, 1404384, 1373411, 1344897, 1316389, 1287702, 1260772, 1236099, 1212646, 1190695, 1171438, 1154050, 1136241, 1117489, 1099014, 1081100, 1063139, 1045727, 1029970, 1015213, 1000086, 985215, 972374, 961718, 952431, 945209, 941264, 939387, 936891, 933080, 929319, 926146, 922976, 920253]
55738I20253r72P46J287J658K712L366K755J801J190L08q03j153j433l701p347
55723I20667q776o726m594n750r656j4208j8468k1272k0623j6954j3935j3710
55711G65995j4010j2135r053p209o824o814p133p932q360q023p793p727o543m474
55697F51965m004o119q572r462r735j0398j0389r235q837j0150j0989r629p826
55684E36620p619p892p042o432p793r338q050m433j699j312k248l640n333o422
55670D57367n915m439l344k743k231k549m456o717p223n811m331m244n313o135
55656C91916n223k360O13J554R13J141K810L717K622J178P42J31j436j993n6K064
55640C98333J191k098m641n175m897m578l826k738j975j596j484k186l684m348
$$ y = [920253, 919281, 920027, 921314, 922972, 925684, 929050, 931805, 933606, 934796, 935104, 934301, 933148, 931715, 928014, 920667, 911891, 905165, 900571, 894821, 885165, 870957, 852489, 831217, 810594, 793640, 779705, 765995, 751985, 739850, 730797, 723588, 716764, 709950, 702817, 694885, 686525, 678502, 670709, 662982, 656439, 651965, 647961, 641842, 633270, 623808, 614073, 603675, 593286, 584051, 575214, 565064, 554075, 544446, 536620, 529001, 521109, 514067, 507635, 499842, 490504, 482454, 478021, 476322, 475010, 472762, 469122, 463789, 457367, 451452, 447013, 443669, 440926, 438695, 436146, 431690, 424973, 417750, 411939, 407608, 403364, 398051, 391916, 386693, 384333, 384946, 386500, 387413, 388554, 391364, 395081, 397703, 398881, 399623, 399754, 398318, 396325, 396269, 398333, 399524, 397426, 392785, 387610, 382713, 378135, 374309, 371571, 369596, 368000, 366516, 364330, 360646, 356298]
55626C56298k954p47K68M3k11k65m21J4J655L403L912L785M261M682L498J064
55610C78285p81j397j564j529r32k80n63j591k347k573k509j749J4J723K206J997
55594C66410K235K493J805R46J415K608K519J044K27J026K156K503K510K504J701
55579C94102j03j493j320n56j101l373o030p677q114p958p561o680n196l827l541
55564C29572m280m969m916m465m006l350k467j909j937k073k071k333k900l044
55550B84852k521k097k257k487k424k418k319j256M86J050l97k211k790k871l702
55535B56638m414l380j169l9r05k490l128k139M3J930J878O1j287o65P17R77K55
55518B42883p6L66J250K712M450M868L172J387K079M881P312Q222Q164P180M756
$$ y = [356298, 353344, 352597, 352865, 352908, 352697, 352432, 352011, 352025, 353680, 357083, 360995, 364780, 369041, 373723, 377221, 378285, 377504, 376107, 374543, 373014, 372082, 371802, 371239, 369648, 367301, 364728, 362219, 360470, 360484, 362207, 364413, 366410, 368645, 371138, 372943, 373889, 375304, 377912, 380431, 381475, 381702, 382728, 384884, 387387, 389897, 392401, 394102, 393999, 392506, 391186, 390630, 389529, 386156, 380126, 372449, 364335, 356377, 348816, 342136, 336940, 333113, 329572, 325292, 320323, 315407, 310942, 306936, 303586, 301119, 299210, 297273, 295200, 293129, 290796, 287896, 284852, 282331, 280234, 277977, 275490, 273066, 270648, 268329, 267073, 267559, 268609, 268212, 266001, 263211, 260340, 256638, 252224, 248844, 247675, 247636, 246731, 244241, 241113, 238974, 239017, 240947, 242825, 242886, 241599, 240934, 241651, 242628, 242883, 242807, 243173, 244423, 247135, 251585, 256453, 259625, 261012, 263091, 267972, 275284, 283506, 291670, 298850, 303606]
55503C03606J638p42k523m773o828o805m990m094n371o705n722l161j847l211
55489B48472n793o948n568l223k284k963l137j582J36J34r63j474j470j932k194
55474B09211q91J082J334l58j673j235j52L18L68L41j03p76o34O46K130L096L631
55457B16335L597K516O39j267l082m729m859k424N46O05k303m430l568j844j764
55442A93968k355j512N4J16j082j139N78J968J509L34K22J002J169L14l00L53
55426A95199J548J810Q99r0n73j242k449l114k301r07l44k82O26K189K831K129
55410A95929J344J142P62n3j38J056K161J709J59r51j073q25q36j239j770j796
55394A95581q04P01J491J177O82O69M91n83j933k268j263K14J233J415P80m49
$$ y = [303606, 305244, 304502, 301979, 297206, 290378, 283573, 278583, 274489, 269118, 262413, 256691, 253530, 251683, 248472, 242679, 235731, 230163, 226940, 224656, 221693, 218556, 216974, 217110, 217244, 216281, 214807, 213337, 211405, 209211, 208320, 209402, 210736, 210378, 208705, 207470, 207318, 207636, 208004, 208345, 208242, 207466, 206832, 207478, 209608, 212704, 216335, 219932, 222448, 223087, 221820, 218738, 214009, 209150, 206726, 207272, 207877, 205574, 201144, 197576, 195732, 193968, 191613, 190101, 190155, 190271, 189189, 188050, 188628, 190596, 192105, 192439, 192661, 193663, 194832, 195146, 194846, 195199, 196747, 198557, 199456, 199366, 198793, 197551, 195102, 191988, 189687, 188780, 188436, 188154, 188780, 190969, 193800, 195929, 197273, 198415, 199177, 199124, 198986, 200042, 202203, 203912, 204071, 203120, 202047, 201222, 200386, 199147, 197377, 195581, 194777, 195478, 196969, 198146, 198828, 199497, 199988, 199405, 197472, 195204, 193941, 194155, 195388, 196803, 197583, 197134]
55378A97134j829k771k764j727l32L14j83r12p38L02J302J888K456L139L504L239
55362B02022K433J269J23l41K3K40m96j396j133MM72j13m78J48R43Q66j19j545
55344B02922k905l341k179k28O88p2j316j823j615j086k46P82J599K215K717K300
55328A98412K82j839j507J096K600R88j584k052o54K66O1m3K73l2j100j668j153
55311A92346n49p09j073p23K55J080J289Q91qj205k084j884m52J268J934J240
55295A91616L14K04L99k66j594k200j855k040l454m388k950K8J828J291k7k35
55279A76671O37J294J170Q44Q37Q36M55R6M14J068R09l36j453j396p68p34j142
55262A79402q68L24J540K215K591K820K743K609K768K619J140j267k823k630j716
$$ y = [197134, 195305, 192534, 189770, 188043, 187711, 188025, 187842, 186930, 186192, 186494, 187796, 189684, 192140, 195279, 198783, 202022, 204455, 205724, 205847, 205506, 205529, 205769, 205273, 203877, 202744, 202748, 203220, 203107, 202629, 202777, 203720, 204586, 204467, 202922, 200017, 196676, 194497, 194269, 194957, 194885, 193569, 191746, 190131, 189045, 188799, 189581, 191180, 193395, 196112, 198412, 198694, 196855, 195348, 196444, 199044, 200032, 198448, 196396, 195742, 196008, 196069, 196026, 196299, 196267, 195167, 193499, 192346, 191797, 191088, 190015, 189292, 189547, 190627, 191916, 192807, 192799, 191594, 189510, 187626, 187174, 188442, 190376, 191616, 191930, 192134, 192533, 192267, 190673, 188473, 186618, 184578, 181124, 176736, 173786, 173814, 175642, 176933, 176906, 176671, 177308, 178602, 179772, 180616, 181453, 182289, 182744, 182840, 183254, 184322, 185231, 184895, 183442, 182046, 181278, 180544, 179402, 178534, 178858, 180398, 182613, 185204, 188024, 190767, 193376, 196144, 198763, 199903, 198636, 195813, 193183, 191467]
55247A91467j383j640j743j317m24N23O65n59k249k792k001j288j414j504o97
55232A73644N90J690K521K834K046O16QM57M36o95j280o5J450J307K97O40K286
55215A88782K982J795K98NM48M07l50j184j583j401p78k00k07p40j043l55J291
55198A88167K883L117J662l09j313j219j001j029q00l81o01j260q15J157K613
55183A90871J634q37k270j786n66L08Q34J167J191R71N69l55j868k976k630j202
55167A83055K5N55Q07R24O36J46RK51M83P19J082R66k52j797k009m87J283J787
55149A88183J084L68N75J623K496J988r2k395l204k069nJ713K393J959Q52k11
55133A95258q93j469j984j718j09K153L673L696K296j11k660l956l276j641p00
$$ y = [191467, 190084, 188444, 186701, 185384, 184960, 185483, 186148, 185589, 183340, 180548, 178547, 177259, 175845, 174341, 173644, 174234, 175924, 178445, 181279, 183325, 183941, 183949, 184406, 184842, 184147, 182867, 182802, 184252, 185559, 185856, 186496, 188782, 191764, 193559, 193857, 193862, 194310, 194717, 194367, 193183, 191600, 190199, 189421, 189221, 189014, 188274, 187231, 186876, 188167, 191050, 194167, 195829, 195520, 194207, 192988, 191987, 190958, 190158, 189777, 189176, 187916, 187101, 188258, 190871, 192505, 191668, 189398, 187612, 187046, 187354, 188188, 189355, 190546, 191517, 192086, 191731, 189863, 186887, 184257, 183055, 183080, 183635, 184442, 185366, 186002, 186148, 186157, 186408, 186891, 187610, 188692, 189658, 189406, 187609, 185600, 185113, 186396, 188183, 189267, 189635, 190210, 191833, 194329, 196317, 196225, 193830, 190626, 188557, 188552, 190265, 192658, 194617, 195469, 195258, 194365, 192896, 190912, 189194, 189085, 191238, 194911, 198607, 200903, 200792, 198132, 194176, 190900, 189259, 188559]
55118A88559p80r15n19O6N17Q84R42L92j43N71K543L963L215J000k65P90K833
55101B03653L187R38j863k568j172j04q23j999j849p87l84p30n45N11J358J372
55085A98195J203J359J300N80j01K42J350J820P61r11j208O04K634K200q95l866
55069B05267m236k568j124q00o82j9P66R72M78k67n28J87J393J972J766J913K808
55052B07298K890Q50j911k784j315N42J202P37l17j632k439j813J9J849L012L659
55036B09847L745L164K592K729K816J543o74k118k394k659l086k293N3K164K711
55021B18140K560K870L086K229P52k24n10m35J76J333K018J274l84j716k287k343
55005B26539j857p35M89J174J365J277N72r33k330k405j200R5O11M94L59P31J770
$$ y = [188559, 187779, 186864, 186345, 186411, 186928, 187812, 188754, 189146, 189003, 189574, 192117, 196080, 199295, 200295, 200030, 200820, 203653, 206840, 207778, 205915, 203347, 202175, 202071, 201248, 199249, 197400, 196613, 196229, 195499, 194954, 195465, 196823, 198195, 199398, 200757, 202057, 202637, 202536, 202778, 204128, 205948, 206709, 205798, 204590, 205194, 207828, 210028, 209133, 205267, 201031, 198463, 197339, 196539, 195857, 195838, 196604, 197576, 198054, 197787, 197259, 197446, 198839, 200811, 202577, 204490, 207298, 210188, 211038, 209127, 206343, 205028, 205570, 206772, 207509, 207192, 205560, 203121, 201308, 201327, 203176, 206188, 209847, 213592, 216756, 219348, 222077, 224893, 226436, 225762, 223644, 221250, 218591, 215505, 213212, 213265, 215429, 218140, 220700, 223570, 226656, 228885, 229637, 229413, 228903, 228468, 228644, 229977, 231995, 233269, 232885, 231169, 228882, 226539, 224682, 223947, 224436, 225610, 226975, 228252, 228824, 227891, 225561, 223156, 221956, 222051, 222662, 223156, 223515, 224246, 226016]
54988B26016K965L253K124M32n01m20k40o92j504j965j805j350j025r13p78m45
54972B23152MM32P61P28l7j290j939j253M3P08O51P26J097J053N22M07J062J611
54954B28438J362P89N22L00l23j107j583j733j556p85L44Q82M67N7N33J267J023
54937B28897j99j263j507j340j373j701k020j915j132Q9J079J486J655K024K524
54922B25304K831K787K287J260M7p59j122j578k066j591K75K295K817J716L72
54907B34875p8J76R0j045k665l106j299J548K886J858M44Q33K667L902L676K966
54891B47728K773K879K406P52j912m412n111l518j054N01R77J287J481P17r11
54876B44583j943j413m8Q93J075R11P20P55J475K969M491N112M728L924L041J946
$$ y = [226016, 228981, 232234, 234358, 234790, 234289, 233869, 233629, 232937, 231433, 229468, 227663, 226313, 225288, 224375, 223597, 223152, 223156, 223588, 224349, 225077, 225040, 223750, 221811, 220558, 220601, 221309, 221960, 222686, 223783, 224836, 225358, 225765, 226827, 228438, 229800, 230589, 231111, 231411, 231088, 229981, 228398, 226665, 225109, 224324, 224668, 225550, 226017, 226074, 226607, 227874, 228897, 228698, 227435, 225928, 224588, 223215, 221514, 219494, 217579, 216447, 216536, 217615, 219101, 220756, 222780, 225304, 228135, 230922, 233209, 234469, 234516, 233757, 232635, 231057, 228991, 227400, 227675, 229970, 232787, 234503, 234875, 234797, 234973, 235063, 234018, 231353, 228247, 226948, 228496, 231382, 233240, 233684, 234517, 237184, 241086, 244762, 247728, 250501, 253380, 255786, 256538, 254626, 250214, 245103, 241585, 240531, 241032, 242009, 243296, 244777, 245494, 244583, 242640, 241227, 241179, 242072, 243147, 244058, 244778, 245533, 247008, 249977, 254468, 259580, 264308, 268232, 271273, 273219]
54860B73219P31R7P30K496M534O119P104P552P281O102M337K666J408L64o65j664
54844C22411k752m139n469n801m781l440l151l978m711m504l792l353l128k474
54830B66938j412q42j348k266k469j797r77j97J340L914O252O937O237N503N025
54815B90838L837J771L59J032L346N630O820O993O597N874M787L066M80k601n187
54800C33642o441o399n779n328n378n753o045o119o194o180n473l948k622k392
54786B59591k612k057j020r25j986k845k828k809l277l196j701L62J620J755J141
54771B39213N4q83p25L32P40r6o61L43J884K296J811J588J459O11l12l2R80J063
54753B49665N3o45n30m87p48m96J97J05r55j472o19M31M33j08l2P38J515J959
$$ y = [273219, 273950, 274047, 274777, 277273, 281807, 287926, 295030, 302582, 309863, 315965, 320302, 322968, 324376, 324740, 324075, 322411, 319659, 315520, 310051, 304250, 299469, 296029, 292878, 288900, 284189, 279685, 275893, 272540, 269412, 266938, 265526, 264684, 263336, 261070, 258601, 256804, 255827, 255630, 256970, 260884, 267136, 274073, 280310, 285813, 290838, 294675, 296446, 296805, 297837, 301183, 306813, 313633, 320626, 327223, 333097, 337884, 340950, 341430, 338829, 333642, 327201, 320802, 315023, 309695, 304317, 298564, 292519, 286400, 280206, 274026, 268553, 264605, 261983, 259591, 256979, 254922, 253902, 252977, 250991, 248146, 245318, 242509, 239232, 236036, 234335, 234697, 236317, 238072, 239213, 239267, 238384, 237659, 237991, 238731, 238635, 237974, 238317, 240201, 242497, 244308, 245896, 247355, 247966, 247654, 247622, 248602, 249665, 249718, 249073, 248543, 248056, 247308, 246812, 247009, 247114, 246159, 244687, 244068, 244499, 244932, 244824, 244792, 245530, 247045, 249004]
54735B49004J994J453N42mK16Q23J456K186K851K931K455K026J574L18j543k467
54719B65815j782r23j282k016j438L79J918K534K797K901K396J632J840L335M889
54704B82995N468N509N862O355O324N932O039O864P553P110N385K994N97j565
54690C53422l496m964n431m704l552l157l753m264l710k645k476l576m907n578
54676B97209n847o048n500l509r52L38j91j294j702j344n01J079L428N528O209
54661B86903N511M477L927M058M847O065P033P010N826L854J727K97K11P91J52
54646C42689k624n841o910n430l421k625k846l201l502l817l696k813j805j678
54632B92480k563l618m035l744l256l024l068l072k935k912l066k955k354j901
$$ y = [249004, 250998, 252451, 252993, 252989, 253205, 254028, 255484, 257670, 260521, 263452, 265907, 267933, 269507, 269825, 268282, 265815, 264033, 263110, 261828, 259812, 258374, 258753, 260671, 263205, 266002, 268903, 271299, 272931, 274771, 278106, 282995, 288463, 293972, 299834, 306189, 312513, 318445, 324484, 331348, 338901, 346011, 351396, 354390, 354987, 353422, 349926, 344962, 339531, 334827, 331275, 328118, 324365, 320101, 316391, 313746, 311270, 307694, 302787, 297209, 291362, 285314, 279814, 276305, 275353, 275691, 275500, 274206, 272504, 271160, 270659, 271738, 275166, 280694, 286903, 292414, 296891, 300818, 304876, 309723, 315788, 322821, 329831, 335657, 339511, 341238, 341535, 341746, 342537, 342689, 340065, 334224, 327314, 321884, 318463, 315838, 312992, 309791, 306289, 302472, 298776, 295963, 294158, 292480, 289917, 286299, 282264, 278520, 275264, 272240, 269172, 266100, 263165, 260253, 257187, 254232, 251878, 249977]
54618B49977k253k800k164j27J826K282J494P42P53J251J678J751J402O56l80
54603B56088j462k147j949q48M10R45N98p8o75j185j518j410r37n56m39k49K54
54586B44842Q37J162J104O04k57q83n53O14J651J974J941J907J534N82l02l48
54570B56409K17N78N27M30K35n30j652k053j169J06N01Q8K08J577L083K960R42
54553B62457j385k433k233j836j623r54M91J828J858M94j081j621r37J30O33L29
54537B54117l11o60l97L91J289J708J310M62q4r2j84j039k496l607l430j664J019
54520B46332L134L449K232R85O35N44k28j416j929j300O8J600K753K933K070R51
54504B62813K23n32j844k917k341r7K230L275K992K021R71K99k3p10k066k988
$$ y = [249977, 247724, 244924, 242760, 242633, 244459, 246741, 248235, 248977, 249730, 250981, 252659, 254410, 255812, 256468, 256088, 254626, 252479, 250530, 249682, 250092, 251037, 251635, 251557, 250882, 249697, 248179, 246769, 245832, 245276, 244837, 244588, 244842, 245679, 246841, 247945, 248549, 248292, 247409, 246856, 247470, 249121, 251095, 253036, 254943, 256477, 257059, 256757, 256409, 256626, 257204, 257731, 258161, 258396, 257866, 256214, 254161, 252992, 253098, 253599, 253687, 253895, 255472, 258555, 261515, 262457, 261072, 258639, 256406, 254570, 252947, 251993, 252484, 254312, 256170, 256664, 255583, 253962, 253025, 253155, 253788, 254117, 253806, 253146, 252749, 253140, 254429, 256137, 257447, 257909, 257825, 257733, 257549, 256510, 254014, 250407, 246977, 245313, 246332, 249466, 252915, 255147, 256132, 256767, 257311, 257083, 255667, 253738, 252438, 252506, 254106, 256859, 259792, 261862, 262813, 263036, 262504, 260660, 257743, 255402, 255305, 257535, 260810, 263802, 265823, 266794, 267093, 267070, 266360, 264294, 261306]
54488B61306k252n55J99l34n12O43K054K387J710N79r47k364k214K1K516L026
54472B65263J634L85O92K158L547L809K455j9k104k511j453k88K7l36n38O8J263
54455B74052J916J150l47r20j63N26O6q40j188j361k020k368j191Q95J973J430
54439B71610N54M35O89O02K84K38N24P31L13j038k813l729l161k106j709j202
54423B60222J051M483O168M563J715N94J335J711N73q86j253o54K5M69P45N94
54407B81455j43q11o12Q7k3j374k689k505r69N15J084J144J364J768J958J651
54391B81900P84l18q16pJ643K681K209O91r24k210l045l187k670k001j482p86
54375B72462K61J181J584J748J815J260M1n69M72K213K819K018J029M32l14j141
$$ y = [261306, 259054, 258499, 258698, 258364, 257852, 258495, 260549, 262936, 264646, 265225, 264278, 261914, 259700, 259721, 262237, 265263, 266897, 267282, 267974, 270132, 273679, 277488, 279943, 279924, 277820, 275309, 273856, 273568, 273595, 273259, 272721, 272789, 274052, 275968, 277118, 276771, 275851, 275688, 276214, 276280, 275440, 274252, 272891, 270871, 268503, 267312, 268207, 270180, 271610, 272164, 272599, 273288, 273890, 274174, 274412, 274936, 275667, 275980, 274942, 272129, 268400, 265239, 263133, 261424, 260222, 261273, 265756, 271924, 276487, 278202, 278796, 280131, 281842, 282415, 281529, 280276, 279622, 279647, 280116, 280861, 281455, 281312, 280501, 279889, 279976, 279953, 278579, 275890, 273385, 272416, 272931, 274015, 275159, 276523, 278291, 280249, 281900, 282684, 282366, 281550, 281543, 283186, 285867, 288076, 288767, 287843, 285633, 282588, 279401, 276731, 274730, 273248, 272462, 272723, 273904, 275488, 277236, 279051, 280311, 280352, 279783, 280255, 282468, 285287, 287305, 288334, 288766, 288452, 287311]
54359B87311r04P61K486K835J950P87l17j463k313k395j870j234m84O54J874K307
54343B89985J466j93j607j866p79R58K334K807K465J513J98p52l95J237K805L091
54327C03267K312J440P52l9o41l03P54J167K24r87r50K98J397J558J329J348J286
54310C14212M97q10j677j443j98J571L170L634K334j9j511q62J049J983P82j414
54294C21298k580k122j357j705k848l130j667M59J424P34m05o26J26Q22O69K9
54278C09121J1J168K675L114K227J391J893L143L474K499J668K308L923M902M324
54263C47841K625J025O19J524K548K174J64k147l491l952m213m202l303j599j02
54248C35511L44j09o48p47p52j512l381n551o718o279m599k299K1J570J834J421
$$ y = [287311, 286407, 287168, 289654, 292489, 294439, 295226, 294909, 293446, 291133, 288738, 286868, 285634, 285150, 285804, 287678, 289985, 291451, 291258, 289651, 287785, 287006, 287964, 290298, 293105, 295570, 297083, 297281, 296529, 296134, 297371, 300176, 303267, 305579, 307019, 307771, 307732, 307091, 306788, 307542, 308709, 308933, 307946, 306996, 307294, 308691, 310249, 311578, 312926, 314212, 314709, 313899, 312222, 310779, 310581, 312152, 315322, 318956, 321290, 321271, 319760, 318898, 319947, 321930, 322712, 321298, 318718, 316596, 315239, 313534, 310686, 307556, 305889, 306348, 307772, 308506, 308101, 307475, 307601, 308423, 309092, 309121, 309132, 310300, 312975, 316089, 318316, 319707, 321600, 324743, 328217, 330716, 332384, 334692, 338615, 343517, 347841, 350466, 351491, 352110, 353634, 356182, 358356, 358520, 356373, 352882, 348930, 344717, 340515, 337212, 335613, 335511, 335855, 335746, 335098, 334351, 333599, 332087, 328706, 323155, 316437, 310158, 305559, 303260, 303281, 304851, 306685, 308106]
54232C08106J438J823J370k69j878k480k573k663k035k36J434J436K04p27j043
54217C01907j370j361o2K011L147K906K437K138J025r25j801k81K229L342K484
54202C17826Q54n12j283j139Q5J638K303J676M37n50q21k14J065K225K341J230
54186C27161l69j550j940j701j134m36J83M37K39J5L87J254J594N88j236k573
54170C20919k854k618k432k174j557p71k98l97r35j399j120K7J197J373O43J43
54154C07747N53J331J654J463J096M04r98k613k921r37K158L629J992j089k524
54139C10945j317P23J843K357K915K556L14k238k445l49J268Q65j8L40J156P32
54123C19647p32j576j161n15p34j663k084q00K029M392M026Q95k652m507m586
$$ y = [308106, 309544, 311367, 312737, 312468, 310590, 308110, 305537, 302874, 300839, 300603, 302037, 303473, 303677, 302950, 301907, 300537, 299176, 299114, 301125, 304272, 307178, 309615, 311753, 312778, 311853, 310052, 309771, 312000, 315342, 317826, 318680, 318168, 316885, 315746, 315831, 317469, 319772, 321448, 321885, 321335, 320514, 320300, 321365, 323590, 325931, 327161, 326792, 325242, 323302, 321601, 320467, 320031, 320214, 320651, 320890, 320905, 321292, 322546, 324140, 324728, 323492, 320919, 318065, 315447, 313015, 310841, 309284, 308513, 308215, 307818, 306883, 305484, 304364, 304391, 305588, 306961, 307604, 307747, 308300, 309631, 311285, 312748, 313844, 314248, 313250, 310637, 307716, 306779, 308937, 312566, 314558, 313469, 310945, 309628, 310351, 312194, 314551, 317466, 320022, 320336, 318098, 315653, 315304, 316572, 317437, 317419, 317759, 318915, 319647, 318915, 317339, 316178, 315663, 314929, 313266, 311182, 310382, 312411, 316803, 320829, 321724, 319072, 314565, 309979]
54108C09979l702k142k67Q32O74M44J290K370K033L66j103j788k468l307l204
54093C00007j570O33K175K917L219K930J727o0j507j908j257k02L30q9r56j464
54077C04925j539j690j927j519j31J473K373K606K811L057K697J547N32P57K042
54062C18014K921K324P98l12o36r92j881k579k209j072k73k85m98j32Q50J769
54046C15807J853R27k90p25P6J525K637K842K156J048K92M44J149J388P18k37
54030C31610p40p98o71l01J65Q5o56j006j49J060J223N50N94J903L379M008L941
54013C44197L439K192L24j032j126p16q97j407j192k23L66n4p70p69O2J094J752
53996C45240J800J344R17J277K546L694L430J826N68J154L143M622M400L179K477
$$ y = [309979, 306277, 304135, 303868, 304700, 305374, 305818, 307108, 309478, 311511, 311877, 310774, 308986, 306518, 303211, 300007, 298437, 299070, 301245, 304162, 307381, 310311, 312038, 311978, 310471, 308563, 307306, 307104, 307434, 307345, 306389, 304925, 303386, 301696, 299769, 298250, 298119, 299592, 301965, 304571, 307382, 310439, 313136, 314683, 315215, 315972, 318014, 320935, 323259, 324057, 323745, 323109, 322117, 320236, 317657, 315448, 314376, 314103, 313818, 313320, 313188, 314038, 315807, 317660, 318587, 318297, 317572, 317648, 319173, 321810, 324652, 326808, 327856, 328148, 328592, 329741, 331129, 331847, 331610, 330870, 330072, 329401, 329100, 329265, 329350, 328694, 327688, 327539, 328599, 329822, 330372, 330966, 332869, 336248, 340256, 344197, 347636, 349828, 350152, 349120, 347994, 347278, 346381, 344974, 343782, 343559, 343925, 343871, 343101, 342332, 342394, 343488, 345240, 347040, 348384, 349301, 350578, 353124, 356818, 360248, 362074, 362642, 363796, 366939, 371561, 375961, 379140, 381617]
53981C81617K999M369N933P192P688P233O349O004O578P473P843P486O744N787
53967D71295M467K938J993K410L975N543O215O055N461M334K510P55L03J185J849
53952E21288J006o75j275L24L610P202R871J1074J1243J1572J2787J4076J3630
53939F15733J0329M644j978q192j3156j6424j7925j8003j7330j6510j5569j3992
53927D91627j1670r653r257j0160j0253q042m519j961j340j849k529l180l726
53914D13488l843l479k900k015m51J327J903M99j870l395l277k073p35K28P63
53899C94170R65Q81N82M53J155K825M414M539L105J413N09K34K01O76J786K790
53883D20698L199L844N551P143O500L710J504J862L607M440M184M468N878P152
$$ y = [381617, 384616, 388985, 394918, 402110, 409798, 417031, 423380, 429384, 435962, 443435, 451278, 458764, 465508, 471295, 475762, 478700, 480693, 483103, 487078, 492621, 498836, 504891, 510352, 514686, 517196, 517951, 518254, 519439, 521288, 522294, 521619, 520344, 520668, 524278, 531480, 541351, 552425, 563668, 575240, 588027, 602103, 615733, 626062, 630706, 628728, 620536, 607380, 590956, 573031, 555028, 537698, 521188, 505619, 491627, 479957, 470304, 461047, 450887, 440634, 432592, 428073, 426112, 424772, 422923, 420394, 417214, 413488, 409645, 406166, 403266, 401251, 400800, 402127, 404030, 404529, 402659, 399264, 395987, 393914, 393179, 393407, 394170, 395135, 396016, 396598, 397051, 398206, 401031, 405445, 409984, 413089, 414502, 415011, 415245, 415446, 416122, 417908, 420698, 423897, 427741, 433292, 440435, 446935, 450645, 452149, 454011, 457618, 462058, 466242, 470710, 476588, 483740]
53869D83740P218O445N525M377K888J791J921L175M760N958O187N147L600L248
53855E45980M802O834P540P106P044P678P784O696N254M382L942L353K269M70
53841F21134j813l319k896j451j234k641l613k902k112l070m915n664n294n259
53827E74951n827o161o411p510r005r217p748n943m639l299j787j114j696k489
53813E02105k722l061m013m508l278q61J035J572J205M27q59k795m948o340o023
53798D66936l919j142Q59J602J618J540J836L183N812Q491R537R218R720J2071
53784E27362J4525J5112J4608J5623J9292K4064K7243K6614K1222J1970J562p205
53772G11992j3272j7023j8672j8084j5989j4069j3315j2954j1422q050l581M92
$$ y = [483740, 490958, 497403, 502928, 507305, 510193, 511984, 513905, 517080, 521840, 527798, 533985, 539132, 542732, 545980, 550782, 557616, 565156, 572262, 579306, 586984, 594768, 601464, 606718, 611100, 615042, 618395, 620664, 621134, 619321, 616002, 613106, 611655, 610421, 607780, 604167, 601265, 599153, 596083, 591168, 585504, 580210, 574951, 569124, 562963, 556552, 549042, 540037, 530820, 523072, 517129, 512490, 509191, 507404, 506290, 504594, 502105, 499383, 496322, 492309, 487801, 484523, 483662, 484697, 486269, 487474, 487901, 487042, 484247, 479299, 472959, 466936, 463017, 461875, 462734, 464336, 465954, 467494, 469330, 472513, 478325, 486816, 496353, 505571, 515291, 527362, 541887, 556999, 571607, 587230, 606522, 630586, 657829, 684443, 705665, 717635, 719197, 711992, 698720, 681697, 663025, 644941, 628952, 614883, 601568, 588614, 577192, 569142, 565561, 566053]
53760E66053K930L405K468Q62j079l290n486p102p699p304o406n580m952m091
53746E22729k824j917k228l241l374k022l00O69J159J827K362K291K226K970L872
53731E24199L525J955P34Q99J881K669K955K812K155R54o98k797n108o672o607
53716E22856n422m487m121l455k448k485m104n614n347m258m508n977o182l888
53702D60560j120n36k014l111k400j013p21j537j906p89J176K561K537J212p76
53687D52123k478k803j303J011K259J468m30j694j562o98j13j32m23m74J25J506
53671D46382L314M709M906L770J923L04l18K79J575K552K544J929J761K578L867
53656D82075M857N407N710N563M578L084K025J881K205K529L047L941M601M272
$$ y = [566053, 568983, 572388, 574856, 575718, 574639, 571349, 565863, 558761, 551062, 543758, 537352, 531772, 526820, 522729, 519905, 517988, 515760, 512519, 509145, 507123, 506823, 507492, 508651, 510478, 512840, 515131, 517357, 520327, 524199, 527724, 529679, 530413, 531312, 533193, 535862, 538817, 541629, 543784, 544738, 544040, 541243, 536135, 529463, 522856, 517434, 512947, 508826, 505371, 502923, 500438, 496334, 490720, 485373, 481115, 476607, 470630, 464448, 460560, 459440, 458904, 456890, 453779, 451379, 450366, 449645, 448108, 446202, 445413, 446589, 449150, 451687, 452899, 452123, 449645, 446842, 445539, 446550, 448809, 450277, 449847, 448153, 446591, 445893, 445780, 445648, 445225, 444751, 444876, 446382, 449696, 454405, 459311, 463081, 465004, 465308, 464990, 465269, 466844, 469396, 471940, 473869, 475630, 478208, 482075, 486932, 492339, 498049, 503612, 508190, 511274, 513299, 515180, 517385, 519914, 522961, 526902, 531503, 535775]
53642E35775L260K659K842K958K280J409J606L097M713N233M648L904L756M213
53628E82353M840N088M361K448J70r60k83J096J401R3j768k786k383r98J98K0
53612E92890j507k695j870M41K030J741N27n08j572k930l630k880j715j667k390
53597E74265k220q48L26M59K89N88J043J191J162R32J09r08p87Q41K524K981K867
53580E84814L304L783L178K166K674M869O545N995M012K363J540J077J040J957
53566F29317L605N020N651N794N866N917N896N817N575N097M775N224O446P592
53552G07592P833P181O350O079O715Q042R192R035P142M323J953P98O73J064J666
53537G85638K260K475J945P23n49j055n72J46L2j000j752j084N11J216j23k633
$$ y = [535775, 539035, 541694, 544536, 547494, 549774, 551183, 552789, 555886, 560599, 565832, 570480, 574384, 578140, 582353, 587193, 592281, 596642, 599090, 599260, 598300, 598017, 599113, 600514, 600607, 598839, 596053, 593670, 592672, 592870, 592890, 591383, 588688, 586818, 587259, 589289, 591030, 591557, 591049, 589477, 586547, 582917, 580037, 578322, 576655, 574265, 572045, 571197, 571523, 571982, 572271, 572859, 573902, 575093, 576255, 577187, 577296, 576388, 575601, 576442, 578966, 581947, 584814, 588118, 591901, 595079, 597245, 599919, 604788, 611333, 617328, 621340, 623703, 625243, 626320, 627360, 629317, 632922, 637942, 643593, 649387, 655253, 661170, 667066, 672883, 678458, 683555, 688330, 693554, 700000, 707592, 715425, 722606, 728956, 735035, 741750, 749792, 758984, 768019, 775161, 779484, 781437, 782235, 782908, 783972, 785638, 787898, 790373, 792318, 793041, 792492, 791437, 790865, 791011, 791043, 790043, 788291, 787207, 787718, 788934, 788811, 786178]
53521G86178m332m149k795j721j523j633j372r10q47j136j006r2R51J262O71n25
53505G67021k082l373l060l09L734O744P713P749Q195Q949R244R161R462J0323
53491H39471J1015J0813R655Q066O746O116N972N706N055M360M003L976M208M825
53477I29987N835P065Q619J0820J3349J5143J5758J6100J7222J9024K0940K3155
53465A103017K6074K8977L0506L0391K9694K9324K9296K9587L0665L2890L6061
53454A436482L9682M3017M4931M4664M3131M2507M4038M6759M8702M8864M7743
53443A930520M6514M5949M5709M4570M1936L9069L7931L8687L9419L8745L7481
53432B386530L6941L6762L5679L3793L2542L2564L2911L2574L1710L0880L0010
$$ y = [786178, 781846, 777697, 774902, 773181, 771658, 770025, 768653, 767743, 766896, 765760, 764754, 764662, 765613, 766875, 767546, 767021, 764939, 761566, 758506, 758197, 761931, 768675, 776388, 784137, 792332, 801281, 810525, 819686, 829148, 839471, 850486, 861299, 870954, 879020, 885766, 891882, 897854, 903560, 908615, 912975, 916978, 920954, 925162, 929987, 935822, 942887, 951506, 962326, 975675, 990818, 1006576, 1022676, 1039898, 1058922, 1079862, 1103017, 1129091, 1158068, 1188574, 1218965, 1248659, 1277983, 1307279, 1336866, 1367531, 1400421, 1436482, 1476164, 1519181, 1564112, 1608776, 1651907, 1694414, 1738452, 1785211, 1833913, 1882777, 1930520, 1977034, 2022983, 2068692, 2113262, 2155198, 2194267, 2232198, 2270885, 2310304, 2349049, 2386530, 2423471, 2460233, 2495912, 2529705, 2562247, 2594811, 2627722, 2660296, 2692006, 2722886, 2752896]
53421B752896K8760K7346K6194K4951K2556J8550J3820R645O206K578j777o108
53409B925617r378j1642j3787j6221j8712k1335k4502k7846l0146l0946l1291
53398B689811l2152l2983l2960l2875l4375l7372l9686l9564l7579l5398l3620
53387B301247l1567k8685k5335k2331k0290j9284j8635j7082j3875r772o449m532
53375B083410k711O15N058Q447R506R554J0957J4387J8427K1568K3703K5540K7528
53362B255989K9829L2658L5934L9003M1343M3271M5523M8256N0958N3190N5004
53351B730958N6826N9345O3160O7980P2387P5144P6667P8519Q1444Q4718Q7606
53340C534754R0487R3910R7247R9246R9731R9876J00625J01527J01441J00018
$$ y = [2752896, 2781656, 2809002, 2835196, 2860147, 2882703, 2901253, 2915073, 2924718, 2930924, 2933502, 2931725, 2925617, 2916239, 2904597, 2890810, 2874589, 2855877, 2834542, 2810040, 2782194, 2752048, 2721102, 2689811, 2657659, 2624676, 2591716, 2558841, 2524466, 2487094, 2447408, 2407844, 2370265, 2334867, 2301247, 2269680, 2240995, 2215660, 2193329, 2173039, 2153755, 2135120, 2118038, 2104163, 2094391, 2087942, 2083410, 2080699, 2081314, 2086372, 2094819, 2104325, 2113879, 2124836, 2139223, 2157650, 2179218, 2202921, 2228461, 2255989, 2285818, 2318476, 2354410, 2393413, 2434756, 2478027, 2523550, 2571806, 2622764, 2675954, 2730958, 2787784, 2847129, 2910289, 2978269, 3050656, 3125800, 3202467, 3280986, 3362430, 3447148, 3534754, 3625241, 3719151, 3816398, 3915644, 4015375, 4115251, 4215876, 4317403, 4418844, 4518862]
53330D518862R8048R6432R5226R3646R0905Q6831Q1849P6376P0333O3303N5186
53319E426997M6561L8225L0460K2985J5502P921Q4q262j7005k5673l4242m3402
53307E460151n3473o3474p2101p9340q6193r2826r8081j01105j02469j03125j03059
53296D504905j01741r9290r6459r3792r1368q9077q6572q3397p9824p7176p6554
53285C529655p7460p8201p7440p4826p0629o5628o1006n7491n4691n1884m8990
53274B811409m5941m1816l6117l0506k7446k6957k6599k5112k4026k4625k5277
53263B476987k3707k0537j8303j7568j6307j3266r755p367n646l167J28L002M862
53250B349356O335Q023R613J0640J1520J3258J6317K0184K4092K7828L1476L4641
$$ y = [4518862, 4616910, 4713342, 4808568, 4902214, 4993119, 5079950, 5161799, 5238175, 5308508, 5371811, 5426997, 5473558, 5511783, 5542243, 5565228, 5580730, 5588651, 5588735, 5580473, 5563468, 5537795, 5503553, 5460151, 5406678, 5343204, 5271103, 5191763, 5105570, 5012744, 4914663, 4813558, 4711089, 4607964, 4504905, 4403164, 4303874, 4207415, 4113623, 4022255, 3933178, 3846606, 3763209, 3683385, 3606209, 3529655, 3452195, 3373994, 3296554, 3221728, 3151099, 3085471, 3024465, 2966974, 2912283, 2860399, 2811409, 2765468, 2723652, 2687535, 2657029, 2629583, 2602626, 2576027, 2550915, 2526889, 2502264, 2476987, 2453280, 2432743, 2414440, 2396872, 2380565, 2367299, 2357544, 2350177, 2344531, 2341364, 2341492, 2344494, 2349356, 2355691, 2363714, 2373327, 2383967, 2395487, 2408745, 2425062, 2445246, 2469338, 2497166, 2528642, 2563283]
53238B563283L6553L7055L7074L7777L9472M1532M3042M3446M2896M2160M1776
53227C006066M1137L9054L5493L1904K9100K5712J9976J2548N983J444k629q037
53215C237751j4296j9487k2805k5309k8380l2308l6395l9934m2828m5403m7761
53204B882845m9641n0982n2176n3287n3574n2624n1569n2076n4135n6104n6982
53193B299695n7297n7443n6685n4628n2202n0172m7959m5280m3611m4209m5595
53182A744614m5087m2486m0078l9038l7980l5610l2734l0549k8523k5506k1938
53171A365085j9546j9170j9954k0517k0194j9300j8710j9019j9819k0108j9646
53160A149102j9326j9893k0965k1795k2278k2542k2162k0733j8793j7258j6180
$$ y = [2563283, 2599836, 2636891, 2673965, 2711742, 2751214, 2792746, 2835788, 2879234, 2922130, 2964290, 3006066, 3047203, 3086257, 3121750, 3153654, 3182754, 3208466, 3228442, 3240990, 3246973, 3248417, 3245788, 3237751, 3223455, 3203968, 3181163, 3155854, 3127474, 3095166, 3058771, 3018837, 2976009, 2930606, 2882845, 2833204, 2782222, 2730046, 2676759, 2623185, 2570561, 2518992, 2466916, 2412781, 2356677, 2299695, 2242398, 2184955, 2128270, 2073642, 2021440, 1971268, 1923309, 1878029, 1834418, 1790209, 1744614, 1699527, 1657041, 1616963, 1577925, 1539945, 1504335, 1471601, 1441052, 1412529, 1387023, 1365085, 1345539, 1326369, 1306415, 1285898, 1265704, 1246404, 1227694, 1208675, 1188856, 1168748, 1149102, 1129776, 1109883, 1088918, 1067123, 1044845, 1022303, 1000141, 979408, 960615, 943357, 927177]
53149I27177j4930j3548j2972j3761j5233j6216j6149j5286j4120j2952j1914
53138G70096j1229j1261j1979j2517j1840j0067q571q375r062r607r589q993p642
53125F39364n824m792n376o419o001m153k859l234m159m293m038m404n133n096
53111E73583m009k540j100L47J479J676R93J64m78j338k503l143k399m63J573
53096E61842K683K453J100o22j704j594o78R7R8o60j830l073m058m469m274l808
53080E41503l400k984k264j170l2P73J161J304J383J369J026J75q98j444r49J87
53064E35740R91R51L95k33r06j570j717r98jK88k75q73r29q32j179j790j957j450
53046E23655p89n38n86l92K52Q06L89j360l781n491n347l370q46O57O11j74o60
$$ y = [927177, 912247, 898699, 885727, 871966, 856733, 840517, 824368, 809082, 794962, 782010, 770096, 758867, 747606, 735627, 723110, 711270, 701203, 692632, 684257, 675195, 665588, 655999, 647006, 639364, 633540, 628748, 623372, 616953, 610952, 606799, 603940, 600706, 596547, 592254, 588216, 583812, 578679, 573583, 569574, 567034, 565934, 566281, 567760, 569436, 570429, 570593, 570115, 568777, 566274, 563131, 560732, 560269, 561842, 564525, 566978, 568078, 567456, 565752, 564158, 563480, 563577, 563675, 563015, 561185, 558112, 554054, 549585, 545311, 541503, 538103, 535119, 532855, 531685, 531653, 532426, 533587, 534891, 536274, 537643, 538669, 538844, 537946, 536502, 535553, 535740, 536731, 537682, 538077, 537844, 536938, 535368, 533651, 532653, 532652, 532940, 532665, 531792, 530863, 530031, 528852, 527062, 525105, 523655, 522866, 522328, 521742, 521350, 521602, 522408, 522797, 521437, 517656, 512165, 506818, 503448, 502602, 503259, 503870, 503696, 503036]
53029E03036p06p69r00p84n99q67j237n48J341K709J951k76j965k350k447l161
53013D92428m120m569m343l496j898K92K281L206K834J584K44l84j00M19N53P98
52997D85729K092M156N582N699N175M475L131J285N51J946L891L799J354j248
52983E27617k253k190k513l524m269l957k874k079k270k960k933j816p63j019
52969D92197k125k428j338j14j34j175j915j644p96o6M05Q43J255J309P52j85
52953D84841r94j386j393r94k3J359K490K841K673K570K554K077R17l02p40j98
52937D96292O65J014P10M68R44J685J532K03j115j263o50m92r74j065j11J300
52921D99143K252K506K320J920J554J585K072K519K381J636Q05N96J459L004L972
$$ y = [503036, 502330, 501561, 500661, 499877, 499278, 498411, 497174, 496626, 497967, 500676, 502627, 502351, 500386, 498036, 495589, 492428, 488308, 483739, 479396, 475900, 474002, 474294, 476575, 479781, 482615, 484199, 484443, 484059, 483959, 484378, 484931, 485729, 487821, 491977, 497559, 503258, 508433, 512908, 516039, 517324, 517875, 519821, 523712, 527511, 528865, 527617, 525364, 523174, 520661, 517137, 512868, 508911, 506037, 503958, 501688, 498728, 495795, 493979, 493216, 492197, 490072, 487644, 486306, 486192, 486058, 484883, 482968, 481324, 480528, 480462, 480867, 481710, 482965, 484274, 485026, 484841, 483847, 482461, 481068, 480074, 480051, 481410, 483900, 486741, 489414, 491984, 494538, 496615, 497532, 497230, 496490, 496292, 496957, 497971, 498681, 499149, 500093, 501778, 503310, 503513, 502398, 501135, 500485, 499993, 499019, 497954, 497843, 499143, 501395, 503901, 506221, 508141, 509695, 511280, 513352, 515871, 518252, 519888, 520693, 521289, 522748, 525752, 529724]
52906E29724L425K000J289J823K522K539K520L284M102L639K121J103R92K87k078
52891E59292m842n874m907l642l344l486l039k134j728k175k828l022k800k515
52877E12956k214j718j140r08j278j950k290j881r09K8M22J68n59j460k079j933
52861D93255r49K93J044J018M19m34j085r76j05N56J85n11j05J261J802P95j30
52844D96333M82J421O04j500k360j054N79P82l2o83r55r35k25R75J327L55k93
52827D94821O84J624%l445n189l749j533j063j599j100K73P09k11j109j207j165
52811D76741j386j106J86J708K494K650K801K960K789K430K322K447K360J847
52797E01243J108M05q1k44k75o52j484k082j684m53N98O97q3j110j749j804j769
$$ y = [529724, 533149, 535149, 536438, 538261, 540783, 543322, 545842, 549126, 553228, 556867, 558988, 560091, 561083, 561370, 559292, 554450, 548576, 543669, 540027, 536683, 533197, 530158, 528024, 526296, 524121, 521293, 518271, 515471, 512956, 510742, 509024, 507884, 506976, 505698, 503748, 501458, 499577, 498668, 498696, 499118, 499286, 498727, 497267, 495188, 493255, 492306, 492599, 493643, 494661, 495080, 494646, 493561, 492585, 492480, 493036, 493221, 492710, 492605, 493866, 495668, 496463, 496333, 496815, 498236, 498840, 497340, 494980, 493926, 494505, 495287, 495255, 494572, 493617, 492682, 492457, 493432, 494759, 495114, 494821, 495505, 497129, 497129, 493684, 488495, 484746, 483213, 482150, 480551, 479451, 479724, 480433, 480222, 479113, 477906, 476741, 475355, 474249, 474435, 476143, 478637, 481287, 484088, 487048, 489837, 492267, 494589, 497036, 499396, 501243, 502351, 502756, 502675, 502431, 502156, 501504, 500020, 497938, 496254, 495801, 496399, 497096, 497013, 495903, 494154, 492350, 490581]
52780D90581k435l839m911m690l567k667k333k132k062k518k998k222j07J575
52766D55675J396K55J20J360K455K034K16j966l548l950l088j477J69J546K677
52751D53874L375L268K373J203K81j33J13J046K352L415L685K932J381j95q46
52736D78124l28O00R91N56m96j953l449m332m299l798l171k073m53N46n4j291
52720D55120j300N7J102R99P88J308J741J162K00m9L36P51J386K547L307K447
52704D71902L47j457k497l558m651m431k358j4P98M42P29K266L678L550K121O22
52688D67489l94j255j977j782j68K001L173K661J082n40j413q26J430M163N257
52673D78901M014K211J957L156M122M065L512K654J147l23k29J302J895J17k238
$$ y = [490581, 488146, 484307, 479396, 474706, 471139, 468472, 466139, 464007, 461945, 459427, 456429, 454207, 454100, 455675, 457071, 457326, 457446, 458806, 461261, 463295, 463511, 461545, 457997, 454047, 450959, 449482, 449651, 451197, 453874, 457249, 460517, 462890, 464093, 464374, 464241, 464354, 465400, 467752, 471167, 474852, 477784, 479165, 478970, 478124, 477796, 478396, 479387, 479943, 479447, 477494, 474045, 469713, 465414, 461616, 458445, 456372, 455919, 456465, 456411, 455120, 453820, 453877, 454979, 455978, 456766, 458074, 459815, 460977, 461177, 461128, 461464, 462215, 463601, 466148, 469455, 471902, 472249, 470792, 468295, 464737, 460086, 455655, 453297, 453283, 454081, 454523, 455252, 457518, 461196, 464746, 466867, 467489, 467095, 465840, 463863, 462081, 461913, 463914, 467087, 469748, 470830, 470290, 468877, 468051, 469481, 473644, 478901, 482915, 485126, 487083, 490239, 494361, 498426, 501938, 504592, 505739, 505416, 505187, 506489, 508384, 508501, 506263]
52658E06263k574j154m56j494k768k839k058j306o76q2J24j30l70o37j689l420
52642D84734m358l623k247j437o70R91K712K853J580O03N05K34o19r57j04J107
52626D81304J823K322K909L091K637K138J783R15l73p19K21O09q92k664k414p00
52610D91990J10l48k83Q73J632J353J355K206K288N68j105l75K145L642K759Q10
52594E09620l31qJ462L459N087N462M441K679Q77o64j737j962j060P41K553L096
52578E33715J622j121l216l377k202j198q59l28J079K835L967M319M546N041N456
52563E50279N359M873M326L622K386P31p63j882l033m453n675o142n730m493k627
52548E36778j117j307k909l530j637R22J165p99j987r65L99L71R5J351L318L640
$$ y = [506263, 503689, 502535, 502079, 500585, 497817, 494978, 492920, 491614, 490938, 490856, 490980, 490850, 490480, 489843, 488154, 484734, 480376, 476753, 474506, 473069, 472399, 473390, 476102, 478955, 480535, 481138, 481643, 481877, 481258, 480301, 480197, 481304, 483127, 485449, 488358, 491449, 494086, 496224, 498007, 498922, 498549, 497830, 498051, 498660, 497768, 495104, 492690, 491990, 492100, 491752, 491469, 492342, 493974, 495327, 496682, 498888, 501176, 501744, 500639, 500264, 502409, 506051, 508810, 509620, 509289, 509281, 510743, 514202, 519289, 524751, 529192, 531871, 532748, 532084, 530347, 528385, 527325, 528066, 530619, 533715, 535337, 534216, 531000, 527623, 525421, 524223, 523364, 523036, 524115, 526950, 530917, 535236, 539782, 544823, 550279, 555638, 560511, 564837, 568459, 570845, 571576, 570813, 568931, 565898, 561445, 555770, 549628, 543898, 539405, 536778, 535661, 534354, 531445, 527915, 526278, 527200, 528365, 527566, 525579, 524614, 525013, 525384, 525479, 526830, 530148, 533788]
52532E33788J730p72k301k522j597J03J483J385K1j134j047l8J061J796K093J998
52516E36047J641J112M47m5J23P11M85j258l306l636j841M72J719J841J599J264
52500E37375N72m31j099p20O23J800J498m06k561l477k838j333K34J160Q74m72
52484E30799j638j400R5J623K295K117J431N40j92n29o41p64q77j089j816k794
52468E27160k587j63L289N263M561K123n45k551l378k849j676r00l85J035L423
52453E31820M960M115J815N38J657M290O406O524M685K354J269J981L403L761
52439E79578J969j579n058o288m658j965o72j270k128j959j336j377j979k143
52425E49135j412k34O76Q18O1j193k206k520k116r61R90L206M631M778M068K888
$$ y = [533788, 535518, 534746, 532445, 529923, 528326, 528429, 529912, 531297, 531318, 530184, 529137, 529099, 530160, 531956, 534049, 536047, 537688, 538800, 539247, 539202, 539325, 540036, 540521, 539263, 535957, 532321, 530480, 530952, 532671, 534512, 536111, 537375, 537947, 537516, 536417, 535697, 536320, 538120, 539618, 539212, 536651, 533174, 530336, 529003, 529237, 530397, 531271, 530799, 529161, 527761, 527856, 529479, 531774, 533891, 535322, 535862, 535670, 535141, 534500, 533736, 532859, 531770, 529954, 527160, 524573, 524410, 527699, 532962, 537523, 539646, 539101, 536550, 533172, 530323, 528647, 527747, 527362, 528397, 531820, 536780, 540895, 542710, 543248, 544905, 549195, 555601, 562125, 566810, 569164, 570433, 572414, 575817, 579578, 581547, 579968, 574910, 568622, 563964, 561999, 561327, 560057, 557929, 555970, 554634, 553257, 551278, 549135, 547723, 547489, 548165, 548983, 549044, 547851, 545645, 543125, 541009, 540048, 541038, 544244, 548875, 553653, 557721, 560609]
52409E60609J140q09j686p31J075K226K663L481M923N940N873N397N309N166L934
52394F04510J586p64k275l159l844m058l411k507k618m037n577o070n638m998
52380E57140m268l266k339j867j305O2J686K192J336K90r2j51l73o47r16j323
52364E46159j258L07K900M214K805O6j625j756j422r87L64K890N503O974P192
52349E72326P090P793R743J2256J4111J4973J5707J6827J7241J5309J0765M876
52337G19017q06n117p336p683p530q000q480p617n611m416n248o966p412n772
52323F31023l126j031j10J50M74R44J167J089J122J420J736K227L502N446O906
52308F52939P241P292P874Q275P457N878M676L687K037K39k07O97J307J011J191
$$ y = [560609, 561749, 560940, 559254, 558523, 559598, 561824, 564487, 567968, 572891, 578831, 584704, 590101, 595410, 600576, 604510, 606096, 605332, 603057, 599898, 596054, 591996, 588585, 586078, 583460, 579423, 573846, 567776, 562138, 557140, 552872, 549606, 547267, 545400, 544095, 544157, 545843, 548035, 549371, 549661, 549569, 549418, 549045, 548398, 547482, 546159, 544901, 545208, 548108, 552322, 555127, 555193, 553568, 551812, 550390, 549403, 549767, 552657, 558160, 565134, 572326, 579416, 587209, 596952, 609208, 623319, 638292, 653999, 670826, 688067, 703376, 714141, 719017, 718211, 713094, 705758, 698075, 690545, 682545, 674065, 666448, 660837, 656421, 651173, 644207, 636795, 631023, 627897, 626866, 626756, 626906, 627380, 628324, 629491, 630580, 631702, 633122, 634858, 637085, 640587, 646033, 652939, 660180, 667472, 675346, 683621, 691078, 696956, 701632, 705319, 707356, 707595, 707388, 708085, 709392, 710403, 711594]
$$ [...]
##END NTUPLES=NMR SPECTRUM
##END=
