
##TITLE=AC1222_Punto_6074794_1Xs9jaGfa0
##JCAMPDX= 6.0         $$ Bruker NMR JCAMP-DX V2.0
##DATA TYPE= NMR SPECTRUM
##DATA CLASS= NTUPLES
##ORIGIN= BRUKER
##OWNER= Administrator
$$ 1.72 TOPSPIN		Version 2.1
$$ 2012-05-08 02:08:41.843 -0500  Administrator@TOPSPIN
$$ Compression mode = diff/dup
##.OBSERVE FREQUENCY= 400.13188235
##.OBSERVE NUCLEUS= ^1H
##.ACQUISITION MODE= SIMULTANEOUS (DQD)
##.ACQUISITION SCHEME= undefined
##.AVERAGES= 8
##.DIGITISER RES= 22
##SPECTROMETER/DATA SYSTEM= spect
##.PULSE SEQUENCE= zg30
##.SOLVENT NAME= COFFEE_meoh
##.SHIFT REFERENCE= INTERNAL, COFFEE_meoh, 1, 14.98061
##AUDIT TRAIL= $$ (NUMBER, WHEN, WHO, WHERE, PROCESS, VERSION, WHAT)
$$ ##TITLE= Audit trail, TOPSPIN		Version 2.1
$$ ##JCAMPDX= 5.01
$$ ##ORIGIN= Bruker BioSpin GmbH
$$ ##OWNER= Administrator
$$ $$ C:\Bruker\TOPSPIN/data/COFFEE/nmr/AC1222_Punto_6074794_1Xs9jaGfa0/30/pdata/1/auditp.txt
$$ ##AUDIT TRAIL=  $$ (NUMBER, WHEN, WHO, WHERE, PROCESS, VERSION, WHAT)
(   1,<2012-05-08 02:08:33.937 -0500>,<Administrator>,<TOPSPIN>,<go>,<TOPSPIN 2.1>,
      <created by zg
	started at 2012-05-08 02:07:27.375 -0500,
	POWCHK enabled, PULCHK disabled,
       configuration hash MD5:
       AF F2 23 6B 01 CD 40 DD E5 A1 38 A0 06 EA F7 77
       data hash MD5: 64K
       32 78 6E 36 44 8C FF 42 59 E5 33 32 12 91 F0 A6>)
(   2,<2012-05-08 02:08:37.234 -0500>,<Administrator>,<TOPSPIN>,<proc1d>,<TOPSPIN 2.1>,
      <Start of raw data processing
       efp LB = 0 FT_mod = 6 PKNL = 1 PHC0 = 0 PHC1 = 0 SI = 32K 
       data hash MD5: 32K
       3D 1A A3 8B D3 21 1D C8 08 74 F7 6D 30 A1 D8 57>)
(   3,<2012-05-08 02:08:37.562 -0500>,<Administrator>,<TOPSPIN>,<proc1d>,<TOPSPIN 2.1>,
      <pk PHC0 = 211.7285 PHC1 = 0 
       data hash MD5: 32K
       99 20 F2 AF C5 9B 04 65 31 E3 77 E5 A8 00 B2 0E>)
(   4,<2012-05-08 02:08:37.625 -0500>,<Administrator>,<TOPSPIN>,<proc1d>,<TOPSPIN 2.1>,
      <abs ABSG = 1 
       data hash MD5: 32K
       D8 69 05 02 92 72 DC 47 93 29 A2 7C 0E BE 9D F2>)
(   5,<2012-05-08 02:08:37.640 -0500>,<Administrator>,<TOPSPIN>,<proc1d>,<TOPSPIN 2.1>,
      <abs ABSG = 2 
       data hash MD5: 32K
       A0 5E D1 C5 25 C1 9F E6 39 27 31 16 30 E1 17 5C>)
(   6,<2012-05-08 02:08:37.671 -0500>,<Administrator>,<TOPSPIN>,<proc1d>,<TOPSPIN 2.1>,
      <abs ABSG = 3 
       data hash MD5: 32K
       8A F0 34 3D 69 C1 0B 60 CC 8B B2 55 54 7D D4 D6>)
(   7,<2012-05-08 02:08:37.703 -0500>,<Administrator>,<TOPSPIN>,<proc1d>,<TOPSPIN 2.1>,
      <abs ABSG = 4 
       data hash MD5: 32K
       34 50 6D 02 DB 5E B8 B7 EC 20 ED BF 73 33 44 1E>)
(   8,<2012-05-08 02:08:37.734 -0500>,<Administrator>,<TOPSPIN>,<proc1d>,<TOPSPIN 2.1>,
      <abs ABSG = 5 
       data hash MD5: 32K
       A1 E7 BE 62 62 3E 79 5D B2 BE D6 FF 0A 5F 92 17>)
$$ ##END=
$$ 
$$ $$ hash MD5
$$ $$ F8 F0 EB F5 92 16 44 26 48 F9 7B 64 93 7D 69 64
##$RELAX= 
##$RELAX= 
##$RELAX= 
##$RELAX= 
##$RELAX= 
##$RELAX= 
##$RELAX= 
$$ Bruker specific parameters
$$ --------------------------
$$ [...]
##$TP= (0..7)
150 150 150 150 150 150 150 150
##$TP07= 0
##$TPNAME0= <>
##$TPNAME1= <>
##$TPNAME2= <>
##$TPNAME3= <>
##$TPNAME4= <>
##$TPNAME5= <>
##$TPNAME6= <>
##$TPNAME7= <>
##$TPOAL= (0..7)
0.5 0.5 0.5 0.5 0.5 0.5 0.5 0.5
##$TPOFFS= (0..7)
0 0 0 0 0 0 0 0
##$TUNHIN= 0
##$TUNHOUT= 0
##$TUNXOUT= 0
##$USERA1= <user>
##$USERA2= <user>
##$USERA3= <user>
##$USERA4= <user>
##$USERA5= <user>
##$V9= 5
##$VALIST= <valist>
##$VCLIST= <CCCCCCCCCCCCCCC>
##$VD= 0
##$VDLIST= <DDDDDDDDDDDDDDD>
##$VPLIST= <PPPPPPPPPPPPPPP>
##$VTLIST= <TTTTTTTTTTTTTTT>
##$WBST= 1024
##$WBSW= 4
##$XGAIN= (0..3)
0 0 0 0
##$XL= 0
##$YL= 0
##$YMAX_a= 525105
##$YMIN_a= -628622
##$ZGOPTNS= <>
##$ZL1= 120
##$ZL2= 120
##$ZL3= 120
##$ZL4= 120
##$ABSF1= 14.98061
##$ABSF2= -5.57192
##$ABSG= 5
##$ABSL= 3
##$ALPHA= 0
##$AQORDER= 0
##$ASSFAC= 0
##$ASSFACI= 0
##$ASSFACX= 0
##$ASSWID= 0
##$AUNMP= <proc_prof1d_extract_pilot.lims>
##$AXLEFT= 0
##$AXNAME= <>
##$AXNUC= <1H>
##$AXRIGHT= 0
##$AXTYPE= 0
##$AXUNIT= <>
##$AZFE= 0.1
##$AZFW= 0.1
##$BCFW= 0
##$BC_mod= 0
##$BYTORDP= 0
##$COROFFS= 0
##$CY= 15
##$DATMOD= 1
##$DC= 0
##$DFILT= <>
##$DTYPP= 0
##$F1P= 0
##$F2P= 0
##$FCOR= 0.5
##$FTSIZE= 32768
##$FT_mod= 6
##$GAMMA= 0
##$GB= 0
##$INTBC= 1
##$INTSCL= 1
##$ISEN= 128
##$LB= 0
##$LEV0= 0
##$LPBIN= 0
##$MAXI= 10000
##$MC2= 0
##$MEAN= 0
##$ME_mod= 0
##$MI= 0
##$NCOEF= 0
##$NC_proc= -8
##$NLEV= 6
##$NOISF1= 0
##$NOISF2= 0
##$NSP= 0
##$NTH_PI= 0
##$NZP= 0
##$OFFSET= 14.98061
##$PC= 1
##$PHC0= 211.7285
##$PHC1= 0
##$PH_mod= 1
##$PKNL= yes
##$PPARMOD= 0
##$PPDIAG= 0
##$PPIPTYP= 0
##$PPMPNUM= 2147483647
##$PPRESOL= 1
##$PSCAL= 4
##$PSIGN= 0
##$PYNMP= <proc.py>
##$REVERSE= no
##$SF= 400.13
##$SI= 32768
##$SIGF1= 0
##$SIGF2= 0
##$SINO= 400
##$SIOLD= 32768
##$SPECTYP= <>
##$SREGLST= <1H.CDCl3>
##$SSB= 0
##$STSI= 32768
##$STSR= 0
##$SW_p= 8223.68421052632
##$SYMM= 0
##$S_DEV= 0
##$TDeff= 65536
##$TDoff= 0
##$TI= <>
##$TILT= no
##$TM1= 0
##$TM2= 0
##$TOPLEV= 0
##$USERP1= <user>
##$USERP2= <user>
##$USERP3= <user>
##$USERP4= <user>
##$USERP5= <user>
##$WDW= 1
##$XDIM= 32768
##$YMAX_p= 466911964
##$YMIN_p= -704279
##$CURPLOT= <Network HP LaserJet P1505>
##$CURPRIN= <$Network HP LaserJet P1505>
##$DFORMAT= <normdp>
##$LAYOUT= <+/1D_H.xwp>
##$LFORMAT= <normlp>
##$PFORMAT= <normpl>
##$SURQMSG= 1
$$ End of Bruker specific parameters
$$ ---------------------------------
##NTUPLES= NMR SPECTRUM
##VAR_NAME=  FREQUENCY,     SPECTRUM/REAL,   SPECTRUM/IMAG
##SYMBOL=    X,             R,               I
##VAR_TYPE=  INDEPENDENT,   DEPENDENT,       DEPENDENT
##VAR_FORM=  AFFN,          ASDF,            ASDF
##VAR_DIM=   32768,         32768,           32768
##UNITS=     HZ,            ARBITRARY UNITS, ARBITRARY UNITS
##FACTOR=    0.250966925370066, 1,           1
##FIRST=     8223.43324360095, 14341,        -76128
##LAST=      0,             -8388,           2633
##MIN=       0,             -704279,         0
##MAX=       8223.43324360095, 466911964,    0
$$ Real data points
##PAGE= N=1
##DATA TABLE= (X++(R..R)), XYDATA
$$ [...]
19550H0407j561a18023J6767D4158a72630j772j66329J61394h7439E5764h8094
$$ 80407 78846 -118023 -101256 44158 -172630 -174402 -340731 -179337 -87439 55764 -88094
19538a31936L5741B0289a6275D2461o464f4083o5901I0567i7604G3256a29508
$$ -131936 -96195 20289 -16275 42461 35997 -64083 -129984 90567 -97604 73256 -129508
19526A56120b44981J17894G376J54232b37892H1899J32560b99826n1623a59193
$$ 156120 -244981 -127087 7376 161608 -237892 81899 214459 -299826 -351449 -159193
19515c5627I7793c24643C1672J25666M9108a90009k91320B6244a9818l2604q2542
$$ -35627 97793 -324643 31672 157338 206446 -190009 -481329 26244 -19818 -52422 -134964
19504a34964D3524J50066A2365d63623a12745F6073b78541J22856L6976F8918
$$ -134964 43524 193590 12365 -463623 -112745 66073 -278541 -155685 -118709 68918
19493A19717C2776M5299N4291k9632c61975I9926Q4784J06700F9705Q4172b87449
$$ 119717 32776 78075 132366 102734 -361975 99926 184710 291410 69705 153877 -287449
19481d0824j23852c7588k30413K3821A07559h3288A0908a33092k40573a04062
$$ -40824 -164676 -37588 -268001 -244180 107559 -83288 10908 -133092 -373665 -104062
19470e7823D2079e915k67702a04267A09689g4682j68323j47923A40341D8613h4512
$$ -57823 42079 -5915 -273617 -104267 109689 -74682 -243005 -390928 140341 48613 -84512
19458a28746L3096L1349A27272m8350d38393K8922a3228l42233A23229b50739
$$ -128746 -95650 -64301 127272 78922 -438393 -409471 -13228 -355461 123229 -250739
19447c48148c997j31548k2928l08503A27304b06220B12293p8871b8824j50914
$$ -348148 -3997 -135545 -158473 -466976 127304 -206220 212293 133422 -28824 -179738
19437a79738h1003B9782b15318Q8200A97140a04251A05515c0281D810d7581k00194
$$ -179738 -81003 29782 -215318 -127118 197140 -104251 105515 -30281 4810 -47581 -247775
19426b47775B5012f8602C05791a10249A6566h3238n7258E8497L551a05657A73982
$$ -247775 25012 -68602 305791 -110249 16566 -83238 -140496 58497 62048 -105657 173982
19414b12001O4927M7072M5677G8586b50497A52746g0309l18534A97629g5226j02472
$$ -212001 -147074 -100002 -54325 78586 -250497 152746 -70309 -388843 197629 -75226 -177698
19403a77698D9312a35531k15664A35073d05971B27583a52801C37716E2058n551
$$ -177698 49312 -135531 -351195 135073 -405971 227583 -152801 337716 52058 46507
19393D6507c11979i6052K1316a0988E9255A0052a43191D8197b70951A50552b48862
$$ 46507 -311979 -96052 -74736 -10988 59255 10052 -143191 48197 -270951 150552 -248862
19381a27481l1687j98493d8611r0104A05024a8416p0635o4571k36237J41448p691
$$ -127481 -159168 -357661 -48611 -138715 105024 -18416 -89051 -153622 -389859 -248411 -256102
19370b56102G7782g2870A38664k2892c32839f4866k59793J07865F157d8971m2790
$$ -256102 77782 -72870 138664 115772 -332839 -64866 -324659 -216794 6157 -48971 -91761
19359i1761j63510A29704a84197I6763q467a52470N9538b6376E5532J8644L15719
$$ -91761 -255271 129704 -184197 96763 88296 -152470 -92932 -26376 55532 74176 389895
19348C89895b7581J2933j47180L7875B17309a74496f6396A52918a71672D09927
$$ 389895 -27581 -14648 -161828 -123953 217309 -174496 -66396 152918 -171672 409927
19337a87721k20598H7622k7830a10610o6755j72135c3572F9961Q6919b89769E4901
$$ -187721 -408319 87622 59792 -110610 -177365 -349500 -33572 69961 156880 -289769 54901
19325a18469j20965C11878g9612k62385I0857a26609B56330R4920B5751J82978
$$ -118469 -239434 311878 -79612 -341997 90857 -126609 256330 351250 25751 208729
19315B08729g1381B07407a82958d7801r5835H252b38462A65584G5576h9559A38339
$$ 208729 -71381 207407 -182958 -47801 -143636 8252 -238462 165584 75576 -89559 138339
19303a87488b9569B17080r7000J93584a86459C1759b16410C7304R4693i2867j15153
$$ -187488 -29569 217080 120080 313664 -186459 31759 -216410 37304 131997 -92867 -208020
19292b08020O6119j8528f0430b5335j15702M3835b2249k41575E3535f5773h064
$$ -208020 -141901 -160429 -60430 -25335 -141037 -97202 -22249 -263824 53535 -65773 -8064
19280b43827g7003B68766g5890l18172a13832F2814K0277a00834B97481b19441
$$ -243827 -77003 268766 -75890 -394062 -113832 62814 83091 -100834 297481 -219441
19269B4078d6904D6837A9337J00567O8499m5514a86986L1878c7227k63060C1167
$$ 24078 -46904 46837 19337 119904 188403 142889 -186986 -155108 -37227 -300287 31167
19257a80413c9774k01387K1976R8763B43070i7768B23636r2867d12531Q2832a40171
$$ -180413 -39774 -241161 -219185 -120422 243070 -97768 223636 130769 -412531 -329699 -140171
19245a95280O6136a1057j16080K4629J5905D9878a95973d5393B9565M8786e040
$$ -195280 -129144 -11057 -127137 -102508 -86603 49878 -195973 -45393 29565 78351 -5040
19233b2506F8463M0815J38378m1365q642b28676H0139c36156a08363C0576d5662
$$ -22506 68463 109278 247656 206291 197649 -228676 80139 -336156 -108363 30576 -45662
19221A9692b62615J09316j14309H7436P1228M0744J54553i1253l3824G6010d47122
$$ 19692 -262615 -153299 -267608 87436 158664 199408 353961 -91253 -125077 76010 -447122
19209a57522j0668a2687k34567d1780m63443J05021i1505B84593A25636c78883
$$ -157522 -168190 -12687 -247254 -41780 -505223 -400202 -91505 284593 125636 -378883
19198C8089J24261e5550k25688A42258a88881a3053o7944B61319d7197J8121j16007
$$ 38089 162350 -55550 -281238 142258 -188881 -13053 -80997 261319 -47197 -29076 -145083
19187a45083G28a81936q8934B4528J23471l7425B527a03455F7501a10898H775
$$ -145083 728 -181936 -270870 24528 147999 110574 2527 -103455 67501 -110898 8775
19175b15245B33936g3761k0662l21084b6410l6383C5804i5994L3348A08876D0636
$$ -215245 233936 -73761 -94423 -415507 -26410 -62793 35804 -95994 -62646 108876 40636
19163C3701C472a72024j09974j7726o191f1808A2245M9745a60903q7891R8031
$$ 33701 3472 -172024 -281998 -299724 -305915 -61808 12245 61990 -160903 -248794 -150763
19152a50763e5896D707N1941O6394D5867J07720h212j97434k81323b32967b0109
$$ -150763 -55896 4707 56648 123042 45867 153587 -8212 -205646 -486969 -232967 -20109
19140c7687j84074A36960D8398J08218i4500d2156r8568a635l98389a442m89402
$$ -37687 -221761 136960 48398 156616 -94500 -42156 -140724 -1635 -400024 -1442 -490844
19129d90844i857Q61G7945a8471o546j52638C7988a74863I1727M7041b6865D5732
$$ -490844 -9857 -8996 77945 -18471 -25017 -177655 37988 -174863 91727 138768 -26865 45732
19116c03456J06095B3523b08546H6958B7186c07997a49102B71935o9297j0273
$$ -303456 -197361 23523 -208546 86958 27186 -307997 -149102 271935 202638 192365
19106A92365e9249J4295q2608d4807B93113b28315Q7976b5446k19819J0458A38062
$$ 192365 -59249 -44954 -127562 -44807 293113 -228315 -140339 -25446 -245265 -234807 138062
19094f3759k35618Q9469j34751J64348A60011D7864a76751p653c4235D1388c05943
$$ -63759 -299377 -209908 -344659 -180311 160011 47864 -176751 -184404 -34235 41388 -305943
19082a25843j16712N7387D801G60b88449M6792J03372k04A11658a74826C01405
$$ -125843 -242555 -185168 4801 760 -288449 -241657 -138285 -138489 111658 -174826 301405
19070c09482a7607G2274b43264L1837c9190j45397C5808K3184a7211k84474a1816
$$ -309482 -17607 72274 -243264 -211427 -39190 -184587 35808 58992 -17211 -301685 -11816
19058E7121b74074c8198A55200P6760a62247G8705R7358b12626G125J84634c4300
$$ 57121 -274074 -38198 155200 231960 -162247 78705 176063 -212626 7125 191759 -34300
19046B40273D2019c28419g5668q695j53425d3161A98170a26527j5231N5406L0511
$$ 240273 42019 -328419 -75668 -84363 -237788 -43161 198170 -126527 -141758 -86352 -55841
19035e5841j48445o6792A78793L89221A7197a26543c8081A32074B9092d0714A15650
$$ -55841 -204286 -271078 178793 568014 17197 -126543 -38081 132074 29092 -40714 115650
19023A04637C7073i6002E0086a6198n52875e2864a3989l733j0024q9321F6065
$$ 104637 37073 -96002 50086 -16198 -569073 -52864 -13989 -17722 -27746 -117067 66065
19011c7394H4658J63234O4171I8495a09063A03424D1877g9160B94092D4099P779
$$ -37394 84658 247892 312063 98495 -109063 103424 41877 -79160 294092 44099 51878
19000E1878d35384B4673f6145E8985a87370B54335c94636b1284H3880a29141m8896
$$ 51878 -435384 24673 -66145 58985 -187370 254335 -394636 -21284 83880 -129141 -178037
18989a78037A42642a03936j53170A98457l5322M9799b26439d6717B55917A02177
$$ -178037 142642 -103936 -257106 198457 163135 212934 -226439 -46717 255917 102177
18978G7707a24524k1353H6308e6720B27440E5205j8715a38209j17911c7694l30454
$$ 77707 -124524 -145877 86308 -56720 227440 55205 36490 -138209 -256120 -37694 -368148
18967c68148a31123H5377I720b47859h1002j1321k7118F3712j0659R0025b70637
$$ -368148 -131123 85377 9720 -247859 -81002 -92323 -119441 63712 53053 143078 -270637
18955b33046j51753C8317N8297b2352A95101F919K43136b56634a28011F0088b3453
$$ -233046 -384799 38317 96614 -22352 195101 6919 250055 -256634 -128011 60088 -23453
18943B43199r2044J6978J9616d2781A14440a7025G3465a09122A15095g2388B27117
$$ 243199 151155 168133 187749 -42781 114440 -17025 73465 -109122 115095 -72388 227117
18931a70468E7850b21202J02683J5199b4015F821b07162f8415A69909k7751P5700
$$ -170468 57850 -221202 -118519 -103320 -24015 6821 -207162 -68415 169909 142158 217858
18920B17858c70705A61388F7847N1785d019n1308A96150g7129k01963n133n1265
$$ 217858 -370705 161388 67847 119632 -4019 -55327 196150 -77129 -279092 -284225 -335490
18909c35490g6013J2114j76885A2607K46125B8996b24153a03429D0380b48668
$$ -335490 -76013 -63899 -240784 12607 258732 28996 -224153 -103429 40380 -248668
18898c2632k49208A83844i6945F0724c5872I2585c71444J80069K9568C1050d6711
$$ -32632 -281840 183844 -96945 60724 -35872 92585 -371444 -191375 -161807 31050 -46711
18886f6544C40028b94608A96348a67299f2111o8417n6804F1569O2309e2344k12382
$$ -66544 340028 -294608 196348 -167299 -62111 -130528 -187332 61569 123878 -52344 -264726
18875b64726M071A99235c4145p7761o1770G9830h2775k64218j17895B45056a61201
$$ -264726 -260655 199235 -34145 -111906 -173676 79830 -82775 -346993 -464888 245056 -161201
18863b01421j67981D9156a38300f174j03494k2251C1830h1734J3852m7445P954
$$ -201421 -369402 49156 -138300 -6174 -109668 -131919 31830 -81734 -67882 -115327 -107373
18852a07373j999l45329f1375k22023n0545A66349n0262b48725R4184B16511a64862
$$ -107373 -109372 -454701 -61375 -283398 -333943 166349 116087 -248725 -154541 216511 -164862
18840A64772q0926e049F8391A1968a08465j91623A5808a91518A83239J37365b57785
$$ 164772 83846 -5049 68391 11968 -108465 -300088 15808 -191518 183239 320604 -257785
18828C4101a68977A30687a74085A14415a68890b3065k74506a16194L7477A02004
$$ 34101 -168977 130687 -174085 114415 -168890 -23065 -297571 -116194 -78717 102004
18817c9853n7671j33034h6827b5198k14136P9520H2368J50470g1542F3041J83217
$$ -39853 -97524 -230558 -86827 -25198 -239334 -159814 82368 232838 -71542 63041 246258
18806B46258R0102f1157D340b03590B06998j02914h8211K2963H8267N8630N2521
$$ 246258 336360 -61157 4340 -203590 206998 104084 -88211 -65248 88267 146897 199418
18795A99418a28233M3896j91355A26364R0890G1887L4q98a66993A18845f89j8561
$$ 199418 -128233 -84337 -275692 126364 217254 71887 71921 71023 -166993 118845 -689 -19250
18783a9250A98328c05536E7526b62667R5133D2958c39000H9894L389K5204j7985
$$ -19250 198328 -305536 57526 -262667 -167534 42958 -339000 89894 93283 118487 100502
18772A00502b09977J03275E1196b2028j81251l6695C462J7144a59716j07467m2768
$$ 100502 -209977 -106702 51196 -22028 -203279 -239974 3462 20606 -159716 -267183 -309951
18761c09951A03656R9250b5042p2642n9144C09833f6960F8223a60637j5961B7119
$$ -309951 103656 202906 -25042 -97684 -156828 309833 -66960 68223 -160637 -176598 27119
18749E3184o713A2270B974c49376A25528D0886A8215d8183j8626j20516Q6325
$$ 53184 46471 12270 2974 -349376 125528 40886 18215 -48183 -66809 -187325 -101000
18738a01000A4437Q5603k7704i6442m6288b5595k09868E0982A598a34410L9E4687
$$ -101000 14437 100040 72336 -96442 -142730 -25595 -235463 50982 1598 -134410 -134371 54687
18725a1511k260A33641F0429a37213h611C40420b06945C34107a40250B87036g0305
$$ -11511 -13771 133641 60429 -137213 -8611 340420 -206945 334107 -140250 287036 -70305
18713c63589e4225j02112B38183a557r3893j28483a8184n7962l9223L8934k87052
$$ -363589 -54225 -156337 238183 -1557 -95450 -223933 -18184 -76146 -115369 -76435 -363487
18702c63487J66669n2532A55089G99h983G6034b92675A08932a64630L0120G7637
$$ -363487 -196818 -249350 155089 799 -8983 76034 -292675 108932 -164630 -134510 77637
18690A57224p6204a76555l6835F0298b58689m5660K7315e5676A67302a7950A757
$$ 157224 81020 -176555 -213390 60298 -258689 -304349 -277034 -55676 167302 -17950 1757
18678c67279A94603A0508J01009c04076j4736A22568K5519b66299O5899f134E8858
$$ -367279 194603 10508 111517 -304076 -318812 122568 148087 -266299 -200400 -6134 58858
18666d38446K03873o9537B3429c14783h1876j45421c3446C00592j3669g4436A07435
$$ -438446 -234573 -304110 23429 -314783 -81876 -227297 -33446 300592 286923 -74436 107435
18654e4174F7869o490Q6244c92513A63920C0507N5933a15440b3289A53718o0558
$$ -54174 67869 61379 147623 -392513 163920 30507 86440 -115440 -23289 153718 93160
18643I3160b05434e5976A91084b28011A10985J2456d05556a23570N8218B58916
$$ 93160 -205434 -55976 191084 -228011 110985 123441 -405556 -123570 -65352 258916
18632h4675B07633C070b51950C84412j43391r9661n0223f8355k06591j60238B4426
$$ -84675 207633 3070 -251950 384412 241021 141360 91137 -68355 -274946 -435184 24426
18620f9922C37727K637C3606a31468b3729j08847k6262m03231G3220L4073A0345
$$ -69922 337727 340364 33606 -131468 -23729 -132576 -158838 -562069 73220 107293 10345
18608A75675b22057K4762f0307j02131A03387M8859a20749j29445M6730B8674
$$ 175675 -222057 -197295 -60307 -162438 103387 152246 -120749 -250194 -203464 28674
18597H4744h4156b6182r3777j46161h7317j11349d1280r6561n777O9755A76711
$$ 84744 -84156 -26182 -119959 -266120 -87317 -198666 -41280 -137841 -143618 -73863 176711
18585E9376b87506G3988J07492q5729f6064l97953e1914O975C50660b31760G8320
$$ 59376 -287506 73988 181480 95751 -66064 -464017 -51914 -44939 350660 -231760 78320
18573I8524k3108a18175H6018N9507i4841l238j68254e0177m8067n5820H5041
$$ 98524 75416 -118175 86018 145525 -94841 -98079 -266333 -50177 -98244 -154064 85041
18561c05619c5009k29792A31073A639b55929A57127c41822a52383h503k83428
$$ -305619 -35009 -264801 131073 1639 -255929 157127 -341822 -152383 -8503 -291931
18551b91931B9521J44155c0084j57467f2771D0104J17103m0399l0509a43070D5482
$$ -291931 29521 173676 -30084 -187551 -62771 40104 157207 116808 86299 -143070 45482
18539E040J36626A57K20366C388J28054c675l402B4424d6000A50847B3482K21502
$$ 5040 141666 157 220523 3388 131442 -3675 -7077 24424 -46000 150847 23482 244984
18527B44984c0943A8162c41166a29792k61958a1663j13656q4209B35002b66285
$$ 244984 -30943 18162 -341166 -129792 -391750 -11663 -125319 -209528 235002 -266285
18516C13121l5004a44796B48820B7243b36823f7784A67150a08320L9612f24A51961
$$ 313121 278117 -144796 248820 27243 -236823 -67784 167150 -108320 -68708 -624 151961
18504A65136A605a21842J5225A73635a83312F9773b75274N9463e2074G5464b77892
$$ 165136 1605 -121842 -106617 173635 -183312 69773 -275274 -215811 -52074 75464 -277892
18492C3476a07087k10917F6538d618m40149c6014c759A56302a36673A05423C5608
$$ 33476 -107087 -318004 66538 -4618 -444767 -36014 -3759 156302 -136673 105423 35608
18480F0064K6146j1055J29048b03217P3550C26382a05893l2216O8018B40273b91432
$$ 60064 86210 75155 204203 -203217 -129667 326382 -105893 -138109 -70091 240273 -291432
18468B2372a68760C62796c81596G7398N4516Q7225a34636D3496J15083D1052b1420
$$ 22372 -168760 362796 -381596 77398 131914 219139 -134636 43496 158579 41052 -21420
18456b99304G9917b11720A54444p6302J53961a11126M7317l70081A855c1223B12785
$$ -299304 79917 -211720 154444 78142 232103 -111126 -63809 -433890 1855 -31223 212785
18444f1285J9610a2992A34392a62951A86621d1172h752D9141b18456B04219c2039
$$ -61285 -41675 -12992 134392 -162951 186621 -41172 -8752 49141 -218456 204219 -32039
18432a80034I1763B9895a6936F523d7218B49762D3321Q3520j9979C4922a93660
$$ -180034 91763 29895 -16936 6523 -47218 249762 43321 126841 106862 34922 -193660
18420G7300J79950h8133p0843f679B4536P3167b01549h05k05476N7512A82139
$$ 77300 257250 -88133 -158976 -6679 24536 97703 -201549 -805 -206281 -148769 182139
18408A70485q1502a69262j5336l3066A42515Q4425a5685A95291M1599F686J76421
$$ 170485 88983 -169262 -184598 -217664 142515 226940 -15685 195291 236890 6686 183107
18397A83107b6715k19397r4417J46435f575B27362a7849A08552c17749G742J98378
$$ 183107 -26715 -246112 -340529 -194094 -6575 227362 -17849 108552 -317749 7742 206120
18386B06120d1362l24701B5353P0896Q0422a14063H4922d5660a9058A8741b03214
$$ 206120 -41362 -366063 25353 96249 176671 -114063 84922 -45660 -19058 18741 -203214
18374B62882b25876B03006d74921a16226m1617O9106J3089E4759a48234e5059
$$ 262882 -225876 203006 -474921 -116226 -157843 -88737 -75648 54759 -148234 -55059
18363B775R6679K4953Q3344d20137J77467j81020C39380h8262k83036C1658c4925
$$ 2775 99454 124407 207751 -420137 -242670 -423690 339380 -88262 -371298 31658 -34925
18351a28535N5952k2183j03771N5903a7542A4296a10849A46029L7174c0105F1597
$$ -128535 -72583 -94766 -198537 -142634 -17542 14296 -110849 146029 183203 -30105 61597
18339A2327K34472I447c23085D1736a85848r0816h6985B024a76878C1080a10184
$$ 12327 246799 9447 -323085 41736 -185848 -276664 -86985 2024 -176878 31080 -110184
18327b04267A0040L0522a92460B85988j00676g8083L5825D3346O186j7341J94127
$$ -204267 10040 40562 -192460 285988 185312 -78083 -42258 43346 49532 32191 226318
18316B26318c3911J6547j70864B29949k6173d82188f0864j91007F7428b03112
$$ 226318 -33911 -17364 -188228 229949 203776 -482188 -60864 -251871 67428 -203112
18305e6254H5192h0594C04380e0401C3297E938R266f8978j6216A3574a24669B9773
$$ -56254 85192 -80594 304380 -50401 33297 5938 15204 -68978 -85194 13574 -124669 29773
18292a31805h83j35451O5026C6126d56k28633A14001c3415a3787A40886h6049
$$ -131805 -883 -136334 -71308 36126 -456 -229089 114001 -33415 -13787 140886 -86049
18280A30265M5703d82464I158b44547l920A3919Q09a19001d4675r3769A18925
$$ 130265 175968 -482464 9158 -244547 -248467 13919 14728 -119001 -44675 -138444 118925
18268a71626A9710C766a35368N2096q8079H7729a62112O7785B96944i7900q4507
$$ -171626 19710 3766 -135368 -83272 -171351 87729 -162112 -94327 296944 -97900 -182407
18257a82407N1726e4947b2238I2267a32578r7763d4495B61462r4886a77236j83189
$$ -182407 -130681 -54947 -22238 92267 -132578 -230341 -44495 261462 166576 -177236 -360425
18246c60425N4697a06426D8820b29848b0646j81936Q7479A05865h484B55061r4511
$$ -360425 -305728 -106426 48820 -229848 -20646 -202582 -115103 105865 -8484 255061 160550
18235A60550C7577R6259g4245B33592I9868f5535K953I809c63423a17667n7070
$$ 160550 37577 133836 -74245 233592 99868 -65535 -62582 9809 -363423 -117667 -174737
18224a74737A19951J82565A42176E8092k4564M5967J77526c0975A47201a83610
$$ -174737 119951 302516 142176 58092 33528 79495 257021 -30975 147201 -183610
18213B28615a86140K4282j39061B49121a0527k40044A15105a88007E072b3974
$$ 228615 -186140 -161858 -300919 249121 -10527 -250571 115105 -188007 5072 -23974
18202a18487A90479a66316c1318k81178g0874q4270j5204B20894a15479B32140
$$ -118487 190479 -166316 -31318 -312496 -70874 -155144 -170348 220894 -115479 232140
18191I0720B7335b90800g5580B05026l6859o1165J50767C8247b4458e450j52596
$$ 90720 27335 -290800 -75580 205026 168167 107002 257769 38247 -24458 -5450 -158046
18180a58046N8942L436G2340b36766a07184M6521q9633K4341M5095c4873C7854
$$ -158046 -99104 -95668 72340 -236766 -107184 -60663 -150296 -125955 -80860 -34873 37854
18168b2201G9396J3999g8901A02018L42l1326K5530k564C1795d5555A78854b21561
$$ -22201 79396 93395 -78901 102018 102360 71034 96564 94000 31795 -45555 178854 -221561
18155E2898a25514k57916D089a52000A6117L2755a0259B49810r7743i1075q8823
$$ 52898 -125514 -383430 4089 -152000 16117 48872 -10259 249810 152067 -91075 -179898
18144a79898d6879j84648i1877L9682j26243G1115a0477B13282r0818K02432f2197
$$ -179898 -46879 -231527 -91877 -52195 -178438 71115 -10477 213282 122464 324896 -62197
18132A64200c4579A21884j6571P051l2332k0112r739N0491E113J67596E2505A1630
$$ 164200 -34579 121884 105313 112364 80032 59920 50181 100672 5113 172709 52505 11630
18119b43055A00057B1547b7543j66544l4677h5046D6876B1424f4694n0159q0026
$$ -243055 100057 21547 -27543 -194087 -228764 -85046 46876 21424 -64694 -114853 -194879
18108a94879O9286A28764a6814j58474O9647H8570l7813a82084G8768J15588a2291
$$ -194879 -125593 128764 -16814 -175288 -105641 88570 50757 -182084 78768 194356 -12291
18096b02364B88346A18g0402m3428l4833A69071G4470d8812G1581A6874h6140
$$ -202364 288346 118 -70402 -113830 -148663 169071 74470 -48812 71581 16874 -86140
18084a64956m3605n1897a13352C6039Q1167e8A76038a8489j57344j38965A12514
$$ -164956 -208561 -260458 -113352 36039 117206 -58 176038 -18489 -175833 -314798 112514
18072a17246D6981K18d811C4004J94062q1481P8742a17592A76289F6090O1448
$$ -117246 46981 47199 -4811 34004 228066 146585 225327 -117592 176289 66090 127538
18061A27538a8975j39017A76618b58207D3447K1815a04587k15392B40597H2419
$$ 127538 -18975 -157992 176618 -258207 43447 65262 -104587 -319979 240597 82419
18050a38361A29243J71359c96978a95573R4608M0572l43998g6165k6368l89895
$$ -138361 129243 300602 -396978 -195573 -100965 -60393 -404391 -76165 -102533 -492428
18040d92428a28943A24899b1339D04974c78502B08847E6009i553C2711a101k04579
$$ -492428 -128943 124899 -21339 404974 -378502 208847 56009 -9553 32711 -1101 -205680
18029b05680C283Q4214f92331d1244o3763d623j08033G055c0210D9881b40086
$$ -205680 3283 87497 -692331 -41244 -105007 -4623 -112656 7055 -30210 49881 -240086
18017a37278E138a64598j90206j02819F614b57050L1066A15448a26792a1397k03685
$$ -137278 5138 -164598 -354804 -457623 6614 -257050 -225984 115448 -126792 -11397 -215082
18006b15082K6826N3845C6315J23071d9232j54279b6058j92056C4176K31405B8534
$$ -215082 -188256 -134411 36315 159386 -49232 -203511 -26058 -218114 34176 265581 28534
17994F6424B8712B722c39829G383a9172j85257J00825C1781c2150e635l7579H4630
$$ 66424 28712 2722 -339829 7383 -19172 -204429 -103604 31781 -32150 -5635 -43214 84630
17981I4456d027j82145e0772A47850g4364C13746e9691A77280b58988R5686A74736
$$ 94456 -4027 -186172 -50772 147850 -74364 313746 -59691 177280 -258988 -163302 174736
17969B72246O175b16307A14979b37418d3160o2239l208l807A04449c47940J45892
$$ 272246 278421 -216307 114979 -237418 -43160 -105399 -108607 -112414 104449 -347940 -202048
17958b02048E5916D762K16651C4040J89760r0524c96146d487E3950K3490c48165
$$ -202048 55916 4762 221413 34040 223800 133276 -396146 -4487 53950 77440 -348165
17946b4528B25609a6550F2383P2034G328a32461A41730P4752H9598O9410J153
$$ -24528 225609 -16550 62383 134417 7328 -132461 141730 216482 89598 159008 160161
17935A60161j3800k8218B3554P1727A0149a59221N6943A44587a17388d5259H7575
$$ 160161 146361 118143 23554 95281 10149 -159221 -102278 144587 -117388 -45259 87575
17923C31725j37861M4553r3875h2782l3176a7779m14348d3152F3766O2197P162
$$ 331725 193864 238417 144542 -82782 -115958 -17779 -432127 -43152 63766 125963 133125
17912A33125a85826b6858B77651a07322m7617l04004a2769n1582o8766C37069
$$ 133125 -185826 -26858 277651 -107322 -154939 -458943 -12769 -64351 -133117 337069
17901a84861a8144j48338q7540b2611A11239L5468m2181a76298G3139J20060I3637
$$ -184861 -18144 -166482 -254022 -22611 111239 146707 104526 -176298 73139 193199 93637
17889b59349f5088j21227e6871E542L16841a37030G4903a4343n9784q4577E987
$$ -259349 -65088 -186315 -56871 5542 322383 -137030 74903 -14343 -74127 -158704 5987
17877A47223M0418C5065e0183k61439o3630a60710I4009p251L7209E3686a74903
$$ 147223 187641 35065 -50183 -311622 -375252 -160710 94009 86758 123967 53686 -174903
17865c72857J03226K9285C67178a30044M925j41938C30111D2633Q5134j7636R9584
$$ -372857 -269631 -240346 367178 -130044 -125119 -267057 330111 42633 127767 110131 209715
17854B09715c95431d6359j27327A83978J2326G0965c9365j51966a0335q7209L5124
$$ 209715 -395431 -46359 -173686 183978 196304 70965 -39365 -191331 -10335 -97544 -62420
17843f2420H0490B1616c58345K7798C84857A21535e7723k1939B17618l9440J4291
$$ -62420 80490 21616 -358345 -330547 384857 121535 -57723 -79662 217618 178178 192469
17832A92469a05247A55191o1332b45192C36744a05032h890B7242M6853J2089a0189
$$ 192469 -105247 155191 93859 -245192 336744 -105032 -8890 27242 74095 86184 -10189
17820A9343J36092J92599e4777D47261i0881C13020A36728h5760J6436K5978A12804
$$ 19343 155435 348034 -54777 447261 -90881 313020 136728 -85760 -69324 -43346 112804
17808G9545b66275P9248E1117b39647C8049O4883b08074A41583d8710k30979B7484
$$ 79545 -266275 -187027 51117 -239647 38049 102932 -208074 141583 -48710 -279689 27484
17796A55297b5133n7552o0446C75720c7199B29237b35050q5938I2895j1570a11387
$$ 155297 -25133 -82685 -143131 375720 -37199 229237 -235050 -320988 92895 81325 -111387
17784A3348a29735A92124A5037d5120C21020A38879J09831A17229P7999I5834
$$ 13348 -129735 192124 15037 -45120 321020 138879 248710 117229 195228 95834
17773a87244i1230A4409O8952d3317j57261D2789J83733D488J98015H3367J55464
$$ -187244 -91230 14409 83361 -43317 -200578 42789 226522 4488 202503 83367 238831
17762B38831n7723a42873j02559b0405B18398a0895F5937b04362A46260E6049
$$ 238831 181108 -142873 -245432 -20405 218398 -10895 65937 -204362 146260 56049
17751A46598c4670B1597Q445J04128F1990J6384b53493A51010c93466B35849b7612
$$ 146598 -34670 21597 30042 134170 61990 78374 -253493 151010 -393466 235849 -27612
17739D72192I9996J65516f7672j8059D3065a85738k3916M6959A60223Q421f1557
$$ 472192 99996 265512 -67672 -85731 43065 -185738 -209654 -162695 160223 168644 -61557
17727A75140a11395J2006M6934A63810R8932d3928q9965E5497M4079K22819c50583
$$ 175140 -111395 -99389 -52455 163810 262742 -43928 -133893 55497 99576 322395 -350583
17715a4807j14211O1806q3353B14018j55f1120k65523D351A800J30325f7971j39490
$$ -14807 -129018 -67212 -150565 214018 213863 -61120 -326643 4351 1800 132125 -67971 -207461
17703b07461A48029R6130J22945a121j93162A68189e8320B56084D7456J14215
$$ -207461 148029 244159 367104 -1121 -194283 168189 -58320 256084 47456 161671
17693A61671c14765C03327a26449e5607B50122p6399a38432b0909j59652k7434
$$ 161671 -314765 303327 -126449 -55607 250122 173723 -138432 -20909 -180561 -207995
17683b07995B31232J32536j76713E1693k4918L9537O084a95497b5567I7217J38658
$$ -207995 231232 363768 187055 51693 26775 66312 72396 -195497 -25567 97217 235875
17672B35875m2276J03444d8837C0279c5365A44446K22966F280a98920B93170A5638
$$ 235875 193599 297043 -48837 30279 -35365 144446 367412 6280 -198920 293170 15638
17660I2275J8438a38771f626k15791k7264A49913a31627A17153k3614j268J77493
$$ 92275 110713 -138771 -6626 -222417 -249681 149913 -131627 117153 93539 92271 269764
17649B69764h3189j00231A4783c2136A48691p3800R8502f2879H9535k3177a51769
$$ 269764 -83189 -183420 14783 -32136 148691 74891 173393 -62879 89535 66358 -151769
17637i1775C4696c72354A31820a12367D148a75085l0187B70612b1766A64257F8372
$$ -91775 34696 -372354 131820 -112367 4148 -175085 -205272 270612 -21766 164257 68372
17625A17857E7740a07538N1086j20633A42189j0808e2492A82543J741A5772L45381
$$ 117857 57740 -107538 -56452 -177085 142189 131381 -52492 182543 184284 15772 361153
17614C61153a23510A3477L45148a97044d4031j48268j4913A08385c36502D07976
$$ 361153 -123510 13477 358625 -197044 -44031 -192299 -207212 108385 -336502 407976
17603b2461l91596c7643B40506r8021c61573A162b64522D5832J82351p3224e172
$$ -22461 -414057 -37643 240506 142485 -361573 1162 -264522 45832 228183 154959 -5172
17591a47016B24172j00045O4989f6587r1192k7844C8284N1360D0971a86247o2130
$$ -147016 224172 124127 189116 -66587 -157779 -185623 38284 89644 40971 -186247 -248377
17580b48377A00058a75979A37061C2291b7608E4288c58988A23170l6565o364J69042
$$ -248377 100058 -175979 137061 32291 -27608 54288 -358988 123170 86605 80241 249283
17569B49283b41477C8883a03985A23510O2146g048I6545m101i4536j0246k99966
$$ 249283 -241477 38883 -103985 123510 185656 -7048 96545 92444 -94536 -104782 -404748
17558d04748d1869A26497e5792o6873k2866A93481a42198B42337l3548c192A60281
$$ -404748 -41869 126497 -55792 -122665 -145531 193481 -142198 242337 208789 -3192 160281
17546A73157a32790A96884m5523a04659a2880B35843a725A19726a3891o7224B65820
$$ 173157 -132790 196884 151361 -104659 -12880 235843 -1725 119726 -13891 -81115 265820
17534b05195C8756e272j3740k93880a05840a4830n3967F0483B6550J01696J54605
$$ -205195 38756 -5272 -19012 -312892 -105840 -14830 -68797 60483 26550 128246 282851
17523B82851d6570p7294k13188E1461O4480b42900Q5618a3615C70754A00947J30053
$$ 282851 -46570 -123864 -337052 51461 115941 -242900 -157282 -13615 370754 100947 231000
17512B31000C2177K14547c997A791a15005D6470J8466a01957c3450H91M10950
$$ 231000 32177 246724 -3997 1791 -115005 46470 64936 -101957 -33450 891 411841
17501D11841G3163K31011C7836L90803A45266c48609h0797D06077A37674f5287
$$ 411841 73163 304174 37836 428639 145266 -348609 -80797 406077 137674 -65287
17490I4023j1933K06806b93409H9308O0473O8050b88507A21800b00150A60935
$$ 94023 82090 288896 -293409 89308 149781 217831 -288507 121800 -200150 160935
17479h7769C85932A03288a69295A25407d3764H1426J57788i6902A6233B47J02321
$$ -87769 385932 103288 -169295 125407 -43764 81426 239214 -96902 16233 247 102568
17468A02568L9120M2973G3973K51313q2073O2347d5866B37534c9817C81027A03068
$$ 102568 141688 184661 73973 325286 243213 305560 -45866 237534 -39817 381027 103068
17456B42060A06621K34396A46077a45488C32092E2121J40881J9647l1793a6687
$$ 242060 106621 341017 146077 -145488 332092 52121 193002 212649 180856 -16687
17445A224c2738A01105J54930j20417J83985j5509d6597J2379A85440i0279B77834
$$ 1224 -32738 101105 256035 135618 319603 304094 -46597 -34218 185440 -90279 277834
17433B03748J0121J08070l0064j43840K789n9557P055J71339H0745l0477J52258
$$ 203748 213869 321939 291875 148035 150824 91267 98322 269661 80745 50268 202526
17422B02526K47117A25490J26472m8865I7452K7743L6100M2003J14191K0041A31949
$$ 202526 449643 125490 251962 203097 97452 125195 161295 203298 317489 337530 131949
17410B01392K36069N1564B4522b0479m5239C50810J45937o6072j69294m3466N9722
$$ 201392 437461 489025 24522 -20479 -65718 350810 496747 430675 261381 217915 277637
17399B77637P1154o0533A03281N0850n1922K97759I1198J44644B4370J48713D4601
$$ 277637 348791 288258 103281 154131 102209 399968 91198 235842 24370 173083 44601
17387I6575a24E1816a16474B38727A15313l9271R578A2109N2357M13727D0208
$$ 96575 -124 51816 -116474 238727 115313 76042 85620 12109 64466 478193 40208
17375b67117K499B06012I4038J05367J57307j24337b8865D3375e1401A96728N9395
$$ -267117 -264618 206012 94038 199405 356712 232375 -28865 43375 -51401 196728 256123
17364B56123a03425B11249i551B33779H7064m1448J26884a39699D36846C1053
$$ 256123 -103425 211249 -9551 233779 87064 45616 172500 -139699 436846 31053
17353A49852J71222a16128M1250F9000M09319A17252J31688R2781j27732O4070
$$ 149852 321074 -116128 -74878 69000 478319 117252 248940 341721 213989 278059
17343B78059j28011e8707C4251R7383J87973j30803m2517a2862K586A32809k9868
$$ 278059 150048 -58707 34251 131634 319607 188804 146287 -12862 -10276 132809 102941
17332A02941h5954I9339j9617M9223E8603J39657b46695E1401L49380j68869G2026
$$ 102941 -85954 99339 79722 128945 58603 198260 -246695 51401 400781 231912 72026
17320F4224j7299J11031b1020C4389R7747J2609b08745A70209o3290J27335e3091
$$ 64224 46925 157956 -21020 34389 132136 144745 -208745 170209 106919 234254 -53091
17308B60933J01499C2960J13951K46419f3863B05642j6617J70300j28384f4078
$$ 260933 362432 32960 146911 393330 -63863 205642 189025 359325 230941 -64078
17297H9878A3299i6566A34644f262q9710B88765H553J04509b6049C02345J65699
$$ 89878 13299 -96566 134644 -6262 -95972 288765 8553 113062 -26049 302345 468044
17286D68044k03946i2468D8732f4581A89487o0148K4750M703a07459A05499N7257
$$ 468044 264098 -92468 48732 -64581 189487 129339 154089 158792 -107459 105499 162756
17275A62756g897I1923l5591Q5796K85858E1638B2906K92960b51926C14117j23214
$$ 162756 -7897 91923 56332 142128 427986 51638 22906 315866 -251926 314117 190903
17264A90903b029A37325N1929b127p8766D50713C2992K89729n9229C3505d5636
$$ 190903 -2029 137325 189254 -2127 -80893 450713 32992 322721 263492 33505 -45636
17252B64077o4349J2118e2825C6373g9502n7192C35532A06147a28885A52146K4823
$$ 264077 199728 211846 -52825 36373 -79502 -136694 335532 106147 -128885 152146 176969
17241A76969k0805J88026j37686N4722g337B15141A06498B8727N1409b7136F4093
$$ 176969 156164 344190 206504 261226 -7337 215141 106498 28727 80136 -27136 64093
17229A65300C1950K0364K4164K18310o1352J9451d1493E1455M00149p8555g844
$$ 165300 31950 52314 76478 294788 233436 252887 -41493 51455 451604 373049 -7844
17217C5891J65Q7378J14785D8172K2576h5282C60742e9780E0368i6038I8701K61842
$$ 35891 36056 123434 238219 48172 70748 -85282 360742 -59780 50368 -96038 98701 360543
17205C60543J6816c9005o201E85799E2971J91625k4773K8050j10667K959J21637
$$ 360543 377359 -39005 -45206 585799 52971 244596 219823 247873 137206 140165 261802
17194B61802J07602p1440A43463O7870H6796J85870m6784M3819o0775J10390J19968
$$ 261802 369404 297964 143463 211333 86796 272666 225882 269701 208926 319316 439284
17183D39284A85037J0923M970P5897L3288J53765n9247j87235J62134b950A48862
$$ 439284 185037 195960 200930 276827 310115 463880 404633 217398 379532 -2950 148862
17171c4410k8275C35311c6281B38602J5215r2943h8676C29484a3401A65482p9883
$$ -34410 -62685 335311 -36281 238602 253817 160874 -88676 329484 -13401 165482 85599
17160H5599K0317j6126K03524L2745j40212K56396A33745d6380C59339E5361J79651
$$ 85599 105916 89790 293314 326059 185847 442243 133745 -46380 359339 55361 235012
17149B35012j4209L2521j23676P2627b3374B74446A21968Q452L8333J63406L3785
$$ 235012 220803 253324 129648 202275 -23374 274446 121968 130420 168753 332159 365944
17138C65944j54903K47026n3476p8879r4743Q4016p2953L05603k05909j29328
$$ 365944 211041 458067 404591 325712 230969 314985 242032 547635 341726 212398
17128B12398k9700K35506d1081B93072J04824J27459j73114k9510J46024A79029
$$ 212398 182698 418204 -41081 293072 397896 525355 352241 322731 468755 179029
17117E51365k65831j35308K32541J8828J8929A28245J78089K896j11036J87134
$$ 551365 285534 150226 382767 401595 420524 128245 306334 309230 198194 385328
17107C85328j79143K54691j69321K78337j72111K59481A32138J14147J59447q132
$$ 385328 206185 460876 291555 569892 397781 657262 132138 246285 405732 397600
17097C97600A71160J24129Q1877A32326K76112K18633l3996I4892A9541L11555
$$ 397600 171160 295289 377166 132326 408438 627071 593075 94892 19541 331096
17087C31096A35018J68249j12601M19864A89554L39677l1786j63875J86359q0081
$$ 331096 135018 303267 190666 610530 189554 529231 497445 333570 519929 439848
17077D39848j71270J4677A32503J35129M05187C07223L35626k08911K16601l3401
$$ 439848 268578 283255 132503 267632 672819 307223 642849 433938 650539 617138
17067F17138j98488J53304B46809J26615j41242L97556k14190B00240L44732j68556
$$ 617138 418650 571954 246809 373424 232182 629738 415548 200240 544972 376416
17057C76416J75169k34982J41994P3291B49962N17555G6612K47175j43971L24738
$$ 376416 551585 316603 458597 531888 249962 767517 76612 323787 179816 504554
17047E04554n2310j87381K12016J00974o6341j31884o3718P48337D47433l1303
$$ 504554 452244 264863 476879 577853 511512 379628 315910 1064247 447433 416130
17037D16130j45074L36706j39887j18780J79271K92440C54515J55465j007j01982
$$ 416130 271056 607762 467875 349095 528366 820806 354515 509980 508973 406991
17027D06991J57797j93854L83624K5840j24837j23933j17226P1049L6851M07977
$$ 406991 564788 370934 754558 780398 655561 531628 414402 485451 522302 930279
17017I30279l17729p2294k24063L01338K43548k35975l6650q8898J18725R4031
$$ 930279 612550 540256 316193 617531 861079 625104 588454 499556 618281 712312
17007G12312j85806m4237M06657l39017J65126k20343k0133J48490o0321K08188
$$ 712312 526506 482269 888926 549909 715035 494692 474559 623049 562728 770916
16997G70916l70696K36744r7377K98778k75065J9950J38738J56226k92013J28343
$$ 770916 400220 636964 539587 838365 563300 583250 721988 878214 586201 714544
16987G14544j08585P2647M6322L66579k94325j45392q247j70429O61630E58092
$$ 714544 605959 678606 724928 1091507 797182 651790 643543 473114 1134744 558092
16976E92226M834K45740l48289L63742j38323k65337J2664L4098K07657M6368
$$ 592226 597060 842800 494511 858253 719930 454593 467257 501355 709012 755380
16966G55380J7069j02226k13612N47902k59680J09161j26708K41739k92397K26603
$$ 755380 772449 670223 456611 1004513 744833 853994 727286 969025 676628 903231
16956I03231L1912j30120r5788R186C32932N24862j18831J12270k28676L92517
$$ 903231 935143 805023 709235 718421 332932 857794 738963 851233 622557 1015074
16946A015074l30015K48626P411L2330k7166k32476M28523j43421r8449k96441
$$ 1015074 685059 933685 941096 973426 946260 713784 1142307 998886 900437 603996
16936F03996M54051K49343l50563o7990M5317o0332L39493k7468j49666m9432
$$ 603996 1058047 1307390 956827 888837 934154 873822 1213315 1185847 1036181 986749
16926I86749o9578M1036K78909j81731J6073j21126K64590j69809M39352m06449
$$ 986749 917171 958207 1237116 1055385 1071458 950332 1214922 1045113 1484465 1078016
16916A078016J99774O7861k13745J61034L37846n68157j15156L85378p0219k05142
$$ 1078016 1277790 1345651 1131906 1292940 1630786 1062629 947473 1332851 1262632 1057490
16906A057490R7827M68874k99218j17266L8620K27221q4452k0711J1570L9138
$$ 1057490 1155317 1624191 1324973 1207707 1246327 1473548 1389096 1368385 1379955 1419093
16896A419093K1668J32603l6964j83842J98653O2136k5004N3167l385P5884J08147
$$ 1419093 1440761 1573364 1536400 1352558 1551211 1613347 1588343 1641510 1638125 1714009 1822156
16885A822156n0339p4865P2491j7743k6887q7358L86870j28207k40794M72766
$$ 1822156 1771817 1696952 1769443 1751700 1724813 1637455 2024325 1896118 1655324 2128090
16875B128090j20956O3670N2047L5082l07160K5060K87891r7454j12929j08641
$$ 2128090 2007134 2070804 2122851 2157933 1850773 1875833 2163724 2066270 1953341 1844700
16865A844700j06174M81605k08408M24697l43896n1900K86453J50557j87586L81983
$$ 1844700 1738526 2220131 2011723 2436420 2092524 2040624 2327077 2477634 2290048 2672031
16855B672031m27829K83827k96993L24166j96356J49469L24922O4822k40923N1140
$$ 2672031 2244202 2528029 2231036 2555202 2358846 2508315 2833237 2898059 2657136 2708276
16845B708276o9084O8884j53719N73583m83092K42608L21952N4568P2751r7200
$$ 2708276 2639192 2708076 2554357 3127940 2644848 2887456 3209408 3263976 3336727 3239527
16835C239527p8445r8230J93615K26349J20079l91487L08220q5574k35377K05567
$$ 3239527 3161082 3062852 3256467 3482816 3602895 3211408 3519628 3434054 3198677 3404244
16825C404244j22184J95320M64014k4632j16733K97825P4765n9686j02981K77793
$$ 3404244 3282060 3477380 3941394 3916762 3800029 4097854 4172619 4112933 4009952 4287745
16815D287745M4674P5491K75045j90497J61999J48384L60152k86576L36499m128
$$ 4287745 4332419 4407910 4682955 4492458 4654457 4802841 5162993 4876417 5212916 5208788
16805E208788K49820K236K56017L8245K9838J26493P4125K30996j07918J95852
$$ 5208788 5458608 5460844 5716861 5755106 5784944 5911437 5985562 6216558 6108640 6304492
16795F304492L34829p0562M4865K41406p2635L75764J17153J03392L54447J94844
$$ 6304492 6639321 6568759 6613624 6855030 6782395 7158159 7275312 7378704 7733151 7927995
16785G927995L07212N4847M00347q2851J76076K51235M39906K20813J58717L72074
$$ 7927995 8235207 8290054 8690401 8607550 8783626 9034861 9474767 9695580 9854297 10226371
16775A0226371K84877m2530M35647K26973P37227j40914P91179j25427P29440
$$ 10226371 10511248 10468718 10904365 11131338 11868565 11727651 12518830 12393403 13122843
16766A3122843J72479L89634N54577P24704K69343J3098N43510P27718K43216
$$ 13122843 13295322 13684956 14239533 14964237 15233580 15246678 15790188 16517906 16761122
16757A6761122Q33841N50157Q70095M16967Q79913O23441P19085J103797P11752
$$ 16761122 17594963 18145120 19015215 19432182 20312095 20935536 21654621 22758418 23470170
16748B3470170J019602Q15416Q75113J121563J227835J332913J094129J627450
$$ 23470170 24489772 25305188 26180301 27301864 28529699 29862612 30956741 32584191
16740C2584191J335933J411890J501845J799964J648611J842395K089571K358765
$$ 32584191 33920124 35332014 36833859 38633823 40282434 42124829 44214400 46573165
16732D6573165K497877J909809K859420K832499L197186L153521L442886L907139
$$ 46573165 49071042 50980851 53840271 56672770 59869956 63023477 66466363 70373502
16724G0373502L844951M243954M546622M886788N124257N170847N857100N847487
$$ 70373502 74218453 78462407 83009029 87895817 93020074 98190921 104048021 109895508
16716A09895508O159346O537723O483633O781774O575924O737833P000554O426440
$$ 109895508 116054854 122592577 129076210 135857984 142433908 149171741 156172295 162598735
16708A62598735N669876N415128M955402L651587K971663J930399R70716n87224
$$ 162598735 168268611 173683739 178639141 182290728 185262391 187192790 188163506 187576282
16700A87576282j429888k661402l276029m703032n012887n894908o114506o813293
$$ 187576282 186146394 183484992 180208963 175505931 170493044 164598136 158483630 151670337
16692A51670337o543029p221759o758865o681136o634061o663267n793684o265717
$$ 151670337 145127308 137905549 131146684 124465548 117831487 111168220 105374536 99108819
16684I9108819n474024n371546n023304m651554m494405m122865l990283l753223
$$ 99108819 93634795 88263249 83239945 78588391 74093986 69971121 65980838 62227615
16676F2227615l196742l257013k888188k675438k624674k748982k108668k091297
$$ 62227615 59030873 55773860 52885672 50210234 47585560 44836578 42727910 40636613
16668D0636613k406678j621138j646356j528774j671294j199449j360050j407236
$$ 40636613 38229935 36608797 34962441 33433667 31762373 30562924 29202874 27795638
16660B7795638j056582q01941j576376o85739j157867o06218n92785j345246l53334
$$ 27795638 26739056 25937115 24360739 23675000 22517133 21910915 21318130 19972884 19619550
16651A9619550j113254n42889q23845k98553q91934k13586m93098m19922n58649
$$ 19619550 18506296 17963407 17139562 16841009 15949075 15735489 15242391 14822469 14263820
16642A4263820n36421n84340r3841l17666m43187j72939p72167j88314j82003
$$ 14263820 13727399 13143059 13049218 12731552 12288365 12115426 11343259 11154945 10972942
16633A0972942o10235K4722n65230m12001p4698l4138o27341K98743m40784k64264
$$ 10972942 10362707 10387429 9822199 9410198 9335500 9301362 8674021 8972764 8531980 8267716
16623H267716l32728L10262n31229r0259k35282m18583L8715k8435m35973k3883
$$ 8267716 7934988 8245250 7714021 7623762 7388480 6969897 7008612 6980177 6544204 6520321
16613F520321k47346k35876J89235k43897j77156l00607J16276J50498o50412
$$ 6520321 6272975 6037099 6226334 5982437 5805281 5504674 5620950 5771448 5121036
16604E121036N21272m74028k05177j03325J70461l96209p4224K24715k80156l96108
$$ 5121036 5642308 5168280 4963103 4859778 5030239 4634030 4559806 4784521 4504365 4108257
16594D108257Q0556j88561R2382j94473J34839j97361j88594J09512n42697M98300
$$ 4108257 4188813 4000252 4092634 3898161 4033000 3835639 3647045 3756557 3213860 3712160
16584C712160k7611l55078O03158m24853l24056L09674q1347n1486m2290j47950
$$ 3712160 3684549 3329471 3932629 3507776 3183720 3493394 3412047 3360561 3318271 3170321
16574C170321N4107m26048K09710R5462n83586K90976K18859l27720N3981k25862
$$ 3170321 3224428 2798380 3008090 3103552 2519966 2810942 3029801 2702081 2756062 2530200
16564B530200j93165M07673j84322j32512q5129Q2592k01572r9013M8249L9053
$$ 2530200 2337035 2744708 2560386 2427874 2342745 2425337 2223765 2124752 2173001 2212054
16554B212054j6937J67152j78821k3910o5228N6294P9548l63611j99042M31257
$$ 2212054 2195117 2362269 2183448 2159538 2094310 2150604 2230152 1866541 1667499 2098756
16544B098756K2210l6896l18494j46037j03490K10703L25693j7845k14947j93525
$$ 2098756 2120966 2084070 1765576 1619539 1516049 1726752 2052445 2034600 1819653 1626128
16534A626128j02771J41270l57671L05509M9535j57946j12304N3433p3811O5092
$$ 1626128 1523357 1664627 1306956 1612465 1662000 1504054 1391750 1445183 1371372 1436464
16524A436464r5096j9876Q5862K27307m44658K28488p8523K83577l77111L99924
$$ 1436464 1341368 1321492 1407354 1634661 1190003 1418491 1339968 1623545 1246434 1646358
16514A646358j99334m26367L70472j67382K2869k1538k84557J07724j34785L96031
$$ 1646358 1447024 1020657 1391129 1223747 1246616 1225078 940521 1048245 913460 1309491
16504A309491K87554n09677k8142m87825Q78342j27491j21764m67536K40072J97739
$$ 1309491 1597045 1087368 1059226 571401 1449743 1322252 1200488 732952 973024 1170763
16494A170763K03750k54168M7299R4101r7540J89372j29009K42878m53885k93375
$$ 1170763 1374513 1120345 1167644 1261745 1164205 1353577 1224568 1467446 1013561 720186
16484G20186J94102K9656k12085P4375K31430o389k54883N442L32891J42898j8752
$$ 720186 914288 943944 731859 806234 1037664 1031275 776392 781834 1114725 1257623 1238871
16473A238871n66992K86774L09915n04586J92319q6692n1637l15607N14296k81060
$$ 1238871 671879 958653 1268568 763982 956301 869609 817972 502365 1016661 735601
16463G35601J54121j20574N4381K01090r9643o5239l29601o2068M2506J80480
$$ 735601 889722 769148 823529 1024619 924976 859737 530136 468068 510574 691054
16453F91054K28098j23605J03035J45778E13949j04213N7554J82808L0223J24359
$$ 691054 919152 795547 898582 1044360 513949 409736 467290 650098 680321 804680
16443H04680m8465j2202C39986L75477K58997l30068K4824O185L2264M8691l4184
$$ 804680 756215 744013 339986 715463 974460 644392 669216 675401 707665 756356 722172
16432G22172Q404k85500L42865C58283r28M80652l09505K06806k04038L28784
$$ 722172 730576 445076 787941 358283 357355 838007 528502 735308 531270 860054
16422H60054C98620j29971N92763q7170j92202K5782q4485k20034R0623K51948
$$ 860054 398620 268649 861412 774242 582040 607822 523337 303303 393926 645874
16412F45874L37752l62429j88902M4934L16382j92058G9942L23250j48137K20553
$$ 645874 983626 621197 432295 477229 793611 601553 79942 403192 255055 475608
16402D75608r2573K24499m5241K492B17136L00343k20308K6111Q6792K08844B97457
$$ 475608 383035 607534 562293 564785 217136 517479 297171 323282 410074 618918 297457
16390B18653K69910j08812j3078M9419R5819r5441M53919a0444C79935n5443n1882
$$ 218653 488563 379751 366673 416092 511911 416470 870389 -10444 379935 324492 272610
16379B72610J17504K52204J21150l71588j06876A32548K57400A63351J76386P8949
$$ 272610 390114 642318 763468 391880 285004 132548 389948 163351 339737 418686
16369D18686M7278j61906I7430N76686k65604F9334M0607Q0576J47831j17617
$$ 418686 465964 304058 97430 674116 408512 69334 109941 190517 338348 220731
16359B20731L50200j57219A4510L15991L33261C04921l3148k5902L52577k70589
$$ 220731 570931 413712 14510 330501 663762 304921 271773 245871 598448 327859
16349C27859j42381L07597j00645Q7779j67351d7783B70246K09695N9708H6227
$$ 327859 185478 493075 392430 480209 312858 -47783 270246 479941 539649 86227
16338C21605G6131N79182j41613j81772A16044J90845r7506J72796K5646C9778
$$ 321605 76131 655313 513700 331928 116044 306889 209383 382179 407825 39778
16327a08901E36526M298k20858j01355M04876A06289j7791J48906M6025J59006
$$ -108901 536526 540824 319966 218611 623487 106289 88498 237404 283429 442435
16317D42435B18783a55830c5852C75681b5455B83229K534A40750J02781K75634
$$ 442435 218783 -155830 -35852 375681 -25455 283229 285763 140750 243531 519165
16307E19165I6216J30264L38661k19000j47817a60806G5231M69830A51238Q8428
$$ 519165 96216 226480 565141 346141 198324 -160806 75231 545061 151238 239666
16297B39666F092J93728l9462j8014l5256J78050H3453R0861a1257A23700b5748
$$ 239666 6092 199820 160358 142344 107088 285138 83453 174314 -11257 123700 -25748
16285B09100Q8162R268J5792C5440L58451b695B52496K74339A91988E4017K68265
$$ 209100 297262 306530 322322 35440 393891 -2695 252496 526835 191988 54017 322282
16274C22282j5785j10242a35308j46474B94681j37441E9745K72143J23279A11401
$$ 322282 306497 196255 -135308 -281782 294681 157240 59745 331888 455167 111401
16263A57107K15591A38884K3150A9230K93252J0489j57714F3527P8919h284A40743
$$ 157107 372698 138884 162034 19230 312482 322971 165257 63527 142446 -8284 140743
16251A48952m9541K86209H0776J36599r478q6720L41348j07287I1727g5402n3265
$$ 148952 99411 385620 80776 217375 207897 121177 462525 355238 91727 -75402 -128667
16240a28667k1364A79624p558J37117A10230J4434M23072C8569J06374J35328
$$ -128667 -150031 179624 172066 309183 110230 124664 547736 38569 144943 280271
16230B80271a66574A74538m8893D232L7555Q5593B7044J14892Q3621D0655a59425
$$ 280271 -166574 174538 125645 4232 41787 127380 27044 141936 225557 40655 -159425
16218g248A57718m1130k8765J41790E5510a45098B02529b3342A75683a31773B113
$$ -7248 157718 116588 87823 229613 55510 -145098 202529 -23342 175683 -131773 2113
16206e5812C36716a29944A2548L8378L8629J27273C1234K48537p2399R889a5729
$$ -55812 336716 -129944 12548 50926 89555 216828 31234 279771 207372 217261 -15729
16194C72765A51361b9564A08929J23861i5932B9636K93777E1549f2067A13117
$$ 372765 151361 -29564 108929 232790 -95932 29636 323413 51549 -62067 113117
16183A55013J29930a622B54174c7957C77153D6923K53663E8842J24705n6480B1372
$$ 155013 284943 -1622 254174 -37957 377153 46923 300586 58842 183547 127067 21372
16171A30860J17411j2586J45709O165e5058F3500k9360L2139J60731m291b46922
$$ 130860 248271 235685 381394 387559 -55058 63500 34140 66279 227010 222719 -246922
16159a20543C15006j38127R8073a3264A56068F8656M8231a09855a6725k55140
$$ -120543 315006 176879 274952 -13264 156068 68656 116887 -109855 -16725 -271865
16149b71865c6505j45723C2916a31176L8799A16612n4181J6536J53320c28470
$$ -271865 -36505 -182228 32916 -131176 -92377 116612 62431 78967 232287 -328470
16138D92845H8226l008K34896j37939d8010B54077A6034K84106o9061D6605J82396
$$ 492845 88226 85218 320114 182175 -48010 254077 16034 300140 231079 46605 229001
16127B29001F8509b6053F5107L264J37063d7779A42899a23920l8649A92696f5193
$$ 229001 68509 -26053 65107 68371 205434 -47779 142899 -123920 -162569 192696 -65193
16115F7354J68082a18575D4653c337A464J60152i6771m5632H8150b18180C4813
$$ 67354 235436 -118575 44653 -3337 1464 161616 -96771 -142403 88150 -218180 34813
16103D22553F0030L20058A68744B1670K17574c4252k30180A36386A2345a20300
$$ 422553 60030 380088 168744 21670 239244 -34252 -264432 136386 12345 -120300
16092i9419c2874E7294K66838A32567F5249J27671K12605i4033A67618g5640D94370
$$ -99419 -32874 57294 324132 132567 65249 192920 405525 -94033 167618 -75640 494370
16080b99192A97171b5269r7220C79862j36677a89026B1567N14234g2242D04567
$$ -299192 197171 -25269 -122489 379862 243185 -189026 21567 535801 -72242 404567
16069B4004a60478K0497C4663d7700B56372D807b3828j58765A91295H0060J4425
$$ 24004 -160478 -139981 34663 -47700 256372 4807 -23828 -182593 191295 80060 94485
16058I4485l6775a56645f0714B61512K4837A31765O0834b58888F2918r079d4176
$$ 94485 57710 -156645 -60714 261512 286349 131765 192599 -258888 62918 53839 -44176
16046I7053m5785a54979n5700A54799a203k12003g7156A33273a14435A56753n7873
$$ 97053 51268 -154979 -210679 154799 -1203 -213206 -77156 133273 -114435 156753 98880
16035I8880R8152G0270C1158J10700b9667I4454a77337A12049a6789A07928l5593
$$ 98880 197032 70270 31158 141858 -29667 94454 -177337 112049 -16789 107928 72335
16024G2335q589i6267l854n5231F4700a31539M4470l7661A24018K32634G9053
$$ 72335 63746 -96267 -100121 -155352 64700 -131539 -87069 -124730 124018 356652 79053
16012B1872c2822j09195K9327A24851K05103H8062J56196f4978j87888J16874
$$ 21872 -32822 -142017 -112690 124851 329954 88062 244258 -64978 -252866 -135992
16002a35992G9463h9131a4674D6274M6290a3332E3640d14277e1393l21979C8866
$$ -135992 79463 -89131 -14674 46274 92564 -13332 53640 -414277 -51393 -373372 38866
15990b09946B46173K8640j8067f3307C70121D215J05296a12352N4122K0343F8541
$$ -209946 246173 274813 256746 -63307 370121 4215 109511 -112352 -58230 -37887 68541
15978g2959E5294a92973B42139a6858P752m17010a48344B43022q2515G2532P111
$$ -72959 55294 -192973 242139 -16858 -9106 -426116 -148344 243022 160507 72532 79643
15967G9643K33167K79807A93243a1973j74124A67555b5981A59173C99J88492K9646
$$ 79643 312810 592617 193243 -11973 -186097 167555 -25981 159173 399 188891 218537
15956B18537a36374j24438a625l871n31089D9695j4323b8597B70183j27770J77628
$$ 218537 -136374 -260812 -1625 -5496 -536585 49695 35372 -28597 270183 142413 320041
15945C20041c1239q7963F4615c6733O389G4064c37503A60349a92307L4486A40403
$$ 320041 -31239 -119202 64615 -36733 -30344 74064 -337503 160349 -192307 -157821 140403
15933b91883d627k43034k20746f031C3959b94290C96516h3363D345a61509O6498
$$ -291883 -4627 -247661 -468407 -6031 33959 -294290 396516 -83363 4345 -161509 -95011
15922i5011a5890k31633j40426A9889J34570a17298k0396e6754j26953J6023b2720
$$ -95011 -15890 -247523 -387949 19889 154459 -117298 -137694 -56754 -183707 -167684 -22720
15910A80625a26895L1194m0382N792f4894j213k08853B62651h1958k65919A74673
$$ 180625 -126895 -95701 -136083 -130291 -64894 -66107 -274960 262651 -81958 -347877 174673
15898E5034f0284j63769R2973o0001B10838a30456c5298a5937E9001B6957a19520
$$ 55034 -60284 -224053 -131080 -191081 210838 -130456 -35298 -15937 59001 26957 -119520
15886a32736A84256e3626B03842a09978A3091J20975h5892B09266e5163J5453
$$ -132736 184256 -53626 203842 -109978 13091 134066 -85892 209266 -55163 -39710
15876c9710r4074A35284L459a26779N1559a3405B011g2613G3872d8258B34876
$$ -39710 -133784 135284 138743 -126779 -75220 -13405 2011 -72613 73872 -48258 234876
15864E4934J50806h4210A4910l435a83987g6933A55908E7492J67556g7772j60121
$$ 54934 205740 -84210 14910 11475 -183987 -76933 155908 57492 225048 -77772 -237893
15853b37893m2328b7001H8251k7624b71290I3656e8120k07648a07607A44025c22799
$$ -237893 -280221 -27001 88251 60627 -271290 93656 -58120 -265768 -107607 144025 -322799
15841a23618G4035a6204j42735F6081p715J01972a61408d3576B7900a42155A45963
$$ -123618 74035 -16204 -158939 66081 58366 160338 -161408 -43576 27900 -142155 145963
15829g5717A24755C8182D924f2817a7066k82245R3427h1531j0513o1684C22260
$$ -75717 124755 38182 4924 -62817 -17066 -299311 -205884 -81531 -92044 -153728 322260
15817F7248a20602d8217k67928b9072j82834q6040J14773P0839r4048A01194i2882
$$ 67248 -120602 -48217 -316145 -29072 -211906 -297946 -183173 -112334 -206382 101194 -92882
15805b04150H417e7958G348b52987E4851b00159B39776a76377n384A9414c62140
$$ -204150 8417 -57958 7348 -252987 54851 -200159 239776 -176377 -181761 19414 -362140
15793F6849c4891A04605b73977a4670D19654d8606j92182A93903a46382B06025
$$ 66849 -34891 104605 -273977 -14670 419654 -48606 -240788 193903 -146382 206025
15782i4887l19425G4740J55260I0656c1766k22567A36607b04873A64335n1101
$$ -94887 -414312 74740 230000 90656 -31766 -254333 136607 -204873 164335 113234
15772A13234J86971A4491d26588C58592b0632A24925A2672J8298P5001k0838b68577
$$ 113234 300205 14491 -426588 358592 -20632 124925 12672 30970 105971 85133 -268577
15760A54356k6656i757k63024F3988K198b2514B12023a37091d0416J623C3272
$$ 154356 127700 -9757 -272781 63988 66186 -22514 212023 -137091 -40416 -38793 33272
15748e8788E694b405j75651j91653H3479a15013A25713O2561F5845B2942J28454
$$ -58788 5694 -2405 -178056 -369709 83479 -115013 125713 188274 65845 22942 151396
15737A51396J17679A9066h2823l3258c4021l8040m5703B89556A13777C3343K37069
$$ 151396 269075 19066 -82823 -116081 -34021 -72061 -117764 289556 113777 33343 270412
15726B70412A26206j3631K2650E6813a04241A5196a52931j3117O4556A29318h6566
$$ 270412 126206 112575 135225 56813 -104241 15196 -152931 -166048 -101492 129318 -86566
15714E9477a2632G244a88356O8661k39615B17098b2010B2677b28509K4227o7599
$$ 59477 -12632 7244 -188356 -119695 -359310 217098 -22010 22677 -228509 -204282 -271881
15703b71881F6433h6527j06742e7791p8860e1419j46725M0408A32737a02513J1561
$$ -271881 66433 -86527 -193269 -57791 -136651 -51419 -198144 -157736 132737 -102513 -90952
15692i0952k15662J28078r159j25735B5506f2226l0418I0028a11399B46971a71729
$$ -90952 -306614 -178536 -187695 -313430 25506 -62226 -92644 90028 -111399 246971 -171729
15680A19030i1884m5753A16722b68997e2980A23916g1265I4009a00541L1789j81019
$$ 119030 -91884 -137637 116722 -268997 -52980 123916 -71265 94009 -100541 -68752 -249771
15669b49771J04875J222k50458H3177a04940A7819b80914j395I3098i0946A43546
$$ -249771 -144896 -143674 -394132 83177 -104940 17819 -280914 -282309 93098 -90946 143546
15657A13026R4519d8681A75199L9427n4759p8570e1911o4185b8421o0459D4439
$$ 113026 207545 -48681 175199 214626 159867 81297 -51911 -116096 -28421 -88880 44439
15645b8799q748a5820m5897i26m1211k53844i8903j31775a11420M9290A64803
$$ -28799 -37547 -15820 -61717 -926 -42137 -295981 -98903 -230678 -111420 -62130 164803
15633d6351m60788A2779b05939D83169c92042A00911D5834h3766j82994l37962
$$ -46351 -507139 12779 -205939 483169 -392042 100911 45834 -83766 -266760 -604722
15623f04722A44665L3263f8913N139k3411E6963J66109b21156i5900k067B77186
$$ -604722 144665 177928 -68913 -63774 -87185 56963 223072 -221156 -95900 -97967 277186
15611B3725e4336j0559k3372A1729J03683J12798a60110d0967F5780p056a77431
$$ 23725 -54336 -64895 -88267 11729 115412 228210 -160110 -40967 65780 58724 -177431
15599b52856A4996e5889A69208m2058J35554a36069G1656K2651b7089j65329L4615
$$ -252856 14996 -55889 169208 127150 262704 -136069 71656 94307 -27089 -192418 -157803
15588a57803A41495C5467a9320I1069a19103I9560b18703B68779a36204F9471
$$ -157803 141495 35467 -19320 91069 -119103 99560 -218703 268779 -136204 69471
15577b04872j57950d8684k40044J5356O6233O4451F3061J47805A0993m298b1090
$$ -204872 -362822 -48684 -288728 -273372 -207139 -142688 63061 210866 10993 6695 -21090
15565i3457A25092M0182a8305j34290j38424h3380A28658a67827A52957a99514
$$ -93457 125092 165274 -18305 -152595 -291019 -83380 128658 -167827 152957 -199514
15554C18965a62936H8083a76660g6584J3869J5214A43410J0863K19398b7575H7222
$$ 318965 -162936 88083 -176660 -76584 -62715 -47501 143410 154273 373671 -27575 87222
15542F8176c4463A12568O6828a74210j33052f2337o3270A66645o6023e9987b2097
$$ 68176 -34463 112568 179396 -174210 -307262 -62337 -125607 166645 100622 -59987 -22097
15530H860b03628M3591A60890a86530R1332n0917j30499A10818c05669B56596
$$ 8860 -203628 -160037 160890 -186530 -95198 -146115 -276614 110818 -305669 256596
15519G1596J17270a99079C16466b16688G9200a10653C81176b17148c198j62006
$$ 71596 188866 -199079 316466 -216688 79200 -110653 381176 -217148 -3198 -165204
15509a65204G9278c0384p7795E4847J05379a0964q1919j15799P8724K9025B34740
$$ -165204 79278 -30384 -108179 54847 160226 -10964 -92883 -208682 -129958 -100933 234740
15497A85360f6204C5008a17342A34237a7349A5207e4970r0400B07894b6522C8747
$$ 185360 -66204 35008 -117342 134237 -17349 15207 -54970 -145370 207894 -26522 38747
15485i4344C5899M9118b10874n8167l8153i9905A5170O4572J08050h2329j74803
$$ -94344 35899 85017 -210874 -269041 -307194 -99905 15170 79742 187792 -82329 -257132
15474b57132B14372f7504K9878j01719k9913F7764b67307q0374J38343A33778
$$ -257132 214372 -67504 -37626 -139345 -169258 67764 -267307 -347681 -209338 133778
15463i2228I1076d99577C35655I1620d5094q8605j57423R9335A00988N7677f3473
$$ -92228 91076 -499577 335655 91620 -45094 -133699 -291122 -191787 100988 158665 -63473
15451d4298A15474M3012L5860c7394M891B7086a997I5360a60924B84399I9057
$$ -44298 115474 158486 194346 -37394 -32503 27086 -1997 95360 -160924 284399 99057
15439a0755A5872K91219f2262o2155e0713C2661a32519n9846e8583C59380e438
$$ -10755 15872 307091 -62262 -124417 -50713 32661 -132519 -192365 -58583 359380 -5438
15427g8391M53E7226b44374f3027M855l45779A84321N2216B5743a38403B6238
$$ -78391 -77938 57226 -244374 -63027 -58172 -403951 184321 236537 25743 -138403 26238
15415b67017Q2060f4297j98076B85116a63589j19180G8405a0942j17968p0423
$$ -267017 -184957 -64297 -262373 285116 -163589 -282769 78405 -10942 -128910 -199333
15405a99333h2433m284r9132k8179Q9921A10814i3333J880A43533M0398k445a99113
$$ -199333 -82433 -86717 -185849 -214028 -124107 110814 -93333 -91453 143533 183931 181486 -199113
15392A88215b3178k0888A06234K0109J99848b39107J12515j30466d1923l53451
$$ 188215 -23178 -44066 106234 126343 326191 -239107 -126592 -257058 -41923 -395374
15382c95374A55528k2217B4263h5915j11088H6795a14740D0929a56894e8603K9253
$$ -395374 155528 133311 24263 -85915 -197003 86795 -114740 40929 -156894 -58603 -29350
15371b9350A32150K6626J19202j11646f9722C23004a04409m8542j6203b5653A33586
$$ -29350 132150 158776 277978 166332 -69722 323004 -104409 -152951 -169154 -25653 133586
15359a09258H2938N4395i2422j61797b1878B12299J8694a49013A2577c61084B094
$$ -109258 82938 137333 -92422 -254219 -21878 212299 230993 -149013 12577 -361084 2094
15347C4931a51866C2043J12078r608J14654D0389b73680a23029N0808C0288b67855
$$ 34931 -151866 32043 144121 134513 249167 40389 -273680 -123029 -72221 30288 -267855
15335b11806R836D0594K117a21853D9113Q8074a03713e1224k5192j3549A39531
$$ -211806 -201970 40594 42711 -121853 49113 137187 -103713 -51224 -76416 -89965 139531
15323c16244J19334A2676a06771M2108j2387o5040F52f7688j38602F4960Q429
$$ -316244 -196910 12676 -106771 -64663 -77050 -142090 652 -67688 -206290 64960 73389
15312G3389j9643J79376b28260a101C64151a10003b8962j08575j322I9723P7872
$$ 73389 53746 233122 -228260 -1101 364151 -110003 -28962 -137537 -138859 99723 177595
15301A77595E4141N9235K30950p0408e38413a61865A55782m8880a46583A43649
$$ 177595 54141 113376 344326 273918 -538413 -161865 155782 106902 -146583 143649
15290G1595a74438A51601a13049j12297B24314K82561f8516l18432A19539g5352
$$ 71595 -174438 151601 -113049 -225346 224314 506875 -68516 -386948 119539 -75352
15279A95963b99483A57046b52l9971n3006j15733I1655d12142C33381b03002B05477
$$ 195963 -299483 157046 -252 -40223 -93229 -208962 91655 -412142 333381 -203002 205477
15267a18166F3597J66071c18912D7841R031L48196F7412R1503A8363p278J1024
$$ -118166 63597 229668 -318912 47841 56872 405068 67412 158915 18363 11085 22109
15256B2109d6674B63476H0667J25026b08550p9113C79160E9632c092A7993a83838
$$ 22109 -46674 263476 80667 205693 -208550 -287663 379160 59632 -3092 17993 -183838
15244B87003b49283H7625N7526K04363A33714e9720E06295k2709K17886K21294
$$ 287003 -249283 87625 145151 349514 133714 -59720 506295 483586 701472 922766
15234I22766k72672p3819L41621l01641B11169h6141D05135a6942F31674A59261
$$ 922766 650094 576275 917896 616255 211169 -86141 405135 -16942 631674 159261
15223A80531a12471A16963i754B65788F5044i7106A03327e451j05950A67319L1822
$$ 180531 -112471 116963 -9754 265788 65044 -97106 103327 -5451 -111401 167319 199141
15212A99141D3235m31e6499A6526K7335a25812B24978C4202R2633L7321h4215
$$ 199141 43235 42804 -56499 16526 43861 -125812 224978 34202 126835 164156 -84215
15200D3755P6535A3812J88252a62435K8692B62661e2231a1795C1652g3392J9068
$$ 43755 120290 13812 202064 -162435 -133743 262661 -52231 -11795 31652 -73392 -54324
15189e4324D70213H9532a37349M5597j4548M7705i097G6152J06905O7249A00969
$$ -54324 470213 89532 -137349 -91752 -106300 -58595 -9097 76152 183057 250306 100969
15177G987b3656A30998L4227k1004b13834j41625e9856A4234f7738I2748f8639
$$ 7987 -23656 130998 165225 144221 -213834 -355459 -59856 14234 -67738 92748 -68639
15165A59678g2366B39620a25214C56071r2017b18209H7251K80141A7759J81430
$$ 159678 -72366 239620 -125214 356071 264054 -218209 87251 367392 17759 199189
15155A99189a08678L5462K7098C69056a6536A21524g5324E3342J18934i0283B83921
$$ 199189 -108678 -73216 -46118 369056 -16536 121524 -75324 53342 172276 -90283 283921
15143B69372a34106C99306j46477D9427c5372A9173J80112D5394j9559b29575
$$ 269372 -134106 399306 252829 49427 -35372 19173 199285 45394 25835 -229575
15132D50798f2432B87932a21495A56253M2638B3777M12265I778L40234j53117
$$ 450798 -62432 287932 -121495 156253 198891 23777 436042 9778 350012 196895
15122A96895M10427j48430a33170H0697L5277L90309B03476b0823A62742Q8590
$$ 196895 607322 458892 -133170 80697 115974 506283 203476 -20823 162742 251332
15112B51332J24626g5056a0504k15615A05457K51814a93672E60752a41946B77472
$$ 251332 375958 -75056 -10504 -226119 105457 357271 -193672 560752 -141946 277472
15101a66563B25638j01741b17182h2829n2525d7993I7274P9353c5349B92722B6703
$$ -166563 225638 123897 -217182 -82829 -135354 -47993 97274 176627 -35349 292722 26703
15089C49336e1627C35753E0948a38566A4587O896J402f8101B11556O5194A1080
$$ 349336 -51627 335753 50948 -138566 14587 21483 22885 -68101 211556 276750 11080
15077d72356A17450J83466n7216L4769n1226G9918K35836A18163n0586J13752
$$ -472356 117450 300916 243700 278469 227243 79918 315754 118163 67577 181329
15067A81329H2724D839K07486k6534d0350C73454j81451n9353f8026A7107e3934
$$ 181329 82724 4839 212325 185791 -40350 373454 192003 132650 -68026 17107 -53934
15055D62176A91154Q3158r9228J25063m8741A23748J7742J36190j19280A238L81826
$$ 462176 191154 274312 175084 300147 251406 123748 141490 277680 158400 1238 383064
15044C83064a18866A46280o7034J34951J03286b75473H8557K24560c7630B03975
$$ 383064 -118866 146280 79246 214197 317483 -275473 88557 313117 -37630 203975
15033D50287j72420J60552f1954B54603P5754A36468d6836I3876l878J50137b8201
$$ 450287 277867 438419 -61954 254603 330357 136468 -46836 93876 89998 240135 -28201
15021C2327a0206C07723J77811B12457e9278A37283m9401c6507A08357C4879K88703
$$ 32327 -10206 307723 485534 212457 -59278 137283 87882 -36507 108357 34879 323582
15010C23582a6640G7819J15548o0031N1206p7121g4096A87683G8979R0969k6632
$$ 323582 -16640 77819 193367 133336 184542 107421 -74096 187683 78979 169948 143316
14999A43316R7602k4337J7223M8242K310A30159d5716A0913a18189D4654i588
$$ 143316 240918 216581 233804 282046 284356 130159 -45716 10913 -118189 44654 -9588
14987I6470j4776b866C46611M7364k9057j16677o1033J06213L341l8752J43580
$$ 96470 81694 -2866 346611 393975 364918 248241 187208 293421 296762 258010 401590
14976D01590G3606P7975J44005k6290K3490o9980d5207A91387p7967L16180J3523
$$ 401590 73606 151581 295586 269296 292786 222806 -45207 191387 113420 429600 443123
14965D43123N6906k38943J20023A64255G4518a83309H4907J22826K21765A00541
$$ 443123 500029 261086 381109 164255 74518 -183309 84907 207733 429498 100541
14954C24685O9770F6233J31688L5881K59562a08642k76132B30221b39300I3891
$$ 324685 394455 66233 197921 233802 493364 -108642 -384774 230221 -239300 93891
14943A91817g5935D98974A73253J16223o7959Q0797O9107j14776K14088j20361
$$ 191817 -75935 498974 173253 289476 221517 302314 371421 256645 470733 350372
14933C50372R035J19546O402B04957r9660Q6838K06730M1657j46597J15316J25649
$$ 350372 359407 478953 485355 204957 105297 192135 398865 440522 293925 409241 534890
14922E34890j33608J32184B25038J03776k7495A06161l1942K04578K58735k58905
$$ 534890 401282 533466 225038 328814 301319 106161 74219 278797 537532 278627
14912B78627J58525n5116F7011K20952K5733B5126P6794K44252K5729L2067L35762
$$ 278627 437152 382036 67011 287963 313696 25126 101920 346172 371901 403968 739730
14901G39730B68521j98n749C1251J24639o3705J02086n0230L05553k17442o4773
$$ 739730 268521 268323 262574 31251 155890 92185 194271 144041 449594 232152 167379
14890A67379O8477P0352j42513M07090A88780O6173j7704k1984J31087o6170M6448
$$ 167379 235856 306208 163695 570785 188780 254953 237249 215265 346352 280182 326630
14879C26630R4905p2887j30128L1546K33925j8467o6986A93252M8889K83186B00973
$$ 326630 421535 348648 218520 250066 483991 465524 398538 193252 242141 525327 200973
14867B16426J54600r4367Q5283A54425M3924K97720k41627r915J45169L7802A65383
$$ 216426 371026 276659 361942 154425 198349 496069 254442 244527 389696 427498 165383
14855A88641a1030D16735A40872N8395J86740j66382K48149n1071M1515j12670
$$ 188641 -11030 416735 140872 199267 386007 219625 467774 416703 458218 345548
14845C45548C1961L80694j14335K08620j08454m4674K11554j15998l5474B1436
$$ 345548 31961 412655 298320 506940 398486 353812 565366 449368 413894 21436
14834C89461J14042J36501k93136J17046A82444M11517j00705Q8486q9224A81827
$$ 389461 503503 640004 346868 463914 182444 593961 493256 581742 492518 181827
14823F21415B7597N63723j31453B11688J48213J86713j08782q9678M1464j23810
$$ 621415 27597 591320 459867 211688 359901 546614 437832 348154 389618 265808
14813B65808J08333K57791k52113J44363B01763K97226j99763J31145j71036M0034
$$ 265808 374141 631932 379819 524182 201763 498989 299226 430371 259335 299369
14803B99369K05808q6274K02175J17553k80768j05968P3021j54039M16265k28160
$$ 299369 505177 418903 621078 738631 457863 351895 424916 270877 687142 458982
14793D58982P872K34811k25339O9765B56429M32683l23810J37869p5795M5160
$$ 458982 466854 701665 476326 546091 256429 689112 365302 503171 427376 472536
14783D72536j97809L07044J57374m6361m5349Q2737l08546j00904K4216J49526
$$ 472536 274727 581771 739145 692784 647435 730172 421626 320722 344938 494464
14773D94464J02949j8184j81151L06140r5928j42389J62970j5133M5154r1052
$$ 494464 597413 579229 398078 704218 608290 465901 628871 613738 658892 567840
14763E67840L30100D26429N441R2443B03143L98167j4117O7455k3127j15014j44767
$$ 567840 897940 426429 431870 524313 203143 601310 587193 654648 631521 516507 371740
14752C71740Q2580K9180o5561M2608J71619k41006J6467L04826j31512l2747K89959
$$ 371740 454320 483500 417939 460547 632166 391160 407627 712453 580941 548194 838153
14741H38153k57712l7684N69704m64264J5338L06032C20404K01436M9061J39861
$$ 838153 580441 542757 1112461 648197 663535 969567 320404 521840 570901 710762
14731G10762q8811K15612J23531j03212J19280B37812L83822L17444p21k04905
$$ 710762 621951 837563 961094 857882 977162 237812 621634 939078 938357 733452
14721G33452L6696k06087k13302L58443R7707l3811j22980k6624r3169N82724
$$ 733452 770148 564061 350759 709202 806909 773098 650118 623494 530325 1113049
14711A113049m90029L30207k05943j89991R8587J31800k24308K42178l49547K66006
$$ 1113049 623020 953227 747284 557293 655880 787680 563372 805550 456003 722009
14701G22009K6795j35058j19356J96771L26813k98919j13881J15996J57658k96427
$$ 722009 748804 613746 494390 691161 1017974 719055 605174 721170 878828 582401
14691E82401L61453j16091k61284M8724J27691j20578K41733l85972M12622P3369
$$ 582401 943854 827763 566479 615203 742894 622316 864049 478077 890699 964068
14681I64068j01107j14273L4868L5353K7597L94458r3280k80057j98789L78647
$$ 964068 862961 748688 783556 818909 846506 1240964 1147684 867627 668838 1047485
14671A047485P1061N8225E56242M42209k30450O53024n05552Q9149j66443R6159
$$ 1047485 1118546 1176771 556242 998451 768001 1421025 915473 1004622 838179 934338
14661I34338J63220l76015L73522o1045k17504r9516K74236r9910P7113j38941
$$ 934338 1097558 721543 1095065 1034020 816516 717000 991236 891326 968439 829498
14651H29498K16991k81341N35723k83259K29845l69576r9256M41871j63278q0923
$$ 829498 1046489 765148 1300871 1017612 1247457 877881 778625 1220496 1057218 976295
14641I76295K10020j04574K16457l2025J8481j62295m7529K5485M00293m82097
$$ 976295 1186315 1081741 1298198 1266173 1284654 1122359 1074830 1100315 1500608 1018511
14631A018511J21766K279o8183K80700J40551j64552p689M9480l37721N9424K6407
$$ 1018511 1140277 1142556 1074373 1355073 1495624 1331072 1323383 1372863 1035142 1094566 1120973
14620A120973L26567J90259r1723j09360k24367J46612j8400r404J77020m98527
$$ 1120973 1447540 1637799 1546076 1436716 1212349 1358961 1340561 1331157 1508177 1009650
14610A009650J21360M28100k52787J52757k49340J95859k9057k9878n5121K20732
$$ 1009650 1131010 1559110 1306323 1459080 1209740 1405599 1376542 1346664 1291543 1512275
14600A512275k9336l7770j60626M49163j85463m15584L73909J7416M450J83658
$$ 1512275 1482939 1445169 1284543 1733706 1548243 1132659 1506568 1523984 1528434 1712092
14590A712092j81257r0234J23569P7146K2729M6679k00476N5292l76928M32508
$$ 1712092 1530835 1440601 1564170 1641316 1664045 1710724 1510248 1565540 1188612 1621120
14580A621120R36J04441J01541N9504j05683q0375R4520J71692m1949j35345K0024
$$ 1621120 1622056 1726497 1828038 1887542 1781859 1701484 1796004 1967696 1925747 1790402 1810426
14569A810426l39797O15304l75348M30300l10428J77502L11541l65745J79507
$$ 1810426 1470629 2085933 1710585 2140885 1830457 2007959 2319500 1953755 2133262
14560B133262k14819J19845J51245m7999L6851J67598l91971L09260j07813K69834
$$ 2133262 1918443 2038288 2189533 2141534 2178385 2345983 1954012 2263272 2155459 2425293
14550B425293J87188k0844m4213P5484k3264K20516K4917N83899l17910K73041
$$ 2425293 2612481 2591637 2547424 2622908 2599644 2820160 2845077 3428976 3111066 3384107
14540C384107L02423P08168K02763O43229P93732J502280J869059L763210O007807
$$ 3384107 3686530 4394698 4597461 5240690 6034422 7536702 9405761 13168971 19176778
14531A9176778R018417K803642j1683515p256401m412460k050535j274247o27923
$$ 19176778 28195195 30998837 19315322 12058921 7646461 5595926 4321679 3693756
14523C693756m24584n04859n6840k56966K05842p8522J11914k06217p113m11666
$$ 3693756 3269172 2764313 2707473 2450507 2656349 2577827 2689741 2483524 2476411 2064745
14513B064745M08998l61590K53168K4984J38090N8541R2073l71971K30297J25331
$$ 2064745 2473743 2112153 2365321 2390305 2528395 2586936 2679009 2307038 2537335 2662666
14503B662666J50241q6116k4495J54302k28233p4565j23701O0882M80641j3131
$$ 2662666 2812907 2726791 2702296 2856598 2628365 2553800 2430099 2490981 2971622 2958491
14493B958491R5557j79136r2977M5689J90080Q4605M3788r0480j5336r3506L67631
$$ 2958491 3054048 2874912 2781935 2827624 3017704 3102309 3146097 3055617 3040281 2946775 3314406
14482C314406j43126J75478j18219K33830k18740J97528m1260l0879j26948O1846
$$ 3314406 3171280 3346758 3228539 3462369 3243629 3441157 3399897 3369018 3242070 3303916
14472C303916L62754j42967J69084j59648K35453l15501M22673O3381j78502l4067
$$ 3303916 3666670 3523703 3692787 3533139 3768592 3453091 3875764 3939145 3760643 3726576
14462C726576M32719q8138j35260K0620j36801L07186K3794M54845n01420k6260
$$ 3726576 4159295 4071157 3935897 3956517 3819716 4126902 4150696 4605541 4104121 4077861
14452D077861M68563q2321j94019L55358K0469P0000K34944J11811P4268m41491
$$ 4077861 4546424 4464103 4270084 4625442 4645911 4715911 4950855 5062666 5136934 4695443
14442D695443L27736l2107L79986l70552J10628Q15Q5972L77424m6270j31659
$$ 4695443 5023179 4991072 5371058 5000506 5111134 5111949 5197921 5575345 5529075 5397416
14432E397416M6877j26811N76470K3631p6532K1716l7902K79241q858J43399m03277
$$ 5397416 5444293 5317482 5893952 5917583 5841051 5862767 5824865 6104106 6095248 6238647 5835370
14421E835370L26710K56727J32776M51091m28516O3369j15525M93619L26645l27851
$$ 5835370 6162080 6418807 6551583 7002674 6574158 6637527 6522002 7015621 7342266 7014415
14411G014415n927M88073j9902p0140L85109R9537k71888K98563K09899J47787
$$ 7014415 7008488 7496561 7476659 7406519 7791628 7891165 7619277 7917840 8127739 8275526
14401H275526J99046J16656k68165K63259j08780J77527j15380P75601k2345J93484
$$ 8275526 8474572 8591228 8323063 8586322 8477542 8655069 8539689 9315290 9292945 9486429
14391I486429K27653J75844J90334K39098k6256P5605J95699p0734K76318M31466
$$ 9486429 9714082 9889926 10080260 10319358 10293102 10368707 10564406 10493672 10769990 11201456
14381A1201456O4492K09509k83044M06441M17025J05849J85174N64444K14783
$$ 11201456 11265948 11475457 11192413 11598854 12015879 12121728 12306902 12871346 13086129
14372A3086129l06829Q21447J91800K84244J4560J54789L35205R7988L78690J69242
$$ 13086129 12779300 13600747 13792547 14076791 14091351 14246140 14581345 14679333 15058023 15227265
14362A5227265O40619L57999J25212L03051N26279l4647N94737K79787N58680
$$ 15227265 15867884 16225883 16351095 16654146 17180425 17145778 17740515 18020302 18578982
14353A8578982K09161L70504K99365Q87673M00612M05381J0323O81774P79061
$$ 18578982 18788143 19158647 19458012 20345685 20746297 21151678 21162001 21843775 22622836
14344B2622836L65104L93456N54469N55309N86165L98167N97844R75556M83621
$$ 22622836 22987940 23381396 23935865 24491174 25077339 25475506 26073350 27048906 27532527
14335B7532527Q59789R19326O67529N82877O40449O87009R97769R76256P55520
$$ 27532527 28392316 29311642 29979171 30562048 31202497 31889506 32887275 33863531 34619051
14326C4619051J604489N78666R30207J260783J038106J315910Q73554J524958
$$ 34619051 36223540 36802206 37732413 38993196 40031302 41347212 42220766 43745724
14318D3745724J124554J353315J644657J516905J742874R97168K178197J537485
$$ 43745724 44870278 46223593 47868250 49385155 51128029 52125197 54303394 55840879
14310E5840879K131331J768882K212212K003474K404269J864379K881695K816122
$$ 55840879 57972210 59741092 61953304 63956778 66361047 68225426 71107121 73923243
14302G3923243K686493L195769K812006L378505L470966L725660L484191M067066
$$ 73923243 76609736 79805505 82617511 85996016 89466982 93192642 96676833 100743899
14294A00743899M402609M394171M796562M673308N610490N448907O025488O563630
$$ 100743899 105146508 109540679 114337241 119010549 124621039 130069946 136095434 142659064
14286A42659064O581441P167497P219576Q290564Q093634R394487R211275J0426033
$$ 142659064 149240505 156408002 163627578 171918142 180011776 189406263 198617538 209043571
14278B09043571J0579595J1212178J1763990J2269332J3340430J3688708J4137318
$$ 209043571 219623166 230835344 242599334 254868666 268209096 281897804 296035122
14271B96035122J4131812J4445680J4867439J4829171J4874187J4128835J4151734
$$ 296035122 310166934 324612614 339480053 354309224 369183411 383312246 397463980
14264C97463980J2967578J1032720J0072835Q881669Q606155P182695N392112
$$ 397463980 410431558 421464278 431537113 440418782 449024937 456207632 461599744
14257D61599744L014704J717445N80071k631742p477587r094780r986354r684761
$$ 461599744 464614448 466331893 466911964 464280222 456802635 447707855 437721501 428036740
14249D28036740j0443317j1777123j1842372j4131848j4495016j4483268j4603391
$$ 428036740 417593423 405816300 393973928 379842080 365347064 350863796 336260405
14242C36260405j3827748j3557384j4014811j3653111j3861490j3124404j2600943
$$ 336260405 322432657 308875273 294860462 281207351 267345861 254221457 241620514
14235B41620514j2042852j1892256j0979426j1050951j0273143r480521q876774
$$ 241620514 229577662 217685406 206705980 195655029 185381886 175901365 167024591
14228A67024591q462893q058710p289280o689706o626354n523743n506990n329234
$$ 167024591 158561698 150502988 143213708 136524002 129897648 124373905 118866915 113537681
14220A13537681n023110m869084m362408m129317l868165l566695l806651l079142
$$ 113537681 108514571 103645487 99283079 95153762 91285597 87718902 83912251 80833109
14212H0833109k969411l188844k649861l038739k454214k106716k451351j970290
$$ 80833109 77863698 74674854 72024993 68986254 66532040 64425324 61973973 60003683
14204F0003683k041784k119446j686863j540511k035360j291119j255765j340438
$$ 60003683 57961899 55842453 54155590 52615079 50579719 49288600 48032835 46692397
14196D6692397k150933r53891j157332j096095j106078q64539j385127j247815
$$ 46692397 44541464 43587573 42430241 41334146 40228068 39363529 37978402 36730587
14188C6730587p27437j139897q21666n47185j067217j006115r34061n56063q24278
$$ 36730587 36003150 34863253 34041587 33494402 32427185 31421070 30487009 29930946 29106668
14179B9106668q25331l98324q64834o44157q13382n52524p06102l12740q79459
$$ 29106668 28281337 27883013 27018179 26374022 25560640 25008116 24302014 23989274 23109815
14170B3109815k37797n09757m35862n28588n04469n67350k79750m30433n19645
$$ 23109815 22872018 22362261 21926399 21397811 20893342 20325992 20046242 19615809 19096164
14161A9096164n58106M9186o85643l53768j58355l68860n71697k92954K258k01265
$$ 19096164 18538058 18587244 17901601 17547833 17389478 17020618 16448921 16155967 16158225 15956960
14151A5956960n96500k91192l63025k64180o35l67896r7476n893m95497l36427
$$ 15956960 15360460 15069268 14706243 14442063 14441428 14073532 13976056 13970163 13474666 13138239
14141A3138239k86944q9543j62848k94964k6384k18086q7999q80307K91681k78392
$$ 13138239 12851295 12761752 12598904 12303940 12277556 12059470 11971471 11091164 11382845 11104453
14131A1104453P1246l80423k09032J65129r24141J23459k86046P3079K73019o12562
$$ 11104453 11175699 10795276 10586244 10751373 9827232 9950691 9664645 9737724 10010743 9398181
14121I398181Q1383l35324p342j95718j88635l9324j46651l7536j21919k729n02870
$$ 9398181 9479564 9144240 9136898 8941180 8752545 8713221 8566570 8529034 8407115 8404386 7901516
14110G901516l5575K35922m14787P1j47167J26921k46542k71645J0586J19514
$$ 7901516 7865941 8101863 7687076 7687147 7539980 7666901 7420359 7148714 7159300 7278814
14100G278814j98471q5007P4075l97828R1163k83884L72780o43575K29030k36899
$$ 7278814 7080343 6995336 7069411 6671583 6762746 6478862 6851642 6208067 6437097 6200198
14090F200198R3001j72439n8821j11688P5846l05617J16605q9525j27028M0149
$$ 6200198 6293199 6120760 6061939 5950251 6026097 5720480 5837085 5747560 5620532 5660681
14080E660681j81742m8302Q8908k88580J89642p5181k24374k2338L0050k85581
$$ 5660681 5478939 5430637 5519545 5230965 5420607 5345426 5121052 5098714 5128764 4843183
14070D843183l21813K64794l33865K65604Q571P7929K035l3878k24110n8939Q196
$$ 4843183 4521370 4786164 4452299 4717903 4726474 4804403 4806438 4772560 4548450 4489511 4497707
14059D497707N4539k82529J40871n09324N82040k88433k03968L24057m48265J08114
$$ 4497707 4552246 4269717 4410588 3901264 4483304 4194871 3990903 4314960 3866695 3974809
14049C974809M1646p6869J40186k19098N897r5570N00226l92821Q2370k62984
$$ 3974809 4016455 3939586 4079772 3860674 3866571 3771001 4271227 3878406 3960776 3697792
14039C697792k98524K87015j26668L11702q9763l32277m4553P3148j08978J38985
$$ 3697792 3399268 3686283 3559615 3871317 3781554 3449277 3404724 3477872 3368894 3507879
14029C507879n58228K14189j32811K03392R274j73583M29686k14519l38276J62625
$$ 3507879 2949651 3163840 3031029 3234421 3243695 3070112 3499798 3285279 2947003 3109628
14019C109628m0202q5504j52724l474J76134m03969M07053o86841K60234M8883
$$ 3109628 3069426 2983922 2831198 2827724 3003858 2599889 3006942 2320101 2580335 2629218
14009B629218n4956l5252l7204j59743K62607k27128N5848l8621K86697k47385
$$ 2629218 2574262 2539010 2501806 2342063 2604670 2377542 2433390 2394769 2681466 2434081
13999B434081J48760j51564K7700n7342k9002J04138Q9044K0726n80043M63235
$$ 2434081 2582841 2431277 2458977 2401635 2372633 2476771 2565815 2586541 2006498 2469733
13989B469733p4336l10072J27131R6120R9800o6746K00764l54386K96116P1287
$$ 2469733 2395397 2085325 2212456 2308576 2408376 2341630 2542394 2188008 2484124 2555411
13979B555411M40008j06713K36409P08041J017600J069335K926724N027544R287763
$$ 2555411 2995419 2888706 3125115 3833156 4850756 5920091 8846815 13874359 23162122
13970B3162122P510041q734750p370151m068927k611660j589941p82692o94336
$$ 23162122 30672163 21937413 14567262 10498335 7886675 6296734 5514042 4819706
13962D819706q41775n18427k49485n78o5090o41p23946O03913l57959k52672j81008
$$ 4819706 3977931 3459504 3210019 3209441 3144351 3143710 2419764 3023677 2665718 2413046 2232038
13951B232038J16598o9207O5857k76079J58262j05150K54499l49515K0501k43541
$$ 2232038 2348636 2279429 2345286 2069207 2227469 2122319 2376818 2027303 2047804 1804263
13941A804263N31049n02041K70460k11620j97502k31470K98407j41708J32645
$$ 1804263 2335312 1833271 2103731 1892111 1694609 1463139 1761546 1619838 1752483
13932A752483k06567J95897M02981l38385N571k26248M58810l55971J90467r4241
$$ 1752483 1545916 1741813 2144794 1806409 1811980 1585732 2044542 1688571 1879038 1784797
13922A784797n1885k68673L19619j49467o8224L11471n02059M90805l44920J46577
$$ 1784797 1732912 1464239 1783858 1634391 1566167 1877638 1375579 1866384 1521464 1668041
13912A668041k00199l8150o6927K36000j27869j6524O2978p3444K06356j92443
$$ 1668041 1467842 1429692 1362765 1598765 1470896 1454372 1517350 1443906 1650262 1457819
13902A457819J02198k6515j14345j36676J63846K82995n69960j7106K42451J51015
$$ 1457819 1560017 1533502 1419157 1282481 1446327 1729322 1159362 1142256 1384707 1535722
13892A535722l56937K46357j08478j07247j25346N90133p0168j59321j95993j22349
$$ 1535722 1178785 1425142 1316664 1209417 1084071 1674204 1604036 1444715 1248722 1126373
13882A126373r2487L29679k76517J45591J19888o3306j29185J78813j63664p6449
$$ 1126373 1033886 1363565 1087048 1232639 1352527 1289221 1160036 1338849 1175185 1098736
13872A098736J6061k75806J54608J28635p793K29123R2459l27210J08485q4176
$$ 1098736 1114797 838991 993599 1122234 1114441 1343564 1436023 1108813 1217298 1133122
13862A133122O9174k62872R5885R4682K90525o53408L23018j03856M0489k06420
$$ 1133122 1202296 939424 1035309 1129991 1420516 767108 1090126 986270 1026759 820339
13852H20339n6454M53365r374R7864J73007l18758q2975k20429K35528O0803o7048
$$ 820339 763885 1217250 1207876 1305740 1478747 1159989 1077014 856585 1092113 1152916 1085868
13841A085868k56134K07528M239k0410m1912O5888K32240n83429J97295N0891
$$ 1085868 829734 1037262 1041501 1021091 979179 1045067 1277307 693878 891173 942064
13831I42064o0998J86422k54039L49020k67206J63596n7563o7322N3724k9045
$$ 942064 881066 1067488 813449 1162469 895263 1058859 1001296 933974 987698 958653
13821I58653p8120O1144r7384R0096N0971O8747k40970N8711J856k05639L78333
$$ 958653 880533 941677 844293 934389 985360 1054107 813137 871848 873704 668065 1046398
13810A046398j33745J6228K022j47885L6683J61844l42407L11517j84348k73505
$$ 1046398 912653 928881 930903 783018 819701 981545 639138 950655 766307 492802
13800D92802J54638J18729J89918D33967O38604D80551L16637k66801M9040J85003
$$ 492802 647440 766169 956087 433967 1072571 480551 797188 530387 579427 764430
13790G64430O8086j2119L5232q0770J60337l14961K74642k2679l08822m6976j32990
$$ 764430 832516 820397 855629 774859 935196 620235 894877 872198 563376 516400 383410
13779C83410L09239J08975k9980r5738R5085l77876K27200N7878j07324J44117
$$ 383410 692649 801624 771644 675906 770991 393115 620315 678193 570869 714986
13769G14986J98871l73888M39280r3636k56954K14976N2456k10651l8298j43102
$$ 714986 913857 539969 979249 885613 628659 843635 896091 685440 647142 504040
13759E04040J50953l2222k71820K32495K06567J23683k99318N756J20014q5020
$$ 504040 654993 622771 350951 583446 790013 913696 614378 620134 740148 655128
13749F55128J62196J73814r6432C43994L75554B70099L54297k45236L22047K73818
$$ 655128 817324 991138 894706 343994 719548 270099 624396 379160 701207 975025
13739I75025q1205C44084L5294J28517J3465J33586J74060k16530m2488J66050
$$ 975025 893820 344084 379378 507895 521360 654946 829006 612476 569988 736038
13729G36038R6582m05747M14442l29204J81424j12243k1246o7104K9016j32909
$$ 736038 832620 426873 841315 512111 693535 581292 560046 492942 521958 389049
13719C89049M87341k31734j20407m5104Q8817j67046J63684j41530K03911k49131
$$ 389049 876390 644656 524249 479145 567962 400916 564600 423070 626981 377850
13709C77850j06268L00394L6236K3906k18577J27317k4357j53249L40530k26603
$$ 377850 271582 571976 608212 632118 413541 540858 516501 363252 703782 477179
13699D77179k2420J39875n450M4700r8928N7970k3203k05562K6321l7019R7331
$$ 477179 454759 594634 589184 633884 534956 592926 569723 364161 390482 353463 450794
13688D50794J17019j38901j3956J44067k13510J47731O3939p0246J54811J76827
$$ 450794 567813 428912 414956 559023 345513 493244 557183 486937 641748 818575
13678H18575C67303q0327O1932j14322K52166O3462L95015m21849J47911K4271
$$ 818575 367303 286976 348908 234586 486752 550214 945229 523380 671291 695562
13668F95562k36948n9332J55373k61151j33346P92647l46737k94336K52734m2388
$$ 695562 458614 399282 554655 293504 160158 952805 606068 311732 564466 522078
13658E22078J14685j87778o5414J60062k13790A61998M31905k34794K98627B16597
$$ 522078 636763 448985 383571 543633 329843 161998 593903 359109 657736 216597
13647D37141p6838K02803k35174K45205B02770N8334L24927m8461j87445M17483
$$ 437141 360303 563106 327932 573137 202770 261104 586031 537570 350125 767608
13637G67608B79147m4025K46070j59475R641M12209R0256B34300a7965A81369
$$ 767608 279147 235122 481192 321717 331358 743567 833823 234300 -17965 181369
13626A64176M38399B65939C4276L32149k9022j5684A47581N45010k0864k86561
$$ 164176 602575 265939 34276 366425 337403 321719 147581 692591 671727 385166
13616C85166J43943A95650J76506k9245O2349L42761k94272j61932L65410A14885
$$ 385166 529109 195650 372156 342911 405260 748021 453749 291817 657227 114885
13605I2965P08438l14032P1800J0509H2556K41934J32389A87096K26991K23309
$$ 92965 801403 487371 559171 569680 82556 324490 456879 187096 414087 637396
13595F37396j27002J27055l04889K7643L12422B07712K95539B30581c6083C74245
$$ 637396 510394 637449 332560 360203 672625 207712 503251 230581 -36083 374245
13584D84319N608A97292J68390K41176r6192k14613m5404r628A11732K6077L22648
$$ 484319 489927 197292 365682 606858 510666 296053 250649 241021 111732 137809 460457
13573D60457j06475N1368j86077J26510A62898N3420H8334J45759L7635j00351
$$ 460457 353982 405350 219273 345783 162898 216318 88334 234093 271728 171377
13563A71377H4346l07J62514K26682j13626R200j68541K31685j16720M70327B85383
$$ 171377 84346 84039 246553 473235 359609 368809 200268 431953 315233 785560 285383
13551D24128e499C24397c4053P184A03444K82888K09129k28363O501n0037j20889
$$ 424128 -5499 324397 -34053 -26869 103444 386332 595461 367098 373599 323562 202673
13540B02673H1137O6834J79723F0105L89847A92009L45532B8251M92127G8623
$$ 202673 81137 147971 327694 60105 449952 192009 537541 28251 520378 78623
13529E16734n8566p5058L3988b3061D49216L9496A48376K55290j45975L07983
$$ 516734 458168 383110 417098 -23061 449216 488712 148376 403666 257691 565674
13519E65674B29274K82613k53389b1628D24778D9239L11098p1658I6329O87504
$$ 565674 229274 511887 258498 -21628 424778 49239 360337 288679 96329 783833
13509G83833B21961O3270J41784A40464J20215b1324C72288j39764p4536K13813
$$ 783833 221961 285231 427015 140464 260679 -21324 372288 232524 157988 371801
13499C71801P0579j87260B2591R0035k7202J55855A08087D5561N20947B80850
$$ 371801 442380 255120 22591 112626 85424 241279 108087 45561 566508 280850
13488C67445A42232C6749J32402J510K33788A89161d8343G2110J28084o226G6437
$$ 367445 142232 36749 169151 170661 404449 189161 -48343 72110 200194 193968 76437
13476C07435K0081q5798L9794H6920a33877A44424c9000C78708A23140A1809L44254
$$ 307435 327516 241718 281512 86920 -133877 144424 -39000 378708 123140 11809 356063
13465C56063K84219A52192J96854j53191b2191C17370D8495J15415K14953J26170
$$ 356063 640282 152192 349046 195855 -22191 317370 48495 163910 378863 505033
13455E05033j71159o7181N137J49279j16741J10178c110B21512M52267B68504
$$ 505033 333874 266693 271830 421109 304368 414546 -3110 221512 673779 268504
13444C17663j32257J27404A53537F7378b2307C31677M4380F2394J40198J05812
$$ 317663 185406 312810 153537 67378 -22307 331677 376057 62394 202592 308404
13434C08404l7402j26366G1653J06036G8023e2807G7027K28632m9186J10776j3220
$$ 308404 271002 144636 71653 177689 78023 -52807 77027 305659 256473 367249 354029
13423C54029b05054e110B96851J70081J51446B10587J02167j14787K04818A39886
$$ 354029 -205054 -5110 296851 466932 618378 210587 312754 197967 402785 139886
13412a42406A85999Q9644r3018h0997B48419J95149A31454J20308J84367P3833
$$ -142406 185999 275643 182625 -80997 248419 443568 131454 251762 436129 509962
13402E09962k23424b13904D22178G6232d1763K939A98245p2659J92625J49408
$$ 509962 286538 -213904 422178 76232 -41763 -38824 198245 125586 318211 467619
13392D67619j28990J23349A78103O7090a36075B79227b12167C09210k6983j33117
$$ 467619 338629 461978 178103 245193 -136075 279227 -212167 309210 282227 149110
13382A49110J49155N9566j02751A11576L42064j68668P8672J75944a4258j84043
$$ 149110 298265 357831 255080 111576 453640 284972 363644 539588 -14258 -198301
13372a98301a8308H4298K74262A53455K56785a00692D52178j59300I8893J71273
$$ -198301 -18308 84298 358560 153455 410240 -100692 452178 292878 98893 270166
13362B70166C8119A8309K12826J1063g3484C95570A29119F1141M30319O0422A16060
$$ 270166 38119 18309 231135 242198 -73484 395570 129119 61141 491460 551882 116060
13350C23605j0328A07577J41835o4733D8981k3261J40286n6030K26172J77969
$$ 323605 313277 107577 249412 184679 48981 25720 166006 109976 336148 514117
13340E14117m2038m0932j81441H6708e9968C57126j77821j5234N7826J54203m9249
$$ 514117 472079 431147 249706 86708 -59968 357126 179305 164071 221897 376100 326851
13329C26851L3922A38239M57998j76164A23161c3765A47096K2287K46303l0924
$$ 326851 360773 138239 596237 420073 123161 -33765 147096 169383 415686 384762
13319C84762A05423j1393J54012J23855d3867B62358m3224K58256j65554l1269
$$ 384762 105423 94030 248042 371897 -43867 262358 219134 477390 311836 280567
13309B80567J04159a77952D07434B7736K192A3110M46039j75913I9616r669O1301
$$ 280567 384726 -177952 407434 27736 29928 13110 459149 283236 99616 89947 151248
13298A51248m6302k4989R8440o9329m7402O0960J7113L2488h4002C39799h0563
$$ 151248 104946 79957 178397 109068 61666 122626 139739 172227 -84002 339799 -80563
13286A53224K524f8917B02797C2922h7532A6469g5981C96532j95559j6931H7148
$$ 153224 155748 -68917 202797 32922 -87532 16469 -75981 396532 200973 184042 87148
13274C4795J1354K38229E5140L6259c55650B57544J5666a04180A69100a25008
$$ 34795 46149 284378 55140 91399 -355650 257544 273210 -104180 169100 -125008
13263a26357A18020R9835L6677A9397K7955J63124k8528H0163B6371J87899e2484
$$ -126357 118020 217855 254532 19397 47352 210476 181948 80163 26371 214270 -52484
13251I067L78322j48798C3638J04370l3439l1598e0950A47651O8285q1651K14261
$$ 9067 387389 238591 33638 138008 104569 72971 -50950 147651 215936 134285 348546
13240C48546A14201Q8617j00557g1719A5392a40456I356a47204E65493F9749J09710
$$ 348546 114201 202818 102261 -71719 15392 -140456 9356 -147204 565493 69749 179459
13229A79459j7095p7958K02360j33487L304P4543J6847J07956j56595p892N2219
$$ 179459 162364 84406 286766 153279 156583 231126 247973 355929 199334 191442 243661
13218B43661A9471c8486A39772L1393E1851p407b9192A33506N8403B5629R6472
$$ 243661 19471 -38486 139772 171165 51851 44444 -29192 133506 191909 25629 122101
13207A22101K3547f2805B0065a86759A18511d8313A80533l3889J4678M0430C4654
$$ 122101 145648 -62805 20065 -186759 118511 -48313 180533 146644 161322 201752 34654
13195A31899n076J49320A17811j3067L20411I8629c682F3904K10724R8701c4423
$$ 131899 126823 276143 117811 104744 425155 98629 -3682 63904 274628 373329 -34423
13183I7926d4048A19610n8191a01188A69187j2771m9287J04614J20917B9176K35814
$$ 97926 -44048 119610 61419 -101188 169187 156416 107129 211743 332660 29176 264990
13172B64990J9346f5231B49400A01377d5049D26515G0759a09375A27422K36281
$$ 264990 284336 -65231 249400 101377 -45049 426515 70759 -109375 127422 363703
13162C63703A6959Q408J09993b56866B3090R2073d3247D9349J34383C0547f7778
$$ 363703 16959 25367 135360 -256866 23090 115163 -43247 49349 183732 30547 -67778
13150d1103G6506J27284k1626n8311b41631D9106b21213B37044I1486f9983B04191
$$ -41103 76506 203790 182164 123853 -241631 49106 -221213 237044 91486 -69983 204191
13138B88839d0722k67632C90215j58970a21380q6123a02926A13368J89950a36221
$$ 288839 -40722 -308354 390215 231245 -121380 -207503 -102926 113368 303318 -136221
13127A92621J82810H5642b16385Q4363f1545k86834a09571c7656D3819c32607
$$ 192621 375431 85642 -216385 -132022 -61545 -348379 -109571 -37656 43819 -332607
13116E8280f2963A45542o2920B0798e4803I5758h6110A17287O1516a74525B77846
$$ 58280 -62963 145542 82622 20798 -54803 95758 -86110 117287 178803 -174525 277846
13104a00498G9160L0552b0566h576A09078J2956J34652D9206f906q5500J972C542
$$ -100498 79160 109712 -20566 -8576 109078 122034 256686 49206 -6906 -92406 -90434 3542
13091i7696n163A5924L88959G0092K37286I6763B1913P6684C3839A2049d6806
$$ -97696 -102859 15924 404883 70092 307378 96763 21913 98597 33839 12049 -46806
13079E712L66116q7740o9720f4803J658a9242A27909c10531C27207E191c87552
$$ 5712 371828 284088 214368 -64803 -63145 -19242 127909 -310531 327207 5191 -387552
13067A31448A2456L23286c6166m6191B39717i7406D40757h78A45825l8884J14313
$$ 131448 12456 335742 -36166 -82357 239717 -97406 440757 -878 145825 106941 221254
13056B21254L0317A20520L8845o7608d1614B83200j12015K4054a14962j7973a0064
$$ 221254 251571 120520 159365 91757 -41614 283200 171185 195239 -114962 -132935 -10064
13044g3004A47987e9353A00042M7210D515b20168B12442p4252k5751b15596E3493
$$ -73004 147987 -59353 100042 147252 4515 -220168 212442 138190 112439 -215596 53493
13032A61927K4988L3463a12435H0361g4591C77091c7923A1117f2930A25443f5006
$$ 161927 186915 220378 -112435 80361 -74591 377091 -37923 11117 -62930 125443 -65006
13020A35181a68229A81990J6010K0605j00833k4515q102L1101C148L29148A4151
$$ 135181 -168229 181990 198000 218605 117772 93257 85155 116256 3148 332296 14151
13008C46744b3206A5294K56372c15212D6079O17247a27309d6697A22611Q8104
$$ 346744 -23206 15294 271666 -315212 46079 663326 -127309 -46697 122611 210715
12998B10715p4938a84496B7917L5371h7626A51725L0J89897E3372a4671C14193
$$ 210715 135777 -184496 27917 63288 -87626 151725 151755 341652 53372 -14671 314193
12986B26254p9431P932l004Q4263G9799l3931K19290c07663D23145H009J48335
$$ 226254 146823 154755 151751 236014 79799 45868 265158 -307663 423145 8009 156344
12975A56344n6606B5561j729J83096i6749A78039A9655O2415N0091H114d3943
$$ 156344 99738 25561 23832 206928 -96749 178039 19655 82070 132161 8114 -43943
12963c0171A42752e5032H6416B3458c04003A56361a40898c1741r1486B20413B9724
$$ -30171 142752 -55032 86416 23458 -304003 156361 -140898 -31741 -123227 220413 29724
12951b19400A54196a015m2643B18706a56436C5397b61463A14372l6163J4721g037
$$ -219400 154196 -1015 -43658 218706 -156436 35397 -261463 114372 78209 92930 -7037
12939H695i0951A41180K770a16320B39676a1801A149e5614G9700Q4889R0590j16175
$$ 8695 -90951 141180 143950 -116320 239676 -11801 1149 -55614 79700 164589 255179 139004
12927A39004B7048K3345J8732J12529a00201j02213E39082A27876J06358m31J36414
$$ 139004 27048 50393 69125 181654 -100201 -202414 539082 127876 234234 233803 370217
12916C70217I1989J18444c33265e7141p1483q6202a3190B80585A29113A8777N1485
$$ 370217 91989 210433 -333265 -57141 -128624 -214826 -13190 280585 129113 18777 70262
12905G0262a57746p180p934J1488C20930f116o6983B91710e3192A6831J49329
$$ 70262 -157746 -164926 -172860 -161372 320930 -6116 -73099 291710 -53192 16831 166160
12894A66160c2558A52496E7127a06730D3143K42452b8059A3046J60732a79835
$$ 166160 -32558 152496 57127 -106730 43143 285595 -28059 13046 173778 -179835
12883b37041a6335A04708J71260H8765b13203B45650a04101C49430A63588L44080
$$ -237041 -16335 104708 275968 88765 -213203 245650 -104101 349430 163588 507668
12873E07668A68371J10799a58294P1046A12147C3275a40656j52348a5901D4571
$$ 507668 168371 279170 -158294 -87248 112147 33275 -140656 -293004 -15901 44571
12862b12869A0341b00008i6773k34379I0429b1517A18605b2783Q444q0271k1595
$$ -212869 10341 -200008 -96773 -331152 90429 -21517 118605 -22783 -14339 -94610 -116205
12851a16205B95977F4201a23309A36497b40641G0944K16554a23930B9737h5577
$$ -116205 295977 64201 -123309 136497 -240641 70944 287498 -123930 29737 -85577
12840d23178a80375Q4020K321A99336m3274K7141o7224j7400a59164n8070A92577
$$ -423178 -180375 -96355 -94034 199336 156062 183203 115979 98579 -159164 -217234 192577
12828d13866a09036a6745j26992q3632A74404c0758p5449C5986h457B58301r5968
$$ -413866 -109036 -16745 -143737 -227369 174404 -30758 -106207 35986 -8457 258301 162333
12817A62333Q6803b93446o713e043B9249K8294a39376C5196J60076M4960a22999
$$ 162333 249136 -293446 -300159 -5043 29249 57543 -139376 35196 195272 240232 -122999
12805a6368j57814J6586b423j47527I8881H029e9020A02865a63559E2541h6038
$$ -16368 -174182 -157596 -2423 -149950 98881 8029 -59020 102865 -163559 52541 -86038
12793b1682A49642j0455e6368F0199a70721n8019B72683h5751m2567O1525E47016
$$ -21682 149642 139187 -56368 60199 -170721 -228740 272683 -85751 -128318 -66793 547016
12781F5778c52180A20394l246J5582c63052a48683N8602A01898J6451i8538B4964
$$ 65778 -352180 120394 117148 132730 -363052 -148683 -90081 101898 118349 -98538 24964
12769b1295B91393g4719G4522a76331B01259P49J04419A3553J06310a00904I1903
$$ -21295 291393 -74719 74522 -176331 201259 202008 306427 13553 119863 -100904 91903
12757A63619c88115b0875p5781A65562b0941j262B3001O7625K718J10439J83616
$$ 163619 -388115 -20875 -96656 165562 -20941 -22203 23001 90626 93344 203783 387399
12746C87399g6857a7056C32174j25625q9403J4703B5583K8709L83819b35815l9766
$$ 387399 -76857 -17056 332174 206549 117146 131849 25583 54292 438111 -235815 -275581
12735b75581J34622m5409G570h9030A43118b042D2101d884n6925A16039a17150
$$ -275581 -140959 -186368 7570 -89030 143118 -2042 42101 -4884 -61809 116039 -117150
12723I2150a67940C81856a6954A99517K03244C0596J61601a60710B54261H8490
$$ 92150 -167940 381856 -16954 199517 402761 30596 192197 -160710 254261 88490
12712b22448L6522B05583g8184k4778B48082a60416A56477d6283A7816E841c14390
$$ -222448 -185926 205583 -78184 -102962 248082 -160416 156477 -46283 17816 5841 -314390
12700A66964K1201F4112e9862A13285J8866a8729A85870O3844R3363n4289H6384
$$ 166964 188165 64112 -59862 113285 132151 -18729 185870 249714 343077 288788 86384
12688I6797B165a26060B30318q7218c29764e9937G7864J72365A521M0689a02719
$$ 96797 2165 -126060 230318 143100 -329764 -59937 77864 250229 1521 42210 -102719
12676A12673d22422A22789c5869j96913A39150a0946p0937B46575d0542B30626
$$ 112673 -422422 122789 -35869 -232782 139150 -10946 -81883 246575 -40542 230626
12665C06930j22196O099M6377a5978j82724B25285A06500a54117A40322C3981
$$ 306930 184734 190833 237210 -15978 -198702 225285 106500 -154117 140322 33981
12654C0908a20485B02709g3745k60094a40405A29122K96433r6552A09658J23920
$$ 30908 -120485 202709 -73745 -333839 -140405 129122 425555 329003 109658 233578
12644B33578q0322M9919M1460I1970M3880J46361N7636E5668h1978A77993P1209
$$ 233578 153256 203175 244635 91970 135850 282211 339847 55668 -81978 177993 249202
12633B49202a87395M0429A32581M6301b87224a13852k7566D8880a70726I2776
$$ 249202 -187395 -146966 132581 178882 -287224 -113852 -141418 48880 -170726 92776
12622A41664P140C1492a19331B53611b10979I0083K55335L7209j23337j11739
$$ 141664 148804 31492 -119331 253611 -210979 90083 345418 382627 259290 147551
12612A47551J93577C0205J2045K91669a53936D24995j91370K51783A03437J59208
$$ 147551 341128 30205 42250 333919 -153936 424995 233625 485408 103437 262645
12602B62645a50299f4942C72053I6647c3520A2969c98863I1490g8393B49260j07847
$$ 262645 -150299 -64942 372053 96647 -33520 12969 -398863 91490 -78393 249260 141413
12591A41413B7233a42191B12913a47117a3220A9377O3987a35294A72088b59384
$$ 141413 27233 -142191 212913 -147117 -13220 19377 83364 -135294 172088 -259384
12580A31877B0381O2378K42229F9373A0163K50200b70214a09051m8168c6922o3149
$$ 131877 20381 82759 324988 69373 10163 260363 -270214 -109051 -157219 -36922 -100071
12569a00071D0211j5697J94821c04677I6638a67200C22830a74097A74851f3466
$$ -100071 40211 24514 219335 -304677 96638 -167200 322830 -174097 174851 -63466
12558b69849H6609A783b43993B2870K90034j52572p6764P8390a09542r6746B02768
$$ -269849 86609 1783 -243993 22870 312904 160332 83568 161958 -109542 -206288 202768
12546f8906B07365m912i3528c6923i890D93436A7810a25233A48903D0546R0446
$$ -68906 207365 202453 -93528 -36923 -9890 493436 17810 -125233 148903 40546 130992
12535A30992J1990J0690h5407j21302B98935m5106J51543F162c083C538J57944
$$ 130992 142982 153672 -85407 -206709 298935 253829 405372 6162 -3083 3538 161482
12524A61482l4102i9584G2097f6969k24039A34985b32946C97267i2395A31984
$$ 161482 127380 -99584 72097 -66969 -291008 134985 -232946 397267 -92395 131984
12513a0986B42907f494B33813P183k0189j03318b49418C2740a40801a2135F4670
$$ -10986 242907 -6494 233813 240996 220807 117489 -249418 32740 -140801 -12135 64670
12501H46b27782P341A60627a8782k05309B4808a86075A03218C7657c07475o3379
$$ 846 -227782 -220441 160627 -18782 -224091 24808 -186075 103218 37657 -307475 -370854
12490c70854A42802F2762b70229c344I2937g7020b6592A40600h0484L4400A14908
$$ -370854 142802 62762 -270229 -3344 92937 -77020 -26592 140600 -80484 -46084 114908
12478A77395b28444b6341j72885j8961q9760J45752A01277e0061j23346q752i152
$$ 177395 -228444 -26341 -199226 -218187 -307947 -162195 101277 -50061 -173407 -182159 -9152
12466I2815M28587A19022J68586A21320j8271d1562B39141G3284K18313c415I664
$$ 92815 521402 119022 287608 121320 103049 -41562 239141 73284 291597 -3415 9664
12454a63008D9466d478A14822K35261F6383g2353j52631H8384b7527C12808m4793
$$ -163008 49466 -4478 114822 350083 66383 -72353 -224984 88384 -27527 312808 268015
12443B68015r0153d3463B12138b98325h217k70156J26647f5081G8998K12832d6150
$$ 268015 177862 -43463 212138 -298325 -8217 -278373 -151726 -65081 78998 291830 -46150
12431E2349b46003E0523a3167j8000D2811b94859J11201a7879p4753A3426J43992
$$ 52349 -246003 50523 -13167 -31167 42811 -294859 -183658 -17879 -92632 13426 157418
12420A57418J79725j51483a10687b5094j03208B10820K4093N1451a58861P566
$$ 157418 337143 185660 -110687 -25094 -128302 210820 234913 286364 -158861 -151295
12410a51295E4223J18084E5786E950d8892B25971p2846g4667o6917k8058g483
$$ -151295 54223 172307 55786 5950 -48892 225971 153125 -74667 -141584 -169642 -7483
12398d568j51025r7085A99014a45796A51776B3850L6566A7113a23675B00002i2259
$$ -4568 -155593 -252678 199014 -145796 151776 23850 60416 17113 -123675 200002 -92259
12386a19945A22454E0741d7061k58318A43287a04687C84493a8017k29882g7325
$$ -119945 122454 50741 -47061 -305379 143287 -104687 384493 -18017 -247899 -77325
12375H0291f2833k46825I5085a8797l28774h527n2518B1592b50738F3829O7555
$$ 80291 -62833 -309658 95085 -18797 -347571 -8527 -61045 21592 -250738 63829 131384
12364A31384b4624l19544A79423J7082h4545m0187f79E4940a85073j9429A99956
$$ 131384 -24624 -344168 179423 196505 -84545 -124732 -679 54940 -185073 -204502 199956
12352a28101H6343D1389Q456l042a12949j52020f2034A48452A5477J09741c42826
$$ -128101 86343 41389 49845 46803 -112949 -264969 -62034 148452 15477 125218 -342826
12340B93180a51858j24134f2175B82216j26364a9009k2802A254J46735f2085j46262
$$ 293180 -151858 -275992 -62175 282216 155852 -19009 -41811 1254 147989 -62085 -208347
12329b08347A74686g4222l5057p010i324C9082R0394C5224c51984a32184D8957
$$ -208347 174686 -74222 -109279 -116289 -9324 39082 129476 35224 -351984 -132184 48957
12317e0252J6062j35586c0482A04288J59419J685b30716A93063e0618B29816k0427
$$ -50252 -34190 -169776 -30482 104288 263707 265392 -230716 193063 -50618 229816 209389
12306B09389b0521l58884A88345a7624j34929j4641D3142d9070A759N0937M23681
$$ 209389 -20521 -379405 188345 -17624 -152553 -167194 43142 -49070 1759 52696 476377
12295D76377G6707a61271n5941O8887g3592j90838c6529n6685B1832L3209J94468
$$ 476377 76707 -161271 -217212 -148325 -73592 -264430 -36529 -93214 21832 55041 249509
12284B49509a24115m9346e5399A3543b2707l5755A63744k9123j4432P5514b13540
$$ 249509 -124115 -173461 -55399 13543 -22707 -58462 163744 134621 120189 195703 -213540
12272D7519D95J86795G3424f9430A48955k8753a81177A21296c4530I1794a31340
$$ 47519 495 187290 73424 -69430 148955 120202 -181177 121296 -34530 91794 -131340
12260c2681G5524R7872Q5471g9864A98219b3000C2785a54611N982A15667a43324
$$ -32681 75524 173396 258867 -79864 198219 -23000 32785 -154611 -148629 115667 -143324
12248A27692N0017q2028h7312B48454k9601q7059d985A83385d3401C04609q8768
$$ 127692 177709 95681 -87312 248454 218853 131794 -4985 183385 -43401 304609 215841
12237B15841P4153j06885E9059K09268a33634B21998K6071j17913a13477B95277
$$ 215841 289994 183109 59059 268327 -133634 221998 248069 130156 -113477 295277
12226A71021G2975J72326e4243A23324a19786k6247B1063R361h8514B47843F910
$$ 171021 72975 245301 -54243 123324 -119786 -146033 21063 30424 -88514 247843 6910
12214B60153a46781F48537A07431K2076f1061D32522a63927B28887J08692K41902
$$ 260153 -146781 648537 107431 129507 -61061 432522 -163927 228887 337579 579481
12204E79481B39007A15174c7977j28090C64158a27756A25791a34256A06421m8668
$$ 579481 239007 115174 -37977 -166067 364158 -127756 125791 -134256 106421 57753
12194E7753L8692a68054e2690C44981a03340M5895C05748I2861L45394C7696J10666
$$ 57753 96445 -168054 -52690 344981 -103340 -57445 305748 92861 438255 37696 148362
12183A48362d4960J0816B17476c571A37483L09623j66098j33403K9649E6929L33102
$$ 148362 -44960 -34144 217476 -3571 137483 447106 281008 147605 177254 56929 390031
12172C90031H882K45073C8056K64195K2585n3621K4312F5623J08238h4336A35572
$$ 390031 8882 253955 38056 302251 324836 271215 295527 65623 173861 -84336 135572
12160C68686A48018a08876I5710c8342D6148M37031A17348L24437A48847M2899
$$ 368686 148018 -108876 95710 -38342 46148 483179 117348 441785 148847 191746
12150A91746H0916q940b18448b5104f54m55678A96189g0143p5023C68288a79192
$$ 191746 80916 71976 -218448 -25104 -654 -456332 196189 -70143 -145166 368288 -179192
12138a75867B26414a53077A98663o6342L7293a30868B61228b8237j01037C50694
$$ -175867 226414 -153077 198663 132321 169614 -130868 261228 -28237 -129274 350694
12127b09776A01761B9559g2639F8571c61248A98035l6248R3640a98266k7990B45164
$$ -209776 101761 29559 -72639 68571 -361248 198035 161787 255427 -198266 -226256 245164
12115a02274E1615b20973I506a78979j8950D33225I8094j1560J64537j9341H9921
$$ -102274 51615 -220973 9506 -178979 -197929 433225 98094 86534 251071 231730 89921
12103A40274C3586j0239K4591a56083a8745o6362M1754j91831B11358H0832f1882
$$ 140274 33586 23347 47938 -156083 -18745 -85107 -43353 -235184 211358 80832 -61882
12091b3700A14057a79525a2405C24996E7727J75270f8514A03084K53013A02717
$$ -23700 114057 -179525 -12405 324996 57727 232997 -68514 103084 356097 102717
12080b43156J19071B40952b20612n2855Q5577Q6870k6439j78196B04312b84484
$$ -243156 -124085 240952 -220612 -273467 -187890 -101020 -127459 -305655 204312 -284484
12069a28080q4086j5266O3268B58846b61711h8713o8047A79239J80755j45457
$$ -128080 -212166 -227432 -164164 258846 -261711 -88713 -156760 179239 359994 214537
12059B14537N04920N72936n43478D6907J86868N0998D1632e9662C7697i4872j21719
$$ 214537 719457 1292393 748915 46907 233775 284773 41632 -59662 37697 -94872 -216591
12048b16591d3440j29088r154G1993J0213b6346A59102B0210R443J80232G7175
$$ -216591 -43440 -172528 -181682 71993 82206 -26346 159102 20210 29653 209885 77175
12036a30195A65557C1633d1977j13789D619L7627a44281o6872D64702b18622a08280
$$ -130195 165557 31633 -41977 -155766 4619 42246 -144281 -211153 464702 -218622 -108280
12024a44358G260J48390g767A8221c1427A25669D4962i8868o620H7008a0943C67468
$$ -144358 7260 155650 -7767 18221 -31427 125669 44962 -98868 -105488 87008 -10943 367468
12011b07763N0442c4400A14914a89498A92720o8159b83605f423A0843Q0876a35119
$$ -207763 -157321 -34400 114914 -189498 192720 124561 -283605 -6423 10843 91719 -135119
11999E19553h8031L3276K5685k08586C55162j74439b20139P8783B04442i5320
$$ 519553 -88031 -54755 -29070 -237656 355162 180723 -220139 -141356 204442 -95320
11988A04300R6619O4932h9217l0108q733b3450D41188A9996K5867R3451a4535
$$ 104300 200919 265851 -89217 -119325 -128058 -23450 441188 19996 45863 139314 -14535
11976A30952f3717F6197i5846A99491a69082N8420B41736j09635c7629j14035
$$ 130952 -63717 66197 -95846 199491 -169082 -110662 241736 132101 -37629 -151664
11966a51664A40894Q2826H0297h7140M2581j11704f3476k19432g1911m3592a0557
$$ -151664 140894 223720 80297 -87140 -44559 -156263 -63476 -282908 -71911 -115503 -10557
11954a14845C81429b5778k31707a26468K3059A78505G6366h8196l570E1967K0980
$$ -114845 381429 -25778 -257485 -126468 -103409 178505 76366 -88196 -91766 51967 72947
11943G2947M363f879B33240b35126j7954n3871A46565b74073G5685a14477R53
$$ 72947 77310 -6879 233240 -235126 -253080 -306951 146565 -274073 75685 -114477 -113524
11932a13524n2059M7152E0196J03623p4183c2009D3656O3752a29746k0096j23464
$$ -113524 -165583 -118431 50196 153819 79636 -32009 43656 107408 -129746 -149842 -273306
11921b73306A71100F9731a57436C6633A75c39277g5270C24691h6812j30655b3483
$$ -273306 171100 69731 -157436 36633 175 -339277 -75270 324691 -86812 -217467 -23483
11909a77406h4605k3660j07391H428a23186o0988P6324a5224k14284k40502J26542
$$ -177406 -84605 -108265 -215656 8428 -123186 -184174 -107850 -15224 -229508 -470010 -343468
11898c43468D19941B08524I637M3647f7022i219B56306a58236l9212h7667q11
$$ -343468 419941 208524 9637 53284 -67022 -9219 256306 -158236 -197448 -87667 -88478
11887h8478L4414E4411K58525j52193N0661a07763p8345I7719j7836a60945g3271
$$ -88478 -54064 54411 312936 160743 211404 -107763 -186108 97719 79883 -160945 -73271
11875A56962a38036A29217R4130B5468j1608a74552a7329E0745f8325K1155f184
$$ 156962 -138036 129217 223347 25468 13860 -174552 -17329 50745 -68325 -47170 -6184
11863A32685B9208a50864n0324m9926a00339A23845a5086j39393B46674e0958
$$ 132685 29208 -150864 -201188 -251114 -100339 123845 -15086 -154479 246674 -50958
11852B28742e4148o0085a3496A520N9508B8785M16039H0482P1699f6940k19161
$$ 228742 -54148 -114233 -13496 1520 61028 28785 444824 80482 152181 -66940 -286101
11841b86101H1049h5180m7359B40857A15098i4821b7712o2466n6265l3318c1731
$$ -286101 81049 -85180 -132539 240857 115098 -94821 -27712 -90178 -146443 -179761 -31731
11829a81772A90599d6372E4785L39113C6515M2385r263c66578J53014A58614A3688
$$ -181772 190599 -46372 54785 393898 36515 78900 69637 -366578 -213564 158614 13688
11817E3275a62746d5418F8819c6811i51k47252a10439L5202B91298b14282b8514
$$ 53275 -162746 -45418 68819 -36811 -951 -248203 -110439 -75237 291298 -214282 -28514
11805G2293K58829G5529b41890p515C130c12588h633A10486m5190K46311c16907
$$ 72293 331122 75529 -241890 -249405 3130 -312588 -8633 110486 65296 311607 -316907
11793e870p6897k9385j07359a8059k66784a28337A62413a48860k9907n9646D0833
$$ -5870 -82767 -112152 -219511 -18059 -284843 -128337 162413 -148860 -178767 -238413 40833
11781b04290j47342b8471m2821k144G161Q014b82186i2528A4022b99267A01555
$$ -204290 -351632 -28471 -71292 -73436 7161 15175 -282186 -92528 14022 -299267 101555
11769f336k14824F6697b46432N4799A47116K44576i94q075j64788P1614A95584
$$ -6336 -221160 66697 -246432 -191633 147116 391692 -994 -9069 -173857 -102243 195584
11757B02495J05244H913g5076F2148a8382A4016A816J63793B586a10599M4571
$$ 202495 307739 8913 -75076 62148 -18382 14016 1816 165609 2586 -110599 -66028
11746f6028A83109J46794F2067c6013k94272A97817b50973B07919k5783h968k52905
$$ -66028 183109 329903 62067 -36013 -330285 197817 -250973 207919 182136 -8968 -261873
11735b61873Q7899o0767o499F0898C0137L85652I4221e3310H2443c1955B39070
$$ -261873 -173974 -234741 -241240 60898 30137 415789 94221 -53310 82443 -31955 239070
11723f6551A05774i8787m7769a4412o0451K6336D91726H8582g9028C7861a54079
$$ -66551 105774 -98787 -146556 -14412 -74863 -48527 491726 88582 -79028 37861 -154079
11711b81145h3652j16843D1478b51354d8869k80156A19261K44872A49626L28579
$$ -281145 -83652 -200495 41478 -251354 -48869 -329025 119261 364133 149626 478205
11701D78205a66994P6625D0704a47464L6360l6897K5555A66764b25842g003F6520
$$ 478205 -166994 -90369 40704 -147464 -111104 -148001 -122446 166764 -225842 -7003 66520
11689d1195r0083H3552g1311l43747B89653b01045B0702J26559C0834g2134E8784
$$ -41195 -131278 83552 -71311 -415058 289653 -201045 20702 147261 30834 -72134 58784
11677c46G3501C5745P2267k0443O6475k970c0346A10058a1930B15212c1022D49250
$$ -346 73501 35745 108012 87569 154044 151074 -30346 110058 -11930 215212 -31022 449250
11664a49095I5701m4642J87504o4863m4458e6689A21233C2840b22959i017A06000
$$ -149095 95701 51059 238563 173700 129242 -56689 121233 32840 -222959 -9017 106000
11652a99454p5839a02355A7347h2421A01079L10928a09730A68972J30493B9124
$$ -199454 -275293 -102355 17347 -82421 101079 412007 -109730 168972 299465 29124
11641B00653J28957a06774A89393b51065H5675a0547l9959o0080E5966J01996
$$ 200653 329610 -106774 189393 -251065 85675 -10547 -50506 -110586 55966 157962
11631A57962G8022H629J58131a1186C24291A37250a29628H3796a36712o5802c6738
$$ 157962 78022 8629 166760 -11186 324291 137250 -129628 83796 -136712 -202514 -36738
11619A34355J6879a86399K4753H8540M8610D6049j429J63960a8075C19419A9703
$$ 134355 151234 -186399 -161646 88540 137150 46049 44620 208580 -18075 319419 19703
11607b56707J4697a06345p9524c6958B14112m2028a1476E0435a54038c6759D4059
$$ -256707 -242010 -106345 -185869 -36958 214112 172084 -11476 50435 -154038 -36759 44059
11595A79674a3218r9956l1438l8357A71335b94730J00660f5962c0110A22459a49742
$$ 179674 -13218 -113174 -144612 -182969 171335 -294730 -194070 -65962 -30110 122459 -149742
11583H9446n029i772j17314C61121b3949m955A38892c6086I0519J56908n8544
$$ 89446 84417 -9772 -127086 361121 -23949 -28904 138892 -36086 90519 247427 188883
11572A88883a41305A90153C453a95821G5191J2527M7739m1962K2583K827J10027
$$ 188883 -141305 190153 3453 -195821 75191 87718 135457 93495 116078 118905 228932
11561B28932k7628c5034M67k03236B58606g5936o867M0325J1857j49474C22035
$$ 228932 201304 -35034 -34567 -237803 258606 -75936 -82803 -42478 -30621 -180095 322035
11549G2714n348J81985a9083l4999d009j81449C04932E2374e8130p285q8889f8194
$$ 72714 67366 249351 -19083 -54082 -4009 -185458 304932 52374 -58130 -65415 -154304 -68194
11536B28097I5473h1641E5921J23241C6684K22610I779a48629A48736M8609k765
$$ 228097 95473 -81641 55921 179162 36684 259294 9779 -148629 148736 197345 194580
11525A94580b8256k55642A59883H707J50907R565A7132O2320P1354a56318M055
$$ 194580 -28256 -283898 159883 8707 159614 169179 17132 79452 150806 -156318 -152263
11514a52263G167J32657c450C02084a52550b3464k45225e794j9800B65305J60342
$$ -152263 7167 139824 -3450 302084 -152550 -23464 -268689 -5794 -25594 265305 425647
11503D25647o3292H7084a8307A96880C2614g6463C82226q8987p8186m9851e7912
$$ 425647 362355 87084 -18307 196880 32614 -76463 382226 293239 215053 165202 -57912
11491B38397c1812A49849f7420j17851A9900K25911a77909M816G1272b77978A8572
$$ 238397 -31812 149849 -67420 -185271 19900 245811 -177909 -173093 71272 -277978 18572
11479D6712J78812q8472K3020E493M03335r8314q0427J22660r2408I4486J55300
$$ 46712 225524 137052 160072 5493 408828 310514 230087 352747 260339 94486 249786
11468B49786a49152A41243J24053A12404K3583M6246i1734A10200a999C16972
$$ 249786 -149152 141243 265296 112404 135987 182233 -91734 110200 -1999 316972
11457b7826B72436J43018H6799K962J73659j12335g3458A32415c0385B21645O014
$$ -27826 272436 415454 86799 89761 263420 151085 -73458 132415 -30385 221645 227659
11446B27659k4656b15077P5828B60619H4905R6075J90739j40033d6342A06597
$$ 227659 203003 -215077 -139249 260619 84905 180980 371719 231686 -46342 106597
11435A24464b35663A64944Q4588D4160J38031g9095B56435q1453J2007m5687a60930
$$ 124464 -235663 164944 249532 44160 182191 -79095 256435 174982 186989 141302 -160930
11423B3603c9022r4800A47033b14821L7228r3097B33128c3421a6477B72873g7721
$$ 23603 -39022 -133822 147033 -214821 -177593 -270690 233128 -33421 -16477 272873 -77721
11411I3845J05057n863a49775B15412d1532k71116J5445N5223A17178J34318p5921
$$ 93845 198902 193039 -149775 215412 -41532 -312648 -297203 -241980 117178 251496 175575
11400A75575I409h6156F8497i35A20460n4499N0825O7438d14938a89008B33135
$$ 175575 9409 -86156 68497 -935 120460 65961 116786 184224 -414938 -189008 233135
11388A33479B3871K52858G1807J48311G2039K12266H7654J80458a49028H6370
$$ 133479 23871 276729 71807 220118 72039 284305 87654 268112 -149028 86370
11377B2575a01986c3196l2467A37849D758g9660H5390b4741C40843G6326a52184
$$ 22575 -101986 -33196 -65663 137849 4758 -79660 85390 -24741 340843 76326 -152184
11365b56919l79B6026b5983j13168e250o3637j35210q5696C10007A0360b52386
$$ -256919 -257298 26026 -25983 -139151 -5250 -68887 -204097 -289793 310007 10360 -252386
11353i2747A12631C4501A5393L9719b52824l3653C98458e6246K0381F2390h506
$$ -92747 112631 34501 15393 55112 -252824 -286477 398458 -56246 -35865 62390 -8506
11341b57667H5638B058K03862a43534C52462a44247B21277f2612A576a67237A33706
$$ -257667 85638 2058 205920 -143534 352462 -144247 221277 -62612 1576 -167237 133706
11329B25283e3581k12905B4267c9719B1360a9077k48517B16980m9666b4066l6619
$$ 225283 -53581 -266486 24267 -39719 21360 -19077 -267594 216980 167314 -24066 -60685
11318f0685m8405N1585A7135i5127b9477A60532E0754c1143A42790L4970P5197
$$ -60685 -109090 -57505 17135 -95127 -29477 160532 50754 -31143 142790 177760 252957
11307B52957a26105K0182C2413J69430g1242j3678R472o0010A32405a30807I6972
$$ 252957 -126105 -105923 32413 201843 -71242 -84920 -75448 -135458 132405 -130807 96972
11295A67584b15261B04575d789j51987q4692f6295o5022F2527c01285f7543c0597
$$ 167584 -215261 204575 -4789 -156776 -241468 -66295 -131317 62527 -301285 -67543 -30597
11283g2639F5158g6727n7769D32115b40353E7654c7314A92737o8190a35840E02433
$$ -72639 65158 -76727 -134496 432115 -240353 57654 -37314 192737 124547 -135840 502433
11271c6511B52675E1941i8154i687C50431b83225P5577A35106J28499a70436K7782
$$ -36511 252675 51941 -98154 -9687 350431 -283225 -207648 135106 263605 -170436 -142654
11260a42654L9619q5669R4123j95407o0290h974k21849A7887J5172J37592E985
$$ -142654 -103035 -188704 -94581 -289988 -350278 -8974 -230823 17887 33059 170651 5985
11248A89085a16570D7021j6045a83017H5906O2084J0919j3817B8390J00389k4362
$$ 189085 -116570 47021 30976 -183017 85906 147990 158909 145092 28390 128779 104417
11237A04417K35613a61513q5776H4759a56600m32569a35067q737g764j06471I5096
$$ 104417 340030 -161513 -247289 84759 -156600 -589169 -135067 -143804 -7764 -114235 95096
11225a22083e2969B27603A2478N9395g6346k5816k05087A64606a27152B8791b13664
$$ -122083 -52969 227603 12478 71873 -76346 -102162 -307249 164606 -127152 28791 -213664
11213e1232L088B40303B8617D526g0036k03702b6481A45146J4773C3434h8070
$$ -51232 -48144 240303 28617 4526 -70036 -273738 -26481 145146 159919 33434 -88070
11201e9971F8682a59473N8466k79886C03021F5231f9975k27618B08094c9016n3304
$$ -59971 68682 -159473 -101007 -380893 303021 65231 -69975 -297593 208094 -39016 -92320
11190i2320j7073j89256A20376B8991P2145a01974A84275l2636c2283A74973a03321
$$ -92320 -109393 -298649 120376 28991 101136 -101974 184275 151639 -32283 174973 -103321
11178e6824I574a33911B72350r8642c77248I1173g7857A75190a09064j74542A40338
$$ -56824 9574 -133911 272350 173708 -377248 91173 -77857 175190 -109064 -283606 140338
11166b5127d404B71786e9444k0250d435j48686A3468h503j1484A17464k6768b57853
$$ -25127 -4404 271786 -59444 -79694 -4435 -153121 13468 -8503 -19987 117464 90696 -257853
11153h6633k09680a26838a1780A90370b77264i8215k85301F6483b02784A93844
$$ -86633 -296313 -126838 -11780 190370 -277264 -98215 -383516 66483 -202784 193844
11142a96788G6954a79667O8826B65574c60528J65443b3009G4092L4230C9732a8901
$$ -196788 76954 -179667 -110841 265574 -360528 -195085 -23009 74092 108322 39732 -18901
11130A48835b37595B1608d4994A37248o3885b20501B08618b17487A01566e2153
$$ 148835 -237595 21608 -44994 137248 73363 -220501 208618 -217487 101566 -52153
11119I3719j6167a15961L8660D49041C1857b07878m8067Q0501N5053j17892c6394
$$ 93719 77552 -115961 -77301 449041 31857 -207878 -255945 -175444 -120391 -238283 -36394
11107A42631R5437o3656P4105n4016m7942k0413c66580D29226H4123a485l13515
$$ 142631 238068 174412 248517 194501 146559 126146 -366580 429226 84123 -1485 -315000
11096c15000B35529q7237L62386f4305q7337I0148J33248c4679A50788L4012D4203
$$ -315000 235529 148292 510678 -64305 -151642 90148 223396 -34679 150788 184800 44203
11084a33198f2799l6890j62599A51605F7806J34094a46264E74331B20971K24374
$$ -133198 -62799 -99689 -262288 151605 67806 201900 -146264 574331 220971 445345
11074D45345b589A89912L4737q1959e8925C93656h2504A26987j4505L69961c426
$$ 445345 -2589 189912 224649 142690 -58925 393656 -82504 126987 112482 482443 -3426
11062B68893j33331J58175q5904p4118O3317J64455j56087l1034J6521P8661A06505
$$ 268893 135562 293737 207833 133715 197032 361487 205400 174366 190887 269548 106505
11050C26705l68J53741k19282J96681A50873M26300n6010P6860J37422k72973
$$ 326705 326337 480078 260796 457477 150873 577173 521163 598023 735445 462472
11040D62472J93348j01461Q0466j7262l2496l9532L98722l3479r1192l24515J93338
$$ 462472 655820 554359 634825 617563 585067 545535 944257 910778 819586 495071 688409
11029F88409j42382j676K72241k52632K32650k68518o7038K67677j94765N1960
$$ 688409 546027 544351 816592 563960 796610 528092 461054 728731 533966 585926
11019E85926q1116K08374l01990K75422J45970q5515k82254q3899J80566K835
$$ 585926 504810 713184 411194 686616 832586 747071 464817 380918 561484 564319
11009E64319J80405r9515J8441R606o8763j16634J52298B33088N44513B50190
$$ 564319 744724 645209 663650 673256 604493 487859 640157 233088 777601 250190
10998I20106B57520M28655M211o6262B96847M51645l68732K13652L03840q1003
$$ 920106 257520 686175 690386 624124 296847 748492 379760 593412 897252 816249
10988H16249k43139k25237o5325K77330J09180N8107N6918C07572N0273K63154
$$ 816249 573110 347873 282548 559878 669058 727165 784083 307572 357845 620999
10978F20999j88393J79131j36553N01200l69235P4500J44315Q0185q1500O4112
$$ 620999 432606 611737 475184 976384 607149 681649 825964 906149 824649 888761
10968H88761k3620M6694L31551K33936j90905K49659M4221l649K69637N0914L67081
$$ 888761 865141 911835 1243386 1477322 1286417 1536076 1580297 1576648 1846285 1897199 2264280
10957B264280M7059J14299j9369l59913J79076l83528n1223j0818l55845P4559
$$ 2264280 2311339 2425638 2406269 2046356 2225432 1841904 1790681 1779863 1424018 1498577
10947A498577k90887k01165N17492N7418j85660L2570r2997o2170K55518n84991
$$ 1498577 1207690 1006525 1524017 1581435 1395775 1428345 1335348 1273178 1528696 943705
10937I43705J22009l00647j33975q4390j2395j4992N4018B22088J86523d987C59501
$$ 943705 1065714 765067 631092 546702 534307 519315 573333 222088 408611 -4987 359501
10925A79400E3464a13242H8358J99541j04992j7166m4842b03108A69727J65471
$$ 179400 53464 -113242 88358 287899 182907 165741 120899 -203108 169727 335198
10915C35198A4508O1644c6148B8841c58353A78518J57417c96791A12596l4846
$$ 335198 14508 76152 -36148 28841 -358353 178518 335935 -396791 112596 77750
10905G7750J17342F7324a80703A6723K36040e4095k4161G7170J1710B1055b66413
$$ 77750 195092 67324 -180703 16723 252763 -54095 -78256 77170 88880 21055 -266413
10893B73571q3451h1661A0861c34275a28711H8368a22463k14457d9830e588k32113
$$ 273571 190120 -81661 10861 -334275 -128711 88368 -122463 -336920 -49830 -5588 -237701
10882b37701e0500j81178a4226C0657a78647A92499b41465a12667J56I3407a38038
$$ -237701 -50500 -231678 -14226 30657 -178647 192499 -241465 -112667 -112511 93407 -138038
10870a32529K4930j15853a8196j13465M8301k1937n1675d0620B03337F6115L20001
$$ -132529 -107599 -223452 -18196 -131661 -83360 -105297 -156972 -40620 203337 66115 386116
10859C86116a33844B70784b741A76927a31582a7841e384j16676B3619C628M8068
$$ 386116 -133844 270784 -2741 176927 -131582 -17841 -5384 -122060 23619 3628 51696
10848E1696a1263j25621L5867j15197H2633a82476l46289K29161a45300I497L16235
$$ 51696 -11263 -136884 -101017 -216214 82633 -182476 -528765 -299604 -145300 9497 325732
10837C25732C3002K26875N2855G5988a79843D5161a28362E7685a18759e6870b2307
$$ 325732 33002 259877 312732 75988 -179843 45161 -128362 57685 -118759 -56870 -22307
10825f0376m8962A85030b16845d7277k63708A34748P3249c26027J32679A1161
$$ -60376 -109338 185030 -216845 -47277 -310985 134748 207997 -326027 -193348 11161
10814A36540J47685a40832q7890a07336A78614c2511C52738A4382K80680d6551
$$ 136540 284225 -140832 -228722 -107336 178614 -32511 352738 14382 295062 -46551
10803B6102b4475D9075e9187C68182a86071g8510j78228j7537f2829k10092h4324
$$ 26102 -24475 49075 -59187 368182 -186071 -78510 -256738 -274275 -62829 -272921 -84324
10791A48878J19740D0677a48858l28296i6142I8783j5779a02309j91500A44900
$$ 148878 268618 40677 -148858 -477154 -96142 98783 83004 -102309 -293809 144900
10780H2348B388J84279a15921R703d5608m4371B85758e2654A19024b36722G3246
$$ 82348 2388 186667 -115921 -106218 -45608 -89979 285758 -52654 119024 -236722 73246
10768a38867k01307a59690N8744D2672K25923a19322E7518b2992N641k5151A29299
$$ -138867 -340174 -159690 -100946 42672 268595 -119322 57518 -22992 -17351 -42502 129299
10756g9717A10265a34147K034A71881a20868E2585a39854O5057k00876B27901
$$ -79717 110265 -134147 -132113 171881 -120868 52585 -139854 -74797 -275673 227901
10745A02409d9137A64957J2441a32539D7927K08509c72962J78958i688A50293
$$ 102409 -49137 164957 177398 -132539 47927 256436 -372962 -194004 -9688 150293
10734I1115a55651p0125e7161q7243j3200B36325a44969J3099D4106a20445A07328
$$ 91115 -155651 -225776 -57161 -144404 -157604 236325 -144969 -131870 44106 -120445 107328
10722b56525B38338b2079p4308L7904A74507j3220b30069a1559j6050B15188J28069
$$ -256525 238338 -22079 -96387 -58483 174507 161287 -230069 -11559 -27609 215188 343257
10711C43257b0137j94259p7737D4712J70414a50191B63866A25796a95191q8889
$$ 343257 -20137 -214396 -292133 44712 215126 -150191 263866 125796 -195191 -284080
10701b84080J31894C403a10390j04590F6993b17055P432D5981a76164P7741G0303
$$ -284080 -152186 3403 -110390 -214980 66993 -217055 -209623 45981 -176164 -98423 70303
10689A39938D4506C657J66208a51865l27550K01680e4093q7063a0251D1898c83910
$$ 139938 44506 3657 169865 -151865 -479415 -277735 -54093 -141156 -10251 41898 -383910
10677b11534P119d6283k38809Q5621c7143B13004k5436b37582J00026K3657k66123
$$ -211534 -204415 -46283 -285092 -199471 -37143 213004 187568 -237582 -137556 -113899 -380022
10666c80022a60334A60123P4186A3096Q7084a25351l39323a36016A9149a4531
$$ -380022 -160334 160123 234309 13096 100180 -125351 -464674 -136016 19149 -14531
10655b2657G0782b52406b1489r4285A26871c4491E6741a02160M6225n7982j0987
$$ -22657 70782 -252406 -21489 -115774 126871 -34491 56741 -102160 -55935 -113917 -124904
10644a24904J0123j7244A37952e4007k0852j08850l4386D573K01586e2161o829
$$ -124904 -114781 -132025 137952 -54007 -74859 -183709 -218095 4573 206159 -52161 -58990
10633e8990H2142J34611a07168j38336d3024j51748k2227J1967p0421R431k4694
$$ -58990 82142 216753 -107168 -245504 -43024 -194772 -216999 -205032 -275453 -266022 -290716
10622b90716J24432B2876c3370k16409A16028a00758j78471j09954A77616a54292
$$ -290716 -166284 22876 -33370 -249779 116028 -100758 -279229 -389183 177616 -154292
10611a31131A5963g4516C36389a18932c360F317a03321k23889H9686l3958J9780
$$ -131131 15963 -74516 336389 -118932 -3360 6317 -103321 -327210 89686 55728 75508
10600G5508b90990a36055j39165d5487A80705h0096m2103B5650a87250Q5694j94807
$$ 75508 -290990 -136055 -275220 -45487 180705 -80096 -122199 25650 -187250 -101556 -296363
10589b96363R7911B81349i7319A72229f1899C3469c9383k9031A07755a02064j68122
$$ -296363 -198452 281349 -97319 172229 -61899 33469 -39383 -68414 107755 -102064 -270186
10578b70186a9283k30570N4427A84303l4823d41117i3729j91402Q3191A62306
$$ -270186 -19283 -249853 -195426 184303 149480 -441117 -93729 -285131 -201940 162306
10567F8358P8819D4223K14473j03199a21084l4889D472a11314A27816b8470A74045
$$ 68358 147177 44223 258696 155497 -121084 -155973 4472 -111314 127816 -28470 174045
10555e8519n0146j5228A07624j2597g2342j84431f8395j91624J08678d7681B04905
$$ -58519 -108665 -123893 107624 95027 -72342 -256773 -68395 -260019 -151341 -47681 204905
10543B2712b76298O6632E3639J43678b1781C45991A51894a45350l3715P3801j42793
$$ 22712 -276298 -209666 53639 197317 -21781 345991 151894 -145350 -179065 -105264 -248057
10532b48057D644e7719A91371E7358h3971J7512l1574j73231L0562D2301e2893
$$ -248057 4644 -57719 191371 57358 -83971 -66459 -98033 -271264 -240702 42301 -52893
10520f4492m5375E9973N2425J02504B0950K319j0400J68749o3262E8631b1566
$$ -64492 -109867 59973 112398 214902 20950 23269 12869 181618 118356 58631 -21566
10508E6395a35617J7999r9038A172L68929j35180C9707J92827J8674b37051D3959
$$ 56395 -135617 -117618 -216656 1172 370101 234921 39707 232534 251208 -237051 43959
10496b64947F6667d62377E7629c57678a48200G5341a66797A61747k4240c49913
$$ -264947 66667 -462377 57629 -357678 -148200 75341 -166797 161747 137507 -349913
10485b16599h2966F1322a72981k69759A49136b4677k80438G2118c9684q1154c9586
$$ -216599 -82966 61322 -172981 -442740 149136 -24677 -305115 72118 -39684 -120838 -39586
10473A2982c0868j38975C30977g244B5655M16417j64802n4090L01779k43043A23349
$$ 12982 -30868 -169843 330977 -7244 25655 442072 277270 223180 524959 281916 123349
10461B91781j40829a98156B278c796A29336a6546o7888C9871A8579a74426a5971
$$ 291781 150952 -198156 2278 -3796 129336 -16546 -84434 39871 18579 -174426 -15971
10449c87671E5046a10800K7852A62859l7995a46202k74136g9448A08713R9912
$$ -387671 55046 -110800 -82948 162859 124864 -146202 -420338 -79448 108713 208625
10439B08625D021b70377f1950k12207J13650L8830A8869J05313a99611j05500
$$ 208625 4021 -270377 -61950 -274157 -160507 -121677 18869 124182 -199611 -305111
10429c05111a46133g832k03416A69003m2451P3082L57512A48668a47772j31777
$$ -305111 -146133 -7832 -211248 169003 126552 199634 557146 148668 -147772 -279549
10419b79549A71307e1625A68286b17185B40588i447G3106a19050M1161c3942H6540
$$ -279549 171307 -51625 168286 -217185 240588 -9447 73106 -119050 -77889 -33942 86540
10407g3406I158J65029a07695B18712j06701c4823J3776A21295J72537c48344
$$ -73406 9158 174187 -107695 218712 112011 -34823 -21047 121295 293832 -348344
10396i7501k8918A5409f4216j25318m9452Q6174I0936b9251A372b05312f7335
$$ -97501 -126419 15409 -64216 -189534 -238986 -152812 90936 -29251 1372 -205312 -67335
10384A13917L4219C9857d8575a2903j36210A92502I2057L67377A99643r8355j8286
$$ 113917 148136 39857 -48575 -12903 -149113 192502 92057 459434 199643 101288 83002
10373H3002B9827L22509H9761a6934C06338C9484M7579a03917M4500C2031R6529
$$ 83002 29827 352336 89761 -16934 306338 39484 87063 -103917 -59417 32031 128560
10362A28560J22415A04475M1760M05702k24665a21936C52738c9524C07265A46619
$$ 128560 250975 104475 146235 551937 327272 -121936 352738 -39524 307265 146619
10351D03086I1390K96701m1752I9140J46108D063J42966n8006K50980a03179N0281
$$ 403086 91390 388091 346339 99140 245248 4063 147029 89023 340003 -103179 -52898
10340e2898C42266H7348J8421R4604K0759a41933A89854J7154A02620L8927L98368
$$ -52898 342266 87348 105769 200373 221132 -141933 189854 207008 102620 141547 539915
10329E39915B27303k7238L2691J83094K2755A73717j1046J71078a57481A16708
$$ 539915 227303 200065 232756 415850 438605 173717 162671 333749 -157481 116708
10318d1483A00385J03335C8595O587a21206A14225l931E0210f1628B32713C3423
$$ -41483 100385 203720 38595 45182 -121206 114225 110294 50210 -61628 232713 33423
10306i7754C17108D9268b3310A84326b399B42898p5577a92728o139j23627J27377
$$ -97754 317108 49268 -23310 184326 -2399 242898 167321 -192728 -198867 -322494 -195117
10295a95117L8788A26768h2410G8394C7536J51564E8003R3337n0514a05308l6232
$$ -195117 -156329 126768 -82410 78394 37536 189100 58003 151340 100826 -105308 -141540
10284a41540B50092d17648A4860e7400p3149B8479a6098A8055L02845a58957d5619
$$ -141540 250092 -417648 14860 -57400 -130549 28479 -16098 18055 320900 -158957 -45619
10272a64133j10778e1970o6264A20675K06241A55537a28114a6700B88363q9537
$$ -164133 -274911 -51970 -118234 120675 326916 155537 -128114 -16700 288363 198826
10262A98826b8094B48866a66805e0132m5519M836J3115a0872k32208A74351A0790
$$ 198826 -28094 248866 -166805 -50132 -95651 -90815 -77700 -10872 -243080 174351 10790
10250A33663d75047B20378K64383B02892K8386J57205A75070J27819O5448n2215
$$ 133663 -475047 220378 484761 202892 231278 388483 175070 302889 368337 316122
10240C16122b82473B19572q0796o6559d2004a0714k57340J04597C12791b4735
$$ 316122 -282473 219572 138776 72217 -42004 -10714 -268054 -163457 312791 -24735
10229b70107B29584P119C094a69214F207P7781b49090k7138a4821k70903C7704
$$ -270107 229584 236703 3094 -169214 6207 83988 -249090 -276228 -14821 -285724 37704
10217A19017J7774l0877b08398F8408a24997A12435b1064A44085D7943A4280a57245
$$ 119017 136791 105914 -208398 68408 -124997 112435 -21064 144085 47943 14280 -157245
10205A51901b62151c002j80691g9310A0191J2509c28386c9225l1917j9987I730
$$ 151901 -262151 -3002 -183693 -79310 10191 22700 -328386 -39225 -71142 -91129 9730
10193A81898b0604g179D0349d139j3224n6188j72425P1500A57127C7385d1027
$$ 181898 -20604 -7179 40349 -4139 -17363 -73551 -245976 -174476 157127 37385 -41027
10181c98812A98005a86108h9803B69010a29499L3122b1152j64983e9170B96662
$$ -398812 198005 -186108 -89803 269010 -129499 -96377 -21152 -186135 -59170 296662
10170c5968A11287D7522a87303P0641q4507J7756n5139A18081a72796B9323a44255
$$ -35968 111287 47522 -187303 -116662 -201169 -183413 -238552 118081 -172796 29323 -144255
10158a44634B10984a30661K4690o227b1008k9094k99629a73409B89142H3529e4125
$$ -144634 210984 -130661 -105971 -112198 -21008 -50102 -349731 -173409 289142 83529 -54125
10146a08623J8307n3009O5339I1683c6951j64086k40212B26418K5403A9275a32702
$$ -108623 -90316 -143325 -77986 91683 -36951 -201037 -441249 226418 251821 19275 -132702
10134a3849k67908d9717k42765B07030a61120A62928O5087A9771M9710J99329
$$ -13849 -281757 -49717 -292482 207030 -161120 162928 228015 19771 69481 268810
10124B68810c5061j25509a1277j00373B09895r4897j9561a13596B9524K4926P0598
$$ 268810 -35061 -160570 -11277 -111650 209895 114998 95437 -113596 29524 54450 125048
10113A25048J56863c74171a47097k23298A84535N5816F7820k5680a23477o9501
$$ 125048 281911 -374171 -147097 -370395 184535 240351 67820 42140 -123477 -192978
10103a92978a3124r9967A94369c4484k89723f7426o7007l62934A78479k1388d55801
$$ -192978 -13124 -113091 194369 -34484 -324207 -67426 -134433 -497367 178479 157091 -455801
10091F3107J31149R4321a46748L596j72782k6601C47385c35713J42444O0060B0747
$$ 63107 194256 288577 -146748 -143152 -315934 -342535 347385 -335713 -193269 -133209 20747
10079a60870j3131N2925k39996a19311G2778b33069f6053p8566H2509N7261c8868
$$ -160870 -174001 -121076 -361072 -119311 72778 -233069 -66053 -144619 82509 139770 -38868
10067b47232D0020K24416a65865k65178A51366a74526j07194a12311A10647b57344
$$ -247232 40020 264436 -165865 -431043 151366 -174526 -281720 -112311 110647 -257344
10056c86390a14306K5439j57196J17998c6260G0351b4086D7325d1510l8316K4617
$$ -386390 -114306 -88867 -246063 -128065 -36260 70351 -24086 47325 -41510 -79826 -55209
10045e5209l7317r5437K7733F4930i2554B27680b2315n6258j99469Q4492J8466
$$ -55209 -92526 -187963 -160230 64930 -92554 227680 -22315 -78573 -278042 -193550 -175084
10034a75084A29696g0794C69154a53119f4211k53219a58305n8479P2643b5286
$$ -175084 129696 -70794 369154 -153119 -64211 -317430 -158305 -216784 -144141 -25286
10023c55215R6299I5354c2999j37698m3157A32256a79810e5488A21392f6287l1919
$$ -355215 -258916 95354 -32999 -170697 -213854 132256 -179810 -55488 121392 -66287 -98206
10012i8206J4527k75817e1236k66689C3927b16800f38k0160q9959B27044b57522
$$ -98206 -83679 -359496 -51236 -317925 33927 -216800 -638 -20798 -110757 227044 -257522
10000f7460E7780c76969M6255h7421B06206b84411a07588C0880J5338A5978b3451
$$ -67460 57780 -376969 -330714 -87421 206206 -284411 -107588 30880 46218 15978 -23451
9988b2106o0403l0565B6836e8538A94512o5457k6084b07646j6928g5709I329b39585
$$ -22106 -82509 -113074 26836 -58538 194512 129055 102971 -207646 -224574 -75709 9329 -239585
9975b45202k99097a27261E7598a5378j69708I7896a32245f5762j70804h9962A15988
$$ -245202 -544299 -127261 57598 -15378 -185086 97896 -132245 -65762 -236566 -89962 115988
9963b86559J35365A10943a01983C41995D6816h0274k6446H474M7085c04275a26781
$$ -286559 -151194 110943 -101983 341995 46816 -80274 -106720 8474 55559 -304275 -126781
9951b26028C26086E1436b574j84536c6169H8546K82527j12472a76461b8983k77060
$$ -226028 326086 51436 -2574 -187110 -36169 88546 371073 258601 -176461 -28983 -306043
9940c06043e2061I0187A7057a9275k23325j04896A17576b3257I7700k9740a89977
$$ -306043 -52061 90187 17057 -19275 -242600 -347496 117576 -23257 97700 67960 -189977
9928a73630A24970a62317A15856J57655E3667A3781f1154j74059A04666j4132
$$ -173630 124970 -162317 115856 273511 53667 13781 -61154 -235213 104666 90534
9918I0534I283J27970e061k41962c2104j46449f4180k67416a34613J8125A45583
$$ 90534 9283 137253 -5061 -247023 -32104 -178553 -64180 -331596 -134613 -116488 145583
9906A12234e1310A78014F2390c10281A7516g8391j68334p8785a25397q1348h0766
$$ 112234 -51310 178014 62390 -310281 17516 -78391 -246725 -325510 -125397 -206745 -80766
9894a35152H5334b396C25564B7351M9887b05676G4949i4716j04319G2422a55862
$$ -135152 85334 -2396 325564 27351 77238 -205676 74949 -94716 -199035 72422 -155862
9882h579l42679a55240k21924B8049a38248j26361B39589B9026A3987J90577b32156
$$ -8579 -351258 -155240 -377164 28049 -138248 -264609 239589 29026 13987 204564 -232156
9870a09485o2126f5660e953j99315j97512i3799r2254f5911j9457p0579j84069
$$ -109485 -171611 -65660 -5953 -205268 -402780 -93799 -186053 -65911 -85368 -155947 -340016
9859c40016a40196b5582l4879G1891B6297f7438n9383k02352C4858c09859J29165
$$ -340016 -140196 -25582 -60461 71891 26297 -67438 -126821 -329173 34858 -309859 -180694
9848a80694O7562l6303A67677a22324D8655J6102b38490J02402j41192F2032j5057
$$ -180694 -113132 -149435 167677 -122324 48655 64757 -238490 -136088 -277280 62032 46975
9837D6975N556h0215G0901a55137C7772c86500A35835a9547l52028B8570G766
$$ 46975 52531 -80215 70901 -155137 37772 -386500 135835 -19547 -371575 28570 7766
9825e3515K548A01571b3063j75867E1969h6247A59731a66900m1342d1543A0993
$$ -53515 -50967 101571 -23063 -198930 51969 -86247 159731 -166900 -208242 -41543 10993
9813b12071j01841A3250K0696c16112J15369j25918A87223e6596k1983k60350
$$ -212071 -313912 13250 33946 -316112 -200743 -326661 187223 -56596 -78579 -338929
9803c38929a56859k4019M4521A6817L6946a89571A75916a40319A542b65927f3398
$$ -338929 -156859 -180878 -136357 16817 53763 -189571 175916 -140319 1542 -265927 -63398
9791a22839e654j27602B28322a32693n4781K6678r7914i2360I9366C00b7085j7963
$$ -122839 -5654 -133256 228322 -132693 -187474 -160796 -258710 -92360 99366 300 -27085 -45048
9779d5048j96746M5296e2098K0415l6171D3931e9562j67068A9312L9773b0704
$$ -45048 -241794 -196498 -52098 -31683 -67854 43931 -59562 -226630 19312 59085 -20704
9767a10921A60258a55365K15m71334a4893l0180j113m5119F4645a26085j80254
$$ -110921 160258 -155365 -155150 -626484 -14893 -45073 -46186 -91305 64645 -126085 -306339
9756c06339d1350P139j35713A07574B4423a34467c2214k27015i6791B18660n365
$$ -306339 -41350 -34211 -169924 107574 24423 -134467 -32214 -259229 -96791 218660 213295
9745B13295d37695C78694a43664O9294j6547m05700d6978B64480b26114C5335
$$ 213295 -437695 378694 -143664 -74370 -90917 -496617 -46978 264480 -226114 35335
9734h7714B08346B7317p880b22513G3487b08439O566a5413B68763a49481G4812
$$ -87714 208346 27317 19437 -222513 73487 -208439 -201873 -15413 268763 -149481 74812
9722h4342k97450a3369p2753B46140i2717k01797e8440F1548b84693a11061j06092
$$ -84342 -381792 -13369 -86122 246140 -92717 -294514 -58440 61548 -284693 -111061 -217153
9711b17153e7558D2948J15770a83748N2020e2595k3373c2263j0324k1394r3647
$$ -217153 -57558 42948 158718 -183748 -131728 -52595 -75968 -32263 -42587 -63981 -157628
9700a57628d5901A62276h6921B52297c83912J66285l625D8346a26339d9910A8875
$$ -157628 -45901 162276 -86921 252297 -383912 -217627 -221252 48346 -126339 -49910 18875
9688A85997o9411k8202b16107J2209A65253c02135i4149l29849A5894b08589k3279
$$ 185997 116586 88384 -216107 -203898 165253 -302135 -94149 -423998 15894 -208589 -231868
9677b31868n452l3313e2089H4836a10382j7639O4009A92567a84483A15303J31670
$$ -231868 -237320 -270633 -52089 84836 -110382 -128021 -64012 192567 -184483 115303 246973
9666B46973F7026a45833A20816a41759r6025a4412E0668J05808f5660A98446e0802
$$ 246973 67026 -145833 120816 -141759 -237784 -14412 50668 156476 -65660 198446 -50802
9654b0947q6541n3833k22745a1984F9411b35062e5744k65051D6691a96700e4957
$$ -20947 -107488 -161321 -384066 -11984 69411 -235062 -55744 -320795 46691 -196700 -54957
9642b48550a18812A36460e31219K25625a13867k1926d3920j97429A19760l7648
$$ -248550 -118812 136460 -531219 -305594 -113867 -135793 -43920 -241349 119760 82112
9632H2112a2976j24401O980C6013K799a36863l1324d0722A52178D7121f7481B70
$$ 82112 -12976 -137377 -130397 36013 38812 -136863 -168187 -40722 152178 47121 -67481 270
9619b34581c5707j61719b9120j01691G3597c9435A11330a80589F1259a74694A6316
$$ -234581 -35707 -197426 -29120 -130811 73597 -39435 111330 -180589 61259 -174694 16316
9607b31730M5574e2920o2565G1511a82769A88844b44565f2770n36411C21079A5287
$$ -231730 -186156 -52920 -115485 71511 -182769 188844 -244565 -62770 -599181 321079 15287
9595g8466f540k73696F9035R2371a73422a2603k8810j30795B25757b80855d0406
$$ -78466 -6540 -280236 69035 161406 -173422 -12603 -41413 -172208 225757 -280855 -40406
9583D550J09184m9115i2270A67566e7258G9304h2714m3444a111I9900J26803o0828
$$ 4550 113734 64619 -92270 167566 -57258 79304 -82714 -126158 -1111 99900 226703 165875
9571A65875c2528B5456h2327J7267l0665B9116J10665C6403c48205a18227k2101
$$ 165875 -32528 25456 -82327 -65060 -95725 29116 139781 36403 -348205 -118227 -140328
9560a40328A64047c9333k4264j85040f9562A19800a41646d5679j1207B5599O6852
$$ -140328 164047 -39333 -63597 -248637 -69562 119800 -141646 -45679 -56886 25599 92451
9549I2451K9864a40405O495j12333l13950D6265e5679A22936a41135A43172P6079
$$ 92451 122315 -140405 -133910 -246243 -560193 46265 -55679 122936 -141135 143172 219251
9538B19251e5692b2548O388F457i0473m9567J5999j656k41694F5055b69971h5776
$$ 219251 -55692 -22548 -16160 6457 -90473 -140040 -124041 -125697 -367391 65055 -269971 -85776
9525a0362p0525j95836a00841r362K4991j10887d8221k81972A25760o1856c3474
$$ -10362 -80887 -276723 -100841 -110203 -85212 -196099 -48221 -330193 125760 63904 -33474
9513e5561b3595j49041k9058k28730I5744k2658c5872j76487A0334J85950b1814
$$ -55561 -23595 -172636 -201694 -430424 95744 73086 -35872 -212359 10334 196284 -21814
9501b1095B21976b65283P5319j42440A58932C1115c1606j06002A06966h4436A02939
$$ -21095 221976 -265283 -189964 -332404 158932 31115 -31606 -137608 106966 -84436 102939
9489b07457q5857M9513j59592I3196a42513l1355L3492B38748c9445k5221E79
$$ -207457 -293314 -243801 -403393 93196 -142513 -173868 -140376 238748 -39445 -64666 579
9477i5421L2171F3414d9389A84768a8057l48151k29916a27845j56351B00868c31615
$$ -95421 -63250 63414 -49389 184768 -18057 -366208 -596124 -127845 -284196 200868 -331615
9465f4902H031a95440C03026F3862a67996B7160f2960J2990A14022c28959c5245
$$ -64902 8031 -195440 303026 63862 -167996 27160 -62960 -49970 114022 -328959 -35245
9453b7712j39748d6627j79567A28546A1055a83739A71975N525C7524a69551P0405
$$ -27712 -167460 -46627 -226194 128546 11055 -183739 171975 177500 37524 -169551 -99146
9442i9146k5411r3415A75474a93486A92115b46541i6483D03131a62631j15152
$$ -99146 -124557 -217972 175474 -193486 192115 -246541 -96483 403131 -162631 -277783
9432b77783a01176k0011G8150J09023a04657c0004j50829E2013b10411N3405L5939
$$ -277783 -101176 -121187 78150 187173 -104657 -30004 -180833 52013 -210411 -157006 -121067
9421a21067H1572a29718A00876K80997a16272c6460q768k9763E7449h2744C6352
$$ -121067 81572 -129718 100876 381873 -116272 -36460 -45228 -74991 57449 -82744 36352
9409g0292a0284l90578B71417a58557D7682N8733N9032C5606a04090a7113j07943
$$ -70292 -10284 -400862 271417 -158557 47682 106415 165447 35606 -104090 -17113 -125056
9398a25056A86189A982a64582B80270f906A1034f7234J8879l047P902k25876c4327
$$ -125056 186189 1982 -164582 280270 -6906 11034 -67234 -48355 -51402 -43500 -269376 -34327
9385A22243a37384H9875a45893m0499K0305J0202F7529c96308D1232K3000c81942
$$ 122243 -137384 89875 -145893 -186392 -166087 -155885 67529 -396308 41232 64232 -381942
9373g5923k01532a11028l80860a33769L22c9623H8386J28002a44800A28448J39796
$$ -75923 -277455 -111028 -491888 -133769 -133447 -39623 88386 216388 -144800 128448 268244
9362B68244a33496B74148b644k3594m11726a81423f2219K7556B02992a70927E0376
$$ 268244 -133496 274148 -2644 -26238 -437964 -181423 -62219 -34663 202992 -170927 50376
9350A17418C026h5069j58464P4283Q2157B46554a69518b037n820q0282I4815i8728
$$ 117418 3026 -85069 -243533 -169250 -87093 246554 -169518 -2037 -7857 -88139 94815 -98728
9337A16864h7812A02321b43921O2256N8628e1678q4454I4029g848B01259a22499
$$ 116864 -87812 102321 -243921 -181665 -123037 -51678 -136132 94029 -7848 201259 -122499
9325a53070k12226D2434J18892e9652j22550K9605f5932J2087k0076A12331e1664
$$ -153070 -365296 42434 161326 -59652 -182202 -152597 -65932 -53845 -73921 112331 -51664
9313A98406o3981E258a76760P437k07270J30045A28506e7741j971A13162k5285
$$ 198406 134425 5258 -176760 -169323 -376593 -246548 128506 -57741 -59712 113162 87877
9302H7877b37152m3333A16123b5647F0440e20814B1808d708D6517g7295E3702
$$ 87877 -237152 -280485 116123 -25647 60440 -520814 21808 -4708 46517 -77295 53702
9290a53932O1691g42B5017J62061f1135o7326c5561j19659F4692f3223i343p7365
$$ -153932 -92241 -742 25017 187078 -61135 -128461 -35561 -155220 64692 -63223 -9343 -86708
9278h6708k60653B45214m1060C7273a8350A57329l9519b34075j91584B26678f6869
$$ -86708 -347361 245214 204154 37273 -18350 157329 117810 -234075 -425659 226678 -66869
9266H6036g2429j04704R872A57885D0332J64701c5639A7842c02604A09863a49820
$$ 86036 -72429 -177133 -167261 157885 40332 205033 -35639 17842 -302604 109863 -149820
9254a6437r4005l02273b6605B06980a19471r3699j60739E5309i7643l5703d5535
$$ -16437 -110442 -412715 -26605 206980 -119471 -213170 -373909 55309 -97643 -133346 -45535
9242a48470g2905A68930p1861B6318f4428j26205C24671a90504R0599n7490p5565
$$ -148470 -72905 168930 97069 26318 -64428 -190633 324671 -190504 -99905 -157395 -232960
9231b32960A84469G6870b3091o8702q6070h2754D6000a54301l9800m7296E6014
$$ -232960 184469 76870 -23091 -91793 -177863 -82754 46000 -154301 -194101 -241397 56014
9219C46857A70544a48408c2800A41138L9868a32899j79433B14416g1016A27981
$$ 346857 170544 -148408 -32800 141138 181006 -132899 -312332 214416 -71016 127981
9208a9161l60542J53864k12690A30714e7067l0095l8513j25784J9298f1384K5415
$$ -19161 -379703 -225839 -438529 130714 -57067 -87162 -125675 -251459 -232161 -61384 -35969
9197c5969D6583a29207n2401A42019c28992C94133e7549b5009E5551J72881j2847
$$ -35969 46583 -129207 -181608 142019 -328992 394133 -57549 -25009 55551 228432 215585
9186B15585A7453J448b45922N1456A09109c67292Q4688P3284R8964e2180A7329
$$ 215585 17453 18901 -245922 -194466 109109 -367292 -282604 -209320 -110356 -52180 17329
9174b78697p5362D9617a62428D0870b15341q2126a10230E7713d7172n2762L3084
$$ -278697 -354059 49617 -162428 40870 -215341 -297467 -110230 57713 -47172 -99934 -66850
9163f6850k19271Q0086C43782c9846n5114G7052B9744g8131b9973j96572G9816
$$ -66850 -286121 -206035 343782 -39846 -94960 77052 29744 -78131 -29973 -226545 79816
9151I5886N9823a9180r4049B96705a30588L217M8247j17766L7310j84841f6813
$$ 95886 155709 -19180 -113229 296705 -130588 -127371 -79124 -196890 -159580 -344421 -66813
9139B11133C0022c2215j20050A48472b0712j78048A60982G9575g3881a5169j76776
$$ 211133 30022 -32215 -152265 148472 -20712 -198760 160982 79575 -73881 -15169 -191945
9128a91945A54332J31046A08754a31364G9867e144C64898E1066a9421A96329d1859
$$ -191945 154332 285378 108754 -131364 79867 -5144 364898 51066 -19421 196329 -41859
9116b32328J8768M5540k625j61958a31698I7586i2609A71314d7517A02001g5228
$$ -232328 -213560 -168020 -170645 -332603 -131698 97586 -92609 171314 -47517 102001 -75228
9104c19515A78357J3730b20691R4328e08m28516K00702C73997E3728d23532j09862
$$ -319515 178357 192087 -220691 -126363 -508 -429024 -228322 373997 53728 -423532 -533394
9093e33394D237c40597a69112n3955B636a91197B78585b29160c7313B4127d5853
$$ -533394 4237 -340597 -169112 -223067 2636 -191197 278585 -229160 -37313 24127 -45853
9081c56752e6729J0552q4016A8159b519j36225A4349b94933C1601L18991a53004
$$ -356752 -56729 -46177 -130193 18159 -2519 -138744 14349 -294933 31601 350592 -153004
9069d18023A44041A1067c85452c2500a6048H6591J74170a31261N3286A84957H836
$$ -418023 144041 11067 -385452 -32500 -16048 86591 260761 -131261 -77975 184957 8836
9057b18718i5379B33464b12642j3566J09073I5551j9315a22935A1939b60451i3494
$$ -218718 -95379 233464 -212642 -226208 -117135 95551 76236 -122935 11939 -260451 -93494
9045a23964A30658C3592b17331p9760A66606d73678A36036K57a97814A82651C3222
$$ -123964 130658 33592 -217331 -297091 166606 -473678 136036 136293 -197814 182651 33222
9033b49261B02609a00937n675j53004h0170b8208I948a96850E8318K1991c12452
$$ -249261 202609 -100937 -106612 -259616 -80170 -28208 9948 -196850 58318 80309 -312452
9021a99223O0288B93553b05453k21660A27402a9088D3443a05054L558o0962C3689
$$ -199223 -138935 293553 -205453 -427113 127402 -19088 43443 -105054 -101496 -162458 33689
9009C23634b18436c5132F9072c7178j31604D1104b15064o999B34497b7404h009
$$ 323634 -218436 -35132 69072 -37178 -168782 41104 -215064 -222063 234497 -27404 -8009
8997b0354A12092J49973B6849d245B20213M9250E2038a35245L4879B59485H5378
$$ -20354 112092 262065 26849 -4245 220213 269463 52038 -135245 -100366 259485 85378
8985C9003b9183h397L298p6379E9299P2042O2422G4425b13587i2128G9476c1574
$$ 39003 -29183 -8397 -5099 -81478 59299 131341 193763 74425 -213587 -92128 79476 -31574
8972A4744b70234J05300M043C6122B016J22238d3282q0669a9565H6043r322l4987
$$ 14744 -270234 -164934 -160891 36122 2016 124254 -43282 -123951 -19565 86043 76721 41734
8960D1734M767Q5742g7758C80838h7679a4890n7162m9085l55377C20573q2131
$$ 41734 46501 132243 -77758 380838 -87679 -14890 -72052 -121137 -476514 320573 238442
8949B38442O8903a54975j61410m2550B2999b34420J10219r4941q7220I9369k6907
$$ 238442 307345 -154975 -316385 -358935 22999 -234420 -124201 -219142 -306362 99369 72462
8938G2462g2515B22511b35740i8211k32407A6309f7585j89233A6860a83489B53535
$$ 72462 -72515 222511 -235740 -98211 -330618 16309 -67585 -256818 16860 -183489 253535
8926B23280a08142L2287C4340R7252K06369F4017e695H5774B4276b55206h9753
$$ 223280 -108142 -75855 34340 131592 337961 64017 -5695 85774 24276 -255206 -89753
8914C7030K3566f0715A93706A3942L53952M1154K89673M35788J715661j205802
$$ 37030 60596 -60715 193706 13942 367894 409048 698721 1134509 2850170 1644368
8904A644368G13147o6102A79233b5884E5715g9217E8797q710g8779E2577c097
$$ 1644368 713147 647045 179233 -25884 55715 -79217 58797 50087 -78779 52577 -3097
8892B4533a48682l653e8715o6151K672e3363A99282k8418p854g4543A07502h4890
$$ 24533 -148682 -152335 -58715 -124866 -122194 -53363 199282 170864 163010 -74543 107502 -84890
8879a67460r4386k6692M6236a5063I7894f8114j25179n4357k8308N8744B46236
$$ -167460 -261846 -288538 -242302 -15063 97894 -68114 -193293 -247650 -275958 -217214 246236
8867a63163K0573B28970a01637E958J412e7376A39805e4725B6431a63106j30395
$$ -163163 -142590 228970 -101637 5958 7370 -57376 139805 -54725 26431 -163106 -293501
8856b93501B782R3482a97558i3218A69371a35175l4200K7122A04005J26865j15271
$$ -293501 2782 96264 -197558 -93218 169371 -135175 -169375 -142253 104005 230870 115599
8845A15599k7903a51496e587o9531r0247B01078a07960n6130g5547A36435C1015
$$ 115599 87696 -151496 -5587 -75118 -165365 201078 -107960 -164090 -75547 136435 31015
$$ [...]
##END NTUPLES=NMR SPECTRUM
##END=
