
##TITLE=AC1222_Punto_6074794_1Xs9jaGfa0
##JCAMPDX= 6.0         $$ Bruker NMR JCAMP-DX V2.0
##DATA TYPE= NMR SPECTRUM
##DATA CLASS= NTUPLES
##ORIGIN= BRUKER
##OWNER= Administrator
$$ 1.72 TOPSPIN		Version 2.1
$$ 2012-05-08 02:21:44.968 -0500  Administrator@TOPSPIN
$$ Compression mode = diff/dup
##.OBSERVE FREQUENCY= 400.13188235
##.OBSERVE NUCLEUS= ^1H
##.ACQUISITION MODE= SIMULTANEOUS (DQD)
##.ACQUISITION SCHEME= undefined
##.AVERAGES= 64
##.DIGITISER RES= 22
##SPECTROMETER/DATA SYSTEM= spect
##.PULSE SEQUENCE= noesygpps1d.comp
##.SOLVENT NAME= COFFEE_meoh
##.SHIFT REFERENCE= INTERNAL, COFFEE_meoh, 1, 14.96671
##AUDIT TRAIL= $$ (NUMBER, WHEN, WHO, WHERE, PROCESS, VERSION, WHAT)
$$ ##TITLE= Audit trail, TOPSPIN		Version 2.1
$$ ##JCAMPDX= 5.01
$$ ##ORIGIN= Bruker BioSpin GmbH
$$ ##OWNER= Administrator
$$ $$ C:\Bruker\TOPSPIN/data/COFFEE/nmr/AC1222_Punto_6074794_1Xs9jaGfa0/32/pdata/1/auditp.txt
$$ ##AUDIT TRAIL=  $$ (NUMBER, WHEN, WHO, WHERE, PROCESS, VERSION, WHAT)
(   1,<2012-05-08 02:21:39.750 -0500>,<Administrator>,<TOPSPIN>,<go>,<TOPSPIN 2.1>,
      <created by zg
	started at 2012-05-08 02:10:09.468 -0500,
	POWCHK enabled, PULCHK disabled,
       configuration hash MD5:
       AF F2 23 6B 01 CD 40 DD E5 A1 38 A0 06 EA F7 77
       data hash MD5: 64K
       E4 DD 03 86 0B D9 4A DC EE 02 2F FD 57 AB 9B E5>)
(   2,<2012-05-08 02:21:42.625 -0500>,<Administrator>,<TOPSPIN>,<proc1d>,<TOPSPIN 2.1>,
      <Start of raw data processing
       efp LB = 0.3 FT_mod = 6 PKNL = 1 PHC0 = 0 PHC1 = 0 SI = 128K 
       data hash MD5: 128K
       D4 B8 15 74 7C 23 0C F9 AE 3A 63 53 CF 12 CA C8>)
(   3,<2012-05-08 02:21:43.843 -0500>,<Administrator>,<TOPSPIN>,<proc1d>,<TOPSPIN 2.1>,
      <pk PHC0 = 33.79944 PHC1 = 0 
       data hash MD5: 128K
       C0 9E DC 76 52 C3 FE 16 D9 77 88 AB 68 C1 8F 8E>)
(   4,<2012-05-08 02:21:44.625 -0500>,<Administrator>,<TOPSPIN>,<proc1d>,<TOPSPIN 2.1>,
      <abs ABSG = 1 
       data hash MD5: 128K
       DE 8A D6 06 FD 5A 94 D6 9B AB A7 DC DE 64 6E EE>)
(   5,<2012-05-08 02:21:44.718 -0500>,<Administrator>,<TOPSPIN>,<proc1d>,<TOPSPIN 2.1>,
      <abs ABSG = 2 
       data hash MD5: 128K
       0A B6 A2 12 75 3A 77 4B 7E F4 51 FC 3E A8 53 CF>)
(   6,<2012-05-08 02:21:44.781 -0500>,<Administrator>,<TOPSPIN>,<proc1d>,<TOPSPIN 2.1>,
      <abs ABSG = 3 
       data hash MD5: 128K
       FC 16 22 F2 53 A8 44 82 57 9E F4 26 9D 37 B0 11>)
(   7,<2012-05-08 02:21:44.828 -0500>,<Administrator>,<TOPSPIN>,<proc1d>,<TOPSPIN 2.1>,
      <abs ABSG = 4 
       data hash MD5: 128K
       32 50 8F 9A 0E 6F F6 48 D6 3D 60 BA 69 96 D0 35>)
(   8,<2012-05-08 02:21:44.890 -0500>,<Administrator>,<TOPSPIN>,<proc1d>,<TOPSPIN 2.1>,
      <abs ABSG = 5 
       data hash MD5: 128K
       C0 28 B1 9E F5 16 C5 CC C7 FB AC 51 FB 46 25 F1>)
$$ ##END=
$$ 
$$ $$ hash MD5
$$ $$ 8A 9A F5 D6 9E 4E 98 0B 34 DC 91 75 9B 7C C8 AA
##$RELAX= 
##$RELAX= 
##$RELAX= 
##$RELAX= 
##$RELAX= 
##$RELAX= 
##$RELAX= 
##$RELAX= 
$$ Bruker specific parameters
$$ [...]
##$TP07= 0
##$TPNAME0= <>
##$TPNAME1= <>
##$TPNAME2= <>
##$TPNAME3= <>
##$TPNAME4= <>
##$TPNAME5= <>
##$TPNAME6= <>
##$TPNAME7= <>
##$TPOAL= (0..7)
0.5 0.5 0.5 0.5 0.5 0.5 0.5 0.5
##$TPOFFS= (0..7)
0 0 0 0 0 0 0 0
##$TUNHIN= 0
##$TUNHOUT= 0
##$TUNXOUT= 0
##$USERA1= <user>
##$USERA2= <user>
##$USERA3= <user>
##$USERA4= <user>
##$USERA5= <user>
##$V9= 5
##$VALIST= <valist>
##$VCLIST= <CCCCCCCCCCCCCCC>
##$VD= 0
##$VDLIST= <DDDDDDDDDDDDDDD>
##$VPLIST= <PPPPPPPPPPPPPPP>
##$VTLIST= <TTTTTTTTTTTTTTT>
##$WBST= 1024
##$WBSW= 4
##$XGAIN= (0..3)
0 0 0 0
##$XL= 0
##$YL= 0
##$YMAX_a= 10320370
##$YMIN_a= -5438276
##$ZGOPTNS= <>
##$ZL1= 120
##$ZL2= 120
##$ZL3= 120
##$ZL4= 120
##$ABSF1= 14.96671
##$ABSF2= -5.58582
##$ABSG= 5
##$ABSL= 3
##$ALPHA= 0
##$AQORDER= 0
##$ASSFAC= 0
##$ASSFACI= 0
##$ASSFACX= 0
##$ASSWID= 0
##$AUNMP= <proc_prof1d_extract.lims>
##$AXLEFT= 0
##$AXNAME= <>
##$AXNUC= <1H>
##$AXRIGHT= 0
##$AXTYPE= 0
##$AXUNIT= <>
##$AZFE= 0.1
##$AZFW= 0.1
##$BCFW= 0
##$BC_mod= 0
##$BYTORDP= 0
##$COROFFS= 0
##$CY= 15
##$DATMOD= 1
##$DC= 0
##$DFILT= <>
##$DTYPP= 0
##$F1P= 0
##$F2P= 0
##$FCOR= 0.5
##$FTSIZE= 131072
##$FT_mod= 6
##$GAMMA= 0
##$GB= 0
##$INTBC= 1
##$INTSCL= 1
##$ISEN= 128
##$LB= 0.3
##$LEV0= 0
##$LPBIN= 0
##$MAXI= 10000
##$MC2= 0
##$MEAN= 0
##$ME_mod= 0
##$MI= 0
##$NCOEF= 0
##$NC_proc= -3
##$NLEV= 6
##$NOISF1= 0
##$NOISF2= 0
##$NSP= 0
##$NTH_PI= 0
##$NZP= 0
##$OFFSET= 14.96671
##$PC= 1
##$PHC0= 33.79944
##$PHC1= 0
##$PH_mod= 1
##$PKNL= yes
##$PPARMOD= 0
##$PPDIAG= 0
##$PPIPTYP= 0
##$PPMPNUM= 2147483647
##$PPRESOL= 1
##$PSCAL= 4
##$PSIGN= 0
##$PYNMP= <proc.py>
##$REVERSE= no
##$SF= 400.130005561587
##$SI= 131072
##$SIGF1= 0
##$SIGF2= 0
##$SINO= 400
##$SIOLD= 131072
##$SPECTYP= <>
##$SREGLST= <1H.CDCl3>
##$SSB= 0
##$STSI= 131072
##$STSR= 0
##$SW_p= 8223.68421052632
##$SYMM= 0
##$S_DEV= 0
##$TDeff= 65536
##$TDoff= 0
##$TI= <>
##$TILT= no
##$TM1= 0
##$TM2= 0
##$TOPLEV= 0
##$USERP1= <user>
##$USERP2= <user>
##$USERP3= <user>
##$USERP4= <user>
##$USERP5= <user>
##$WDW= 1
##$XDIM= 131072
##$YMAX_p= 452282755
##$YMIN_p= -109581568
##$CURPLOT= <Network HP LaserJet P1505>
##$CURPRIN= <$Network HP LaserJet P1505>
##$DFORMAT= <normdp>
##$LAYOUT= <+/1D_H.xwp>
##$LFORMAT= <normlp>
##$PFORMAT= <normpl>
##$SURQMSG= 1
$$ End of Bruker specific parameters
$$ ---------------------------------
##NTUPLES= NMR SPECTRUM
##VAR_NAME=  FREQUENCY,     SPECTRUM/REAL,   SPECTRUM/IMAG
##SYMBOL=    X,             R,               I
##VAR_TYPE=  INDEPENDENT,   DEPENDENT,       DEPENDENT
##VAR_FORM=  AFFN,          ASDF,            ASDF
##VAR_DIM=   131072,        131072,          131072
##UNITS=     HZ,            ARBITRARY UNITS, ARBITRARY UNITS
##FACTOR=    0.0627417313425165, 1,          1
##FIRST=     8223.62146879498, 2401,         -101210
##LAST=      0,             5813,            -101889
##MIN=       0,             -109581568,      0
##MAX=       8223.62146879498, 452282755,    0
$$ Real data points
##PAGE= N=1
##DATA TABLE= (X++(R..R)), XYDATA
$$ [...]
63677C95872M540M533M490M014K866J551Q96J187K001K813L504M164M661M724
63663D41816M405M087L927L623L008K498K510K643J940J04j964k974k382p19R10
63648D63432J532R46j87r51j036q90j046j526j889j540j22J975L489L296J743
63633D67226M61N57J572K623L767N417O915O855M960K713J718K052K581K421J628
63618E13466P86L40L11M26N47R48J925L081L426K471R39K3j0m3q78k039k222r53
63600E22544N87P77n82k251l375m345n423n491l447l61J296P16k87J74J824L261
63584E05617M109M988O108P084P849Q605R044Q640P718P347Q056R373J0749J2186
63570F17473J3823J5449J6685J7238J7115J7008J8282K1646K5848K8656K9436
$$ plain form
63677 395872 400412 404945 409435 413449 416315 417866 418762 419949 421950 424763 428267 432431 437092 441816
63663 441816 446221 450308 454235 457858 460866 463364 465874 468517 470457 470561 468597 465623 463241 462522 463432
63648 463432 464964 465910 465723 464772 463736 462846 461800 460274 458385 456845 456723 458698 462187 465483 467226
63633 467226 467687 468244 469816 472439 476206 481623 488538 495393 500353 503066 504784 506836 509417 511838 513466
63618 513466 514252 514592 514903 515329 515876 516824 518749 521830 525256 527727 528666 528689 528679 528636 527758 525719 523497 522544
63600 522544 523131 523908 523326 521075 517700 513355 507932 502441 498994 498633 499929 500645 500358 500532 502356 505617
63584 505617 509726 514714 520822 527906 535755 544360 553404 562044 569762 577109 585165 594538 605287 617473
63570 617473 631296 646745 663430 680668 697783 714791 733073 754719 780567 809223 838659
63559H38659K9945L2117L5819L9288M1200M1646M1576M1977M3461M5981M8794
63548A280463N0792N0784M7639M0881L1506K1633J2900N513p46n373p812q838
63536A519342j0161j2554j5303j7706k0211k3535k7371l0819l3727l6671l9525
63525A251759m1016m0206l7793l5150l2514k9065k4753k0837j8166j5942j2946
63514I43371r289n921l003K2L013N169O540Q173J0422J2335J3348J4441J6826
63501A015447K0348K4025K7400L0433L2800L4356L5852L8159M1027M3553M5623
63490A389023M7975N0968N4089N6389N6418N2021M1679K6595J0631k379j0941
63479A772468j5792j8425k0000k0827k0462j8808j7219j7778k1146k5956l0707
$$ plain form
63559 838659 868604 900721 936540 975828 1017028 1058674 1100250 1142227 1185688 1231669 1280463
63548 1280463 1331255 1382039 1429678 1470559 1502065 1523698 1536598 1542111 1541365 1535992 1528180 1519342
63536 1519342 1509181 1496627 1481324 1463618 1443407 1419872 1392501 1361682 1327955 1291284 1251759
63525 1251759 1210743 1170537 1132744 1097594 1065080 1036015 1011262 990425 972259 956317 943371
63514 943371 934082 928161 925158 925180 928193 933362 939902 948075 958497 970832 984180 998621 1015447
63501 1015447 1035795 1059820 1087220 1117653 1150453 1184809 1220661 1258820 1299847 1343400 1389023
63490 1389023 1436998 1487966 1542055 1598444 1654862 1706883 1748562 1775157 1785788 1783409 1772468
63479 1772468 1756676 1738251 1718251 1697424 1676962 1658154 1640935 1623157 1602011 1576055 1545348
63468A545348l5391m0591m5795m9672n1695n2492n2648n1953n0036m7129m3916
63457A024030m0837l7828l4616l1205k8123k6026k4973k4229k2907k0685j7794
63446G14807j4719j2155j0824j0787j1113j0758r712q765q205p416n905m043k432
63433E97973j114P5Q26O98m8n94n24r5M22J007J494J545J343J632K637L545L594
63416F14416L218L310L693L224J426p42k003k077j682j670k289k912k426l83K102
63401F15205L151K044J6j054k39K132N123P733R352J0142J0777J1625J2583J3721
63387G02311J5472J7793J9921K1417K2950K5417K8668L1763L4280L6828M0312
63376I97132M4819M9037N0693M8202M2280L5575L0397K7275K5697K5286K5741
$$ plain form
63468 1545348 1509957 1469366 1423571 1373899 1322204 1269712 1217064 1165111 1115075 1067946 1024030
63457 1024030 983193 945365 910749 879544 851421 825395 800422 776193 753286 732601 714807
63446 714807 700088 687933 677109 666322 655209 644451 634739 625974 617769 610353 604448 600405 597973
63433 597973 596859 596934 597760 598458 598410 597816 597292 597197 597619 598626 600120 601665 603008 604640 607277 610822 614416
63416 614416 617634 620944 624637 627861 629287 628545 626542 624465 622783 621113 618824 615912 613486 613103 615205
63401 615205 618356 620400 620416 619362 619123 621255 626378 634111 643463 653605 664382 676007 688590 702311
63387 702311 717783 735576 755497 776914 799864 825281 853949 885712 919992 956820 997132
63376 997132 1041951 1090988 1141681 1189883 1232163 1267738 1298135 1325410 1351107 1376393 1402134
63365A402134K6779K8874L3163L9586M6001N0426N3368N6462N9245N9029N4090
63354A909157M5452L5204K4432J3405K767o434j3440j8071k0650k1823k2301k2672
63342A905026k3780k6756l2011l8326m3852m7916n1148n3911n5527n5214n3026
63331A423559m9741m6313m3317m0300l5968k9922k3916k0308j9197j8247j5498
63320A080832j1305p247m139j546J474N465R951J3736J6351J8810K2172K5865
63308A170419K8663L0832L3715L7436M0799M3523M6638N0336N3354N5040N6268
63297A647023N7482N7546N5315N0722M3594L3338K0898R122k59q207j5571k0702
63285A930301k1985k1210k1841k4724k7834k9815l1684l5092m0583m7443n3803
$$ plain form
63365 1402134 1428913 1457787 1490950 1530536 1576537 1626963 1680331 1736793 1796038 1855067 1909157
63354 1909157 1954609 1989813 2014245 2027650 2030417 2023983 2010543 1992472 1971822 1949999 1927698 1905026
63342 1905026 1881246 1854490 1822479 1784153 1740301 1692385 1641237 1587326 1531799 1476585 1423559
63331 1423559 1373818 1327505 1284188 1243888 1207920 1177998 1154082 1133774 1114577 1096330 1080832
63320 1080832 1069527 1062280 1058141 1056595 1058069 1063534 1073485 1087221 1103572 1122382 1144554 1170419
63308 1170419 1199082 1229914 1263629 1301065 1341864 1385387 1432025 1482361 1535715 1590755 1647023
63297 1647023 1704505 1762051 1817366 1868088 1911682 1945020 1965918 1975040 1974781 1966574 1951003 1930301
63285 1930301 1908316 1887106 1865265 1840541 1812707 1782892 1751208 1716116 1675533 1628090 1574287
63274A574287n7216n6703n4013n1602m9758m7093m3191l9003l4937l0424k5412
63263A084935k0641j6523j3318j2298j4901k0358k5771k8947k9985l0001k9642
63252H42550k9052k7845k4926j9819j4379j1660j2472j4443j4959j3740j1975
63241F47280j0371q984p928p321p043p114p706q431q378p149n331l762k947k990
63227E51825l296k613o00R23j42l080m861m014k127r83k89O30Q06q40l135l616
63211E24588j468J831M389N311M688L378K723L527N194O379O352N522M895N306
63197E82615O786Q367R023Q953R287J0437J1595J2184J2778J4110J6063J8167
63185G20365K0233K1949K2768K2828K3220K4691K6864K9104L1224L2922L3670
$$ plain form
63274 1574287 1517071 1460368 1406355 1354753 1304995 1257902 1214711 1175708 1140771 1110347 1084935
63263 1084935 1064294 1047771 1034453 1022155 1007254 986896 961125 932178 902193 872192 842550
63252 842550 813498 785653 760727 740908 726529 714869 702397 687954 672995 659255 647280
63241 647280 636909 627925 619997 612676 605633 598519 590813 582382 574004 566855 561524 557762 554815 551825
63227 551825 548529 545916 545316 546239 546097 543017 538156 534142 532015 531032 530743 531373 532179 531339 528204 524588
63211 524588 523120 524951 529340 534651 539339 542717 545440 548967 554161 560540 566892 572414 577309 582615
63197 582615 589401 597768 606791 615744 625031 635468 647063 659247 672025 686135 702198 720365
63185 720365 740598 762547 785315 808143 831363 856054 882918 912022 943246 976168 1009838
63174A009838L3850L4662L6101L6416L4631L2313L1446L1739L1579L0658K9969
63163A373202K9939L0295L1233L2804L3520L1421K6625K1257J6752J2632P992
63152A647672K664l291r939j6856k3243k8803l3530l6611l6821l4368l1194k9005
63140A366675k7823k6657k4726k1816j8343j5252j3038j0792p186k345K350O292
63128A207339J0082J3781J6351J7398J8028J9091J9933J9868J9687K0423K1443
63117A403424K1217J9524J7602J6341J5338J3796J1385Q236M639R11k898p162
63105A522353j2151j7478k2450k6745l0478l3772l6585l8689l9518l8532l6159
63094A189796l3898l2826l2312l0873k8158k5278k3213k1722k0081j8225j6729
$$ plain form
63174 1009838 1043688 1078350 1114451 1150867 1185498 1217811 1249257 1280996 1312575 1343233 1373202
63163 1373202 1403141 1433436 1464669 1497473 1530993 1562414 1589039 1610296 1627048 1639680 1647672
63152 1647672 1650336 1647045 1637106 1620250 1597007 1568204 1534674 1498063 1461242 1426874 1395680 1366675
63140 1366675 1338852 1312195 1287469 1265653 1247310 1232058 1219020 1208228 1201042 1198697 1201047 1207339
63128 1207339 1217421 1231202 1247553 1264951 1282979 1302070 1322003 1341871 1361558 1381981 1403424
63117 1403424 1424641 1444165 1461767 1478108 1493446 1507242 1518627 1526863 1531502 1532413 1529515 1522353
63105 1522353 1510202 1492724 1470274 1443529 1413051 1379279 1342694 1304005 1264487 1225955 1189796
63094 1189796 1155898 1123072 1090760 1059887 1031729 1006451 983238 961516 941435 923210 906481
63083I06481j5890j5227j3888j1498q658o495n578n309m609l074j185M28J483
63070H16981J897J707J369J566K405L095K902K166J947K717L878M662M983N275
63056H57550N767O271O477O230N719N504O066P035P271O216M889M739N655O000
63042I41389M855L321K986L851M599M435L721K950K094J148O15R85K034K991L241
63027I85215K870K635L403N282P408Q862R679J0526J1504J1963J1718J1807J3478
63014A096350J6674J9972K1961K2397K2102K2162K3397K6094K9764L3111L4877
63003A368861L5263L6285M0026M6384N3037N7874O0932O3646O6863P0308P3541
62992A973020P6537P9270Q1546Q3383Q4869Q5498Q4333Q1407P8438P7358P8232
$$ plain form
63083 906481 890591 875364 861476 849978 841320 834825 829247 823938 819329 816255 815070 815498 816981
63070 816981 818878 820585 821954 823520 825925 829020 831922 834088 836035 838752 842630 847292 852275 857550
63056 857550 863317 869588 876065 882295 888014 893518 899584 906619 913890 920106 924995 929734 935389 941389
63042 941389 946244 949565 952551 956402 961001 965436 969157 972107 974201 975349 975964 976949 978983 981974 985215
63027 985215 988085 990720 994123 999405 1006813 1015675 1025354 1035880 1047384 1059347 1071065 1082872 1096350
63014 1096350 1113024 1132996 1154957 1177354 1199456 1221618 1245015 1271109 1300873 1333984 1368861
63003 1368861 1404124 1440409 1480435 1526819 1579856 1637730 1698662 1762308 1829171 1899479 1973020
62992 1973020 2049557 2128827 2210373 2293756 2378625 2464123 2548456 2629863 2708301 2785659 2863891
62981B863891P9186P8594P6772P5038P3409P0167O4059N6166M8537M1323L2468
62970C559610K0467O181q635k3349l7951n1564o2941p1989p9398q4999q7847q7967
62958B989618q6426q3474p8139p0297o1714n4099m7083l9188l0119k1027j2966
62947B405086o056R2N884J1649J7280K2020K4980K5903K5354K4474K4680K6764
62935B608110K9778L1431L0346K7506K4834K2920K0952J8248J4643R596K382o659
62923B834087j6230k5755l5779m6195n5319o1792o6478p1134p5678p8257p8086
62912B223384p6680p5611p4270p1008o5843o0626n6652n3345m9723m5966m2791
62901A550869m0123l7529l5470l4886l5372l4992l2461k8831k6326k5866k6322
$$ plain form
62981 2863891 2943077 3021671 3098443 3173481 3246890 3317057 3381116 3437282 3485819 3527142 3559610
62970 3559610 3580077 3586258 3577623 3554274 3516323 3464759 3401818 3329829 3250431 3165432 3077585 2989618
62958 2989618 2903192 2819718 2741579 2671282 2609568 2555469 2508386 2469198 2439079 2418052 2405086
62947 2405086 2399030 2399122 2405006 2416655 2433935 2455955 2480935 2506838 2532192 2556666 2581346 2608110
62935 2608110 2637888 2669319 2699665 2727171 2752005 2774925 2795877 2814125 2828768 2838364 2840746 2834087
62923 2834087 2817857 2792102 2756323 2710128 2654809 2593017 2526539 2455405 2379727 2301470 2223384
62912 2223384 2146704 2071093 1996823 1925815 1859972 1799346 1742694 1689349 1639626 1593660 1550869
62901 1550869 1510746 1473217 1437747 1402861 1367489 1332497 1300036 1271205 1244879 1219013 1192691
62890A192691k6044k4576k2808k1810k1669k1506k0616j9343j8498j8076j7196
62879I60549j5446j3574j2453j1917j1235j0296r568r121q504p513o361n009l169
62866H36383j268n68j709l631m656m429l954l910l764k855j614j145j978l745
62852G97157n824p669q729q619p567o194m849l576k674k689l539m247l912k688
62838G24381j483r71j041r43Q8J875L034K346M71o79m94k96q51q56P42K345J629
62821G29297q22k121j150J79J04o95q19l12Q7M49J118J671J586J164Q19K31q11
62804G29975j552j190n3R67J447J221J26j102q77J043K497J598m03p50J037K889
62788G36873L393L099K684J901Q49M73J000J346Q18Q9j98n05j244j709j130R1
$$ plain form
62890 1192691 1166647 1142071 1119263 1097453 1075784 1054278 1033662 1014319 995821 977745 960549
62879 960549 945103 931529 919076 907159 895924 885628 876060 866939 858435 850922 844561 839552 836383
62866 836383 835115 834547 832838 829207 824551 820122 816168 812258 808494 805639 804025 802880 800902 797157
62852 797157 791333 783664 774935 766316 758749 752555 747706 744130 741456 738767 735228 730981 727069 724381
62838 724381 722898 721927 720886 719943 720031 721906 724940 727286 727757 727078 726584 726288 725437 724581 725323 727668 729297
62821 729297 728475 726354 725204 725383 725487 724792 723973 723661 723748 724197 725315 726986 728572 729736 730555 730786 729975
62804 729975 728423 727233 727180 728147 729594 730815 730941 729839 728962 730005 732502 734100 733697 732947 733984 736873
62788 736873 740266 743365 746049 747950 748799 749272 750272 751618 752436 752525 752327 751822 750578 748869 747739 747830
62772G47830J125J916K863L939M877N585N828N271M328M007M385M384L868M511
62758H04717P174R802R869Q154P828R949J2178J2356J1295J1043J2184J4031J6210
62745I46790J8514K0079K0265J9995K0953K3478K6367K8730L0912L3443L6119
62734A225645L8633M1310M4581M8256N2009N6232O1715O8483P5470Q1553Q6542
62723A880429R1211R6555J03038J10067J15965J18890J18228J14969J10346J04197
62713B963895R5171Q2618O7684N1986L5669J7496l024k4278m3711n9913p3146
62702C110447q4132r3078r9943j04899j08141j09511j08825j06482j03348j00010
62692B092078r6434r2277q7326q1565p5173o8680o2918n8422n4896n1444m7537
$$ plain form
62772 747830 748955 750871 753734 757673 762550 768135 773963 779234 783562 787569 791954 796338 800206 804717
62758 804717 811891 821693 831562 839716 847544 857493 869671 882027 893322 904365 916549 930580 946790
62745 946790 965304 985383 1005648 1025643 1046596 1070074 1096441 1125171 1156083 1189526 1225645
62734 1225645 1264278 1305588 1350169 1398425 1450434 1506666 1568381 1636864 1712334 1793887 1880429
62723 1880429 1971640 2068195 2171233 2281300 2397265 2516155 2634383 2749352 2859698 2963895
62713 2963895 3059066 3141684 3209368 3261354 3297023 3314519 3311495 3287217 3243506 3183593 3110447
62702 3110447 3026315 2933237 2833294 2728395 2620254 2510743 2401918 2295436 2192088 2092078
62692 2092078 1995644 1903367 1816041 1734476 1659303 1590623 1527705 1469283 1414387 1362943 1315406
62681A315406m3546m0158l7367l4406l0765k6866k3427k0497j7615j4750j2379
62670A013630j0526q406n406j975Q25K334K662K522L075N357R222J3191J5883
62657A042388J7295J8262J9281K0616K2856K6277L0044L3313L6843M2088M8700
62646A357963N4525N8485O1900O6286P1232P5451P8739Q1670Q4116Q5316Q4985
62635B160668Q3366Q0570P6477P0803O2659N0987L6346K1320P909m786j8894l4460
62623B592965m9197o1223p0402p7230q2021q5327q7671q8577q7181q3982q0551
62612A739603p7204p2660o6563o0824n7383n5800n4148n1392m7919m4477m1581
62601A109652l9446l7604l5006l1198k6937k3143j9935j7276j5655j5216j4933
$$ plain form
62681 1315406 1271860 1231702 1194335 1159929 1129164 1102298 1078871 1058374 1040759 1026009 1013630
62670 1013630 1003104 994698 989292 987317 988142 990476 993138 995660 998735 1004092 1013314 1026505 1042388
62657 1042388 1059683 1077945 1097226 1117842 1140698 1166975 1197019 1230332 1267175 1309263 1357963
62646 1357963 1412488 1470973 1532873 1599159 1670391 1745842 1824581 1906251 1990367 2075683 2160668
62635 2160668 2244034 2324604 2401081 2471884 2534543 2585530 2621876 2643196 2651105 2646319 2627425 2592965
62623 2592965 2543768 2482545 2412143 2334913 2252892 2167565 2079894 1991317 1904136 1820154 1739603
62612 1739603 1662399 1589739 1523176 1462352 1404969 1349169 1295021 1243629 1195710 1151233 1109652
62601 1109652 1070206 1032602 997596 966398 939461 916318 896383 879107 863452 848236 833303
62590H33303j3756j2093j1105j0933j0702r884q650p127n438m242m024l927k572
62577G28850j47J582J672J125J105J230N04r29k031k303k022j366k02J309K634
62562G31011L422L712L795M356O279R461J2074J2237J0572R875J1716J4589J6352
62549H49451J7355J9612K3405K6676K7968K8286K9406L1815L5209L9558M4381
62538A173122M8067M9619N0313N1881N3575N3134N0446M7828M6109M2848L5843
62527A702785K6448J7487R316J76j0251k0054k7831l4098l9493m3410m5368m6353
62515A489354m7624m8982m9275m8138m6254m4172m1783l9025l6346l4217l2498
62504A021040l0560k7972k5017k2528k1002j9889j8021j4999j1871j0062r740
$$ plain form
62590 833303 819547 807454 796349 785416 774714 764830 756180 749053 743615 739373 735349 731422 728850
62577 728850 728703 730285 731957 733082 734187 735417 735921 734992 732961 730658 728636 727270 727068 728377 731011
62562 731011 734433 738145 741940 746296 752575 762036 774110 786347 796919 806794 818510 833099 849451
62549 849451 866806 886418 909823 936499 964467 992753 1022159 1053974 1089183 1128741 1173122
62538 1173122 1221189 1270808 1321121 1373002 1426577 1479711 1530157 1577985 1624094 1666942 1702785
62527 1702785 1729233 1746720 1756036 1756212 1745961 1725907 1698076 1663978 1624485 1581075 1535707 1489354
62515 1489354 1441730 1392748 1343473 1295335 1249081 1204909 1163126 1124101 1087755 1053538 1021040
62504 1021040 990480 962508 937491 914963 893961 874072 856051 841052 829181 819119 809379
62493H09379r684q780p185n801m975m240l210k083j066J98J998L661M027K998
62479G75237J907J942K775L331L522M330O239Q450J0054J1300J3077J5464J7557
62466H75185J8823J9968K2065K5252K8763L2067L5303L8576M1501M3848M6110
62455A227461M8729N1082N1984N1177M9625M8248M6865M4693M1253L6524L0726
62444A728367K4345J8023J2096O450J021l978q475j2558j5734j6774j4955j1029
62432A706799o445j914K633P106J1167J4910J8908K3528K8783L4668M0981M6797
62420A927921N0974N3386N4949N6143N5995N2983M6630L7946K8549J9492J0613
62409B395581P70j0998k4336l7623m9238n8629o6149p2110p6207p7850p7102p5130
$$ plain form
62493 809379 799695 790915 783730 777929 772954 768714 765504 763421 762355 762553 764551 768212 772239 775237
62479 775237 777144 779086 781861 785192 788714 793044 799283 807733 817787 829087 842164 857628 875185
62466 875185 894008 913976 936041 961293 990056 1022123 1057426 1096002 1137503 1181351 1227461
62455 1227461 1276190 1327272 1379256 1430433 1480058 1528306 1575171 1619864 1661117 1697641 1728367
62444 1728367 1752712 1770735 1782831 1789281 1790302 1786324 1777849 1765291 1749557 1732783 1717828 1706799
62432 1706799 1700354 1698440 1701073 1708179 1719346 1734256 1753164 1776692 1805475 1840143 1881124 1927921
62420 1927921 1978895 2032281 2087230 2143373 2199368 2252351 2298981 2336927 2365476 2384968 2395581
62409 2395581 2396351 2385353 2361017 2323394 2274156 2215527 2149378 2077268 2001061 1923211 1846109 1770979
62397A770979p3436p2395p0923o7856o3305n8189n2857m6980m0670l4868l0351
62386A159149k7048k4538k2611k0981j8977j6041j2332q589n577l771l213l432
62374I92039l793m227n360p696j0756j3302j4391j4149j3569j3567j4131j4463
62362H62635j4036j3267j2934j3111j3042j2058j0252q324o961o310n913n269
62350G41158m536m274m370l988k881j922j620j131K15J335R60O1P48K959M397
62335G27111L963L118L231L728L825M096M963N529N375N860P822R612R556R059
62321H06848J0670J4059J6607J7569J8768K1158K3391K4508K5479K7133K8827
62310A035017L0345L3074L7713M2469M5251M6546M8559N2372N7389O2732O7836
$$ plain form
62397 1770979 1697543 1625148 1554225 1486369 1423064 1364875 1312018 1265038 1224368 1189500 1159149
62386 1159149 1132101 1107563 1084952 1063971 1044994 1028953 1016621 1008032 1002455 998684 995471 992039
62374 992039 988246 984019 978659 970963 960207 946905 932514 918365 904796 891229 877098 862635
62362 862635 848599 835332 822398 809287 796245 784187 773935 765611 758650 752340 746427 741158
62350 741158 736622 732348 727978 723990 721109 719187 717567 716436 716651 717986 718946 719007 719755 722714 727111
62335 727111 731074 734192 737423 741151 744976 749072 754035 759564 764939 770799 778621 788233 797789 806848
62321 806848 817518 831577 848184 865753 884521 905679 929070 953578 979057 1006190 1035017
62310 1035017 1065362 1098436 1136149 1178618 1223869 1270415 1318974 1371346 1428735 1491467 1559303
62299A559303P2235P6174Q0775Q6158Q9929Q9167Q3697P5929O7502N7685M5364
62288B383918L1104J6526K853r215j9113k6994l4244m2338n1079n8575o3255o5511
62276B064077o6990o8421o8666o6326o1803n6989n2888m8585m3154l7626l3921
62265A458708l2330l1236k9406k7403k6427k6740k7766k9055l0456l1601l1786
62254A134502l0344k7118k2817j9004j7194j7570j8736j9017j7831j5704j3318
62243I15849j0971q753o867n592m981m639l969k838j862j699k066j941p92Q57
62229H59736K324L721N577P804R596J0380J0502J0749J1390J1910J1836J1641
62217I67166J2450J4666J7292J9085K0044K1239K3311K5970K8866L2060L5362
$$ plain form
62299 1559303 1631538 1707712 1788487 1874645 1964574 2053741 2137438 2213367 2280869 2338554 2383918
62288 2383918 2415022 2431548 2434401 2425186 2406073 2379079 2344835 2302497 2251418 2192843 2129588 2064077
62276 2064077 1997087 1928666 1860000 1793674 1731871 1674882 1621994 1573409 1530255 1492629 1458708
62265 1458708 1426378 1395142 1365736 1338333 1311906 1285166 1257400 1228345 1197889 1166288 1134502
62254 1134502 1104158 1077040 1054223 1035219 1018025 1000455 981719 962702 944871 929167 915849
62243 915849 904878 896125 889258 883666 878685 874046 870077 867239 865377 863678 861612 859671 858879 859736
62229 859736 862060 865781 871358 879162 888758 899138 909640 920389 931779 943689 955525 967166
62217 967166 979616 994282 1011574 1030659 1050703 1071942 1095253 1121223 1150089 1182149 1217511
62206A217511L8175M0611M3960M9288N6021O2678O8554P3912P8969Q3594Q7736
62195A901009R1219R3049R1876Q7228P9680O9870N8152M5235L2186J9489O905
62184B575898n393j6407k5479l3261m1029m9537n8755o7922p5432p9610q0413
62173B042660p9629p8661p6868p3064o7857o3050n9138n4973m9982m5223m1778
62162A352437l9418l7427l5668l4026l1756k8348k4504k1411j9450j8207j7276
62151A044946j6271j4573j1942r184p296o247n404m864n212n904n230k321J647
62138I52145M896O935Q382R544J0182J0426J1006J2367J4000J5021J5193J5253
62126A085350J6242J8354K0567K1618K1535K1769K3439K5721K6565K5058K2571
$$ plain form
62206 1217511 1255686 1296297 1340257 1389545 1445566 1508244 1576798 1650710 1729679 1813273 1901009
62195 1901009 1992228 2085277 2177153 2264381 2344061 2413931 2472083 2517318 2549504 2568993 2575898
62184 2575898 2570505 2554098 2528619 2495358 2454329 2404792 2346037 2278115 2202683 2123073 2042660
62173 2042660 1963031 1884370 1807502 1734438 1666581 1603531 1544393 1489420 1439438 1394215 1352437
62162 1352437 1313019 1275592 1239924 1205898 1174142 1145794 1121290 1099879 1080429 1062222 1044946
62151 1044946 1028675 1014102 1002160 992976 985680 979433 974029 969165 963953 958049 952819 950498 952145
62138 952145 957041 963976 972358 981902 992084 1002510 1013516 1025883 1039883 1054904 1070097 1085350
62126 1085350 1101592 1119946 1140513 1162131 1183666 1205435 1228874 1254595 1281160 1306218 1328789
62115A328789K1425K2756K5977L0060L4687L9955M5393N0017N3510N6803O0902
62104A770274O5217O7607O6169O0698N2450M2916L3016K2975J2686K321p358j5568
62092B173403k2410k8777l5187m1182m6017m9457n1630n2695n2893n2359n0602
62081A690194m6932m1881l7227l3879l0623k6048k0898j6982j4424j1743q547
62070A401010o184n278m437k377P6J340J438J670K496K887J708j061m318o476
62056A382494o371m219j593j68o38k883o364r963j2241j2743j2580j2989j3794
62043A285948j3888j2721j0512p554m329j893j030j015j82K235N409Q015R398
62030A257881R765R891J0527J1655J2492J2717J3134J4561J6657J8649K0593K2813
$$ plain form
62115 1328789 1350214 1372970 1398947 1429007 1463694 1503649 1549042 1599059 1652569 1709372 1770274
62104 1770274 1835491 1903098 1969267 2029965 2082415 2125331 2158347 2181322 2194008 2196329 2188971 2173403
62092 2173403 2150993 2122216 2087029 2045847 1999830 1950373 1898743 1846048 1793155 1740796 1690194
62081 1690194 1643262 1601381 1564154 1530275 1499652 1473604 1452706 1435724 1421300 1409557 1401010
62070 1401010 1394826 1389548 1385111 1382734 1382810 1384150 1385588 1387258 1389754 1392641 1394349 1393288 1388970 1382494
62056 1382494 1376123 1371904 1370311 1370143 1369505 1366622 1360258 1350295 1338054 1325311 1312731 1299742 1285948
62043 1285948 1272060 1259339 1248827 1241273 1236944 1235051 1234021 1233006 1232824 1235059 1240468 1248483 1257881
62030 1257881 1267646 1277537 1288064 1299719 1312211 1324928 1338062 1352623 1369280 1387929 1408522 1431335
62018A431335K4846K6243K7800L0411L3149L4314L4368L5797L9709M4377M7764
62007A810113M9800N1300N2196N1948N0547M8146M4604L9955L4324K6955J6875
61996B276763N205m948j2075j8124k5449l3531m0416m5889n1000n5524n8359n9933
61984A876720o1856o4173o5042o3319n9700n5203n0298m5767m2589m0500l8192
61973A290081l5423l3412l2668l2047l0492k8174k5263k1288j6728j3741j3805
61962A007040j5697j7083j7220j6823j6131j4830j3460j3219j4066j4279j2435
61951H41797r064n936m152l312k323p46P38J120K27j182k325k932k938k219q79
61936H05874N81J592J685M92j730l616l810k822k713m360o199o530o017o581q510
$$ plain form
62018 1431335 1456181 1482424 1510224 1540635 1573784 1608098 1642466 1678263 1717972 1762349 1810113
62007 1810113 1859913 1911213 1963409 2015357 2065904 2114050 2158654 2198609 2232933 2259888 2276763
61996 2276763 2281968 2277020 2264945 2246821 2221372 2187841 2147425 2101536 2050536 1995012 1936653 1876720
61984 1876720 1814864 1750691 1685649 1622330 1562630 1507427 1457129 1411362 1368773 1328273 1290081
61973 1290081 1254658 1221246 1188578 1156531 1126039 1097865 1072602 1051314 1034586 1020845 1007040
61962 1007040 991343 974260 957040 940217 924086 909256 895796 882577 868511 854232 841797
61951 841797 832733 826797 822645 819333 817010 816264 817002 818122 818349 817167 814842 811910 808972 806753 805874
61936 805874 806455 808047 809732 810224 808494 804878 801068 798246 795533 791173 784974 778444 772427 765846 757336
61921G57336j0194j0490r887r222q481p355o007m758l679k988l217m410n547n399
61907F65702l891k153j231j018o56K64J198J387Q42K55J36M73J161K242L487M301
61891F72499M361M036L947M479N856Q118J0726J2776J4034J5220J6758J7902J7891
61878H08603J7374J7699J8960J9769J8928J6691J4276J2799J2636J3249J3520
61867I84504J2636J0667Q006M816J559n57p79j47n25k336m253n062m619k941K01
61852A001170M249P634R387J0087J0647J1113J1382J2068J3536J4615J3501R777
61840A129166M820L33k956n344p583j0109j2411j3392j2727j1467j0928j1355
61828A036047j2103j2614j2579j1704j0142q775q368q721r347j0407j2093j3560
$$ plain form
61921 757336 747142 736652 726765 717543 709062 701707 695700 690942 687263 684275 681058 676648 671101 665702
61907 665702 661811 659658 658427 657409 656753 657017 658215 659602 660444 660699 660835 661308 662469 664711 668198 672499
61891 672499 676860 680896 684843 689322 695178 703296 714022 726798 740832 756052 772810 790712 808603
61878 808603 825977 843676 862636 882405 901333 918024 932300 945099 957735 970984 984504
61867 984504 997140 1007807 1015813 1020629 1022188 1021631 1020852 1020705 1020180 1017844 1013591 1008529 1003910 1000969 1001170
61852 1001170 1005419 1013053 1022440 1032527 1043174 1054287 1065669 1077737 1091273 1105888 1119389 1129166
61840 1129166 1133986 1134319 1131363 1126019 1118436 1108327 1095916 1082524 1069797 1058330 1047402 1036047
61828 1036047 1023944 1011330 998751 987047 976905 968130 959762 951041 941694 931287 919194 905634
61816I05634j3734j2885j2129j1432r557o310l441k571l169l370k155k6J965L164
61802H29984L686M309N850Q364J1309J4407J7709K0731K2560K3272K4216K6168
61790A012565K8060K8461K7586K6778K6499K6028K4908K3391K1401J8118J3078
61779A276873P105J807j493k589k625l340n371p286p126m776k002j44J280L343
61765A253656O052Q449R744R799Q794O862L876m14n692j0724j4457j7355k0707
61752A237883k4493k7081k7479k6696k6166k5857k5015k3852k3285k3359k3207
61741I61393k2356k1075j9539j7568j5225j2906j0893r386q785r122r443q681
61729G96414p088n951n888o307o494o340n845m831l420k088j087m78o66j872l099
$$ plain form
61816 905634 891900 879015 866886 855454 845897 839587 836146 833575 830406 827036 824881 824855 826820 829984
61802 829984 833670 837979 843829 852193 863502 877909 895618 916349 938909 962181 986397 1012565
61790 1012565 1040625 1069086 1096672 1123450 1149949 1175977 1200885 1224276 1245677 1263795 1276873
61779 1276873 1283978 1285785 1284292 1281703 1279078 1275738 1270367 1263081 1255955 1251179 1249177 1249033 1250313 1253656
61765 1253656 1259708 1268157 1277901 1287700 1296494 1303356 1307232 1306818 1301126 1290402 1275945 1258590 1237883
61752 1237883 1213390 1186309 1158830 1132134 1105968 1080111 1055096 1031244 1007959 984600 961393
61741 961393 939037 917962 898423 880855 865630 852724 841831 832445 823660 814538 805095 796414
61729 796414 789326 783375 777487 771180 764686 758346 752501 747670 744250 742162 741075 740597 739931 738059 734960
61714G34960k810j092R4n76j970k024l04J779K698K120R11L92J166K360K588J868
61698G42160J599K291K652J788R63J751L519M288L498K167Q37p88k294k649k144
61683G59638k352l593m183l097j724j693k361k009o25L07L45O20J674K336J415
61668G44698n83k174k664k379j612k71J404K602K773K296J874J532Q16o5m0J432
61652G49639L353M119L260J617M7j315k469l119l129k954l163l886m920n932o435
61637G24713o041n020m138l727l455l310l955n469o551n967m396l723m563n592
61623F58806n399m068k644j853j815k283k632k240j349j088k056l366l689k910
61609F21414k016j618j418j055p20o36n69j25P90K002L177L830L655K990K477
$$ plain form
61714 734960 732150 731058 731152 730576 728606 726582 726278 728057 730755 732875 733786 734178 735344 737704 740292 742160
61698 742160 743759 746050 748702 750490 751453 753204 756723 761011 764509 766676 767513 766725 764431 761782 759638
61683 759638 757286 753693 749510 746413 744689 742996 740635 738626 738001 738308 738653 739273 740947 743283 744698
61668 744698 744115 741941 739277 736898 735286 735015 736419 739021 741794 744090 745964 747496 748312 748247 748207 749639
61652 749639 752992 757111 760371 761988 762035 760720 758251 755132 752003 749049 745886 742000 737080 731148 724713
61637 724713 718672 713652 709514 705787 702332 699022 695067 689598 683047 677080 672684 668961 664398 658806
61623 658806 653407 649339 646695 644842 643027 640744 638112 635872 634523 633435 631379 628013 624324 621414
61609 621414 619398 617780 616362 615307 614587 613951 613382 613257 614047 616049 619226 623056 626711 629701 632178
61594F32178K118J330K18J4J456L306L470J539o72j265j18J591K907L621L761
61579F55454L289K290J058q1j024j976l204m465m865l817k086j240j856k920l279
61564F31278k994k767k723k549k363k523k831k758k361k144k141j966j842k590
61550E96726m232n539n441m380l677m038n125o174o533n905m679l863m166n235
61536E27739o167o624p011p534p632o558m409k350j724k814m335m425k362O50
61522D64444K525K141J06k039l118k929j936p48J53M17p9j031j798j944j636j290
61506D51238r49l22N81J242J205N98j02n57p06n56k8Q69J803K140J586R08J463
61489D60413L440N036M284J568p20j062k40L90O98J028R03j52j238j014L50J533
$$ plain form
61594 632178 634296 635626 635844 635858 637314 640620 644090 645629 644957 643692 643574 645165 648072 651693 655454
61579 655454 658743 661033 662091 662010 660986 659010 655806 651341 646476 642659 640573 639333 637477 634557 631278
61564 631278 628284 625517 622794 620245 617882 615359 612528 609770 607409 605265 603124 601158 599316 596726
61550 596726 592494 586955 581514 577134 573457 569419 564294 558120 551587 545682 541003 537140 532974 527739
61536 527739 521572 514948 507937 500403 492771 486213 481804 479454 477730 474916 470581 466156 463794 464444
61522 464444 466969 469110 469216 467177 464059 461130 459194 458446 458599 459016 458937 457906 456108 454164 452528 451238
61506 451238 450289 449967 450548 451790 452995 453593 453491 452934 452228 451672 451644 452513 454316 456456 458042 458950 460413
61489 460413 463853 468889 473173 474741 474021 472959 472719 473109 473807 474835 475738 475586 474348 473334 473684 475217
61473D75217K146K913L665K990N93j511j408R8O16o93k356k766j895p54j59l16
61457D76380r00j212q21k14l00j154j834j615q23j94M2kk55m57j3J190K281K357
61439D72456J621Q19n5j437k714k394j91K243L327L342L380L402K686J642J555
61424D89682K469K788J527k33q90m09J91O25J421K438K671J809R99J422K685L371
61408E12566K858J957J675J894J606K55j574k865l344l519l650l096j101K001
61394E05663M774O044N909N212M347K978R60r77j827j428n45J43Q02J930L417
61379E37402M560M966M950M968M985M675L931K901J601r1k085l870m824m621l359
61364E56089j435O07K212L038L207L202L310L180K343J152P37J545K425J867N5
$$ plain form
61473 475217 477363 480276 483941 486931 487524 486013 484605 484703 485319 484626 482270 479504 477609 476855 476696 476380
61457 476380 475480 474268 473447 473233 472933 471779 469945 468330 467507 467313 467355 467353 467098 466641 466628 467818 470099 472456
61439 472456 474077 474896 474841 473404 470690 468296 468105 470348 473675 477017 480397 483799 486485 488127 489682
61424 489682 492151 494939 496466 496233 495343 494934 495125 495750 497171 499609 502280 504089 505088 506510 509195 512566
61408 512566 515424 517381 519056 520950 522556 522811 521237 518372 515028 511509 507859 504763 503662 505663
61394 505663 510437 516481 522390 527602 531949 534927 535887 534910 533083 531655 531110 531253 532055 533985 537402
61379 537402 541962 546928 551878 556846 561831 566506 570437 573338 574939 574848 572763 568893 564069 559448 556089
61364 556089 554654 555261 557473 560511 563718 566920 570230 573410 575753 576905 577642 579187 581612 583479 583534
61349E83534j174o63N53N39j216l435m678m700m151l545k766j540j43O00K73m07
61333E57081l32M78Q59K58l56kP48Q35P27J836L965M952L536J271N25J473K420
61316E80274K507K633L523M368M064L001K616L471M630M979M577M327M693N196
61302F34859N170M630M075L643L047K457K903N064P836R022P824N993N829P415
61288G09767Q779Q567P539P051P091O602N216L696K804K525K413K060J272L74
61274G75756L19J672L471L970K793J371Q65O59j90j078p31N71J176M35m21j96
61258G90442P27J380J790K713M286N802O625O822O962P743R512J1846J3777J4771
61244H85198J5100J4932J3601J0550O656L694K360J648L62j494l253m709o022
$$ plain form
61349 583534 582360 581697 582250 582789 581573 578138 573460 568760 564609 561064 558298 556758 556615 557215 557488 557081
61333 557081 556749 557227 558086 558344 557988 557986 558734 559569 560296 562132 566097 571049 574585 575856 576381 577854 580274
61316 580274 582781 585414 588937 593305 597369 600370 602986 606457 611087 616066 620643 624970 629663 634859
61302 634859 640029 644659 648734 652377 655424 657881 660784 665848 673684 682706 690530 696523 702352 709767
61288 709767 718546 727113 734652 741703 748794 755396 760612 764308 767112 769637 772050 774110 775382 775756
61274 775756 776075 777747 781218 785188 787981 789352 790217 790876 790686 789608 788877 789448 790624 791059 790638 790442
61258 790442 791169 792549 794339 797052 801338 807140 813765 820587 827549 835292 844804 856650 870427 885198
61244 885198 900298 915230 928831 939381 946037 949731 952091 953739 954101 952607 949354 944645 938623
61231I38623o974p195p070p485q572r374r247q835r041r397q385n392j649J094
61217H41101K224K371K413K862L824M885N273M679L774L456L761M102M387N104
61203H94216O229O994P024O924P235P538P192O341N476M452K826R36k04l2J110
61188I64257K595L835M163L120J070j022k478l090k684j341q1k04j664k957l008
61173I60511k281j561o82P06K044K575K580K789L103L056L101M070N465N799M838
61158I96113M145M858O233P115P680Q697R816R815Q275O062M296L530L793M675
61144A085103N449N685N802O477P622Q456Q644Q914J0348J3255J6699J8982J8859
61131A220295J6537J3373J0392P520M547K195J414J959K560K518K313K485K630
$$ plain form
61231 938623 931649 924454 917384 909899 901327 891953 882706 873871 864830 855433 847048 841656 840007 841101
61217 841101 843325 845696 848109 850971 854795 859680 864953 869632 873406 876862 880623 884725 889112 894216
61203 894216 900445 907439 914463 921387 928622 936160 943352 949693 955169 959621 962447 963383 963179 963147 964257
61188 964257 966852 970687 974850 977970 979040 978018 975540 972450 969766 968425 968344 968140 966476 963519 960511
61173 960511 958230 956669 955987 956693 958737 961312 963892 966681 969784 972840 975941 980011 985476 991275 996113
61158 996113 1000258 1005116 1011349 1018464 1026144 1034841 1044657 1054472 1062747 1068809 1073105 1076635 1080428 1085103
61144 1085103 1090552 1096237 1102039 1108516 1116138 1124594 1133238 1142152 1152500 1165755 1182454 1201436 1220295
61131 1220295 1236832 1250205 1260597 1268117 1272664 1274859 1276273 1278232 1280792 1283310 1285623 1288108 1290738
61118A290738J829l78l590o698q409q125o627n478n659o997q777j0290j0871j0195
61104A200473q906q370r401j1552j3824j5486j5930j4568j1633q653p256p408
61092A067486p388n713k823o94q75l010n351o605p002p436q044q303q159q138
61078I87945q177p379n374l175j921j262J70K796N384O400N665M551M846P369
61064I97838J1393J5214J7510J8354J9019K0706K3454K6223K8136K9442L0888
61053A238177L2217L2116L0098K7642K6546K6683K6503K5482K4632K4460K3825
61042A538381K1461J7531J3015Q533M428J126j334l543n745p347q080q923j1086
61029A558417j4540j8211k1026k2248k1656k0201j9641k0518k1211j9980j7217
$$ plain form
61118 1290738 1292567 1292189 1288599 1281901 1273492 1265367 1258740 1253262 1247603 1240606 1231829 1221539 1210668 1200473
61104 1200473 1191567 1183197 1173796 1162244 1148420 1132934 1117004 1102436 1090803 1082150 1074894 1067486
61092 1067486 1060098 1054385 1051562 1050868 1049993 1046983 1041632 1035027 1028025 1020589 1012545 1004242 996083 987945
61078 987945 979768 972389 967015 963840 961919 960657 960827 963623 969007 975407 981072 985623 990469 997838
61064 997838 1009231 1024445 1041955 1060309 1079328 1100034 1123488 1149711 1177847 1207289 1238177
61053 1238177 1270394 1302510 1332608 1360250 1386796 1413479 1439982 1465464 1490096 1514556 1538381
61042 1538381 1559842 1577373 1590388 1598921 1603349 1604475 1603141 1599598 1593853 1586506 1578426 1569503 1558417
61029 1558417 1543877 1525666 1504640 1482392 1460736 1440535 1420894 1400376 1379165 1359185 1341968
61018A341968j4563j2617j0977r828r683r703q154m796j391P04K126M254P434
61005A274774J0984J4037J5859J6129J5623J6029J8444K2306K6065K8710L0490
60994A489450L2463L5449L9217M2773M5589M8180N1241N4798N8732O3412O8890
60983B030194P4154P8319Q2231Q7625R4919J03035J11239J19794J28623J36727
60973C046860J43392J49160J55224J62498J71360J81734J93452K06934K22996
60964D633610K41464K60939K80905L02938L28689L58451L93610M38366M95641
60955G734613N62873O36182P17732Q13620R24870J047467J182942J340963J527232
60946A6488494J736575J961740K191862K379699K417147K183878J656951R71966
$$ plain form
61018 1341968 1327405 1314788 1303811 1293983 1284300 1274597 1266443 1261647 1260256 1260960 1263086 1267340 1274774
61005 1274774 1285758 1299795 1315654 1331783 1347406 1363435 1381879 1404185 1430250 1458960 1489450
60994 1489450 1521913 1557362 1596579 1639352 1684941 1733121 1784362 1839160 1897892 1961304 2030194
60983 2030194 2104348 2182667 2264898 2352523 2447442 2550477 2661716 2781510 2910133 3046860
60973 3046860 3190252 3339412 3494636 3657134 3828494 4010228 4203680 4410614 4633610
60964 4633610 4875074 5136013 5416918 5719856 6048545 6406996 6800606 7238972 7734613
60955 7734613 8297486 8933668 9651400 10465020 11389890 12437357 13620299 14961262 16488494
60946 16488494 18225069 20186809 22378671 24758370 27175517 29359395 31016346 31988312
60938C1988312L51232m3381j88341j48673O523K11151L51718K74909j08347p28093
60928C1967010j386798j893895k171135k247922k191528k057802j885482j702275
60920A6430173j523428j353185j193908j050672r26421q18849p24793o43824n75655
60911G619438n17832m68097m25916l89928l56863l25100k96535k72809k51990
60902D314368k31187k10286j90783j72780j55717j40845j30230j23645j18523
60893B840372j12792j06198r9213r2258q5995q0898p6359p1265o5685o1015n8187
60882A930507n6375n3886n0135m6415m4485m4404m4320m2729m0267l8430l7232
60871A431829l5615l3708l2801l2843l2012k9481k6836k5713k5601k5129k4092
$$ plain form
60938 31988312 32339544 32296163 32107822 31959149 31965672 32176823 32528541 32803450 32695103 31967010
60928 31967010 30580212 28686317 26515182 24267260 22075732 20017930 18132448 16430173
60920 16430173 14906745 13553560 12359652 11308980 10382559 9563710 8838917 8195093 7619438
60911 7619438 7101606 6633509 6207593 5817665 5460802 5135702 4839167 4566358 4314368
60902 4314368 4083181 3872895 3682112 3509332 3353615 3212770 3082540 2958895 2840372
60893 2840372 2727580 2621382 2522169 2429911 2343916 2263018 2186659 2115394 2049709 1988694 1930507
60882 1930507 1874132 1820246 1770111 1723696 1679211 1634807 1590487 1547758 1507491 1469061 1431829
60871 1431829 1396214 1362506 1329705 1296862 1264850 1235369 1208533 1182820 1157219 1132090 1107998
60860A107998k2860k1115j8663j6483j5373j4508j2875j1257j0959j1297j0411
60849I42197q273o687o201n153k482K69R67k74j508j410k86J008K076K790K861
60834I19894K035N27j013k100k935m132n946p866r114r309q744q156q240r022
60820H45879r801j0048j0152j0563j0534q938o436n321o471p828p098m847l345
60807G44497l138k600q04J001J206r3j510j995j470m88K84N19M04J81l86j615
60791G33993l156m158m156l239j577M59J867J632Mj546j906j261m13P8j09j066
60775G15446k254k741k334j884k088k533k460j939j546j295o81K10M44n77k176
60760F91592l092k965k662l031l739l831l207k844l282l570k434j61J473J196
$$ plain form
60860 1107998 1085138 1064023 1045360 1028877 1013504 998996 986121 974864 963905 952608 942197
60849 942197 933924 927237 921036 915883 913401 913670 914637 914363 912855 911445 911159 912167 914243 917033 919894
60834 919894 921929 922456 921443 919343 916408 912276 906330 898464 889350 880041 871297 863141 854901 845879
60820 845879 836078 826030 815878 805315 794781 785843 779407 774086 767615 759787 752689 747842 744497
60807 744497 741359 738759 737955 738956 740162 740069 738559 736564 735094 734606 734890 735409 735813 735994 735608 733993
60791 733993 730837 726679 722523 719284 717707 718166 720033 721665 721669 720123 718217 716956 716543 716621 716512 715446
60775 715446 713192 710451 708117 706233 704145 701612 699152 697213 695667 694372 693691 693901 694345 693768 691592
60760 691592 688500 685535 682873 679842 676103 672272 669065 666221 662939 659369 656935 656774 658247 659443
60746F59443n65k601m358n943p214p612o958n916n315n104m415k847j360j370
60732E97865l006m817n460n086m602m131l005j108N89J080M04n59j124j352j661
60717E64027k068j964q75P67K049K830L815N120N712M912L759L720M556M700L662
60702F04722K715K888L458L123J831O50K18J79N8j6K93P97R05N27L63Q61J169
60685F24741L9k188l608l258k480k837l815m038l952n295p992r596q437n706l662
60670E57916l080l340l796l997l420k190j475k188l548l794k201K30J780J309
60656E28206r87l555m515l199n77J874L204K909R91j343k098n82J497J983Q12
60641E24620l07k28O16J274J349J011P14R50J763K617L099L444L887M038L560
$$ plain form
60746 659443 658878 656277 651919 645976 638762 631150 624192 618276 612961 607857 603442 600595 599235 597865
60732 597865 594859 590042 584582 579496 574894 570763 567758 566650 567239 568319 568723 568164 567040 565688 564027
60717 564027 561959 559995 559120 559887 561936 564766 568581 573701 579413 584325 588084 591804 596360 601060 604722
60702 604722 607437 610325 613783 616906 618737 619387 619605 619784 619842 619826 620119 620916 621821 622348 622711 623572 624741
60685 624741 624780 622592 618984 615726 613246 610409 606594 602556 598604 593309 585317 575721 567284 561578 557916
60670 557916 554836 551496 547700 543703 540283 538093 536618 534430 530882 527088 524887 525117 526897 528206
60656 528206 527219 523664 519149 515950 515373 517247 520451 523360 524351 523008 520910 520328 521825 523808 524620
60641 524620 524313 524085 524701 525975 527324 528335 529049 529999 531762 534379 537478 540922 544809 548847 552407
60626E52407L025L256M143M935N326N444N154M378L762L919M190L386J713O64
60612F05702Q12R65j1j663k956l795m691n541n675m894l750k789k042j351q93
60597E67428j078j859k248j118J218K786K000k81j511l44K032L544L477K743K388
60582E79177K305J428q31l512m960m945n055o302p245n861k673l22n8m46R5J160
60566E41955J560J283J116J255J296R65J73r64j668r83O98J661J221Q75J986L476
60550E55905L297J461r4k42M02J102J960L018L755L946L974M009L712K951K012
60535E91168R69k04p89K91K755M630M250K050j44j013n49N04J438K044K649L537
60519F13586M445N059N900P871J0725J2921J3459J3140J3360J4276J4954J4810
$$ plain form
60626 552407 555432 558688 562831 567766 573092 578536 583690 588068 591830 595749 599939 603325 605038 605702
60612 605702 606514 607479 607468 605805 602849 599054 594363 588822 583147 578253 574503 571714 569672 568321 567428
60597 567428 566350 564491 562243 561125 562343 565129 567129 566848 565337 564993 567025 570569 574046 576789 579177
60582 579177 581482 582910 582079 578567 573607 568662 563607 557305 550060 544199 541526 541204 541146 540700 540795 541955
60566 541955 543515 544798 545914 547169 548465 549430 549603 548639 546971 545988 546686 548347 549568 550443 552429 555905
60550 555905 559202 560663 560569 560327 560729 561831 563791 566809 570564 574510 578484 582493 586205 589156 591168
60535 591168 592137 591933 591144 591435 594190 598820 603070 605120 604976 603963 603414 603918 605356 607400 610049 613586
60519 613586 618031 623090 628990 636861 647586 660507 673966 687106 700466 714742 729696 744506
60507G44506J4175J3555J3054J2456J1252Q673M397n71m331n762n482m960m917
60494G96045m953m388k966p14K229N379P907R433J0583J2265J4538J6740J8615
60481H80713K0551K2572K3973K4221K3413K1443J7669J2300P159L951K251M13
60469A060629j937l669m335n106p025r398j0481r239o125k735p30m93o67L25K361
60454A001375L972M539N091O745R416J2395J5297J8054K0880K4519K9565L5263
60442A187111M0068M3669M7209N1055N3924N5016N5445N6204N6067N3143M7493
60431A746404M0552L2583K2592J0466k462j5025k6970l7948m7219n4548o0285
60420A608140o4244o5582o4201o1408n8696n6455n4046n0738m6380m1597l7281
$$ plain form
60507 744506 758681 772236 785290 797746 808998 817671 822068 821497 817166 811404 805922 800962 796045
60494 796045 791092 786704 783738 783024 785253 790632 798539 807972 818555 830820 845358 862098 880713
60481 880713 901264 923836 947809 972030 995443 1016886 1034555 1046855 1054014 1057965 1060216 1060629
60469 1060629 1058692 1055023 1050688 1045582 1038557 1029159 1018678 1009439 1003314 1000579 999849 999356 998689 999014 1001375
60454 1001375 1005347 1009886 1014977 1021722 1031138 1043533 1058830 1076884 1097764 1122283 1151848 1187111
60442 1187111 1227179 1270848 1318057 1369112 1423036 1478052 1533497 1589701 1645768 1698911 1746404
60431 1746404 1786956 1819539 1842131 1852597 1850135 1835110 1808140 1770192 1722973 1668425 1608140
60420 1608140 1543896 1478314 1414113 1352705 1294009 1237554 1183508 1132770 1086390 1044793 1007512
60409A007512l3719l0535k7738k5992k5125k3438j9791j5665j3539j3636j3869
60398G64465j2841j1070r356p815o862p194q171q021o432n235n530n943n011l632
60384F61352l439m047l901k973k559k838k629j626j024j528k228k019j127n31
60370F28883p02j387k037k078j313l51j00n27m79Q20K518L017J910N08K60J088
60354F30030J671J188K12l03k09K18J221L069M785M670K437k08j595j647q54R22
60338F45607L499N268M788L070K642M257N934N677L878K478K586L592M176L623
60324G01075K325J300J098J281J204J110J800L386N047O134O757P159P115O374
60310G53165N176M040L370L419M175N069N236M451L534L577M888O801Q307Q837
$$ plain form
60409 1007512 973793 943258 915520 889528 864403 840965 821174 805509 791970 778334 764465
60398 764465 751624 740554 731198 723383 716521 709327 701156 693135 686703 681468 675938 669995 664984 661352
60384 661352 657913 653866 649965 646992 644433 641595 638966 637340 636316 634788 632560 630541 629414 628883
60370 628883 628181 626794 624757 622679 621366 621015 620915 620388 619909 620729 623247 626264 628174 628682 628942 630030
60354 630030 631701 632889 633101 632798 632589 632807 634028 637097 641882 646552 648989 648781 647186 645539 644685 645607
60338 645607 649106 654374 659162 662232 664874 669131 675065 680742 684620 687098 689684 693276 697452 701075
60324 701075 703400 704700 705798 707079 708283 709393 711193 714579 719626 725760 732517 739676 746791 753165
60310 753165 758341 762381 765751 769170 773345 778414 783650 788101 791635 795212 800100 806901 815208 824045
60296H24045Q645Q489Q832R538J0475J1827J3207J2959R601L979j096l706m509
60283I12286n216o424p558q086p893o958n563m535m461m818m613l789l292l691
60269H35389m474m914n047n352n774n542m076j803J86J266J923L077M996P176
60255H17031R079J0555J1560J2045J2315J3043J4670J7014J9523K1433K1646J9238
60243I99152J4514R079M418O85k874o918j1665j6813k1227k3451k3260k2080k1146
60230H78414j9967j7552j4349j1570r092n873k360o69j774m107n731o521p188
60217G71661p483o663n011l498k441j677j549k482l854m526m436m401m474l819
60203G15347k477j837k691l985m243l457k621k061j233J29J502K259K248J712
$$ plain form
60296 824045 832690 841179 850011 859549 870024 881851 895058 908017 917618 921597 920501 916795 912286
60283 912286 907070 900646 893088 885002 877109 870151 864588 860053 855592 850774 846161 842372 839080 835389
60269 835389 830915 826001 820954 815602 809828 804286 800210 798407 798593 799859 801782 804859 809855 817031
60255 817031 826110 836665 848225 860270 872585 885628 900298 917312 936835 958268 979914 999152
60243 999152 1013666 1022745 1027163 1027848 1024974 1018056 1006391 989578 968351 944900 921640 899560 878414
60230 878414 858447 840895 826546 814976 805884 800011 797651 796982 795208 791101 785370 778849 771661
60217 771661 764178 757515 752504 749006 746565 744888 743339 740857 737003 732477 728041 723640 719166 715347
60203 715347 712870 711033 708342 704357 700114 696657 694036 691975 690742 690871 692373 694632 696880 698592
60189F98592J039N73M06M13P00J651L305M872N365M532K953J452O37O64J036R47
60173G29137K49j83M62J772K538K181J190L00k32n58q59r96l13J778M698O739
60157G47903O913O280O530P749Q647Q733Q783R179R280Q839Q675R240R759R605
60143H66115R431R889J0248R470Q038P416Q014Q754Q563P431O026M953M331L659
60129I72338K364Q64L47J012J364J63j785l030l816n421p638q812q343p352o627
60114I25628n758m827m996o416p222n985l928l210l886m127k929j121R0K75m02
60099H71186j391j815j248m74n37j188j235l21O46R07N99J4p20j008l3J805K897
60082H68084K538K024K747M239N257N915P257R124J0112R681Q785Q097P082N388
$$ plain form
60189 698592 699631 700204 700610 701023 701723 703374 706679 711551 716916 721448 724401 725853 726490 727154 728190 729137
60173 729137 729386 729203 729665 731437 733975 736156 737346 737646 737414 736856 735997 735001 734688 736466 741164 747903
60157 747903 754816 761096 767626 775375 784022 792755 801538 810717 819997 828836 837511 846751 856510 866115
60143 866115 875546 885435 895683 905153 913191 920607 928621 937375 945938 953369 959395 964348 968679 972338
60129 972338 974702 975566 975913 976925 978289 978452 976667 973637 969821 964400 956762 947950 939607 932255 925628
60114 925628 919870 915043 910047 903631 896409 890424 886496 883286 879400 875273 872344 871223 871313 871588 871186
60099 871186 869795 867980 866732 866258 865721 864533 863298 862977 863623 864530 865129 865143 864423 863415 863382 865187 868084
60082 868084 870622 872646 875393 879632 884889 890804 898061 907185 917297 926978 935763 943860 950942 956330
60068I56330L857L228K985K562K665M029N546N326L472K170K777M187M634L853
60054A007621K717J756J026P81J291K172K539J725l74l091m863m285j944l79j242
60039A005450l183l682k396j353k086m044n841o733o512n179l305j866j262j139
60025I56869j271j730k008j222M29J502J193K65n76j872l986n633n421m101l741
60010I28697m975o571p584q344r085r115q100p006o972p834q527q490q010p465
59996H20619o789n710m254k940k407k534k228o32J529K651K445K467L891N695
59982H11803O088N102M543N368O451O348N187M048L247K317J268O78M67l42k081
59967H60492l508l273j876j270k607n113p257q282q339p874p375p266p480p421
$$ plain form
60068 956330 960187 963415 966400 968962 971627 975656 981202 986528 990000 992170 994947 999134 1003768 1007621
60054 1007621 1010338 1012094 1013120 1013901 1015192 1017364 1019903 1021628 1021254 1018163 1013300 1009015 1007071 1006692 1005450
60039 1005450 1002267 998585 996189 994836 992750 988706 982865 976132 969620 964441 961136 959270 958008 956869
60025 956869 955598 953868 951860 950638 951067 952569 953762 954027 953451 951579 947593 941960 936539 932438 928697
60010 928697 923722 917151 909567 901223 892138 883023 874923 867917 860945 853111 844584 836094 828084 820619
59996 820619 813830 808120 803866 800926 798519 795985 793757 793125 794654 797305 799750 802217 806108 811803
59982 811803 817891 822993 827536 832904 839355 845703 850890 854938 858185 860502 861770 862448 862915 862573 860492
59967 860492 856984 853711 851835 850565 847958 842845 835588 827306 818967 811093 803718 796452 788972 781551
59953G81551o866o592p457r013r715q700o816n636n753o429o618n978m838l618
59939F87522k400j093K43J318J833J710J115M41K20P61J805K729L280L810M506
59924G07800M833M167K903K162K362K679K196J089J60l02o31r62j008p80q49j561
59908G24258k421k646k075j086O3J228J862J294j36q75K57K449L547K278n35k969
59892G24493l685k502m7K549M014L773K529J556J290J079L36o79j506k231k887
59877G28082k700r93J239J942N78r38o53R52J903J572J238K045L741N584P202
59862G50794Q215Q224P805Q274R648R910P538L905J752J794K275J721O03N2L36
59847H22846J073J958K684K975L152L923N198N851N169L855L045K950L053L058
$$ plain form
59953 781551 774685 768093 760636 751623 741908 733208 726392 720756 715003 708574 701956 695978 691140 687522
59939 687522 685122 684029 684272 685590 687423 689133 690248 690689 690909 691670 693475 696204 699484 703294 707800
59924 707800 712633 716800 719703 721865 724227 726906 729102 730191 730351 730049 729418 728456 727448 726668 725819 724258
59908 724258 721837 719191 717116 716030 716093 717321 719183 720477 720341 719466 719723 722172 725719 727997 727462 724493
59892 724493 720808 718306 718259 720808 724822 728595 731124 732680 733970 735049 735385 734706 733200 730969 728082
59877 728082 725382 724389 725628 727570 728148 727210 726557 727509 729412 730984 732222 734267 738008 743592 750794
59862 750794 759009 767233 775038 783312 792960 802870 810408 814313 816065 817859 820134 821855 822458 822510 822846
59847 822846 823919 825877 828561 831536 834688 838611 843809 849660 854829 858684 861729 864679 867732 870790
59833H70790L002K867K771L150M136N128N538N631N905O088N640M987N132N975
59819I36740O193N259M428M907N793N126K629R6j157j810k842l550k657p21L15
59804I58749p6k59J008K781L587L519L543L760L872M571O739R591J1217J0925
59790A023527R533P420M066j24l283m177l640l180l323m043n611p963j0153j1332
59776I87717j1734j1840j1372r919p964o385n470n026m969n016m471l112j929
59763H98510k202m093o494p862p059m184j003L86k59j350j897k494l380l469k453
59748H50697k052l390m738l942j897j091j724j855r36l96p62r09n50q34j867k087
59732H21667r51L2M3L02J401J568m35k642k473o45r6j620l065k716j421r03j582
$$ plain form
59833 870790 873792 876659 879430 882580 886716 891844 897382 903013 908918 915006 920646 925633 930765 936740
59819 936740 942933 948192 952620 957527 963320 968446 971075 971171 970014 968204 965362 961812 959155 958434 958749
59804 958749 958673 958414 959422 962203 965790 969309 972852 976612 980484 985055 991794 1001385 1012602 1023527
59790 1023527 1033060 1040480 1044546 1044422 1041139 1036962 1033322 1030142 1026819 1022776 1017165 1009202 999049 987717
59776 987717 975983 964143 952771 942852 934888 928503 923033 918007 913038 908022 903551 900439 898510
59763 898510 896308 892215 885721 877859 870800 866616 865613 865999 865740 864390 862493 859999 856619 853150 850697
59748 850697 848645 845255 840517 836575 834678 833587 831863 830008 829072 828676 827914 827005 826455 825621 823754 821667
59732 821667 820716 820748 820791 821093 822494 824062 823627 820985 818512 817867 817771 816151 813086 810370 808949 808046 806464
59715H06464k598k978k252o49J013K078K672L173L423L160K867L301M297M981
59701H28952M988M647M081L332L342N403R051J1681J1340R176Q056R148J0963
59688I24160J1686J1343J1142J1496J1559J0514Q687P186O709O850O561N320L863
59675A037076L366L735L218M51l436n650m796k250k54L70J80k20n16m45j85o03
59659A030041k214m279n738o554p081o754m823k095l54n9n9J78k04j524k405j570
59643I84506L84J916K406K227J883J947L003M668N365M183K358J870K930L902
59629A023548L395J554n65j966k176j466o78m67q00j478k599m051n160n506n565
59614I96020n868o179o258o699p927q933q339o403m727m106l895l423k732j862
$$ plain form
59715 806464 803866 800888 798636 797987 799000 801078 803750 806923 810346 813506 816373 819674 823971 828952
59701 828952 833940 838587 842668 846000 849342 854745 863796 875477 886817 895993 904049 913197 924160
59688 924160 935846 947189 958331 969827 981386 991900 1000587 1007773 1014482 1021332 1027893 1033213 1037076
59675 1037076 1040442 1044177 1047395 1047846 1044410 1038760 1033964 1031714 1031460 1031830 1032010 1031790 1031274 1030829 1030644 1030041
59659 1030041 1027827 1023548 1017810 1011256 1004175 997421 992598 990503 990149 990090 990031 990209 990005 988481 986076 984506
59643 984506 984890 986806 989212 991439 993322 995269 998272 1002940 1008305 1012488 1014846 1016716 1019646 1023548
59629 1023548 1026943 1028497 1027932 1025966 1023790 1022324 1021646 1021179 1020379 1018901 1016302 1012251 1007091 1001585 996020
59614 996020 990152 983973 977715 971016 963089 954156 945817 939414 934687 930581 926686 923263 920531 918669
59600I18669p09K53L67J01O52J960K599K178K187L508M552L464J046k77R1L65
59584I41006q14k643l645l596l234l079l266l938m989n671n179l694k482k747
59570H92029m419o157o724o384o514p630q395p296m906l319l509m391m798n061
59556H12526n803o373n699m078k907k887l511l984l720k255J31J998K137J277
59542G76852J042J350O07j307k279j003R82J638J196J004R57J58p70k78J305J717
59526G83171p0k326k797j236P90J606M62j973l692k964m96R62k21k587l628k913
59510G62088k203k781l892m048l012j846j224n75P77K176K328J287N35P78R61
59495G51349K95j44Q74K561L394L609M413N374N032L982M688P745J0764J1913
$$ plain form
59600 918669 917960 918213 918580 918681 919333 921293 923892 926070 928257 931765 936317 939781 940827 940550 940641 941006
59584 941006 940192 937549 933904 930308 927074 923995 920729 916791 911802 906131 900952 897258 894776 892029
59570 892029 887610 881453 874729 868345 861831 854201 845806 838510 833604 830285 826776 822385 817587 812526
59556 812526 806723 800350 794651 790573 787666 784779 781268 777284 773564 771309 771440 773438 775575 776852
59542 776852 777894 779244 779851 778544 776265 775262 776244 777882 779078 780082 781039 781197 780427 780149 781454 783171
59526 783171 783101 780775 777978 776742 777532 779138 779600 777627 773935 770971 770475 771437 771216 768629 765001 762088
59510 762088 759885 757104 753212 749164 746152 744306 743082 742507 743284 745460 747788 749075 749610 750388 751349
59495 751349 751644 751500 752374 754935 758329 761938 766351 771725 776757 780739 785427 793172 803936 815849
59481H15849J2339J3950J6763J9680K1903K2092J8075R519l82p784j1736j3366
59469I16902j3007j0347o439l134q79R59K077J638L63P2J132K343L200M099M218
59454I03197J851k503n740o103n468o225p707p693o181n386o367p653p524o116
59440H24382m807m394m555m569m132l523l121k714j598L61K110K350J068l98p68
59425G95692J31J751L474M700M861M113L673M692O790Q370Q533P968P662P574
59411H69984P125O267N292M109K662J521J105P37k82j044K0K685M994N898O130
59396I17203O235N686M677M788O636Q583R182R312J0325J1555J1496J0242Q706
59383A024626O595L375K99j103j872m219p487q562o648m682m977o122n719l953
$$ plain form
59481 815849 828188 842138 858901 878581 900484 922576 940651 950170 949788 942004 930268 916902
59469 916902 903895 893548 887109 883975 883096 884055 886132 887770 888133 888205 889337 891680 894880 898979 903197
59454 903197 905048 902545 896805 890702 885234 879009 871302 863609 857428 852042 845675 838022 830498 824382
59440 824382 819575 815181 810626 806057 801925 798402 795281 792567 790969 791330 793440 795790 796858 796460 795692
59425 795692 795823 797574 801048 805748 810609 814722 818395 823087 829877 838247 846780 854748 862410 869984
59411 869984 877109 883376 888668 892777 895439 896960 898065 898802 898520 897476 897496 900181 905175 911073 917203
59396 917203 923438 929124 933801 938589 945225 953808 962990 972302 982627 994182 1005678 1015920 1024626
59383 1024626 1031221 1034596 1034895 1033792 1031920 1027701 1020214 1011652 1005004 1000322 995345 989223 983504 979551
59369I79551k472j464l2J591K361K510L553O204R648J2918J5919J8941K1939K4532
59355A095699K6421K7903L0101L3811L7492L7197K9827J6574K317q402j4122j5703
59343A299115j4313j0835o057m21N908J1590J3158P241n451j9466k9061l2753
59331A218655l2713l0788k7149k2432j8574j6443j4591j1725q852p334o300m009
59319A017745q09J450K369L070L660L151K050K440M792O910P086O286N970N618
59305A071788M060J904P72J099K221L806N599O426N267L152K439M017O584Q819
59291A127953J0879J3265J5356J6024J5159J3824J2980J2674J2519J2473J2763
59280A275869J3292J3665J3815J4034J4032J2699R559N949L696K720J060k494
$$ plain form
59369 979551 977079 975615 975583 977174 979535 982045 985598 991802 1001450 1014368 1030287 1049228 1071167 1095699
59355 1095699 1122120 1150023 1180124 1213935 1251427 1288624 1318451 1335025 1337342 1328940 1314818 1299115
59343 1299115 1284802 1273967 1267910 1267489 1273397 1284987 1298145 1305386 1299935 1280469 1251408 1218655
59331 1218655 1185942 1155154 1128005 1105573 1086999 1070556 1055965 1044240 1035388 1028054 1021754 1017745
59319 1017745 1016936 1018386 1020755 1023825 1027485 1030636 1032686 1035126 1039918 1046828 1053914 1060200 1066170 1071788
59305 1071788 1075848 1077752 1078524 1079623 1081844 1085650 1091249 1097675 1102942 1106094 1108533 1112550 1119134 1127953
59291 1127953 1138832 1152097 1167453 1183477 1198636 1212460 1225440 1238114 1250633 1263106 1275869
59280 1275869 1289161 1302826 1316641 1330675 1344707 1357406 1366965 1372914 1376610 1379330 1380390 1377896
59268A377896o848j0034j1424j1975j2883j4339j5253j4207j1282q742q786j0591
59256A241532j1087r013o551n956o225m845j721P18J120R07J923L858M722K918
59242A212300j770q339j4837j9073k0104j9156j8419j8821j9414j9005j7694j6306
59230A019362j4891j2792j0132q089p193o316m239j541Q7P6n21n71R1J198K618
59215I57147M180N637P018Q513J0107J1889J4231J6825J8000J6425J3305J1330
59203A094607J1312J1373R806P120M668K840J494P73L46j019l899o953q384p975
59189A116109o857n956n596n914o605o725n698m135k941j981m67J715L751M778
59175A073478M590L838L631M363M861L755J792J377L283N265M925K483l82k992
$$ plain form
59268 1377896 1371048 1361014 1349590 1337615 1324732 1310393 1295140 1280933 1269651 1260909 1252123 1241532
59256 1241532 1230445 1221432 1214881 1208925 1202700 1197855 1196134 1196852 1197972 1198879 1200802 1204660 1209382 1212300
59242 1212300 1210530 1202191 1187354 1168281 1148177 1129021 1110602 1091781 1072367 1053362 1035668 1019362
59230 1019362 1004471 991679 981547 973458 966265 959949 955710 954169 954256 954332 953811 953240 953331 954529 957147
59215 957147 961327 966964 973982 982495 992602 1004491 1018722 1035547 1053547 1069972 1083277 1094607
59203 1094607 1105919 1117292 1127098 1134218 1138886 1141726 1143220 1143993 1144339 1143320 1139421 1132468 1124084 1116109
59189 1116109 1109252 1103296 1097700 1091786 1085181 1078456 1072758 1068623 1065682 1063701 1063234 1064949 1068700 1073478
59175 1073478 1078068 1081906 1085537 1089900 1094761 1098516 1100308 1101685 1104968 1110233 1115158 1117641 1117259 1114267
59161A114267n417p081p472p403p814p914o400m011k962l868n101n390n422o401
59147A031611q151r251q433n777l017k283l768n168m353j946j06M50O28P82L78
59132I81596l01r8J011J696J439J311J959K576K672L301N253P184P030M756K535
59117A023920K288L815N351N589M987N082O440P795P830P190P543Q849R109P115
59103A112903M061J857R93Q45J000J278J235N95l61j510l426o319r062j0266j0068
59088A083755r820j0224j0709j0735j0679j0953j1079j0379r254q828r267r372
59076I62456q423p598q454j0226j0174p090l160j301j648j956q05J136K774L912
59062I09443M631M733M457M767O305Q564J0568J1816J2320J2195J1565J0504R002
$$ plain form
59161 1114267 1108850 1101769 1094297 1086894 1079080 1071166 1064766 1060755 1057793 1053925 1048824 1043434 1038012 1031611
59147 1031611 1023460 1014209 1005776 999999 996982 994699 990931 985763 981410 979464 979358 979808 980436 981218 981596
59132 981596 981295 981197 982208 983904 985343 986654 988613 991189 993861 997162 1002415 1009599 1016629 1021385 1023920
59117 1023920 1026208 1030023 1035374 1040963 1045950 1051032 1057472 1065267 1073097 1080287 1087830 1096679 1105788 1112903
59103 1112903 1116964 1118821 1119814 1120659 1121659 1122937 1124172 1124767 1124406 1122896 1119470 1113151 1104089 1093823 1083755
59088 1083755 1073935 1063711 1053002 1042267 1031588 1020635 1009556 999177 989923 981095 971828 962456
59076 962456 954033 946435 937981 927755 917581 910491 907331 906030 904382 902426 901621 902757 905531 909443
59062 909443 914074 918807 923264 928031 934336 942900 953468 965284 977604 989799 1001364 1011868 1020870
59049A020870P378O506O963Q006Q273P451O406N685M932L893K808J581k48k161
59035A088343k636j312m4o62k533l545k999k134k031k259j888r23k60p07k274
59020A062136m204n535n832n405m840m522m663n315o054o095n214m208l936m125
59006I92188l732k478j380j639l324n340o390n935m443k913j950j274k19J231
58992I52402K199J927Q63M40J618L872N762O369N857M766L254J287q06k313k665
58977I84832j780n7J739K848L075K969L195L792M251M311M398N226O935Q742R623
58962A044099R585R910J1600J3834J4838J4351J4007J4722J4931J2545Q004L979
58950A186405K245K087J850R47j74j086j731j931j194P91L425N275N238L831K707
$$ plain form
59049 1020870 1028248 1034754 1041717 1049723 1057996 1065447 1071853 1077538 1082470 1086363 1089171 1090752 1090504 1088343
59035 1088343 1085707 1084395 1084351 1083689 1081156 1077611 1074612 1072478 1070447 1068188 1066300 1065377 1065117 1064410 1062136
59020 1062136 1057932 1052397 1046565 1041160 1036320 1031798 1027135 1021820 1015766 1009671 1004457 1000249 996313 992188
59006 992188 988456 985978 984598 982959 979635 974295 967905 961970 957527 954614 952664 951390 951171 952402
58992 952402 954601 956528 957391 957831 959449 963321 969083 975452 981309 986075 989329 990616 989810 987497 984832
58977 984832 983052 982995 984734 987582 990657 993626 996821 1000613 1004864 1009175 1013573 1018799 1025734 1034476 1044099
58962 1044099 1053684 1063594 1075194 1089028 1103866 1118217 1132224 1146946 1161877 1174422 1182426 1186405
58950 1186405 1188650 1190737 1192587 1193534 1193360 1192274 1190543 1188612 1187418 1188209 1191634 1196909 1202147 1205978 1208685
58935A208685K726L210L350L387L686L671K786J779J603J641O30r07r55J065L280
58920A239637L929L472L373L911M291M211M235M864O011P368Q865J0595J2425
58907A317187J3645J3418J1917J0595J0621J1302J0920R055O987N709M604K604
58895A428564k25k862m659n975p694j0306j3307j5609j6826j7746j8894j9279
58883A295182j7710j4984j3219j2856j2031r538o835n967o612o634n089l248k587
58870A177872k826k477q09J248K167J497J94n05l9J631M243O742P568O435N116
58855A208057N305O268O093M788M340N679P465Q223Q105P889P759P742Q094Q656
58841A304463Q959R462J1121J3193J3174J0082O207M414M948O226P415Q711J0090
$$ plain form
58935 1208685 1211411 1214621 1217971 1221358 1225044 1228715 1231501 1233280 1234883 1236524 1237154 1236247 1235292 1236357 1239637
58920 1239637 1243566 1247038 1250411 1254322 1258613 1262824 1267059 1271923 1277934 1285302 1294167 1304762 1317187
58907 1317187 1330832 1344250 1356167 1366762 1377383 1388685 1399605 1408660 1415647 1421356 1425960 1428564
58895 1428564 1428339 1425477 1420818 1414843 1407149 1396843 1383536 1367927 1351101 1333355 1314461 1295182
58883 1295182 1277472 1262488 1249269 1236413 1224382 1214844 1208009 1202042 1195430 1188796 1183707 1180459 1177872
58870 1177872 1175046 1172569 1171760 1173008 1175175 1176672 1176866 1176361 1176322 1177953 1182196 1188938 1196506 1202941 1208057
58855 1208057 1213362 1219630 1225723 1230511 1234851 1240530 1247995 1256218 1264323 1272212 1279971 1287713 1295807 1304463
58841 1304463 1313422 1322884 1334005 1347198 1360372 1370454 1376661 1381075 1386023 1392249 1399664 1408375 1418465
58828A418465J1525J3651J6687J9334K0300K0229K0455K0461J8480J4412J0208
58817A604207P236M945K514J05k085m637p786j0586j2073j2676j3588j5240j7036
58804A523300j8299j8844j8716j7989j6966j6283j6447j7196j7594j7105j6470
58793A331391j6921j8465j9644j9399j8454j8077j8091j7190j5096j3238j2921
58782A143895j3670j3898j2814j1167j0306j0893j2403j3569j3258j1205q199
58771A012513n587m420m707n446n458m295k434p41O3k55j201j710r95O43K132
58756I78102K774K840L076L903N049N624M726K414Nj078p45j58l82j595l364n003
58740I96188n764n378m548m251m628n046n162n188n213m980m408l643k714j823
$$ plain form
58828 1418465 1429990 1443641 1460328 1479662 1499962 1520191 1540646 1561107 1579587 1593999 1604207
58817 1604207 1611443 1616388 1618902 1619007 1616922 1612285 1604499 1593913 1581840 1569164 1555576 1540336 1523300
58804 1523300 1505001 1486157 1467441 1449452 1432486 1416203 1399756 1382560 1364966 1347861 1331391
58793 1331391 1314470 1296005 1276361 1256962 1238508 1220431 1202340 1185150 1170054 1156816 1143895
58782 1143895 1130225 1116327 1103513 1092346 1082040 1071147 1058744 1045175 1031917 1020712 1012513
58771 1012513 1006926 1002506 997799 992353 986895 982600 980166 979425 979488 979233 978032 976322 975327 975970 978102
58756 978102 980876 983716 986792 990695 995744 1001368 1006094 1008508 1008513 1007435 1006690 1006532 1006150 1004555 1001191 996188
58740 996188 990424 985046 980498 976247 971619 966573 961411 956223 951010 946030 941622 937979 935265 933442
58726I33442j630k382l019k324o48P18J648L060M738N215M293L761M679N604M711
58711I61866K331R9j445k937m644o113p042p528p652p473p101o294m630k505j240
58696H97692j569k690l347l216k640j767n86P67K210L605M300L782K957L461N157
58681I08116N841M303K270K049L463M580M533M060L872L928M164M736N592O493
58667I68000P228P395O574N245M710N415O156N679M270L091K824L738N916Q502
58653A044743R674Q521O152M128K671J303P5r36k201l736m658m955o256r401j2584
58638A032540j3825j3960j5039j6769j7101j5883j5261j6273j7294j6446j3775
58627H60914j0474p454n314m557n110o279p375p940p594o423n171m229k881n45
$$ plain form
58726 933442 931812 929430 926411 924087 923439 924157 925805 928865 933603 938818 943111 946872 951551 957155 961866
58711 961866 964197 964296 962851 959914 955270 949157 942115 934587 926935 919462 912361 906067 901437 898932 897692
58696 897692 896123 893433 890086 886870 884230 882463 881877 882644 884854 888459 892759 896541 899498 902959 908116
58681 908116 913957 918260 920530 922579 926042 930622 935155 939215 943087 947015 951179 955915 961507 968000
58667 968000 975228 982623 989197 994442 999152 1004567 1010723 1016402 1020672 1023763 1026587 1030325 1036241 1044743
58653 1044743 1054417 1062938 1069090 1073218 1075889 1077192 1077267 1076331 1074130 1070394 1065736 1060781 1054525 1045124 1032540
58638 1032540 1018715 1004755 989716 972947 955846 939963 924702 908429 891135 874689 860914
58627 860914 850440 842986 837672 833115 828005 821726 814351 806411 798817 792394 787223 782994 780113 779568
58613G79568J763K455J589Q43J366K797M273N394O250P277Q899J0607J0933R229
58599H53243O791N180M094K094j059m127o077o872o900o725p013p671p568o062
58585H11328m161l190l161l543m539o081o699n234k913j848k155k372k064j851
58571G61517j462J9K111L270L193K867K538J648O22N56J085P56l38l87J322L407
58555G82724M606N133N420N353N220N689O403O200N074M259M115L794L270L660
58541H50920M867M973L043Q19M57J827L109L186K375J528J100R22O97Q94K523
58526H83240N381P525P765P605Q987J1088J1627J0676J0460J1703J2990J3801
58514A002848J5134J6665J6375J4118J2699J3977J6313J7447J7699J8552J9969
$$ plain form
58613 779568 781331 783786 785375 786218 787584 790381 794654 800048 806298 813575 822474 833081 844014 853243
58599 853243 860034 865214 869308 871402 870343 866216 860139 853267 846367 839642 832629 824958 817390 811328
58585 811328 807167 803977 800816 797273 792734 786653 779954 774720 771807 769959 767804 765432 763368 761517
58571 761517 760055 760074 762185 765455 768648 771515 774053 775701 776323 776879 777964 778720 778382 777995 779317 782724
58555 782724 787330 792463 797883 803236 808456 814145 820548 826748 831822 836081 840196 843990 847260 850920
58541 850920 855787 860760 863803 864622 865079 866906 870015 873201 875576 877104 878204 879126 879823 880717 883240
58526 883240 888621 896146 903911 911516 920503 931591 943218 953894 964354 976057 989047 1002848
58514 1002848 1017982 1034647 1051022 1065140 1077839 1091816 1108129 1125576 1143275 1161827 1181796
58503A181796K1028K1815K2845K3755K3994K3942K4087K4069K3496K2692K1641
58492A435160J9412J5625J1395P774M401O89k716m815n696o078o291o614p826
58479A454420j0427j3917j7463k0593k2850k3753k3706k3936k4859k5445k4692
58468A222779k2831k0511j7900j5133j2820j1422j0764j0460j0113r079p111n263
58456A069372m912n814o380n978n495n543n589n210m632l690j795O14K094K075
58442A019117J451R66M65o2j16L46R16J675K700K973J718M69J456M070N519N023
58426A048686M570N199N677N649O880J0016J3031J4532J5778J7734J8883J8039
58414A184674J6937J7525J8678J7946J5118J1736Q437M883J370j400l445n012
$$ plain form
58503 1181796 1202824 1224639 1247484 1271239 1295233 1319175 1343262 1367331 1390827 1413519 1435160
58492 1435160 1454572 1470197 1481592 1489366 1493767 1494456 1491740 1486925 1481229 1475151 1468860 1462246 1454420
58479 1454420 1443993 1430076 1412613 1392020 1369170 1345417 1321711 1297775 1272916 1247471 1222779
58468 1222779 1199948 1179437 1161537 1146404 1133584 1122162 1111398 1100938 1090825 1081746 1074635 1069372
58456 1069372 1064460 1058646 1052266 1046288 1040793 1035250 1029661 1024451 1019819 1016129 1014334 1014948 1017042 1019117
58442 1019117 1020568 1021534 1021999 1021937 1021821 1022167 1023083 1024758 1027458 1030431 1032149 1032618 1034074 1038144 1043663 1048686
58426 1048686 1053256 1058455 1064132 1069781 1076661 1086677 1099708 1114240 1130018 1147752 1166635 1184674
58414 1184674 1201611 1219136 1237814 1255760 1270878 1282614 1291051 1295934 1297304 1295904 1292459 1287447
58402A287447n762n497m665l353j185J184K165J854K490N216Q405J0489J2100
58389A310888J3686J3416R774M506M82j999m535p445r595j0586j1106j1451j1320
58376A284715j0589r192o869m031j920j020l60Q84K340L616M952N943N545M270
58362A278284M354O605R094J0162J0408J0312Q444M176o4j722j694k553m578n896
58348A325332n666m914m773n480o509o662m916k071l09m47j076j035p18j76J611
58333A282191M368N811M827L117K350K063J761K344L677L660J748P17K526N151
58319A326311O016N989P087Q725R325R601J1109J3126J3913J3670J3615J3656
58307A452143J3371J3797J5775J8011J8935J8868J8525J7465J6033J6300J8727
$$ plain form
58402 1287447 1281685 1276188 1271523 1268170 1266985 1268169 1270334 1272188 1274678 1279894 1288299 1298788 1310888
58389 1310888 1324574 1337990 1347764 1352270 1352752 1350753 1346218 1338773 1329178 1318592 1307486 1296035 1284715
58376 1284715 1274126 1264934 1258065 1254034 1252114 1251094 1250734 1251618 1253958 1257574 1262526 1268469 1274014 1278284
58362 1278284 1282638 1289243 1298337 1308499 1318907 1329219 1337663 1341839 1341775 1340053 1338359 1335806 1331228 1325332
58348 1325332 1319666 1314752 1309979 1304499 1297990 1291328 1286412 1284341 1284032 1283585 1282509 1281474 1280756 1280580 1282191
58333 1282191 1286559 1292370 1297197 1300314 1302664 1304727 1306488 1308832 1312509 1316169 1317917 1318634 1321160 1326311
58319 1326311 1332327 1338316 1345403 1354128 1363453 1373054 1384163 1397289 1411202 1424872 1438487 1452143
58307 1452143 1465514 1479311 1495086 1513097 1532032 1550900 1569425 1586890 1602923 1619223 1637950
58296A637950K0355J9018J6740J6236J6655J5955J4856J4889J4818J2800J0222
58285A810494R721J0955J1754J2033J3239J5223J6771J7872J8771J8504J6968
58274A972305J6481J8422K0672K1254K1865K4484K7178K7214K5854K6000K7100
58263B228829K6569K4432K2534K0842J8414J6403J6392J7353J7659J8175K0009
58252B447611K1615K1693K2276K5115K7838K7926K7529K9709L2795L3484L2880
58241B750471L4114L6470L7299L7570L9999M3596M5469M6105M7631M9019M8426
58230C216169M8027N0736N4442N5438N5383N8595O4489O8991P1629P4750P7648
58219C896297P8207P8612Q2589Q8363R1282R1864R4377R8942J02235J04670J09486
$$ plain form
58296 1637950 1658305 1677323 1694063 1710299 1726954 1742909 1757765 1772654 1787472 1800272 1810494
58285 1810494 1820215 1831170 1842924 1854957 1868196 1883419 1900190 1918062 1936833 1955337 1972305
58274 1972305 1988786 2007208 2027880 2049134 2070999 2095483 2122661 2149875 2175729 2201729 2228829
58263 2228829 2255398 2279830 2302364 2323206 2341620 2358023 2374415 2391768 2409427 2427602 2447611
58252 2447611 2469226 2490919 2513195 2538310 2566148 2594074 2621603 2651312 2684107 2717591 2750471
58241 2750471 2784585 2821055 2858354 2895924 2935923 2979519 3024988 3071093 3118724 3167743 3216169
58230 3216169 3264196 3314932 3369374 3424812 3480195 3538790 3603279 3672270 3743899 3818649 3896297
58219 3896297 3974504 4053116 4135705 4224068 4315350 4407214 4501591 4600533 4702768 4807438 4916924
58208D916924J15730J19570J21722J26390J33715J40388J46671J55492J65702
58199F142304J73713J80556J89782J99811K06401K11268K19883K31883K42157
58190G997758K50363K60726K73545K85698K98296L14715L32331L45727L57041
58181A0716200L73433L95480M17949M40600M67591M97427N24592N50446N81587
58172A4965305O18424O56358O96695P44492P97425Q49582R04613R71791J050637
58163B2255322J133304J220117J317835J424609J532836J644810J768200J898338
58155C4195371K024124K150108K292366K453609K624083K806187L014599L252171
58147E4812618L511399L800881M143708M548572N011402N546704O185019O937192
$$ plain form
58208 4916924 5032654 5152224 5273946 5400336 5534051 5674439 5821110 5976602 6142304
58199 6142304 6316017 6496573 6686355 6886166 7092567 7303835 7523718 7755601 7997758
58190 7997758 8248121 8508847 8782392 9068090 9366386 9681101 10013432 10359159 10716200
58181 10716200 11089633 11485113 11903062 12343662 12811253 13308680 13833272 14383718 14965305
58172 14965305 15583729 16240087 16936782 17681274 18478699 19328281 20232894 21204685 22255322
58163 22255322 23388626 24608743 25926578 27351187 28884023 30528833 32297033 34195371
58155 34195371 36219495 38369603 40661969 43115578 45739661 48545848 51560447 54812618
58147 54812618 58324017 62124898 66268606 70817178 75828580 81375284 87560303 94497495
58139I4497495P796765Q780232R924176J1238376J2707693J4344404J6180321
58132A75469462J8196598K0334515K2602502K5080978K7736402L0242914L1977347
58125C51640718L2080594K9523895K3430501J3763991J843056j0031105j9721144
58118D22530506k6203057k9605334l0616668k9976897k8316050k6130815k3750952
58111B27930733k1360792j9082975j7012887j5185710j3576587j2156391j0916862
58104A18638529r840967q891074q038698p276823o596329n977996n413809m910653
58096F1692180m466520m064834l696336l365328l070495k799960k549352k325651
58088C5353704k129232j950072j785324j643030j524186j417594j316797j226736
$$ plain form
58139 94497495 102294260 111074492 120998668 132237044 144944737 159289141 175469462
58132 175469462 193666060 214000575 236603077 261684055 289420457 319663371 351640718
58125 351640718 383721312 413245207 436675708 450439699 452282755 442251650 422530506
58118 422530506 396327449 366722115 336105447 306128550 277812500 251681685 227930733
58111 227930733 206569941 187486966 170474079 155288369 141711782 129555391 118638529
58104 118638529 108797562 99906488 91867790 84590967 77994638 72016642 66602833 61692180
58096 61692180 57225660 53160826 49464490 46099162 43028667 40228707 37679355 35353704
58088 35353704 33224472 31274400 29489076 27846046 26321860 24904266 23587469 22360733
58080B2360733j149287j077018j006122r42053q87468q36824p87261p43246p06164
58071A4225290o70063o31798n95499n63592n32711n01440m73027m47885m22256
58062I387019l96387l75195l58872l41670l21786l03780k89455k75201k60081
58053F464592k47759k38420k27323k13461k01344j92320j82483j71139j62972
58044D627371j59492j56278j50976j46341j43210j38325j31332j26235j23502
58035C351680j18252j08809r9656r3408q7151p9390p3352p0414o7126o1727n7138
58024B435257n4705n1466m6447m3253m3580m4293m3679m4258m6580m6700m2991
58013A927305l9421l8765l8427l6140l3927l3057l0996k7001k5007k7027k8955
$$ plain form
58080 22360733 21211446 20134428 19128306 18186253 17298785 16461961 15674700 14931454 14225290
58071 14225290 13555227 12923429 12327930 11764338 11231627 10730187 10257160 9809275 9387019
58062 9387019 8990632 8615437 8256565 7914895 7593109 7289329 6999874 6724673 6464592
58053 6464592 6216833 5978413 5751090 5537629 5336285 5143965 4961482 4790343 4627371
58044 4627371 4467879 4311601 4160625 4014284 3871074 3732749 3601417 3475182 3351680
58035 3351680 3233428 3124619 3024963 2931555 2844404 2765014 2691662 2621248 2554122 2492395 2435257
58024 2435257 2380552 2329086 2282639 2239386 2195806 2151513 2107834 2063576 2016996 1970296 1927305
58013 1927305 1887884 1849119 1810692 1774552 1740625 1707568 1676572 1649571 1624564 1597537 1568582
58002A568582k7048k3628k2298k2212k1242k0461k1217k1607j9939j8297j8918
57991A331715k0227j9861j8480j7441j5862j3135j1152j1141j1351j0622j0995
57980A171448j3882j6797j6889j4849j2758j0935r418r473j1055j1769j0731j0436
57968A022456j2484j4706j4894j4021j3294j1599q666p202q664j0187r058p143
57956H90538p422q936q957p794p717q830r430r064q329p095n447m873o006o785
57942G83853n206k376o38k74j38O1K21J019K723M245M805M902M402J971k240n699
57926G91631o901p247q072q594q439r098j0731j0716p913n367n908p918q504q214
57912F78009q976r816q436n502l717l673l778l283k495r74J576L507L010R14o31
$$ plain form
58002 1568582 1541534 1517906 1495608 1473396 1452154 1431693 1410476 1388869 1368930 1350633 1331715
57991 1331715 1311488 1291627 1273147 1255706 1239844 1226709 1215557 1204416 1193065 1182443 1171448
57980 1171448 1157566 1140769 1123880 1109031 1096273 1085338 1075920 1066447 1055392 1043623 1032892 1022456
57968 1022456 1009972 995266 980372 966351 953057 941458 932792 925590 916926 906739 897681 890538
57956 890538 883116 874180 865223 857429 849712 840882 831452 822388 814059 806964 801517 796644 790638 783853
57942 783853 778647 776271 775633 775359 775221 775282 775503 776522 779245 783490 788295 793197 797599 799570 797330 791631
57926 791631 784730 777483 769411 760817 752378 743280 732549 721833 713920 708553 702645 694727 686223 678009
57912 678009 669033 659217 650781 645279 641562 637889 634111 630828 628333 627359 628935 632442 635452 636366 635735
57897F35735j232j702j679m58Q40O08n18q31p18j967m348n471m054j196J521L378
57881F17908M111L798L262L296L740M106M440M750M553L903L647L675K490l11
57867F67368k797l406l179l571l958l366k968m317o277o434m719l240l002l134
57853F13000l056l189l518l314k514j912j833j696r01O02K318L220K380K70j305
57838E98552j134K95J864K798K401N53j121n69J529K176N31p22P3N58j646m542
57822F01596m475j648K99o48l094m942n405m524k934k028k632l694l607k350j111
57807E58803n51o56j468k585k816j560L34K049L845N637O197N255M616N595O977
57792E89672P246O937O858O058L937K406L058L801J555k866n811n989n397n426
$$ plain form
57897 635735 634503 632801 631122 630664 631504 632112 631594 630763 630045 628078 623730 618259 614205 613009 614530 617908
57881 617908 622019 625817 629079 632375 636115 640221 644661 649411 653964 657867 661514 665189 667679 667368
57867 667368 664571 661165 657986 654415 650457 647091 644123 639806 633529 627095 622376 619136 616134 613000
57853 613000 609944 606755 603237 599923 597409 595497 593664 591968 591067 591669 593987 597207 599587 599857 598552
57838 598552 597418 597713 599577 602375 604776 605329 604208 603639 605168 607344 607875 607153 607226 607784 606138 601596
57822 601596 597121 595473 595772 595124 592030 587088 581683 577159 574225 572197 569565 565871 562264 559914 558803
57807 558803 558252 557596 556128 553543 550727 549167 549501 551550 555395 561032 567229 572484 577100 582695 589672
57792 589672 596918 603855 610713 616771 620708 623114 626172 629973 631528 628662 622851 616862 611465 606039
57778F06039n247m235l234k913l065l685m889n706m966l299k422k553k375j373
57764E56077m43l30j006k269l431l103j079L82q62l737n623o299p566r464r832
57749E01415p921n742n114n455n317m415l419k995l430m278m359l036j157R5O47
57734D45519Q01K44p54n26J703L961M186L517M436O719P987P559O819O336N570
57719E04077N074N885O945O237M367L830M667M359K349J020J391J502L11l62M70
57704E52122P60r97k853k555j213j237k568l566m055m841n354m357k446j517j921
57689E13402k078r71N50J195Q42M16O68J354J477N81m14k44R54J949K348K869
57673E24898L507L048J078q72j175n6J175K002K780L567L818L073J580L45M60
$$ plain form
57778 606039 600792 596557 593323 590410 587345 583660 578771 573065 568099 564800 562378 559825 557450 556077
57764 556077 555634 555304 554298 552029 548598 545495 544416 544798 543936 540199 534576 528277 520711 511247 501415
57749 501415 493494 487752 482638 477183 471866 467451 464032 461037 457607 453329 448970 445934 444777 444872 445519
57734 445519 446320 446564 445810 445284 446987 450948 455134 458651 463087 469806 477793 485352 492171 498507 504077
57719 504077 509151 515036 521981 528218 532585 536415 541082 545441 547790 548810 550201 551703 552014 551652 552122
57704 552122 552882 551885 549032 546477 545264 544027 541459 537893 533838 528997 523643 519286 516840 515323 513402
57689 513402 511324 510353 510903 512098 512940 513356 514024 515378 516855 517436 517022 516778 517732 519681 522029 524898
57673 524898 528405 531453 532531 531659 530484 530428 531603 533605 536385 539952 543770 546843 548423 548768 549228
57658E49228J864L009K559J106J92M1l44j123j455j483k483m463n544m669l305
57643E33130l257m154m388l452k045n87J026K540L298K975J813K46j354k753l776
57628E19262m039l054j128L80O17O16J907M208O006P068Q501J0366J1434J1678
57614E73822J2836J5672J8782K1354K5025L1274L8413M3087M3675M0384L2885
57603H97209K0234L433j3568k6216l2425l3463l2410l1614l1106k9424k5912k1670
57591F43068j8160j5722j3931j2599j1646j0616r126p524o407n716m867l691k670
57578E20393k170j798q45O26J473P46r22j980k050k205k767k372l69J332O66j344
57562E06414j973q51k52j371k775l046k713k627k341j218K02J049J254J056L88
$$ plain form
57658 549228 551092 554101 556660 557766 557958 557999 557655 556532 555077 553594 551111 546648 541104 536435 533130
57643 533130 529873 525719 521331 517879 515834 515247 516273 518813 522111 525086 526899 527145 525791 523038 519262
57628 519262 515223 512169 511041 511421 512038 512654 514561 518769 524775 531843 540344 550710 562144 573822
57614 573822 586658 602330 621112 642466 667491 698765 737178 780265 823940 864324 897209
57603 897209 917443 920876 907308 881092 848667 815204 782794 751180 720074 690650 664738 643068
57591 643068 624908 609186 595255 582656 571010 560394 551268 543744 537337 531621 526754 523063 520393
57578 520393 518223 516425 515580 516206 517679 518425 517503 515523 513473 511268 508501 506129 505760 507092 507758 506414
57562 506414 504441 503590 503338 501967 499192 496146 493433 490806 488465 487247 487449 488498 489752 490808 491196
57547D91196n16q94l76N98J588K381K430J245n34j737k336l017l295k080k16r2
57531D84345k040l451k450l49P36O48K29m19j147j051j45j8j196j557N71L351
57515D76057L759J878M18P56J700J959J687J492J545J847K227K139J415Q81J228
57500E00988J878J958J890K693M212N198M954L920K999L058M460O259O575M782
57486E55824K489J392J139N48j98r7P57J495K110L117M028L859K795J847J217
57471E82322N51L87J487K957K959J449M22J058K321K993L521M903O751P579O668
57456F28328M948M100M872O309O874O351N956O260O173M861L476L538M423M248
57442G00717K754J500J392J875K633M166O166P096O272M960M568M885M979M806
$$ plain form
57547 491196 490680 489786 489410 490008 491596 493977 496407 497652 497118 495381 493045 490028 486733 484653 484437 484345
57531 484345 482305 478854 476404 476055 476791 477439 477668 477249 476102 475051 474906 474888 473692 472135 472706 476057
57515 476057 479816 481694 482112 482868 484568 486527 488214 489706 491251 493098 495325 497464 498879 499760 500988
57500 500988 502866 504824 506714 509407 513619 518817 523771 527691 530690 533748 538208 544467 551042 555824
57486 555824 558313 559705 560844 561392 561194 561097 561854 563349 565459 568576 572604 576463 579258 581105 582322
57471 582322 582873 583260 584747 587704 590663 592112 592534 593592 595913 598906 602427 607330 614081 621660 628328
57456 628328 633276 637376 642248 648557 655431 661782 667738 673998 680171 685032 688508 692046 696469 700717
57442 700717 703471 704971 706363 708238 710871 715037 721203 728299 734571 739531 744099 748984 753963 758769
57428G58769M905N247N353N279N526O100O206N118L190J865K379M241N487M914
57414H24579L598L382M410N197M903M193L745L280K506J903J864J982J904K132
57400H69578L289N078O647P540P722P166O191N824O924Q871R769Q297N137K494
57386I60527K309M829Q601J1582J2514J1613J0215R650J0211J1081J1215J0296
57374A074643Q901P903P878Q715R607R718R283R499J0753J1561J0473Q635Q742
57361A196311J1172J3082J2215J0027R445J0750J1605J0693R326R297J0705J2450
57349A327078J3688J4209J4086J3680J3563J4021J4739J5134J4889J4180J3665
57338A482932J4069J5516J7462J9370K1125K2489K2788K1728K0108J9094J9053
$$ plain form
57428 758769 763674 768921 774274 779553 785079 791179 797385 802503 805693 807558 809937 814178 819665 824579
57414 824579 828177 831559 835969 841166 846069 850262 854007 857287 859793 861696 863560 865542 867446 869578
57400 869578 872867 877945 884592 892132 899854 907020 913211 919035 925959 934830 944599 952896 958033 960527
57386 960527 962836 967665 976266 987848 1000362 1011975 1022190 1031840 1042051 1053132 1064347 1074643
57374 1074643 1083544 1091447 1099325 1108040 1117647 1127365 1136648 1146147 1156900 1168461 1178934 1187569 1196311
57361 1196311 1207483 1220565 1232780 1242807 1252252 1263002 1274607 1285300 1294626 1303923 1314628 1327078
57349 1327078 1340766 1354975 1369061 1382741 1396304 1410325 1425064 1440198 1455087 1469267 1482932
57338 1482932 1497001 1512517 1529979 1549349 1570474 1592963 1615751 1637479 1657587 1676681 1695734
57327A695734J9582K0243K0631K0296J9368J8831J9250J9604J8605J6875J6523
57316A905542J8253K0218K0314J8725J7409J7687J9155K0722K1898K2797K3386
57305B126106K3218K2155K1044K1150K2696K4330K4521K3260K1941K1588K1853
57294B373862K1951K2082K3226K5519K7597K8084K7291K6531K5983K4476K1861
57283B648463K0054K0705K2869K4473K5130K5805K6446K6148K5305K5330K6106
57272B916834K6159K5670K6703K9532L1399L0351K8062K7022K7006K6383K5154
57261C220275K4465K4431K4592K5411K7154K8391K7816K6633K6877K8213K8702
57250C512960K8083K7891K8732K9870L1161L2968L4351L3804L1887L0762L0976
$$ plain form
57327 1695734 1715316 1735559 1756190 1776486 1795854 1814685 1833935 1853539 1872144 1889019 1905542
57316 1905542 1923795 1944013 1964327 1983052 2000461 2018148 2037303 2058025 2079923 2102720 2126106
57305 2126106 2149324 2171479 2192523 2213673 2236369 2260699 2285220 2308480 2330421 2352009 2373862
57294 2373862 2395813 2417895 2441121 2466640 2494237 2522321 2549612 2576143 2602126 2626602 2648463
57283 2648463 2668517 2689222 2712091 2736564 2761694 2787499 2813945 2840093 2865398 2890728 2916834
57272 2916834 2942993 2968663 2995366 3024898 3056297 3086648 3114710 3141732 3168738 3195121 3220275
57261 3220275 3244740 3269171 3293763 3319174 3346328 3374719 3402535 3429168 3456045 3484258 3512960
57250 3512960 3541043 3568934 3597666 3627536 3658697 3691665 3726016 3759820 3791707 3822469 3853445
57239C853445L1129L0883L1678L3819L5355L5046L4270L4724L5944L6529L6408
57228D229230L6486L7019L7528L7762L7871L8133L8856M0011M0759M0140L8225
57217D652020L5793L3059K9890K7047K5641K5314K4536K3035K2293K3216K4883
57206D946727K6194K7290K8694L0301L1912L3570L4823L4850L3830L3123L3523
57195E294837L4371L4650L3892L2013K9590K8325K9538L1970L2977L2274L2425
57184E646862L4933L7984L9306L9292L9938M2170M5686M9981N4091N6403N6139
57173F142785N4270N2108N0062M8435M7903M8126M7365M4790M1731L9481L7374
57162F654430L4587L2150L1345L1289L0189K7943K5614K3282K0495J8138J7582
$$ plain form
57239 3853445 3884574 3915457 3947135 3980954 4016309 4051355 4085625 4120349 4156293 4192822 4229230
57228 4229230 4265716 4302735 4340263 4378025 4415896 4454029 4492885 4532896 4573655 4613795 4652020
57217 4652020 4687813 4720872 4750762 4777809 4803450 4828764 4853300 4876335 4898628 4921844 4946727
57206 4946727 4972921 5000211 5028905 5059206 5091118 5124688 5159511 5194361 5228191 5261314 5294837
57195 5294837 5329208 5363858 5397750 5429763 5459353 5487678 5517216 5549186 5582163 5614437 5646862
57184 5646862 5681795 5719779 5759085 5798377 5838315 5880485 5926171 5976152 6030243 6086646 6142785
57173 6142785 6197055 6249163 6299225 6347660 6395563 6443689 6491054 6535844 6577575 6617056 6654430
57162 6654430 6689017 6721167 6752512 6783801 6813990 6841933 6867547 6890829 6911324 6929462 6947044
57151F947044J8315J8478J7648J7249J8185J9857K1625K3616K5871K8104L0540
57140G186532L3649L6943L9264M0469M1589M3120M4375M4849M4980M5147M4807
57129G645724M3188M0118L5908L1008K6004K1337J6809J1934O782J929k428o643
57117G871670j0860j4762j8144k1163k3858k5963k7312k7950k7773k6454k3941
57106G623490k0845j8264j7144j7569j8473j8514j7526j6752j7256j8442j8676
57095G424029j7105j4477j2232j1075j0459r464q160p700q666r990j0451j0754
57083G293496j2713j6717k1679k7521l5509m5512n5061o2476o9172p7378q6953
57072F782805r5974j03322j09174j14046j18894j25138j33067j41073j47794j53972
$$ plain form
57151 6947044 6965359 6983837 7001485 7018734 7036919 7056776 7078401 7102017 7127888 7155992 7186532
57140 7186532 7220181 7257124 7296388 7336857 7378446 7421566 7465941 7510790 7555770 7600917 7645724
57129 7645724 7688912 7729030 7764938 7795946 7821950 7843287 7860096 7872030 7878812 7880741 7878313 7871670
57117 7871670 7860810 7846048 7827904 7806741 7782883 7756920 7729608 7701658 7673885 7647431 7623490
57106 7623490 7602645 7584381 7567237 7549668 7531195 7512681 7495155 7478403 7461147 7442705 7424029
57095 7424029 7406924 7392447 7380215 7369140 7358681 7349217 7341057 7333357 7324691 7314701 7304250 7293496
57083 7293496 7280783 7264066 7242387 7214866 7179357 7133845 7078784 7016308 6947136 6869758 6782805
57072 6782805 6686831 6583509 6474335 6360289 6241395 6116257 5983190 5842117 5694323 5540351
57062E540351j60848j68105j75155j83157j93677k06359k20103k35678k55000
57053C742269k78643l06248l38606l76741m19533m64712n11911D83380a33634
57043h09075p39171q10067q87752r70715j059699j157257j265259j387076j532171
57034a0618242j714144j943032k221600k547541k915430l319413l760314m245970
57026c3285686m773115n312308n831038o336876o867901p406652p808948p854478
57018h5477002p391086o426343n081446l483519j722172J12518J895934L494582
57010a04078534M815622N823006O517245O914108P040317O936072O653454O251179
57002e3127531N787673N312121M856941M437000M054807L706086L383225L078399
$$ plain form
57062 5540351 5379503 5211398 5036243 4853086 4659409 4453050 4232947 3997269 3742269
57053 3742269 3463626 3157378 2818772 2442031 2022498 1557786 1045875 483380 -133634
57043 -809075 -1548246 -2358313 -3246065 -4216780 -5276479 -6433736 -7698995 -9086071 -10618242
57034 -10618242 -12332386 -14275418 -16497018 -19044559 -21959989 -25279402 -29039716 -33285686
57026 -33285686 -38058801 -43371109 -49202147 -55539023 -62406924 -69813576 -77622524 -85477002
57018 -85477002 -92868088 -99294431 -104375877 -107859396 -109581568 -109469050 -107573116 -104078534
57010 -104078534 -99262912 -93439906 -86922661 -80008553 -72968236 -66032164 -59378710 -53127531
57002 -53127531 -47339858 -42027737 -37170796 -32733796 -28678989 -24972903 -21589678 -18511279
56994a8511279K786421K505459K235838J979358J739308J519340J321611J146281
56986c277663R92721Q60308f76687b3145E51141N07297M50063M00798L58292L21366
56976B588957K89020K61295K39176K22565K08593J92564J70434J40322J02902
56967D415828O1748K2772q551l0200m3605n1267n5268n7510n9497o1385o2444
56956D070621o2943o4613o8875p5480q3095r0290r5771r8844j00244j01471j02900
56945C126095j03490j02723j01627j01287j01596j02251j03885j07069j11144
56936B191023j15012j18403j21404j23475j23862j22246j18180j10884j00785
56927A136772r0286q1570p4197o6315n7663m9765m3572l8691l4921l2766l1972
$$ plain form
56994 -18511279 -15724858 -13219399 -10983561 -9004203 -7264895 -5745555 -4423944 -3277663
56986 -3277663 -2284942 -1424634 -676687 -23145 551141 1058438 1508501 1909299 2267591 2588957
56976 2588957 2877977 3139272 3378448 3601013 3809606 4002170 4172604 4312926 4415828
56967 4415828 4477576 4500348 4491797 4461597 4417992 4366725 4311457 4253947 4194450 4133065 4070621
56956 4070621 4007678 3943065 3874190 3798710 3715615 3625325 3529554 3430710 3330466 3228995 3126095
56945 3126095 3022605 2919882 2818255 2716968 2615372 2513121 2409236 2302167 2191023
56936 2191023 2076011 1957608 1836204 1712729 1588867 1466621 1348441 1237557 1136772
56927 1136772 1046486 964916 890719 824404 766741 716976 673404 634713 599792 567026 535054
56916E35054l1120k9273k6981k5017k3133k0657j7568j4408j1666r677q473p479
56904C09602n905l734j752k96J229L305N522P367R043J0675J1180Q932L698k699
56890C56167p875j0740j1713j1604j0757r267p471n800m295k692r33Q02K549M632
56876B81003P188J0037J3050J6172J8948K0684K1208K0872J9584J6595J1679N703
56864D62723k97n931j0853j4280j5863j6236j6009j4963j3041j1237j0365r697
56852C23951q082n911m739n162o264o882o490n157l673l256l975l985j640K004
56838B60739M246M088K971K419K627L515N341P767R823J1286J2880J4662J5622
56825C57986J5297J4395J3186J0830P125L452Q83j428m658q054r654q738o388
$$ plain form
56916 535054 503934 474661 447680 422663 399530 378873 361305 346897 335231 325554 317081 309602
56904 309602 303697 299963 298211 297915 299144 302449 307971 315338 324381 335056 346236 355168 358866 356167
56890 356167 348292 337552 325839 314235 303478 294211 286740 280940 276645 273953 273020 273822 276371 281003
56876 281003 288191 298228 311278 327450 346398 367082 388290 409162 428746 445341 457020 462723
56864 462723 462426 456495 445642 431362 415499 399263 383254 368291 355250 344013 333648 323951
56852 323951 315869 309958 305219 300057 293793 286911 280421 275264 271591 268335 264360 260375 258735 260739
56838 260739 264985 269073 272044 274463 277090 280605 285946 293713 303536 314822 327702 342364 357986
56825 357986 373283 387678 400864 411694 418819 422271 423154 421726 417068 409014 399360 390622 384234
56812C84234l843j336J562N094Q785J1490J2439J2423J3318J6017J9588K2903
56800E02674K6127K9724L2753L3278L0099K3439J4490N108k647p863j1476j4735
56788F60971j7214j7304j4582j0443o277k062K758P905J2599J6801K1337K6690
56776F81179L2259L6997M0528M3230M5229M5503M2216L3998K1118N613r655k2389
56764I95826l1670l7492l9854l8769l5134l0675k6534k2452j7881j3127q673m011
56752F89554J608P613J2511J5788J8277K0648K2568K3357K2325J8399J0803M72
56740H63923j0282j9839k7822l3453l5201l3040k9577k7403k6177k3730j9422
56729E77977j4949j2003j0445q841n934j564L159O592Q127Q824R885J0745R491
$$ plain form
56812 384234 380391 379055 380617 385711 394496 405986 418425 430848 444166 460183 479771 502674
56800 502674 528801 558525 591278 624556 654655 678094 692584 697692 695045 687182 675706 660971
56788 660971 643757 626453 611871 601428 595151 593089 595847 603752 616351 633152 654489 681179
56776 681179 713438 750435 790963 834193 879422 924925 967141 1001139 1022257 1027870 1018215 995826
56764 995826 964156 926664 886810 848041 812907 782232 755698 733246 715365 702238 693565 689554
56752 689554 691162 698775 711286 727074 745351 765999 788567 811924 834249 852648 863451 863923
56740 863923 853641 833802 805980 772527 737326 704286 674709 647306 621129 597399 577977
56729 577977 563028 551025 540580 531739 525805 524241 527400 533992 542119 550943 560828 571573 581064
56716E81064N129j340q060j3741j7918k0674k2501k3868k4454k3339k0403j7134
56704C92761j5320j5065j4768j3259j1267j0241j0270j0068q905p525o854o683
56692B62536o303n694n209m636l573k486k424l636n166n871n246l516j611p48
56678B06417j249j940j523l04M05K72J73O09J163J521J826J941J508Q27M20j11
56662B11955j380k477j810Q7P47n87j617n04J304J432J93k01R87K452L118L198
56646B16897L157L114L195L342K910J484j52q59o41l47j47N16J664K560K761K448
56630B41902J768O98l73p97n56l28n61r26q48k53L55L38m63j478j971j794j316
56613B33397p17qM09J83l2P74K108K169M58j197j086K14J113J218J024N21m13
$$ plain form
56716 581064 586193 584853 576793 563052 545134 524460 501959 478091 453637 430298 409895 392761
56704 392761 377441 362376 347608 334349 323082 312841 302571 292503 283598 276073 269219 262536
56692 262536 256233 250539 245330 240694 237121 234635 232211 228575 223409 217538 212292 208776 207165 206417
56678 206417 205168 203228 201705 201401 201806 202078 202251 202860 204023 205544 207370 209311 210819 211646 212066 211955
56662 211955 210575 208098 206288 206375 207122 206535 204918 204414 205718 207150 207343 207142 208129 210581 213699 216897
56646 216897 220054 223168 226363 229705 232615 234099 233947 233088 232447 232100 231953 232469 234133 236693 239454 241902
56630 241902 243670 244368 243995 243198 242642 242314 241753 240827 239979 239726 240081 240419 239956 238478 236507 234713 233397
56613 233397 232680 232672 233081 233264 233232 234006 236114 238283 238741 237544 236458 236672 237785 239003 240027 240548 240135
56596B40135r75l42R71J877K261K517K255R65m80o34L45Q62J75p10p02m2K03o93
56578B47988k449l897l962l004k492k850k700j160L26K4j249j239L43J626J551
56563B26856J022Q59N41m76j680k318k158j155N26J873J725L64o73o74m58p62
56547B23412j160j022m80N7M42N15J38l01l73o49j994l641l412n75K768M082L244
56530B21051K093J790J751R67l84r99N1K065L313L041K272K193K520K345J918
56515B45987K211L123L454K628J207k49j501j893o76J654L729N129O572Q172R058
56500B88605R052R161R776R871Q713P046N662M102J795n81j939k309k475k687
56486C43792k635k281k104k677m250o186o863n136k161n90j437k920l025j997
$$ plain form
56596 240135 239160 238818 239789 241666 243927 246444 248699 249664 249184 248550 248895 249757 249932 249222 248520 248478 248681 247988
56578 247988 245539 241642 237680 234676 232184 229334 226634 225474 225800 225824 224575 223336 223679 225305 226856
56563 226856 227878 228737 229278 228802 227122 224804 222646 221491 222017 223890 225615 225979 225306 224632 224174 223412
56547 223412 222252 221230 220750 220807 221249 221764 221902 221601 221228 220579 218585 214944 211532 210957 213725 217807 221051
56530 221051 223144 224934 226685 227652 227268 226269 226320 228385 231698 234739 237011 239204 241724 244069 245987
56515 245987 248198 251321 254775 257403 258610 258361 256860 254967 254291 255945 259674 264803 271375 279547 288605
56500 288605 297657 306818 316594 326465 335178 342224 347886 351988 353783 353202 351263 348954 346479 343792
56486 343792 341157 338876 336772 334095 329845 323659 316796 311660 309499 308909 307472 304552 301527 299530
56472B99530j348j438j394q09k89n18j528k759l329k650j282p18j707l234l639
56457B72888k380k21J780K886K758J649M21j58l8L24M79J77n71j353j626j294
56441B75721p92n69q03j351j533m11J882L499K791N88p66n70l20q56r24O09K697
56424B78892L550K951J905Q47n33k175l489l984l403j687M75J732J540J052J635
56409B79308K835K768N38k396l507j753J221K619J436n21j022l8R52J506K252
56394B86198K793J833k74j257p5J645K300K420K768K396N83r47j00K200L085J745
56378C07313J69l1M92M01m18j141j135m30K17k33j928l490l436k017q24o82q90
56361B91937n21M71J611K603L348L673L312K063J08j741k462j692O0K025L482
$$ plain form
56472 299530 298182 296744 295350 294541 294252 293734 292206 289447 286118 283468 282186 281468 279761 276527 272888
56457 272888 270508 270287 272067 274953 277711 279360 279781 279623 279585 279909 280388 280565 279994 278641 277015 275721
56441 275721 274929 274360 273557 272206 270673 270262 272144 275643 278434 279022 278256 277686 277366 276510 275586 276195 278892
56424 278892 282442 285393 287298 288145 287612 285437 281948 277964 274561 272874 273349 275081 276621 277673 279308
56409 279308 282143 284911 285449 283053 279546 277793 279014 281633 283069 282548 281526 281488 282440 283946 286198
56394 286198 288991 290824 290550 289293 289218 290863 293163 295583 298351 300747 301330 300383 300283 302483 305568 307313
56378 307313 307482 307451 307943 308344 307926 306785 305650 305220 305437 305204 303276 299786 296350 294333 293509 292827 291937
56361 291937 291416 291887 293498 296101 299449 303122 306434 308497 308605 306864 304402 302710 302770 304795 308277
56346C08277L638K246M75k0P11Q96k37j172m79R10J145R4q94j090p08K22J793
56329C15807L317L755K966J643M79J43J311L512M776L818J943J333J975K109J183
56314C50070M47N18M41l40p31L53K279L505L339K178O13r19j893j734l24J649
56298C59451L020L086K224J313P11L10M42J573L060L527K923K742L514L697K273
56283C93866Q68J504L523M599L933K517J021m23r02N50K962M270M218M396N323
56268D32225N632M680L834M263N124N043M063L127K638K469K475K292J430K45
56254D79540k2J164K697L235K843K508K589K601K333K351L196M552N628O228P038
56239E28481Q523R923J0081R151Q533Q905R367R060Q472Q394Q650Q777R048R789
$$ plain form
56346 308277 311915 314161 314636 314616 315327 316223 315986 314814 314335 315245 316390 316484 315590 314500 313792 314014 315807
56329 315807 319124 322879 325845 327488 327967 328110 329421 332933 337709 341527 343470 344803 346778 348887 350070
56314 350070 350517 351035 351476 351136 350405 350758 353037 356542 359881 362059 362672 361753 359860 358126 357802 359451
56298 359451 362471 365557 367781 369094 369805 370115 370557 372130 375190 378717 381640 384382 387896 391593 393866
56283 393866 394734 396238 399761 404360 408293 410810 411831 411408 410506 411056 414018 418288 422506 426902 432225
56268 432225 437857 442537 446371 450634 455758 460801 464864 467991 470629 473098 475573 477865 479295 479540
56254 479540 479518 480682 483379 486614 489457 491965 494554 497155 499488 501839 505035 509587 515215 521443 528481
56239 528481 537004 546927 557008 566159 574692 583597 592964 602024 610496 618890 627540 636317 645365 655154
56225F55154J0601J1295J2622J4817J6453J6203J4939J4523J5287J6268J7169
56214H15331J8360J9579K0513K2075K5201K8844L1204L2514L4506L7492M0244
56203A125863M2541M5355M8526N0895N3084N7352O3984P0479P5412Q0626Q8107
56192A802224R6869J04836J11939J19341J26845J33086J37641J41113J43486J43835
56182C061215J41590J37012J30418J21538J09693R4316P5565N4622L3030J1616
56172C970615r525l0130m9505o7096q2621r5693j06074j14120j20229j24055j25278
56161C046289j24669j23290j21025j17221j12373j07662j03145r8072r2768q8272
56151A957792q4230p9231p3388o8391o4594o0253n4423m8580m4340m1382l8720
$$ plain form
56225 655154 665755 677050 689672 704489 720942 737145 752084 766607 781894 798162 815331
56214 815331 833691 853270 873783 895858 921059 949903 981107 1013621 1048127 1085619 1125863
56203 1125863 1168404 1213759 1262285 1313180 1366264 1423616 1487600 1558079 1633491 1714117 1802224
56192 1802224 1899093 2003929 2115868 2235209 2362054 2495140 2632781 2773894 2917380 3061215
56182 3061215 3202805 3339817 3470235 3591773 3701466 3795782 3871347 3925969 3958999 3970615
56172 3970615 3961090 3930960 3881455 3814359 3731738 3636045 3529971 3415851 3295622 3171567 3046289
56161 3046289 2921620 2798330 2677305 2560084 2447711 2340049 2236904 2138832 2046064 1957792
56151 1957792 1873562 1794331 1720943 1652552 1587958 1527705 1473282 1424702 1380362 1338980 1300260
56140A300260l6310l4239l1765k8491k5367k3402k2281k1109j9527j7460j4789
56129A025520j2039j0352j0048j0102r477q104o360m629l551l438l340k067j26
56116I41887J004J382K367L865M297L710M225O421Q038P657P095Q364J0563J1939
56102A022814J2988J5011J7147J7495J6401J6075J7400J9229K0830K3122K6936
56091A225448L1451L5049L7368M0076M5336N3350O1975O9428P6540Q4874R3302
56080A854197R8669R9740R8020R4370Q7539P7161O5783N6374M9590M4752M1577
56069B667772L9467L6743L2249K6573K0654J4601Q701L834k80n624j3624k3916
56057B807150l6026n0098o4887p7299q5353q9565r0284q6375p8223o9358o2607
$$ plain form
56140 1300260 1263950 1229711 1197946 1169455 1144088 1120686 1098405 1077296 1057769 1040309 1025520
56129 1025520 1013481 1003129 993081 982979 973502 965398 959038 954409 950858 947420 944080 942013 941887
56116 941887 942891 944273 946640 950505 954802 958512 962737 969158 977196 984853 991948 1000312 1010875 1022814
56102 1022814 1035802 1050813 1067960 1085455 1101856 1117931 1135331 1154560 1175390 1198512 1225448
56091 1225448 1256899 1291948 1329316 1369392 1414728 1468078 1530053 1599481 1676021 1760895 1854197
56080 1854197 1952866 2052606 2150626 2244996 2332535 2409696 2475479 2531853 2581443 2626195 2667772
56069 2667772 2707239 2743982 2776231 2802804 2823458 2838059 2846760 2850594 2850314 2844690 2831066 2807150
56057 2807150 2771124 2721026 2656139 2578840 2493487 2403922 2313638 2227263 2149040 2079682 2017075
56046B017075n6811m9749m2280l6769l3102k9158k4331j9894j6575j3922j1484
56035A683000q900n472j299K092L675M448N759P342Q443R395J0621J1472J1580
56022A742156J1906J3031J4097J4792J6369J9058K0711K0142J9656K1816K5403
56011A939137K7262K6767K5899K6022K6897K8020K8984K9217K8953K9471L1201
56000B247830L2942L3949L5014L6465L7315L7538L8659M0755M1735M1111M1363
55989B664676M3765M6133M6867M7758N0249N2481N2941N3599N6304N9480O1570
55978C235823O4264O8798P2683P3994P5299P9114Q3100Q4277Q4617Q7534R2057
55967D101560R5530R9047J04888J11311J15339J18342J23586J30650J37310J44285
$$ plain form
56046 2017075 1960264 1910515 1868235 1831466 1798364 1769206 1744875 1724981 1708406 1694484 1683000
56035 1683000 1674100 1668628 1667329 1669421 1673096 1677544 1683303 1690645 1699088 1708483 1719104 1730576 1742156
56022 1742156 1754062 1767093 1781190 1795982 1812351 1831409 1852120 1872262 1891918 1913734 1939137
56011 1939137 1966399 1993166 2019065 2045087 2071984 2100004 2128988 2158205 2187158 2216629 2247830
56000 2247830 2280772 2314721 2349735 2386200 2423515 2461053 2499712 2540467 2582202 2623313 2664676
55989 2664676 2708441 2754574 2801441 2849199 2899448 2951929 3004870 3058469 3114773 3174253 3235823
55978 3235823 3300087 3368885 3441568 3515562 3590861 3669975 3753075 3837352 3921969 4009503 4101560
55967 4101560 4197090 4296137 4401025 4512336 4627675 4746017 4869603 5000253 5137563 5281848
55957E281848J52954J61133J66666J72279J81329J91890K00916K10639K24137
55948F943791K38079K47449K54444K64841K78194K89968L00926L15608L33266
55939I466566L49350L64803L84759M08816M31620M52846M77677N07408N38190
55930A3382035N69260O04090O43354O84934P30616P84486Q45276R08705R76195
55921B0128951J052462J135931J221268J309599J405689J506733J605685J704782
55913C1071100J813834J936005K067650K211147K374772K560625K766522K999020
55905D9800675L270392L584364L940698M352085M839173N410582O066194O816945
55897H8081108P679789Q656899R746034J0969710J2366757J3958604J5753995
$$ plain form
55957 5281848 5434802 5595935 5762601 5934880 6116209 6308099 6509015 6719654 6943791
55948 6943791 7181870 7429319 7683763 7948604 8226798 8516766 8817692 9133300 9466566
55939 9466566 9815916 10180719 10565478 10974294 11405914 11858760 12336437 12843845 13382035
55930 13382035 13951295 14555385 15198739 15883673 16614289 17398775 18244051 19152756 20128951
55921 20128951 21181413 22317344 23538612 24848211 26253900 27760633 29366318 31071100
55913 31071100 32884934 34820939 36888589 39099736 41474508 44035133 46801655 49800675
55905 49800675 53071067 56655431 60596129 64948214 69787387 75197969 81264163 88081108
55897 88081108 95760897 104417796 114163830 125133540 137500297 151458901 167212896
55890A67212896J7774337K0022196K2416200K4780032K6824184K7980946K7247383
55883C34258174K3474493J6182354O236334m380926j3607444k0247536k4143572
55876C17771877k5750181k5689630k4548698k2806233k0792581j8709161j6692800
55869A62782593j4841995j3198524j1754364j0492910r404796q468992p650410
55862H6970602o923464o278070n701423n174862m691286m256676l871003l523246
55854D6550572l206666k923116k670162k438632k225379k035153j867704j715324
55846B7468436j575015j450974j343143j244698j153041j072355j003043r38904
55838A7687263q77255q22132p74884p30708o87203o47825o14045n81761n48311
$$ plain form
55890 167212896 184987233 205009429 227425629 252205661 279029845 307010791 334258174
55883 334258174 357732667 373915021 380151355 375770429 362162985 341915449 317771877
55876 317771877 292021696 266332066 241783368 218977135 198184554 179475393 162782593
55869 162782593 147940598 134742074 122987710 112494800 103090004 94621012 86970602
55862 86970602 80047138 73769068 68067645 62892783 58201497 53944821 50073818 46550572
55854 46550572 43343906 40420790 37750628 35311996 33086617 31051464 29183760 27468436
55846 27468436 25893421 24442447 23099304 21854606 20701565 19629210 18626167 17687263
55838 17687263 16810008 15987876 15212992 14482284 13795081 13147256 12533211 11951450 11403139
55829A1403139n16232m87777m61969m38650m19242m02099l83282l62992l45076
55820G585820l29608l12477k93077k75598k61560k47857k33603k22135k14324
55811E195581k06262j95761j85354j76846j68526j59706j52564j47385j41230
55802C661947j33381j27069j23793j20819j16253j11785j08388j04025r7734r1657
55792B527043q6943q1817p5577p0287o6714o2674n7304n2903n0728m8963m6552
55781A826581m5051m4876m3755m0762l7998l6506l4536l1674l0453l1686l2267
55770A417017l0080k7228k5914k4909k2789k1047k0970k0784j8952j7325j7888
55759A169131j9100j8584j7112j6841j7605j7798j7213j6363j4650j1655q811
$$ plain form
55829 11403139 10886907 10399130 9937161 9498511 9079269 8677170 8293888 7930896 7585820
55820 7585820 7256212 6943735 6650658 6375060 6113500 5865643 5632040 5409905 5195581
55811 5195581 4989319 4793558 4608204 4431358 4262832 4103126 3950562 3803177 3661947
55802 3661947 3528566 3401497 3277704 3156885 3040632 2928847 2820459 2716434 2618700 2527043
55792 2527043 2440100 2358283 2282706 2212419 2145705 2083031 2025727 1972824 1922096 1873133 1826581
55781 1826581 1781530 1736654 1692899 1652137 1614139 1577633 1543097 1511423 1480970 1449284 1417017
55770 1417017 1386937 1359709 1333795 1308886 1286097 1265050 1244080 1223296 1204344 1187019 1169131
55759 1169131 1150031 1131447 1114335 1097494 1079889 1062091 1044878 1028515 1013865 1002210 993399
55748I93399p580p439p426p983r338r921q505o363n222m614l247j522o70n58l74
55733I12637l07q68j448j201n02k37n79j450l013m801n776o238p893j0941j2877
55718H54506j1780r123p560p236o127l100J018M634O249M785M90m808r206j2209
55704H00533j4450j6591j8761k0146j9191j5465j1212r343r802r752p728n427
55692F42665m797n558o455p053p248o835o562p790j0192j1559j0761r043p611
55679E41201o071m385m041n731p779q386p850p206o533n978o617q598j0088r672
55665D42266q279p291o366m795l350k938k764j691k31N76J120K362L912M693M692
55650D21916M637M613M135K953J012j415l074k754j608k454n748q441q256o896
$$ plain form
55748 993399 985819 978380 970954 962971 953633 943712 935207 928844 923622 919008 915761 914239 913569 913011 912637
55733 912637 912330 911462 910014 908813 908311 908074 907495 906045 903032 898231 892455 886217 878324 867383 854506
55718 854506 842726 833603 826043 818807 812680 809580 810598 815232 821481 826266 826756 821948 812742 800533
55704 800533 786083 769492 750731 730585 711394 695929 684717 675374 665572 655820 648092 642665
55692 642665 637868 632310 625855 618802 611554 604719 598157 590367 580175 568616 557855 548812 541201
55679 541201 535130 530745 526704 520973 513194 504808 496958 489752 483219 477241 470624 462026 451938 442266
55665 442266 433987 426696 420330 415535 412185 409247 406483 404792 404561 405137 406257 408619 412531 417224 421916
55650 421916 426553 431166 435301 438254 439266 437851 434777 432023 430415 427961 422213 413772 405516 398620
55636C98620p045q347q646p529o090m523k634j671k945n165n576l461o61J079
55622C35406J395M56j170k148j573k69N33J172K518L722L105R65n59l58O91J558
55606C45444K111K203J447K17m96m69l72m19j05M98L99r53k731l549k845j290
55590C39090n6L82P35J792K941K740J079m23o12j02J77K46J4j457m293o756p370
55573C28127o973p151p689p307o065n189m981m674m138m188n113o062n995m544
55559B48058k148J26J296J400J126L89j477l761m374k698p94n20j220j644k387
55544B31372m403o449o286l718o40J309J681O87p69j393j140j398k439k362k51
55529B03801J724J526O57J503K980K254l67j814j028J01N27J272K554K956K299
$$ plain form
55636 398620 391575 383228 374582 367053 360963 356440 353806 352135 349190 344025 338449 334988 334327 335406
55622 335406 336801 337257 336087 333939 332366 332097 332630 333802 336320 340042 343147 344112 343553 343195 343886 345444
55606 345444 347555 349758 351205 351422 350926 350457 350085 349666 349561 350059 350458 349505 346774 343225 340380 339090
55590 339090 339034 339416 340151 341943 344884 347624 348703 348280 347668 347566 347743 347989 348003 346546 342253 335497 328127
55573 328127 321154 314003 306314 299007 292942 287753 282772 278098 273960 269772 264659 258597 252602 248058
55559 248058 245910 246036 247332 248732 249858 250247 248770 245009 240635 237937 237143 236623 235403 233759 231372
55544 231372 226969 220520 214234 210516 209876 211185 212866 213553 212784 211391 210251 208853 206414 204052 203801
55529 203801 205525 207051 207708 209211 212191 214445 214078 212264 211236 211337 211864 213136 215690 218646 220945
55514B20945K517M623P156Q529Q826Q471P148M880K492K96k076m133m615l613
55500B61446k862l428m704o004p284p896o651l866j640j305k084k727l051l212
55486B04732k990k317j439l82O06L39j855m203m120j731L21O92N71Q96R35L54
55470A90409J74P29J002Q61J576L022K981O91j368j067J80j01j652k500k299k324
55454A90314l034l746m140m297l773k219l89Q30J702K700L013J550j104l151l695
55439A70561l218k337j321n21k03j31j47p43k117l140k372n5J816J511q02l318
55423A53463m183l067j334l96m0Q69K293K887K172J324J199R95j82j646k191j888
55407A50275j633j579j215m81J41L77K41k30p41p96l85r9j49n7K42nj057j896
$$ plain form
55514 220945 223462 228085 235241 243770 252596 261067 268215 273095 275587 275883 273807 269674 265059 261446
55500 261446 258584 255156 250452 244448 237164 229268 222617 218751 217111 215806 213722 210995 207944 204732
55486 204732 201742 199425 197986 197604 198210 198549 196694 192491 188371 186640 186961 187653 188224 189120 190055 190409
55470 190409 190583 191312 192314 193175 194751 197773 200754 201445 200077 199010 199190 199089 197437 194937 192638 190314
55454 190314 187280 183534 179394 175097 171324 169105 168716 169546 171248 173948 176961 178511 177407 174256 170561
55439 170561 167343 165006 163685 163164 162961 162830 162683 161940 159823 156683 154311 154256 156072 157583 156781 153463
55423 153463 149280 146213 144879 144483 144443 145312 147605 150492 152664 153988 155187 156182 156000 154354 152163 150275
55407 150275 148642 147063 145848 145367 145508 145885 146126 145896 145155 144359 143974 143875 143726 143669 143911 143906 142849 140953
55389A40953j533l92L73L19j34l27L03J692K717K201P14J04Q67J451P82j81l91
55372A49518n10j405k276j946q23o0K64O10O81K18J35J047J609L45j614j772N
55355A44026J288O61n76p38L7P14J049J370J576J282N49j12k99j66l48j294k467
55338A46552k654j495j30K43j52l38j09P5K08O66J273J405R33K71l17p39o97m0
55320A44955O56N85l85j740k845l026j868p3P38k8r52m40J145K305K460K017J120
55303A44624j76j067q33p8K53N42J580K441J301j577l688l467j996r38m24K69
55287A36766J175J776J839J415N82l23q06q53r24j213j514j826k341k793k588
55272A28372j612k73J200K760L985M436M312L890K746O65j097j055J73N20m13
$$ plain form
55389 140953 139420 139028 139401 139720 139586 139259 139562 141254 143971 146172 146886 146990 147857 149308 150090 149909 149518
55372 149518 149008 147603 145327 143381 142558 142498 142762 143372 144053 144271 144406 145453 147062 147407 145793 144021 144026
55355 144026 145314 145975 145399 144661 144698 145412 146461 147831 149407 150689 151238 151126 150827 150661 150313 149019 146552
55338 146552 143898 142403 142273 142516 142364 142026 141917 141992 142200 142866 144139 145544 146477 146748 146431 145692 144995 144955
55320 144955 145611 146196 145811 144071 141226 138200 136332 136259 136997 136969 136017 135577 136722 139027 141487 143504 144624
55303 144624 144448 143381 142548 142470 142723 143265 144845 147286 148587 147010 143322 139855 137859 136921 136497 136766
55287 136766 137941 139717 141556 142971 143553 143230 142424 141571 140647 139434 137920 136094 133753 130960 128372
55272 128372 126760 126487 127687 130447 134432 138868 143180 147070 149816 150481 149384 148329 148502 149022 148609
55257A48609p94M24J788J619L74m70o81j066j923k786l158k624q65J563L151K914
55241A46075J459k4j048j489r30N07J509R74l24o23N41J949K403J774N36p18j260
55224A51311p99k06q72k941m917n220l668j227J063K571K987K362J150r1j015
55209A40488j473j416q96K6J375L003M129L589J099j966l656l382k375j990k177
55194A34378k020j213k65N33J387K175K190J134l38j405j816j464q5J933L052
55179A38176J913r20l336l716k262m18M83K14k69N9R47J116K36k64Q53K630L081
55162A38523J843M16j0L20O62N77j86j393j883o69J380K241J356K26j8j4n03p71
55144A42097P4J389J913J631J475J645J420M69o87j486j893k172k573l094l229
$$ plain form
55257 148609 147815 148239 150027 151646 152020 151550 150869 149803 147880 145094 141936 139312 138447 140010 143161 146075
55241 146075 147534 147510 146462 144973 144043 144550 146059 147033 146709 146086 146627 148576 150979 152753 153289 152571 151311
55224 151311 150512 150306 149434 146493 141576 136356 132688 131461 132524 135095 138082 140444 141594 141503 140488
55209 140488 139015 137599 136703 136729 138104 141107 145236 148825 149924 147958 144302 140920 138545 136555 134378
55194 134378 132358 131145 130880 131413 132800 134975 137165 138299 137961 136556 134740 133276 133191 135124 138176
55179 138176 140089 139169 135833 132117 129855 129437 129920 130134 129865 129924 130871 131987 132223 131959 132812 135442 138523
55162 138523 140366 140782 140772 141092 141754 142331 142145 140752 138869 138200 139580 141821 143177 143403 143385 143371 142868 142097
55144 142097 142171 143560 145473 147104 148579 150224 151644 152113 151426 149940 148047 145875 143302 140208 136979
55129A36979k297m78J007J351J233J695K401K052L47j416j844q01Q16K022K304
55114A45371J751Q85M5j017k535l858l857k308k93R80J275J041O21J93Q9N68J310
55097A40261J648J356Q91O95O10K93n1Q8M56r3k107m123l682j14M126N586L277
55080A49117m23k365j716j55N42L55K96O73Q81O10K91J49k14q48q92J14J051M97
55062A47963j052j540j08J727K194J495J081J413J604J056L68L99J155J964K254
55047A61973J773N58q70j622j341q24j081j830j703j73J545K029J324L29o54j639
55031A57794j776j04K547L975L287J720L95j029k556k680n65J906K308J048N18
55016A66788J431K121J420J69n05n97m10N9L23n16k166l009k327j427j597k176
$$ plain form
55129 136979 134682 134204 135211 136562 137795 139490 141891 143943 144290 142874 141030 140229 141045 143067 145371
55114 145371 147122 148007 148052 147035 144500 140642 136785 134477 134184 135164 136439 137480 138101 138294 138383 138951 140261
55097 140261 141909 143265 144156 144851 145461 145754 145703 145791 146247 146154 144047 139924 136242 136128 140254 145840 149117
55080 149117 148694 146329 144613 144458 145000 145355 145651 146324 147205 147815 148106 148255 148041 147193 146301 146415 147466 147963
55062 147963 146911 145371 145263 146990 149184 150679 151760 153173 154777 155833 156201 156600 157755 159719 161973
55047 161973 163746 164304 163434 161812 160471 159647 158566 156736 155033 154860 156405 158434 159758 160087 159433 157794
55031 157794 156018 155914 158461 162436 165723 167443 167838 166809 164253 161573 161008 162914 165222 166270 166788
55016 166788 168219 170340 171760 171929 171424 170827 170417 170476 170799 170283 168117 165108 162781 161354 159757 157581
55000A57581j726j89J274J897J737J055L06K75J252K286K138Q08n36r97p08l57
54984A66096m74j098j646j343j32J029J088rj336j812r50P04J755J090q09k197
54968A59956k004r40m04q69j618j622m09J378K215J242l23k90J655L387L073J329
54952A65756j62q54j124r45k50K31q3m01K59J191R08l90r71k07O77Q04R20J747
54934A67106K573K487J932J789J755Q12r79k292k169r80K43P73K92j121k635k857
54918A66729j152J292K451J758P65J043K039J865q8k397l482l138j837J78K334
54903A68360L315K480J074Q04J496J508L62m27L78J868K167Q20q47j542j404j487
54887A78925k192k722k161q50m7j48k4J312L000L314K050P99P21J185J059M03
$$ plain form
55000 157581 155855 155666 156940 158837 160574 161629 161935 162210 163462 165748 167886 168694 168158 167161 166453 166096
54984 166096 165622 164524 162878 161535 161403 162432 163520 163511 162175 160363 159413 160117 161872 162962 162153 159956
54968 159956 157952 157012 156608 155739 154121 152499 152090 153468 155683 156925 156602 156312 157967 161354 164427 165756
54952 165756 165594 164740 163616 162671 162421 162652 162569 162168 162427 163618 164526 164136 163165 162958 163635 164439 165359 167106
54934 167106 169679 172166 174098 175887 177642 178454 177475 175183 173014 172034 172277 173050 173342 172221 169586 166729
54918 166729 165577 166869 169320 171078 171843 172886 174925 176790 176702 174305 170823 167685 165848 166026 168360
54903 168360 171675 174155 175229 176033 177529 179037 179399 178972 179350 181218 183385 184205 183358 181816 180412 178925
54887 178925 176733 174011 171850 171000 170953 170805 170781 172093 175093 178407 180457 181256 181977 183162 184221 184624
54871A84624J4j3l11r01q01P43L123M827M987M115L402L447L855M023M006M422
54855B23562N591P022P799P316N627L340J224l08j477k780m257n239n042l810
54841B38568k404j481j078j141j984l687n314n522m065k159j069q91r93j053j084
54826B04643r50o07m60q42j289j044l4J255K531L586L937L505L341M411N950O328
54810B34261N501M951N117M613K628L64q56j465k468l672m357m686n118n336n007
54795B24470m741m985m972m125l578m451n486m576k200r80j747k435j537l65o43
54780A77649j657j430K46J544J022p84k129j773j42R19Rj949k426m52J857J876
54764A72380j00j299j78J728K105Q22l67n23n42j401k558k794j893n76Q10K417
$$ plain form
54871 184624 184638 184625 184314 183413 182612 183355 186478 191305 196292 200407 203809 207256 211111 215134 219140 223562
54855 223562 229153 236175 243974 251290 256917 260257 261481 261173 259696 256916 252659 247420 242378 238568
54841 238568 236164 234683 233605 232464 230480 226793 221479 215957 211892 209733 208664 207773 206780 205727 204643
54826 204643 203693 203086 202626 201784 200495 199451 199417 200672 203203 206789 210726 214231 217572 221983 227933 234261
54810 234261 239762 244713 249830 254443 257071 257435 256579 255114 252646 248974 244617 239931 234813 229477 224470
54795 224470 219729 214744 209772 205647 202069 197618 192132 187556 185356 184376 182629 180194 178657 178292 177649
54780 177649 175992 174562 174808 176352 177374 176590 174461 172688 172546 173465 173474 171525 169099 168647 170504 172380
54764 172380 172280 170981 170803 172531 174636 175458 175091 174568 174026 172625 170067 167273 165380 164804 165614 168031
54748A68031L862M294L706K988K432J337k58q86K68J732J607K11n71l6P30P53
54732A90200K01l92p35n30K07P28M72K30J164K859L763L445K859K379J240o42
54716B07448j990j903r42J04J100J736J352M08O49K713M858N192M053L110L251
54701B31139M494O784R365J0302Q345M780J926K60j496l877n911o747o548n719
54687B47097m540l694l801m203l574j993j086j596k118j130P06J344n0k231l318
54672B15813k483m04J336J416r6j680j767k47J574K425K273K064K533L467M257
54657B30481M851N667O573O600N247L437K336J512n08l781o326o623n598n157
54643B38711n439m972l212j507j204j947k472k227j549q81o27j193k392l158k742
$$ plain form
54748 168031 171893 176187 179893 182881 185313 186650 186392 185506 185774 187506 189113 189324 188753 188717 189447 190200
54732 190200 190401 190009 189274 188744 188951 189679 190151 190381 191545 194404 198167 201612 204471 206850 208090 207448
54716 207448 205458 203555 202613 202717 203817 205553 206905 207313 207962 210675 215533 220725 224778 227888 231139
54701 231139 235633 242417 251782 262084 270429 275209 277135 277395 275899 272022 266111 259364 252816 247097
54687 247097 242557 238863 235062 230859 227285 225292 224206 222610 220492 219362 220068 221412 221362 219131 215813
54672 215813 213330 212926 214262 215678 215582 213902 212135 211888 213462 215887 218160 220224 222757 226224 230481
54657 230481 235332 240999 247572 254172 259419 262856 265192 266704 266196 262415 256089 249466 243868 238711
54643 238711 233272 228300 225088 223581 222377 220430 217958 215731 214182 213301 212674 211481 209089 205931 203189
54628B03189j874j755k136j632m5J024M43q07j208r17j199k302l268l540l382
54613A80591k680p72K014L885L399J180r37j866j826j449j111r32q12m42K45P66
54597A79253O52J64j7K96O39P08O34M06l80j745k885l029k495k037j412L94L226
54580A72372N199M825K943J541J183Q93K75J42P70J023M2j277j526p19PJ07L3
54563A87833K46P36J300J593J144K0q35o64n1k24j447k734k974j832J14J608J597
54546A85430N00j09L21M29p06j525r0K603L541J717q43k220k658l003l055k371
54530A77961j207J84J918L461L589K147M88m65j224j954j467P60K911K840Q42
54515A90784r97j500j106n16n5j2l83n79k43N2j39l4J273L104L731K460K04j673
$$ plain form
54628 203189 201315 199560 197424 195792 195747 196771 197214 196407 195199 194282 193083 190781 187513 183973 180591
54613 180591 177911 177139 179153 183038 186437 187617 186680 184814 182988 181539 180428 179496 178684 178242 178487 179253
54597 179253 179905 180069 180052 180348 180987 181695 182329 182735 182355 180610 177725 174696 172201 170164 168752 169146 172372
54580 172372 177571 182396 185339 186880 188063 188956 189231 189373 190143 191166 191208 189931 188405 187686 187693 187800 187833
54563 187833 188079 188815 190115 191708 192852 192872 192037 191373 191322 191098 189651 186917 183943 182111 182225 183833 185430
54546 185430 185930 185821 186142 186571 185865 184340 184250 186853 190394 192111 191268 189048 186390 183387 180332 177961
54530 177961 176754 176938 178856 182317 185906 188053 188541 188076 186852 184898 183431 184191 187102 189942 190784
54515 190784 189787 188287 187181 186665 186610 186598 186215 185636 185393 185445 185306 185272 186545 189649 193380 195840 196044 194371
54497A94371k235j187P43J933J450K46j59K64L76j67n49k17O36J927L723N254
54481B06409N142L040J75k087l390l831l237j542N60J985K134J248Q7p29j216
54466B04748j762k249k018r85k00m91j128p77N29J450J282O72K45l86j684k998
54450A94248l031j289J300L150L258J824j26j600j963q76J309L029K449l86l063
54435A98233l213r18J845L386L233J779J26l27O53J617J348O36Q23J435R84l40
54419B11300q46r3N08J53k82n6L48O67J512K737K898J551N02J332K993L386K209
54402B30819O43q14k305l101k192k66P71M48K22R86J723J389N78J53n41k523m775
54385B21215m845k152Q14J415Q3o21L66J404Q46m79n88O39J239k3j962k638j776
$$ plain form
54497 194371 192136 190949 191692 193625 195075 195321 195162 195426 195802 195635 195086 194869 195505 197432 201155 206409
54481 206409 211551 214591 214766 212679 209289 205458 202221 200679 201239 203224 205358 206606 206693 205964 204748
54466 204748 202986 200737 198719 197734 197534 197043 195915 195138 195667 197117 198399 199071 199316 198930 197246 194248
54450 194248 191217 189928 191228 194378 197636 199460 199334 197734 195771 194895 196204 199233 201682 201296 198233
54435 198233 195020 194102 195947 199333 202566 204345 204471 204144 204797 206414 207762 208398 209221 210656 211640 211300
54419 211300 210454 210361 210869 211022 210740 210684 211032 211699 213211 215948 218846 220397 220899 222231 225224 228610 230819
54402 230819 231462 230648 228343 225242 223050 222784 223555 224003 224225 225211 226934 228323 228901 229054 228513 225990 221215
54385 221215 216370 214218 215032 216447 216530 215909 216275 217679 218525 218046 217458 218097 219336 219313 217351 214713 212937
54368B12937p00l89n29m22m7J36j8j98j83j48k03MP91J656J722J141J222K540
54350B19312L678K873N67r81n87O48J306J506K009K639K783K752L244L750K918
54335B48417P32r37o05R51J899J715J340J402J466J106N80nj154k827l711k741
54319B47628q66k3n78j060n36K46M49N73J369K431K866K535J817P34o58j579j168
54302B54180M58K465M015M258K603n9j483p04M46o4j320r62Q74J575l5k171l017
54285B61059k914k911l014k925k845k627j662m75p47k625l749k526p17q59k357
54270B28106k400j11K453L371K910K250J787J373J053Q96Q03P63P79N02m02j450
54254B42683j733j227j045k030l600m224k911k18K050K287N74j443k261j780p25
$$ plain form
54368 212937 212237 211848 211319 210897 210850 210986 210968 210770 210587 210439 210236 210240 211031 212687 214409 215550 216772 219312
54350 219312 222990 225863 226430 225449 224862 225510 226816 228322 230331 232970 235753 238505 241749 245499 248417
54335 248417 249149 248212 247607 248558 250457 252172 253512 254914 256380 257486 258066 258061 256907 254080 250369 247628
54319 247628 246762 246739 246161 245101 244565 244811 245260 245833 247202 249633 252499 255034 256851 257585 256927 255348 254180
54302 254180 254638 257103 261118 265376 267979 267920 266437 265733 266179 266115 264795 263833 264707 266282 266247 264076 261059
54285 261059 258145 255234 252220 249295 246450 243823 242161 241686 240939 238314 234565 232039 231322 230463 228106
54270 228106 225706 225595 228048 231419 234329 236579 238366 239739 240792 241688 242491 243254 244033 244535 244133 242683
54254 242683 240950 239723 238678 236648 233048 228824 225913 225695 227745 230032 230606 229163 226902 225122 224397
54239B24397M29J323J296O6j426j801p89O81J735K119J796R05Q3m3L18N49P18
54222B32356J335K128K120J086o4n79o14m46p5R7o29j841j813K79K845L614K290
54205B42089M41o70q98l18R89K286K633K260K244K600K069L66q58l17P93M16j391
54188B54734k707k442j226K39J782K590J355j526l525k987j291p01j152q66N75
54173B42852J598J052l64j290j094J54J913L050K561Q18o41q83m17j22j88l46
54157B48653l37M3O39O23n71k039k238j207n86j145j761j471j015j351j921j679
54141B32637p56R0Q49J781K401K235J954K278K460J390k93r63o56j022k428l025
54125B38932j505P23J362J83r63o45O91J654J450M28m74n61J61J119J609J160
$$ plain form
54239 224397 224826 226149 227445 227511 226085 224284 223495 224176 225911 228030 229826 230731 230814 230771 231089 231638 232356
54222 232356 233691 235819 237939 239025 238961 238382 237768 237322 237247 237344 236715 234874 233061 233340 236185 239799 242089
54205 242089 242530 241860 240962 240644 241633 243919 246552 248812 251056 253656 255725 256091 255233 254916 255709 256125 254734
54188 254734 252027 249585 248359 248598 250380 252970 254325 252799 249274 246287 244996 244295 243143 242277 242852
54173 242852 244450 245502 245138 243848 242754 242908 244821 247871 250432 251250 250609 249726 249309 249187 248999 248653
54157 248653 248316 248359 248998 249621 249050 247011 244773 243566 242980 241835 240074 238603 237588 236237 234316 232637
54141 232637 231881 231971 232820 234601 237002 239237 241191 243469 245929 247319 247026 246063 245407 244385 241957 238932
54125 238932 237427 238150 239512 239695 238732 238087 238778 240432 241882 242310 241836 241275 241436 242555 244164 245324
54109B45324j91j701k339j781p56m9M80J345K191J955L21j646k625k337j470o93
54093B36028n3P51J719K291J957J051N10O86Q94N82L36R34J814J505l55k279k642
54076B45729j473k35m8n78o65J31Q73M00j021j848j263j95J95K15Q56J884K069
54059B45026J176L92N44R95Q58L97N02J419K584L374L426K582J055m25j103q22
54043B61980K7J036K002K652K516J369k80j377j322o19k46l95l21N10J660K434
54027B71626K757K960L224L762M940O518P200N825K891J51j166j167o96o78j844
54012C06303m022n784n623l659j407J1O29P76N80N24J305K695L371K510Q20m55
53996B98574q49n89R8R17J332J126Q27J070J874K947M233N614O544O624O313O395
$$ plain form
54109 245324 245133 243432 241093 239312 238556 238507 238987 240332 242523 244478 244799 243153 240528 238191 236721 236028
54093 236028 235975 236726 238445 240736 242693 243744 244254 244940 245834 246416 246752 247686 249500 251005 250650 248371 245729
54076 245729 244256 244021 243973 243395 242730 242861 243734 244134 243113 241265 240002 239807 240002 240217 241073 242957 245026
54059 245026 246202 246594 247138 248133 248991 249388 249890 251309 253893 257267 260693 263275 264330 263905 262802 261980
54043 261980 262007 263043 265045 267697 270213 271582 271302 269925 268603 267984 267738 267343 267022 267532 269192 271626
54027 271626 274383 277343 280567 284329 289269 295787 302987 308812 311703 311854 310688 309521 308825 308147 306303
54012 306303 302281 296497 290874 287215 285808 285819 286448 287224 287804 288328 289633 292328 295699 298209 299029 298574
53996 298574 297725 297136 297234 298151 299483 300609 301436 302506 304380 307327 311560 317174 323718 330342 336655 343050
53980C43050O914P165O719N925N358N263N692O681P944Q637P937O062M406M205
53966D31958N068N253L541N21k207l672m030l872l677l764m111m232l648k575
53952D10553j863k300m131o774q773q641o426l903k512j834j037r02k620n043
53938C53794n334k831k51j08j627k518k378k550l429l755k637q50J67j81j384
53923C24128k444k666k129j394n95O05J955K235Q14j067j613p31N9r3m35q4P67
53906C17312J530K174K654K340J001k8J078M265P281Q183P384O673O780O985O763
53891C82375O686P339Q421R475J0567J1426J0713P478K930m72j740j957k160k003
53877D49078r86K42O95L52j98p32j175j015J22J575K229J936J585J871K626L494
$$ plain form
53980 343050 349964 357129 363848 369773 375131 380394 386086 392767 400711 409348 417285 423347 427753 431958
53966 431958 437026 442279 445820 446341 444134 440462 436432 432560 428883 425119 421008 416776 413128 410553
53952 410553 408690 406390 402259 395485 386712 378071 371645 367742 365230 363396 362359 361457 358837 353794
53938 353794 348460 345629 345378 345270 343643 341125 338747 336197 332768 329013 326376 325526 325693 325512 324128
53923 324128 321684 319018 316889 315495 314900 315505 317460 319695 320509 319442 317829 317098 317157 317064 316629 316545 317312
53906 317312 318842 321016 323670 326010 327011 326983 328061 332326 339607 347790 355174 361847 368627 375612 382375
53891 382375 389061 396400 404821 414296 424863 436289 447002 454480 457410 456938 455198 453241 451081 449078
53877 449078 448092 448334 449029 449381 449183 448451 447276 446261 446383 447958 450187 452123 453708 455579 458205 461699
53861D61699M591O187Q058R474R757Q821P254N822M884M276L716L176K901L200
53847E43816M106M921M365J782j717l955l814k329j476k234l967n387n899o198
53833E22014p469r760j1413j0767q298o196n747o006n514m354l881m899o820q388
53819D22502q813q213p114n592l328q92q6j860m391m901l312k287l359n078n709
53804C57567n616n519m455j688R11Q74j135k101q98N87O84mm57j055k355l566
53788C31774l465k161r12o89j465k470k678j572O0O47m48k036k355q54J393K717
53772C15486K171L02j241j197R2J236J462J230J312J912K695K987J934p30l686
53757C25965m638k498J349M417N466N207M910M856M408L433L117M691P488R210
$$ plain form
53861 461699 466290 472477 480535 490009 499766 508587 515841 521663 526547 530823 534539 537715 540616 543816
53847 543816 547922 552843 557208 558990 557273 553318 549504 547175 545699 543465 539498 534111 528212 522014
53833 522014 514545 504785 493372 482605 474307 468111 462364 456358 450844 446490 442609 437710 430890 422502
53819 422502 413689 405476 398362 392770 389442 388550 388464 386604 382213 377312 374000 371713 368354 363276 357567
53804 357567 351951 346432 341977 340289 341200 342074 340939 338838 337940 338527 339211 339207 338750 337695 335340 331774
53788 331774 328309 326148 325236 324547 323082 320612 317934 316362 316422 317069 316621 314585 312230 311376 312769 315486
53772 315486 317657 317959 316718 315521 315613 316849 318311 319541 320853 322765 325460 328447 330381 329651 325965
53757 325965 321327 318829 320178 324595 330061 335268 340178 345034 349442 352875 355992 360683 368171 377381
53743C77381Q576O771N549M866L661K190J864K851L617L214K534K647L199L243
53729D32163K672K008J602J714K524L364K783L45k461l972m362m835n425n048
53715D23072l611k596l127m558n606o104o718p349o863m747k349j673k997m443
53701C60331m253k827j838j825j775j083o73j540l052l570k431n81O71R43Q35
53686C37332J092J763K049J075j006k891l291k075j15J672K952L830M401M452
53672C51240L589J787k02j247q21N78J933K457J996J134Q91J826L392M477M615
53657C77645M198L649K978K231J685J458J553K255L741N184N292M088L204L806
53643D22967N123N689N266M620M259M282M902N906O116M615K272Q97R66J311J076
$$ plain form
53743 377381 385957 392728 398277 403143 406804 408994 410858 413709 417326 420540 423074 425721 428920 432163
53729 432163 434835 436843 438445 440159 442683 446047 448830 449175 446714 442742 438380 433545 428120 423072
53715 423072 419461 416865 413738 409180 403574 397470 390752 383403 376540 371793 369444 367771 364774 360331
53701 360331 356078 353251 351413 349588 347813 346730 346057 344517 341465 337895 335464 334883 335554 336497 337332
53686 337332 338424 340187 342236 343311 342305 339414 336123 334048 333933 335605 338557 342387 346788 351240
53672 351240 354829 356616 356414 355167 354346 354924 356857 359314 361310 362444 363335 365161 368553 373030 377645
53657 377645 381843 385492 388470 390701 392386 393844 395397 397652 401393 406577 411869 415957 419161 422967
53643 422967 428090 433779 439045 443665 447924 452206 457108 463014 469130 473745 476017 476914 477880 479191 480267
53628D80267O91O48M85l77j579k336k420k110j552p11K66R50Q21m61k490l840
53612D66252l114o65J397J443L4j155j516j671j843j366o7R96Q61Km13j63j6l55
53594D58641p55r67j353j859j449N36K926L642K094q6q86J47J978L467M247M567
53578D74890M790M947M603L316J422J26N18K524M984O677P261P202O963O406N265
53563E41894M061L896M946N864N506M711N221O998Q097P386N973N251M990M460
53549F19254M172N024O431O993O591O225N909M459J859J01P68K828L970L382K090
53534F80056J018n3j503k884l470l203k605k043j596j482j983k735k804j892r65
53519F51856r52j303q18L04N48n95j819k159k501l787m908m093j671K53O57M33
$$ plain form
53628 480267 480958 481606 482091 481714 480135 477799 475379 473269 471717 471006 471272 472222 473043 472582 470092 466252
53612 466252 463138 462473 463870 465313 465347 464192 462676 461005 459162 457796 457729 458725 459586 459588 459175 459012 458996 458641
53594 458641 457886 456919 455566 453707 452258 452794 455720 459362 461456 461370 460484 460631 462609 466076 470323 474890
53578 474890 479680 484627 489230 492546 493968 494094 494612 497136 502120 508797 516058 523260 530223 536629 541894
53563 541894 545955 549851 554797 560661 566167 570878 576099 583097 591194 598580 604553 609804 614794 619254
53549 619254 623426 628450 634881 641874 648465 654690 660599 665058 666917 667018 667786 670614 674584 677966 680056
53534 680056 681074 681021 679518 676634 673164 669961 667356 665313 663717 662235 660252 657517 654713 652821 651856
53519 651856 650904 649601 648783 649087 649635 649040 647221 645062 642561 638774 633866 629773 628102 628355 629012 629445
53503F29445L58N5o56r04m8J400K735L973N195O018O408O944P695P831P081O342
53487F89872O013N048K928J356K215M677O282O484P089R144J1450J2759J3654
53474G78971J5136J6687J7060J6261J5649J6319J8226K0560K2378K3007K2489
53463I82743K1590K1157K1625K3201K5906K8953L0752L0409K9052K8946L1218
53452A275552L4923L8276M0277M1067M1299M1439M1421M0777L9290L7500L6256
53441A708077L5655L4896L3415L1803L1087L1243L1066K9715K7900K7034K7434
53430B049325K8051K8009K7702K7893K8330K8090K7015K5859K4836K2951J9443
53419B337504J5305J2468J1516J0903Q596M125j165n484p922q716q731q984j0384
$$ plain form
53503 629445 629803 629858 629202 628298 628250 629650 632385 636358 641553 647571 653979 660923 668618 676449 683530 689872
53487 689872 695885 700933 703861 705217 707432 712109 718391 724875 731964 741108 752558 765317 778971
53474 778971 794107 810794 827854 844115 859764 876083 894309 914869 937247 960254 982743
53463 982743 1004333 1025490 1047115 1070316 1096222 1125175 1155927 1186336 1215388 1244334 1275552
53452 1275552 1310475 1348751 1389028 1430095 1471394 1512833 1554254 1595031 1634321 1671821 1708077
53441 1708077 1743732 1778628 1812043 1843846 1874933 1906176 1937242 1966957 1994857 2021891 2049325
53430 2049325 2077376 2105385 2133087 2160980 2189310 2217400 2244415 2270274 2295110 2318061 2337504
53419 2337504 2352809 2365277 2376793 2387696 2396292 2400417 2399252 2393768 2385846 2377130 2368399 2359415 2349031
53406B349031j3278j6950j9926k1419k2299k3984k6313k7471k6539k5108k5496
53395B100248k7772k9831l0111k9110k7989k6927k5518k3891k2546k1484k0302
53384A814767j8859j7170j4887j1669q065n273l721k526o82J520K869K977L133
53371A742414N048Q836J2782J5311J6752J8574K1199K3520K4799K5952K8209L1275
53359A974671L3830L5370L6496L7711L9166M1442M5081M9156N1880N3300N5710
53348B453813O0167O4194O4899O3434O3908O8003P3150P6561P8639Q0924Q2816
53337C230508Q2662Q0997Q0177Q0888Q1300Q0063P8158P6876P5647P3263P0083
53326D090622O7415O5318O2407N7855N2223M6341M0382L4360K8536K2856J6698
$$ plain form
53406 2349031 2335753 2318803 2298877 2277458 2255159 2231175 2204862 2177391 2150852 2125744 2100248
53395 2100248 2072476 2042645 2012534 1983424 1955435 1928508 1902990 1879099 1856553 1835069 1814767
53384 1814767 1795908 1778738 1763851 1752182 1744117 1738844 1735123 1732597 1731915 1733435 1736304 1739281 1742414
53371 1742414 1747462 1756298 1769080 1784391 1801143 1819717 1840916 1864436 1889235 1915187 1943396 1974671
53359 1974671 2008501 2043871 2080367 2118078 2157244 2198686 2243767 2292923 2344803 2398103 2453813
53348 2453813 2513980 2578174 2643073 2706507 2770415 2838418 2911568 2988129 3066768 3147692 3230508
53337 3230508 3313170 3394167 3474344 3555232 3636532 3716595 3794753 3871629 3947276 4020539 4090622
53326 4090622 4158037 4223355 4285762 4343617 4395840 4442181 4482563 4516923 4545459 4568315 4585013
53315D585013R654K069n529j3089k0699k8132l5281m2675n0813n9133o6236p1272
53303D203877p4588p6907p8392p8807p8279p7481p7036p6956p6707p5718p3889
53292C359117p1676o9603o7668o5416o2812o0738o0057o0212n9523n7203n4385
53281B669824n2368n0482m6957m1784l7207l4811l3480l1233k8095k5720k4780
53270B262907k4303k3503k2743k2323k1671k0319j8651j7109j5527j3885j2726
53259B050147j2134j1107q940o544n295m997m063j504K157N856Q855J0717J1366
53246B034514J1467J2042J3584J5992J9211K3036K6341K7732K7467K7722L0173
53235B269281L3930L6635L7149L6229L4927L3343L1197K8811K6939K5849K4897
$$ plain form
53315 4585013 4594667 4596736 4591207 4578118 4557419 4529287 4494006 4451331 4400518 4341385 4275149 4203877
53303 4203877 4129289 4052382 3973990 3895183 3816904 3739423 3662387 3585431 3508724 3433006 3359117
53292 3359117 3287441 3217838 3150170 3084754 3021942 2961204 2901147 2840935 2781412 2724209 2669824
53281 2669824 2617456 2566974 2520017 2478233 2441026 2406215 2372735 2341502 2313407 2287687 2262907
53270 2262907 2238604 2215101 2192358 2170035 2148364 2128045 2109394 2092285 2076758 2062873 2050147
53259 2050147 2038013 2026906 2017966 2011422 2006127 2001130 1997067 1995563 1997720 2003576 2012431 2023148 2034514
53246 2034514 2045981 2058023 2071607 2087599 2106810 2129846 2156187 2183919 2211386 2239108 2269281
53235 2269281 2303211 2339846 2376995 2413224 2448151 2481494 2512691 2541502 2568441 2594290 2619187
53224B619187K3038J9701J5296J0872P050L299j483p503j3501j7990k0821k3192
53212B613953k6122k9513l2724l5434l7550l8875l9488m0151m1491m3000m3663
53201B205942m3617m4131m5633m6772m6150m4271m2932m2962m3510m3348m2290
53190A720326m1189m0946m1499m1609l9989l6975l4572l4296l5314l5443l3702
53179A304792l1096k9049k7865k6841k5205k2755k0040j7940j6739j5762j4344
53168A057156j2926j2501j3227j4337j5264j6041j6703j7234j8096j9722k1331
53157H79774k1433j9904j8390j8035j7942j6793j4995j3957j3874j3617j2720
53146F98114j2083j2372j2880j2590j1705j1234j1360j1102r865q624q899j0694
$$ plain form
53224 2619187 2642225 2661926 2677222 2688094 2695144 2698443 2696960 2689457 2675956 2657966 2637145 2613953
53212 2613953 2587831 2558318 2525594 2490160 2452610 2413735 2374247 2334096 2292605 2249605 2205942
53201 2205942 2162325 2118194 2072561 2025789 1979639 1935368 1892436 1849474 1805964 1762616 1720326
53190 1720326 1679137 1638191 1596692 1555083 1515094 1478119 1443547 1409251 1373937 1338494 1304792
53179 1304792 1273696 1244647 1216782 1189941 1164736 1141981 1121941 1104001 1087262 1071500 1057156
53168 1057156 1044230 1031729 1018502 1004165 988901 972860 956157 938923 920827 901105 879774
53157 879774 858341 838437 820047 802012 784070 767277 752282 738325 724451 710834 698114
53146 698114 686031 673659 660779 648189 636484 625250 613890 602788 592923 584299 575400 564706
53134E64706j2216j1881j0060q375p778p895q023p863p264o002m267k834k420
53121D67828k972l736l810k816j343o77j554l286m540m835m680m378l676k570
53107D22955j652j214q63k59L14L93k31j658l683n273n240l742k253j652j355
53092C94587q28p09j583k641k663j517K99K689N227O188M124K19k517k606j304
53077C96965k79L31J024J506J300J001J638L062L839K935R08q05j355j038o24
53062D10408m85m65l34o0L29Q15J229J274Q54J47o89j576k256k378k091k040k464
53045D00218k719k143j118o98j287k117k092j015J24J22j011j894j376l6O14J91
53029C83763l64o19j349k775l512k343j31J236J217P34M67K76P7N7%n13j236j494
$$ plain form
53134 564706 552490 540609 530549 522174 514396 506501 498478 490615 483351 477349 473082 470248 467828
53121 467828 464856 461120 457310 454494 453151 452474 450920 447634 443094 438259 433579 429201 425525 422955
53107 422955 421303 420089 419226 418967 419281 419674 419443 417785 414102 408829 403589 399847 397594 395942 394587
53092 394587 393759 393050 391467 388826 386163 384646 384945 387634 392861 399049 403173 403392 400875 398269 396965
53077 396965 396686 397017 398041 399547 400847 401848 403486 406548 410387 413322 414230 413425 412070 411032 410408
53062 410408 409923 409458 409124 409064 409393 410208 411437 412711 413565 413712 413023 411447 409191 406813 404722 402682 400218
53045 400218 397499 395356 394238 393540 392253 390136 388044 387029 387153 387275 386264 384370 382994 382958 383572 383763
53029 383763 383399 382780 381431 378656 375144 372801 372670 373906 375123 375857 376324 376600 376677 376734 376734 376221 374985 373491
53011C73491j329j473k149k761k887k707k400j812j017m20j39K14R31J874K751
52996C60167L270L118K370J755J903K410K343J575Q61O47N91K89k15p10r88p46
52980C78640m3L49k42j320j788j414p94r2R42J704R58j267l125k983j142R12K121
52963C71416K289J775J315J432J631R48l88r69k99L02l54j550j867j226n55q7
52947C73813O63J581J915J533J133J069P58m62k357l846l819k070K74J571J329
52932C73085O98Q62J550J816J740K143K814K457Q34k41R54L581N004L893J613
52917D02803K91L53P01P47J139K297L234K721J143K48J056K742L776L520K382
52902D29153J022j75j143k041l025l846l945l082j704m87K37M99M60K75o0p74
$$ plain form
53011 373491 372162 370689 368540 365779 362892 360185 357785 355973 354956 354536 354397 354611 355542 357416 360167
52996 360167 363437 366555 368925 370680 372583 374993 377336 378911 379772 380419 381010 381299 381084 380374 379386 378640
52980 378640 378597 378946 378704 377384 375596 374182 373388 373296 374238 375942 376900 375633 372508 369525 368383 369295 371416
52963 371416 373705 375480 376795 378227 379858 380806 380418 379449 379150 379452 379098 377548 375681 374455 373900 373813
52947 373813 374476 376057 377972 379505 380638 381707 382465 382003 379646 375800 371981 369911 370185 371756 373085
52932 373085 373783 374645 376195 378011 379751 381894 384708 387165 387999 387758 388712 392293 397297 401190 402803
52917 402803 403094 403447 404148 404895 406034 408331 411565 414286 415429 415677 416733 419475 423251 426771 429153
52902 429153 430175 430000 428857 426816 423791 419945 416000 412918 411214 410727 410964 411463 411923 412198 412138 411364
52886D11364k039l398l904l035j322J31O40M15J45K20L40j8p87j330j339j256
52870C94827j457j598j276p70m25J78J485K784K927J991J142R36Q62N29N3p03
52854D01485k000l170l136k173j721k013j555L38K229K661K151J803J427M75l25
52839C96476j3P82P16j61q22j240k173l160k631l76J588J298q22k513k126k81
52823C84542Q76J26j124n06J847K966J223r39l06K315L266J584L08J690L875L925
52807D05668J967L77J52K78Q8J70Q59J402J096K27o04j347k114k512k003p58L11
52790D03257M62l21j671l322m887n634n174m256m021m357l901k198q13j350l050
52775C58764l587j957N67K309K777K273J150Kl33L14J032R08J39m12m35m74j105
$$ plain form
52886 411364 409325 405927 402023 398988 397666 397797 398437 398852 398997 399217 399557 399539 398752 397422 396083 394827
52870 394827 393370 391772 390496 389726 389301 389479 390964 393748 396675 398666 399808 400744 401606 402135 402188 401485
52854 401485 399485 396315 393179 391006 389285 387272 385717 386055 388284 390945 393096 394899 396326 396801 396476
52839 396476 396463 397245 397961 397800 396978 395738 393565 390405 387774 387398 388986 390284 389462 386949 384823 384542
52823 384542 385418 385544 384420 383914 385761 388727 389950 389011 388705 391020 394286 395870 396178 397868 401743 405668
52807 405668 407635 408012 408164 408442 408530 408700 409559 410961 412057 412284 411680 410333 408219 405707 403704 402946 403257
52790 403257 403719 403398 401727 398405 393518 387884 382710 378454 374433 370076 366175 363977 363164 361814 358764
52775 358764 355177 353220 353787 356096 358873 361146 362296 362298 361965 362279 363311 364219 364358 363946 363511 363037 361932
52758C61932k173k832k297n87J423K767L096K596J525K19p58r01k95M95Q66L91
52742C65467r20k260k462j385k79j38l34J97J110J214M35k26m91j005j732j862
52726C55329j488j694k434k116j42J763K003J443J708K327J505q18k577k255m84
52711C52070J239K106J958P98r23k261k616k334k195k487k792k538j623m66N53
52696C38489J577K797L679L361K098J413K168L201K859J398O80J616L091L586
52682C72013K977K241K075K351K575K554K618L162L920L979K905J435M43k60j241
52667D03747j900r79J274K820K237K78j582k949l947l959k455m45L35l86j339
52652C90750j754k074k522k373j271n0N62J007J751K047J045m26o40O14J720J466
$$ plain form
52758 361932 359759 356927 354630 354043 355466 358233 361329 363925 365450 365669 364911 364010 363715 364210 365076 365467
52742 365467 364547 362287 359825 358440 358161 358023 357689 357886 358996 360210 360645 360419 359928 358923 357191 355329
52726 355329 353841 352147 349713 347597 347455 349218 351221 352664 354372 356699 358204 357386 354809 352554 352070
52711 352070 353309 355415 357373 358171 357248 354987 352371 350037 347842 345355 342563 340025 338402 337936 338489
52696 338489 340066 342863 346542 349903 352001 353414 355582 358783 361642 363040 363720 365336 368427 372013
52682 372013 374990 377231 379306 381657 384232 386786 389404 392566 396486 400465 403370 404805 405248 404988 403747
52667 403747 401847 400868 402142 404962 407199 407477 405895 402946 398999 395040 392585 392140 392475 392089 390750
52652 390750 388996 386922 384400 382027 380756 380706 381268 382275 384026 386073 387118 386692 386052 386666 388386 389852
52636C89852M63nM47J414K427K934K143j55k842m236l676k007n99j24k30j05N53
52619C86254J105O80o53j827k036j567j088p09k19J95K32J94O87J632K208J773
52603C86861N14q30j484j046J50J173J497J697K642M208N473N965N860M990K751
52588D20421n65l313m015k772p56J052K012J526l75k433l117k211q00K25R06J475
52572D07260J790J839K046K637L254L671M294N279N644M190J225j544k990l561
52558D35034m038m190l443k205j483j414j178m87j96r65k089k303j438o52j019
52543D07934k318l304l001j640l70l6m43q13o72M8J356K914L668K660M55j095
52527D05343q34N44J730K328K633K562J774M85n10o69j36M51M02m74j448j460
$$ plain form
52636 389852 390315 390310 390757 392171 394598 397532 399675 399520 396678 392442 388766 386759 386160 386036 385806 385701 386254
52619 386254 387359 388039 387386 385559 383523 381956 380868 380159 379940 380135 380367 380561 381248 382880 385088 386861
52603 386861 387375 386545 385061 384015 384165 385338 386835 388532 391174 395382 400855 406820 412680 417670 420421
52588 420421 419856 416543 412528 409756 409000 410052 412064 413590 413215 410782 407665 405454 404654 404879 405785 407260
52572 407260 409050 410889 412935 415572 418826 422497 426791 432070 437714 441904 443129 441585 438595 435034
52558 435034 430996 426806 423363 421158 419675 418261 417083 416596 416400 415435 413346 411043 409605 408953 407934
52543 407934 405616 402312 399311 397671 397301 397265 396822 396009 395337 395385 396741 399655 403323 405983 406438 405343
52527 405343 404509 405053 406783 409111 411744 414306 416080 416565 416055 415386 415250 415701 416103 415629 414181 412721
52511D12721m60M39M44k1l26p40j657k518k531j933j541j372q18J48Q78J007M76
52494D02196r79l153m509l429n69J416R55o36j019L42J901K056Q49k47m2J049
52478C96181J604J096M91O25R59P99O88J332J967J467L69R5M60L8j131j358p5
52461D05607J276J644J658J835J565O68P9m1p80j947j299K022N288N596L808K774
52445D29753L030L003K492K877L987L649R66k180l780l946l824l824l775l580
52431D24848k903j317N45J096k87k295l306l112k378j347L5J344J989J985J789
52416D16686J583J266R60R77J450K260L114L542L128K048J022M81J86m8K31J420
52400D40306K949L759L563K945K245J061q05k575l309l196l377m378n398n399
$$ plain form
52511 412721 412261 412700 413144 413123 412797 412057 410400 407882 405351 403418 401877 400505 399687 399835 400713 401720 402196
52494 402196 401217 398064 393555 390126 389557 390973 391928 391292 390273 390615 392516 394572 395421 395174 395132 396181
52478 396181 397785 398881 399372 399997 400956 401755 402443 403775 405742 407209 407578 407673 408133 408171 407040 405682 405607
52461 405607 406883 408527 410185 412020 413585 414253 414332 414291 413511 411564 410265 412287 417575 423171 426979 429753
52445 429753 432783 435786 438278 441155 445142 448791 449757 447577 443797 439851 436027 432203 428428 424848
52431 424848 421945 420628 421173 422269 421982 419687 416381 413269 410891 409544 409579 410923 412912 414897 416686
52416 416686 418269 419535 420495 421472 422922 425182 428296 431838 434966 437014 438036 438517 438703 438655 438886 440306
52400 440306 443255 447014 450577 453522 455767 456828 456023 453448 450139 446943 443566 439188 433790 428391
52386D28391m382l106k017j061l42j72m20n24l68n07j173j675j252j23Q40J208
52370D13317J250J303J403J472J571J821K241K646K652J984Q47j39m97k24M18
52355D32065J231K158L273M592N724O039N581N502O798Q880J0279J0534J0174
52342E12830R002O035J678j748k783k734l480m539m130k484j926l571n714o122
52328D90314m556k306l37J068J638J300Q98J585L189L986K836J048J107L442N578
52313E10790N171K993J743K576M263N570O617P510P408O028M704M633N013M201
52299E79220K178N11K28Q58J365J182N22L71J893N101Q331R758R122P487N853
52284F33980M780M812O228Q517J0788J2467J3220J2840J1971J2206J4535J8101
$$ plain form
52386 428391 424009 420903 418886 417825 417483 417311 416891 416367 415999 415492 414319 412644 411392 411269 412109 413317
52370 413317 414567 415870 417273 418745 420316 422137 424378 427024 429676 431660 432507 432368 431871 431647 432065
52355 432065 433296 435454 438727 443319 449043 455082 460663 466165 472963 481843 492122 502656 512830
52342 512830 521832 527867 529545 527797 525014 522280 518800 514261 510131 507647 505721 502150 496436 490314
52328 490314 485758 483452 483115 484183 485821 487121 488019 489604 492793 496779 499615 500663 501770 505212 510790
52313 510790 515961 518954 520697 523273 527536 533106 539723 547233 554641 560669 565373 570006 575019 579220
52299 579220 581398 581909 582137 582995 584360 585542 586064 586435 588328 593429 601760 611518 620640 628127 633980
52284 633980 638760 643572 649800 658317 669105 681572 694792 707632 719603 731809 746344 764445
$$ [...]
##END NTUPLES=NMR SPECTRUM
##END=
