
##TITLE=AC1222_Punto_6074794_1Xs9jaGfa0
##JCAMPDX= 6.0         $$ Bruker NMR JCAMP-DX V2.0
##DATA TYPE= NMR SPECTRUM
##DATA CLASS= NTUPLES
##ORIGIN= BRUKER
##OWNER= Administrator
$$ 1.72 TOPSPIN		Version 2.1
$$ 2012-05-08 02:42:31.468 -0500  Administrator@TOPSPIN
$$ Compression mode = diff/dup
##.OBSERVE FREQUENCY= 400.13188235
##.OBSERVE NUCLEUS= ^1H
##.ACQUISITION MODE= SIMULTANEOUS (DQD)
##.ACQUISITION SCHEME= undefined
##.AVERAGES= 8
##.DIGITISER RES= 22
##SPECTROMETER/DATA SYSTEM= spect
##.PULSE SEQUENCE= zg30
##.SOLVENT NAME= COFFEE_meoh
##.SHIFT REFERENCE= INTERNAL, COFFEE_meoh, 1, 14.98061
##AUDIT TRAIL= $$ (NUMBER, WHEN, WHO, WHERE, PROCESS, VERSION, WHAT)
$$ ##TITLE= Audit trail, TOPSPIN		Version 2.1
$$ ##JCAMPDX= 5.01
$$ ##ORIGIN= Bruker BioSpin GmbH
$$ ##OWNER= Administrator
$$ $$ C:\Bruker\TOPSPIN/data/COFFEE/nmr/AC1222_Punto_6074794_1Xs9jaGfa0/10/pdata/1/auditp.txt
$$ ##AUDIT TRAIL=  $$ (NUMBER, WHEN, WHO, WHERE, PROCESS, VERSION, WHAT)
(   1,<2012-05-08 02:42:24.375 -0500>,<Administrator>,<TOPSPIN>,<go>,<TOPSPIN 2.1>,
      <created by zg
	started at 2012-05-08 02:41:17.546 -0500,
	POWCHK enabled, PULCHK disabled,
       configuration hash MD5:
       AF F2 23 6B 01 CD 40 DD E5 A1 38 A0 06 EA F7 77
       data hash MD5: 64K
       06 34 B6 50 C6 64 9A 13 BF 98 A5 69 17 D4 2B D7>)
(   2,<2012-05-08 02:42:27.156 -0500>,<Administrator>,<TOPSPIN>,<proc1d>,<TOPSPIN 2.1>,
      <Start of raw data processing
       efp LB = 0 FT_mod = 6 PKNL = 1 PHC0 = 0 PHC1 = 0 SI = 32K 
       data hash MD5: 32K
       D6 40 BC 3F A3 9E F1 42 3D 0B FE 7B CB 7E 4F CD>)
(   3,<2012-05-08 02:42:27.546 -0500>,<Administrator>,<TOPSPIN>,<proc1d>,<TOPSPIN 2.1>,
      <pk PHC0 = 213.8708 PHC1 = 0 
       data hash MD5: 32K
       C2 8D 58 18 14 B0 D7 A9 AF 75 FF D1 15 0E 34 4C>)
(   4,<2012-05-08 02:42:27.593 -0500>,<Administrator>,<TOPSPIN>,<proc1d>,<TOPSPIN 2.1>,
      <abs ABSG = 1 
       data hash MD5: 32K
       1F ED 69 CC 43 83 D3 83 D7 82 7A 9F 98 E0 A9 7E>)
(   5,<2012-05-08 02:42:27.625 -0500>,<Administrator>,<TOPSPIN>,<proc1d>,<TOPSPIN 2.1>,
      <abs ABSG = 2 
       data hash MD5: 32K
       75 A3 E2 F4 3A C4 F5 50 5C B9 92 AA 91 94 CA 9F>)
(   6,<2012-05-08 02:42:27.656 -0500>,<Administrator>,<TOPSPIN>,<proc1d>,<TOPSPIN 2.1>,
      <abs ABSG = 3 
       data hash MD5: 32K
       0E FF 66 12 9C 01 10 9C 39 58 6F 1D A3 A7 D0 63>)
(   7,<2012-05-08 02:42:27.687 -0500>,<Administrator>,<TOPSPIN>,<proc1d>,<TOPSPIN 2.1>,
      <abs ABSG = 4 
       data hash MD5: 32K
       B4 41 C7 2C BA BA 76 B4 CE 0D 80 BB 17 30 F6 96>)
(   8,<2012-05-08 02:42:27.718 -0500>,<Administrator>,<TOPSPIN>,<proc1d>,<TOPSPIN 2.1>,
      <abs ABSG = 5 
       data hash MD5: 32K
       79 F6 BD 38 DE 30 BE 2F 19 40 12 BF 75 EC 0F F1>)
$$ ##END=
$$ 
$$ $$ hash MD5
$$ $$ E1 71 6C 50 E7 8E 0B 90 ED F3 0D 73 0A 88 A6 B4
##$RELAX= 
##$RELAX= 
##$RELAX= 
##$RELAX= 
##$RELAX= 
##$RELAX= 
##$RELAX= 
$$ Bruker specific parameters
$$ --------------------------
$$ [...]
##$TP= (0..7)
150 150 150 150 150 150 150 150
##$TP07= 0
##$TPNAME0= <>
##$TPNAME1= <>
##$TPNAME2= <>
##$TPNAME3= <>
##$TPNAME4= <>
##$TPNAME5= <>
##$TPNAME6= <>
##$TPNAME7= <>
##$TPOAL= (0..7)
0.5 0.5 0.5 0.5 0.5 0.5 0.5 0.5
##$TPOFFS= (0..7)
0 0 0 0 0 0 0 0
##$TUNHIN= 0
##$TUNHOUT= 0
##$TUNXOUT= 0
##$USERA1= <user>
##$USERA2= <user>
##$USERA3= <user>
##$USERA4= <user>
##$USERA5= <user>
##$V9= 5
##$VALIST= <valist>
##$VCLIST= <CCCCCCCCCCCCCCC>
##$VD= 0
##$VDLIST= <DDDDDDDDDDDDDDD>
##$VPLIST= <PPPPPPPPPPPPPPP>
##$VTLIST= <TTTTTTTTTTTTTTT>
##$WBST= 1024
##$WBSW= 4
##$XGAIN= (0..3)
0 0 0 0
##$XL= 0
##$YL= 0
##$YMAX_a= 513495
##$YMIN_a= -606448
##$ZGOPTNS= <>
##$ZL1= 120
##$ZL2= 120
##$ZL3= 120
##$ZL4= 120
##$ABSF1= 14.98061
##$ABSF2= -5.57192
##$ABSG= 5
##$ABSL= 3
##$ALPHA= 0
##$AQORDER= 0
##$ASSFAC= 0
##$ASSFACI= 0
##$ASSFACX= 0
##$ASSWID= 0
##$AUNMP= <proc_prof1d_extract_pilot.lims>
##$AXLEFT= 0
##$AXNAME= <>
##$AXNUC= <1H>
##$AXRIGHT= 0
##$AXTYPE= 0
##$AXUNIT= <>
##$AZFE= 0.1
##$AZFW= 0.1
##$BCFW= 0
##$BC_mod= 0
##$BYTORDP= 0
##$COROFFS= 0
##$CY= 15
##$DATMOD= 1
##$DC= 0
##$DFILT= <>
##$DTYPP= 0
##$F1P= 0
##$F2P= 0
##$FCOR= 0.5
##$FTSIZE= 32768
##$FT_mod= 6
##$GAMMA= 0
##$GB= 0
##$INTBC= 1
##$INTSCL= 1
##$ISEN= 128
##$LB= 0
##$LEV0= 0
##$LPBIN= 0
##$MAXI= 10000
##$MC2= 0
##$MEAN= 0
##$ME_mod= 0
##$MI= 0
##$NCOEF= 0
##$NC_proc= -8
##$NLEV= 6
##$NOISF1= 0
##$NOISF2= 0
##$NSP= 0
##$NTH_PI= 0
##$NZP= 0
##$OFFSET= 14.98061
##$PC= 1
##$PHC0= 213.8708
##$PHC1= 0
##$PH_mod= 1
##$PKNL= yes
##$PPARMOD= 0
##$PPDIAG= 0
##$PPIPTYP= 0
##$PPMPNUM= 2147483647
##$PPRESOL= 1
##$PSCAL= 4
##$PSIGN= 0
##$PYNMP= <proc.py>
##$REVERSE= no
##$SF= 400.13
##$SI= 32768
##$SIGF1= 0
##$SIGF2= 0
##$SINO= 400
##$SIOLD= 32768
##$SPECTYP= <>
##$SREGLST= <1H.CDCl3>
##$SSB= 0
##$STSI= 32768
##$STSR= 0
##$SW_p= 8223.68421052632
##$SYMM= 0
##$S_DEV= 0
##$TDeff= 65536
##$TDoff= 0
##$TI= <>
##$TILT= no
##$TM1= 0
##$TM2= 0
##$TOPLEV= 0
##$USERP1= <user>
##$USERP2= <user>
##$USERP3= <user>
##$USERP4= <user>
##$USERP5= <user>
##$WDW= 1
##$XDIM= 32768
##$YMAX_p= 449041624
##$YMIN_p= -699704
##$CURPLOT= <Network HP LaserJet P1505>
##$CURPRIN= <$Network HP LaserJet P1505>
##$DFORMAT= <normdp>
##$LAYOUT= <+/1D_H.xwp>
##$LFORMAT= <normlp>
##$PFORMAT= <normpl>
##$SURQMSG= 1
$$ End of Bruker specific parameters
$$ ---------------------------------
##NTUPLES= NMR SPECTRUM
##VAR_NAME=  FREQUENCY,     SPECTRUM/REAL,   SPECTRUM/IMAG
##SYMBOL=    X,             R,               I
##VAR_TYPE=  INDEPENDENT,   DEPENDENT,       DEPENDENT
##VAR_FORM=  AFFN,          ASDF,            ASDF
##VAR_DIM=   32768,         32768,           32768
##UNITS=     HZ,            ARBITRARY UNITS, ARBITRARY UNITS
##FACTOR=    0.250966925370066, 1,           1
##FIRST=     8223.43324360095, 23805,        -59994
##LAST=      0,             -31414,          5638
##MIN=       0,             -699704,         0
##MAX=       8223.43324360095, 449041624,    0
$$ Real data points
##PAGE= N=1
##DATA TABLE= (X++(R..R)), XYDATA
$$ [...]
19543a40592k03787C8906a02022k8091j03337C3655l172b74406p533G191J80426
19532A87617f2891E3054O4445c49466B4104J12703a05763j74534A31758l7925
19522I3833b0712R47k03793n990D5251J62788C935J9570b737k21303I1464h7308
19509A65070j0619m6081m7334b73464b9472F7477c93977J29684D948M06373b96571
19497b54799B20509L975a70432r2447a02522h799k77463A74057a62035C58674
19486b43675H6100I420a82947A35924K4634a84035A46631b67985B36036g9421
19475B12123b729A61609c0457N062j49782o4904J383a0704B56123E7180a37196
19463d72286b26318a1735B9227J559a03990l949I4325a75600L7036l6359h5536
$$ plain form
19543 -140592 -344379 38906 -102022 -130113 -233450 33655 30483 -274406 -281939 7191 187617
19532 187617 -62891 53054 117499 -349466 24104 136807 -105763 -280297 131758 93833
19522 93833 -20712 -19765 -223558 -229548 45251 208039 3935 23505 -2737 -224040 91464 -87308
19509 165070 154451 108370 61036 -273464 -29472 67477 -393977 -264293 4948 411321 -296571
19497 -254799 220509 224484 -170432 -262879 -102522 -8799 -286262 174057 -162035 358674
19486 -243675 86100 9420 -182947 135924 160558 -184035 146631 -267985 236036 -79421
19475 212123 -2729 161609 -30457 -25395 -175177 -240081 -238698 -10704 256123 57180 -137196
19463 -472286 -226318 -11735 29227 30786 -103990 -107939 94325 -175600 -138564 -174923 -85536
19451A5319i249o5494q5787b7872j96685J02019k45861J66085G2142G814a80677
19439a4709m4904K1886m0378j89324B5568e10930K01853A38522c3765J320q6043
19428a18488b63B16356b00084B50922a38783d6578j1861B85102b08888e8016B56760
19416H161J04002b86849h5006p0505q0600Q7420J5744M4809j12667R0405L4394
19405g6006H4198i5079k23888j74978A14613c2365h802j81352B2182c0945p9080
19394a10025F7834Q5433a30361d3636G9584b68527b4308r8855C2563Q1256N0590
19383A64409F6199d33987A32353M520a59507B57202b3230k6164A03715J08086
19373B11801d4127B8431a75713g6451b2900B25567C8323a03705A23313g3591j4248
$$ plain form
19451 15319 -9249 -74743 -160530 -27872 -224557 -122538 -368399 -202314 72142 7814 -180677
19439 -14709 -59613 -37727 -78105 -267429 25568 -510930 -309077 138522 -33765 -32445 -118488
19428 -118488 -263 216356 -200084 250922 -138783 -46578 -58439 285102 -208888 -58016 256760
19416 8161 112163 -286849 -85006 -155511 -236111 -148691 -132947 -88138 -200805 -110400 -76006
19405 -76006 84198 -95079 -318967 -493945 114613 -32365 -8802 -190154 22182 -30945 -110025
19394 -110025 67834 153267 -130361 -43636 79584 -268527 -24308 -123163 32563 113819 164409
19383 164409 66199 -433987 132353 136873 -159507 257202 -23230 -49394 103715 211801
19373 211801 -44127 28431 -175713 -76451 -22900 225567 38323 -103705 123313 -73591 -87839
19362h7839Q65K924A84035a25233A00655e7011A6781J36580k5440c69777i1843
19350c05962g1100a3842A36614a5302C1528a68865H6808b91540R2551R0251K3262
19339h5476L8437j06015A22754a57809j75629A38417a81249c5877n5964n9587
19329a51428e9942q9319j1232b4672k76027m2045e8322j6877A56004b68006D2797
19317b044n3654l11532h678E0061b31872k2740B28884i8156c4488I9751J40366
19306B40117j07988F1445J74473c6502A48121c71356J05930A80978a76429j8601
19296a95030d6421j96344C6137P0288l7147g8301B12165e21607J64035f15k92820
19285b93435B9602b03620A39985o7166f5353K4508a3303l97474C8092a46534C9753
$$ plain form
19362 -87839 -86974 -84050 184035 -125233 100655 -57011 16781 153361 127921 -369777 -91843
19350 -305962 -71100 -13842 136614 -15302 31528 -168865 86808 -291540 -198989 -108738 -85476
19339 -85476 -47039 -153054 122754 -157809 -333438 138417 -181249 -35877 -91841 -151428
19329 -151428 -59942 -149261 -160493 -24672 -300699 -342744 -58322 -75199 156004 -268006 42797
19317 -2044 -55698 -367230 -8678 50061 -231872 -254612 228884 -98156 -34488 99751 240117
19306 240117 132129 61445 235918 -36502 148121 -371356 -265426 180978 -176429 -195030
19296 -195030 -46421 -242765 36137 106425 69278 -78301 212165 -521607 -357572 -615 -293435
19285 -293435 29602 -203620 139985 72819 -65353 -40845 -13303 -410777 38092 -146534 39753
19273h1413P726c3159p7194C881d0696A48957P5040J31067a31132k96603A48016
19261a02902E2885g6977J629j18034j8174A19126R4841a5299A39653q84a4963
19249a31299o1738g3167F7384m929C950g3921A02640A0154i2907B4979b56901
19237a52078c1045k54630C3904J03813d62331a05967A38158a56408B13852b56583
19226C94668a19497A9217b19992j52803J63336J5052K9124K0996r2456o2091f8211
19214c40833b5065k9008j06996B38169a79194C193R6367K59567I3752A8974d3362
19202H2469b34494B06476R9065B2340c50248j03496A64332a18935F5368b27769
19191c120k2273j32322N609B82972k8371A00920i1125l7683O3632j24398k5588
$$ plain form
19273 -81413 -73687 -33159 -110353 3881 -40696 148957 223997 355064 -131132 -427735 148016
19261 -102902 52885 -76977 -75348 -193382 -211556 119126 213967 -15299 139653 138769 -14963
19249 -131299 -193037 -73167 67384 62455 3950 -73921 102640 10154 -92907 24979 -256901
19237 -152078 -31045 -285675 33904 137717 -462331 -105967 138158 -156408 213852 -256583
19226 394668 -119497 19217 -219992 -372795 -209459 -194407 -165283 -144287 -236743 -298834 -68211
19214 -340833 -25065 -54073 -161069 238169 -179194 3193 99560 359127 93752 18974 -43362
19202 82469 -234494 206476 305541 22340 -350248 -453744 164332 -118935 65368 -227769
19191 -3120 -25393 -157715 -152106 282972 254601 100920 -91125 -128808 -65176 -189574 -215162
19180b15162n9973h0441k3820A98404K0022E7838a39914d8476H7354b4649D0356
19168a27713k52158J63687A74103d0367n1709L4872C19160H6200J08010a19257
19157A42700a4583A5467F960a02897k30611A32056a31361k27628r8812A99302
19146A14834f0009A36769E1686a09846A75315b45829B00263a11676F8540b12777
19135a45198K6339j1328m4827k8420A79935g1609F3782d602k11306e757E165c51945
19122c99441a98386C8683J03151d0450n5070C8196c03196f9611p3142j4727K6999
19111a30481n1160j10187A3505a88838f302j98869a0657j65072j13754B17789
19100F7146i3171A80097b67247A06824a86199K9598D3376J86181b00398R1700
$$ plain form
19180 -215162 -275135 -80441 -104261 198404 218426 57838 -139914 -48476 87354 -24649 40356
19168 -127713 -379871 -216184 174103 -40367 -92076 -57204 319160 86200 194210 -119257
19157 142700 -14583 15467 6960 -102897 -333508 132056 -131361 -358989 -457801 199302
19146 114834 -60009 136769 51686 -109846 175315 -245829 200263 -111676 68540 -212777
19135 -145198 -118859 -130187 -175014 -203434 179935 -71609 63782 -4602 -215908 -5757 5165 -351945
19122 -399441 -198386 38683 141834 -40450 -95520 38196 -303196 -69611 -142753 -157480 -130481
19111 -130481 -181641 -291828 13505 -188838 -6302 -205171 -10657 -175729 -289483 217789
19100 67146 -93171 180097 -267247 106824 -186199 -156601 43376 229557 -200398 -108698
19090a08698l2059B1606L170a63898G7066N4980h3030B57877a10850b2549F1913
19078A02392m8926L2692c58623A06308D4266b43649k8847G647L77149I1423l2702
19067E8721J07348c76192J6594J71197l5759R9427j70283p809e9906m49776B02537
19055C0076c5881A28146b16408P4546J1032A09066a3298I8100e1829l6797A12315
19043a25847l64865n9763a32983A38089F0049k7474a46908G3531l322b89402C8600
19031h7862M953k71542O9341i4478l87123A31083i7515H4863A4083a56104B45441
19019B56083a05553H3624B7607J13549b51252b8561A55888a29034h504o8545F686
19007H8146J15456b29534D2816i3145A2008N9998b2998j02347c0898j11508C9445
$$ plain form
19090 -108698 -140757 21606 24776 -163898 77066 132046 -83030 257877 -110850 -22549 61913
19078 102392 53466 86158 -358623 106308 44266 -243649 -272496 7647 384796 91423 58721
19067 58721 166069 -376192 -359598 -188401 -224160 -124733 -295016 -302825 -59906 -509682 202537
19055 30076 -35881 128146 -216408 -141862 -130830 109066 -13298 98100 -51829 -88626 112315
19043 -125847 -490712 -550475 -132983 138089 60049 32575 -146908 73531 70209 -289402 38600
19031 -87862 -82909 -354451 -285110 -94478 -481601 131083 -97515 84863 14083 -156104 245441
19019 256083 -105553 83624 27607 141156 -251252 -28561 155888 -129034 -8504 -77049 6686
19007 88146 203602 -229534 42816 -93145 12008 72006 -22998 -125345 -30898 -142406 39445
18995c38804H3698b32969G0549J53551b90229D2023A9757b14551h1605j76404
18985b58009i7752l41703d1912H7219j8556R2698b78833M6951G3598a04309A52463
18973f619A46727a65860m7424j89123B11083p6952A3603a16342G6584J20066i5538
18961d8537A83966a57712A49706o6299j6887b3483j43687K6157m2442Q6629m6607
18950a43433q9398B9479R7927R803A9256a29239b7886k43055C2307c95943B07570
18938E73a70189K3035J2677j42444A91259P4900F9907O8556J91098h6665A70038
18926f8173j62090g2946A12868a36882b4109m94514J93057J45266M8190d3716
18915a67906j07838K4766G2942b12841f3210k20705A27720M8957b19489h4041
$$ plain form
18995 -338804 83698 -232969 70549 224100 -290229 42023 19757 -214551 -81605 -258009
18985 -258009 -97752 -439455 -41912 87219 68663 161361 -278833 -231882 73598 -104309 152463
18973 -6619 146727 -165860 -213284 -402407 211083 134131 13603 -116342 76584 196650 -95538
18961 -48537 183966 -157712 149706 83407 66520 -23483 -167170 -141013 -183455 -96826 -143433
18950 -143433 -232831 29479 127406 137209 19256 -129239 -27886 -270941 32307 -395943 207570
18938 573 -170189 -147154 -134477 -276921 191259 266159 69907 138463 329561 -86665 170038
18926 -68173 -230263 -72946 112868 -136882 -24109 -518623 -325566 -180300 -132110 -43716
18915 -167906 -275744 -250978 72942 -212841 -63210 -283915 127720 176677 -219489 -84041
18904d1539n2788Q366A87219d7811A42485G0787K0431B582c6071A21054b06790
18892c05162B7830f1694j88184B88751A16096a38965c0364B14707c5371r3251
18882a28622b1507A10785O3392a99127e9669B6124J31698d54987h5600D640J43708
18871A48348b1941F9933J24195D8700K49186b3947A39616e8002A41932i6158A28170
18859f0280C16986c4621n1287E2153A5233a46644b932B2595Q0105a34963a8281
18847b2920A57653k9595n2928b66292e250A20952a92472O1456C74385A14694a8675
18835a1853E5961a18750k6738A59326c7376o7554A1079O6989Q2326a06534k76881
18824c83415I4047R5215a32362A67126b72798J03704Q0423A03661F435J85305
$$ plain form
18904 -41539 -94327 -85961 187219 -47811 142485 70787 91218 2582 -36071 121054 -206790
18892 -305162 27830 -61694 -249878 288751 116096 -138965 -30364 214707 -35371 -128622
18882 -128622 -21507 110785 174177 -199127 -59669 26124 157822 -454987 -85600 4640 148348
18871 148348 -21941 69933 194128 48700 297886 -23947 139616 -58002 141932 -96158 128170
18859 -60280 316986 -34621 -85908 52153 15233 -146644 -2932 22595 102700 -134963 -18281
18847 -22920 157653 128058 75130 -266292 -5250 120952 -192472 -131016 374385 114694 -18675
18835 -11853 55961 -118750 -145488 159326 -37376 -104930 11079 78068 160394 -106534 -383415
18824 -383415 94047 189262 -132362 167126 -272798 -169094 -88671 103661 6435 191740
18814A91740d5727A52018a1995D1543g0589j62799E7414a46209K8960A63984n4497
18803A09487a08621B70158c4487H5058f3938m0594C07979a35802a3652q376p6325
18792i8353C2463b58631Q1994I4465c2610j48608B47042g0979j96900N8957P9912
18781a29010a6432C0901d43043h6685k47900a27790a8891j20647l417C6736J83373
18770B20109r0351o2597h1392j82321a18944p6950q9241L0329K5080r3366a22576
18758g6127q2889j51393a47526A8897a17339b9626l59753J79419Q6593G3164B5522
18746C25540c53464R8477G454L28427k5959a54801j43362D3648L9192b71475B89728
18734h2706J347m1151D0686i1910C2444P0776b68023e68B62205b937m1767j05353
$$ plain form
18814 191740 -45727 152018 -11995 41543 -70589 -233388 57414 -146209 -117249 163984 109487
18803 109487 -108621 270158 -34487 85058 -63938 -104532 307979 -135802 -13652 -22028 -98353
18792 -98353 32463 -258631 -176637 94465 -32610 -181218 247042 -70979 -267879 -208922 -129010
18781 -129010 -16432 30901 -443043 -86685 -334585 -127790 -18891 -139538 -142955 36736 220109
18770 220109 129758 67161 -81392 -263713 -118944 -195894 -285135 -254806 -229726 -323092 -122576
18758 -76127 -159016 -310409 -147526 18897 -117339 -29626 -389379 -209960 -123367 73164 25522
18746 325540 -353464 -254987 7454 335881 309922 -154801 -298163 43648 82840 -271475 289728
18734 -82706 -81359 -122510 40686 -91910 32444 103220 -268023 -568 262205 -2937 -44704 -150057
18722a50057N4919j2768j92322j19629a5664A57297a73196b9204j46415Q7152
18712h8467l44846F694f7454A66793m6331a90987A39953c73392J07389A42998
18701A71046p4326b7710k29287A93035A0202c31049A16934b3088A0460f2866B7322
18689F7427J4508a47740A9990M0717b13963l7545C3126b54336A5020O7665b7822
18677a8126B21311e6948k02962Q8158c2373l23636D0564c66070a46830b3008B9032
18665B0968a1758a134m29256h2151I4484d09858A33575P9670i2992l0342B07798
18653b2227F4544d01285a19952l6815M4021p0545k83470J19941A09287b58449
18642B15497F6141a87406e1098A19387E0578e4502R552j14978j57855J17622G8492
$$ plain form
18722 -150057 -95138 -107906 -300228 -419857 -15664 157297 -173196 -29204 -175619 -88467
18712 -88467 -433313 6694 -67454 166793 120462 -190987 139953 -373392 -266003 142998
18701 171046 96720 -27710 -256997 193035 10202 -331049 116934 -23088 10460 -62866 27322
18689 67427 81935 -147740 19990 60707 -213963 -251508 33126 -254336 15020 82685 -27822
18677 -18126 221311 -56948 -259910 -171752 -32373 -356009 40564 -366070 -146830 -23008 29032
18665 20968 -11758 -1134 -430390 -82151 94484 -409858 133575 213245 -92992 -123334 207798
18653 -22227 64544 -401285 -119952 -156767 -112746 -183291 -466761 -346820 109287 -258449
18642 215497 66141 -187406 -51098 119387 50578 -54502 -44950 -159928 -317783 -200161 78492
18630a12029D5952K93762j9450D0685K18471a943o0065j96402G9038e2149i8j44786
18618a44884J6505j04381A06657A5541a51820E0701b45291B2923Q7451n237G591
18606B08091g250E2411a38581q4398g2060r2994J2248l34966A6666a24397N8728
18595f5669q1319A6131J23155e9672m8895N2049A12667b39095G1702J92857A079
18583a16831l43223F4433f7133Q593q1574b89l07637I3089M1313A1096Q1704i564
18570I9955C4621K24724A3248a22142A71432b37301D5246i9047B66180a80424
18559a0992j17763q4009B91215I1472a05016m2485L3383c4044j75202P6936B6665
18547c27025A95356n0346b09585r4640Q9763B5812R8588D0609c9121a6467k0792
$$ plain form
18630 -112029 45952 339714 320264 40685 259156 -1943 -62008 -258410 79038 -52149 -98 -144884
18618 -144884 -128379 -232760 106657 15541 -151820 50701 -245291 22923 110374 105137 7591
18606 208091 -7250 52411 -138581 -222979 -72060 -165054 -152806 -487772 16666 -124397 -65669
18595 -65669 -146988 16131 139286 -59672 -108567 -56518 112667 -239095 71702 264559 1079
18583 -116831 -460054 64433 -67133 -58540 -140114 -289 -307926 93089 134402 11096 92800 -9564
18570 99955 34621 259345 13248 -122142 171432 -237301 45246 -99047 266180 -180424
18559 -10992 -128755 -212764 291215 91472 -105016 -147501 -114118 -34044 -209246 -132310 26665
18547 -327025 195356 145010 -209585 -304225 -214462 25812 124400 40609 -39121 -16467 -37259
18536c7259j76065C8832a43759a3197A2110R7724A9063K0043c8997A25076f4314
18524e0392A51652a84578g4373j48948I7416b73162J28863A08149A5433J5107
18514C0540b50063B33604p5624a62293D5566O9154b77158J11544L0372J786A08960
18502b0185j90082a00033n4550B0252h3557B36038a98306a4537B3570a63724m6113
18491b09837R0826q4226r2485B0879R8028d90498J43576a31744d1287B97914a75867
18479b72274o9157J00381j7511A1961b09966J4001P8511j4324L2450D6663K31719
18468B78382a14065j09023K9800A27772a78608j63453A28306b28003A1158R1318
18458A02476e5068j36364J3524f5132j32886A85981P1140r4606b3900j31564A270
$$ plain form
18536 -37259 -213324 38832 -143759 -13197 12110 109834 19063 39106 -38997 125076 -64314
18524 -50392 151652 -184578 -74373 -223321 97416 -273162 -144299 108149 15433 30540
18514 30540 -250063 233604 157980 -162293 45566 114720 -277158 -165614 -135242 -133456 108960
18502 -20185 -210267 -100033 -154583 20252 -83557 236038 -198306 -14537 23570 -163724 -209837
18491 -209837 -119011 -203237 -295722 20879 118907 -490498 -346922 -131744 -41287 297914 -175867
18479 -272274 -341431 -241050 -258561 11961 -209966 -195965 -117454 -131778 -99328 46663 278382
18468 278382 -114065 -223088 -193288 127772 -178608 -342061 128306 -228003 11158 102476
18458 102476 -55068 -191432 -177908 -65132 -198018 185981 257121 162515 -23900 -155464 1270
18446D15236a93330A25314a24470C7637L4156a91537B7955a28569l07116E1871
18435A68672o3184K6262j62f8229l11562J39005a3020d168j75430b7914j22152
18424a50066e4354j23833E115K2162c06062B7835c4619j1158p8742A48216b33514
18412f4452H958b84414e8355b7890o4899H3460c86446i2657L9613A65690H0108
18400C6573P974L4881A5649h6230B39672l8964R5851H2135g5550C1164a87395
18388C33083g698n1167j84688l3086M2885r659f2650j20373h0551j09168A60397
18376d8674j8749D2143f9752j80642d4256j86272J04922A06259K2375b80539C26644
18364a2155j37461l3187H9919b30694e0609b129j41039I8333j7715J87445A32415
$$ plain form
18446 415236 -193330 125314 -124470 37637 71793 -191537 27955 -128569 -435685 51871
18435 168672 105488 131750 131588 -68229 -379791 -240786 -13020 -4168 -179598 -27914 -150066
18424 -150066 -54354 -178187 5115 27277 -306062 27835 -34619 -45777 -124519 148216 -233514
18412 -64452 8958 -284414 -58355 -27890 -92789 83460 -386446 -92657 -53044 165690 80108
18400 36573 44547 79428 15649 -86230 239672 200708 296559 82135 -75550 31164 -187395
18388 333083 -7698 -58865 -243553 -276639 -233754 -243413 -62650 -183023 -80551 -189719 160397
18376 -48674 -67423 42143 -69752 -250394 -44256 -230528 -125606 106259 128634 -280539 326644
18364 -12155 -149616 -182803 89919 -230694 -50609 -2129 -143168 98333 80618 268063 132415
18352b27610i7352l06691F3866a13585d5508G1060a89012Q6017R322A7893g8378
18340A07042c45540f8996O583A98881B1416J7054a041F7953i7247j6894J5262
18329i8879j38352B17479A08112J04134o9378B538J3942b02369k14052J36740
18319b79681B77936b89935q0213c2301I3914N6070c09468i5076A39353c71915
18308A23934D3149K35231I6400J45864c1151k39659J4795d7707C40320A6103K36383
18297B52486b85620d2473A9824c54244B04782F2973K16449H737g5001A98932i3699
18285e244m598j59095C64692h7733f082p4549c8677A41213b53002a23788k35668
18274c59456b7290k20121M3196l7614C9053b22598B67806A12361e65452a57104
$$ plain form
18352 -227610 -97352 -404043 63866 -113585 -45508 71060 -189012 -102995 -93673 17893 -78378
18340 107042 -345540 -68996 -62413 198881 21416 38470 -1041 67953 -97247 -114141 -98879
18329 -98879 -237231 217479 108112 212246 142868 2538 16480 -202369 -416421 -279681
18319 -279681 277936 -289935 -370148 -32301 93914 149984 -309468 -95076 139353 -371915
18308 123934 43149 278380 96400 242264 -31151 -270810 -256015 -47707 340320 16103 252486
18297 252486 -285620 -42473 19824 -354244 204782 62973 279422 8737 -75001 198932 -93699
18285 -5244 -9842 -168937 364692 -87733 -6082 -80631 -38677 141213 -253002 -123788 -359456
18274 -359456 -27290 -247411 -204215 -241829 39053 -222598 267806 112361 -565452 -157104
18263i4283k61957J09731A21371a65409j54077E4098e2252A50725c3247d126j26096
18252a30222o7761A22370j8778b75713J20429a0q7515j26800r9108A04769a73671
18240a47052c1774r2716k7097A49451a02151k07244C4665i6320A4938J60687M3255
18229B18880a28473c1898k18128c7137G35J9307a50356N2164L9778b2237B1384
18217C1046c5603Q639A37722a54962M3497A39007h835n4877g159b699j22780m0616
18205a66095j24607C105J01712a80792D4770b630k12839Q6019K6092K1526j35779
18194b17611B69226D4343N0740h6682r942A48612n1809e3735l70393B41751A06724
18182I1549J7268J1850J57106A3646g8675j61835b7069j28907K5112k5624K1570
$$ plain form
18263 -94283 -356240 -246509 121371 -165409 -319486 54098 -52252 150725 -33247 -4126 -130222
18252 -130222 -197983 122370 103592 -275713 -155284 -10 -87525 -214325 -313433 104769 -173671
18240 -147052 -31774 -124490 -151587 149451 -102151 -309395 34665 -96320 14938 175625 218880
18229 218880 -128473 -31898 -250026 -37137 735 20042 -150356 -98192 -58414 -22237 21384
18217 31046 -35603 -26964 137722 -154962 -111465 139007 -8835 -63712 -7159 -2699 -125479 -166095
18205 -166095 -290702 3105 104817 -180792 44770 -2630 -215469 -129450 -103358 -81832 -217611
18194 -217611 269226 44343 95083 -86682 -96624 148612 96803 -53735 -424128 241751 106724
18182 91549 108817 120667 277773 13646 -78675 -240510 -27069 -155976 -130864 -156488 -134918
18171a34918M7739A6688b87241f6016C9822L8862a09767B21899a24050B62604
18160c25142a9272j47408E998a71048h1144A8122J62056b62979j3580E7349a75717
18148C474f0632C06431j33701l7277d77287A24402l5174c15735J48090B6285J4707
18137D0992c7415f983o3609B61849a27441A00582D4164J80976b16392A85675g9582
18125B29532C3728b08990A54846g5888j04509q6326D740a78111c2177j25245C06231
18113a70375g7733A28209I650J30633c58839A66575b26455H0065b23175H0424
18102A2013d21917h2763j52205B94040n2630a27934l2721c8455k75069A8066b9142
18090b39206J1096A65751c0786j56007c5379A20557c1017m03378H0699e3631p2778
$$ plain form
18171 -134918 -87179 16688 -287241 -66016 39822 78684 -109767 221899 -124050 262604
18160 -325142 -19272 -166680 5998 -171048 -81144 18122 180178 -262979 -276559 57349 -175717
18148 3474 -60632 306431 172730 135453 -477287 124402 89228 -315735 -167645 26285 40992
18137 40992 -37415 -6983 -70592 261849 -127441 100582 44164 225140 -216392 185675 -79582
18125 229532 33728 -208990 154846 -75888 -180397 -266723 4740 -178111 -32177 -157422 306231
18113 -170375 -77733 128209 9650 140283 -358839 166575 -226455 80065 -223175 80424
18102 12013 -421917 -82763 -234968 294040 241410 -127934 -160655 -38455 -313524 18066 -29142
18090 -239206 -228110 165751 -30786 -186793 -35379 120557 -31017 -434395 80699 -53631 -126409
18079a26409j20922h7104D2624J0523a49891E6067d3788p776J5384j45641d0872
18067a6204j69683B35615o6108h0224k27443G4288b24296A81960b89161A64401
18056a5953H0241a30534D04008g8A70606c34487J7059R2409k85305c173l18452
18045c21625P0464D5983b32B62684b8523A25132a1986k00746A07600a5675I4203
18033h9703j83078a04971K509k66767i2855J1264b9489A31551c0993B4207L31479
18022C55686j67902R0332F088a29784C7455d366k6095j81120A8447K97342A9230
18010A08998g5822A0429d102n9295I9654j9330a5775j0866b976F0925B0175b60027
17997a37225c4440F7442a04491j91299C06637c4060A63366b55463a05935Q626
$$ plain form
18079 -126409 -247331 -87104 42624 53147 -149891 56067 -43788 -51564 -36180 -181821 -40872
18067 -16204 -185887 235615 169507 -80224 -307667 74288 -224296 181960 -289161 164401
18056 -15953 80241 -130534 404008 -78 170606 -334487 -317428 -225019 -510324 -3173 -321625
18045 -321625 -251161 45983 -232 262684 -28523 125132 -11986 -212732 107600 -15675 94203
18033 -89703 -272781 -104971 -102462 -369229 -92855 -81591 -29489 131551 -30993 24207 355686
18022 355686 187784 278116 6088 -129784 37455 -4366 -30461 -211581 18447 315789 19230
18010 108998 -75822 10429 -4102 -63397 99654 80324 -15775 -26641 -2976 60925 20175 -260027
17997 -137225 -34440 67442 -104491 -295790 306637 -34060 163366 -255463 -105935 -97309
17987i7309k02102a44513A18986m3591O0094i5637J7924A77807i4370n5001A61278
17975B36304K9687i342C8037J23913l3594d6811A65680d66635h5650M715A64313
17963h1805p9264g7735k15749C08975f557q2792B77588B8632d69449G0501a09799
17951c52046J75995C81778g185B42440i2947n6065l8582N5477B35380a5680k26055
17940b41735i5837E3093M5874c1794j37328j83084N7246B31304b31200i7394L1986
17929f5408o574a1481j36663A20921J03885a13755J5084C6220M15307h8471B81078
17917i683q6235C8286L0800c89532J70743J5726f6351j87001M7438L9298r3193
17906b59809j24139E4270k2488c22088L6743b238k36413C1018K2084a63384M6065
$$ plain form
17987 -97309 -299411 -144513 118986 75395 135489 -95637 -77713 177807 -94370 -149371 161278
17975 236304 265991 -9342 38037 161950 128356 -46811 165680 -466635 -85650 -80935 164313
17963 -81805 -161069 -77735 -293484 308975 -6557 -89349 277588 28632 -469449 70501 -109799
17951 -352046 -176051 381778 -7185 242440 -92947 -149012 -187594 -132117 235380 -15680 -241735
17940 -241735 -95837 53093 98967 -31794 -169122 -352206 -294960 231304 -231200 -97394 -65408
17929 -65408 -71982 -11481 -148144 120921 224806 -113755 -98671 36220 451527 -88471 281078
17917 -9683 -95918 38286 69086 -389532 -218789 -203063 -66351 -253352 -205914 -166616 -259809
17906 -259809 -383948 54270 31782 -322088 -285345 -2238 -238651 31018 53102 -163384 -117319
17895a17319j1099J7406r7584A33379c9346A88998i964A91222D807b03776B92910
17883b79224A26322B8457b22393N4729B80862b6114A02914m4529a34985A9322
17872i5072l3905B57008I1354g3279B31510F3468b1738E0955k2402e026q1046
17861h6072C15749a13799I5714a91516A65012b11753D7427a66798A67323G3639
17850H4908l9531c855k09272J02327A1270c3702k60381A39286f308A7241M13512
17839D30753b17209J01665m2937C5270b40905D0625J24960a10626o2597B39888
17828G1719J89479b4450B57969f0928E4062e0290J6214J3364A06390i9412k0129
17817a19541B77879o8461e08661f7733F8238a68833K9074b3530C25848b97917
$$ plain form
17895 -117319 -128418 -111012 -208596 133379 -39346 188998 -9964 191222 4807 -203776 292910
17883 -279224 126322 28457 -222393 -167664 280862 -26114 102914 58385 -134985 19322
17872 -95072 -128977 257008 91354 -73279 231510 63468 -21738 50955 28553 -5026 -86072
17861 -86072 315749 -113799 95714 -191516 165012 -211753 47427 -166798 167323 73639
17850 84908 45377 -3855 -213127 -110800 11270 -33702 -294083 139286 -6308 17241 430753
17839 430753 -217209 -115544 -158481 35270 -240905 40625 165585 -110626 -173223 239888
17828 71719 261198 -24450 257969 -60928 54062 -50290 -34076 -20712 106390 -99412 -119541
17817 -119541 277879 209418 -508661 -67733 68238 -168833 -139759 -23530 325848 -297917
17806f6550b1933H6089c22500A54490M2107a39032j34531G7187C352J30636c6531
17794A862a04619j98533A14065L25049h6097K2610b5722k34904a1544p291H655
17782A07290h2149l50871C3754K8696f3034E2136J27512A1129b28522a06605D44032
17770G9157J86593f7669J7241A19790c25794C53263a52715n2095C8291M7244m0245
17759D5290N481c7029d231j20131A73019o2805b03093i2514B22834J88636c26861
17747c04187J01944A82551i6848b7669C99611j44015I1834a37964l1048j06843
17737b75855J26125k54282a90966g3941A20601K1765a15472q5315e2951j09473
17727a62424B30138a63384j65266A0294a78071A2274R7310J86240e2889B18514
$$ plain form
17806 -66550 -21933 86089 -322500 154490 196597 -139032 -273563 77187 3352 133988 -36531
17794 1862 -104619 -303152 114065 439114 -86097 -63487 -25722 -260626 -11544 -18835 8655
17782 107290 -82149 -433020 33754 62450 -63034 52136 179648 11129 -228522 -106605 444032
17770 79157 265750 -67669 -50428 119790 -325794 353263 -152715 -204810 38291 85535 45290
17759 45290 50771 -37029 -4231 -124362 173019 110214 -203093 -92514 222834 411470 -326861
17747 -304187 -202243 182551 -96848 -27669 399611 255596 91834 -137964 -169012 -275855
17737 -275855 -149730 -404012 -190966 -73941 120601 142366 -115472 -200787 -52951 -162424
17727 -162424 230138 -163384 -328650 10294 -178071 12274 109584 295824 -52889 218514
17716b78308b8650j87255F9615f4265L62j39618I7373a78411j11877C22342L4369
17705C56711d49316f1596q3208B88551b58262J9673D9274K62546A9154J7092J3286
17694D9532h2996K8684k02264J8722B61127M7474I8261b1184j61380G2282K84753
17683C57035A4530a21523A50737a01957A10278L414N4252A7124J46730g7810b3826
17671A71921A5880P3245A9259b31542B50893F4678a2710G0458K08043E995N0422
17660E6417K3112a92691H6263n117i7795k97721a52547M1685b9577D3391b13229
17648b35142g2127n7794k11826M2364B2997h553j18879j47520A93496a61108I6986
17636b4305m7087k27243A02492J98060h9129A29174O7890n2989j949C0624J32919
$$ plain form
17716 -278308 -28650 -215905 69615 -64265 -63903 -203521 97373 -178411 -290288 322342 356711
17705 356711 -449316 -61596 -144804 288551 -258262 -238589 49274 311820 19154 36246 49532
17694 49532 -82996 -54312 -256576 -237854 261127 308601 98261 -21184 -182564 72282 357035
17683 357035 14530 -121523 150737 -101957 110278 113692 167944 17124 163854 -77810 -23826
17671 171921 15880 89125 19259 -231542 250893 64678 -12710 70458 278501 5995 56417
17660 56417 79529 -192691 86263 81146 -97795 -395516 -152547 -110862 -29577 43391 -213229
17648 -235142 -72127 -129921 -341747 -299383 22997 -8553 -127432 -274952 193496 -161108 96986
17636 -24305 -71392 -298635 102492 300552 -89129 129174 197064 144075 142126 30624 163543
17625A63543l204F2960J37597a77010c4395C2485P1831b2964n7183A39796i0188
17613a79130B58540j26003K42659g6883k31013N1194i2191l1154E7203L1242j3403
17602G5042d09110F5190O6072a43573A85874P5571m2335c0495j56406A94b28220
17590A67798C1516b75887O6085B35184k5982R8090A36484a17224D8111M0839b06832
17578A08362j4713n702J35882j10204M4258a02875B27137R8956E778f5719C91386
17566a68598A25871n1842O0852i6289l3035e1202j39999b4888o9919A52589f6557
17554D18024A78465b56118A63595a03942D5629J7693P2378J6767b61169A00837
17543h5774j96811A64079J47352A40170A8439J14152a54745q8364a8673A9312
$$ plain form
17625 163543 160339 62960 200557 -177010 -34395 32485 104316 -22964 -80147 139796 -90188
17613 -179130 258540 132537 375196 -76883 -307896 -256702 -92191 -123345 57203 88445 75042
17602 75042 -409110 65190 131262 -143573 185874 261445 219110 -30495 -186901 194 -228220
17590 167798 31516 -275887 -209802 235184 209202 307292 136484 -117224 48111 88950 -206832
17578 108362 93649 87947 223829 113625 157883 -102875 227137 326093 5778 -65719 391386
17566 -168598 125871 74029 134881 -96289 -129324 -51202 -191201 -24888 -94807 152589 -66557
17554 418024 178465 -256118 163595 -103942 45629 63322 135700 152467 -261169 100837
17543 -85774 -282585 164079 311431 140170 18439 132591 -154745 -243109 -18673 19312
17532H0185l7889a4884A72757E7752K72636H6202c2699b938m0600k185I297Q4221
17520I3518k2319e0792P928d004B50955E0006J19932p2337J38760D1510K90260
17509C31770a01176I8077g5976B9586R2723c34441A86881o3914A3823J99776a38199
17497C56768J2888D8531J36381h5970D9981b840j95980B47143C26J27353J6349
17486A44028J61651a57819B73427J03597a70216B51036n4483e9534o7893A49209
17475i4202A47058J12093a0422E4263K21104A15893d7289E0526R6508a17412G1408
17463A46094J44844A23039J33025J22038B6072c7624B22850O3381f4738B100a15737
17451C12962j14323E3262K9114K34543a19279A52676M013J09611I5716N1599l6158
$$ plain form
17532 80185 42296 -14884 172757 57752 330388 86202 -32699 -2938 -43538 -45723 9297 93518
17520 93518 71199 -50792 -42864 -4004 250955 50006 169938 97601 236361 41510 331770
17509 331770 -101176 98077 -75976 29586 122309 -334441 186881 122967 13823 213599 -138199
17497 356768 369656 48531 184912 -85970 49981 -2840 -198820 247143 326 127679 144028
17486 144028 305679 -157819 273427 377024 -170216 251036 196553 -59534 -127427 149209
17475 -94202 147058 259151 -10422 54263 275367 115893 -47289 50526 147034 -117412 71408
17463 146094 290938 123039 256064 378102 26072 -37624 222850 286231 -64738 2100 -115737
17451 312962 198639 53262 82376 316919 -119279 152676 156689 266300 95716 147315 111157
17440A11157b7918B63154K40967j84928C1120K02200P1425G3933J20787C4815
17429a16289D1549r778K03632I7533L37245f2559A87365I3163M5940Q0973J11977
17418C32053D9311J04232P3411a83192O3322a1959k3686C23149j46993J06232
17408B82388C1969M81120e4108A29879N3147P2163K47268k35005L8629c698D1002
17396A47365a02942B1355d1295D280R0568d9671C57580B6926K21293a59408A21234
17384C14220j17302m5600b31281O2885G7764L13579f333H9716O0775d6005B48700
17372a57723B47460m1463J04578G8236a30713A5156d1357B16093A5355R7039l1172
17361H1222K48151A47482J72621O4686j00866E8867K46363M62722B98363A05522
$$ plain form
17440 111157 -27918 263154 504121 319193 31120 233320 304745 73933 194720 34815
17429 -116289 41549 31771 235403 97533 434778 -62559 187365 93163 139103 220076 332053
17418 332053 49311 153543 226954 -183192 -119870 -11959 -35645 323149 176156 282388
17408 282388 31969 513089 -54108 129879 183026 255189 502457 267452 306081 -3698 41002
17396 147365 -102942 21355 -41295 4280 94848 -49671 357580 26926 248219 -159408 121234
17384 314220 196918 151318 -231281 -168396 77764 391343 -6333 89716 150491 -46005 248700
17372 -157723 247460 205997 310575 78236 -130713 15156 -41357 216093 15355 112394 81222
17361 81222 329373 147482 320103 384789 283923 58867 305230 767952 298363 105522
17350d4177D3596a15072c3942B17949i4757A82153b03168C2300K3425B0878L08238
17339C29116H4887J53355a77868B32977r7501J32161A21443J09140O1457J29080
17329D21120A65653b88232a30221B93081g9993A73799J7893E9213k6783K58447
17319B90877b1481B67651j13527e9409E27812A12889m4576g1477B36666n9089
17309A77577J77935j54495G9832J42968N0893k8274j04962J01791D8017J50953
17299A98970c30241e3955l04543B16420j02648K92225A30703J90964H9138K40856
17289C29994d6395H0213c03486A03172k795H835L42505G332i116A42065A1949
17277H0666M624a05929A16742N7378p4605L0564J73429F3900K60347o6364j0155
$$ plain form
17350 -44177 43596 -115072 -33942 217949 -94757 182153 -203168 32300 55725 20878 329116
17339 329116 84887 238242 -177868 232977 135476 267637 121443 230583 292040 421120
17329 421120 165653 -288232 -130221 293081 -79993 173799 191692 59213 32430 290877
17319 290877 -21481 267651 154124 -59409 527812 112889 68313 -71477 236666 177577
17309 177577 355512 201017 79832 222800 273693 245419 140457 242248 48017 198970
17299 198970 -330241 -53955 -358498 216420 113772 405997 130703 321667 89138 329994
17289 329994 -46395 80213 -303486 103172 100377 8835 351340 7332 -9116 142065 11949
17277 80666 85290 -105929 116742 174120 99515 130079 303508 63900 324247 257883 247728
17266B47728C2668h6741A14671b15382A09608K8280a78832B34041H1538M2273
17256A23811K49765E4301D215K82017G6381o377O9406k3084J28791l3583J71181
17245C82715a29624A10703J66563A23835a2012A05924j9603i4792J9084C11096
17234B01352q0698J06359E8877L54497j66571D5350R3871e8832n0294e3934j0705
17223f4639B82019r3759a12259B61643c9034C29681I7457k5917k2705J8252a2568
17211A89401M7940J11669c5787I9982K62926B7720L31368A04730K12982f8504
17200C5277L94722A27927k4671M9564n1806J95881A29182L7903Q8619j02005O1285
17189B14984N2549J35985A56670P1245r4705P891M8615k2122D769M63266A12457
$$ plain form
17266 247728 32668 -86741 114671 -215382 109608 137888 -178832 234041 81538 123811
17256 123811 373576 54301 4215 286232 76381 70004 139410 116326 245117 211534 382715
17245 382715 -129624 110703 277266 123835 -12012 105924 86321 -94792 -75708 311096
17234 201352 120654 227013 58877 413374 246803 45350 139221 -58832 -109126 -53934 -64639
17223 -64639 282019 188260 -112259 261643 -39034 329681 97457 71540 48835 67087 -12568
17211 189401 237341 349010 -35787 99982 362908 27720 359088 104730 317712 -68504
17200 35277 429999 127927 103256 152820 101014 296895 129182 167085 255704 153699 214984
17189 214984 267533 403518 156670 227915 133210 141101 189716 167594 4769 468035 112457
17177E14280E5338K70530M9255A83792P2432o4464J6755p6914a01336n3715B45387
17165B96801k7994N8511J7737M7898j84292M3577J97315B12616J49157j01387
17155B60386J04882b9826D78001B32964J65184A19452J26354K32704j96061p7874
17145B04575q8361K94922A91457J11674q1490a01246B60316j7076G0273L30626
17135D00899j31481n6353l0609a45637D91697a7068D00224R2935A62137K17921
17125C80058j10390K4002H0636L11003K7609o5203D1998J94770j7375K3171E3090
17113B68939M6326n249e3913A32714R9395L69946k48774K07K21780b36052A51163
17101B89357I8686P3861n1927K46034j47635B4814J38550K15678Q3255j88545
$$ plain form
17177 514280 55338 325868 375123 183792 256224 191760 208515 131601 -101336 -155051 245387
17165 296801 268807 327318 345055 392953 208661 252238 449553 212616 361773 260386
17155 260386 365268 -29826 478001 232964 398148 119452 245806 478510 282449 204575
17145 204575 116214 411136 191457 303131 221641 -101246 260316 243240 70273 400899
17135 400899 269418 213065 182456 -145637 491697 -17068 400224 493159 162137 380058
17125 380058 269668 293670 80636 391639 419248 354045 41998 236768 219393 242564 53090
17113 268939 315265 310016 -53913 132714 232109 602055 353281 353488 575268 -236052 151163
17101 289357 98686 172547 120620 366654 219019 24814 163364 379042 462297 273752
17091B73752q5205K13852j87566K04435l6079j81964N04320C13166m7225N7187
17081C23128A09812M311L77361A82844J9615J10348a16460C56161j76104J98030
17071C78087j56817J5771K33959a2871B42708R5509J83442A41112M00739j80039
17061C61812o3491j17893K01018j40233J68421j15484K57831k65242N3052K33407
17051E73198B64645L30160B19431n3459K53568J54050k27423j41978L72706B80011
17040A25359L20487A44597n4735K14783R7451l6428A24622K6385L08307K1895
17030D81209J08303p3803L2237j00277K57533k95168Q0761k22884M71953j37586
17020F02278P5952B54368O3200L03511k28612o5830n5052J01703L34028B58931
$$ plain form
17091 273752 188547 402399 214833 419268 383189 201225 705545 313166 265941 323128
17081 323128 109812 114123 491484 182844 202459 312807 -116460 356161 180057 378087
17071 378087 221270 237041 471000 -12871 242708 338217 521659 141112 541851 361812
17061 361812 298321 180428 381446 241213 409634 294150 551981 286739 339791 573198
17051 573198 264645 594805 219431 165972 419540 573590 346167 204189 576895 280011
17040 125359 445846 144597 89862 304645 402096 365668 124622 151007 459314 481209
17030 481209 589512 515709 547946 447669 705202 410034 490795 267911 739864 602278
17020 602278 678230 254368 317568 621079 392467 326637 271585 373288 707316 258931
17009D02543K22612l8143j48832M6469J72949J87434O3014k27305J71769m08175
16999D44335N5241Q6042L2917n3386k67822N13077k72028J55970C26448P8544
16989D04992L27419k12936P9664j56511L71687l51303J63468K83961l27383K88663
16979H71721J4605k39477C16606N50581l43888P4852m0781K50354j32928o9992
16969F04804o5956M49533j68732O3939k76985O5946J4163j51127k9729p6799K68871
16958F97928K69155j89174l09174j3035J23839P9129M7184K43103k2915L39587
16948A265627m82084K0161K82796l32462L62184m00682J31597j44817O80892o09376
16938G73836K9451L0021L02689p8529m25517M64403j01935J65294k09131M8551
$$ plain form
17009 402543 625155 587012 438180 484649 657598 845032 908046 680741 852510 444335
16999 444335 499576 585618 618535 565149 297327 810404 538376 694346 326448 404992
16989 404992 732411 519475 599139 442628 814315 463012 626480 910441 583058 871721
16979 871721 886326 646849 316606 867187 523299 598151 557370 807724 674796 604804
16969 604804 538848 988381 819649 883588 606603 672549 686712 535585 505856 429057 697928
16958 697928 967083 777909 468735 455700 579539 658668 705852 948955 926040 1265627
16948 1265627 783543 803704 1086500 754038 1116222 715540 847137 702320 1383212 773836
16938 773836 803287 833308 1135997 1057468 631951 1096354 994419 1159713 950582 999133
16928I99133J62459j20193m67R1272P6322k65728K67635k33606L47080k47300
16918A076607J2879k52862M30076l19909L25218l31933M32047j41980k82311M08105
16908A355937m30979J61153L09584k41621L94328l12809K08479r4772J47909R9090
16898A596299K0304j34552j19090k94984J95461J38003K82408j34617r094j81909
16888A358229l09868M03703J79556l66919M4674j2662M22320j67015L77754k45877
16878A683895O7344N7737p5178J37661j13890j1856n4223K33129l50130M01399
16868A975888j89322J10603j30456J65840J5730L1197l4297R5930K5930L7379
16858B104422J36166M6110o5022n8863M9715r792J94181J49725l00670M5711J25729
$$ plain form
16928 999133 1161592 1041399 1040932 1132204 1208526 942798 1210433 976827 1323907 1076607
16918 1076607 1089486 836624 1266700 946791 1272009 940076 1372123 1230143 947832 1355937
16908 1355937 924958 1086111 1395695 1154074 1548402 1235593 1444072 1349300 1497209 1596299
16898 1596299 1616603 1482051 1362961 1067977 1263438 1401441 1683849 1549232 1540138 1358229
16888 1358229 1048361 1452064 1631620 1264701 1309375 1296713 1719033 1552018 1929772 1683895
16878 1683895 1751239 1808976 1733798 1871459 1757569 1745713 1691490 1924619 1574489 1975888
16868 1975888 1786566 1897169 1766713 1932553 1948283 1979480 1945183 2041113 2067043 2104422
16858 2104422 2240588 2286698 2221676 2162813 2212528 2202736 2396917 2546642 2245972 2291683 2417412
16847B417412r9924J55753O7329j73029p5192L20701j66009j59926L80047L12824
16837B979986q057l69671L01847J02502j88742K60071O8640L3799J03202j53193
16827C130384P7269J89902j21244j52640K35153M2910r9496L94537J27456j89416
16817C634815M60395k2626l89906K45688K43896m54393N06592O01702m84319K63084
16807D604928j00611K85603J2001J06882L56244R9628k21374J1989P4769L24109
16797E554168L52550J07681l02789L11084J53751p6184M41162j95039L48737q4219
16787F610902K75597q690N38639k34782L74577L01798K88041J26880J70087m5588
16777H397461M79438L93587K07226j6126J80080N77615J36379K19085J79908Q01050
$$ plain form
16847 2417412 2317488 2473241 2540570 2367541 2292349 2613050 2447041 2287115 2667162 2979986
16837 2979986 2971929 2602258 2904105 3006607 2817865 3077936 3146576 3180375 3283577 3130384
16827 3130384 3207653 3397555 3276311 3123671 3358824 3401734 3302238 3696775 3824231 3634815
16817 3634815 4095210 4072584 3682678 3928366 4172262 3717869 4224461 4826163 4341844 4604928
16807 4604928 4504317 4789920 4801921 4908803 5265047 5364675 5143301 5155290 5230059 5554168
16797 5554168 5906718 6014399 5711610 6022694 6176445 6100261 6541423 6346384 6695121 6610902
16787 6610902 6886499 6877809 7416448 7181666 7556243 7858041 8146082 8272962 8443049 8397461
16777 8397461 8876899 9270486 9477712 9461586 9641666 10219281 10355660 10574745 10754653 11555703
16767A1555703J76072K42060M91045Q4569L92216N63808M393Q33043M59839N28473
16757A5331221O04488L38029P90619O61961O67750M82102P36222R01461P99181
16748B1313034O07469Q66091R80897J232662Q92067R79614J570891J251565J064590
16739C0758880J478056J389188J822455J775160J983659J891923K386513K152199
16731D5638033K467733K910659K372592L380826L243118L535617L864400L697131
16723G1110109M547208M307071N045478N870521N226642O432458O351908O576522
16715A15467917O762904P804963P540961P276904P753648P503052P258129O322384
16707A73690862O153498N351532M215895L216335K136337K05503n87121k121805
$$ plain form
16767 11555703 11731775 11973835 12464880 12549449 12941665 13505473 13509866 14342909 14802748 15331221
16757 15331221 15935709 16273738 17064357 17726318 18394068 18876170 19612392 20513853 21313034
16748 21313034 21920503 22786594 23767491 25000153 25892220 26871834 28442725 29694290 30758880
16739 30758880 32236936 33626124 35448579 37223739 39207398 41099321 43485834 45638033
16731 45638033 48105766 51016425 53389017 56769843 60012961 63548578 67412978 71110109
16723 71110109 75657317 79964388 85009866 90880387 96107029 102539487 108891395 115467917
16715 115467917 122230821 130035784 137576745 144853649 152607297 160110349 167368478 173690862
16707 173690862 179844360 185195892 189411787 192628122 194764459 194969962 194382841 192261036
16699A92261036l119880m326530n352454o249590o864489o879835p787683p496201
16691A44184374p482146p212232p038021p211222o831900n911808o310796n641164
16683I0545085n287536n026580m920462m249630m005835l873288l708938l648911
16675E5823905k839887l195440k398309k987283k001339k314686k173130j912851
16667C6000980j525870j867517j288342j848542j057007j386574j102804j042099
16659B4882225j209851j095464p36967q95062q55549n89415j033838l32097j184558
16650A6949424j75789o92588l58626p38692k66797r46023o0525q54213P7365r18145
16640A2015391r3596l87333n76169q6857n17611l25128R4259o11677P5723l66739
$$ plain form
16699 192261036 189141156 184814626 179462172 173212582 166348093 159468258 151680575 144184374
16691 144184374 136702228 129489996 122451975 115240753 108408853 102497045 96186249 90545085
16683 90545085 85257549 80230969 75310507 71060877 67055042 63181754 59472816 55823905
16675 55823905 52984018 49788578 47390269 44402986 42401647 40086961 37913831 36000980
16667 36000980 34475110 32607593 31319251 29470709 28413702 27027128 25924324 24882225
16659 24882225 23672374 22576910 21839943 20944881 20089332 19499917 18466079 18133982 16949424
16650 16949424 16773635 16081047 15722421 14983729 14716932 13770909 13710384 12856171 12933536 12015391
16640 12015391 11921795 11534462 10958293 10871436 10353825 10028697 10122956 9511279 9587002 9220263
16630I220263n19560Q0416o68001j11474j45334k6842l94691K36877n59516l02549
16620F809589k51793K38677o56529j54985K58408m38338j51064N1616j85114j12049
16610E408418k96172M39065m22106k50418J6638o8944m42884M2485J91161m48288
16600D168955L32138k20374j02681j97194k79290K59681k24502j14625k50457
16591C371651q2123K57068M0989k6893k30938l73745M09158k03587K90723m56014
16581B996289j51463J2428K7797r3815P901j10600J3893Q9075J768k11378P9775
16570B661670j27654j11202O9234j0536l22412j3024j52297O6404O5554J07841
16560B233578k35318J10981k2383j77313Q1518j0762K580K58242m59187L1112
$$ plain form
16630 9220263 8700703 8781119 8113118 8001644 7856310 7829468 7434777 7671654 7112138 6809589
16620 6809589 6557796 6796473 6139944 5984959 6243367 5805029 5653965 5705581 5520467 5408418
16610 5408418 5112246 5551311 5129205 4878787 4895425 4826481 4383597 4426082 4617243 4168955
16600 4168955 4501093 4280719 4178038 3980844 3701554 3961235 3736733 3622108 3371651
16591 3371651 3289528 3546596 3587585 3560692 3329754 2956009 3365167 3161580 3452303 2996289
16581 2996289 2844826 2857254 2885051 2791236 2799137 2688537 2702430 2791505 2793273 2581895 2661670
16570 2661670 2534016 2422814 2492048 2481512 2159100 2146076 1993779 2060183 2125737 2233578
16560 2233578 1998260 2109241 2086858 1909545 1991063 1980301 1982881 2241123 1781936 1813048
16550A813048j45032L76760j63978j3279j24464m12889L38265J92557j24837l90
16540A735761Q2386l62782K9132R523p273K72851j60190k02439k0912k04287L58093
16529A529863j33991j63244L04389j79246m0744J89149J4836k09759k94801J89235
16519A205687m5492J36941k93101k10254K41744j8187R4254m0368r6755J80139
16509A154608r7789J8984K74895n23319J00607O5325L61795n21943J45694o7480
16499I11377j97727O42458F34681R8906j47311q8484L40261j58561l9828K0595
16489F60259J15383j52620K09360r3381M9672J72733J22935k65452R4658Q238
16479I21785l56466N12669l21217M63C21648L48392K47027k67776N2592J88169
$$ plain form
16550 1813048 1668016 2044776 1880798 1867519 1743055 1330166 1668431 1860988 1736151 1735761
16540 1735761 1818147 1455365 1484497 1494020 1486747 1759598 1599408 1396969 1376057 1171770 1529863
16529 1529863 1395872 1232628 1537017 1357771 1317027 1506176 1521012 1311253 1016452 1205687
16519 1205687 1160195 1297136 1004035 793781 1035525 1017338 1111592 1071224 974469 1154608
16509 1154608 1056819 1075803 1350698 827379 927986 993311 1355106 833163 978857 911377
16499 911377 713650 1356108 634681 733587 586276 497792 838053 679492 639664 660259
16489 660259 775642 623022 832382 739001 788673 961406 1084341 818889 913547 921785
16479 921785 565319 1077988 756771 757234 321648 670040 917067 649291 701883 890052
16469H90052j84881J54764k21341N05932l60323l00811j36977J73621L61010j94826
16459F86220n8500B21028J57453M6256K31909q1180r8111j07493o8343M66030
16449G67549m274k45380J10983L33913D31503j88485l6425M88247j69548J6135
16439E41427B66634J43396l4079K66462j43829k12406L86817k48195Q8109J30168
16429F43077r0456A45001L19843J47083o6156B22724L1953J20108J0028K48755
16419F33568K4735j84128K12891A89720L01573K68850l04571j21129J08140N0702
16409D93285J32328O9860B90365r2748J55412K25689B41139J7017L95456C24708
16398A86457K33272A15350M87666k59633K41769A99577J08356K91841j89436k2805
$$ plain form
16469 890052 705171 859935 638594 1144526 784203 483392 346415 520036 881046 686220
16459 686220 627720 221028 378481 424737 656646 575466 477355 369862 301519 767549
16449 767549 763275 517895 628878 962791 431503 243018 206593 694840 525292 541427
16439 541427 266634 410030 375951 642413 498584 286178 672995 424800 512909 643077
16429 643077 552621 145001 464844 611927 545771 222724 254677 374785 384813 633568
16419 633568 658303 474175 687066 189720 491293 760143 455572 334443 442583 493285
16409 493285 625613 695473 290365 197617 353029 578718 241139 258156 653612 324708
16398 186457 419729 115350 603016 343383 585152 199577 307933 599774 410338 387533
16388C87533j37773N75935k46109j86692J16675o7869A69433N00652k54147o0859
16378C55079J488N2564j44644O9182K21176A88967p5611k5493K78450j37384M3698
16367B72627p5111K6450R3875L01579B63706K30945o6261j47696Q8434L3462q9422
16356C13168j33420J53216n4146K09452C7127N70963A05161L18914L1543j26691
16346C28927m4665r6872L7111A06873K0176c833H1848K55303j67286J46949A19837
16334A64120D7160i5004B85682K02521r9193I1225k5218K49989j28344K66765
16324D54417j00857J84418D6372J93488J41874A46588b1186A01221J34031P4359
16314C09611B2501R1818j7276J37273R0421G7187K63634J04450L7761n8797j21852
$$ plain form
16388 387533 249760 825695 579586 392894 509569 441700 169433 670085 415938 355079
16378 355079 356567 409131 264487 333669 554845 188967 113356 87863 366313 228929 272627
16367 272627 197516 223966 317841 619420 263706 494651 428390 280694 369128 402590 313168
16356 313168 179748 332964 278818 488270 37127 608090 105161 424075 455618 328927
16346 328927 284262 187390 224501 106873 127049 -3833 81848 337151 169865 316814 119837
16334 164120 47160 -95004 285682 488203 389010 91225 66007 315996 187652 454417
16324 454417 353560 537978 46372 239860 381734 146588 -21186 101221 235252 309611
16314 309611 22501 114319 97043 234316 324737 77187 340821 445271 483032 424235 302383
16303C02383A3906b1266A755M1070K57404r9120J6157p4537F6360J27680G4247
16291B45122f359E3675K68685G9734i6686H9593K74265j33624A08093P4094J75765
16280C57952C3816b12727B14683e0004J7131A46999L2104n7823R6398M732p8733
16269A43677Q5554n4715g6892B13700e6646b536C94706o9303m121N0738B3137
16257A79849l1631B1847M00437C2802a02945k51831F1941d9318k10825B08203
16246f5187A76677B2377b5070A70971b0243A1926J98895N9791j6901j3780p715
16235B32216a6072B00872f8738A33566e2481i490D9459J11837p575G2608N2638
16224A25246m5044b915k3350A87477p0614L1141O8041j0514J30841A03117h264
$$ plain form
16303 302383 13906 -21266 1755 42825 300229 201109 217266 142729 66360 194040 74247
16291 245122 -6359 53675 322360 79734 -96686 89593 363858 230234 108093 182187 357952
16280 357952 33816 -212727 214683 -50004 -32873 146999 179103 121280 217678 222410 143677
16269 143677 229231 174516 -76892 213700 -56646 -2536 394706 325403 321282 372020 23137
16257 179849 148218 21847 422284 32802 -102945 -354776 61941 -49318 -260143 208203
16246 -65187 176677 22377 -25070 170971 -20243 11926 210821 270612 253711 239931 232216
16235 232216 -16072 200872 -68738 133566 -52481 -9490 49459 161296 153721 72608 125246
16224 125246 80202 -2915 -26265 187477 116863 148004 216045 205531 336372 103117 -8264
16212A27519J0875J39073A10809M4306a27582G345a10500E5315h5349D4969K04637
16201B49606r4517b24431C21819E9199b4811F7615a14658c5323C38798a88180
16190b7466A68873K20126a4424A0364f5521A00161B7560h3956B81101N9156A69651
16178C33137A10020A1286d2096n3587B08430Q1335p8496b62532A35524a41265
16167B6798L65858A61340A4505R334b7540E4058P5417L06504A17320P7780G5332
16155f2077B79263d8209j21164o4532e9938a9750D7587M78406B36716E0357K13610
16144B63967a15723c6193l5345J9419B6436g2751j35738M6976K5341e9271B8005
16132B26546j00299C3536c02588a46272j5792A71805f7907j13751A09667c41187
$$ plain form
16212 127519 138394 277467 110809 155115 -127582 7345 -110500 55315 -85349 44969 249606
16201 249606 155089 -224431 321819 59199 -24811 67615 -114658 -35323 338798 -188180
16190 -27466 168873 388999 -14424 10364 -65521 100161 27560 -83956 281101 340257 169651
16178 333137 110020 11286 -42096 -95683 208430 289765 211269 -262532 135524 -141265
16167 26798 392656 161340 14505 23839 -27540 54058 129475 435979 117320 195100 75332
16155 -62077 279263 -48209 -169373 -233905 -59938 -19750 47587 525993 236716 50357 263967
16144 263967 -115723 -36193 -71538 -52119 26436 -72751 -208489 -161513 -136172 -59271 28005
16132 226546 126247 33536 -302588 -146272 -162064 171805 -67907 -181658 109667 -341187
16121h5061G3236A2303P328f45325F3065J23151F5634d0830C44535i2185n4887
16110a47072R673j86417P8706e6479H3417J06236a14484M6838j27461G5072a07157
16098C7366f7364j39250A70644f2097G7468a8881B1252b38558H7061j9072Q5230
16087A53219a04593o3831A41933O5016f5180F345a62704g9288a2529o9967D0302
16075c20604A85995g8244B16426a03748b976l56351A26072c471A95824b06173
16064a29725A49831a38253k1425K9854A63624n3382k2848M9867J47899b70083
16053i0163L238j41185C8937c51373D1243O879P1184K938c21777C52449A25335
16041D1318r976J34540f3240l38988i9432E0635c60570D962J04586g5465k27417
$$ plain form
16121 -85061 73236 12303 19631 -645325 63065 186216 65634 -40830 344535 -92185 -147072
16110 -147072 -137399 -323816 -245110 -56479 83417 189653 -114484 -67646 -195107 75072 -107157
16098 37366 -67364 -206614 170644 -62097 77468 -18881 21252 -238558 87061 67989 153219
16087 153219 -104593 -168424 141933 206949 -65180 6345 -162704 -79288 -12529 -82496 40302
16075 -320604 185995 -78244 216426 -103748 -2976 -359327 126072 -3471 195824 -206173
16064 -129725 149831 -138253 -159678 -129824 163624 110242 87394 137261 285160 -270083
16053 -90163 -86925 -228110 38937 -351373 41243 48122 119306 122244 -321777 352449 125335
16041 41318 31342 165882 -63240 -402228 -99432 50635 -360570 4962 109548 -75465 -302882
16030c02882c1471C29357j38588p3254a14632d744j72265h0615D7129f5780A07428
16018B47106a34835e5971k09886A18486a0793o8853l5967L8229K9697j84952A23097
16006b20729k66516B75755i5271A30860L4606b5886C10741b92658b7193l8352
15996f5545j7836K4151r1306A16b74638g8333G362f6976H5071a5131k32779B7397
15983A68986a61827A26485D1941b98824E5535J24394e5194B32257a16109A95783
15972A9646e8525C10468a09448A11726P5517J94764j48849F3150k727N38969a83625
15960A33784D6674c29039A91931N204a74166B11963i2899d043B4103N3545a28893
15948e37801B3525J9821d6384J18K1643r3936k18088D5351a74978A95108A3212
$$ plain form
16030 -302882 -31471 329357 190769 117515 -114632 -4744 -177009 -80615 47129 -65780 107428
16018 247106 -134835 -55971 -265857 118486 -10793 -79646 -115613 -77384 -47687 -232639 123097
16006 -220729 -487245 275755 -95271 130860 165466 -25886 310741 -292658 -27193 -65545
15996 -65545 -83381 -59230 -150536 116 -274638 -78333 7362 -66976 85071 -15131 -247910 27397
15983 168986 -161827 126485 41941 -298824 55535 179929 -55194 232257 -116109 195783
15972 19646 -58525 310468 -109448 111726 187243 382007 233158 63150 60423 599392 -183625
15960 133784 46674 -329039 191931 197135 -174166 211963 -92899 -4043 24103 77648 -128893
15948 -537801 23525 43346 -46384 -46266 -24623 -118559 -336647 45351 -174978 195108 13212
15936f1384n8201j44214Q7120k289K7368m0292L9748a6507j40389B56683E3641
15924e4362I8922a72787e6896A22437e83945A1912c1396p3602A47207a90795f1929
15912b13049k5588G4497b2638I2748k3128i8731E9806Q6014b30411A39400o0535
15901G8865c47818M9682A60920k6467a28615d4488n8593I6346h2819q4697G3053
15889b04438M6738q3156D4948B47M6404r563P589M6198i2460A55967c32347B27906
15876A1964b37021A83598a53114o7575A33469K83583A19291a65010f9747m74970
15866e44717J71271I085R4823J63195b67278I0843d32365a90348p8601P2756g9800
15854C332M36072A25648P2855J14815q726a77499H830K23737E9130g3459A967
$$ plain form
15936 -61384 -119585 -263799 -176679 -178968 -151600 -191892 -152144 -16507 -156896 256683 53641
15924 -54362 98922 -172787 -56896 122437 -583945 11912 -31396 -104998 147207 -190795 -61929
15912 -213049 -238637 74497 -22638 92748 69620 -98731 59806 145820 -230411 139400 78865
15901 78865 -347818 -298136 160920 134453 -128615 -44488 -103081 96346 -82819 -167516 73053
15889 -204438 -157700 -240856 44948 247 46651 37088 44677 90875 -92460 155967 -332347 227906
15876 11964 -237021 183598 -153114 -220689 133469 417052 119291 -165010 -69747 -544717
15866 -544717 -373446 9085 103908 267103 -267278 90843 -432365 -190348 -268949 -196193 -79800
15854 3332 439404 125648 198503 313318 304592 -177499 8830 232567 59130 -73459 1967
15842E3884a23087m7236A80736b2573C5401H714a5168k36436A86135C1150J33498
15831A64648k5062q144K58806a29246C5751O2969b9363k00738e4565D1366a38299
15819b1172C6176a00097A41837K77422A92739b78085F7877b37302o7423R0320
15809b14405n5135L4672I4587d0645j14962j33843O7573a7194j53969j3658B38259
15797c82490P7661A19909a7397A11571k4569J20776D3632a86935j02211A12887
15786A8408a26159O0136k691k26050e8661A31054d89480i6800D2122J93685g3821
15774B1226a50098A8701J9160a66322K7588p4820P9109b0465I8732L3494a52382
15762A73676b09260D0275c16771A12585b25877j56711L2903Q3754J28309m2490
$$ plain form
15842 53884 -123087 -170323 180736 -22573 35401 8714 -15168 -251604 186135 31150 164648
15831 164648 139586 131442 390248 -129246 35751 98720 -29363 -230101 -54565 41366 -138299
15819 -21172 36176 -100097 141837 419259 192739 -278085 67877 -237302 -304725 -214405
15809 -214405 -269540 -234868 94587 -40645 -155607 -289450 -221877 -17194 -171163 -184821 238259
15797 -382490 -304829 119909 -17397 111571 87002 207778 43632 -186935 -289146 112887
15786 18408 -126159 -66023 -68714 -294764 -58661 131054 -489480 -96800 42122 235807 -73821
15774 21226 -150098 18701 37861 -166322 -138734 -213554 -134445 -20465 98732 132226 -152382
15762 173676 -209260 40275 -316771 112585 -225877 -382588 -349685 -265931 -137622 -180112
15752a80112j07475E3160a12670j56757F0539d91270a15777A28789d6698I9498
15741B4134Q3148L2663b81493a13054B2055c40446P9971H248N77048H161e4446
15729A98982d5116j39864D4668q180d65048A14081d62179A62350A6432e2284a9501
15717d6637l87366b3600A28325c19343N2453c749j36164c5874k92538N4696m7711
15706c21427j6549A5203b89791J25101O0273A33000b7847r5604j28691A37372
15695E0611k3369c57316F9794b89543A81472L1626p3905e6006D4158a77756H3847
15683F6650A6944a9377C7995K08849J75932A76960g880A38162f8968c1393q868
15672d0261H4067k5904B3152a15025B3505j1623J11767d18018f5614H8157J37366
$$ plain form
15752 -180112 -287587 53160 -112670 -269427 60539 -491270 -115777 128789 -46698 99498
15741 24134 107282 139945 -281493 -113054 22055 -340446 -260475 8248 585296 8161 -54446
15729 198982 -45116 -184980 44668 36488 -465048 114081 -462179 162350 16432 -52284 -19501
15717 -46637 -434003 -23600 128325 -319343 -266890 -3749 -139913 -35874 -328412 -273716 -321427
15706 -321427 -337976 15203 -289791 -164690 -104417 133000 -27847 -123451 -252142 137372
15695 50611 27242 -357316 69794 -289543 181472 213098 139193 -56006 44158 -177756 83847
15683 66650 16944 -19377 37995 246844 422776 176960 -7880 138162 -68968 -31393 -40261
15672 -40261 84067 58163 23152 -115025 23505 11882 123649 -418018 -65614 88157 225523
15661B25523L2585d7069j42608F3904K72245i9050A38703a6973A3736n375J3417
15650B1778O3569L9080b6556E9891c16961G3224c10279i2084n3284H1225b9924
15638f7358C35167a39595M0279q8865c5564j20431j15437B7901L06988j18140
15628B16749c52073c8143J1148p8978A16119K77323a70068B57497a52940k19197
15618c72137J10084B8991N529M7689K0390h0431j17689j03844g589E7677c1813
15606A38115J24262b53333d1291I2294h1689I0366b04873p5785A0230O5821g8374
15594i8388l7779m8287k1548A40090b13898j39876A98833a72228F8580b30428
15583f444o7600l35729d9873J2821A85265I0022K36098H2845d6253E6408N6530
$$ plain form
15661 225523 258108 -47069 -189677 63904 336149 -99050 138703 -16973 13736 8361 21778
15650 21778 85347 124427 -26556 59891 -316961 73224 -310279 -92084 -145368 81225 -29924
15638 -67358 335167 -139595 -99316 -188181 -35564 -155995 -271432 27901 334889 216749
15628 216749 -352073 -38143 -26995 -105973 116119 393442 -170068 257497 -152940 -372137
15618 -372137 -262053 28991 34520 82209 102599 -80431 -198120 -301964 -7589 57677 -31813
15606 138115 262377 -253333 -41291 92294 -81689 90366 -204873 -280658 10230 76051 -78374
15594 -98388 -136167 -184454 -206002 140090 -213898 -353774 198833 -172228 68580 -230428
15583 -6444 -74044 -409773 -49873 -37052 185265 90022 326120 82845 -46253 56408 112938
15572A12938P8891n5510a43620O7769B65078j14674B1196e1623q7763G1579a47653
15560E3948d7719F976b50910H7841f7165m944p207L6939J505j2989k60711p6962
15548c91534H5982N7742D5993J01883k4404f7970d068C4285J5854k0283Q5414
15537A15270g9448B7245c4621A56023g4713o2085K3416G8844b08045G5903C1558
15525e07435a16175n6140A27014J02237r9057a15321A42774A770R1529a18230
15514d5300A5742b4146C8427K00398d17617B30744b83119C0183f6450l4206p1364
15503a72020C27347G2849Q2480m6772e2393A41311g260F6756c8443k02589e0986
15491I6150a01576H4484i7640d2306o2354A27381L5977L2285a79599M8726N5235
$$ plain form
15572 112938 191829 136319 -143620 -75851 265078 150404 21196 -51623 -139386 71579 -147653
15560 53948 -47719 6976 -250910 87841 -67165 -72109 -79316 -42377 -40872 -53861 -314572 -391534
15548 -391534 85982 143724 45993 147876 123472 -67970 -4068 34285 50139 29856 115270
15537 115270 -79448 27245 -34621 156023 -74713 -136798 -113382 78844 -208045 75903 31558
15525 -507435 -116175 -172315 127014 229251 130194 -115321 142774 1770 93299 -118230
15514 -45300 15742 -24146 38427 238825 -417617 230744 -283119 30183 -66450 -100656 -172020
15503 -172020 327347 72849 155329 108557 -52393 141311 -7260 66756 -38443 -241032 -50986
15491 96150 -101576 84484 -97640 -42306 -104660 127381 163358 195643 -179599 -130873 -75638
15480g5638l43857E6419L62455a50763K4736K3474A84925g7348B1926a2825k54408
15469b67233A86376a65752a5381B38966c8877A57159h4404a9466j42123H6757
15458a27855A81108a50072e1551a5754n9927f953k61130Q8459d7730J4613D2092
15446A42969E0595c3030l44862C1020a05943G2435a23942C06486K0860a39916
15435a04483A61279n3678C7914L7138b23228A78791a03173b6425j26683A13653
15424H43K89777A38625M9310b74104G4046b80722A97085C2243b43842D6491i9959
15412h4484a0834A1038h9264a8043N029A01448m1093B4338L1335B7069a60078
15400F0237K2719j9895a6109B54161c55709a9255F2816K15723E9548a85018m0117
$$ plain form
15480 -75638 -419495 56419 418874 -150763 -126027 -102553 184925 -77348 21926 -12825 -267233
15469 -267233 186376 -165752 -15381 238966 -38877 157159 -84404 -19466 -161589 86757
15458 -127855 181108 -150072 -51551 -15754 -75681 -6953 -268083 -179624 -47730 -33117 42092
15446 142969 50595 -33030 -377892 31020 -105943 72435 -123942 306486 327346 -139916
15435 -104483 161279 107601 37914 75052 -223228 178791 -103173 -26425 -153108 113653
15424 843 290620 138625 187935 -274104 74046 -280722 197085 32243 -243842 46491 -99959
15412 -84484 -10834 11038 -89264 -18043 -13014 101448 60355 24338 55673 27069 -160078
15400 60237 82956 63061 -16109 254161 -355709 -19255 62816 278539 59548 -185018 -225135
15389b25135h6374A21578A0701O7666M4948a40433k04532i2596A2186L7744a465
15377D9637b00001I2790k860a62505j12745B20623a91147Q7930b754B8330J22659
15366A50989b48687a07229C24074a35979f359p5281q0835K5376B4802a32765A57526
15354A41405o2108L7357G911J45410P2878A10168K6940c37290a14961A23265m5123
15343G8142B4702J46676p1851J11592C4703c6342A07697L6505h6769C4051O2599
15332I6650B2860b74398D9568l128P396J33849P4658F6942K54737g2989B27861
15320a01697n7467l1905A19685Q7963b62834f9545A89458K4765g6038b9638j39842
15309a69480A65758M5992J06704b7535E249N5169b9052j35283a2816A78676i2523
$$ plain form
15389 -225135 -86374 121578 10701 78367 123315 -140433 -344965 -92596 12186 49930 -1465
15377 49637 -200001 92790 89930 -162505 -275250 220623 -191147 -103217 -2754 28330 150989
15366 150989 -248687 -107229 324074 -135979 -6359 -81640 -162475 -137099 24802 -132765 157526
15354 141405 79297 116654 7911 153321 226199 110168 137108 -337290 -114961 123265 78142
15343 78142 24702 171378 99527 211119 34703 -36342 107697 144202 -86769 34051 96650
15332 96650 22860 -274398 49568 46440 53836 187685 262343 66942 321679 -72989 227861
15320 -101697 -159164 -191069 119685 207648 -262834 -69545 189458 214223 -76038 -29638 -169480
15309 -169480 165758 211750 318454 -27535 5249 60418 -29052 -164335 -12816 178676 -92523
15297a22038A51686i4329E1719a83818r893j49200B13256B2216J28076h8601j99129
15286b87730I9434a49230B09136F8943b21926B15488A6853J40560i8336A0653
15275I3321J82992j1561O8K11320a62974E8190g0817G8224f9293A72858b20277
15263c4323H8122b04801c7953C4180c63306B27692F1282K57640h3428j14878h2180
15251A75541p6769c6948F161J16608k0485F417c35390R2760A91817A9912f5841
15239B38551A4943L71382K6485L50556J16171n9174R1884J60875m97018A68327
15228B0558K74528A20905L20034h7750C53764Q2262a57470m7943I2989m1202p769
15217D4018b14437F2488K7441B8766i9584b4771j14147B26053c1851B51849a41278
$$ plain form
15297 -122038 151686 -94329 51719 -183818 -193711 -342911 213256 22216 150292 -88601 -287730
15286 -287730 99434 -149230 209136 68943 -221926 215488 16853 157413 -98336 10653
15275 93321 276313 264752 264820 476140 -162974 58190 -70817 78224 -69293 172858 -220277
15263 -34323 88122 -204801 -37953 34180 -363306 227692 61282 318922 -83428 -198306 -82180
15251 175541 98772 -36948 6161 122769 102284 6417 -335390 -242630 191817 19912 -65841
15239 238551 14943 386325 412810 763366 879537 820363 912247 1073122 576104 168327
15228 20558 295086 120905 440939 -87750 353764 436026 -157470 -205413 92989 51787 44018
15217 44018 -214437 62488 89929 28766 -99584 -24771 -138918 226053 -31851 251849 -141278
15205e7998m8616A02417P3328L07613a33838C00299b3955I4519M305a7466A22596
15193c9639B88597A09559h8045A31954J05977b88687A23195M6683a6468k91247
15183c07715a03261j53835A87768a15353A7979a92464B217M812J71341n3530a19043
15171H1477B3103K07661a82423A23529f7295k1329A0998K0996c9744C0117M3298
15160G3415J3527Q9012p6396a6516A65692i4905C9168M6377P5758n2017i8557
15148B57322H2600i7353B50083A21304A8379a3729B7304A0628J81388L66945b24894
15136A39438o3455K46848A41766L7285H6021g3911c1295j93831R2158H3090b39565
15124B90409J12765A98052q4161K48599J3458j20928D6018h5494D47037A48622
$$ plain form
15205 -57998 -106614 102417 175745 483358 -133838 300299 -23955 94519 98824 -17466 122596
15193 -39639 288597 109559 -88045 131954 237931 -288687 123195 169878 -16468 -307715
15183 -307715 -103261 -257096 187768 -115353 17979 -192464 2217 7029 178370 124840 -119043
15171 81477 23103 230764 -182423 123529 -67295 -88624 10998 31994 -39744 30117 73415
15160 73415 86942 175954 99558 -16516 165692 -94905 39168 85545 161303 109286 -98557
15148 257322 82600 -97353 250083 121304 18379 -13729 27304 10628 192016 558961 -224894
15136 139438 75983 322831 141766 179051 86021 -73911 -31295 -225126 -132968 83090 -239565
15124 290409 403174 198052 113891 362490 375948 255020 46018 -85494 447037 148622
15113b0567k5312B56190D2180J88175A09517l9940K00192C9354M0954a16461B01785
15101A68955g2390n7539A96912e0669B66731G6835K56892a22761K8143B56041
15090B2658b843p8399B16206B4492J42589D8936j7945a02745L5337J7565I3873
15078B25889J14423B0592a14709B50771d9898A69538J05593K5813J9392P5450
15068C95786A60923J7925B083K29195A11801j0404C1913d785A78335H1280P7233
15057A58513a4624A09310b7822A72645G6437K45302b00436k2513a0142C54667
15046A10854A3186K22635h4086B83052F7553e4262n6762B14891J89131E2746J71854
15035B24600q020a79010D2566J21857b737C11457A27483n309J36273b82546a3040
$$ plain form
15113 -20567 -45879 256190 42180 230355 109517 69577 269769 39354 80308 -116461 201785
15101 168955 -72390 -129929 196912 -50669 266731 76835 333727 -122761 -94618 256041
15090 22658 -2843 -81242 216206 24492 167081 48936 30991 -102745 -67408 -49843 93873
15078 225889 340312 20592 -114709 250771 -49898 169538 275131 300944 320336 395786
15068 395786 160923 178848 2083 231278 111801 101397 31913 -4785 178335 81280 158513
15057 158513 -14624 109310 -27822 172645 76437 321739 -200436 -222949 -10142 354667
15046 110854 13186 235821 -84086 283052 67553 -54262 -111024 214891 404022 52746 224600
15035 224600 216580 -179010 42566 164423 -2737 311457 127483 122174 258447 -282546 -13040
15023c5617B44127a033E01816g970l2114A85892j7418F3489i981l5320C42024
15011A28184K24755b14167A97672K50133G8879L97383A1496K98331L2615H8011
15000f4451j18327D9336J43888p2545R8150j8375R601j3681a04066C5082J38569
14989A73651J54049D1728K6007j4853P5791K19947a17244B67029A14841a5458
14978C1801r887N4005J65284M2585M1101k8258l2312l4867c9364A62887j3480
14967A49407Q600j2684K65263j62678L74470D4882J58617h2077A45354J86928
14957C32282o8489k5306C4942J18132K26745j40313j5075K73903F9327b2458D01605
14945D21070q9610D3552L73741r5216A46620P0687h5131A73825n8185b92A55155
$$ plain form
15023 -35617 244127 -1033 501816 -7970 -40084 185892 168474 63489 -9981 -45301 342024
15011 128184 352939 -214167 197672 447805 78879 476262 11496 309827 342442 88011
15000 -64451 -182778 49336 193224 120679 218829 200454 210055 196374 -104066 35082 173651
14989 173651 327700 41728 67735 52882 128673 348620 -117244 267029 114841 -15458
14978 31801 21914 75919 241203 283788 324889 296631 264319 229452 -39364 162887 149407
14967 149407 158007 145323 410586 247908 622378 44882 203499 -82077 145354 332282
14957 332282 263793 238487 34942 153074 379819 239506 224431 498334 69327 -22458 401605
14945 421070 331460 43552 417293 322077 146620 217307 -85131 173825 115640 -292 155155
14933B1178K84079m2985O8220I1212J51832F7646J60722K13954r5568r6582L11292
14922E61464A99392M1861L99126A09820J62159J80907o0393A17203N2559J52808
14912C22570G518J87465N05616c0712C37146N6043A13064J31404L57608B42828
14901b0173A33108L46055k38590A05680K54643J55978k34733J9641a8676A97981
14890C22830J49819j63280J63625A35480J03629J05349A57220L79659j27884C8513
14879B60769A23047a06294A51790J33287p3913R1193R3348J97498B19195e5805
14868C15545O0072m4099J94828m0036A88230K27816P3442k14891N3313L0461J84395
14857E42766B2565L25841q1736R2333J37048j50337K34813n307j88731j53328
$$ plain form
14933 21178 305257 262272 330492 91212 243044 67646 228368 442322 346754 250172 561464
14922 561464 199392 241253 640379 109820 271979 452886 392493 117203 169762 322570
14912 322570 7518 194983 700599 -30712 337146 393189 113064 244468 602076 242828
14901 -20173 133108 479163 240573 105680 360323 516301 281568 301209 -18676 197981
14890 322830 472649 309369 472994 135480 239109 344458 157220 536879 408995 38513
14879 260769 123047 -106294 151790 285077 211164 302357 395705 593203 219195 -55805
14868 315545 375617 331518 526346 486310 188230 416046 489488 274597 327910 358371 542766
14857 542766 22565 348406 266670 359003 496051 345714 580527 575220 386489 233161
14847B33161K91915G1562M12341H8264L45175M2531K6605B47708K9798J64822
14837D42328O0672k34994L6873K31775p6664e365D21774J97543B47232M26604
14827F73836B47299J00975J16742A13030J99952I9377K72481j5511L6807j05536
14817B87618l2282M79186a05102E38476j47615O7789j26671J54126o2805k06168
14807B17132L55778j63286N0831r566j03981M1157j72742K49408k21389R9701
14797C43043K6505J95828j09511A76614M73953n7065k13289K29074C00864J37649
14787D38513q1993L17150l09469J38244j09404J22026j07145j29081K85969K26853
14777G91663k72854K12198B4252M03664m6113M27047l18272K09469K3334j24297
$$ plain form
14847 233161 525076 71562 483903 88264 433439 475970 502575 247708 277506 442328
14837 442328 503000 268006 304879 536654 459990 -5365 421774 619317 247232 673836
14827 673836 247299 348274 465016 113030 312982 99377 371858 356347 393154 287618
14817 287618 255336 734522 -105102 538476 390861 458650 331979 486105 423300 217132
14807 217132 572910 409624 460455 450889 346908 388065 215323 464731 243342 343043
14797 343043 369548 565376 455865 176614 650567 593502 380213 609287 300864 438513
14787 438513 356520 673670 364201 502445 393041 515067 407922 278841 564810 791663
14777 791663 518809 731007 24252 427916 381803 808850 490578 700047 723381 599084
14767E99084k88772M8517J43972J15869N8054k34447K36087j55538j62667O7061
14757D27220A51667N08868k96647K66307k94497J99878K7607O6337m8714k24059
14747C56747L90416k20697n1653J05790l1043B63483l8489M72262B90556M56134
14737G46690B83100L61059M8187J10518K3538p1443k6091k73852L22889k61254
14727E16651m7102K25176J02840o5006J94090j44634l63462J59987J92013j81168
14717E89385K03787j17668k41096L74465j31046R7789q7402k55129J44181J87049
14707G64315j69032K33848j94567K69021k38515J10778j22040P2108q3049k03383
14697D39484R8265j20344L92309l36049L72568M1716m23298J06526k1816J73181
$$ plain form
14767 599084 310312 358829 502801 618670 676724 442277 678364 522826 360159 427220
14757 427220 151667 660535 363888 630195 335698 535576 563183 629520 580806 356747
14747 356747 747163 526466 474813 580603 549560 263483 224994 697256 290556 746690
14737 746690 283100 644159 692346 802864 826402 754959 728868 455016 777905 516651
14727 516651 469549 694725 797565 732559 926649 782015 418553 578540 770553 589385
14717 589385 793172 675504 434408 808873 677827 775616 688214 433085 577266 764315
14707 764315 595283 829131 634564 903585 665070 775848 653808 725916 642867 439484
14697 439484 537749 417405 809714 473665 846233 887949 464651 571177 549361 722542
14687G22542k56794N89837D76190J61012L51693j11053l52649K84353K64880j49198
14677I25228q041r2239o0372j73827O56077k49926m39786M23868J68880k16835
14667I33027k16332p2787M6960J67966K56458j86912K07708m75142L27679J2892
14657A001517L17695l69305J91988k02074N897J35833j42715J82199J46048k83703
14647I83380J31907j19433n1308n4479J3739L49677j28528j00448k12558L23239
14637A135188Q4860l72718N52209m23617L57494l81980p4450J92029N3910k52990
14627H69935M78566j70970m7037M11495m69591K00430m15819L09441j4950l21485
14617H30015M20264r3088n5772Q4089J7522j2287J41823k02167L28490M880o4635
$$ plain form
14687 722542 465748 1055585 476190 637202 988895 877842 525193 809546 1074426 925228
14677 925228 917187 824948 764576 590749 1246826 996900 557114 980982 1149862 933027
14667 933027 716695 643908 690868 858834 1115292 928380 1136088 660946 988625 1001517
14657 1001517 1319212 949907 1141895 939821 945718 1081551 938836 1121035 1267083 983380
14647 983380 1115287 995854 944546 890067 903806 1253483 1124955 1024507 811949 1135188
14637 1135188 1220048 847330 1399539 975922 1333416 951436 876986 1069015 1122925 869935
14627 869935 1348501 1177531 1130494 1541989 1072398 1272828 857009 1166450 1151500 830015
14617 830015 1250279 1157191 1101419 1185508 1203030 1190743 1332566 1130399 1458889 1463769 1399134
14606A399134k31751K5057K53237J32112o8818o0240J86974l06417j79198K06982
14596A357072K01643k74250k6450n688L94179k03275J88794k57493L3733L32376
14586A740641k61957m069j03215K6909N7858K85404p4358J8753p5655J35881k91680
14575A454512M08540j37366J68180j21026J68513l05284K91361j77930N6930J52505
14565A958935j65895K45974k67153K47176k74091q7312K57246K15799j63572J4679
14555A981786L56281k40874q6437J33734J57968J08409J10205j1856j85179J54300
14545B478337L09220j92420N48395j78494M43212J30169P21538O8976L68891J129300
14535E827124J452871K581850M006358O169274Q631630J19352j1134978o534332
$$ plain form
14606 1399134 1167383 1192440 1445677 1577789 1508971 1448731 1635705 1329288 1150090 1357072
14596 1357072 1558715 1284465 1258015 1252327 1646506 1443231 1632025 1374532 1408265 1740641
14586 1740641 1478684 1474615 1371400 1398309 1456167 1741571 1667213 1685966 1610311 1746192 1454512
14575 1454512 1863052 1725686 1893866 1772840 1941353 1636069 1927430 1749500 1806430 1958935
14565 1958935 1793040 2039014 1771861 2019037 1744946 1657634 1914880 2130679 1967107 1981786
14555 1981786 2338067 2097193 2010756 2144490 2302458 2410867 2521072 2509216 2324037 2478337
14545 2478337 2787557 2595137 3143532 2965038 3408250 3538419 4259957 4328933 4697824 5827124
14535 5827124 7279995 9861845 13868203 20037477 28669107 28788459 17653481 11119149
14527A1119149m101365j776861j312786o40120l83380Q1589m70772j1591j85052
14518B318811J51669j80984l84270N52166l30829O9475K7780j25315K62581q2229
14508B278855L77841r3059l43918K39321P3511Q433j08284l20987M78623J74461
14498B764797j48695j67653L35274J08037m72944K88060o0014P7125M35536N5315
14488C214838n53284J29225J72964j81605M11554j66217j29892J88660L28648
14479C414891J48867n20041J78982L05408k66691P6844J28135j29202J71061l54164
14469C154090L42282L27793l0720k8709J08998m39748M78202m72976M86949l07597
14459C618564M88547J02704j28660m45446N57972j58966J45138l17464N00330
$$ plain form
14527 11119149 7017784 5240923 3928137 3288017 2904637 2986226 2515454 2503863 2318811
14518 2318811 2470480 2289496 1905226 2457392 2126563 2196038 2223818 2098503 2361084 2278855
14508 2278855 2656696 2563637 2219719 2459040 2532551 2540984 2432700 2111713 2590336 2764797
14498 2764797 2616102 2448449 2783723 2891760 2418816 2706876 2646862 2723987 3159523 3214838
14488 3214838 2661554 2790779 2963743 2782138 3193692 3027475 2897583 3086243 3414891
14479 3414891 3563758 3043717 3222699 3528107 3261416 3338260 3466395 3337193 3508254 3154090
14469 3154090 3496372 3824165 3793445 3764736 3873734 3433986 3912188 3439212 3926161 3618564
14459 3618564 4107111 4209815 4081155 3635709 4193681 4034715 4179853 3862389 4362719
14450D362719J86335R7698n1305q0056L55763o9223m20343O01936k42440p7345
14440D663739o2000M51324Q3640k25817p9263J23934K37770K29560j28915j84805
14430E109167K1363L33344M11244j53296q4537J17338J08196j65387M37828J24373
14420F259633q7779J34733J64554J61890k33068J09639M43840k31310J79455P4094
14410F975681M7937J24441J93618j48774q8853N86337N6976q5452J70600M1758
14400G874269N09332n71821O29617r0066N89160k49121O0274L09227L8952k67168
14390H832655K17140N95124k05461L04254r3174N45945K96004l828J9450J16010
14380A0624119N70287O8936j55112M95984K30241r2178J93884K37632P4190M97775
$$ plain form
14450 4362719 4549054 4646752 4595447 4515391 4871154 4801931 4381588 4983524 4741084 4663739
14440 4663739 4601739 5053063 5136703 4910886 4831623 4955557 5193327 5422887 5293972 5109167
14430 5109167 5130530 5463874 5875118 5721822 5637285 5754623 5862819 5697432 6135260 6259633
14420 6259633 6171854 6306587 6471141 6633031 6399963 6509602 6953442 6722132 6901587 6975681
14410 6975681 7023618 7148059 7341677 7192903 7104050 7690387 7747363 7661911 7832511 7874269
14400 7874269 8383601 7811780 8441397 8351331 8940491 8691370 8751644 9060871 9099823 8832655
14390 8832655 9049795 9644919 9439458 9743712 9650538 10196483 10492487 10488659 10508109 10624119
14380 10624119 11194406 11263342 11108230 11604214 11834455 11742277 11936161 12173793 12247983 12745758
14370A2745758J64975M00159K91121J0082L47893K51261j8476L33997K66048N37507
14360A5330325K71128N09430L09291K62381L11012R6484O65213J38617J32026
14351A8025907P38469P6605O65017K68039M48613O62907J22101P78715M07952
14342B2194325M12490M77129N24773O28272P20065N00053L04156J004447P63574
14333B7529284P17047N57984O90353R57934O17579N67321R61403Q86359R73067
14324C4458331Q77416R17164J238092J044271Q93001J284230J416651J127303
14316D3256459J757764J324086J395405J449337J620116J242320K118709J859794
14308E6023990J834236K060898K233196K242349K458123K483111K506997K794798
$$ plain form
14370 12745758 12910733 13310892 13602013 13612095 13959988 14211249 14192773 14526770 14792818 15330325
14360 15330325 15601453 16110883 16420174 16682555 16993567 17090051 17755264 17893881 18025907
14351 18025907 18764376 18840981 19505998 19774037 20222650 20885557 21007658 21786373 22194325
14342 22194325 22606815 23083944 23608717 24236989 24957054 25457107 25761263 26765710 27529284
14333 27529284 28246331 28804315 29494668 30452602 31070181 31637502 32598905 33485264 34458331
14324 34458331 35335747 36252911 37491003 38535274 39428275 40712505 42129156 43256459
14316 43256459 45014223 46338309 47733714 49183051 50803167 52045487 54164196 56023990
14308 56023990 57858226 59919124 62152320 64394669 66852792 69335903 71842900 74637698
14300G4637698L128869K888393L025178M190124L178995L724535L937744M438424
14292A03149960M245430N046396N061101N397750N529957O098888O075119P146622
14284A47751223O894277P679926Q176943Q443737R404386R362778J0018028J0456220
14276B18187518J1594405J1888771J2883022J3312176J3562557J4549053J4580156
14269C10557658J4749065J4268275J3529714J4003343J2565773J2148825J1361362
14262D03184015J0350496R952999R253393P336312M342801J386819J460817J773972
14254D49041624j315402p071942n348719o084540r352862j0372237j1825409j2985450
14246C84685063j3054203j2977265j3411452j3355618j3210378j3189439j3098037
$$ plain form
14300 74637698 77766567 80654960 83680138 87870262 91049257 94773792 98711536 103149960
14292 103149960 107395390 112441786 117502887 122900637 128430594 134529482 140604601 147751223
14284 147751223 154645500 162325426 170502369 178946106 188350492 197713270 207731298 218187518
14276 218187518 229781923 241670694 254553716 267865892 281428449 295977502 310557658
14269 310557658 325306723 339574998 353104712 367108055 379673828 391822653 403184015
14262 403184015 413534511 423487510 432740903 440077215 444420016 445806835 447267652 449041624
14254 449041624 447726222 440654280 435305561 429221021 419868159 409495922 397670513 384685063
14246 384685063 371630860 358653595 345242143 331886525 318676147 305486708 292388671
14239B92388671j2574783j2451049j1975101j1667479j1375571j0779315j0757731
14232B10807642j0039424r584594q835937r167337q718347q833102p544375p128963
14224A40955563p151175n700953o097513n374576n138013m646393m662240m142036
14216I8042664l986512l717392l837256l537839k937553l141475k776019l281286
14208G0827332k066417k386878k231632k376446k228426j997968j618577j918995
14200E4001993j663838j422468j480504j607581j792901j238707j371979r92482
14192D2431533r00888j410741r57660j413931j160300n67552j021555j132571
14184C3866335j95999j522569o43672j051130q22783k67885j036358o21211j161671
$$ plain form
14239 292388671 279813888 267362839 255387738 243720259 232344688 221565373 210807642
14232 210807642 200768218 191183624 182347687 173180350 164462003 155628901 148084526 140955563
14224 140955563 133804388 128103435 122005922 116631346 111493333 106846940 102184700 98042664
14216 98042664 94056152 90338760 86501504 82963665 80026112 76884637 74108618 70827332
14208 70827332 68760915 66374037 64142405 61765959 59537533 57539565 55920988 54001993
14200 54001993 52338155 50915687 49435183 47827602 46034701 44795994 43424015 42431533
14192 42431533 41530645 40119904 39162244 37748313 36588013 36020461 34998906 33866335
14184 33866335 33670336 32147767 31504095 30452965 29630182 29362297 28325939 27704728 26543057
14175B6543057l22907o39205n19693o74649n75932l93355o57904n46536j51938
14166B2060938o98519l05562l68396q70644j15385n49352l82609k04753k83376
14157A8282342l47944l81821m61369l86081j51290o40896k22626l00820k92134
14148A5097361j39976j24104m10698m57873j35143m61196Q6089l82279J38025
14139A3210206l38758l25981m06047M7962Q96m52764l50142J01750k56510O646
14129A1237258n22843N9958k64502P6327n31779L46866l80331k95158k4l36618
14119I389154j92699M0333q5758J23423n74858K2873l23922N7867k41257l0423
14109H184733j53457P3218n8189m13921L46351n27046J08291l09511Q1175n11514
$$ plain form
14175 26543057 26220150 25580945 25061252 24386603 23810671 23417316 22759412 22212876 22060938
14166 22060938 21362419 21056857 20688461 19817817 19702432 19153080 18770471 18565718 18282342
14157 18282342 17934398 17552577 17091208 16705127 16553837 15912941 15690315 15389495 15097361
14148 15097361 14957385 14833281 14422583 13964710 13829567 13368371 13454460 13072181 13210206
14139 13210206 12871448 12545467 12139420 12187382 12188278 11735514 11385372 11487122 11230612 11237258
14129 11237258 10714415 10774373 10509871 10586198 10054419 10401285 10020954 9725796 9725772 9389154
14119 9389154 9196455 9236788 9151030 9274453 8699595 8722468 8398546 8456413 8215156 8184733
14109 8184733 8031276 8104494 8046305 7632384 7978735 7451689 7559980 7250469 7331644 6820130
14099F820130M52285l00233l9534j69235J25029k76192k37937J62798n33761M75745
14089F479095l14780k01660P6495R4270l92093L31401j79091j32009l50143M2816
14079E454301J38747j35491K78202l60502j30571M8211n89311L96885o6059j94861
14069D839551q6647N9293Q9011j87070l8845K11584l95117J77292m0425k78988
14059D349639O8470k63963M73804l83404L0264N9326j27513k54663L56817k02252
14049D106525j72905q2649p0797M29374m05116j07544M05150k09680j09178k53110
14039C530070k21079L33273k04468L42443k93310J13653j17289J07597l85153
14030C205737L52177o31552L28089J31920n02900M19599K56170n76687o2838L09579
$$ plain form
14099 6820130 7272415 6972182 6932648 6763413 6888442 6612250 6374313 6537111 6003350 6479095
14089 6479095 6164315 5962655 6039150 6133420 5741327 6072728 5893637 5761628 5411485 5454301
14079 5454301 5593048 5457557 5735759 5375257 5244686 5292897 4703586 5100471 5034412 4839551
14069 4839551 4752904 4812197 4901208 4714138 4675293 4886877 4491760 4669052 4628627 4349639
14059 4349639 4418109 4154146 4627950 4244546 4274810 4334136 4206623 3951960 4308777 4106525
14049 4106525 3933620 3850971 3780174 4209548 3804432 3696888 4102038 3892358 3783180 3530070
14039 3530070 3308991 3642264 3437796 3780239 3486929 3600582 3483293 3590890 3205737
14030 3205737 3557914 2926362 3254451 3386371 2883471 3303070 3559240 2982553 2919715 3229294
14020C229294j0323k01590M4382J48223m59247N35111n17159K14582N1390m27769
14010B606894J52307k28051K3041L49083l9152k23778N2147j7254k1855O2573
14000B715955k10407M413o1982J06997k72713M74900k39751k76389o662M821M12657
13989B651839l70565k564q5962K00303J21472l76630r9527M51456O9337o11513
13979A947646P33147K93422K73787L27009J069836K190751L041984N826966Q760092
13970B4464640M537136q597139o054545m442671k224923j828358j019016k42031
13962D593093n99269k22843k15864m05750J3386k04048q3868R4087k94726Q3616
13952B757814J6400l56893J4339k56309L06494p1732k77067K38102l29511n9344
$$ plain form
14020 3229294 3218971 3017381 3061763 3209986 2750739 3285850 2768691 2983273 3034663 2606894
14010 2606894 2759201 2531150 2554191 2903274 2864122 2640344 2692491 2675237 2653382 2715955
14000 2715955 2505548 2509961 2447979 2554976 2282263 2757163 2517412 2241023 2234361 2239182 2651839
13989 2651839 2281274 2278710 2192748 2393051 2514523 2137893 2038366 2489822 2559159 1947646
13979 1947646 2680793 2974215 3248002 3575011 4644847 6835598 9877582 15704548 24464640
13970 24464640 29001776 20404637 14350092 9907421 7682498 5854140 4835124 4593093
13962 4593093 3993824 3770981 3555117 3149367 3162753 2958705 2874837 2968924 2674198 2757814
13952 2757814 2774214 2417321 2431660 2175351 2481845 2410113 2133046 2371148 2041637 1982293
13942A982293J67561m0733q6454j847l39344K45161k83751L78734n3433K86401
13932B254588o20380J15382O1686m19313N16073k03975L28441j23998r2778J00480
13922A916206k30110O8994j15352P3882k68764L87221n457R7887n50308L7904
13912A412103L385K49368o0939k30591L46077j82137K03472l40265K49924n2707
13902A597690j9214j13741L26917m38561k08733L20237q252r979q5392Q202l8519
13891A330655J57731j28196Q0142J1616P3522k87370P5424J53941k35774J27035
13881A358726L48395l65480K78635j18138l15562j43955L17456k45113P9236J15701
13871A309901k48896j19291Q1650L886K66377k23804j60827N99934m86856Q3622
$$ plain form
13942 1982293 2149854 2109121 2022667 2020820 1681476 1926637 1642886 2021620 1968187 2254588
13932 2254588 1634208 1749590 1811276 1391963 1908036 1704061 2032502 1908504 1815726 1916206
13922 1916206 1686096 1755090 1639738 1713620 1444856 1832077 1826620 1924507 1374199 1412103
13912 1412103 1415488 1664856 1603917 1373326 1719403 1537266 1740738 1400473 1650397 1597690
13902 1597690 1578476 1464735 1791652 1353091 1144358 1464595 1456343 1446364 1360972 1369174 1330655
13891 1330655 1488386 1360190 1440332 1451948 1525470 1238100 1313524 1467465 1231691 1358726
13881 1358726 1707121 1341641 1620276 1502138 1186576 1042621 1360077 1114964 1194200 1309901
13871 1309901 1061005 941714 1023364 1027250 1293627 1069823 908996 1508930 1022074 1105696
13861A105696N78063o11117j7203O8448J31871m6164j57775P4851J52517l79268
13851H99919L02813J10505l83499K15690L1031J83166j78576m55792L57312L11891
13841A394460m90589M18774k38631q4746l10252L37400n7432K7559r0801K37464
13831A143206j93977j96048J35812k08656K16601M2929L5540q451N1267j84665
13821H33558J59901k8650J53006j25509p3062L36964l86430L5481j62899K29943
13811I72303m4904Q9585k72340K2632j56710P68119o20649j20315J29245K2966
13801G89932M2373O4630j69810l6453l9832L95755k13325k17046K68757l20511
13791E64470J98644K19129C47309L43877K25725k58340j55727L07059j86196n7472
$$ plain form
13861 1105696 1683759 1072642 1055439 1123887 1255758 1209594 1051819 1126670 1279187 899919
13851 899919 1202732 1313237 929738 1145428 1176459 1359625 1181049 725257 1082569 1394460
13841 1394460 903871 1322645 1084014 999268 689016 1026416 968984 996543 905742 1143206
13831 1143206 949229 753181 888993 680337 896938 939867 975407 966956 1018223 833558
13821 833558 993459 964809 1117815 992306 919244 1256208 869778 905259 742360 972303
13811 972303 927399 1016984 744644 767276 610566 1378685 758036 637721 766966 789932
13801 789932 832305 896935 727125 690672 650840 1046595 833270 616224 884981 564470
13791 564470 763114 982243 347309 691186 916911 658571 502844 809903 623707 566235
13781E66235L64191l25004Q1445K62333r7670j81204M05493j49892j90470J80395
13771I15852D34963K90983k13448K99412j16716K81237m28811L64904j03270m8121
13761G61133K35582k48676j39305j5029j24392K59903L3017m2244l29008J54282
13751E45263K47243C13607L45844J60454j59538J57293J63748m39644J28050k36147
13741D33667K17378m7660R5123R2501j58731J3187l4475P6550C10063K29110J66112
13730G05285j26183k18164N06164l71196K20968J93083Q963k19080m8070q2171
13720E69599r9188J98473r621B28627M43115j26405P8310j23739K6509j55288
13710C71129L79037j53781J06544q1763j41933J35962p0684k55324L23594J82861
$$ plain form
13781 566235 930426 605422 686867 949200 851530 670326 1075819 925927 735457 915852
13771 915852 434963 725946 512498 811910 695194 976431 547620 912524 809254 761133
13761 761133 996715 748039 608734 593705 469313 729216 762233 719989 390981 545263
13751 545263 792506 313607 659451 819905 660367 817660 981408 541764 669814 433667
13741 433667 651045 603385 698508 791009 632278 645465 610990 687540 310063 539173 705285
13730 705285 579102 360938 867102 495906 716874 909957 918920 699840 651770 569599
13720 569599 470411 668884 659263 228627 671742 545337 623647 499908 526417 371129
13710 371129 750166 596385 702929 621166 479233 615195 544511 289187 612781 795642
13700G95642k74021k00881J09569K10140o1897L220j01243J59610k68900O5222
13690D36461r9829M78674B51662L27405p0054B17017K06582J76318j82403L9347
13680D56861K71917j72336j07753L30808B96054N53065m23015j18127M41509k92202
13670D57284O6182j55096J38186J54504F1643N41455k73359J36646J72361k26862
13660D11884N63774C07765J63934k8886M28011k45901B07027K4932K16502j54388
13650B94073K07926L56795B21389J68684B2387L68980j46167K45093J16762j72137
13640D34918q998K57811I1978N26963J06523B77379M43861j72855M7664M7292
13630F43341k82572J55064M1692A55441K48599j84884J67665J44080j82588J27500
$$ plain form
13700 795642 521621 320740 430309 640449 578552 581772 480529 640139 371239 436461
13690 436461 336632 815306 251662 579067 509013 217017 423599 599917 417514 456861
13680 456861 728778 556442 448689 779497 296054 849119 426104 307977 749486 457284
13670 457284 523466 368370 506556 661060 61643 603098 329739 466385 638746 411884
13660 411884 975658 307765 471699 442813 870824 624923 207027 231959 448461 294073
13650 294073 501999 858794 221389 390073 22387 391367 245200 490293 607055 434918
13640 434918 425920 683731 91978 618941 725464 277379 721240 548385 596049 643341
13630 643341 360769 515833 557525 155441 404040 219156 386821 530901 348313 475813
13620D75813A38248L62384o7061p833J36488j20822q5577K19367B78598J97369
13610D75967A87882K43759J5463A25573L11208l3212j4817A65041K65041j17946
13600C12136K41581j98839r2372K10291o1451j88082J56955M27163A77361K24988
13590D02349A30054L49316k21188l9619J37974R4219m3124N4091m3493L45143
13580G63373C81294q4087l5519A20146K51814K4978j91618H9152N05519j53263
13570D41408j15643K43082O3056l1711k23110j42629q6953K64167A76663K84049
13560D60712p0918j74520D5314O1875J18805l2418K05894A12400M9955P8289L38628
13549E79272o8423A58900N47036j26976J15290C15488A00500L81741H9741j0117
$$ plain form
13620 475813 138248 500632 433571 425738 562226 441404 355827 575194 278598 475967
13610 475967 187882 431641 447104 125573 436781 403569 388752 165041 430082 312136
13600 312136 553717 354878 262506 472797 411346 223264 380219 807382 177361 402349
13590 402349 130054 479370 258182 218563 356537 450756 407632 461723 418230 763373
13580 763373 381294 297207 261688 120146 371960 396938 205320 89152 594671 441408
13570 441408 325765 568847 631903 600192 377082 234453 147500 411667 176663 460712
13560 460712 389794 215274 45314 107189 225994 193576 399470 112400 162355 240644 579272
13549 579272 510849 158900 705936 578960 694250 315488 100500 482241 89741 79624
13539G9624c0721F83880l00692K23484B28870K60699L8869a4668B10240L17271
13529E27511k57304O1066a5722B19595K33410j34545j10975L19714q4686o1518
13519C80995j79016l5277N7221F7996L04692J41740B25140L35186j55758m1952
13509C62616o7863j28434K32909H713M57470O53A29100K27826j72752M74633k96507
13498C62300a6533A9054K35609K04714j28865D579K42430K68446k36709J83928
13488D62674B15032j04865L9642R3955m8576J38677F2349L34802R045f6491B53250
13476C09550l6193F4784Q09120C01959C5425J99443B4457M33672A91944L6252
13466B28196p856L14935k20561A07430e4576C61903G5153j6547B9200J38264o5256
$$ plain form
13539 79624 -30721 683880 383188 606672 228870 489569 528438 -14668 210240 527511
13529 527511 270207 331273 -15722 219595 453005 318460 207485 527199 442513 380995
13519 380995 201979 166702 223923 67996 372688 514428 225140 560326 404568 362616
13509 362616 294753 166319 399228 8713 466183 466836 129100 356926 184174 658807 362300
13498 362300 -16533 19054 254663 459377 330512 4579 247009 515455 278746 462674
13488 462674 215032 110167 149809 243764 195188 333865 62349 397151 406196 -66491 253250
13476 309550 273357 64784 873904 301959 35425 234868 24457 458129 191944 228196
13466 228196 220340 535275 314714 107430 -54576 361903 75153 58606 29200 167464 102208
13455A02208M10633J7249j00564L9155k9905p8777B184N62112b5568D43734j47914
13444B95820j29745L86791B74068J64889a3491A31214K04355D1397Q6978M37051
13434E65426H9956J14511H6307f1924C15207A2203A239L38920j30018M70492C5199
13422F0964K51901K7070J25578p4612A42134j3991J74491A40K40990j00947m6039
13411I4144K64632Q313J29797G7331K15751q5516H5616b50220E06930A36381N0325
13400A86706J97226a05214D87855A77655l2469N088K12973j05763o4084J41236
13390C34636J48216d9990k85159A72223R9320E7004L07031A6376K75500Q0627
13380C72503E8937R965K63500O6762N8754A27586J03576F4012J41565M1240K69490
$$ plain form
13455 102208 512841 530090 429526 468681 438776 359999 2184 564296 -25568 443734 295820
13444 295820 166075 552866 274068 438957 -13491 131214 335569 41397 128375 565426
13434 565426 89956 204467 86307 -61924 315207 12203 1239 340159 210141 680633 35199
13422 60964 312865 339935 465513 390901 142134 128143 302634 140 241130 140183 94144
13411 94144 358776 367089 496886 77331 293082 207566 85616 -250220 506930 136381 186706
13400 186706 383932 -105214 487855 177655 145186 150274 363247 257484 193400 334636
13390 334636 482852 -49990 -335149 172223 271543 57004 364035 16376 291876 372503
13380 372503 58937 68902 332402 399164 457918 127586 231162 64012 205577 246817 516307
13369E16307B32060r8794m748Q8123m0821N1227A13515L450L2857c06935C58000
13357F6223Q2930J47014p7676K796l4846K06731A59066N4072G8324J38916K33693
13346D50933k18263J47856n4088G6904J99495A2919J19392h6171L7088j6484B65956
13334F31066j84944j69324Q1072q3431J22095r8033n2986d9962D68344j77315
13324B91029j03910K8190a0561C85121j20701J9867O8845f9661C46923j68236
13314A78687J15171J26514o9778i3198C16921j13181M2302n1139J53263A12697
13303B53500A7728Q1820L66670j27074D7590g257F6468L2404e173r0834A98337
13291A34387C7158i8416Q723B3557J57986M235K72926A69563F0471J90973m7939
$$ plain form
13369 516307 232060 133266 128518 216641 175820 227047 113515 116965 149822 -306935 358000
13357 66223 149153 296167 218491 221287 186441 393172 159066 213138 78324 217240 450933
13346 450933 232670 380526 326438 76904 276399 12919 132311 -86171 -49083 -65567 265956
13334 631066 446122 276798 357870 274439 396534 298501 245515 -49962 468344 291029
13324 291029 187119 215309 -10561 385121 264420 284287 353132 -69661 346923 178687
13314 178687 293858 420372 350594 -93198 316921 203740 246042 194903 348166 112697
13303 253500 17728 99548 466218 339144 47590 -7257 66468 98872 -5173 -96007 198337
13291 134387 37158 -98416 -89693 23557 181543 185778 458704 169563 60471 251444 203505
13280B03505o2855K04572b06550I1316g2114G3471J95950A21745k4910b13704
13269B50464k1788p0677J42989J71753b7555C88165j71903j7925E824J30505J80891
13258C17220a40388G1068a6656C35228B5798J87794h7187E7907l840k4898o335
13247B2834J2291a26043b6761K602A84487K1679b61866B71650a03249B99195A00665
13235H0295b0188j20701B03003g9776D7320L1421c7515k42403B66710j07015J23410
13224B83105m4618b20760F40308B31911C4201J48127h7901C22059A42545J29214
13214B71759K4963j03613b5195A65434p011m4440a01084B29745d714C21542j23133
13203A98409o2129d8176D78588A07974M6402c4871l15550C2954L9294J5447K70203
$$ plain form
13280 203505 140650 345222 -206550 91316 -72114 73471 269421 121745 96835 -213704
13269 250464 228676 157999 300988 472741 -27555 388165 216262 198337 5824 136329 317220
13258 317220 -140388 71068 -16656 335228 25798 213592 -87187 57907 54067 29169 22834
13247 22834 35125 -126043 -26761 -24159 184487 206166 -261866 271650 -103249 299195 100665
13235 80295 -20188 -140889 203003 -79776 47320 78741 -37515 -279918 266710 159695 283105
13224 283105 238487 -220760 640308 231911 34201 182328 -87901 322059 142545 271759
13214 271759 296722 193109 -25195 165434 158423 113983 -101084 229745 -4714 321542 198409
13203 198409 136280 -48176 478588 107974 154376 -34871 -350421 32954 72248 87695 357898
13192C57898E0276a8290A98354i4070N809B55247i7178j39943g8661A80443J8430
13181A98873l054G2856a6993E208J92026r2070J33212J26289e1866A72106a9569
13169c5596C75687G3905K70601G5291n555b52076b2624F7089P3783D2330Q478
13158E0808c11018Q0811a0443k76119A20607Q9649j3093d5858k1099B27277G6550
13146D60621A2031M07314j68791D2325f3924a6291B58076a6974E11210A7041J76421
13135A93462H565L7860a006C3116J77046J5990k3925k213R6748A05130O7316N4241
13123B26687j7642E8656Q359a46533A27910K13878J08277J66405G1234a19321
13112a7329B22205J33410j2582l9289j05536M0326H9534i1027A67255C6298a84969
$$ plain form
13192 357898 50276 -18290 198354 -94070 -88261 255247 -97178 -237121 -78661 180443 198873
13181 198873 195819 72856 -16993 5208 197234 105164 238376 364665 -51866 172106 -19569
13169 -35596 375687 73905 344506 75291 69736 -252076 -22624 67089 140872 42330 50808
13158 50808 -311018 -230207 -10443 -286562 120607 210256 197163 -45858 -66957 227277 76550
13146 460621 12031 419345 250554 42325 -63924 -16291 258076 -16974 511210 17041 193462
13135 193462 8565 46425 -1006 33116 210162 226152 202227 200014 296762 105130 172446 226687
13123 226687 209045 58656 67015 -146533 127910 341788 450065 616470 71234 -119321
13112 -17329 222205 355615 343033 303744 198208 238534 89534 -91027 167255 36298 -184969
13100e2366C3709b03444p8631A66487a11809B31216M9704F0454c4178Q437B41135
13088A21831m9706c00308j03986D52775f1070A63688h194C4609J23758c7651j4668
13077e2319E36260f7554j0282I7927J41168D497J88052a08900A58924h1482B96166
13065D2325M71954a38822C19033A13199n1132B3566g9454j15455a2121j05318
13055a17439A95920J0549P378J41407f2921K5398G9919J69478G1853g1781B50633
13043B07211B6713a49176F1179J15407B1137L58408P4456A35254g6258D27960
13032B63813A24438o0088h6773d0098A69626L8647J31111i3325C8097n736R2662
13021A25023h434F8064L50719b26164B00713a14175J7772E5283J07687p0053A4324
$$ plain form
13100 -52366 33709 -203444 -282075 166487 -111809 231216 280920 60454 -34178 -25741 241135
13088 121831 72125 -300308 -404294 452775 -61070 163688 -8194 34609 158367 -37651 -52319
13077 -52319 536260 -67554 -77836 97927 239095 4497 192549 -108900 158924 -81482 296166
13065 42325 514279 -138822 319033 113199 62067 23566 -79454 -194909 -12121 -117439
13055 -117439 195920 206469 213847 355254 -62921 -37523 79919 249397 71853 -71781 250633
13043 207211 26713 -149176 61179 176586 21137 379545 454001 135254 -76258 427960
13032 263813 124438 64350 -86773 -40098 169626 208273 339384 -93325 38097 32361 125023
13021 125023 -8434 68064 418783 -226164 200713 -114175 -96403 55283 162970 92917 14324
13009e3515H3720C4294J46642K48138C7629K88742C9498J21688i192n7404l8025
12998a04621b0461C4724J34671M92241b08342B63782q8457G1510J93837j22459
12988A42888l6553k7366l4588J764J5270K16045B5791J59019n3072Q5947k5043
12977A92642K24784j16741c720j56276C7897L48901a36850H4629J44c2616A33273
12965A45621B4254a38507A19920m1621J97044c611k91163B3128J4809a43052A48643
12953C31942e8237C5490J322J67602A4638J78611i7043F8668J52251L8180h6789
12941A16806N1707m3207k2366L0910b56791h7436A28854a03274M4133k1349C6591
12929f6963A62341B3150f0678m6217B9894d5324B91663a52214A19779J96952b87940
$$ plain form
13009 -53515 83720 34294 180936 429074 37629 326371 39498 161186 -9192 -66596 -104621
12998 -104621 -20461 34724 169395 661636 -208342 263782 175325 71510 265347 142888
12988 142888 106335 78969 44381 46145 61415 277460 25791 184810 131738 217685 192642
12977 192642 417426 300685 -3720 -159996 37897 386798 -136850 84629 84773 -32616 133273
12965 145621 24254 -138507 119920 78299 275343 -3611 -294774 23128 37937 -143052 148643
12953 331942 -58237 35490 36812 204414 14638 193249 -97043 68668 220919 259099 -86789
12941 116806 168513 125306 102940 133850 -256791 -87436 128854 -103274 -59141 -80490 36591
12929 -66963 162341 23150 -60678 -106895 29894 -45324 291663 -152214 119779 316731 -287940
12917c5346n9086A09919M1727K17447j64446K2105D7769E017K0675K29653d2340
12905g5204j22421O7141A91266c4361j92206B39083b50184A08487k5175C4482
12894d6972A029J04875P5442a85756B07077b65248i710n0384A33386Q0487i6387
12882D1261N2400i6916c1205B91060c08785E4090b55124c8937B27601i3337H5344
12870a97835j47100D2749M2734a64004j6452D5256B426i3984j49734g6710A1086
12858f7154q9238k20161C24029b22064P802F5072b07789e2306G028e3965k7306
12847h1271c654A24571K605c66058B74453a83194E2081K50496a81154B3527J24654
12836A48181e2524J0225A19888p721D7870H921P297K11200G5710b91246J09927
$$ plain form
12917 -35346 -94432 109919 151646 369093 204647 226752 47769 5017 25692 255345 -42340
12905 -75204 -197625 -130484 191266 -34361 -226567 239083 -250184 108487 83312 34482
12894 -46972 1029 105904 181346 -185756 207077 -265248 -9710 -60094 133386 213873 -96387
12882 41261 93661 -96916 -31205 291060 -308785 54090 -255124 -38937 227601 -93337 85344
12870 -197835 -344935 42749 85483 -164004 -180456 45256 2426 -93984 -243718 -76710 11086
12858 -67154 -156392 -376553 324029 -222064 -214262 65072 -207789 -52306 7028 -53965 -81271
12847 -81271 -3654 124571 127176 -366058 274453 -183194 52081 302577 -181154 23527 148181
12836 148181 -52524 -42299 119888 112167 47870 8921 16218 227418 75710 -291246 -181319
12825a81319L0533A31680l5131c4272J1703A2113a65825c4324l5035B21620B66
12813d8642C37165k7597q9814B4537a44086A48687o9901A3321b80351C03815a77894
12801C3198N9894d9735G7488a85493k607g1951j38495H9172b95620C57031b6359
12789a20849e0993D13373c14475A51208h7085J8278B60346J1097a76765B5715
12778E6929J02782G1827i0256k60862a35685C9106C943L36215A2351i4203B29228
12766i2571B2947L6158K13388j02714k7282P8489a61144A27218n0353C6225K55612
12755B91837b55675B16008o3049J77736H5760a91867H844R5513J0659a2966F6217
12743A77313a66558P0767A09005a01523l4134F3918L26123F8464J16206B8121
$$ plain form
12825 -181319 -150786 131680 96549 -34272 -22569 12113 -165825 -34324 -69359 221620 266
12813 -48642 337165 309568 219754 24537 -144086 148687 78786 13321 -280351 303815 -177894
12801 33198 93092 -49735 77488 -185493 -188100 -71951 -210446 89172 -295620 357031 -26359
12789 -120849 -50993 413373 -314475 151208 -87085 -68807 260346 271443 -176765 25715
12778 56929 159711 71827 -90256 -351118 -135685 39106 3943 340158 12351 -94203 229228
12766 -92571 22947 59105 272493 169779 142497 220986 -161144 127218 76865 36225 291837
12755 291837 -255675 216008 152959 330695 85760 -191867 8844 104357 115016 -12966 66217
12743 177313 -166558 -95791 109005 -101523 -135657 63918 390041 68464 184670 28121
12732a67431A28069a84233A12405k1689J28140b14835B83285b93510B23741F8745
12721A61643L9928B3022J30643C9880J70578K13725j75255J75378G6244b41232
12710C45008b75642F7982N0178J64721I7454J47416J6125a68265A04047a38179
12699B58630E2219E470K06109i6731A44203b867A63111O219K24520a04028C16753
12687D6064O237J7114b297p2804A11943b29093R4115M1390A89638a20293j32959
12676b53252R1769M8963K1904A89726F2506J49875D3795J13503J92010B2534K84854
12665C07388j05045n7839F8387a06844J9891A5915N269K1714J88359I1600c4704
12653c493B18963E2861M2071J19048p0685e3280A35306i8681B39069a74609J7432
$$ plain form
12732 -167431 128069 -184233 112405 90716 218856 -214835 283285 -293510 223741 68745
12721 161643 201571 23022 153665 39880 210458 424183 248928 424306 76244 -241232
12710 345008 -275642 67982 118160 282881 97454 244870 260995 -168265 104047 -138179
12699 258630 52219 5470 211579 -96731 144203 -2867 163111 169330 393850 -104028 316753
12687 46064 52301 69415 -2297 -75101 111943 -229093 -134978 -93588 189638 -120293 -253252
12676 -253252 -161483 -112520 -90616 189726 62506 212381 43795 157298 349308 22534 307388
12665 307388 202343 144504 68387 -106844 -86953 15915 21184 42898 231257 91600 -34704
12653 -3493 218963 52861 94932 213980 143295 -53280 135306 -98681 239069 -174609 -157177
12642a57177k60436D1000L31044c90782B72312a64552I4420J16094b18627A11304
12631e9121C13801j56275F2638a39214G9801a6287C83444j33209J08180A34846
12620A99879a47189A263d8427A92874J13675q1620R3079j26369m6701L15018A47052
12608C05035h242A55008G0564J56179e1589k09139i484B49486n2963C2623K90099
12597C22722d4537A52206d6264H4725J47565K9074a6510j29450M453C0031K52
12586C0283J08484E3254Q4241b59033f0142A67491a87210Q7950B02082J98097
12576D00179h0588k417I7941A1462g5358A77336b56887J07554a2843A19909E9124
12564D736b7490A11020C3986c3681E8978a10568K0017j9758j64304B27742g6120
$$ plain form
12642 -157177 -417613 41000 372044 -390782 272312 -164552 94420 210514 -218627 111304
12631 -59121 313801 157526 62638 -139214 79801 -16287 383444 250235 358415 134846
12620 199879 -147189 1263 -48427 192874 306549 224929 318008 191639 144938 459956 147052
12608 305035 -8242 155008 70564 226743 -51589 -260728 -9484 249486 196523 32623 322722
12597 322722 -44537 152206 -46264 84725 232290 261364 -16510 -145960 -141507 30031 30283
12586 30283 138767 53254 137495 -259033 -60142 167491 -187210 -99260 202082 400179
12576 400179 -80588 -83005 97941 11462 -75358 177336 -256887 -149333 -12843 119909 59124
12564 4736 -27490 111020 33986 -33681 58978 -110568 -90551 -110309 -274613 227742 -76120
12552B52212I737d05148G6538a19497k12592J0332A60032m8058a13198C09939
12541b31772B0834a27681L1080g168l4871A66338p6127O6604B860b40851A7471
12529a1456n959r4051B73311f7841a2662I3742J18370P0872j16322F445Q7956
12518I4401J72651a69899B69072A03285J71443r7811i9063E117O4099d97160f6133
12506B48431j09608Q4675H4633a3343m4535E14419h6861K2434D3940M691e6491
12494A885P6657b4022j33695f3903k04959j64189J1819B16453o9714m1622K32625
12483C37742a6358B31670C3154a59155p4118C58514b44943A80450b72070D17453
12472i7699B1736K5039q277b88194F65293A06769B6217K75747g2604k7819n2535
$$ plain form
12552 252212 9737 -405148 76538 -119497 -332089 -321757 160032 111974 -113198 309939
12541 -231772 20834 -127681 -96601 -7168 -42039 166338 90211 156815 2860 -240851 17471
12529 -11456 -17415 -111466 273311 -67841 -12662 93742 212112 282984 166662 6445 94401
12518 94401 267052 -169899 269072 103285 274728 176917 -99063 5117 69216 -497160 -66133
12506 248431 138823 223498 84633 -13343 -57878 514419 -86861 -64427 43940 48631 -56491
12494 1885 78542 -24022 -157717 -63903 -268862 -433051 -421232 216453 146739 105117 337742
12483 337742 -16358 231670 33154 -159155 -233273 358514 -244943 180450 -272070 417453
12472 -97699 21736 46775 38498 -288194 665293 106769 26217 301964 -72604 -100423 -152958
12461a52958J584N3059A86216q6732D1299g148A19153C8571b01505l0865A88293
12449a11302J4766B59111A16643m747D5751J85142b3549F8591J73558a25846A344
12437A46350f3386j17986N3585B23293F2869b16354I806a90996A5171b07831j57925
12426c65756B7891a17316A78171b42256B3145q565f728o6190r1432k45993C33314
12414C2519f9012a7171j32376A52222c13394E7314a11798B570c02114F7975a00294
12402B51382o9466a65592g9986j28709i2221C5622a4402E5417R6200c25764C2421
12390b24983h0122G4105a73585b9959A42391a47359l71613a09288j22767c8876
12379B94715p7584a6612j85352A75325a66135g6792B00786K1231d4937C12136
$$ plain form
12461 -152958 -151374 -98315 186216 99484 41299 -7148 119153 38571 -201505 -232370 188293
12449 -111302 -96536 259111 116643 111896 45751 230893 -23549 68591 242149 -125846 1344
12437 146350 -63386 -181372 -127787 223293 62869 -216354 9806 -190996 15171 -207831 -365756
12426 -365756 27891 -117316 178171 -242256 23145 14580 -6728 -72918 -164350 -410343 333314
12414 32519 -69012 -17171 -149547 152222 -313394 57314 -111798 2570 -302114 67975 -100294
12402 251382 181916 -165592 -79986 -208695 -92221 35622 -14402 55417 151617 -325764 32421
12390 -224983 -80122 74105 -173585 -29959 142391 -147359 -518972 -109288 -232055 -38876
12379 294715 217131 -16612 -201964 175325 -166135 -76792 200786 222017 -44937 312136
12368E1838f5166B72446J26983h5298C81801j24070b20201g0323C5545Q295N9107
12357A02947b01319d9811M381B87810a69134C98769A43177N7694A6187g5207J5735
12346e9472l21705f8625A27479L2488l6144a4993E1329a555r9134j29893j3623
12335b44205E2954i1697A1099Q964c31506B41433o392L10832a20139J3618B30218
12323A62354J59978A1830M1662a58435j04955E0479K7777d06445B77556j24329
12313A53227a61120C7498M8635d12972A15651e9721k29381A29527c6365F443J32239
12302A38682b93454a41841o1106E1910C142a82705P3342B31708h7665l5379M0027
12291h3017B45850a70931r2931D56369a64234B48386b30033A52676J20627F1111
$$ plain form
12368 51838 -65166 272446 399429 -85298 381801 257731 -220201 -70323 35545 43840 102947
12357 102947 -201319 -49811 -45430 287810 -169134 398769 143177 200871 16187 -75207 -59472
12346 -59472 -381177 -68625 127479 159967 123823 -14993 51329 -1555 -100689 -230582 -244205
12335 -244205 52954 -91697 11099 20063 -331506 241433 235041 545873 -120139 -106521 230218
12323 162354 322332 11830 53492 -158435 -263390 50479 78256 -406445 277556 153227
12313 153227 -161120 37498 86133 -412972 115651 -59721 -289102 129527 -36365 6443 138682
12302 138682 -293454 -141841 -202947 51910 3142 -182705 -109363 231708 -87665 -123044 -83017
12291 -83017 245850 -170931 -263862 456369 -164234 248386 -230033 152676 273303 61111
12280A27407h2131k28167B42612B2323d3471d590n8946j78846E8489b29739A55399
12268a71311l8589F6405J60454B4093a48485A23176J11602D7680f4562C05685
12257C7171J90999c2209e140A83852R4650j29280J32531d5971F6970B8780c3849
12245f0031D5991a95527C02336a7722A92005c88610a33411l2930A12167k5533
12235H6634E830L00972p4161K2125L0025g8949D545Q579L94600j46467c97261
12223a07460B1443K22032j06708d9607A92280l2055Q32b23699F4302O8253J40402
12212B72957K41925b6597B17288J89552A25431M4768k0819Q4483I1575J68681
12202B60256A06072A9781P3167J00672J035D0540K01135P0815m3386c23930J57358
$$ plain form
12280 127407 -82131 -310298 242612 22323 -43471 -4590 -63536 -242382 58489 -229739 155399
12268 -171311 -209900 66405 226859 24093 -148485 123176 234778 47680 -64562 305685
12257 37171 228170 -32209 -5140 183852 278502 149222 281753 -45971 66970 28780 -33849
12245 -60031 45991 -195527 302336 -17722 192005 -388610 -133411 -166341 112167 86634
12235 86634 5830 306802 232641 254766 284791 -78949 4545 13124 407724 261257 -397261
12223 -107460 21443 243475 136767 -49607 192280 160225 161057 -223699 64302 132555 272957
12212 272957 514882 -26597 217288 406840 125431 170199 149380 233863 91575 260256
12202 260256 106072 19781 92948 193620 194655 40540 241675 312490 269104 -323930 -166572
12191a66572D98003e8004J59I1292K67869A13747R2150G171a23172A06071K48352
12180C54423a02905D69162D6487b3337C43481b76413B33372J47403A25646D5257
12169a52610A02665Q7863p22J44053c8187H492K74320m8402k9563G9924c1555
12157c1509r4195d2760j9657o089B80806c41432J68254C70025C2267L100K90960
12146C26327a16863A28369H805L24842a31507M286A16929l2607J1444a35022L380
12135a31642E9231h3759D8915J44967J24443A1558J15730B4739K11679b51456
12124f162B3875a82010A84773k3318J20103j3979d2120n349A95307I3440i8413
12112B14991b89542n8498b1198F9649P4089e2169A72031b72776K9132c8067A73928
$$ plain form
12191 -166572 498003 -58004 -57845 91292 359161 113747 205897 7171 -123172 106071 354423
12180 354423 -102905 469162 46487 -23337 343481 -276413 233372 380775 125646 45257
12169 -152610 102665 190528 189806 333859 -38187 8492 282812 234410 204847 79924 -31555
12157 -31509 -125704 -42760 -62417 -68506 280806 -341432 -173178 370025 32267 35367 326327
12146 326327 -116863 128369 8805 333647 -131507 -127221 116929 84322 95766 -135022 -131642
12135 -131642 59231 -83759 48915 193882 318325 11558 127288 24739 236418 -251456
12124 -6162 23875 -182010 184773 161455 281558 267579 -42120 -47469 195307 93440 -98413
12112 214991 -289542 -348040 -21198 69649 143738 -52169 172031 -272776 -243644 -38067 173928
12100A27386a04996M5567B9097J16916c684r5597M7951A42282h8398n8582I6498
12088a19890j61799A29392J9955b13636I0699a11854e591C2611c85203J71241
12078b13962F7147d2203G7613l7047b8219G8111i5097l3357e2009j22053p3071
12067b47133g7728c1135m1165C72200k7278a03986B14941N73128l19220P83833
12057A252682k72452D88382j75146f3849j1727F569J45383E814J11416f5637A87680
12045A12004l6659J71763J7251A31678a80542A34176g296k85850C13904j33587
12035A80317k0737d5753R741G9734a68658D8232c93315J91716A17752a68499P7585
12024i0914H075e7658A05757K4075c7114D0720a24874K8326B25942I3252k5188
$$ plain form
12100 127386 -104996 -59429 29097 146013 -3684 -99281 -51330 142282 -88398 -146980 96498
12088 -119890 -281689 129392 149347 -213636 90699 -111854 -5591 32611 -385203 -213962
12078 -213962 67147 -42203 77613 40566 -28219 78111 -95097 -128454 -52009 -174062 -247133
12067 -247133 -77728 -31135 -72300 372200 344922 -103986 214941 788069 468849 1252682
12057 1252682 980230 488382 313236 -63849 -75576 6569 151952 5814 117230 -65637 187680
12045 112004 75345 247108 264359 131678 -180542 134176 -7296 -293146 313904 180317
12035 180317 159580 -45753 -36012 79734 -168658 48232 -393315 -201599 117752 -168499 -90914
12024 -90914 8075 -57658 105757 129832 -37114 40720 -124874 -96548 225942 93252 68064
12013F8064e1491Q219D6967b30605L2032A47315J16173a61976j12010L0311C42481
12001A33083a21401F0209K44260j50097c7638k148C6920c2503A43170H950h09
11989a81071B8028b15914a0083j77256n792A1892a3465k18765A97288q6999n1586
11978E8703b63051a16688B3623i3727j18069C9883e673p6356A51568c0449r6217
11967a26666m7779M9900A7750G314c6543a5126k24329B5515i0023B95257a64484
11955e869l72228b3933A62353A6819K67662a02277A06624l554J41318p0214B1334
11943i7107a7808j36073C08185a46435P0706A86878d2804J3565A63766f6296A51381
11931A11618c7827A73087p6841b44228C52821A49117c2140A84458p8659n0915
$$ plain form
12013 68064 -51491 -43272 46967 -230605 -198573 147315 263488 -161976 -273986 -243675 342481
12001 133083 -121401 60209 304469 154372 -37638 -39786 36920 -32503 143170 8950 -809
11989 -181071 28028 -215914 -10083 -187339 -193131 11892 -13465 -232230 197288 110289 58703
11978 58703 -263051 -116688 23623 -93727 -211796 39883 -5673 -82029 151568 -30449 -126666
11967 -126666 -174445 -124545 17750 7314 -36543 -15126 -239455 25515 -90023 295257 -164484
11955 -5869 -378097 -23933 162353 16819 284481 -102277 106624 103070 244388 174174 21334
11943 -97107 -17808 -153881 308185 -146435 -75729 186878 -42804 -29239 163766 -66296 151381
11931 111618 -37827 173087 96246 -244228 352821 149117 -32140 184458 105799 54884
11921E4884J75906i9734H9009a43461E9685d0120B29307D7456a78077A03193a94887
11909A76264a29705B12077j8967a22977k6967k35068a59891G588J54143j4731
11899A47000e79p4456K7440I2097J3651d8594A49514j5800J16982E4553N7051
11888A11604a01910p4211h5302P176F2160P1675O028a85000j3568l77B10741H953
11875B95032A24766f8170A1491g6574A10628b20972g8139C41361a87910d3727
11864C31082a65916C7366b17243h9351J8726o5554m1472f4277j2255r6028A20255
11852A30275J56682b5086j05592C5596R5940b53068a21695d9043A4780b62010
11841a33921M6216q9872e6378F0574b15139A13244b80215H2361J10931a06136
$$ plain form
11921 54884 230790 -99734 89009 -143461 59685 -40120 229307 47456 -178077 103193 -194887
11909 176264 -129705 212077 193110 -122977 -149944 -385012 -159891 7588 161731 147000
11899 147000 -579 -75035 -47595 92097 105748 -48594 149514 133714 250696 54553 111604
11888 111604 -101910 -176121 -85302 -78126 62160 133835 139863 -185000 -198568 -198945 210741 8953
11875 295032 124766 -68170 11491 -76574 110628 -220972 -78139 341361 -187910 -43727
11864 331082 -165916 37366 -217243 -89351 -70625 -136179 -177651 -64277 -76532 -172560 120255
11852 130275 286957 -25086 -130678 35596 131536 -253068 -121695 -49043 14780 -262010
11841 -133921 -87705 -177577 -56378 60574 -215139 113244 -280215 82361 193292 -106136
11830g4775a4793n5427A69641b21070c513D4943J21008b11089k4827A64891J82947
11819C47838A33660J3261k7986C3729a63099f7920A98086e7926G3852g5074r6146
11808a71220f8704o7277j78731B6650K0760J61795E4745c34843A4011J1374c30032
11796E9857a18773b7258p6029B15534H1242K18110b3020m9276d042A81838p888
11785A73950i6365B048a02490k8685g453n1697p5211C5063c49930G3901L3883
11774A07784D7381K9802g6769B82649b06644J9270A54124C1572c2004q2193l197
11763a17394k0300b4102A25355g4678B75706f4670C49388b38755E5933J8839b51621
11751c2401o5185J8321K3488A1668J12554O4917K207o8470E7046b81818R2858
$$ plain form
11830 -74775 -14793 -70220 169641 -221070 -3513 44943 165951 -211089 -235916 164891 347838
11819 347838 133660 146921 118935 33729 -163099 -67920 198086 -57926 73852 -75074 -171220
11808 -171220 -68704 -135981 -314712 26650 47410 209205 54745 -334843 14011 25385 -330032
11796 59857 -118773 -27258 -103287 215534 81242 299352 -23020 -72296 -4042 181838 173950
11785 173950 -96365 2048 -102490 -131175 -7453 -59150 -134361 35063 -349930 73901 107784
11774 107784 47381 77183 -76769 282649 -206644 -187374 154124 31572 -32004 -114197 -117394
11763 -117394 -137694 -24102 125355 -74678 275706 -64670 349388 -238755 55933 74772 -251621
11751 -32401 -97586 -79265 -55777 11668 124222 189139 191346 122876 57046 -281818 -188960
11740a88960Q0044c194B56204c00872g2179A49421G3478b36672b4466k89817D0834
11728F3293J2284b93492A3590k561L37455a00935A7739a71944E0071O9189b25866
11716c22696a21154M5846Q796n72274A69781D8102P390M6957J63834H469J65684
11705A74153c27772A07150B6425M9476b91931b3807A01955k9416G22O297J97399
11694B04418j4691b03282p5658A15331H270R2686b03304k5369O7877B0085R6604
11683A16689a58852A08739J18770F0404J00467a12789E1893c0462B22653H957
11672a89738R2852B20823a59042A41559K05461j55165c51088E5816L8266b5293
11661B0217M4683A1356a81786A48587D8046a57493o594j9451F6511c3744P478
$$ plain form
11740 -188960 -108916 -3194 256204 -300872 -72179 149421 73478 -236672 -24466 -314283 40834
11728 63293 75577 -293492 13590 11029 348484 -100935 17739 -171944 50071 119260 -225866
11716 -322696 -121154 -75308 -66512 -638786 169781 48102 55492 102449 266283 8469 174153
11705 174153 -327772 107150 26425 75901 -291931 -23807 101955 72539 722 7019 204418
11694 204418 189727 -203282 -278940 115331 8270 100956 -203304 -228673 -160796 20085 116689
11683 116689 -158852 108739 227509 60404 160871 -112789 51893 -30462 222653 8957
11672 -189738 -96886 220823 -159042 141559 347020 191855 -351088 55816 94082 -25293
11661 20217 64900 11356 -181786 148587 48046 -157493 -164087 -183538 66511 -33744 -26266
11650b6266G1469R6963a41125d4392B45516B5380e2125B63093O355o2666n9444
11639A47338F868K23675J55162e5318B0380R1085l1807e0030p4340j33384A67909
11627a81530k4670F2175b51140b5348k15030H3814b78146A08142a9104g190A04229
11615f1603B23441l1982I4421d4858K535J4941k59576B0678i8504B1578J82927
11604B04505d1710F7734a25173L8198e016m1285B57461E9602j4719h315A5696
11592C55288A11995h1162F4448c98926A9235L8964b88055F0240Q4074J33105e1809
11580c41613a45060B25608i8641B74271a82932B52110a02494c3934A85421C9326
11569B25140j9871i231A70785d3170F8518a9755j17224C5884a0028B35533N0750
$$ plain form
11650 -26266 71469 168432 -141125 -44392 245516 25380 -52125 263093 269448 206782 147338
11639 147338 6868 230543 385705 -55318 20380 111465 79658 -50030 -124370 -257754 167909
11627 -181530 -206200 62175 -251140 -25348 -240378 83814 -278146 108142 -19104 -7190 104229
11615 -61603 223441 191459 94421 -44858 -42323 -27382 -286958 20678 -98504 21578 204505
11604 204505 -41710 67734 -125173 -86975 -5016 -46301 257461 59602 44883 -8315 15696
11592 355288 111995 -81162 64448 -398926 19235 58199 -288055 60240 144314 277419 -51809
11580 -341613 -145060 225608 -98641 274271 -182932 252110 -102494 -33934 185421 39326
11569 225140 205269 -9231 170785 -43170 68518 -19755 -136979 35884 -10028 235533 286283
11558B86283o6313K67155h4089j54540C4134a1648A66963J24797E0265d0452C44223
11546G9353B7367K28416I1961g7309K9554m3464C04393a89766A59035P6668i3664
11534B50592a7304D24794a11348C73101E0462a01681D2222c9408A24683f4363
11523B16701d3986j26653M7912H7615R8128C8830b6333A54048Q375a62926a5527
11511b72435A28013H69a6397C91726a82565B21638c08959a29729p0251d3415j64553
11500b07968E8026J49471a93755D08476K0733j09508j59627o9761J44042p4521
11490A59834e290j16679C41613F8020K09303H4083L96502A67020J09504n6706
11480B19818n9643l6079c4128j13918C92605j19248f5746E8191K72138O6998A80247
$$ plain form
11558 286283 219970 487125 -84089 -238629 34134 -11648 166963 291760 50265 -40452 344223
11546 79353 27367 255783 91961 -77309 -47755 -91219 304393 -189766 159035 235703 -93664
11534 250592 -17304 424794 -111348 373101 50462 -101681 42222 -39408 124683 -64363
11523 216701 -43986 -170639 -122727 87615 185743 38830 -26333 154048 162423 -162926 -15527
11511 -272435 128013 869 -16397 391726 -182565 221638 -308959 -129729 -199980 -43415 -207968
11500 -207968 58026 207497 -193755 408476 429209 319701 160074 90313 234355 159834
11490 159834 -5290 -121969 341613 68020 277323 84083 480585 167020 276524 219818
11480 219818 160175 124096 -34128 -148046 392605 273357 -65746 58191 330329 397327 180247
11468B25398q9767a5797A96727F4105J99983J76183A8206A939J77090J8386I6727
11456C83404j20370C0290Q6304a7930E1453c9667B89531j42141m3220K79837a78011
11444b22256A84761a66536B58592L3388b5297H4494l1944f1264A94470b46193
11433f2042A01403a87475B1124N6803j0220K45372G7578i3089D96428A05660a0714
11421a83820G8738d79643b9538j11146D634J10106e2746J4979j5767j06911F4053
11409A97064b88828B58475J01069A32413E8676M40111b50691j2837I5748a43994
11398C94160a84640A6982K28512a90202E2977j236e1269j8230C2993J76446F5643
11386C54736a84971B25604a28148a3642j02268G1419c77832E5325L254J43393
$$ plain form
11468 225398 135631 -15797 196727 64105 264088 440271 18206 1939 179029 197415 96727
11456 383404 263034 30290 116594 -17930 51453 -39667 289531 147390 104170 384007 -178011
11444 -222256 184761 -166536 258592 291980 -25297 84494 52550 -61264 194470 -246193
11433 -62042 101403 -187475 21124 77927 67707 313079 77578 -93089 496428 105660 -10714
11421 -183820 78738 -479643 -29538 -140684 4634 114740 -52746 -37767 -53534 -160445 64053
11409 197064 -288828 258475 359544 132413 58676 498787 -250691 -263528 95748 -143994
11398 394160 -184640 16982 245494 -190202 52977 51741 -51269 -69499 32993 209439 65643
11386 354736 -184971 225604 -128148 -13642 -115910 71419 -377832 55325 58579 201972
11376B01972c820A21849b01511i7978K3754B03993A3281a41826P0551A38593a67136
11364a54440D06943E5500N7374l3316d85792C50183M5930c4405j10362N058A93352
11352c7040H4990a39945j5987a7487A04871P6106c25111A72889n4371N71c51506
11340B46582H0148Q7526b46165j0445c7443J0994A51609C0613h4003j49541a11185
11328a42844j07715A0538J06162d6002C10802D9851K287R4268a23419J2671C2584
11316a14370B30447a93095j0313B7107K24160f8511j65947f9788k4467k70026
11306c64281A9994b18624A26967L2070c2341A2870i8634I4414M6122m7952J00496
11295A93080d0856n2711B8353K9074Q7417b23642A44523d5855n0310m3796k62303
$$ plain form
11376 201972 -3820 121849 -201511 -97978 -74224 203993 13281 -141826 -71275 138593 -167136
11364 -154440 406943 55500 112874 79558 -485792 350183 396113 -34405 -144767 -139709 193352
11352 -37040 84990 -139945 -155932 -17487 104871 180977 -325111 172889 118518 119089 -351506
11340 246582 80148 167674 -246165 -256610 -37443 -26449 151609 30613 -84003 -233544 -111185
11328 -142844 -250559 10538 116700 -46002 310802 49851 52138 146406 -123419 -110748 32584
11316 -114370 230447 -193095 -203408 27107 251267 -68511 -234458 -69788 -94255 -364281
11306 -364281 19994 -218624 126967 159037 -32341 12870 -98634 94414 140536 92584 193080
11295 193080 -40856 -93567 28353 57427 144844 -223642 144523 -45855 -96165 -139961 -402264
11284d02264d9772k0467n4582C1890a86845p9727b3704o0844b4205B87558C9419
11272B18099g6998L7190H1500l7127n986g3666G1005B446A75L9743b72078B37665
11259D7056i8821A07490i8973C03647a14663N3182j8082j41901A29706b01480
11248a60885j08333h8655F2883a50970C03122j00817q8685D5665A431a48217B59690
11236G2417a0450q7038b4189A76120a94000B39050g7452B7732G317e9826j20916
11225a80742B4901b21853A48744e16k57197L7503B05526c31512a22969n9691B17120
11213I9414h8214l7571O1989q9367L1380n9402I0547f5128m3541C1709O000a83201
11200b64223a08794d8851j6077A5415a20599j15917R8685A22202F0675d4109A47280
$$ plain form
11284 -402264 -49772 -70239 -124821 31890 -186845 -266572 -23704 -84548 -24205 287558 39419
11272 218099 -76998 -39808 81500 44373 38387 -73666 71005 2446 175 39918 -272078 237665
11259 47056 -98821 107490 -98973 303647 -114663 -61481 -79563 -221464 129706 -201480
11248 -160885 -269218 -88655 62883 -150970 303122 202305 113620 45665 1431 -148217 259690
11236 72417 -10450 -97488 -24189 176120 -194000 239050 -77452 27732 7317 -59826 -180742
11225 -180742 24901 -221853 148744 -516 -257713 -220210 205526 -331512 -122969 -182660 217120
11213 99414 -88214 -125785 -63796 -153163 -121783 -181185 90547 -65128 -108669 31709 37709 -183201
11200 -264223 -108794 -48851 -64928 15415 -120599 -236516 -137831 122202 60675 -44109 147280
11188a27175c9437A67365i7172A01680K32884G5716a11422m4450G6468O0792K12374
11177C49634D364M514J22875C4656c9667f508C36710h1403j08585C38184A55261
11165a99794C0954K44885a55711G1786a2974j46041k66943H356Q2639j9178J78380
11154B50197a10273C16687a9045k58568F2956g9568e688k91201B1659R6152L1216
11143A49027D6269a91873B20661a37541K9514j74757A07519b22776Q1810j09818
11133b50784H7871b06538G5535N2506A3848a83080m5307B74562q8758m8667e064
11121a07962B8239P0079J37645b59270J02984B16830g5165I9886i5400A02158
11110C36190e7309F0437c02277D8893R2553E9093K40240A01966h6226E9944K38191
$$ plain form
11188 -127175 -39437 167365 -97172 101680 334564 75716 -111422 -155872 76468 137260 349634
11177 349634 4364 8878 131753 34656 -39667 -6508 336710 -81403 -189988 338184 155261
11165 -199794 30954 275839 -155711 71786 -12974 -159015 -425958 8356 90995 71817 250197
11154 250197 -110273 316687 -19045 -277613 62956 -79568 -5688 -296889 21659 117811 149027
11143 149027 46269 -191873 220661 -137541 -108027 -282784 107519 -222776 -140966 -250784
11133 -250784 87871 -206538 75535 128041 13848 -183080 -228387 274562 185804 137137 -5064
11121 -107962 28239 98318 235963 -259270 -156286 216830 -75165 99886 -95400 102158
11110 336190 -57309 60437 -302277 48893 141446 59093 299333 101966 -86226 59944 298135
11099B98135A47335B5122K88079D3311n291a1529C7718J88346q0767l3226J53737
11088B65808F2145b45487I4773J24336o4470K53491j59143j22438n5699j9974
11078E0876K35413j36866M1741K3955p3400o6478R1034J33769d5780B04553O7684
11067B72237b06934E9416L16947j51549L34598o5919j42337A73293K09439j85094
11057A97638n0463K76445j85020G9794L47656J0662L55j5379A64505J9534Q5549
11046B69588k1203M53013C32609K14666j12249k14674N20801C23232O10946D02404
11035E53373K91064j22947C36275c781E57191l6434j53836N9480K85151j63332
11025E48220L07792k73491j84252K2013Q6349o5738P4664K03656J5171B86019
$$ plain form
11099 298135 147335 25122 313201 43311 38020 -11529 37718 226064 145297 112071 265808
11088 265808 62145 -245487 94773 219109 154639 408130 248987 126549 70850 50876
11078 50876 286289 149423 191164 215119 141719 75241 166275 300044 -45780 204553 272237
11067 272237 -206934 59416 376363 224814 559412 493493 351156 173293 382732 197638
11057 197638 147175 423620 238600 79794 427450 438112 438467 423088 164505 184039 269588
11046 269588 248385 701398 332609 547275 435026 220352 741153 323232 934178 402404
11035 553373 844437 721490 336275 -3781 557191 520757 366921 426401 711552 548220
11025 548220 856012 582521 398269 420282 506631 440893 515557 719213 734384 286019
11014D10385J70118J32938j07752r0160J87178k57473o7555P5450j7757k8058
11004D07314J74813j37446j5366K69842B50226K71365j15622q2300N94812C25737
10993E67495B60354K26314J85058M0932m8504M7528n7876Q3254k92650K3414K68241
10982G36065j82469R1519k25035j37177M40317j35854J47920L95144n01840R8831
10972G27421M97214E96548J81548k36108N80572j76941M54163k03586L38170j64677
10962A369689M44961J56692j73455M89539J25713Q059l80564M61965l21393j52103
10952B029103J3728m32513P7105l55236q0447J92410j91847j0931l2758J5325
10942A223939P3302j21305j19532J68236l99540N63401n98841k8867J43160B78219
$$ plain form
11014 410385 580503 713441 605689 515529 702707 445234 377679 453129 435372 407314
11004 407314 582127 444681 429315 699157 250226 521591 405969 323669 918481 325737
10993 567495 260354 486668 671726 712658 664154 711682 653806 737060 444410 467824 736065
10982 736065 553596 645115 420080 282903 723220 587366 735286 1130430 628590 727421
10972 727421 1224635 596548 778096 541988 1122560 945619 1399782 1196196 1534366 1369689
10962 1369689 1814650 1971342 1797887 2287426 2413139 2421198 2040634 2502599 2181206 2029103
10952 2029103 2042831 1610318 1687423 1332187 1251740 1444150 1252303 1241372 1208614 1223939
10942 1223939 1297241 1175936 1056404 1224640 825100 1388501 789660 760793 903953 278219
10931E21201B57614J78150j27408A33848l0654J56920A16860N7991o7123J14846
10921B22574b8563F474K32597g1594I2242K8270B2544L97265c1131H0166b85952
10909c24698H1795K53266A25462b747k81062J12980K0412j09307B32402n4135
10899A78267k1232k4525o1931O4707a42578A45078n3831b88330A31287C2211O7149
10888I9360K25440c38468A50052i4015j6457D142h5575A33283n5958b84883a01383
10876b68024e5529k4048A3940e5987A41928D4434J47122D238e4285r5057A03733
10864B030J87985n876m0466R968a03904B24606K0543c9707B5224J58152a18391
10852b04024f4086a0724r2357A86157h6269A02346a27858B7887a01344k6661j323
$$ plain form
10931 521201 257614 435764 308356 133848 103194 260114 116860 174851 107728 222574
10921 222574 -28563 6474 239071 -71594 92242 120512 22544 419809 -31131 80166 -285952
10909 -324698 81795 335061 125462 -2747 -283809 -170829 -150417 -259724 232402 178267
10899 178267 157035 132510 70579 135286 -142578 145078 91247 -288330 131287 32211 99360
10888 99360 324800 -338468 150052 -94015 -110472 4142 -85575 133283 77325 -284883 -101383
10876 -268024 -55529 -79577 13940 -55987 141928 44434 191556 4238 -54285 -149342 103733
10864 2030 190015 184139 143673 153641 -103904 224606 245149 -39707 25224 183376 -118391
10852 -204024 -64086 -10724 -103081 186157 -86269 102346 -127858 27887 -101344 -128005 -129328
10841a29328L1676L2852G8364j4267b23418B76893c7421B5746f6827C00326b71430
10829b57635C4343b08416F9393M1837h7476k76993a22395A93694f8288j6350o1496
10818a46134a8768q4786m4990f0014B40407a8961G3325a9202d740p8361a1467
10806a37508k16562R9863B89995a89323c9021j8193A2418b0301p9592H2368i1536
10794b4558E3545h4227L4711j70035B31984a96934C6091a26960n133k566B38517
10782A46481c43807J64972Q6404k90750E570c99731G0185j4697e0924j70112J6038
10771b04998A01584c3509l08769g4598A6222J26491c50343a52908j14864D5620
10760e9206E8005a24946A15261N7303G5128a99481A57525b46538r7382J06719
$$ plain form
10841 -129328 -97652 -64800 78364 64097 -223418 276893 -37421 25746 -66827 300326 -271430
10829 -257635 34343 -208416 69393 111230 -87476 -364469 -122395 193694 -68288 -84638 -146134
10818 -146134 -18768 -103554 -148544 -60014 240407 -18961 73325 -19202 -4740 -83101 -11467
10806 -137508 -354070 -254207 289995 -189323 -39021 -57214 12418 -20301 -99893 82368 -91536
10794 -24558 53545 -84227 -49516 -219551 231984 -196934 36091 -126960 -132093 -134659 238517
10782 146481 -343807 -178835 -92431 -383181 5570 -399731 70185 55488 -50924 -221036 -204998
10771 -204998 101584 -33509 -342278 -74598 16222 142713 -350343 -152908 -267772 45620
10760 -59206 58005 -124946 115261 172564 75128 -199481 157525 -246538 -343920 -237201
10750b37201B35186c6939j2389r8338l25596i7207F2251K47818A04292J2579i8518
10738b09098c5625m5616A03496J53051c3076I2058a32191j63040a16103j22257
10728b38360a03459F3086a86523e3083j78808e6239b7177p8519k2178r9149Q8524
10717a38499I0922Q4596E1922Q7093h1173n7936H6090g30k95176h3972r9902q2795
10705b66669B791L5355J65983a38755O1473k86014f2414j36212M452K1333c0391
10693a15752k95024a69472C1048c7136l2616n027H5535i4977A20155J18654g0068
10681a61676A55868J7368c71604c2864C47525j29689h63k1028j69389Q3316B97437
10669a72506G3095c48461H1231C5897K52036e21820B12022L5334a06669l97028
$$ plain form
10750 -237201 235186 -36939 -49328 -147666 -473262 -97207 62251 310069 104292 116871 -98518
10738 -209098 -35625 -81241 103496 256547 -33076 92058 -132191 -295231 -116103 -238360
10728 -238360 -103459 63086 -186523 -53083 -231891 -56239 -27177 -105696 -127874 -227023 -138499
10717 -138499 90922 175518 51922 139015 -81173 -139109 86090 -730 -295906 -83972 -183874 -266669
10705 -266669 2791 38146 204129 -138755 -77282 -363296 -62414 -198626 -194174 -172841 -30391
10693 -115752 -410776 -169472 31048 -37136 -69752 -74779 85535 -94977 120155 238809 -70068
10681 -161676 155868 173236 -371604 -32864 347525 217836 -863 -21891 -191280 -107964 297437
10669 -172506 73095 -348461 81231 35897 287933 -521820 212022 247356 -106669 -503697
10659e03697K44622G5232a9037I9178C8094e04025E1801f4964l5679a7652j73498
10648a91150F8182b33869b5880C0010a54412o170e043B9308e15361B3259J43632
10637A66891n6291l837K9215O8830g0301C573a72402A9368a3823o4997F294a5114
10624a30745D4554A1911b08658Q965C0028a36347b4544j16081d6190a3646C6937
10612a91550R0862a4692k03904C8034h7785I9987Q3303d3294m9464A21553L863
10601A25416b26894K7104f1515a5701F44h9977j46626B88147A4980K45020e6665
10589d436j25063B15436I7441c24798O3427A30570a53257C5010a20109C7726d3244
10577e6482j30140g0447F970c06914a49272I7388C5136a32753A8905a97967o8866
$$ plain form
10659 -503697 -259075 75232 -19037 99178 38094 -504025 51801 -64964 -100643 -17652 -191150
10648 -191150 68182 -233869 -25880 30010 -154412 -160582 -5043 29308 -515361 23259 166891
10637 166891 110600 106763 135978 204808 -70301 3573 -172402 19368 -13823 -78820 6294 -15114
10624 -130745 44554 11911 -208658 -199693 30028 -136347 -24544 -140625 -46190 -13646 36937
10612 -191550 -100688 -14692 -218596 38034 -87785 99987 183290 -43294 -92758 121553 125416
10601 125416 -226894 -199790 -61515 -15701 644 -89977 -236603 288147 14980 260000 -56665
10589 -4436 -129499 215436 97441 -324798 -261371 130570 -153257 35010 -120109 37726 -43244
10577 -56482 -186622 -70447 6970 -306914 -149272 97388 35136 -132753 18905 -197967 -266833
10566b66833A28411J0830a45667A79757a22071C15539j38101i4843H3882H952
10555a46526J4447I085a36936N7636c1468C5293J25454P6708a95388B18342m7005
10544A71337l1140a36297H0529B6365J876R8730B5879J17011b1171p2421r9452
10533a93044k22165a16271j88752g6059D66975b09356j51869h7692B72561A00947
10522C7541a00930a2337q5606F8215B8421c0348j89828f1568A76852Q6891N0796
10511C14539a17664B4446a456r8610k14654r3573d4148O587B32439b01439e2576
10499a3554r6966A90232L8607a45316k23191A9095O4896m423C7024b3804j691
10488b5495l0006A27348b3743H6946c843j70483B19997a1705l20246A89202b18435
$$ plain form
10566 -266833 128411 139241 -145667 179757 -122071 315539 177438 -94843 83882 8952
10555 -146526 -132079 9085 -136936 -79300 -31468 35293 160747 237455 -195388 218342 171337
10544 171337 140197 -136297 80529 26365 28241 126971 25879 142890 -21171 -93592 -193044
10533 -193044 -415209 -116271 -305023 -76059 466975 -209356 -361225 -87692 272561 100947
10522 37541 -100930 -12337 -97943 68215 28421 -30348 -220176 -61568 176852 263743 314539
10511 314539 -117664 24446 -1456 -100066 -314720 -408293 -44148 -37561 232439 -201439 -52576
10499 -13554 -110520 190232 228839 -145316 -368507 19095 83991 79568 37024 -23804 -25495
10488 -25495 -55501 127348 -23743 86946 -3843 -174326 219997 -11705 -331951 189202 -218435
10476a67808B2783a18638A89701D2145j7201M97959A79196J63545A27636L82390
10466E10026B33932J16109H9969P1876J35596G9637K1624J24427J30302D024b9643
10454A59432K7370J7055l9701b5225A7325J5286g3123F6623a33127A8018a4353
10442A613d4867B75348b3262G1843h8929B7087j2945a9878j26428N7727a5j94391
10430a94406O6564L6086B48725L9668a65411A15196i6021B0458c50268a62419
10419a73910j53523A90037c0308q3636A21994b66935P2020b9676B8946d8226o3212
10408a11438k34956Q5394e0590p2909F9995c2965j55676m9929c5716k49742H031
10396b07492O7337A02897L4758c14261E3174b12897A25092j8767L84624b3464
$$ plain form
10476 -167808 22783 -118638 189701 42145 24944 522903 179196 342741 127636 510026
10466 510026 233932 350041 89969 161845 297441 79637 101261 225688 355990 4024 -29643
10454 159432 186802 203857 164156 -25225 17325 32611 -73123 66623 -133127 18018 -14353
10442 1613 -44867 275348 -23262 71843 -88929 27087 14142 -19878 -146306 -88579 -15 -194406
10430 -194406 -127842 -91756 248725 288393 -165411 115196 -96021 20458 -350268 -162419
10419 -173910 -327433 190037 -30308 -113944 121994 -266935 -194915 -29676 28946 -48226 -111438
10408 -111438 -346394 -261000 -50590 -123499 69995 -32965 -188641 -238570 -35716 -285458 8031
10396 -207492 -140155 102897 137655 -314261 53174 -212897 125092 106325 490949 -23464
10385H2083g1840A38846a98250B35193q1776b12195a1253k34642C22231j1470
10375C10761a53357G8823M3747K0559l651R060a5310A20913a5051B20255B3610
10363B03595a18863j91440F4340K70310j28522M6359j14892a47146G4332K57013
10353C31345A39288L90722B01069O3208N4087A42564J19303J03023J20214j39620
10343C45484m4501q3423q8688A9647L11277A35175N31589l30709L0017M0706J73067
10332E79845A88477D053L05449f6342D30384j35057G266L17920i3962A28610a2438
10320A76999M9971e942I2813c7320A66550b8866C5176Q622a96220C1980d1786
10308B30386K4921E9973e2665b0625B63895k0711J85759G1234b73552C26629a93058
$$ plain form
10385 82083 -71840 138846 -198250 235193 153417 -212195 -11253 -245895 322231 310761
10375 310761 -153357 78823 122570 143129 139478 148538 -15310 120913 -15051 220255 23610
10363 203595 -118863 -310303 64340 334650 206128 252487 137595 -147146 74332 331345
10353 331345 139288 530010 201069 264277 318364 142564 261867 364890 485104 345484
10343 345484 300983 217560 128872 19647 330924 135175 666764 336055 366072 406778 579845
10332 579845 188477 4053 309502 -66342 430384 295327 7266 325186 -93962 128610 -12438
10320 176999 226970 -5942 92813 -37320 166550 -28866 35176 43798 -196220 31980 -41786
10308 230386 255307 59973 -52665 -20625 263895 243184 428943 71234 -273552 326629 -193058
10296F2482e5156D6952N22308d9314E8285P6668a57633A71903n6831h1345H4517
10284A37801a40850A97765a42977r9309G4249b7356B3893A0202b59365J19656
10274a39709l7534Q2698J0144D7052h0279m4642j58609H3995d27153A24328B4779
10262f6476F5239J78960G1047i0524g2m4214l22911A2976a82017I4741J61523
10251B56264b72709N090A93122a03527A79489p6109J06330H9057j3173K27786
10241C03670h2036E1824H137K73162A03905c7098B58516b37575A08891A7745i9206
10229E29248j81957A69477B0496c9483i400B09629B6932b9966q6363d755k04521
10218b09276L239b6561B84211c0464B0209b05538n7019f2619p5727B15858a46520
$$ plain form
10296 62482 -55156 46952 569260 -49314 58285 134953 -157633 171903 115072 -81345 84517
10284 137801 -140850 197765 -142977 -242286 74249 -27356 23893 10202 -259365 -139709
10274 -139709 -177243 -94545 -84401 47052 -80279 -124921 -283530 83995 -427153 124328 24779
10262 -66476 65239 244199 71047 -90524 -72 -44286 -367197 12976 -182017 94741 256264
10251 256264 -272709 -267619 193122 -103527 179489 103380 209710 89057 75884 303670
10241 303670 -82036 51824 8137 281299 103905 -37098 258516 -237575 108891 17745 -99206
10229 529248 347291 169477 20496 -39483 -9400 209629 26932 -29966 -116329 -4755 -209276
10218 -209276 -206037 -26561 284211 -30464 20209 -205538 -262557 -62619 -138346 215858 -146520
10206b96516C42708F767K19695b67463g1538C1074b6038B09415e0255A02877D6559
10194a62255A15305B6540K7427c00133A44119R7931C8737K33357j34241c21199
10183E9523K34919A09942b93560a4638A74411c3714D26766c18828J43095N2674
10173a23059j669D9025A4955d46910O6584A03914L9375b05303M8585g293k96637
10162c03930I0286a2270A09494a20755d4663E7166a99500f1773j61588P971B22666
10150a7265j40056e5472M782C02780A15520f1051A04287J38561A06283K3206d8455
10138a10027A0024N78J35313e1042q6936k37791f9923j6494E3045a11567F7431
10126a86489i0683m0966q0580A12725d7106j19404g8832D6615J16916a65838A16314
$$ plain form
10206 -296516 342708 6767 226462 -267463 -71538 31074 -26038 209415 -50255 102877 46559
10194 -162255 115305 26540 53967 -300133 144119 242050 38737 272094 137853 -321199
10183 59523 294442 109942 -293560 -14638 174411 -33714 426766 -318828 -175733 -123059
10173 -123059 -124728 49025 14955 -446910 -380326 103914 143289 -205303 -156718 -7293 -303930
10162 -303930 90286 -12270 109494 -120755 -44663 57166 -199500 -61773 -223361 -215390 222666
10150 -17265 -157321 -55472 -50690 302780 115520 -61051 104287 242848 106283 129489 -48455
10138 -110027 10024 10602 145915 -51042 -137978 -375769 -69923 -86417 53045 -111567 67431
10126 -186489 -90683 -131649 -212229 112725 -47106 -166510 -78832 46615 163531 -165838 116314
10114A890K21256a39231k31190A70363J04191c0007F8977b39835j003J06169J2937
10103a21732n6819A05492J330C6897J37686o0647b12767A62871F6110A8097c52418
10091b19378C742R6553i7307j51634J00550O4639a3391I4553i7372B09333A9070
10079a14444j89414A46869a86115g5737j12405N0710k2409m237l70790G4839c7467
10067a83568b9078k32049C5944h5531m5630B33729j13028b85352E4996b18029
10056c49734a18471k9497M914L9699c7203n0391n8288j45862A16739n1158a16099
10044i8050j26562B31078A05764i8875n6386D2370a59850A64264a28900j33910
10034b62810b3786l65363J91094e96j38086k99585b06335i2133A48769a92814
$$ plain form
10114 1890 223146 -139231 -370421 170363 274554 -30007 68977 -239835 -240838 -134669 -121732
10103 -121732 -178551 105492 106822 36897 174583 113936 -212767 162871 66110 18097 -352418
10091 -219378 3742 100295 -97307 -248941 -148391 -83752 -13391 94553 -97372 209333 19070
10079 -114444 -303858 146869 -186115 -75737 -188142 -137432 -159841 -164078 -534868 74839 -37467
10067 -183568 -29078 -261127 35944 -85531 -131161 233729 120701 -285352 54996 -218029
10056 -349734 -118471 -147968 -143054 -103355 -37203 -87594 -145882 -291744 116739 65581 -116099
10044 -98050 -224612 231078 105764 -98875 -155261 42370 -159850 164264 -128900 -262810
10034 -262810 -23786 -389149 -198055 -596 -138682 -438267 -206335 -92133 148769 -192814
10023a54270C88187e262A4732J6673d8140A18780a17069m8623A76608a37328C4516
10011B42678A14216K7855o2129a90886A46482n8305d52704a79606j32589a54341
10000c10598P9709d0983j87175R8059O2161G1636d49181a34141d5178b663B6371
9988b4564n13079J75692A07121F705J54746a43006E149a18738D4174F728a63045
9976b19452d6300o601j65513J07128K7662E4934J17682f6176K3671B3958a04816
9964F7384e3307B15841A01147d04H5593a90147k2010B6934B598K0664C960i1550
9951a51589G6726Q3906a82995O4591A10508K0021A017a01476j18108j48266A69424
9939C10703A22510b62905b4404o0569o3313q6204b9386k28128E6100e417C1258
$$ plain form
10023 -154270 388187 -5262 14732 31405 -48140 118780 -117069 -165692 176608 -137328 34516
10011 242678 114216 142071 79942 -190886 146482 88177 -452704 -179606 -312195 -154341
10000 -310598 -230889 -40983 -228158 -130099 -67938 71636 -449181 -134141 -45178 -2663 26371
9988 -24564 -537643 -361951 107121 6705 161451 -143006 5149 -118738 44174 6728 -163045
9976 -219452 -46300 -52901 -218414 -111286 -83624 54934 172616 -66176 -42505 23958 -104816
9964 67384 -53307 215841 101147 -404 85593 -190147 -212157 26934 2598 23262 3960 -91550
9951 -151589 76726 160632 -182995 -118404 110508 130529 1017 -101476 -219584 -367850 169424
9939 310703 122510 -262905 -24404 -84973 -148286 -234490 -29386 -257514 56100 -5417 31258
9927b22164J1723R8189k39674a05147q1784J1835n722C7566K66331c75867A88014
9915b29984O3330H9405l6238d7163C5829c62651a2691k47364A54657e7137B25248
9903H6016J3115m3704b86387a38244J4667A18614a81539k4114j0071m4225A51020
9891c86173d8737a9253l32563A22805a42403K6379B51138I736J38759b76905B64636
9879G4481b62666a27802M9005D0226a45151d143j81351A01328d6741o5250j7814
9868a29805B92710a26052q6679g6636A5675O579j0100d05119i1066d3253A1872
9856d6014m5109A6395a61180A98124a23066j29362a14817n0885a6562l39893G3404
9844A0728a7529k61908A13682b03363M5336A8344d03509J52019D3835c40150a07972
$$ plain form
9927 -222164 -210441 -112252 -351926 -105147 -186931 -175096 -180818 37566 303897 -375867 188014
9915 -229984 -166654 89405 53167 -47163 35829 -362651 -12691 -260055 154657 -57137 225248
9903 86016 99131 55427 -286387 -138244 -123577 118614 -181539 -205653 -215724 -259949 151020
9891 -386173 -48737 -19253 -351816 122805 -142403 -116024 251138 9736 148495 -276905 264636
9879 74481 -262666 -127802 -78797 40226 -145151 -4143 -185494 101328 -46741 -111991 -129805
9868 -129805 292710 -126052 -212731 -76636 15675 22254 12154 -405119 -91066 -43253 11872
9856 -46014 -91123 16395 -161180 198124 -123066 -252428 -114817 -165702 -16562 -356455 73404
9844 10728 -17529 -279437 113682 -203363 -158027 18344 -403509 -251490 43835 -340150 -107972
9832i5269B63651K55830e0210k81077A76419a91219A10749a80278d686A09953
9821G2774e1712m7871a5405m27140A37407e385A73420c19639j30557I5217a08631
9809A39713a17972l2151M4184k11171F3605J83725p1888E4261h9593H2262b29315
9797c04057B0824N7529c87507H1114J61276h5186K3943j03541k4619l2347p4203
9786b95953e8834h441j27477p9665A60878b504A6226a69340g0109r9030j04k3514
9774a92757n718L2613O6822K6165d413l43461B4854b25716O1796O0992c9751A6359
9761f86H3410G61J51547J94891b19214a3761k66954N4168c5178j82276Q3412k99906
9749d33948K10180d1588j76486o5221a00782m08862A08080a54711r0422i3592
$$ plain form
9832 -95269 263651 519481 -50210 -331287 176419 -191219 110749 -180278 -4686 109953
9821 72774 -51712 -99583 -15405 -442545 137407 -5385 173420 -319639 -450196 95217 -108631
9809 139713 -117972 -150123 -105939 -317110 63605 247330 175442 54261 -89593 82262 -229315
9797 -304057 20824 78353 -387507 81114 242390 -85186 -61243 -164784 -189403 -221750 -295953
9786 -295953 -58834 -8441 -135918 -215583 160878 -2504 16226 -169340 -70109 -169139 -169243 -192757
9774 -192757 -198475 -165862 -99040 -72875 -4413 -347874 24854 -225716 -163920 -102928 -39751 16359
9761 -686 83410 761 152308 347199 -219214 -13761 -280715 -226547 -35178 -217454 -134042 -433948
9749 -433948 -223768 -41588 -218074 -283295 -100782 -509644 108080 -154711 -245133 -93592
9738c96846A03353j9981d5758j12210H4068b5322A93620F2399P4086C6389Q6592
9727A22981c79077B8302J54882J01547l7297d6023k66773a27097A4709d59664
9716G0586j6173R289g9255j41259l312M3611A58690e3060C0482f8809k27456J06469
9704a89796C7425J0061a72371B87621b38353f203n2022K2242C0348b45738j5924
9693b61662h2252b1640A59637d11771a40643e0483G8759e900B5731i4759j80274
9682b75033B28540e1132B7283o379G763b21543E2312J21860b19488F8735K77812
9671C46547F5729a98182B94357h3130K993D3497a37988O5829A32446c12353J22832
9660a89521C8664b14091A94166F1692d37688A80676b50418c524o7555p8298k1255
$$ plain form
9738 -396846 103353 83372 -45758 -157968 84068 -25322 193620 62399 136485 36389 122981
9727 122981 -379077 28302 183184 284731 247434 -46023 -312796 -127097 14709 -459664
9716 70586 54413 63702 -79255 -220514 -223826 -180215 158690 -53060 30482 -68809 -296265 -189796
9704 -189796 37425 47486 -172371 287621 -238353 -6203 -58225 -35983 30348 -245738 -261662
9693 -261662 -82252 -21640 159637 -411771 -140643 -50483 78759 -5900 25731 -94759 -275033
9682 -275033 228540 -51132 27283 20904 7763 -221543 52312 174172 -219488 68735 346547
9671 346547 65729 -198182 294357 -83130 -80137 43497 -137988 -72159 132446 -312353 -189521
9660 -189521 38664 -214091 194166 61692 -437688 180676 -250418 -3524 -71079 -149377 -170632
9649a70632A62648E7189D369a88844I1155e2983A66500a21836c5962J6969C28479
9637a17360c7471F172d5523D2206P9378c2809G1364c15260A52676e2479j37713
9626a90192A25819g5280J6109B35761E4923e6452k17871J18480B239a06788L90
9615a06398K1695q5209g5745E8585a8892o0014J6640A92059d6030r4887b212k77614
9603b79826m8035a6109k97470f9373j9826k93216E4387a12794D0510f4166m4707
9592a08873j0965B9099i07k30802A84498g032j01844D8780J00502K9371b52989
9580c01365d7387l77712A15075C9114J69704b9732F612b29808q9696A4908g8897
9568A20145l0940b9734H3155a38376A02820b54850f8523C08255b20533j16206
$$ plain form
9649 -170632 162648 57189 4369 -188844 91155 -52983 166500 -121836 -35962 -18993 328479
9637 -117360 -37471 6172 -45523 42206 121584 -32809 71364 -315260 152676 -52479 -190192
9626 -190192 125819 -75280 -59171 235761 54923 -56452 -274323 -155843 2239 -106788 -106398
9615 -106398 -84703 -169912 -75745 58585 -18892 -78906 -62266 192059 -46030 -140917 -2212 -279826
9603 -279826 -327861 -16109 -313579 -69373 -89199 -382415 54387 -112794 40510 -64166 -108873
9592 -108873 -119838 29099 -907 -231709 184498 -7032 -108876 48780 149282 178653 -252989
9580 -301365 -47387 -425099 115075 39114 208818 -29732 6612 -229808 -319504 14908 -78897
9568 120145 89205 -29734 83155 -138376 102820 -254850 -68523 308255 -220533 -336739
9558c36739F5761i6860B87798b04554D2165b00292H7589a03674j08709l85189
9548e97572B02964a51779o1039F4190J4294J7365a1333D7077a7369m2235l0643
9537i0247L719L1043o049k71757f5496p9371p1591B12210D99d1971p9472l29063
9525d50506J86122A07265b16733E3342Q3252a14212j4871j52345a2271A16765
9514B2474a40036B31483Q2855b32570e3327j12511p0406b823k24635J11320q4698
9503b00836c2094j7886r7870A33092R7657D8497j2156a14641j66007g7279r0923
9492a68202G377d2309e215G1788j282a60880G9764b61004G5604B6861A0346a68739
9479i962k76689m4161K7031J51609d3889m249A3754b97708j1987c7516l01945
$$ plain form
9558 -336739 65761 -96860 287798 -204554 42165 -200292 87589 -103674 -212383 -597572
9548 -597572 202964 -151779 -212818 64190 78484 95849 -11333 47077 -17369 -59604 -90247
9537 -90247 -86528 -55485 -61534 -333291 -65496 -144867 -216458 212210 499 -41971 -121443 -450506
9525 -450506 -264384 107265 -216733 53342 136594 -114212 -129083 -281428 -12271 116765
9514 22474 -140036 231483 314338 -232570 -53327 -165838 -236244 -2823 -227458 -116138 -200836
9503 -200836 -32094 -49980 -147850 133092 230749 48497 36341 -114641 -280648 -77279 -168202
9492 -168202 7377 -42309 -5215 71788 70506 -160880 79764 -261004 75604 26861 10346 -168739
9479 -9962 -286651 -330812 -303781 -152172 -43889 -48138 13754 -297708 -309695 -37516 -339461
9468c39461I0843b1439A31238f7117a876C00986F8316K4415C5920F507M0531P4671
9456A21709b37045H6801a83863B06343a27609j648c0857C88772a6280o8694A50908
9444B0831c07352a50276E9617b35219K9737a02719n4704G3763a47399m0530A05373
9432f38976i5627B30731g26j21176F5760b35866B10555r6064h0994A75911a31471
9420b02197j95573g4375A33921d0012B48J33149j9313c63269B74271h0569m7850
9409a28419L19D8860h6781E5404J3653d4115A18905a5116B61410C5523L51673
9398C87196A05312j8919c9929B38733F6422b49803f4681j29374p63A16122I769
9386A36449b21379R1531C11699F3986G823J94812l7911N4737a45398J5172q6042
$$ plain form
9468 -339461 90843 -21439 131238 -67117 -1876 300986 68316 92731 35920 6507 47038 121709
9456 121709 -237045 86801 -183863 206343 -127609 -129257 -30857 388772 -16280 -84974 150908
9444 20831 -307352 -150276 59617 -235219 -205482 -102719 -157423 73763 -147399 -187929 105373
9432 -638976 -95627 230731 -726 -121902 65760 -235866 210555 114491 -80994 175911 -131471
9420 -202197 -397770 -74375 133921 -40012 248 133397 114084 -363269 274271 -80569 -128419
9409 -128419 -128100 48860 -86781 55404 69057 -44115 118905 -15116 261410 35523 387196
9398 387196 105312 86393 -39929 238733 66422 -249803 -64681 -194055 -194818 116122 9769
9386 136449 -221379 -129848 311699 63986 7823 202635 164724 219461 -145398 -130226 -216268
9375b16268R2399j8882A36604c03842A7056a20684e453j26039M1066L604J4885
9364g1937j64192J3653B27551o5626f6646J819A33959c67675A08830d7759F1640
9352G0981c20281L0121B5159m551a37154O5275A01098a20624G9440b78805a0237
9340B1325J87560a72783n8454g1375j54688J9113I1065c42B00203o5072c4651
9328b0051k3425j52867c8025A74410K97320a78229b5988A65884c7175l60523h3748
9316D7158a150E2483J657a32158r457k35972a00371B3242b65212M0443h2186k236
9304h4422C6933J34651H2232J509b86886A56205C1433A4266a39898p3965A19638
9292G7378M0101d8871A43774f32551a39875B75531a5782A82583d49325J52055
$$ plain form
9375 -216268 -123869 -142751 136604 -303842 17056 -120684 -5453 -131492 -90426 -86822 -71937
9364 -71937 -236129 -222476 227551 161925 -66646 -64827 133959 -367675 108830 -47759 61640
9352 70981 -320281 -290160 25159 20608 -137154 -71879 101098 -120624 79440 -278805 -10237
9340 21325 208885 -172783 -231237 -71375 -226063 -206950 91065 -342 200203 135131 -34651
9328 -20051 -43476 -196343 -38025 174410 471730 -178229 -25988 165884 -37175 -397698 -83748
9316 47158 -1150 52483 54140 -132158 -141615 -377587 -100371 23242 -265212 -224769 -82186 -84422
9304 -84422 36933 171584 82232 83741 -286886 156205 31433 14266 -139898 -213863 119638
9292 77378 117479 -48871 143774 -632551 -139875 275531 -15782 182583 -449325 -297270
9282b97270A94242A9530N3842c49229K1130G8789b37274A15512K18828b0350j23845
9271a44195l3731b0513C74418g0267B3928a49299j28054N6096D5605d08697B31622
9259i8778D0851c37884C2706b01397c543A50594a00199C2557i2516j50010r0837
9248c33363A16867l9797J00760J57410A28032a67127P4144k34034a33057j04693
9238b37750i5151j20636k9764A31617C3361j2431N0694K3738i8275b4520j23407
9227a47927L8122A29867A777J99336g9281c3834g639j35919d7821n1904M3950
9216e5775n9306B05572b48677F2355d35326J80709a01227j08520A70929E5576
9205c80469D2370a65741h1543h509B1422h7906L6555B64544a39422c7616J2484
$$ plain form
9282 -297270 194242 19530 73372 -349229 -328099 78789 -237274 115512 334340 -20350 -144195
9271 -144195 -177926 -20513 374418 -70267 23928 -149299 -277353 -221257 45605 -408697 231622
9259 -98778 40851 -337884 32706 -201397 -3543 150594 -100199 32557 -92516 -242526 -333363
9248 -333363 116867 77070 177830 335240 128032 -167127 -92983 -327017 -133057 -237750
9238 -237750 -95151 -215787 -245551 131617 33361 20930 71624 95362 -98275 -24520 -147927
9227 -147927 -109805 129867 1777 201113 -79281 -33834 -7639 -143558 -47821 -99725 -55775
9216 -55775 -115081 205572 -248677 62355 -435326 -254617 -101227 -209747 170929 55576
9205 -380469 42370 -165741 -81543 -8509 21422 -87906 -51351 264544 -139422 -37616 -25132
9194b5132B45310B2006b68261a24022P841b2803l04354i7916E9964f3824f563
9182E9613c70710o9931J43033e5969A52519b09747E8651K88125e1338I2912a138
9170a45956o3266h814k08132P4505k6832B80332a58011j85400J14844J04886B35838
9158D6415a09665e0363A51594b39756J8896A05482c28511B41549A5194i6700q3482
9147a80182c4472j30866C3771b47453Q9144p0129a13756D3971a10404G2537b15466
9135D0913a26640B72126D7701K7244b19210j25547i7157E9504b39628j68738B01653
9123A11841K02558j38496c44876a17904C42985G7822a0996G9153a32733G534c13972
9111h6597b8715E3518N4050b23863a01385M8911A42693E3428J54082g0887L0186
$$ plain form
9194 -25132 245310 22006 -268261 -124022 -116181 -22803 -327157 -97916 59964 -63824 -6563
9182 59613 -370710 -440641 -297608 -55969 152519 -209747 58651 346776 -51338 92912 -1138
9170 -145956 -209222 -8814 -216946 -142441 -169273 280332 -158011 -343411 -228567 -123681 235838
9158 46415 -109665 -50363 151594 -239756 -220860 105482 -328511 241549 15194 -96700 -180182
9147 -180182 -34472 -165338 33771 -247453 -158309 -228438 -113756 43971 -110404 72537 -215466
9135 40913 -126640 272126 47701 74945 -219210 -344757 -97157 59504 -239628 -408366 201653
9123 111841 314399 175903 -344876 -117904 342985 77822 -10996 79153 -132733 7534 -313972
9111 -86597 -28715 53518 107568 -223863 -101385 -52474 142693 53428 207510 -70887 -40701
9100d0701C3650a34741m16018b22379f1915j3028C7536a14548H2272b7491n951
9089c3442q9991B01075a22075d9352l22461H2643J73423a54784k7115A42398K36665
9078C79063F220J97796G955J47635p2310J66968p0288B0947g9284C54397A65272
9066A88981E1918K5732b23753O4158e5489C30841D9527J32390a35653D5438q263
9055C7175a01896k80896A63472a54962l5965Q7964B89871d68374A60091d3346
9044H8123k4162a11076N3406A11598c64227F3929c4818j95273P2641j1551L4824
9033a34177q7105n0416C9412K052b25329J521c0755o8093B23820A08039b4045
9021A38067a70988o0046D9544d4746C0438M0991J84412A02545a86148g6188j50923
$$ plain form
9100 -40701 33650 -134741 -550759 -222379 -61915 -74943 37536 -114548 82272 -27491 -33442
9089 -33442 -123433 201075 -122075 -49352 -371813 82643 256066 -154784 -181899 142398 379063
9078 379063 6220 204016 7955 155590 83280 250248 179960 20947 -79284 354397 165272
9066 188981 51918 77650 -223753 -159595 -55489 330841 49527 181917 -135653 45438 37175
9055 37175 -101896 -382792 163472 -154962 -190927 -102963 289871 -468374 160091 -43346
9044 88123 63961 -111076 -57670 111598 -364227 63929 -34818 -230091 -157450 -169001 -134177
9033 -134177 -221282 -271698 39412 41464 -225329 -223808 -30755 -98848 223820 108039 -24045
9021 138067 -170988 -231034 49544 -44746 30438 71429 255841 102545 -186148 -76188 -227111
9010b27111K8063k04518B97875D6159N87a06292a5077l22839P9921I631a51564
8998c07483a11503k3626I3871h8579j272D6611L672d00645B04220m2737b90626
8986a24959L3052A49562C208d08028a02934j18467g6797C86729c6927G1727a91735
8974A7200d2632F3128a89766l842p1386A07421a63612k012I0746b68341J21191
8963a47150j5449e984l28129F4131A5506O0060d2916A7393J46531d1265B35608
8951b54675A2080b78159A9494b08191D27715g8666j29188A56453c05625Q3743
8941b21882F3190c53502A59023a42874B4086b93743h5241A57201g088k0062B21610
8929A3489N5361g8866m8614K9583q3972H2629a02085l4292m3434F8001J18544
$$ plain form
9010 -227111 -199048 -403566 297875 46159 46746 -106292 -15077 -337916 -257995 9631 -151564
8998 -307483 -111503 -135129 93871 -88579 -89851 46611 50283 -400645 204220 161483 -290626
8986 -124959 -91907 149562 3208 -408028 -102934 -221401 -76797 386729 -36927 71727 -191735
8974 17200 -42632 63128 -189766 -193608 -264994 107421 -163612 -165624 90746 -268341 -147150
8963 -147150 -162599 -5984 -334113 64131 15506 75566 -42916 17393 163924 -41265 235608
8951 -254675 12080 -278159 19494 -208191 427715 -78666 -207854 156453 -305625 -221882
8941 -221882 63190 -353502 159023 -142874 24086 -293743 -85241 157201 -7088 -27150 221610
8929 13489 68850 -78866 -127480 -97897 -181869 82629 -102085 -136377 -179811 68001 186545
8918A86545R1672i6203j02815A34718m5399a57150f9302C17365J96567j46840
8908C67092L60696N27405J022192j030606n85996R5436C51746j59352K82876a16095
8897b14714F5761b54603B66537C7127a71755A00165R9449C4475J90461p5631o3370
8886H5935b70302k9700R2981j70891A67312d3763D04634g5904G5745N298i9220
8874D2507L4861c01295h6392H7573a3507A12354B2159c30466h476l4452A32881
8862C4736K63871f4430B16281a26205n2489g0347A48194J0493A4009J41345a42614
$$ plain form
8918 186545 278217 -96203 -199018 134718 89319 -157150 -69302 317365 513932 367092
8908 367092 727788 1255193 2277385 1246779 660783 756219 351746 192394 475270 -116095
8897 -214714 65761 -254603 266537 37127 -171755 100165 199614 34475 224936 149305 85935
8886 85935 -270302 -300002 -207021 -377912 167312 -43763 404634 -75904 75745 81043 -99220
8874 42507 77368 -301295 -86392 87573 -13507 112354 22159 -330466 -8476 -42928 132881
8862 34736 298607 -64430 216281 -126205 -178694 -70347 148194 158687 14009 155354 -142614
$$ [...]
##END NTUPLES=NMR SPECTRUM
##END=
