
##TITLE=AC1222_Punto_6074794_1Xs9jaGfa0
##JCAMPDX= 6.0         $$ Bruker NMR JCAMP-DX V2.0
##DATA TYPE= NMR SPECTRUM
##DATA CLASS= NTUPLES
##ORIGIN= BRUKER
##OWNER= Administrator
$$ 1.72 TOPSPIN		Version 2.1
$$ 2012-05-08 02:55:36.437 -0500  Administrator@TOPSPIN
$$ Compression mode = diff/dup
##.OBSERVE FREQUENCY= 400.13188235
##.OBSERVE NUCLEUS= ^1H
##.ACQUISITION MODE= SIMULTANEOUS (DQD)
##.ACQUISITION SCHEME= undefined
##.AVERAGES= 64
##.DIGITISER RES= 22
##SPECTROMETER/DATA SYSTEM= spect
##.PULSE SEQUENCE= noesygpps1d.comp
##.SOLVENT NAME= COFFEE_meoh
##.SHIFT REFERENCE= INTERNAL, COFFEE_meoh, 1, 14.96662
##AUDIT TRAIL= $$ (NUMBER, WHEN, WHO, WHERE, PROCESS, VERSION, WHAT)
$$ ##TITLE= Audit trail, TOPSPIN		Version 2.1
$$ ##JCAMPDX= 5.01
$$ ##ORIGIN= Bruker BioSpin GmbH
$$ ##OWNER= Administrator
$$ $$ C:\Bruker\TOPSPIN/data/COFFEE/nmr/AC1222_Punto_6074794_1Xs9jaGfa0/12/pdata/1/auditp.txt
$$ ##AUDIT TRAIL=  $$ (NUMBER, WHEN, WHO, WHERE, PROCESS, VERSION, WHAT)
(   1,<2012-05-08 02:55:31.296 -0500>,<Administrator>,<TOPSPIN>,<go>,<TOPSPIN 2.1>,
      <created by zg
	started at 2012-05-08 02:44:00.296 -0500,
	POWCHK enabled, PULCHK disabled,
       configuration hash MD5:
       AF F2 23 6B 01 CD 40 DD E5 A1 38 A0 06 EA F7 77
       data hash MD5: 64K
       81 15 0C 93 AD 41 34 CF 14 99 FC 4D C1 AF 67 20>)
(   2,<2012-05-08 02:55:34.078 -0500>,<Administrator>,<TOPSPIN>,<proc1d>,<TOPSPIN 2.1>,
      <Start of raw data processing
       efp LB = 0.3 FT_mod = 6 PKNL = 1 PHC0 = 0 PHC1 = 0 SI = 128K 
       data hash MD5: 128K
       52 1F DB F8 49 70 6C A9 06 A5 1F 4F 77 7E 21 10>)
(   3,<2012-05-08 02:55:35.296 -0500>,<Administrator>,<TOPSPIN>,<proc1d>,<TOPSPIN 2.1>,
      <pk PHC0 = 37.07886 PHC1 = 0 
       data hash MD5: 128K
       DF 3A A1 D4 48 2D 5C 18 24 1D FD 39 BA 70 DD C8>)
(   4,<2012-05-08 02:55:36.093 -0500>,<Administrator>,<TOPSPIN>,<proc1d>,<TOPSPIN 2.1>,
      <abs ABSG = 1 
       data hash MD5: 128K
       11 A3 66 1F C4 55 36 39 F0 10 DF C8 2A 2A FB 36>)
(   5,<2012-05-08 02:55:36.171 -0500>,<Administrator>,<TOPSPIN>,<proc1d>,<TOPSPIN 2.1>,
      <abs ABSG = 2 
       data hash MD5: 128K
       5C B8 6B BA 20 99 D4 9C 74 30 4A 0F 0C 73 7C 96>)
(   6,<2012-05-08 02:55:36.234 -0500>,<Administrator>,<TOPSPIN>,<proc1d>,<TOPSPIN 2.1>,
      <abs ABSG = 3 
       data hash MD5: 128K
       D5 D6 18 85 49 05 97 6E B9 3F D1 C7 5E 0E 1B FE>)
(   7,<2012-05-08 02:55:36.296 -0500>,<Administrator>,<TOPSPIN>,<proc1d>,<TOPSPIN 2.1>,
      <abs ABSG = 4 
       data hash MD5: 128K
       7C 9B 3F 6D 4D FF E9 A4 42 57 94 38 0F C7 97 93>)
(   8,<2012-05-08 02:55:36.359 -0500>,<Administrator>,<TOPSPIN>,<proc1d>,<TOPSPIN 2.1>,
      <abs ABSG = 5 
       data hash MD5: 128K
       6E 0F 73 79 99 C6 DC E2 C1 18 79 9C F7 92 8A 54>)
$$ ##END=
$$ 
$$ $$ hash MD5
$$ $$ C4 EB BD FB B8 65 90 AE 24 EF ED 6E 34 11 6D C6
##$RELAX= 
##$RELAX= 
##$RELAX= 
##$RELAX= 
##$RELAX= 
##$RELAX= 
##$RELAX= 
##$RELAX= 
$$ Bruker specific parameters
$$ [...]
##$TP07= 0
##$TPNAME0= <>
##$TPNAME1= <>
##$TPNAME2= <>
##$TPNAME3= <>
##$TPNAME4= <>
##$TPNAME5= <>
##$TPNAME6= <>
##$TPNAME7= <>
##$TPOAL= (0..7)
0.5 0.5 0.5 0.5 0.5 0.5 0.5 0.5
##$TPOFFS= (0..7)
0 0 0 0 0 0 0 0
##$TUNHIN= 0
##$TUNHOUT= 0
##$TUNXOUT= 0
##$USERA1= <user>
##$USERA2= <user>
##$USERA3= <user>
##$USERA4= <user>
##$USERA5= <user>
##$V9= 5
##$VALIST= <valist>
##$VCLIST= <CCCCCCCCCCCCCCC>
##$VD= 0
##$VDLIST= <DDDDDDDDDDDDDDD>
##$VPLIST= <PPPPPPPPPPPPPPP>
##$VTLIST= <TTTTTTTTTTTTTTT>
##$WBST= 1024
##$WBSW= 4
##$XGAIN= (0..3)
0 0 0 0
##$XL= 0
##$YL= 0
##$YMAX_a= 10280623
##$YMIN_a= -5216348
##$ZGOPTNS= <>
##$ZL1= 120
##$ZL2= 120
##$ZL3= 120
##$ZL4= 120
##$ABSF1= 14.96662
##$ABSF2= -5.58591
##$ABSG= 5
##$ABSL= 3
##$ALPHA= 0
##$AQORDER= 0
##$ASSFAC= 0
##$ASSFACI= 0
##$ASSFACX= 0
##$ASSWID= 0
##$AUNMP= <proc_prof1d_extract.lims>
##$AXLEFT= 0
##$AXNAME= <>
##$AXNUC= <1H>
##$AXRIGHT= 0
##$AXTYPE= 0
##$AXUNIT= <>
##$AZFE= 0.1
##$AZFW= 0.1
##$BCFW= 0
##$BC_mod= 0
##$BYTORDP= 0
##$COROFFS= 0
##$CY= 15
##$DATMOD= 1
##$DC= 0
##$DFILT= <>
##$DTYPP= 0
##$F1P= 0
##$F2P= 0
##$FCOR= 0.5
##$FTSIZE= 131072
##$FT_mod= 6
##$GAMMA= 0
##$GB= 0
##$INTBC= 1
##$INTSCL= 1
##$ISEN= 128
##$LB= 0.3
##$LEV0= 0
##$LPBIN= 0
##$MAXI= 10000
##$MC2= 0
##$MEAN= 0
##$ME_mod= 0
##$MI= 0
##$NCOEF= 0
##$NC_proc= -3
##$NLEV= 6
##$NOISF1= 0
##$NOISF2= 0
##$NSP= 0
##$NTH_PI= 0
##$NZP= 0
##$OFFSET= 14.96662
##$PC= 1
##$PHC0= 37.07886
##$PHC1= 0
##$PH_mod= 1
##$PKNL= yes
##$PPARMOD= 0
##$PPDIAG= 0
##$PPIPTYP= 0
##$PPMPNUM= 2147483647
##$PPRESOL= 1
##$PSCAL= 4
##$PSIGN= 0
##$PYNMP= <proc.py>
##$REVERSE= no
##$SF= 400.130005597859
##$SI= 131072
##$SIGF1= 0
##$SIGF2= 0
##$SINO= 400
##$SIOLD= 131072
##$SPECTYP= <>
##$SREGLST= <1H.CDCl3>
##$SSB= 0
##$STSI= 131072
##$STSR= 0
##$SW_p= 8223.68421052632
##$SYMM= 0
##$S_DEV= 0
##$TDeff= 65536
##$TDoff= 0
##$TI= <>
##$TILT= no
##$TM1= 0
##$TM2= 0
##$TOPLEV= 0
##$USERP1= <user>
##$USERP2= <user>
##$USERP3= <user>
##$USERP4= <user>
##$USERP5= <user>
##$WDW= 1
##$XDIM= 131072
##$YMAX_p= 473790034
##$YMIN_p= -127458139
##$CURPLOT= <Network HP LaserJet P1505>
##$CURPRIN= <$Network HP LaserJet P1505>
##$DFORMAT= <normdp>
##$LAYOUT= <+/1D_H.xwp>
##$LFORMAT= <normlp>
##$PFORMAT= <normpl>
##$SURQMSG= 1
$$ End of Bruker specific parameters
$$ ---------------------------------
##NTUPLES= NMR SPECTRUM
##VAR_NAME=  FREQUENCY,     SPECTRUM/REAL,   SPECTRUM/IMAG
##SYMBOL=    X,             R,               I
##VAR_TYPE=  INDEPENDENT,   DEPENDENT,       DEPENDENT
##VAR_FORM=  AFFN,          ASDF,            ASDF
##VAR_DIM=   131072,        131072,          131072
##UNITS=     HZ,            ARBITRARY UNITS, ARBITRARY UNITS
##FACTOR=    0.0627417313425165, 1,          1
##FIRST=     8223.62146879498, -2802,        -88061
##LAST=      0,             -967,            -89681
##MIN=       0,             -127458139,      0
##MAX=       8223.62146879498, 473790034,    0
$$ Real data points
##PAGE= N=1
##DATA TABLE= (X++(R..R)), XYDATA
$$ [...]
63657D67516K119L598M467L975K639J069p58k519l087k116j042j277k274k627
63643D69683k434k872l815l656j698P26K135K720L467M366M455L449K401K499
63629D81426L568M271L775K818K695L532M196L940L206K630K163J723J774K412
63615E24129K619J521q0n53M66J822K513K516K098J418R23J054J358Q31n57j723
63599E40355k145k693m164n848o331n260l524k107j358j142j101p58O5R60J374
63584E06323J301J339K041L423N008O243O868P069P285P923R137J0753J2238J3057
63570F00008J3310J3816J5222J7192J8900K0158K1530K3368K5333K6910K7922
63559H23669K8513K9184L0840L4138L8492M2407M5038M6878M8527M9670M9949
$$ plain form
63657 467516 469635 473233 477700 481675 484314 485383 484625 482106 479019 476903 475861 474584 472310 469683
63643 469683 467249 464377 460562 456906 455208 455934 458069 460789 464256 468622 473077 476526 478927 481426
63629 481426 484994 489265 493040 495858 498553 502085 506281 510221 513427 516057 518220 519943 521717 524129
63615 524129 526748 528269 528189 527636 528102 529924 532437 534953 537051 538469 539392 540446 541804 542635 542078 540355
63599 540355 538210 535517 531353 525505 519174 513914 510390 508283 506925 505783 504682 503924 503989 504949 506323
63584 506323 507624 508963 511004 514427 519435 525678 532546 539615 546900 554823 563960 574713 586951 600008
63570 600008 613318 627134 642356 659548 678448 698606 720136 743504 768837 795747 823669
63559 823669 852182 881366 912206 946344 984836 1027243 1072281 1119159 1167686 1217356 1267305
63548A267305N0155N1332N2772N2002M7293L9481L0848K2665J4620O413r77o206
63536A627703r151j0982j2693j4315j5746j7671k0966k5541l0394l4701l8306
63525A397237m1097m2611m2514m1102l8929l6235l3014k9489k6224k3600k1310
63514A021112j8503j4671j0389o921m820l248j004K053N184Q083J1255J4867J7971
63501A020969J9467J9540J9769K1759K5789L0669L4743L7134L8211L9087M0895
63490A348032M4390M9666N5875O1494O5215O6277O3740N6341M4016K9102J4907
63479A899055L089o566j4004j8143j8764j7794j7703j9262k1653k4159k6901l0388
63467A686807l5031m0820m6862n1737n4890n7252n9704o1420o0655n6985n1913
$$ plain form
63548 1267305 1317460 1368792 1421564 1473566 1520859 1560340 1591188 1613853 1628473 1634886 1633909 1627703
63536 1627703 1618552 1607570 1594877 1580562 1564816 1547145 1526179 1500638 1470244 1435543 1397237
63525 1397237 1356140 1313529 1271015 1229913 1190984 1154749 1121735 1092246 1066022 1042422 1021112
63514 1021112 1002609 987938 977549 970628 965808 962560 961556 963609 968793 976876 988131 1002998 1020969
63501 1020969 1040436 1059976 1079745 1101504 1127293 1157962 1192705 1229839 1268050 1307137 1348032
63490 1348032 1392422 1442088 1497963 1559457 1624672 1690949 1754689 1811030 1855046 1884148 1899055
63479 1899055 1902144 1895578 1881574 1863431 1844667 1826873 1809170 1789908 1768255 1744096 1717195 1686807
63467 1686807 1651776 1610956 1564094 1512357 1457467 1400215 1340511 1279091 1218436 1161451 1109538
63456A109538m7304m3907m1383l8932l5885l2214k8649k5865k3706k1605j9487
63445G50601j7548j5504j2997j0653r598r673r340p805o303o324p397p669o335
63432F23455m473l455l482l763l499k312l65J517K265J653P55Q75K013K894K609
63417F16687J711J376J852K338K297K122K258K226J154r51l058m263m509m114
63403F17126l151j663j53P43R64J098J746L049M752O402P527Q005Q372R399J1159
63388F75375J2891J3998J4819J6008J7601J9289K1385K4565K8609L2312L5081
63377I11933L7846M1684M6136M9517N0491M8738M4671L9466L5014L2584L1530
63366A369610L0387K9300L0141L3796L8647M2572M5479M8801N3115N7367O0214
$$ plain form
63456 1109538 1062234 1018327 976944 938012 902127 869913 841264 815399 791693 770088 750601
63445 750601 733053 717549 704552 693899 684301 674628 665288 657483 651180 644856 637459 629790 623455
63432 623455 618982 615527 612045 608282 604783 602471 602106 603623 605888 607541 608296 609171 611184 614078 616687
63417 616687 618398 619774 621626 623964 626261 628383 630641 632867 634021 633070 630012 625749 621240 617126
63403 617126 613975 612312 612159 612902 613866 614964 616710 619759 624511 630913 638440 646445 654817 664216 675375
63388 675375 688266 702264 717083 733091 750692 769981 791366 815931 844540 876852 911933
63377 911933 949779 991463 1037599 1087116 1137607 1186345 1231016 1270482 1305496 1338080 1369610
63366 1369610 1399997 1429297 1459438 1493234 1531881 1574453 1619932 1668733 1721848 1779215 1839429
63355A839429O1062N9736N5894M9127L9398K7491J5136M327l899r865j4237j7156
63343B106443j8810k0192k2493k6068l0651l6170m2421m8389n2938n6082n8521
63332A693708n9999n9353n6389n2554m9235m6363m3254l9918l6797l3770l0170
63321A185906k5491j9827j3966r292o706n269k762J754O744J0389J3101J6706
63309A151287K1615K6279K9413L1506L3823L6849M0177M3279M6026M8830N2422
63298A561506N6945O1295O3897O4186O2630N9360N3743M5621L5950K5648J4662
63287B105443L028p836j5815j9909k0808k0189k0138k2573k7951l4539l9992m3736
63275A834985m7017n0685n4080n6250n7130n6977n5704n3421n0738m7759m3661
$$ plain form
63355 1839429 1900491 1960227 2016121 2065248 2104646 2132137 2147273 2151600 2147701 2137836 2123599 2106443
63343 2106443 2087633 2067441 2044948 2018880 1988229 1952059 1909638 1861249 1808311 1752229 1693708
63332 1693708 1633709 1574356 1517967 1465413 1416178 1369815 1326561 1286643 1249846 1216076 1185906
63321 1185906 1160415 1140588 1126622 1117330 1110624 1105355 1102593 1104347 1111091 1121480 1134581 1151287
63309 1151287 1172902 1199181 1228594 1260100 1293923 1330772 1370949 1414228 1460254 1509084 1561506
63298 1561506 1618451 1679746 1743643 1807829 1870459 1929819 1983562 2029183 2065133 2090781 2105443
63287 2105443 2108471 2100635 2084820 2064911 2044103 2023914 2003776 1981203 1953252 1918713 1878721 1834985
63275 1834985 1787968 1737283 1683203 1626953 1569823 1512846 1457142 1403721 1352983 1305224 1261563
63264A261563l8128l2445k8044k4648k1276j8599j8558k1591k5733k8911l0650
63253I72980l1047k9797k7211k4901k3916k3146k1083j8376j6935j6880j6364
63242G23324j4569j2921j2621j2594j1107q314o000n439o574q722j0921j1963
63230F01579j1231r461p894o798n650m448l755l481k815j590o65n67p87q67j186
63215E40384j903k173j363l40l73j194j303q8J566K859M043N497O748P136O876
63200E66372O761P092P317O846N931N676O938R178J0921J1699J2869J5572J8482
63187F91654J9191J7726J6843J8210K0199K0796K0995K3222K7345L0677L1858
63176I38716L2409L3872L5429L5501L4250L3184L3140L3831L4751L5369L4965
$$ plain form
63264 1261563 1223435 1190990 1162946 1138298 1117022 1098423 1079865 1058274 1032541 1003630 972980
63253 972980 941933 912136 884925 860024 836108 812962 791879 773503 756568 739688 723324
63242 723324 708755 695834 683213 670619 659512 651198 645198 639759 633185 624463 613542 601579
63230 601579 590348 580887 572993 566195 560545 556097 552342 548861 546046 544456 543791 543224 542437 541570 540384
63215 540384 538481 536308 534945 534605 534232 533038 531735 531647 533213 536072 540115 545612 552360 559496 566372
63200 566372 573133 580225 587542 594388 600319 605995 612933 622111 633032 644731 657600 673172 691654
63187 691654 710845 728571 745414 763624 783823 804619 825614 848836 876181 906858 938716
63176 938716 971125 1004997 1040426 1075927 1110177 1143361 1176501 1210332 1245083 1280452 1315417
63165A315417L3381L1773L1543L2504L3033L2118L0424K8974K7522K4714J9667
63154A641070J2993O242M81m479r457j4744j9942k4797k9448l3629l6367l7110
63142A450813l6563l5672l4218l1402k7414k3242j9037j3981q143l097O4K206
63130A220314M633P029Q330R030J0932J4391J7437J8312J7750J7774J9119K0914
63118A385965K2326K3248K3477K2522K0541J8446J6661J4545J1541P980M130p24
63106A570658p130j4023j9639k3739k7737l2384l6637l9219m0261m0574m0153
63095A249162l8425l5571l2570l0062k8029k6591k6179k6591k6596k5048k2107
63084I31393j8887j6159j3867j1738r787q053o361m737l777l979m705m490k696
$$ plain form
63165 1315417 1348798 1380571 1412114 1444618 1477651 1509769 1540193 1569167 1596689 1621403 1641070
63154 1641070 1654063 1660305 1660786 1656307 1646850 1632106 1612164 1587367 1557919 1524290 1487923 1450813
63142 1450813 1414250 1378578 1344360 1312958 1285544 1262302 1243265 1229284 1221141 1218044 1218108 1220314
63130 1220314 1224947 1231976 1240306 1249336 1260268 1274659 1292096 1310408 1328158 1345932 1365051 1385965
63118 1385965 1408291 1431539 1455016 1477538 1498079 1516525 1533186 1547731 1559272 1567252 1571382 1570658
63106 1570658 1563528 1549505 1529866 1506127 1478390 1446006 1409369 1370150 1329889 1289315 1249162
63095 1249162 1210737 1175166 1142596 1112534 1084505 1057914 1031735 1005144 978548 953500 931393
63084 931393 912506 896347 882480 870742 860955 852902 846541 841804 838027 834048 829343 824853 822157
63071H22157l65J023J312J515K209K841K732K133J910K620M104N733O831P076
63057H63831O649N830M720L642L420M537O108O673N979N089M588L935K993K745
63043I30739L553L960K571M06j28J679M159N573N845N890O244O685O431M755K132
63028I90494N42J572M196N642M781L494M153O740R166R792Q897Q129R057J1941
63014A078596J5554J8417K0363K2294K4422K5748K5800K5900K7718L1120L4474
63003A350406L6948L9419M2938M7153N0806N3502N6339O0591O5987P0848P4197
62992A949134P7055Q0858Q4818Q6227Q3924Q0397P9356Q1717Q4922Q6045Q4528
62981B858981Q1827P9446P7906P6941P5858P3650O9349O2660N4205M4907L5053
$$ plain form
63071 822157 821792 822815 824127 825642 827851 830692 833424 835557 837467 840087 844191 849924 856755 863831
63057 863831 870480 876310 881030 884672 888092 892629 898737 905410 911389 916478 921066 925001 927994 930739
63043 930739 934292 938252 940823 941229 941101 942780 946939 952512 958357 964247 970491 977176 983607 988362 990494
63028 990494 991036 992608 996804 1002446 1007227 1010721 1014874 1021614 1030780 1040572 1049469 1057598 1066655 1078596
63014 1078596 1094150 1112567 1132930 1155224 1179646 1205394 1231194 1257094 1284812 1315932 1350406
63003 1350406 1387354 1426773 1469711 1516864 1567670 1621172 1677511 1738102 1804089 1874937 1949134
62992 1949134 2026189 2107047 2191865 2278092 2362016 2442413 2521769 2603486 2688408 2774453 2858981
62981 2858981 2940808 3020254 3098160 3175101 3250959 3324609 3393958 3456618 3510823 3555730 3590783
62970C590783K4040J1131l563j9049l4187m8278o0853p1337p9153q4125q6634
62959C138775q7294q6412q3738p8958p2455o5255n8012n0485m2347l3963k5838
62948B454018j7814r682k140L933Q964J4154J9601K4237K7786L1136L4307L5748
62936B624248L4662L2640L1649L1582L1155L0094K8696K6157K1381J5061Q915
62925B916240K880m918j5134k6144l6584m6888n7284o6103p1685p4761p7225p9431
62913B362963q0361p9917p9081p7836p4785o9470o3584n8960n5292n0984m5757
62902A626936m1198l8626l7393l5844l3433l1276l0507l0788l0775k9780k8289
62891A259027k6864k5358k3696k2757k3415k4763k4485k1634j8220j7102j8500
$$ plain form
62970 3590783 3614823 3625954 3622391 3603342 3569155 3520877 3460024 3388687 3309534 3225409 3138775
62959 3138775 3051481 2965069 2881331 2802373 2729918 2664663 2606651 2556166 2513819 2479856 2454018
62948 2454018 2436204 2426522 2424382 2428315 2437279 2451433 2471034 2495271 2523057 2554193 2588500 2624248
62936 2624248 2658910 2691550 2723199 2754781 2785936 2816030 2844726 2870883 2892264 2907325 2916240
62925 2916240 2919120 2914202 2899068 2872924 2836340 2789452 2732168 2666065 2594380 2519619 2442394 2362963
62913 2362963 2282602 2202685 2123604 2045768 1970983 1901513 1837929 1778969 1723677 1672693 1626936
62902 1626936 1585738 1547112 1509719 1473875 1440442 1409166 1378659 1347871 1317096 1287316 1259027
62891 1259027 1232163 1206805 1183109 1160352 1136937 1112174 1087689 1066055 1047835 1030733 1012233
62880A012233j9739j8528j5535j3083j2293j2407j2490j2421j2127j1062r104
62869H63444p223o415o428o241n396m253l206k517k656l791m880m283j819N77
62855H04913Q06j170l557m768m728m399m561n106n268m607l750l729m534m902
62841G50640m055k912k891l936m649m152k833j385j27N83L87k95n76n63j375l034
62825G18827l612j697J289K816K579K319K665K329Q63k6Q62J954R93j569l107
62810G27485k330n36O56J177J677J997J385k64k003k529j219J216L049K953J278
62795G33992l63o90K75J621K381K058Q72m46j371j906j902p40J514L222K774Q14
62779G42105m81l72k58j071j687q86N54J080P88J102K463L692L659K621J777K109
$$ plain form
62880 1012233 992494 973966 958431 945348 933055 920648 908158 895737 883610 872548 863444
62869 863444 856221 849806 843378 837137 831741 827488 824282 821765 819109 815318 810438 806155 804336 804913
62855 804913 805719 804549 800992 796224 791496 787097 782536 777430 772162 767555 763805 760076 755542 750640
62841 750640 746585 743673 740782 736846 732197 728045 725212 723827 723700 724283 724670 724375 723799 723236 721861 718827
62825 718827 715215 713518 714807 717623 720202 722521 725186 727515 728378 728352 729214 731168 732161 730592 727485
62810 727485 725155 724619 725275 726452 728129 730126 731511 731247 729244 726715 725496 726712 729761 732714 733992
62795 733992 733629 732939 733214 734835 737216 739274 740146 739700 738329 736423 734521 733781 735295 738517 741291 742105
62779 742105 741624 741252 740994 739923 738236 737350 737904 738984 739772 740874 743337 747029 750688 753309 755086 757195
62763G57195L672N567O671O783O749P172P592P506P541Q702J0784J2498J3057
62750H61489J2842J2586J2743J3637J5400J7486J8892J9200J9151J9935K2058
62739A045419K4890K7324K8974L0594L2954L5613L7706L9890M4095N0760N7684
62728A455903O2799O6850P1948P8408Q4847R0766R6989J03552J09158J13102J16048
62717B450370J18381J19253J17804J13992J07544R7367Q2916O5202M5801K5810
62707C344440O302j1474k7367m2773n8623p3661q5849r4940j02348j08779j13162
62696B631766j14233j12326j09156j06181j03353r9445r3627q6570p9814p4156
62686A652905o9224o4482n9897n5490n1108m6877m3112l9506l5316l0705k6905
$$ plain form
62763 757195 760867 766434 773105 779888 786637 793809 801401 808907 816448 825150 835934 848432 861489
62750 861489 874331 886917 899660 913297 928697 946183 965075 984275 1003426 1023361 1045419
62739 1045419 1070309 1097633 1126607 1157201 1190155 1225768 1263474 1303364 1347459 1398219 1455903
62728 1455903 1518702 1585552 1657500 1735908 1820755 1911521 2008510 2112062 2221220 2334322 2450370
62717 2450370 2568751 2688004 2805808 2919800 3027344 3124711 3207627 3272829 3318630 3344440
62707 3344440 3350742 3339268 3311901 3269128 3210505 3136844 3050995 2956055 2853707 2744928 2631766
62696 2631766 2517533 2405207 2296051 2189870 2086517 1987072 1893445 1806875 1727061 1652905
62686 1652905 1583681 1519199 1459302 1403812 1352704 1305827 1262715 1223209 1187893 1157188 1130283
62675A130283k4531k2701k0436j7890j5477j2862r813p061n106l078j46K723L935
62662I97840L770M100N817Q162J0493J3103J6003J8506K0517K2912K6060K9221
62650A176504L2065L5487M0073M4796M8485N1753N6246O2367O8889P4577P9232
62639A770474Q3081Q6078Q7982Q8541Q7527Q5077Q1947P8540P3650O5026N1858
62628B639781L6019K0191N190r975k5642m0373n2716o2988p2321q0501q6056q8512
62616B182097q9311q9937r0038q8286q4520q0020p5821p1684o6950o1638n6387
62605A327505n1774m8136m5604m3843m1863l8653l4227k9699k6106k3375k0768
62594I23457j8162j6257j5374j4765j3709j2648j2360j2310j1197r119p824q170
$$ plain form
62675 1130283 1105752 1083051 1062615 1044725 1029248 1016386 1006573 999512 994406 991328 991182 993905 997840
62662 997840 1001610 1005710 1011527 1019689 1030182 1043285 1059288 1077794 1098311 1121223 1147283 1176504
62650 1176504 1208569 1244056 1284129 1328925 1377410 1429163 1485409 1547776 1616665 1691242 1770474
62639 1770474 1853555 1939633 2027615 2116156 2203683 2288760 2370707 2449247 2522897 2587923 2639781
62628 2639781 2675800 2695991 2701181 2691206 2665564 2625191 2572475 2509487 2437166 2356665 2270609 2182097
62616 2182097 2092786 2002849 1912811 1824525 1740005 1659985 1584164 1512480 1445530 1383892 1327505
62605 1327505 1275731 1227595 1181991 1138148 1096285 1057632 1023405 993706 967600 944225 923457
62594 923457 905295 889038 873664 858899 845190 832542 820182 807872 796675 787556 779732 771562
62582G71562q681p677n828n038n473n306l415r07N07M22m02j133j263o82J13M35
62566G27234M71J269L203N190N978N656N179N065N330O189P779R395J0169J0451
62552H08558J1558J3864J6207J7639J8823K0900K3636K5822K7224K9017L2044
62541A045292L5571L8388M0563M3363M7585N2471N6394N8261N8133N6681N4230
62530A586932N0368M4598L7321K9824K3042J6467Q686j050j1937k2283l0749l7001
62518A694218m1543m5080m7935m9975n1114n1624n1776n1293m9581m6492m2693
62507A165112l9252l6969l5758l4549l2101k8407k4865k2548k0837j8447j5423
62496H55956j2994j1707j0951j0337j0137j0033q904o553m380l411k855j653l86
$$ plain form
62582 771562 762881 755204 749376 744338 738865 733559 730144 729237 729744 730166 729764 728631 727368 726686 726799 727234
62566 727234 727705 728974 732177 737367 743345 749001 754180 759245 764575 770764 778543 787938 798107 808558
62552 808558 820116 833980 850187 867826 886649 907549 931185 957007 984231 1013248 1045292
62541 1045292 1080863 1119251 1159814 1203177 1250762 1303233 1359627 1417888 1476021 1532702 1586932
62530 1586932 1637300 1681898 1719219 1749043 1772085 1788552 1797238 1796188 1784251 1761968 1731219 1694218
62518 1694218 1652675 1607595 1559660 1509685 1458571 1406947 1355171 1303878 1254297 1207805 1165112
62507 1165112 1125860 1088891 1053133 1018584 986483 958076 933211 910663 889826 871379 855956
62496 855956 842962 831255 820304 809967 799830 789797 780893 774340 769960 766549 763694 762041 761655
62483G61655j62m43L90K599M787O030O869P860Q407P666N930M533M698O649R557
62468H37025J2280J4416J6465J8803K0983K2630K4433K7398L1401L5443L9093
62457A100370M2695M6194M8885N0540N1912N3686N5462N6010N4242M9972M4211
62446A654179L8445L3144K7254J9796J1532M155j730o705j1025j4346j6798j8878
62434A719023k0097j9222j6141j2097p681k075N063J2400J8474K3392K8093L2966
62422A762098L7994M3299M8573N2836N5554N7320N8673N9046N7609N4167M8456
62411B335625L9766K8368J6291N256n344j7079k9770m1681n1856o0585o7803p2733
62399B078455p5334p6710p7711p8146p7539p5583p1837o6093n9394n3543m9195
$$ plain form
62483 761655 761493 761050 761440 764039 768826 774856 781725 789585 797992 805658 811588 816121 820819 827468 837025
62468 837025 849305 863721 880186 898989 919972 942602 967035 994433 1025834 1061277 1100370
62457 1100370 1143065 1189259 1238144 1288684 1340596 1394282 1449744 1505754 1559996 1609968 1654179
62446 1654179 1692624 1725768 1753022 1772818 1784350 1788505 1786775 1780070 1769045 1754699 1737901 1719023
62434 1719023 1698926 1679704 1663563 1651466 1643785 1641710 1646773 1659173 1677647 1701039 1729132 1762098
62422 1762098 1800092 1843391 1891964 1944800 2000354 2057674 2116347 2175393 2233002 2287169 2335625
62411 2335625 2375391 2403759 2420050 2425306 2419962 2402883 2373113 2331432 2279576 2218991 2151188 2078455
62399 2078455 2003121 1926411 1848700 1770554 1693015 1617432 1545595 1479502 1420108 1366565 1317370
62388A317370m5286m0728l5726l1023k6772k2790j9311j6765j5106j3884j2734
62377A037245j1476r961q109o080m291l392l959n878q118r601j0257j0854j1819
62364I33450j2797j3319j3374j3216j3063j3043j3033j2513j1075r158p806p646
62352G93407q286q808q498p255n708m718m461m177l315k475k529l174l234k278
62338G24491r25M24K014L720M706M583M130M231M777N149N236N492O302P631R046
62323G91007R984J0352J0900J2415J4567J6284J7250J8141J9221J9900K0147K1238
62311I81406K4283K8758L3275L7176M0546M3421M5947M8932N3237N8852O5087
62300A460920P1443P7574Q2981Q7434R1308R4698R6618R5915R2499Q6728P8074
$$ plain form
62388 1317370 1272084 1231356 1195630 1164607 1137835 1115045 1095734 1078969 1063863 1049979 1037245
62377 1037245 1025769 1015808 1007699 1001619 997328 993936 989977 984099 975981 966380 956123 945269 933450
62364 933450 920653 907334 893960 880744 867681 854638 841605 829092 818017 808859 801053 793407
62352 793407 785121 776313 767815 760560 754852 750134 745673 741496 738181 735706 733177 730003 726769 724491
62338 724491 723566 723990 726004 729724 734430 739013 743143 747374 752151 757300 762536 768028 774330 781961 791007
62323 791007 800991 811343 822243 834658 849225 865509 882759 900900 920121 940021 960168 981406
62311 981406 1005689 1034447 1067722 1104898 1145444 1188865 1234812 1283744 1336981 1395833 1460920
62300 1460920 1532363 1609937 1692918 1780352 1871660 1966358 2062976 2158891 2251390 2338118 2416192
62289B416192O5776N0671L5032K0471P113n046j5541k4789l4610m6148n7919o7011
62277B344191p2041p4126p5118p5706p5345p3376o9774o5023n9573n3695m7825
62266A602589m2720l8935l6269l4149l2363l1025k9938k8710k7581k7426k8650
62255A244823l0563l2119l2620l1551k8617k4541k1065j9338j8702j7796j6315
62244I71596j4817j3292j1261r138q079q082p473n037j831M9p4j127k005k545
62230H86884k768k106L3L323O549Q575R179R046R077R689J0691J1777J2885J4060
62216I86894J5214J6225J7067J7740J8306J9256K1475K5347L0050L4259L7545
62205A239378M0620M4244M8472N3099N8232O4104P0635P7518Q4391R0680R5660
$$ plain form
62289 2416192 2481968 2532639 2567671 2588142 2595255 2590209 2574668 2549879 2515269 2469121 2411202 2344191
62277 2344191 2272150 2198024 2122906 2047200 1971855 1898479 1828705 1763682 1704109 1650414 1602589
62266 1602589 1559869 1520934 1484665 1450516 1418153 1387128 1357190 1328480 1300899 1273473 1244823
62255 1244823 1214260 1182141 1149521 1117970 1089353 1064812 1043747 1024409 1005707 987911 971596
62244 971596 956779 943487 932226 923088 915009 906927 899454 894417 892586 892635 892561 891434 889429 886884
62230 886884 884116 882010 882043 885366 891915 900490 909669 918715 927792 937481 948172 959949 972834 986894
62216 986894 1002108 1018333 1035400 1053140 1071446 1090702 1112177 1137524 1167574 1201833 1239378
62205 1239378 1279998 1324242 1372714 1425813 1484045 1548149 1618784 1696302 1780693 1871373 1967033
62194A967033R8925J00497J00092R6690Q9334P8330O5141N1142L6822K2197P644
62183B713847n912j7534k7069l5473m4159n3855o3999p3271q0408q4604q5702
62172B141861q4440q2128p9533p6302p1867o6572o1347n6599n2108m7913m4433
62161A418619m1710l9292l6957l4856l2893l0736k8659k7446k7049k6220k4037
62150A068764k1096j8395j5798j2610r221o977o355o255n384l656j872n72M21
62137I60994J627L446N805Q148R897J1096J2312J3847J5316J6190J6560J7127
62125A092365J8445K0323K1928K2495K2034K1320K1155K1614K2195K2564K3031
62114A329469K4327K7056L1165L5783L9799M2976M6255N0590N5652O0404O4651
$$ plain form
62194 1967033 2065958 2166455 2266547 2363237 2452571 2530901 2596042 2647184 2684006 2706203 2713847
62183 2713847 2707935 2690401 2663332 2627859 2583700 2529845 2465846 2392575 2312167 2227563 2141861
62172 2141861 2057421 1975293 1895760 1819458 1747591 1681019 1619672 1563073 1510965 1463052 1418619
62161 1418619 1376909 1337617 1300660 1265804 1232911 1202175 1173516 1146070 1119021 1092801 1068764
62150 1068764 1047668 1029273 1013475 1000865 991644 984667 978312 972057 966673 963017 961145 960573 960994
62137 960994 962621 966067 971872 980020 989917 1001013 1013325 1027172 1042488 1058678 1075238 1092365
62125 1092365 1110810 1131133 1153061 1175556 1197590 1218910 1240065 1261679 1283874 1306438 1329469
62114 1329469 1353796 1380852 1412017 1447800 1487599 1530575 1576830 1627420 1683072 1743476 1808127
62103A808127O8994P2859P3745O9525O0931N0700M0452K9716J8069O853k327r924
62091B287720j7989k7436l6899m4544n0073n4366n7866o0126o0682n9465n6359
62080A761915n1203m4682l8577l4447l2164l0217k7380k3715j9945j6376j2752
62069A430457q907n213k327n67M78J659L421N180N689M238J376j653m001n473
62055A424357n860m736k314l6L61j548m676p911j1084j4138j6102j5796j3422
62042A327095j0550q370o728n101l630k636j795o02P37J771K888M944P802J0186
62028A316011J1290J1695J2311J3132J3635J3861J4408J5708J7832K0657K3734
62017A484274K6432K8797L1765L5612L8753L9359L8161L8160M1096M5488M8856
$$ plain form
62103 1808127 1877121 1949980 2023725 2093250 2154181 2204881 2245333 2275049 2293118 2299971 2297644 2287720
62091 2287720 2269731 2242295 2205396 2160852 2110779 2056413 1998547 1938421 1877739 1818274 1761915
62080 1761915 1710712 1666030 1627453 1593006 1560842 1530625 1503245 1479530 1459585 1443209 1430457
62069 1430457 1421550 1416337 1414010 1413443 1413921 1415580 1419001 1424181 1429870 1434108 1435484 1433831 1429830 1424357
62055 1424357 1418497 1413761 1411447 1411411 1411772 1410224 1405548 1397637 1386553 1372415 1356313 1340517 1327095
62042 1327095 1316545 1308175 1301447 1296346 1292716 1290080 1288285 1287683 1288420 1290191 1293079 1298023 1305825 1316011
62028 1316011 1327301 1338996 1351307 1364439 1378074 1391935 1406343 1422051 1439883 1460540 1484274
62017 1484274 1510706 1539503 1571268 1606880 1645633 1684992 1723153 1761313 1802409 1847897 1896753
62006A896753N0689N2123N3748N5176N6153N6424N4656M9180M0240L0043K0069
61995B415254R674j767j2732k1051k6878l2586l9795m7822n5103o0856o4898o7007
61983A994433o7358o6946o6614o5963o3973o0636n7260n4831n2619m8965m3442
61972A345826l7712l3883l2223l1091k9100k6685k5011k3931k2075j8875j5577
61961A049663j3769j3613j4018j4057j3582j2832j2145j1938j2366j2879j2616
61950I05848j1379r862q737p924o965n800m713l749k572j025N33J619K024J762
61936H49060Q82k87j052j082j131k307m448n946n735m805n012o710q504r236r178
61921G84509r142r285r272q957q384p620o936o645o396n281l255j736j982l348
$$ plain form
62006 1896753 1947442 1999565 2053313 2108489 2164642 2221066 2275722 2324902 2365142 2395185 2415254
61995 2415254 2424928 2423161 2410429 2389378 2362500 2329914 2290119 2242297 2187194 2126338 2061440 1994433
61983 1994433 1927075 1860129 1793515 1727552 1663579 1602943 1545683 1490852 1438233 1389268 1345826
61972 1345826 1308114 1274231 1242008 1210917 1181817 1155132 1130121 1106190 1084115 1065240 1049663
61961 1049663 1035894 1022281 1008263 994206 980624 967792 955647 943709 931343 918464 905848
61950 905848 894469 884607 875870 867946 860981 855181 850468 846719 844147 843122 843655 845274 847298 849060
61936 849060 849942 849655 848603 847521 846390 844083 839635 833689 827954 823149 818137 811427 802923 793687 784509
61921 784509 775367 766082 756810 747853 739469 731849 724913 718268 711872 706591 703336 701600 699618 696270
61907F96270m183m092m093m647m828l962k902k805l379l245j773K32J590J910
61893F60093J694J758K561L844M942N693O711Q419J0196J1146J1455J2267J4148
61880G54927J6406J8113J9038J9309J8940J8181J7693J7753J7731J6972J5671
61869I50734J4328J2963J1625J1050J1529J1595R379N288J768Q2j061k963m654
61856A031663m402k322m2J534K711L801M796N924P374Q740R779J1229J3553J5366
61842A109704J4711J1685Q122M911J404k342m945n878o424p583q815r695j0987
61829A093868j2794j3539j2376j1039j1418j2670j2871j2338j2908j4529j5238
61818I52148j4357j3287j2799j1956j0320r115r233r817r928r927j0005q789n129
$$ plain form
61907 696270 692087 687995 683902 679255 674427 670465 667563 664758 661379 658134 656361 656593 658183 660093
61893 660093 661787 663545 666106 669950 674892 680585 687296 695715 705911 717057 728512 740779 754927
61880 754927 771333 789446 808484 827793 846733 864914 882607 900360 918091 935063 950734
61869 950734 965062 978025 989650 1000700 1012229 1023824 1033203 1038491 1040259 1040341 1039280 1036317 1031663
61856 1031663 1027261 1024939 1024897 1026431 1029142 1032943 1037739 1043663 1051037 1059777 1069556 1080785 1094338 1109704
61842 1109704 1124415 1136100 1144222 1149133 1150537 1148195 1143250 1137372 1130948 1123365 1114550 1104855 1093868
61829 1093868 1081074 1067535 1055159 1044120 1032702 1020032 1007161 994823 981915 967386 952148
61818 952148 937791 924504 911705 899749 889429 880314 871081 861264 851336 841409 831404 822615 817486
61805H17486l54K911L848L976M833O410Q125J0124J2914J6245J9001K0379K0840
61792I46738K1636K3358K5391K6969K8201K9442L0081K9080K6637K4216K2591
61781A234340K0795J7557J2975Q189M056P58j839m052o214q016q487p120m741
61768A258201k672j243K69K503N320Q120J0303J1351J0792Q291L921j548o805
61755A306803j0957j4287j7619k0958k3483k4986k6335k7959k8782k7536k4727
61744A059174k2380k1869k2630k2983k1801j9352j6879j5443j5083j5061j4773
61733H50920j4083j2882j0998q722o827n826n568n689n901n760m915l747k990
61720G57012k469j272M45R84p02l359m889m682l539k044j82J840L452M192L687
$$ plain form
61805 817486 817132 820043 823891 827867 832700 839110 847235 857359 870273 886518 905519 925898 946738
61792 946738 968374 991732 1017123 1044092 1072293 1101735 1131816 1160896 1187533 1211749 1234340
61781 1234340 1255135 1272692 1285667 1293856 1297912 1298670 1296831 1292779 1286565 1278549 1270062 1262942 1258201
61768 1258201 1255529 1254286 1254555 1257058 1262378 1270498 1280801 1292152 1302944 1311235 1315156 1313608 1306803
61755 1306803 1295846 1281559 1263940 1242982 1219499 1194513 1168178 1140219 1111437 1083901 1059174
61744 1059174 1036794 1014925 992295 969312 947511 928159 911280 895837 880754 865693 850920
61733 850920 836837 823955 812957 804235 797408 791582 786014 780325 774424 768664 763749 760002 757012
61720 757012 754543 753271 753716 754700 753998 750639 745750 741068 737529 735485 735303 737143 740595 744787 748474
61705G48474J746p96k162j536j37O60J286K620L742L114J495J385L456N658O215
61690G75220N479M284K499K63j159j145r59j912l303l575k618j681j535j927k389
61675G65542k600k310j711j507j908k079j354l42J3j95k70l7M55J634L498M659
61659G61488L887K330K410M320N405L681N68r34J58K080K630J266r23k489k816
61644G83061k504k663l735n094n880n838n224m365l608l365l660l863l325k315
61630G27622j846k559m049n424o160o222n621m325k706j634j779k841l837m122
61616F74497l902l628l287k529j323o9P98J090P43k24j484k398k465j804j073
61601F52942q18r19q08k69J84j6o38r01n51j26j8J52P74J417J414J043J400L047
$$ plain form
61705 748474 750220 749424 747262 745726 745589 746249 747535 750155 753897 757011 758506 759891 763347 769005 775220
61690 775220 780699 784983 787482 787745 786586 785441 784482 782570 779267 775692 773074 771393 769858 767931 765542
61675 765542 762942 760632 758921 757414 755506 753427 752073 751731 751744 751549 751279 751242 751697 753331 756829 761488
61659 761488 765375 767705 770115 774435 779840 783521 784089 783155 783313 785393 788023 789289 788366 785877 783061
61644 783061 780557 777894 774159 769065 763185 757347 752123 747758 744150 740785 737125 733262 729937 727622
61630 727622 725776 723217 719168 713744 707584 701362 695741 691416 688710 687076 685297 682456 678619 674497
61616 674497 670595 666967 663680 661151 659828 659759 660557 661647 662390 662166 660682 658284 655819 654015 652942
61601 652942 652124 651205 650397 650128 650312 650296 649658 648757 648206 648080 648062 648214 648988 650405 651819 652862 654262 657309
61583F57309N261O691O419M507J983L22L62J543K549K678K129J058q31l411n615
61568F82954o403n860m832l873l141k940l558m628n327n307m769l729k001j33
61554F26453N41o37k613l769l744l622m370n697o379n438l106r12o18k561n196
61539E78332o668o631o148o106o497p049p652q011p676o730n823n282m871m566
61525D88622m709n078m723l307j792j101q87m36L2o5m81o51p96j377j873j478
61509D59900o76o56j317j397o24o4o7M20J820K881K644J974J949J964Q93o92j148
61492D67804o8J392K293K716K804K331J424Q39J166K284L558M093L045M45k301
61477D93825l542l021j819p83J35R31R70j87j840k627j840j74P47j99k346l525
$$ plain form
61583 657309 662570 669261 675680 680187 682170 682492 682854 684397 686946 689624 691753 692811 691980 688569 682954
61568 682954 676551 670691 665859 661986 658845 655905 652347 647719 642392 637085 632316 628587 626586 626453
61554 626453 626994 626357 623744 619975 616231 612609 608239 602542 596163 590725 587619 586707 586089 583528 578332
61539 578332 571664 565033 558885 552779 546282 539233 531581 523570 515894 509164 503341 498059 493188 488622
61525 488622 483913 478835 474112 470805 469013 467912 467025 466589 466621 466556 466075 465424 464628 463251 461378 459900
61509 459900 459224 458568 457251 455854 455230 455166 455099 455519 457339 460220 462864 464838 466787 468751 469644 468952 467804
61492 467804 467736 469128 471421 474137 476941 479272 480696 481535 482701 484985 488543 492636 495681 496126 493825
61477 493825 490283 487262 485443 484660 484795 485726 486696 486509 484669 482042 480202 480028 480775 480576 478230 474705
61461D74705k144J051L708M202K800O68j406l089l923l339j289J269K723K072
61447D78008J05j080k63J456J957P12o81n52R37K202K057P84l92o38j90L30J003
61430D85755K414M254N114M283K953K640L011K501P81p53r65j73Q61J870K623
61415E17169K652K117J972K582K898J804k72j763j677l76J015J534J022K07j53
61400E30731k24p79j829k404j928j018m73k05J97N99P16Q59J545K628L490L799
61384E35704L593K860J619J87r53j392p92P76K336K703K122K197L531M476L437
61369E62404J460J042K693M393M479L532K930K851K506J515K59o51p74lJ146J732
61353E91514J246J19p58q40k56L61L08n55j568j995j934k069k615l086l182l139
$$ plain form
61461 474705 472561 473612 477320 481522 484322 484990 483584 480495 476572 473233 471944 473213 475936 478008
61447 478008 478113 477033 476770 478226 480183 480895 480214 479662 480599 482801 484858 485642 485250 484612 484422 484752 485755
61430 485755 488169 492423 497537 501820 504773 507413 510424 512925 513706 512953 511988 511815 512676 514546 517169
61415 517169 519821 521938 523910 526492 529390 531194 530922 529159 527482 527106 528121 529655 530677 530884 530731
61400 530731 530507 529728 527899 525495 523567 522549 522076 521871 522068 522667 523383 524242 525787 528415 531905 535704
61384 535704 539297 542157 543776 543963 543010 541618 540826 541602 543938 546641 548763 550960 554491 558967 562404
61369 562404 563864 564906 567599 571992 576471 580003 582933 585784 588290 589805 590064 589413 588639 588636 589782 591514
61353 591514 592760 592879 592121 591281 591025 591386 591694 591139 589571 587576 585642 583573 580958 577872 574690 571551
61337E71551l003k310r59J83K36m46o69N9R43R61Q1p95q18R1J382K465L014K906
61319E74872K191J177L73P8K51Q26J878L229M250M505M297M071L574K344R04M65
61303F09285J236K029K089K387M135O576P551O293M539M356N736P103P611P964
61289F78890Q953J0162J0599J0026Q999P932O800N801N529O197P154P594P312
61276G81948O435M962L151J973K194L119L177K024J100J559K514K306R01k01l85
61261H16777q66k688m853n465m070j742Q03L763O833Q696Q760Q355R112J0815
61247H54230J2056J2504J3111J4150J4574J3733J2365J1148R399O186K024j574
61235I73906l787m897n416n736o360p611r011r680r387q754q487q815r408r404
$$ plain form
61337 571551 568548 566238 565279 565462 565698 565252 564583 564642 565585 566546 566627 565832 565014 565105 566487 568952 571966 574872
61319 574872 577063 578240 578613 578691 578942 579768 581646 584875 589125 593630 597927 601998 605572 607916 608820 609285
61303 609285 610521 612550 614639 617026 621161 627737 635288 641581 646120 650476 656212 663315 670926 678890
61289 678890 687843 698005 708604 718630 727629 735561 742361 748162 753691 759888 767042 774636 781948
61276 781948 788383 793345 796496 798469 800663 803782 806959 808983 810083 811642 814156 816462 817363 817162 816777
61261 816777 815911 813223 808370 802905 798835 797093 797896 801659 808492 817188 825948 834303 843415 854230
61247 854230 866286 878790 891901 906051 920625 934358 946723 957871 967270 973456 975480 973906
61235 973906 970119 965222 959806 954070 947710 940099 931088 921408 912021 903267 894780 885965 876557 867153
61221H67153p978n535l874m173n107m030j07M706P876Q530P422N762M568M305
61207H79518M580M600M226M082M504N084N494N957O570O974P070P228P379O706
61193I59972M866K743J359P85P00J160J911J915O67o92q70k80q8J5J211K959L079
61176I81412Q06j974l316l377l096k344p17J061K136K947M163N028M534L670M401
61161I95334O560P858P233O142N877N738M991M706N855P067O353M222K992L489
61147A074417M451N005N546N990N329L707L069M669P372R507J0982J2375J3292
61134A165711J3318J3523J5055J6687J5763J1809P544N671N908N934M380J982
61122A283285J38q54j842l428m938n240m432l915m496n209m815l769l581m578
$$ plain form
61221 867153 859175 853640 849766 845593 840486 836456 836349 841055 848931 857461 864883 870645 875213 879518
61207 879518 884098 888698 892924 897006 901510 906594 912088 918045 924615 931589 938659 945887 953266 959972
61193 959972 964838 967581 968940 969725 970425 971585 973496 975411 976078 975386 974516 974236 974148 974163 975374 978333 981412
61176 981412 982218 980244 976928 973551 970455 968111 967394 968455 970591 973538 977701 982729 987263 990933 995334
61161 995334 1001894 1009752 1016985 1023127 1029004 1034742 1039733 1044439 1050294 1057361 1063714 1067936 1070928 1074417
61147 1074417 1078868 1083873 1089419 1095409 1100738 1104445 1107514 1112183 1119555 1129062 1140044 1152419 1165711
61134 1165711 1179029 1192552 1207607 1224294 1240057 1251866 1259410 1265081 1270989 1276923 1281303 1283285
61122 1283285 1283423 1282569 1280727 1277299 1272361 1267121 1262689 1258774 1254278 1249069 1244254 1240485 1236904 1232326
61108A232326n472n268m570m605n721p291q580r351r844j0406j1068j1537j1631
61095A126982j1400j0676r070o861n232m936n299n291n098n669p134q759j0099
61082A031458j1118j1456j0736r487q619q067p167o181n993o312n589l076K89
61069I37946L282N440O626O987P591R598J2420J4214J4656J5494J7774K0380K2255
61056A094663K4184K6931K9316K9911K9428K9614L0582L1053L0635L0192L0161
61045A416670L0008K9214K7654K5140K1654J7861J4547J1716Q922N967K645j411
61033A610587n883r507j1766j3874j6955k0173k1990k2542k3102k3854k3874k3059
61021A394008k2385k2334k2414k2027k0696j7932j4298j1965j2263j3128j1151
$$ plain form
61108 1232326 1226854 1221586 1217016 1212411 1206690 1199399 1190819 1181468 1171624 1161218 1150150 1138613 1126982
61095 1126982 1115582 1104906 1095836 1088975 1083743 1078807 1073508 1068217 1063119 1057450 1050316 1041557 1031458
61082 1031458 1020340 1008884 998148 988661 980042 971975 964808 958627 952634 946322 940733 937657 937946
61069 937946 941228 946668 953294 960281 967872 977470 989890 1004104 1018760 1034254 1052028 1072408 1094663
61056 1094663 1118847 1145778 1175094 1205005 1234433 1264047 1294629 1325682 1356317 1386509 1416670
61045 1416670 1446678 1475892 1503546 1528686 1550340 1568201 1582748 1594464 1603386 1609353 1611998 1610587
61033 1610587 1604704 1595197 1583431 1569557 1552602 1532429 1510439 1487897 1464795 1440941 1417067 1394008
61021 1394008 1371623 1349289 1326875 1304848 1284152 1266220 1251922 1239957 1227694 1214566 1203415
61010A203415o205j783l25l74P66L436N868O669O018N330O479J0335J5444J9214
60996A274287K0967K2693K6164L0680L4518L7319L9800M2220M4529M7405N1716
60985A672298N7107O2318O6844P1412P6786Q2905Q9379R6156J03336J10656J17632
60974B606829J24170J30671J37326J43641J49275J55155J62962J73381J85825
60965C969235K00042K16659K35598K55559K76197K99342L26919L59592L99185
60956F538328M49999N14640N90234O72382P61392Q60872R72421J097791J245083
60947A3703142J424658J637902J877515K135344K386921K553166K501126K131039
60939C0350813J488738P76122K23286n7951r8388J7704K20260M24854M88795K63980
$$ plain form
61010 1203415 1197210 1195427 1195102 1194728 1195494 1198930 1204798 1211467 1217485 1222815 1229294 1239629 1255073 1274287
60996 1274287 1295254 1317947 1344111 1374791 1409309 1446628 1486428 1528648 1573177 1620582 1672298
60985 1672298 1729405 1791723 1858567 1929979 2006765 2089670 2179049 2275205 2378541 2489197 2606829
60974 2606829 2730999 2861670 2998996 3142637 3291912 3447067 3610029 3783410 3969235
60965 3969235 4169277 4385936 4621534 4877093 5153290 5452632 5779551 6139143 6538328
60956 6538328 6988327 7502967 8093201 8765583 9526975 10387847 11360268 12458059 13703142
60947 13703142 15127800 16765702 18643217 20778561 23165482 25718648 28219774 30350813
60939 30350813 31839551 32615673 32838959 32781008 32682620 32700324 32920584 33345438 33834233 34098213
60929C4098213k78596r93694j651981k089905k279788k285252k182347k023587
60921B0313063j843324j665276j500501j349392j210163j082516r65016q55193
60913I841682p53436o62900n84865n17501m59361m10644l70416l35870l05338
60904E441351k79249k57140k36424k15430j95404j78172j63805j51786j42469
60895C621472j35800j30255j24575j19193j14604j09716j03361r6231q9772q4016
60885B513949p8107p2173o7111o3151o0099n8394n8259n8143n5902n1742m8329
60874A842539m7414m7732m6977m4753m2346m0372l8157l5509l3698l3754l4619
60863A397208l4195l2123l0229k9810k9608k7503k3459j9488j7125j6229j6157
$$ plain form
60929 34098213 33819617 32825923 31173942 29084037 26804249 24518997 22336650 20313063
60921 20313063 18469739 16804463 15303962 13954570 12744407 11661891 10696875 9841682
60913 9841682 9088246 8425346 7840481 7322980 6863619 6452975 6082559 5746689 5441351
60904 5441351 5162102 4904962 4668538 4453108 4257704 4079532 3915727 3763941 3621472
60895 3621472 3485672 3355417 3230842 3111649 2997045 2887329 2783968 2687737 2597965 2513949
60885 2513949 2435842 2363669 2296558 2233407 2173308 2114914 2056655 1998512 1942610 1890868 1842539
60874 1842539 1795125 1747393 1700416 1655663 1613317 1572945 1534788 1499279 1465581 1431827 1397208
60863 1397208 1363013 1330890 1300661 1270851 1241243 1213740 1190281 1170793 1153668 1137439 1121282
60852A121282j6516j6420j4626j1327q722q530r683r683p806n638m494l733k174
60839A001930j89P07L6r42r04j55k6j008k302l121l653m385n280o148p280q951
60823I58329j0671j1615j1601j1099j0529j0112j0032j0126r782q895q390q946
60811H36531r601q836o728m736l548k621j828j945l056m006m253m779o264p445
60797G66885o541l615m73J350J668J141M55j77j152k808m517n091m232k727j047
60782G39119R76K700K510J54k149k345j291j258k539l373k821j869j593j787j751
60767G22683j196j95Q69J102p1j823k609k054j197r34j314k287l772m795m071
60752F98336j997o88j298k577k957k797l269m129m188l523l455m322m748l648
$$ plain form
60852 1121282 1104766 1088346 1073720 1062393 1053671 1045141 1035458 1025775 1017969 1012331 1007837 1004104 1001930
60839 1001930 1001741 1002448 1002484 1001542 1000638 1000483 1000457 999449 997147 994026 990373 985988 980708 974560 967280 958329
60823 958329 947658 936043 924442 913343 902814 892702 882670 872544 862762 853867 845477 836531
60811 836531 826930 818094 811366 806630 803082 800461 798633 796688 793632 789626 785373 780594 774330 766885
60797 766885 760344 756729 756256 757606 759274 760415 760870 760693 759541 756733 752216 747125 742893 740166 739119
60782 739119 740095 742795 745305 745459 743310 740965 739674 738416 735877 732504 729683 727814 726221 724434 722683
60767 722683 721487 721292 722161 723263 723192 721369 718760 716706 715509 714575 713261 710974 707202 702407 698336
60752 698336 696339 695651 694353 691776 688819 686022 682753 678624 674436 670913 667458 663136 658388 654740
60738F54740j850r86j501k575l682n298p760j0062j0462q452n582l825l404k891
60724E86410j469j57k99j526k143j307R7Q34P87O14O25O20O41J190K565M347N818
60707E97647O624O747O084M546K593J143P00Q52R71J056J394J661J114j88j082
60692F31862n77R51K253K561K055J310Q20R37J659K362K095M21k182m786o696
60677F35045p714p985p746p129o244n460n429o304p150o682m901l434l718n159
60663E49990n749m499k553j654k061k449j660M3J500J964J664J253J032P49M1
60648E37611j009j781j622n25P68J481J545J533J875K387K627K489K225K129K443
60633E54176L283M275M443L219J647J658L724N886N966M302L306M361O205O621
$$ plain form
60738 654740 652890 651904 650403 647828 644146 638848 631088 621026 610564 602112 596530 592705 589301 586410
60724 586410 584941 584784 584485 582959 580816 579509 579606 580440 581227 581841 582466 583086 583727 584917 587482 591829 597647
60707 597647 604271 611018 617102 621648 624241 625384 626084 626936 627907 628963 630357 632018 633132 632944 631862
60692 631862 631285 632236 634489 637050 639105 640415 641235 642172 643831 646193 648288 648709 646527 641741 635045
60677 635045 627331 619346 611600 604471 598227 592767 587338 581034 573884 567202 562301 558867 555149 549990
60663 549990 544241 539742 537189 535535 533474 531025 529365 529408 530908 532872 534536 535789 536821 537570 537611
60648 537611 536602 534821 533199 532674 533442 534923 536468 538001 539876 542263 544890 547379 549604 551733 554176
60633 554176 557459 561734 566177 569396 571043 572701 576425 582311 588277 592579 595885 600246 606451 613072
60619F13072M952K445P08M43J330K572L418L475K580P35j546l082l029k110j990
60604F23973l098l977l345j937j430k214l350m148m548m134k319K58J795J516
60590E93042P35J018K017K195J229N04J082K155K122O43j136k243k920l664m048
60575E92731l348k046j554k330l279l447l228l246l057k067q68l72j47R33K635
60560E67310L520L112K436K124J550L35o99q53n84m37n2P70J090J40j152j266
60544E77344k40M92K40j51M13K114M375O303O935N824L658J732O88J92j99m21
60528F09299l06k0J62K48N26J326K726M268N090M703L690L353M495O690Q783R964
60512F64997J0420J0968J2134J3687J5111J6238J7109J7392J6460J3991J0108
$$ plain form
60619 613072 618024 620469 621177 621620 622950 625522 628940 632415 634995 635730 634184 631102 628073 625963 623973
60604 623973 620875 616898 613553 611616 610186 607972 604622 600474 595926 591792 589473 589731 591526 593042
60590 593042 593777 594795 596812 599007 600236 600740 601822 603977 606099 606742 605606 603363 600443 596779 592731
60575 592731 589383 587337 585783 583453 580174 576727 573499 570253 567196 565129 564261 563889 563742 564675 567310
60560 567310 570830 573942 576378 578502 580052 580387 579688 578835 578251 577814 577762 578532 579622 579762 578610 577344
60544 577344 577104 577596 577836 577685 578098 580212 584587 590890 597825 603649 607307 609039 609727 609919 609720 609299
60528 609299 608993 608973 609135 609383 609909 611235 613961 618229 623319 628022 631712 635065 639560 646250 655033 664997
60512 664997 675417 686385 698519 712206 727317 743555 760664 778056 794516 808507 818615
60501H18615N115k52m482o240n873n095m827m348k966j358l05Q81L392O949J0065
60486H09271J2089J3805J6050J8710K1222K3201K4369K4516K3777K2506K0773
60475A030289J8348J5090J0998O120J071k677l889l131k506l523n710p633q694
60462A044153r423j0167j0169q451n383k640j181N2K571N988Q531R829J1516J4617
60448A049843J7967K0313K2563K6439L1891L7425M2295M6748N0579N3205N5050
60437A454318N7231N9697O0946N9768N6193N0648M3321L4356K3632J0568m651
60426A906027j9875l2465m1991n0068n7506o3273o6381o7121o5969o3024n9166
60415A319188n6041n4035n1656m7861m3565l9892l6377l2248k8239k5503k3658
$$ plain form
60501 818615 823730 823478 818996 812756 806883 801788 796961 792613 789647 788289 787984 788865 792257 799206 809271
60486 809271 821360 835165 851215 869925 891147 914348 938717 963233 987010 1009516 1030289
60475 1030289 1048637 1063727 1074725 1080845 1081916 1079239 1075350 1072219 1069713 1066190 1060480 1052847 1044153
60462 1044153 1034730 1024563 1014394 1005943 1000560 997920 996739 996791 999362 1005350 1013881 1023710 1035226 1049843
60448 1049843 1067810 1088123 1110686 1137125 1169016 1206441 1248736 1295484 1346063 1399268 1454318
60437 1454318 1511549 1571246 1632192 1691960 1748153 1798801 1842122 1876478 1900110 1910678 1906027
60426 1906027 1886152 1853687 1811696 1761628 1704122 1640849 1574468 1507347 1441378 1378354 1319188
60415 1319188 1263147 1209112 1157456 1109595 1066030 1026138 989761 957513 929274 903771 880113
60404H80113k1400j8632j6452j5239j4023j1937r389p608p364q127q514p861p160
60391G26407p610q485p902n837m534n142n926n169m002m369n596n430l679k304
60377F50422k110j825p48l0n47j306j016N0O44J50j093k303k575j520M1Q14O35
60360F37683M26L53o20k745m387l908j812R3R09J078J073Q84O60R43K003L430
60344F36063M406M297L276K647L848O585Q545P765M985K684K151K477K356J707
60330F93792J121P94P31J325K851M690N685N267L892K508J965K581L819M566M291
60315G39878L750L988M799M969M101L214L168L415L035K304K301L292M531N519
60301G92264O473P423P764P183O408O521P815R608J1007J1626J1751J1808J1543
$$ plain form
60404 880113 858713 840081 823629 808390 794367 782430 773041 765433 758069 749942 741428 733567 726407
60391 726407 718797 710312 702410 696573 692039 686897 680971 675802 671800 667431 661835 656405 652726 650422
60377 650422 648312 646487 645739 645709 645162 643856 642840 642890 643534 643684 642591 640288 637713 636193 636234 637048 637683
60360 637683 638109 638462 637842 635097 630710 626802 624990 625083 625992 627070 628143 629027 629687 630630 632633 636063
60344 636063 640469 644766 648042 650689 654537 661122 669667 677432 682417 685101 687252 689729 692085 693792
60330 693792 694913 695707 696438 697763 700614 705304 710989 716256 720148 722656 724621 727202 731021 735587 739878
60315 739878 743628 747616 752415 757384 761485 764699 767867 771282 774317 776621 778922 782214 786745 792264
60301 792264 798737 806160 813924 821107 827515 834036 841851 851459 862466 874092 885843 897651 909194
60288I09194R897O250J623k005l714m360n245o764q516r934j0367r380p491o010
60274H53178n503n075l800k315k051l267m753n336m890l891k768j883j490j417
60260H04739j065O5J933M030N754O873P752Q955J0579J2289J4059J6178J8413
60247I10554K0044K1025K2044K2625K0431J4048N707o10l771o333j0613j5786
60235I99365j9596k1232k1324k0442j9098j8237j8059j6994j3618r401p545q722
60223H05097r849q051m346j918j870k512k441k204k523k718j993j000q31j285
60209G61556j596k258m434p499q947p403m374k181j345j058j212k332l816l981
60195G09120k204J37J425J645J743J941J644P78J58K98O81P01P08J358K314K594
$$ plain form
60288 909194 919091 925341 926964 924959 921245 916885 911640 904876 896360 886426 876059 866679 859188 853178
60274 853178 847675 842600 838800 836485 834434 831167 826414 821078 816188 812297 809529 807646 806156 804739
60260 804739 803674 803739 805672 809702 815456 822329 830081 839036 849615 861904 875963 892141 910554
60247 910554 930598 951623 973667 996292 1016723 1030771 1036478 1035868 1032097 1025764 1015151 999365
60235 999365 979769 958537 937213 916771 897673 879436 861377 844383 830765 821364 813819 805097
60223 805097 795248 787197 782851 780933 779063 776551 774110 771906 769383 766665 764672 763672 762841 761556
60209 761556 759960 757702 753268 745769 736822 729419 725045 722864 721519 720461 719249 716917 713101 709120
60195 709120 706916 707053 708478 710123 711866 713807 715451 716229 716387 716685 717366 718067 718775 720133 722447 725041
60179G25041K148K014K584K757J610n8q07m80O7N42J134J321M97l84M18K646L903
60162G44953L061K017K972N348O898O734N772M928M430M588N803P744R369R861
60148H24478R130P802P067P772R216R713Q962Q633R770J1022J0780R728R501R883
60134I53457R347P689O083M976M024L673M586N609M646J703j125k856m432n966
60120I91414n900m128l381n642r024j0259q949p319o602n835m153k494k470m424
60106I10834p001q340p691n967m629m128l923l682l476k881j159J405L516M515
60092H67393M862M735L608J736O02R96K001K621L065L496L028J265m35o36L60
60077H98697J579L101N220P007P458P204P397P711P190O336O363O915O609N533
$$ plain form
60179 725041 727189 729203 731787 734544 736154 736096 735289 734809 734876 735418 736552 737873 738370 737986 738404 741050 744953
60162 744953 748014 750031 753003 758351 765249 771983 777755 782683 787113 791701 797504 805248 814617 824478
60148 824478 833608 841410 848477 856249 865465 875178 884140 892773 902543 913565 924345 934073 943574 953457
60134 953457 962804 970493 976576 981552 985576 989249 993835 999444 1004090 1005793 1004668 1001812 997380 991414
60120 991414 985514 981386 978005 972363 963339 953080 944131 936812 930210 924375 920222 917728 915258 910834
60106 910834 903833 895493 887802 881835 877206 873078 869155 865473 861997 859116 857957 859362 862878 867393
60092 867393 872255 876990 880598 882334 882936 883932 885933 888554 891619 895115 898143 899408 898973 898337 898697
60077 898697 900276 903377 908597 915604 923062 930266 937663 945374 952564 958900 965263 972178 978787 984320
60063I84320N017N036M130K302J664L286N252N243L574K348K420K674J984P42
60049A029992K31J039K362K876K182J125N32J88n43j596k482l134l645l633k924
60034A022570k394k987m158m601m260m161m304l536j800p48j362k451k548k030
60020I81230k162k924l103k136q07k55r20k381l795m681n493p019r172j0980j1858
60005I13544j1955j1157r022o259m958o184q349r193q663q351q539p615m676j220
59991H07403N66L29l81j46J037K364L459M549N639O084N459M515M596N900O986
59976H58359O464M696L336L412M409M987M188K069l27j702j592p81m32r86k163
59961H83937l722n689p823r421r902r448q891q935r494r844r539q953q646q458
$$ plain form
60063 984320 989337 994373 998503 1000805 1002469 1005755 1011007 1016250 1019824 1022172 1024592 1027266 1029250 1029992
60049 1029992 1030223 1031262 1033624 1036500 1038682 1039807 1040339 1040527 1039984 1038388 1035906 1032772 1029127 1025494 1022570
60034 1022570 1020176 1017189 1013031 1008430 1004170 1000009 995705 992169 990369 989621 988259 985808 983260 981230
60020 981230 979068 976144 973041 970905 970098 969843 968923 966542 962747 958066 952573 945554 936382 925402 913544
60005 913544 901589 890432 881410 875151 870193 864009 855660 846467 837804 829453 820914 813299 808623 807403
59991 807403 807969 808298 807917 807771 808808 811172 814631 819180 824819 830903 836362 840877 845473 851373 858359
59976 858359 864823 869519 872855 876267 880676 885663 889851 891920 891593 889891 888299 887518 887086 886100 883937
59961 883937 880215 874526 866703 857282 847380 837932 829041 820106 810612 800768 791229 782276 773630 765172
59947G65172p865p015o547o288n238l260j628j160r75j96K17j037l007l397j796
59932G15980o6P12J509K950L798L114K178K504L353L172K552L311N082N250K802
59917G58201O6l44J292K714K505Q69j363l240l853l124k088j602j323p64n37j343
59901G46066k307j790K73K200K799K477J966J253L11k14J90R88J156K92j146k218
59885G52296k050n07J474K692K908K704K300J409K58m43p03j238k012k091j418
59870G55579j251j979k011j3L017N210O247O849O968O350O064P319R126R156O977
59855H23608M517L254K764K448K670L436L639K654J526J552K688M100N259N705
59841H69820M731K444L94J04J331K566K961L066L902N766P661P881N726K731J353
$$ plain form
59947 765172 757307 750292 743745 737457 732219 728959 727331 726171 725196 725000 725217 724180 721173 717776 715980
59932 715980 715914 716626 718135 721085 724883 727997 730175 732679 736032 739204 741756 745067 750149 755399 758201
59917 758201 758267 757923 759215 761929 764434 765303 763940 760700 756847 753723 751635 750033 748710 747946 747409 746066
59901 746066 743759 741969 742242 744442 747241 749718 751684 752937 753248 753034 753224 754212 755368 755660 754514 752296
59885 752296 750246 749739 751213 753905 756813 759517 761817 763226 763484 763041 762338 761100 759088 756997 755579
59870 755579 754328 752349 750338 750325 753342 758552 764799 771648 778616 784966 791030 798349 807475 816631 823608
59855 823608 828125 831379 834143 836591 839261 842697 846336 848990 850516 852068 854756 858856 864115 869820
59841 869820 874551 876995 877389 877493 878824 881390 884351 887417 891319 897085 904746 912627 918353 921084 922437
59826I22437K216L661M266M497N216O024O251O455P410Q344P827N968M284L461
59812I98317K653J120o73j887k260j983j390j057j397j975j840q17K63Q41J468
59797I89383K974N318P704R491J0513J0722R967Q284O140M201K762J619N62j85
59783A069455n25j170l088o102q831j0347j1150j2058j2887j2904j1993j0543
59771I67857q799p112o289o688p340o989n704m456l495k344j218j039j865k543
59757I01976k402k146k623l621m416m625m111k855j586j645l474n705o416n001
59743H51350k407j13O80m25k591m092l814k239o35L26P57Q27N16j55j074k078
59727H34833k768k648j848j225j323j650j516j065p61m04M33J293J238L17l78
$$ plain form
59826 922437 924653 928314 932580 937077 942293 948317 954568 961023 968433 976777 984604 990572 994856 998317
59812 998317 1000970 1002090 1001417 999530 997270 995287 993897 992840 991443 989468 987628 986811 987074 987915 989383
59797 989383 992357 997675 1005379 1014870 1025383 1036105 1046072 1054356 1060496 1064697 1067459 1069078 1069640 1069455
59783 1069455 1068930 1067760 1064672 1058570 1049739 1039392 1028242 1016184 1003297 990393 978400 967857
59771 967857 959058 951946 945657 938969 931629 924640 918936 914480 910985 908641 907423 906384 904519 901976
59757 901976 899574 897428 894805 891184 886768 882143 878032 875177 873591 871946 868472 862767 856351 851350
59743 851350 848943 848830 849510 849085 846494 842402 838588 836349 835714 836040 836797 837624 838140 837985 836911 834833
59727 834833 832065 829417 827569 826344 825021 823371 821855 820790 820029 819625 820058 821351 822589 822906 822528
59712H22528k86OL8L77J525K748K992K575K850M157N119M536L207L041M646O766
59696H66825Q157R022J0052J0922J0808J0074J0097J1247J2136J1467R823Q828
59684I89458R179J0172J0827J0682R740Q364P117O173N091L693K753K938L394
59671A079581K458p4k447l038k179j398j598k533l547m186m346m347m776n842
59657A041728p048p658p382o467n354m352l421k194n78P36Q95P5o28o51n71r12
59641I96218j159m94J155L379N854P924Q488P300N760N309N459M592K331j97k113
59626A049806l312l448k127l88j51j627k856k649k263l089m362m743m823o054
59612A007914q028q971q549q191q566q727p945o722n450l685j491q3k74j361k286
$$ plain form
59712 822528 822242 822248 822286 822663 824188 826936 829928 832503 835353 839510 844629 849165 852372 855413 860059 866825
59696 866825 874982 884004 894056 904978 915786 925860 935957 947204 959340 970807 980630 989458
59684 989458 998637 1008809 1019636 1030318 1040058 1048422 1055539 1061712 1066803 1070496 1073249 1076187 1079581
59671 1079581 1082039 1081965 1079518 1076480 1074301 1072903 1071305 1068772 1065225 1061039 1056693 1052346 1047570 1041728
59657 1041728 1034680 1027022 1019640 1013173 1007819 1003467 1000046 997852 997274 998010 998905 998980 998352 997701 997130 996218
59641 996218 995059 994565 995720 999099 1004953 1012877 1021365 1028665 1034425 1039734 1045193 1049785 1052116 1051919 1049806
59626 1049806 1046494 1043046 1040919 1040531 1040380 1038753 1035897 1033248 1030985 1027896 1023534 1018791 1013968 1007914
59612 1007914 999886 990915 982366 974175 965609 956882 948937 942215 936765 933080 931589 931506 931232 929871 927585
59597I27585k838k989k188l45J403K050K170L000M628O152O991O944N503K527
59583I60593n72j778q44L11j18j990l963n251o128p132q196q544p524n710m746
59568H98408n573p152p668o619m961l515k356j673j943k983l910m398n017n999
59554H34641o761p019p277p535o744m372j582J86Q43R78N69l19n42O45J741O47
59538G98099j948k941j038J377J607J80l70Q35K282K494J629N85k85j143k011
59523G99352k624k611j789n25K22m19k293m219n002m400l146k099j477r59m96
59508G67515o61j757k956l004j892r41r86j241n57R77K405L314L935M145L450
59493G71746J924M36j80L37J839L792N281N754N863O776Q610J0369J1531J2869
$$ plain form
59597 927585 924747 921758 919570 919225 920628 922678 924848 927848 932476 938628 945619 952563 958066 960593
59583 960593 960021 958243 957399 957710 957592 955602 951639 946388 940260 933128 924932 916388 908864 903154 898408
59568 898408 892835 885683 878015 871396 866435 862920 860564 858891 856948 853965 850055 845657 840640 834641
59554 834641 827880 820861 813584 806049 799305 794933 793351 793537 794380 795358 795927 795608 795066 795711 797452 798099
59538 798099 796151 793210 792172 793549 795156 795336 794966 795801 798083 800577 802206 802791 802506 801363 799352
59523 799352 796728 794117 792328 791803 792025 791606 789313 785094 780092 775692 772546 770447 768970 768011 767515
59508 767515 766854 765097 762141 759137 757245 756304 755318 754077 753520 754497 756902 760216 764151 768296 771746
59493 771746 773670 774106 773926 774263 776102 779894 785175 790929 796792 803568 812178 822547 834078 846947
59479H46947J5269J8472K1329K2631K1286J6578R128J209m683p717q916r618j0079
59466I31836r436o904l127j14O34j66m56N46J549J242mj087j738k140j995j204
59450I07436r00k271m639o044n855n412n932p014p693p843p872p867p726p445
59436H22923o692m806j959L60R17M25O48J939K774J944K87m04M51J897L024L970
59420H27698N197O540P515Q047Q320Q111P062N556M547M368M433M225L907L585
59406I09111K867J694R16J308K534L708M432M622M045K962K610L907O074P671
59392I58461Q558R501J0292R941Q716Q253R111R735Q596O047L303P77j604l387
59378A046300m053l966l975m417n104n842o346o216n540n099n341n564m661k314
$$ plain form
59479 846947 862216 880688 902017 924648 945934 962512 971640 972849 968166 960449 951533 941915 931836
59466 931836 922400 915496 912369 912255 912889 912723 912267 912813 914362 915604 915600 914513 912775 910635 908640 907436
59450 907436 906536 904265 899626 893582 887727 882315 876383 869369 861676 853833 845961 838094 830368 822923
59436 822923 816231 811425 809466 809826 810743 811168 811816 813755 816529 818473 818760 818356 818807 820704 823728 827698
59420 827698 832895 839435 846950 854997 863317 871428 878490 884046 888593 892961 897394 901619 905526 909111
59406 909111 911978 913672 914588 915896 918430 922138 926570 931192 935237 938199 940809 944716 950790 958461
59392 958461 967019 976520 986812 996753 1005469 1013722 1022833 1032568 1041164 1047211 1050514 1051291 1049687 1046300
59378 1046300 1042247 1038281 1034306 1029889 1024785 1018943 1012597 1006381 1000841 995742 990401 984837 980176 977862
59364I77862R06M305P518J0529J3401J5752J6819J6806J7709K1495K7551L3465
59352A164118L8158M2025M3625L9117K6904J0836l151j2130j6199j5688j1323
59341A306292n709j221L073R065J4379J3173L151j1256k3877l2241l6709l7335
59329A200785l4232k9348k5090k1802j8408j4791j1731r146o330l638k246k255
59317A021768k420j736k51J666L565M620M330L584L902N399O652O814O642P012
59303A071547P499P289O630O441O802O846O209N810O823R173J1422J2202J1507
59290A176200J0498J0176J0573J1229J1937J2712J3332J3512J3435J3622J4220
59279A311446J4775J4848J4435J3575J2008R567O646L795J035j905m687o440p020
$$ plain form
59364 977862 978768 983073 990591 1001120 1014521 1030273 1047092 1063898 1081607 1103102 1130653 1164118
59352 1164118 1202276 1244301 1287926 1327043 1353947 1364783 1361632 1349502 1333303 1317615 1306292
59341 1306292 1300583 1299362 1302435 1311500 1325879 1339052 1342203 1330947 1307070 1274829 1238120 1200785
59329 1200785 1166553 1137205 1112115 1090313 1071905 1057114 1045383 1036237 1029907 1026269 1024023 1021768
59317 1021768 1019348 1017612 1017361 1019027 1022592 1027212 1031542 1035126 1039028 1044427 1051079 1057893 1064535 1071547
59303 1071547 1079046 1086335 1092965 1099406 1106208 1113054 1119263 1125073 1131896 1141069 1152491 1164693 1176200
59290 1176200 1186698 1196874 1207447 1218676 1230613 1243325 1256657 1270169 1283604 1297226 1311446
59279 1311446 1326221 1341069 1355504 1369079 1381087 1390654 1397300 1401095 1402130 1400225 1395538 1389098 1382078
59266A382078p597r276j1534j2858j2747j2134j1721j1021r577q127p613p698
59254A260175p268o032m628l373j965k47J641L822O328Q288Q600P444N763L096
59240A281644k432j1023j9573k4413k4942k3403k1757k0214j8486j6922j5993
59229A082486j5461j4530j2544r622o832n448n562n789m924l416k401j771l50
59216I93836K065M124M734M492M777O007P452Q474R342J0856J3286J5737J6750
59203A101932J5777J3756J1791R712O705L173O51l72j317l459o070p594q066q955
59189A127664j0733j1870j0710p546m268k414k089k438k604k186j259j89O42J152
59175A071152J625K417L543M632N259N319M939M131K758R47p38j671j700j272
$$ plain form
59266 1382078 1374481 1365205 1353671 1340813 1328066 1315932 1304211 1293190 1283613 1275486 1267873 1260175
59254 1260175 1252907 1246875 1242247 1238874 1236909 1236662 1238303 1242125 1248453 1256741 1265341 1272785 1278548 1281644
59240 1281644 1279212 1268189 1248616 1224203 1199261 1175858 1154101 1133887 1115401 1098479 1082486
59229 1082486 1067025 1052495 1039951 1030329 1023497 1018049 1012487 1006698 1001774 998358 995957 994186 993836
59216 993836 995901 1000025 1004759 1009251 1014028 1020035 1027487 1035961 1045303 1056159 1069445 1085182 1101932
59203 1101932 1117709 1131465 1143256 1152968 1159673 1162846 1163497 1163125 1161808 1158349 1152279 1144685 1136619 1127664
59189 1127664 1116931 1105061 1094351 1086805 1082537 1080123 1078034 1075596 1072992 1070806 1069547 1069358 1070000 1071152
59175 1071152 1072777 1075194 1078737 1083369 1088628 1093947 1098886 1103017 1105775 1106722 1105984 1104313 1102613 1101341
59161A101341j074j528k422l041l020l027m075n922o952o257n104n199o065n591
59147A042064l375j693k375m183m742l857l225l443l415k704k448l267l990l534
59133I95813k665k594k873k203p05J71r7l97K82J609K770L623M446N199N626N694
59117A013699N504N002M099K997K205K323L730O214Q842J0468J0511R265P535
59104A092394O136N593N970O899P842Q270P705O003L717J761M31q28k512m466
59090A144915o429q374r912j0255r566r386j0649j2088j1972j0688r948r911r202
59077A016535p821p713r653j1502j0955q613o855o582o558n523l558j433L20J590
59063I31679K491L113L232K712K330L486O447R514J0716R901Q535P870Q065Q672
$$ plain form
59161 1101341 1100267 1098739 1096317 1093276 1090256 1087229 1083154 1077232 1070280 1064023 1058919 1053720 1047655 1042064
59147 1042064 1038689 1036996 1034621 1030438 1025696 1021839 1018614 1015171 1011756 1009052 1006604 1003337 999347 995813
59133 995813 993148 990554 987681 985478 984773 984944 984847 984450 984732 986341 989111 992734 997180 1002379 1008005 1013699
59117 1013699 1019203 1024205 1028304 1031301 1033506 1035829 1039559 1045773 1054615 1065083 1075594 1084859 1092394
59104 1092394 1098530 1104123 1110093 1116992 1124834 1133104 1140809 1146812 1150529 1152290 1152721 1151893 1149381 1144915
59090 1144915 1138486 1130112 1120200 1109945 1100379 1090993 1080344 1068256 1056284 1045596 1035648 1025737 1016535
59077 1016535 1008714 1001001 991348 979846 968891 960278 953423 946841 940283 934760 931202 929769 930089 931679
59063 931679 934170 937283 940515 943227 945557 949043 955490 965004 975720 985621 994156 1002026 1010091 1018763
59049A018763R088Q716P527O430O420P383Q281Q354P583O169M283K409J206P28
59035A103340K21j036k805m024l890k700j541j103j052q82q96j735l124m054m248
59020A070471m476n118n465n020m555n051o296p328p721p707p496p239p135o954
59006I82910o038m520l726m427n362m823l187k441l286m290m100l244l050l731
58992I26685m174l249q96J767L194K701J117j74p97j503k699l528k839p82J053
58977I15876J168k43j434j027M86J650K209L369N729Q107R118Q998Q871R069R245
58962I81191R531J0255J0938J0854J0465J0999J2540J3700J3390J1898J0095Q510
58950A114366P322O343M798K093r52k595k194q92P0P25J649K740L503L884M074
$$ plain form
59049 1018763 1027851 1036567 1044094 1050524 1056944 1064327 1072608 1080962 1088545 1094714 1098997 1101406 1102612 1103340
59035 1103340 1103561 1102525 1099720 1095696 1091806 1089106 1087565 1086462 1085410 1084528 1083632 1081897 1078773 1074719 1070471
59020 1070471 1065995 1060877 1055412 1050392 1045837 1040786 1034490 1027162 1019441 1011734 1004238 996999 989864 982910
59006 982910 976872 972352 968626 964199 958837 954014 950827 948386 945100 940810 936710 933466 930416 926685
58992 926685 922511 919262 918366 920133 923327 926028 927145 926971 926174 924671 921972 918444 915605 914823 915876
58977 915876 917044 916801 915367 914340 914826 916476 918685 922054 927783 935890 945008 954006 962877 971946 981191
58962 981191 990722 1000977 1011915 1022769 1033234 1044233 1056773 1070473 1083863 1095761 1105856 1114366
58950 1114366 1121688 1128031 1132829 1134922 1133970 1131375 1129181 1128289 1128359 1129084 1130733 1133473 1136976 1140860 1144934
58935A144934L830K779J321O63J667L740N017L948R62j682k021k53J622J789j9
58920A168297k518l726k296J135M290N614N975P266R782J2037J2875J2595J1958
58907A243284J1329J1018J1446J2522J3515J3738J2855J0609P135L511J041q3
58895A351920p04j435k467m311p362j0687j2719j3467j4490j6224j6960j5470
58883A235624j3208j2538j3754j5090j5122j3857j1867r572p465o111n618n456
58871A105966m921l675k024p67m65p44o42J95J093J199L80p72j428r94L96J884
58855A094681K844L609M702N813O418O963Q132R190Q724P107O553Q152J0427J1612
58841A194927J1938J2610J3750J4442J4037J2547J0427Q645Q170Q748R149R121
$$ plain form
58935 1144934 1148764 1151543 1152864 1153527 1155194 1158934 1163951 1167899 1168861 1167179 1165158 1164905 1166527 1168316 1168297
58920 1168297 1165779 1162053 1159757 1160892 1165182 1170796 1176771 1184037 1193819 1205856 1218731 1231326 1243284
58907 1243284 1254613 1265631 1277077 1289599 1303114 1316852 1329707 1340316 1347451 1350962 1352003 1351920
58895 1351920 1351216 1349781 1347314 1343003 1335641 1324954 1312235 1298768 1284278 1268054 1251094 1235624
58883 1235624 1222416 1209878 1196124 1181034 1165912 1152055 1140188 1130616 1123151 1117040 1111422 1105966
58871 1105966 1101045 1097370 1095346 1094579 1094114 1093370 1092728 1092923 1094016 1095215 1095595 1094823 1093395 1092401 1092797 1094681
58855 1094681 1097525 1101134 1105836 1111649 1118067 1125030 1133162 1142352 1151076 1158183 1164736 1172888 1183315 1194927
58841 1194927 1206865 1219475 1233225 1247667 1261704 1274251 1284678 1293323 1301493 1310241 1319390 1328511
58829A328511R959J2389J5197J6927J7765J8545J9062J8733J7880J6915J5052
58818A506935J1462P134M092K923K392J210r61l950p232r815j1048j1484j2068
58805A479590j2725j2691j1841j0818j0176j0290j1545j3581j4964j4853j4474
58794A341632j5530j7589j8606j7941j7122j7371j7955j7525j5915j4008j2567
58783A159503j1797j1533j1516j1690j2097j2306j1592j0268r952j1349j2574
58772A032829j1246p786m929m111m298m450m997o109o396m718j967J87J388K333
58758I75730L209L630L669L795L979L761L094K462K191K133K006J653J017J36
58744A012465r21k188l574m535m481l700l302l885m750m898m375m032m285m745
$$ plain form
58829 1328511 1338470 1350859 1366056 1382983 1400748 1419293 1438355 1457088 1474968 1491883 1506935
58818 1506935 1518397 1525531 1529623 1532546 1534938 1536148 1535187 1531237 1524005 1514190 1503142 1491658 1479590
58805 1479590 1466865 1454174 1442333 1431515 1421339 1411049 1399504 1385923 1370959 1356106 1341632
58794 1341632 1326102 1308513 1289907 1271966 1254844 1237473 1219518 1201993 1186078 1172070 1159503
58783 1159503 1147706 1136173 1124657 1112967 1100870 1088564 1076972 1066704 1056752 1045403 1032829
58772 1032829 1021583 1013797 1008868 1004757 1000459 996009 991012 984903 978507 973789 971822 972009 973397 975730
58758 975730 978939 982569 986238 990033 994012 997773 1000867 1003329 1005520 1007653 1009659 1011312 1012329 1012465
58744 1012465 1011544 1009356 1005782 1001247 996766 993066 989764 985879 981129 976231 971856 967824 963539 958794
58730I58794n024n279n728n995n317l386q37J235K230K450K556K785K853K582
58716I43919K316K574L320L770L169J650l5j670l821o480q236p868o355n930p065
58701I13258p894p059n573m905m693l678k004r10p23n74J11J163K456L873M624
58686H87472L924K431J807K686M052M787M866M857N101N622O092N864M779L874
58672I48214M347N956P312P774P890P963P481O359N495N446N518M875L817L211
58658A031658L230L344L292L373L849M454M630M244M011M829O501P559O797M551
58644A096322J894q72m008p106r247j0385j1526j3308j5293j6744j7454j7653
58632I74620j7799j8287j8774j8048j5505j2469j0965j1147j1145r535o889m679
$$ plain form
58730 958794 953770 948491 942763 936768 931451 928065 927228 928463 930693 933143 935699 938484 941337 943919
58716 943919 946235 948809 952129 955899 959068 960718 960683 959013 955192 948712 940476 932608 926253 920323 913258
58701 913258 905364 898305 892732 887827 883134 879456 877452 876542 875819 875245 875356 876519 878975 882848 887472
58686 887472 891396 893827 895634 898320 902372 907159 912025 916882 921983 927605 933697 939561 944340 948214
58672 948214 952561 958517 965829 973603 981493 989456 996937 1003296 1008791 1014237 1019755 1024630 1028447 1031658
58658 1031658 1034888 1038232 1041524 1044897 1048746 1053200 1057830 1062074 1066085 1070914 1077415 1084974 1091771 1096322
58644 1096322 1098216 1097344 1093336 1086230 1076983 1066598 1055072 1041764 1026471 1009727 992273 974620
58632 974620 956821 938534 919760 901712 886207 873738 862773 851626 840481 830946 824057 819378
58620H19378l609l422l543l625l865m680n579m971k072J535L555L809M004M981
58606H01896N958O458P178Q534R884J0616J0578R239O037J952r50k100l016m735
58592H67529o345o754o285n683n008m397m382m726m387l403l073l492k928q36
58578H05830O66Jj094j50K248L558L038K031J277L11p18q55p1N72N40J68m82j665
58560H15205k893l235k612j609k43J681L262L214J988J564K766M223M505M050
58546H31866M176N112N908N826N089M382M029L756L151K191J163K73k37J66J640
58531H78491L126L275K432K362L588M556M297M316O322R364J1060J0842J0235
58518I54266J0393J1155J2216J3539J4597J4787J4605J5045J5867J5875J4983
$$ plain form
58620 819378 815769 812347 808804 805179 801314 796634 791055 786084 784012 785547 789102 792911 796915 801896
58606 801896 807854 814312 821490 830024 839908 850524 861102 870341 876378 878330 877380 875280 872264 867529
58592 867529 861184 854430 848145 842462 837454 833057 828675 823949 819562 816159 813086 809594 806666 805830
58578 805830 806496 806497 805403 805253 807501 811059 814097 816128 817405 817716 816998 816143 816072 816644 817184 817352 816870 815205
58560 815205 812312 809077 806465 804856 804613 806294 809556 812770 814758 816322 819088 823311 827816 831866
58546 831866 836042 841154 847062 852888 857977 862359 866388 870144 873295 875486 876649 876922 876685 876851 878491
58531 878491 881617 884892 887324 889686 893274 897830 902127 906443 912765 922129 933189 944031 954266
58518 954266 964659 975814 988030 1001569 1016166 1030953 1045558 1060603 1076470 1092345 1107328
58507A107328J4593J5578J7254J8738K0283K2587K5521K8028K9069K8621K7917
58496A355517K8199K8900K7819K3871J8737J4636J1483P779L515K52j471k727
58484A516510m158n252n981p276r283j0827j1373j2119j4229j7240k0055k2485
58472A376232k4770k6505k7099k6644k5529k3624k0723j7429j4873j3533j2812
58461A142691j1752j0013q207p289p503q054p999p164n919m585l589l538m312
58448A052767m608l405j503n31q09j381j795k370k716j699O60K618K744J659J097
58433A040728J936L550M586M121K552J399J709K935M063N346P695J0647J2516
58420A103783J2641J2142J2213J2987J4258J5881J7155J7151J6142J5359J4829
$$ plain form
58507 1107328 1121921 1137499 1154753 1173491 1193774 1216361 1241882 1269910 1298979 1327600 1355517
58496 1355517 1383716 1412616 1440435 1464306 1483043 1497679 1509162 1516941 1520456 1520708 1519237 1516510
58484 1516510 1512352 1507100 1501119 1493843 1484560 1473733 1462360 1450241 1436012 1418772 1398717 1376232
58472 1376232 1351462 1324957 1297858 1271214 1245685 1222061 1201338 1183909 1169036 1155503 1142691
58461 1142691 1130939 1120926 1112719 1105430 1097927 1089873 1081874 1074710 1068791 1064206 1060617 1057079 1052767
58448 1052767 1048159 1044754 1043251 1042720 1041911 1040530 1038735 1036365 1033649 1031950 1032610 1035228 1037972 1039631 1040728
58433 1040728 1042664 1046214 1050800 1054921 1057473 1058872 1060581 1063516 1067579 1072925 1080620 1091267 1103783
58420 1103783 1116424 1128566 1140779 1153766 1168024 1183905 1201060 1218211 1234353 1249712 1264541
58409A264541J3035R305N102K038n3k028l739m615m971n332n214l843j613L29
58395A262942J677L114N024O987Q592R998J1437J2533J2327J0037N969J449k422
58382A349664n721q893j1414j2266j1607j0779j0396r605p571m726k128m60J4
58369A254112m48n90J140M713Q236J0067J0355J0046R470Q662Q081P965P676O481
58355A345966M527K338k8k694n282p182q086p956p033o097n921o200n930n167
58341A285255n145o124o442m729j948m7O04J205K602M545O485P920Q277P374N964
58326A305796M988M479L809K823K031J875K308K981L479L615L757M488N745O781
58312A358955P280P816Q916J0286J1421J2337J3269J4141J4731J4863J4280J3100
$$ plain form
58409 1264541 1277576 1286881 1291983 1294021 1293968 1291940 1288201 1283586 1278615 1273283 1268069 1264226 1262613 1262942
58395 1262942 1264619 1267733 1272757 1279744 1288336 1298334 1309771 1322304 1334631 1344668 1350637 1352086 1349664
58382 1349664 1343943 1335050 1323636 1311370 1299763 1288984 1278588 1268983 1261412 1256686 1254558 1254098 1254112
58369 1254112 1253664 1253074 1254214 1258927 1267163 1277230 1287585 1297631 1307101 1315763 1323844 1331809 1339485 1345966
58355 1345966 1350493 1352831 1352803 1350109 1344827 1337645 1329559 1321603 1314570 1308473 1302552 1296352 1290422 1285255
58341 1285255 1280110 1273986 1267544 1262815 1260867 1260820 1261424 1262629 1265231 1269776 1276261 1284181 1292458 1299832 1305796
58326 1305796 1310784 1315263 1319072 1321895 1323926 1325801 1328109 1331090 1334569 1338184 1341941 1346429 1352174 1358955
58312 1358955 1366235 1374051 1382967 1393253 1404674 1417011 1430280 1444421 1459152 1474015 1488295 1501395
58300A501395J2408J3424J5767J7673J8265J8390J8747J8691J7628J6255J5246
58289A683889J3989J1868R727Q674Q407Q177Q533J0377J2779J3723J2979J2592
58277A815714J4076J6504J7977J8038J7892J8760K0668K2779K4391K5403K5966
58266B038168K6074K5734K5154K4329K2852K0670J8665J7628J7140J6461J6040
58255B268915J6706J7723J7474J6025J5277J6157J7549J8486J9523K1214K3041
58244B468090K4710K6756K9024L0376L0860L2245L5078L7260L7124L6162L6833
58233B824518L9123M1224M2438M3420M4458M5468M6973M9504N2477N5027N7251
58222C341881N9502O1346O2383O3208O4435O5811O7335P0012P4166P8366Q1367
$$ plain form
58300 1501395 1513803 1527227 1542994 1560667 1578932 1597322 1616069 1634760 1652388 1668643 1683889
58289 1683889 1697878 1709746 1719473 1728147 1736554 1744731 1753264 1763641 1776420 1790143 1803122 1815714
58277 1815714 1829790 1846294 1864271 1882309 1900201 1918961 1939629 1962408 1986799 2012202 2038168
58266 2038168 2064242 2089976 2115130 2139459 2162311 2182981 2201646 2219274 2236414 2252875 2268915
58255 2268915 2285621 2303344 2320818 2336843 2352120 2368277 2385826 2404312 2423835 2445049 2468090
58244 2468090 2492800 2519556 2548580 2578956 2609816 2642061 2677139 2714399 2751523 2787685 2824518
58233 2824518 2863641 2904865 2947303 2990723 3035181 3080649 3127622 3177126 3229603 3284630 3341881
58222 3341881 3401383 3462729 3525112 3588320 3652755 3718566 3785901 3855913 3930079 4008445 4089812
58211D089812Q3904Q7184R0950R4519R8451J03627J09713J15911J22138J28322
58201E124531J33918J39158J45124J51569J56752J60683J66070J74413J83654
58192F535872J91646J99334K08298K17849K27361K38806K54025K71848K90932
58183H635971L12883L39128L67250L94332M21633M51776M83342N12856N40670
58174A2459841N70491O04268O41814O84244P33077P86608Q41311Q96539R54250
58165A9172443J015182J078899J146414J218991J295924J377319J467062J568695
58157B9340929J680431J798876J925501K064583K217392K384149K569379K779364
58149D6760604L016363L281304L579777L919740M307196M751689N272661N892231
$$ plain form
58211 4089812 4173716 4260900 4351850 4446369 4544820 4648447 4758160 4874071 4996209 5124531
58201 5124531 5258449 5397607 5542731 5694300 5851052 6011735 6177805 6352218 6535872
58192 6535872 6727518 6926852 7135150 7352999 7580360 7819166 8073191 8345039 8635971
58183 8635971 8948854 9287982 9655232 10049564 10471197 10922973 11406315 11919171 12459841
58174 12459841 13030332 13634600 14276414 14960658 15693735 16480343 17321654 18218193 19172443
58165 19172443 20187625 21266524 22412938 23631929 24927853 26305172 27772234 29340929
58157 29340929 31021360 32820236 34745737 36810320 39027712 41411861 43981240 46760604
58149 46760604 49776967 53058271 56638048 60557788 64864984 69616673 74889334 80781565
58141H0781565O624059P475651Q455905R571943J0826202J2228648J3804845J5577787
58133A65346605J7547759J9704537K2055574K4635561K7493189L0618101L3710267
58126C41111593L5845373L5429153L0848315K1595795Q959805m448120j6019583
58119D53322331k4270767k9039868l0966401l0903394k9616694k7699904k5555825
58112B55269478k3414051k1382952j9496458j7739872j6080227j4502131j3016400
58105A29637387j1639484j0379436r241224q228660p335692o546771n849518n238490
58097F5178112m705409m235819l818133l448048l122036k834227k581238k362320
58089C8070882k172406k001894j845447j704850j581457j471939j373419j286485
$$ plain form
58141 80781565 87405624 94881275 103337180 112909123 123735325 135963973 149768818 165346605
58133 165346605 182894364 202598901 224654475 249290036 276783225 307401326 341111593
58126 341111593 376956966 412386119 443234434 464830229 473790034 469341914 453322331
58119 453322331 429051564 400011696 369045295 338141901 308525207 280825303 255269478
58112 255269478 231855427 210472475 190976017 173236145 157155918 142653787 129637387
58105 129637387 117997903 107618467 98377243 90148583 82812891 76266120 70416602 65178112
58097 65178112 60472703 56236884 52418751 48970703 45848667 43014440 40433202 38070882
58089 38070882 35898476 33896582 32051135 30346285 28764828 27292889 25919470 24632985
58081B4632985j210394j140533j073430j009932r51253q96080q43652p95525p52074
58072A5960112p10997o71305o35179o03646n73765n42448n10322m79744m51601
58063A0781105m26050m03951l85362l68332l51040l33786l17833l03742k91562
58054G599447k80887k70090k57527k44098k32585k23753k15368k05826j96353
58045E472960j88460j81539j74439j67588j61890j56890j51463j45278j38628
58036D006785j31755j25168j19536j14737j10079j05875j03259j02010j00080
58027B994286r6184r1483q7876q5723q4067q2050p9281p5794p2185o9162o6526
58016B103955o3418n9655n5863n2259m8549m5128m2949m1798m0064l6812l2933
$$ plain form
58081 24632985 23422591 22282058 21208628 20198696 19247443 18351363 17507711 16712186 15960112
58072 15960112 15249115 14577810 13942631 13338985 12765220 12222772 11712450 11232706 10781105
58063 10781105 10355055 9951104 9565742 9197410 8846370 8512584 8194751 7891009 7599447
58054 7599447 7318560 7048470 6790943 6546845 6314260 6090507 5875139 5669313 5472960
58045 5472960 5284500 5102961 4928522 4760934 4599044 4442154 4290691 4145413 4006785
58036 4006785 3875030 3749862 3630326 3515589 3405510 3299635 3196376 3094366 2994286
58027 2994286 2898102 2806619 2718743 2633020 2548953 2466903 2387622 2311828 2239643 2170481 2103955
58016 2103955 2040537 1980882 1925019 1872760 1824211 1779083 1736134 1694336 1654272 1617460 1584527
58005A584527k9836k7985k7237k7371k7795k7608k6542k5126k3874k3041k3125
57994A294987k4366k5663k5186k2444j8766j5687j3875j3544j4532j5742j5802
57983A089380j4601j3167j2022j0798r535q868q893r121r746j1351j3314j4136
57971I53828j3785j3940j5332j6495j5951j4233j2847j2341j2279j2208j1962
57960H02455j1634j1543j1575j0791q767o878o677p392o966n438m822n531n665
57947F98776m583m237n534o156m041q68L06q41k334l091l309k804j364p5j48q57
57931F58840o63P2n14k848n338o665o966o724o071n424n344n535n236m690m929
57916E91965n880o123m977l591l208l320k516o60P46M41j084k340k794l275m282
$$ plain form
58005 1584527 1554691 1526706 1499469 1472098 1444303 1416695 1390153 1365027 1341153 1318112 1294987
57994 1294987 1270621 1244958 1219772 1197328 1178562 1162875 1149000 1135456 1120924 1105182 1089380
57983 1089380 1074779 1061612 1049590 1038792 1029257 1020389 1011496 1002375 992629 981278 967964 953828
57971 953828 940043 926103 910771 894276 878325 864092 851245 838904 826625 814417 802455
57960 802455 790821 779278 767703 756912 748145 741267 734590 727198 720232 714794 709972 704441 698776
57947 698776 694193 689956 684422 678266 674225 673357 673663 672822 670488 667397 664088 661284 659920 659845 659697 658840
57931 658840 658177 658249 657735 654887 649549 642884 635918 629194 623123 617699 612355 606820 601584 596894 591965
57916 591965 586085 579962 574985 571394 568186 564866 562350 561690 562436 562877 561793 559453 556659 553384 549102
57901E49102m758l484j193J36l6l02J78L67o49j904k070j591j835k863l420k744
57885E22934j208M78J767K305K301K462L037L511L773M608O258P697Q210Q401
57871E76534Q447O935L230m11j421o61j077l234n029n579o421q246r352q495o871
57856E38349n790m524k285n27j057k937l428j674M40J101N97J87L42P37J140J583
57840E22254J877J557M05j166k338k491j579n6J274J410j17k239k697l62K997
57825E18729M270K359q24k826l135k858k967l701n083o956q518q626o934m453
57811D68477k660k083k007j606j037r86j349j121K57K095L412L936L788K976J912
57796D74004J701K862M417N194N422N823N880M631K763J989K364K115N22j048
$$ plain form
57901 549102 544344 540860 539667 539803 539767 539465 539643 540010 539361 537457 535387 533796 531961 529098 525678 522934
57885 522934 521726 522204 523971 526276 528577 531039 534076 537587 541360 545968 552226 559923 568133 576534
57871 576534 584981 591916 595146 594735 593314 592653 591576 588342 583313 577734 571313 563067 553715 545220 538349
57856 538349 532559 528035 525750 525223 524166 521229 517801 516127 516567 517668 518265 518452 518794 519531 520671 522254
57840 522254 524131 525688 526093 524927 522589 520098 518519 518463 519737 521147 521030 518791 516094 515732 518729
57825 518729 522999 525358 524534 521708 518573 515715 512748 509047 503964 497008 488490 479864 472930 468477
57811 468477 465817 463734 461727 460121 459084 458098 456749 455628 455885 457980 461392 465328 469116 472092 474004
57796 474004 475705 478567 482984 488178 493600 499423 505303 509934 512697 514686 517050 519165 519687 518639
57782E18639j570j943l060m064l904l181k978l029k731k930m716p059p662o067
57768D63745m064k939k127j027l35p29j452j420q15n39o77n59q5K1p30k030l313
57751D40925m283m743m534l948l801m688o256p448p502o522n177m038l335l129
57737C71521l436m010m152l066o42K185M101M518L914L127K589K374K496K812
57723C84331K830K312J928K629M236N405N379N093N800P125P436O057M192L334
57709D48087L502L590K917J781O33n62j890k965l362l437m047n336o259n765m123
57694D22764k555j833j809k127k701l385l874m006l665k493o27N03n97l086m106
57679C86403k348pO5j863l032j998k2J183J476J634J943K037J709J341J741L262
$$ plain form
57782 518639 517069 515126 512066 508002 504098 500917 497939 494910 492179 489249 484533 477474 469812 463745
57768 463745 459681 456742 454615 453588 453253 452524 451072 449652 448837 448298 447621 447062 446977 446998 446268 444238 440925
57751 440925 436642 431899 427365 423417 419616 414928 408672 401224 393722 387200 382023 377985 374650 371521
57737 371521 368085 364075 359923 356857 356215 358400 362501 367019 370933 374060 376649 379023 381519 384331
57723 384331 387161 389473 391401 394030 398266 403671 409050 414143 419943 427068 434504 440561 444753 448087
57709 448087 451589 455179 458096 459877 460510 459948 458058 455093 451731 448294 444247 438911 432652 426887 422764
57694 422764 420209 418376 416567 414440 411739 408354 404480 400474 396809 394316 393689 394192 393595 390509 386403
57679 386403 384055 384048 384113 382250 379218 377220 377198 378381 379857 381491 383434 385471 387180 388521 390262 393524
57663C93524M850M643K283K3K77K525L950K933N11j590k794l230l055k849l500
57648C98501m898n647m800l073j803j349j158p51j20M01L62k39o27j90L39k64
57632C74684j677k217j361n81j014j766j565p44l67l41K32J545L195N190P575
57617C80788R569J0509J1354J3923J8461K3084K5991K7495K9595L3861L9608M3677
57605F67915M2313L3920K0121M172j1064k3429l1124l3649l2774l1264l0397k9481
57593E45259k7748k5683k4176k3172k1663j8775j4669j0563p811o723o351n625
57581C52300m426l283k481j960j767j897j892j231p7Q96J274R79k15k430m849
57566C28941n882m720k395q46r35j712j837j392j671l076m112l291j439p88j945
$$ plain form
57663 393524 398374 403017 405300 405323 405600 408125 412075 415008 415519 413929 411135 407905 404850 402001 398501
57648 398501 393603 387956 383156 380083 378280 376931 375773 375022 374902 375303 375665 375426 374799 374609 374948 374684
57632 374684 373007 370790 369429 368848 367834 366068 364503 363759 363392 363051 363283 364828 368023 373213 380788
57617 380788 390357 400866 412220 426143 444604 467688 493679 521174 550769 584630 624238 667915
57605 667915 710228 744148 764269 768441 757377 733948 702824 669175 636401 605137 574740 545259
57593 545259 517511 491828 467652 444480 422817 404042 389373 378810 370999 364276 357925 352300
57581 352300 347874 344591 342110 340150 338383 336486 334594 333363 333286 334182 335456 336435 336220 333790 328941
57566 328941 323059 318339 315944 315098 314163 312451 310614 309222 307551 304475 300363 297072 295633 294845 292900
57551B92900l218l284k937l363m010l505j917o90p52j657k451k521j905j376j816
57536B57498k912l176k020r20j371k516k294n60O56l1j675k439j636OJ170Q94
57520B38674n82j832j778r81n91m59L56J497J384l20j950k186j766j898k259j758
57504B23551n41J05m04j351j930k150k261k010j054J30M67l14r82j85J582K314
57488B14967J123m24l21J212K163J380l03j401j238m2J428K127J505K15n09k08
57472B21674O08J514K552L627M361M706N000N344N537N630N742N522M661L792
57458B80270L780M143L467J665M47R07J827J303p29k558k803j611J3J214J632
57443B92967J291M42n17j135j167r00q80j149j083m60q6p31j897k431k007j209
$$ plain form
57551 292900 289682 286398 283461 280098 276088 272583 270666 269976 269224 267567 265116 262595 260690 259314 257498
57536 257498 254586 251410 249390 248470 247099 244583 242289 241729 242385 242354 240679 238240 236604 236610 237780 238674
57520 238674 238092 236260 234482 233501 232910 232451 232807 234304 235688 235368 233418 231232 229466 227568 225309 223551
57504 223551 223010 223115 222711 221360 219430 217280 215019 213009 211955 212085 212552 212238 211256 211071 212653 214967
57488 214967 216090 215666 215345 216557 218720 220100 219797 218396 217158 217116 218544 220671 222176 222391 221882 221674
57472 221674 222282 223796 226348 229975 234336 239042 244042 249386 254923 260553 266295 271817 276478 280270
57458 280270 284050 288193 291660 293325 293772 294679 296506 297809 297080 294522 291719 290108 290121 291335 292967
57443 292967 294258 294700 294183 293048 291881 290981 290101 288952 287869 287409 287323 286592 284695 282264 280257 279048
57427B79048m91l8k01j032j755j743j615k032k007j62K554L361J285j581k891
57412B70700k487j502o72l40n99o61N13K308K776J657J218K900M930M852L011
57397B88604J664J644J894J642J263J261J789L014M664N609N008L605K747K553
57383C26961K209J653J695K526L356L512L063K454K170K559L353L759L655L934
57369C66859M894N254L935K011J318J762J715Q09M65J459K719K989K386J594P67
57354D00936p4l98L51J995L830N210N761N492M790L928K744J305O03J635L855
57339D41963N530N897N971O809P906Q017O925N582M758M435M475N151O445P426
57325E27290P102N887N301N890O371N647M700N043N960N306L062J829L053M904
$$ plain form
57427 279048 278557 278519 278318 277286 275531 273788 272173 270141 268134 267972 270526 273887 275172 273591 270700
57412 270700 268213 266711 266039 265699 265100 264439 264952 267260 270036 271693 272911 275811 280741 285593 288604
57397 288604 290268 291912 293806 295448 296711 297972 299761 302775 307439 313048 318056 321661 324408 326961
57383 326961 329170 330823 332518 335044 338400 341912 344975 347429 349599 352158 355511 359270 362925 366859
57369 366859 371753 377007 380942 382953 384271 386033 387748 388557 389022 390481 393200 396189 398575 400169 400936
57354 400936 400862 400464 400815 402810 406640 411850 417611 423103 427893 431821 434565 435870 436473 438108 441963
57339 441963 447493 453390 459361 466170 474076 482093 489018 494600 499358 503793 508268 513419 519864 527290
57325 527290 534392 540279 545580 551470 557841 563488 568188 573231 579191 584497 587559 589388 592441 597345
57311E97345N149M298M085M422M004K958K600L099L470L684M774O704Q021P873
57297F62486O919O115N958O916R001J0741J0267P860O022O531Q657J0583J1241
57284G69297J0447Q619O950O588P112P035O122N804O721P537P086O297O770Q432
57270H70817R862J0147R412Q150P046O868P621Q284Q205Q106Q942J0314J0964
57257I84738J0377R086P849P430Q606J1288J3811J4244J2554J0584R809R905R806
57244A120087R385R361R910J0209R599Q736Q894J0241J1561J2030J2433J3749
57232A246195J5244J5204J3490J2014J2280J3673J4758J5298J6126J7673J9426
57221A411381K0609K0848K0466K0431K1515K3171K3800K2704K1179K1035K2502
$$ plain form
57311 597345 602494 606792 610877 615299 619303 622261 624861 627960 631430 635114 639888 646592 654613 662486
57297 662486 669405 675520 681478 688394 697395 708136 718403 726263 732285 738816 747473 758056 769297
57284 769297 779744 788363 795313 801901 809013 816048 822170 827974 834695 842232 849318 855615 862385 870817
57270 870817 880679 890826 900238 908388 915434 922302 929923 938207 946412 954518 963460 973774 984738
57257 984738 995115 1004201 1012050 1019480 1028086 1039374 1053185 1067429 1079983 1090567 1100376 1110281 1120087
57244 1120087 1129472 1138833 1148743 1158952 1168551 1177287 1186181 1196422 1207983 1220013 1232446 1246195
57232 1246195 1261439 1276643 1290133 1302147 1314427 1328100 1342858 1358156 1374282 1391955 1411381
57221 1411381 1431990 1452838 1473304 1493735 1515250 1538421 1562221 1584925 1606104 1627139 1649641
57210A649641K4435K6209K8297L0846L2696L2547L0691K8799K7937K7512K6546
57199A966156K5339K4969K5400K5361K4345K3451K3522K3637K2645K1162K0604
57188B226591K0922K0996K0760K1119K1805K1421J9865J8758J8850J8825J7609
57177B447521J6304J6670J8838K1586K3913K5466K6349K7268K8878L0428L0292
57166B713513K8502K7185K7457K7471K5073K0917J7255J4786J2653J0606R082
57155B934500P745N975M546M872O739Q799J1154J5368K1651K8143L3546L8507
57143C121545M3574M7590M9330M9338M8806M7839M6156M4605M4447M5413M5805
57132C634448M4459M1732L8661L5908L3516L0999K7748K3819K0161J7548J5439
$$ plain form
57210 1649641 1674076 1700285 1728582 1759428 1792124 1824671 1855362 1884161 1912098 1939610 1966156
57199 1966156 1991495 2016464 2041864 2067225 2091570 2115021 2138543 2162180 2184825 2205987 2226591
57188 2226591 2247513 2268509 2289269 2310388 2332193 2353614 2373479 2392237 2411087 2429912 2447521
57177 2447521 2463825 2480495 2499333 2520919 2544832 2570298 2596647 2623915 2652793 2683221 2713513
57166 2713513 2742015 2769200 2796657 2824128 2849201 2870118 2887373 2902159 2914812 2925418 2934500
57155 2934500 2942245 2948220 2952766 2957638 2964377 2973176 2984330 2999698 3021349 3049492 3083038 3121545
57143 3121545 3165119 3212709 3262039 3311377 3360183 3408022 3454178 3498783 3543230 3588643 3634448
57132 3634448 3678907 3720639 3759300 3795208 3828724 3859723 3887471 3911290 3931451 3948999 3964438
57121C964438J2574Q546M153L02k640m552n508o323q131j0962j3537j5114j6615
57108C906631j9066k1730k3151k3614k4901k7485k9650k9941k9061k8458k8358
57097C621216k8397k8957l0361l1541l1215k9970k9522k9957k9360k6435k2102
57086C303399j8138j5297j3147j0896p976m445p01L559R360J6379K1816K3166
57074C307079K1501J9899J8846J5827R592K092m744j1484j9060k6573l3105l9991
57062C259879m9386o2081p8303r9147j25086j54178j83684k12866k42814k74463
57052A777871l08478l46143l88652B98715a88426n42665o03506o70824p45698
57043b751119q28452r17486j010276j106220j207045j314694j431863j565438
$$ plain form
57121 3964438 3977012 3985558 3989711 3990013 3987373 3982821 3977313 3970990 3962859 3951897 3938360 3923246 3906631
57108 3906631 3887565 3865835 3842684 3819070 3794169 3766684 3737034 3707093 3678032 3649574 3621216
57097 3621216 3592819 3563862 3533501 3501960 3470745 3440775 3411253 3381296 3351936 3325501 3303399
57086 3303399 3285261 3269964 3256817 3245921 3237945 3233500 3232799 3236358 3245718 3262097 3283913 3307079
57074 3307079 3328580 3348479 3367325 3383152 3392744 3394836 3390092 3378608 3359548 3332975 3299870 3259879
57062 3259879 3210493 3148412 3070109 2970962 2845876 2691698 2508014 2295148 2052334 1777871
57052 1777871 1469393 1123250 734598 298715 -188426 -731091 -1334597 -2005421 -2751119
57043 -2751119 -3579571 -4497057 -5507333 -6613553 -7820598 -9135292 -10567155 -12132593
57035a2132593j725880j921697k156838k433072k749828l101820l483678l896344
57027c3601750m338028m792130n254036n790743o541876p594797q822205r863470
57019h6599035j0303330r890134q608467o603167m094212j359794J272325L495746
57011a22690068N125643O142424O652111O810928O766399O628937O465149O304097
57003g1794380O149022N988134N803189N577508N301690M974538M601787M196085
56995b9202427L776470L363875K975075K620112K303689K027068J788741J584801
56987h762596J409632J257052J122263J003275Q99565Q09353P29767O59839b70880
56977B82313N12933M76211M42615M14015L90512L69561L48105L23414K92739K54950
$$ plain form
57035 -12132593 -13858473 -15780170 -17937008 -20370080 -23119908 -26221728 -29705406 -33601750
57027 -33601750 -37939778 -42731908 -47985944 -53776687 -60318563 -67913360 -76735565 -86599035
57019 -86599035 -96902365 -106792499 -115400966 -122004133 -126098345 -127458139 -126185814 -122690068
57011 -122690068 -117564425 -111422001 -104769890 -97958962 -91192563 -84563626 -78098477 -71794380
57003 -71794380 -65645358 -59657224 -53854035 -48276527 -42974837 -38000299 -33398512 -29202427
56995 -29202427 -25425957 -22062082 -19087007 -16466895 -14163206 -12136138 -10347397 -8762596
56987 -8762596 -7352964 -6095912 -4973649 -3970374 -3070809 -2261456 -1531689 -871850 -270880
56977 282313 795246 1271457 1714072 2128087 2518599 2888160 3236265 3559679 3852418 4107368
56967D107368K13200J74059J43052J21465J07181R7103Q8677Q0497P2325O4215
56957E269142N5703M6419L7170K9316K3127J7588J1744N310j869r880j8158k5819
56945E439793l2769l9631m6520n2732n7839o2307o6923p2225p8379q4770q9899
56934D755799r2765r4245r6106r8762j01281j03416j05956j08885j11076j12509
56924C730798j14992j19664j25470j31404j38595j48325j59100j67738j72769
56915B452741j74881j74492j70979j64311j55492j45059j32864j19700j07386
56906A107577r6567q5961p4738o4173n5795m9047m2133l4438k6842k0323j5515
56895E42045j3223j3852j6332j8802k0477k1767k2597k2084k0263j8676j8121
$$ plain form
56967 4107368 4320568 4494627 4637679 4759144 4866325 4963428 5052105 5132602 5204927 5269142
56957 5269142 5324845 5371264 5408434 5437750 5460877 5478465 5490209 5495519 5493650 5483770 5465612 5439793
56945 5439793 5407024 5367393 5320873 5268141 5210302 5147995 5081072 5008847 4930468 4845698 4755799
56934 4755799 4663034 4568789 4472683 4373921 4272640 4169224 4063268 3954383 3843307 3730798
56924 3730798 3615806 3496142 3370672 3239268 3100673 2952348 2793248 2625510 2452741
56915 2452741 2277860 2103368 1932389 1768078 1612586 1467527 1334663 1214963 1107577
56906 1107577 1011010 925049 850311 786138 730343 681296 639163 604725 577883 557560 542045
56895 542045 528822 514970 498638 479836 459359 437592 414995 392911 372648 353972 335851
56884C35851j7038j3606q857n856n620n554k876J786N536P158Q189J0232J2927
56871C22272J5122J6495J6957J5451J0837L658m049j0559j5199j7693j8087j7462
56859C17743j7374j7992j7687j5245j1793r775j0220j1721j1955r831o193k797
56847A75160p60Q9L94K88m07j280j439o95R9J92j59k78K6O28J677L381N426P126
56829A89468Q077Q458Q866J0062J2463J5400J7175J6256J2562P431K646m82j604
56816C06778j389q91n19K29J930M483P339J0035J2219J3686J4800J6465J9164
56803D04329K2389K5446K8463L1926L5328L6934L4928K8753J9445R038m52p804
56791F68723j2555j4625j4440j3137j1828j0419p994m478j014J815N005R600J5032
$$ plain form
56884 335851 318813 305207 296350 290494 284874 279320 276444 278230 283766 290924 299113 309345 322272
56871 322272 337394 353889 370846 386297 397134 400792 396743 386184 370985 353292 335205 317743
56859 317743 300369 282377 264690 249445 237652 227877 217657 205936 193981 184150 177957 175160
56847 175160 174400 174489 174883 175171 174764 173484 172045 171350 171449 171641 171482 171204 171230 171858 173535 176916 182342 189468
56829 189468 197545 206003 214869 224931 237394 252794 269969 286225 298787 306218 308864 308382 306778
56816 306778 305389 304498 303979 304208 306138 310621 317960 327995 340214 353900 368700 385165 404329
56803 404329 426718 452164 480627 512553 547881 584815 619743 648496 667941 676979 676527 668723
56791 668723 656168 641543 627103 613966 602138 591719 583725 579247 578233 580048 585053 594653 609685
56778F09685K0009K4441K9372L5310M1518M6527M8418M5199L6230K3206Q833n269
56766I63479j8355k8856l4644l5397l3320l0857k8585k5788k2103j7809j3204
56755F74561q507m117l31L175P129J1935J7252K2190K5800K7404K6440K2192J4255
56742H39378L611p386j6615k3551k8512l1281l1373k9398k6998k5304k4015k2011
56730E76545j8424j3384q383n424m919m735k338K404P488J1258J3257J3065J0279
56717E76689N813J393k724p828j3943j8836k0900k1323k1882k2090k0414j7367
56705D16588j5245j5034j5335j4560j2687j0582q796p553p016p008p008o752o425
56692B82587o119n619m883m179l564k715j682j222j874l018l455k982k709l515
$$ plain form
56778 609685 629694 654135 683507 718817 760335 806862 855280 900479 936709 959915 968748 963479
56766 963479 945124 916268 881624 846227 812907 782050 753465 727677 705574 687765 674561
56755 674561 666054 661937 661606 664781 671910 683845 701097 723287 749087 776491 802931 825123 839378
56742 839378 842989 835603 818988 795437 766925 735644 704271 674873 647875 622571 598556 576545
56730 576545 558121 544737 536354 530930 526011 521276 518938 521342 528830 540088 553345 566410 576689
56717 576689 582502 583895 581171 573343 559400 540564 519664 498341 476459 454369 433955 416588
56705 416588 401343 386309 370974 356414 343727 333145 324349 316796 309780 302772 295764 289012 282587
56692 282587 276468 270849 265966 261787 258223 255508 253826 252604 250730 247712 244257 241275 238566 235051
56678B35051m623m426k633q61p67k083l069k621j230k9N16P05Q61Q84M38m12r46
56661B14755m86M38L29j419l431l879k680j230l50L01Q81P95j10r29q97l43P7
56644B01822L59P59J133J301J472J802J985J809J608J649J518O67o77j573j203
56629B14431M47K348K921J503n73j169Q6J392J249L20J26Q86J744K293K704K757
56613B33465K052J078R19J704K283J686K69r15j353j290j049o40q1J48n88k061
56597B35627k860j729Q21K870L305K907K922L288K919J358o02j733j441j75R47
56582B48424J211J119J624K397J772r10l661l699p44K593L743K626R19k62j127
56567B56025k029k430j598K8R37K95r73j458j115j109j969k913l081k507j598
$$ plain form
56678 235051 230428 226002 223369 222508 221741 219658 216589 213968 212738 212709 213225 213930 214791 215675 216113 215701 214755
56661 214755 214269 214707 215036 213617 210186 206307 203627 202397 202047 202348 203229 204024 203914 202985 202088 201745 201822
56644 201822 202181 202940 204073 205374 206846 208648 210633 212442 214050 215699 217217 217884 217207 215634 214431
56629 214431 214878 217226 220147 221650 221077 219908 219994 221386 222635 222955 223081 223967 225711 228004 230708 233465
56613 233465 235517 236595 237514 239218 241501 243187 243456 242541 241188 239898 238849 238209 238128 238276 237688 235627
56597 235627 232767 231038 231859 234729 238034 240941 243863 247151 250070 251428 250826 249093 247652 247477 248424
56582 248424 249635 250754 252378 254775 256547 255637 251976 248277 247533 250126 253869 256495 257414 257152 256025
56567 256025 253996 251566 249968 249996 250933 251228 250255 248797 247682 246573 244604 241691 238610 236103 234505
56552B34505m62O96J228O69p21k337l652m034k902o48J198J372K04r69j269p68
56536B22110P8Q97J435J591J447J110P07N07P61J360J925K202K051J311K69j19
56520B39642P92K313L223L331L294L209K672K062K288L198L708L687M034M697
56506B82150M467L287K872M124N777O582P045P842Q331P981P540P192N421J647
56492C62258j676j974l11J82j318k981l658l813l473j916K23R11n86k740m018
56477C35110m468m615m340l558k735k205j850j758k232k995l381l311l141k604
56463B91917j169N90J300N72o52j580k198k343j565j47Q47Q88L82k59r06j147
56447B84530n92K73O67Q54J509K005J053q88j730p96J38l04r84j80J660K523J492
$$ plain form
56552 234505 234043 234739 235967 236636 235915 233578 229926 225892 222990 222342 223540 224912 225116 224147 222878 222110
56536 222110 222188 223085 224520 226111 227558 228668 229375 229882 230643 232003 233928 236130 238181 239492 239761 239642
56520 239642 240434 242747 245970 249301 252595 255804 258476 260538 262826 266024 269732 273419 277453 282150
56506 282150 286617 289904 292776 296900 302677 309259 316304 324146 332477 340458 347998 355190 360611 362258
56492 362258 360582 358608 358297 358479 357161 354180 350522 346709 343236 341320 341543 342454 341868 339128 335110
56477 335110 330642 326027 321687 318129 315394 313189 311339 309581 307349 304354 300973 297662 294521 291917
56463 291917 290748 291338 292638 293210 292558 290978 288780 286437 284872 284725 285572 286460 286842 286583 285677 284530
56447 284530 283938 284211 284878 285732 287241 289246 290299 289411 287681 286885 287023 286719 285735 285555 287215 289738 291230
56430B91230l54j285m14J751L689M117L148J821N85q77k338k843k191j412j145
56415B93482o64O81K067K227J179j2o55q06n53J90J259K146K335J574J32j070
56399C03512j114r4R04J121R05Q38P10j01j394j963q36J409K968K676J427J084
56383C12052K023K694K033J088J180J553M87j734k797j439R65K315K016Q51l72
56368C22915j259j598j292l71R78K214K687K469K407K724K368P53p07k82J457
56353C35463K313J427q5j217j915j836k26K422M208L986K462Q28l92q98m32N34
56337C46642J191J661K611L615L486K365J707J845J497J11j250j972k827l937
56323C56745l890k044N8R11J033J482J936J703J226J091Q29J16j19P19J446Q89
$$ plain form
56430 291230 290876 289591 289177 290928 294617 298734 301882 303703 304288 303411 301073 298230 296039 294627 293482
56415 293482 292818 293499 295566 297793 298972 298960 298305 297499 296946 297136 298395 300541 302876 304450 304582 303512
56399 303512 302398 302304 303208 304329 305234 306072 306782 306681 305287 303324 302488 303897 306865 309541 310968 312052
56383 312052 314075 316769 318802 319890 321070 322623 323110 321376 318579 317140 318105 320420 322436 323287 322915
56368 322915 321656 320058 318766 318395 319373 321587 324274 326743 329150 331874 334242 334995 334288 334006 335463
56353 335463 337776 339203 339118 337901 335986 334150 333924 336346 340554 344540 347002 347830 347438 346540 346108 346642
56337 346642 347833 349494 352105 355720 359206 361571 363278 365123 366620 366731 365481 363509 360682 356745
56323 356745 352855 350811 350869 351780 352813 354295 356231 357934 359160 360251 361080 361196 361077 361796 363242 364131
56307C64131n9J69J285J839J607J505J682J486R98J000J586K193K710L273L236
56292C88641J901J61p3J602L335L166J139r47j280N83L410N229M948L235J687
56277D16737J376K263L548M306M152L575L260L087K497J839K235L818N142M960
56263D62795L729K832L133M675O707P496N408J094k449k979j252O12J831K855
56249D96487L669L812L614M026N264O519O921O207M823L896M506O429Q096Q377
56235E72646P696O991O528O352O807P743Q170P675P303Q046R367J0265J0922J1991
56221F88502J3005J3024J2450J2848J4890J7599J9612K0483K0640K0787K1449
56210H75289K2802K4796K7375L0199L2486L3880L5271L7753M0991M3916M6890
$$ plain form
56307 364131 364072 364241 365526 367365 368972 370477 372159 373645 374643 375643 377229 379422 382132 385405 388641
56292 388641 390542 390703 390630 392232 395567 398733 399872 398925 397645 398228 401638 406867 411815 415050 416737
56277 416737 418113 420376 423924 428230 432382 435957 439217 442304 444801 446640 448875 452693 457835 462795
56263 462795 466524 469356 472489 477164 483871 491367 496775 497869 495420 492441 491189 491801 493632 496487
56249 496487 500156 503968 507582 511608 516872 523391 530312 536519 541342 545238 549744 556173 564269 572646
56235 572646 580342 587333 593861 600213 607020 614763 622933 630608 637911 645957 655324 665589 676511 688502
56221 688502 701507 714531 726981 739829 754719 772318 791930 812413 833053 853840 875289
56210 875289 898091 922887 950262 980461 1012947 1046827 1082098 1119851 1160842 1204758 1251648
56199A251648N1375N7216O2329O5909O9963P6457Q4592R2307R9170J06260J14255
56188B131481J22859J31253J38144J42432J44670J46542J48050J46738J40890
56179C393059J31705J21004J08440R2746P4257N4295L3341J1700r226k8315m6345
56168C936661o4393q1514r5891j07343j16725j23742j27503j28621j28617j27645
56158B834667j24713j19855j14321j08848j03286r7697r2423q7471q2927p9315
56148A823811p6389p2564o6934o0828n5872n1721m7332m3181m0161l7497l4024
56137A237308l0542k8517k7306k5078k1854j9119j7015j4504j1898j0579j0287
56126A020609r223o953m961m146l958m000m339m164k402J17J234M40n80o19j32
$$ plain form
56199 1251648 1303023 1360239 1422568 1488477 1558440 1634897 1719489 1811796 1910966 2017226 2131481
56188 2131481 2254340 2385593 2523737 2666169 2810839 2957381 3105431 3252169 3393059
56179 3393059 3524764 3645768 3754208 3846954 3921211 3975506 4008847 4020547 4011321 3983006 3936661
56168 3936661 3872268 3790754 3694863 3587520 3470795 3347053 3219550 3090929 2962312 2834667
56158 2834667 2709954 2590099 2475778 2366930 2263644 2165947 2073524 1986053 1903126 1823811
56148 1823811 1747422 1674858 1607924 1547096 1491224 1439503 1392171 1348990 1308829 1271332 1237308
56137 1237308 1206766 1178249 1150943 1125865 1104011 1084892 1067877 1053373 1041475 1030896 1020609
56126 1020609 1011386 1004433 999472 995326 991368 987368 983029 978865 976463 976580 977814 978254 977674 977055 976923
56111I76923M36J487L053M493N768P426R211J0273J0797J1784J3194J4046J4211
56098A083102J4429J4737J4809J5592J8529K3129K7452L0882L4393L8107M1175
56087A356336M4248M9384N6843O4483P1199P8596Q7855R6915J02332J02641R8698
56076B209530R1788Q2676P1997O0826N1057M4914M3043M3160M1746L7216L0555
56065B808508K3363J6628J1112P104L522j430q619j7962k9644m3830n9236p3379
56053B636137q4217r0700r2369q9916q5378q0295p4174o6298n8023n1353m6122
56042A817292m0821l5428l0992k7025k2079j6735j3286j2191j1277q793n197j641
56030A591827J420L850N729P618R533J0238R224Q424R824J2304J3313J2838J2922
$$ plain form
56111 976923 977359 978846 981899 986392 992160 999586 1008797 1019070 1029867 1041651 1054845 1068891 1083102
56098 1083102 1097531 1112268 1127077 1142669 1161198 1184327 1211779 1242661 1277054 1315161 1356336
56087 1356336 1400584 1449968 1506811 1571294 1642493 1721089 1808944 1905859 2008191 2110832 2209530
56076 2209530 2301318 2383994 2455991 2516817 2567874 2612788 2655831 2698991 2740737 2777953 2808508
56065 2808508 2831871 2848499 2859611 2866715 2870237 2868807 2860188 2842226 2812582 2768752 2709516 2636137
56053 2636137 2551920 2461220 2368851 2278935 2193557 2113262 2039088 1972790 1914767 1863414 1817292
56042 1817292 1776471 1741043 1710051 1683026 1660947 1644212 1630926 1618735 1607458 1598665 1593468 1591827
56030 1591827 1593247 1597097 1602826 1610444 1619977 1630215 1639439 1647863 1657687 1669991 1683304 1696142 1709064
56017A709064J4050J5034J6016J8258K1087K2270K1555K0855K0741J9910J8456
56006A917296J8470K0675K3197K4533K5345K6608K8229L0048L2260L4436L5861
55995B216958L6766L7626L7883L7251L7267L9179M1506M2215M2048M2684M3216
55984B654599M2029M0767M2372M6109M8800N0172N2531N5769N7363N7351N8646
55973C206508O2160O5873O8915P2432P6289P9069Q1418Q5336R0224R3743R6178
55962D078145R9762J04282J07997J12121J19238J27927J34328J38490J43712J50268
55952E316270J55940J62099J72533J86233J98184K07612K18775K33330K48856
55943G099832K65265K85380L08423L30301L51086L74854M01479M26421M49420
$$ plain form
56017 1709064 1723114 1738148 1754164 1772422 1793509 1815779 1837334 1858189 1878930 1898840 1917296
56006 1917296 1935766 1956441 1979638 2004171 2029516 2056124 2084353 2114401 2146661 2181097 2216958
55995 2216958 2253724 2291350 2329233 2366484 2403751 2442930 2484436 2526651 2568699 2611383 2654599
55984 2654599 2696628 2737395 2779767 2825876 2874676 2924848 2977379 3033148 3090511 3147862 3206508
55973 3206508 3268668 3334541 3403456 3475888 3552177 3631246 3712664 3798000 3888224 3981967 4078145
55962 4078145 4177907 4282189 4390186 4502307 4621545 4749472 4883800 5022290 5166002 5316270
55952 5316270 5472210 5634309 5806842 5993075 6191259 6398871 6617646 6850976 7099832
55943 7099832 7365097 7650477 7958900 8289201 8640287 9015141 9416620 9843041 10292461
55934A0292461M75279N05280N36207N68652O07179O51086O94440P36584P82992
55925A5850160Q34329Q85129R35004R90221J052224J116144J182961J260863J351496
55916B5458531J447454J546747J656862J781059J914802K059842K227336K422293
55908D0514926K639928K881907L160205L480638L841139M252126M739202N319347
55900G0829418N994787O775303P681200Q717282R874053J1166996J2645733J4354220
55892A48038992J6315352J8557681K1095643K3847283K6602403K9044793L0650572
55885C14152719L0483102K7316294K0379342J0222664j220797j1608342j9364260
55878C70360722k4115290k6313599k6668784k5840993k4354433k2565775k0674974
$$ plain form
55934 10292461 10767740 11273020 11809227 12377879 12985058 13636144 14330584 15067168 15850160
55925 15850160 16684489 17569618 18504622 19494843 20547067 21663211 22846172 24107035 25458531
55916 25458531 26905985 28452732 30109594 31890653 33805455 35865297 38092633 40514926
55908 40514926 43154854 46036761 49196966 52677604 56518743 60770869 65510071 70829418
55900 70829418 76824205 83599508 91280708 99997990 109872043 121039039 133684772 148038992
55892 148038992 164354344 182912025 204007668 227854951 254457354 283502147 314152719
55885 314152719 344635821 371952115 392331457 402554121 401333324 389724982 370360722
55878 370360722 346245432 319931833 293263049 267422056 243067623 220501848 199826874
55871A99826874j8793038j6995281j5319488j3764885j2325838j1012392r830789
55864A01785163q769393p816520o971959o230703n574382m988782m473537m026167
55856E2933720l632459l280654k970486k700619k460921k244566k054753j892134
55848C1697128j747381j613274j493047j389866j298096j211549j131314j059392
55840B0753209r92997r30543q75114q27210p81737p36449o95341o59697o24136
55831A3629985n85976n50171n20158m91835m61914m34743m14859l99196l82452
55822I388681l64768l48754l33837l18513l03956k91137k78325k64970k53896
55813F630525k46336k39027k29319k18974k09917k00652j89927j79862j72352
$$ plain form
55871 199826874 181033836 164038555 148719067 134954182 122628344 111615952 101785163
55864 101785163 93015770 85199250 78227291 71996588 66422206 61433424 56959887 52933720
55856 52933720 49301261 46020607 43050121 40349502 37888581 35644015 33589262 31697128
55848 31697128 29949747 28336473 26843426 25453560 24155464 22943915 21812601 20753209
55840 20753209 19760212 18829669 17954555 17127345 16345608 15609159 14913818 14254121 13629985
55831 13629985 13044009 12493838 11973680 11481845 11019931 10585188 10170329 9771133 9388681
55822 9388681 9023913 8675159 8341322 8022809 7718853 7427716 7149391 6884421 6630525
55813 6630525 6384189 6145162 5915843 5696869 5486952 5286300 5096373 4916511 4744159
55804D744159j66034j59447j53507j48596j42994j36297j30486j25860j20059
55795C460879j12877j07504j05071j02601r8460r5090r3996r2846r0066q7716
55785B474652q7031q5685q2233p8920p7187p4828p0426o6366o4145o1154n5513
55774A671164m9983m7326m5558m1762l7182l4593l3408l1389k8773k7135k6193
55763A267862k4917k3885k3695k3111k1317j9864k0021k0475k0005j9918k1234
55752A029420k1939j9860j6182j3536j2425j1901j1688j1460j0002p299n509n806
55740H81813o304n004k603n38J295K912K872Q34q90n28N86O84L67N38J16j717
55724H74433l341l290k838l681n157o173p550r895j1425j0688r285r116q895o389
$$ plain form
55804 4744159 4578125 4418678 4265171 4116575 3973581 3837284 3706798 3580938 3460879
55795 3460879 3348002 3240498 3135427 3032826 2934366 2839276 2745280 2652434 2562368 2474652
55785 2474652 2387621 2301936 2219703 2140783 2063596 1988768 1918342 1851976 1787831 1726677 1671164
55774 1671164 1621181 1573855 1528297 1486535 1449353 1414760 1381352 1349963 1321190 1294055 1267862
55763 1267862 1242945 1219060 1195365 1172254 1150937 1131073 1111052 1090577 1070572 1050654 1029420
55752 1029420 1007481 987621 971439 957903 945478 933577 921889 910429 900427 893128 887619 881813
55740 881813 875509 870505 867902 867364 868659 871571 874443 875277 874387 873859 874445 875129 875496 876034 876150 874433
55724 874433 871092 867802 864964 861283 856126 849953 842403 832508 821083 810395 801110 791994 783099 776710
55710G76710k372N73J591J086j597o948j2830j6248j6857j6383j5518j3819j1690
55697F65698j0056q674o872n263m885n518o351p391q696r520r642j0092j1042
55684E61696j0727q293n825n459o142n552l741k574k850m108o052q058q560p027
55670D76728n381n490o558o871o565o589o519n689n012n349n496m194k624k396
55656D01995k546j305N75J273J543L572O829Q255O538L424Q03j035k144k372k359
55641D23046l102m377n147n396n913o607o722o382o225n907m593k733j672j863
55627C56407k758l927m931m825l340j828j489j531o53O71J208J350K337L847M370
55612C44908L599K460J372K21m21L1P07J98j400k838l521l487k455n76P44M96
$$ plain form
55710 776710 774338 774911 776502 777588 775991 769043 756213 739965 723108 706725 691207 677388 665698
55697 665698 655642 646968 640096 634833 629948 624430 618079 610688 601992 592472 582830 572738 561696
55684 561696 550969 542676 536851 531392 525250 519698 515957 513383 510533 506425 500373 492315 483755 476728
55670 476728 471347 465857 459299 452428 445863 439274 432755 427066 422054 416705 411209 407015 404391 401995
55656 401995 399449 398144 398719 399992 401535 405107 411936 420191 426729 430153 430956 429921 427777 425405 423046
55641 423046 419944 415567 410420 405024 399111 392504 385782 379400 373175 367268 362675 359942 358270 356407
55627 356407 353649 349722 344791 339966 336626 334798 333309 331778 331125 331796 333004 334354 336691 340538 344908
55612 344908 348507 350967 352339 352560 352139 352170 352877 353075 351675 348837 345316 341829 339374 338798 339542 340038
55596C40038l05k46K67L23O02J873K660J168j288j693L15K244K672K540K555K002
55580C55727N41j209l121n550p636p863o506n509n666n997n953o113o370n777
55566B82998m622m479n535n898m429k460j769k322k865k604j557k59L08n41k246
55551B41720l526l945m025m078l978l891m006l766k623j290q87j162j000m20m71
55536B02652j304j884j617q58R5J154J743J323M75J39J55j44m39j15J96m47j253
55519A99871o09J340K866L258L319L526L678M129N338O361N912M704M606N479
55505B53778N213L062N63j155k637m183m932m658m434m759m757l987l410l783
55491B19921m613n146n233m885m311m233m753m291j563J813L000J925J041J305
$$ plain form
55596 340038 339733 339487 339754 340077 340679 342552 345212 346380 345092 343399 343714 345958 348630 351170 353725 355727
55580 355727 356268 355059 351938 346388 338752 330889 324383 318874 313208 307211 301258 295145 288775 282998
55566 282998 278376 273897 268362 262464 258035 255575 253806 251484 248619 246015 244458 244199 244507 243966 241720
55551 241720 238194 234249 230224 226146 222168 218277 214271 210505 207882 206592 205705 204543 203543 203123 202652
55536 202652 201348 199464 197847 196989 197084 198238 199981 201304 201779 201918 202073 201929 201490 201375 201571 201124 199871
55519 199871 199262 200602 203468 206726 210045 213571 217249 221378 226716 233077 238989 243693 248299 253778
55505 253778 258991 262053 262616 261461 258824 254641 249709 245051 240617 235858 231101 227114 223704 219921
55491 219921 215308 210162 204929 200044 195733 191500 186747 182456 180893 182706 185706 187631 188672 189977
55477A89977J354Q39J284K739K808N18j688j445L05J293R47n1j312k218j700n3
55461A93597P69n7r75q32q43k176l748m278m572n636o275m968k765j934k671l426
55445A49210l624l860l967l088j533o39q00j128j064j032j399j873j924j186L24
55430A22417J886K461J929J217Q63M03k13J35K070M306N063M098K445R50nj68
55414A49857K11L46J0j77j51q41k432l509k982j631n88L30J406J570m1k143k775
55397A36460k003j335j069k18J295K232J927R74q9j291k235j900k5K108K778J397
55381A39006j025k670k392q00M02L53k81o55p87o84K55J966K847J548r95k545
55365A33543k217r86L1N64O71L95K1j02j0J59O66J815L213L902L165J089j313
$$ plain form
55477 189977 191331 192170 193454 196193 199001 199519 197831 196386 196691 197984 198931 198880 197568 195350 193650 193597
55461 193597 194366 194309 193334 192502 191659 189483 185735 181457 176885 171249 164974 160006 157241 155307 152636 149210
55445 149210 145586 141726 137759 134671 133138 132499 131699 130571 129507 128475 127076 125203 123279 122093 122417
55430 122417 124303 126764 128693 129910 130773 131176 130963 131098 133168 137474 142537 146635 149080 150030 150025 149857
55414 149857 150068 150414 150424 150247 150096 149255 146823 143314 140332 138701 138113 138443 139849 141419 141378 139235 136460
55397 136460 134457 133122 132053 131835 133130 135362 137289 138263 138174 136883 134648 132748 132723 134831 137609 139006
55381 139006 137981 135311 132919 132119 132521 132874 132593 131938 131151 130467 130722 132688 135535 137083 136088 133543
55365 133543 131326 130340 130371 130935 131606 132001 132022 131920 131910 132069 132735 134550 137763 141665 144830 145919 144606
55348A44606k478j617J42Q48J29n36k68ro90j654j948j849j873j561n46K80R5
55331A31071m60n44p02j532j890m09J959K986K276J373J063N98l35r39r13j095
55315A32507j865k211j039J365L547M006K282m09j900j380m88j112k728l293k357
55300A24925j457j426j150N01K847M237L716J486j357l093k418J55K449K756J391
55285A33562l5m57k04k61r55j516j189m79n28j142q10Q55K083J496L15M42J452
55268A32629J465K98m02L9N87O75J099K156K670J752J62q08r05p17p73j315k195
55251A36417k715k248j154l41N5O06J307J535J305J309J518J019l57j427j280
55236A35549m38R9O5l04q25j155p37M56J644J964J208j43j030m16J417K452J017
$$ plain form
55348 144606 142128 140511 140653 141501 141630 141094 140826 140817 140127 138473 136525 134676 132803 131242 130696 130976 131071
55331 131071 130611 130067 129365 127833 125943 125534 127493 130479 132755 134128 135191 135789 135454 134515 133602 132507
55315 132507 130642 128431 127392 128757 132304 136310 138592 138183 136283 134903 134415 133303 130575 127282 124925
55300 124925 123468 122042 120892 121393 124240 128477 132193 133679 132322 129229 126811 126966 129415 132171 133562
55285 133562 133527 133070 132866 132605 131650 130134 128945 128466 127938 126796 125986 126841 128924 130420 130735 131177 132629
55268 132629 134094 134392 133990 134029 134616 135291 136390 138546 141216 142968 143130 142322 141417 140700 139927 138612 136417
55251 136417 133702 131454 130300 129959 130014 130620 131927 133462 134767 136076 137594 138613 138256 136829 135549
55236 135549 135111 135210 135275 134971 134146 132991 132254 132710 134354 136318 137526 137383 136353 135937 137354 139806 140823
55219A40823j883l596l092j768r71m94N0J72k93m43K21P53J66j060j814j791j234
55202A23746j65J156J880J603J109J241J661J556Q91J31o60j513j929j430l48
55187A28929N76J057J115P21J39j4K76J33q08j482q41M76J054P65O44J060J264
55170A35064O78m46j777l136l736k351J002M179M584J796j839l443k276j11R75
55155A29163P52M41P93J385J801K335L035L011J532p82k582l304l337l046k370
55140A28827j251N7J091J365P96J35L38J157J208j8j043l40J419K307J911J638
55124A39597K308K950K352P13r33j951k179j466P2J624K135J201n87k071k330
55109A41435j467o03o49j158r25L69J873K896L455L304J715r69k746k190n74k14
$$ plain form
55219 140823 138940 135344 132252 130484 129513 129019 129069 129241 128948 128505 128726 129479 129645 128585 126771 124980 123746
55202 123746 123581 124737 126617 128220 129329 130570 132231 133787 134678 134809 134149 132636 130707 129277 128929
55187 128929 129505 130562 131677 132398 132537 132523 132799 132932 132124 130642 129801 130277 131331 132096 132740 133800 135064
55170 135064 135742 135296 133519 130383 126647 124296 125298 129477 134061 135857 134018 130575 128299 128188 129163
55155 129163 129915 130356 131149 132534 134335 136670 139705 142716 144248 143466 140884 137580 134243 131197 128827
55140 128827 127576 127633 128724 130089 130885 131020 131358 132515 133723 133705 132662 132322 133741 136048 137959 139597
55124 139597 141905 144855 147207 147920 146987 145036 142857 141391 141463 143087 145222 146423 145836 143765 141435
55109 141435 139968 139365 138716 137558 136633 137002 138875 141771 145226 148530 150245 149276 146530 144340 143766 143552
55093A43552j155j166P87K863K878J164k98o08m77n70p01o77p17p78m22L09O61
55076A44645K05n35q64p23l71J73Q85J342J052j6j419k432k243o60J142J456J36
55059A41773r94m58R74J602J135N09K6p81j638j459p1J301J677J407J197J142
55043A47342J099J146J079L77p66j207l50Q87J369J253J400J798J606N43o46j114
55027A55816p30q1N0o28j428j228J74J692K309K205J978J567P79K19M96R53N50
55010A64693j95L09K064L002J781l71j620k051k704l119j819Q58K438J503k66
54995A64503l16J436K777K233O66k44r0J06o62k309l836m390l997l211k086j12
54979A50468K512M161L321P06j163q18N62Q41m64j865j843m47R09R11l71j580
$$ plain form
55093 143552 142397 141231 142018 144881 147759 148923 148625 148017 147540 146970 146269 145592 144875 144097 143675 143984 144645
55076 144645 144850 144315 143451 142728 142357 142530 143415 144757 145809 145793 144374 141942 139699 139039 140181 141637 141773
55059 141773 140779 140321 141295 142897 144032 144541 144567 143786 142148 140689 140618 141919 143596 145003 146200 147342
55043 147342 148441 149587 150666 151043 150277 149070 148720 149607 150976 152229 153629 155427 157033 157576 156930 155816
55027 155816 155086 155005 155055 154427 152999 151771 151945 153637 155946 158151 160129 161696 162475 162694 163190 164143 164693
55010 164693 164498 164807 166871 169873 171654 171283 169663 167612 164908 161789 159970 160828 163266 164769 164503
54995 164503 164187 165623 168400 170633 171299 171055 170965 171071 170409 168100 164264 159874 155877 152666 150580 150468
54979 150468 152980 157141 160462 161168 160005 159187 159749 160590 160126 158261 156418 155971 156880 157791 157420 155840
54963A55840j548n68J67J31k83q63j781k430j463J149L223K750M15j362j313r0
54947A51974J319K447K782J889L55m21K51J706K790K712J326n19j171P6J620J301
54931A70437o73j997j632r74j116r18Q83L137L588J888k52j495j922j791p88J075
54915A67450K831L462K964K125J498R84K68o02j261j567j799k116k188j720j025
54900A69304m77K34J479K559K341J038J11J04n8j043j754j064L11R85J188K218
54884A77476L918M336K302q95k903k771j510o71q21j259r73K35J658K549K700
54869A83371K099O67j195k323j816mJ961L313L896L682K809K061K422L902N350
54854B10195N706N104M490M487M921N276N236M610L061M39k504m324m358l651
$$ plain form
54963 155840 154292 153724 153891 154022 153739 152876 151095 148665 147202 148351 151574 154324 154739 153377 152064 151974
54947 151974 153293 155740 158522 160411 160766 160345 160596 162302 165092 167804 169130 168611 167440 167516 169136 170437
54931 170437 169764 167767 166135 165161 164045 163127 164010 167147 170735 172623 172371 170876 168954 167163 166375 167450
54915 167450 170281 173743 176707 178832 180330 181314 181582 180980 179719 178152 176353 174237 172049 170329 169304
54900 169304 168827 169061 170540 173099 175440 176478 176589 176693 176635 175592 173838 172774 173085 174070 175258 177476
54884 177476 181394 185730 188032 187137 184234 181463 179953 179282 178461 177202 176229 176464 178122 180671 183371
54869 183371 185470 186137 184942 182619 180803 180799 182760 186073 189969 193651 196460 198521 200943 204845 210195
54854 210195 215901 221005 225495 229982 234903 240179 245415 250025 253086 253525 251021 246697 242339 238688
54840B38688l745m797n704n797n415m824l858k818k388k158p08J995L656K458
54826B04585k91j822j399m63J39J008K295K892K144R57M39N04O57J223K822N077
54810B20767O671O717N610M548M321M594M318K975J172k76j417k717l905m167
54796B49211l573l298m093n302n969o171o523o814o094m252k691k848m370n396
54782A81817m843l662l347l680l061j028Q65J186N24L33P69R83R23J309J990J846
54766A72924N99n80p98o44j035j776k061j752j366j130o95L52K011L687M362L395
54750A75493J392j26k48M96R91O86k86j425j907j008R08K363K347J474R53R19
54734A83022O09j35o03l89P0L08M41O93R62J211J767K820L980M630M462L397J494
$$ plain form
54840 238688 234943 230146 224442 218645 213230 208406 204548 201730 199342 197184 196476 198471 202127 204585
54826 204585 204294 202472 201073 200610 200749 201757 204052 206944 209088 210045 210484 210988 211645 212868 215690 220767
54810 220767 227438 234155 239765 244313 248634 253228 257546 260521 261693 261417 260000 257283 253378 249211
54796 249211 245638 242340 238247 232945 226976 220805 214282 207468 201374 197122 194431 191583 187213 181817
54782 181817 176974 173312 169965 166285 163224 162196 163061 164247 164771 165104 165873 166856 167779 169088 171078 172924
54766 172924 173523 172943 172145 171501 170466 168690 166629 164877 163511 162381 161686 162038 164049 167736 172098 175493
54750 175493 176885 176759 176511 177007 177998 178684 178398 176973 175066 174058 174966 177329 179676 181150 182103 183022
54734 183022 183631 183496 182893 182504 182574 182882 183323 184016 184978 186189 187956 190776 194756 199386 203848 207245 208739
54717B08739p24k217k293j405o29m69n23k25O48K025L582M662M780M245L756L389
54701B27341K787K407L394N669P305O838N248M359M028K712L77j316j905l002
54687B66242n325o861n588k667j144k222m495o239o794o023m239k797l031m285
54673B04532m370k459j44Q97R39J062J238Q23K60P60K429L827L712K434J288R66
54657B18194J167J554K561M761P531Q999P850M843J956K39p35j470j765j728k388
54642B51569m361o531p134n976m641m398m756m409k970j221l9L45R7n50j141j073
54626B02811l45O7p30k110k388j036M28L85p88j539j508j750k651l039j905P4
54610A83976J443J667J164K99q44j971k562k300j208K99J265P78o72j189K56K108
$$ plain form
54717 208739 208015 205798 203505 202100 201471 201002 200479 200254 200902 202927 206509 211171 215951 220196 223952 227341
54701 227341 230128 232535 235929 241598 248903 255741 260989 265348 269376 272088 272465 271149 269244 266242
54687 266242 260917 254056 248468 245801 244657 242435 237940 231701 224907 218884 214645 211848 208817 204532
54673 204532 200162 197703 197559 198456 199395 200457 201695 202518 202778 203538 205967 209794 213506 215940 217228 218194
54657 218194 219361 220915 223476 228237 235768 244767 252617 257460 259416 259655 258920 257450 255685 253957 251569
54642 251569 247208 240677 233543 227567 222926 218528 213772 209363 206393 205172 205133 205478 205575 205025 203884 202811
54626 202811 202466 202533 201803 199693 197305 196269 196697 197082 196294 194755 193247 191497 188846 185807 183902 183976
54610 183976 185419 187086 188250 188549 187705 185734 183172 180872 179664 179963 181228 182006 181334 180145 180401 182509
54594A82509K012k8j612j219N5M79k9m75n23l39M14J877K736J412j419l137k515
54577A80198j156q38r20J38J845K194P85m91j73J000J611J543J495J603J514J182
54561A91530O28n51k482m149m201k533m57O87M90o53j910k332j511J6J325J987
54545A75884K039J472M44l30k21L66M98J25Q2N94P58l3r86q45M84J838K089J082
54527A85340n11j857k509k457j797n90Q28J665J426O78M26O80L23j286l231m021
54511A73107l279j875o80L03J496K896L838L587K099K54p78m88O01J515J702J370
54495A85668J041R23P78N14N48J234K067K067J026j96q31r44p08J51J528K330
54479A97196J752P32R47K525L783L321J520k56j127j238j392k324l785m455l343
$$ plain form
54594 182509 184521 184493 182881 181662 181717 182196 182167 181692 181169 180830 181244 183121 185857 187269 185850 182713 180198
54577 180198 179042 178204 177284 177422 179267 181461 182246 181755 181582 182582 184193 185736 187231 188834 190348 191530
54561 191530 192158 191607 189125 184976 180775 178242 177785 178472 178962 178309 176399 174067 172556 172572 173897 175884
54545 175884 177923 179395 179839 179509 179288 179654 180152 180277 180359 180953 181711 181678 180692 179847 180331 182169 184258 185340
54527 185340 184829 182972 180463 178006 176209 175619 176447 178112 179538 180216 180642 181322 181645 180359 177128 173107
54511 173107 169828 167953 167273 167576 169072 171968 175806 179393 181492 181746 180968 180480 181081 182596 184298 185668
54495 185668 186709 187632 188410 188924 189472 190706 192773 194840 195866 195670 194839 193895 193187 193338 194866 197196
54479 197196 198948 199680 200627 203152 206935 210256 211776 211520 210393 209155 207763 205439 201654 197199 193856
54464A93856j169L93O34K39OJ44P26J746K526K158Q53j25j88j09n96j186j085
54447A98823l97P0l06j560k916k961r81J675K702J694O74J223K378K299Q71n38
54431B02750j110j118r40o51m57n62p97p96l95M02J366J735Q33n62o18J141K947
54414B03168L203K602K486K353Q06j567k391o61J975L349K948J567J26o46l65
54399B18953N54J082O19m58j269j124L4J277J105r18l206l662k118k84M87L69
54383B11441k6n82j194j402j096q06q91j054r93q69p22j33J088K413L189L373
54367B11736L321L173K773J913N89o94j029N1J754K596J817j36k289l651l333
54352B18591j227J293K373J665N91L34N00J86n18q10k37J051K619L625L103J125
$$ plain form
54464 193856 192687 193080 193714 193953 193959 194103 194829 196575 199101 201259 202112 201987 201799 201690 201094 199908 198823
54447 198823 198426 198496 198190 196630 193714 190753 189772 191447 194149 195843 196517 197740 200118 202417 203288 202750
54431 202750 201640 200522 199582 198931 198474 197912 197115 196319 195924 196326 197692 199427 200260 199698 199080 200221 203168
54414 203168 206371 208973 211459 213812 214618 213051 210660 209999 211974 215323 218271 219838 219964 219318 218953
54399 218953 219507 220589 221208 220750 219481 218357 218391 219668 220773 219855 216649 212987 210869 210585 211072 211441
54383 211441 211415 210833 209639 208237 207141 206335 205444 204390 203397 202528 201806 201673 202761 205174 208363 211736
54367 211736 215057 218230 221003 222916 223505 222811 221782 221833 223587 226183 228000 227864 225575 221924 218591
54352 218591 217364 218657 221030 222695 223286 223620 224120 224306 223788 222978 222741 223792 226411 230036 233139 234264
54336B34264o42m56J506L279L286J886O94N89P78m4j696k356q56J457K162Q30
54320B44681o68r11n08k91L22J921L199K289l78k216j658J37J198J164J143J851
54304B51275K706K670J618O36R11K248L144K675J808K039L007K654O9k924l892
54289B70644k769j676k023k977l113k472k181k536k630j833o57J92Q13J466J599
54274B49847N48j144k101j888j397j310j131k71Q22J307J105P06K75l02r18j488
54258B42660k234l061l096j831l24j37j072j310K4J612J823Q34K4l0k7p08j955
54241B31192l056l341k624j408m62O9Q10K059K992K649J363M08L08M22K60L20
54225B31961J121K096K112Q33r13j990j790n27Q72J314M70q53j548j364q71m85
$$ plain form
54336 234264 233622 233166 234672 237951 241237 243123 243817 244406 245184 245140 243444 241088 240232 241689 243851 244681
54320 244681 244013 243102 242594 242303 242625 244546 247745 250034 249656 247440 245782 245919 247117 248281 249424 251275
54304 251275 253981 256651 258269 258905 259816 262064 265208 267883 269691 271730 274737 277391 277460 274536 270644
54289 270644 267875 266199 264176 261199 258086 255614 253433 250897 248267 246434 245777 245969 246782 248248 249847
54274 249847 250395 249251 247150 245262 243865 242555 241424 241153 241975 243282 244387 245093 245368 245066 244148 242660
54258 242660 240426 237365 234269 232438 232114 231977 230905 229595 229619 231231 233054 233888 233912 233882 233855 233147 231192
54241 231192 228136 224795 222171 220763 220301 220370 221180 223239 226231 228880 230243 230651 230959 231381 231641 231961
54225 231961 233082 235178 237290 238123 237210 235220 233430 232903 233775 235089 235559 234706 233158 231794 230923 230438
54209B30438l8N50Q00K96n81j011q00o36j064j615j299J46J969L412M517N481
54193B40565N730M498K283P41O60R01N5j475k140j573r45r73q27L56J911K435
54177B52202J509j67j819k946l039j992p48n60j384j882j264l41k27o63m33Q81
54161B37127K369K993K622J618J11j752l154l067j605l34n79j722j822r8J862
54146B34569J886j20j914j453P77K389J855J14q62n98l79j011j428m41R62O27
54130B34973j467k570o91K518L733K109q5p77m24n70j408j822j237l75k29r26
54114B30752j655j482k06J397K345K488K490K569J851k92k636k923n69K232K785
54099B39146Q15j504k144j045N14J391J161pj394j988j287K29J692K613K785K049
$$ plain form
54209 230438 230400 230950 231750 232046 231465 230454 229654 229018 227954 226339 225040 225186 227155 230567 235084 240565
54193 240565 246295 250793 253076 253817 254477 255378 255433 253958 251818 250245 249300 248327 247500 247856 249767 252202
54177 252202 253711 253544 251725 248779 245740 243748 243000 242440 241056 239174 237910 237569 237342 236679 236246 237127
54161 237127 239496 242489 245111 246729 246840 245088 241934 238867 237262 236928 236349 234627 232805 232707 234569
54146 234569 236455 236335 234421 232968 233745 236134 237989 238103 237241 236643 236264 235253 233825 233384 234346 234973
54130 234973 233506 230936 230245 232763 236496 238605 238520 237743 237319 236749 235341 233519 232282 231907 231678 230752
54114 230752 229097 227615 227409 228806 231151 233639 236129 238698 240549 240257 237621 234698 234129 236361 239146
54099 239146 239961 238457 236313 235268 235782 237173 238334 238327 236933 234945 233658 233887 235579 238192 240977 243026
54083B43026P10l12m99o00j542k714k539q04P39O10n23q15M25K057K464J212m82
54066B40413q56M94K018K138J271R55J331J211O08R96K319K071r47l964l594n34
54050B45930J661J636J242J694J693J44j720k254j732j442j605j406l22J433L194
54035B48146M037L360J736M55Ml6M11J978M084M831L611K382L028M763N497M817
54019B93104L940L527L179K782K614K192N55k049l928l798k126m44N9p34j866
54004B97007k145j373n34k33K18J312J761J47k269k454L11L147L320J661R03J777
53988C02556K548J984J044J267K693M093M638M705N124O123P079P255O668O115
53974C63892O284O876O823N483L580K765L983O355P973P904P057O815P228P068
$$ plain form
54083 243026 243736 243424 242925 242325 240783 238069 235530 234726 235465 236075 235552 234737 235162 237219 239683 240895 240413
54066 240413 239557 240051 242069 244207 245478 246433 247764 248975 249583 250579 252898 254969 254022 250058 246464 245930
54050 245930 247591 249227 250469 252163 253856 254000 252280 250026 248294 246852 245247 243841 243519 244952 248146
54035 248146 252183 255543 257279 257734 257738 257702 258113 260091 264175 269006 272617 274999 278027 282790 288287 293104
54019 293104 297044 300571 303750 306532 309146 311338 311893 309844 305916 302118 299992 299548 299607 298873 297007
54004 297007 294862 293489 292955 292722 292940 294252 296013 296160 293891 291437 291748 294895 298215 299876 300779 302556
53988 302556 305104 307088 308132 309399 312092 316185 320823 325528 330652 336775 343854 351109 357777 363892
53974 363892 370176 377052 383875 389358 392938 395703 399686 406041 414014 421918 428975 435790 443018 450086
53960D50086N496L028P92o53j602k768m694p154q991r009p336n540n104o040p306
53945C93205q062q043p166n492l614k329j714j122m18n45k244m507n210l568j230
53930C37941m57j580k957l133k271j297n22K65R16R17J42r88k083k910k974j792
53914C17217J22J234N63j076j937j223L62J714K346K289J671P37j3o1P64K160
53898C26869L412L704K817J638J528K851M432M889M265L928M991P203R406J0666
53884C92599J0830J0371J0038J0534J2110J4067J4655J2065O278j62m016m424
53872D84945l474l321l690l013j213K08N30P23J592K534K741K487K428K561K750
53857D88788L456M993O634P415P301O726N630L941K497K295L054L563L220K239
$$ plain form
53960 450086 455582 458610 459402 458749 457147 454379 449685 442531 433540 424531 417195 411655 406551 400511 393205
53945 393205 385143 377100 369934 364442 360828 358499 356785 355663 355245 354700 352456 347949 342739 339171 337941
53930 337941 337484 335904 332947 329814 327543 326246 325724 325989 326905 327822 327964 326976 324893 321983 319009 317217
53914 317217 317339 318573 319136 318060 316123 314900 315262 316976 319322 321611 323282 324019 324006 323945 324709 326869
53898 326869 330281 333985 336802 338440 339968 342819 347251 352140 356405 360333 365324 372527 381933 392599
53884 392599 403429 413800 423838 434372 446482 460549 475204 487269 493547 493385 489369 484945
53872 484945 481471 478150 474460 471447 470234 470442 470972 471695 473287 475821 478562 481049 483477 486038 488788
53857 488788 492244 497237 503871 511286 518587 525313 530943 534884 537381 539676 542730 546293 549513 551752
53843E51752P62j050k264j957q77r30k709m678n326n000n077o168p807r170r631
53828D89870r075q121p537p222o405m949l619k928k634k664l428m696n296m713
53814D16583m045m462n497n859n238m347l643l219l476m698o020o033m677l501
53800C51868l594m067l386j649o65j504k852k619q08L01p45k525k771j530p00
53785C22754r44j048m87m97j708k574j637R9P50N27J177K952L997K921N26j377
53769C25431j775p01J253L209M309M175K972J165n23j207n94N30J088P95J48k70
53753C40005L9J404L313M329L695K596K770M106M843M151L240L545M889O014O229
53738C95168N871N535N301M772L734K734K588L237L632L226K913L659M760M552
$$ plain form
53843 551752 552514 551464 549200 547243 546366 545436 542727 538049 532723 527723 522646 516478 508671 499501 489870
53828 489870 480795 472674 465137 457915 451510 446561 442942 440014 437380 434716 431288 426592 421296 416583
53814 416583 412538 408076 402579 396720 391482 387135 383492 380273 376797 372099 366079 360046 355369 351868
53800 351868 348274 344207 340821 339172 338507 337003 334151 331532 330724 331025 330280 327755 324984 323454 322754
53785 322754 321810 320762 320275 319778 318070 315496 313859 313958 314708 315235 316412 319364 323361 326282 326808 325431
53769 325431 323656 322955 324208 327417 331726 335901 338873 340038 339515 338308 337714 338244 339332 340127 340275 340005
53753 340005 340044 341448 344761 349090 352785 355381 358151 362257 367100 371251 374491 378036 382925 388939 395168
53738 395168 401039 406574 411875 416647 420381 423115 425703 428940 432572 435798 438711 442370 447130 451682
53724D51682K654L70j033j511j679j993k674l591m199m274m551n790p321p660
53710D08430o548n285m891n125n561o281o989o711n110l199j998j369q92r47j911
53695C45613l014l124k252j325o78K25J564K588K487J345Po76l94M32R59O69q
53678C44418m3R59K050J819J55j325j102L69J322J153J016J703K358K239K350
53663C59441L757N321N134L747L643N350O391M885K235J002J659K777L237K944
53649D11523K231J770K341L629M095L106K237L182N161N987N064L772L165L013
53635D60276K986L158L151K359J388J754L569M837L844J216j234k640l071k391
53621D79202n55J287J463j96j981k334j461n66j93p4j50q22k003k740k257j032
$$ plain form
53724 451682 454336 454706 453673 452162 450483 448490 445816 442225 438026 433752 429201 423411 416090 408430
53710 408430 401882 396597 391706 386581 381020 374739 367750 361039 355929 352730 350732 349363 348471 347524 345613
53695 345613 342599 339475 337223 335898 335220 335445 337009 339597 342084 343429 343436 342760 342366 342798 343757 344426 344418
53678 344418 344375 345334 347384 349203 349358 348033 346931 347300 348622 349775 350791 352494 354852 357091 359441
53663 359441 363198 368519 373653 377400 381043 386393 392784 397669 399904 400906 402565 405342 408579 411523
53649 411523 413754 415524 417865 421494 425589 428695 430932 434114 439275 445262 450326 454098 457263 460276
53635 460276 463262 466420 469571 471930 473318 475072 478641 483478 487322 488538 487304 484664 481593 479202
53621 479202 478647 479934 481397 481201 479220 476886 475425 474859 474666 474592 474442 473620 471617 468877 466620 465588
53605D65588l36p20j449j530r91p81j462k322k040k32J962L079K970K690K818
53590D67244K608J273n63j527j190k68P37K027L572M690M947M748M540M183L615
53575E00636L451M073M653L967K114O35Q79K767N144O811P092O146N050N141O726
53560E65285Q588R211Q448P556P496P766P329O152N170M860M801M676M747M993
53546F57078M734L774K989K976K877J776N00O49K189L470L547L001K329J099q31
53531F92157k634l709m401m946m758l553k206j656j757j922k095k364k325j646
53517F52185p32k47n22j686l519m801l909q88K121L246K757J829P59m14q14J84
53501F45549J611K222K467L455M612M309K627J458J681K116J778J518K546M519
$$ plain form
53605 465588 465252 464532 463083 461553 460562 459781 458319 455997 453957 453725 455687 458766 461736 464426 467244
53590 467244 469852 471125 470562 469035 467845 467577 468314 470341 473913 478603 483550 488298 492838 497021 500636
53575 500636 504087 508160 512813 516780 518894 519529 520408 523175 528319 535130 542222 548368 553418 558559 565285
53560 565285 573873 583084 591532 599088 606584 614350 621679 627831 633001 637861 642662 647338 652085 657078
53546 657078 661812 665586 668575 671551 674428 676204 676704 677353 679542 683012 686559 689560 691889 692988 692157
53531 692157 689523 685814 681413 676467 671709 668156 665950 664294 662537 660615 658520 656156 653831 652185
53517 652185 651453 651206 650684 648998 645479 640678 636769 635881 638002 641248 644005 645834 646593 646179 645365 645549
53501 645549 647160 649382 651849 655304 659916 664225 666852 668310 669991 672107 673885 675403 677949 682468
53487F82468O087O568O342O041O013O277O737P545R112J1397J3403J4160J4079
53474G96229J4501J5942J7578J8555J8940J9224J9686K0471K1548K2414K2541
53463A007629K2353K3062K5307K8390L1041L2386L2395L2028L2836L5479L8630
53452A341536M0288M0171L9750L9820L9472L7992L6455L6327L7380L8135L7972
53441A765298L7704L8021L8256L7124L4465L1878L1258L2530L3400L2025K9493
53430B141452K8639L0473L2914L3337L1221K7930K5003K3332K2959K2783K1132
53419B441175J7532J3406J0304Q050N426K082j269m178o942r875j2992j6287j9563
53406B426869k2042k3008k2923k3131k4280k5671k6395k6559k7037k8351l0120
$$ plain form
53487 682468 688555 695123 701465 707506 713519 719796 726533 734078 743190 754587 767990 782150 796229
53474 796229 810730 826672 844250 862805 881745 900969 920655 941126 962674 985088 1007629
53463 1007629 1029982 1053044 1078351 1106741 1137782 1170168 1202563 1234591 1267427 1302906 1341536
53452 1341536 1381824 1421995 1461745 1501565 1541037 1579029 1615484 1651811 1689191 1727326 1765298
53441 1765298 1803002 1841023 1879279 1916403 1950868 1982746 2014004 2046534 2079934 2111959 2141452
53430 2141452 2170091 2200564 2233478 2266815 2298036 2325966 2350969 2374301 2397260 2420043 2441175
53419 2441175 2458707 2472113 2482417 2490467 2495893 2497975 2496706 2492528 2485586 2475711 2462719 2446432 2426869
53406 2426869 2404827 2381819 2358896 2335765 2311485 2285814 2259419 2232860 2205823 2177472 2147352
53395B147352l1485l1858l1278l0129k8617k6833k5202k4391k4349k3918k1998
53384A847294j8880j5821j3408j1044q174n325l421k488j541K60K689M882O469
53371A781492Q037J0391J3514J6534J8739K0306K1960K4134K6737K9423L1837
53360B003104L3698L4990L6131L7770M0367M3955M8127N2154N5334N7573N9587
53349B502790O2300O5924O9729P2686P4294P4874P5300P6381P8367Q0883Q3253
53338C316781Q4858Q5442Q5357Q5455Q6336Q7592Q8075Q7088Q4911Q2071P8608
53327D252574P4483P0199O6365O2665N8075N2197M5859M0032L4492K8026J9931
53316D804898J0979K720m104j0297j7284k5630l4720m3812n2792o1546o9104p4244
$$ plain form
53395 2147352 2115867 2084009 2052731 2022602 1993985 1967152 1941950 1917559 1893210 1869292 1847294
53384 1847294 1828414 1812593 1799185 1788141 1779967 1774642 1771221 1768733 1767192 1767452 1770141 1775023 1781492
53371 1781492 1789529 1799920 1813434 1829968 1848707 1869013 1890973 1915107 1941844 1971267 2003104
53360 2003104 2036802 2071792 2107923 2145693 2186060 2230015 2278142 2330296 2385630 2443203 2502790
53349 2502790 2565090 2631014 2700743 2773429 2847723 2922597 2997897 3074278 3152645 3233528 3316781
53338 3316781 3401639 3487081 3572438 3657893 3744229 3831821 3919896 4006984 4091895 4173966 4252574
53327 4252574 4327057 4397256 4463621 4526286 4584361 4636558 4682417 4722449 4756941 4784967 4804898
53316 4804898 4815877 4818597 4814493 4804196 4786912 4761282 4726562 4682750 4629958 4568412 4499308 4425064
53304D425064p6968p8699q0762q3075q4715q5237q5001q4422q3520q2149q0274
53293C520242p7945p5388p3103p1572p0701o9851o8485o6505o3958o0783n7050
53282B764901n3158m9519m6315m3628m1486l9499l6929l3597l0415k8385k7249
53271B334721k5721k3140k0366j8768j8706j9231j9129j8138j7018j6419j5826
53260B122259j4179j1523r229q093p098m971k175rJ731M427Q024J0676J1600J2490
53246B113930J4994J8288K0483K1399K2336K3947K5895K8199L1278L4705L7349
53235B392803L8867L9931M0754M0576L8931L6434L3848L1198K8272K5359K2936
53224B769909K0889J8464J4901J0066M609o62n674j1067j6835k1616k4161k5270
$$ plain form
53304 4425064 4348096 4269397 4188635 4105560 4020845 3935608 3850607 3766185 3682665 3600516 3520242
53293 3520242 3442297 3366909 3293806 3222234 3151533 3081682 3013197 2946692 2882734 2821951 2764901
53282 2764901 2711743 2662224 2615909 2572281 2530795 2491296 2454367 2420770 2390355 2361970 2334721
53271 2334721 2309000 2285860 2265494 2246726 2228020 2208789 2189660 2171522 2154504 2138085 2122259
53260 2122259 2108080 2096557 2087328 2079235 2072137 2067166 2064991 2064982 2066713 2071140 2079164 2089840 2101440 2113930
53246 2113930 2128924 2147212 2167695 2189094 2211430 2235377 2261272 2289471 2320749 2355454 2392803
53235 2392803 2431670 2471601 2512355 2552931 2591862 2628296 2662144 2693342 2721614 2746973 2769909
53224 2769909 2790798 2809262 2824163 2834229 2838838 2838176 2832502 2821435 2804600 2782984 2758823 2733553
53212B733553k7250l1219l5829l8939l9989m0308m1432m3520m5435m6320m6870
53201B296442m8552n1426n3643n3713n2462n1669n1339m9860m6762m3830m2901
53190A750285m3644m4228m3516m1885m0237l8812l7020l4297l1057k8458k7114
53179A340017k6482k5894k5500k5437k4805k2711j9951j8293j8026j7621j6097
53168A099200j4501j4404j5883j7687j8837j9408j9956k0618k0844k0202j9274
53157H97586j9227k0159k0726k0055j8946j8273j7315j5208j3011j2400j2948
53146G09318j2980j2587j3260j4695j4712j2842j1195j0920j0546r101q156q962
53134E69362r936r225p870p924q890q644o974n706n841o753p857q977r222p583
$$ plain form
53212 2733553 2706303 2675084 2639255 2600316 2560327 2520019 2478587 2435067 2389632 2343312 2296442
53201 2296442 2247890 2196464 2142821 2089108 2036646 1984977 1933638 1883778 1837016 1793186 1750285
53190 1750285 1706641 1662413 1618897 1577012 1536775 1497963 1460943 1426646 1395589 1367131 1340017
53179 1340017 1313535 1287641 1262141 1236704 1211899 1189188 1169237 1150944 1132918 1115297 1099200
53168 1099200 1084699 1070295 1054412 1036725 1017888 998480 978524 957906 937062 916860 897586
53157 897586 878359 858200 837474 817419 798473 780200 762885 747677 734666 722266 709318
53146 709318 696338 683751 670491 655796 641084 628242 617047 606127 595581 586480 578324 569362
53134 569362 559426 550201 542331 534407 525517 516873 509899 504193 498352 491599 483742 474765 465543 457960
53120D57960m813k972k820l120k743k012j570j191l83O29J044L58j050k053j725
53105D33539n37m7r93k239k166o16J045J342k39k783m258l215o68Q33M13k63J01
53088D19249N31p5q78q60q13j597k047r72K13m66j995j824p8Q27L16K74J357J967
53070D13129J425J164J836K009Q29n23j136j745k504j952J75J462K22j567j043
53055D11781J229K241R81n58n92K32K55j026k677l535l397l123l436l721k802
53040C91852r18J93l92j589k061j897j689j224k50M92K65m00o51p33j215j525
53024C78258q19K18R1j071j455k87Q36J46j805k802j761N4P23K9m45N68K357L086
53006C75921J986K08m47O86K496K863N49l183n264l946q06J181J027N4m34j71
$$ plain form
53120 457960 453147 450175 447355 444235 441492 439480 437910 436719 436336 436965 438009 438367 437317 435264 433539
53105 433539 433002 432955 431962 429723 427557 426941 427986 429328 429089 426306 422048 418833 418165 418998 419411 419148 419249
53088 419249 419780 419705 418827 417967 417154 415557 413510 412538 412751 412285 410290 408466 408388 409215 409531 409805 411162 413129
53070 413129 414554 415718 417554 419563 420392 419869 418733 416988 414484 412532 412707 414169 414391 412824 411781
53055 411781 413010 415251 416232 415674 415082 415314 415569 414543 411866 408331 404934 401811 398375 394654 391852
53040 391852 390934 391127 390735 389146 387085 385188 383499 382275 382025 382517 382782 382382 381731 380998 379783 378258
53024 378258 377439 377657 377748 376677 375222 374935 375771 375917 374112 371310 369549 369603 370326 370355 369910 370478 372835 375921
53006 375921 377907 378115 377668 378354 380850 383713 384262 381079 375815 371869 371063 372244 373271 373325 372891 372720
52990C72720J036L184M876M257J739j07J3O14J36r00j501j952k468k029l15Q23
52974C80126j44j823j930p87m07r75p72O46J764J691J263J110O18n21j348j068
52958C77443k84K8j29j00L77R16R76M31r1L59J828L123L247K605K081J625P73
52941C95208j15m08m51q62j117m01M88q6j890k739j509M21J238Q36K56J55N40
52924C89564R77P48l27j075j32J884K818J946R57J280K088J955J131Q33J218J533
52908D07398J596J850K337K755L208L832L970K739L71j926l372m108m271l458
52894D12921j465R36K381K008J34k083l566m018l738l046k154j388j053j009q05
52879C94055k81L22P80Q37j3j786l057j948J367M035L442K23k405k191J0J582
$$ plain form
52990 372720 373756 376940 381816 386073 387812 387705 387718 388332 388468 387568 386067 384115 381647 379618 379303 380126
52974 380126 379982 378159 376229 375442 375035 374060 373288 373934 375698 377389 378652 379762 380380 379859 378511 377443
52958 377443 377159 377187 377058 376958 377335 378251 379227 379658 379567 379926 381754 384877 388124 390729 392810 394435 395208
52941 395208 395093 394685 394234 393372 392255 391854 392342 392256 390366 387627 386118 386539 387777 388613 388869 389024 389564
52924 389564 390541 391289 390962 389887 389755 391639 394457 396403 397360 398640 400728 402683 403814 404647 405865 407398
52908 407398 408994 410844 413181 415936 419144 422976 426946 429685 430056 428130 424758 420650 416379 412921
52894 412921 411456 412392 414773 416781 416915 414832 411266 407248 403510 400464 398310 396922 395869 394860 394055
52879 394055 393774 394096 394876 395713 395700 393914 390857 388909 390276 394311 397753 397976 395571 393380 393390 394972
52863C94972J035o57j401l93J078J273M7j317j908j923j707j179n04k94n48l43
52847C86231P00J444P29p65j246k48P70L84j088k203k242j784j578j337k10J632
52831C79189K612J571n33j666j192k94J08N01J422K203J876O00o55j202p78O37
52815C84399K346L048K321J440J725K685K824J742L62n85j039r12j81M15Q8n42
52799D00136j6J665K693J922M06l85p53j968l914m908l961k106j085j402k159
52784C84165k433k098j406m54N15Q00p1j459k142j802j266j130j014n71k86o01
52768C68747r41o02K4K8o19j219j521j690j527q38l13p36j480j248l13k82j320
52751C54150j443M80K606K401P3j761j363M83J838J584J61r53n57Q90J625Q19
$$ plain form
52863 394972 396007 395350 393949 393556 394634 395907 395954 394637 392729 390806 389099 387920 387416 387122 386574 386231
52847 386231 386931 388375 389104 388339 387093 386845 387615 387999 386911 384708 382466 380682 379104 377767 377557 379189
52831 379189 381801 383372 382839 381173 379981 379687 379795 380296 381718 383921 385797 386397 385742 384540 383762 384399
52815 384399 386745 389793 392114 393554 395279 397964 400788 402530 402892 402307 401268 400356 400175 400590 400678 400136
52799 400136 400120 401785 404478 406400 406806 406421 405668 403700 399786 394878 390917 388811 387726 386324 384165
52784 384165 381732 379634 378228 377774 378289 379089 379018 377559 375417 373615 372349 371219 370205 369634 369348 368747
52768 368747 367806 367204 367228 367256 366637 365418 363897 362207 360680 359842 359529 358793 357313 356065 355752 355470 354150
52751 354150 352707 353187 355793 358194 358267 356506 355143 355626 357464 359048 359209 358256 357699 358589 360214 361033
52735C61033j95J92J418J456k68k122k589k034j716k043k510k631k229j239R6
52720C44619J079J142N34R1L65J140J683J372L02o41n71L24P56k80k270l532k905
52703C43208q42J128J952J957K169K923L414K785J227k77j064j169p21L18J706
52688C58714K751K988K646K247K003J901K105K830L929M834M948M045K534J384
52674C99859J351K054K182J069k59k28J268K633K369M95j905l850m787m373k676
52659C95202m87J117J577J012k68j914l260l465k301n33P78J167Q74K61m72j092
52643C88196j263q26p4N12P44Q97J313J812J696N40j064j925j559p64n12o64k52
52626C86807J002K115K034R26j16l31O1L43M2p40j517j849j739j587j709j970
$$ plain form
52735 361033 360838 361030 362448 363904 363636 361514 358925 356891 355175 353132 350622 347991 345762 344523 344619
52720 344619 345698 346840 347374 347465 347830 348970 350653 352025 352327 351686 351115 351439 352195 351915 349645 346113 343208
52703 343208 342366 343494 345446 347403 349572 352495 355909 358694 359921 359644 358580 357411 356690 357008 358714
52688 358714 361465 364453 367099 369346 371349 373250 375355 378185 382114 386948 391896 395941 398475 399859
52674 399859 401210 403264 405446 406515 406256 406028 407296 409929 412298 412793 410888 407038 402251 397878 395202
52659 395202 394715 395832 397409 398421 398153 396239 392979 389514 387213 386680 387458 388625 389499 389760 389288 388196
52643 388196 386933 386107 386033 386545 387289 388186 389499 391311 393007 393547 392483 390558 388999 388235 387723 387059 386807
52626 386807 387809 389924 391958 392884 392768 392437 392498 392841 392883 392143 390626 388777 387038 385451 383742 381772
52610C81772j926j288j54J050J842K037J846J518J053N12M37J318K634L166K479
52595C98296J432Q37N01K08O77K434M324M494K746P20l15n93p10o57n47j087k498
52578D10262l733l599k101j23J640K872L355L252L137L178K848K089K007L373
52564D28457M994M798K434k73j538j377r74j188k002k925l480l600l585l605l372
52549D12764k642j669q05M2R44J365P46n04j397j570j323p04M90J868K557K340
52533D12502J779J176L36n80r55p41o20q53r38o94o76j045j136p16o11j305j920
52516D03003j409L2J541K666L060K066j56j901j711l40L97K40L79J040R92k55
52500D09644j429j332m66o3m08r82j510k010k248j908j118l30J65K47j68q74j140
$$ plain form
52610 381772 379846 378558 378404 379454 381296 383333 385179 386697 387750 388262 388699 390017 392651 395817 398296
52595 398296 399728 400565 401066 401274 401951 404385 408709 413203 415949 416669 416354 415761 415051 414394 413847 412760 410262
52578 410262 406529 402930 400829 400706 402346 405218 408573 411825 414962 418140 420988 423077 425084 428457
52564 428457 433451 438249 440683 440410 438872 437495 436521 435333 433331 430406 426926 423326 419741 416136 412764
52549 412764 410122 408453 407648 407690 408634 409999 410745 410241 408844 407274 405951 405247 405737 407605 410162 412502
52533 412502 414281 415457 415793 415213 414258 413517 412897 412044 411106 410412 409736 408691 407555 406839 406228 404923 403003
52516 403003 401594 401626 403167 405833 408893 410959 410803 408902 407191 406851 407248 407488 407867 408907 409899 409644
52500 409644 408215 406883 406417 406354 405946 404964 403454 401444 399196 397288 396170 395840 396005 396252 396084 395210 394070
52483C94070k43J667L397L525J695p94j877p23J308K123J292L22N45J515J892
52468D09714J246L69P8K99M17P7m73q03r33j326k030k155q27J423K909K674J526
52451D12185Q92J269K232L285M106M386M189M168M658M827L536R85j384k608k991
52436D43735l052k717k038j780k432l254l239k531j974j600o73P58J629J389P25
52421D22946L19o5o72r54n97m82j438k589k226j07K259L457L282K206J002P96
52405D27137K111L661L528J890J001K004L328L212K156J505J023k76j765j813
52391D48702m74L60m06j938l234m396n537n807m563k641j492j410j386o14N09
52376D15673R90N79Q9K34M93j45j369j554l7J706K095J621J705K296K171J219
$$ plain form
52483 394070 393827 395494 398891 402416 404111 403317 401440 400717 402025 404148 405440 405762 406307 407822 409714
52468 409714 410960 411329 411407 411706 412123 412200 411727 410924 409991 408665 406635 404480 403653 405076 407985 410659 412185
52451 412185 413077 414346 416578 419863 423969 428355 432544 436712 441370 446197 449733 450718 449334 446726 443735
52436 443735 440683 437966 435928 434148 431716 428462 425223 422692 420718 419118 418445 419203 420832 422221 422946
52421 422946 423265 423200 422528 421574 420977 420495 419057 416468 414242 414135 416394 419851 423133 425339 426341 427137
52405 427137 429248 432909 436437 438327 439328 441332 444660 447872 450028 451533 452556 452280 450515 448702
52391 448702 448228 448588 448182 446244 443010 438614 433077 427270 422707 420066 418574 417164 415778 415164 415673
52376 415673 416663 417242 417331 417565 418058 417913 416544 414990 414953 416659 418754 420375 422080 424376 426547 427766
52360D27766O18Q30J120J191J695K770L576L755L948M492M995N604P108R211J0316
52345D88995R779Q759P942O229K921m88k441l730n802p826p737n625l864l796
52331D83316m282l772k209m51Q33J238P28kk6O74J441K135L151M265M691M450
52315D96180M438M819M498K872J122R90K790N263P004P580P535P629P968P829
52301E68517O613M774L305K505J868J049K61k58l87K11J693L462M798O000P719
52286F12130R228Q837O507M622N337Q192J1205J3261J4500J5282J5996J7320J9429
52273G61846K1362K2162K2217K2505K3031K3243K3600K5156K7551K9016K8825
52262A030514K8426K9452L1656L3593L4359L3764L1659K8463K5831K5354K6386
$$ plain form
52360 427766 428384 429214 430334 431525 433220 435990 439566 443321 447269 451761 456756 462360 469468 478679 488995
52345 488995 498774 507533 515475 521704 524625 524137 521696 517966 512164 504338 496601 490976 487112 483316
52331 483316 479034 475262 473053 472602 473435 474673 475401 475399 475373 476047 477488 479623 482774 487039 491730 496180
52315 496180 500618 505437 509935 512807 513929 514919 517709 522972 529976 537556 545091 552720 560688 568517
52301 568517 575130 579904 583209 585714 587582 588631 588892 588634 588247 588458 590151 593613 598411 604411 612130
52286 612130 621358 630195 636702 641324 646661 654853 666058 679319 693819 709101 725097 742417 761846
52273 761846 783208 805370 827587 850092 873123 896366 919966 945122 972673 1001689 1030514
52262 1030514 1058940 1088392 1120048 1153641 1188000 1221764 1253423 1281886 1307717 1333071 1359457
$$ [...]
##END NTUPLES=NMR SPECTRUM
##END=
