
##TITLE=AC1222_Punto_6074794_1Xs9jaGfa0
##JCAMPDX= 6.0         $$ Bruker NMR JCAMP-DX V2.0
##DATA TYPE= NMR SPECTRUM
##DATA CLASS= NTUPLES
##ORIGIN= BRUKER
##OWNER= Administrator
$$ 1.72 TOPSPIN		Version 2.1
$$ 2012-05-08 19:54:38.671 -0500  Administrator@TOPSPIN
$$ Compression mode = diff/dup
##.OBSERVE FREQUENCY= 400.13188235
##.OBSERVE NUCLEUS= ^1H
##.ACQUISITION MODE= SIMULTANEOUS (DQD)
##.ACQUISITION SCHEME= undefined
##.AVERAGES= 8
##.DIGITISER RES= 22
##SPECTROMETER/DATA SYSTEM= spect
##.PULSE SEQUENCE= zg30
##.SOLVENT NAME= COFFEE_meoh
##.SHIFT REFERENCE= INTERNAL, COFFEE_meoh, 1, 14.98061
##AUDIT TRAIL= $$ (NUMBER, WHEN, WHO, WHERE, PROCESS, VERSION, WHAT)
$$ ##TITLE= Audit trail, TOPSPIN		Version 2.1
$$ ##JCAMPDX= 5.01
$$ ##ORIGIN= Bruker BioSpin GmbH
$$ ##OWNER= Administrator
$$ $$ C:\Bruker\TOPSPIN/data/COFFEE/nmr/AC1222_Punto_6074794_1Xs9jaGfa0/40/pdata/1/auditp.txt
$$ ##AUDIT TRAIL=  $$ (NUMBER, WHEN, WHO, WHERE, PROCESS, VERSION, WHAT)
(   1,<2012-05-08 19:54:31.531 -0500>,<Administrator>,<TOPSPIN>,<go>,<TOPSPIN 2.1>,
      <created by zg
	started at 2012-05-08 19:53:25.093 -0500,
	POWCHK enabled, PULCHK disabled,
       configuration hash MD5:
       AF F2 23 6B 01 CD 40 DD E5 A1 38 A0 06 EA F7 77
       data hash MD5: 64K
       62 6D 88 7C 6E DE 3A 28 88 5F A9 F7 D3 97 1E 7F>)
(   2,<2012-05-08 19:54:34.328 -0500>,<Administrator>,<TOPSPIN>,<proc1d>,<TOPSPIN 2.1>,
      <Start of raw data processing
       efp LB = 0 FT_mod = 6 PKNL = 1 PHC0 = 0 PHC1 = 0 SI = 32K 
       data hash MD5: 32K
       31 91 40 02 F6 2E 00 13 86 F7 2D 1E 69 98 59 22>)
(   3,<2012-05-08 19:54:34.671 -0500>,<Administrator>,<TOPSPIN>,<proc1d>,<TOPSPIN 2.1>,
      <pk PHC0 = 214.1455 PHC1 = 0 
       data hash MD5: 32K
       4A C3 B9 AF B1 22 7C B8 D4 15 B3 E7 0C 22 BF F6>)
(   4,<2012-05-08 19:54:34.734 -0500>,<Administrator>,<TOPSPIN>,<proc1d>,<TOPSPIN 2.1>,
      <abs ABSG = 1 
       data hash MD5: 32K
       8B DA D7 14 96 01 19 8E B5 05 68 C3 17 5B 23 35>)
(   5,<2012-05-08 19:54:34.765 -0500>,<Administrator>,<TOPSPIN>,<proc1d>,<TOPSPIN 2.1>,
      <abs ABSG = 2 
       data hash MD5: 32K
       E2 D7 6E F2 D6 5E 05 20 9D C7 6C 48 25 DC DE D7>)
(   6,<2012-05-08 19:54:34.796 -0500>,<Administrator>,<TOPSPIN>,<proc1d>,<TOPSPIN 2.1>,
      <abs ABSG = 3 
       data hash MD5: 32K
       5F BD C8 78 AD 62 6E 07 B8 19 07 80 86 4D BA CC>)
(   7,<2012-05-08 19:54:34.828 -0500>,<Administrator>,<TOPSPIN>,<proc1d>,<TOPSPIN 2.1>,
      <abs ABSG = 4 
       data hash MD5: 32K
       6E 25 2F A7 F9 2B 7A F9 F3 F5 5E 1F DB 82 4C BC>)
(   8,<2012-05-08 19:54:34.859 -0500>,<Administrator>,<TOPSPIN>,<proc1d>,<TOPSPIN 2.1>,
      <abs ABSG = 5 
       data hash MD5: 32K
       E9 32 4C C0 DA 0E CE D4 AD 6A E3 5E 88 60 25 B3>)
$$ ##END=
$$ 
$$ $$ hash MD5
$$ $$ 75 B4 9E 3D E0 AB 47 D1 4E 59 D0 A5 35 B3 F6 DA
##$RELAX= 
##$RELAX= 
##$RELAX= 
##$RELAX= 
##$RELAX= 
##$RELAX= 
##$RELAX= 
$$ Bruker specific parameters
$$ --------------------------
$$ [...]
##$TP= (0..7)
150 150 150 150 150 150 150 150
##$TP07= 0
##$TPNAME0= <>
##$TPNAME1= <>
##$TPNAME2= <>
##$TPNAME3= <>
##$TPNAME4= <>
##$TPNAME5= <>
##$TPNAME6= <>
##$TPNAME7= <>
##$TPOAL= (0..7)
0.5 0.5 0.5 0.5 0.5 0.5 0.5 0.5
##$TPOFFS= (0..7)
0 0 0 0 0 0 0 0
##$TUNHIN= 0
##$TUNHOUT= 0
##$TUNXOUT= 0
##$USERA1= <user>
##$USERA2= <user>
##$USERA3= <user>
##$USERA4= <user>
##$USERA5= <user>
##$V9= 5
##$VALIST= <valist>
##$VCLIST= <CCCCCCCCCCCCCCC>
##$VD= 0
##$VDLIST= <DDDDDDDDDDDDDDD>
##$VPLIST= <PPPPPPPPPPPPPPP>
##$VTLIST= <TTTTTTTTTTTTTTT>
##$WBST= 1024
##$WBSW= 4
##$XGAIN= (0..3)
0 0 0 0
##$XL= 0
##$YL= 0
##$YMAX_a= 534475
##$YMIN_a= -631624
##$ZGOPTNS= <>
##$ZL1= 120
##$ZL2= 120
##$ZL3= 120
##$ZL4= 120
##$ABSF1= 14.98061
##$ABSF2= -5.57192
##$ABSG= 5
##$ABSL= 3
##$ALPHA= 0
##$AQORDER= 0
##$ASSFAC= 0
##$ASSFACI= 0
##$ASSFACX= 0
##$ASSWID= 0
##$AUNMP= <proc_prof1d_extract_pilot.lims>
##$AXLEFT= 0
##$AXNAME= <>
##$AXNUC= <1H>
##$AXRIGHT= 0
##$AXTYPE= 0
##$AXUNIT= <>
##$AZFE= 0.1
##$AZFW= 0.1
##$BCFW= 0
##$BC_mod= 0
##$BYTORDP= 0
##$COROFFS= 0
##$CY= 15
##$DATMOD= 1
##$DC= 0
##$DFILT= <>
##$DTYPP= 0
##$F1P= 0
##$F2P= 0
##$FCOR= 0.5
##$FTSIZE= 32768
##$FT_mod= 6
##$GAMMA= 0
##$GB= 0
##$INTBC= 1
##$INTSCL= 1
##$ISEN= 128
##$LB= 0
##$LEV0= 0
##$LPBIN= 0
##$MAXI= 10000
##$MC2= 0
##$MEAN= 0
##$ME_mod= 0
##$MI= 0
##$NCOEF= 0
##$NC_proc= -8
##$NLEV= 6
##$NOISF1= 0
##$NOISF2= 0
##$NSP= 0
##$NTH_PI= 0
##$NZP= 0
##$OFFSET= 14.98061
##$PC= 1
##$PHC0= 214.1455
##$PHC1= 0
##$PH_mod= 1
##$PKNL= yes
##$PPARMOD= 0
##$PPDIAG= 0
##$PPIPTYP= 0
##$PPMPNUM= 2147483647
##$PPRESOL= 1
##$PSCAL= 4
##$PSIGN= 0
##$PYNMP= <proc.py>
##$REVERSE= no
##$SF= 400.13
##$SI= 32768
##$SIGF1= 0
##$SIGF2= 0
##$SINO= 400
##$SIOLD= 32768
##$SPECTYP= <>
##$SREGLST= <1H.CDCl3>
##$SSB= 0
##$STSI= 32768
##$STSR= 0
##$SW_p= 8223.68421052632
##$SYMM= 0
##$S_DEV= 0
##$TDeff= 65536
##$TDoff= 0
##$TI= <>
##$TILT= no
##$TM1= 0
##$TM2= 0
##$TOPLEV= 0
##$USERP1= <user>
##$USERP2= <user>
##$USERP3= <user>
##$USERP4= <user>
##$USERP5= <user>
##$WDW= 1
##$XDIM= 32768
##$YMAX_p= 451703988
##$YMIN_p= -730648
##$CURPLOT= <Network HP LaserJet P1505>
##$CURPRIN= <$Network HP LaserJet P1505>
##$DFORMAT= <normdp>
##$LAYOUT= <+/1D_H.xwp>
##$LFORMAT= <normlp>
##$PFORMAT= <normpl>
##$SURQMSG= 1
$$ End of Bruker specific parameters
$$ ---------------------------------
##NTUPLES= NMR SPECTRUM
##VAR_NAME=  FREQUENCY,     SPECTRUM/REAL,   SPECTRUM/IMAG
##SYMBOL=    X,             R,               I
##VAR_TYPE=  INDEPENDENT,   DEPENDENT,       DEPENDENT
##VAR_FORM=  AFFN,          ASDF,            ASDF
##VAR_DIM=   32768,         32768,           32768
##UNITS=     HZ,            ARBITRARY UNITS, ARBITRARY UNITS
##FACTOR=    0.250966925370066, 1,           1
##FIRST=     8223.43324360095, -46338,       48311
##LAST=      0,             -12536,          6792
##MIN=       0,             -730648,         0
##MAX=       8223.43324360095, 451703988,    0
$$ Real data points
##PAGE= N=1
##DATA TABLE= (X++(R..R)), XYDATA
$$ [...]
19539b47654r2997i2336A11091b75344B88114B8016c0446r4225A06575R4851o1674
19528A39752D8087b9276j26281m5404P2634D4749e2945D4098a97366p3989e4620
19516e4343A73864c3122l28174g8533k8936K2203H248J3182a34338d4262j96534
19505b40796c2096A24999J7843m0569g2600G6756h9846j79263l2305a6063A39861
19493b00423L9094j5048m3381C68743a57700j255J9731d9954o1185k19035a43436
19481a90780M5727q350L961A15902a89369h0952k5994J3065M6897B77526b17589
19469I813J05734f6965k2442B39996a64253D7561b5631F6926N7501g5975l0239
19458a06214L8780c0614B4156a52320g5158i596L379r2759M4853o219j6145j1939
$$ y = [-247654, -340651, -92336, 111091, -275344, 288114, 28016, -30446, -124671, 106575, 201426, 139752, 48087, -29276, -155557, -200961, -128327, 44749, -52945, 44098, -197366, -271355, -54620, -54343, 173864, -33122, -361296, -78533, -107469, -85266, 8248, 21430, -134338, -44262, -240796, -32096, 124999, 142842, 102273, -72600, 76756, -89846, -269109, -301414, -16063, 139861, -200423, -161329, -176377, -219758, 368743, -157700, -158955, -139224, -49954, -111139, -330174, -143436, -190780, -145053, -153403, -149442, 115902, -189369, -80952, -106946, -93881, -46984, 277526, -217589, 9813, 115547, -66965, -89407, 239996, -164253, 47561, -25631, 66926, 124427, -75975, -106214, -67434, -30614, 24156, -152320, -75158, -9596, -6217, -98976, -54123, -60342, -76487, -88426]
19446h8426l61412A9263b80377K0565L4941A82865d9218A70403G1670j6645a52616
19434d21741A28802J43006f7608j8934A52280A849J14758K6311C9171P6583K01755
19423C17509a10810J3874j43196M4694k2445a01848L4843A5298g3100F949P173
19412A4122a25428K8861L19A74113c99972a31064k2223q1392l81061D9792c66279
19400A55676D7952Q8289A2918c6751j43434f8539j15338B22700d6449F1563b31821
19388b6255o5521k03162e9441m3010C6341b6357k64837d430r7622G8917b30602
19376g1816q8980A8281N2257R6823m8606J4692b00494B175Q369b0862j79333b0096
19363B09138d7998B446a35352j63070Q9952A68062b90210d9964r4532k7339b1625
$$ y = [-88426, -449838, 19263, -280377, -259812, -224871, 182865, -49218, 170403, 71670, 55025, -152616, -421741, 128802, 271808, -67608, -86542, 152280, 1849, 116607, 142918, 39171, 115754, 317509, -110810, -96936, -240132, -195438, -217883, -101848, -67005, 15298, -73100, 6949, 14122, -125428, -96567, -96248, 174113, -399972, -131064, -153287, -234679, -615740, 49792, -366279, 155676, 47952, 136241, 12918, -36751, -180185, -68539, -183877, 222700, -46449, 61563, -231821, -26255, -91776, -294938, -59441, -102451, 36341, -26357, -291194, -4430, -102052, 78917, -230602, -71816, -160796, 18281, 70538, 167361, 118755, 133447, -200494, 2175, 10544, -20862, -200195, -20096, 209138, -47998, 2446, -135352, -298422, -208470, 168062, -290210, -49964, -144496, -171835, -21625]
19351B17329c40726F0439J66296F7380b2453C42897A53492i061H2395J77983b13560
19339A40048e5550j4339k48041B37290e3660A2581b60849a07107c2358j19159
19329a51517A84837a10662k89746C147b7535A00927d7864A15819b04035r5486
19319b99521G4744c3670n26619K62438A97015C719c42190a32032j66678B30372
19308D1555H375e509p2206L6590j82859e4612k01625c8774j36272C22089i2715
19296a6131A12576b18907g5332A5913J8058N2510b21077f7396b0643k13029I018
19284B03620I7108a40378O304j4098E6813d5208j25517B78703c30869Q8021A09505
19272B54056a25584K4600M3493j9531A03565a35427r2942A91406a39024a8277
$$ y = [217329, -340726, 60439, 226735, 67380, -22453, 342897, 153492, -9061, 82395, 260378, -213560, 140048, -55550, -69889, -317930, 237290, -53660, 12581, -260849, -107107, -32358, -151517, 184837, -110662, -400408, 3147, -27535, 100927, -47864, 115819, -204035, -299521, 74744, -33670, -560289, -297851, 197015, 3719, -342190, -132032, -298710, 230372, 41555, 8375, -5509, -77715, -41125, -223984, -54612, -256237, -38774, -175046, 322089, -92715, -16131, 112576, -218907, -75332, 15913, 33971, 86481, -221077, -67396, -20643, -233672, 9018, 203620, 97108, -140378, -134074, -148172, 56813, -45208, -170725, 278703, -330869, -242848, 109505, 254056, -125584, -100984, -57491, -77022, 103565, -135427, -228369, 191406, -139024, -18277]
19261d33592g7741n4987O4335K0909A43067l7369k8460h5706n0329a4351B6082
19249G375b05788i0034p71j75916a01819k5058p8189e9270q5735E3842a35401
19237d66515b24893c4616j06198A47190a98747B31279b90190c5684C5292J03365
19227A38657L94J75777e3587o6608B46732N2514j23892c2781a3257l3055H0308
19215d42806g700p3150a9390l1508I6570a09711l39072C11297a80925N6082B5421
19203h3992H3522N7216J38383f4732A57328p4553d45698A41617A1058a16128p6715
19192a92843c9838k63909C43025C9570a8922j89103A34842a92381O7771k00526
19182c25136a42644O3818k3638l34747a46297A23502r427P9963b81091J24735
$$ y = [-433592, -77741, -132728, -68393, -47484, 143067, 105698, 77238, -85706, -136035, -14351, 26082, 7375, -205788, -90034, -90805, -266721, -101819, -126877, -205066, -59270, -145005, 53842, -135401, -466515, -224893, -34616, -140814, 147190, -198747, 231279, -290190, -35684, 35292, 138657, 139051, 314828, -53587, -120195, 246732, 299246, 175354, -32781, -13257, -46312, 80308, -442806, -7700, -80850, -19390, -50898, 96570, -109711, -448783, 311297, -180925, -124843, 25421, -83992, 83522, 140738, 279121, -64732, 157328, 82775, -445698, 141617, 11058, -116128, -192843, -39838, -303747, 343025, 39570, -18922, -208025, 134842, -192381, -124610, -325136, -142644, -78826, -102464, -437211, -146297, 123502, 114075, 194038, -281091, -156356]
19172a56356A05327L5853C2796J02842b92691H1984a09489E1112K59313b74523
19161f2783j356B35861c1815k25554a03530j0849A88903I740c25306d947m9849
19150e4796a8874j58624b2709j45024A0493b20883A89293b08255l7821A3613b30696
19138G1265G234L5762a41204L2283l66062g4890C7568R2322a41571B58446a84307
19126f8119k1436B2160J88082q3324g2666o8497O1662k2847j34060o4725a08339
19114A39931a47991D30499e3510j76738A87065b33148o6722i312j12942j9607
19104a41861N7132I448b3240D187h9239H900b1375B00630E2351d4643k70416P5751
19092b39308d9696A39881a97113F5520a71068H6050N7549b3460B01272B649c26174
$$ y = [-156356, 105327, 141180, 32796, 135638, -292691, 81984, -109489, 51112, 310425, -274523, -62783, -64139, 235861, -31815, -257369, -103530, -114379, 188903, 9740, -325306, -4947, -54796, -18874, -177498, -22709, -167733, 10493, -220883, 189293, -208255, -246076, 13613, -230696, 71265, 7234, 42996, -141204, -108921, -474983, -74890, 37568, 129890, -141571, 258446, -184307, -68119, -89555, 22160, 210242, 126918, -72666, -141163, -79501, -102348, -236408, -301133, -108339, 139931, -147991, 430499, -53510, -230248, 187065, -233148, -299870, -9312, -122254, -141861, -84729, 9448, -23240, 4187, -89239, 8900, -21375, 200630, 52351, -44643, -315059, -239308, -49696, 139881, -197113, 65520, -171068, 86050, 143599, -23460, 201272, 2649, -326174]
19080C6277b9164k48955a15166l0839k2838P4486A2573f8499H8297R3847j1276
19069A70868i0022p2960N0335J0840H4660a32118M3417n2023k52006d9062l34252
19058c83314B5387K22448O1191b52079J17344a654m35257f1587B75092I9053a20954
19046A33913b32267L4157B40921d0906m4879Q99N369B06242b2017d961C6509G986
19033d812k36833B24399k5169D160L2592b87696O9190Q7495e6297A26134b4692
19021D8409i4370G7831l7031J74817A04476e0996A67097H2421h5981A85920q5863
19010A00057g6579j277A26183J49525A28047e9434k29422d8012j93108A45055
18999A01613h4297A06951a48446B98319C4363b24589j9985M334G0919b52967m6255
$$ y = [36277, -29164, -278119, -115166, -146005, -168843, -94357, 12573, -68499, 88297, 182144, 170868, -90022, -162982, -112647, -101807, 84660, -132118, -88701, -140724, -392730, -49062, -383314, 25387, 247835, 309026, -252079, -134735, -1654, -436911, -61587, 275092, 99053, -120954, 133913, -232267, -198110, 240921, -40906, -85785, -84886, -79517, 206242, -22017, -4961, 36509, 7986, -4812, -241645, 224399, 199230, 4160, 36752, -287696, -218506, -131011, -56297, 126134, -24692, 48409, -94370, 77831, 40800, 215617, 104476, -50996, 167097, 82421, -85981, 185920, 100057, -76579, -77856, 126183, 275708, 128047, -59434, -288856, -48012, -241120, 145055, 101613, -84297, 106951, -148446, 298319, 34363, -224589, -244574, -240240, 70919, -252967, -299222]
18988b99222d8335C3992J32194G0735a76059l9286M0084A3644f5418A30422m2057
18977H8365f2128E4350h4331D4864a38204p4993e8498m2944M5002k13781p4400
18966c44621D3046b99826C92588i0954b2421l1749n3070A59202c612j18485K0626
18955a01471j00111a0993q0519j05114J0530A99292a6708j46479L8661J8098A22791
18943C995e998k03318i8102j56552B71647C8360B434J87681n9315a94262G8426
18931a95912K1952C31185b01347H4969b29769h6253e935F5788i973n6648j73399
18920b40020b3601A38601f007A99407O1297c31307D1171L4094d29980A10712a01246
18908h5552L0298m9244G3392N11K96614b96058c8273B7531b75978I3166a14915
$$ y = [-299222, -48335, 33992, 166186, 70735, -176059, -215345, -175261, 13644, -65418, 130422, 88365, -62128, 54350, -84331, 44864, -138204, -213197, -58498, -101442, -56440, -270221, -344621, 43046, -299826, 392588, -90954, -22421, -54170, -107240, 159202, -3612, -122097, -101471, -201582, -10993, -91512, -196626, -186096, 199292, -16708, -163187, -124526, -106428, 122791, 3995, -5998, -209316, -98102, -254654, 271647, 38360, 2434, 190115, 130800, -194262, 78426, -195912, -173960, 331185, -201347, 84969, -229769, -86253, -5935, 65788, -9973, -66621, -240020, -23601, 138601, -6007, 199407, 260704, -331307, 41171, 75265, -429980, 110712, -101246, -85552, -55254, -104498, 73392, 73903, 370517, -296058, -38273, 27531, -275978, 93166, -114915]
18896B86979d8113j8141l7158A2866Q5552c36323A34117b1595k21859b5192k17643
18885b42835A76736c4305j33814A12708b1869l03453a41578O0842H526a39161
18874G4128a11892j72886B37561a48122b3531m0974K2823B1217a00812l56636
18864d57448a99241C7665J39724b42409j59591A83349A9389e12358a56544E817
18853H218J7638a88096C5226A3571a25844N0697l6357e1400j5859a4332k3362
18842c7694A4629J11858D5125a61170I9540L2783j4982a74652b6950F6553g553
18830b97827f1841j40188R1933j40641M3908I1574a39871M0183L1864l09195J77063
18819a99956B16488j01335R9483J16338b6557p3442M1267j42690g7865J8708j02286
$$ y = [286979, -48113, -66254, -103412, 12866, 98418, -336323, 134117, -21595, -243454, -25192, -242835, 176736, -34305, -168119, 112708, -21869, -325322, -141578, -80736, 8526, -139161, 74128, -111892, -284778, 237561, -148122, -23531, -64505, -41682, 21217, -100812, -457448, -199241, 37665, 177389, -242409, -402000, 183349, 19389, -512358, -156544, 5817, 8218, 25856, -188096, 35226, 13571, -125844, -75147, -111504, -51400, -67259, -14332, -37694, 14629, 126487, 45125, -161170, 99540, 132323, 117341, -174652, -26950, 66553, -7553, -297827, -61841, -202029, -110096, -250737, -206829, 91574, -139871, -99688, -67824, -377019, -199956, 216488, 115153, 214636, 330974, -26557, -99999, -58732, -201422, -77865, -59157, -161443]
18808a61443C40385H1307J66693b30426D22918A99834J08157a56110A46881b8595
18797D35869I3840O4902p6975e0460k46438h4929D04707j81372H5260f7892K493
18786f5399A54335a55243k33583a61226K9694C7712L58570E5621a46844A31514
18775b64659b6159l2400k6139K3667q3998C11043h7692m9831F7116a76239O6978
18764a09261k7209f0769m8539J9597a6425I0109l9757b08170A92211a82098E2313
18752a75462j1482A27021a97736A61055G4578L0355a75515A75113a97325A05011
18741b92718F406K47125b60559B03544a77315A17424b17925a02380l1946A88973
18730D9803d25712g5186p3490b7466A00696A9629a02027C3741Q6302c32684a03827
$$ y = [-161443, 340385, 81307, 248000, -230426, 422918, 199834, 307991, -156110, 146881, -28595, 435869, 93840, 158742, 81767, -50460, -296898, -84929, 404707, 223335, 85260, -67892, -65399, 154335, -155243, -388826, -161226, -131532, 37712, 396282, 55621, -146844, 131514, -264659, -26159, -58559, -84698, -61031, -145029, 311043, -87692, -137523, 67116, -176239, -109261, -136470, -60769, -109308, -89711, -16425, 90109, 50352, -208170, 192211, -182098, 52313, -175462, -186944, 127021, -197736, 161055, 74578, 104933, -175515, 175113, -197325, 105011, -292718, 6406, 253531, -260559, 203544, -177315, 117424, -217925, -102380, -134326, 188973, 49803, -425712, -75186, -148676, -27466, 100696, 19629, -102027, 33741, 120043, -332684, -103827]
18718f6613j15210j02230J11395P4943n5001B72498d4980g638I984J10449b01887
18706F0686c23076n4049a2420A17165K6458a15141j18730k22172g6224K7752B10249
18694I1015R6178b43649I5595j0187a48634k10831a17402k50418A49799K2503
18684A72302j7053c4152j77660A7798O1249a89948B2646J95529D9518e6520j09160
18673a65680A69115d81032g1005A72358g1525l0945p3785h4421j11190A66142
18662A46532a20140k11404A3408h8800b2892L96k99937l957J1421a21262A95724
18650i2689p2410D6187a74617N3146C4264c0050B56969d5883o735n4784l40561
18639d47963c9565l60487A11044f5103B6754K65270a22263m30447K21019n7678
$$ y = [-66613, -181823, -284053, -172658, -97715, -152716, 272498, -44980, -7638, 9984, 120433, -201887, 60686, -323076, -377125, -12420, 117165, 143623, -115141, -233871, -456043, -76224, -48472, 210249, 91015, 187193, -243649, 95595, 85408, -148634, -359465, -117402, -367820, 149799, 172302, 155249, -34152, -211812, 17798, 79047, -189948, 22646, 218175, 49518, -56520, -165680, 169115, -481032, -71005, 172358, -71525, -102470, -176255, -84421, -195611, 166142, 146532, -120140, -331544, 13408, -88800, -22892, -22496, -322433, -326390, -314969, -121262, 195724, -92689, -165099, 46187, -174617, -121471, 34264, -30050, 256969, -45883, -52618, -107402, -447963, -39565, -400052, 111044, -65103, 26754, 292024, -122263, -552710, -331691, -389369]
18629c89369O5408I8298g5186k53122F1823Q0204c8837E3357C920a15176j62024
18618b77200i7300A32035a3521m56590a3687A64963e8932A3996c60115i2153k79523
18607c71676A80537m0538a32077j77721R1297e4699j53985f2483H4215L9760a29525
18595H9319d04562H1367a04138K8243A2998a64150A96919a96544g7628H7397f6321
18583d22405a43755G9680a22016k28090J72708A16744a53163F2057k7555b62813
18572A82038p9913c8317J267p3424H8666d483k34668P0799H8775k4124b76902
18560c04138Q5194B18O7856O2796h9723K5192l16666g987k20556O1383J4363f6408
18547a54877A41445d08592a86949g9731n5787j12622a123C08774b03636A38116
$$ y = [-389369, -323961, 98298, -75186, -328308, 61823, 142027, -38837, 53357, 3920, -115176, -277200, -97300, 132035, -13521, -470111, -13687, 164963, -58932, 13996, -360115, -92153, -371676, 180537, 139999, -132077, -309798, -218501, -54699, -208684, -62483, 84215, 123975, -129525, 89319, -404562, 81367, -104138, -75895, 12998, -164150, 196919, -196544, -77628, 87397, -66321, -422405, -143755, 79680, -122016, -350106, -177398, 116744, -153163, 62057, 34502, -262813, 182038, 102125, -38317, -37050, -110474, 88666, -4483, -239151, -168352, 88775, 64651, -276902, -304138, -218944, 218, 68074, 130870, -89723, -64531, -381197, -7987, -228543, -167160, -152797, -66408, -154877, 141445, -408592, -186949, -79731, -135518, -248140, -1123, 308774, -203636, 138116]
18536a72853C73289b0243l86820A42779c32215d6053p0951j46457B92292b41319
18525A1153b49493A00663J26836e15472B2698b59089M0879B9434f8701j3320A20979
18513A8613a734k66341a25339D8318a88103j7207F7697a3506E0604j0126b2950
18501A61035d43301a19518C923h7983E7579a60248C0646N9244i0402q6544b7517
18489b57617a25669l0621f0838l0903r068j06302A58239a11183j50865c4066G7189
18477C34215a2124j48051B15148a63432a4496q7800B39588k1406j03708a27732
18466A97910D7510b39598p0904k16597A263a67137A45246L0182a26371A04188
18455C4733e1569A17387a49352K7439B06781A0634a47434R164c5805J2925A16846
$$ y = [-172853, 373289, -20243, -407063, 142779, -332215, -46053, -117004, -263461, 292292, -241319, 11153, -249493, 100663, 227499, -515472, 22698, -259089, -218210, 29434, -68701, -82021, 120979, 18613, -1734, -268075, -125339, 48318, -188103, -205310, 67697, -13506, 50604, 40478, -22950, 161035, -443301, -119518, 3923, -87983, 57579, -160248, 30646, 89890, -90402, -176946, -27517, -257617, -125669, -156290, -60838, -91741, -100809, -207111, 158239, -111183, -262048, -34066, 77189, 334215, -12124, -160175, 215148, -163432, -14496, -102296, 239588, 218182, 114474, -127732, 197910, 47510, -239598, -310502, -527099, 1263, -167137, 145246, 175428, -126371, 104188, 34733, -51569, 117387, -149352, -121913, 206781, 10634, -147434, -138270, -35805, -22880, 116846]
18443A22355a14380K4201B69440b59977l903a16661B20566B2696c7472k20377
18433b57849f7j51163D046R1972A2823B179a23622G2273r110i2079k91950d5021
18420f6188A11810j7584b50426A28850a45173j30961J12317A41550L4238O5622
18410B41410b05746c8177a0834B0760L9536J64055A0661K27570j01728h8360H2734
18398F720c8901C17591j42663d0045C03997a06073A12544l3890a47528b1979m9644
18387g1623k0252p8721A2103d0590g064D9614J80890I5474L02812d367A52208
18375A27092h8021B14404G4822b07580A21953a89980C88204b00409F5466K86204
18365C51670h9420o8629j47532L6541G0067L5052b3408A94944b7010G697O8378
$$ y = [122355, -114380, -90179, 269440, -259977, -263880, -116661, 220566, 22696, -37472, -257849, -67, -151230, 4046, 96018, 12823, 2179, -123622, 72273, 63163, -92079, -384029, -45021, -66188, 111810, 94226, -250426, 128850, -145173, -276134, -163817, 141550, 175788, 241410, -205746, -38177, -10834, 20760, 60296, 224351, 10661, 238231, 136503, -88360, 82734, 6720, -38901, 317591, 174928, -40045, 303997, -106073, 112544, 78654, -147528, -21979, -71623, -91875, -170596, 12103, -40590, -7064, 49614, 230504, 95474, 398286, -4367, 152208, 127092, -88021, 214404, 74822, -207580, 121953, -189980, 388204, -200409, 65466, 351670, -89420, -158049, -305581, -269040, 70067, 105119, -23408, 194944, -27010, 7697, 76075]
18354G6075a31662M2807A06271a13511a4534j69345B91726h574A98464a87099
18343B09223p6534c2209A47575F8236c79878g5213A54440p0672a88523E7123b21803
18331B0594a28153L4135L6915p9623O2548j80570A31141c20057E1963a33754B43705
18319D5583J31619C9692c0990j10404k05276J52135d8985A41897e6878I7929b85900
18307b86390G9418e1235A3391Q0084c86998J57972F3076g5253O70j01673f6503
18295B9806b18310A34607b44201A00476a13414J0247A70043A868a84267B4469
18284f2470A76523e8044F2722a13677B30096h7979o2186K778H9776a17472E9939
18272A31686a4022D9006a44378o6340A32360d45939g4832J3042K9530k7317I6814
$$ y = [76075, -131662, -88855, 106271, -113511, -14534, -183879, 291726, -8574, 198464, -187099, 209223, 132689, -32209, 147575, 68236, -379878, -75213, 154440, 83768, -188523, 57123, -221803, 20594, -128153, -94018, -57103, -136726, -74178, -254748, 131141, -320057, 51963, -133754, 243705, 45583, 177202, 39692, -30990, -141394, -346670, -194535, -48985, 141897, -56878, 97929, -285900, -286390, 79418, -51235, 13391, 93475, -386998, -229026, 63076, -75253, -74583, -176256, -66503, 29806, -218310, 134607, -244201, 100476, -113414, -103167, 170043, 1868, -184267, 24469, -62470, 176523, -58044, 62722, -113677, 230096, -87979, -150165, -147387, 89776, -117472, 59939, 131686, -14022, 49006, -144378, -210718, 132360, -445939, -74832, -61790, -32260, -59577, 96814]
18260B34915b12236h7443K6225A16863A0884P7662A7734B030J70791b03997q7896
18249b91893B82764p5101o1543a5981I0716b73891C08967B1919a10582C904b35447
18237g225B24732A8492i0094A30704c0863A34421h2332A24965f8400A45705C1213
18225A17763j0649a06998j02445H5660J13958f4374r3091A99676j5866B6404K5000
18214E1404f4896A7931c1528a3635n0758l8282c3181j28917f459k06528A88336
18202F9031q01J04522j0239M2508e565D290b26899Q194A2221a93875b5799q7731
18190a13530C2705a77727A63501a82018B8079K1066b66378I8178B9535a11475
18179F064a25464E8974q336K05661F136a96139B68738b67451c6956F8654c8397
$$ y = [234915, -212236, -87443, -61218, 116863, 10884, 88546, 17734, 2030, 172821, -203997, -291893, 282764, 207663, 146120, -15981, 90716, -273891, 308967, 21919, -110582, 3904, -235447, -7225, 224732, 18492, -90094, 130704, -30863, 134421, -82332, 124965, -68400, 145705, 31213, 117763, 107114, -106998, -209443, 85660, 199618, -64374, -157465, 199676, 183810, 26404, 51404, -64896, 17931, -31528, -13635, -64393, -102675, -33181, -162098, -6459, -212987, 188336, 69031, 68230, 172752, 162513, 205021, -5565, 4290, -226899, -218705, 12221, -193875, -25799, -113530, 32705, -177727, 163501, -182018, 28079, 49145, -266378, 98178, 29535, -111475, 6064, -125464, 58974, 50638, 256299, 6136, -196139, 268738, -267451, -36956, 68654, -38397]
18167D157J61833B0419J28471b59455l2449R9296C8539b99337J20810o0304i207
18155C62343H0071a36385I2989D0054L6192K9675a67039C120J17058B1541d12159
18143b80211A79431c3579j8045q2775L1958M6461n2572o732j21472H9911b19873
18131B24059a65680C03602A21184b2030F7883K5418O4021d6848B49148I7427a79196
18119e3735E0172b11780f3928j1931A21340a63449c6774l68557g5293q6429b7657
18107b77089D8784e3637j28559j92600b1962j10028C38408H7156c0350f371n0214
18096e6585B63161a6678k7826l3540C05209a75892O4335j35136B06280c689l0370
18085c4059A91750o6269j9296d75p0125C15929C318N9256a36371j155I6595B0218
$$ y = [4157, 165990, 20419, 148890, -259455, -291904, -192608, 38539, -299337, -178527, -238831, -9207, 362343, 80071, -136385, 92989, 40054, 76246, 105921, -167039, 3120, 120178, 21541, -412159, -280211, 179431, -33579, -51624, -134399, -102441, -55980, -108552, -115284, -236756, 89911, -219873, 224059, -165680, 303602, 121184, -22030, 67883, 93301, 157322, -46848, 249148, 97427, -179196, -53735, 50172, -211780, -63928, -75859, 121340, -163449, -36774, -405331, -75293, -161722, -27657, -277089, 48784, -53637, -182196, -374796, -21962, -131990, 338408, 87156, -30350, -6371, -56585, 263161, -16678, -44504, -78044, 305209, -175892, -111557, -246693, 206280, -3689, -34059, 191750, 125481, 106185, -475, -70600, 315929, 3318, 62574, -136371, -137526, 96595, 20218]
18072A18945k8668d8299i386A20414F0092L32403h0670R458j20792B5989b9550
18060a92265B77830i605B07956b99080A66785G4410f9120C6212f0586o5688L310
18049a22964k05843e4022j37088A37570e2424B3699J43452o0495B782a65224E6697
18037C4719f8650o0670G4904b27845A2943l522b9369o992C1745Q2327b25786O7620
18025a58166B6823M1133d7266B04131A1985a32963I2935a12389c0879F4411b96405
18013A45862b72201J10953C15056a004B94243f7793K3375j80231O7265K4734n67
18002a33217j29348E0391L7306a11936j74965b9988A36571b14086M1527M3828
17992a28731M8949C90836C8904a09804B23224d27531A43278A2846Q2964b74660
$$ y = [118945, 90277, -48299, -9386, 120414, 60092, 392495, -80670, -71212, -192004, 25989, -29550, -192265, 277830, -9605, 207956, -299080, 166785, 74410, -69120, 36212, -60586, -126274, -122964, -328807, -54022, -191110, 137570, -52424, 23699, 167151, 106656, 2782, -165224, 56697, 34719, -68650, -129320, 74904, -227845, 12943, 9421, -29369, -36361, 31745, 114072, -225786, -158166, 26823, 67956, -47266, 204131, 11985, -132963, 92935, -112389, -30879, 64411, -296405, 145862, -272201, -161248, 315056, -1004, 294243, -67793, -44418, -224649, -157384, -132650, -133217, -262565, 50391, 87697, -111936, -286901, -29988, 136571, -214086, -172559, -128731, -79782, 390836, 38904, -109804, 223224, -427531, 143278, 12846, 95810, -274660]
17981a97866A306a61006B67179a00986A97148K0874J4820a43213F7218c73707
17970A87352a61623m0827A91369c8209k71032c5822k24112J07650j0130B01314
17959A09831e1879F8549c37188a65246B8722Q3755c5384F7634a43659A84438e6415
17947B52008i9746p0296B4372e47675A26975b7626l6722A24366a46692A25935
17936h1343A52422n4530h1693j11938B42906a06605E004L04340A8524J8481B079
17924a65892l3046F2654N4592n3150a12301M51l7804j20198b5092B9777j1299
17913A8478F45J14754l4406h5725L2291k34584A81110b5508B26950b1909O343
17902a5566j8209B2261J54947c20541F6840J38567a7134I8752a72064I84h7207
$$ y = [-197866, 1306, -161006, 267179, -100986, 197148, 218022, 232842, -143213, 67218, -373707, 187352, -161623, -202450, 191369, -38209, -309241, -35822, -259934, -152284, -162414, 201314, 109831, -51879, 68549, -337188, -165246, 28722, 112477, -35384, 67634, -143659, 184438, -56415, 252008, -99746, -170042, 24372, -547675, 126975, -27626, -64348, 124366, -146692, 125935, -81343, 152422, 97892, -81693, -193631, 242906, -106605, 5004, 309344, 18524, 37005, 2079, -165892, -198938, 62654, 117246, 64096, -112301, -111850, -149654, -269852, -25092, 29777, 18478, 645, 115399, 80993, -85725, -53434, -288018, 181110, -25508, 226950, -21909, -15566, -33775, 22261, 177208, -320541, 66840, 205407, -17134, 98752, -172064, 984, -87207]
17890B37996a41460f0757j18519A36895i2890R640k05324G8535N3712i2805B40365
17878A01419b17815d4003K0794r9145B51586A25687d6337C07082A24804a14150
17867b86999c7500j18977O8877J4214A10226C7408c965D17216f1637C77124A34252
17855A09488f7342n6055k6692A30417c39062a11495J6321j08488B73364R2240
17845C65604a66654A40299a00439p2699M1090D5880J4509r319c80790B3429D866
17833A80549a1265D0058J80158D2707J91303a84604A29333L3674f7341i882G2337
17821b04723i8689c4500l04612f3971b7217B7444J78950a56905C2499c46032C1690
17809F756e744A14500d2011A34681J17326L4124F5986J55446A07249h4912M1019
$$ y = [237996, -141460, -60757, -179276, 136895, -92890, -83250, -288574, 78535, 132247, -92805, 240365, 101419, -217815, -44003, -23209, -122354, 251586, 125687, -46337, 307082, 124804, -114150, -286999, -37500, -156477, -87600, -73386, 110226, 37408, -3965, 417216, -61637, 377124, 134252, 109488, -67342, -123397, -150089, 130417, -339062, -111495, -95174, -203662, 273364, 365604, -166654, 140299, -100439, -173138, -132048, 45880, 60389, 51070, -380790, 23429, 4866, 180549, -11265, 40058, 220216, 42707, 234010, -184604, 129333, 163007, -67341, -9882, 72337, -204723, -98689, -34500, -339112, -63971, -27217, 27444, 206394, -156905, 32499, -346032, 31690, 6756, -5744, 114500, -42011, 134681, 252007, 286131, 65986, 221432, 107249, -84912, -43893]
17798d3893j33738m0435P1578A56831a93945a5214j93854D972b67364c8650j60608
17787a99258O1837l1057P3430j47224A67034a44195g0415A5477c31287m509a8197
17775a61373A4362K0161a53346a4345D9802Q8373b2790D2491d4631A05167a9423
17763f1076A5591b8888j27850j45675B17631a75173E5297J77080b9298q1022I0478
17751B5682c6759j72722a02738A3716a28495M6380j21711O3189H5204k0962L8198
17740A02440i4488A71995A9714c0170A6746J61519i8021A74570a00980j6184n3348
17729a70512A92735L151B8055c16079E8111K0111d9690B08916a25195b1016A35208
17717F0241K91928a58956g0147j86669A19200a24905B0000J1977P7123K36556
$$ y = [-43893, -177631, -218066, -146488, 156831, -193945, -15214, -209068, 4972, -267364, -38650, -199258, -137421, -168478, -95048, -242272, 167034, -144195, -70415, 15477, -331287, -335796, -18197, -161373, 14362, 34523, -153346, -14345, 49802, 138175, -22790, 42491, -44631, 105167, -19423, -61076, 15591, -28888, -156738, -302413, 217631, -175173, 55297, 232377, -29298, -110320, 90478, 25682, -36759, -209481, -102738, 13716, -128495, -82115, -203826, -140637, 85204, 64242, 102440, -94488, 171995, 19714, -30170, 16746, 178265, -98021, 174570, -100980, -117164, -170512, 192735, 195886, 28055, -316079, 58111, 78222, -49690, 208916, -125195, -21016, 135208, 60241, 352169, -158956, -70147, -256816, 119200, -124905, 20000, 31977, 109100, 345656]
17707C45656d6973A61377C6319O0550L5036r272A9991d2915B37414J36291j66707
17696B06998n7407L72946j79191b85908j1773N0132F3455a27609O3580A1267M19230
17685D30497I3343F399a93256B56356a18679C4703m202b48353I5078J85861k7396
17674B53543q4595i5106K1976G0782a09467r0697A00470L4867f7838H1879a40284
17662C7930m24j6188a03645N0412G0690Q8891a86356B17652D854P7119f851p7426
17650h4277c4682a4472C8925b43418A46947K35615G3024c54032a20146B57235
17639B79069H9738i1705k47181A51526a37311k2509e65D6102b2190q3766A72299
17627A24954d887A70998L3582g0268A10895J93757F3140d3236B19609b48403H7576
$$ y = [345656, -46973, 161377, 36319, 96869, 131905, 122633, 19991, -42915, 237414, 373705, 206998, 149591, 522537, 343346, -285908, -297681, -247549, 63455, -127609, -64029, 11267, 430497, 93343, 6399, -193256, 256356, -118679, 34703, 30501, -248353, 95078, 280939, 253543, 168948, -95106, -73130, 70782, -109467, -200164, 100470, 135337, -67838, 81879, -140284, 37930, 37506, 21318, -103645, -53233, 70690, 159581, -186356, 217652, 4854, 81973, -6851, -84277, -34682, -14472, 38925, -243418, 146947, 382562, 73024, -354032, -120146, 257235, 279069, 89738, -91705, -338886, 151526, -137311, -159820, -565, 46102, -22190, -105956, 172299, 124954, -4887, 170998, 204580, -70268, 110895, 304652, 63140, -43236, 219609, -248403, 87576]
17615A59971J30732E1025a00193j02283B47916n7712M8516A09080a47852A09802
17604E22915D0938A0172g4356F0733b72520f790C4115J70726b01117c672k92882
17593b96554A58015B0014K63222a12781B76903a69106A07506J74944h8854M0968
17583d7886A79290a21988I2047J37058a08007H2012b60633I6084C6310K37223
17573B73533H0964k826a00307l5140d1936D40838A08429D5684b80467N8787j27493
17562c49173a10799K6541G4744j117B4986K54043F8021c58576A64524a51279q2187
17551b33466Q144E5066J39662c8219i168C51860n3118a98754I609K8763b27153
17539b21758B15327c15069I7170b9048b768A01097J0526m2773b1225A70048O3991
$$ y = [159971, 290703, 51025, -100193, -202476, 247916, 190204, 238720, 109080, -147852, 109802, 522915, 40938, 10172, -74356, 60733, -272520, -6790, 34115, 204841, -201117, -3672, -296554, 158015, 20014, 283236, -112781, 276903, -169106, 107506, 282450, -88854, -47886, 179290, -121988, 92047, 229105, -108007, 82012, -260633, 96084, 36310, 273533, 80964, 78138, -100307, -135447, -41936, 440838, 108429, 45684, -280467, -221680, -349173, -110799, -84258, 74744, 73627, 24986, 279029, 68021, -358576, 164524, -151279, -233466, -225322, 55066, 194728, -38219, -9168, 351860, 298742, -198754, 9609, 38372, -227153, -221758, 215327, -315069, 97170, -29048, -2768, 101097, 111623, 68850, -21225, 170048, 234039]
17528B34039A7478O01092B58255j2227M0392j33615O8948o4932k2343b6208A15139
17516D85494j50253a18013B89760b70581A00741a43112H0775j3499a10995M8556
17506f2439b0968B71938j05881R429E980J24260F2134g1308B12174r3614a2632
17494C0620a76311B995i3963A20870l228P6127K05843p5443E9802a00206H1398
17482C236a04635D664J06313b05936B41350e4670A75517M0689R4588A51232i6194
17470e1189B61527F2732O879h9908B60866l4101k3783m2955a03251B42400J24731
17459C67131n6106a09077o825A35089J68921a1751j59536C8931K45732j15522
17449A69141l8560J36847C8436j5232N8211P8418K04091L1837j42225j23925K36456
$$ y = [234039, 17478, 618570, 258255, 246028, 286420, 152805, 221753, 156821, 134478, -26208, 115139, 485494, 335241, -118013, 289760, -270581, 100741, -143112, 80775, 67276, -110995, -62439, -20968, 271938, 166057, 175486, 5980, 130240, 62134, -71308, 212174, 118560, -12632, 30620, -176311, 2995, -93963, 120870, 117642, 193769, 399612, 324169, 59802, -100206, 81398, 3236, -104635, 4664, 110977, -205936, 241350, -54670, 175517, 216206, 310794, 151232, -96194, -51189, 261527, 62732, 69611, -89908, 260866, 226765, 202982, 160027, -103251, 242400, 367131, 311025, -109077, -115902, 135089, 304010, -11751, -171287, 38931, 284663, 169141, 130581, 267428, 38436, 23204, 81415, 159833, 363924, 395761, 253536, 129611, 366067]
17438C66067A22064K5893F0238O8628K63491A48274K21360j08397A20140q40L40104
17427D59404j04260c8759C07015P9494j72212R6255a48129B80839J43335h2035
17416A04522L09257j03619j04076n1383p530C0524O1360O4148J35565n0149q4607
17405A56841J45288M2578J51185A65772L50425K5819A75765J45370q7225J15833
17395C49743d081A66742J29072m1647P7643E023K01423C3206Q4554b5943B10627
17383a06027L2089A73248a26050B3712d3265B04280a99174A96971r2043c0577
17372a94746A56399K00140a76013A27329E4259d4760j2386E719J57092D7938b631
17360B61055o4938j551a05913B10352F6048K06655A0058b5136B95792a92171B0218
$$ y = [366067, 122064, 147957, 60238, 128866, 392357, 148274, 369634, 261237, 120140, 119300, 459404, 355144, -38759, 307015, 386509, 214297, 310552, -148129, 280839, 424174, -82035, 104522, 413779, 310160, 206084, 154701, 147171, 30524, 91884, 156032, 291597, 241448, 156841, 302129, 344707, 495892, 165772, 516197, 542016, 175765, 321135, 233910, 349743, -4081, 166742, 295814, 254167, 331810, 5023, 206446, 33206, 117760, -25943, 210627, -106027, -73938, 173248, -126050, 23712, -43265, 204280, -199174, 196971, 104928, -30577, -194746, 156399, 356539, -176013, 127329, 54259, -44760, -57146, 5719, 162811, 47938, -2631, 261055, 196117, 194566, -105913, 210352, 66048, 272703, 10058, -25136, 295792, -192171, 20218]
17348A54452C1220L70894a54193f8639C51582j16502a13202D13569c6301A60346
17337a49809F6789d8525l8627D26976q5079b2595B57426h6951D91925j68714A55581
17325D74690A41243N860a04877r7324B9291J00828c5025I7899J43082J828O5522
17314C08331m9181q2349c563E8142K93285H7033K68302A67883a49334I8488l1949
17303F6539J96923c5081A7988J86154G9238L08333A74164m9528K63130A85896
17292E20989k33960L2704o7030F3466J10762m1668J5463n4898K81916B7840J27779
17281A55619p3381J94417j37927j807J38408A06950a31311B0501R1823C5644J1077
17270D6721h7506D59187A5585g2094B11545p6133n1758J97511K42697k45217r0206
$$ y = [154452, 31220, 402114, -154193, -68639, 351582, 235080, -113202, 413569, -36301, 160346, -149809, 66789, -48525, -87152, 426976, 341897, -22595, 257426, -86951, 491925, 323211, 155581, 474690, 141243, 147103, -104877, -202201, 29291, 130119, -35025, 97899, 240981, 242809, 308331, 259150, 176801, -3563, 58142, 351427, 87033, 355335, 167883, -149334, 98488, 66539, 263462, -35081, 17988, 204142, 79238, 387571, 174164, 124636, 387766, 185896, 520989, 287029, 319733, 252703, 63466, 174228, 132560, 148023, 93125, 375041, 27840, 155619, 82238, 276655, 138728, 136921, 275329, 106950, -131311, 20501, 112324, 35644, 46721, -87506, 459187, 15585, -72094, 211545, 135412, 83654, 281165, 523862, 278645, 188439]
17259A88439B7796K60567j26038M3629I8169J0679g0758D00386b4051a077I6920
17247C36551B6502L65972N3650J20091B37030P9670j9852H7820b8163B1544J86274
17236B07818g633C23009K03252J80253A44711K09735j44044a12235A43543J96185
17226C39728j53351O0222j04145a3069C52490H7314J64833L9157q1641G9593N93181
17215F72774A57883L18419A24008D8579d2488I4746A9992K08082j13691b14466
17204B63365R1592j12155J04534J58406B24824J44856p9048b8053A38189b34371
17193A26764a3880A21630K3772D6575J97062j19234C7515L15607j44314J4726
17183B23534L7457B7012b7165C8336K65511j24993M0780p9893n6382P5623n9785
$$ y = [188439, 27796, 288363, 162325, 205954, 98169, 108848, -70758, 400386, -24051, -1077, 96920, 336551, 26502, 392474, 446124, 566215, 237030, 316700, 296848, 87820, -28163, 21544, 207818, -7633, 323009, 526261, 706514, 144711, 354446, 210402, -112235, 143543, 339728, 186377, 246599, 142454, -13069, 352490, 87314, 252147, 291304, 209663, 79593, 672774, 157883, 476302, 124008, 48579, -42488, 94746, 19992, 228074, 114383, -214466, 263365, 354957, 242802, 347336, 505742, 224824, 369680, 290632, -28053, 138189, -234371, 126764, -13880, 121630, 145402, 46575, 243637, 124403, 37515, 353122, 208808, 223534, 260991, 27012, -27165, 38336, 303847, 178854, 219634, 139741, 83359, 158982, 99197]
17172I9197M7335P1352c73j6888n1889C45554j70544N8399M2688f8929B86038
17160D67952J84438j64212l8573j57336l4001O1080b15922a4309B54732G0156
17149D60147p8416A89990A7072L01028A47654K89186j23112p6603J55441j82931
17139B09635F8805R2562J14611B7789N31655A68214M68301o3606K0221k94511
17129B98619K98639A38903O7315L81789B17991J83302c1938B17770r0716R4814
17119B21868K07640m5973J8675k00552K84134A48992L72017B55693m8600K78840
17109D85933J55546B58853K64316G7097L01569L7077l843N3764k28647K71719
17099E08736K66551j75480k74341j2525I9519b955C24577j9134M21693j54156
$$ y = [99197, 146532, 217884, -373, -17261, -69150, 345554, 175010, 233409, 276097, -68929, 286038, 467952, 652390, 488178, 449605, 292269, 258268, 319348, -215922, -14309, 254732, 70156, 460147, 381731, 189990, 17072, 318100, 147654, 436840, 313728, 237125, 392566, 209635, 68805, 161367, 275978, 27789, 559444, 168214, 636515, 572909, 593130, 298619, 597258, 138903, 206218, 588007, 217991, 401293, -31938, 217770, 127054, 221868, 429508, 383535, 402210, 201658, 485792, 148992, 521009, 255693, 207093, 485933, 641479, 258853, 523169, 77097, 378666, 415743, 411900, 465664, 237017, 508736, 775287, 599807, 325466, 312941, 99519, -2955, 324577, 305443, 727136, 572980]
17089E72980j86657J8986o1062O834j2234J7785P8048j80363K56186K30171k75389
17078D65285J38167B41729O7146R0497Q7964J87740k35288q9417J87822N7872
17068E96065o2118j99534J99365K6019B11601L3764M29417B71116J1130L6224
17058C18470j14103L88622A15194L54693j3101j9495L46313k79534A80756P16910
17048H97666C86941L22055j92902m3196N4691k27159K55549k01801J88548J36921
17038F79647j12613j81946K40450l00125J17972A43256K03258O37F6199M71027
17028E37226J42144l38327J28313l0977A94159M41287j69127K27452j88641R3471
17018E98601j33580J30697n171J5631k45652L61624j74271P4525N6922j93323
$$ y = [572980, 386323, 405309, 344247, 351081, 338847, 356632, 434680, 254317, 510503, 740674, 465285, 603452, 241729, 308875, 399372, 487336, 675076, 439788, 350371, 538193, 596065, 533947, 334413, 533778, 559797, 211601, 245365, 674782, 271116, 282246, 318470, 204367, 592989, 115194, 469887, 456786, 437291, 783604, 504070, 180756, 897666, 386941, 708996, 516094, 472898, 527589, 300430, 555979, 354178, 542726, 679647, 567034, 385088, 625538, 325413, 443385, 143256, 346514, 347151, 66199, 537226, 679370, 341043, 469356, 438379, 194159, 635446, 466319, 693771, 505130, 598601, 465021, 595718, 590547, 606178, 360526, 722150, 547879, 622404, 679326, 486003]
17008D86003L3647j93742J27768M87345l85890J55441j63238j15756K43740k9542
16998F45776K71781r2684j32007l18828J78604J62330J2917k11753K206m8036
16988D70306Q8283k37159K97174B89170K05807M50501k37196O9768K16681k88520
16978G06211j45367L73098K43871l73478C10033N81168k37929j65067N12101l03383
16968F96923l4751K80321j28516M1124R087o9596n2796L3578J31611M2301M4353
16957I93639j5430m6941J9107k41382K42231K4663k42737M46860k03750O1090
16947A037350l46601K64830J23944J13858l43563J4655L19848q0466j82044j55474
16937G66337K51163J44752l02745J59407k53564K62185J10967N6575M0182l85378
$$ y = [486003, 519650, 325908, 453676, 941021, 555131, 710572, 547334, 431578, 675318, 645776, 917557, 824873, 692866, 374038, 552642, 714972, 727889, 516136, 518342, 470306, 558589, 321430, 618604, 289170, 494977, 945478, 708282, 778050, 994731, 706211, 560844, 933942, 1177813, 804335, 310033, 891201, 653272, 488205, 1000306, 696923, 662172, 942493, 813977, 855101, 864188, 794592, 741796, 775374, 906985, 949286, 993639, 978209, 931268, 950375, 708993, 951224, 975887, 733150, 1180010, 976260, 1037350, 690749, 955579, 1079523, 1193381, 849818, 864473, 1184321, 1103855, 921811, 766337, 1017500, 1162252, 859507, 1018914, 765350, 1027535, 1138502, 1195077, 1235259, 849881]
16927H49881L04295l0754j07193J29302L38307k46128l3811q254l39336M16589
16917A272898j40695J54823J76464l76544J84067J39874m84854M87995o4863R7989
16907A447154l99061L4170M11391r5423n3758j7991l8061j9667M93824m79728
16897A282850R844p872K32250o9064k693K61698j10441j00351K59365J64820l87481
16886A532925K53314J32564l94911K02864l1591l87538M22270j78552J68760J33617
16876A853722j83952K28384Q9247j90746K12712j14550L95593j4871r7086j0400
16866B168053k98538M64887m28906K49067k45629K24675J1529J00133k29830L72337
16856B387778q2058J08307k7396J15151O8000j01619j88957j15620L69312m6980
$$ y = [849881, 1154176, 1123422, 1016229, 1145531, 1483838, 1237710, 1203899, 1195645, 856309, 1272898, 1132203, 1287026, 1463490, 1086946, 1271013, 1410887, 926033, 1414028, 1349165, 1447154, 1048093, 1082263, 1493654, 1398231, 1344473, 1326482, 1288421, 1268754, 1762578, 1282850, 1292694, 1284822, 1517072, 1448008, 1445315, 1707013, 1596572, 1496221, 1755586, 1920406, 1532925, 1786239, 1918803, 1523892, 1726756, 1695165, 1307627, 1729897, 1551345, 1720105, 1853722, 1669770, 1898154, 1987401, 1796655, 2009367, 1894817, 2290410, 2275539, 2178453, 2168053, 1869515, 2334402, 1905496, 2154563, 1908934, 2133609, 2145138, 2245271, 2015441, 2387778, 2305720, 2414027, 2386631, 2501782, 2569782, 2468163, 2279206, 2163586, 2532898, 2485918]
16846B485918J94817J62157L51663m89981K02234q0030J32318j91810K28231K06750
16836C202267k83373L21905k23952K62205j39221J42447K96354m0496O0272k78720
16826C319688R7224M68818k15297J24792p1422L06115M2054l1679K44864k06133
16816D079024J39230J83692j18841M00326r3539r3828K97307J05117J93926j51244
16806D941170M4912M3332J26109K36888K0058K62073J69301k58735P56164j3052
16796F328220l85506N14935M943M63221q0695j12756L95243K92457J25128n3225
16786G491965K21904K00498J15589K86645J00986R5393N46730P9578K2512L84047
16776I545847K44516K56923N89485J69750P0863M20402l6191M85584J06043J081355
$$ y = [2485918, 2680735, 2842892, 3194555, 2704574, 2906808, 2826778, 2959096, 2767286, 2995517, 3202267, 2918894, 3240799, 3016847, 3279052, 3139831, 3282278, 3578632, 3538136, 3598408, 3319688, 3416912, 3885730, 3670433, 3795225, 3723803, 4029918, 4071972, 4040293, 4285157, 4079024, 4218254, 4401946, 4283105, 4683431, 4589892, 4496064, 4793371, 4898488, 5092414, 4941170, 4986082, 5029414, 5155523, 5392411, 5412469, 5674542, 5843843, 5585108, 6341272, 6328220, 5942714, 6457649, 6462592, 6925813, 6845118, 6732362, 7127605, 7420062, 7545190, 7491965, 7713869, 7914367, 8029956, 8316601, 8417587, 8512980, 9059710, 9139288, 9161800, 9545847, 9790363, 10047286, 10636771, 10806521, 10877384, 11297786, 11261595, 11747179, 11853222, 12934577]
16766A2934577J02114L26538O08139J82937N73122J019468L5874L38749N63235
16757A6684753R72728N76017N30074N78559J090149L15148J188053Q48887P93187
16748B3577555N53570J212950J277763J136575J121470J157520J492561J564689
16740C3094653J467470J234474K029777K199414K028258K027119K495576K473590
16732D9050331K673787K566996L333437L666983L415772L678786M147057M552069
16724G7085218M606389N486028N231764N798438O583804O841269O475594P601681
16716A25710185P448471Q118965Q216587P866368Q059976P669551P264560O683113
16708A87037776O001088N238117L723981K688323J619890m82223j419858l116833
$$ y = [12934577, 13036691, 13363229, 13971368, 14154305, 14727427, 15746895, 15782769, 16121518, 16684753, 17657481, 18233498, 18763572, 19342131, 20432280, 20747428, 21935481, 22784368, 23577555, 24131125, 25344075, 26621838, 27758413, 28879883, 30037403, 31529964, 33094653, 34562123, 35796597, 37826374, 40025788, 42054046, 44081165, 46576741, 49050331, 51724118, 54291114, 57624551, 61291534, 64707306, 68386092, 72533149, 77085218, 81691607, 87177635, 92409399, 98207837, 104791641, 111632910, 118108504, 125710185, 133158656, 141277621, 149494208, 157360576, 165420552, 173090103, 180354663, 187037776, 193038864, 198276981, 202000962, 204689285, 206309175, 205826952, 204407094, 201290261]
16700B01290261m539590n140143o121660o959438p798712p821603q123335q085149
16692A46700631q146052p890797p395273p592119o850752o474276o230629n656133
16684I0464600n680389m960978n007298m449559l985508l777851l807598l334463
16676E5460956l149770k930204k633524k510633k078623k344213j936525k060192
16668C5817272j693825j385516j728423j394999j415341j057532j600725n74373
16660B4966538j540364p19869j204915q60572o12551o40423j161695k80933q04417
16651A7140799j001542j47115m86834l34638q54246o27890k84976n02559j35032
16642A2765967p95477o4470l96132n30073j54970n26063J98574n51686p04209
$$ y = [201290261, 196750671, 191610528, 185488868, 178529430, 170730718, 162909115, 154785780, 146700631, 138554579, 130663782, 123268509, 115676390, 108825638, 102351362, 96120733, 90464600, 84784211, 79823233, 74815935, 70366376, 66380868, 62603017, 58795419, 55460956, 52311186, 49380982, 46747458, 44236825, 42158202, 39813989, 37877464, 35817272, 34123447, 32737931, 31009508, 29614509, 28199168, 27141636, 25540911, 24966538, 23426174, 22706305, 21501390, 20640818, 20028267, 19387844, 18226149, 17945216, 17140799, 16139257, 15992142, 15505308, 15170670, 14316424, 13688534, 13403558, 12900999, 12765967, 11970490, 11906020, 11509888, 10979815, 10824845, 10298782, 10497356, 9945670, 9241461]
16633I241461M2743m80657Q430m56023k93628L03094o25279R6625k72412r5584
16623G468770l92279k51908n0429k03224k11569l07665J68067l42580L59j12373
16613E765169l10395r8379m1806l0170l31655n4260N572m68063K06178r3251j81202
16602D367738j02650L4976J20879m07016j78551k73509M68045k15038L77k44180
16592C571071j23341n3902j07591Q1476l4460j70900j3604N0501k78656M75541
16582C396135l25694k92506M0965j42451K42859j73819m5264j4496j92161J76011
16572B669579l18191K64887k91397j91251N44736m18039j38018K48448k49362
16563B121392j18921N30736l00169l02319k32904L05401o0590L19028k86073k75812
$$ y = [9241461, 9284204, 8803547, 8811977, 8355954, 8062326, 8365420, 7740141, 7836766, 7564354, 7468770, 7076491, 6824583, 6774154, 6570930, 6359361, 6051696, 6219763, 5877183, 5877542, 5765169, 5454774, 5356395, 5314589, 5284419, 4952764, 4898504, 4904076, 4436013, 4642191, 4548940, 4367738, 4265088, 4300064, 4420943, 4013927, 3835376, 3561867, 4029912, 3814874, 3815251, 3571071, 3447730, 3393828, 3286237, 3367713, 3333253, 3162353, 3148749, 3199250, 2920594, 3396135, 3070441, 2777935, 2818900, 2676449, 2919308, 2745489, 2700225, 2685729, 2493568, 2669579, 2351388, 2616275, 2324878, 2133627, 2678363, 2260324, 2122306, 2370754, 2121392, 2002471, 2533207, 2233038, 1930719, 1697815, 2003216, 1942626, 2261654, 1975581, 1699769]
16553A699769L2919Q5870R1687k65748J36948J99328j87932m82939M24468N3982
16543A788352l27121L7680J61645q0941J00279k29318K12554l97534L07563m11379
16533A161780P03459k46120k14480J39379Q2329j12077m26511M7086K29660L31223
16523A695728o73999k2972K42021k30142O964L56884l28781k1100l333K52466
16513A273736j65615l64312K99532l4440l4495j9896N838k17192L51820J1232
16503A106208k88251L63950m36065J61715l6646J9128j20496M7751K49256l58494
16493G08056R3525j8411p070R4943k31151M36488l41497R534M02158l60034l55927
16482D30614K37060j34291K06654p0399C10520Q05687j97562l66257K30629j81459
$$ y = [1699769, 1732688, 1818558, 1910245, 1644497, 1781445, 1980773, 1792841, 1309902, 1734370, 1788352, 1461231, 1498911, 1660556, 1579615, 1679894, 1450576, 1663130, 1265596, 1573159, 1161780, 1865239, 1619119, 1404639, 1544018, 1626347, 1514270, 1087759, 1134845, 1364505, 1695728, 1021729, 998757, 1240778, 1010636, 1017600, 1374484, 1045703, 1024603, 1021270, 1273736, 1108121, 743809, 1043341, 1008901, 974406, 954510, 960348, 743156, 1094976, 1106208, 817957, 1181907, 745842, 907557, 870911, 890039, 769543, 817294, 1066550, 708056, 801581, 783170, 776100, 871043, 639892, 1076380, 734883, 744417, 1146575, 786541, 430614, 667674, 533383, 740037, 669638, 310520, 1116207, 918645, 552388, 783017, 601558]
16472F01558p7872M61312D51348J81817l0013O9952O4184J99669C56282M20460
16462G76742k00559n2103k8747M4329J80617k63501K03387M4013j44760K68207
16452H27625B43089L13717J18849m5898B22131K93339R1616k95838L08721j63864
16442D56105n3141m2308K21869j35501j2869K99029j36118p0303J42274C17899
16431D8621M64705p50P9774k27378J04189R0068k1909O7314B33908L15105N1762
16420F00775b5964B10529D5009M18095L28399B83858L53246J3736L5202o281k56990
16409D22771l5011J56351B59582l6137J83590K86055A13118O36220B45342J86304
16399D31646m6488j43918Q3259P341j08552L06933A86165L33640B5929L55751
$$ y = [601558, 523686, 984998, 451348, 633165, 603152, 673104, 737288, 936957, 356282, 776742, 576183, 524080, 495333, 539662, 720279, 456778, 660165, 704178, 559418, 827625, 243089, 556806, 675655, 629757, 222131, 515470, 607086, 311248, 619969, 456105, 402964, 360656, 582525, 447024, 434155, 733184, 597066, 526763, 669037, 317899, 48621, 513326, 512576, 592350, 364972, 469161, 559229, 537320, 604634, 233908, 549013, 600775, -25964, 210529, 45009, 463104, 791503, 283858, 637104, 650840, 686042, 679761, 422771, 387760, 544111, 259582, 223445, 407035, 693090, 113118, 749338, 245342, 431646, 385158, 241240, 324499, 331840, 223288, 530221, 186165, 519805, 25929, 381680]
16389C81680K4896j92760K41484M8858B50771r7992L3028J08407J7937J11405
16379D23556A83372K76012R6379A24103L51082G2024J84331r481q3944J48919
16369C11849J1879j12462J13509r1972a33606F9170j3814M45234P560k14086A11451
16357I5016K09235O1843A27986D5350O6413K04062n3598q2596P7305J01665k3109
16346C35492A38601j7745J35671B2053M06314f4306B32485o8579K1247C1694K00104
16335B31798G6158f3704I7357B0414b134D30315A95564N7646L40816k39517A56889
16323D22292k0342A57288L43311q0917A82437K55106p5553F9753K42573A51054
16312D03548E5763Q8243M2362a20733A50699M1595k8683j76J48691b08247G9460
$$ y = [381680, 406576, 213816, 455300, 504158, 250771, 152779, 185807, 294214, 312151, 423556, 183372, 459384, 555763, 124103, 475185, 72024, 256355, 246874, 162930, 311849, 323728, 211266, 324775, 232803, -133606, 69170, 55356, 500590, 508150, 294064, 111451, 95016, 304251, 366094, 127986, 45350, 111763, 315825, 262227, 179631, 256936, 358601, 335492, 138601, 120856, 256527, 22053, 428367, -64306, 232485, 163906, 185153, 31694, 231798, 76158, -63704, 97357, 20414, -2134, 430315, 195564, 253210, 594026, 354509, 156889, 422292, 401950, 157288, 500599, 419682, 182437, 437543, 361990, 69753, 312326, 151054, 403548, 55763, 144006, 186368, -120733, 150699, 192294, 163611, 163435, 312126, -208247, 79460]
16300a19639A14633K26168B1889J41498L20456B19073b14960B26920J18643N6901
16290D02464A16175E3287K6423l7999a90084B74815a35126f3216C6364M25802
16280D62166a19824G8421c3794D11778J9121b5345C61487j56976M08468A92051
16269A87978a6196B31189p3467N5002O9141B641J54725k7903J94827B3029e6973
16257B88207I6132B0280N4508K30792j52317c1313C61447a3332j0682n7946E0208
16245C18185H2298l8809J6571G500J6646O792c841C48410b4470B31160H3403h0511
16232h436A22722D0377N7006j4549d0828J4129A03710k5216B5116a97783A80517
16220E6870g1516G3177e6984m0530G1519K21321f3878C84254F2656a92777g4099
$$ y = [-119639, 114633, 340801, 21889, 163387, 483843, 219073, -214960, 226920, 345563, 402464, 116175, 53287, 79710, 41711, -190084, 274815, -135126, -63216, 36364, 462166, -119824, 78421, -33794, 411778, 430899, -25345, 361487, 204511, 612979, 192051, 187978, -16196, 231189, 157722, 212724, 281865, 2641, 157366, 129463, 324290, 23029, -56973, 288207, 96132, 20280, 74788, 305580, 153263, -31313, 361447, -13332, -24014, -81960, 50208, 318185, 82298, 43489, 60060, 7500, 24146, 30938, -3841, 348410, -24470, 231160, 83403, -80511, -8436, 122722, 40377, 97383, 82834, -40828, -26699, 103710, 78494, 25116, -197783, 180517, 56870, -71516, 73177, -56984, -97514, 71519, 292840, -63878, 384254, 62656, -192777, -74099]
16208G5029J423c9376r298A511K19278g391I825Q0253c0812B0944g6318A05859
16195h4224m3600K7104k1740j0543B21412a40445B2992a12601A03366K81162A10065
16183C16228i0440j87855B5317N8019a33492p7484d4092j54264n4990J26122F994
16171A65818C9757O864J1043d59011f5287F6813K4326m5187h4226h508k39577
16160b48085A7656K7420i9642k0740N7614C08931f8075C58269A69725J27821A6364
16148C64919c7997p3770C00425A47519D4571k0439a05961B74439D7323L4555L112
16137H4990q919K45841h1630C75125b7596A01541J58379c9218D1960J27095a48073
16125A79037P63B1160d0417j25484m5732j82546A54409n3496B7503J92738I2061
$$ y = [75029, 76452, -39376, -48674, 1511, 220789, -7391, 9825, 90078, -30812, 20944, -76318, 105859, -84224, -127824, -100720, -122460, -133003, 221412, -140445, 22992, -112601, 103366, 384528, 110065, 316228, -90440, -278295, 25317, 83336, -133492, -210976, -44092, -198356, -253346, -127224, 6994, 165818, 39757, 46621, 57664, -459011, -65287, 66813, 91139, 45952, -84226, -8508, -248085, 17656, 45076, -99642, -120382, -62768, 308931, -68075, 358269, 169725, 297546, 16364, 364919, -37997, -111767, 300425, 147519, 44571, 24132, -105961, 274439, 47323, 81878, 84990, 76071, 321912, -81630, 375125, -27596, 101541, 259920, -39218, 41960, 169055, -148073, 179037, 179800, 21160, -40417, -165901, -211633, -394179, 154409, 100913, 27503, 220241, 92061]
16113a09280A44617A966a13780H326c42573J10932B16778a06381I495L1877J14317
16102A55689a21598b2948A60016a26313q5804k7636i2701I7124K63835a8455B52551
16090e1552l5755A62032E6072K44276b24139H28Q7456J64240A1158a3410p6759
16079i0169K6297B814a15473C9244Q3400o1179g4670D56072a06133l5966O4776
16068g7323l4807o1948I9370K55841B5633h2549j12088d2167D2796g0723A96951
16056I2275c3981A9572J07508b1875B86060k0169J910d27183a01437D54155a11981
16044a02424A52366A1724a03944k96815J97042B5749L7255M2921L6439n9229O697
16033H9832a4128q7788p1689g9800K0409j30374n9536A28331J996O5712C7735
$$ y = [-109280, 144617, 1966, -113780, 8326, -342573, -231641, 216778, -106381, 9495, 41372, 155689, -121598, -22948, 160016, -126313, -212117, -239753, -92701, 97124, 360959, -18455, 252551, -51552, -87307, 162032, 56072, 300348, -224139, 828, 88284, 252524, 11158, -13410, -90169, -63872, 2814, -115473, 39244, 122644, 61465, -74670, 456072, -106133, -142099, -77323, -112130, -174078, 99370, 355211, 25633, -82549, -194637, -42167, 42796, -70723, 196951, 92275, -33981, 19572, 127080, -21875, 286060, 265891, 267801, -427183, -101437, 454155, -111981, -102424, 152366, 11724, -103944, -400759, -203717, 25749, 63004, 105925, 142364, 83135, 89832, -14128, -101916, -173605, -79800, -59391, -189765, -249301, 128331, 130327, 196039, 37735]
16021a17290B2297c6283j03263o7636k16559I758c1570j62775k1698c196A35631
16009H7684a1870k77955g0715k01177L8497B12936b3086k32560d3507D0151f7144
15997c0215k84776a12933l53014I1618h7449A16894k9978d09195d4832A86398
15986b6224r0872C17335E8628a51789D1211a99062r6281j02950B13449a39872
15975B9639a48752E0438J83581b83415j115C54797A34473K29774N9603I6189L87455
15964D83644B24100o7044J44353b64216A78321o439g2474C45659A5279c83503
15953A41346f7165o5273B1335Q2348L5779b81946I0370J81557J02352b2755A73780
15941e2007A043a64574b9686o1509A58088b99968L5983R8155j56290P4809d5418
$$ y = [-117290, 22297, -36283, -139546, -207182, -423741, 9758, -31570, -194345, -216043, -3196, 135631, 87684, -11870, -289825, -70715, -271892, -233395, 212936, -23086, -255646, -43507, 40151, -67144, -30215, -314991, -112933, -465947, 91618, -87449, 116894, 86916, -409195, -44832, 186398, -26224, -117096, 317335, 58628, -151789, 41211, -199062, -295343, -398293, 213449, -139872, 29639, -148752, 50438, 234019, -283415, -284530, 354797, 134473, 364247, 423850, 96189, 483644, 224100, 157056, 301409, -264216, 178321, 171882, -72474, 345659, 15279, -383503, 141346, -67165, -132438, 21335, 103683, 139462, -281946, 90370, 271927, 374279, -22755, 173780, -52007, 1043, -164574, -29686, -91195, 158088, -299968, -263985, -165830, -322120, -247311, -45418]
15929C2674c9395k41116e846a516k64539f7692k75441a04952c2805j02196A35921
15917A27345a811k75137f2716j34288p905O4176j31449J25872N906B986K34349
15906B37335g3999D3573i3635k1820b0069j52783k0419K7144j30776A26M3745
15895D3871N9600b71202J19496L7222B25257g4178B48045a57204o8404Q8510A06091
15883b05105a5943E8150b89901Q1744R7789N0612I8813B8723Q5876D1824A4476
15871F7933K27310g8734B57419b4161B24252m2686i491j27681j82311p5496h0968
15859a13059j01516K8471j02619A0123K92746F5115l939J8671D214i6536j0178
15848a06714b3490j30o8137j00899A70095a74793j7288Q1853A01079a27589Q034
$$ y = [32674, -39395, -280511, -5846, -1516, -266055, -67692, -343133, -104952, -32805, -135001, 135921, 127345, -1811, -276948, -62716, -197004, -204909, -140733, -272182, -146310, -140404, 2986, 237335, -73999, 43573, -93635, -115455, -20069, -172852, -193271, -166127, -296903, 126, 43871, 103471, -271202, -151706, -114484, 225257, -74178, 248045, -157204, -225608, -137098, 106091, -205105, -15943, 58150, -289901, -208157, -110368, -59756, 98813, 28723, 114599, 41824, 14476, 67933, 295243, -78734, 257419, -24161, 224252, 181566, -9491, -137172, -319483, -394979, -80968, -113059, -214575, -186104, -288723, 10123, 302869, 65115, 61176, 79847, 4214, -96536, -106714, -23490, -23620, -91757, -192656, 170095, -174793, -192081, -110228, 101079, -127589, -119555]
15837a19555C36757e4213j73145A3065i3995B11750e22860I7073C7147A5367c3672
15825g7868A17720a7094l54223i777m57800c3520A42319B7019d7584D04151A0755
15813A65350a52675C147K63555c27613K6803A5233c28524B94625a07331j78439
15803b85770d3752B3425N2881h9430d2636l16002c9430A44169a08482A3143b9899
15791E2563Q2268K66561o1107c5791p6450F240a70917j66726B53292b25560P7922
15780a47638d1419j38875B85386I5564c74905Q9016B01817g1180A4318Q4506e9764
15768e4585G793a85938j5908A54781a70684j29086g8383k90638j06301E004i5720
15756A01456d65979J75183d1068p4466D022f325C9469G780Q2058a11820B00325
$$ y = [-119555, 336757, -54213, -227358, 13065, -93995, 211750, -522860, 97073, 37147, 15367, -33672, -77868, 117720, -17094, -371317, -9777, -467577, -33520, 142319, 27019, -47584, 404151, 10755, 165350, -152675, 3147, 266702, -327613, -300810, 15233, -328524, 294625, -107331, -285770, -43752, 23425, 76306, -89430, -42636, -358638, -39430, 144169, -108482, 13143, -29899, 52563, 134831, 401392, 340285, -35791, -112241, 6240, -170917, -337643, 253292, -225560, -147638, -41419, -180294, 285386, 95564, -374905, -285889, 201817, -71180, 14318, 98824, -59764, -54585, 7793, -185938, -201846, 154781, -170684, -299770, -78383, -369021, -475322, 5004, -95720, 101456, -465979, -290796, -41068, -115534, 4022, -6325, 39469, 7780, 89838, -111820, 200325]
15744A352c293G8323d0359B08268A01042a7127j80778E451a01525C1634c65747
15732g1239j02810B47166a41563B44377B133a29309a0244A48485a18606A05804
15721B15463b5090k70879e5579n2102B01274b68634i4579c3397G8456J5669N0044
15710A44169a24533F180a82792J1977E0820J73593a10461c2471G4500L0153b31783
15698D88941a18946A54313R06F9545P6363F6539M9183a93799O1218C3802a10001
15686H036K59326D9044L041M4572J4443D3829J7773P7347a8256j08687C8578R8517
15674A37095a8802D24604a14006B19388a06087q9793j93232a08346B27626a51307
15663A13197e737A2320c02745C3862d5587k20288H4494i4054E884b3957m5610
$$ y = [1352, -3293, 78323, -40359, 208268, 101042, -17127, -197905, 5451, -101525, 31634, -365747, -71239, -174049, 247166, -141563, 244377, 2133, -129309, -10244, 148485, -118606, 105804, 215463, -25090, -295969, -55579, -107681, 201274, -268634, -94579, -33397, 78456, 94125, 144169, -124533, 6180, -182792, -170815, 50820, 224413, -110461, -32471, 74500, 104653, -231783, 488941, -118946, 154313, 155219, 69545, 145908, 66539, 115722, -193799, -132581, 33802, -110001, 8036, 267362, 49044, 52085, 96657, 111100, 43829, 61602, 138949, -18256, -126943, 38578, 137095, -18802, 424604, -114006, 219388, -106087, -195880, -389112, -108346, 227626, -151307, 113197, -5737, 12320, -302745, 33862, -45587, -265875, 84494, -94054, 5884, -23957, -69567]
15652f9567A43280L2841a17280E8697L3537A0511a34431q3557R9128G097c8244
15640a84885j63052d4725b1153k6299b331j79888C6965a53451A12860h742A09831
15628B8695n524b60935J10057F6985N5714b45322A21410a69151G6392B0057f3577
15616b7509Q941H9444a72905A44559l1779b66772a02701k3424f1090p9945j4836
15605a55871A62706a07414F3220g406k9067k37794a884j36327A40063a72281n4220
15594b26501f1202q4303n6249K7927j52042A27768d48084e2088A05766a5811k67961
15583b83772C64938a92955M1342A28665E750L26632G702a7876k02970f1219A59190
15571b42316A34384J09999E4710N7814a23683k24938c9796k0190A35923Q4477
$$ y = [-69567, 143280, 176121, -117280, 58697, 92234, 10511, -134431, -217988, -118860, 7097, -38244, -184885, -347937, -44725, -21153, -47452, -2331, -182219, 36965, -153451, 112860, -8742, 109831, 28695, 23171, -260935, -150878, 66985, 122699, -245322, 121410, -169151, 76392, 20057, -63577, -27509, -18568, 89444, -172905, 144559, 112780, -266772, -102701, -126125, -61090, -141035, -155871, 162706, -107414, 63220, -7406, -36473, -274267, -1884, -138211, 140063, -172281, -226501, -61202, -145505, -201754, -173827, -325869, 127768, -448084, -52088, 105766, -15811, -283772, 364938, -192955, -151613, 128665, 5750, 332382, 7702, -17876, -220846, -61219, 159190, -242316, 134384, 244383, 54710, 112524, -123683, -348621, -39796, -59986, 135923, 220400]
15561B20400b58342A43922B9395P078b17710g4714b6120A25922b12989k35755
15551d48744i1243j85485c428b53F082J91650j5415O1845H6195Q8446a97865E4112
15538A606J55127J55879c38373b0759j59814g2714p2850b2040r7977a5052A35551
15526B14476b45342D1863J45263h3966E8787A2293c3243j1111j40051D9163K61652
15515C10815a39070c1937A03413N7384d3791k19479J10882G3092f2790C11377
15504A62894a3335k06625A29352A3799K21448C7685g1690B84380p9983b85137
15493G6937L67360b52653a05025l8708B26490A07152a97326D5701R2684J65658
15483C04043b18660o8530e8606j16843B45012H6205K8018h0960C1174d0063a9630
$$ y = [220400, -258342, 143922, 29395, 36473, -217710, -74714, -26120, 125922, -212989, -448744, -91243, -276728, -3428, -253, 6082, 197732, 182317, 244162, 86195, 174641, -197865, 54112, 1606, 156733, 312612, -338373, -20759, -180573, -72714, -145564, -22040, -120017, -15052, 135551, 214476, -245342, 41863, 187126, -83966, 58787, 12293, -33243, -44354, -184405, 49163, 310815, -139070, -31937, 103413, 160797, -43791, -263270, -152388, 73092, -62790, 311377, 162894, -13335, -219960, 129352, 13799, 235247, 37685, -71690, 284380, 204397, -285137, 76937, 444297, -252653, -105025, -143733, 226490, 107152, -197326, 45701, 138385, 304043, -218660, -287190, -58606, -175449, 245012, 86205, 114223, -80960, 31174, -40063, -19630]
15471G5518b45600i0233A763J13861n4840L2809d12499a20160k24409B20235c32674
15459e3273A49645a61963A53876c05094n8218R5572O761B5274c34753D4436g1702
15447G7127c18123a51385C89933e660F0922c50170D0596J08706E7873J78052g3146
15435h8090p0634e9490j17276b940G87J98507a12745b7365C9288h6667J036B21266
15422A92877a11887B17022B0287N3268J32240q6189J8594d7651A08178m9740P2068
15411A30506a9040j78932G9476a89302A45547A1673e4626j9659H7509d01190L9950
15400c61240A2496J23532a47307n7225E4493k1983p335N1816b32922B32849l1793
15389B01056B9428P1718P4089N1048P9834d9098q4166L0343A21675b54705L8158
$$ y = [75518, -245600, -90233, 1763, 115624, 60784, 93593, -412499, -120160, -344569, 220235, -332674, -53273, 149645, -161963, 153876, -305094, -363312, -267740, -260979, 25274, -334753, 44436, -71702, 77127, -318123, -151385, 389933, -5660, 60922, -350170, 40596, 149302, 57873, 235925, -73146, -88090, -158724, -59490, -176766, -2940, 787, 199294, -112745, -27365, 39288, -86667, -85631, 221266, 192877, -111887, 217022, 20287, 73555, 205795, 119606, 138200, -47651, 108178, 58438, 130506, -19040, -197972, 79476, -189302, 145547, 11673, -54626, -74285, 87509, -401190, -361240, 12496, 136028, -147307, -204532, 54493, 32510, 25175, 76991, -232922, 232849, 201056, 29428, 101146, 175235, 226283, 306117, -49098, -133264, -102921, 121675, -254705, -216547]
15378b16547B81145a26795m209F7905K06395i469A6558p300e9777A42689D1645
15366H8778b22170A09898a0279j00096b3324B71113D913b3215q5989r2485P1426
15355a30263A23175b49738B58170b5217l7245C31158j22881a91253L9327C58482
15344C3607b41857g1054H0440J21315b45123j19884e081F889K434d2612n2084
15333i4696B0229K39219k5500h1958A13561b90402C83808n4418a32954C44443
15322a19000A47249P8925D4870d1241k8135q7789L9874A24179c2808A14433D694
15310D1340L3937a00517B8816a25629C3368J06435d0725A31608P9505q4351B2625
15298C03039A49274G4077a14162A47423N4898L9901b9991l1192E0389L05829B3387
$$ y = [-216547, 281145, -126795, -131004, 67905, 274300, -9469, 16558, 9258, -59777, 142689, 41645, 88778, -222170, 109898, -10279, -110375, -23324, 271113, 4913, -23215, -109204, -201689, -130263, 123175, -249738, 258170, -25217, -62462, 331158, 208277, -191253, -151926, 358482, 33607, -241857, -71054, 80440, 201755, -245123, -365007, -5081, 6889, 9323, -42612, -94696, 20229, 259448, 233948, -81958, 113561, -290402, 383808, 329390, -132954, 344443, -119000, 147249, 226174, 44870, -41241, -69376, -157165, -117291, 124179, -32808, 114433, 4694, 41340, 75277, -100517, 28816, -125629, 33368, 139803, -40725, 131608, 211113, 126762, 22625, 303039, 149274, 74077, -114162, 147423, 202321, 242222, -29991, -61183, 50389, 356218, 23387]
15286I9361Q1962D121O8781R1943a10677D08846A11057L1182d0232F011a07751
15274A60855p2165d6767F6250P9572c07205A90207D4691b42098B0694i0672D6995
15262g0566e822k02128F9136K27279A10811a1353j99549d261j5237l08705A32412
15250b65121i8110C26178A01898B4733Q2615J33926C396M46813P543j56108p7865
15239B23779K05897A32284L78613Q9878J10050R4740K9476j41285J44839A96923
15228A12089E1255a10430B77096a31289E5171e9211A85039p2216b33077Q5944
15218a47133e6801D56003q9675A34091A5365L90625N0177m2660a5068j00532a6202
15206a07919A37368f0994I3601C8330a26666C68196C6885J13471L36704e2608
$$ y = [99361, 181323, 4121, 72902, 164845, -110677, 408846, 111057, 142239, -40232, 6011, -107751, 160855, 88690, -46767, 66250, 145822, -307205, 190207, 44691, -242098, 20694, -90672, 46995, -70566, -5822, -207950, 69136, 296415, 110811, -11353, -210902, -4261, -19498, -328203, 132412, -265121, -98110, 326178, 101898, 24733, 107348, 241274, 3396, 450209, 457752, 301644, 223779, 429676, 132284, 510897, 600775, 710825, 805565, 835041, 693756, 838595, 196923, 112089, 51255, -110430, 277096, -131289, 55171, -59211, 185039, 112823, -233077, -147133, -56801, 456003, 366328, 134091, 15365, 405990, 456167, 413507, -15068, -115600, -16202, -107919, 137368, -60994, 93601, 38330, -126666, 368196, 36885, 150356, 487060, -52608]
15195b40094H1990i6716I898a33884j66176J11677b5130A53442B8444J76060I5493
15183F9765R007l713B7471M13060D0556a03109D63710b82043C64060j22010b41348
15171a5562A0187J17404j0498A548J9785a3248G9874k1048j3095K05433J31860
15160C83024A53648d6587A89767J6700L7301K9678a17958A36102J62971k8800
15150B70273j00252g8429G8615c6318C85422j40328o5507a5038B14160a8174A12494
15138A51652J37994e7815E2207b90431B61304a3503B25363O1794L2119A37688
15127a3042A99761K9112a33314B86202n8997K22899j63496i2933E3670f863B77968
15115A03963J60675E1996o962O2628K7270P6123R0226j07940H1859a77994B03948
$$ y = [-240094, 81990, -96716, 9898, -133884, -300060, -188383, -25130, 153442, 28444, 204504, 95493, 69765, 78772, 75059, 27471, 440531, 40556, -103109, 463710, -282043, 364060, 242050, -241348, -15562, 10187, 127591, 117093, 1548, 21333, -13248, 79874, 58826, 45731, 251164, 383024, 153648, -46587, 189767, 206467, 243768, 273446, -117958, 136102, 299073, 270273, 170021, -78429, 78615, -36318, 385422, 245094, 179587, -15038, 214160, -18174, 112494, 151652, 289646, -57815, 52207, -290431, 261304, -13503, 225363, 287157, 319276, 137688, -13042, 199761, 228873, -133314, 286202, 227205, 450104, 286608, -92933, 53670, -6863, 277968, 103963, 264638, 51996, 45034, 107662, 134932, 211055, 301281, 193341, 81859, -177994, 203948]
15103G2159a75826A88790h721B36502a42937A57259j5237i6819b2897E0290a68552
15091A22636K2403E7591K06428D0968J88928N5810A35455l5096j9891b2383D89097
15079B34342c3377F2092g6753B54078K84914B56301A13631c4677B25971F7565
15068C80078r4081M4472B3662M5841L01564j60430n0628P3843A07437b1318A35206
15056B85100k2264a09093D03341A38570N8098H483L23205l251A00426a21960D34300
15044B30106b4745E0349J86988A05035J13685r2809M5278J66123C9409J76529
15034B15938M6743K279H1820g3198I1943L75089A70557g8191E3429J25315L9095
15023B17839J47929c1158B93784q2981E0289P7612M16435G9689N44J90546J18948
$$ y = [72159, -175826, 188790, -8721, 236502, -142937, 157259, 142022, -96819, -22897, 50290, -168552, 122636, 145039, 57591, 264019, 40968, 229896, 285706, 135455, 100359, 80468, -22383, 489097, 234342, -33377, 62092, -76753, 254078, 538992, 256301, 113631, -34677, 225971, 67565, 380078, 285997, 330469, 23662, 69503, 371067, 210637, 160009, 233852, 107437, -21318, 135206, 285100, 262836, -109093, 403341, 138570, 196668, 8483, 331688, 328437, 100426, -121960, 434300, 230106, -24745, 50349, 237337, 105035, 218720, 125911, 171189, 337312, 39409, 215938, 262681, 264960, 81820, -73198, 91943, 467032, 170557, -78191, 53429, 178744, 217839, 365768, -31158, 293784, 210803, 50289, 127901, 544336, 79689, 80233, 270779, 389727]
15012C89727j87183q9782k9102R2292L2421H668a0505m9248I3583J98328j00139
15001A91772J63083l3716J589A48608D995M43141F3427M41018d3593E05545k26385
14990B79160C8247K56108H2304K8695L90179b1028A92362Q1652J46413A8244b00821
14978D98008c7652A32840M47593I0578L1575R8261L5792A06836j4982J0709K80226
14967C82789j57872k8626E1474K98643J48080k35007G8557a7907g943B29378A06442
14955B75012j10831r021L00208A09800Q3713b15501B55197p8878K09479R937j70213
14944B25522K38094a7327B87779L85618b233F37898k30061e3034P51B63448J86237
14933D49685j93988J48388l5597K3121q1504o5982J02974A52798K69975J72714
$$ y = [389727, 202544, 112762, 83660, 175952, 208373, 8668, -10505, -59753, 93583, 291911, 191772, 354855, 321139, 322728, 148608, 4995, 448136, 63427, 504445, -43593, 505545, 279160, 38247, 294355, 82304, 110999, 501178, -21028, 192362, 274014, 420427, 18244, -200821, 498008, -37652, 132840, 580433, 90578, 122153, 220414, 256206, 106836, 91854, 102563, 382789, 224917, 196291, 51474, 350117, 498197, 263190, 78557, -17907, -7943, 229378, 106442, 275012, 164181, 155160, 455368, 109800, 193513, -215501, 255197, 176319, 385798, 395735, 225522, 463616, -17327, 287779, 673397, -2233, 637898, 407837, -53034, -52283, 263448, 449685, 255697, 404085, 368488, 391609, 310105, 244123, 347097, 152798, 422773, 595487]
14923E95487B40467I9341Q9712o2843J16693J95882j09528j00359j02332J02111
14913B28677M28528B35561M45869k85728c9439B82393m566k5189O1731K2939Q7632
14902D24940l0597C3825M05169j40397j45130M04621j21403m3603R5902j88278
14892C00706P7973j22035H0097O38976B58138o6932J65798j36410K6321q5449
14882A61466L23033B24791r5718J20727K05818A28295L08258J2270P6345j69744
14872C55424l7589J60890j34459I9112k763O2230K23643K1365P9918L9695k10591
14861C12609l1057j3827L6463J53377B27046Q9265R8410Q9144J31121k42335L5914
14850D28565L8619k6072k5103A90745J27647K53202B81105o6041J71627L45642
$$ y = [595487, 240467, 99341, 189053, 126210, 242903, 438785, 329257, 228898, 126566, 228677, 657205, 235561, 681430, 395702, -39439, 282393, 277827, 252638, 314369, 337308, 424940, 394343, 33825, 438994, 298597, 153467, 558088, 436685, 393082, 488984, 300706, 378679, 256644, 80097, 719073, 258138, 191206, 357004, 220594, 246915, 161466, 484499, 224791, 129073, 249800, 455618, 128295, 436553, 448823, 525168, 355424, 317835, 478725, 344266, 99112, 96349, 158579, 382222, 403587, 483505, 523200, 312609, 281552, 267725, 304188, 457565, 227046, 316311, 414721, 503865, 634986, 392651, 428565, 467184, 441112, 416009, 190745, 318392, 571594, 281105, 215064, 386691, 732333]
14840G32333j66354k09291M6750J63128k68969K66893j72956L03847C45521J47030
14830D92551K0174j10022A95648K08570J91632o5719k59074P7603m2065L54316
14820F60911B45292R1752J62307K61053C64738L76K12228j45276J21276K8696
14810E82038A27836M67670k60144L17167k75263K17025R2147j232j04538J19313
14800F99981B51149R9672J08572Q9424J2770k18454L18738B68847K58084j10390
14790D16541J10954o8217K46296n7713j34270p2170K47934J05377k35115j13506
14780D46111J79390K6465J18834o5526j43054L4032o9583r407N7415O8091J14195
14769G56963k35084j9009k39006j3495J4251Q8330K97281j33251K19480j53084
$$ y = [732333, 565979, 356688, 403438, 566566, 297597, 564490, 391534, 695381, 345521, 492551, 512725, 402703, 195648, 404218, 595850, 530131, 271057, 348660, 306595, 660911, 245292, 337044, 499351, 760404, 364738, 365114, 577342, 432066, 553342, 582038, 127836, 595506, 335362, 652529, 377266, 594291, 686438, 685206, 580668, 699981, 251149, 350821, 459393, 548817, 561587, 343133, 661871, 268847, 526931, 416541, 527495, 459278, 705574, 647861, 513591, 441421, 689355, 794732, 559617, 446111, 625501, 651966, 770800, 705274, 562220, 596252, 526669, 517262, 574677, 642768, 756963, 521879, 502870, 263864, 250369, 264620, 352950, 650231, 516980, 736460, 583376]
14759E83376l8139o967K18240k2372m623O2891k34450J88261k45702N82774D97353
14747E45224K69528p6461J4240j25266r6561K00146k24516M48808N45l49509K9585
14736F35763J18502l43402N85879j42655m02336J33893K31167P5169m2606j67717
14726F81657L12042l61410j91098K00094Q4356J96249j26766q5499k54466N9885
14716E15044K25301M2004l26090K34167K26696k61722R3231n8289l529L12135
14706I98948l68658K99872J10369j48593j02373L04919k02192n4597M43983m23117
14696H58561O445l4897K14143r4621n8810o2662j13228p3848O37172m59871K34126
14685A052510m60674L12476m497M1905j44012Q6458M05821n12432K66976M9491
$$ y = [583376, 545237, 538270, 756510, 734138, 729515, 792406, 557956, 746217, 500515, 1083289, 497353, 545224, 814752, 738291, 752531, 627265, 530704, 730850, 506334, 955142, 955687, 606178, 635763, 754265, 410863, 996742, 854087, 451751, 585644, 816811, 891980, 849374, 681657, 993699, 632289, 441191, 641285, 725641, 921890, 795124, 709625, 455159, 515044, 740345, 782349, 456259, 690426, 917122, 655400, 748631, 690342, 686813, 998948, 630290, 930162, 1040531, 891938, 789565, 1094484, 892292, 837695, 1281678, 858561, 865006, 830109, 1044252, 949631, 890821, 828159, 714931, 641083, 1278255, 818384, 1052510, 591836, 904312, 899815, 941720, 797708, 884166, 1289987, 777555, 1044531, 1094022]
14675A094022l16636K29466J70807M9288r3674k14676Q4936r386M3096k56998
14665G80245K95033r3875L50211n26507K04518J38029q1340k71390M36884j63658
14655A068150M4671J3680O5015k65234q5642K74513p7447J3118Q7194j33718J58090
14644A162390K37101m25955K74071k68728J35485N1959K88076k95687j01288M22465
14634A479889M9647k81958j37456J07464j70807J41272L31759n34264L85558k80482
14624A090622J2493K44473J67041k58025K62734k00751j73908M56723j7049n06801
14614A077552L31539O7354l68610K69044m9038P824L58288l9623j71239l53937
14604A129154L17749k61686R4356Q6576Q2627L06462l43913K31562P0845j4511
$$ y = [1094022, 777386, 1006852, 1177659, 1226947, 1133273, 918597, 1003533, 994147, 1037243, 780245, 1075278, 981403, 1331614, 805107, 1009625, 1147654, 1066314, 794924, 1231808, 1068150, 1112821, 1126501, 1191516, 926282, 840640, 1115153, 1037706, 1050824, 1138018, 1004300, 1162390, 1399491, 973536, 1247607, 978879, 1114364, 1166323, 1454399, 1158712, 1057424, 1479889, 1529536, 1247578, 1110122, 1217586, 1046779, 1188051, 1519810, 985546, 1371104, 1090622, 1103115, 1347588, 1514629, 1256604, 1519338, 1318587, 1144679, 1601402, 1584353, 1077552, 1409091, 1476445, 1107835, 1376879, 1327841, 1335665, 1693953, 1654330, 1483091, 1129154, 1446903, 1185217, 1279573, 1366149, 1448776, 1755238, 1411325, 1642887, 1713732, 1699221]
14594A699221k25446j5994L15463R1992m26643L16361J9940j81717L0232J04448
14584A727857j14158J02647j6709L02774o4267o7701J083j27018N7530J86742
14574A988780l17345J21532N03714k60507m00623K38640J38061M9562r2148O9944
14564B039610O3753j97751J21179J27461k24918J83311K00569p4417J09864M6086
14554B394747O0419N2793J03875k4384j33386K99219K0924J98270J33339j16637
14544B989179J66605J53601J88935K10352K17743M14264M79414R53322J247851
14535G021266J648906L071212L910625P044951Q473489k524717j1615318o423680
14527A0606734l852406j818735j366566l99699j98661k13133K7185J48165m60518
$$ y = [1699221, 1473775, 1457781, 1773244, 1865236, 1438593, 1754954, 1774894, 1593177, 1623409, 1727857, 1613699, 1716346, 1699637, 2002411, 1938144, 1870443, 1871526, 1744508, 1802038, 1988780, 1671435, 1792967, 2296681, 2036174, 1635551, 1874191, 2012252, 2061814, 1969666, 2039610, 2103363, 1905612, 2026791, 2154252, 1929334, 2112645, 2313214, 2238797, 2348661, 2394747, 2455166, 2507959, 2611834, 2587450, 2454064, 2753283, 2774207, 2972477, 3105816, 2989179, 3155784, 3309385, 3498320, 3708672, 3926415, 4340679, 4820093, 5773415, 7021266, 8670172, 11741384, 15652009, 22696960, 31170449, 28645732, 17030414, 10606734, 6754328, 4935593, 3569027, 3169328, 2970667, 2757534, 2784719, 2932884, 2472366]
14518B472366p1139O0412q2813o3996J2773M7579J45537K75358k4894k56152j19665
14507B395366M36427l48213n0526K46595J90385q1183n1881K63341j75444m7630
14497B777237L35589m39202K88761j60180L30851R1904l28142L99121l40726o65
14487B954548O35264m75610l081N15588M1661k85786K23506m06815M91639j91632
14477C499282J55160K69268k18620j69287K02695K8321J44914J89075j79363k13126
14467C708319K66060P2863J75593r3091L4406K69935l27037J91169q8422K27926
14457D437721J23242k02930K18742J46232j04637r2076O79424l97475j17531J82281
14447D872993K397K50875p7225l4325J13753P9842L04125l32355M38855q3131
$$ y = [2472366, 2401227, 2461639, 2378826, 2314830, 2327603, 2375182, 2520719, 2796077, 2771183, 2515031, 2395366, 2831793, 2483580, 2433054, 2679649, 2870034, 2788851, 2736970, 3000311, 2824867, 2777237, 3112826, 2673624, 2962385, 2802205, 3133056, 3224960, 2896818, 3295939, 2955213, 2954548, 3589812, 3114202, 3111121, 3626709, 3668370, 3382584, 3606090, 3199275, 3690914, 3499282, 3654442, 3923710, 3705090, 3535803, 3738498, 3766819, 3911733, 4100808, 3921445, 3708319, 3974379, 4047242, 4222835, 4129744, 4164150, 4434085, 4107048, 4298217, 4209795, 4437721, 4560963, 4358033, 4576775, 4723007, 4618370, 4526294, 5205718, 4808243, 4690712, 4872993, 4875390, 5126265, 5049040, 5014715, 5128468, 5208310, 5512435, 5180080, 5618935, 5535804]
14437E535804l16771K63846K54829K22788j21469J85233j29323Q1238J30124J53938
14427F260237L74421m91651J29006K10544k6948j08712K47607M40141j3338j43116
14417F878191J40733J57746j02753N41435q0160l4388L69519j68834J93211j63766
14407G730934K59292N9416M59253J76571k3939J90470k21598M43400K35011J71729
14397I480539j11273J29670J92968J43870p0013L92478m3700J98432K58013k00408
14387A0370576L63108K61731J96432M2482K72043L25869m0300M4792P98902J23778
14377A2759413o9374L26133o9563N14578K9368L48443L04949l8326L27873K04445
14367A4637939M87281J29989L51986K73765K88982N42640L02129J80372M97012
$$ y = [5535804, 5219033, 5482879, 5737708, 5960496, 5839027, 6024260, 5894937, 5976175, 6106299, 6260237, 6634658, 6143007, 6272013, 6482557, 6455609, 6346897, 6594504, 7034645, 7021307, 6878191, 7018924, 7176670, 7073917, 7615352, 7535192, 7500804, 7870323, 7701489, 7894700, 7730934, 7990226, 8049642, 8508895, 8685466, 8661527, 8851997, 8630399, 9073799, 9308810, 9480539, 9369266, 9498936, 9691904, 9835774, 9765761, 10158239, 10114539, 10312971, 10570984, 10370576, 10733684, 10995415, 11191847, 11234329, 11506372, 11832241, 11791941, 11836733, 12635635, 12759413, 12690039, 13016172, 12946609, 13461187, 13490555, 13838998, 14143947, 14105621, 14433494, 14637939, 15125220, 15255209, 15607195, 15880960, 16169942, 16712582, 17014711, 17195083, 17692095]
14358A7692095j79353Q48897j7146N80775J53592O96675L78751n3321Q11375P9011
14348B0991351Q29979N66051M20160K92762P57637O0342Q90800L29358O84772
14339B5823212P27712M21616P63245M31022O91381N99924J042026N17610O56920
14330C1674668R40440Q16975J006882Q72637J093568J137220O95449J292676J186682
14321D0717197J021015J179008J178005J420479J294547J353797J699426J401819
14313E1265293J631613J821410J651806K185526J958052J993751K095881K362793
14305F6966125K379001K604379K576597K712760L168933K737237L434367L398796
14297H9978195L518507L880433L905046M254034M654113M737361M872414N522511
$$ y = [17692095, 17512742, 18361639, 18344493, 18925268, 19078860, 19775535, 20154286, 20100965, 20912340, 20991351, 21821330, 22387381, 22807541, 23100303, 23857940, 23918282, 24809082, 25138440, 25823212, 26550924, 26972540, 27735785, 28166807, 28858188, 29458112, 30500138, 31017748, 31674668, 32615108, 33432083, 34438965, 35311602, 36405170, 37542390, 38237839, 39530515, 40717197, 41738212, 42917220, 44095225, 45515704, 46810251, 48164048, 49863474, 51265293, 52896906, 54718316, 56370122, 58555648, 60513700, 62507451, 64603332, 66966125, 69345126, 71949505, 74526102, 77238862, 80407795, 83145032, 86579399, 89978195, 93496702, 97377135, 101282181, 105536215, 110190328, 114927689, 119800103, 125322614]
14289A25322614N550439O104612O356783O849702O610304P770723Q044320Q510334
14281A81119831Q867243R266768J0007648J0398713J1213124J1292328J2041751
14274B54207406J2654256J3170726J3276946J3751612J3649993J3757854J3564016
14267C48032809J3261851J3217820J2976322J1877296J1378780R622333Q948214
14260D29315425P089116N211623L195659J955468K318467K618230j746985m027103
14252D45929900m214638o345816p606686j0477131j1532652j2898788j1933339
14245C80920850j2885878j3228205j2954414j3349046j2779227j2871223j2791511
14238B90061346j2592566j2533275j1869024j1288724j1220596j0495109j0686579
$$ y = [125322614, 130873053, 136977665, 143334448, 150184150, 156794454, 164565177, 172609497, 181119831, 189987074, 199253842, 209261490, 219660203, 230873327, 242165655, 254207406, 266861662, 280032388, 293309334, 307060946, 320710939, 334468793, 348032809, 361294660, 374512480, 387488802, 399366098, 410744878, 420367211, 429315425, 436404541, 441616164, 444811823, 446767291, 449085758, 451703988, 449957003, 445929900, 441715262, 435369446, 427762760, 417285629, 405752977, 392854189, 380920850, 368034972, 354806767, 341852353, 328503307, 315724080, 302852857, 290061346, 277468780, 264935505, 253066481, 241777757, 230557161, 220062052, 209375473]
14231B09375473j0579570r838653r094316q898358q042280p886262p045826o693752
14223A41296456o161641o382672n348124n225971n367906m843204m194336l981202
14215I9791400l863528m068036l651796l394488k985781l008378k917749k827700
14207G3073944k257909k701631k188389j895453k533496k120233j688494j819060
14199E5869279j636902j506439j737438j759127j227486j733057j065063j319110
14191D3884657r69005j318227j400791j163263p00924p82040r27268j201719j144009
14182C4277411q55615p63806p03540q52740n17454j142947p42601q34819n46936
14173B7316953n87622o37150j40350j017141m65670m56552p24843p49675j58628
$$ y = [209375473, 198795903, 188957250, 179862934, 170964576, 162922296, 155036034, 147990208, 141296456, 135134815, 128752143, 123404019, 118178048, 112810142, 107966938, 103772602, 99791400, 95927872, 91859836, 88208040, 84813552, 81827771, 78819393, 75901644, 73073944, 70816035, 68114404, 65926015, 64030562, 61497066, 59376833, 57688339, 55869279, 54232377, 52725938, 50988500, 49229373, 48001887, 46268830, 45203767, 43884657, 42915652, 41597425, 40196634, 39033371, 38332447, 37550407, 36623139, 35421420, 34277411, 33421796, 32657990, 31954450, 31101710, 30584256, 29441309, 28698708, 27863889, 27316953, 26729331, 26092181, 25951831, 24934690, 24469020, 24012468, 23287625, 22537950, 22379322]
14164B2379322m56437q65234l63117j14880l44154p05676m4865o42515l58509
14155A8483935n44736l92500j81141l17218l41618k62293m87128j3480j87862
14146A5755959n05422k51273k92490j6777n15563m6323k75376m70514k17411j81621
14136A2983189j35591o316l33957k54952l71819n066j63046m3500j14345n01558
14126A1053039J14921k77086k16007j07807o31337j15297N47673j79261n06752
14117I682086k47982L49140l85679j35403m4760m08594K77438m51286k29290K92395
14107H698065k51398j29735j28977n73540N80925p6088j75506j93887k33631j15937
14097G400291k28366J78677p2611k29248j3690j78760o2820j70481N3820q3406
$$ y = [22379322, 21922885, 21057651, 20694534, 20579654, 20235500, 19529824, 19484959, 18842444, 18483935, 17939199, 17546699, 17365558, 17048340, 16706722, 16444429, 15957301, 15943821, 15755959, 15250537, 14999264, 14706774, 14689997, 14174434, 14128111, 13852735, 13382221, 13164810, 12983189, 12847598, 12841282, 12507325, 12252373, 11880554, 11875488, 11712442, 11668942, 11554597, 11053039, 11167960, 10890874, 10674867, 10567060, 9935723, 9820426, 10368099, 10188838, 9682086, 9434104, 9783244, 9397565, 9262162, 9217402, 8808808, 9086246, 8634960, 8405670, 8698065, 8446667, 8316932, 8187955, 7614415, 8195340, 8119252, 7943746, 7749859, 7516228, 7400291, 7171925, 7350602, 7277991, 7048743, 7035053, 6856293, 6793473, 6622992, 6676812, 6593406]
14087F593406m32984M35575k31673k41715K81924n88398K78815j07296n5749J5428
14077E947333r0690R0311k66100k31329K25750j25319n2120m19630K10840l7693
14067E251353j62412L78818n80701J35925M53R0799k77442n5582K05337l50737
14057D635811j50167j51684j62430J10730N9339L6298J08628j75946k94855M6722
14047D062446J9776K59243j94705M5009j69448J96181o4757j50625n9257m4014
14037C899849L2985j6995l69740P4616J62433k02155k08654M47374n65504J52804
14027C407013J35589P6411m05068R8046j880J0181k20826j13027K93314j66274
14017C113479K34641j89305p0908J4175j57966k29741N34953m93049M63629n88711
$$ y = [6593406, 6160422, 6595997, 6364324, 6122609, 6404533, 5816135, 6094950, 5987654, 5931905, 5947333, 5856643, 5946954, 5680854, 5449525, 5675275, 5549956, 5497836, 5078206, 5289046, 5251353, 5088941, 5467759, 4887058, 5022983, 5023436, 5114235, 4836793, 4781211, 4986548, 4635811, 4485644, 4333960, 4171530, 4282260, 4341599, 4377897, 4486525, 4310579, 4015724, 4062446, 4082222, 4341465, 4146760, 4191769, 4022321, 4218502, 4153745, 4003120, 3943863, 3899849, 3932834, 3915839, 3546099, 3620715, 3783148, 3580993, 3372339, 3819713, 3254209, 3407013, 3542602, 3619013, 3213945, 3311991, 3310111, 3320292, 3099466, 2986439, 3279753, 3113479, 3348120, 3158815, 3087907, 3102082, 2944116, 2714375, 3249328, 2756279, 3219908, 2631197]
14007B631197N57149n30408K8280J47710J49686l86926j79955L69879j96307j91954
13997B398351J58854J35377K15280n32556r1788J93244k31116J8473K72176l0281
13987B506014K0407k20967R4830l5968J65562j10962J20273K77590k56100O90639
13977C251318J70845P86070J424202K346080L822068N689167R722671J958580
13969B9171001q912158o440122m018907k623317j440486p40850n77939l68775
13961D048447r4819o10757q7913r6706m0778j53389m1715l03407l2896k8795J42707
13950B699979k34205L5259J06943j95052m0400j87007r0754o9134Q0831O5621
13940B172081j52303L06383j6034k51975J70046k84572J14343p5695j0567J77738
$$ y = [2631197, 3188346, 2657938, 2686218, 2833928, 2983614, 2596688, 2416733, 2786612, 2590305, 2398351, 2557205, 2692582, 2907862, 2375306, 2283518, 2476762, 2245646, 2264119, 2536295, 2506014, 2526421, 2305454, 2400284, 2364316, 2529878, 2418916, 2539189, 2816779, 2560679, 3251318, 3422163, 4208233, 5632435, 7978515, 11800583, 17489750, 27212421, 29171001, 20258843, 13818721, 9799814, 7176497, 5736011, 4995161, 4417222, 4048447, 3953628, 3342871, 3254958, 3158252, 3117474, 2964085, 2922370, 2618963, 2586067, 2557272, 2699979, 2465774, 2501033, 2607976, 2412924, 2372524, 2185517, 2094763, 2025629, 2106460, 2172081, 2019778, 2326161, 2310127, 2058152, 2228198, 1943626, 2057969, 1982274, 1971707, 2149445]
13930B149445k24457l4032l40196M19409J02444k02120K38209l68935J07268k47412
13920A599623P05933j72177q9182p27294K11475K07327j75328J17371m9499L03899
13910A932148k97782L9591r5955m2261L38950l54232K66603k48412J05953l359
13900A641244l30070l8540J71791K2453j36700J59384K82571K53501q15431L67392
13890A577595m6994j99664K42412R9997j19802k04137J28765l2399K21940k68273
13880A399440j12403R1939q0386k20356N70706j25038k24073j20041m4144K61823
13870A397467k27450K47507L6024j09036n78956M67324r1737j02628L12732j18506
13860A232741r026K2908N2205l17222L58969M7845m07980j6477O3905K81214N675
$$ y = [2149445, 1924988, 1890956, 1550760, 1970169, 2072613, 1870493, 2108702, 1739767, 1847035, 1599623, 2305556, 2133379, 2044197, 1316903, 1528378, 1735705, 1560377, 1677748, 1628249, 1932148, 1634366, 1673957, 1578002, 1535741, 1874691, 1520459, 1787062, 1538650, 1644603, 1641244, 1311174, 1272634, 1444425, 1466878, 1330178, 1489562, 1772133, 2025634, 1210203, 1577595, 1530601, 1330937, 1573349, 1673346, 1553544, 1349407, 1478172, 1445773, 1667713, 1399440, 1287037, 1378976, 1298590, 1078234, 1648940, 1523902, 1299829, 1179788, 1135644, 1397467, 1170017, 1417524, 1453548, 1344512, 765556, 1232880, 1141143, 1038515, 1351247, 1232741, 1223715, 1246623, 1298828, 981606, 1340575, 1388420, 980440, 963963, 1027868, 1309082, 1314757]
13849A314757k42837K59628p3078j28711k00502K44241K13203j73945j54958j92266
13839H65532J21700j00803K07428n8341O5752L77404l08079O3177k05357o3473
13829I64940K16545m3373K41453l25586k22922K32930j6317R9252j66748n3452
13819I26722K07475J36932l82826K42405j07651j72057j34712J10299L7513j33717
13809G30383K3499J31769m8440J5093j19129J46269K2349j19859o2353k5161K7645
13798G22065N6207l3216j21937L35652j07587n9119p0744J79197l60763K28352
13788G68107J27357j71924K43876k9542l46744M72770j62813j82055K34331k69272
13778F84091q3747L03592k44357j21078J64656Q1835J0959j24911R2116k14930
$$ y = [1314757, 1071920, 1331548, 1258470, 1129759, 929257, 1173498, 1386701, 1212756, 1057798, 865532, 987232, 886429, 1093857, 1035516, 1101268, 1478672, 1170593, 1233770, 1028413, 964940, 1181485, 1138112, 1379565, 1053979, 831057, 1063987, 1047670, 1146922, 980174, 926722, 1134197, 1271129, 888303, 1130708, 1023057, 851000, 716288, 826587, 864100, 730383, 753882, 885651, 837211, 852304, 733175, 879444, 901793, 781934, 719581, 694420, 722065, 778272, 745056, 623119, 958771, 851184, 792065, 721321, 900518, 539755, 768107, 895464, 723540, 967416, 937874, 591130, 1063900, 901087, 719032, 953363, 684091, 600344, 903936, 659579, 538501, 703157, 784992, 795951, 671040, 763156, 548226]
13768E48226K70890k07487M1932P7163K01834m36911J61724K67275p8315l49487
13758D96844L49569j17638J09230J69469k24090k27440J23470q5099m2604R7393
13748F49104m1668J53433M1633n2512k22324K24596O5257N3097m25269L96017
13738H41364j54426q751J81504j91192K3216r8191K81675l97264K43649k34376
13728D87208j59880M34255o7659J26384C93299N16908k03231n9327M5726o9436
13718F23939K40152l59199q054J48124j1028M6748j38802J80345p2378j86275
13708D63572m5312K18708j22810n323P9348J37406j30578m3678k6704L8008q7537
13697D75100P0843P7051j78024n7916K87890L65046D75394J66204j25292K49894
$$ y = [548226, 819116, 611629, 653561, 730724, 932558, 495647, 657371, 924646, 846331, 496844, 846413, 728775, 838005, 1007474, 783384, 555944, 679414, 594315, 551711, 649104, 607436, 760869, 802502, 749990, 527666, 752262, 817519, 870616, 445347, 841364, 686938, 678187, 859691, 668499, 691715, 593524, 875199, 477935, 721584, 487208, 327328, 761583, 693924, 820308, 393299, 910207, 706976, 647649, 693375, 623939, 864091, 504892, 496838, 644962, 633934, 680682, 541880, 722225, 649847, 463572, 418260, 636968, 514158, 508835, 588183, 725589, 595011, 551333, 524629, 562637, 475100, 545943, 622994, 444970, 387054, 674944, 1039990, 475394, 641598, 516306, 766200]
13687G66200l17241J25256K08066k65148p043R3444M484A46717J86051J23019
13677D55787r0819J27972j9653L12730j67634m6471P4237B23647K29015J93384
13667F46046j86954J15432m4334r0126J64594B01061L85574j8212r929B01712
13656C30934k500K12365j86505J10058A76296O1709O3747K71398J46335B42838
13645F44839j56579Q394n4853j61341J75023J92296j51446A47314N97404k42101
13635E02617j27411K72465k51096J96623k52207K62100j09813J48163C09993L63082
13625F73075j0419j37776k5355K00608j65665n9682j71880O0469O4806q4294q6590
13614B57297Q8363M3209A74786M13210B48052K55484l2117J7551J52778C4781
$$ y = [766200, 448959, 574215, 782281, 517133, 510090, 603534, 608018, 146717, 332768, 455787, 364968, 492940, 473287, 786017, 618383, 571912, 646149, 223647, 452662, 646046, 459092, 574524, 530190, 440064, 604658, 201061, 586635, 568423, 558494, 201712, 330934, 328434, 540799, 354294, 464352, 176296, 238005, 301752, 573150, 719485, 242838, 644839, 488260, 496654, 441801, 280460, 455483, 647779, 496333, 147314, 744718, 502617, 375206, 647671, 396575, 593198, 340991, 603091, 493278, 641441, 309993, 673075, 662656, 524880, 499525, 700133, 534468, 474786, 302906, 363375, 428181, 343887, 257297, 345660, 388869, 174786, 587996, 248052, 503536, 471419, 488970, 641748, 34781]
13603F49343k21889O4870j02131M3330K29927l14209E2848L48308R8878j2300
13593D87734j60670n6941J753K55370o4495A86844J98329J83363B56680L76655
13583F33335k83882O5021n7503k8312A27797k7511L64336Q61p4448q5244J38249
13572D44040l953j71881J11339F8149J58588J32457P305p8757p9576J45012j32801
13561B20377L57810B25198L75045f1874C19680N0946l1083q3092J92189A39701
13550a70124A95861K73817n4936j16693K28684A48668M79584k78614L720j9430
13540C33928h1331E12683m607k11696k2584E0371L37788d7459C80541q2802j412
13529B96327K15352k48455K06015B18747j8928R5400l953j42061K99122j997A32894
$$ y = [649343, 427454, 492324, 390193, 433523, 663450, 349241, 52848, 401156, 500034, 487734, 327064, 270123, 271876, 527246, 462751, 186844, 385173, 568536, 256680, 633335, 349453, 414474, 356971, 328659, 127797, 100286, 464622, 465483, 391035, 305791, 444040, 440087, 268206, 379545, 68149, 226737, 359194, 366499, 287742, 208166, 353178, 220377, 578187, 225198, 600243, -61874, 319680, 370626, 339543, 256451, 448640, 139701, -170124, 195861, 469678, 414742, 298049, 526733, 148668, 628252, 349638, 353358, 333928, -81331, 512683, 508076, 296380, 273796, 50371, 388159, -47459, 380541, 297739, 296327, 511679, 263224, 469239, 218747, 199819, 295219, 291266, 149205, 448327, 446330, 132894]
13517C94614J17293j89264R5697j97509K04252N5726l4543E0047M43236j61522
13507C31761A14795J92738J70491q8672j47212J07236r0823J5096j14628J05079
13497B64100O6202R8270A89457L41717C4394K36233k3264J5854K3713A19263n0895
13486F8368J62351N9044p2700K00640j59195M0614J55973J8528A69994c6985B95729
13474C81866c11819F58778A60315P3805L6203m9963K1978j1114R3286J18372A89911
13462a04929J0010A75025D0832O3206f6943D40281J98168j92889A42846K38494
13452C81340p9155K6922A62327A6912M23475e633D33866E2479K06937J71404M4718
13441D75538k26101o7521K83371i8242A51039m8817J25261J4468B4446N12563
$$ y = [394614, 511907, 322643, 418340, 220831, 425083, 480809, 446266, 50047, 493283, 331761, 114795, 307533, 478024, 389352, 242140, 349376, 258553, 273649, 159021, 264100, 330302, 428572, 189457, 531174, 34394, 270627, 247363, 263217, 286930, 119263, 68368, 230719, 289763, 217063, 417703, 258508, 299122, 455095, 473623, 169994, -36985, 295729, 381866, -311819, 658778, 160315, 234120, 270323, 220360, 242338, 231224, 324510, 442882, 189911, -104929, -94919, 175025, 40832, 104038, -66943, 440281, 638449, 445560, 142846, 381340, 302185, 329107, 162327, 16912, 440387, -5633, 433866, 52479, 259416, 430820, 475538, 249437, 181916, 465287, -98242, 151039, 102222, 227483, 241951, 24446, 537009]
13431E37009A02819k2280J51857K39905A55525K28587a09303A23676E5825M96285
13421E52110J7531j91486A55350M5315o780K16637B3537K56272P9932m1720q072
13410C09949p69A53206m472J83296j41325p1233m1639J22160O0990a82810c517
13398b14620P4718B47214d7608j9646B25405k0617J2576L3587M0739F6418L36636
13387D03054A79919k300p2265D8252L06663f1602B62805J50133A20694K95997
13377D16691A88942c4566A7966a9358A99838K33262j32933k9176Q1370N0110A27314
13365A64205K55860k07308g1520B82526M1569p2172n4277K96163A21408J17424
13355B38832J00263M5117j46463K78092e1795A98393h4592H2873f4502D3689L74622
$$ y = [537009, 102819, 80539, 232396, 472301, 155525, 384112, -109303, 123676, 55825, 552110, 569641, 378155, 155350, 200665, 193885, 410522, 23537, 279809, 359741, 318021, 309949, 309180, 153206, 148734, 332030, 190705, 119472, 77833, 199993, 260983, -182810, -3517, -214620, -139902, 247214, -47608, -67254, 225405, 204788, 217364, 250951, 291690, 66418, 403054, 179919, 177619, 105354, 48252, 354915, -61602, 262805, 412938, 120694, 416691, 188942, -34566, 17966, -19358, 199838, 433100, 300167, 270991, 352361, 402471, 127314, 164205, 420065, 212757, -71520, 282526, 324095, 251923, 197646, 493809, 121408, 238832, 339095, 384212, 237749, 515841, -51795, 198393, -84592, 82873, -64502, 43689, 418311]
13344D18311B06986O9959H3636L59634n4635j00621o4249m3492L3789J87421j93812
13333B07671o3053O322K12484k6498I4811J14288J67850q7936D8835J04455A5338
13321C60038q6111K3411p7744A07728J13313A08752M7696J01654d1872A80098
13310A21529R3816D4413J11490R45a52434D09639G3740k8863c3805A30465M138
13299A34603K03772a48818D1599K95202A62277J14525J49952c86420c708B16558
13288B9716K03122C71M54734A95124R5756J3119j42373d9372E01600A26929J68303
13277B95232j2862a550A81998c8827l09041B55777D2407J67754R11C6866J42381
13266A79247i3764B17184J26946A69033l8618J85381A7650J16220a79516A08302
$$ y = [418311, 206986, 276945, 83636, 443270, 388635, 288014, 223765, 180273, 214062, 401483, 207671, 144618, 150940, 363424, 336926, 94811, 209099, 376949, 289013, 48835, 153290, 15338, 360038, 273927, 297338, 219594, 107728, 221041, 108752, 156448, 258102, -41872, 180098, 121529, 215345, 44413, 155903, 156848, -152434, 409639, 73740, 44877, -33805, 130465, 134603, 338375, -148818, 41599, 336801, 162277, 276802, 426754, -386420, -3708, 216558, 29716, 232838, 371, 455105, 195124, 290880, 303999, 161626, -49372, 501600, 126929, 295232, 282370, -1550, 181998, -38827, -347868, 255777, 42407, 210161, 211072, 36866, 179247, -93764, 217184, 344130, 169033, 130415, 315796, 17650, 133870, -179516, 108302]
13255E8416K01506k0055a46200B83833n3862q6130k6451J65879g7352A91673h5648
13243A36533K54371j45895g0416b627B45303G9683L5948J7856K63587A43738a57850
13231F5429J27500J46932G2805f5072B37418E2581R4657m1014k5735e0209A84850
13219B26347n8095c9568C30458j57244j5342Q2724Q4430A04929c3012I8391R1738
13208A90129b23662C7104M69522A97137J78237C5654L7275N4758E3280K3572P7398
13197A54250m1527a76527A67582n0252C0429b4987A2891J18075M9666i7212I4254
13185B3391L40933j04206k7538a66758B25680a50550B499h5605B263N8070L04777
13174C65110A71804J52228K2478a62457m1064J2464C57356B6927K8026a52194
$$ y = [58416, 259922, 239867, -146200, 283833, 229971, 143841, 117390, 283269, -77352, 191673, -85648, 136533, 390904, 245009, -70416, -2627, 245303, 79683, 115631, 133487, 397074, 143738, -157850, 65429, 192929, 339861, 72805, -65072, 237418, 52581, 147238, 106224, 80489, -50209, 184850, 226347, 168252, -39568, 330458, 173214, 157872, 240596, 325026, 104929, -33012, 98391, 190129, -223662, 37104, 506626, 197137, 375374, 35654, 72929, 127687, 53280, 76852, 154250, 112723, -176527, 167582, 117330, 30429, -24987, 12891, 130966, 180632, -97212, 94254, 23391, 364324, 260118, 232580, -166758, 225680, -150550, 2499, -85605, 2263, 60333, 365110, 171804, 324032, 346510, -162457, -203521, -191057, 357356, 26927, 54953, -152194]
13163B254K21878g0851A92309J95943A07694a10628L129D5091L69404j95846r7335
13152A21314m860I261c3825A36574N0978B9943K12078K2693c82656G8988J45449
13141B24437c5609H7129Q4343R0870E5465b17050E7164f1552b1474D18365d3393
13129H325L25496i673G200b85062A24905Q0451B8963b0251H47g2638C47812i7860
13116a28925l6967B990K4175c1068C7420H755J64738a40517d9782B3486K49651
13105B73137H0123K7774R154l9836d18549A25254k4010L70980E3527O2088R2598
13094B08213I5309L8344b714A67509b571E19514A86866F9666K2411b419m2214
13083d4633c943j5201B17348I6644M3982a66518B13082D4557a8109A43593J81091
$$ y = [2254, 224132, -70851, 192309, 388252, 107694, -110628, -107499, 45091, 414495, 218649, 121314, 116454, 9261, -33825, 136574, 187552, 29943, 242021, 264714, -382656, 78988, 224437, -35609, 87129, 171472, 262342, 55465, -217050, 57164, -61552, -21474, 418365, -43393, 8325, 333821, -9673, 7200, -285062, 124905, 205356, 28963, -20251, 847, -72638, 347812, -97860, -128925, -165892, 2990, 27165, -31068, 37420, 8755, 173493, -140517, -49782, 23486, 273137, 80123, 107897, 117051, 77215, -418549, 125254, 101244, 472224, 53527, 115615, 208213, 95309, 133653, -2714, 167509, -2571, 519514, 186866, 69666, 92077, -2419, -44633, -3943, -19144, 217348, 96644, 140626, -166518, 213082, 44557, -18109, 143593, 324684]
13072C24684G2939J01611p0224J71312A25091c5885A59525G5388K97J68004i5010
13060A21075J38730a07334C01862f7481A88023o9933L2410g4519A99049r2670
13050A06379b20383C74402E4440L24614L5495C0988c5131j71121B81163o4799
13040B16364A01583J36936a95454A6870P2767B5645b11120B89648F076L06672
13030C12748b757q7273B65323b71767A17197K38238g8191B48201A01929c35556
13019b58032A52082F4084K45915d2690D24850l8414A37831j5435J55272a61916
13008d0626B87291a39201o3635B8251R7726P0471O1183N9353A42868K6253a81038
12996G2952l076a35524C36708B8975h5581j07317A53918a97787K1810B55256A26596
$$ y = [324684, 72939, 174550, 104326, 275638, 125091, -35885, 159525, 75388, 75685, 243689, -95010, 121075, 259805, -107334, 301862, -67481, 188023, 118090, 150500, -74519, 199049, 106379, -220383, 374402, 54440, 379054, 414549, 30988, -35131, -206252, 281163, 216364, 101583, 238519, -195454, 16870, 89637, 25645, -211120, 289648, 6076, 312748, -2757, -90030, 265323, -271767, 117197, 355435, -78191, 248201, 101929, -335556, -258032, 152082, 64084, 309999, -42690, 424850, 386436, 137831, 122396, 277668, -161916, -40626, 287291, -139201, -202836, 28251, 125977, 196448, 257631, 316984, 142868, 169121, -181038, 72952, 69876, -135524, 336708, 28975, -85581, -192898, 153918, -197787, -175977, 255256, 126596]
12984A5926O3665J43491E408a27805c7783B84526C9210J07944g2868k7810j55357
12973b56035B24785I9221J4104c5630A21333l202d9816A33299a43942c6579I9853
12961A5437d4591J5390H7990J51573r3961B5100R2123P3860a43844A33549j4488
12950A19061l7898D767J16897i3169j08107j21564A13498c47320B74258f2155
12939A75476k7712J73491b37013A57988J33834I9753a17677M6417k1022q2004
12929a74286B32794G0041a85723A02426J03115b5026D6308K37802k8878b06873
12918B61223b20402m0804H9360B6597H245b66854B07524a78394A06203k6019b1656
12906A62847G8886k2598Q5413Q2521L1534F1756b1125j45124A85254i5247B0899
$$ y = [15926, 79591, 223082, 5408, -127805, -37783, 284526, 39210, 147154, -72868, -100678, -256035, 224785, 99221, 113325, -35630, 121333, 118131, -49816, 133299, -143942, -36579, 99853, 15437, -44591, -29201, 87990, 239563, 145602, 25100, 117223, 191083, -143844, 133549, 119061, 81163, 4767, 121664, -93169, -201276, -322840, 113498, -347320, 274258, -62155, 175476, 147764, 321255, -237013, 157988, 291822, 99753, -117677, -71260, -92282, -174286, 232794, 70041, -185723, 102426, 205541, -25026, 46308, 284110, 255232, -206873, 261223, -220402, -261206, 89360, 26597, 8245, -266854, 207524, -178394, 106203, 80184, -21656, 162847, 78886, 56288, 141701, 224222, 255756, 61756, -21125, -166249, 185254, -95247, 20899]
12894E1593L57464a972n2024A60649D3797K0108b50471B55698a22654A75399a17120
12882A40777A3576a48746b1247H5621a99827G9374P2675i8653A19617J67260E1960
12870c4521C4705a49778C1638a75800C07517f9121j20366G7929E952J9753N2472
12859G8177b7091j61973B04884E3692A8338a08238n2252G8349J62466E6842L5948
12848I2790b38035b5394A93816a83073c2643G7195a71915A64942g9332K1401A30170
12836a29182N0938A54308o3574a59130H0374P3538j9339N6327K76564H8953a98513
12824C4910G044K5887L14126a71512I8403K37644a65770B22437G2319J67079b76813
12812b6859A08374b59392A72353B0021J18355D3659a9586M377A28298B9661K12492
$$ y = [51593, 409057, -1972, -53996, 160649, 43797, 63905, -250471, 255698, -122654, 175399, -117120, 140777, 13576, -148746, -21247, 85621, -199827, 79374, 152049, -98653, 119617, 286877, 51960, -34521, 34705, -149778, 31638, -175800, 307517, -69121, -189487, 77929, 5952, 25705, 78177, -27091, -189064, 204884, 53692, 18338, -108238, -160490, 78349, 240815, 56842, 92790, -238035, -25394, 193816, -183073, -32643, 77195, -171915, 164942, -79332, -57931, 130170, -129182, -78244, 154308, 90734, -159130, 80374, 153912, 134573, 190900, 467464, 88953, -198513, 34910, 7044, 32931, 347057, -171512, 98403, 336047, -165770, 222437, 72319, 239398, -276813, -26859, 108374, -259392, 172353, 20021, 138376, 43659, -19586, -15209, 128298, 29661, 242153]
12801B42153b30842I6486k4108C4609D595O4624d63786b3968j22611A08477b36957
12789c24119a26467j0779A80310a16724I4061m809a2013E0719Q5144i9111p477
12778a06588C46713i2921K2744j29491n761R3984C07391r8415C6776a05600r698
12767a15298L9294A22227a57799g0670j78269J3618E4909R7153a9464A9713R2399
12756A12112a15342c451k86886B63102a86455A8930J3300k50O4694P4142d5898
12744A2345b4791r3784A0968P9000K76961g2327H7891O6061a1421A91104a6087
12732H0679M3430A1687J5906K07915H4714O2212h306B02097k9226N1510J83635
12721D08016j11703o3334a14349j53328a18014A51952A9562K39219l0894a45330
$$ y = [242153, -230842, 96486, 72378, 34609, 4595, 69219, -463786, -23968, -146579, 108477, -236957, -324119, -126467, -137246, 180310, -116724, 94061, 89252, -12013, 50719, 135863, -99111, -106588, 346713, -92921, -70177, -199668, -205429, -111445, 307391, 208976, 36776, -105600, -115298, -76004, 122227, -157799, -70670, -248939, -235321, 54909, 152062, -19464, 19713, 112112, -115342, -3451, -290337, 263102, -186455, 18930, 32230, 31980, 96674, 170816, -45898, 12345, -24791, -118575, 10968, 89968, 366929, -72327, 87891, 153952, -11421, 191104, -16087, 80679, 124109, 11687, 27593, 235508, 84714, 146926, -8306, 202097, 172871, 224381, 408016, 296313, 232979, -114349, -267677, -118014, 151952, 19562, 258781, 227887, -145330]
12710I2039J84140J34239H6113J0535C2784K07435a45082B8929L2991J67115a32607
12698c4138A39576a02523A61450J58642A21770J26495g9019A36326J69105F5309
12687A69119J51699i1105A07629a05303Q889m4533b4167C5188R189K24571a08117
12675F6546N2813B0368K1444K5296J27788J46938a35140j83369E1253c456B97100
12663B25897j5282b6598A23028J69645a8218C54015d851A11893D9732J40092e5858
12651D00228G2301a66412n7127J08942j11338B94127B0345L00094p4934H3108
12640A82659a49907A54862L9266a13827I6603C7648K44243C712c77412D72172
12629g3322I8790d4736l18526C29512C395N1766b590q9085B1537K20543C5912
$$ y = [92039, 276179, 410418, 86113, 96648, 32784, 240219, -145082, 28929, 61920, 229035, -132607, -34138, 139576, -102523, 161450, 320092, 121770, 248265, -79019, 136326, 305431, 65309, 169119, 320818, -91105, 107629, -105303, -96414, -140947, -24167, 35188, 44377, 268948, -108117, 66546, 119359, 20368, 41812, 67108, 194896, 341834, -135140, -318509, 51253, -3456, 297100, 225897, 210615, -26598, 123028, 292673, -18218, 354015, -4851, 111893, 49732, 189824, -55858, 400228, 72301, -166412, -223539, -114597, -225935, 294127, 20345, 320439, 245505, 83108, 182659, -149907, 154862, 194128, -113827, 96603, 37648, 281891, 3712, -377412, 472172, -73322, 98790, -44736, -363262, 329512, 3395, 55161, -2590, -91675, 21537, 242080, 35912]
12617B64551p2647K14329A59082J22065H712J80752J90316G8321o618R7290n2673
12606A16320O0876G0633M3362a95454B50356j455o5884o3226J03292f1372b779
12594a8992q4475A64092o3388f5290A6712M77052A68503Q4487l6944C7770J37974
12583A75744l1747J53728A20419j4058b43446B28296C9449e61j52071j21563C190
12571A3693d1564P168p0507I120g1120F7198L4970a99399I021b1071j4396k15942
12559b51409j23544I890c18257H0922d8857B44299b30303i2418A2181J04284b1321
12547g3149l3219K0968B51467j06097K0841a42192j38656g2805j44509m3405d3438
12535D3841K22102p8807n4855b723E0246R9184e9361G949L1408h0628j51747E0986
$$ y = [264551, 191904, 406233, 159082, 281147, 8712, 189464, 379780, 78321, 71703, 168993, 116320, 177196, 70633, 113995, -195454, 250356, 248901, 183017, 119791, 223083, -61372, -2779, -18992, -103467, 164092, 100704, -65290, 16712, 493764, 168503, 252990, 216046, 37770, 175744, 143997, 297725, 120419, 106361, -243446, 228296, 39449, -561, -152632, -274195, 3190, 13693, -41564, -34396, -104903, 9120, -71120, 67198, 102168, -199399, 9021, -21071, -35467, -251409, -374953, 9890, -318257, 80922, -48857, 244299, -230303, -92418, 12181, 116465, -21321, -73149, -106368, -85400, 251467, 145370, 166211, -142192, -280848, -72805, -217314, -260719, -43438, 43841, 265943, 187136, 132281, -2723, 50246, 149430, -59361, 7949, 39357, -80628, -232375, 50986]
12522a11989k8565j12531Q6965C81750i9028M8098b3521I6935Q3694b03006C44677
12510A74636a80983A53891e5053b5752I6507d2695B56149n8156K33382H7358b65376
12498B38421A0479Q0316q285a31077n5759A08236L6446a16684F1139A8429h006
12486A85158F2905c8059C84700A50892a66231D9250a4864B17150H8707e4503l00359
12475c54862A36037K2600a03536m5624c4070D3485h0957r8096B0945R5188K15249
12464C31382e1466A26275O3265f2269p8547A75591a3763q567B99893r8945a80734
12452e1160C41826a21753I2644d5099k14500B46161b13959d8724A51545F0668
12441D25375j77144f071C15718I5018J691e1494A73433H194R7805a20191q3815
$$ y = [-111989, -140554, -253085, -166120, 381750, -99028, -50930, -23521, 96935, 180629, -203006, 344677, 174636, -180983, 153891, -55053, -25752, 96507, -42695, 256149, 197993, 431375, 87358, -265376, 238421, 10479, 90795, 82510, -131077, -186836, 108236, 144682, -116684, 61139, 18429, -8006, 185158, 62905, -38059, 384700, 150892, -166231, 49250, -14864, 217150, 88707, -54503, -354862, 136037, 158637, -103536, -149160, -34070, 43485, -80957, -179053, 20945, 116133, 331382, -51466, 126275, 189540, -62269, -140816, 175591, -13763, -22330, 299893, 200948, -180734, -51160, 341826, -121753, 92644, -45099, -259599, 246161, -213959, -48724, 151545, 60668, 425375, 248231, -6071, 315718, 95018, 96709, -51494, 173433, 8194, 105999, -120191, -204006]
12430b04006c130l6611B32981a57824l4339J2712b260o1587m9885J9025C9380
12418g2466a346B7540b77575C12740A02049g8834B89366a5400B3839g3115A3229
12406A6676J06735a94011I9708L19176A5192R7142N7584j0607J79106a51291A44192
12394a79152A05049J36025B8294J56672A2002b34908f8754A55205F3242D098L46965
12383C51063c3265B50818r4694i2880k25985B14454o680a75695A28182d3247k822
12372d6069A90007q3561m7185J8251k8355a67687a3604k7718C9262i3969C4161
12360a69123A24434f6484E4999b74224C9415f0641A76802k8773p1658j1371L21824
12349C86824a10777A02404A9441d35110B05273b80994h5171F1380H578b20415
$$ y = [-204006, -3130, -39741, 232981, -157824, -192163, -179451, -2260, -63847, -113732, -94707, 39380, -72466, -1346, 27540, -277575, 312740, 102049, -78834, 289366, -15400, 23839, -73115, 13229, 16676, 123411, -194011, 99708, 418884, 15192, 112334, 169918, 159311, 338417, -151291, 144192, -179152, 105049, 241074, 28294, 184966, 12002, -234908, -68754, 155205, 63242, 4098, 351063, -33265, 250818, 156124, -92880, -318865, 214454, 207774, -175695, 128182, -43247, -46069, 190007, 106446, 59261, 77512, 49157, -167687, -13604, -41322, 39262, -93969, 34161, -169123, 124434, -66484, 54999, -274224, 39415, -60641, 176802, 148029, 76371, 65000, 386824, -110777, 102404, 19441, -435110, 205273, -280994, -85171, 61380, 8578, -220415]
12338F7935A1037K01687A6369a77025A60489C9550J816a82585k07732a73186M3510
12327a29676J6039C54654D0759R7523L065o2666N7189j712c75706e9059K387j7469
12315g4141A51109A7745J27389i5651G2090f9767r6205H6801c4643B8632M439
12304C3071a09199A19930j671K21439a48863a0705j6338n2362k96626G8041K7549
12293A05590k2322f7322n7750K7581A6692a05854J0255A29983a80434b5855o2769
12282h8624l346a9244B2131J72665f7676j4904H1419J00830I309J20242a76038
12270a88206B54017K9154B5511Q1322a4299o5013B1360b03178A05325L3711F055
12258A50901e1889m2822k7860A66620E8659K97516a20552j57236C0439J1566c71581
$$ y = [67935, 11037, 212724, 16369, -177025, 160489, 39550, 41366, -182585, -390317, -173186, -129676, -113637, 354654, 40759, 138282, 141347, 78681, 135870, 134158, -375706, -59059, -56672, -74141, 151109, 17745, 145134, -95651, 72090, -69767, -165972, 86801, -34643, 28632, 33071, -109199, 119930, 118259, 339698, -148863, -10705, -27043, -79405, -376031, 78041, 105590, 83268, -67322, -125072, -97491, 16692, -105854, -95599, 129983, -180434, -25855, -88624, -91970, -19244, 22131, 194796, -67676, -82580, 81419, 182249, 9309, 129551, -176038, -188206, 254017, 283171, 25511, 106833, -14299, -79312, 21360, -203178, 105325, 139036, 6055, 150901, -51889, -94711, -122571, 166620, 58659, 356175, -120552, -277788, 30439, 42005, -371581]
12246a07253j11981e3945j12426A74724h7333C37433a27981I4206b53956B84096
12235i6924j8506D28857j24703k7972e0464q3109E32704B06417l3831a4545C0819
12223A22938L28651a33663M104H2235d174A27879M0510l4054K9594G4819k8594
12212D6225b7437B04321F9876J43310d3989I3578K34646j40196J38120g0351h620
12200C0986i5181B55235J38753a58132f6943C35800A27402J15051J6132H9920
12189B62862j5760I0596k5221K1341a78125c8022E34211j54865j14361m3707C9316
12177G7575K71432I8174N2394a62028A97668C3462a79621I2772J20029P999J4454
12166B35254O5339A6143K26028b79587C45169a90780Q598F2601q611J00397o0731
$$ y = [-107253, -219234, -53945, -166371, 174724, -87333, 337433, -127981, 94206, -253956, 284096, -96924, -115430, 428857, 304154, 276182, -50464, -133573, 532704, 206417, 172586, -14545, 30819, 122938, 451589, -133663, -129559, 82235, -4174, 127879, 168389, 134335, 163929, 74819, 46225, -27437, 204321, 69876, 213186, -43989, 93578, 328224, 188028, 326148, -70351, -8620, 30986, -95181, 255235, 393988, -158132, -66943, 335800, 127402, 242453, 258585, 89920, 262862, 247102, 90596, 65375, 86716, -178125, -38022, 534211, 379346, 264985, 221278, 39316, 77575, 349007, 98174, 150568, -162028, 197668, 33462, -179621, 92772, 212801, 220800, 235254, 300593, 16143, 242171, -279587, 345169, -190780, -182182, 62601, 53990, 154387, 93656]
12155I3656J40697q1335B6989a93950B94533a19877m8172h3190A97402b9593j48992
12144a78585K702B33982p4226G2815R8903c12841C7739i9599B40408d5699B01564
12132I910K71604r1119O3500A15041f0864E6172A8221b7455n2308j83979C91887
12120F0406K76677a50274B6272M677J01988C9808K67122j03073Q5533a13603I200
12108d0523B37919b1593A09461b13657H5386N0097K53373a95021I8082d1338J1411
12097b9927A03688b54299R8050B300J30322K9900a08319q8665f7025k74221G8454
12085a77540h2631F6455h0042Q931B05746B0347b6564F3255G377f8467j34793
12074b03260l2394F4490B6128J99020F6853A4912b58225R7687B37372J12456j22897
$$ y = [93656, 234353, 153018, 26989, -193950, 294533, -119877, -168049, -83190, 197402, -29593, -178585, -175883, 233982, 159756, 72815, 171718, -312841, 37739, -99599, 240408, -45699, 201564, 9910, 281514, 190395, 253895, 115041, -60864, 56172, 18221, -27455, -79763, -263742, 391887, 60406, 337083, -150274, 26272, 30949, 132937, 39808, 306930, 203857, 289390, -113603, 9200, -40523, 237919, -21593, 109461, -213657, 85386, 135483, 388856, -195021, 98082, -41338, -29927, 103688, -254299, -156249, 2300, 132622, 162522, -108319, -196984, -67025, -341246, 78454, -177540, -82631, 66455, -80042, -71111, 205746, 20347, -26564, 63255, 7377, -68467, -203260, -235654, 64490, 26128, 225148, 66853, 14912, -258225, -160538, 237372, 349828, 226931]
12063B26931a53473J4835D20791k7632k2841K89027M41120m84420j70674a26249
12052a36687j12076A40906d175A29281n1458L1798P3447K8002K5561H414N961
12041A4375b59667A89321l1848a6597B09987G8155J93192F4304m582R954L2524
12030A02200K5019a85250O9443d4553E2506J41797a21070k48815a68895J884G1419
12018A18812L37710B0058f3367A63030i2558C06036b32902C5287M9846b36934
12007e0054b3171B00153B9345d13j23792c0680A00999A852O1512J10735b59187
11995E4246b3691k97764J08360K1689A10936f4064E20034i6091C46059B9406b27954
11983a14578A38525o7526i9886I672e05856a00295d2619F7856J67390r5074K8693
$$ y = [226931, -153473, -138638, 420791, 393159, 370318, 659345, 1100465, 616045, 445371, -126249, -136687, -248763, 140906, -4175, 129281, 77823, 109621, 183068, 211070, 236631, 8414, 14375, -259667, 189321, 157473, -16597, 209987, 78155, 271347, 64304, 59722, 69676, 102200, 127219, -185250, -115807, -44553, 52506, 194303, -121070, -369885, -168895, -167011, 71419, 118812, 456522, 20058, -63367, 163030, -92558, 306036, -232902, 35287, 85133, -236934, -50054, -23171, 200153, 29345, -413, -124205, -30680, 100999, 1852, 63364, 174099, -259187, 54246, -23691, -321455, -213095, -191406, 110936, -64064, 520034, -96091, 346059, 29406, -227954, -114578, 138525, 70999, -99886, 9672, -505856, -100295, -42619, 67856, 235246, 140172, 168865]
11972A68865a7116p1104b4163j44391j13550g5129j12046C0910K24189d8669A21040
11960F139b525E4137b68403c4737j12314F8575a10956A99158r0988a21199D0472
11948b43535D5326L00377L8035b40055f9835k65243B35815a14042j7833C66709
11937a99172R2229c0033j30326G0997g0392o9320A88736E7131i4733n2949A06424
11925A08285b00938d951j54341j23772I0467K5959b11665k2998a13617d090B7369
11913a07484c7969l58740B9993J83607b1782k31106J24870C66848c05794e2345
11902A61616c14015a10318o1051j2048p0276e4484j01662f9037A04259l3999h6767
11890E0753J51940p3139b16504P9644K1881A40548C217a4574A77153b09784B86260
$$ y = [168865, -17116, -88220, -24163, -168554, -282104, -75129, -187175, 30910, 255099, -48669, 121040, 6139, -2525, 54137, -268403, -34737, -147051, 68575, -110956, 199158, 108170, -121199, 40472, -243535, 45326, 345703, 383738, -240055, -69835, -335078, 235815, -114042, -131875, 366709, -199172, -106943, -30033, -160359, 70997, -70392, -139712, 188736, 57131, -94733, -147682, 106424, 108285, -200938, -4951, -159292, -283064, 90467, 116426, -211665, -234663, -113617, -4090, 27369, -107484, -37969, -396709, 29993, 213600, -21782, -252888, -128018, 366848, -305794, -52345, 161616, -314015, -110318, -171369, -183417, -253693, -54484, -156146, -69037, 104259, 70260, -86767, 50753, 202693, 129554, -216504, -136860, -114979, 140548, 3217, -14574, 177153, -209784, 286260]
11878G1289a23415H0272g8540b077D7284M8598a81582A52193f3828k24171D8763
11866a29391o8330o2961b954j31253D5476J00123a01938j32806B75047f719H0357
11854A25938e851l7886o9559l7611N4660J4764I7491h7193A27134c82906J55562
11843b27344A68587J04724O9459a91700H2049K9606a30034b7303k12467n633j5757
11832b61160R5565b8535n8619A77316b06959D8651B707a40183H0529R8384b35237
11820a29466r7027F721c017j10917I0752Q9070a7126A19283a23778K7618K4626
11809g1534k23927N5376B38487a16195E3845d8947j06234k42382E861a07554K3510
11798h4044k07619B44363C6253K19967a03007A77334d57626C2484L06715N1468
$$ y = [71289, -123415, 80272, -78540, -2077, 47284, 95882, -181582, 152193, -63828, -287999, 48763, -129391, -197721, -260682, -2954, -134207, 45476, 145599, -101938, -234744, 275047, -6719, 80357, 125938, -5851, -43737, -113296, -150907, -96247, -81483, 97491, -87193, 127134, -382906, -227344, 168587, 273311, 342770, -191700, 82049, 111655, -130034, -27303, -239770, -245403, -261160, -165595, -28535, -87154, 177316, -206959, 48651, 2707, -140183, 80529, 178913, -235237, -129466, -226493, 6721, -3017, -113934, 90752, 179822, -17126, 119283, -123778, -96160, -71534, -295461, -240085, 238487, -116195, 53845, -48947, -155181, -397563, 5861, -107554, -84044, -291663, 244363, 36253, 256220, -103007, 177334, -457626, 32484, 339199, 390667]
11788C90667F3672b50489g283A19718c03114F9098a00882G0839N8525h6329c1739
11776E5276c84401A60782p5717Q1892j2857b07253D7318a77345n20f3155j57142
11765b20297M7844A48066J01989h143m04392c9805F0370O6752F3488K14452A24917
11753b69956C8578b52148C07791A51468L7187d1494H3856a54377A4986M8972D621
11741a6077A06810i8526k79878a53112B19123b09394A72504F1311p711J07912
11731A61512a12867A05585b27922A48210a03781B19522M1699h9552A14797A1083
11720G567b1132k19546h511A01056B6829L7488a66698A1295a53049D55802p7764
11709C78038A69273l0893a0928C542K53963c4510B20143d428A65897K1565a57493
$$ y = [390667, 63672, -250489, -7283, 119718, -303114, 69098, -100882, 70839, 129364, -86329, -31739, 55276, -384401, 160782, 85065, 166957, 154100, -207253, 47318, -177345, -177865, -63155, -220297, -172453, 148066, 250055, -8143, -412535, -39805, 60370, 127122, 63488, 277940, 124917, -269956, 38578, -252148, 307791, 151468, 188655, -41494, 83856, -154377, 14986, 63958, 4621, -16077, 106810, -98526, -378404, -153112, 219123, -209394, 172504, 61311, 53600, 161512, -112867, 105585, -227922, 148210, -103781, 219522, 261221, -89552, 114797, 11083, 7567, -21132, -240678, -8511, 101056, 26829, 64317, -166698, 11295, -153049, 455802, 378038, 169273, 138380, -10928, 3542, 257505, -34510, 220143, -4428, 165897, 187462, -157493]
11697A42432c09372b0319C21853B6666e5082a9655k2977A25380h9159A83073E416
11685F1646g4409C00386c48343H874L648g450j97189q764A5070L46278j10786
11674B50562j04047B8937K32380O8704A32476G759L3984J55753c36763A69651
11663H4404Q7176K01031r4060f8069F3234j0595J48990E7026J78731e6141k929
11652e9070A5924c6405k32808h1478E5251J30180e5180E6727G385J94736J12061
11641C14182F2386j4223R6939b8314A24004b77241B13368C0625J74731M4722a08660
11629B71190b41404d3083B27162q6559F7566c47824J60994k6546B08853m2916
11619A65937F0567M877j4690J16755A0903J58791a68191A33626D7343b46796J00495
$$ y = [142432, -309372, -20319, 321853, 26666, -55082, -19655, -42632, 125380, -89159, 183073, 5416, 61646, -74409, 300386, -348343, 8874, 12522, -7450, -204639, -213403, 15070, 361348, 250562, 146515, 28937, 261317, 330021, 132476, 7759, 41743, 197496, -336763, 169651, 84404, 171580, 372611, 278551, -68069, 63234, 52639, 201629, 57026, 235757, -56141, -59070, 15924, -36405, -269213, -81478, 55251, 185431, -55180, 56727, 7385, 202121, 314182, 62386, 48163, 145102, -28314, 124004, -277241, 213368, 30625, 205356, 250078, -108660, 271190, -241404, -43083, 227162, 140603, 67566, -347824, -186830, -213376, 208853, 165937, 60567, 65444, 50754, 167509, 10903, 169694, -168191, 133626, 47343, -246796, -146301]
11608a46301A16531J16842a62503H7448J59793c16751J35506g8412h43A38330
11597a01394i773A33936a34397A66448a57658D9640A7751a9338m2061A183i4660
11585B71551j17310J34947b2477l79505I0226f0705A5791a7399j82406A78260
11574b18843A21039N5757J55228d33613g392A23112J95398e8559A40364h7233
11563g0939A04723A9589J47410a17423E512c4005k02643B46705i5045n5108D05941
11551A52731h4676l4094B33614a29015C8490f8641F7618c51498B200c8973r3600
11540a32573C78943A00144k8056R5587p5350a24499C1245j3114J34048J62935
11530C15114A1452K72503E7724h3648A12685C4430K28751o5046b8442D8339R1550
$$ y = [-146301, 116531, 233373, -162503, 87448, 247241, -316751, -181245, -78412, -843, 138330, -101394, -9773, 133936, -134397, 166448, -157658, 49640, 17751, -19338, -61399, 1183, -94660, 271551, 154241, 289188, -22477, -401982, 90226, -60705, 15791, -17399, -199805, 178260, -218843, 121039, 176796, 332024, -433613, -7392, 123112, 318510, -58559, 140364, -87233, -70939, 104723, 19589, 166999, -117423, 5512, -34005, -236648, 246705, -95045, -150153, 405941, 152731, -84676, -118770, 233614, -129015, 38490, -68641, 67618, -351498, 2200, -38973, -132573, 378943, 100144, 72088, 167675, 92325, -124499, 31245, 18131, 152179, 315114, 11452, 283955, 57724, -83648, 112685, 34430, 263181, 198135, -28442, 48339, 139889]
11519A39889c12896B05000J1654m1025a01958j39866B54736a61256A3481K01600
11509B15081K52809A50364C5538N4116K7861c5831A64496p2366j4939n949J03122
11498A74364b4828A77263A2756L33360d3076A05071R840a39152H0187M6360Q8398
11487B14945g3528F28353G449P5447d1444j0710D8104K75170B9647L63095A75159
11475B05910H5171a48076L7896B34674p4241O1697c6378B20143o8466K5856J14891
11464B92424a00608k5283C72773j28916P190F6205f495B55498F9326f4899D99007
11452G8787b38897P305j03902d2831n3289Q734B86961K3673A04347K3629J91537
11441C19513A45342C470J12087c59G0622J11601p5811k7452N4942E0218b5534
$$ y = [139889, -312896, 205000, 216654, 175629, -101958, -241824, 254736, -161256, 13481, 215081, 467890, 150364, 35538, 89654, 117515, -35831, 164496, 92130, 77191, 71242, 174364, -24828, 177263, 12756, 346116, -43076, 105071, 114911, -139152, 80187, 126547, 214945, -73528, 628353, 7449, 82896, -41444, -52154, 48104, 323274, 29647, 392742, 175159, 205910, 85171, -148076, -110180, 234674, 160433, 222130, -36378, 220143, 151677, 177533, 292424, -100608, -125891, 372773, 243857, 251047, 66205, -6495, 255498, 69326, -64899, 499007, 78787, -238897, -231592, -335494, -42831, -96120, -87386, 286961, 310634, 104347, 127976, 319513, 145342, 3470, 115557, -359, 70622, 182223, 106412, 78960, 133902, 50218, -25534]
11429A16514J12999A6953g943j85003B03420I9843k4700a26876O2051A8018J0828
11418B8846q751a1785B58647i385p980j8943B62606l8855a48899j54562e5801
11406e5635A41204c3069H6067a42838o7661Q7434q2044d8984B30032d7720n4375
11395a02095b3881j14481G5354g0147C25843g7362A03549c02997B78183i552D7701
11383c4806A68051a91072L267b6373k7154j7475I6796g2104E2459K743J93684
11372B48886a39479K9840H6897J05926h4814B02663a53505C22679m823a64990
11361c37567I8130h4048k73408A4239a75963o2886F6239O3069a00446E637N527
11350A1164Q1341c33092I6781j5018f2062j44090b358j9675A74516B173a48349
$$ y = [116514, 229513, 16953, -7943, -192946, 203420, 99843, 75143, -126876, -64825, 18018, 28846, 20095, -11785, 258647, -9385, -17365, -36308, 262606, 223751, -148899, -303461, -55801, -55635, 141204, -33069, 86067, -142838, -210499, -123065, -205109, -48984, 230032, -47720, -102095, -23881, -138362, 75354, -70147, 325843, -77362, 103549, -302997, 278183, -9552, 47701, -34806, 168051, -191072, -187805, -26373, -53527, -71002, 96796, -72104, 52459, 55202, 248886, -139479, -109639, 86897, 192823, -84814, 202663, -153505, 322679, 317856, -164990, -337567, 98130, -84048, -357456, 14239, -175963, -238849, 66239, 129308, -100446, 5637, 11164, 92505, -333092, 96781, 81763, -62062, -206152, -2358, -22033, 174516, 2173, -148349]
11338a45674n6167M1983k69196H975b56882h0548b6973n7370B21329g4877E1621
11326A26725J1020R3321c791k45987A18380h3614j6289B49127d6828K2958A24493
11314i9727n3179A30355M2893a26692K3867r4398D0917a57220A66730A3505J26181
11303A39686n5523a62923O8658j45001g1672A13075e6483j78248J04860N3398
11293g6473k226K6880p2286B08443D669b25405b3321A20057B6832c8271j64754
11282b03025H8646a7385M902j00770m2744A1511b65176A87878a96590k35090a12160
11270a97360g6312A8990a04109j94917B6504L41845c3043l0624H36a40755p9869
11259b20624P0763j45950Q0440J06511M6811A64302b69853J13268H3988k6428
$$ y = [-145674, -201841, -159858, -429054, 8975, -256882, -80548, -26973, -84343, 221329, -74877, 51621, 126725, 137745, 231066, -3791, -249778, 118380, -83614, -99903, 249127, -46828, -23870, 124493, -99727, -152906, 130355, 173248, -126692, -102825, -197223, 40917, -157220, 166730, 13505, 139686, 84163, -162923, -94265, -239266, -71672, 113075, -56483, -234731, -129871, -76473, -78699, -51819, -124105, 208443, 4669, -225405, -23321, 120057, 26832, -38271, -203025, 88646, -17385, -12483, -113253, -155997, 11511, -265176, 187878, -196590, -431680, -112160, -197360, -76312, 18990, -104109, -299026, 26504, 368349, -33043, -63667, 836, -140755, -220624, -149861, -295811, -215371, -108860, -62049, 164302, -269853, -156585, 83988, 57560]
11249E7560e4323A09033h9367L7357C81574A10968N4620b17783a2781H7791a78800
11237c67148F9340M3497C5768J9797b24737B74705d6989A4728P8169q796f1416
11225b8661n9781l7977N8868E0182b4358A60991J78693D9267j770j7075k528K25112
11213B53006b03855o5126h9354E005a33536j7018p1171r8278C62952A0788a80702
11201C4373f3970l7478C66646a05918k65945a25518k4764K5389B79321j02513
11191A76808J08949A38768b97713E2277f0731A5816a15068k06622I7177c42175
11180a17001H445L5671L8229O3267l1767J43596C7709e1515H3972a66439G2737
11168G7817c89106h6352m50788B1268b58167A63223p6322c6456k2346J5143C5001
$$ y = [57560, -54323, 109033, -89367, -52010, 381574, 110968, 165588, -217783, -12781, 87791, -178800, -367148, 69340, 112837, 35768, 55565, -224737, 274705, -46989, 14728, 92897, 84101, -61416, -28661, -88442, -126419, -67551, 50182, -24358, 160991, 339684, 49267, 47497, 30422, 27894, 253006, -203855, -268981, -89354, 5005, -133536, -150554, -221725, -320003, 362952, 10788, -180702, 34373, -63970, -101448, 366646, -105918, -371863, -125518, -150282, -124893, 279321, 176808, 285757, 138768, -297713, 52277, -60731, 15816, -115068, -321690, 97177, -342175, -117001, 8445, 44116, 82345, 145612, 113845, 257441, 37709, -51515, 83972, -166439, 72737, 77817, -389106, -86352, -537140, 21268, -258167, 163223, 86901, -36456, -58802, -43659, 35001]
11156e9477F7457P9571a37230B03488B0390f6122A57111b87140i3965C22646R7484
11145D20130b66854f5126k96363E1556b21757h9186j27350k93554D0245b46655
11134a87620A85730G192b64998k88705a30013j0789r8510j08907A48459K3437
11124A71896m2499a1231k35270g6771A5311a29552b6313A89301l1729M1656D7256
11112B21251I976L58767A69918a37381C48866b2889A50310J8247o2607g806j13403
11101a21209A24288m4769D286L95734a879D6745K36458O1439B5980K97773P41
11090C24494l9345e2812I4169J45823c23862K5796C11477M1273A41180e7881B69781
11078b4052C02332A04192M411R5527a16157A15219K4357n4311K7882J14792N4460
$$ y = [-59477, 67457, 147028, -137230, 203488, 20390, -66122, 157111, -287140, -93965, 322646, 420130, -266854, -65126, -361489, 51556, -221757, -89186, -216536, -510090, 40245, -246655, -187620, 185730, 7192, -264998, -553703, -130013, -140802, -239312, -348219, 148459, 171896, 129397, -11231, -246501, -76771, 15311, -129552, -26313, 189301, 157572, 199228, 47256, 221251, 9976, 368743, 169918, -137381, 348866, -22889, 150310, 168557, 105950, -7806, -121209, 124288, 79519, 4286, 400020, -1879, 46745, 283203, 344642, 25980, 323753, 324494, 285149, -52812, 94169, 239992, -323862, -298066, 311477, 352750, 141180, -57881, 269781, -24052, 302332, 104192, 108603, 204130, -116157, 115219, 139576, 85265, 113147, 227939, 282399]
11067B82399c2642B79847J52043B1478L24524j02241r592K07420b4848C03423
11056A51558m778Q7246K16235j6885j0293k1089A97870N88198B57232N2264K23299
11045E32795j14109J86960B51608J61363m112K01131C01780K55119j35773o7536
11035C53590M64640j41761K72666k39863M00192n37160m0640M96588D52318J07213
11025E59531O5810j44575K71638p5791R3612M6544j97671J71595C59484L88829
11015G48313Q206j38353J76704j98413K020m750J38989J45729D15536K76901R301
11004G01738I5515L58847o0389A63026O10478k19512q1650J99154j73854J96564
10994F94206k06911j17029K06150n2792m7576Q8016j94600J43097J12984r1026
$$ y = [282399, -32642, 279847, 431890, 21478, 346002, 243761, 234169, 441589, -24848, 303423, 151558, 146780, 234026, 450261, 433376, 423083, 401994, 197870, 786068, 257232, 309496, 532795, 418686, 605646, 251608, 412971, 408859, 609990, 301780, 556899, 421126, 353590, 818230, 676469, 949135, 709272, 1109464, 572304, 531664, 1028252, 452318, 559531, 625341, 480766, 752404, 676613, 770225, 816769, 619098, 790693, 359484, 748313, 756519, 618166, 794870, 596457, 598477, 593727, 732716, 878445, 415536, 692437, 701738, 95515, 454362, 393973, 163026, 773504, 553992, 472342, 671496, 497642, 694206, 487295, 370266, 576416, 523624, 476048, 564064, 369464, 512561, 625545, 534519]
10984E34519L52552k02822J41941C82738J31004O9742J26469J00031N6034o0865
10974H05153N2346j3985J0320o7259O9102R0903J36852N3275L12028l0389j42993
10963A275353J25398j16659O03508K5879K02521O8022L48801j73776l55790M43981
10953B447238k37837j35805l85313J79567l43779k28334K97606k23527J64058
10944A533874r3941r0560M1220n7049M43942o65179k67219J80187k8010k37357
10934G59908N772j54526j66442p6741K9275E0290K83088j29259H9667m614i006
10922i5992B19841o4934A9333K07617a65423A61174g7218A29363a47394e7868
10911A9144b46315A57500F7461P1984I14a35877k4426f3267j20774P9621m7935
$$ y = [534519, 887071, 684249, 826190, 382738, 513742, 583484, 709953, 809984, 866018, 805153, 857499, 843514, 853834, 786575, 855677, 946580, 1083432, 1136707, 1448735, 1418346, 1275353, 1400751, 1284092, 1887600, 1913479, 2116000, 2184022, 2532823, 2359047, 2003257, 2447238, 2209401, 2073596, 1688283, 1867850, 1524071, 1295737, 1593343, 1369816, 1533874, 1439933, 1349373, 1390593, 1333544, 1777486, 1112307, 845088, 1025275, 997265, 759908, 765680, 611154, 444712, 367971, 397246, 50290, 333378, 204119, 89667, 85053, -9006, -95992, 219841, 154907, 19333, 226950, -165423, 161174, -77218, 129363, -147394, -57868, 19144, -246315, 157500, 67461, 139445, 914, -135877, -160303, -63267, -184041, -104420, -152355]
10900a52355A4196c20579e6706A90692C6220K1568K02130D5298i4826H225b20821
10888a62353j44821A24a57089B52935o7930n9134F2190q184J54047a21569H8000
10876a71735g36I3103c67802b4215k52455M5736B26504D1630a98163M7125F6205
10864a85455M9236e7595m8320K8730l08709f7869o7951f0385A45421a665j33677
10853a35342G3828j9900h2109C5200J39231a36347b4024H4481a2948l62697C20986
10841a02524b3176B69647h3253I9875a45275A45079c53573B04650c40708R7671
10831b43037B8396i7309B28445p6674C7831a71916A65701n2639c60093j1980e7419
10819c55346A22879d2026l28770e8513C11831a78269C9805N240j3997l716a82504
$$ y = [-152355, 14196, -320579, -56706, 190692, 36220, 57788, 259918, 45298, -94826, 8225, -220821, -162353, -307174, 124, -157089, 252935, 185005, 125871, 62190, 54006, 208053, -121569, 88000, -171735, -736, 93103, -367802, -24215, -276670, -230934, 226504, 41630, -198163, -151038, 66205, -185455, -136219, -57595, -105915, -77185, -385894, -67869, -135820, -60385, 145421, -1665, -135342, 73828, 53928, -82109, 35200, 174431, -136347, -24024, 84481, -12948, -375645, 320986, -102524, -23176, 269647, -83253, 99875, -145275, 145079, -353573, 204650, -340708, -243037, 28396, -97309, 228445, 151771, 37831, -171916, 165701, 113062, -360093, -372073, -57419, -355346, 122879, -42026, -370796, -58513, 311831, -178269, 39805, 45045, 31048, 27332, -182504]
10807a56978I3406g8953A13666a0567l71703b2602p2078k53161E5210d0043l06298
10796c46341A71171a2600A8928g3636J6095k23444O9427L52j77406A96960d7898
10784a47425G0294R066O3382k9712D3799N1637c2435j44670B07351A6715R8814
10773A15529i6588K3137r3209a8213j63584C32466F6804J24585b04760i853H1982
10761a52563a738m4859g843B8224a43240C3638c3898G5917d6412A78152C2889
10749D5898R1115B1092a84806J8089A22852L6441f9588l52752A7066J3714c58996
10737b13535c8881A39694F3803R3134p0364i8918m6141C57507g2645j15282L7869
10726a50058c7953k16245e27q2689D9518b65207C6157J41015E8716c34008i5267
$$ y = [-156978, 93406, -78953, 113666, -10567, -382270, -22602, -94680, -347841, 55210, -40043, -346341, 171171, -12600, 18928, -73636, -57541, -280985, -211558, -211206, -388612, 196960, -47898, -147425, 70294, 79360, 142742, 113030, 43799, 95436, -32435, -177105, 207351, 16715, 115529, -96588, -73451, -166660, -18213, -181797, 332466, 66804, 191389, -204760, -9853, 81982, -152563, -1738, -46597, -7843, 28224, -143240, 33638, -33898, 75917, -46412, 178152, 32889, 45898, 137013, 21092, -184806, -166717, 122852, 159293, -69588, -422340, 17066, 30780, -358996, -213535, -38881, 139694, 63803, 156937, 86573, -98918, -145059, 357507, -72645, -187927, -150058, -37953, -254198, -527, -83216, 49518, -265207, 36157, 177172, 58716, -334008, -95267]
10714B24951c3573A58411b36333a2044r4253B49848F7891b06376B7410b23860
10703H8605K04234A18653j2918g9767B40456D646a02753I8275l8888R469a24431
10691A6780a02045i405C47351H1927a1787C68044g5621f646m51005A30995c10077
10679B70729c2962j78553D0467O0130K3269A1137O077f6253K4413P677b137o7565
10667f9702D50729I5637a46781e7726l0084l19184a51262A5670f4680C9628J12694
10656A52322a35271f2134j30164O9291A12384h3756L2899A92924I5053Q7988a65792
10644a79579j8020m2814a07343k49660L4350C6787c00896l2783Q3091H7953I674
10632d5583m1906A56664b3051l9943l75605J67752N9334H9916h3821o0165I0223
$$ y = [224951, -33573, 158411, -236333, -12044, -106297, 249848, 67891, -206376, 27410, -223860, 88605, 292839, 118653, 105735, -79767, 240456, 4646, -102753, 98275, 59387, 68856, -124431, 16780, -102045, -9405, 347351, 81927, -11787, 368044, -75621, -6646, -457651, 130995, -310077, 270729, -32962, -211515, 40467, 100597, 123866, 11137, 17214, -66253, -41840, -34163, -2137, -69702, 450729, 95637, -146781, -57726, -87810, -406994, -151262, 15670, -64680, 39628, 152322, -135271, -62134, -192298, -123007, 112384, -83756, -50857, 192924, 95053, 183041, -165792, -179579, -197599, -240413, -107343, -357003, -322653, 36787, -300896, -333679, -250588, 87953, 9674, -45583, -87489, 156664, -23051, -62994, -438599, -270847, -211513, 89916, -83821, -143986, 90223]
10620e8378r4457d2775D5950b7850l47768a41510c5713k57998g3283B6238i1821
10608f6519L1192r9008K4963L5456J7446q997B95567b32069A5896L4713e6812
10596b9207j37914c4128e307m40213B0828b2631G158b36117A90215c87249h8612
10584e3675q8500C2610O474h7968G7549A2377c55057f1808A60342D359b29954
10572a5356d222m2255B6709J01615n3083c9989n4435A49358b72228K3349R0220
10561a58659I7967m990a2479F541f4552B47244j02384i0395k22834d4254A37311
10549b75799A39452m2409L9827a64055c0644n2989e793j20791j47123i4779D763
10537B71147j10683M1694a93081j54154K3383D9463c26888J62580b0005m5400
$$ y = [-58378, -152835, -42775, 45950, -27850, -375618, -141510, -35713, -293711, -73283, 26238, -91821, -66519, -35327, -134335, -109372, -73916, -56470, -65467, 295567, -232069, 15896, 50609, -56812, -29207, -167121, -34128, -5307, -445520, 20828, -22631, 7158, -236117, 190215, -387249, -88612, -53675, -142175, 32610, 39084, -87968, 77549, 12377, -355057, -61808, 160342, 4359, -229954, -15356, -4222, -46477, 26709, 128324, 75241, -39989, -94424, 149358, -272228, -248879, -158659, 97967, 92977, -12479, 6541, -64552, 247244, 144860, -90395, -313229, -44254, 137311, -275799, 139452, 97043, 136870, -164055, -30644, -83633, -5793, -126584, -273707, -94779, 4763, 271147, 160464, 202158, -193081, -347235, -323852, 49463, -326888, -164308, -20005, -65405]
10527f5405j17208B8823d8630k24187d2910l34287M9601B23875A09195c5533l3215
10516f8748B48383i3826A09958a72588G6871a40983m06419A32560L7831P6428
10506B46819d3381k73128J9287a21316K848N0098m1741B38449r840G273J29302
10495A36575a56277m6666i3799j5143m80960B4014I923g6212r1799C3078b41466
10483A02264a25028j40056L3395B0040J38317J16232E1970c21599C8803o894R9637
10472A31546e7591r9263a0276E0283N14101q3564P8575k55576B4581K90579d5089
10460A13936m7890J79239G4768b30454M0795A54119K06148j58336a31541d2926
10449e9929o9035q8580B46172a28222b2661j55193G5288J64206k9332c75782a66555
$$ y = [-65405, -182613, 28823, -48630, -272817, -42910, -377197, -327596, 223875, 109195, -35533, -68748, 248383, -93826, 109958, -172588, 76871, -140983, -547402, 132560, 170391, 246819, -43381, -316509, -297222, -121316, -118468, -68370, -110111, 238449, 228609, 7273, 136575, -156277, -202943, -93799, -108942, -589902, 24014, 9923, -76212, -168011, 33078, -241466, 102264, -125028, -265084, -231689, 20040, 158357, 274589, 51970, -321599, 38803, 31909, 131546, -57591, -156854, -10276, 50283, 564384, 480820, 559395, 303819, 24581, 315160, -45089, 113936, 66046, 245285, 74768, -230454, -189659, 154119, 360267, 201931, -131541, -42926, -59929, -128964, -217544, 246172, -128222, -22661, -177854, 75288, 239494, 210162, -375782, -166555]
10437c62l2211A72509b24377g3217A46436c07022B08315r5630c5457A36339a42240
10425b51580c0788j09773d3969j69106A05361K62233B8391K4812L2150C0869O6286
10414I7155a83554k0920M322b7446k84986I5514h4206q4685b2355A02823c2746
10402b13888A78354a72687B8071O0893a82405B10881F8925a16460A45100b07023
10391a75420D09669A42215F1516J81789j07382c58144F63J03385i1864m885A80479
10379a10346j46630A09942i3537D29844d7576O440A11070P1286L13438a10793
10368a23617J2088D54086k08127a42090B52331P5951n4390I4603J69771g1890
10357B97128n5315l8384o1144J53304K55444k25150m000r3963d0323B55805d9438
$$ y = [-362, -32573, 172509, -224377, -73217, 146436, -307022, 208315, 112685, -35457, 136339, -142240, -251580, -30788, -140561, -43969, -213075, 105361, 367594, 28391, 53203, 85353, 30869, 97155, -183554, -204474, -200152, -27446, -312432, 95514, -84206, -168891, -22355, 102823, -32746, -213888, 178354, -172687, 28071, 88964, -182405, 210881, 68925, -116460, 145100, -207023, -175420, 409669, 142215, 61516, 243305, 135923, -358144, 663, 104048, -91864, -96749, 180479, -110346, -256976, 109942, -93537, 429844, -47576, -41136, 111070, 182356, 495794, -110793, -123617, -111529, 454086, 245959, -142090, 252331, 328282, 273892, 94603, 264374, -71890, 297128, 241813, 203429, 142285, 295589, 551033, 325883, 321883, 227920, -40323, 255805, -49438]
10345B90988F0468A4527a18271B87439m3453b72E74574k18759m5794P7037j08517
10334B78541A12743Q5145K04728n0834k3014a2668E67765A7499J90579b32192
10323B97049K25174f4272A67495J70011M9279A75989K34317A12414M0709a33938
10312a88307A30387O0067e61372A0867n3J7648J06016m2781K13054F5210f1004
10300C38336j51517M7541q7939o4737e7504n9884d1330j86878F9526j5991J20561
10289A74096N8570d57013G4396a15087K4476A965P9458P7958l5469B9669k026
10278B7643b15639J9230E4038L4681k5755b30499B36154A02733a19583d4454j05439
10267a49893K962p82p8710E1960b77900F9940B7338B263c26693E5029O798k9809
$$ y = [290988, 60468, 14527, -118271, 287439, 243986, -272, 574574, 355815, 310021, 387058, 278541, 112743, 197888, 402616, 351782, 328768, -12668, 567765, 17499, 208078, -232192, 297049, 522223, -64272, 167495, 337506, 386785, 175989, 410306, 112414, 153123, -133938, -188307, 130387, 190454, -561372, 10867, 10814, 28462, 134478, 91697, 304751, 65210, -61004, 338336, 186819, 234360, 146421, 81684, -57504, -117388, -41330, -228208, 69526, 53535, 174096, 232666, -457013, 74396, -115087, -90611, 1965, 81423, 159381, 123912, 29669, 27643, -215639, -196409, 54038, 88719, 62964, -230499, 236154, 102733, -119583, -44454, -149893, -146931, -147713, -226423, 51960, -277900, 69940, 27338, 2263, -326693, 55029, 61827, 32018]
10255C2018b19628R9453A84492G6956J20391F6620a22502G9731K04149A31442
10244G33534l56037A34503d0155D33665F1444i6908B71429h7041K6596K5361D6355
10232h2156j69101G6054Q1898C9183L8777d55001A92230a81362c5152k48334A17272
10220f0812B88174B3104b56885A5522h5200I4838J0660f8958M842k3999m4398
10209a32513j49913A40234F5009a64270A42056D0169h8601D9846b53495c4968
10198c8299j44500F1230k9193b97043J17120Q1134k6714e8810j24408L2611d4380
10186a57472j19305k0472I556a54179c3010j95707F8572a28379A06227m4993a08445
10174C8053J0615A0005a3202q7360I3762K06283H5217i0045L4762r2236A07569
$$ y = [32018, -219628, -120175, 184492, 76956, 197347, 66620, -122502, 79731, 283880, 131442, 733534, 377497, 134503, -40155, 433665, 61444, -96908, 271429, -87041, -60445, -35084, 46355, -82156, -251257, 76054, 157952, 39183, 77960, -455001, 192230, -181362, -35152, -283486, 117272, -60812, 288174, 23104, -256885, 15522, -85200, 94838, 105498, -68958, -64116, -88115, -132513, -282426, 140234, 65009, -164270, 142056, 40169, -88601, 49846, -253495, -34968, -38299, -182799, 61230, 32037, -297043, -179923, -98789, -125503, -58810, -183218, -150607, -44380, -157472, -276777, -297249, 9556, -154179, -33010, -228717, 68572, -128379, 106227, 61234, -108445, 38053, 48668, 10005, -13202, -100562, 93762, 300045, 85217, -90045, -55283, -147519, 107569]
10162d4267A01564L5921g8216K0380B30663a27993e5055B2570J64911J559L8955
10151B27995c71236a34121B18839f1675j52454j08666a03896a2933k43907r1366
10141c48206A2743a59139O4602q1350G856b10225c6190B27355c90610g6667k75796
10130c52463G454a09890B35211d1898j47206i764j76617D41384A66682A6600R6025
10119A12625C6436a403l96868a51880O9045C70518d6805A07898c21706B36459
10108a03867j5700m4122A47122d10324D4999b02376J9973C7741b18890A48298
10097e8322A5206c31815a0615j6937k36803A41822a74619d2588E6680a26876A44842
10085C9920L0586h5049B04223a33475A71318o26a13422k73051a17672l8570A14806
$$ y = [-44267, 101564, 137485, -78216, -57836, 230663, -127993, -55055, 22570, 187481, 189040, 227995, -371236, -134121, 218839, -61675, -214129, -322795, -103896, -12933, -256840, -348206, 12743, -159139, -94537, -175887, 7856, -210225, -36190, 227355, -390610, -76667, -352463, 7454, -109890, 235211, -41898, -189104, -9764, -186381, 441384, 166682, 16600, 112625, 36436, -1403, -398271, -151880, -82835, 370518, -46805, 107898, -321706, 236459, -103867, -119567, -163689, 147122, -410324, 44999, -202376, -182403, 37741, -218890, 148298, -58322, 15206, -331815, -10615, -27552, -264355, 141822, -174619, -42588, 56680, -126876, 144842, 39920, 70506, -85049, 204223, -133475, 171318, 170692, -113422, -386473, -117672, -156242, 114806]
10073c33548d7192A76709b19799e9502A73368d6423k77426J15806k19141J3430
10063d13754a84377B0887a65786q9685J25153N2582p3485o0135L0921M7942K0414
10052a12079b0429o1302j22629a7093j91451i1375A14581f6320j37569j8771J6133
10041b06527J5155E7626b13886n9055P7497o9935i8061D1271a64079A67662a84214
10029C84796j77328F1382i8595k56714a30291A70289b07323R4799p2615n0201
10019b35340R0880B58073b58214b3548B0921c68505C8301f5057m87825f4384A55925
10007a65242o466f1712A32621a11089b6733j24362d9794i240H8609a54535e003
9995E8450g0729D86002j14431A18926b61257E6819e3109p9450C726a8149j93722
$$ y = [-333548, -47192, 176709, -219799, -59502, 173368, -46423, -323849, -208043, -427184, -413754, -184377, 20887, -165786, -255471, -130318, -77736, -151221, -211356, -180435, -132493, -112079, -20429, -81731, -204360, -17093, -208544, -91375, 114581, -66320, -203889, -222660, -206527, -191372, 57626, -213886, -272941, -195444, -265379, -98061, 41271, -164079, 167662, -184214, 384796, 207468, 61382, -98595, -355309, -130291, 170289, -207323, -112524, -185139, -235340, -144460, 258073, -258214, -23548, 20921, -368505, 38301, -65057, -552882, -64384, 155925, -165242, -171708, -61712, 132621, -111089, -26733, -151095, -49794, -9240, 88609, -154535, -5003, 58450, -70729, 486002, 371571, 118926, -261257, 56819, -53109, -132559, 3726, -18149, -211871]
9984b11871k804c5713l14367F618c7287m1994K6983A70051l5062a72548L5166
9973a37382B8836a12614c4376m4523k0527k52206J45912j32120D7880b11384C8836
9961B1210a64034B1965a18131A36185f8273A77579c3140n4958C3117a36938B33799
9949a76655g6221j03989q0460p8233i2047I599e03448K25016d2510B18087b02939
9937d28339a41189d4007j70204I8597J49909a743k48488f038o803j40492A39872
9925h3488B13102a00670j9113C2104K27815q9495C6302F078K24821F3220A5590
9913c4575l05785a56567r553b1177b293m3195d739j59091B9483J01148m6635b45138
9900g5973A10082c68904c6292A11357R742b93397K0237J35658I7951b26384g6766
$$ y = [-211871, -214675, -35713, -350080, 6618, -37287, -79281, -52298, 170051, 134989, -172548, -137382, 28836, -112614, -34376, -78899, -99426, -351632, -205720, -337840, 47880, -211384, 38836, 21210, -164034, 21965, -118131, 136185, -68273, 177579, -33140, -88098, 33117, -136938, 233799, -176655, -76221, -180210, -260670, -338903, -92047, 9599, -503448, -278432, -42510, 218087, -202939, -428339, -141189, -44007, -214211, 98597, 248506, -1743, -250231, -6038, -12841, -153333, 139872, -83488, 213102, -100670, -119783, 32104, 259919, 170424, 36302, 6078, 230899, 63220, 15590, -34575, -340360, -156567, -166120, -21177, -2293, -45488, -4739, -163830, 29483, 130631, 83996, -245138, -75973, 110082, -368904, -36292, 111357, 121099, -293397, -273160, -137502, 97951, -226384, -76766]
9888a59459B35393i0944A85280h8957A15889C5025R664c85656N1269B9612a85559
9876F2615a28717K0929L1938j7236C6631l543M0925P595Q1245l3850J23794b61100
9863A97648a52983A82489N1719a32838A789K01976c00902A51035j3488J85748
9853C23295A16835a68264Q976d5455n606A17013a36822k05215G39J128J71966
9842A73833K3465F198b9269j45053K0707j02155B0929a03816d6559p9733l5695
9831a61987G2701e21261b00416q253B15790b72456A12756d26433I418g6949B01289
9819B27066D4731g5268G392J4329c0030k90595A32301L485E3058d11519A13196
9807A08866a1990j81485F7145b47274R3741j47154h0660a5812j2266A51837b1953
$$ y = [-159459, 235393, -90944, 185280, -88957, 115889, 35025, 44689, -385656, -334387, 29612, -185559, 62615, -128717, -107788, -75850, -93086, 36631, 33088, 74013, 81608, 162853, 129003, 252797, -261100, 197648, -152983, 182489, 234208, -132838, 1789, 203765, -300902, 151035, 137547, 323295, 116835, -168264, -159288, -45455, -51061, 117013, -136822, -342037, 739, 1867, 173833, 197298, 6198, -29269, -174322, -153615, -255770, 20929, -103816, -46559, -126292, -161987, 72701, -521261, -200416, -208669, 215790, -272456, 112756, -426433, 9418, -76949, 201289, 227066, 44731, -75268, 7392, 21721, -30030, -320625, 132301, 135786, 53058, -411519, 113196, 108866, -11990, -193475, 67145, -247274, -153533, -300687, -80660, -15812, -28078, 151837, -21953]
9795b97280I8494a46158I8325F833L9952i7470j37001e806C3270a11069B9840
9783A38116b79251Q0013B1599b2179k45821K8786P6787A65751b21839P6435a4408
9771a2880B4349N5546c26464H9089a11379q4417N3344A33489o6678h435F3353
9759B50648A01907i8364j78R269I1185a8482k15300H4813l4847b85936j52526
9748d38462b07067e4058q1559j74989R3927k6686q5927B55493B7756e8022l69445
9737d27467G4310b27464C8295b37394H2079a08363B70847C1686q47c18157J45616
9726a72541r6065e3789L956j8339j06658e0826j32798f462A30059b2139A45125
9714i1242R286C9787b18631j67521D0965c8646C6395a6583k09102d5973I800b18546
$$ y = [-297280, 98494, -146158, 98325, 6833, 46785, -97470, -234471, -5806, 33270, -111069, 29840, 138116, -279251, -199238, 21599, -22179, -268000, -239214, -162427, 165751, -221839, -145404, -14408, -12880, 24349, 79895, -326464, 89089, -111379, -195796, -142452, 133489, 66811, -8435, 63353, 250648, 101907, -98364, -98542, -89273, 91185, -18482, -233782, 84813, 49966, -285936, -438462, -207067, -54058, -135617, -310606, -216679, -243365, -329292, 255493, 27756, -58022, -427467, 74310, -227464, 38295, -237394, 82079, -108363, 270847, 31686, 30839, -318157, -172541, -268606, -53789, -49833, -68172, -174830, -50826, -183624, -6462, 130059, -22139, 145125, -91242, -81956, 39787, -218631, -386152, 40965, -38646, 36395, -16583, -225685, -45973, 9800, -218546]
9701h9213B31471d15794B24455A08564l7112O564B423c32511A36135c11405E532
9689c5287a7372C8211Q4140b32647F8287A876L73812a71960k02077a5421F2561
9677e1373p2049C4000b17062J8280Q8984B2289R6264b58750l5282h8740C6291
9665B037c2833k03363L8609f3546j74321B45168G0039b05341N813A73304b62459
9653a84463Q1394j34903O7180h0814B57292a18698K7852j60653G6408Q1976l1809
9642A26575E9123a7099B27563a68054h1795G0965c39950A09513c26535m946Q9986
9631b41495K2479A48675o8671b07478O2341A9818a54366e2955j06723l5540Q0099
9620a15119M7238o5042l14398a69492A05229D4585M4293e5925p965p5708K4723
$$ y = [-89213, 231471, -415794, 224455, 108564, 71452, 78016, 2423, -332511, 136135, -311405, 5532, -35287, -17372, 38211, 122351, -232647, 68287, 1876, 375688, -171960, -374037, -15421, 62561, -51373, -123422, 34000, -217062, -198782, -109798, 22289, 118553, -258750, -294032, -88740, 36291, 2037, -32833, -236196, -197587, -63546, -237867, 245168, 70039, -205341, -199528, 173304, -262459, -184463, -103069, -237972, -170792, -80814, 257292, -118698, -90846, -251499, 76408, 158384, 126575, 59123, -17099, 227563, -168054, -81795, 70965, -339950, 109513, -326535, -331481, -241495, -219016, 148675, 80004, -207478, -145137, 19818, -154366, -52955, -159678, -195218, -115119, -67881, -132923, -447321, -169492, 105229, 44585, 88878, -55925, -63890, -139598, -114875]
9609a14875j5771K6364I796J81417l8048i6468L9259r3333e5706l3437K8091n4386
9597a15438j8404L2172j10710h1898A00376b11245b124p4420C8672a46140H026
9585a56386m5119D591K1431a54169B95673a44451j40379K6621L6197E2276a33414
9573c53672g0826A61704i7839j53451f8976A58958B7610a10869M5013o2341L7794
9562i0403h207r7443j13287L0473I110L71583d11860E6456B3050a329j09099j76309
9550b86737H5360a38848j47837g1807k57994M4867D05406h2366q796H1390e6124
9538C2082j4699J22720a12688q0631k89844J39071a47821G4194g5266Q278b420
9526c761E7134a90103A4278K02744H5028g2809o2052H9243b24857Q1806a4436
$$ y = [-114875, -130646, -104282, 9796, 191213, 153165, -96468, -57209, -150542, -55706, -89143, -61052, -115438, -133842, -101670, -212380, -81898, 100376, -211245, -2124, -76544, 38672, -146140, 8026, -156386, -201505, 4591, 26022, -154169, 295673, -144451, -284830, -258209, -222012, 52276, -133414, -353672, -70826, 161704, -97839, -251290, -68976, 158958, 27610, -110869, -65856, -128197, -90403, -8207, -105650, -218937, -188464, 9110, 380693, -411860, 56456, 23050, -1329, -110428, -286737, 85360, -138848, -286685, -71807, -329801, -284934, 405406, -82366, -91162, 81390, -56124, 32082, 17383, 140103, -112688, -193319, -483163, -344092, -147821, 74194, -75266, -66988, -2420, -3761, 57134, -190103, 14278, 217022, 85028, -72809, -134861, 89243, -224857, -143051, -14436]
9514H3606a76424b9863j2351A15685K8470a12159A65504B5157R7306D379P6585
9503H0964M0038e1455F3634J87949b48603A65690h3713H9094a9137A78372b00515
9491b24378L1146p18k24067D1180a05271j24801c1408j79309B63454B3842c51348
9479h9807J7887P697j9633j31067D6350g2573k20002N3140a12048h03E7599Q7193
9467A44792N233c4311k4875a5326j39074E1438a51424k55021a97073d7426A98035
9455a60367P796j82888i9983A59399a08895j65015J24800c754l99792i4664E0352
9443a13747B68473c9814G370b08278H5570b19296a5263A80662b87869E6414a9899
9431b02462A15184b35641h7109j30571Q4057B35956b46319a12872J8730C15581
$$ y = [83606, -176424, -29863, -42214, 115685, 144155, -112159, 165504, 25157, 122463, 4379, 80964, 121002, -51455, 63634, 251583, -248603, 165690, -83713, 89094, -19137, 178372, -200515, -224378, -193232, -193950, -418017, 41180, -105271, -230072, -31408, -210717, 263454, 23842, -351348, -89807, -71920, -64223, -83856, -214923, 46350, -72573, -292575, -239435, -112048, -803, 57599, 144792, 150025, -34311, -59186, -15326, -154400, 51438, -151424, -406445, -197073, -47426, 198035, -160367, -152571, -335459, -99983, 159399, -108895, -273910, -149110, -3754, -403546, -94664, 50352, -113747, 268473, -39814, 7370, -208278, 85570, -219296, -15263, 180662, -287869, 56414, -19899, -202462, 115184, -235641, -87109, -217680, -133623, 235956, -246319, -112872, -94142, 315581]
9420c974I690a50362n1336d8904k76290A11982C4347h9175f831B4120b12193A17897
9407a5632A7508b28517H8911b92351C56994A36834K00989A38667a2531j44782
9397a57313q7890l6928j02062i8591A3160J89240b53276G2736j2586J66168b15812
9385F8348a52325C0146b25762n8745A43538a28352A11901B4614Q7280a45809C9161
9373g8069E0314b60580D268K12973h2172m3126q2196h0868a4015j32600q3506
9362b30121Q9197A91932d0833j45762J5679k07985i514G420b31711h0090C3983
9350h6890B640c0007k56675h5939m8441N9932A44326K9609l4296a38096B1960
9338B00288a47309b2392B02878i7348G9154a58250k0440M0626A54623h2866A56841
$$ y = [-3974, 9690, -150362, -201698, -48904, -325194, 111982, 34347, -89175, -6831, 24120, -212193, 117897, -15632, 17508, -228517, 88911, -292351, 356994, 136834, 337823, 138667, -12531, -157313, -245203, -282131, -384193, -98591, 13160, 202400, -253276, 72736, 60150, 226318, -215812, 68348, -152325, 30146, -225762, -284507, 143538, -128352, 111901, 24614, 111894, -145809, 39161, -78069, 50314, -260580, 4268, 217241, -82172, -125298, -207494, -80868, -14015, -146615, -230121, -140924, 191932, -40833, -186595, -170916, -378901, -9514, 7420, -231711, -80090, 33983, -86890, 2640, -30007, -286682, -85939, -134380, -74448, 144326, 173935, 139639, -138096, 21960, 200288, -147309, -22392, 202878, -97348, 79154, -158250, -178690, -138064, 154623, -82866, 156841]
9326g4661C6079j5661b78132e9985K7883k02936B04155c9480o4467M1796A86374
9314C04855b56884A72391J41420h9763A57965g7635c6132o7166q5765k89628g6582
9302a16285a3417j35654A9501J60644b58491d4376l07779B8000b2441j01137e3459
9290b44810B29252K1693c0184m7247r4701F3556M27699f33A28968b94913J09652
9279a85261J8038q081k0620c4338m00794e411E5392a69439E7340a34638a1992
9267F5216b27246i9448j40901g8199A17822l2050b4697j20613N6560l1890j01564
9256b22204B29297d143p8661r1051L4769n9437H2584q507d03852J98748j55267
9245c60371N9363a40323a2921j83132q565a4775m1908l5559b5783k6142F0018
$$ y = [-74661, 36079, 20418, -278132, -59985, -32102, -235038, 204155, -39480, -103947, -62151, 186374, 304855, -256884, 172391, 313811, -89763, 157965, -77635, -36132, -103298, -189063, -478691, -76582, -116285, -13417, -149071, 19501, 180145, -258491, -44376, -352155, 28000, -22441, -123578, -53459, -244810, 229252, 250945, -30184, -77431, -172132, 63556, 491255, -633, 128968, -294913, -185261, -167223, -175304, -195924, -34338, -435132, -5411, 55392, -169439, 57340, -134638, -11992, 65216, -227246, -99448, -240349, -78199, 117822, 85772, -24697, -145310, -88750, -120640, -222204, 229297, -4143, -82804, -173855, -139086, -198523, 82584, 74077, -403852, -205104, -360371, -301008, -140323, -12921, -196053, -204618, -14775, -56683, -92242, -25783, -51925, 60018]
9233C3557D949f6696l3759a218j29779j1710A02062K3191J83195A32411H955g1473
9220A04544b15895f2038q2230L462G274h0926I894N5759B1500b46267B10637g1105
9207b63267J5898A38568K25287a72258h896k94733b4347G0518a18990D6851f4380
9195b11046A99881f0646j23990M3866f6495K984A15519a26930A67146d8516B6867
9183a98364A9145a47125A70077a6917B4052b98804I2696f4767j8027l39044A18451
9171b1379A86394e1792j10753O4271D70226d43410a28594a9198k74318D8811c5234
9159a02572l2864p2832k4878j04061i9602m8122m3197I5096b909m1874k92637
9148c37420J03361A7414a16426K6033K9156G7024d8263B693d3204j7678m8832
$$ y = [33557, 4949, -66696, -100455, -1218, -130997, -142707, 102062, 125253, 308448, 132411, 8955, -71473, 104544, -215895, -62038, -144268, -140806, 7274, -80926, 9894, 65653, 21500, -246267, 210637, -71105, -263267, -247369, 138568, 363855, -172258, -8896, -303629, -24347, 70518, -118990, 46851, -64380, -211046, 199881, -60646, -184636, -140770, -66495, -63511, 115519, -126930, 167146, -48516, 26867, -198364, 19145, -147125, 170077, -16917, 24052, -298804, 92696, -64767, -82794, -421838, 118451, -21379, 186394, -51792, -162545, -98274, 470226, -443410, -128594, -19198, -293516, 48811, -35234, -102572, -135436, -208268, -233146, -337207, -99602, -147724, -190921, 95096, -2909, -44783, -337420, -234059, 17414, -116426, -90393, -61237, 77024, -48263, 2693, -43204, -60882, -109714]
9137a09714E0438i9091A00816C0703J69470a5043G081c52214D1967e625k50645
9126b56270D5278a15551A03839a78101J0338K3538C98860a59509c3978H2164O7043
9115A49207b1404A88532c54905A71638m4274b41003D3173L5830a40430I0902J23636
9104B14538l563o5185b25928H6055a84695d3919m2009a8725j67915c7983o3718
9093a01701L7689k39294f9133k49286d6012m03447D8968j4578a4500j58592R805
9082a63287q3179A34397c5603A66926h582r8302J296d4983B68666D0131c63735
9070i2430B0143d9994r1172I4011i8351m24126h740n3841O33C6088O2774N5872
9058A54734d25874g4895r1378N5465E1132b52728I5166g5344B07480c2777A54493
$$ y = [-109714, 50438, -99091, 100816, 30703, 200173, -15043, 7081, -352214, 41967, -5625, -256270, 45278, -115551, 103839, -178101, -167763, -144225, 398860, -159509, -33978, 82164, 149207, -21404, 188532, -354905, 171638, 127364, -241003, 43173, 79003, -140430, 90902, 214538, 210975, 145790, -225928, 86055, -184695, -43919, -85928, -18725, -186640, -37983, -101701, -64012, -303306, -69133, -318419, -46012, -449459, 48968, 34390, -14500, -173092, -163287, -246466, 134397, -35603, 166926, -8582, -106884, -105588, -44983, 268666, 40131, -363735, -92430, 20143, -49994, -141166, 94011, -98351, -522477, -8740, -62581, -61948, 36088, 98862, 154734, -425874, -74895, -166273, -110808, 51132, -252728, 95166, -75344, 207480, -32777, 154493]
9046B8249K11378i4944A22154a3579B02861E0069k3642a42288B69774a53194F6615
9034a69060d3653B05365C893g3595H9321b43421A44327b10898H2477a64445f9140
9022a76041M0908C9101a92728R60f1445b4606j42620o2263a7897l09700M3456
9011b84141R6502j45719B79294b52692H8008d20421Q1017J15052H5383K7923a56711
8999A02994l5597b77210A31328m356F2782a09655G2533a14154B37073a31956H8097
8987C1902b95564o8971a27946N1820m480a4427q8515E1389a38794O2978B46981
8975b71887q1663J27550C6493J7757A0475K9043A6175J9016J26977K6116c27628
8963a27413C5176a68915f4895J4646F486J59362h2944C0618c84401B6718a60322
$$ y = [28249, 239627, -94944, 122154, -13579, 202861, 50069, 26427, -142288, 269774, -153194, 66615, -169060, -43653, 205365, 3893, -73595, 89321, -243421, 144327, -210898, 82477, -164445, -69140, -176041, -135133, 39101, -192728, -191768, -61445, -24606, -167226, -229489, -17897, -327597, -284141, -187639, -333358, 279294, -252692, 88008, -420421, -339404, -224352, 85383, 113306, -156711, 102994, 67397, -277210, 131328, 126972, 62782, -109655, 72533, -114154, 237073, -131956, 88097, 31902, -295564, -364535, -127946, -76126, -80606, -14427, -102942, 51389, -138794, -75816, 246981, -271887, -353550, -226000, 36493, 54250, 10475, 39518, 16175, 35191, 162168, 188284, -327628, -127413, 35176, -168915, -64895, -50249, 6486, 165848, -82944, 30618, -384401, 26718, -160322]
8951a88543A6634B466b02792F489K04354a11597d6530C2957a63964B2803c26967
8939a63551K6382A6561R4027B3723b37231B2408i5881F1395R3052b31250C37439
8927B1871K0349P7484c45050f1319A944J30277J97194j04324M3976N9137j16631
8916B11573k4715D9526a06049D05758p2727O83883M97076M91055J419311J983328
8906E407684N516943l721986C459876j423771p53380o36887j48591E0013c4197
8896C68541J0070H4944C6848O8337K73567o9639j6790L0818j38574m9754O2487
8885A97300C5671a20236K24I470M9022K2974b06813R5598q8873m47A40811a65950
8872b02336M6710D8097b51713F5295b28917I1861B7904b46328J11272j95878k109
$$ y = [-188543, 16634, 2466, -202792, 6489, 210843, -111597, -46530, 32957, -163964, 22803, -326967, -163551, -137169, 16561, 110588, 23723, -237231, 22408, -95881, 61395, 154447, -231250, 337439, 21871, 42220, 119704, -345050, -61319, 1944, 132221, 329415, 225091, 269067, 328204, 211573, 186858, 49526, -106049, 405758, 333031, 1016914, 1513990, 2005045, 3424356, 5407684, 10924627, 7202641, 3459876, 2036105, 1282725, 645838, 497247, 50013, -34197, 368541, 378611, 84944, 36848, 105185, 378752, 309113, 292323, 323141, 184567, 134813, 197300, 35671, -120236, -120012, 9470, 58492, 81466, -206813, -111215, -200088, -200535, 140811, -165950, -202336, -155626, 48097, -251713, 65295, -228917, 91861, 27904, -246328, -135056, -330934, -333043]
8861c33043D77516b22139l0657N5238B5012b65466B44225d07848e0741A54990
8850f0601p8911B98531i6674p07k7727C7868d6119I5869b95455a34455B63298
8838b39886I1708g4352C0231a43454C6948b76710j21942b0586c148B5170d7346
$$ y = [-333043, 477516, -222139, -252796, -197558, 25012, -265466, 244225, -407848, -50741, 154990, -60601, -139512, 298531, -96674, -97381, -125108, 37868, -46119, 95869, -295455, -134455, 263298, -239886, 91708, -74352, 30231, -143454, 36948, -276710, -398652, -20586, -3148, 25170, -47346]
$$ [...]
##END NTUPLES=NMR SPECTRUM
##END=
