
##TITLE=AC1222_Punto_6074794_1Xs9jaGfa0
##JCAMPDX= 6.0         $$ Bruker NMR JCAMP-DX V2.0
##DATA TYPE= NMR SPECTRUM
##DATA CLASS= NTUPLES
##ORIGIN= BRUKER
##OWNER= Administrator
$$ 1.72 TOPSPIN		Version 2.1
$$ 2012-05-08 20:07:41.218 -0500  Administrator@TOPSPIN
$$ Compression mode = diff/dup
##.OBSERVE FREQUENCY= 400.13188235
##.OBSERVE NUCLEUS= ^1H
##.ACQUISITION MODE= SIMULTANEOUS (DQD)
##.ACQUISITION SCHEME= undefined
##.AVERAGES= 64
##.DIGITISER RES= 22
##SPECTROMETER/DATA SYSTEM= spect
##.PULSE SEQUENCE= noesygpps1d.comp
##.SOLVENT NAME= COFFEE_meoh
##.SHIFT REFERENCE= INTERNAL, COFFEE_meoh, 1, 14.96665
##AUDIT TRAIL= $$ (NUMBER, WHEN, WHO, WHERE, PROCESS, VERSION, WHAT)
$$ ##TITLE= Audit trail, TOPSPIN		Version 2.1
$$ ##JCAMPDX= 5.01
$$ ##ORIGIN= Bruker BioSpin GmbH
$$ ##OWNER= Administrator
$$ $$ C:\Bruker\TOPSPIN/data/COFFEE/nmr/AC1222_Punto_6074794_1Xs9jaGfa0/42/pdata/1/auditp.txt
$$ ##AUDIT TRAIL=  $$ (NUMBER, WHEN, WHO, WHERE, PROCESS, VERSION, WHAT)
(   1,<2012-05-08 20:07:35.843 -0500>,<Administrator>,<TOPSPIN>,<go>,<TOPSPIN 2.1>,
      <created by zg
	started at 2012-05-08 19:56:05.609 -0500,
	POWCHK enabled, PULCHK disabled,
       configuration hash MD5:
       AF F2 23 6B 01 CD 40 DD E5 A1 38 A0 06 EA F7 77
       data hash MD5: 64K
       4A A7 40 2B 55 A6 FE 6A 17 14 68 3B A3 FC 98 37>)
(   2,<2012-05-08 20:07:38.781 -0500>,<Administrator>,<TOPSPIN>,<proc1d>,<TOPSPIN 2.1>,
      <Start of raw data processing
       efp LB = 0.3 FT_mod = 6 PKNL = 1 PHC0 = 0 PHC1 = 0 SI = 128K 
       data hash MD5: 128K
       65 05 80 1D 16 B2 CB CB 6E 9F 36 90 FB 38 0B 21>)
(   3,<2012-05-08 20:07:40.078 -0500>,<Administrator>,<TOPSPIN>,<proc1d>,<TOPSPIN 2.1>,
      <pk PHC0 = 32.29431 PHC1 = 0 
       data hash MD5: 128K
       4F B0 DA FF B9 82 28 56 D3 E2 DD C5 C9 21 60 86>)
(   4,<2012-05-08 20:07:40.609 -0500>,<Administrator>,<TOPSPIN>,<proc1d>,<TOPSPIN 2.1>,
      <abs ABSG = 1 
       data hash MD5: 128K
       98 B8 BC 35 6B F2 1C CF 1A 3C 02 96 23 4B 40 61>)
(   5,<2012-05-08 20:07:40.671 -0500>,<Administrator>,<TOPSPIN>,<proc1d>,<TOPSPIN 2.1>,
      <abs ABSG = 2 
       data hash MD5: 128K
       56 96 0F 84 7C F2 2F 24 9C EA 74 E9 F6 DE E8 CF>)
(   6,<2012-05-08 20:07:40.734 -0500>,<Administrator>,<TOPSPIN>,<proc1d>,<TOPSPIN 2.1>,
      <abs ABSG = 3 
       data hash MD5: 128K
       C3 56 96 E1 D2 58 FB 96 B6 F4 F5 0B DA EF 73 08>)
(   7,<2012-05-08 20:07:41.078 -0500>,<Administrator>,<TOPSPIN>,<proc1d>,<TOPSPIN 2.1>,
      <abs ABSG = 4 
       data hash MD5: 128K
       26 7A EC A9 ED D5 E1 11 56 F2 C3 CC C0 A7 A4 A6>)
(   8,<2012-05-08 20:07:41.140 -0500>,<Administrator>,<TOPSPIN>,<proc1d>,<TOPSPIN 2.1>,
      <abs ABSG = 5 
       data hash MD5: 128K
       90 5F 31 E7 AF 0D 4C BB 90 DA AC 10 D5 C2 00 73>)
$$ ##END=
$$ 
$$ $$ hash MD5
$$ $$ 5F 01 54 A6 F6 4F 67 C3 6F EA 50 70 17 4B A4 00
##$RELAX= 
##$RELAX= 
##$RELAX= 
##$RELAX= 
##$RELAX= 
##$RELAX= 
##$RELAX= 
##$RELAX= 
$$ Bruker specific parameters
$$ [...]
##$TP07= 0
##$TPNAME0= <>
##$TPNAME1= <>
##$TPNAME2= <>
##$TPNAME3= <>
##$TPNAME4= <>
##$TPNAME5= <>
##$TPNAME6= <>
##$TPNAME7= <>
##$TPOAL= (0..7)
0.5 0.5 0.5 0.5 0.5 0.5 0.5 0.5
##$TPOFFS= (0..7)
0 0 0 0 0 0 0 0
##$TUNHIN= 0
##$TUNHOUT= 0
##$TUNXOUT= 0
##$USERA1= <user>
##$USERA2= <user>
##$USERA3= <user>
##$USERA4= <user>
##$USERA5= <user>
##$V9= 5
##$VALIST= <valist>
##$VCLIST= <CCCCCCCCCCCCCCC>
##$VD= 0
##$VDLIST= <DDDDDDDDDDDDDDD>
##$VPLIST= <PPPPPPPPPPPPPPP>
##$VTLIST= <TTTTTTTTTTTTTTT>
##$WBST= 1024
##$WBSW= 4
##$XGAIN= (0..3)
0 0 0 0
##$XL= 0
##$YL= 0
##$YMAX_a= 11132056
##$YMIN_a= -6119868
##$ZGOPTNS= <>
##$ZL1= 120
##$ZL2= 120
##$ZL3= 120
##$ZL4= 120
##$ABSF1= 14.96665
##$ABSF2= -5.58588
##$ABSG= 5
##$ABSL= 3
##$ALPHA= 0
##$AQORDER= 0
##$ASSFAC= 0
##$ASSFACI= 0
##$ASSFACX= 0
##$ASSWID= 0
##$AUNMP= <proc_prof1d_extract.lims>
##$AXLEFT= 0
##$AXNAME= <>
##$AXNUC= <1H>
##$AXRIGHT= 0
##$AXTYPE= 0
##$AXUNIT= <>
##$AZFE= 0.1
##$AZFW= 0.1
##$BCFW= 0
##$BC_mod= 0
##$BYTORDP= 0
##$COROFFS= 0
##$CY= 15
##$DATMOD= 1
##$DC= 0
##$DFILT= <>
##$DTYPP= 0
##$F1P= 0
##$F2P= 0
##$FCOR= 0.5
##$FTSIZE= 131072
##$FT_mod= 6
##$GAMMA= 0
##$GB= 0
##$INTBC= 1
##$INTSCL= 1
##$ISEN= 128
##$LB= 0.3
##$LEV0= 0
##$LPBIN= 0
##$MAXI= 10000
##$MC2= 0
##$MEAN= 0
##$ME_mod= 0
##$MI= 0
##$NCOEF= 0
##$NC_proc= -3
##$NLEV= 6
##$NOISF1= 0
##$NOISF2= 0
##$NSP= 0
##$NTH_PI= 0
##$NZP= 0
##$OFFSET= 14.96665
##$PC= 1
##$PHC0= 32.29431
##$PHC1= 0
##$PH_mod= 1
##$PKNL= yes
##$PPARMOD= 0
##$PPDIAG= 0
##$PPIPTYP= 0
##$PPMPNUM= 2147483647
##$PPRESOL= 1
##$PSCAL= 4
##$PSIGN= 0
##$PYNMP= <proc.py>
##$REVERSE= no
##$SF= 400.130005588056
##$SI= 131072
##$SIGF1= 0
##$SIGF2= 0
##$SINO= 400
##$SIOLD= 131072
##$SPECTYP= <>
##$SREGLST= <1H.CDCl3>
##$SSB= 0
##$STSI= 131072
##$STSR= 0
##$SW_p= 8223.68421052632
##$SYMM= 0
##$S_DEV= 0
##$TDeff= 65536
##$TDoff= 0
##$TI= <>
##$TILT= no
##$TM1= 0
##$TM2= 0
##$TOPLEV= 0
##$USERP1= <user>
##$USERP2= <user>
##$USERP3= <user>
##$USERP4= <user>
##$USERP5= <user>
##$WDW= 1
##$XDIM= 131072
##$YMAX_p= 427517123
##$YMIN_p= -2064964
##$CURPLOT= <Network HP LaserJet P1505>
##$CURPRIN= <$Network HP LaserJet P1505>
##$DFORMAT= <normdp>
##$LAYOUT= <+/1D_H.xwp>
##$LFORMAT= <normlp>
##$PFORMAT= <normpl>
##$SURQMSG= 1
$$ End of Bruker specific parameters
$$ ---------------------------------
##NTUPLES= NMR SPECTRUM
##VAR_NAME=  FREQUENCY,     SPECTRUM/REAL,   SPECTRUM/IMAG
##SYMBOL=    X,             R,               I
##VAR_TYPE=  INDEPENDENT,   DEPENDENT,       DEPENDENT
##VAR_FORM=  AFFN,          ASDF,            ASDF
##VAR_DIM=   131072,        131072,          131072
##UNITS=     HZ,            ARBITRARY UNITS, ARBITRARY UNITS
##FACTOR=    0.0627417313425165, 1,          1
##FIRST=     8223.62146879498, -10946,       -112689
##LAST=      0,             -5927,           -116711
##MIN=       0,             -2064964,        0
##MAX=       8223.62146879498, 427517123,    0
$$ Real data points
##PAGE= N=1
##DATA TABLE= (X++(R..R)), XYDATA
$$ [...]
63706C56948L580L119J985J048R90J247Q16k5j1J034J620Q10j99Q7J034R51K7
$$ 356948 360528 363647 365632 366680 367670 368917 369733 369708 369697 370731 372351 373161 372962 373049 374083 375034 375061
63689C75061K09J943L126K221O32M48J198Q77m82n42J808M632N568M753L936L729
$$ 375061 375270 377213 380339 382560 383192 383640 384838 385715 385233 384691 386499 391131 396699 401452 405388 409117
63673D09117L309K480K298L292M331M148L275L346M685N764N355M283M182N153
$$ 409117 412426 414906 417204 420496 424827 428975 432250 435596 440281 446045 451400 455683 459865 465018
63659D65018N658M690K958J662R85M39q3l43n30j083j844k174k016k184l236m483
$$ 465018 470676 475366 478324 479986 480971 481410 481327 480984 480454 479371 477527 475353 473337 471153 467917 463434
63643D63434m547k838k67J566J817J136Q77J612K621K899K370J757J638K187L527
$$ 463434 458887 456049 455782 457348 459165 460301 461178 462790 465411 468310 470680 472437 474075 476262 479789
63628D79789N582P477P891O543M714L851M002M167L737K862J711L01q38q13L78
$$ 479789 485371 492848 500739 507282 511996 515847 519849 524016 527753 530615 532326 532627 531789 530976 531354
63613E31354J459J377O64M97Q78P13m13j577j954j905k043j984r56O41J224k41
$$ 531354 532813 534190 534854 535351 536229 536942 536529 534952 532998 531093 529050 527066 526110 526751 527975 527734
63597E27734l038n413o247n859n306n090m732l713k485j871j620n13J680L517
$$ 527734 524696 519283 513036 507177 501871 496781 492049 488336 485851 483980 482360 481847 483527 487044
63583D87044L869L747M810O724P506O423N127N501P522R720J0956J1265J1551
$$ 487044 490913 494660 499470 506194 513700 520123 525250 530751 538273 547993 558949 570214 581765
63570E81765J2671J4328J4978J3705J1963J2244J4927J7856J9287J9806K0673
$$ 581765 594436 608764 623742 637447 649410 661654 676581 694437 713724 733530 754203
63559G54203K2014K3638K6156K9803L3278L5201L6003L6955L8147L8920L9654
$$ 754203 776217 799855 826011 855814 889092 924293 960296 997251 1035398 1074318 1113972
63548A113972M1372M3756M5066M4054M0864L6249L1008K5817K0415J3435M565
$$ 1113972 1155344 1199100 1244166 1288220 1329084 1365333 1396341 1422158 1442573 1456008 1460573
63537A460573l702q331r568j0520j2854j5148j5979j6416j8264k1601k5348k8918
$$ 1460573 1456871 1448540 1438972 1428452 1415598 1400450 1384471 1368055 1349791 1328190 1302842 1273924
63525A273924l1958l3668l3754l3151l2634l1531k8997k5716k3019k0940j8414
$$ 1273924 1241966 1208298 1174544 1141393 1108759 1077228 1048231 1022515 999496 978556 960142
63514I60142j5019j1452q504o416m897l078K9M303Q329J1046J2784J4117J4879
$$ 960142 945123 933671 925167 918751 913854 910776 910805 915108 923437 934483 947267 961384 976263
63501I76263J5296J6744J9835K2998K4712K6037K8754L2051L3678L3978L5726
$$ 976263 991559 1008303 1028138 1051136 1075848 1101885 1130639 1162690 1196368 1230346 1266072
63490A266072L9760M3795M6328M8816N2489N5536N5342N1530M4911L5274K2615
$$ 1266072 1305832 1349627 1395955 1444771 1497260 1552796 1608138 1659668 1704579 1739853 1762468
63479A762468R343j330q654j4043j8089j9976j9727j8946j9025k0099k1938k4598
$$ 1762468 1771811 1770481 1761827 1747784 1729695 1709719 1689992 1671046 1652021 1631922 1609984 1585386
63467A585386k8049l2196l7175m2575m6831m8721m9115m9613m9912m8425m5343
$$ 1585386 1557337 1525141 1487966 1445391 1398560 1349839 1300724 1251111 1201199 1152774 1107431
63456A107431m2761m1400l9503l5761l1281k7647k4863k2330k0157j8268j5932
$$ 1107431 1064670 1023270 983767 948006 916725 889078 864215 841885 821728 803460 787528
63445G87528j3495j2787j4154j4887j2590q705o432o356o545o057n549m965l419
$$ 787528 774033 761246 747092 732205 719615 710910 704478 698122 691577 685520 679971 675006 671587
63432F71587j475q34j428j267L37J790K158K571L723M308L480K731L563M947N033
$$ 671587 670112 669278 667850 666583 666920 668710 670868 673439 677162 681470 684950 687681 691244 696191 701224
63417G01224M022L388L273K601J182j41j029j888k785l477m090m628m341k901
$$ 701224 705246 708634 711907 714508 715690 715549 714520 712632 709847 706370 702280 697652 693311 690410
63403F90410j653k211m174n688n879n231l840j237K007M250M879N052N870P088
$$ 690410 688757 686546 682372 676684 670805 665574 661734 660497 662504 666754 671633 676685 682555 689643
63389F89643Q186R539J1716J4413J6734J8132J8794J9495K0983K2963K4098K3986
$$ 689643 697829 707368 719084 733497 750231 768363 787157 806652 827635 850598 874696 898682
63377H98682K4580K8204L4397M0247M3861M5554M5532M2737L7061L0735K6000
$$ 898682 923262 951466 985863 1026110 1069971 1115525 1161057 1203794 1240855 1271590 1297590
63366A297590K2830K0359J9168K0375K3513K7146L0903L5246L9645M2795M4536
$$ 1297590 1320420 1340779 1359947 1380322 1403835 1430981 1461884 1497130 1536775 1579570 1624106
63355A624106M5875M6949M6371M2884L6650K8651J9879J1283L606l082r110j4391
$$ 1624106 1669981 1716930 1763301 1806185 1842835 1871486 1891365 1902648 1906254 1903172 1894062 1879671
63343A879671j8447k1144k2817k3854k4913k7165l1294l6398m0916m4448m7556
$$ 1879671 1861224 1840080 1817263 1793409 1768496 1741331 1710037 1673639 1632723 1588275 1540719
63332A540719n0025n0759m9497m7151m4094l9789l4745l1163l0294l0319k8279
$$ 1540719 1490694 1439935 1390438 1343287 1299193 1259404 1224659 1193496 1163202 1132883 1104604
63321A104604k3443j7492j2041p400l502n27J712L952O635R538J2422J5482J8803
$$ 1104604 1081161 1063669 1051628 1044228 1040726 1040199 1041911 1045863 1052498 1062036 1074458 1089940 1108743
63308A108743K1901K4180K5725K7431L0287L4384L8687M2052M4495M6972M9814
$$ 1108743 1130644 1154824 1180549 1207980 1238267 1272651 1311338 1353390 1397885 1444857 1494671
63297A494671N2104N3038N3033N2739N1591M8395M3014L6358K8967K0682J1755
$$ 1494671 1546775 1599813 1652846 1705585 1757176 1805571 1848585 1884943 1913910 1934592 1946347
63286A946347L058m913j2304j8767k3171k4911k4859k4647k5650k8733l3814l9229
$$ 1946347 1949405 1944492 1932188 1913421 1890250 1865339 1840480 1815833 1790183 1761450 1727636 1688407
63274A688407m2754m4094m5318m7922n0491n0471m7500m3488l9988l7041l4348
$$ 1688407 1645653 1601559 1556241 1508319 1457828 1407357 1359857 1316369 1276381 1239340 1204992
63263A204992l1770k8463k3241j6579j1052q993j0459j4012j8448k2920k6332
$$ 1204992 1173222 1144759 1121518 1104939 1093887 1084894 1074435 1060423 1041975 1019055 992723
63252I92723k7801k7574k6610k5429k3924k2020j9829j7371j4707j2318j0775
$$ 992723 964922 937348 910738 885309 861385 839365 819536 802165 787458 775140 764365
63241G64365j0186j0197j0317r874q175n456l279l085m313m840l543j676j300
$$ 764365 754179 743982 733665 723791 715616 710160 706881 703796 699483 694643 691100 689424 688124
63228F88124k854m817n507m691l451k826k941l379l997m882n683n661m628l291
$$ 688124 685270 680453 674946 670255 666804 663978 661037 657658 653661 648779 643096 637435 632807 629516
63214F29516k238j159L37J700K028J372N75L7l96m39N40K256L411L444L278L799
$$ 629516 627278 626119 626456 628156 630184 631556 632131 632168 631772 631333 631873 634129 637540 640984 644262 648061
63198F48061M489M528M498N697Q080J0123J0830J0944J1743J3354J4843J5567
$$ 648061 652550 657078 661576 667273 675353 685476 696306 707250 718993 732347 747190 762757
63186G62757J5930J6797J8463K0374K1868K3067K4738K7155K9509L0763L0974
$$ 762757 778687 795484 813947 834321 856189 879256 903994 931149 960658 991421 1022395
63175A022395L1273L2566L4546L6011L5877L4048L1634L0213L0347L0893L0356
$$ 1022395 1053668 1086234 1120780 1156791 1192668 1226716 1258350 1288563 1318910 1349803 1380159
63164A380159K8940K8391K9518L0750L0015K7429K4972K3629K2114J8787J3722
$$ 1380159 1409099 1437490 1467008 1497758 1527773 1555202 1580174 1603803 1625917 1644704 1658426
63153A658426Q068K167m532j1914j8648k3578k6943k9729l2295l4121l4747l4453
$$ 1658426 1666494 1668661 1664129 1652215 1633567 1609989 1583046 1553317 1521022 1486901 1452154 1417701
63141A417701l3763l2524k9830k5256k0029j6285j4660j3215r562l865J426M700
$$ 1417701 1383938 1351414 1321584 1296328 1276299 1260014 1245354 1232139 1222577 1218712 1220138 1224838
63129A224838O830R232J1700J3188J3737J4333J5326J6342J7428J9007K0674K1314
$$ 1224838 1231668 1240900 1252600 1265788 1279525 1293858 1309184 1325526 1342954 1361961 1382635 1403949
63117A403949K0630J9450J8360J7097J5555J4152J2735J0283O389J915k538p624
$$ 1403949 1424579 1444029 1462389 1479486 1495041 1509193 1521928 1532211 1538600 1540515 1537977 1530353
63105A530353j3603j8886k1904k3808k7381l3214l8643m1010m0540l9313l8523
$$ 1530353 1516750 1497864 1475960 1452152 1424771 1391557 1352914 1311904 1271364 1232051 1193528
63094A193528l7848l6713l5045l2929l0497k8121k6098k4077k1390j8130j5236
$$ 1193528 1155680 1118967 1083922 1050993 1020496 992375 966277 942200 920810 902680 887444
63083H87444j3352j2012j0429q734p813p917q065p226n608m246l515k794j692
$$ 887444 874092 862080 851651 842917 835104 827187 819122 811896 806288 802042 798527 795733 794041
63070G94041p71m44Q4J883M479O061N737M739M846O174P296P241O590O477P096
$$ 794041 793270 792826 792910 794793 799272 805333 811070 815809 820655 826829 834125 841366 847956 854433 861529
63055H61529P563P062N847N026N331O142N996M261K066J185K111L639M345M002
$$ 861529 869092 876154 882001 887027 892358 898500 904496 908757 910823 912008 914119 917758 922103 926105
63041I26105L375L160L449L863L901L345K676K783L900N086N226M400L701L836
$$ 926105 929480 932640 936089 939952 943853 947198 949874 952657 956557 961643 966869 971269 974970 978806
63027I78806M447M906N170N656O642P989R182R638R408R609J1536J5041J8227
$$ 978806 983253 988159 993329 998985 1005627 1013616 1022798 1032436 1041844 1051453 1062989 1078030 1096257
63014A096257J9271J8283J7127J7602K0041K3460K6728K9555L2443L5740L9008
$$ 1096257 1115528 1133811 1150938 1168540 1188581 1212041 1238769 1268324 1300767 1336507 1375515
63003A375515M1663M3901M6335M8998N1493N4137N7871O2795O7811P2076P5781
$$ 1375515 1417178 1461079 1507414 1556412 1607905 1662042 1719913 1782708 1850519 1922595 1998376
62992A998376P8974Q0887Q1182Q0838Q0793Q0761Q0382Q0410Q1342Q1850Q0392
$$ 1998376 2077350 2158237 2239419 2320257 2401050 2481811 2562193 2642603 2723945 2805795 2886187
62981B886187P7771P6166P5883P4922P1819O7153O1986N6402M9943M2082L1926
$$ 2886187 2963958 3040124 3116007 3190929 3262748 3329901 3391887 3448289 3498232 3540314 3572240
62970C572240J8952M293j0072k3577l6935m9693n9951o7302p3862q1098q7373
$$ 3572240 3591192 3595485 3585413 3561836 3524901 3475208 3415257 3347955 3274093 3192995 3105622
62959C105622r0048q8669q4647p9078p2520o5846n9474n2288m2944l1970k1432
$$ 3105622 3015574 2926905 2842258 2763180 2690660 2624814 2565340 2513052 2470108 2438138 2416706
62948B416706j2805o104n59M852J0850J6965K1849K5231K8439L1941L3971L3239
$$ 2416706 2403901 2397797 2397238 2402090 2412940 2429905 2451754 2476985 2505424 2537365 2571336 2604575
62936B604575L1631L1879L3428L3161K9867K5480K1852J8727J5316J1441O391
$$ 2604575 2636206 2668085 2701513 2734674 2764541 2790021 2811873 2830600 2845916 2857357 2863748
62925B863748j141j0878k0567k8854l6915m6030n5117o2267o7521p2409p7382
$$ 2863748 2862607 2851729 2831162 2802308 2765393 2719363 2664246 2601979 2534458 2462049 2384667
62914B384667q1208q2703q1833p9231p5558p1399o7214o3371o0271n7903n5161
$$ 2384667 2303459 2220756 2138923 2059692 1984134 1912735 1845521 1782150 1721879 1663976 1608815
62903A608815n0584m4337l8516l4710l2125k9273k6662k6240k8293l0381k9950
$$ 1608815 1558231 1513894 1475378 1440668 1408543 1379270 1352608 1326368 1298075 1267694 1237744
62892A237744k7052k3920k2453k2653k3192k2940k1839k0658k0067j9987j9767
$$ 1237744 1210692 1186772 1164319 1141666 1118474 1095534 1073695 1053037 1032970 1012983 993216
62881I93216j8815j7109j5238j3963j3558j3502j2956j1551r574p461n493l891
$$ 993216 974401 957292 942054 928091 914533 901031 888075 876524 866950 859489 853996 850105
62869H50105k918k703l163m094n059n327m429k913k024k344l082l012j914q42
$$ 850105 847187 844484 841321 837227 832168 826841 822412 819499 817475 815131 812049 809037 807123 806281
62855H06281r47k209l526m115m544n924q075r324q387n832l200j491j110k337
$$ 806281 805334 803125 799599 795484 790940 785016 776941 767617 759230 753398 750198 748707 747597 745260
62841G45260m610o002m980k493q79q45r89l58L04K72J31N09R33Q95Q85J412J987
$$ 745260 740650 734648 729668 727175 726296 725451 724462 724104 724408 724680 724811 725320 726253 727148 728033 729445 731432
62824G31432K048J890J708Q36q95j972q72J675L441L328K000M29p59p10J118L555
$$ 731432 733480 735370 737078 737914 737019 735047 734175 735850 739291 742619 744619 745048 744289 743579 744697 748252
62808G48252M278K414l33j699j192m3N59M95L58O13J111J313J056Q91J407K350
$$ 748252 752530 754944 754611 752912 751720 751677 752236 752731 753089 753702 754813 756126 757182 758073 759480 761830
62792G61830K975L131L496M550N839O424N785M153K248P48j25p08j475k471l200
$$ 761830 764805 767936 771432 775982 781821 788245 794030 798183 800431 801179 801054 800346 798871 796400 793200
62777G93200l030j783n8J146J364J214J557K308K652K481K651L474L973L431K908
$$ 793200 790170 788387 788329 789475 790839 792053 793610 795918 798570 801051 803702 807176 811149 814580 817488
62762H17488M096O953R549J0297R522Q634Q395Q341P701O661O436P827R966J1242
$$ 817488 821584 828537 838086 848383 857905 866539 874934 883275 890976 897637 904073 911900 921866 933108
62748I33108J1503J2216J4091J5887J6493J6890J8588K1069K2671K3552K5642
$$ 933108 944611 956827 970918 986805 1003298 1020188 1038776 1059845 1082516 1106068 1131710
62737A131710K9556L3543L6163L8270M1326M5160M8604N1428N4408N8125O2869
$$ 1131710 1161266 1194809 1230972 1269242 1310568 1355728 1404332 1455760 1510168 1568293 1631162
62726A631162O9195P7249Q5526R1635R4792R6922J00645J06535J12690J16813
$$ 1631162 1700357 1777606 1863132 1954767 2049559 2146481 2247126 2353661 2466351 2583164
62716B583164J17985J16272J11407J02868R1120P7722O3608M8155L0640J1844
$$ 2583164 2701149 2817421 2928828 3031696 3122816 3200538 3264146 3312301 3342941 3354785
62706C354785o859k5362m4293o2846p8713r0592r9423j06553j11826j14355j14261
$$ 3354785 3347926 3322564 3278271 3215425 3136712 3046120 2946697 2840144 2728318 2613963 2499702
62695B499702j12718j10671j08258j05092j00590r4538q7745q1638p6608p1584
$$ 2499702 2386984 2276313 2168055 2062963 1962373 1867835 1780090 1698452 1621844 1550260
62685A550260o5799o0198n6023n2656m8330m2796l7822l4705l2523k9552k5560
$$ 1550260 1484461 1424263 1368240 1315584 1267254 1224458 1186636 1151931 1119408 1089856 1064296
62674A064296k1797j9128j7043j4543j1349q059n319l098q04J973M932P294Q512
$$ 1064296 1042499 1023371 1006328 991785 980436 972377 967058 963960 963156 965129 970061 977355 985867
62661I85867Q688Q459Q739J0397J3690J7782K1211K3268K4750K6929K9930L2733
$$ 985867 994555 1003014 1011753 1022150 1035840 1053622 1074833 1098101 1122851 1149780 1179710 1212443
62649A212443L4939L7794M2765M9508N6065O0997O4539O7559P0458P3537P7402
$$ 1212443 1247382 1285176 1327941 1377449 1433514 1494511 1559050 1626609 1697067 1770604 1848006
62638A848006Q2013Q5903Q7440Q6525Q4095Q0171P3704O4451N3752M2926L1935
$$ 1848006 1930019 2015922 2103362 2189887 2273982 2354153 2427857 2492308 2546060 2588986 2620921
62627B620921K0101P299o236k0466l5065m8912o0824p0469p7994q3373q6818q9177
$$ 2620921 2641022 2648321 2642085 2621619 2586554 2537642 2476818 2406349 2328355 2244982 2158164 2068987
62615B068987r0930r1214q8967q4786q0416p6503p2207o7221o2610n8920n4851
$$ 2068987 1978057 1886843 1797876 1713090 1632674 1556171 1483964 1416743 1354133 1295213 1240362
62604A240362m9200m3185l9245l7727l6357l3324k9406k6336k4263k2033j9337
$$ 1240362 1191162 1147977 1108732 1071005 1034648 1001324 971918 945582 921319 899286 879949
62593H79949j7061j5559j4039j2155j0984j1394j2254j1535q973o398n320n283
$$ 879949 862888 847329 833290 821135 810151 798757 786503 774968 765995 759597 754277 748994
62581G48994n083m505m014l467k262n85N46O23K48J19K06L77J151K978N118O042
$$ 748994 743911 739406 735392 731925 729663 729078 729624 730247 730495 730614 730820 731197 732348 735326 740444 746486
62565G46486N175L618K871L400M696O245P703Q463Q047P057P024Q763J1465J3857
$$ 746486 751661 755279 758150 761550 766246 772491 780194 788657 796704 803761 810785 819548 831013 844870
62551H44870J5773J7824K0020K1808K3376K5657K8654L0917L1557L1864L3721
$$ 844870 860643 878467 898487 920295 943671 969328 997982 1028899 1060456 1092320 1126041
62540A126041L6943L9637M1137M2985M6466N0573N3451N4765N5219N4339N0664
$$ 1126041 1162984 1202621 1243758 1286743 1333209 1383782 1437233 1491998 1547217 1601556 1652220
62529A652220M4231L7206L1197K5299J7722Q337j613j1481k1268l0191l6936m1531
$$ 1652220 1696451 1733657 1764854 1790153 1807875 1816212 1814599 1803118 1781850 1751659 1714723 1673192
62517A673192m5469m9458n2397n3271n2783n2259n1877n0984m9364m7173m4296
$$ 1673192 1627723 1578265 1525868 1472597 1419814 1367555 1315678 1264694 1215330 1168157 1123861
62506A123861m0830l7598l5043l2195k8027k3405k0277j9013j8015j6021j3460
$$ 1123861 1083031 1045433 1010390 978195 950168 926763 906486 887473 869458 853437 839977
62495H39977j1262r666q625q140p648o245m253l391m441n682m773j600J785L696
$$ 839977 828715 819049 810424 802284 794636 788391 784138 780747 776306 770624 765851 764251 766036 769732
62481G69732M212M283M388M331L820L063K886L968N893P457Q214R000J0624J2743
$$ 769732 773944 778227 782615 786946 790766 793829 796715 800683 806576 814033 822247 831247 841871 854614
62467H54614J4756J6941J9715K2463K4336K5818K8164L1391L4304L6635L9629
$$ 854614 869370 886311 906026 928489 952825 978643 1006807 1038198 1072502 1109137 1148766
62456A148766M3822M7696M9686N0571N2318N4928N5967N3537M8535M3221L8347
$$ 1148766 1192588 1240284 1289970 1340541 1392859 1447787 1503754 1557291 1605826 1649047 1687394
62445A687394L2804K5828J8404J1974O532Q43n530j1260j4640j5501j5306j5418
$$ 1687394 1720198 1746026 1764430 1776404 1782936 1783779 1778249 1766989 1752349 1736848 1721542 1706124
62433A706124j5642j4616j1472o847k053K458P358J3127J9188K4856L0470L6708
$$ 1706124 1690482 1675866 1664394 1657547 1655494 1657952 1665310 1678437 1697625 1722481 1752951 1789659
62421A789659M3081M8198N1568N4043N6213N7353N6524N3721M9206M2488L3032
$$ 1789659 1832740 1880938 1932506 1986549 2042762 2100115 2156639 2210360 2259566 2302054 2335086
62410B335086K1703J0595J300o428j4480k4819l7543n0213n9920o6280p1447p6785
$$ 2335086 2356789 2367384 2368684 2362256 2347776 2322957 2285414 2235201 2175281 2109001 2037554 1960769
62398A960769q0918q2062q0845p9057p6603p1924o5117n8479n3400m8744m2960
$$ 1960769 1879851 1797789 1716944 1637887 1561284 1489360 1424243 1365764 1312364 1263620 1220660
62387A220660l6359l0345k5629k2128j9656j7740j5424j2179q610n653l666k730
$$ 1220660 1184301 1153956 1128327 1106199 1086543 1068803 1053379 1041200 1032590 1026937 1023271 1020541
62375A020541l054m315n363n406m999n141n973p118q742j1056j3159j3629j2443
$$ 1020541 1017487 1013172 1007809 1002403 997404 992263 986290 979172 970430 959374 946215 932586 920143
62362I20143j1360j1976j3975j5605j5543j4019j2299j1229j0360q706o363m801
$$ 920143 908783 896807 882832 867227 851684 837665 825366 814137 803777 795071 788708 783907
62350G83907n153o612p196n970l857k329j846j765j375o85k70m23o36j35J095
$$ 783907 778754 772142 764946 758976 755119 752790 750944 749179 747804 747119 746849 746426 745790 745655 746750
62335G46750K309L127M083N612P098P531O880O090N892O183O600P101P937R349
$$ 746750 749059 752186 756269 761881 768979 776510 783390 789480 795372 801555 808155 815256 823193 832542
62321H32542J1347J3469J4986J5651J6093J7044J8454J9814K1127K2908K5268
$$ 832542 843889 857358 872344 887995 904088 921132 939586 959400 980527 1003435 1028703
62310A028703K7636K9518L1117L3167L6324M0590M5030M8481N0997N4124N9073
$$ 1028703 1056339 1085857 1116974 1150141 1186465 1227055 1272085 1320566 1371563 1425687 1484760
62299A484760O4953O9710P2575P4556P6548P8062P8054P6061P2143O6336N8589
$$ 1484760 1549713 1619423 1691998 1766554 1843102 1921164 1999218 2075279 2147422 2213758 2272347
62288B272347M8721L6588K2911R772r80r866j9017k8993l7922m4462m9875n5913
$$ 2272347 2321068 2357656 2380567 2390339 2389359 2379493 2360476 2331483 2293561 2249099 2199224 2143311
62276B143311o1917o5687o6518o5676o4263o2198n9187n5361n0859m5955m1528
$$ 2143311 2081394 2015707 1949189 1883513 1819250 1757052 1697865 1642504 1591645 1545690 1504162
62265A504162l8298l5621l2303k8662k6438k6387k7240k7527k7216k6884k6441
$$ 1504162 1465864 1430243 1397940 1369278 1342840 1316453 1289213 1261686 1234470 1207586 1181145
62254A181145k5630k4934k4938k5167k4492k2452j9648j7031j5330j4773j4816
$$ 1181145 1155515 1130581 1105643 1080476 1055984 1033532 1013884 996853 981523 966750 951934
62243I51934j4373j2851j0692q622o770m975l410k183q42Q40J969J537K28l1J380
$$ 951934 937561 924710 914018 905396 898626 893651 890241 888058 887216 888056 890025 891562 891790 891759 893139
62228H93139K819K749K036K752N181P402P976P819Q808J1332J4184J6376J7944
$$ 893139 895958 898707 900743 903495 908676 916078 924054 931873 940681 952013 966197 982573 1000517
62215A000517J9083J9601J9638K0036K1405K3411K5561K8113L1416L4903L7758
$$ 1000517 1019600 1039201 1058839 1078875 1100280 1123691 1149252 1177365 1208781 1243684 1281442
62204A281442M0304M3671M7971N1990N5038N8123O2616O8355P3842P7871Q0269
$$ 1281442 1321746 1365417 1413388 1465378 1520416 1578539 1641155 1709510 1783352 1861223 1941492
62193A941492Q1190Q0417P7595P2862O6851N9943N1617M0979K8133J4679K348
$$ 1941492 2022682 2103099 2180694 2253556 2320407 2380350 2431967 2472946 2501079 2515758 2518106
62182B518106q644j9280l0071m0396m9485n7214o3699o8860p2584p4865p5637
$$ 2518106 2509462 2490182 2460111 2419715 2370230 2313016 2249317 2180457 2107873 2033008 1957371
62171A957371p4955p3273p0895o7423o2624n7617n3811n0837m7081m2632l9677
$$ 1957371 1882416 1809143 1738248 1670825 1608201 1550584 1496773 1445936 1398855 1356223 1316546
62160A316546l9181l9000l6705l2791k9384k7018k4571k1586j8659j5885j2843
$$ 1316546 1277365 1238365 1201660 1168869 1139485 1112467 1087896 1066310 1047651 1031766 1018923
62149A018923j0007q499q314q262p671o819n692l829j561m1L83O65J690L403N377
$$ 1018923 1008916 1000417 992103 983841 976170 969351 963659 959830 958269 958228 958611 959276 960966 964369 969746
62134I69746P253Q586R428J0929J3993J7460J9254J9341J9701K1033K1674K0596
$$ 969746 976999 985585 995013 1005942 1019935 1037395 1056649 1075990 1095691 1116724 1138398 1158994
62122A158994J9438K0079K1778K2521K2049K1800K2391K2866K2443K1841K2627
$$ 1158994 1178432 1198511 1220289 1242810 1264859 1286659 1309050 1331916 1354359 1376200 1398827
62111A398827K5819L0942L6195L9883M2112M4522M8081N1940N4836N6551N7264
$$ 1398827 1424646 1455588 1491783 1531666 1573778 1618300 1666381 1718321 1773157 1829708 1886972
62100A886972N6384N3036M7130L9231K9955K0178J1011K791n198j3350k0945k7448
$$ 1886972 1943356 1996392 2043522 2082753 2112708 2132886 2143897 2146688 2141490 2128140 2107195 2079747
62088B079747l3557l9842m5361m8881n0687n1748n1803m9842m6112m2069l8512
$$ 2079747 2046190 2006348 1960987 1912106 1861419 1809671 1757868 1708026 1661914 1619845 1581333
62077A581333l5081l1469k7743k3595j8595j3285q817n522k984j327j020j309
$$ 1581333 1546252 1514783 1487040 1463445 1444850 1431565 1422748 1417226 1414242 1412915 1411895 1410586
62065A410586l98K310N252O494N567L268O81j227j922j749j536j592j752k357
$$ 1410586 1410188 1412498 1417750 1424244 1429811 1433079 1433760 1432533 1430611 1428862 1427326 1425734 1423982 1421625
62051A421625m155p082j0028j2052j3014j3095j2659j2523j3038j2901j0451o465
$$ 1421625 1417470 1410388 1400360 1388308 1375294 1362199 1349540 1337017 1323979 1311078 1300627 1294162
62039A294162l794l473l049j44L940O082N681M970N511O641P596R043J1532J3859
$$ 1294162 1290368 1286895 1283846 1283702 1287642 1293724 1299405 1304375 1309886 1316527 1324123 1333166 1344698 1358557
62025A358557J4288J2863J1522J2065J4631J7965K0722K2473K3836K5645K8061
$$ 1358557 1372845 1385708 1397230 1409295 1423926 1441891 1462613 1485086 1508922 1534567 1562628
62014A562628L0555L2758L4797L6650L7755L7831L7632L8118L9034L9292L8803
$$ 1562628 1593183 1625941 1660738 1697388 1735143 1772974 1810606 1848724 1887758 1927050 1965853
62003A965853L8824L9942M0829L9896L7234L3705K8809K1299J1650K041o422j4655
$$ 1965853 2004677 2044619 2085448 2125344 2162578 2196283 2225092 2246391 2258041 2260082 2253660 2239005
61991B239005k3129l0407l5292l8910m3057m7710n1737n5073n8343o1049o2013
$$ 2239005 2215876 2185469 2150177 2111267 2068210 2020500 1968763 1913690 1855347 1794298 1732285
61980A732285o1222n9613n7325n3937n0086m6959m4290m0809l6722l3677l1981
$$ 1732285 1671063 1611450 1554125 1500188 1450102 1403143 1358853 1318044 1281322 1247645 1215664
61969A215664l0031k7145k4813k3961k3010k0183j6352j3945j3874j4930j5583
$$ 1215664 1185633 1158488 1133675 1109714 1086704 1066521 1050169 1036224 1022350 1007420 991837
61958I91837j5117j3604j1805j0805j0880j1173j0920j0347r789q833p129n246
$$ 991837 976720 963116 951311 940506 929626 918453 907533 897186 887397 878564 871435 866189
61946H66189l925l160k718k642k539j457N88J975J498O6q12j227k123l201l342
$$ 866189 862264 859104 856386 853744 851205 849748 850336 852311 853809 853875 853063 851836 849713 846512 843170
61931H43170k645k334k812l318l446l643m230n214o916r445j1647j2056j0932
$$ 843170 840525 838191 835379 832061 828615 824972 820742 815528 808612 799167 787520 775464 764532
61918G64532r930r641q955p191n310m437m486m860n307n398m421k622j504j911
$$ 764532 754602 744961 736006 728815 723505 719068 714582 709722 704415 699017 694596 691974 690470 688559
61904F88559k706k361j145n57j079j689j468o71J2M53R73J693K377K898L640N118
$$ 688559 685853 683492 682347 681790 680711 679022 677554 676883 676895 677348 678321 680014 682391 685289 688929 694047
61888F94047P042Q121P447O110O599J0068J4724J7561J7538J6424J6553J8319
$$ 694047 701089 709210 716657 722767 729366 739434 754158 771719 789257 805681 822234 840553
61876H40553K0081K0216J8825J7466J7407J8414J9108J8215J5408J1454P908O179
$$ 840553 860634 880850 899675 917141 934548 952962 972070 990285 1005693 1017147 1025055 1031234
61864A031234O284O636N714L774K217J229p65m724q844r942o926k071J447K703
$$ 1031234 1037518 1044154 1049868 1053642 1055859 1057088 1056323 1051599 1042755 1032813 1025887 1023816 1025263 1027966
61850A027966L250M607O532Q063R416J1640J4570J6373J5706J3235J0240O740
$$ 1027966 1031216 1035823 1042355 1050418 1059834 1071474 1086044 1102417 1118123 1131358 1141598 1148338
61838A148338K329j860l929m001m494p022j0484j3018j4414j5315j5299j3619
$$ 1148338 1150667 1148807 1144878 1140877 1136383 1129361 1118877 1105859 1091445 1076130 1060831 1047212
61826A047212j1375j0911j2714j4554j4466j3295j3106j4061j4372j3129j1588
$$ 1047212 1035837 1024926 1012212 997658 983192 969897 956791 942730 928358 915229 903641
61815I03641j1196j1580j1369j0295r323q972q571p291n075k320O04L209N005
$$ 903641 892445 880865 869496 859201 849878 840906 832335 825044 819969 817649 818253 821462 826467
61802H26467O202P658R580J1000J1184J1054J2285J5255J8623K0848K1515K1430
$$ 826467 832669 840327 849907 860907 872091 883145 895430 910685 929308 950156 971671 993101
61790I93101K1939K3877K6583K8325K8357K7870K8003K7671K4870J9821J5004
$$ 993101 1015040 1038917 1065500 1093825 1122182 1150052 1178055 1205726 1230596 1250417 1265421
61779A265421J1926R546O362K411j525n170q170r591r194q140p283n835k956L84
$$ 1265421 1277347 1286893 1293255 1295666 1294141 1288971 1280801 1271210 1262016 1253876 1246593 1240758 1237802 1238186
61765A238186K662M144O176Q644J0005R649Q362O309K506l101q714j2873j6267
$$ 1238186 1240848 1244992 1251168 1259812 1269817 1279466 1287828 1294137 1296643 1293542 1284828 1271955 1255688
61752A255688k0211k4330k7023k7671k7169k6472k5690k4680k3646k2857k2207
$$ 1255688 1235477 1211147 1184124 1156453 1129284 1102812 1077122 1052442 1028796 1005939 983732
61741I83732k1304j9943j8336j6965j6138j5697j5275j4822j4512j4188j3308
$$ 983732 962428 942485 924149 907184 891046 875349 860074 845252 830740 816552 803244
61730H03244j1624r561p674o104m734l589k826k606l092m186n142m999l744k479
$$ 803244 791620 782059 774385 768281 763547 759958 757132 754526 751434 747248 742106 737107 733363 730884
61716G30884k102k194j756n74O66J247Q88k58j459j684p72J52K14K72J674L876
$$ 730884 728782 726588 724832 724258 724924 726171 727059 726801 725342 723658 722886 723038 723252 723524 725198 729074
61700G29074M843M010L161L749M761M456L020J956J558O96q94j867j250K1L06
$$ 729074 733917 737927 741088 744837 749598 754054 757074 759030 760588 761284 760390 758523 757273 757294 757600
61685G57600p52k211l156l315k723j631p42q81k094l415l657k440l91J461K380
$$ 757600 756848 754637 751481 748166 745443 743812 743070 742189 740095 736680 733023 730583 730192 731653 734033
61670G34033K262J529Q65Q20J513K601L547L905L414K131P23L00J323K690K712
$$ 734033 736295 737824 738689 739509 741022 743623 747170 751075 754489 756620 757343 757643 758966 761656 764368
61655G64368J287L13J285L156L630K123J59j132k377m212n592n141l498k821m001
$$ 764368 765655 765968 767253 770409 774039 776162 776321 775189 772812 768600 763008 757867 754369 751548 747547
61640G47547n612n935n008m140m244n337p005q374p991n079j152P88o35l532m994
$$ 747547 741935 736000 730992 726852 722608 717271 710266 701892 693901 688822 687670 688458 687823 684291 679297
61625F79297m314l067k497k271j846j581j787j803j073l77r32k631m085m238l204
$$ 679297 674983 671916 669419 667148 665302 663721 661934 660131 659058 658681 657749 655118 651033 646795 643591
61610F43591j676l30L63L66M7m98j642l093l330j354J433K542J584O43J325K823
$$ 643591 641915 641585 641948 642314 642361 641863 640221 637128 633798 632444 633877 636419 638003 638646 639971 642794
61594F42794L505L105K579K654L227L600K912J034p58r11M09J556J850K295L288
$$ 642794 646299 649404 651983 654637 657864 661464 664376 665410 664652 663741 664150 665706 667556 669851 673139
61579F73139L407J639n74j145j83N29J14q77j928k889l229k548j712k079l588
$$ 673139 676546 678185 677611 676466 676283 676812 676926 676049 674121 671232 668003 665455 663743 661664 658076
61564F58076m914n303n051m356l203k336k710l808l985k898k077k602l608l901
$$ 658076 653162 647859 642808 638452 635249 632913 630203 626395 622410 619512 617435 614833 611225 607324
61550F07324l781m207n088n546n432n527o343p276p144n422l108k109l197m833
$$ 607324 603543 599336 594248 588702 583270 577743 571400 564124 556980 551558 548450 546341 543144 538311
61536E38311m857l275k239l124m840n612n280m896m887m719m015l099k552k714
$$ 538311 533454 530179 527940 524816 519976 514364 509084 504188 499301 494582 490567 487468 484916 482202
61522D82202l417l787k791n25J352J148j025l367m247l587k456j716j202j96J274
$$ 482202 478785 474998 472207 471682 473034 474182 473157 469790 465543 461956 459500 457784 456582 456386 457660
61507D57660K009J007r48j842p75J023J851J499J008J058J357J367J037P94J084
$$ 457660 459669 460676 459728 457886 457111 458134 459985 461484 462492 463550 464907 466274 467311 468105 469189
61492D69189J882K583K649K265J954J606O58o81j312p70J3J33K8M80J090Q36j59
$$ 469189 471071 473654 476303 478568 480522 482128 482786 482105 480793 480023 480036 480169 480197 480677 481767 482603 482444
61475D82444o91k54L54L92J60K05M22N55R56J987L009K815J213n31j171q86p12
$$ 482444 481753 481499 481853 482245 482405 482610 483032 483587 484543 486530 489539 492354 493567 493036 491865 490979 490267
61458D90267r57j007o15n04j230k155k234j434o76n99j048j574j753j163K16J529
$$ 490267 489310 488303 487688 487184 485954 483799 481565 480131 479455 478856 477808 476234 474481 473318 473534 475063
61442D75063J734Q97J32J72O19P36K86m98j240j493j040j94P08J887L490M580
$$ 475063 476797 477694 477826 477998 478617 479353 479639 479141 477901 476408 475368 475174 475882 477769 481259 485839
61426D85839L934J894J98k68l01n16j04J664L775M522L538J859N72J28M85J047
$$ 485839 489773 491667 491865 491597 491296 490780 490676 492340 496115 500637 504175 506034 506606 506734 507219 508266
61410E08266J003L64J50Q73J613J444R06R89J369R27l72j446j699j488j000N0
$$ 508266 509269 509633 509783 510656 512269 513713 514619 515608 516977 517904 517532 516086 514387 512899 511899 511949
61394E11949J461K331K108J170K43r3N89K196L704L902K856J957K338L695M826
$$ 511949 513410 515741 517849 519019 519262 519169 519758 521954 525658 529560 532416 534373 536711 540406 545232
61379E45232M802L556J869R16J338K666L782L915K923J109o76j081N74L165M587
$$ 545232 550034 553590 555459 556375 557713 560379 564161 568076 570999 572108 571432 570351 570925 574090 578677
61364E78677L870J947K70n95q90r37r58j058j072o88j3L40l2p59j115q25k71J8
$$ 578677 582547 584494 584764 584169 583279 582342 581384 580326 579254 578566 578553 578893 578861 578102 576987 576162 575891 575909
61346E75909j53p06j560k590l326l103j944r02r85j861k295j711n74N94J570J779
$$ 575909 575756 575050 573490 570900 567574 564471 562527 561625 560640 558779 556484 554773 554199 554793 556363 558142
61330E58142O54j036j595o66K01O4Q3J423L167L877L965M598N246M425K350O84
$$ 558142 558796 557760 556165 555499 555700 555764 555847 557270 560437 564314 568279 572877 578123 582548 584898 585582
61314E85582n8p17j219l33J921L781M235M194M512M604L923L126K805K451J777
$$ 585582 585524 584807 583588 583255 585176 588957 593192 597386 601898 606502 610425 613551 616356 618807 620584
61299F20584J742L156N291O945P904Q489Q703Q749R296J0197J0042Q260O521O538
$$ 620584 622326 625482 630773 637718 645622 654111 662814 671563 680859 691056 701098 709358 715879 722417
61285G22417P361O737M596L248M013N485N777N026M799N674O508O041M526L384
$$ 722417 729778 736515 741111 744359 748372 753857 759634 764660 769459 775133 781641 787682 792208 795592
61271G95592L295L236J925j87j452j534j928l416m476l377p71J343K332K944L207
$$ 795592 798887 802123 804048 803861 802409 800875 798947 795531 791055 787678 786907 788250 790582 793526 796733
61256G96733K491J560K379N163P531P643O715P078Q970J0777J1681J2364J3272
$$ 796733 799224 800784 803163 808326 815857 823500 830215 837293 846263 857040 868721 881085 894357
61243H94357J3736J3113J1520R184O106K798L58q69j865l583n675p294q416r382
$$ 894357 908093 921206 932726 941910 948016 950814 951172 950303 948438 944855 939180 931886 923470 914088
61229I14088r787r098q036p929q686q886q107p589p875p433m936j648L2k85q59
$$ 914088 904301 895203 887167 879238 870552 861666 853559 845970 838095 830662 825726 824078 824110 823825 822966
61214H22966l84R57K665M447N515N031L650L185M352O134P616Q903R748R102P126
$$ 822966 822582 823539 826204 830651 836166 841197 844847 848032 852384 858518 866134 875037 884785 893887 901013
61199I01013N931O880Q432Q240O345M471L098J376m69r56J54J238J320J403K412
$$ 901013 906944 913824 922256 930496 936841 941312 944410 945786 945317 944361 944515 945753 947073 948476 950888
61184I50888L353K891J566R43J238J279N40j72k40k10q06j745k123j517k91R12
$$ 950888 954241 957132 958698 959641 960879 962158 962698 962526 962286 962076 961270 959525 957402 955885 955594 956506
61168I56506J746K418L499N116O340N927L962K137J996L331M812N668O058O220
$$ 956506 958252 960670 964169 969285 975625 981552 985514 987651 989647 992978 997790 1003458 1009516 1015736
61154A015736O259O519P258P804P065N077L167K418K762L813N405O843O881N300
$$ 1015736 1021995 1028514 1035772 1043576 1050641 1055718 1058885 1061303 1064065 1067878 1073283 1080126 1087007 1092307
61140A092307L671L631N237P737J0884J4278J6473J6408J5070J4119J3265J0881
$$ 1092307 1095978 1099609 1104846 1112583 1123467 1137745 1154218 1170626 1185696 1199815 1213080 1223961
61128A223961O976L621K094J397K40j044j392o54L74P39k43k439m524n158m702
$$ 1223961 1230937 1234558 1236652 1238049 1238289 1237245 1235853 1235199 1235573 1236312 1236069 1233630 1229106 1223948 1219246
61113A219246m601n095n102m590m980o477p128n876m663n762q450j0302j0584
$$ 1219246 1214645 1209550 1204448 1199858 1194878 1188401 1181273 1175397 1170734 1164972 1156522 1146220 1135636
61100A135636j0377j0237r854r608j0274j1391j1717j1249j0970j0615q737n299
$$ 1135636 1125259 1115022 1105168 1095560 1085286 1073895 1062178 1050929 1039959 1029344 1020607 1015308
61088A015308k324j305j679k539m223p017r675j0754j0600j0660j1152j0800q806
$$ 1015308 1012984 1011679 1010000 1007461 1003238 996221 986546 975792 965192 954532 943380 932580 923774
61075I23774n957l531j880o22L87R28J186K005L937O366Q207R415J1033J3523
$$ 923774 917817 914286 912406 911784 912171 913099 914285 916290 920227 926593 934800 944215 955248 968771
61061I68771J5911J7246J8142J9920K2625K4976K6153K6566K6812K6953K7025
$$ 968771 984682 1001928 1020070 1039990 1062615 1087591 1113744 1140310 1167122 1194075 1221100
61050A221100K7343K7762K7566K6572K5739K5938K6598K6215K3982K0480J6934
$$ 1221100 1248443 1276205 1303771 1330343 1356082 1382020 1408618 1434833 1458815 1479295 1496229
61039A496229J4098J1659Q448L572k294p132r563j0423j1765j4431j7258j8705
$$ 1496229 1510327 1521986 1530434 1534006 1531712 1524580 1515017 1504594 1492829 1478398 1461140 1442435
61027A442435j8645j8109j7914j8138j8741j9844k1174k1837k1170j9531j7787
$$ 1442435 1423790 1405681 1387767 1369629 1350888 1331044 1309870 1288033 1266863 1247332 1229545
61016A229545j6248j4595j2605j0424q067n327k373R4J538K195K761L838N736
$$ 1229545 1213297 1198702 1186097 1175673 1167606 1162279 1159906 1160000 1161538 1163733 1166494 1170332 1176068
61003A176068Q397J1263J3613J5254J6698J8596K1288K4764K8524L1481L2760
$$ 1176068 1184465 1195728 1209341 1224595 1241293 1259889 1281177 1305941 1334465 1365946 1398706
60992A398706L2854L3333L5229L8372M2406M7413N3059N8120O1756O4678O8307
$$ 1398706 1431560 1464893 1500122 1538494 1580900 1628313 1681372 1739492 1801248 1865926 1934233
60981A934233P3254P9237Q5776R2297R8154J03419J09185J16293J24334J32500
$$ 1934233 2007487 2086724 2172500 2264797 2362951 2466370 2575555 2691848 2816182 2948682
60971B948682J40778J49429J58213J67239J77940J91703K08085K25854K45593
$$ 2948682 3089460 3238889 3397102 3564341 3742281 3933984 4142069 4367923 4613516
60962D613516K69465K98224L29900L62137L95113M32036M77580N35557O06629
$$ 4613516 4882981 5181205 5511105 5873242 6268355 6700391 7177971 7713528 8320157
60953H320157O87671P74292Q64637R60985J068375J192292J336501J501772J686921
$$ 8320157 9007828 9782120 10646757 11607742 12676117 13868409 15204910 16706682 18393603
60944A8393603J888735K090953K242824K254211K037627J581702R89056M28570
$$ 18393603 20282338 22373291 24616115 26870326 28907953 30489655 31478711 31907281
60936C1907281L6379j45532j50949m0080J13537K05454J15306k23257p59921j345536
$$ 31907281 31943660 31798128 31647179 31607099 31720636 31926090 32041396 31818139 31058218 29712682
60926B9712682j822410k106617k201607k157494k028841j858387j676724j502706
$$ 29712682 27890272 25783655 23582048 21424554 19395713 17537326 15860602 14357896
60918A4357896j343759j199933j069143r49512q39598p38708o47119n65536m94565
$$ 14357896 13014137 11814204 10745061 9795549 8955951 8217243 7570124 7004588 6510023
60909F510023m34476l84467l42179l05105k72635k45681k24185k06185j89691
$$ 6510023 6075547 5691080 5348901 5043796 4771161 4525480 4301295 4095110 3905419
60900C905419j74247j60193j47577j36515j27646j21156j15932j10437j04224
$$ 3905419 3731172 3570979 3423402 3286887 3159241 3038085 2922153 2811716 2707492
60891B707492r8045r2651q7915q3064p7634p2247o8124o5516o3035n9279n4704
$$ 2707492 2609447 2516796 2428881 2345817 2268183 2195936 2127812 2062296 1999261 1939982 1885278
60880A885278n0924m8399m6083m3366m1029l9827l9309l8622l7558l6289l4884
$$ 1885278 1834354 1785955 1739872 1696506 1655477 1615650 1576341 1537719 1500161 1463872 1428988
60869A428988l3564l2691l2057l1069k9914k9587l0211l0323k8556k5278k1882
$$ 1428988 1395424 1362733 1330676 1299607 1269693 1240106 1209895 1179572 1151016 1125738 1103856
60858A103856j9171j7127j5593j4378j3194j2000j1062j0289r173p675o374n401
$$ 1103856 1084685 1067558 1051965 1037587 1024393 1012393 1001331 991042 981869 974194 967820 962419
60846I62419m238l067l104m650o001n363l137j132k13J02K94M20O65J144J251
$$ 962419 958181 955114 952010 947360 941359 935996 932859 931727 931514 931616 931910 932330 932995 934139 935390
60831I35390L13j288k629l668n109o937q159q183p586p250p494q189r053r616
$$ 935390 935703 934415 931786 928118 923009 916072 907913 899730 892144 884894 877400 869211 860158 850542
60817H50542r450q709q145q411r507j0745j1139j0114q113o212m757l001m86J800
$$ 850542 841092 832383 824238 815827 806320 795575 784436 774322 766209 759997 755240 752239 751753 753553
60803G53553K454J370l51j852k997l738l930l698l203k195n28J039J524J080P62
$$ 753553 756007 757377 757026 755174 752177 748439 744509 740811 737608 735413 734885 735924 737448 738528 739290
60788G39290Q99P18k59j397j908j834j690j691j808k148k874l949n034n514m743
$$ 739290 740189 740907 740648 739251 737343 735509 733819 732128 730320 728172 725298 721349 716315 710801 706058
60773G06058k776o70M23M54K23J69J49K28P08J254J015o1r17q99p16j266k234
$$ 706058 703282 702612 703035 703489 703712 703881 704030 704258 704966 706220 707235 707174 706257 705358 704642 703376 701142
60756G01142k667k477k435k909l381l340l027l067l702m544m940m484l347k269
$$ 701142 698475 695998 693563 690654 687273 683933 680906 677839 674137 669593 664653 660169 656822 654553
60742F54553k148l391n509p259p515o241m543l585l516l722l842m078m475m500
$$ 654553 652405 649014 643505 636246 628731 622490 617947 614362 610846 607124 603282 599204 594729 590229
60728E90229l675k299j276j199j800k199j762p54j27m39j163j269l75R59J942
$$ 590229 586554 584255 582979 581780 579980 577781 576019 575265 575138 574699 573536 572267 571892 572851 574793
60713E74793K117J462N31M85K123M581N810M905L377L304M681N488M371K263J041
$$ 574793 576910 578372 578903 579388 581511 586092 591902 596807 600184 603488 608169 613657 618028 620291 621332
60698F21332J407K593L521L540K368K82j515j588K46K484L390K549P28j276l067
$$ 621332 622739 625332 628853 632393 634761 635043 633528 631940 632186 634670 638060 640609 641337 640061 636994
60683F36994m355n084n715o597p070o075l972k697l484n195n838n169m673n174
$$ 636994 632639 627555 621840 615243 608173 602098 598126 595429 591945 586750 580912 575743 571070 565896
60669E65896n709n138l789k829k629k609k376k239k522k980l099k634j624k82
$$ 565896 560187 555049 551260 548431 545802 543193 540817 538578 536056 533076 529977 527343 525719 525437
60655E25437R79J657J641J352J134P61p9r62j071l66K07n2o76p34K8J180K259
$$ 525437 526416 528073 529714 531066 532200 532961 532882 531920 530849 530483 530690 530638 529962 529228 529256 530436 532695
60638E32695K898K709J769J037J561L193M632M788L754K546K266L264M692N129
$$ 532695 535593 538302 540071 541108 542669 545862 550494 555282 559036 561582 563848 567112 571804 576933
60624E76933M206L208L407M268M352L562L144L563L853L381K774K607K525K287
$$ 576933 581139 584347 587754 592022 596374 599936 603080 606643 610496 613877 616651 619258 621783 624070
60610F24070K316K322Q12k809o603q029o908n113l892k955j979j507j983k899
$$ 624070 626386 628708 629520 626711 620108 612079 605171 600058 596166 593211 591232 589725 587742 584843
60596E84843l256k431m99J687K813K190O59r6O90K155K824K045L53j307k531l524
$$ 584843 581587 579156 578657 580344 583157 585347 586006 585910 586600 588755 591579 593624 593977 592670 590139 586615
60580E86615m196l753j894l0j44k297m421m860l820k045K37K185K056l49k415
$$ 586615 582419 578666 576772 576742 576598 574301 569880 565020 561200 559155 559392 561577 563633 563284 560869
60565E60869j819J44M26j397l016l201l134l571l283j325J005J952J682J585K061
$$ 560869 559050 559194 559620 558223 555207 552006 548872 545301 542018 540693 541698 543650 545332 546917 548978
60550E48978K215J427K71o9J059L078M561M636L931L574L598L188K303J809J926
$$ 548978 551193 552620 552891 552822 553881 556959 561520 566156 570087 573661 577259 580447 582750 584559 586485
60535E86485J808J132P99J407K084J726P00L14J024J947K118J675J697L014N096
$$ 586485 588293 589425 590224 591631 593715 595441 596141 596455 597479 599426 601544 603219 604916 607930 613026
60520F13026O382O066N133N074N899O507O728P633R573J1388J2203J2869J4525
$$ 613026 619408 625474 630607 635681 641580 648087 654815 662448 672021 683409 695612 708481 723006
60507G23006J6553J7038J5016J1483Q258O296N094L495J075j357k824l327l412
$$ 723006 739559 756597 771613 783096 791354 797650 802744 806239 807314 805957 803133 799806 796394
60494G96394l020j827m27J65K92J527M323P127Q614R580J1579J4616J7401J9265
$$ 796394 793374 791547 791120 791285 791577 793104 797427 804554 813168 822748 834327 848943 866344 885609
60480H85609K0705K2159K3182K2948K1101J8097J4831J1648P788K433l592q032
$$ 885609 906314 928473 951655 974603 995704 1013801 1028632 1040280 1048068 1050501 1046909 1038877
60468A038877r475q688p301o054m869l802l108k869l081l662m047l445j921l22
$$ 1038877 1029402 1020714 1013413 1007359 1002490 998688 995580 992711 989630 985968 981921 978476 976555 976233
60454I76233J202L577P069J0295J1982J2791J4349J7176K0664K4450K8583L2848
$$ 976233 977435 981012 988081 998376 1010358 1023149 1037498 1054674 1075338 1099788 1128371 1161219
60442A161219L6986M1174M5422M8996N1539N3933N6770N8518N6908N1887M5644
$$ 1161219 1198205 1239379 1284801 1333797 1385336 1439269 1496039 1554557 1611465 1663352 1708996
60431A708996L9628L3038K4458J3586R80j2607k6016l7827m7356n4887o0670o4462
$$ 1708996 1748624 1781662 1806120 1819706 1820686 1808079 1782063 1744236 1696880 1641993 1581323 1516861
60419A516861o6268o6602o5647o3109n9215n4918n0602m5657l9966l4837l1500
$$ 1516861 1450593 1383991 1318344 1255235 1196020 1141102 1090500 1044843 1004877 970040 938540
60408I38540k9446k7375k5077k3122k1170j8208j4637j2484j2682j3341j1953
$$ 938540 909094 881719 856642 833520 812350 794142 779505 767021 754339 740998 729045
60397G29045q653n889n049n054m659m520n729p385p456n798m506m882n710n365
$$ 729045 720392 714503 709454 704400 699741 695221 689492 682107 674651 668853 664347 659465 653755 648390
60383F48390m178l415k997j979p01o15j801k418j251M81Q65j97j319j878k550
$$ 648390 644212 640797 637800 635821 635120 634505 632704 630286 629035 629516 630381 630184 628865 626987 624437
60368F24437l676m354l735k362j434j151p00J77N85o7p65N3K371M381M509L006
$$ 624437 620761 616407 612672 610310 608876 607725 607025 607202 607787 607720 606955 607008 609379 613760 618269 621275
60352F21275J306M97P08J487K163K188J624J155J373K129K814K963K444J455O55
$$ 621275 622581 623078 623786 625273 627436 629624 631248 632403 633776 635905 638719 641682 644126 645581 646236
60337F46236Q61K110L368L643L160K804K770K498K035K495M626P333Q417O880
$$ 646236 647097 649207 652575 656218 659378 662182 664952 667450 669485 671980 676606 683939 692356 699236
60323F99236M061K200K156K937L384L545M061M824N123M924N034N860O685O537
$$ 699236 703297 705497 707653 710590 713974 717519 721580 726404 731527 736451 741485 747345 754030 760567
60309G60567N201L226J422N96J109K423L591M460N751P626Q984Q803P611O837
$$ 760567 765768 768994 770416 771012 772121 774544 778135 782595 788346 795972 804956 813759 821370 828207
60295H28207P102P886Q641R414J0325J0966J0635R037O649M234J945q33m317p428
$$ 828207 835309 843195 851836 861250 871575 882541 893176 902213 908862 913096 915041 914208 909891 902463
60281I02463q762q367p603p333p283p310p836q580q227o271m070k979k543j676
$$ 902463 893701 885334 877731 870398 863115 855805 847969 839389 831162 824891 820821 817842 815299 813623
60267H13623p44r65k318l473l513k538r62O53J425J142J145K912N902Q178R120
$$ 813623 812879 811914 809596 806123 802610 800072 799110 799763 801188 802330 803475 806387 812289 820467 829587
60252H29587J0132J2379J5219J7286J8140J8379J8900K0192K1564K0998J6913
$$ 829587 839719 852098 867317 884603 902743 921122 940022 960214 981778 1002776 1019689
60241A019689J0276L918o01m331q862j4149j9052k2877k5286k5603k3531k0108
$$ 1019689 1029965 1033883 1033282 1028951 1020089 1005940 986888 964011 938725 913122 889591 869483
60229H69483j6920j4434j2061r776q565q917r625q833o040k662n41l15j247k279
$$ 869483 852563 838129 826068 816292 807727 798810 789185 780352 774312 771650 771109 770794 769547 767268
60215G67268k928l251l460l715m106m583m952m911m062k224q2Q18m89k974m426
$$ 767268 764340 761089 757629 753914 749808 745225 740273 735362 731300 729076 728994 729812 729323 726349 721923
60200G21923l887k518j865k168k746l016k418l79K596M533L898J495m67q92l63
$$ 721923 718036 715518 713653 711485 708739 705723 703305 702926 705522 710055 713953 715448 714981 714089 713726
60185G13726L50J108J786K027J903J940K288K484K260J966J974K143K082J777
$$ 713726 714076 715184 716970 718997 720900 722840 725128 727612 729872 731838 733812 735955 738037 739814
60171G39814J772K645M097M727L407R66l75M22K103L038L165L316L749M317N178
$$ 739814 741586 744231 748328 753055 756462 757428 757053 757475 759578 762616 765781 769097 772846 777163 782341
60156G82341O218O677O358O350P361Q351Q160P432P350P526P047O737Q133J0625
$$ 782341 788559 795236 801594 807944 815305 823656 831816 839248 846598 854124 861171 867908 876041 886666
60142H86666J1928J1280J0063R334Q796Q314Q346Q566Q020O985O727P118O449
$$ 886666 898594 909874 919937 929271 938067 946381 954727 963293 971313 978298 985025 992143 998592
60129I98592M075J309p07k109k939k729k023k304l638m443m270m613o112p269
$$ 998592 1002667 1003976 1003269 1001160 998221 995492 993469 991165 987527 983084 978814 974201 968089 960820
60115I60820p167p126q117q747p688o138n813o085n362l995l542m052m280l905
$$ 960820 953653 946527 938410 929663 921975 915837 910024 903939 898577 894582 891040 886988 882708 878803
60101H78803l544l084j996r81j360k811l409k120j2J256J147K78m54n78l17j37
$$ 878803 875259 872175 870179 869198 867838 865027 861618 859498 859486 860742 861889 862167 861713 861135 860818 860681
60085H60681j8L50P76Q44J132K777N460P193O860N600M913M829M841N102N578
$$ 860681 860663 861013 861789 862633 863765 866542 872002 879195 886055 891655 896568 901397 906238 911340 916918
60070I16918N495M814M850O146P283P064O262N691M536K432J330K743M755M502
$$ 916918 922413 927227 932077 938223 945506 952570 958832 964523 969059 971491 972821 975564 980319 984821
60056I84821K529J755K964M185M089L238K177R21K13P26J241J36j563j393L76
$$ 984821 987350 989105 992069 996254 1000343 1003581 1005758 1006679 1006892 1007618 1008859 1008995 1007432 1006039 1006415
60041A006415R05o63j957j458p11j323k546l313m176n569o286n457m206l785l675
$$ 1006415 1007320 1006657 1004700 1003242 1002531 1001208 998662 995349 991173 985604 979318 973861 969655 965870 962195
60026I62195l052k505k733k983k414j695j744k145k236k532l473m050l333k381
$$ 962195 959143 956638 953905 950922 948508 946813 945069 942924 940688 938156 934683 930633 927300 924919
60012I24919k844m597o334p699r069j0065j0075r721j0018j0527j0051q802p986
$$ 924919 922075 917478 911144 903445 894376 884311 874236 864515 854497 843970 833919 825117 817131
59999H17131p528o200m109l009l642m433l717j913n49j67j27K60J152K302L063
$$ 817131 809603 803403 799294 796285 792643 788210 784493 782580 782031 781864 781737 781997 783149 785451 788514
59984G88514K792J728J145J952L547M552M466L997L891M077M109L993M136M630
$$ 788514 791306 793034 794179 796131 799678 804230 808696 812693 816584 820661 824770 828763 832899 837529
59970H37529M903M228K526N85n90o73l87r53k966n674p546p733o902o457p049
$$ 837529 842432 846660 849186 849771 849181 848508 848121 847168 844202 838528 830982 823249 816347 809890 802841
59955H02841q085q600q306p741p579p885q037p453o346n434m933m370l624l390
$$ 802841 794756 786156 777850 770109 762530 754645 746608 739155 732809 727375 722442 718072 714448 711058
59941G11058m090m896m700l646k802k612k591k354j924j143J97J529J946J702
$$ 711058 706968 702072 697372 693726 690924 688312 685721 683367 681443 680300 680497 682026 683972 685674
59927F85674K134L691N093M987L567J940Q20M84J172K593L558L071J549L15R4
$$ 685674 687808 691499 696592 701579 705146 707086 707906 708390 709562 712155 715713 718784 720333 720648 720742
59912G20742N27Q54M44j042l239m902m735k666n2J546J772J719K637M322N102
$$ 720742 721269 722123 722567 721525 718286 713384 708649 705983 705931 707477 709249 710968 713605 717927 723029
59897G23029L814J438j3J0J37p29j956k365j893j300j002r34r62p68J90J781K751
$$ 723029 726843 728281 728268 728278 728415 727686 725730 723365 721472 720172 719170 718236 717274 716506 716696 718477 721228
59880G21228J988J8j525j760j200p41o29n52k32K26M93O35J452L599O274P638
$$ 721228 723216 723234 721709 719949 718749 718008 717379 716827 716595 716821 717314 717949 719401 723000 729274 736912
59864G36912O997N821N846O971P950Q362Q611Q362O691L943J937J697K152J888
$$ 736912 743909 749730 755576 762547 770497 778859 787470 795832 802523 806466 808403 810100 812252 814140
59850H14140J165J114J685J779J269J479L172N236O084N634M961M509L749K557
$$ 814140 815305 816419 818104 819883 821152 822631 825803 831039 837123 842757 847718 852227 855976 858533
59836H58533J757K004L017M221N230N319L702J154J59K106N170O559O135N982
$$ 858533 860290 862294 865311 869532 874762 880081 883783 884937 885096 887202 892372 898931 905066 911048
59822I11048O734O656M759K661K276L310M275M672M759M266K777Q36o61j690k576
$$ 911048 917782 924438 929197 931858 934134 937444 941719 946391 951150 955416 958193 959029 958368 956678 954102
59807I54102k805j598M74J684J096l84j005K55K821M788M566K744J834L473O561
$$ 954102 951297 949699 950173 951857 952953 952569 951564 951819 954640 959428 963994 966738 968572 972045 978606
59792I78606Q853R494Q844O786L047j081l271k880j683j351j564j396j402l058
$$ 978606 987459 996953 1005797 1012583 1015630 1014549 1011278 1008398 1006715 1005364 1003800 1002404 1001002 997944
59778I97944o526j0099j1985j2077j1721j1981j2465j1959j0046p645n789m535
$$ 997944 991418 981319 969334 957257 945536 933555 921090 909131 899085 891440 885651 881116
59766H81116l470k639k175j593m83L08n34k781m604m824m114l533k961j905r42
$$ 881116 877646 875007 872832 871239 870756 871064 870530 867749 863145 858321 854207 850674 847713 845808 844866
59751H44866j194k638l959m148l439k606k053j895k272l033l434k818j594r39
$$ 844866 843672 841034 837075 832927 829488 826882 824829 822934 820662 817629 814195 811377 809783 808844
59737H08844j348j897j446j93N31qj080j459p48M24J133Q60j41r97j101q73j182
$$ 808844 807496 805599 804153 803960 804491 804483 803403 801944 801196 801620 802753 803613 803472 802475 801374 800501 799319
59720G99319j962k181j387n12o25j619k612l000k601j501l90j97o17J52L022O185
$$ 799319 797357 795176 793789 793277 792652 791033 788421 785421 782820 781319 780929 780732 780115 780267 783289 789474
59704G89474P073N698M512N100O577P343P056O414O226P083Q948J0660J0835R662
$$ 789474 796547 802245 806757 811857 818434 825777 832833 839247 845473 852556 861504 872164 882999 892661
59690H92661Q789R131R943J0501J1353J2920J3971J2936J0183P703O689O496O058
$$ 892661 901450 910581 920524 931025 942378 955298 969269 982205 992388 1000091 1006780 1013276 1019334
59677A019334N226M471L905L225K400J892K090K586K256L60k595n270o734o967
$$ 1019334 1024560 1029031 1032936 1036161 1038561 1040453 1042543 1045129 1047385 1047745 1045150 1039880 1033146 1026179
59663A026179o330n212m185l842m182m563m531m240l872l251k380j889k350l426
$$ 1026179 1019849 1014637 1010452 1006610 1002428 997865 993334 989094 985222 981971 979591 977702 975352 971926
59649I71926m051l446j808k67r8j498l047k967j159P23J424J560K335L603M112
$$ 971926 967875 964429 962621 962354 962256 960758 957711 954744 953585 954308 955732 957292 959627 963230 967342
59634I67342L303J956J081R07R70O84j44j033j196n46K2k13p57p35m03q29k226
$$ 967342 970645 972601 973682 974589 975559 976243 976099 975066 973870 973324 973346 973133 972376 971641 971238 970409 968183
59617I68183l647m470n119n894o154n380m315m170n072o068o378n928m863l403
$$ 968183 964536 960066 954947 949053 942899 937519 933204 929034 923962 917894 911516 905588 900725 897322
59603H97322k216k125l114m115m021k607m11J817L338L720L218K614K379K276
$$ 897322 895106 892981 889867 885752 881731 879124 878713 880530 883868 887588 890806 893420 895799 898075
59589H98075K004J749J737J714J365P61Mj221k969m342m317l079j813j362j872
$$ 898075 900079 901828 903565 905279 906644 907405 907409 906188 903219 898877 894560 891481 889668 888306 886434
59574H86434l408n623p009n999l371j964l246n375n728m164k508j779j597j769
$$ 886434 883026 877403 870394 864395 861024 859060 855814 850439 844711 840547 838039 836260 834663 832894
59560H32894k713m282n658o592p484q165p780o300m876m216l633k380r72l74n16
$$ 832894 830181 825899 820241 813649 806165 798000 790220 783920 779044 774828 771195 768815 767843 767469 766953
59545G66953m49K84J149J312M74p94j417p90M69J127P82J86J32O84J697L114M323
$$ 766953 766504 766788 767937 769249 769723 768929 767512 766722 767191 768318 769100 769286 769418 770102 771799 774913 779236
59528G79236M125K228J10o42m13r39k682m002l325j243J45l29j826k716k389j694
$$ 779236 783361 785589 785699 785057 784644 783705 781023 777021 773696 772453 772598 772269 770443 767727 765338 763644
59512G63644j843l129m649n129m077k249j009j004j529j422n10L23O07J032K195
$$ 763644 761801 758672 754023 748894 744817 742568 741559 740555 739026 737604 737094 737417 738024 739056 741251
59497G41251L319L119J641K86j6L33O70J065J806K661L258L840N062P159R606
$$ 741251 744570 747689 749330 749616 749600 749933 750603 751668 753474 756135 759393 763233 768295 775454 785060
59482G85060J1495J2238J2141J2342J3874J6709J9675K1122J9489J4112O254j017
$$ 785060 796555 808793 820934 833276 847150 863859 883534 904656 924145 938257 944511 943494
59470I43494n184o474o855p130o391m340k414j900k326k557k378k018j244j07
$$ 943494 938310 931836 924981 917851 911460 907120 904706 902806 900480 897923 895545 893527 892283 892176
59456H92176L38o32j997k253j614j571k624l885m925o495q904j0886j0864q765
$$ 892176 892514 891882 889885 887632 886018 884447 881823 877938 873013 866518 857614 846728 835864 827099
59442H27099o074m374m195n024o000o567o579o035n060m088l485k847j359Q14
$$ 827099 821025 816651 812456 807432 801432 794865 788286 782251 777191 773103 769618 766771 765412 766226
59428G66226K209J799M26k48L71J716L290M886N946N874N030M448M569N029N587
$$ 766226 768435 770234 770660 770412 770783 772499 775789 780675 786621 792495 797525 801973 806542 811571 817158
59413H17158O259O624O064M826L839L275K363R08j20rO88J198J702K588L394L436
$$ 817158 823417 830041 836105 840931 844770 848045 850408 851316 851196 851187 851875 853073 854775 857363 860757 864193
59397H64193L101L396M414N179N146M981N545O739P751Q139Q065P726P057O107
$$ 864193 867294 870690 875104 880283 885429 890410 895955 902694 910445 918584 926649 934375 941432 947539
59383I47539N136M041K183o26l258m289l852l539m215m967m854m537n049n680
$$ 947539 952675 956716 958899 958273 955015 950726 946874 943335 939120 934153 929299 924762 919713 914033
59369I14033m658j735J331L094L992N174O873Q584J0114J1752J3734J6029J8360
$$ 914033 909375 907640 908971 912065 916057 921231 928104 936688 946802 958554 972288 988317 1006677
59356A006677K0281K1536K2488K3857K6068K9009L1993L3245L0047K0929Q051
$$ 1006677 1026958 1048494 1070982 1094839 1120907 1149916 1181909 1215154 1245201 1266130 1274181
59345A274181l851j1333j4344j4465j2658r246m672Q37O984J1592J0489J350j2641
$$ 1274181 1270330 1258997 1244653 1230188 1217530 1208284 1203612 1204449 1211433 1223025 1233514 1234864 1222223
59332A222223k4762l0596l0823k8568k5824k2863j9524j5866j2168r082p397p156
$$ 1222223 1197461 1166865 1136042 1107474 1081650 1058787 1039263 1023397 1011229 1002147 994750 987594
59320I87594p323o682m851k249M15K397L215L128L093L893N437P029Q047Q269
$$ 987594 980271 973589 968738 966489 966904 969301 972516 975644 978737 982630 988067 995096 1003143 1011412
59306A011412P870P373P291P554P566P024O388O297O803P531Q392R669J1436J3164
$$ 1011412 1019282 1026655 1033946 1041500 1049066 1056090 1062478 1068775 1075578 1083109 1091501 1101170 1112606 1125770
59292A125770J4022J3411J1391Q792O890O638P978J0010J1817J3031J3549J3116
$$ 1125770 1139792 1153203 1164594 1173386 1180276 1186914 1194892 1204902 1216719 1229750 1243299 1256415
59280A256415J1666R948R088R145Q610O137K570K43R5N10m35k590m654o530r093
$$ 1256415 1268081 1278029 1287117 1296262 1304872 1311009 1313579 1313822 1313917 1314427 1313992 1311402 1306748 1300218 1291125
59265A291125j1760j2317j0000p213o846q718j0173r719q447p820p709p251o295
$$ 1291125 1279365 1267048 1257048 1249835 1242989 1234271 1224098 1214379 1205932 1198112 1190403 1183152 1176857
59252A176857m928k639P02L570M079K605J726L080N400O384N389L226Q8m675j0679
$$ 1176857 1171929 1169290 1169992 1173562 1177641 1180246 1181972 1185052 1190452 1196836 1202225 1205451 1205539 1200864 1190185
59237A190185j5837j8288j8295j7625j7495j7628j7018j5222j2982j1656j1755
$$ 1190185 1174348 1156060 1137765 1120140 1102645 1085017 1067999 1052777 1039795 1028139 1016384
59226A016384j2098j1032q555o426n791n622m235j603Q27K177K841L496M550O430
$$ 1016384 1004286 993254 984699 978273 972482 966860 962625 961022 961849 964026 966867 970363 974913 981343
59212I81343R179J1626J2213J1016R780R545R469Q738Q224R003J0183R865P927
$$ 981343 990522 1002148 1014361 1025377 1035157 1044702 1054171 1062909 1071133 1080136 1090319 1100184 1108111
59199A108111O151N441M396J296l431p563r394r158q420q439q979q636o577l841
$$ 1108111 1114262 1119703 1124099 1125395 1121964 1114401 1105007 1095849 1087429 1078990 1070011 1061375 1054798 1050957
59185A050957k326k523l012k419j027Q1O95J465K671L889M639M698L951K668J787
$$ 1050957 1048631 1046108 1043096 1040677 1039650 1039731 1040426 1041891 1044562 1048451 1053090 1057788 1061739 1064407 1066194
59170A066194K114L167L660L175K574K528K618K284J714J034n81l749p231q780
$$ 1066194 1068308 1071475 1075135 1078310 1080884 1083412 1086030 1088314 1090028 1091062 1090481 1086732 1079501 1070721
59156A070721p802o150n830o721p188o286m611l288k852l170l803m231m042l194
$$ 1070721 1062919 1056769 1050939 1044218 1037030 1030744 1026133 1022845 1019993 1016823 1013020 1008789 1004747 1001553
59142A001553k056j068l89J18N90Q40M60n64j407r81P99K612L016J915N36M6O11
$$ 1001553 999497 998429 998040 998158 998748 999588 1000048 999484 998077 997096 997895 1000507 1003523 1005438 1005974 1006020 1006631
59125A006631J622K373K460K017J724K215L339M235M338M046M115M715N381N853
$$ 1006631 1008253 1010626 1013086 1015103 1016827 1019042 1022381 1026616 1030954 1035000 1039115 1043830 1049211 1055064
59111A055064O569Q049R927J0877R924P680N802N135N044M818M860N643O173M946
$$ 1055064 1061633 1069682 1079609 1090486 1100410 1108090 1113892 1119027 1124071 1128889 1133749 1139392 1145565 1150511
59097A150511K288K34k79p01k627n472p454q001q027q373r169j0383j1857j2879
$$ 1150511 1152799 1153033 1152754 1152053 1149426 1143954 1136500 1128499 1120472 1112099 1102930 1092547 1080690 1067811
59083A067811j2767j1908j1359j1437j1449j0809r663q380p219o446o153n940
$$ 1067811 1055044 1043136 1031777 1020340 1008891 998082 988419 980039 972820 966374 960221 954281
59071I54281n426m872m593m091k672o55J119K729M723O460O562N358N106P008
$$ 954281 948855 943983 939390 935299 932627 931972 933091 935820 940543 947003 953565 958923 964029 971037
59057I71037R488J0462J0041R795J0280J0673J0289R315Q269P531P180O759N744
$$ 971037 980525 990987 1001028 1010823 1021103 1031776 1042065 1051380 1059649 1067180 1074360 1081119 1086863
59044A086863M538M285N110N595M679L170K476K673K843K416J230p95k887l383
$$ 1086863 1091401 1095686 1100796 1106391 1111070 1114240 1116716 1119389 1122232 1124648 1125878 1125083 1122196 1118813
59030A118813j804q7k27j609k430k787m202o528p779p188o265o392p223p971q569
$$ 1118813 1117009 1116922 1116695 1115086 1112656 1109869 1105667 1099139 1091360 1084172 1077907 1071515 1064292 1056321 1047752
59015A047752r012r047r035r625j0153r115o757n391o380q354r323q957p858o277
$$ 1047752 1038740 1029693 1020658 1011033 1000880 991765 985008 979617 973237 964883 955560 946603 938745 932468
59001I32468m705m182m664m404k381n4P17K25j92n33j506k437k043p73l30j001
$$ 932468 927763 923581 918917 914513 912132 912078 912795 913020 912828 912295 910789 908352 906309 905536 905206 904205
58985I04205j427r81m84l17L94J971L133K620R33l34k22J013K517L540M040M794
$$ 904205 902778 901797 901313 900996 901390 903361 906494 909114 910047 909713 909491 910504 913021 916561 920601 925395
58969I25395O556R029J1077J1928J1652J0666R537R198J0320J2298J3637J3678
$$ 925395 931951 940980 952057 963985 975637 986303 995840 1005038 1015358 1027656 1041293 1054971
58957A054971J3216J3163J3306J2854J1590R903Q063O030L820J744J86o43r54
$$ 1054971 1068187 1081350 1094656 1107510 1119100 1129003 1137066 1143096 1146916 1148660 1148846 1148203 1147249
58944A147249j297k011k657k315n54J975M045M841M553M114M292M968N317M759
$$ 1147249 1145952 1143941 1141284 1138969 1138415 1140390 1144435 1149276 1153829 1157943 1162235 1167203 1172520 1177279
58930A177279L497K133J056M60M97J078J763K190K388K469K356K201K688M421
$$ 1177279 1180776 1182909 1183965 1184425 1184922 1186000 1187763 1189953 1192341 1194810 1197166 1199367 1202055 1206476
58916A206476P117R823J1786J2887J3380J3549J3527J3335J3187J3618J4811J5999
$$ 1206476 1213593 1223416 1235202 1248089 1261469 1275018 1288545 1301880 1315067 1328685 1343496 1359495
58904A359495J6226J5643J5166J4805J3522J1006Q298O144M102K009P24K57j188
$$ 1359495 1375721 1391364 1406530 1421335 1434857 1445863 1454161 1460305 1464407 1466416 1467140 1467397 1466209
58891A466209m634q122r052p868p206q124r469j0575j2053j3637j3778j2113j0294
$$ 1466209 1461575 1453453 1444401 1436533 1429327 1421203 1411734 1401159 1389106 1375469 1361691 1349578 1339284
58878A339284r528r074q093p208p135p231o716o061n932n779m865l851l982n121
$$ 1339284 1329756 1320682 1312589 1305381 1298246 1291015 1284299 1278238 1272306 1266527 1261662 1257811 1253829 1248708
58864A248708n758m816k655n63K03p57k488l412k918j815r55j71R13J931K404
$$ 1248708 1242950 1238134 1235479 1234916 1235119 1234362 1231874 1228462 1225544 1223729 1222774 1222603 1223516 1225447 1227851
58849A227851K689L509M964O691Q528J0344J1713J2419J2885J3503J3986J3938
$$ 1227851 1230540 1234049 1239013 1245704 1254232 1264576 1276289 1288708 1301593 1315096 1329082 1343020
58837A343020J3596J3411J3487J3853J4665J5333J4338J1064P317N832P363J0255
$$ 1343020 1356616 1370027 1383514 1397367 1412032 1427365 1441703 1452767 1460084 1465916 1473279 1483534
58825A483534J2699J4167J4635J3791J1694R321P570O072L720K57l258n644o928
$$ 1483534 1496233 1510400 1525035 1538826 1550520 1559841 1567411 1573483 1577203 1577460 1574202 1568558 1561630
58812A561630q119r910j1931j3429j4276j4924j5599j6032j5909j5092j3500j1302
$$ 1561630 1553511 1543601 1531670 1518241 1503965 1489041 1473442 1457410 1441501 1426409 1412909 1401607
58800A401607r288q439r021j0520j2404j4244j5195j4477j2792j2162j3630j5876
$$ 1401607 1392319 1383880 1374859 1364339 1351935 1337691 1322496 1308019 1295227 1283065 1269435 1253559
58788A253559j6911j6431j5519j4659j3284j1221r346q401q054p578p016p087
$$ 1253559 1236648 1220217 1204698 1190039 1176755 1165534 1156188 1147787 1139733 1132155 1125139 1118052
58776A118052q150r664j0689j0685r697q066o241m871m453m663m387k942r82L16
$$ 1118052 1109902 1100238 1089549 1078864 1069167 1061101 1054860 1049989 1045536 1040873 1036486 1033544 1032562 1032878
58762A032878O78P16P73O07K13J37O52J390J926K264K586K981L480L807L272J617
$$ 1032878 1033556 1034272 1035045 1035652 1035865 1036002 1036654 1038044 1039970 1042234 1044820 1047801 1051281 1055088 1058360 1059977
58746A059977j69q24n41o97j927l631n430p647r910j0735r383o989n123m208m072
$$ 1059977 1059808 1058984 1058443 1057746 1055819 1052188 1046758 1039111 1029201 1018466 1009083 1002094 996971 992763 988691
58731I88691m833o182o879o128m762m026l886l431k330r29N41J864K574K635K782
$$ 988691 983858 977676 970797 964669 959907 955881 951995 948564 946234 945305 945846 947710 950284 952919 955701
58716I55701L335L445K435J083M67K15p89k595m303n507o285o240m993l340k575
$$ 955701 959036 962481 964916 965999 966466 966681 965892 963297 958994 953487 947202 940962 935969 932629 930054
58701I30054k771l066l386m423n802n848l699n25J876K853K824K315J595Q89L77
$$ 930054 927283 924217 920831 916408 910606 904758 901059 900534 902410 905263 908087 910402 911997 912886 913263
58686I13263J89M00R16J488K092K980M128N053N526N936O513O845O689O510O497
$$ 913263 913452 913852 914768 916256 918348 921328 925456 930509 936035 941971 948484 955329 962018 968528 975025
58671I75025N916M403L092L283M565N520N694N676N574M872L645K661K367K695
$$ 975025 980941 985344 988436 991719 996284 1001804 1007498 1013174 1018748 1023620 1027265 1029926 1032293 1034988
58657A034988L636N006N963N888N371N322N627N748N854N941M734J357k528m436
$$ 1034988 1038624 1043630 1049593 1055481 1060852 1066174 1071801 1077549 1083403 1089344 1094078 1095435 1092907 1088471
58643A088471m573n354p545r408j0039j0884j2994j5099j5683j5254j5154j5589
$$ 1088471 1083898 1078544 1070999 1061591 1051552 1040668 1027674 1012575 996892 981638 966484 950895
58631I50895j5979j6003j5346j3622j1386r939r367q345o680o167p706r348q911
$$ 950895 934916 918913 903567 889945 878559 868620 859253 850908 844228 838061 830355 821007 812096
58618H12096p045n853n678n273m156k751r11J592L573L576K390K421M360O320
$$ 812096 805051 799198 793520 788247 784091 781340 780429 782021 785594 789170 791560 793981 798341 804661
58604H04661O769O529P125Q424Q957P833N572L354J914Q83p88l409n778o459n572
$$ 804661 811430 817959 825084 833508 842465 850298 855870 859224 861138 862021 861233 857824 852046 845587 840015
58589H40015m433l680k955k507l442n722p237o202l638k110k416k956k375j229
$$ 840015 835582 831902 828947 826440 822998 817276 810039 803837 800199 798089 795673 792717 790342 789113
58575G89113n30JJ129K445K934K831L503N207O356N605L738K514K343K095R56
$$ 789113 788583 788584 789713 792158 795092 797923 801426 806633 812989 818594 822332 824846 827189 829284 830240
58560H30240m30p40O13K856M396M286L306L050L688L598J856mnJ400K099J453
$$ 830240 829810 829070 829683 832539 836935 841221 844527 847577 851265 854863 856719 856715 856710 858110 860209 861662
58544H61662Q76J314J994K045J742J505J097M64J00q7r95k608l344k035M40K502
$$ 861662 862538 863852 865846 867891 869633 871138 872235 872699 872799 872712 871717 869109 865765 863730 864170 866672
58528H66672L749M483M582M219M743P100R894J0812R900R688J1722J4503J5633
$$ 866672 870421 874904 879486 883705 888448 895548 905442 916254 926154 935842 947564 962067 977700
58515I77700J4878J4021J4269J4869J4404J2763J1442J2055J4853J8629K1866
$$ 977700 992578 1006599 1020868 1035737 1050141 1062904 1074346 1086401 1101254 1119883 1141749
58504A141749K3786K4535K4706K4738K4697K4558K4674K5469K6516K6424K4299
$$ 1141749 1165535 1190070 1214776 1239514 1264211 1288769 1313443 1338912 1365428 1391852 1416151
58493A416151K0897J7652J4757J1139O256R46l587o734q269q207p365p204q437
$$ 1416151 1437048 1454700 1469457 1480596 1486852 1487798 1484211 1477477 1469208 1461001 1453636 1446432 1437995
58480A437995j0354j2032j3616j5830j8659k1207k2720k3294k3512k3625k3211
$$ 1437995 1427641 1415609 1401993 1386163 1367504 1346297 1323577 1300283 1276771 1253146 1229935
58469A229935k1841k0052j9000j8748j7658j4532j0790r066r711j0191q427n324
$$ 1229935 1208094 1188042 1169042 1150294 1132636 1118104 1107314 1098248 1088537 1078346 1069919 1064595
58457A064595l309l425m791o086o669o581o211n867n445m662l528k118k34J902
$$ 1064595 1061286 1057861 1053070 1046984 1040315 1033734 1027523 1021656 1016211 1011549 1008021 1005903 1005669 1007571
58443A007571K984J918l16j453p74K19L21J31M72R33J077J724L678O021P000O165
$$ 1007571 1010555 1012473 1012157 1010704 1009930 1010149 1010470 1010601 1011073 1012006 1013083 1014807 1018485 1024506 1031506 1037671
58427A037671M629L670L933N434P483Q930R213Q939R131J0311J2532J5473J8134
$$ 1037671 1042300 1045970 1049903 1055337 1062820 1071750 1080963 1089902 1099033 1109344 1121876 1137349 1155483
58414A155483J9291J8775J7509J5930J3373R581N709L053J617O59k80j510l360
$$ 1155483 1174774 1193549 1211058 1226988 1240361 1249942 1255651 1258704 1260321 1260980 1260700 1259190 1255830
58401A255830n331n989m611k152J13K016L788M997N255N231N869P116Q165Q367
$$ 1255830 1250499 1244510 1239899 1237747 1237860 1239876 1243664 1248661 1253916 1259147 1265016 1272132 1280297 1288664
58387A288664P248M547R09k258m359o169q153r414r224q419q080p800o539m460
$$ 1288664 1295912 1300459 1301368 1299110 1294751 1288582 1280429 1271015 1261791 1253372 1245292 1237492 1230953 1226493
58373A226493k610j348k63P98J610K191K762L380M143N223O363P023P258P537
$$ 1226493 1223883 1222535 1222272 1223070 1224680 1226871 1229633 1233013 1237156 1242379 1248742 1255765 1263023 1270560
58359A270560P534O440M695L824M123M210L362K337J050k063p032j1002j1681
$$ 1270560 1278094 1284534 1289229 1293053 1297176 1301386 1304748 1307085 1308135 1306072 1299040 1288038 1276357
58346A276357j0219q782p323n006k880k405k590j304J343L351L772L200K080P36
$$ 1276357 1266138 1257356 1250033 1245027 1242147 1239742 1237152 1235848 1237191 1240542 1244314 1247514 1249594 1250330
58332A250330K66J411L135M168M896N786N509L167J064K060N033O232M798L600
$$ 1250330 1250596 1252007 1255142 1259310 1264206 1269992 1275501 1278668 1279732 1281792 1286825 1293057 1297855 1301455
58318A301455M412N550N120L852L528M556O192P664Q347P996P301P255P969Q932
$$ 1301455 1305867 1311417 1316537 1320389 1323917 1328473 1334665 1342329 1350676 1358672 1365973 1373228 1381197 1390129
58304A390129J0048J1371J2526J3589J5563J8497K0396J9763J8136J7968J9102
$$ 1390129 1400177 1411548 1424074 1437663 1453226 1471723 1492119 1511882 1530018 1547986 1567088
58293A567088J9607J8934J7713J5541J1843Q192O712O835O494N962P212R935J1645
$$ 1567088 1586695 1605629 1623342 1638883 1650726 1658918 1665630 1672465 1678959 1684921 1692133 1702068 1713713
58280A713713J1780J2277J3890J5208J5694J6489J7653J7787J7111J7791K0451
$$ 1713713 1725493 1737770 1751660 1766868 1782562 1799051 1816704 1834491 1851602 1869393 1889844
58269A889844K3124K4452K5091K5294K4129K1927K0554K0293J9263J6995J5614
$$ 1889844 1912968 1937420 1962511 1987805 2011934 2033861 2054415 2074708 2093971 2110966 2126580
58258B126580J6288J7239J6781J5753J5436J5387J4874J4547J5271J6966J9413
$$ 2126580 2142868 2160107 2176888 2192641 2208077 2223464 2238338 2252885 2268156 2285122 2304535
58247B304535K2571K5586K7366K8509L0467L2706L3246L2279L2300L4101L5729
$$ 2304535 2327106 2352692 2380058 2408567 2439034 2471740 2504986 2537265 2569565 2603666 2639395
58236B639395L6279L7565M0648M3703M4985M5473M6962M9530N2179N4121N4619
$$ 2639395 2675674 2713239 2753887 2797590 2842575 2888048 2935010 2984540 3036719 3090840 3145459
58225C145459N3558N2682N4060N6872N8273N7825N8269O1305O5482O9062P2085
$$ 3145459 3199017 3251699 3305759 3362631 3420904 3478729 3536998 3598303 3663785 3732847 3804932
58214C804932P4847P7187Q0019Q4791R0774R5726R9619J04576J10872J16412J20527
$$ 3804932 3879779 3956966 4036985 4121776 4212550 4308276 4407895 4512471 4623343 4739755 4860282
58203D860282J24741J29488J33857J38852J46640J56149J64009J70313J78613
$$ 4860282 4985023 5114511 5248368 5387220 5533860 5690009 5854018 6024331 6202944
58194F202944J89443J99316K07371K17367K31295K46541K61525K78443K97879
$$ 6202944 6392387 6591703 6799074 7016441 7247736 7494277 7755802 8034245 8332124
58185H332124L16252L31742L47567L66238L85621M03891M23345M45783M68887
$$ 8332124 8648376 8980118 9327685 9693923 10079544 10483435 10906780 11352563 11821450
58176A1821450M90727N13564N40025N69780O02894O41734O86771P35146P85859
$$ 11821450 12312177 12825741 13365766 13935546 14538440 15180174 15866945 16602091 17387950
58167A7387950Q41278R01452R62940J025848J095466J174253J259078J349386
$$ 17387950 18229228 19130680 20093620 21119468 22214934 23389187 24648265 25997651
58159B5997651J450639J566279J694138J834222J991371K166092K352209K548942
$$ 25997651 27448290 29014569 30708707 32542929 34534300 36700392 39052601 41601543
58151D1601543K766262L013251L290949L602429L959206M370585M836313N355703
$$ 41601543 44367805 47381056 50672005 54274434 58233640 62604225 67440538 72796241
58143G2796241N933313O571186P270658Q050074Q946481R991516J1198454J2572019
$$ 72796241 78729554 85300740 92571398 100621472 109567953 119559469 130757923 143329942
58135A43329942J4099973J5722330J7344618J8915923K0486308K2180800K4128349
$$ 143329942 157429915 173152245 190496863 209412786 229899094 252079894 276208243
58128B76208243K6347458K8500729K9610686K8159273K2861630J3678613K150491
$$ 276208243 302555701 331056430 360667116 388826389 411688019 425366632 427517123
58121D27517123r346804j8802633k5278153k8813297k9958793k9406491k7809313
$$ 427517123 418170319 399367686 374089533 345276236 315317443 285910952 258101639
58114B58101639k5686883k3386916k1114391j8980615j7025673j5237368j3591409
$$ 258101639 232414756 209027840 187913449 168932834 151907161 136669793 123078384
58107A23078384j2080369j0704827r457684q331377p327112o444391n671683m996686
$$ 123078384 110998015 100293188 90835504 82504127 75177015 68732624 63060941 58064255
58099E8064255m415654l924182l508601l154410k854160k599959k377693k176271
$$ 58064255 53648601 49724419 46215818 43061408 40207248 37607289 35229596 33053325
58091C3053325j994660j833177j686002j548679j424811j318044j224402j138960
$$ 33053325 31058665 29225488 27539486 25990807 24565996 23247952 22023550 20884590
58083B0884590j063205r98978r41508q85208q31055p81967p36117o91012o49234
$$ 20884590 19821385 18822407 17880899 16995691 16164636 15382669 14646552 13955540 13306306
58074A3306306o13725n81529n48202n14774m84811m57964m31803m07090l85983
$$ 13306306 12692581 12111052 11562850 11048076 10563265 10105301 9673498 9266408 8880425
58065H880425l67454l49156l31739l17115l04435k91500k78273k65815k53721
$$ 8880425 8512971 8163815 7832076 7514961 7210526 6919026 6640753 6374938 6121217
58056F121217k41487k30250k20607k10966k00449j91016j84331j79076j73431
$$ 6121217 5879730 5649480 5428873 5217907 5017458 4826442 4642111 4463035 4289604
58047D289604j67647j62113j55767j48412j41714j36035j29523j22037j16306
$$ 4289604 4121957 3959844 3804077 3655665 3513951 3377916 3248393 3126356 3010050
58038C010050j13126j09365j03227r7393r4029r0772q5249p9692p6952p5243p1112
$$ 3010050 2896924 2787559 2684332 2586939 2492910 2402138 2316889 2237197 2160245 2085002 2013890
58027B013890o5100o0145n6536n2503m8136m4901m2535l9834l7243l5734l4507
$$ 2013890 1948790 1888645 1832109 1779606 1731470 1686569 1644034 1604200 1566957 1531223 1496716
58016A496716l2464l0480k9534k8485k6382k5072k6342k8246k7492k4162k1018
$$ 1496716 1464252 1433772 1404238 1375753 1349371 1324299 1297957 1269711 1242219 1218057 1197039
58005A197039j9351j8456j8009j8080j7799j6654j6056j7179j8524j8180j7101
$$ 1197039 1177688 1159232 1141223 1123143 1105344 1088690 1072634 1055455 1036931 1018751 1001650
57994A001650j7315j8269j7978j6772j6664j7563j7222j4850j2216j1039j1349
$$ 1001650 984335 966066 948088 931316 914652 897089 879867 865017 852801 841762 830413
57983H30413j2338j3055j2597j1057r824r669r445q046o323n600n684n999p111
$$ 830413 818075 805020 792423 781366 771542 761873 752428 744382 738059 732459 726775 720776 713665
57970G13665r150j0416r719q696r403j1068j1603j1002j0647j0479r549q300p742
$$ 713665 704515 694099 684380 675684 666281 655213 643610 632608 621961 611482 601933 593633 585891
57957E85891p319o165n321n936o454m741k007j240k281k059L53K408K328J282
$$ 585891 578572 572407 567086 561150 554696 549955 547948 546708 544427 542368 542721 545129 547457 548739
57943E48739N30o48k791m535m524l399k618k561k806l122l440l669m016m900o302
$$ 548739 549269 548621 545830 541295 536771 533372 530754 528193 525387 522265 518825 515156 511140 506240 499938
57928D99938p674q441q169o901n729n991p125o821m480k813m025o121n503k129
$$ 499938 492264 483823 475654 468753 463024 457033 449908 443087 438607 435794 431769 425648 420145 418016
57914D18016P62J426J123J060P68M6j15O08J113O66j35o45q59o27K63R38J27j695
$$ 418016 418778 420204 421327 422387 423155 423201 423086 423694 424807 425473 425338 424693 423834 423207 423470 424408 424535 422840
57896D22840k445j114J031K284K117P69j321l237l970l457k416j196K34J473K025
$$ 422840 420395 419281 420312 422596 424713 425482 424161 420924 416954 413497 411081 409885 410119 411592 413617
57881D13617K187K395K156R85j30J56J460K465L251M740O260O025M153K767K704
$$ 413617 415804 418199 420355 421340 421210 421366 422826 425291 428542 433282 439542 445567 449720 452487 455191
57866D55191K382O39j421k391k583k977l506l482k894k440k817m175n667n763
$$ 455191 457573 458212 456791 454400 451817 448840 445334 441852 438958 436518 433701 429526 423859 418096
57852D18096l971j778q28p11r6P11M27n17l26J065J733R61K49N94J084R43P77
$$ 418096 414125 412347 411519 410808 410712 411423 411850 411333 411007 412072 413805 414766 415015 415609 416693 417636 418413
57835D18413Q17P9j554k439j618l62J7J65J078K044J851P92K1k22m54r68j980
$$ 418413 419230 419309 417755 415316 413698 413336 413353 413518 414596 416640 418491 419283 419304 419082 418628 417660 415680
57818D15680l755n619o050m758l576m036n251n486m647l749k874j425K15R34O18
$$ 415680 411925 406306 400256 395498 391922 387886 382635 377149 372502 368753 365879 364454 364669 365603 366221
57803C66221L00O69J518K448L062K750J398J85N83K497M328N010N086N395N610
$$ 366221 366521 367190 368708 371156 374218 376968 378366 378551 379134 381631 385959 390969 396055 401450 407060
57788D07060M807L134J970K147K674J944l3j611j789j484j892k802l460m072n100
$$ 407060 411867 415001 416971 419118 421792 423736 423703 422092 420303 418819 416927 414125 410665 406593 401493
57773D01493n896n589m759m564m632l689k109j726k888l663k555l39J384K021
$$ 401493 395597 390008 385249 380685 376053 372364 370255 368529 365641 361978 359423 359084 360468 362489
57759C62489J696O46m90j067j587l150n486p071p481p854q541q367p048o157o440
$$ 362489 364185 364831 364341 363274 361687 358537 353051 345980 338499 330645 322104 313737 306689 300532 294092
57744B94092o217m044j295j96o59r91o68m54l50O04K611M595N476N133M231L626
$$ 294092 287875 283831 282536 282340 281681 280690 280022 279568 279218 279822 282433 287028 292504 297637 301868 305494
57728C05494L554L241K069J213K634O024Q479Q113O347N283M664L121J010q5K24
$$ 305494 309048 312289 314358 315571 318205 324229 332708 340821 347168 352451 357115 360236 361246 361161 361385
57713C61385J114K186L282L354J483j385l353l880l704l156k322k267m120o965
$$ 361385 362499 364685 367967 371321 372804 371419 368066 364186 360482 357326 355004 352737 348617 341652
57699C41652q576q270p358o808o123m725k918j115N42J609J702J528K272L820
$$ 341652 333076 324806 317448 310640 304517 299792 296874 295759 296301 297910 299612 301140 303412 307232
57685C07232M818M614L809K874J732Q90J302K700L552L373L455M461M890L267
$$ 307232 312050 316664 320473 323347 325079 325969 327271 329971 333523 336896 340351 344812 349702 352969
57671C52969O96l03J006K927L683L189K415K020J958J859J281K2j467k110j127
$$ 352969 353665 353362 354368 357295 360978 364167 366582 368602 370560 372419 373700 373722 372255 370145 369018
57656C69018R10K408K436J756J632J912J243p46k590k878k073j685k318l364l985
$$ 369018 369928 372336 374772 376528 378160 380072 381315 380569 377979 375101 373028 371343 369025 365661 361676
57641C61676l573j847M65J645Q45m42p1J834L052K215J93j694l291m817n757n577
$$ 361676 358103 356256 356721 358366 359211 358769 358698 360532 363584 365799 365992 364298 361007 356190 350433 344856
57625C44856m795m265l820k462J64L150N293O297O866P856R492J1436J3469J5823
$$ 344856 340061 335796 331976 329514 329678 332828 338121 344418 351284 359140 368632 380068 393537 409360
57611D09360J8832K2573K7002L2015L6883L9851L8798L2484K1265O950p797k0437
$$ 409360 428192 450765 477767 509782 546665 586516 625314 657798 679063 686013 678216 657779
57599F57779k9570l5107l7412l6725l3599k9288k5195k2099k0129j8994j7940
$$ 657779 628209 593102 555690 518965 485366 456078 430883 408784 388655 369661 351721
57588C51721j6096j3384j0639q547p072o265o611p800q191o659m248k748k236
$$ 351721 335625 322241 311602 303055 295983 289718 283107 275307 267116 260457 256209 253461 251225
57575B51225j476l72k23j390k318j577J88J143M37j086k005j655n91J07j5m41
$$ 251225 249749 249377 249154 247764 245446 243869 244057 245200 245637 244551 242546 240891 240300 240407 240392 239951
57559B39951o15p49j320k173k794l071l153k909k301j989k674l940m490l569j613
$$ 239951 239336 238587 237267 235094 232300 229229 226076 223167 220866 218877 216203 212263 207773 204204 202591
57544B02591L11J108K11j683k790k005k77O00K23l70n40p55j530k617l385l247
$$ 202591 202902 204010 204221 202538 199748 197743 197466 198066 198289 197919 197379 196624 195094 192477 189092 185845
57528A85845j955k15M01q00k436k759k149k367l689m545m064l160k647k112j270
$$ 185845 183890 183675 184076 183276 180840 178081 175932 173565 169876 165331 161267 158107 155460 153348 152078
57513A52078p73p51p8J684K933K004l76j992j892r39p1O62J267J305O15j39j93
$$ 152078 151305 150554 150476 152160 155093 157097 156721 154729 152837 151898 151827 152489 153756 155061 155676 155537 155344
57496A55344L34O30L52J81Q75J946K035P78n38p51m38q00j730k191k031j899j664
$$ 155344 155678 156308 156660 156841 157716 159662 161697 162475 161937 161186 160748 159948 158218 156027 153996 152097 150433
57479A50433n97Q38J173K86j85M55O29j032l231l572j761K31Q56N65P01J751K951
$$ 150433 149836 150674 151847 152133 151948 152403 153032 152000 148769 145197 143436 143667 144523 145088 145789 147540 150491
57462A50491L186K217R63M91Q57J357J688K055K340K195J962K358L033K789J502
$$ 150491 153677 155894 156857 157348 158205 159562 161250 163305 165645 167840 169802 172160 175193 177982 179484
57447A79484M72K65k75j998l831m413m181m396m990m834l710k516j824j442j328
$$ 179484 179956 180221 179946 177948 174117 169704 165523 161127 156137 151303 147593 145077 143253 141811 140483
57432A40483j818k821l630l621k677j138K79Q61P36Q75J726K516K455J981J891
$$ 140483 138665 135844 132214 128593 125916 124778 125057 125918 126654 127529 129255 131771 134226 136207 138098
57417A38098J966J527Q38P29J181J387R92J88j134l125m976n420m362k925j764
$$ 138098 140064 141591 142429 143158 144339 145726 146718 146906 145772 142647 137671 132251 127889 124964 123200
57402A23200n65O44R52o8j468k114j996j679j191l63J67o77k911m992n129l004
$$ 123200 122635 123279 124231 124163 122695 120581 118585 116906 115715 115352 115519 114842 111931 106939 101810 98806
57386I8806j12J519J002q58k495k961k351j243n4J064K073K860L184K786J790
$$ 98806 98694 100213 101215 100357 97862 94901 92550 91307 91253 92317 94390 97250 100434 103220 105010
57371A05010P89L01J72j26p06j090r07l51J72N73R24J081Q41L82J14J7m05j316
$$ 105010 105799 106100 106272 106146 105440 104350 103443 103092 103264 103837 104761 105842 106683 107065 107179 107196 106791 105475
57353A05475k083k026j296m41M91J700K610K193N20j070j720j872j853r59J000
$$ 105475 103392 101366 100070 99629 100120 101820 104430 106623 107143 106073 104353 102481 100628 99669 100669
57338A00669K470K099R23R06J886K012R69M92J397K300K028J391J507J995K031
$$ 100669 103139 105238 106161 107067 108953 110965 111934 112426 113823 116123 118151 119542 121049 123044 125075
57323A25075J775J525P63o28j328l25J229J472N58L85J882L922M910M295K527
$$ 125075 126850 128375 129138 128510 127182 126857 128086 129558 130116 130501 132383 136305 141215 145510 148037
57308A48037N16p95r87m42K06O74Q50O29L11M60Q71N37o98j503q99K58P35Q27
$$ 148037 148553 147758 146771 146329 146535 147209 148059 148688 148999 149459 150330 150867 150169 148666 147767 148025 148760 149587
57290A49587J440K151J895R78O40Q48L57r29j358J55K565L997L685K249R39Q64
$$ 149587 151027 153178 155073 156051 156691 157539 157896 156967 155609 155764 158329 162326 166011 168260 169199 170063
57274A70063K172L650L875K883J949J787J968K236L114M633N542M646K453P31
$$ 170063 172235 175885 179760 182643 184592 186379 188347 190583 193697 198330 203872 208518 210971 211702
57260B11702P82K580N364Q333J0778J2020J1736J0390R132Q879R565J0582J1694
$$ 211702 212484 215064 220428 228761 239539 251559 263295 273685 282817 291696 301261 311843 323537
57247C23537J2902J3526J2635J0730R801J0866J2463J2619J1477J0693J0908J1220
$$ 323537 336439 349965 362600 373330 383131 393997 406460 419079 430556 441249 452157 463377
57235D63377J0885J0137R366Q697Q401Q665Q843P929O000M428M531O517R531J2075
$$ 463377 474262 484399 493765 502462 510863 519528 528371 536300 542300 546728 551259 557776 567307 579382
57221E79382J2729J1340R362Q338Q381Q762R215R599R063P071M876M417N961Q204
$$ 579382 592111 603451 612813 621151 629532 638294 647509 657108 666171 673242 678118 682535 688496 696700
57207F96700J0325J2341J3776J3869J3181J3105J3687J3829J3808J5318J8310
$$ 696700 707025 719366 733142 747011 760192 773297 786984 800813 814621 829939 848249
57196H48249K0119J9048J6884J6338J7459J8264J7819J6941J6431J6183J5839
$$ 848249 868368 887416 904300 920638 938097 956361 974180 991121 1007552 1023735 1039574
57185A039574J5298J4762J4882J6376J8899K0930K1399K0825K0241J9909J9682
$$ 1039574 1054872 1069634 1084516 1100892 1119791 1140721 1162120 1182945 1203186 1223095 1242777
57174A242777J9743K0011J9756J8838J8628K0492K3999K7668L0965L4311L7605
$$ 1242777 1262520 1282531 1302287 1321125 1339753 1360245 1384244 1411912 1442877 1477188 1514793
57163A514793M0186M2144M4272M6580M7934M7572M6024M4268M2691M1352M0448
$$ 1514793 1554979 1597123 1641395 1687975 1735909 1783481 1829505 1873773 1916464 1957816 1998264
57152A998264M0038L9636L8626L6887L4731L2459L0370K9052K9118L0574L2775
$$ 1998264 2038302 2077938 2116564 2153451 2188182 2220641 2251011 2280063 2309181 2339755 2372530
57141B372530L5293L8356M2025M5309M7051M7600M8517N0325N1634N1316N0442
$$ 2372530 2407823 2446179 2488204 2533513 2580564 2628164 2676681 2727006 2778640 2829956 2880398
57130B880398N0953N3152N5850N8319O0647O2533O3393O3799O5213O7816O9862
$$ 2880398 2931351 2984503 3040353 3098672 3159319 3221852 3285245 3349044 3414257 3482073 3551935
57119C551935O9569O6808O2673N8453N5167N3092N1425M9230M6680M4466M2277
$$ 3551935 3621504 3688312 3750985 3809438 3864605 3917697 3969122 4018352 4065032 4109498 4151775
57108D151775L9255L5778L3220L1889L0927L0357L1178L3138L4503L4717L5276
$$ 4151775 4191030 4226808 4260028 4291917 4322844 4353201 4384379 4417517 4452020 4486737 4522013
57097D522013L7011L8565L8761L8584L9342M0561M1171M1204M0830L9321L6653
$$ 4522013 4559024 4597589 4636350 4674934 4714276 4754837 4796008 4837212 4878042 4917363 4954016
57086D954016L4643L4756L6022L6880L7522L8355L7623L3082K5263J6689Q463
$$ 4954016 4988659 5023415 5059437 5096317 5133839 5172194 5209817 5242899 5268162 5284851 5293314
57075E293314k4q544j5868k2249k9674l9125m9408n9094o8044p6580q4690r2555
$$ 5293314 5293290 5284746 5268878 5246629 5216955 5177830 5128422 5069328 5001284 4924704 4840014 4747459
57063D747459j00911j10448j21760j35720j52932j72840j94313k16887k40470
$$ 4747459 4646548 4536100 4414340 4278620 4125688 3952848 3758535 3541648 3301178
57054C301178k64320k87319l08881l28412l44580l56417l64554l69823C05703
$$ 3301178 3036858 2749539 2440658 2112246 1767666 1411249 1046695 676872 305703
57044f0655l54079l33820l04867k67538k24847j80708j37174r5789o0278l3488
$$ -60655 -414734 -748554 -1053421 -1320959 -1545806 -1726514 -1863688 -1959477 -2019755 -2053243
57034b053243j1721J1666L2965L5283J4862K2616J72746N77992C8423J958656
$$ -2053243 -2064964 -2053298 -2020333 -1985050 -1970188 -1947572 -1774826 -1196834 38423 1997079
57024A997079K453122K507016K150891J633816J231280J056558J030137R97654
$$ 1997079 4450201 6957217 9108108 10741924 11973204 13029762 14059899 15057553
57016A5057553Q63469O35754L87113J93461R5065Q6958J30922J78297J90177J45956
$$ 15057553 15921022 16556776 16943889 17137350 17232415 17319373 17450295 17628592 17818769 17964725
57006A7964725M2556j08779k86247m63334o15560p25002p82242p86835p46291
$$ 17964725 18007281 17898502 17612255 17148921 16533361 15808359 15026117 14239282 13492991
56997A3492991o73172n81613m84543l91521l07536k33940j71007j19329p9080
$$ 13492991 12819819 12238206 11753663 11362142 11054606 10820666 10649659 10530330 10451250
56988A0451250m9253k8506j5921j0157q494p900p063o558p068q285r861j2464
$$ 10451250 10401997 10373491 10357570 10347413 10338919 10331019 10323956 10317398 10310330 10302045 10292184 10279720
56976A0279720j6647k0682k0686j3893j818R992J4786O936j6638n4469r9285j40838
$$ 10279720 10263073 10242391 10221705 10207812 10205994 10215986 10230772 10237708 10221070 10166601 10067316 9926478
56964I926478j71944j91607k02202k05374k01933j94112j85340j77749j71405
$$ 9926478 9754534 9562927 9360725 9155351 8953418 8759306 8573966 8396217 8224812
56955H224812j65758j60415j54602j47633j40150j33600j28255j23070j17859
$$ 8224812 8059054 7898639 7744037 7596404 7456254 7322654 7194399 7071329 6953470
56946F953470j14275j14153j17980j25333j35463j46734j56841j64619j70931
$$ 6953470 6839195 6725042 6607062 6481729 6346266 6199532 6042691 5878072 5707141
56937E707141j76994j82618j86791j89134j89814j88731j85800j81639j77103
$$ 5707141 5530147 5347529 5160738 4971604 4781790 4593059 4407259 4225620 4048517
56928D048517j72447j67588j62662j57544j51367j43449j34515j26174j19423
$$ 4048517 3876070 3708482 3545820 3388276 3236909 3093460 2958945 2832771 2713348
56919B713348j14376j10929j08780j06907j04039r9641r3762q6338p7718o9525
$$ 2713348 2598972 2488043 2379263 2272356 2168317 2068676 1974914 1888576 1810858 1741333
56909A741333o3677o0265n7519n3978m9563m4411l8151l1064k4638j9872j5997
$$ 1741333 1677656 1617391 1559872 1505894 1456331 1411920 1373769 1342705 1318067 1298195 1282198
56898A282198j1975q477p149q536j1966j7019k3438k9695l3329l3497l2062l1448
$$ 1282198 1270223 1261746 1254597 1246061 1234095 1217076 1193638 1163943 1130614 1097117 1065055 1033607
56886A033607l2135l2813l2297l0434k7642k4459k1510j9196j7285j5090j2128
$$ 1033607 1001472 968659 936362 905928 878286 853827 832317 813121 795836 780746 768618
56875G68618q524m892j917R6J437K482K831J266k991r182j5459k0337k3425k5007
$$ 768618 760094 755202 753285 753381 754818 757300 760131 761397 758406 749224 733765 713428 690003 664996
56861F64996k5465k5154k4337k2973k0847j8207j6063j5333j5644j5353j3175
$$ 664996 639531 614377 590040 567067 546220 528013 511950 496617 480973 465620 452445
56850D52445r588o236m128k992k389k461l091l195j884J65J549K110K853M016
$$ 452445 442857 436621 432493 429501 427112 424651 421560 418365 416481 416646 418195 420305 423158 427174
56836D27174M681M562M794O107P542Q066Q435J0080J2715J4558J4660J3705J2384
$$ 427174 431855 436417 441211 447318 454860 462926 471361 481441 494156 508714 523374 537079 549463
56823E49463J0358P274L775P48j802m374o773p988p409n729m303l636k825o89
$$ 549463 559821 567095 570870 571618 569816 565442 558669 550681 543272 537543 533240 529604 526779 526090
56809E26090K772O538R940J3127J6123J8363J9795K1564K4697K8528L1160L1119
$$ 526090 528862 535400 545340 558467 574590 592953 612748 634312 659009 687537 718697 749816
56797G49816K7825K1084J1383O80q319j4102j7040j8137j7842j6271j3798j0834
$$ 749816 777641 798725 810108 810788 802469 788367 771327 753190 735348 719077 705279 694445
56785F94445p393l153K036P706J2826J6740K0281K5308L2447L9854M5061M7534
$$ 694445 687052 683899 685935 693641 706467 723207 743488 768796 801243 841097 886158 933692
56773I33692M8254M7083M2159L2187J8174K453j2989k6580l6668m1956m2464l9618
$$ 933692 981946 1029029 1071188 1103375 1121549 1124002 1111013 1084433 1047765 1005809 963345 923727
56761I23727l5475l1633k8326k4515j9339j3371p815k785K579Q369J3610J7989
$$ 923727 888252 856619 828293 803778 784439 771068 763253 760468 763047 771416 785026 803015
56749H03015K2490K7572L1693L2574K9253K2167J2017l38j3205k4356l2221l6559
$$ 803015 825505 853077 884770 917344 946597 968764 980781 980443 967238 942882 910661 874102
56737H74102l8095l7794l6294l3801l0513k7004k3701k0201j5885j1194p344m659
$$ 874102 836007 798213 761919 728118 697605 670601 646900 626699 610814 599620 592276 587617
56725E87617k206O02L164M923O256P377P355N241J414l133q127j3569j8580k1883
$$ 587617 585411 586013 589177 594100 600356 607733 615088 620329 621743 618610 610483 596914 578334 556451
56711E56451k3155k2964k1794k0079j8777j8618j8821j7800j5269j2707j1499
$$ 556451 533296 510332 488538 468459 449682 431064 412243 394443 379174 366467 354968
56700C54968j1453j1501j1079j0331r480q504p316o001m867m239m096m059l846
$$ 354968 343515 332014 320935 310604 301124 292620 285304 279303 274436 270197 266101 262042 258196
56687B58196l605l539l537l372l109k979l098l433l750l454k064r9J110R85M93
$$ 258196 254591 251052 247515 244143 241034 238055 234957 231524 227774 224320 222256 222157 223267 224252 224745
56672B24745P57J487J593R59N41P90R84K87j129k304k436j509k77L94M37O33J430
$$ 224745 225502 226989 228582 229541 230082 230872 231856 232143 231014 228710 226274 224765 224488 224882 225319 225952 227382
56655B27382K064J391o07k764m041m332l999l271k212r13M23J362J392M69o74
$$ 227382 229446 230837 230230 227466 223425 219093 215094 211823 209611 208698 209121 210483 211875 212344 211670
56640B11670j146p31J90J254K229K786K704K285K105K370K827L090K787J729L64
$$ 211670 210524 209793 209983 211237 213466 216252 218956 221241 223346 225716 228543 231633 234420 236149 236513
56625B36513k92K04R49P44k79r57q27n78o24l19P92J724J027j207l305m018l788
$$ 236513 236221 236425 237374 238118 237839 236882 236055 235477 234853 234534 235326 237050 238077 236870 233565 229547 225759
56608B25759l547l073j554M64J110k17j561q01J471K993L181L580M956N981N549
$$ 225759 222212 219139 217585 218049 219159 218942 217381 216580 218051 221044 224225 227805 232761 238742 244291
56593B44291M575M360M600M324L646L175K802K475L089M868N796L813Q0k218k218
$$ 244291 248866 253226 257826 262150 265796 268971 271773 274248 277337 282205 288001 291814 291894 289676 287458
56578B87458k276m047n977n812l836k149j814k165k301j965j149Q6J371K292K951
$$ 287458 285182 281135 275158 269346 265510 263361 261547 259382 257081 255116 253967 254053 255424 257716 260667
56563B60667L814M906N613N437M673M071L834L349K195J128J292K520L278K691
$$ 260667 264481 269387 275000 280437 285110 289181 293015 296364 298559 299687 300979 303499 306777 309468
56549C09468J657J390J686J596J063Q34J129J454J429R42j40j462j927j071j19
$$ 309468 311125 312515 314201 315797 316860 317694 318823 320277 321706 322648 322508 321046 319119 318048 317929
56534C17929n22j877k642k312j411M9K055K957Q94k837m367k114J144K223J416
$$ 317929 317407 315530 312888 310576 309165 309214 311269 314226 315120 312283 307916 305802 306946 309169 310585
56519C10585Q95J138J191J085J720K762K818J680P32R57J855K538K908L437M548
$$ 310585 311480 312618 313809 314894 316614 319376 322194 323874 324606 325563 327418 329956 332864 336301 340849
56504C40849O323Q140Q771P594N769N398P272R931J1124R800O662L187L42j812
$$ 340849 347172 355312 364083 371677 377446 382844 390116 400047 411171 420971 427633 430820 431162 429350
56490D29350l394l943l031j559j380l095n053n413m535m216m964n370m291k420
$$ 429350 425956 422013 418982 417423 416043 412948 407895 402482 397947 393731 388767 383397 379106 376686
56476C76686j233j157j368r53K11J446J827R71n30j696k255k737l307l088j372
$$ 376686 375453 374296 372928 371975 372186 373632 375459 376430 375900 374204 371949 369212 365905 362817 361445
56461C61445Q37J444l02k622l084j344O77J130L1j431k470l112l542l740l605
$$ 361445 362282 363726 363424 360802 357718 356374 357051 358181 358212 356781 354311 351199 347657 343917 340312
56446C40312k992j811m38K82nn40l08O12J159O53m92j334j196o8J292J803J190
$$ 340312 337320 335509 335071 335353 335348 334808 334500 335112 336271 336924 336432 335098 333902 333834 335126 336929 338119
56429C38119M82P97J792K033P83j217k704k993k252j302r87j241j003K83J654
$$ 338119 338601 339398 341190 343223 344006 342789 340085 337092 334840 333538 332551 331310 330307 330590 332244
56414C32244J940J570J849K888L614L646L558L313K168M39m45j64j55j199k060
$$ 332244 334184 335754 337603 340491 344105 347751 351309 354622 356790 357229 356784 356620 356465 355266 353206
56399C53206j648r31j255j927j193R80K778K939K009J100M92k32j315k314k388
$$ 353206 351558 350627 349372 347445 346252 347232 350010 352949 354958 356058 356550 356318 355003 352689 350301
56384C50301j147P29K066K314J631J62j786k935j903P59K684K533J509J324J961
$$ 350301 349154 349883 351949 354263 355894 356056 354270 351335 349432 350191 352875 355408 356917 358241 360202
56369C60202K345J994R00j038l176l847k398o77q32k331k830j532J23R62J486
$$ 360202 362547 364541 365441 364403 361227 357380 354982 354305 353473 351142 348312 346780 346903 347865 349351
56354C49351K504L736M364M020K910J619R24J133J622J581R81K57n41j342j310
$$ 349351 351855 355591 359955 363975 366885 368504 369428 370561 372183 373764 374745 375002 374461 373119 371809
56339C71809K30K339L166K290J256J539K869L911L853K926J959J675K152K775
$$ 371809 372039 374378 377544 379834 381090 382629 385498 389409 393262 396188 398147 399822 401974 404749
56325D04749K971K733K255J517P18N78J451K559K880K402J803J384J130J228J448
$$ 404749 407720 410453 412708 414225 414943 415521 416972 419531 422411 424813 426616 428000 429130 430358 431806
56310D31806O13j874m340m257j428J651K850K471J942J793J688J474J325J270
$$ 431806 432419 430545 426205 421948 420520 422171 425021 427492 429434 431227 432915 434389 435714 436984
56296D36984J120O41k31j110j216l70L80j3r34p54R29K851L949M410M644M521
$$ 436984 438104 438745 438514 437404 436188 435818 436198 436185 435251 434497 435426 438277 442226 446636 451280 455801
56280D55801M185M378N231N707N050L971L599L972M422M795N399O170O722O977
$$ 455801 459986 464364 469595 475302 480352 484323 487922 491894 496316 501111 506510 512680 519402 526379
56266E26379P013O560N288L500J977J268J468K410L541L962L252K111J635J938
$$ 526379 533392 539952 545240 548740 550717 551985 553453 555863 559404 563366 566618 568729 570364 572302
56252E72302K123J650J152J560K779L711L518K569J971K346L340M235M719M899
$$ 572302 574425 576075 577227 578787 581566 585277 588795 591364 593335 595681 599021 603256 607975 612874
56238F12874M976N178N784O783P681Q041Q146Q562R151R125Q290P630Q219R884
$$ 612874 617850 623028 628812 635595 643276 651317 659463 668025 677176 686301 694591 702221 710440 720324
56224G20324J1424J2062J2162J2539J3523J4998J6880J9074K0977K1778K1588
$$ 720324 731748 743810 755972 768511 782034 797032 813912 832986 853963 875741 897329
56213H97329K1730K3334K5902K7984K9104L0245L2362L5155L7632L9315M0550
$$ 897329 919059 942393 968295 996279 1025383 1055628 1087990 1123145 1160777 1200092 1240642
56202A240642M2143M4940M9342N4942O0959O7041P3224P9221Q4601Q9736R5590
$$ 1240642 1282785 1327725 1377067 1432009 1492968 1560009 1633233 1712454 1797055 1886791 1982381
56191A982381J02406J09581J17108J25780J35304J43499J48576J51246J53398
$$ 1982381 2084787 2194368 2311476 2437256 2572560 2716059 2864635 3015881 3169279
56182C169279J55303J55357J52033J44874J33991J19868J03518Q5679O5752M2566
$$ 3169279 3324582 3479939 3631972 3776846 3910837 4030705 4134223 4219902 4285654 4328220
56172D328220J6344j0757l6086n8017p6296r1598j04742j15850j24373j30165
$$ 4328220 4344564 4333807 4297721 4239704 4163408 4071810 3967068 3851218 3726845 3596680
56162C596680j33984j36561j37775j37303j35396j32336j27919j22290j16525
$$ 3596680 3462696 3326135 3188360 3051057 2915661 2783325 2655406 2533116 2416591
56153B416591j11388j06180r9880r2795q5971p9659p3559o8088o3825o0150n5772
$$ 2416591 2305203 2199023 2099143 2006348 1920377 1840718 1767159 1699071 1635246 1575096 1519324
56142A519324n0634m5924m2251l8883l4941l0493k6422k3845k3216k3352k1970
$$ 1519324 1468690 1422766 1380515 1341632 1306691 1276198 1249776 1225931 1202715 1179363 1157393
56131A157393j8184j3840j1300j0608j0107r080q206p775p158o002m562k946j251
$$ 1157393 1139209 1125369 1114069 1103461 1093354 1084274 1076068 1068293 1061135 1055133 1050571 1047625 1046374
56118A046374k15m03j055q67L07J722L139M653N796O301P102Q898J0497J0561
$$ 1046374 1046159 1045756 1044701 1043834 1044141 1045863 1049002 1053655 1059451 1065752 1072854 1081752 1092249 1102810
56104A102810J0225J1751J5038J7835J9200K0197K1294K1801K2150K3978K7343
$$ 1102810 1113035 1124786 1139824 1157659 1176859 1197056 1218350 1240151 1262301 1286279 1313622
56093A313622L0383L2453L5062L8868M2402M4988M8478N4487O1846O8553P4479
$$ 1313622 1344005 1376458 1411520 1450388 1492790 1537778 1586256 1640743 1702589 1771142 1845621
56082A845621Q0595Q6853R2466R7056J00130J00314R6366Q8480P8080O7285N8703
$$ 1845621 1926216 2013069 2105535 2202591 2302721 2403035 2499401 2587881 2665961 2733246 2791949
56071B791949N4093N2536N1308M8959M5950M2015L5436K6002J6327Q584J683o668
$$ 2791949 2846042 2898578 2949886 2998845 3044795 3086810 3122246 3148248 3164575 3173159 3174842 3168174
56059C168174j6823k7919m0126n3978o8365q1143r1242r8687j03044j03333r9279
$$ 3168174 3151351 3123432 3083306 3029328 2960963 2879820 2788578 2689891 2586847 2483514 2384235
56048B384235r1747q2278p2766o4745n8175n1600m4152l6675l0332k5222k0927
$$ 2384235 2292488 2210210 2137444 2072699 2014524 1962924 1918772 1882097 1851765 1826543 1805616
56037A805616j7362j4373j1509q760o459m090o18L522O358O982O696O725O658
$$ 1805616 1788254 1773881 1762372 1753612 1747153 1743063 1742445 1745967 1752325 1759307 1766003 1772728 1779386
56024A779386O145O417Q546J1547J3635J4420J4697J5042J5692J6852J8200J8987
$$ 1779386 1785531 1791948 1800494 1812041 1825676 1840096 1854793 1869835 1885527 1902379 1920579 1939566
56012A939566J9288K0065K1484K2579K3214K4766K7893L1208L3179L3945L4345
$$ 1939566 1958854 1978919 2000403 2022982 2046196 2070962 2098855 2130063 2163242 2197187 2231532
56001B231532L4542L4627L5205L6422L7590L8523L9943M1976M3755M5006M6469
$$ 2231532 2266074 2300701 2335906 2372328 2409918 2448441 2488384 2530360 2574115 2619121 2665590
55990B665590M8250M9539N0330N1480N2703N2708N1698N1356N1956N2187N2309
$$ 2665590 2713840 2763379 2813709 2865189 2917892 2970600 3022298 3073654 3125610 3177797 3230106
55979C230106N4388N8555O2265O4422O7029P1437P6357Q0957Q6400R2560R6957
$$ 3230106 3284494 3343049 3405314 3469736 3536765 3608202 3684559 3765516 3851916 3944476 4041433
55968D041433R9093J02069J07547J12758J15371J17604J22326J28465J33821J39319
$$ 4041433 4140526 4242595 4350142 4462900 4578271 4695875 4818201 4946666 5080487 5219806
55958E219806J46685J54688J61535J68680J78553J90463K02261K14184K27898
$$ 5219806 5366491 5521179 5682714 5851394 6029947 6220410 6422671 6636855 6864753
55949F864753K43513K60316K78415K97063L13798L27980L42633L60116L78871
$$ 6864753 7108266 7368582 7646997 7944060 8257858 8585838 8928471 9288587 9667458
55940I667458L97038M15838M36314M56488M75361M96198N22106N51881N84046
$$ 9667458 10064496 10480334 10916648 11373136 11848497 12344695 12866801 13418682 14002728
55931A4002728O21010O64899P13144P62815Q15572Q73817R35921J000362J070549
$$ 14002728 14623738 15288637 16001781 16764596 17580168 18453985 19389906 20390268 21460817
55922B1460817J150202J237794J330865J431875J544432J668013J802001J950438
$$ 21460817 22611019 23848813 25179678 26611553 28155985 29823998 31625999 33576437
55914C3576437K117083K300571K500415K722641K973714L255145L570653L931586
$$ 33576437 35693520 37994091 40494506 43217147 46190861 49446006 53016659 56948245
55906E6948245M347496M818581N345077N936107O602097P350466Q199399R181665
$$ 56948245 61295741 66114322 71459399 77395506 83997603 91348069 99547468 108729133
55898A08729133J0317263J1590304J2966488J4423070J5950906J7547659J9228774
$$ 108729133 119046396 130636700 143603188 158026258 173977164 191524823 210753597
55891B10753597K1021392K2916084K4832507K6617091K7953898K8152381K6111151
$$ 210753597 231774989 254691073 279523580 306140671 334094569 362246950 388358101
55884C88358101K0816240J2182609J474906r210392j8013918k4049081k7377259
$$ 388358101 409174341 421356950 422831856 413621464 395607546 371558465 344181206
55877C44181206k8545971k8196728k6898530k5092447k3072917k1015394j9024486
$$ 344181206 315635235 287438507 260539977 235447530 212374613 191359219 172334733
55870A72334733j7154399j5413696j3791131j2285973j0906776r653518q519062
$$ 172334733 155180334 139766638 125975507 113689534 102782758 93129240 84610178
55863H4610178p502181o604271n817809n130320m535126m027586l595771l225235
$$ 84610178 77107997 70503726 64685917 59555597 55020471 50992885 47397114 44171879
55855D4171879k908554k641202k412825k211548k032562j874332j730968j596583
$$ 44171879 41263325 38622123 36209298 33997750 31965188 30090856 28359888 26763305
55847B6763305j472788j363634j266848j177442j095859j024688r61048q99961
$$ 26763305 25290517 23926883 22660035 21482593 20386734 19362046 18400998 17501037
55839A7501037q42187p91198p45408p00646o57577o19439n84811n49967n16151
$$ 17501037 16658850 15867652 15122244 14421598 13764021 13144582 12559771 12009804 11493653
55830A1493653m87376m62510m36796m10278l87954l71797l58696l46141l34462
$$ 11493653 11006277 10543767 10106971 9696693 9308739 8936942 8578246 8232105 7897643
55821G897643l23349l11247k98418k86340k74342k60775k46862k35357k26071
$$ 7897643 7574294 7263047 6964629 6678289 6403947 6143172 5896310 5660953 5434882
55812E434882k16614k06780j98262j90996j83725j77219j72789j68544j61385
$$ 5434882 5218268 5011488 4813226 4622230 4438505 4261286 4088497 3919953 3758568
55803C758568j52100j44260j38548j32337j24654j17458j11907j07058j02407
$$ 3758568 3606468 3462208 3323660 3191323 3066669 2949211 2837304 2730246 2627839
55794B627839r8321r4016q8435q2924p9771p8189p5109o9800o4491o0440n6813
$$ 2627839 2529518 2435502 2347067 2264143 2184372 2106183 2031074 1961274 1896783 1836343 1779530
55783A779530n3350n0776m8368m4385l9352l5851l4667l3976l2630l1303l0028
$$ 1779530 1726180 1675404 1627036 1582651 1543299 1507448 1472781 1438805 1406175 1374872 1344844
55772A344844k7702k4638k2818k2663k2128j9907j7314j6078j6255j7102j8254
$$ 1344844 1317142 1292504 1269686 1247023 1224895 1204988 1187674 1171596 1155341 1138239 1119985
55761A119985j9279j9621j9443j9440j9678j9820j9990k0009j8603j5399j2807
$$ 1119985 1100706 1081085 1061642 1042202 1022524 1002704 982714 962705 944102 928703 915896
55750I15896j3302j5368j5011j1285p381n911o029n924n492n190m495l037j728
$$ 915896 902594 887226 872215 860930 853549 847638 841609 835685 830193 825003 820508 817471 815743
55737H15743j496j884j824j005O0O68N21K82J086K741L284J709%N17K172J642
$$ 815743 814247 812363 810539 809534 809594 810262 810783 811065 812151 814892 818176 819885 819885 820402 822574 824216
55721H24216k107o985j1203j4763j7410j8016j6697j5126j3805j1332p362l954
$$ 824216 822109 815124 803921 789158 771748 753732 737035 721909 708104 696772 689410 685456
55709F85456k708k536j842j282k659o108r902j2428j3266j2810j1732j0529r162
$$ 685456 682748 680212 678370 677088 674429 668321 658419 645991 632725 619915 608183 597654 588492
55696E88492p403n602m575m839o554r756j3586j5814j4793j1816r843r742r562
$$ 588492 581089 575487 570912 566073 559519 549763 536177 520363 505570 493754 483911 474169 464607
55683D64607p885n995n740o774p398p168p238q299r284q471n620k556j302j792
$$ 464607 456722 450727 444987 438213 430815 423647 416409 408110 398826 390355 384735 382179 380877 379085
55669C79085k245j862j815k913l824l132j787j682k694l247l076l121l108j703
$$ 379085 376840 374978 373163 370250 366426 363294 361507 359825 357131 353884 350808 347687 344579 342876
55655C42876P95K327K055J320J224J298J199J658K803L269K038j33j908k839l034
$$ 342876 343671 345998 348053 349373 350597 351895 353094 354752 357555 360824 362862 362729 360821 357982 354948
55640C54948k628k139k303l083l828m464n290n753n015l771l618m416m233k303
$$ 354948 352320 350181 347878 344795 340967 336503 331213 325460 320445 316674 313056 308640 304407 302104
55626C02104j01J072J572J840J430N74O51J963K917K557K108K647L076K042L00
$$ 302104 302003 303075 304647 306487 307917 308491 309142 311105 314022 316579 318687 321334 324410 326452 326752
55611C26752n65m32j8P72K005K377P23j795k928k388j845k097k067r06M68O22
$$ 326752 326187 325755 325737 326509 328514 330891 331614 329819 326891 324503 322658 320561 318494 317588 318056 318678
55595C18678m10j126l78J275K169J500J64o49j029j656k102j432k79m41k068l108
$$ 318678 318268 317142 316764 318039 320208 321708 321872 321223 320194 318538 316436 315004 314725 314284 312216 309108
55579C09108k352j317j866l448m095l326k567l146m824o093n476l094j049j347
$$ 309108 306756 305439 303573 300125 296030 292704 290137 286991 282167 276074 270598 267504 266455 265108
55565B65108l329m437l715k852l231l870l351j993q24M3N36l56k920n244n225
$$ 265108 261779 257342 253627 250775 247544 243674 240323 238330 237506 237549 238085 237729 234809 229565 224340
55550B24340l302j643j382k067k991l540k995j514o71j571l117l561k977k649
$$ 224340 221038 219395 218013 215946 212955 209415 206420 204906 204235 202664 199547 195986 193009 190360
55536A90360k766k482j660q49qJ096J669Q26n33o55N55J593J800J968K612L276
$$ 190360 187594 185112 183452 182603 182595 183691 185360 186186 185653 184998 185553 187146 188946 190914 193526 196802
55520A96802L733M189M367L956L982N870Q975J0926J0796J0145J0281J0400R363
$$ 196802 200535 204724 209091 213047 217029 222899 231874 242800 253596 263741 274022 284422 293785
55507B93785P575N897M054J526r79k456l344m966p484r618j0314r686q292o398
$$ 293785 301360 307257 311311 312837 311858 309402 306058 301092 293608 283990 273676 263990 255698 249300
55493B49300m374l101l324m626n617n289m027k959k574k492k523l119m342n075
$$ 249300 244926 241825 238501 233875 228258 222969 218942 215983 213409 210917 208394 205275 200933 195858
55479A95858m063j547O92R73p08k536k267O17L980N001L328J293P01N99p90l220
$$ 195858 191795 190248 190940 191913 191205 188669 186402 187019 190999 196000 199328 200621 201322 201921 201131 197911
55463A97911n026n753o477p741q791q922q302p282n938m441l088j915r81p75j424
$$ 197911 192885 187132 180655 172914 164123 155201 146899 139617 133679 129238 126150 124235 123254 122479 121055
55448A21055j892j153J75N06l89j101o55L63R47Q00J85l68j39R82J786J068m11
$$ 121055 119163 118010 118185 118691 118302 117201 116546 116909 117856 118656 118841 118473 118334 119316 121102 122170 121759
55431A21759o74N96J501P44n04m27R77K233K354J531M67k61n12p16j322k067k374
$$ 121759 121085 121681 123182 123926 123422 122995 123972 126205 128559 130090 130557 130296 129784 129068 127746 125679 123305
55414A23305k409k735k882j579J206L739M758M953N291N107L242L26j541j315
$$ 123305 120896 118161 115279 113700 114906 118645 123403 128356 133647 138754 141996 142322 140781 139466
55400A39466r7L91l80j626k368k356k028j702j162k39N22M21m07j218j710j921
$$ 139466 139369 139760 139380 137754 135386 133030 131002 129300 128138 127899 128421 128842 128435 127217 125507 123586
55384A23586j357M63K500K779J036n56j57J475K448K251J587O15r76k613k953
$$ 123586 122229 122692 125192 127971 129007 128451 128294 129769 132217 134468 136055 136670 135694 133081 130128
55369A30128j517P34K432K800J811J70j002j036l67P4r9n78q57n52M04J489J982
$$ 130128 128611 129345 131777 134577 136388 136558 135556 134520 134153 134227 134128 133550 132693 132141 132545 134034 136016
55352A36016J867J687J431N29o18n90P40J283m99l067l876k965k382k626k055
$$ 136016 137883 139570 141001 141530 140912 140322 141062 142345 141846 138779 134903 131938 129556 126930 124875
55337A24875L2K114K877K861K780K012R8j750k089j231m04J45Q12J093J60j259
$$ 124875 124907 127021 129898 132759 135539 137551 137649 135899 133810 132579 132175 132320 133132 134225 134385 133126
55321A33126j387O5J270P57p62j710j740j549j448j234j061j227j216j70J455
$$ 133126 131739 131804 133074 133831 133069 131359 129619 128070 126622 125388 124327 123100 121884 121714 123169
55306A23169J940O32p76l44J491K627K155J180Q23Q66Q71J177J956K299J355k61
$$ 123169 125109 125741 124965 124621 126112 128739 130894 132074 132897 133763 134634 135811 137767 140066 141421 141160
55290A41160j277j503j633j718j057L64J418J188p2j541k665l148k732j496k2
$$ 141160 139883 138380 136747 135029 133972 134336 135754 136942 136870 135329 132664 129516 126784 125288 125266
55275A25266R88J165O24o6k74l9j34q39j105J44K184L140K412J180L90l66j397
$$ 125266 126254 127419 128043 127977 127703 127664 127530 126691 125586 125730 127914 131054 133466 134646 135036 134670 133273
55258A33273j947j595j316j883k252j131O48J089J00l94N21J455J089K63N03J651
$$ 133273 131326 129731 128415 126532 124280 123149 123797 124886 124986 124592 125113 126568 127657 127920 128423 130074
55242A30074K295J946J336Q15j95j810k786j825N95K425K227P78J19J090K308
$$ 130074 132369 134315 135651 136466 136271 134461 131675 129850 130445 132870 135097 135875 135994 137084 139392
55227A39392J955O8j622j948j370o59L55J909L104K819J444N12O12P43j8j237
$$ 139392 141347 141415 139793 137845 136475 135816 136171 138080 141184 144003 145447 145959 146571 147314 147296 146059
55211A46059j951j934j608j225p83k75L90J321K184K273J433M04k05n87r09o50
$$ 146059 144108 142174 140566 139341 138558 138283 138673 139994 142178 144451 145884 146288 146083 145496 144587 143937
55195A43937L84J094M41o89m70J146K214J644O84P68J368J141K44j00J59k62j829
$$ 143937 144321 145415 145856 145167 144697 145843 148057 149701 150385 151153 152521 153662 153906 153806 153965 153703 151874
55178A51874l337l652l283l239l174j860N37J867L99k747m448l007M1J916J721
$$ 151874 148537 144885 141602 138363 135189 133329 133866 135733 136132 133385 128937 125930 125971 127887 129608
55163A29608P94M18L95Qp50j514k184k453j534O84K786L285K573K145K156J304
$$ 129608 130402 130820 131215 131223 130473 128959 126775 124322 122788 123472 126258 129543 132116 134261 136417 137721
55147A37721o42j917j273l1j93j474j812m50J257K166K796L744M120K853O16r53
$$ 137721 137079 135162 133889 133858 133665 132191 130379 129929 131186 133352 136148 139892 144012 146865 147481 146528
55131A46528j542k184l030k704n08K012K790J736M43j49n11j125j600j540j196
$$ 146528 144986 142802 139772 137068 136560 138572 141362 143098 143541 143392 142881 141756 140156 138616 137420
55116A37420p55J48J511K391K108J396J347J578P06j366k831k167q2J400J247
$$ 137420 136665 136813 138324 140715 142823 144219 145566 147144 147850 146484 143653 141486 141404 142804 144051
55101A44051J72n42l21N20J294J505J222Q78P28O05L59K15M10P25Q43R35J351
$$ 144051 144223 143681 143360 143880 145174 146679 147901 148779 149507 150112 150471 150686 151096 151821 152664 153599 154950
55084A54950J722J051q91k792k892q80J703K924K135L14r65q28L09J246J112J60
$$ 154950 156672 157723 156832 154040 151148 150268 151971 154895 157030 157344 156379 155551 155860 157106 158218 158378
55068A58378o44p21m77o40j234j505q63L74J338J516J073L91l12q79j035p14k98
$$ 158378 157734 157013 156536 155896 154662 153157 152294 152668 154006 155522 156595 156986 156674 155795 154760 154046 153748
55051A53748k13l27j29L72M85j27p10k39J124K026J533J57r37j296j265j100o33
$$ 153748 153535 153208 153079 153451 153936 153809 153099 152860 153984 156010 157543 157700 156763 155467 154202 153102 152469
55034A52469J63Q33R62P07O30J132K211L513M345L917K054k38j372p58M41O30
$$ 152469 152632 153465 154427 155134 155764 156896 159107 162620 166965 170882 172936 172698 171326 170568 171009 171639
55018A71639k41o59K37J249Q19m85n67R31J600m78l593m256j745R82J130q49k686
$$ 171639 171398 170739 170976 172225 173044 172559 171992 172923 174523 174045 170452 166196 164451 165433 166563 165714 163028
55001A63028l267k870j599O17K749L099J405o47j489j283j020r60p22k72J38O89
$$ 163028 159761 156891 155292 155909 158658 161757 163162 162515 161026 159743 158723 157763 157041 156769 156907 157596
54985A57596J789L182L913L279J383j101l232l962k840q31K32n43k038k382j023
$$ 157596 159385 162567 166480 169759 171142 170041 166809 162847 160007 159176 159408 158865 156827 154445 153422
54970A53422O98J018l17j655j012J726M399M768L009J283Q46O44p43k834l969
$$ 153422 154120 155138 154821 153166 152154 153880 158279 163047 166056 167339 168185 168829 168086 165252 161283
54955A61283l577k382p73J437L615M252K982J375Q85J015M40q64j688j286M3J687
$$ 161283 157706 155324 154551 155988 159603 163855 166837 168212 169097 170112 170552 169688 168000 166714 166757 168444
54939A68444L015L245K094N67J69J216K554K861J676o10k828l399j768M75J142
$$ 168444 171459 174704 176798 177365 177534 178750 181304 184165 185841 185231 182403 179004 177236 177711 178853
54924A78853J76l29P94K183K153J140P37J235J555J093J67j120l054n076n673
$$ 178853 179029 178700 179494 181677 183830 184970 185707 186942 188497 189590 189757 188637 185583 180507 174834
54909A74834m065j259J168K704L816M617M390K522m65l036l819k696p73O84J169
$$ 174834 170769 169510 170678 173382 177198 181815 186205 188727 188262 185226 181407 178711 177938 178622 179791
54894A79791R41M75J38P2M7m51j553k585k719k067j572j710j866j321m50k52q39
$$ 179791 180732 181207 181345 181417 181464 181013 179460 176875 174156 172089 170517 168807 166941 165620 165170 164918 164079
54877A64079j083o8J600K530K344K001K259K619K318J721J790K488K727K035J273
$$ 164079 162996 162928 164528 167058 169402 171403 173662 176281 178599 180320 182110 184598 187325 189360 190633
54862A90633J300J791K036K220L064M515N557N401M351L565M131O096Q068Q114
$$ 190633 191933 193724 195760 197980 201044 205559 211116 216517 220868 224433 228564 234660 242728 250842
54848B50842N616K019n70j347j030p02r51j872l170m401n464o503p067o161l906
$$ 250842 256458 258477 257907 256560 255530 254828 253877 252005 248835 244434 238970 232467 225400 219239 215333
54833B15333k202k485l486k899q88R0r17j879r23R90J901J695J500J386O50j86
$$ 215333 213131 210646 207160 204261 203373 203463 202546 200667 199744 200734 202635 204330 205830 207216 207866 207680
54817B07680L56K456M549N337M980M225L567L543M584O077O605N607M051L040
$$ 207680 208036 210492 215041 220378 225358 229583 233150 236693 241277 247354 253959 259566 263617 266657
54803B66657K505J776O62o05j994l596n285o653p133o305m695m002n399p548p746
$$ 266657 269162 270938 271600 270995 269001 265405 260120 253467 246334 240029 235334 231332 225933 218385 210639
54788B10639n407k922k315k653k097r26o74j295j382q02p58j322j133J2M26p98
$$ 210639 205232 202310 199995 197342 195245 194319 193645 192350 190968 190166 189408 188086 186953 186965 187391 186593
54772A86593k212k244j293l99O16K038K589Q06k458m691m631l069j053J086K914
$$ 186593 184381 182137 180844 180445 181061 183099 185688 186494 184036 179345 174714 171645 170592 171678 174592
54757A74592L642L165K338J815J417Q18J9r05j805k139j578q64j073j975k224
$$ 174592 178234 181399 183737 185552 186969 187787 187806 186901 185096 182957 181379 180515 179442 177467 175243
54742A75243j295l0R38J934K916K874J447N7K45J674K853L094K766K051P48q97
$$ 175243 173948 173918 174856 176790 179706 182580 184027 184084 184329 186003 188856 191950 194716 196767 197515 196618
54726A96618k161k622k229r10J112K758K878J693O99R28J852K232J586O32N13
$$ 196618 194457 191835 189606 188696 189808 192566 195444 197137 197836 198764 200616 202848 204434 205066 205579
54711B05579J486K406J843m7j382p95Q80K045K803M563P306Q932Q001N882N014
$$ 205579 207065 209471 211314 211267 209885 209090 209970 212015 214818 219381 226687 235619 243620 249502 254516
54696B54516N826O558N875M354L100J969L0k699n005o021o164o111n675m462l162
$$ 254516 260342 266900 272775 277129 280229 282198 282228 279529 274524 268503 262339 256228 250553 246091 242929
54681B42929k985l799l967k514n60P1r66k413k969k243p15N82O44m68j374q00
$$ 242929 239944 236145 232178 229664 229104 229175 228209 225796 222827 220584 219869 220451 221095 220627 219253 218453
54665B18453J012K772L616L494K698J933K290L993N369M583K329J414L120N358
$$ 218453 219465 222237 225853 229347 232045 233978 236268 240261 245630 250213 252542 253956 257076 262434
54651B62434N320K956O84J44M32k72k311m285m908m479m296m929n642n588m844
$$ 262434 267754 270710 271394 271538 271970 271698 269387 265102 260194 255715 251419 246490 240848 235260 230416
54636B30416l954l153k645k964m105m766l531p05J922L040K624J160p41k040k018
$$ 230416 226462 223309 220664 217700 213595 208829 205298 204593 206515 209555 212179 213339 212598 210558 208540
54621B08540j467j803k828k850j508o72j597k801k202j22J428J613J178N52o14
$$ 208540 207073 205270 202442 199592 198084 197412 195815 193014 190812 190690 192118 193731 194909 195461 194847
54606A94847k002k493j840j210j533k253k275j242N40K659M323M264J905j492
$$ 194847 192845 190352 188512 187302 185769 183516 181241 179999 180539 183198 187521 191785 193690 192198
54592A92198l643l430j809m21J57L82N53M73L37Q38J922K262J023n16m27R79J315
$$ 192198 188555 185125 183316 182895 183052 183434 183987 184460 184797 185635 187557 189819 190842 190326 189899 190878 192193
54575A92193n04k673l020j744m54L60J317K197J798p9j941k301j286j14M36O32
$$ 192193 191689 189016 185996 184252 183798 184158 185475 187672 189470 189391 187450 185149 183863 183749 184185 184817
54559A84817J157K072K443J370n57j459m17J244J701R52L28L02J93j93k67o5l56
$$ 184817 185974 188046 190489 191859 191302 189843 189426 190670 192371 193323 193651 193953 194146 193953 193686 193621 193265
54542A93265r58o21P38J156p34l367l899j611J577L497L465K018K36o61k09O38
$$ 193265 192307 191686 192424 193580 192846 189479 185580 183969 185546 189043 192508 194526 194762 194101 193892 194530
54526A94530N47l93p54J82J443J725R79J55j5N03J228J404M39j382k927l283k438
$$ 194530 195077 194684 193930 194112 195555 197280 198259 198414 198399 198902 200130 201534 201973 200591 197664 194381 191943
54509A91943o76J903M621N782M251J241p16p35l78j183k678l501l366k821j826
$$ 191943 191267 193170 197791 203573 207824 209065 208349 207614 207236 206053 203375 199874 196508 193687 191861
54494A91861kK056L109K983K747K896K583J189l70o88M42K132L574M341L984K352
$$ 191861 191859 193915 197024 200007 202754 205650 208233 209422 209052 208364 208806 210938 214512 218853 222837 225189
54478B25189K18j228j530j121m59K86P82O12m5m21j97K9l74j168j640j549j225
$$ 225189 225407 224179 222649 221528 221069 221355 222137 222749 222704 222283 222086 222115 221741 220573 218933 217384 216159
54461B16159r49o77l08Q2L72N11M45J12m72j130j543j322k69J203K055J423l49
$$ 216159 215210 214533 214225 214307 214679 215190 215635 215747 215275 214145 212602 211280 211011 212214 214269 215692 215343
54444B15343j785j711m23P92J179J103J100R98L64n78j108r53o36p78j409j987
$$ 215343 213558 211847 211424 212216 213395 214498 215598 216596 216960 216382 215274 214321 213685 212907 211498 209511
54428B09511j842o28J321K985L334K205M06r91j412r69j84N01J107J915K787L098
$$ 209511 207669 207041 208362 211347 214681 216886 217292 216301 214889 213920 213736 214237 215344 217259 220046 223144
54412B23144K608J998K008K423K571K438K428K296J465L28O2Q15J190P8j902l384
$$ 223144 225752 227750 229758 232181 234752 237190 239618 241914 243379 243707 243769 244584 245774 245852 243950 240566
54396B40566l854l677l155k310j167J66J406J917J343L84P2K17k00q73j50K100
$$ 240566 236712 233035 229880 227570 226403 226569 227975 229892 231235 231619 231691 231908 231708 230835 230685 232785
54380B32785L415J882j092k778k622j946j303l41M55K65j04Q58K461K302Q2j490
$$ 232785 236200 238082 236990 234212 231590 229644 228341 228000 228455 228720 228616 229474 231935 234237 234319 232829
54364B32829m66J739K769K519K310K210J063j339l535l848j918J030K987K736
$$ 232829 232363 234102 236871 239390 241700 243910 244973 243634 240099 236251 234333 235363 238350 241086
54350B41086J011l65o48o71j073j247n37P27K098L687N101N041L229J542J694
$$ 241086 242097 241732 241084 240413 239340 238093 237556 238283 240381 244068 249169 254210 257439 258981 260675
54335B60675K629J973m10k244k132j148p60q35n11K55R40J435J885K072J805J514
$$ 260675 263304 265277 264867 262623 260491 259343 258583 257748 257237 257492 258432 259867 261752 263824 265629 267143
54319B67143J684J917J324j81j613k087j703j043l26M14P13O6r45p92J140L367
$$ 267143 268827 270744 272068 271887 270274 268187 266484 265441 265115 265529 266242 266308 265363 264571 265711 269078
54303B69078L808K245N08K90J513K954L675L470K617J622Q43P6j096k421l063
$$ 269078 272886 275131 275639 275929 277442 280396 284071 287541 290158 291780 292623 292699 291603 289182 286119
54288B86119k745k194k105k312k388k444k804l348l729l790l364k166l31J316
$$ 286119 283374 281180 279075 276763 274375 271931 269127 265779 262050 258260 254896 252730 252399 253715
54274B53715K122K208J830P31j269l482m875n043m209k677r15L28O81O00O37O94
$$ 253715 255837 258045 259875 260606 259337 255855 250980 245937 241728 239051 238136 238464 239145 239745 240382 241076
54258B41076N58N40Q46R13K50o74j215j619k258k484j564k12K93K34R54K272K308
$$ 241076 241634 242174 243020 243933 244183 243509 242294 240675 238417 235933 234369 234157 234450 234684 235638 237910 240218
54241B40218L93j585j563J71J772K067J209l6p41l00P71J072J6j336j720j222
$$ 240218 240611 239026 237463 237634 239406 241473 242682 242646 241905 241605 242376 243448 243464 242128 240408 239186
54225B39186p50o47o31m97r1Q87K158K584J490j15o31J18R53J099P93L01m40j027
$$ 239186 238436 237789 237158 236661 236570 237457 239615 242199 243689 243574 242943 243061 244014 245113 245906 246207 245767 244740
54207B44740n82R99K603L177K855K351J880J223M18k05n24p05q74r40p92m41o8
$$ 244740 244158 245157 247760 250937 253792 256143 258023 259246 259664 259459 258935 258230 257356 256416 255624 255183 255115
54190B55115Q9K4J19P22J501J654R33J22P1N35M01q80k530l261k656j464o31l26
$$ 255115 255204 255228 255347 256069 257570 259224 260157 260279 260350 260885 261286 260406 257876 254615 251959 250495 249864 249538
54172B49538j4P08J623K172J908P02j108k544k534j140P4l86k095l130k362n40
$$ 249538 249524 250232 251855 254027 255935 256637 255529 252985 250451 249311 249385 248999 246904 243774 241412 240872
54156B40872J061K110K757K564J000j305k864k920k074j229o72k50J62P07J474
$$ 240872 241933 244043 246800 249364 250364 249059 246195 243275 241201 239972 239300 239050 239212 239919 241393
54141B41393K192K453K348K322K283J637M91k5P58J886J912O53q37j714j926j686
$$ 241393 243585 246038 248386 250708 252991 254628 255119 255094 255852 257738 259650 260303 259466 257752 255826 254140
54125B54140j193q11q52j144j362j489j405n05J346K806K220j06j937j673P5J639
$$ 254140 252947 252136 251284 250140 248778 247289 245884 245379 246725 249531 251751 251645 249708 248035 248110 249749
54109B49749K029J218k00j112o39O02Q99l95j947k296j523m56O52J555J289n13
$$ 249749 251778 252996 252796 251684 251045 251647 252546 252151 250204 247908 246385 245929 246581 248136 249425 248912
54093B48912k304k208m84J051J638J951K064R64j357l069k633o47J213K173K451
$$ 248912 246608 244400 243916 244967 246605 248556 250620 251584 250227 247158 244525 243878 245091 247264 249715
54078B49715K331J992J808J893J678O46p83j678j710j356j101r17n02K35R42J123
$$ 249715 252046 254038 255846 257739 259417 260063 259280 257602 255892 254536 253435 252518 252016 252251 253193 254316
54062B54316P82O11J092J587R52q04k302k443j573n40M93J635K318J806M76l34
$$ 254316 255098 255709 256801 258388 259340 258536 256234 253791 252218 251678 252171 253806 256124 257930 258406 258072
54046B58072J54J329K015J673O64l25r00j104j080o92L13J802L196L980L995L298
$$ 258072 258226 259555 261570 263243 263907 263582 262682 261578 260498 259806 260119 261921 265117 269097 273092 276390
54030B76390K212J549K063L334L909L106K065K288L688M898N214N165N153M681
$$ 276390 278602 280151 282214 285548 289457 292563 294628 296916 300604 305502 310716 315881 321034 325715
54016C25715L304J593M90J9p23k375m441n749n603m411l142k362j960j671j430
$$ 325715 329019 330612 331102 331121 330398 328023 323582 317833 312230 307819 304677 302315 300355 298684 297254
54001B97254j122n30J83M16kl04K81J382J870J239J26l72N64K985N654O532M838
$$ 297254 296132 295602 295785 296201 296199 295895 296176 297558 299428 300667 300793 300421 300985 303970 309624 316156 320994
53984C20994K497K295M435O286N942M616M623O140P410P488P265P818Q933R532
$$ 320994 323491 325786 330221 336507 342449 347065 351688 357828 365238 372726 379991 387809 396742 406274
53970D06274Q764O543L758K063K618M758O493O612N678M763M007K951J639M67
$$ 406274 415038 421581 425339 427402 430020 434778 441271 447883 453561 458324 462331 465282 466921 467388
53956D67388o77k347m485o229o931o889o747o605o196n699n706o230o349n282
$$ 467388 466711 464364 459879 453650 446719 439830 433083 426478 420282 414583 408877 402647 396298 391016
53942C91016l546k446k554l248l845m402n019n168m438l441l079l204k934k174
$$ 391016 387470 385024 382470 379222 375377 370975 365956 360788 356350 352909 349830 346626 343692 341518
53928C41518j763j989k049j345l34L92R25J283Q05o97j942j581j88L34p62k351
$$ 341518 339755 337766 335717 334372 334038 334430 335355 336638 337443 336746 334804 333223 333035 333369 332607 330256
53912C30256l099k795j749j13J723K873K868K324K207K725L371L687L585L206
$$ 330256 327157 324362 322613 322500 324223 327096 329964 332288 334495 337220 340591 344278 347863 351069
53898C51069K838K867L476M342M772M211K807J607J814L499N347O204O478P370
$$ 351069 353907 356774 360250 364592 369364 373575 376382 377989 379803 383302 388649 394853 401331 408701
53884D08701R133J1085J2953J4850J5908J4629J1208P972O459N303K405j686m275
$$ 408701 417834 428919 441872 456722 472630 487259 498467 506439 512898 518201 520606 518920 514645
53871E14645m010k406j577j787j743o08R91J831J604J370K281M003N085M993M866
$$ 514645 510635 508229 506652 504865 503122 502514 503505 505336 506940 508310 510591 514594 519679 524672 529538
53856E29538N768P049P378O697O062N975N954N579M835L550J562n06j590j524
$$ 529538 535306 542355 549733 556430 562492 568467 574421 580000 584835 588385 589947 589441 587851 586327
53842E86327j220j473k346l684n363o831p373o989o392o019n846o078p066q325
$$ 586327 585107 583634 581288 577604 572241 565410 558037 551048 544656 538637 532791 526713 519647 511322
53828E11322q739q034p168o924p104p405p963q401p537n066k614j991k939l763
$$ 511322 502583 494549 487381 480457 473353 465948 457985 449584 442047 436981 434367 432376 429437 425674
53814D25674l787l966n089o502o990o165m641l240k418k187k316k546k758k938
$$ 425674 421887 417921 412832 406330 399340 393175 388534 385294 382876 380689 378373 375827 373069 370131
53800C70131l055l031k795k401k033j805j483o96L52P68P4r37j139p19r45k207
$$ 370131 367076 364045 361250 358849 356816 355011 353528 352832 353184 353952 354026 353089 351950 351231 350286 348079
53784C48079l244k841j502p52j206k060k312j874j432j499j745j310J37J827K702
$$ 348079 344835 341994 340492 339740 338534 336474 334162 332288 330856 329357 327612 326302 326439 328266 330968
53769C30968K610K178J658P10n30j018oJ914L482M091M000L518K734J911J646
$$ 330968 333578 335756 337414 338124 337594 336576 336570 338484 341966 346057 350057 353575 356309 358220 359866
53754C59866K227K939K477N44j158l98K745N508N742M603M640O050O801O102N457
$$ 359866 362093 365032 367509 368053 366895 366497 369242 374750 380492 385095 389735 395785 402586 408688 414145
53739D14145N774N814M624L574M191N474N230L251J385Q81J316J866K213K204
$$ 414145 419919 425733 430357 433931 438122 443596 448826 452077 453462 454343 455659 457525 459738 461942
53725D61942J777J203N85n53k258l332k812j827k453m803o783o934o004n337n124
$$ 461942 463719 464922 465507 464954 462696 459364 456552 454725 452272 447469 440686 433752 427748 422411 417287
53710D17287n061n416o344o846n615k777QJ172M95j272l296m943n560m789l297
$$ 417287 412226 406810 400466 393620 388005 385228 385236 386408 386903 385631 382335 377392 371832 367043 363746
53695C63746k648l677n226n203l047k56J567K211K083J218j03q24l90K42O7k11
$$ 363746 361098 357421 352195 346992 343945 343689 345256 347467 349550 350768 350665 349841 349451 349693 349760 349549
53679C49549O51K059K193Q42j16N00J540J469O31N00J474K538K819K552K390K333
$$ 349549 350200 352259 354452 355294 355178 355678 357218 358687 359318 359818 361292 363830 366649 369201 371591 373924
53663C73924J694J67j326j281O94L229M654M705M325M193M254M328M362M105L311
$$ 373924 375618 375785 374459 373178 373872 377101 381755 386460 390785 394978 399232 403560 407922 412027 415338
53648D15338K334J873K174K936L822M442M149K755J267J019K140L604M633N229
$$ 415338 417672 419545 421719 424655 428477 432919 437068 439823 441090 442109 444249 447853 452486 457715
53634D57715N462N312N135N222M938L363J009l52K09J726K673K376R04j349l483
$$ 457715 463177 468489 473624 478846 483784 487147 488156 487804 488013 489739 492412 494788 495692 494343 490860
53619D90860m504m416m172m190l825k672j329l47N69J640K176J604O63N46J201
$$ 490860 486356 481940 477768 473578 469753 467081 465752 465405 465974 467614 469790 471394 472057 472603 473804
53604D73804J399M47q39j100j52N99l40k535l712k377L03K025K194J971J981J652
$$ 473804 475203 475650 474811 473711 473559 474158 473818 471283 467571 465194 465497 467522 469716 471687 473668 475320
53588D75320R99J128K296L072K444J522J858L013L143J589k42n26J148L470M616
$$ 475320 476319 477447 479743 482815 485259 486781 488639 491652 494795 496384 496142 495616 496764 500234 504850
53573E04850L993K870K853L862M456M108L850M468N376N893O148O081N039L396
$$ 504850 508843 511713 514566 518428 522884 526992 530842 535310 540686 546579 552727 558808 563847 567243
53559E67243L097N219Q084R273Q651P794P331O608N493M729M534M399M256M549
$$ 567243 570340 575559 583643 592916 601567 609361 616692 623300 628793 633522 638056 642455 646711 651260
53545F51260N047M765L327J417j33r53q48M7R83J227J005R73J043O49j4j69J42
$$ 651260 656307 661072 664399 665816 665683 664730 663882 663929 664912 666139 667144 668117 669160 669809 669795 669626 669768
53528F69768k5j043k179k786l118l568l882l568k619j548r48j141j906k574k660
$$ 669768 669743 668700 666521 663735 660617 657049 653167 649599 646980 645432 644484 643343 641437 638863 636203
53513F36203k233j531o52O4M0n41n34O89K184K777K690K720K674K007J305J430
$$ 636203 633970 632439 631787 631851 631891 631350 630816 631505 633689 636466 639156 641876 644550 646557 647862 649292
53497F49292J724J005J31J192L972N606M629L180L774N778O822O339N677N500
$$ 649292 651016 652021 652152 653344 657316 662922 667551 670731 674505 680283 687105 693444 699121 704621
53483G04621N185M607M776O277Q369J0033J1099J1900J2599J3282J4319J5947
$$ 704621 709806 714413 719189 725466 733835 743868 754967 766867 779466 792748 807067 823014
53471H23014J7685J8603J8408J8105J9057K1240K2954K2864K1894K2182K4239
$$ 823014 840699 859302 877710 895815 914872 936112 959066 981930 1003824 1026006 1050245
53460A050245K6334K6982K6847K7556K9551L2031L4304L6080L6941L6625L5867
$$ 1050245 1076579 1103561 1130408 1157964 1187515 1219546 1253850 1289930 1326871 1363496 1399363
53449A399363L5895L7006L8292L8842L8586L7920L7192L6700L6511L6087L4648
$$ 1399363 1435258 1472264 1510556 1549398 1587984 1625904 1663096 1699796 1736307 1772394 1807042
53438A807042L2242K9910K8566K8133K8074K8191K8432K8462K8084K7749K7914
$$ 1807042 1839284 1869194 1897760 1925893 1953967 1982158 2010590 2039052 2067136 2094885 2122799
53427B122799K8098K7325K5534K3719K2565K1704K0672J9692J8850J7240J3857
$$ 2122799 2150897 2178222 2203756 2227475 2250040 2271744 2292416 2312108 2330958 2348198 2362055
53416B362055R086M429Q59j822m148o329q519j0946j3594j6231j8752k0956k2225
$$ 2362055 2371141 2375570 2376429 2374607 2370459 2364130 2355611 2344665 2331071 2314840 2296088 2275132 2252907
53403B252907k2243k1878k2298k3269k3488k2767k2625k4216k6920k9512l1427
$$ 2252907 2230664 2208786 2186488 2163219 2139731 2116964 2094339 2070123 2043203 2013691 1982264
53392A982264l2104l0540k6771k2762k0491j9828j9378j8575j7608j6087j3463
$$ 1982264 1950160 1919620 1892849 1870087 1849596 1829768 1810390 1791815 1774207 1758120 1744657
53381A744657j0311p677n533l194r46L95J280L011N522P260P635P940R375J1586
$$ 1744657 1734346 1726669 1721136 1717942 1716996 1717391 1718671 1721682 1727204 1734464 1742099 1750039 1759414 1771000
53367A771000J3846J6290J9200K2102K4450K6373K8163K9774L1452L4009L7714
$$ 1771000 1784846 1801136 1820336 1842438 1866888 1893261 1921424 1951198 1982650 2016659 2054373
53356B054373M1515M4167M5698M7243M9608N2416N4623N5724N6574N8717O2586
$$ 2054373 2095888 2140055 2185753 2232996 2282604 2335020 2389643 2445367 2501941 2560658 2623244
53345B623244O6805O9826P1728P3553P5481P7031P8562Q0854Q3153Q3497Q1516
$$ 2623244 2690049 2759875 2831603 2905156 2980637 3057668 3136230 3217084 3300237 3383734 3465250
53334C465250P9323P8795P9301P9060P7480P5175P2548O9517O6171O2818N9576
$$ 3465250 3544573 3623368 3702669 3781729 3859209 3934384 4006932 4076449 4142620 4205438 4265014
53323D265014N6247N2271M6839L9723L2000K4991J8581J1691M290k616r062j6316
$$ 4265014 4321261 4373532 4420371 4460094 4492094 4517085 4535666 4547357 4551647 4549031 4539969 4523653
53311D523653k4511l1977l7902m3767n0977n8675o5211p0306p4283p6692p7359
$$ 4523653 4499142 4467165 4429263 4385496 4334519 4275844 4210633 4140327 4066044 3989352 3911993
53300C911993p7572p8466p9253p8735p7473p6618p5639p3239o9806o6849o4520
$$ 3911993 3834421 3755955 3676702 3597967 3520494 3443876 3368237 3294998 3225192 3158343 3093823
53289C093823o1834n8959n7152n6517n5865n4812n4075n3500n1755m8364m4353
$$ 3093823 3031989 2973030 2915878 2859361 2803496 2748684 2694609 2641109 2589354 2540990 2496637
53278B496637m0519l6684l3012l0433k9157k8148k6561k4474k2128j9853j8870
$$ 2496637 2456118 2419434 2386422 2355989 2326832 2298684 2272123 2247649 2225521 2205668 2186798
53267B186798k0283k2781k3266k0542j6756j4397j3499j2805j1909j0870r240
$$ 2186798 2166515 2143734 2120468 2099926 2083170 2068773 2055274 2042469 2030560 2019690 2010450
53256B010450o999n281m634l656j003K248M104M784O319R294J2065J3466J4542
$$ 2010450 2003451 1998170 1993536 1989880 1988877 1991125 1995229 2000013 2006332 2015626 2027691 2041157 2055699
53243B055699J6930K0756K4831K8013K9817L0434L0590L1027L1867L2873L4155
$$ 2055699 2072629 2093385 2118216 2146229 2176046 2206480 2237070 2268097 2299964 2332837 2366992
53232B366992L5758L6652L5351L1927K8254K5690K3503K0517J7225J4903J3304
$$ 2366992 2402750 2439402 2474753 2506680 2534934 2560624 2584127 2604644 2621869 2636772 2650076
53221B650076J0876P157L277l46n073j1793j8713k2949k3869k3698k4938k8285
$$ 2650076 2660952 2668109 2671386 2671040 2665967 2654174 2635461 2612512 2588643 2564945 2540007 2511722
53209B511722l2921l7622m1203m2932m3089m2634m2118m1551m1349m2418m4836
$$ 2511722 2478801 2441179 2399976 2357044 2313955 2271321 2229203 2187652 2146303 2103885 2059049
53198B059049m7314m8475m8087m6601m4410m2083m0462l9737l9129l8188l7570
$$ 2059049 2011735 1963260 1915173 1868572 1824162 1782079 1741617 1701880 1662751 1624563 1586993
53187A586993l7739l7825l6864l5391l4470l3759l2051k9342k6896k5399k4427
$$ 1586993 1549254 1511429 1474565 1439174 1404704 1370945 1338894 1309552 1282656 1257257 1232830
53176A232830k3692k3393k3212k2331k0708j9139j7866j6327j4565j3599j4090
$$ 1232830 1209138 1185745 1162533 1140202 1119494 1100355 1082489 1066162 1051597 1037998 1023908
53165A023908j5641j7642j9594k0544j9733j8215j8155j9882k1243k0734j9492
$$ 1023908 1008267 990625 971031 950487 930754 912539 894384 874502 853259 832525 813033
53154H13033j9051j8735j7110j4712j3308j3140j2864j1955j1314j1468j1838
$$ 813033 793982 775247 758137 743425 730117 716977 704113 692158 680844 669376 657538
53143F57538j2062j2576j3438j3776j2952j1488j0323r802r652r404q678p618
$$ 657538 645476 632900 619462 605686 592734 581246 570923 561121 551469 542065 533387 525769
53131E25769p030p456q174p953o768n779n492n047l847k764k862l657l804l064
$$ 525769 518739 511283 503109 495156 488388 482609 477117 472070 468223 465459 462597 458940 455136 452072
53117D52072k555l018l780l803l083k462k327k082j095K46Q56L88j57L31J523
$$ 452072 449517 446499 442719 438916 435833 433371 431044 428962 427867 428113 428969 429357 429200 429531 431054
53102D31054J917O43j610l696n197o038n560l180P8J889J070r11j637n15R01J157
$$ 431054 432971 433614 432004 428308 423111 417073 411513 408333 408411 410300 411370 410459 408822 408307 409208 410365
53086D10365N09N4J10R2m50j294j846j534p1K113L725L534J598o18j561q62N30
$$ 410365 410874 410928 411038 411130 410680 409386 407540 406006 405935 408048 411773 415307 416905 416287 414726 413864 414394
53069D14394J248N60j029k171j864l97R60J181L42n52m22R08K391K749J983J450
$$ 414394 415642 416202 415173 413002 411138 410741 411701 412882 413224 412672 412250 413158 415549 418298 420281 421731
53053D21731J922K413J629J7q78p31p13j382j844j404p95q86j279j129n84n11
$$ 421731 423653 426066 427695 427712 426834 426103 425390 424008 422164 420760 419965 419079 417800 416671 416087 415576
53037D15576j282k551l652l738k274j00Q68p1j277j051j53m98j962k428j002O89
$$ 415576 414294 411743 408091 404353 402079 401979 402847 402776 401499 400448 400295 399797 397835 395407 394405 395094
53021C95094R22Q6l49J17Q46J140P30j50p30l70K80j74j676k277r19N28l65l013
$$ 395094 396016 396102 395753 395870 396716 397856 398586 398436 397706 397336 397616 397442 395766 393489 392570 393098 392733 389720
53003C89720m482l552j992j495j411n70M60N44K31P89J706J289k05l06K133M901
$$ 389720 385238 381686 379694 378199 376788 376218 376678 377222 377453 378242 379948 381237 381032 380726 382859 387760
52987C87760N218L171J004k4m82j082j792k476k993k647q87J296K053R53o37j650
$$ 387760 392978 396149 397153 397129 396647 395565 393773 391297 388304 385657 384770 386066 388119 389072 388435 386785
52971C86785k335k719j884K24J764J204m41j002o7R67J157Q29M59K91Q74K546
$$ 386785 384450 381731 379847 380071 381835 383039 382598 381596 381529 382496 383653 384482 384941 385232 386106 388652
52955C88652M318M585L140J294j4r40j531j213O5J458K388K910K662R86j336k128
$$ 388652 392970 397555 400695 401989 401975 401035 399504 398291 398356 399814 402202 405112 407774 408760 407424 405296
52939D05296p14P77L32j047j046L54J135N69J53R96K133K140R80m68j646k334
$$ 405296 404582 405359 405691 404644 403598 403952 405087 405656 405809 406805 408938 411078 412058 411590 409944 407610
52923D07610k193j051P11K428L462L312K173J342J975L225K888M69j646r74K044
$$ 407610 405417 404366 405077 407505 410967 414279 416452 417794 419769 422994 425882 426351 424705 423731 425775
52908D25775M863N801N025L320J392J22M6N05M01j47r7O18P37l81j710k025j407
$$ 425775 430638 436439 441464 444784 446176 446298 446344 446849 447250 447103 447006 447624 448361 447980 446270 444245 442838
52891D42838o45o2K41k59j927m057n339n126l860k478j790j962k300j849n19P83
$$ 442838 442193 442131 442372 442113 440186 436129 430790 425664 421804 419326 417536 415574 413274 411425 410906 411689
52875D11689J360J328Q52k43j500j584j5J626J454l30j837j880q21M64J240R28
$$ 411689 413049 414377 415229 414986 413486 411902 411887 413513 414967 414637 412800 410920 410099 410563 411803 412731
52859D12731k40q16K37J828K033Q68j7k22j079k852l710k535p08J26L56Q77R08
$$ 412731 412491 411675 411912 413740 415773 416641 416624 416402 415323 412471 408761 406226 405518 405644 406000 406877 407785
52842D07785o08k545k825j454j97M23J493K964K969Q46j186q83Q37J228m39k142
$$ 407785 407177 404632 401807 400353 400156 400579 402072 405036 408005 408851 407665 406782 407619 408847 408408 406266
52826D06266k126j039m27k83O45K512L606K485K2j505j024N39J912K901L757M163
$$ 406266 404140 403101 402674 402391 403036 405548 409154 411639 411661 410156 409132 409671 411583 414484 418241 422404
52810D22404L651K476J323M34k88n36J82J576K429J711l60k423l065k049n77j73
$$ 422404 426055 428531 429854 430288 430000 429464 429646 431222 433651 435362 435002 432579 429514 427465 426888 426715
52794D26715j086k138k259j579q34l52k39q31k186l523m061m069m274m477l823
$$ 426715 425629 423491 421232 419653 418819 418467 418228 417397 415211 411688 407627 403558 399284 394807 390984
52779C90984k373j351j529k169k020q14O02J249Q47j02p52n53L66J412J990J842
$$ 390984 388611 387260 385731 383562 381542 380728 381330 382579 383426 383324 382572 382019 382385 383797 385787 387629
52763C87629J266J100J957L217L284J404j215k652k302j155m81q13j801k402j571
$$ 387629 388895 389995 391952 395169 398453 399857 398642 395990 393688 392533 392052 391239 389438 387036 385465
52748C85465M13J733J012q27j678r31P0J90j49l7N36Q72M63n92j609j735q44M4
$$ 385465 385878 387611 388623 387796 386118 385187 385257 385447 385298 385261 385797 386669 387132 386540 384931 383196 382352 382396
52730C82396Mm00J0R37P82r47k676k854j850j012q73j119j524j941j952j458j231
$$ 382396 382400 382000 382010 382947 383729 382782 380106 377252 375402 374390 373517 372398 370874 368933 366981 365523 364292
52713C64292j960k932k612o15J584K234J223O7N7P64P03o24j954j852l70J436
$$ 364292 362332 359400 356788 356173 357757 359991 361214 361281 361338 362102 362805 362181 360227 358375 358005 359441
52697C59441L000M247M566L195P39r51q07M78J706K447K753K679K575K891L245
$$ 359441 362441 366688 371254 374449 375188 374237 373430 373908 375614 378061 380814 383493 386068 388959 392204
52682C92204K692J304M72J016K123K877L630M746N187L747J213k90J06J224J625
$$ 392204 394896 396200 396672 397688 399811 402688 406318 411064 416251 419998 421211 420921 421027 422251 423876
52667D23876J191P40P91J018O56o76k481l977n025n809n658l392O27L913M364
$$ 423876 425067 425807 426598 427616 428272 427596 425115 421138 416113 410304 404646 401254 401881 405794 410158
52652D10158K546N61n56j183j622j679j469j387j314q58k64j03k12N4N63M80l65
$$ 410158 412704 413265 412709 411526 409904 408225 406756 405369 404055 403197 402933 402830 402618 402672 403235 403715 403350
52635D03350j146j234q80n09j30K92N20L53j07n73o05K46J807L009K836J394l87
$$ 403350 402204 400970 400090 399581 399451 399743 400263 400616 400509 399936 399331 399577 401384 404393 407229 408623 408236
52618D08236j814k582k376j301l82o03j445j443k15J014J060j1j444k655l156
$$ 408236 406422 403840 401464 400163 399781 399178 397733 396290 396075 397089 398149 398138 396694 394039 390883
52603C90883k452o13J451K685K732K139J853K360K998K604J272P37K158M270M916
$$ 390883 388431 387818 389269 391954 394686 396825 398678 401038 404036 406640 407912 408649 410807 415077 419993
52588D19993L911K873K519J906N64m25j87M90L72n80j562k028j810r63p3J2o31
$$ 419993 423904 426777 429296 431202 431766 431341 431154 431644 432016 431436 429874 427846 426036 425073 425000 425012 424381
52571D24381q44N7J484K705L803M875N389N154M871M776L734R34k393m258m438
$$ 424381 423537 423594 425078 427783 431586 436461 441850 447004 451875 456651 460385 461319 458926 454668 450230
52556D50230m312m487m119k596o95L63J64r15k193k920k562j272J68R75Q80J56
$$ 450230 445918 441431 437312 434716 434021 434384 434548 433633 431440 428520 425958 424686 424854 425829 426709 426865
52540D26865n93q84q18q84j150j131o44k12j35O6P05J088N98l4M07J800K883L016
$$ 426865 426272 425388 424570 423686 422536 421405 420761 420549 420414 420480 421185 422273 422871 422837 423244 425044 427927 430943
52522D30943K615J879M82j196j902j178k24l05j068j354j065j150j874k187j154
$$ 430943 433558 435437 435919 434723 432821 431643 431419 431114 430046 428692 427627 426477 424603 422416 421262
52507D21262O22J602J098m6o78p32r83j673k054j455j55J130K097K649K417J177
$$ 421262 421884 423486 424584 424538 423860 423128 422145 420472 418418 416963 416808 417938 420035 422684 425101 426278
52491D26278m80j753k659l690m533m111k191o6Q84P09N05R35J692K172K140J764
$$ 426278 425798 424045 421386 417696 413163 409052 406861 406795 407679 408388 408893 409828 411520 413692 415832 417596
52475D17596J321R91Q34Q83J128J311R91J72m04n6Q17J136N42k87p53r72r99l66
$$ 417596 418917 419908 420742 421625 422753 424064 425055 425227 424823 424767 425584 426720 427262 426975 426222 425250 424251 423885
52457D23885R31J762J179O2K91K302M403M873L931L072L048L368L411L248L101
$$ 423885 424816 426578 427757 427819 428110 430412 434815 439688 443619 446691 449739 453107 456518 459766 462867
52442D62867K697J614Jj460k293k540k479k278k007j685j314j072j309k022k505
$$ 462867 465564 467178 467179 465719 463426 460886 458407 456129 454122 452437 451123 450051 448742 446720 444215
52427D44215k104j281j113j608j533l75N56l8j328j318M66K546L506L227K124
$$ 444215 442111 440830 439717 438109 436576 436201 436757 436719 435391 434073 434539 437085 440591 443818 445942
52412D45942O46l40l0R93J238N88O86K219L404K462L43o10J07J059J474J958K669
$$ 445942 446588 446248 446218 447211 448449 449037 449723 451942 455346 457808 458151 457541 457648 458707 460181 462139 464808
52395D64808K641J545N58P08J338J067m30k229l216k925j818j100j730l299m477
$$ 464808 467449 468994 469552 470260 471598 472665 472235 470006 466790 463865 462047 460947 459217 455918 451441
52380D51441m657m492m602m654m164l343k553j722q28k34J06J000K724M150M217
$$ 451441 446784 442292 437690 433036 428872 425529 422976 421254 420426 420192 420298 421298 424022 428172 432389
52365D32389L583L590M050L570K040J174K142L791M082K526N77j1J287L433M702
$$ 432389 435972 439562 443612 447182 449222 450396 452538 456329 460411 462937 463514 463503 464790 468223 472925
52350D72925M259L219L651O181R023R938Q710P059O269N716M047J171j583l169
$$ 472925 477184 480403 484054 490235 499258 509196 517906 524965 531234 536950 540997 542168 540585 537416
52336E37416l946m724n222m347k046Q6N91j72q31q81q27q73p12n50r97j652j034
$$ 537416 533470 528746 523524 519177 517131 517217 517808 517636 516805 515924 515097 514224 513512 512962 511965 510313 509279
52319E09279J346L870M681L882K961K568K141J559J879L874O610Q203P912O978
$$ 509279 510625 514495 519176 523058 526019 528587 530728 532287 534166 538040 544650 552853 560765 567743
52305E67743P202Q761R845Q740N953L594K691K151P66p11o09J134K848L497L981
$$ 567743 574945 583706 593551 602291 608244 611838 614529 616680 617446 616735 616126 617260 620108 623605 627586
52290F27586N456P393Q232P556O651O798P759Q356Q112P718P981Q910J0120J1617
$$ 627586 633042 640435 648667 656223 662874 669672 677431 685787 693899 701617 709598 718508 728628 740245
52276G40245J3627J5863J7661J8878K0155K2063K4394K6501K7987K8888K9438
$$ 740245 753872 769735 787396 806274 826429 848492 872886 899387 927374 956262 985700
52265I85700K9893L0323L0643L1019L2052L3956L5696L5831L4264L2269L0508
$$ 985700 1015593 1045916 1076559 1107578 1139630 1173586 1209282 1245113 1279377 1311646 1342154
$$ [...]
##END NTUPLES=NMR SPECTRUM
##END=
