
##TITLE=AC1222_Punto_6074794_1Xs9jaGfa0
##JCAMPDX= 6.0         $$ Bruker NMR JCAMP-DX V2.0
##DATA TYPE= NMR SPECTRUM
##DATA CLASS= NTUPLES
##ORIGIN= BRUKER
##OWNER= Administrator
$$ 1.72 TOPSPIN		Version 2.1
$$ 2012-05-08 20:13:05.812 -0500  Administrator@TOPSPIN
$$ Compression mode = diff/dup
##.OBSERVE FREQUENCY= 400.13188235
##.OBSERVE NUCLEUS= ^1H
##.ACQUISITION MODE= SIMULTANEOUS (DQD)
##.ACQUISITION SCHEME= undefined
##.AVERAGES= 8
##.DIGITISER RES= 22
##SPECTROMETER/DATA SYSTEM= spect
##.PULSE SEQUENCE= zg30
##.SOLVENT NAME= COFFEE_meoh
##.SHIFT REFERENCE= INTERNAL, COFFEE_meoh, 1, 14.98061
##AUDIT TRAIL= $$ (NUMBER, WHEN, WHO, WHERE, PROCESS, VERSION, WHAT)
$$ ##TITLE= Audit trail, TOPSPIN		Version 2.1
$$ ##JCAMPDX= 5.01
$$ ##ORIGIN= Bruker BioSpin GmbH
$$ ##OWNER= Administrator
$$ $$ C:\Bruker\TOPSPIN/data/COFFEE/nmr/AC1222_Punto_6074794_1Xs9jaGfa0/60/pdata/1/auditp.txt
$$ ##AUDIT TRAIL=  $$ (NUMBER, WHEN, WHO, WHERE, PROCESS, VERSION, WHAT)
(   1,<2012-05-08 20:12:59.062 -0500>,<Administrator>,<TOPSPIN>,<go>,<TOPSPIN 2.1>,
      <created by zg
	started at 2012-05-08 20:11:52.703 -0500,
	POWCHK enabled, PULCHK disabled,
       configuration hash MD5:
       AF F2 23 6B 01 CD 40 DD E5 A1 38 A0 06 EA F7 77
       data hash MD5: 64K
       0C 68 2B EF A5 66 35 07 6C B4 A9 96 E0 A6 01 7C>)
(   2,<2012-05-08 20:13:01.812 -0500>,<Administrator>,<TOPSPIN>,<proc1d>,<TOPSPIN 2.1>,
      <Start of raw data processing
       efp LB = 0 FT_mod = 6 PKNL = 1 PHC0 = 0 PHC1 = 0 SI = 32K 
       data hash MD5: 32K
       E2 81 3A EA F1 89 30 8E DF 2D 94 3A 9F DB 27 1A>)
(   3,<2012-05-08 20:13:02.171 -0500>,<Administrator>,<TOPSPIN>,<proc1d>,<TOPSPIN 2.1>,
      <pk PHC0 = 211.322 PHC1 = 0 
       data hash MD5: 32K
       A5 C8 FF FD 67 94 15 11 6F E6 A0 4C 7F 18 B7 D3>)
(   4,<2012-05-08 20:13:02.234 -0500>,<Administrator>,<TOPSPIN>,<proc1d>,<TOPSPIN 2.1>,
      <abs ABSG = 1 
       data hash MD5: 32K
       6E 45 2C 50 22 04 F4 71 C4 D5 1F F5 D7 3F C1 76>)
(   5,<2012-05-08 20:13:02.265 -0500>,<Administrator>,<TOPSPIN>,<proc1d>,<TOPSPIN 2.1>,
      <abs ABSG = 2 
       data hash MD5: 32K
       24 DD 79 AD 1D 78 5F AA A0 50 53 C5 63 9F 90 88>)
(   6,<2012-05-08 20:13:02.281 -0500>,<Administrator>,<TOPSPIN>,<proc1d>,<TOPSPIN 2.1>,
      <abs ABSG = 3 
       data hash MD5: 32K
       08 7B 24 A1 2F AF 39 3E 7B F7 21 61 40 B5 19 C3>)
(   7,<2012-05-08 20:13:02.312 -0500>,<Administrator>,<TOPSPIN>,<proc1d>,<TOPSPIN 2.1>,
      <abs ABSG = 4 
       data hash MD5: 32K
       68 63 A2 3E 3E 78 77 C6 9D F9 4D F6 3F BB FA 87>)
(   8,<2012-05-08 20:13:02.343 -0500>,<Administrator>,<TOPSPIN>,<proc1d>,<TOPSPIN 2.1>,
      <abs ABSG = 5 
       data hash MD5: 32K
       A8 48 69 63 8A BD 78 09 01 8E B8 0E 33 00 62 C5>)
$$ ##END=
$$ 
$$ $$ hash MD5
$$ $$ B1 25 4B A6 77 D5 2E 33 26 89 77 09 0D F9 4F 40
##$RELAX= 
##$RELAX= 
##$RELAX= 
##$RELAX= 
##$RELAX= 
##$RELAX= 
##$RELAX= 
$$ Bruker specific parameters
$$ --------------------------
$$ [...]
##$TP= (0..7)
150 150 150 150 150 150 150 150
##$TP07= 0
##$TPNAME0= <>
##$TPNAME1= <>
##$TPNAME2= <>
##$TPNAME3= <>
##$TPNAME4= <>
##$TPNAME5= <>
##$TPNAME6= <>
##$TPNAME7= <>
##$TPOAL= (0..7)
0.5 0.5 0.5 0.5 0.5 0.5 0.5 0.5
##$TPOFFS= (0..7)
0 0 0 0 0 0 0 0
##$TUNHIN= 0
##$TUNHOUT= 0
##$TUNXOUT= 0
##$USERA1= <user>
##$USERA2= <user>
##$USERA3= <user>
##$USERA4= <user>
##$USERA5= <user>
##$V9= 5
##$VALIST= <valist>
##$VCLIST= <CCCCCCCCCCCCCCC>
##$VD= 0
##$VDLIST= <DDDDDDDDDDDDDDD>
##$VPLIST= <PPPPPPPPPPPPPPP>
##$VTLIST= <TTTTTTTTTTTTTTT>
##$WBST= 1024
##$WBSW= 4
##$XGAIN= (0..3)
0 0 0 0
##$XL= 0
##$YL= 0
##$YMAX_a= 543784
##$YMIN_a= -655582
##$ZGOPTNS= <>
##$ZL1= 120
##$ZL2= 120
##$ZL3= 120
##$ZL4= 120
##$ABSF1= 14.98061
##$ABSF2= -5.57192
##$ABSG= 5
##$ABSL= 3
##$ALPHA= 0
##$AQORDER= 0
##$ASSFAC= 0
##$ASSFACI= 0
##$ASSFACX= 0
##$ASSWID= 0
##$AUNMP= <proc_prof1d_extract_pilot.lims>
##$AXLEFT= 0
##$AXNAME= <>
##$AXNUC= <1H>
##$AXRIGHT= 0
##$AXTYPE= 0
##$AXUNIT= <>
##$AZFE= 0.1
##$AZFW= 0.1
##$BCFW= 0
##$BC_mod= 0
##$BYTORDP= 0
##$COROFFS= 0
##$CY= 15
##$DATMOD= 1
##$DC= 0
##$DFILT= <>
##$DTYPP= 0
##$F1P= 0
##$F2P= 0
##$FCOR= 0.5
##$FTSIZE= 32768
##$FT_mod= 6
##$GAMMA= 0
##$GB= 0
##$INTBC= 1
##$INTSCL= 1
##$ISEN= 128
##$LB= 0
##$LEV0= 0
##$LPBIN= 0
##$MAXI= 10000
##$MC2= 0
##$MEAN= 0
##$ME_mod= 0
##$MI= 0
##$NCOEF= 0
##$NC_proc= -8
##$NLEV= 6
##$NOISF1= 0
##$NOISF2= 0
##$NSP= 0
##$NTH_PI= 0
##$NZP= 0
##$OFFSET= 14.98061
##$PC= 1
##$PHC0= 211.322
##$PHC1= 0
##$PH_mod= 1
##$PKNL= yes
##$PPARMOD= 0
##$PPDIAG= 0
##$PPIPTYP= 0
##$PPMPNUM= 2147483647
##$PPRESOL= 1
##$PSCAL= 4
##$PSIGN= 0
##$PYNMP= <proc.py>
##$REVERSE= no
##$SF= 400.13
##$SI= 32768
##$SIGF1= 0
##$SIGF2= 0
##$SINO= 400
##$SIOLD= 32768
##$SPECTYP= <>
##$SREGLST= <1H.CDCl3>
##$SSB= 0
##$STSI= 32768
##$STSR= 0
##$SW_p= 8223.68421052632
##$SYMM= 0
##$S_DEV= 0
##$TDeff= 65536
##$TDoff= 0
##$TI= <>
##$TILT= no
##$TM1= 0
##$TM2= 0
##$TOPLEV= 0
##$USERP1= <user>
##$USERP2= <user>
##$USERP3= <user>
##$USERP4= <user>
##$USERP5= <user>
##$WDW= 1
##$XDIM= 32768
##$YMAX_p= 458390293
##$YMIN_p= -713142
##$CURPLOT= <Network HP LaserJet P1505>
##$CURPRIN= <$Network HP LaserJet P1505>
##$DFORMAT= <normdp>
##$LAYOUT= <+/1D_H.xwp>
##$LFORMAT= <normlp>
##$PFORMAT= <normpl>
##$SURQMSG= 1
$$ End of Bruker specific parameters
$$ ---------------------------------
##NTUPLES= NMR SPECTRUM
##VAR_NAME=  FREQUENCY,     SPECTRUM/REAL,   SPECTRUM/IMAG
##SYMBOL=    X,             R,               I
##VAR_TYPE=  INDEPENDENT,   DEPENDENT,       DEPENDENT
##VAR_FORM=  AFFN,          ASDF,            ASDF
##VAR_DIM=   32768,         32768,           32768
##UNITS=     HZ,            ARBITRARY UNITS, ARBITRARY UNITS
##FACTOR=    0.250966925370066, 1,           1
##FIRST=     8223.43324360095, 28975,        -165197
##LAST=      0,             -225717,         -86960
##MIN=       0,             -713142,         0
##MAX=       8223.43324360095, 458390293,    0
$$ Real data points
##PAGE= N=1
##DATA TABLE= (X++(R..R)), XYDATA
$$ [...]
$$ plain form
19534 130796 67609 296155 211035 -20062 -361402 148234 -3861 -204583 -173032 -104212 -180659
19523 -180659 -116016 -64337 -174185 -131397 -83152 -72554 -111974 -103465 -234435 -181541 353488
19511 -18142 301208 -131403 -316241 170040 -84553 -9362 144218 -188376 230499 -189713
19500 -19743 58766 80466 220254 -73832 -388378 296546 -169422 -38041 -6748 188859 -36603
19488 -304989 -229285 -207187 -54354 -254819 -263484 317147 -159465 -114121 -64280 -25727 -176789
19477 -176789 -304425 -71652 -317478 -66319 98742 -86576 -11075 -33118 174186 14448 -128610
19465 -155069 25030 -10952 71676 -63599 -81814 144003 -9592 216369 -44254 -143505 264391
19453 -324528 -225389 -120337 -189690 198138 -16061 -114272 -182140 65714 89204 83842 23537
$$ packed form
19534A30796o3187K28546q5120b0062l41340A48234c861k00722L1551O8820p6447
19523a80659O4643N1679j09848M2788M8245J0598l9420Q509j30970N2894C53488
19511a8142C01208a31403j84838A70040h4553i362A44218a88376B30499a89713
19500a9743E8766K1700J39788g3832l14546B96546a69422c8041f748A88859c6603
19488c04989P5704K2098e4354k00465q665C17147a59465M5344M9841b5727j51062
19477a76789j27636g1652k45826f6319I8742h6576a1075k2043A74186A4448a28610
19465a55069B5030a0952G1676f3599j8215A44003i592B16369d4254r9251B64391
19453c24528R9139J05052o9353A98138a6061r8211o7868F5714K3490n362B3537
$$ plain form
19441 -74420 -274547 67546 -166359 -158138 -92828 80179 187138 -93473 -18027 192643 281261
19430 281261 -442698 -117608 79486 16769 35937 -145686 1151 -121486 -222936 -143156 -33645
19418 -105242 84596 186109 338461 -247747 192628 -86753 -230548 219603 915 138339
19408 138339 -166097 -119464 28038 -247965 130758 109288 69355 -24817 -221265 197138
19397 -169923 -160443 -126127 -241383 45342 9034 -157275 127025 -63283 -62088 -225706 -37501
19385 141726 -210257 351132 -84105 -255844 -19295 -427810 -262200 253017 -228221 -279024
19375 -279024 -210231 62926 -72239 -124786 -186955 114666 120223 -226763 -227453 -125928 131680
19363 -248535 -401229 -226341 -336165 14005 14466 -7674 -79885 -235522 12123 -236149 86609
$$ packed form
19441g4420k00127F7546a66359Q221O5310H0179J06959i3473a8027A92643Q8618
19430B81261d42698a17608G9486A6769J9168a45686A151a21486j01450P9780c3645
19418a05242H4596J01513J52352b47747A92628h6753j43795B19603I15J37424
19408A38339a66097M6633B8038b47965A30758k1470l9933b4817j96448A97138
19397a69923R480L4316j15256D5342I034a57275A27025f3283J195j63618c7501
19385A41726b10257C51132h4105j71739a9295m08515J65610B53017b28221n0803
19375b79024O8793F2926g2239n2547o2169A14666N557b26763o90J01525A31680
19363b48535j52694J74888j09824A4005M61g674p2211j55637A2123b36149H6609
$$ plain form
19351 -141056 427421 -131224 -166183 -143727 -418518 -206750 -399568 -89369 -95650 -174735 -201582
19340 -201582 -215122 -87330 -167826 -114690 144655 -57198 -119834 -162915 -79615 107282 -93265
19328 122261 -209600 -246128 -164696 84593 -73692 159627 -67267 -153997 2720 243518 -64553
19316 -282570 -10856 -169752 -208468 207374 -333767 210124 -221683 22205 -161399 11991
19305 111746 59146 159795 -286936 -88721 -273456 237025 -207965 -266015 165793 -151722
19294 -326969 -331279 -62004 5465 263359 -78370 -254200 -72917 342218 126784 -21154 30243
19282 -15037 244135 -191642 62449 -83215 66812 -253614 -316157 -182775 6187 -117107 58048
19270 -291403 -138353 5014 -460713 3809 -165420 -160092 -234874 28029 25828 147590 -321000
$$ packed form
19351a41056D27421a31224l4959K2456k74791b06750j92818h9369o281p9085k6847
19340b01582j3540h7330q0496N3136A44655e7198o2636m3081g9615A07282i3265
19328A22261b09600l6528Q1432H4593g3692A59627f7267q6730B720K40798f4553
19316b82570a0856j58896l8716B07374c33767B10124b21683B2205a61399A1991
19305A11746n2600J00649b86936h8721j84735B37025b07965n8050A65793a51722
19294c26969m310f2004E465K57894g8370j75830g2917C42218A26784b1154C0243
19282a5037B44135a91642F2449h3215F6812b53614o2543J33382F187a17107E8048
19270b91403a38353E014d60713C809a65420N328p4782B8029k201J21762c21000
$$ plain form
19258 10136 -166316 -76260 -334012 28468 -87908 -66341 137376 56561 -95706 -183354 133339
19246 133078 -19384 -242210 69824 -69084 -78712 -139772 -275426 -43488 -150460 1157 -73624
19234 75625 -102467 -9744 249928 -152506 -19706 -318720 -108268 -364074 -346773 275386
19223 -232549 126766 4887 -172260 -297192 -108760 14279 104407 -250613 126922 107447
19213 107447 -224833 78805 -169099 -165215 269790 -66806 202431 -292644 10409 -272505
19202 -598920 -115097 -162164 -49606 94815 89851 -58622 -192538 -279641 -356539 -44037 -22691
19191 -22691 136019 -98887 59107 -153696 429068 -333772 -273128 -157364 202582 -268679
19180 54807 51255 94982 -133724 -65874 158734 -102698 132051 -196485 -183262 -174425 -210108
$$ packed form
19258A0136a66316g6260k57752B8468h7908K1567A37376E6561i5706q7648A33339
19246A33078a9384k22826F9824f9084r628o1060j35654d3488j06972A157g3624
19234G5625a02467i744B49928a52506a9706k99014a08268k55806J7301B75386
19223b32549A26766D887a72260j24932a08760A4279R0128b50613A26922j9475
19213A07447b24833G8805a69099L884B69790f6806B02431b92644A0409b72505
19202e98920a15097m7067d9606I4815m964e8622j33916q7103p6898d4037K1346
19191b2691A36019i8887E9107a53696D29068c33772O0644J15764B02582b68679
19180E4807l552M3727a33724f5874A58734a02698A32051a96485J3223Q837l5683
$$ plain form
19169 -210108 9059 -94245 9949 104932 152015 17765 -90185 426554 -166107 320072 -257835
19157 204066 64765 -19119 -333599 -9130 -344620 89517 -6270 6766 -117868 -355611 54023
19145 -155461 -91928 176247 -41762 -502350 -104704 -72360 -86228 73731 -127267 -304995
19135 -304995 -432629 -98960 -12401 -82747 -273363 101850 -113904 196438 -101244 -168770
19125 -168770 -124609 102161 -360465 -179247 -21682 -7155 350397 -152522 18655 -111703
19114 -55823 88505 230229 338214 27291 85457 9027 -224298 315558 70790 -139331 -263048
19103 -263048 -130322 -12188 -176179 -166776 96104 -102015 -94643 -287199 128630 -152584 103116
19091 -18835 201890 -183076 -55651 -415605 -33343 -399777 129293 -136639 -250774 -109691
$$ packed form
19169b10108I059i4245I949R4983M7083A7765i0185D26554a66107C20072b57835
19157B04066F4765a9119l14480i130l35490H9517f270F766a17868k37743E4023
19145a55461O3533A76247d1762m60588a04704L2344j3868G3731a27267j77728
19135c04995j27634i8960a2401p0346j90616A01850a13904A96438a01244o7526
19125a68770M4161A02161c60465a79247b1682g155C50397a52522A8655a11703
19114e5823H8505J41724J07985B7291N8166I027b24298C15558G0790a39331j23717
19103b63048a30322a2188j63991R403I6104a02015P372j92556A28630a52584A03116
19091a8835B01890a83076e5651l59954c3343l66434A29293a36639j14135a09691
$$ plain form
19080 -2235 130662 99667 -160427 -272981 -640122 190286 215433 -162981 34031 -46370 -87944
19069 -87944 87634 -48477 9209 73860 -99619 -89680 33330 46474 173940 -39059 -41772 -58305
19057 -58305 -17103 183478 -199436 -72869 -39563 145309 192440 127955 148507 -310507 61894
19045 -117346 -218715 57838 19044 -140697 -98943 4444 -2682 -266398 -156381 -248575 -139048
19034 -139048 -145633 -152609 -138905 -198816 -240445 -59611 -76682 -329804 -291264 15570 -61652 398900
19021 76767 133934 110868 96432 69721 87915 31602 11854 87140 338232 24873 85197
19010 85197 -62929 -2871 62569 38244 95602 34097 -310726 22348 -153338 -34498 26154
18998 -129788 -378313 -13382 -236428 -113802 -70128 -11985 -174726 343256 -134601 113353
$$ packed form
19080b235A30662l0995a60427j12554l67141A90286K5147a62981C4031d6370m1574
19069h7944H7634d8477I209O4651i9619R939C3330J3144J27466c9059k713j6533
19057e8305a7103A83478a99436g2869L3306A45309M7131o4485K0552c10507F1894
19045a17346j01369E7838A9044a40697M1754D444b682k63716J10017r2194J09527
19034a39048o585o976J3704n9911m1629e9611j7071k53122L8540A5570f1652C98900
19021G6767N7167k3066j4436k6711J8194C1602A1854P5286K51092B4873O0324
19010H5197f2929b871F2569k4325N7358C4097c10726B2348a53338c4498B6154
18998a29788k48525a3382k23046a13802M3674a1985j62741C43256a34601A13353
$$ plain form
18987 -326650 175205 252444 1134 354475 -39880 -400987 -88846 96361 -189405 -289264 -228592
18976 -228592 219971 61951 164188 -214572 -65647 49907 204973 -280751 -30263 52057
18965 -139181 -124216 256656 -26486 161451 -32298 -151921 -16889 -130588 -98869 53904 132740
18954 132740 -32202 -233185 5124 -292675 360676 -51549 -9180 106139 -147151 -310259 99884
18942 -295038 -46590 -55496 -50551 -29990 -114422 -97206 -63947 -326764 20557 -196052 204875
18930 -227755 94282 -38804 -111714 15050 200229 -34819 -55987 -212550 -147572 -96991 -76997
18919 -76997 291699 -228780 72643 -21215 -143118 -268303 -200552 -356942 -297785 -130333
18908 -18186 -245194 -138137 -141670 74881 2027 -55740 -254176 199864 175075 376319 -259467
$$ packed form
18987c26650A75205P7239A134L53341c9880l61107h8846I6361a89405r9859O0672
18976b28592B19971F1951J02237b14572f5647D9907J55066b80751c0263E2057
18965a39181J4965B56656b6486A61451c2298j19623a6889j13699L1719E3904P8836
18954A32740c2202k00983E124b92675C60676e1549i180A06139a47151j63108I9884
18942b95038d6590q906M945K0561q4432J7216L3259k62817B0557a96052B04875
18930b27755I4282c8804p2910A5050J85179c4819k1168j56563O4978N0581J9994
18919g6997B91699b28780G2643b1215j21903j25185O7751j56390N9157a30333
18908a8186k27008J07057l533G4881B027e5740j98436A99864k4789K01244b59467
$$ plain form
18896 -104533 114780 -58751 -64717 -230601 -70437 -146848 -118289 -125002 98912 30366 33942 -72850
18883 11706 -29167 -311659 -46100 125158 175575 -201733 -43730 -13337 -120290 44232 -39849
18871 7835 -369680 395444 -176624 222906 -212179 -80080 90977 135254 -215925 -191942 123815
18859 -10979 -181854 -329740 125430 -218579 -90237 155946 -52911 -325996 -131524 170718
18848 -198213 -55117 -371037 66001 -283067 -94770 2785 63516 -146084 69236 79509 2392
18836 369934 211921 -187546 2425 9816 -12522 -328608 -1432 148882 -133665 -144303 181707
18824 60867 -46376 -11474 117567 -77915 -53366 -98575 -18072 -28238 246784 -149324 -155650
18813 -155650 -58750 -166543 311465 -94958 -178437 -332084 -82061 -217735 147636 114236
$$ packed form
18896a04533A14780e8751n966j65884g0437p6411K8559o713I8912C0366L576g2850
18883A1706b9167k82492d6100A25158N0417b01733d3730a3337j06953D4232c9849
18871G835c69680C95444a76624B22906b12179h0080I0977M4277b15925K3983A23815
18859a0979j70875j47886A25430b18579i0237A55946e2911k73085a31524A70718
18848a98213e5117l15920F6001b83067i4770B785O0731a46084F9236J0273B392
18836C69934j58013a87546B425P391a2522l16086a432A48882a33665j0638A81707
18824F0867d6376a1474A17567g7915K4549m5209a8072j0166B46784a49324o326
18813a55650e8750j07793C11465i4958q3479j53647h2061j35674A47636l3400
$$ plain form
18803 114236 63440 -204546 -144768 -304983 140336 -75611 -174132 303807 178240 225819
18793 225819 34809 -42526 81814 -264894 -151630 88147 217116 7365 -35713 42015 -196619
18781 -19679 102239 -220482 48055 -106073 130465 67057 -31657 257926 26768 199000
18771 199000 -125328 -274847 -94484 -35228 -89226 -336524 267010 -21977 -209194 -139900
18761 -139900 -209187 -156019 -290733 128381 -89281 -274757 96248 111374 -267951 -62347 -113120
18750 -113120 -362379 19897 -58788 -169447 -216889 -105258 -97270 -83899 -24765 -195176 262220
18738 169197 88563 83296 123565 281183 -123075 -83285 -190405 -85046 -57533 188069 59600
18726 -23323 6570 86861 -102451 419203 101469 -26717 -237520 286676 -325603 6943 -487749
$$ packed form
18803A14236n0796b04546N9778j60215A40336g5611r8521C03807j25567M7579
18793B25819C4809d2526H1814b64894J13264H8147J28969G365c5713D2015a96619
18781a9679A02239b20482D8055a06073A30465o3408c1657B57926B6768J72232
18771A99000a25328j49519i4484c5228n3998k47298B67010b1977j87217O9294
18761a39900o9287N3168j34714A28381h9281j85476I6248J5126b67951f2347n0773
18750a13120k49259A9897e8788j10659m7442a05258P988J3371b4765j70411B62220
18738A69197q0634n267M0269J57618a23075L9790j07120h5046K7513A88069E9600
18726b3323F570Q0291a02451D19203A01469b6717k10803B86676c25603F943d87749
$$ plain form
18714 -22331 109545 53267 301204 -275606 -305640 -115867 -218482 44942 -76186 -262663
18704 -262663 3016 87302 -204533 -76869 82253 -323570 -88797 -309579 -108883 150343 10120
18692 -196017 -115303 -46869 93895 -90145 14270 291023 -263564 -311855 -28776 -166727 -236767
18681 -236767 -214771 15863 -214086 229055 45964 134705 -322586 186343 187799 -208613 -19151
18669 14799 221158 202172 -291156 31241 179115 -164126 -183211 -3201 -413021 -253700 -194615
18658 -194615 -288202 -256782 30858 526 376556 -295692 269077 -15383 -134901 -14383 -337372
18647 -337372 -146038 -244354 299144 22240 169517 -243769 71954 -120873 103205 266423
18637 266423 25942 -236224 -119947 -228554 113384 72832 -213600 284658 80859 181174
$$ packed form
18714b2331A09545E3267K47937b75606l0034a15867j02615D4942g6186j86477
18704b62663C016Q4286b04533g6869H2253c23570h8797k20782a08883A50343A0120
18692a96017Q0714d6869I3895i0145A4270K76753b63564m8291b8776j37951p0040
18681b36767K1996A5863b14086B29055D5964Q8741c22586A86343J456b08613a9151
18669A4799K06359j8986b91156C1241J47874a64126j9085c201m09820J59321N9085
18658a94615r3587L1420C0858E26L76030b95692B69077a5383j19518a4383l22989
18647c37372a46038r8316B99144B2240J47277b43769G1954a20873A03205J63218
18637B66423B5942b36224J16277j08607A13384m0552b13600B84658H0859J00315
$$ plain form
18627 181174 -120207 184133 120211 11415 -93984 7124 -254753 -78299 -29537 336457 -272581
18615 -301520 -130534 -114438 -63256 108358 -162183 -353078 94768 -221172 53373 334394
18605 334394 -18872 238590 -90928 -242185 -364912 -188025 174915 14008 -286759 -257278
18595 -257278 -12376 -7237 -200335 -282366 -96468 -204599 -232970 50298 4169 -104844 -8320
18583 -128347 -9104 103018 -186126 17098 -38356 -6201 135329 -162992 -190364 -97745 -177873
18572 -177873 -182595 2423 27701 -5907 -180319 -446555 -76336 -103645 -46880 -101804 210883
18560 -64234 28121 -178599 240919 137547 -6360 357875 -193006 242190 5115 511 -33663
18548 248651 -45990 180100 -48034 -259090 5013 -27242 170247 -241899 -218741 72721 -161096
$$ packed form
18627A81174a20207A84133o3922A1415i3984G124b54753g8299b9537C36457b72581
18615c01520a30534J6096N1182A08358a62183j90895I4768b21172E3373K81021
18605C34394a8872B38590i0928j51257j22727J76887A74915A4008b86759K9481
18595b57278a2376N139j93098q2031i6468j08131k8371E0298D169a04844h320
18583a28347i104A03018a86126A7098c8356f201A35329a62992k7372R2619q0128
18572a77873m722B423K5278e907j74412k66236g6336k7309d6880n4924B10883
18560f4234B8121a78599B40919j03372f360C57875a93006B42190E115E11c3663
18548B48651d5990A80100d8034k11056E013b7242A70247b41899K3158G2721a61096
$$ plain form
18536 307430 -66559 -87359 -167421 -375 182061 -82829 264311 -60702 -79813 -157509 22561
18524 -297015 -304617 -98132 38710 -222083 73293 -144713 -77418 -41329 -64241 18493 34422
18513 34422 -348107 96459 -189083 172915 202848 228105 227041 -120827 -411469 -65131 136673
18501 -113942 142911 337 357785 144720 -122779 -48417 -426413 280158 -54112 -124557 210830
18489 174508 -50457 -43510 -66816 -237947 -2652 126414 -164941 42883 -239830 -274846 -52106
18477 66958 -98887 -66732 -251604 -94307 94312 -124678 -51567 -153865 241959 8977 -58921
18465 -15699 -198783 -22039 311751 -110281 -27398 -4372 237546 186336 -210044 -201696 -105173
18454 -105173 -35511 82578 12296 85646 -38402 17422 260904 -320641 51596 24823 -376783
$$ packed form
18536C07430f6559k0800q0062c75A82061h2829B64311f0702j9111p7696B2561
18524b97015p602i8132C8710b22083G3293a44713O7295L6089k2912A8493J5929
18513C4422c48107I6459a89083A72915K9933K5257j064a20827k90642f5131A36673
18501a13942A42911C37L57448A44720a22779d8417l77996B80158e4112p0445B10830
18489A74508e0457O947k3306j71131b652A26414a64941D2883b39830l5016e2106
18477F6958i8887L2155j84872i4307I4312a24678e1567j02298B41959H977e8921
18465a5699j83084b2039C11751a10281b7398d372B37546n1210b10044Q348R6523
18454a05173c5511H2578A2296P3350c8402A7422K43482c20641E1596B4823c76783
$$ plain form
18442 -68221 -49954 -40359 73089 -72367 -154514 -36519 175634 -152190 -186347 -77978 170874
18430 -387300 170387 88402 459 -14299 -51159 -57218 57924 85970 -316695 -308584 -49983 -178958
18418 -178958 -284507 -32777 -114423 -423911 147070 -147324 -229743 92012 -32699 -37023 103798
18406 212723 266368 -33228 104473 192367 -14642 -229969 142559 124444 180082 -51362 -219876
18395 -219876 -129574 43951 -229599 -7700 286651 234846 -396077 363060 -109973 -283292
18385 -283292 179420 -90710 -278977 -163792 -217163 413200 53070 -22664 246432 110438
18374 95124 -154472 -109272 140629 -441559 -27543 -82854 -135140 -103272 -193632 -208614 -758
18362 160160 -234989 -274307 -56194 83989 -122431 130002 167801 87284 279400 197930 -174906
$$ packed form
18442f8221J8267R595G3089g2367q2147c6519A75634a52190l4157g7978A70874
18430c87300A70387q1985D59a4299l6860o059E7924K8046c16695Q111d9983j28975
18418a78958j05549c2777q1646l09488A47070a47324q2419I2012c2699m324A03798
18406B12723N3645c3228A04473Q7894a4642k15327A42559j8115N5638e1362j68514
18395b19876R0302D3951b29599g700B86651n1805c96077C63060a09973j73319
18385b83292A79420i0710j88267J15185n3371D13200E3070b2664B46432A10438
18374I5124a54472M5200A40629d41559b7543n5311n2286L1868r0360j4982g58
18362A60160b34989l9318e6194H3989a22431A30002L7799q0517J92116q1470a74906
$$ plain form
18350 164013 -147012 6332 -361451 -284967 50332 -38317 152591 -204971 -333011 -152222
18339 -423190 58036 13943 133333 147036 -124015 -105144 8117 127918 114319 -215235 103352
18327 -115459 153820 137684 -58472 41449 -328737 -75076 18545 104813 78215 -306725 209204
18315 -71134 -7969 -133308 -272121 97967 -78503 -117797 -154847 -35891 -249376 -277565 -184059
18304 -184059 22369 227058 -210232 -233880 -260572 -211603 55375 -255753 387451 -61320 38306
18292 -79210 -131998 -124904 -89870 89258 32380 -2831 -36538 44329 -26213 -4969 -32933 20859
18279 -221914 102360 -57266 251405 123130 -113246 -277931 71204 -165192 136238 -115847
18268 199637 -183950 -188531 396224 125224 222482 80837 56417 67925 169813 62542 35337
$$ packed form
18350A64013a47012F332c61451P6484E0332c8317A52591b04971j28040a52222
18339d23190E8036A3943J19390J3703a24015J8871H117J19801j3599b15235A03352
18327a15459A53820j6136e8472D1449c28737g5076A8545Q6268k6598c06725B09204
18315g1134g969j25339j38813I7967g8503l9294l7050c5891k13485k8189R3506
18304a84059B2369K04689b10232k3648k6692M8969E5375b55753C87451f1320C8306
18292g9210n2788P094L5034H9258C2380b831l3707D4329b6213d969k7964B0859
18279b21914A02360e7266B51405A23130a13246j64685G1204a65192A36238a15847
18268A99637a83950m581C96224A25224R7258H0837k4420J1508J01888F2542k7205
$$ plain form
18257 35337 125416 -57091 198856 42944 -322527 -63965 -91310 213851 -188602 7350 -250443
18245 -69267 143599 27245 -22085 49259 49583 -306586 230400 -142691 -37319 -100908 -88112
18234 -88112 216834 89256 -295509 -49145 61072 157954 89688 152794 -105897 -257503 -391053
18223 -391053 -271201 37043 67266 -243118 -135568 100622 103037 -64828 -251835 39768 -176694
18211 -142914 -43099 32696 175746 143354 -249139 56921 -2651 -84783 -54290 -3371 55219
18199 -232953 10162 -15309 392525 200205 21163 -16752 106257 -61541 65318 -336248 -59449
18187 59139 136460 53436 23685 213600 208452 -116688 356 -211896 -92393 -76812 -242968
18176 -242968 13818 -386012 50375 -139996 -109251 -26517 -274217 18414 -112559 -220084
$$ packed form
18257C5337R0079e7091A98856D2944c22527f3965k7345B13851a88602G350b50443
18245f9267A43599B7245b2085D9259L24c06586B30400a42691c7319o3589J2796
18234h8112B16834H9256b95509d9145F1072R6882o8266O3106a05897j51606j33550
18223c91053J19852C7043L0223b43118J07550A00622K415f4828j87007C9768a76694
18211a42914d3099C2696J43050l2392b49139E6921b651q2132L0493c371E5219
18199b32953A0162a5309C92525j92320B1163a6752A06257f1541F5318c36248e9449
18187E9139P7321E3436B3685J89915n148a16688C56b11896i2393J5581j66156
18176b42968A3818c86012E0375a39996L0745b6517k47700A8414a12559j07525
$$ plain form
18166 -220084 -55019 155737 -87686 -79587 75987 156371 -296835 -84149 162813 -19939 -62851
18155 -62851 -308620 -108792 199210 -560509 148054 -104158 -409305 -178451 -89129 95026
18144 194328 214433 -369310 13461 104464 -144103 -125229 -119853 39610 -355552 -88410 -152384
18133 -152384 16350 52603 103964 -378812 119589 111129 52991 76241 -96628 -275306 -178482
18122 -178482 -559748 -349287 384394 -239533 -337027 -205277 -377654 -65774 -172679 -22803
18111 -184774 -90791 -207740 -240383 -358761 -212830 191930 275474 258421 136219 141927 -15334
18099 -172221 -48966 86516 212110 -262367 -208374 -104016 21225 315268 -150132 -129173
18089 -129173 2615 100586 -113111 -84544 165192 123876 30152 -79916 -41667 56177 -194362
$$ packed form
18166b20084e5019A55737h7686Q099G5987Q0384b96835h4149A62813a9939m2912
18155f2851k45769a08792A99210e60509A48054a04158l05147a78451h9129I5026
18144A94328K0105c69310A3461R1003a44103J8874N376C9610c55552h8410o3974
18133a52384A6350L6253N1361c78812A19589q460E2991K3250i6628j78678R6824
18122a78482l81266K10461C84394b39533r7494J31750j72377f5774j06905b2803
18111a84774i0791j16949l2643j18378J45931A91930Q3544j7053j22202N708a5334
18099a72221d8966H6516J25594b62367N3993a04016B1225K94043a50132K0959
18089a29173B615R7971a13111K8567A65192m1316C0152g9916L8249E6177a94362
$$ plain form
18077 -12238 -148249 -123087 -7845 122285 109055 32345 251435 252311 197405 -131813 -13941
18065 -26369 303213 25360 -143978 -314439 110624 -73174 -432708 -80834 8025 -203337 -256779
18054 -256779 15040 -21892 -106481 -414712 -163553 -11799 -35266 -46495 19022 2448 -128139
18042 119005 -278502 92694 30424 -201948 170524 -210211 125377 186219 19848 14231 -163530
18030 120367 161869 44416 -179171 -308122 49272 3285 -4717 -187873 -128009 351967 21106
18018 -19842 85888 158344 163202 145817 140233 40182 -741 271490 -55952 -206791 -258565 -42272
18005 51963 166978 164363 111079 273023 -89348 -71719 264067 14803 17615 -173633 8835
17993 174109 20821 90854 -191292 -203548 36922 209880 -314687 327808 14299 171362
$$ packed form
18077a2238j36011K5162g845A22285j3230C2345K19090Q76n4906a31813a3941
18065b6369C03213B5360a43978j70461A10624g3174l59534h0834H025b03337n3442
18054b56779A5040b1892q4589l08231a63553a1799k3467j1229A9022B448a28139
18042A19005b78502I2694C0424b01948A70524b10211A25377O0842A9848n617a63530
18030A20367M1502D4416a79171j28951D9272C285d717j83156N9864C51967B1106
18018a9842H5888P2456M858j7385n584D0182g41B71490e5952j50839n1774d2272
18005E1963J15015k615n3284J61944h9348J7629B64067A4803K812a73633H835
17993A74109B0821P0033a91292j2256C6922J72958c14687C27808A4299J57063
$$ plain form
17983 171362 -137948 -8610 46388 -21642 -225218 229618 121692 29773 248525 -340780
17972 -277372 394250 103983 -242709 -374153 -326063 -55831 -249203 -67014 -311777 -37295
17961 107420 -94641 222473 -163489 77671 -118562 23625 -80270 -20135 -362201 103195
17950 -248445 -214508 331594 -106419 25344 123339 31871 92052 51609 -96085 -303448 53185
17938 -283854 77137 130864 -304364 -269661 -113233 101559 -16392 58160 7684 -64078 -287998
17927 -287998 89275 -476930 137131 95041 122716 -245769 18694 -275948 50382 -18632 246810
17915 -310544 126641 66197 -247965 271573 25652 5275 86519 -43173 -267998 -253054 -134055
17904 -134055 -255055 -265512 187222 -89086 -124693 -187911 -31211 72165 101444 175028 -144280
$$ packed form
17983A71362a37948h610D6388b1642k03576B29618j07926B9773K18752c40780
17972b77372C94250A03983b42709j31444M8090e5831j93372f7014k44763c7295
17961A07420i4641B22473a63489G7671a18562B3625h0270b0135l42066A03195
17950b48445L3937C31594a06419B5344R7995C1871O0181m0443i6085k07363E3185
17938b83854G7137N3727c04364L4703a13233A01559a6392E8160G684f4078k23920
17927b87998H9275d76930A37131m2090K7675b45769A8694b75948E0382a8632B46810
17915c10544A26641o0444b47965B71573B5652E275Q1244d3173k24825J4944J18999
17904a34055j21000j0457A87222h9086l5607o3218c1211G2165K9279P3584a44280
$$ plain form
17892 169344 215519 67002 229602 140428 72055 5870 255974 -139548 -40906 183041 -47917
17880 136217 45710 -190477 -157594 -218956 -177214 -196052 303690 -162125 -30440 -7178 -67764
17869 -67764 51094 -178107 298812 53305 -59505 -255003 -113680 111003 -112310 -303835
17859 -303835 16794 48782 1842 -20161 128973 99698 63337 -168651 -99270 267993 -446963
17847 102326 364368 -1964 -50653 -407347 -368141 311142 27989 -40448 -10441 15083 -6321
17835 -54754 92133 -85350 -168113 -151631 7947 -84898 -3185 22771 285448 93392 214729 -106459
17822 40336 184338 -257928 -373591 311895 -29726 223168 195870 -110464 118604 -178025
17811 101773 -196109 -99960 11413 172487 19380 6466 243604 -77423 135584 84371 -71317
$$ packed form
17892A69344M6175F7002J62600q9174o8373E870K50104a39548d0906A83041d7917
17880A36217D5710a90477L2883o1362M1742j8838C03690a62125c0440g178o0586
17869f7764E1094a78107B98812E3305e9505j95498a13680A11003a12310j91525
17859c03835A6794L1988A842b0161A28973k9275l6361a68651O9381B67993d46963
17847A02326K62042a964m8689l56694L9206C11142B7989d0448a0441A5083f321
17835e4754I2133h5350q2763J6482G947h4898c185B2771K62677I3392J21337a06459
17822D0336J44002b57928j15663C11895b9726B23168k7298a10464A18604a78025
17811A01773a96109R6149A1413J61074A9380F466K37138g7423A35584n1213g1317
$$ plain form
17799 -96694 118464 93389 -138502 -115479 27927 265675 94133 288807 -27968 69096 105880
17788 105880 47504 -130165 -64618 131084 195160 -385146 70499 72878 -160007 -86021 -182603
17777 -182603 103234 101449 -104010 -215010 -7350 93252 -231396 -171161 142971 53533 177054
17766 177054 355172 -53112 -195648 253183 -151561 -4756 67726 -92735 -63162 60081 23376
17754 -32077 281851 21778 -126299 -309065 86983 -28150 -38813 -6828 59738 54775 -13521
17742 -179832 107306 252119 268908 30892 382474 179124 16056 22513 -21328 242821 -45602
17730 10738 -213510 229189 82584 -17368 -73414 -108970 83922 -94793 56765 -54532 183002
17718 237012 -127072 -152080 -59043 -101854 18700 -20192 7846 216646 33852 86055 -120358
$$ packed form
17799i6694A18464k5075a38502K3023B7927K37748I4133J94674b7968F9096L6784
17788A05880D7504a30165f4618A31084O4076c85146G0499K379a60007P3986r6582
17777a82603A03234j785a04010j11000g350I3252b31396O0235A42971E3533J23521
17766A77054J78118e3112j42536B53183a51561d756F7726i2735K9573F0081B3376
17754c2077B81851B1778a26299j82766H6983b8150j0663f828E9738m963a3521
17742a79832A07306J44813J6789C0892L51582A79124A6056O457b1328B42821d5602
17730A0738b13510B29189H2584a7368n6046l5556H3922i4793E6765e4532A83002
17718B37012a27072k5008e9043m2811A8700b0192G846K08800C3852N2203a20358
$$ plain form
17706 -153640 5608 149766 -4997 26228 164532 38417 -192190 -266162 -129782 -159095 229186
17694 143134 144834 227338 487589 135007 -188876 97884 39590 -12521 -75475 8326 -85281
17682 -47422 182111 -6906 241862 -278155 -400524 312351 136951 41362 149076 246061
17672 246061 222680 90091 513491 45012 -19485 398165 -7432 -114817 -156546 35195 -67623
17660 -164805 94617 49814 -173244 -48086 156122 -52245 -262933 -329820 270849 284674 311783
17649 311783 -323923 -42585 122622 9911 -232018 -82606 -67190 142426 -137988 179612
17638 -99623 -90860 -147789 192991 -177346 17324 -254278 5016 -90637 76923 331453 7989
17626 -107662 -3459 18333 -227167 12257 -89415 121211 172936 375199 83411 -21382 -136470
$$ packed form
17706a53640E608J44158d997B6228J38304C8417a92190p3972a29782k9313B29186
17694A43134J700Q2504K60251A35007a88876I7884C9590a2521o2954H326h5281
17682d7422A82111f906B41862b78155j22369C12351A36951D1362J07714R6985
17672B46061k3381I0091M23400D5012a9485C98165g432j07385m1729C5195f7623
17660a64805I4617m4803a73244d8086A56122e2245k10688o6887B70849J3825K7109
17649C11783c23923d2585A22622I911b32018h2606J5416A42426a37988A79612
17638i9623Q763n6929A92991a77346A7324b54278E016i0637G6923K54530G989
17626a07662c459A8333b27167A2257h9415A21211N1725K02263H3411b1382j15088
$$ plain form
17615 -136470 79547 -271673 151915 -50719 -56456 -35422 -103750 151517 -2052 -319351 303604
17603 312436 112536 91157 -314666 -168936 -297581 -55350 185286 1450 -43809 49579 214453
17592 214453 6068 51994 -22444 -166781 -43062 46609 32988 250925 215655 302266 61685
17580 -81240 57714 -147432 297006 380289 -207837 58935 112017 111749 127749 213121 214081 423554
17568 423554 182693 -112744 335348 -77178 26798 229943 293788 214257 -73379 -2524 -75511
17557 -75511 224456 248721 210048 168354 410169 35761 -37862 -181866 58077 -48009 303269
17545 -43767 -116890 156442 108496 -71079 333505 -138539 -86195 284268 -35004 -6518 335370
17533 -74369 284144 67138 -21273 265747 -46971 29181 9113 288695 -204375 173234 177095
$$ packed form
17615a36470G9547b71673A51915e0719n737K1034o8328A51517b052l17299C03604
17603C12436A12536k1379c14666J45730j28645e5350A85286A450d3809D9579J64874
17592B14453F068M5926b2444j44337d3062D6609j3621K17937l5270Q6611F1685
17580h1240E7714a47432B97006Q3283b07837E8935N3082k68J6000Q5372R60K09473
17568D23554A82693a12744C35348g7178B6798K03145O3845p9531g3379b524p2987
17557g5511B24456K4265l8673m1694K41815C5761c7862j44004E8077d8009C03269
17545d3767p3123A56442m7946g1079C33505a38539N2344B84268c5004f518C35370
17533g4369B84144F7138b1273B65747d6971B9181I113K79582b04375A73234L861
$$ plain form
17522 177095 -140088 -157484 -21825 -12892 179041 -96226 39775 3589 123196 273153 -74444
17510 322605 331963 208058 132032 38507 -10879 -215267 147067 -77355 -108830 -176610 374110
17498 -16613 -160423 229845 -56523 8214 -126021 -202236 -126696 20054 -388469 495806 -192514
17486 -7234 97673 14117 205008 271323 25273 178953 504952 -144282 220859 159598 214725
17475 214725 -211743 128011 76553 77072 -69572 205281 121475 -55889 -38201 -34112 243799
17463 -252620 42226 -50702 -73256 115501 -62455 149788 34049 266472 -15736 -49641 145180
17451 165215 -72425 210364 348240 497557 180162 313304 -24898 -98582 278574 216550
17441 216550 86430 420009 155705 70893 496050 299875 80183 254988 25532 262155
$$ packed form
17522A77095a40088j7396b1825Q933A79041i6226C9775C589J19607J49957g4444
17510C22605R358j23905p6026C8507a0879k04388A47067g7355l1475o7780C74110
17498a6613j43810B29845e6523H214a26021p6215P5540B0054c88469D95806a92514
17486g234I7673A4117J90891O6315B5273J53680L25999a44282B20859o1261N5127
17475B14725b11743A28011n1458N19f9572B05281q3806e5889J7688M089B43799
17463b52620D2226e0702k2554A15501f2455A49788C4049K32423a5736l3905A45180
17451A65215g2425B10364J37876J49317A80162J33142b4898p3684B78574o2024
17441B16550H6430L33579A55705G0893M25157j96175H0183J74805B5532K36623
$$ plain form
17431 262155 111446 266616 -101681 323208 110986 246867 4498 404919 416667 378112
17421 378112 61977 93121 305256 389859 292366 334399 386064 109833 356530 3610 124858
17410 124858 196195 14725 36645 75847 138296 289358 221928 7690 447966 218824 361362
17399 361362 209079 236743 379110 257695 -6525 185864 351911 409841 -109569 -85077
17389 -85077 359853 185704 17679 46949 333472 83542 414083 -176184 207579 182388
17379 182388 7724 102571 134645 -65038 50690 262776 311956 -255171 65291 221988 -96984
17367 15094 -82618 173599 249506 -18812 122221 166106 249115 242993 99290 -191224 141306
17355 411942 123186 -28859 125254 90935 365143 -161341 159259 -262678 106755 24115
$$ packed form
17431B62155A11446J55170a01681C23208A10986J35881D498M00421J1748l8555
17421C78112F1977L1144K12135Q4603r7493M2033N1665A09833K46697C610J21248
17410A24858P1337A4725K1920L9202O2449J51062o7430G690M40276B18824J42538
17399C61362j52283K7664J42367j21415f525A85864J66047N7930a09569K4492
17389h5077C59853j74149A7679K9270K86523H3542L30541a76184B07579k5191
17379A82388G724R4847L2074f5038E0690K12086M9180b55171F5291J56697i6984
17367A5094h2618A73599P5907a8812A22221M3885Q3009o122I9290a91224A41306
17355D11942A23186b8859A25254l4319K74208a61341A59259b62678A06755B4115
$$ plain form
17344 20007 -118183 139039 62729 422786 110205 133651 -149273 93262 -207159 396264
17333 -33190 148708 -53140 -189996 130513 240292 206373 250179 200604 341103 45253 8955
17321 258746 23029 -1398 193515 53838 -84865 254416 50204 260189 273740 230767 222755
17310 222755 106872 219028 252278 300404 -90610 327054 158875 18135 436565 398529
17300 398529 69919 281923 160729 -95266 251278 47253 111220 198874 47492 -261996 308307
17288 403215 108684 379560 209817 412514 667753 233209 44706 281297 10616 63763
17278 63763 24632 93637 200347 83362 350841 -104532 13934 262266 87611 -71196 214921
17266 358591 256038 385087 361935 228634 102177 307153 31925 -76896 318756 66371
$$ packed form
17344B0007a18183A39039F2729L60057A10205K3446a49273I3262b07159C96264
17333c3190A48708e3140j36856A30513J09779l3919M3806m9575J40499D5253H955
17321B58746B3029a398A93515E3838h4865B54416E0204K09985J3551m2973q012
17310B22755A06872J12156L3250M8126i0610C27054A58875A8135M18430l8036
17300C98529F9919K12004j21194i5266B51278D7253O3967Q7654D7492b61996C08307
17288D03215A08684K70876j69743K02697K55239B33209D4706K36591A0616N3147
17278F3763B4632O9005J06710H3362K67479a04532A3934K48332H7611g1196B14921
17266C58591j02553J29049k3152j33301A02177K04976C1925g6896C18756F6371
$$ plain form
17255 319201 44415 196002 169040 33058 122497 41614 -78147 -4422 179009 336732 -241729
17243 141425 341363 151602 33417 313541 358522 169535 267196 309335 442966 285600
17233 285600 354702 -44234 222223 249535 145020 -13225 225727 305498 405453 17408 133597
17222 133597 150945 -72228 64898 108526 167356 295749 312706 316882 27043 362018 383304
17211 383304 321804 126207 248277 275385 49905 188000 -15699 79217 265198 323515 146017
17199 -83159 17183 190081 71990 204211 227662 75389 88175 203477 280561 417329 448591
17188 448591 471529 4765 148957 190337 241027 221341 71730 94710 -42711 156417 164453
17177 164453 349059 500707 -38204 479107 333041 140672 305896 280930 315852 221624
$$ packed form
17255C19201D4415J51587k6962C3058Q9439D1614g8147d422A79009J57723b41729
17243A41425J99938A51602C3417K80124M4981A69535R7661M2139J33631j57366
17233B85600O9102d4234B22223K7312j04515a3225B25727P9771R9955A7408J16189
17222A33597J7348g2228F4898M3628N8830J28393J6957M176B7043L34975K1286
17211C83304o1500A26207J22070K7108D9905J38095a5699G9217J85981N8317A46017
17199h3159A7183J72898G1990J32221K3451G5389J2786J15302P7084J36768L1262
17188D48591K2938D765J44192M1380N0690j9686G1730K2980d2711A56417Q036
17177A64453J84606J51648c8204D79107j46066A40672J65224k4966L4922r4228
$$ plain form
17167 221624 696728 391418 119564 141141 209396 -84824 168178 168249 238386 31084 319443
17156 319443 341464 188362 594567 140427 202835 -28468 282968 -40747 188739 595575
17146 595575 163806 390417 474232 22518 336504 -66879 215477 346482 378985 249156
17136 249156 144681 57892 239995 358401 488174 262644 312385 359170 379607 290984
17126 290984 315114 309120 247515 256010 409237 254836 410179 460075 187832 547124 184566
17114 41136 439650 124634 452471 300265 208900 529612 430706 179196 410087 385539
17104 385539 310379 575649 404482 201082 507950 750303 88919 218559 235119 203525
17094 203525 186566 365566 321290 150016 243287 373031 362841 257944 451053 271356
$$ packed form
17167B21624M75104l05310A19564K1577O8255h4824A68178P1P0137C1084K88359
17156C19443K2021j53102M06205A40427O2408b8468B82968d0747A88739M06836
17146E95575A63806K26611Q3815B2518L13986f6879B15477J31005L2503j29829
17136B49156j04475E7892J82103J18406J29773k25530M9741M6785K0437q8623
17126B90984K4130n994o1605Q495J53227j54401J55343M9896A87832L59292A84566
17114D1136L98514A24634L27837j52206r1365L20712r8906A79196K30891k4548
17104C85539p5160K65270j71167B01082L06868K42353H8919J29640J6560l1594
17094B03525j6959J79000m4276A50016R3271J29744j0190j04897J93109j79697
$$ plain form
17084 271356 211096 130483 544141 711558 469250 393254 315606 -47742 275436 628229
17074 628229 54627 527762 575750 673532 307444 181032 599917 221482 275607 447555
17064 447555 721397 317640 556357 703562 454686 521575 320956 434746 252307 410312
17054 410312 242542 423702 305530 134856 337311 596033 358335 305653 825833 580948
17044 580948 636973 552038 506851 318568 237228 619352 496467 643449 52319 542879
17034 542879 640306 432253 387325 450340 615536 668599 65898 496915 826242 468040
17024 468040 414406 551574 466883 956853 488708 555810 457777 684973 538183 757428
17014 757428 637651 579126 317077 406229 253614 421056 466042 386739 614670 571342
$$ packed form
17084B71356o0260q0613M13658J67417k42308p5996p7648d7742B75436L52793
17074F28229E4627M73135M7988R7782C07444j26412M18885B21482N4125J71948
17064D47555K73842C17640K38717J47205k48876O6889k00619J13790j82439J58005
17054D10312j67770J81160j18172A34856K02455K58722k37698n2682N20180k44885
17044E80948N6025q4935m5187j88283q1340L82124j22885J46982E2319M90560
17034E42879R7427k08053m4928O3015J65196N3063F5898M31017L29327l58202
17024D68040n3634J37168q4691M89970m68145O7102r8033K27196j46790K19245
17014G57428j19777n8525k62049Q9152j52615J67442M4986p9303K27931m3328
$$ plain form
17004 571342 832109 645239 596400 710105 727466 820037 665384 380325 807337 662862
16994 662862 356676 1070817 531135 611979 752794 743362 734510 933766 541640 422221
16984 422221 1014387 814234 779153 457283 841891 239657 920877 951395 922881 737773
16974 737773 580825 788035 915679 763502 568905 450010 615050 705496 635086 657145
16964 657145 1030415 612132 946181 779337 803958 1093397 725248 717449 915772 744208
16954 744208 948489 827814 675535 1275087 1039622 575011 1438699 1209412 867657 908574
16944 908574 1153555 1024651 955160 1043464 1345660 874188 1312469 1183988 1153941 978498
16934 978498 1410233 1055884 1191586 968657 1161011 1055250 1007646 1040319 1028223 1154466
$$ packed form
17004E71342K60767j86870m8839J13705J7361R2571j54653k85059M27012j44475
16994F62862l06186P14141E31135Q0844J40815r432q852J99256l92126j19419
16984D22221N92166k00153l5081l21870L84608B39657O81220L0518k8514j85108
16974G37773j56948K07210J27644j52177j94597j18895J65040R0446p0410K2059
16964F57145L73270m18283L34049j66844K4621K89439l68149p799J98323j71564
16954G44208K04281j20675j52279N99552k35465m64611Q63688k29287l41755M0917
16944I08574K44981j28904o9491Q8304L02196m71472M38281j28481l0047j75443
16934I78498M31735l54349J35702k22929J92354j05761m7604L2673j2096J26243
$$ plain form
16924 1154466 1245306 1132246 1424606 1555914 1386030 1255769 1340804 1296494 1254665 1556720
16914 1556720 1100009 1006696 1019431 1369070 1158630 1207857 1365411 1489965 1025380 1282099
16904 1282099 1104607 1453437 1478078 1263482 1157575 1491080 1549853 1535326 1498501 1531355
16894 1531355 1637825 1537882 1537141 1446528 1341029 1698286 1156758 1808259 1842066 1691667
16884 1691667 1470330 1795546 1847268 1895568 2113225 2013473 1696717 1667167 1909688 2005305
16874 2005305 1821385 2256619 1982194 1639543 1772757 2096385 1707291 1770256 2120121 2213070
16864 2213070 2492406 2397972 2379108 2343559 2463623 2195152 2574143 2289529 2444701 2248297
16854 2248297 2325468 2639079 2714551 2445117 2534405 2600978 2442711 2600277 2647362 2843898
$$ packed form
16924A154466R0840j13060K92360J31308j69884j30261Q5035m4310m1829L02055
16914A556720m56711r3313J2735L49639k10440M9227J57554J24554m64585K56719
16904A282099j77492L48830K4641k14596j05907L33505N8773j4527l6825L2854
16894A531355J06470r9943p41r0613j05499L57257n41528O51501L3807j50399
16884A691667k21337L25216N1722M8300K17657r9752l16756k9550K42521R5617
16874B005305j83920M35234k74425l42651J33214L23628l89094O2965L49865R2949
16864B213070K79336r4434j8864l5549J20064k68471L78991k84614J55172j96404
16854B248297P7171L13611P5472k69434Q9288O6573j58267J57566M7085J96536
$$ plain form
16844 2843898 2814149 2781360 3066619 3165634 3195266 2988836 3310168 2913849 2939647 3193127
16834 3193127 3457622 3419846 3406631 3141608 3512370 3551473 3505260 3576512 3833034 3653180
16824 3653180 3891628 3921785 3811293 3909482 3939459 4133877 3959030 4327163 4567473 4489301
16814 4489301 4452880 4460977 4789720 4837099 4726275 4890132 4783240 5300548 5180671 5243143
16804 5243143 5292686 5691868 5555862 5800047 5661681 6121195 6134338 6785930 6413097 6378728
16794 6378728 6617269 6743743 7127748 7209880 7487426 7316485 7485842 7891646 8064774 8492512
16784 8492512 8333358 8489718 8694158 9061178 9534606 9542815 10064235 10413124 10363505 10935169
16774 10935169 10952182 11245688 11893820 11893428 12383924 12500496 12949036 13753793 13867431 14363662
$$ packed form
16844B843898k9749l2789K85259R9015K9632k06430L21332l96319K5798K53480
16834C193127K64495l7776j3215k65023L70762L9103m6213P1252K56522j79854
16824C653180K38448L0157j10492R8189K9977J94418j74847L68133K40310p8172
16814D489301l6421Q097L28743M7379j10824J63857j06892N17308j19877O2472
16804E243143M9543L99182j36006K44185j38366M59514J3143O51592l72833l4369
16794F378728K38541J26474L84005Q2132K77546j70941J69357M05804J73128M27738
16784H492512j59154J56360K04440L67020M73428Q209N21420L48889m9619N71664
16774A0935169J7013K93506O48132l92M90496J16572M48540Q04757J13638M96231
$$ plain form
16764 14363662 14939458 15210556 15966922 16178582 16805377 17525999 18196842 18861876 19124827
16755 19124827 20190186 20938589 21613285 22683044 23587568 24271107 25600625 26706271 27701372
16746 27701372 28536964 29822655 31322102 32944774 34354694 35827429 37718770 39752167
16738 39752167 41470523 43649871 45816267 48373031 50857925 53935061 56578981 59819055
16730 59819055 63370943 67180721 71387932 75613044 80076224 85109634 90292019 96138999
16722 96138999 102245104 108735063 115189928 122607427 129992804 137695696 145382478 153739890
16714 153739890 161699391 169623156 177316462 184355013 190880939 196288181 201240505 205129800
16706 205129800 206991655 208127217 207830059 205907423 202708269 198251192 192529259 186051422
$$ packed form
16764A4363662N75796K71098P56366K11660O26795P20622O70843O65034K62951
16755A9124827J065359P48403O74696J069759R04524O83539J329518J105646R95101
16746B7701372Q35592J285691J499447J622672J409920J472735J891341K033397
16738C9752167J718356K179348K166396K556764K484894L077136K643920L240074
16730E9819055L551888L809778M207211M225112M463180N033410N182385N846980
16722I6138999O106105O489959O454865P417499P385377P702892P686782Q357412
16714A53739890P959501P923765P693306P038551O525926N407242M952324L889295
16706B05129800J861855J135562k97158j922636l199154m457077n721933o477837
$$ plain form
16698 186051422 179200335 171486982 163380792 155901745 147397440 139615747 131896483 124097364
16690 124097364 116990449 109941832 103241083 97501060 91467037 86438302 81160735 76092191
16682 76092191 71578544 67678907 63609468 60125899 56636181 53613408 50378968 47831612
16674 47831612 45288100 43085566 40649208 38673252 36483328 34803583 33244214 31788312
16666 31788312 29874638 28881700 27576484 26456737 25278723 24194724 23027501 22190600
16658 22190600 21074280 20516867 19585445 18890029 17722645 17646965 17134583 16407295 15689139
16649 15689139 15512392 14934479 14401860 14025944 13519741 13023992 12224659 12210117 11399716
16640 11399716 11302624 11297982 10761807 10541760 10147831 9849742 9329406 9203192 8919931 8724837
$$ packed form
16698A86051422o851087p713353q106190p479047q504305p781693p719264p799119
16690A24097364p106915p048617o700749n740023o034023n028735n277567n068544
16682G6092191m513647l899637m069439l483569l489718l022773l234440k547356
16674D7831612k543512k202534k436358j975956k189924j679745j559369j455902
16666C1788312j913674r92938j305216j119747j178014j083999j167223q36901
16658B2190600j116320n57413r31422o95416j167384p5680n12382p27288p18156
16649A5689139j76747n77913n32619l75916n06203m95749p99333j4542q10401
16640A1399716r7092m642n36175k20047l93929k98089n20336j26214k83261j95094
$$ plain form
16630 8724837 8571029 8425847 8092583 7930288 7556719 7438608 7253656 7031781 6822365
16621 6822365 6758924 6749378 6665774 6375300 6369293 5863771 5795837 5814601 5630439 5622356 5496852
16610 5496852 5083879 5341249 5156341 5192913 4735565 4793067 5124222 4503872 4394433 4377116
16600 4377116 4436732 4015823 4180851 4203706 3932794 3819860 3666278 3647958 3615984 3768200
16590 3768200 3517500 3655908 3446967 3254586 3215734 3262963 3429339 2984620 2806060 2955766
16580 2955766 3136849 3053433 2922125 3081986 3040860 2382590 2822986 2634311 2772388 2570306
16570 2570306 2477150 2313254 2611482 2313366 2222178 2223373 2323676 2249840 1928570 2263675
16560 2263675 2140229 2140490 1975794 2020134 2145166 1868984 2190895 1988889 1687668 2109088
$$ packed form
16630H724837j53808j45182l33264j62295l73569j18111j84952k21875k09416
16621F822365o3441r546q3604k90474o007n05522o7934J8764j84162q083j25504
16610E496852m12973K57370j84908L6572m57348N7502L31155o20350j09439j7317
16600D377116N9616m20909J65028K2855k70912j12934j53582j8320l1974J52216
16590C768200k50700J38408k08941j92381l8852M7229J66376m44719j78560J49706
16580B955766J81083q3416j31308J59861m1126o58270M40396j88675J38077k02082
16570B570306r3156j63896K98228k98116r1188J195J00303p3836l21270L35105
16560B263675j23446K61j64696M4340J25032k76182L21911k02006l01221M21420
$$ plain form
16550 2109088 1674074 1631491 1748180 1497548 1728544 1719135 1509035 1513760 1672316 1663033 1798573
16539 1798573 1629365 1489717 1585881 1557233 1539543 1602374 1191004 1458187 1601004 1297360
16529 1297360 1821024 1453054 1504174 1289336 1367397 1232910 1459409 1351574 988508 1213154
16519 1213154 1445062 1198670 1536669 997297 895407 1374963 760705 1086610 976278
16510 976278 1064903 1064316 1144518 1205863 1055989 956274 871988 987081 757244 1301130 1271238
16499 1271238 1047329 951807 940220 900537 1072139 940762 1011335 653987 712759 829307
16489 829307 1056292 826455 772296 818099 816515 491602 709606 742893 846580 851397 755711
16478 755711 847206 415897 888202 786277 716396 756679 852591 513546 858451 770985
$$ packed form
16550B109088m35014m2583J16689k50632K30996r409k10100M725J58556r283J35540
16539A798573j69208j39648R6164k8648j7690O2831m11370K67183J42817l03644
16529A297360N23664l67970N1120k14838P8061j34487K26499j07835l63066K24646
16519A213154K31908k46392L37999n39372j01890M79556o14258L25905j10332
16510I76278Q8625n87Q0202O1345j49874r9715q4286J15093k29837N43886k9892
16499A271238k23909r5522j1587l9683J71602j31377P0573l57348N8772J16548
16489H29307K26985k29837n4159M5803j584l24913K18004L3287J03687M817r5686
16478G55711R1495D15897M72305j01925o9881M0283R5912l39045L44905q7466
$$ plain form
16468 770985 726940 964151 824075 808763 522913 650101 470243 811055 246992 700862
16458 700862 534225 914552 779409 414428 660325 635632 494928 804283 608190 510022
16448 510022 750125 500440 669113 332765 96135 203362 426809 416271 731928 547391
16438 547391 566827 461896 466674 458137 456823 559538 106533 889113 178433 233856 474782
16427 474782 707346 597324 413238 349030 701135 291356 590367 392494 131577 608997
16417 608997 286157 284111 344682 515962 444097 642905 485301 486847 584102 411429 236412
16406 236412 323556 250708 661404 475136 250441 95165 351666 78206 520579 192029
16395 161150 284442 332397 591347 308562 492409 414049 449834 552723 326972 266511
$$ packed form
16468G70985m4045K37211j40076j5312k85850J27188j79858L40812B46992M53870
16458G00862j66637L80327j35143l64981K45897k4693j40704L09355j96093r8168
16448E10022K40103k49685J68673C32765I6135J07227K23447j0538L15657j84537
16438E47391J9436j04931M778q537j314J02715A06533P82580A78433N5423K40926
16427D74782K32564j10022j84086o4208L52105B91356K99011j97873A31577M77420
16417F08997B86157k046O0571J71280p1865J98808j57604J546R7255j72673j75017
16406B36412Q7144p2848M10696j86268k24695I5165K56501G8206M42373A92029
16395A61150J23292M7955K58950k82785J83847p8360L5785J02889k25751o0461
$$ plain form
16385 266511 155434 415517 102459 736663 257312 373302 324194 187685 323545 345198
16375 345198 533768 621105 313513 256978 183219 328134 -23689 24230 480638 209159
16364 221415 304053 180353 31714 -19793 335529 219882 339927 335279 544019 154963
16353 603281 193259 138931 263958 214847 250537 -143231 262153 84857 192476 250778
16343 250778 205480 -134842 222285 279111 214532 376120 279007 121505 169954 376478
16333 376478 354539 92851 66979 -88513 233708 358930 472373 -76353 20468 402912 101229
16321 347348 213648 182623 188553 -34859 210657 371074 155551 115652 225887 75032 281614
16310 281614 173722 423580 321769 111048 -36198 319050 204863 81658 304298 257641
$$ packed form
16385B66511j11077K60083A02459O34204B57312J15990m9108j36509J35860K1653
16375C45198J88570Q7337l07592n6535p3759J44915b3689B4230M56408B09159
16364B21415Q2638j23700C1714a9793C35529j15647J20045m648K08740A54963
16353F03281A93259n4328J25027m9111L5690a43231B62153H4857J07619N8302
16343B50778m5298a34842B22285N6826o4579J61588r7113A21505M8449K06524
16333C76478k1939I2851k5872h8513B33708J25222J13443g6353B0468L82444A01229
16321C47348j33700l1025N930c4859B10657J60417A55551l9899J10235G5032K06582
16310B81614j07892K49858j01811A11048c6198C19050j14187H1658K22640m6657
$$ plain form
16300 257641 183143 26693 156625 -50471 33992 461121 243668 232976 119994 436955
16290 436955 53355 110122 -61806 110443 126539 153916 432208 16002 263425 246149 287871
16279 287871 280109 154206 26484 -31986 338865 140083 62849 224727 -47843 87915 42631
16267 352446 6107 484036 211003 285458 184276 406691 168856 390434 -239740 -67117
16256 37343 262040 130488 515752 114851 97882 171849 315883 257490 -1239 -89080 330559
16244 88702 279035 39022 59607 203207 282624 151159 -265676 -55070 -98379 -105430 -302589
16233 -302589 -9782 36162 -77933 75376 35408 -153037 32542 325507 6824 -48287 -121277
16222 -121277 173242 -14285 -101931 103868 -230228 310779 117784 -156170 84806 26391
$$ packed form
16300B57641p4498B6693J29932e0471C3992M27129k17453j0692j12982L16961
16290D36955E3355N6767f1806A10443J6096K7377K78292A6002K47423j7276M1722
16279B87871p762j25903B6484c1986C38865A40083F2849J61878d7843H7915D2631
16267C52446F107M77929B11003P4455j01182K22415A68856K21578b39740f7117
16256C7343K24697A30488L85264A14851j6969P3967J44034n8393a239q7841C30559
16244H8702J90333C9022K0585J43600P9417j31465b65676e5070m3309p051j97159
16233c02589i782C6162g7933G5376C5408a53037C2542K92965F824d8287p2990
16222a21277A73242a4285q7646A03868b30228C10779A17784a56170H4806B6391
$$ plain form
16211 281955 126830 133278 -101457 330474 188110 152958 141666 2300 192292 74229 173989
16200 173989 450616 -10256 24231 -103519 375647 -140138 -30311 199067 -154726 204107
16189 320669 383279 -13057 -114651 250824 199942 -365357 280696 135037 214398 31423
16178 156503 47878 -36878 -211579 243777 -48074 -265857 209690 44913 135115 67545 210655
16167 210655 -165695 182404 -44922 -132722 178464 -13361 165165 -293561 47363 24434
16157 24434 46620 48856 -199809 20930 40651 93946 -135331 -60183 101777 -93362 -275171
16146 -275171 25371 110377 -248297 118135 32887 8280 -4319 -148236 -131902 143620 364797
16135 364797 223906 -182169 -35890 129823 -261501 310535 -214283 129838 -147348 220299
$$ packed form
16211B81955A26830O448a01457C30474j42364l5152j1292B300J89992G4229R9760
16200A73989K76627a0256B4231a03519C75647a40138c0311A99067a54726B04107
16189C20669O2610a3057j01594B50824n0882c65357B80696A35037P9361C1423
16178A56503D7878c6878j74701B43777d8074k17783B09690D4913R0202F7545J43110
16167B10655a65695A82404d4922q7800A78464a3361A65165b93561D7363k2929
16157B4434K2186K236a99809B0930J9721N3295a35331f0183A01777i3362j81809
16146b75171B5371Q5006b48297A18135C2887H280d319j43917J6334A43620K21177
16135C64797j40891a82169c5890A29823b61501C10535b14283A29838a47348B20299
$$ plain form
16124 124384 -86659 -50290 143264 57755 -296105 175567 39640 257360 148309 -301232
16113 84739 -104025 -1175 -97443 178119 327685 57611 143632 37325 -97389 -61280 80125
16101 168294 -123925 -18990 -192758 274925 101242 216088 159086 -37608 -531701 153947
16090 207715 -90164 -4879 168618 127509 112621 195311 285072 -22319 201985 -6339 84206
16078 -117598 204534 59881 31051 -236297 -166300 17581 -173957 -92043 87442 -186223 -151511
16067 -151511 -67638 -143551 -44129 -55579 -65918 -174307 -134398 62423 -170910 -161517 29323
16055 -941 25106 -26439 88092 -192095 68073 -5846 179867 -203636 93670 -269626 -45286
16043 -242884 -199321 -298278 -106150 -32949 -218887 -43168 -148213 165445 188082 86993 196999
$$ packed form
16124A24384h6659L6369A43264E7755b96105A75567C9640K17720j09051c01232
16113H4739a04025a175r6268A78119J49566E7611Q6021C7325i7389L6109H0125
16101A68294a23925a8990j73768B74925A01242J14846n7002c7608m94093A53947
16090B07715i0164d879A68618m1109j4888Q2690Q9761b2319B01985f339H4206
16078a17598B04534E9881k8830b36297O9997A7581a73957Q1914H7442a86223L4712
16067a51511f7638p5913d4129j1450j0339j08389L9909F2423a70910R393B9323
16055i41B5106b6439H8092a92095F8073e846A79867b03636I3670b69626d5286
16043b42884M3563r8957a06150c2949j85938d3168j05045A65445K2637H6993J10006
$$ plain form
16032 196999 112611 99079 29579 47737 -62732 292224 -154743 -202024 -509676 262253 -98218
16020 -8150 -129133 -66488 36031 260532 44302 -90839 -10994 -269918 -271958 113686 -127950
16008 -170937 133873 -32006 7517 25326 -6117 -22150 107285 -120598 220751 -222612 52999
15996 -180863 -458229 -131202 7293 304425 72414 -22622 197589 103045 -146181 104825
15985 39012 -582314 -190566 134869 49002 238857 38987 -41406 64064 -28509 -116902 5793
15973 272248 -185658 210115 60399 113324 115505 157294 294331 468084 399866 404676 -108944
15961 23182 -203076 -45142 -119716 52399 -137107 50210 -31927 -141200 -54239 40706 58384
15950 58384 -75170 44920 259278 110169 -135154 -57714 188981 -95682 115280 -114581
$$ packed form
16032A96999q4388j3532B9579J8158f2732B92224a54743m7281l07652B62253i8218
16020h150j20983O2645C6031K24501D4302i0839a0994k58924k040A13686a27950
16008a70937A33873c2006G517J7809f117j6033A07285a20598B20751b22612E2999
15996a80863k77366a31202G293K97132G2414b2622A97589r4544a46181A04825
15985C9012e82314a90566A34869D9002J89855C8987d1406F4064b8509q8393E793
15973B72248a85658B10115F0399N2925K181M1789J37037J73753o8218M810a08944
15961B3182b03076d5142p4574E2399a37107E0210c1927j09273e4239D0706J7678
15950E8384g5170D4920K14358A10169a35154e7714A88981i5682A15280a14581
$$ plain form
15939 -201134 92008 -282496 -47421 -123935 47913 -158604 -29976 -149302 174381 -19736 78132
15927 -68241 -137289 -161607 -140475 157994 -175527 -141750 234777 -186206 -62265 82442 -92272
15915 32472 -115571 -158930 84849 41804 -177433 -148096 53149 -106613 -82145 -405339 -183605
15903 330619 -177615 -64636 -82508 -32070 -174478 -32907 -28441 55419 188281 63415 191307
15892 191307 -52062 41691 103790 -356205 -406602 116268 -58855 -17308 -99404 -219002 -400424
15881 -400424 -70077 -41185 -11812 -98761 112936 8756 -84286 55898 109063 -198302 -142419
15870 -142419 261989 314395 98359 2826 -48433 -164337 70626 230264 188758 20887 -211571
15858 -283275 -40215 -52963 -453468 52507 51946 -312037 -10203 222558 208283 46380 -186760
$$ packed form
15939b01134I2008b82496d7421p6514D7913a58604b9976j19326A74381a9736G8132
15927f8241o9048k4318K1132A57994a75527L3777B34777a86206f2265H2442i2272
15915C2472a15571m3359H4849D1804a77433K9337E3149a06613K4468l23194a83605
15903C30619a77615f4636j7872c2070j42408c2907M466E5419J32862F3415J27892
15892A91307e2062D1691O2099c56205n0397A16268e8855a7308q2096j19598j81422
15881d00424g0077K8892a1812q6949A12936H756h4286E5898N3165a98302N5883
15870a42419B61989N2406I8359B826d8433j15904G0626J59638m1506B0887b11571
15858b83275d0215j2748m00505E2507n61c12037a0203B22558j4275D6380a86760
$$ plain form
15846 -91916 -170334 379557 -173978 59911 -245842 60927 -292129 -321362 -147024 66072 -128991
15834 -61973 29638 -98938 -25748 66277 -53649 77191 -83165 63276 -88814 45777 -19113 86763
15821 314800 -21776 -114779 -6023 -154890 -123748 283829 -72606 -204710 -136166 -52169 295219
15809 -131709 -166314 221828 -137595 -249286 -217591 33753 238750 -363593 -208795 -18616
15798 -56204 -44666 -98218 226208 26061 -140651 30923 169874 -215025 25025 -160849 12513
15786 48188 -76244 -251206 79048 14032 63442 -179689 82166 -23004 102520 99133 -258906
15774 103575 33581 -105137 -67243 -185146 301803 -14881 -54947 -151535 -141583 -26827 -106136
15763 -106136 -27004 -146473 -81515 3816 -128790 -10746 118714 54656 45069 -114027 -202505
$$ packed form
15846i1916p8418C79557a73978E9911b45842F0927b92129k9233a47024F6072a28991
15834f1973B9638i8938b5748F6277e3649G7191h3165F3276h8814D5777a9113H6763
15821C14800b1776r3003f023j48867L1142B83829g2606j32104O8544e2169B95219
15809a31709l4605B21828a37595j11691L1695C3753K04997c63593J54798a8616
15798e6204J1538n3552B26208B6061a40651C0923J38951b15025B5025a60849A2513
15786D8188g6244j74962G9048A4032M9410a79689H2166b3004A02520l387b58906
15774A03575C3581a05137L7894j17903C01803a4881m0066r6588R952b6827p9309
15763a06136b7004j19469O4958C816a28790a0746A18714E4656r587a14027q8478
$$ plain form
15752 -202505 -98543 -76766 21911 -227016 -55528 116106 -95020 -69455 48370 83590 104943
15741 104943 185532 198005 46599 169190 227637 40882 6702 93774 -70790 4696 9083 -181630
15728 -124202 -272058 -60731 80039 155552 100519 -21041 -191958 -108454 85790 -5952 21708
15716 -38250 -51015 -37095 -265998 -281013 -2472 107296 60445 74756 57239 47482 -131967
15704 114769 -195580 -239959 262148 -143484 -13259 206538 -64355 -87001 -284058 -187386
15694 -187386 -67648 -118172 -126510 -55003 -301039 192210 -133255 -113461 -36003 169375 -59727
15682 -190750 193975 187398 138177 -110356 231468 -61769 37749 -118285 245734 -222891
15671 -276073 -244117 36965 -137874 -15474 -19829 199996 -20694 -36636 -295090 -180565 -138596
$$ packed form
15752b02505i8543K1777B1911b27016e5528A16106i5020K5565D8370L5220K1353
15741A04943Q0589J2473D6599J22591N8447D0882F702Q7072g0790D696M387a81630
15728a24202j47856f0731H0039P5513n5033b1041j70917Q3504H5790e952B1708
15716c8250j2765J3920k28903j5015b472A07296m6851J4311j7517r757a31967
15704A14769a95580m4379B62148a43484a3259B06538f4355k2646j97057R6672
15694a87386f7648n0524q338e5003k46036A92210a33255J9794c6003A69375e9727
15682a90750A93975o577m9221a10356B31468f1769C7749a18285B45734b22891
15671b76073L1956C6965a37874a5474m355A99996b0694j5942k58454J14525M1969
$$ plain form
15660 -138596 -223065 25141 -21361 -78353 130966 -257106 -60349 202579 -300699 -145459
15649 -429662 -25266 11091 -270968 -103935 18568 -316184 -51063 -139881 -80536 -32859 -51410
15638 -51410 65332 166910 -108950 -128243 -20830 -23910 -231162 1808 -79330 -8170 265408
15626 63322 47092 -227141 10166 114574 -152351 112790 302923 -10430 -328124 -235132
15616 -235132 -224620 -40583 177231 185813 -33524 133763 15600 -213140 106650 -10101 100107
15604 -21090 -62515 -7394 91281 -11354 166194 -150383 -195993 263040 23562 210388 -190750
15592 25563 -31823 283480 68609 60778 26038 128019 180687 -38486 124229 14967 -215585
15580 -105273 -46628 -353136 -93725 -145442 -91465 -105303 -219927 -213484 -251114 -30371 -25781
$$ packed form
15660a38596q4469B5141b1361n6992A30966b57106f0349B02579c00699a45459
15649d29662b5266A1091b70968a03935A8568c16184e1063q8818N9345c2859j8551
15638e1410F5332J01578a08950j9293b0830l080k07252A808g9330h170B65408
15626F3322j6230b27141A0166J04408a52351A12790J90133a0430l17694R2992
15616b35132J0512d0583A77231Q582c3524A33763A5600b13140A06650a0101A00107
15604b1090m1425g394I1281a1354A66194a50383m5610B63040B3562J86826a90750
15592B5563c1823B83480F8609p831B6038J01981N2668c8486A24229A4967b15585
15580a05273d6628l06508i3725n1717N3977j3838j14624O443l7630c0371M590
$$ plain form
15569 -25781 -77593 138892 87084 -7445 230070 -106670 116436 -90621 8044 -34739 -103888
15558 -103888 -170428 -50231 143702 -45203 198452 -175822 -152516 -34091 114626 -158704
15547 78327 -60167 115129 -13072 -144270 77547 -67976 138362 86118 37665 -35687 -73261
15536 -73261 -99236 175113 162458 -295238 269980 131238 -148214 64332 8166 54340 -183097
15524 392782 -112083 280233 266097 -21521 -114329 -108646 -90962 -86351 148193 -55432 -67952
15513 -67952 130283 12050 48720 -198744 2383 48401 182920 -78009 -177912 -276516 -124696
15501 -59108 135639 -12054 110662 -323805 259671 -101070 -64829 -215054 -69397 -23174
15490 -10066 208482 -160584 -107877 138202 158195 99387 34523 428248 -13298 -184185 310968
$$ packed form
15569b5781n1812A38892n1808g445B30070a06670A16436i0621H044c4739o9149
15558a03888o6540e0231A43702d5203A98452a75822K3306c4091A14626a58704
15547G8327f0167A15129a3072j31198G7547f7976A38362n2244C7665c5687l7574
15536g3261k5975A75113j2655b95238B69980A31238a48214F4332H166M6174a83097
15524C92782a12083B80233j4136b1521r2808N683J7684M611A48193e5432j2520
15513f7952A30283A2050L6670a98744B383M6018J34519g8009r9903r8604a24696
15501e9108A35639a2054A10662c23805B59671a01070L6241j50225f9397b3174
15490a0066B08482a60584N2707A38202J9993n8808C4523L93725a3298j70887C10968
$$ plain form
15478 188606 -106352 163763 209101 -42827 -190378 -691 -39999 -113254 239247 -244595 179213
15466 45505 -128643 -52982 -104758 -383020 115127 57127 -58827 9458 -217887 -174577 202725
15454 -81322 -31744 -109943 187468 208194 -34546 -60425 -337074 297840 55045 242646 -214687
15442 -70988 -284039 -189652 -122608 40674 -81828 -106261 61261 23920 136913 6868 286583
15431 286583 -62732 170630 -757 -156477 -73309 -51991 15904 142796 277223 -9479 -136949
15420 -136949 -11161 -229879 -266179 100092 100997 204988 -20975 -117181 311246 104865 257605
15409 257605 -62512 -87062 -81431 -67980 127131 -79417 -449762 346602 -71597 229391 319628
15398 319628 -475775 82711 115633 -496103 -109644 307010 172589 -92460 -5760 169262
$$ packed form
15478A88606a06352A63763M5338d2827j47551f91l9308p3255B39247b44595A79213
15466D5505a28643e2982n1776k78262A15127E7127e8827I458b17887M3310B02725
15454h1322c1744p8199A87468K0726c4546k5879k76649B97840E5045J87601b14687
15442g0988k13051R4387O7044D0674h1828k4433F1261B3920J12993F868K79715
15431B86583f2732A70630g57j55720g3309K1318A5904J26892J34427i479j27470
15420a36949a1161k18718l6300A00092R05J03991b0975r6206C11246A04865J52740
15409B57605f2512k4550N631J3451A27131g9417l70345C46602g1597B29391R0237
15398C19628d75775H2711L2922d96103a09644C07010j34421i2460e760A69262
$$ plain form
15387 178106 111067 -385783 141746 -6017 -266210 195440 93721 116634 -5344 189639 119507
15376 119507 61069 39699 -123294 -30945 -128583 197840 66707 87294 -104464 -105476 426145
15364 -73590 29082 145637 187304 -305975 -194302 197067 -75859 -175559 20385 247449 321127
15353 321127 -186897 -57820 -56865 -243067 115750 251960 77914 89680 -37833 -169342 -67829
15341 -169003 -64385 -283628 -32546 -85709 149320 122415 -204204 155443 -175897 -99782
15331 -99782 -27583 214293 -217274 -264053 -46832 -194401 -190935 -126315 73700 -73764 137377
15319 -106717 -112460 -43355 45726 58163 63812 54945 -241697 -217823 102598 -199860 19937
15307 142612 -191683 -67595 -93030 -135964 26614 -52283 229168 -204127 35810 -63685 196690
$$ packed form
15387A78106o7039c85783A41746f017k60193A95440I3721K2913e344A89639p0132
15376A19507n8438k1370a23294c0945r7638A97840F6707K0587a04464j012D26145
15364g3590B9082J16555M1667c05975J11673A97067g5859r9700B0385K27064P3678
15353C21127a86897e7820R55j86202A15750J36210G7914J1766c7833j31509f7829
15341a69003f4385k19243c2546n3163A49320k6905b04204A55443a75897P6115
15331i9782b7583B14293b17274m6779d6832j47569L466O4620G3700g3764A37377
15319a06717n743d3355D5726J2437N649q867b41697K3874A02598a99860A9937
15307A42612a91683f7595k5435m2934B6614e2283B29168b04127C5810f3685A96690
$$ plain form
15295 145450 48136 -3662 -62161 6669 7983 230332 -273144 159951 -89003 23176 132232
15284 132232 166119 193031 8824 -166910 138381 46640 -24244 105473 -181502 -26147 -199190
15273 -199190 436177 -19269 -181980 199759 69192 -109099 192392 -354005 -166235 80610
15262 -82693 -79381 390369 57671 358274 166968 -43278 76371 -150824 461788 -115598 38310
15250 351257 -66334 -143379 84805 185158 -76765 -66209 40252 -145830 -113977 131981 212348
15239 212348 47409 615418 67551 396970 1130849 1101569 1105687 1197606 694547 350756 175368
15227 230933 235375 -40233 196062 -18269 -33932 309566 -190195 209518 88177 -12544 307746
15215 152753 263493 -106565 103363 270306 189189 64673 210849 -62312 -36776 117128
$$ packed form
15295A45450D8136c662n8499F669J314K22349b73144A59951h9003B3176J09056
15284A32232L3887K6912H824a66910A38381D6640b4244A05473a81502b6147j73043
15273a99190D36177a9269j62711A99759F9192a09099A92392c54005a66235H0610
15262h2693L312C90369E7671L00603A66968d3278G6371a50824D61788a15598C8310
15250C51257f6334p7045H4805J00353g6765J0556D0252a45830L1853A31981Q0367
15239B12348D7409N68009F7551L29419P33879k9280M118R1919n03059l43791A75368
15227B30933M442d0233A96062a8269j5663C09566a90195B09518H8177a2544C07746
15215A52753J10740a06565A03363J66943q1117F4673J46176f2312K5536A17128
$$ plain form
15204 3812 187419 120748 183078 -105802 113372 -154350 54056 -149213 19452 42240 28679
15193 28679 21 196335 230025 199078 161616 316985 -110371 247758 143168 184962 -58472
15181 -143562 -210968 -149149 306117 230287 125163 -18352 144701 323760 118868 -117322
15170 23655 293394 211759 102054 44856 232285 29422 514031 86802 -215415 -183283 -35788
15158 -49738 231736 195727 143629 -89496 549003 -184579 181985 133544 199026 64398 48688
15147 48688 163036 -79034 -205933 -45358 95578 47025 280778 4309 -93770 238589 -58148
15135 83897 -31178 -137639 161965 -2412 -710 -10286 182096 -11411 -15674 159129 -189919 160579
15122 45635 327529 433212 292702 219096 -138098 21320 -208426 299647 64362 97484
$$ packed form
15204C812J83607o6671O2330a05802A13372a54350E4056a49213A9452K2788j3561
15193B8679B1J96314L3690l0947l7462J55369a10371B47758j04590M1794e8472
15181a43562o7406O1819C06117p5830j05124a8352A44701J79059A18868a17322
15170B3655K69739q1635A02054D4856J87429B9422M84609H6802b15415L2132c5788
15158d9738B31736l6009n2098h9496E49003a84579A81985m8441O5482F4398j5710
15147D8688J14348g9034j26899d5358I5578D7025K33753D309i3770B38589e8148
15135H3897c1178j06461A61965b412g10r576A82096a1411m263A59129a89919A60579
15122D5635K81894J05683j40510p3606a38098B1320b08426B99647F4362L3122
$$ plain form
15112 97484 426405 141090 382720 24521 -77589 -25512 251247 38357 158562 76149 204675
15101 204675 260375 164140 -174313 127214 22689 175218 -123056 -23370 -368341 -51751
15090 27426 272289 248342 256373 139145 429087 107733 92299 320194 351439 312997 -188796
15078 20708 275781 118479 -174390 194606 122172 171820 -16415 383939 177714 242030
15068 242030 368936 25441 180705 6016 393369 -161170 52438 1679 494632 41676 188429
15057 188429 283118 173348 26677 314813 345128 255370 25970 21156 -4993 228951 549709
15046 549709 2941 28019 246526 -29111 235042 424497 -44715 294474 346846 236597 230259
15035 230259 193037 127144 -27643 -129389 82683 141577 420216 97 234902 140894 64045
$$ packed form
15112I7484L28921A41090K41630B4521g7589b5512B51247C8357J20205G6149J28526
15101B04675N5700r6235a74313A27214B2689J52529a23056b3370l44971e1751
15090B7426K44863k3947Q031j17228K89942A07733j5434K27895L1245l8442a88796
15078B0708K55073A18479a74390A94606p2434M9648a6415C83939A77714O4316
15068B42030J26906B5441J55264F016L87353a61170E2438A679M92953D1676J46753
15057A88429R4689j09770B6677K88136L0315q9758B5970m814d993B28951L20758
15046E49709B941K5078K18507b9111B35042J89455d4715B94474N2372j10249o338
15035B30259l7222o5893b7643j01746H2683N8894K78639I7K34805r4008F4045
$$ plain form
15023 185162 223153 355127 161229 86159 279720 122395 72781 268340 206109 -49819
15012 147748 123787 312457 313095 402038 372981 196535 261892 208403 250903 209413 46941
15000 233332 390011 170934 274216 196993 199687 382604 247478 185926 227594 130613 172842
14989 172842 229083 222654 -127748 557492 -1975 59637 137567 230526 311895 100709 241793
14978 241793 197974 134045 62855 137176 233616 183049 387439 170562 434750 163319 426224
14967 426224 328417 -91307 -20086 232441 177305 291144 53851 254540 324629 366747 235648
14956 235648 -188762 102671 324121 585865 244078 363657 23652 525652 172222 564184
14946 564184 458928 233143 111439 139158 259486 394868 625684 37711 -156090 106989
$$ packed form
15023A85162L7991J31974A61229p5070J93561A22395m9614J95559o2231d9819
15012A47748k3961J88670O38Q8943k9057j76446O5357n3489M2500m1490D6941
15000B33332J56679A70934J03282p7223K694J82917j35126o1552M1668r6981M2229
14989A72842N6241o429a27748E57492a975E9637P7930R2959Q1369A00709J41084
14978B41793m3819o3929F2855P4321R6440n0567K04390A70562K64188A63319K62905
14967D26224r7807i1307b0086B32441n5136J13839E3851K00689P0089M2118j31099
14956B35648a88762A02671K21450K61744B44078J19579B3652N02000A72222L91962
14946E64184j05256k25785A11439K7719J20328J35382K30816C7711a56090A06989
$$ plain form
14935 26194 462046 383397 329404 355180 304153 179280 428721 136466 474002 274347
14925 274347 506936 466946 82220 477679 539075 496348 293022 267422 262739 812951 -5263
14913 344138 39398 306398 573857 342419 215952 -10823 349477 514774 266313 330661
14903 330661 475563 400355 321830 217571 307023 96491 599644 322415 50693 279452
14893 279452 263123 326710 243702 346868 313404 484879 230057 150447 274013 80829 -3175
14881 522200 286688 179118 585934 241665 -53010 235494 85760 361732 152354 384570
14871 384570 301371 379874 164672 385674 187692 388519 452857 151154 454191 206903
14860 165879 193731 536734 451583 355037 174703 767164 365193 380903 346711 539144
$$ packed form
14935B6194M35852p8649n3993K5776n1027j24873K49441A36466L37536j99655
14925B74347K32589l9990H2220L95459O1396m2727k03326k5600m683N50212e263
14913C44138C9398K67000K67459k31438j26467a0823C49477J65297k48461O4348
14903C30661J44902p5208p8525j04259Q9452I6491N03153k77229E0693K28759
14893B79452j6329O3587q3008J03166l3464J71475B30057p9610J23566H0829c175
14881E22200k35512j07570M06816B41665e3010B35494H5760K75972A52354K32216
14871C84570q3199P8503A64672K21002A87692K00827O4338A51154L03037B06903
14860A65879K7852L43003q5151r6546A74703N92461C65193J5710l4192J92433
$$ plain form
14850 539144 314627 461655 702666 604518 173409 216393 516148 475679 479477 656274
14840 656274 383457 491993 117787 383001 317964 366988 644826 307162 156001 302512
14830 302512 422841 370814 454116 301871 653704 512798 414267 584747 435203 455030
14820 455030 494276 477060 486947 711605 456051 808760 337525 357843 130585 653128
14810 653128 267916 74389 516615 351573 261863 546077 734832 266427 277280 514893
14800 514893 373145 594663 665453 574899 312434 506093 437915 472854 597606 89181
14789 308145 495226 92048 553903 654857 767600 475178 473771 716165 514574 372984
14779 372984 454201 559806 658173 795322 589240 454999 500202 628948 636175 480205
$$ packed form
14850E39144k24517J47028K41011r8148A73409M2984K99755m0469L798J76797
14840F56274k72817J08536A17787K65214o5037M9024K77838C07162j51161J46511
14830C02512J20329n2027Q3302j52245L51833j40906r8531J70480j49544J9827
14820D55030L9246j7216R887K24658k55554L52709C37525K0318A30585N22543
14810F53128B67916G4389M42226j65042q9710K84214J88755B66427J0853K37613
14800E14893j41748K21518P0790r0554k62465J93659o8178L4939J24752H9181
14789C08145J87081I2048M61855J00954J12743k92422j407K42394k01591j41590
14779C72984Q1217J05605R8367J37149k06082j34241M5203J28746P227j55970
$$ plain form
14769 480205 394219 853259 422466 407119 804071 175649 768720 620283 507290 467676
14759 467676 854530 503779 709772 702531 874224 516196 746479 650632 502597 595980
14749 595980 513335 354010 623433 598273 452580 747505 614901 743813 375726 671856
14739 671856 479721 512042 758749 713984 773580 760433 512096 805484 878331 726220
14729 726220 802676 584860 996616 673366 862859 738021 801841 637972 780743 895493
14719 895493 679844 1055751 896405 556097 745372 618496 937880 952370 953599 941343
14709 941343 579589 976646 976977 666483 787170 728573 732793 691963 645437 644356 822247
14698 822247 998587 703210 772211 906804 828007 646914 676671 891263 684119 1278899
$$ packed form
14769D80205q5986M59040D22466j5347L96952A75649N93071j48437j12993l9614
14759D67676L86854l50751K05993p241J71693l58028K30283r5847j48035R3383
14749E95980q2645j59325K69423k5160j45693K94925j32604J28912l68087K96130
14739F71856j92135L2321K46707m4765N9596j3147k48337K93388P2847j52111
14729G26220P6456k17816M11756l23250J89493j24838O3820j63869J42771J14750
14719H95493k15649L75907j59346l40308J89275j26876L19384J4490J229j2256
14709I41343l61754L97057L31l10494J20687n8597M220m0830m6526j081J77891
14698H22247J76340k95377O9001J34593p8797j81093K9757K14592k07144N94780
$$ plain form
14688 1278899 869188 771359 865803 972503 846761 796819 737898 948601 710925 740621
14678 740621 570422 1117711 862078 1186077 969451 1064379 968868 905598 1115498 1323338
14668 1323338 1074017 878580 1007388 1087205 1067889 989938 919659 1022810 719380 866389
14658 866389 942580 1237350 1038618 859121 732441 1187042 1024196 1199361 780416 1293897
14648 1293897 1369056 1127107 1476436 1174642 984657 1174023 1316555 1329335 952392 1437672
14638 1437672 971721 1293866 1487481 939610 985593 1035786 1346645 1152862 1144831 1594239
14628 1594239 1597714 1441752 1366283 1043819 1108363 1551372 1537076 1453609 1377118 1201357 1533364
14617 1533364 929548 1329219 1298856 1440962 1350958 1470392 1475687 1211035 1657597 1651107
$$ packed form
14688A278899m09711r7829R4444J06700j25742m9942n8921K10703k37676K9696
14678G40621j70199N47289k55633L23999k16626R4928r5511o3270K09900K07840
14668A323338k49321j95437J28808P9817j9316p7951p0279J03151l03430J47009
14658H66389P6191K94770j98732j79497j26680M54601j62846J75165m18945N13481
14648A293897P5159k41949L49329l01794j89985J89366J42532J2780l76943M85280
14638A437672m65951L22145J93615n47871M5983N0193L10859j93783q031M49408
14628A594239L475j55962p5469l22464O4544M43009j4296q3467p6491j75761L32007
14617A533364o03816L99671l0363J42106r0004J19434N295k64652M46562o490
$$ plain form
14607 1651107 1577608 1609529 1176248 1296090 1594616 1604271 1392652 1358192 1296278 1410674
14597 1410674 1533411 1715598 1802039 1699032 1534795 1464532 1948986 1773962 1970955 1773993
14587 1773993 1533964 1536058 2077036 2012182 2131575 1553457 1917446 1822951 1898364 1859098
14577 1859098 2065316 1617368 1990541 1764198 2028264 1963330 1825661 1645612 1555158 1975027
14567 1975027 2353646 2340344 2117787 1926514 2223686 2279744 2289815 1938392 2290225 2567634
14557 2567634 2349561 2035590 2436614 2355604 2585692 2256613 2437081 2636472 2445274 2596418
14547 2596418 2812166 3168838 3021472 3411612 3352802 3691282 3933644 4024807 5075283 5040632
14537 5040632 5792694 6596062 8007688 10779975 15328685 22741440 32480284 29216550
$$ packed form
14607A651107p3499L1921m33281J19842K98526R655k11619l4460o1914J14396
14597A410674J22737J82187Q6441j03007j64237p0263M84454j75024J96993j96962
14587A773993k40029K094N40978o4854J19393n78118L63989r4495P5413l9266
14577A859098K06218m47948L73173k26343K64066o4934j37669j80049r0454M19869
14567A975027L78619j3302k22557j91273K97172N6058J0071l51423L51833K77409
14557B567634k18073l13971M01024q1010K30088l29079J80468J99391j91198J51144
14547B596418K15748L56672j47366L90140n8810L38480K42362R1163J050476l4651
14537E040632P52062Q03368J411626K772287M548710P412755R738844l263734
$$ plain form
14529 29216550 18106403 11315952 7359632 5196604 4176977 3667023 3284997 3364223
14521 3364223 2987152 2821314 2847524 2535703 2758299 2404964 2618099 2723381 2477975 2523039
14511 2523039 2556450 2713945 2737463 2862197 2845419 2822535 2552344 2597578 2538167 2916703
14501 2916703 2805573 2843726 2618371 3190304 2834665 3037426 2933247 3307150 3231941 3189865
14491 3189865 3206407 2861569 3342958 3135612 3173597 3014565 3200237 3098978 3405797 3278004
14481 3278004 3673654 3558052 3520011 3881783 3705157 3787166 3997193 3777193 3928048 3870338
14471 3870338 4099692 3944581 4161049 4202738 4439612 4148017 4351014 4347834 4097912 4307802
14461 4307802 4210926 4519429 4602976 4416491 4624056 4822284 4645076 4486427 4976532 4392003
$$ packed form
14529B9216550j1110147o790451l956320k163028j019627n09954l82026P9226
14521C364223l77071j65838K6210l11821K22596l53335K13135J05282k45406M5064
14511B523039L3411J57495K3518J24734j6778k2884k70191M5234n9411L78536
14501B916703j11130L8153k25355N71933l55639K02761j04179L73903p5209m2076
14491C189865J6542l44838M81389k07346L7985j59032J85672j01259L06819j27793
14481C278004L95650j15602l8041L61772j76626Q2009K10027k20000J50855n7710
14471C870338K29354j55111K16468M1689K36874k91595K02997l180k49922K09890
14461D307802r6876L08503Q3547j86485K07565J98228j77208j58649M90105n84529
$$ plain form
14451 4392003 4858018 4927625 4771386 4985528 4973313 4828103 5045509 5028837 5367733 5382427
14441 5382427 5502427 5222677 5596877 5351774 5689617 5393652 5558244 5799707 5833011 6307190
14431 6307190 5920365 6018202 6343698 6374729 6259526 6467751 6425087 6423455 6925760 6445258
14421 6445258 6821051 6935822 7013372 6763244 7505697 7224626 7582848 7431066 7554160 7461621
14411 7461621 7587814 7777803 8157221 7904544 8513695 8560897 8543499 8495821 8531704 8917837
14401 8917837 8956099 8885032 9388117 9184677 9434093 9987176 9842344 10088153 10351385 10203889
14391 10203889 10353959 10711573 10701448 10944367 11113454 11395353 11554850 11461998 11740247 11758145
14381 11758145 12003921 12616590 12216668 12960431 13170341 13352600 13476428 13725612 13658313
$$ packed form
14451D392003M66015O9607j56239K14142j2215j45210K17406j6672L38896J4694
14441E382427J20000k79750L74200k45103L37843k95965J64592K41463L3304M74179
14431F307190l86825R7837L25496L1031j15203K08225m2664j632N02305m80502
14421F445258L75793J14771P7550k50128P42453k81071L58222j51782J23094r2539
14411G461621J26193J89989L79418k52677O09151M7202j7398m7678L5883L86133
14401H917837L8262p1067N03085k03440K49416N53083j44832K45809K63232j47496
14391A0203889J50070L57614j0125K42919J69087K81899J59497r2852K78249J7898
14381A1758145K45776O12669l99922P43763K09910J82259J23828K49184o7299
$$ plain form
14372 13658313 14275554 14353944 14582669 14644941 14962571 15464393 15669587 15994223 16348019 16582978
14362 16582978 17063787 17175814 17429483 18009398 18160166 18452303 19083136 19453166 19591865
14353 19591865 20416362 20724419 20906978 21248112 21817138 22429914 23029233 23346205 23756624
14344 23756624 24410724 25250793 25732789 26157561 26879877 27502717 27866895 28584328 29899946
14335 29899946 30334182 30779749 31887253 32610189 33231194 34446107 35041463 35931753 36848374
14326 36848374 38168102 39148662 40296824 41076058 42439417 43747940 45002341 46588689
14318 46588689 47479730 49385992 50655570 52440444 54003408 55999465 57577269 59879793
14310 59879793 61514179 63573064 65791350 68176067 70504627 73035896 75725320 78767580
$$ packed form
14372A3658313O17241P8390K28725O2272L17630N01822K05194L24636L53796K34959
14362A6582978M80809J12027K53669N79915J50768K92137O30833L70030J38699
14353A9591865Q24497L08057J82559L41134N69026O12776N99319L16972M10419
14344B3756624O54100Q40069M81996M24772P22316O22840L64178P17433J315618
14335B9899946M34236M45567J107504P22936O21005J214913N95356Q90290R16621
14326C6848374J319728R80560J148162P79234J363359J308523J254401J586348
14318D6588689Q91041J906262J269578J784874J562964J996057J577804K302524
14310E9879793J634386K058885K218286K384717K328560K531269K689424L042260
$$ plain form
14302 78767580 81943292 84935055 87808268 91466369 95104223 99053737 103341360 107385664
14294 107385664 111740180 116989700 121891049 127509034 132627875 138761762 145229064 151849645
14286 151849645 158826901 166432129 174520356 182669746 191988416 200637077 210869215 221346124
14278 221346124 232111124 243867280 255827564 268669787 282044644 295777546 309966270
14271 309966270 324471622 339146292 353323941 367013521 379820635 391783138 402843707
14264 402843707 413127304 422053865 430986996 438364646 445076958 451073416 455817352 457678641
14256 457678641 457658080 458390293 452816573 446430356 441111963 433002856 423349132 412442727
14248 412442727 400854240 389572292 376721385 363997636 350477440 337078067 323645503
$$ packed form
14302G8767580L175712K991763K873213L658101L637854L949514M287623M044304
14294A07385664M354516N249520M901349N617985N118841O133887O467302O620581
14286A51849645O977256P605228Q088227Q149390R318670Q648661J0232138J0476909
14278B21346124J0765000J1756156J1960284J2842223J3374857J3732902J4188724
14271C09966270J4505352J4674670J4177649J3689580J2807114J1962503J1060569
14264D02843707J0283597Q926561Q933131P377650O712312N996458M743936J861289
14256D57678641k0561P32213n573720o386217n318393q109107r653724j0906405
14248D12442727j1588487j1281948j2850907j2723749j3520196j3399373j3432564
$$ plain form
14241 323645503 310953031 297657388 285505230 273431884 261399047 249311136 238136082
14234 238136082 227722463 217326073 207359061 197490402 188258841 179205763 170421334 161867417
14226 161867417 154130023 147147691 140187869 134169862 128263288 122425737 117704777 112199377
14218 112199377 107494412 103791775 99630393 95498058 92160109 88082975 84933491 81553184
14210 81553184 78754403 75778853 73127600 71054441 68108342 66102958 63568191 61527863
14202 61527863 59452449 57799787 55890390 54470308 52972020 50978889 49727826 48188783
14194 48188783 46560335 45543508 44585107 43342766 41983449 40457884 39577255 38961742
14186 38961742 37290184 36772196 35781514 35109729 33819149 33116268 32269504 31717511 30839990
$$ packed form
14241C23645503j2692472j3295643j2152158j2073346j2032837j2087911j1175054
14234B38136082j0413619j0396390r967012r868659r231561r053078q784429q553917
14226A61867417p737394o982332o959822o018007n906574n837551m720960n505400
14218A12199377m704965l702637m161382m132335l337949m077134l149484l380307
14210H1553184k798781k975550k651253k073159k946099k005384k534767k040328
14202F1527863k075414j652662j909397j420082j498288j993131j251063j539043
14194D8188783j628448j016827r58401j242341j359317j525565q80629o15513
14186C8961742j671558n17988r90682o71785j290580p02881q46764n51993q77521
$$ plain form
14177 30839990 30112947 29353541 28352606 27884931 27381382 26572862 25925112 25418204 24992556
14168 24992556 24291604 23808577 23049231 22506866 22697997 21692764 21103273 21118005 20596020
14159 20596020 20391929 19765302 19437964 19167414 18944960 18653530 18071349 17719562 17469951
14150 17469951 17188632 16757415 16319434 16259852 15703489 15536661 15137249 15107704 14558210 14260106
14140 14260106 14385254 14133762 13801612 13630711 13247593 13153934 12680655 12830118 12379545
14131 12379545 12190578 12056256 11861099 12041848 11786492 11447543 11187677 11210256 10894830
14122 10894830 10278355 10823487 10664965 10284608 10299942 9734799 9908284 9663628 9314574
14113 9314574 9225828 9421317 8851250 8923886 8757080 8629232 8696257 8102715 8206603 8214994
$$ packed form
14177C0839990p27043p59406j000935m67675n03549q08520o47750n06908m25648
14168B4992556p00952m83027p59346n42365J91131j005233n89491J4732n21985
14159B0596020k04091o26627l27338k70550k22454k91430n82181l51787k49611
14150A7469951k81319m31217m37981n9582n56363j66828l99412k9545n49494k98104
14140A4260106J25148k51492l32150j70901l83118r3659m73279J49463m50573
14131A2379545j88967j34322j95157J80749k55356l38949k59866K2579l15426
14122A0894830o16475N45132j58522l80357J5334n65143J73485k44656l49054
14113I314574q8746J95489n70067P2636j66806j27848O7025n93542J03888Q391
$$ plain form
14103 8214994 8014821 8149853 8070046 7955223 7939969 7945935 7527238 7506337 7252759 7142169
14093 7142169 7426077 7173970 7030330 7090071 6973775 6748489 6571767 6739312 6803810 6485649
14083 6485649 6311499 6185702 6276761 6362709 6111145 5693540 6049501 5437907 6051375 5555240
14073 5555240 5534842 5646144 5602486 5509477 5161092 5328446 5459743 5367161 5478404 5284160
14063 5284160 5268871 5013585 5201035 5006677 4817062 4706496 4827637 5034967 4581412 4955110
14053 4955110 4742207 4592474 4389331 4278736 4154590 4335371 4251617 4236497 4151073 4294810
14043 4294810 4228545 4062518 4423569 4036868 4090098 4225301 3977826 3598884 3350560 3936854
14033 3936854 3309555 3755655 3664809 3710678 3951594 3721645 3537091 3704783 3282375 3458124
$$ packed form
14103H214994k00173J35032p9807j14823j5254N966m18697k0901k53578j10590
14093G142169K83908k52107j43640N9741j16296k25286j76722J67545O4498l18161
14083F485649j74150j25797R1059Q5948k51564m17605L55961o11594O13468m96135
14073E555240k0398J11302m3658r3009l48385J67354J31297r2582J11243j94244
14063E284160j5289k55286J87450j94358j89615j10566J21141K07330m53555L73698
14053D955110k12903j49733k03143j10595j24146J80781q3754j5120q5424J43737
14043D294810o6265j66027L61051l86701N3230J35203k47475l78942k48324N86294
14033C936854o27299M46100r0846M5869K40916k29949j84554J67692m22408J75749
$$ plain form
14023 3458124 3489781 3225822 3358027 3468325 3846705 3119882 3396203 3326137 3165327 3248223
14013 3248223 3254546 2914848 3222640 3114800 2978889 2946345 3058820 2741054 2976068 2784520
14003 2784520 2883793 2733167 2524879 2703178 2846040 2798909 2906357 2708161 2585131 2592204
13993 2592204 2810854 2454129 2517309 2547907 2598909 2616138 2293743 2401927 2673395 2543018
13983 2543018 2471871 2499874 3017400 2678582 3272160 3229993 3736682 4684042 5058900 6920582
13973 6920582 10526244 17361736 27905422 29486745 20958307 14577665 10289281 7874748
13965 7874748 6212006 5305511 4852634 4465156 4193414 3591359 3796960 3574898 3170858
13956 3170858 3060417 2915372 3135149 2733453 2622342 2363306 2866863 2724766 2490349
$$ packed form
14023C458124L1657k63959J32205J10298L78380p26823K76321p0066j60810Q2896
14013C248223O323l39698L07792j07840j35911l2544J12475l17766K35014j91548
14003B784520R9273j50626k08288J78299J42862m7131J07448j98196j23030P073
13993B592204K18650l56725O3180L0598N1002J7229l22395J08184K71468j30377
13983B543018p1147K8003N17526l38818N93578m2167N06689R47360L74858J861682
13973F920582L605662O835492J0543686J581323q528438o380642m288384k414533
13965G874748j662742r06495m52877l87478k71742o02055K05601k22062m04040
13956C170858j10441j45045K19777m01696j11111k59036N03557j42097k34417
$$ plain form
13947 2490349 2573310 2979770 2454774 2475470 2496992 1905838 2348393 2054751 1988028 2301972
13937 2301972 2257584 2226350 1892910 2442909 2233997 1854762 1846172 2054207 1872692 1919240
13927 1919240 1813398 2031994 2146826 1662704 2060905 1953328 1915134 1803605 1617230 1905090
13917 1905090 1871075 1906831 2017096 1677803 1683571 1660285 1887027 1943774 1827220 1876936 1824323
13906 1824323 1877856 1752037 1815915 1513248 1675961 1923336 1897013 1455304 1422004 1766470
13896 1766470 1387958 1456081 1532835 1541628 1429004 1760256 1590724 1393191 1689948 1582615
13886 1582615 1807909 1575628 1275080 1385952 1630919 1390393 1580783 1349614 1456137
13877 1456137 1643647 1603055 1363850 1433580 913927 1556165 1332105 1393270 1480321 1563396
$$ packed form
13947B490349Q2961M06460n24996K0696K1522n91154M42555k93642o6723L13944
13937B301972m4388l1234l33440N49999k08912l79235q590K08035j81515M6548
13927A919240j05842K18596J14832m84122L98201j07577l8194j11529j86375K87860
13917A905090l4015L5756J10265l39293N768k3286K26742N6747j16554M9716n2613
13906A824323N3533j25819O3878l02667J62713K47375k6323m41709l3300L44466
13896A766470l78512O8123P6754Q793j12624L31252j69532j97533K96757j07333
13886A582615K25294k32281l00548J10872K44967k40526J90390k31169J06523
13877A456137J87510m0592k39205O9730n19653O42238k24060O1165Q7051Q3075
$$ plain form
13867 1563396 1349969 1521050 1315398 1146439 1120716 1449074 1297194 1102810 1505945 1448924
13857 1448924 1351620 1378923 1121804 1378425 1452003 1347477 1191562 1126316 1169930 1503820
13847 1503820 1428474 1453376 1227281 1166135 1118221 1339591 1180716 1200607 1252953 1250623 1256284
13836 1256284 1111556 1309275 1336732 1186673 981599 928548 1117465 1120791 1454298 973028
13826 973028 1279336 1234372 1048837 661554 1188412 1223106 936819 1199586 1026164 1074908
13816 1074908 956053 1271470 1114294 881643 915346 1049222 805455 810893 1019958 1099448
13806 1099448 938893 839066 817449 860642 1334076 1014940 778974 804345 990878 1051474
13796 1051474 858007 525510 962289 819777 637368 805233 813492 1082737 1207313 775021
$$ packed form
13867A563396k13427J71081k05652j68959k5723L28358j51880j94384M03135n7021
13857A448924r7304K7303k57119K56621P3578j04526j55915o5246M3614L33890
13847A503820p5346K4902k26095o1146m7914K21370j58875J9891N2346k330N661
13836A256284j44728J97719K7457j50059k05074n3051J88917L326L33507m81270
13826I73028L06308m4964j85535l87283N26858L4694k86287K62767j73422M8744
13816A074908j18855L15417j57176k32651L3703J33876k43767N438K09065P9490
13806A099448j60555r9827k1617M3193M73434l19136k35966K5371J86533O0596
13796A051474j93467l32497M36779j42512j82409J67865Q259K69245J24576m32292
$$ plain form
13786 775021 659609 958258 1044563 1041033 845207 791993 751095 958351 691003 628192 685174
13775 685174 776130 819335 702448 1023511 915167 738195 956868 823120 907704 872845
13765 872845 810533 855699 381220 918437 914172 704919 486659 536047 741778 536243
13755 536243 821123 622472 771919 913302 849341 632654 771494 869789 860643 858089 718174
13744 718174 572065 854729 753806 651524 815847 931486 755731 869867 539325 924040
13734 924040 752506 803991 867296 678346 667608 1036367 434886 664553 627579 728271
13724 728271 463676 956159 886249 821087 649978 990484 413695 598676 708104 822926
13714 822926 812609 680017 561862 1081017 815918 516404 728396 307063 601942 686491
$$ packed form
13786G75021j15412K98649Q6305l530j95826n3214m0898K07256k67348o2811N6982
13775F85174R0956M3205j16887L21063j08344j76972K18673j33748Q4584l4859
13765H72845o2312M5166C81220N37217m265k09253k18260M9388K05731k05535
13755E36243K84880j98651J49447J41383o3961k16687J38840R8295r146k554j39915
13744G18174j46109K82664j00923j02282J64323J15639j75755J14136l30542L84715
13734I24040j71534N1485O3305j88950j0738L68759D34886K29667l6974J00692
13724G28271k64595M92483o9910o5162j71109L40506D13695J84981J09428J14822
13714H22926j0317j32592j18155N19155k65099k99514K11992C07063K94879Q4549
$$ plain form
13704 686491 302097 490545 518036 578152 633333 531870 560803 649457 165211 556214
13694 556214 616597 654075 309041 811585 770665 367738 588884 616547 477404 537852
13684 537852 392588 578984 491149 371288 683278 104921 959374 597645 804859 386891
13673 854204 688109 509452 735729 576087 771603 505069 668932 632064 724042 400318
13663 400318 732726 337960 514177 330230 580958 573875 628971 432026 536162 553191
13653 553191 570548 528752 469701 557397 476237 511868 450699 441006 155731 614986 203931
13641 394053 770300 559482 414255 529836 385729 428009 820751 433388 641897 386874
13631 386874 831348 658784 227624 713848 218139 488683 269404 388474 204969 213992
$$ packed form
13704F86491C02097J88448K7491O0116N5181j01463K8933Q8654A65211L91003
13694E56214O0383L7478C09041N02544m0920C67738K21146K7663j39143O0448
13684E37852j45264J86396q7835j19861L11990A04921Q54453l61729K07214C86891
13673H54204j66095j78657K26277j59642J95516k66534J63863l6868R1978l23724
13663D00318L32408C37960J76217j83947K50728p083N5096j96945J04136J7029
13653E53191J7357m1796n9051Q7696q1160L5631o1169r693A55731M59255B03931
13641C94053L76247k10818j45227J15581j44107M2280L92742l87363K08509k55023
13631C86874M44474j72564B27624M86224B18139K70544k19279J19070j83505R023
$$ plain form
13621 213992 639944 210889 626336 904096 564087 270320 262165 251580 487704 660839
13611 660839 568419 469811 350940 574152 446621 334054 449359 285514 52848 709794
13601 709794 382533 253032 543433 363268 379557 554156 117096 489238 220419 552883
13591 552883 348440 542942 324518 386357 596182 378077 378904 586238 592667 638148 282530
13579 493685 76118 294884 484428 312543 200798 613802 341578 498372 270125 322156
13569 322156 352734 290688 316144 502242 285984 413995 122719 338620 504541 508286
13559 508286 53417 363859 295290 478942 482590 383846 338575 487068 386185 437886 440942
13548 440942 359958 535401 417793 315164 391904 450418 338506 435353 134680 464634
$$ packed form
13621B13992M25952B10889M15447K77760l40009B70320q155j0585K36124J73135
13611F60839r2420r8608j18871K23212j27531j12567J15305j63845E2848O56946
13601G09794l27261j29501K90401j80165J6289J74599A17096L72142B20419L32464
13591E52883k04443J94502k18424O1839K09825k18105Q27K07334O429M5481B82530
13579D93685G6118K18766J89544j71885j11745M13004k72224J56794k28247N2031
13569C22156L0578o2046K5456J86098k16258J28011A22719K15901J65921L745
13559E08286E3417L10442o8569J83652L648r8744m5271J48493j00883N1701L056
13548D40942q0984J75443j17608j02629P6740N8514j11912R6847A34680L29954
$$ plain form
13538 464634 45338 454769 259607 331925 498526 494541 123435 558930 457682 389236
13528 389236 396590 222607 248308 524896 285658 308551 431759 205980 406950 147559
13517 204384 316418 246955 48355 391274 193360 521887 428917 390760 145049 109087
13507 109087 -27638 187720 64060 538396 344773 155280 425546 386551 103931 707215
13497 707215 207094 506934 344342 295049 268075 114440 56519 251050 441875 524180
13487 524180 160207 245239 415505 118334 385456 178234 76801 118996 173042 327827
13477 327827 264376 270112 191150 226595 139869 512043 331279 174757 220977 267921 350321
13466 350321 440155 374282 459596 -2363 300727 121278 46504 -147130 221203 240873 455232
$$ packed form
13538D64634D5338M09431j95162P2318J66601l985A23435M35495j01248o8446
13528C89236P354j73983K5701K76588k39238K2893J23208B05980K00970A47559
13517B04384J12034o9463D8355L42919A93360L28527r2970l8157A45049l5962
13507A09087b7638A87720F4060M74336j93623A55280K70266l8995A03931O03284
13497G07215B07094K99840j62592m9293k6974A14440E6519J94531J90825Q2305
13487E24180A60207Q5032J70266A18334K67122A78234G6801M2195N4046J54785
13477C27827o3451N736p8962L5445q6726L72174j80764j56522M6220M6944Q2400
13466C50321Q9834o5873Q5314b363C00727A21278D6504a47130B21203J9670K14359
$$ plain form
13455 455232 429011 251237 150494 36590 577343 247349 632719 339980 425767 348311
13445 348311 489430 319035 398147 466113 353563 77211 228262 365551 311310 270586
13435 270586 107592 370591 58453 366908 263147 474835 90042 56480 274109 -110308
13424 432601 342955 151009 142528 300725 431500 -239768 156343 438030 420246 289372
13414 289372 221508 690146 449401 340925 345696 67133 191846 107426 459318 303293
13404 303293 509927 182159 154370 -45389 296652 203653 350449 -93746 289193 658319
13394 658319 3492 -3117 304906 279818 225111 164148 360052 632219 363212 119931 305704
13383 305704 610370 275716 329522 352086 583083 -183825 465013 197414 281242 207923
$$ packed form
13455D55232k6221j77774j00743C6590N40753B47349L85370k92739Q5787p7456
13445C48311J41119j70395P9112O7966j12550G7211J51051J37289n4241m0724
13435B70586A07592K62999E8453L08455j03761K11688I0042l3562K17629a10308
13424D32601q9646A51009q481J58197J30775b39768A56343K81687j7784j30874
13414B89372o7864M68638k40745j08476M771F7133J24713q4420L51892j56025
13404C03293K06634A82159k7789d5389B96652r2999J46796i3746B89193L69126
13394F58319C492c117C04906k5088n4707o0963J95904K72167k69007A19931J85773
13383C05704L04666B75716N3806K2564K30997a83825D65013A97414Q3828p3319
$$ plain form
13373 207923 263949 197773 260717 215094 25920 104412 358791 468954 97783 450441 110008
13361 338406 70869 108335 143374 221010 298622 427439 421848 253223 -64947 510653 -31130
13349 128173 159543 23566 201161 -146800 179361 191653 270947 95372 249663 201242 59966
13337 115606 273218 254304 77394 116193 136448 297968 271328 486414 99569 141322 -73214
13325 203990 435270 -111218 112993 301086 424120 469277 -273995 225088 299494 323101
13315 323101 24518 71575 123952 210738 232881 269931 490534 540318 219391 157328 158246
13304 158246 250808 155443 260466 223291 327518 -10473 293457 351193 11148 14999 526499
13293 526499 -179482 -18733 118663 399995 -92294 -39057 264841 -167918 487531 67101
$$ packed form
13373B07923N6026o6176O2944m5623B5920P8492K54379J10163I7783L52658A10008
13361C38406G0869L7466L5039P7636P7612J28817n591j68625f4947E10653c1130
13349A28173L1370B3566J77595a46800A79361J2292P9294I5372J54291m8421E9966
13337A15606J57612j8914G7394L8799K0255J61520k6640K15086I9569M1753g3214
13325B03990K31280a11218A12993J88093J23034M5157b73995B25088P4406K3607
13315C23101B4518M7057N2377Q6786K2143L7050K20603M9784B19391o2063R18
13304A58246R2562r5365J05023l7175J04227a0473B93457N7736A1148L851N11500
13293E26499a79482a8733A18663K81332i2294c9057B64841a67918D87531F7101
$$ plain form
13282 190957 140902 202233 -53218 -18033 10203 151054 93984 296029 465225 178067 -9476
13270 24182 255494 44236 9224 292393 -257377 11083 37886 406856 564493 191430 572866
13259 572866 249550 300985 -39063 230514 334281 327346 143861 119678 111444 -33310 172746
13247 262825 264609 122981 -6472 73060 186741 408930 156244 362814 53102 128422 260394
13236 260394 267308 209674 27045 202611 -70859 192910 73823 -143517 -34515 162094 133491
13225 133491 174656 183590 55239 11172 -7316 79300 229664 376808 253105 -110296 500330
13213 154942 412796 -308831 256646 130496 26792 554102 259924 170832 -145212 10824
13202 185004 141282 33821 66183 229475 228568 217145 -177888 208284 -309246 286514 511154
$$ packed form
13282A90957n0055O1331e3218a8033A0203J40851n7070K02045J69196A78067i476
13270B4182K31312D4236I224K83169b57377A1083K6803L68970J57637A91430L81436
13259E72866B49550N1435c9063B30514J03767o935A43861k4183q234c3310A72746
13247B62825J784A22981f472G3060J13681K22189A56244K06570E3102P5320J31972
13236B60394O914n7634B7045J75566g0859A92910G3823a43517c4515A62094k8603
13225A33491M1165Q934E5239A1172g316G9300J50364J47144j23703a10296E00330
13213A54942K57854c08831B56646j26150B6792N27310B59924q9092a45212A0824
13202A85004m3722C3821L2362J63292r07j1423a77888B08284c09246B86514K24640
$$ plain form
13191 511154 291081 313458 -60417 56102 149973 -70100 321777 324162 -168407 -239304 -92664
13179 112893 126665 129844 295443 -241982 119979 -78577 243328 376866 256358 23492
13168 -23594 -54520 166044 226743 287100 -34277 66281 122462 104388 -17461 -142780 17805
13156 199349 209440 382001 52677 211626 -52001 273450 -46633 228531 275513 -16084 339460
13144 448571 412914 -331711 158534 77189 66178 869 223719 216396 44614 -270485 -238219
13133 -238219 256759 266319 183183 -176484 139458 -231357 189795 35480 -53804 29637 -27241
13121 287070 115326 -62196 153462 278030 460973 212100 4046 61037 -148142 251744
13110 177365 -23705 82873 185107 106985 -21526 216652 -202417 246003 37419 100861 106822
$$ packed form
13191E11154k20073K2377f0417E6102R3871g0100C21777K385a68407p0897i2664
13179A12893J3772L179J65599b41982A19979g8577B43328J33538j20508B3492
13168b3594l0926A66044O0699O0357c4277F6281N6181j8074a7461j25319A7805
13156A99349J0091J72561E2677J58949e2001B73450d6633B28531M6982a6084C39460
13144D48571l5657c31711A58534G7189j1011H69K22850p323D4614b70485L2266
13133b38219B56759R560q3136a76484A39458b31357A89795C5480e3804B9637b7241
13121B87070A15326f2196A53462J24568J82943B12100D046N6991a48142B51744
13110A77365b3705H2873J02234p8122b1526B16652b02417B46003C7419O3442N961
$$ plain form
13099 106822 381238 -75074 103395 217386 105952 64951 -82381 61084 139831 269335
13089 269335 -105016 89561 284014 -114493 72581 -60408 104631 -98994 108163 -290541
13078 -35312 -103647 39997 263274 -161774 3546 -15035 356359 -171092 262121 -175917 -151559
13067 -151559 167947 52647 30294 240189 129434 212666 123540 -98016 113588 227261
13057 227261 177253 -158061 -72136 158963 125374 109687 -40898 344348 176839 -102428
13046 121583 138124 -14049 218682 110747 473943 171111 20902 425163 122634 -78710
13035 158012 187704 192345 214554 97129 296552 -64274 141941 -42595 477301 251545 -248901
13023 26811 140550 -21853 99566 62386 32775 225991 -139232 31245 -7605 151602 88644
$$ packed form
13099A06822K74416g5074A03395J13991A05952m1001h2381F1084P8747J29504
13089B69335a05016H9561J94453a14493G2581f0408A04631i8994A08163b90541
13078c5312o8335C9997K23277a61774C546a5035C56359a71092B62121a75917K4358
13067a51559A67947E2647k2353K09895j10755Q3232q9126i8016A13588J13673
13057B27261n0008a58061g2136A58963l3589j5687d0898C44348j67509a02428
13046A21583J6541a4049B18682j07935L63196A71111B0902M04261A22634g8710
13035A58012K9692M641K2209I7129J99423f4274A41941d2595D77301k25756b48901
13023B6811J13739b1853I9566l7180k9611J93216a39232C1245g605A51602o2958
$$ plain form
13012 88644 44840 72284 1754 43842 -62177 293210 495982 187941 121238 -47499 111761
13000 131928 -51340 45301 217760 211626 34884 73686 331316 -130316 142443 178369 10328
12988 140537 79494 26899 -48622 273764 151462 231470 133253 53554 -142161 36805 77293
12977 77293 -484589 -40060 233140 629400 48606 7803 191260 30332 -149267 -3292 -148249
12966 -148249 35756 179609 302033 254252 -166473 128035 131758 72483 -21003 300253 63126
12954 84942 -35011 -46755 8020 197894 -166667 93237 10052 91602 124589 -18145 -228974
12943 -228974 50103 99733 221355 300451 -283683 -103006 9916 -137566 105969 251631
12933 251631 -258903 271878 -39368 38880 101029 20494 -171536 88615 225822 368614
$$ packed form
13012H8644m3804K7444A754M2088f2177B93210K02772A87941o6703d7499A11761
13000A31928e1340D5301J72459o134C4884L8802K57630a30316A42443L5926A0328
12988A40537o1043B6899d8622B73764j22302Q0008r8217E3554a42161C6805M0488
12977G7293d84589d0060B33140L96260D8606G803J83457C0332a49267c292j44957
12966a48249C5756J43853J22424m7781a66473A28035L723n9275b1003C00253F3126
12954H4942c5011j1744H020J89874a66667I3237A0052Q1550L2987a8145k10829
12943b28974E0103M9630J21622P9096b83683a03006I916a37566A05969J45662
12933B51631b58903B71878c9368C8880O2149B0494a71536H8615J37207J42792
$$ plain form
12923 368614 304370 63401 -174528 199448 367593 -55491 250095 81956 -167334 -13178
12912 5781 -31980 245633 163726 101071 174464 112657 -166451 460172 351718 18141 216258
12901 216258 370513 112801 -34553 283857 -396370 141990 -174157 48708 26768 -215155
12890 161559 35570 -47009 35913 181056 -100434 -14506 -32516 196642 299112 398402 -142150
12878 -2316 72475 -124253 -76857 73884 98337 163096 225410 177058 351445 53837 69164
12867 69164 -121671 286927 -9248 -83047 105925 -147334 115369 137240 -37864 106305 -65072
12855 372829 -97007 -341455 -241008 125383 168392 127564 -54669 -97012 58806 -324744 182059
12843 -202284 -133259 -210154 162024 171999 -42455 245279 3790 226834 1072 206390 118550
$$ packed form
12923C68614o4244F3401a74528A99448J68145e5491B50095H1956a67334a3178
12912E781c1980B45633q1907o2655P3393o1807a66451D60172j08454A8141J98117
12901B16258J54255A12801c4553B83857c96370A41990a74157D8708k1940b15155
12890A61559C5570d7009C5913J45143a00434a4506j8010A96642J02470R9290a42150
12878b316G2475a24253M7396G3884K4453O4759O2314m8352J74387E3837J5327
12867F9164a21671B86927i248p3799A05925a47334A15369K1871c7864A06305f5072
12855C72829i7007k44448J00447A25383M3009m0828e4669m2343E8806c24744A82059
12843b02284O9025p6895A62024R975d2455B45279C790K23044A072K05318q7840
$$ plain form
12832 118550 -12636 -157471 2483 -2482 -392110 56079 -304544 -77011 391024 125992 -11117
12820 -184654 -25138 -73706 -81752 -3209 113254 72330 140584 285245 284406 -259886 -9032 185060
12807 -105892 -47361 -88569 7061 -217546 -227805 26095 196785 -126467 12381 159116 -662
12795 -221255 260066 132421 95993 128454 93692 151520 14803 -12782 -16859 -453031 90400
12783 -305686 -374856 -102719 36972 -11997 -59103 -265681 130573 -139421 59839 -15941 201374
12771 12686 146398 -159962 -56415 -17308 197721 -11754 350298 -35636 -62345 163449 79858
12759 211087 14160 169138 16875 -6312 131456 -37845 270188 -18918 -186110 115765 -72816
12747 281503 -9137 64149 -62896 -286383 389919 -36830 -75591 287276 -129491 19674 120576
$$ packed form
12832A18550a2636j44835B483b482l89628E6079c04544g7011C91024A25992a1117
12820a84654b5138m8568q046c209A13254m0924O8254J44661q39b59886i032A85060
12807a05892d7361m1208G061b17546j0259B6095J70690a26467A2381J46735f62
12795b21255B60066j27645l6428L2461l4762N7828A4803a2782m077m36172I0400
12783c05686o9170a02719C6972a1997m7106k06578A30573a39421E9839a5941B01374
12771A2686J33712a59962e6415a7308A97721a1754C50298c5636k6709A63449G9858
12759B11087A4160J54978A6875f312A31456c7845B70188a8918j67192A15765g2816
12747B81503i137F4149f2896k23487C89919c6830l8761B87276a29491A9674J00902
$$ plain form
12736 120576 62599 81356 -6343 -86267 -29341 227621 223915 303656 18301 -144174 -46216
12724 19490 204961 214696 111405 391228 -25511 161501 27344 44203 122714 388 210840
12713 210840 -87870 -101370 -149018 -51328 173321 -198672 -442059 143022 40261 102435 277938
12702 277938 48371 71110 154136 49134 -167820 -179079 307264 254527 275400 297393 242696
12691 242696 -221625 -53080 157471 -49617 -176461 252422 271177 -68096 -175492 36635
12680 -130094 5256 97893 189305 259810 58791 113558 -116441 125585 119417 88899 -62019
12668 342931 -141390 -17742 343883 -42907 441980 -39671 430096 292148 252106 -114017
12657 -166147 485266 359925 311584 436676 -111065 8630 45617 -138882 387 -173813 23986
$$ packed form
12736A20576n7977J8757f343p9924b9341B27621l706P9741A8301a44174d6216
12724A9490J85471R735j03291K79823b5511A61501B7344J6859P8511C88K10452
12713B10840h7870j3500m7648e1328A73321a98672k43387A43022D0261O2174J75503
12702B77938D8371K2739Q3026D9134a67820j1259C07264n2737K0873K1993n4697
12691B42696b21625e3080A57471d9617j26844B52422J8755f8096j07396C6635
12680a30094E256R2637R1412P0505E8791N4767a16441A25585o168l0518f2019
12668C42931a41390a7742C43883d2907D41980c9671D30096j37948m0042a14017
12657a66147D85266j25341m8341J25092a11065H630L6987a38882C87a73813B3986
$$ plain form
12645 428405 -33296 458173 73799 395431 91176 189948 155878 118908 -138185 -6633 271851
12633 -156919 -32991 220699 -120693 396769 -65803 -202833 302785 71669 -42715 175839
12622 16023 265245 90429 252987 135967 -45529 75820 220392 -49070 164434 -177217
12611 70000 477713 20772 357825 138368 47103 -63523 231061 348935 315827 200198
12601 200198 198386 -227002 -257451 -180705 -241836 303847 -223360 -118245 -72613 49401 69860
12590 69860 157793 -213024 28067 173638 -19614 57317 307503 -128809 200099 -78546 190819
12578 299798 -164020 58529 -15676 314874 161961 187036 2830 156719 -141171 43420 235752
12567 235752 -33447 107343 -85773 441580 -1358 -182414 24457 -62819 -41036 -255062 161186
$$ packed form
12645D28405c3296D58173G3799L21632I1176R8772l4070l6970a38185f633B71851
12633a56919c2991B20699a20693C96769f5803j37030C02785G1669d2715A75839
12622A6023K49222I0429J62558j17020d5529G5820J44572d9070A64434a77217
12611G0000M07713B0772L37053A38368D7103f3523B31061J17874l3108j15629
12601B00198j812b27002l0449P6746o1131C03847b23360J05115M5632D9401K0459
12590F9860Q7933b13024B8067J45571a9614E7317K50186a28809B00099g8546A90819
12578B99798a64020E8529a5676C14874j52913K5075B830J53889a41171D3420J92332
12567B35752c3447A07343h5773D41580a358j81056B4457f2819K1783k14026A61186
$$ plain form
12555 -105917 113569 158960 -163652 -57748 -268799 173850 -327451 21038 156084 -240469
12544 156047 317741 26173 140011 -48755 284695 -30898 118905 484221 -317975 -79236
12533 159622 -158550 42133 5128 210166 -29263 -64665 -231522 -140538 -361619 92827 -245751
12521 152354 -107631 263883 -31042 51658 -173686 -276435 -76436 -8155 82761 -98690 84483
12509 -116237 -104161 35481 247822 696020 -23774 -31950 -162570 130719 -100826 192221
12498 -23819 -67658 -110230 -55655 138367 183623 -37024 -198481 -183014 -178733 275108 70610
12486 16131 190562 -41788 45088 -214979 -63869 -304790 11178 -17740 -115109 -34481 274009
12474 296712 164686 -63237 -121494 -226731 -24922 409663 -169641 102670 -116494 346170
$$ packed form
12555a05917A13569M5391a63652e7748k11051A73850c27451B1038J35046b40469
12544A56047J61694B6173J13838d8755B84695c0898A18905L65316c17975g9236
12533A59622a58550D2133E128K05038b9263l5402j66857R0984k21081I2827b45751
12521A52354a07631B63883c1042E1658a73686j02749g6436h155H2761i8690H4483
12509a16237J2076C5481K12341M48198b3774q176j30620A30719a00826A92221
12498b3819m3839m2572N4575A38367M5256c7024j61457J5467M281B75108G0610
12486A6131J74431d1788D5088b14979f3869k40921A1178a7740r7369c4481B74009
12474B96712j32026f3237n8257j05237b4922D09663a69641A02670a16494C46170
$$ plain form
12463 14353 -225843 63189 17513 75302 367404 -53102 -289552 -262606 -213053 288321 641
12451 162827 101689 -247448 513469 -187039 56204 61353 -408514 -69022 -189537 26820 320260
12440 320260 -139326 123265 85811 89515 173389 129822 194244 175294 231572 33182 -71570
12428 -26036 -13600 26223 428406 265664 -57872 -139690 -28347 326269 78780 153762 -162475
12416 -32779 38236 218208 -25447 182502 150208 -20313 19797 13775 -93695 128878 75357
12405 75357 -89091 -237924 247811 247168 -136396 37585 375073 12311 -10620 58891 -86078
12393 139737 9660 -128420 7828 -107752 -200330 -234928 148471 355352 117280 174204 124180
12382 124180 -148691 -182275 28510 32709 -194582 103537 70213 -186948 53868 -231814 132733
$$ packed form
12463A4353b25843F3189A7513N7789K92102e3102k36450K6946M9553B88321F41
12451A62827o1138b47448E13469a87039E6204N149d08514f9022j20515B6820K93440
12440C20260a39326A23265l7454L704Q3874m3567O4422j8950N6278C3182g1570
12428b6036J2436B6223M02183j62742e7872q1818b8347C26269G8780P4982a62475
12416c2779C8236J79972b5447A82502l2294b0313A9797o022i3695A28878n3521
12405G5357h9091j48833B47811o43a36396C7585L37488A2311a0620E8891h6078
12393A39737I660a28420G828a07752r2578l4598A48471K06881A17280N6924n0024
12382A24180a48691l3584B8510M199a94582A03537l3324a86948E3868b31814A32733
$$ plain form
12370 -90928 -218712 -140419 36258 28307 -226459 52089 -134407 95564 -58345 -160495 19108
12358 -300792 -59571 97682 -6514 165345 410010 171735 194032 -249372 -112183 6425 -96491
12346 75322 -248898 353570 -45375 392772 -125310 70126 -421470 122773 146364 102343
12336 102343 -65826 -151753 215753 86505 198216 88338 -155977 -197627 32084 -39159 -105056
12325 -105056 -92629 88343 -423874 154224 17282 -4596 75803 82007 -122056 -301491 -38131
12313 22870 -99811 5498 -248920 -5711 -12721 132707 -400765 181779 124000 -32719 27882
12301 54195 123683 -87508 91008 -59916 11348 284254 -533846 -116137 123369 116028 355289
12290 355289 245161 -11386 -62424 321934 131111 58484 210222 33244 346526 -4371 -222342
$$ packed form
12370i0928j27784P8293C6258p951b26459E2089a34407I5564e8345j02150A9108
12358c00792e9571I7682f514A65345K44665A71735K2297b49372a12183F425i6491
12346G5322b48898C53570d5375C92772a25310G0126d21470A22773K3591m4021
12336A02343f5826q5927B15753H6505J11711H8338a55977m1650C2084c9159o5897
12325a05056J2427H8343d23874A54224A7282d596G5803O204a22056j79435c8131
12313B2870i9811E498b48920e711p010A32707d00765A81779n7779c2719B7882
12301E4195O9488h7508I1008e9916A1348K72906e33846a16137A23369p341K39261
12290C55289j10128a1386n1038C21934A31111E8484J51738C3244L13282d371k17971
$$ plain form
12279 -222342 -19880 121372 -33097 2831 66812 -20349 -203668 150052 105773 -20930 251075
12267 297285 -123812 -24682 -100031 -212665 -145868 -25885 261146 320185 78799 146324 -20030
12255 -221842 415786 325006 99851 59419 300941 74210 343737 177182 -15629 118303
12244 7108 -116499 367798 153575 37652 -52267 126247 368097 -14355 -174245 -369322
12234 -369322 207093 -15496 103238 -1718 58365 -81123 113995 42049 -37940 20950 -107263
12222 210314 84076 -122220 -259771 -125284 151227 53408 -75924 32780 254699 -57405
12211 342318 49660 218962 248168 10909 252148 159421 110162 360391 318654 -95864 192731
12199 126803 165737 274559 113874 -31693 182485 236720 12537 28103 300111 73672 53965
$$ packed form
12279b22342a9880A21372c3097B831O3981b0349j83319A50052m4279b0930B51075
12267B97285a23812b4682p5349j12634O6797b5885B61146N9039G8799O7525b0030
12255b21842D15786r0780I9851m0432K41522G4210K69527j66555a5629A18303
12244G108a16499C67798A53575C7652e2267A26247K41850a4355j59890j95077
12234c69322B07093a5496A03238a718E8365h1123A13995D2049c7940B0950a07263
12222B10314H4076a22220j37551a25284A51227E3408g5924C2780K21919e7405
12211C42318D9660J69302K9206A0909K41239r2727m9259K50229m1737i5864A92731
12199A26803L8934J08822A13874c1693A82485N4235A2537J5566K72008G3672j9707
$$ plain form
12188 53965 321130 372675 436078 197791 486884 481199 267831 277077 84122 114177 271009
12177 271009 -110326 228917 -280526 -40808 399329 13366 -57866 209000 -94692 159164
12166 -1215 -101742 -77053 141544 153607 252362 -53052 -76440 116697 60762 55642 -180442
12154 203313 40424 75696 203124 130735 104913 -30062 221591 -17196 443448 88288 106190
12143 106190 115759 297304 134099 127008 -199836 47900 155583 332376 -153548 81057 290316
12132 290316 169948 333002 431315 115958 43136 153693 -92696 33133 98589 107799 -170733
12120 -136161 23486 -181940 -265567 374348 422 218527 -63973 91232 -54049 -62891 145365
12108 -228687 -100707 -220485 -157636 117403 -138620 -76699 375968 -238512 -31269 -72295
$$ packed form
12188E3965K67165N1545O3403A97791K89093n685k13368R246H4122L0055J56832
12177B71009a10326B28917b80526d0808C99329A3366e7866B09000i4692A59164
12166a215j00527K4689A41544J2063R8755e3052k3388A16697n5935n120a80442
12154B03313D0424L5272J27428p2389k5822c0062B21591a7196D43448H8288J7902
12143A06190R569J81545A34099p091a99836D7900J07683J76793a53548H1057K09259
12132B90316j20368J63054R8313A15958D3136J10557i2696C3133O5456R210a70733
12120a36161B3486a81940q3627C74348D22K18105f3973I1232e4049q842A45365
12108b28687a00707j19778O2849A17403a38620O1921C75968b38512c1269m1026
$$ plain form
12098 -72295 -126138 -20744 -34760 106512 46926 213267 297840 373 117025 -134439 104290
12086 179868 54744 -199015 -789 206554 19382 -105457 30860 -101647 468791 -77501 206974
12074 -70363 15659 -95248 45381 275314 72366 217739 -72297 138065 230708 -136664 -48740
12062 -204754 -236249 129142 578714 579901 314341 977968 536283 456469 79712 216791
12052 216791 81083 232321 -106653 -120985 181578 113549 319031 -41519 71376 294252
12042 294252 -273720 -15632 -122313 -149187 56152 -214975 59680 -16070 119372 17944 -55628
12030 -105752 -211056 -60809 -275752 141536 -170851 46980 -257326 93373 -74370 -71840 107649
12018 -331168 236053 95860 95667 -340743 -94476 -157451 -2470 138405 7077 167867 213836
$$ packed form
12098g2295n3843b0744j4016A06512D6926J66341Q4573C73J16652a34439A04290
12086A79868E4744a99015g89B06554A9382a05457C0860a01647D68791g7501B06974
12074g0363A5659i5248D5381K29933G2366J45373g2297A38065R2643a36664d8740
12062b04754l1495A29142M49572J187k65560O63627m41685p9814G9712J37079
12052B16791H1083J51238a06653j4332A81578o8029K05482d1519G1376K22876
12042B94252b73720a5632j06681k6874E6152b14975E9680a6070A19372A7944e5628
12030a05752j05304f0809k14943A41536a70851D6980b57326I3373g4370K530A07649
12018c31168B36053I5860j93c40743i4476o2975b470A38405G077J60790M5969
$$ plain form
12007 213836 -251123 98202 149368 -21322 -69894 -268479 117380 83385 -335 -139789 -134013
11996 -134013 -40741 -349264 -81403 161675 -60132 -222654 104016 -450607 59897 -373550
11985 -305895 -36393 103464 276968 -43748 69378 -422920 -17927 -62550 83958 246243 221310
11974 221310 -33362 197726 -18154 -77173 -57251 34026 139723 145811 -142098 -60414 63641
11962 213755 -98941 -68024 211580 54651 132363 22164 21463 -156333 154655 -330419 -252314
11951 -252314 -188484 -146026 70003 -134681 -60225 -285165 -103771 -309289 -157978 100515
11940 86197 101527 140328 -148116 46513 84260 145716 6449 -149272 55451 44904 -213060
11928 161129 -86653 -135484 -4804 115079 181905 -34525 -130067 48738 -39618 60400 -124783
$$ packed form
12007B13836b51123I8202N1166b1322m8572j98585A17380l3995c35j39454N776
11996a34013d0741l08523h1403A61675f0132j62522A04016d50607E9897c73550
11985c05895c6393A03464J73504d3748F9378d22920a7927m4623H3958J62285k4933
11974B21310c3362A97726a8154n9019J9922C4026J05697O088a42098f0414F3641
11962B13755i8941L0917B11580E4651P7712B2164p01a56333A54655c30419P8105
11951b52314O3830M2458G0003a34681f0225k24940a03771k05518J51311A00515
11940H6197J5330L8801a48116D6513L7747O1456F449a49272E5451j0547b13060
11928A61129h6653m8831d804A15079O6826c4525r5542D8738c9618F0400a24783
$$ plain form
11916 -58060 -125868 -100804 -19729 374698 1703 -9330 350779 -419523 148242 389806 -122791
11904 -176400 -183937 -69187 16292 110550 -110529 -2750 -328126 -9398 -5019 5904 65396 166597
11892 166597 -156937 155979 -22420 -155112 -93340 -126060 106556 -289144 -156719 -162501
11882 -162501 -130412 -390989 -108593 -91157 -236311 198657 -91590 269640 79033 7287 -9663
11870 69506 -64079 -764 -215209 -404299 -93296 244452 -7393 -252469 269260 356248 -36826
11858 47286 37783 110850 68152 -53456 -31573 -33159 144149 39455 -229061 -319021 72764 201835
11846 201835 87249 -86091 -125177 -106930 129990 -144393 2942 14269 58071 40525 41736
11835 41736 -121673 -32343 130728 -21686 110594 35111 -181869 -102957 78502 -252509 -47931
$$ packed form
11916e8060o7808K5064a9729C74698A703i330C50779d19523A48242K41564a22791
11904a76400p537f9187A6292R4258a10529b750l25376i398M379E904N9492J01201
11892A66597a56937A55979b2420j32692O1772l2720A06556b89144J32425n782
11882a62501L2089k60577a08593J7436j45154A98657i1590B69640G9033G287i663
11870F9506f4079g64k14445j89090i3296B44452g393k45076B69260Q6988c6826
11858D7286r503P3067m2698e3456K1883j586A44149C9455b29061q9960G2764J29071
11846B01835H7249h6091l9086J8247A29990a44393B942J1327M3802j7546J211
11835D1736a21673c2343A30728b1686A10594C5111a81869P8912G8502b52509d7931
$$ plain form
11823 19078 -249821 126064 301943 -419090 -385070 -49158 123980 -244756 -100617 224573
11812 -264714 -427090 183329 -40420 61749 -327936 -50432 -161619 144143 -121946 -111844
11802 -111844 -456145 -15080 235921 21662 24198 -198076 183698 -162115 81098 20268 178508
11791 178508 -12824 -178429 -101645 43261 -121648 180286 -256655 84506 -114587 123751
11780 19515 -43931 -37189 -157394 -325239 129340 -180892 -347433 -120702 27339 -118960
11769 136965 -75057 4567 -239268 -164044 -170539 231856 36170 -7071 122956 -168057 9367
11757 342287 -238667 154961 123685 -22428 307820 -37877 142836 94968 -68971 164153
11746 -139937 55876 -97326 124244 -63745 -31282 -85828 -79665 104029 4728 530376 -59397
$$ packed form
11823A9078b49821A26064J75879d19090L4020d9158A23980b44756a00617B24573
11812b64714j62376A83329d0420F1749c27936e0432j11187A44143a21946J0102
11802a11844l44301a5080B35921B1662K536a98076A83698a62115H1098B0268J58240
11791A78508a2824j65605P6784D3261a21648A80286b56655H4506a14587A23751
11780A9515d3931O742j20205j67845A29340a80892j66541a20702B7339a18960
11769A36965g5057D567b39268P5224o495B31856C6170g071A22956a68057I367
11757C42287b38667A54961l1276b2428C07820c7877A42836m7868f8971A64153
11746a39937E5876i7326A24244f3745c1282n4546O163A04029D728N25648e9397
$$ plain form
11734 -167480 -193995 287357 160424 -41823 -263654 -206175 237472 47423 -160197 183205
11723 -223221 140409 189609 -42983 -11315 -173804 405287 -273040 234613 93378 203270
11713 203270 -64010 -20777 -40326 338188 -105491 148844 163715 -37342 282653 -13037 -60980
11702 -60980 95503 -253671 208895 -140884 16725 88379 197053 98303 14640 258041 -22081
11690 431761 102401 121302 -64912 75916 -16956 -46142 670 -40619 -164131 702754 -275666
11678 64956 151442 37926 104866 -131294 -106378 -219533 102110 -20050 -157275 25108 -146010
11666 60230 -66601 -6278 -207054 165460 -10379 -199019 -62883 97100 -102359 111061 -37347
11654 -202582 8613 238248 -77444 132853 148878 148923 -108373 -73010 -353049 99011 -256279
$$ packed form
11734a67480k6515B87357j26933d1823k21831N7479B37472D7423a60197A83205
11723b23221A40409M9200d2983a1315j62489D05287b73040B34613I3378J09892
11713B03270f4010b0777j9549C38188a05491A48844J4871c7342B82653a3037m7943
11702f0980I5503b53671B08895a40884A6725P1654J08674I8303A4640K43401b2081
11690D31761A02401J8901f4912G5916a6956k9186F70d0619j23512G02754b75666
11678F4956Q6486C7926O6940a31294K4916j13155A02110b0050j37225B5108a46010
11666F0230f6601f278k00776A65460a0379j88640f2883I7100a02359A11061c7347
11654b02582H613K29635g7444A32853J6025M5a08373L5363k80039I9011b56279
$$ plain form
11642 90500 170212 -218264 -10678 112503 -86802 48325 479656 -49390 -128612 3051 404 -190712
11629 -131688 -97133 -17116 -61796 -65236 -421729 -175764 -17524 226341 -48084 -268389 -69062
11617 -23688 27197 366901 179920 -21924 187795 284177 66470 61722 189281 -229660 -23418
11605 294966 159934 37637 -84064 -8794 348422 32677 239523 -103029 -34040 -27278 -114661
11594 -114661 -164949 -261112 -176539 100467 -100004 1246 36221 -176869 -29449 -65769 -95518
11583 -95518 -235324 -18989 250386 -27388 29373 23591 120299 -35720 129138 269702 -123346
11571 -45178 79326 111794 68767 -252289 75759 77347 202179 23502 -77730 44992 156267
11560 156267 145529 179080 -59803 197915 110697 97451 -246534 323042 67508 -47517 65002
$$ packed form
11642I0500P9712b18264a0678A12503h6802D8325M31331d9390p9222C051D04a90712
11629a31688L4555a7116m4680l440l56493a75764a7524B26341d8084k20305f9062
11617b3688B7197L39704A79920b1924A87795R6382F6470m748J27559b29660b3418
11605B94966j35032C7637h4064h794C48422C2677K06846a03029c4040O762q7383
11594a14661n0288r6163Q4573A00467a00004A246L4975a76869b9449l6320k9749
11583i5518j39806a8989B50386b7388B9373n782R6708c5720A29138J40564a23346
11571d5178G9326L2468m3027b52289G5759J588J24832B3502g7730D4992J11275
11560A56267j0738L3551e9803A97915q7218j3246b46534C23042F7508d7517F5002
$$ plain form
11548 -53593 -150789 58986 -95958 324507 -62536 102825 128857 185068 10088 1478 24931
11537 24931 321978 194461 -225019 43263 109399 9308 -29681 51197 -148483 101177 -420132
11525 -190761 215244 146531 -189467 92907 136208 -42892 306687 -132348 -64204 386493
11514 -42852 47865 63048 56401 111415 192800 -141630 27915 27240 136415 -180497 -282947
11503 -282947 -9497 -206044 210657 186248 195174 524177 115611 -154572 82924 -129708 -143460
11492 -143460 105437 -45582 86367 26601 322221 176292 157949 32756 156944 657400
11482 657400 93325 237867 270857 48118 -118499 -8024 174266 224713 329678 108064 39960
11470 118242 49661 304835 17545 11415 49971 -44048 182634 -56630 254602 148767 80721
$$ packed form
11548e3593r7196E8986i5958C24507f2536A02825K6032N6211A0088A478K3453
11537B4931K97047j27517b25019D3263O6136I308b9681E1197a48483A01177d20132
11525a90761B15244o8713a89467I2907M3301d2892C06687a32348f4204C86493
11514d2852D7865J5183o647N5014Q1385a41630B7915o75J09175a80497j02450
11503b82947i497j96547B10657k4409Q926L29003A15611a54572H2924a29708j3752
11492a43460A05437d5582H6367B6601K95620j45929j8343C2756J24188N00456
11482F57400I3325J44542L2990D8118a18499h024A74266N0447J04965A08064C9960
11470A18242D9661K55174A7545o130L8556d4048A82634e6630B54602j05835o8046
$$ plain form
11459 80721 96015 177186 370155 80529 -168080 418645 191980 -71097 133330 202510 177602
11448 177602 832 323952 -10244 397460 452953 186745 -186579 567889 -121122 -59358 92802
11436 70742 -131445 59539 19432 6110 121481 -105266 112574 -81240 65189 -35726 -191557
11425 -191557 119276 196753 -70348 -256367 87214 318836 65732 -32372 191365 230764 467443
11414 467443 46333 16202 -184651 118732 81080 82163 -15571 286328 -51140 -199592 89684
11402 137950 -295768 148137 141356 -295753 -127155 -283330 -98636 336149 -12763 75633
11391 -87733 -102948 -171689 -342235 271679 -41063 269026 196992 157751 -106014 -76736 -126456
11380 -126456 -6335 238325 -119911 -175576 -86224 -2240 -193509 -47879 -89674 -307746 340483
$$ packed form
11459H0721J5294Q1171J92969H0529a68080D18645A91980g1097A33330O9180k4908
11448A77602H32L23120a0244C97460N5493A86745a86579E67889a21122e9358I2802
11436G0742a31445E9539A9432F110J15371a05266A12574h1240F5189c5726j55831
11425a91557A19276P7477g0348j86019H7214K31622F5732c2372A91365L9399K36679
11414D67443D6333A6202a84651A18732l7652J083a5571B86328e1140j48452H9684
11402A37950b95768A48137o781b95753a27155j56175i8636C36149a2763G5633
11391h7733j5215o8741j70546B71679d1063B69026p2034l9241a06014K9278m9720
11380a26456f335B38325a19911n5665h6224b240j91269d7879m1795k18072C40483
$$ plain form
11368 109152 -37801 -205229 -27842 78853 122218 94247 45451 130942 -235843 410427 -392470
11356 -237936 -65637 73978 -282656 157803 -10069 -186208 137304 -9614 166603 34956 24203
11345 24203 254614 -143259 -34225 244231 -78656 170132 76838 -105756 62290 186418
11335 186418 20346 105601 -32673 74279 84187 273153 113817 -218225 81160 125871 -44557
11323 257004 31167 274785 51561 120220 -194204 86695 24910 -4195 31125 158867 -464413
11311 55489 -315394 -144958 -337188 -88893 131945 -111793 233209 90109 87253 217574
11301 217574 -31908 88288 -115368 -138952 -97140 -93624 90950 -78638 -22278 182302 -264574
11289 -3834 -197630 -83322 26286 168954 139549 -84947 8718 16210 148523 -269000 -113652
$$ packed form
11368A09152c7801j67428b7842G8853M3365k7971D5451Q5491b35843D10427c92470
11356b37936f5637G3978b82656A57803a0069j76139A37304i614A66603C4956j0753
11345B4203K30411a43259c4225B44231g8656A70132G6838a05756F2290J24128
11335A86418B0346Q5255c2673G4279R908J88966A13817b18225H1160M4711d4557
11323B57004C1167K43618E1561O8659a94204H6695B4910d195C1125J27742d64413
11311E5489c15394a44958j92230h8893A31945a11793B33209I0109k856J30321
11301B17574c1908H8288a15368k3584M1812L516I0950g8638b2278A82302b64574
11289c834j93796h3322B6286J42668k9405h4947H718P492J32313b69000a13652
$$ plain form
11277 -138145 -13529 -260647 -155439 248945 53272 93233 -80920 -57628 -35579 150692 -73102
11265 -79968 -187951 33024 -198810 -108947 25844 43825 -286464 -113873 -135931 -239952 -111595
11253 175850 -81257 227896 -283211 106970 -128375 140881 396168 -72147 42377 -58384
11242 135269 70122 46558 190381 100436 -293841 42442 47069 79064 99364 -224740 -551138
11231 -551138 -122919 -229858 191625 -92185 228254 -27394 -241733 -13246 92402 -329088
11220 7017 12329 233950 209965 -114674 51611 142215 -24448 31909 -6102 -253647 -4370 -639379
11208 -639379 77936 321928 -97266 82687 257836 233010 155876 264456 327111 -122922 -193056
11197 -193056 2175 -235177 10958 -169011 -194400 -357594 -57604 -197345 -80336 -305617 -55655
$$ packed form
11277a38145a3529k47118J05208B48945E3272L9961h0920K3292K2049A50692g3102
11265g9968j07983C3024a98810Q9863B5844J7981b86464a13873k2058j04021a11595
11253A75850h1257B27896b83211A06970a28375A40881K55287g2147D2377e8384
11242A35269o5147k3564J43823q9945b93841D2442M627L1995K0300b24740l26398
11231e51138a22919j06939A91625i2185B28254b7394k14339a3246I2402c29088
11220G017N312K21621k3985a14674E1611R0604b4448C1909f102k47545d370o35009
11208f39379G7936K43992i7266H2687J75149k4826p7134J08580O2655a22922p0134
11197a93056B175b35177A0958a69011k5389j63194e7604j39741h0336k25281e5655
$$ plain form
11185 55493 -334750 -116992 -136821 -12011 -145864 -58705 -122651 76679 -156073 -152460 74947
11173 -123072 45267 93322 188085 181811 -235642 107651 -36293 87800 269474 -160399 153703
11161 244555 70403 21093 -72754 -98815 -76655 29093 -54610 279017 -419493 -133985 -102776
11150 -102776 -59567 28050 -293304 161668 -213974 166883 50602 9680 252430 -46043 338339
11138 112156 -323273 -292957 65738 -168417 -81377 99955 -232666 -52187 -130097 19936 -157298
11126 240233 -35263 -132088 197081 -150317 56566 207635 151218 96092 1963 -188004 -191844
11115 -191844 44963 -124261 30396 -42359 167557 -216742 184781 156596 -1828 156791 291770
11104 291770 183651 -33775 192512 -270789 -75513 224211 -2748 233866 241424 268064 -90038
$$ packed form
11185E5493c34750a16992j9829a2011j33853e8705o3946G6679a56073L613G4947
11173a23072D5267M8055R4763o274b35642A07651c6293H7800J81674a60399A53703
11161B44555G0403B1093g2754k6061K2160B9093e4610B79017d19493a33985L1209
11150a02776M3209B8050b93304A61668b13974A66883E0602I680K42750d6043C38339
11138A12156c23273L0316F5738a68417h1377I9955b32666e2187p7910A9936a57298
11126B40233c5263r6825A97081a50317E6566J51069n6417n5126A963a88004l840
11115a91844D4963a24261C0396d2359A67557b16742A84781k8185a828A56791J34979
11104B91770j08119c3775A92512b70789g5513B24211b748B33866P558K6640i0038
$$ plain form
11092 -141332 -1320 413972 -181745 114855 230387 -114933 244012 87948 65213 66858 322674
11081 322674 20828 263187 390890 193829 31602 137666 135166 52168 465907 16732 511416
11070 511416 -154919 380087 41714 76069 243549 166299 467186 399391 143283 516952
11060 516952 211913 303615 290108 8875 239211 188881 219476 262387 111544 348750 373315
11049 373315 350211 241803 440906 425158 878252 411049 362795 200164 490914 658546
11039 658546 654409 636050 817895 589391 422254 596160 465693 665005 465767 225242
11028 570859 785644 680393 674017 572073 603271 531285 559053 855672 624718 500646
11018 500646 620463 738331 338774 536354 715067 652087 761886 372945 598385 627003
$$ packed form
11092a41332a320D13972a81745A14855J15532a14933B44012H7948k2735J645K55816
11081C22674B0828K42359J27703A93829C1602J06064k500E2168M13739A6732M94684
11070E11416a54919C80087D1714L4355J67480p7250L00887o7795A43283L73669
11060E16952B11913R1702j3507H875K30336n0330L0595M2911A11544K37206K4565
11049C73315k3104j08408J99103j5748M53094D11049m8254j62631K90750J67632
11039F58546m137j8359J81845k28504j67137J73906j30467J99312j99238B25242
11028E70859K14785j05251o376j01944L1198p1986K7768K96619k30954j24072
11018E00646J19817J17868C38774J97580J78713o2980J09799C72945K25440K8618
$$ plain form
11008 627003 610879 513380 489505 589311 483840 497944 526294 663396 488823 129974 718292
10997 718292 506698 829940 518045 762106 707386 642280 598071 526296 527608 264930 615447
10986 615447 324390 646333 508632 693515 433162 411272 535192 605090 677100 610992
10976 610992 548897 563650 807441 850953 482893 725017 759302 967429 960422 1106893 1286324
10965 1286324 1184420 941991 1492784 1412251 1401576 2020828 1602152 2225679 2177569 2357173
10955 2357173 2376789 2283999 1817308 1529132 1686563 1932731 1770578 1574799 1254152 1389428
10945 1389428 1537253 1857090 1559375 1279509 1500401 1243070 1361006 1061466 1124178 914874
10935 914874 1326927 782422 847474 131008 546858 603313 144063 560392 133336 427983
$$ packed form
11008F27003j6124r7499k3875R9806j05471J4104K8350J37102j74573A29974N88318
10997G18292k11594L23242l11895K44061n4720o5106m4209p1775J312k62678L50517
10986F15447k91057L21943j37701J84883k60353k1890J23920O9898P2010o6108
10976F10992o2095J4753K43791M3512l68060K42124L4285K08127p007J46471J79431
10965A286324j01904k42429N50793q0533j0675O19252m18676O23527m8110J79604
10955B357173J9616r2790m66691k88176J57431K46168j62153j95779l20647J35276
10945A389428J47825L19837k97715k79866K20892k57331J17936k99540O2712k09304
10935I14874M12053n44505O5052A31008M15850N6455A44063M16329A33336K94647
$$ plain form
10925 427983 337256 339487 55336 142060 85191 -113196 75768 43984 46357 99883 48017 157903
10913 157903 191826 110874 -70544 -56619 101583 23471 155747 179603 -179606 -77877 181335
10901 -10116 27923 242273 -82586 256992 80398 -31446 -167335 -186629 -409565 342173 -161274
10889 -150064 -288865 -117599 -198323 -74836 -72919 112655 -248258 -85748 -248251 11890 23847
10878 23847 50787 -351809 266722 -39338 -57445 -300509 -5399 13092 -182860 -87842 -54415
10867 -54415 206214 161030 191357 -85837 198625 -165263 -388069 -150353 230817 -56190
10856 31592 -11031 -51627 44421 -174445 70736 -82662 -39415 142287 -113624 54490 -19391
10844 49378 -14860 109457 -279666 -196233 33773 -24056 -235963 302671 -197082 -29796 124189
$$ packed form
10925D27983r0727K231E5336Q6724n6869a13196G5768l1784K373N3526D8017J09886
10913A57903L3923q0952g0544J3925A01583B3471J32276K3856a79606g7877A81335
10901a0116B7923K14350h2586B56992H0398c1446j35889j9294k22936C42173a61274
10889a50064j38801a17599q0724g4836J917A12655b48258h5748j62503A1890J1957
10878B3847K6940c51809B66722c9338j8107k43064e399A3092a82860h7842L3427
10867e4415B06214m5184L0327h5837A98625a65263k22806a50353B30817e6190
10856C1592a1031m0596D4421a74445G0736h2662c9415A42287a13624E4490a9391
10844D9378a4860A09457b79666Q3433C3773b4056k11907C02671a97082b9796A24189
$$ plain form
10832 16764 90420 29012 -22721 29192 26541 61596 -64692 -18156 146979 31688 87152 -247630
10819 36456 210434 -198401 -276182 25388 -59727 -83960 -94495 150844 -54471 -12529 -206368
10808 -206368 -90597 18451 -28679 -80833 -5170 130644 -62469 -61272 -13908 -254205 92119
10796 -463932 96214 53296 29476 42346 -33402 -66557 97224 -18706 46329 116143 -86434
10784 -150765 188086 136603 49488 -179242 -30391 229939 84971 -112093 -77862 -66471 -176174
10773 -176174 -61043 8293 -322821 -50462 -103177 -233025 38681 -241251 -150935 -47310 -317604
10762 -317604 -609 117224 -14010 -83255 -28809 111286 -30036 -70782 -141062 21803 95821
10751 95821 204717 14827 -81099 -406979 -92909 115301 212405 148440 25621 103196 80782
$$ packed form
10832A6764P3656B9012b2721B9192k651L5055f4692a8156A46979C1688N5464b47630
10819C6456J73978a98401p7781B5388e9727k4233j0535A50844e4471a2529j93839
10808b06368i0597A8451b8679n2154e170A30644f2469J197a3908k40297I2119
10796d63932I6214m2918k3820J2870c3402l3155I7224a8706D6329O9814h6434
10784a50765A88086n1483D9488a79242c0391B29939H4971a12093L4231J1391j09703
10773a76174f1043H293c22821e0462n2715j29848C8681b41251R0316d7310k70294
10762c17604f09A17224a4010o9245b8809A11286c0036m0746p0280B1803P4018
10751I5821J08896A4827h1099l25880i2909A15301R7104o3965B5621P7575k2414
$$ plain form
10740 80782 -223829 -233578 -93770 26392 104471 -118493 60894 -59577 101100 -46991 -215473
10729 -215473 -366199 -26374 -333404 70225 45933 -248600 -258375 -318446 -344866 116528 114164
10718 114164 64273 -103549 39721 -154115 -64754 62559 165023 -104897 51691 276166
10708 276166 201282 -273166 -186540 -121905 -251650 -165796 -235383 324214 55824 -23466 -172294
10697 -172294 44663 -117704 -208399 -318253 194895 -132789 -145107 465792 249542 148590
10687 148590 58889 -53563 -62772 96043 111551 -97982 197057 -10492 96648 134265 73342
10676 73342 138259 -134801 -113241 -186455 -98443 -180042 24891 -109625 -146525 -222445 -265884
10665 -265884 -527 -85506 -311028 -88447 -96714 -256099 -21743 22839 -228866 123675 116178
$$ packed form
10740H0782b23829r749i3770B6392P8079a18493F0894e9577A01100d6991j68482
10729b15473j50726b6374l07030G0225k4292b48600r775o0071k6420A16528k364
10718A14164m9891a03549C9721a54115f4754F2559J02464a04897E1691K24475
10708B76166p4884b73166Q6626O4635j29745Q5854o9587C24214E5824b3466j48828
10697a72294D4663a17704r0695j09854A94895a32789j2318D65792k16250j00952
10687A48590E8889e3563r209I6043J5508i7982A97057a0492I6648L7617o0923
10676G3342O4917a34801K1560p3214Q8012q1599B4891a09625l6900p5920m3439
10665b65884e27q4979k25522h8447q267j59385b1743B2839b28866A23675p497
$$ plain form
10654 116178 86810 -91147 115632 23212 -46658 -149703 -6418 131964 -223522 174753 -244197
10642 -241234 -146602 56026 -271642 209149 -257179 -86288 -239927 74205 339969 -254833
10631 20742 -273367 66627 3588 143696 -152622 -282345 -111079 -45651 -52059 -14458 -278758
10620 -278758 -159247 -398817 -46635 57296 -68341 -141444 184927 -133532 177836 -194308
10609 -158632 164456 35606 -119623 -133814 -246925 -396856 -356987 444667 4926 -4830 76291
10597 -75544 127813 -108622 -68280 -211357 -79865 187435 208940 -226778 23947 -305722
10586 97091 51514 158233 -91288 -229439 75782 -3682 153925 -66309 5511 196619 -426705
10574 132944 -149151 -180392 348727 -289173 251167 -149513 -81776 -24658 220938 52721
$$ packed form
10654A16178k9368i1147A15632B3212d6658j03045f418A31964b23522A74753b44197
10642b41234R4632E6026b71642B09149b57179h6288j53639G4205K65764b54833
10631B0742b73367F6627C588J40108a52622j29723a11079d5651o408a4458k64300
10620b78758J19511k39570d6635E7296f8341p3103A84927a33532A77836a94308
10609a58632A64456C5606a19623j4191j13111j49931L9869D44667D926d830G6291
10597g5544A27813a08622M0342j43077g9865A87435K1505b26778B3947c05722
10586I7091m5577J06719i1288j38151G5782c682A53925f6309E511J91108d26705
10574A32944a49151l1241C48727b89173B51167a49513O7737b4658B20938E2721
$$ plain form
10563 166986 -66082 76 -225147 -10571 -123184 -189644 -147984 -176363 121872 10307 15058 -119233
10550 -122369 5428 46370 6038 -89548 48122 -52389 30905 -80586 -98181 -170468 -59049 34824
10537 -142451 21412 -284659 82268 -136721 -202001 241912 -62514 -102222 155091 142649 -295281
10525 49501 -99407 77130 -51573 171951 15159 -136171 -185142 108313 -54779 37350 -20345
10513 -207605 53789 -124668 -128668 -67554 129178 97138 -173049 82928 40963 -227327 -76700
10501 28866 20508 -171683 71495 -139726 179088 14762 -177007 93415 -106173 216510 -158099
10489 244236 60599 -386446 200009 139007 -44425 6012 -37563 189029 -123290 -18564 -116398
10478 -116398 100100 5736 -253824 -163618 -25647 68965 136062 -289332 203361 190924 450759
$$ packed form
10563A66986f6082G6b25147a0571j12613o6460M1660k8379A21872A0307M751a19233
10550a22369E428M0942F038h9548D8122e2389C0905h0586j7595p2287e9049C4824
10537a42451B1412b84659H2268a36721o5280B41912f2514l9708A55091j2442b95281
10525D9501i9407G7130e1573A71951A5159a36171m8971A08313e4779C7350b0345
10513b07605E3789a24668m000O1114A29178l2040a73049H2928D0963b27327g6700
10501B8866q358a71683G1495a39726A79088A4762a77007I3415a06173B16510a58099
10489B44236F0599c86446B00009o1002d4425F012c7563A89029a23290a8564r7834
10478a16398A00100E736b53824R0206b5647F8965O7097b89332B03361j2437K59835
$$ plain form
10467 450759 39167 295163 143243 153320 222701 255758 371195 392888 -38071 -100348 139198
10455 185864 43783 -103799 275950 455976 30924 120099 -371834 262781 -79223 27615
10444 156698 -257522 171940 -216930 61102 -260177 -27262 -37510 -381753 -262766 291059
10433 98591 140735 306948 40904 -166137 166766 -79331 226283 89624 43480 226099 -358843
10421 144466 -30520 -99355 -164012 -54450 134027 -96255 -262211 138997 -183446 -108969 -330011
10410 -330011 -60763 -13522 -344219 88967 273752 194003 411234 -215885 87426 180223 -140066
10398 -262058 132353 -422784 107875 -52984 185122 -153865 46058 -54635 -54133 73039 -173956
10386 137537 -21793 57357 10051 -152096 6800 18075 124412 102923 69296 253699 243420
$$ packed form
10467D50759C9167K55996A43243J0077O9381L3057J15437K1693c8071o2277A39198
10455A85864D3783a03799B75950J80026C0924Q9175c71834B62781g9223B7615
10444A56698b57522A71940b16930F1102b60177b7262j0248l44243J18987B91059
10433I8591M2144J66213D0904a66137A66766g9331B26283H9624D3480J82619c58843
10421A44466c0520o8835o4657e4450A34027i6255j65956A38997a83446P4477k21042
10410c30011f0763a3522l30697H8967J84785p9749K17231b15885H7426R2797a40066
10398b62058A32353d22784A07875e2984A85122a53865D6058e4635N02G3039a73956
10386A37537b1793E7357A0051a52096F800J1275J06337k1489l3627J84403j0279
$$ plain form
10375 243420 251040 63879 -34182 -137890 159910 201905 138923 254997 -75958 -152149 -165859
10364 -165859 -293643 31568 45780 280477 159490 137570 225534 -127543 225445 372081
10354 372081 567842 187406 350522 375461 164113 207174 -4586 339654 148885 172633
10344 172633 561180 246136 -13010 442747 312521 402798 495926 507561 454178 186412
10333 267297 154856 386426 323778 301071 572240 240875 103851 436696 -154944 81619
10322 186599 400248 196299 -43115 140148 -142899 -156350 342342 316349 147567 97086
10312 97086 -41187 71982 103230 226960 202849 284450 25008 73633 -20577 -65074 220788
10300 80182 -152562 76793 -375142 157510 410344 187069 216689 97926 291351 101344
$$ packed form
10375B43420P620F3879c4182j03708A59910M1995o2982J16074g5958p6191j3710
10364a65859j27784C1568J4212K34697j20987k1920Q7964a27543B25445J46636
10354C72081J95761A87406J63116K4939A64113M3061d586C39654A48885K3748
10344A72633L88547B46136a3010D42747j30226R0277R3128J1635n3383A86412
10333B67297j12441K31570o2648k2707K71169B40875A03851L32845a54944H1619
10322A86599K13649A96299d3115A40148a42899j3451C42342k5993A47567n0481
10312I7086d1187G1982L1248J23730k4111Q1601B5008M8625b0577m4497B20788
10300H0182a52562G6793c75142A57510K52834A87069K9620I7926J93425A01344
$$ plain form
10289 -123422 196116 -270749 302770 363131 -59342 46006 126271 29718 -123408 149341
10278 68182 162439 58425 -204161 -195335 -26472 -86131 -59331 41174 -138833 72863 -32597
10266 -244276 -119487 -144747 199715 -101924 83851 -108022 24962 28173 -204305 -234519 91770
10254 -297164 -9674 370388 64034 -41282 116927 71622 345580 33060 409362 10676 113918
10243 113918 161865 16499 -24285 18687 -96739 163890 162693 -124942 19717 -175423 -217111
10232 -217111 172124 -182178 -234699 277647 -23508 35633 -257737 458564 -245527 29011
10221 -187177 119744 -91971 -219044 176557 74302 -129685 270963 23016 -393733 -78421
10210 -71926 87018 -160568 -194485 117433 6044 -267112 62695 296099 21131 254947 -259525
$$ packed form
10289a23422A96116b70749C02770O0361e9342D6006Q0265B9718a23408A49341
10278F8182R4257E8425b04161Q826b6472n9659K6800D1174a38833G2863c2597
10266b44276a19487k5260A99715a01924H3851a08022B4962L211b04305l0214I1770
10254b97164i674C70388F4034d1282A16927m5305K73958C3060L76302A0676J03242
10243A13918M7947A6499b4285A8687i6739A63890j197a24942A9717a75423m1688
10232b17111A72124a82178n2521B77647b3508C5633b57737D58564b45527B9011
10221a87177A19744i1971j27073A76557G4302a29685B70963B3016c93733g8421
10210g1926H7018a60568l3917A17433F044b67112F2695K33404B1131K33816b59525
$$ plain form
10198 -132775 76313 -44944 -237440 -56382 148672 -171837 -34727 -418040 -79214 -139090 -52823
10186 -165511 125211 575207 -91315 -228436 202597 -24086 -1104 -379450 60017 -208870
10175 -465853 -8286 333235 31566 -513962 268390 -115552 45585 57018 -119016 -177898 -75554
10163 -258404 9640 -295487 -280199 369156 53107 -111070 46420 3266 -208615 -290283 -14724
10151 -481200 42959 158159 -364447 -13690 -182682 50778 -12699 -140535 -132427 66393 -189199
10139 -69273 -43964 -190469 -64474 -253416 291431 -14154 -114673 -132816 -170400 -339227 -358752
10128 -358752 -314324 -44007 347963 -14660 -65744 -276644 -24849 -53853 -183557 11958 26754
10117 26754 59215 -138605 270217 110739 -302502 -243113 -170901 130716 -57907 -2146 36186
$$ packed form
10198a32775G6313d4944j92496e6382A48672a71837c4727l83313g9214n9876e2823
10186a65511A25211M49996i1315j37121B02597b4086a104l78346F0017b08870
10175d65853h286C33235C1566e13962B68390a15552D5585J1433a19016n8882g5554
10163b58404I640b95487J5288C69156E3107a11070D6420C266b08615q1668a4724
10151d81200D2959J15200c64447a3690j68992E0778a2699j27836Q108F6393a89199
10139f9273K5309j46505f4474j88942B91431a4154j00519j8143l7584j68827j9525
10128c58752M4428d4007C47963a4660n1084k10900b4849k9004j29704A1958J4796
10117B6754L2461a38605B70217A10739c02502N9389P2212A30716e7907b146C6186
$$ plain form
10105 75171 -24660 -135692 67450 -9178 135191 -4664 -65685 52163 63586 -178245 -283606
10094 -283606 -77220 -278288 13332 -357213 -102166 22405 -201295 84380 198739 -308280
10083 108803 -158862 28509 -135485 -163847 101652 -212368 -203179 -215679 260854 54085 214427
10072 214427 -552639 270336 -308519 -400738 -30113 179422 -133863 -55233 111471 14047
10061 -40694 130793 -223403 -273995 -79499 472536 -241622 232059 -510390 -317277 -63907
10050 -222552 -33790 110226 -136170 91675 -92046 63461 -59158 -257570 -123744 -191588 50646
10038 -83949 74396 13834 10197 49051 77689 -37837 215532 -181248 -203917 -80607 -21305
10026 -325665 322802 -6741 213676 -296464 -122737 -259175 286981 -103937 -230260 259490
$$ packed form
10105G5171b4660j11032F7450i178A35191d664o1021E2163J1423a78245j05361
10094b83606g7220k01068A3332c57213a02166B2405b01295H4380J14359c08280
10083A08803a58862B8509a35485k8362A01652b12368R189j2500B60854E4085J60342
10072B14427e52639B70336c08519r2219c0113A79422a33863e5233A11471A4047
10061d0694A30793b23403n0592g9499D72536b41622B32059e10390J93113f3907
10050b22552c3790A10226a36170I1675i2046F3461e9158j98412a23744o7844E0646
10038h3949G4396A3834l637L8854K8638c7837B15532a81248k2669h0607b1305
10026c25665C22802f741B13676b96464a22737j36438B86981a03937j26323B59490
$$ plain form
10015 -238986 102890 133044 -45952 122460 33680 -228053 13861 -151828 -279024 -133916
10004 -133695 -62546 -360260 37280 178339 76567 -191049 -203690 -137021 -89268 -199968 -109087
9993 -109087 -96771 34205 -77592 46250 -469252 -465398 93682 -215573 -256857 -16553 -70773
9982 -70773 -252654 -75408 -191177 -332581 21638 48435 66801 -215848 -112252 181131 -29409
9970 261866 26757 141005 84703 -157872 -155240 -46013 73171 -148747 58979 129364 18731
9958 -120967 -253397 -105472 208048 4170 216308 -42051 -125321 -225721 33370 35340 69088
9947 69088 -25557 -172302 -103671 -58794 -238595 -46476 -7540 -305315 -309763 82132 -72036 -319184
9935 -319184 69684 -86152 -317223 67795 10856 -223292 -149407 43880 -236561 33046 -326631
$$ packed form
10015b38986A02890L0154d5952A22460C3680b28053A3861a51828j27196a33916
10004a33695f2546k97714C7280J41059G6567a91049j2641O6669M7753j10700R0881
9993a09087J2316C4205g7592D6250d69252L854I3682b15573m1284a6553n4220
9982g0773j81881g5408j15769j41404B1638K6797J8366b15848J03596A81131b9409
9970B61866B6757J14248n6302a57872K632d6013G3171a48747E8979P0385A8731
9958a20967j32430a05472B08048D170K12138d2051q3270j00400C3370J970L3748
9947F9088b5557j46745O8631M4877j79801d6476g540k97775m448H2132g2036k47148
9935c19184F9684h6152k31071F7795A0856b23292P3885D3880b36561C3046c26631
$$ plain form
9923 -2666 92089 -76032 331114 -148569 -132177 121172 -326785 89848 -352801 -187969 -152981
9912 -152981 2609 -264884 -175238 263839 -157574 -76809 -241723 91303 -95562 -215514 -137636
9901 -137636 -226194 109278 -80506 164736 -138089 -269544 -8293 -213961 239278 197835 -347401
9889 -231951 -203824 -148639 78340 -135215 -146366 179421 159838 -90685 249472 113123 183264
9878 183264 218102 -182306 -12646 312313 -174525 123792 98969 -115085 -433355 -46337
9867 -58558 -148520 -158893 19415 -29209 -126404 -24337 -16793 -572079 -294289 -266105 -183177 -125297
9855 -125297 19128 255624 14620 -70350 -198315 49852 -180453 149214 -362155 362109
9844 -80450 -339242 65753 -303663 -67977 150480 -59370 -87808 -193116 -5780 -71390 2558
$$ packed form
9923b666I2089g6032C31114a48569J6392A21172c26785H9848c52801J64832L4988
9912a52981B609b64884Q9646B63839a57574g6809j64914I1303i5562j19952P7878
9901a37636q8558A09278h0506A64736a38089j31455h293k05668B39278m1443c47401
9889b31951K8127N5185G8340a35215j1151A79421j9583i0685B49472A13123P0141
9878A83264L4838a82306a2646C12313a74525A23792k4823a15085l18270d6337
9867e8558q9962j0373A9415b9209r7195b4337P544n55286K77790K8184Q2928N7880
9855a25297A9128K36496A4620g0350j27965D9852a80453A49214c62155C62109
9844h0450k58792F5753c03663f7977A50480e9370k8438j05308e780o5610B558
$$ plain form
9832 390368 409556 -82269 -40050 263600 238004 -115413 -205770 63558 -154234 44301 28637
9821 28637 -48881 -290457 -255868 87546 -373036 -108 -26799 -75650 104263 6583 29153 164180
9809 164180 -186026 -335589 -264594 18049 -27999 -231802 -97651 -111369 32656 -255817 -154295
9798 -154295 -167399 -74671 62429 48946 -354845 -139671 -38520 -93389 -239821 129985 -91376
9786 20066 -319740 85553 -62259 12599 110440 115464 3708 87953 217078 42419 105480 7421
9773 143836 -394845 -176493 -33671 -14382 358757 224282 -24126 69561 220766 -141303
9762 -12843 -172300 136849 10324 26235 -43456 -122026 -53487 126217 205200 -154953 -104091
9751 -104091 -108866 160049 -362018 -78995 169293 160232 75893 56311 -164018 -53123 -175398
$$ packed form
9832C90368J9188h2269d0050B63600k5596a15413r0357F3558a54234D4301j5664
9821B8637d8881k41576L4589H7546c73036a08k6691m8851A04263F583K2570J35027
9809A64180a86026j49563P0995A8049b7999k03803i7651j3718C2656b55817J01522
9798a54295j3104g4671F2429j3483c54845a39671c8520n4869j46432A29985i1376
9786B0066c19740H5553f2259A2599R7841N024C708Q4245J29125D2419O3061G421
9773A43836c94845a76493c3671a4382C58757j34475b4126F9561J51205a41303
9762a2843j59457A36849A0324J5911d3456p8570e3487A26217P8983a54953N0862
9751a04091m775A60049c62018g8995A69293r061G5893j9582a64018e3123j22275
$$ plain form
9740 -175398 -380517 -119079 -70214 79213 215512 -78713 -201824 -137191 -219433 -168612 187272
9728 53575 -65909 100782 -362432 -131013 393070 159549 -49985 -220937 -193497 -245844 -263291
9717 -263291 -55696 -125735 15559 -187437 144813 8949 -203844 11538 -230896 117327 -13109
9705 -89101 -43226 -106917 84677 -185265 181335 38687 -46916 -215852 13976 61010 122124
9694 122124 -344665 -274784 10836 70712 18565 -158309 -130387 288213 -230759 -125619 18517
9682 357902 199183 -261492 31035 -199578 -62228 -193737 -186458 -108570 45194 79149 -183338
9670 99988 186639 281128 -468626 152079 -267734 -237571 -158314 -41978 -120901 -173900 -145603
9659 -145603 180993 44159 -166651 108564 -39181 -112829 -387280 -157268 265692 131698
$$ packed form
9740a75398k05119a19079M8865G9213J36299g8713j23111O4633q2242N0821A87272
9728E3575f5909A00782c62432a31013C93070A59549d9985j70952K7440n2347j7447
9717b63291e5696p0039A5559a87437A44813H949b03844A1538b30896A17327a3109
9705h9101d3226o3691H4677a85265A81335C8687d6916j68936A3976M7034O1114
9694A22124c44665O9881A0836N9876A8565a58309K7922B88213b30759J05140A8517
9682C57902j58719b61492C1035a99578f2228j31509P279P7888D5194L3955a83338
9670I9988Q6651R4489d68626A52079b67734L0163P9257d1978p8923n2999K8297
9659a45603A80993D4159a66651A08564c9181p3648k74451a57268B65692A31698
$$ plain form
9648 -93630 -257329 -49940 92901 208211 102432 96454 -66134 -177101 124951 36214 -69865
9636 55832 142102 -209188 -114971 -47554 8059 -127988 -48372 45459 -176892 120258 4885
9624 380225 -208960 128311 -152744 -308793 -75859 147827 24603 -74585 -145411 34903 -195052
9612 -233090 -326523 -283302 -105962 31224 147351 -122732 -120854 -77412 43547 197717 161402
9601 161402 -226181 -181404 -266177 -60234 21490 96683 282456 -16838 -119443 -305619 116563
9589 62781 -72212 -329580 267633 -150545 -94253 86341 -4762 92939 -110868 51823 164076
9578 164076 27738 -176231 -255676 -120254 77340 -78708 88309 -140205 80463 -148981 -136383
9567 -136383 -332365 297176 -239867 -346712 -84718 -72121 -363076 204425 57669 -364158
$$ packed form
9648i3630j63699d9940I2901J15310A02432n978f6134j10967A24951C6214f9865
9636E5832Q6270b09188R4217d7554H059a27988d8372D5459a76892A20258D885
9624C80225b08960A28311a52744j56049g5859A47827B4603g4585p0826C4903a95052
9612b33090r3433M3221a05962C1224J16127a22732J878M3442D3547J54170l6315
9601A61402b26181M4777q4773f0234B1490P5193J85773a6838j02605j86176A16563
9589F2781g2212k57368B67633a50545N6292H6341d762I2939a10868E1823J12253
9578A64076B7738a76231p9445a20254G7340g8708H8309a40205H0463a48981J2598
9567a36383j95982B97176b39867j06845h4718J2597k90955B04425E7669c64158
$$ plain form
9556 -122499 -126135 -249635 -218143 -102167 -52962 -198355 72538 305 173367 138767 235482
9545 235482 -184623 -361622 -199198 -78046 74776 -387807 -253448 -6605 54618 42018 -25899
9533 -89605 -75087 -81809 -271496 -356685 -183877 -6145 95008 114685 82946 152269 74837 -241299
9520 48708 -20627 189968 -140615 -114319 -67952 -204226 61275 -192352 241468 -87091 -324312
9509 -324312 -279037 -125255 63567 70890 177720 -111991 -182808 -2548 59258 -93630 -6248 106269
9496 135173 121821 -340816 152878 -293001 -450988 -231580 -253888 70672 -206317 -10853
9485 -348657 -380189 93839 131445 74957 -11252 81498 112643 -165042 61917 -62926 -140534
9474 -140534 -15381 -147134 381389 35059 417153 88464 -82235 -247325 -5607 88143 -190324
$$ packed form
9556a22499l636j23500L1492a02167M9205j45393G2538C05J73062l4600R6715
9545B35482a84623j76999J62424g8046G4776c87807J34359f605E4618j2600b5899
9533h9605J4518o722j89687q5189J72808f145I5008J9677l1739O9323G4837b41299
9520D8708b0627A89968a40615K6296M6367j36274F1275a92352B41468h7091k37221
9509c24312M5275a25255F3567P323J06830a11991p0817b548E9258i3630f248A06269
9496A35173j3352c40816A52878b93001j57987K19408k2308G0672b06317a0853
9485c48657l1532I3839L7606n6488a1252H1498L1145a65042F1917f2926p7608
9474a40534a5381j31753C81389C5059L82094H8464h2235j65090e607H8143a90324
$$ plain form
9462 -340641 -268638 -52256 -33518 41082 -417025 -241012 -295097 -248539 -61540 -248215 -158045
9451 -158045 87264 -169900 113602 -120516 345213 221460 -331859 -78637 -220917 -193821
9441 -193821 -197508 -170719 119995 346418 -66834 -37842 -424394 131356 124739 43458 -144079
9429 94549 130678 -140895 188616 -467540 -278925 -217848 173748 184139 -97803 -240570 70650
9417 -130097 -64240 -28324 -238844 -421476 -95944 -95451 220555 161662 -72028 -67285 -156887 -244330
9405 -244330 53602 -115898 233985 -45921 -79411 -67583 -70857 80217 96344 -17824 112599
9393 -22676 -30005 194421 -58239 -148936 185247 -131611 -35160 -114678 108995 10965 -37521
9381 -3787 209491 -98562 -159376 5338 -322911 205652 -19156 142826 -257161 -82680 -10327
$$ packed form
9462c40641P2003e2256J8738D1082d17025J76013n4085M6558f1540j86675R0170
9451a58045H7264a69900A13602a20516C45213j23753c31859g8637j42280K7096
9441a93821l687K6789A19995K26423f6834K8992l86552A31356o617D3458a44079
9429I4549L6129a40895A88616d67540J88615O1077A73748J0391i7803j42767G0650
9417a30097f4240b8324k10520j82632i5944M93B20555n8893g2028M743q9602q7443
9405b44330E3602a15898B33985d5921l3490J1828l274H0217J6127a7824A12599
9393b2676p329A94421e8239r0697A85247a31611c5160p9518A08995A0965c7521
9381c787B09491i8562o0814E338c22911B05652a9156A42826b57161h2680a0327
$$ plain form
9369 -11292 -382664 11157 6340 177778 -267678 -191964 -192250 -114927 1251 -6764 54824 -6133
9356 65118 79766 47795 46675 152739 -91342 -115850 8092 146177 177064 -151330 -124637 190117
9343 -264999 -42637 91554 96757 -136158 -157342 -94183 -45799 -207954 58186 191943 66428
9331 -174665 39013 -14089 -165254 -603977 -43555 -140370 60413 -107955 -31223 257440 -75627
9319 -134426 229559 255680 -61169 -77017 -137268 -110059 107440 -409683 -22810 -202105 198096
9307 -198246 -298657 -218345 -129848 123923 -255849 145084 -377747 -204867 124025 -111549
9296 144884 -388947 -54172 -154675 44319 -312644 265040 108514 240693 -227625 -131681
9286 -131681 -201117 -112218 49674 -240329 -198334 285924 116516 103323 -241363 -160695 235035
$$ packed form
9369a1292l71372A1157m817J71438b67678P5714k86P7323A251f764E4824f133
9356F5118J4648l1971j120J06064i1342k4508H092J38085L0887a51330K6693A90117
9343b64999d2637I1554N203a36158k1184O3159d5799j62155E8186J33757F6428
9331a74665C9013a4089j51165m38723d3555r6815F0413a07955c1223B57440g5627
9319a34426B29559K6121f1169j5848o0251K7209A07440d09683b2810j79295A98096
9307a98246j00411Q0312Q8497A23923b55849A45084c77747J72880A24025a11549
9296A44884c88947e4172j00503D4319c12644B65040A08514J32179b27625R5944
9286a31681o9436Q8899D9674b40329M1995B85924A16516j3193b41363Q0668B35035
$$ plain form
9274 102810 -31113 118795 -223542 -263867 37270 -188980 -32638 34699 33564 -358626 23765
9262 -182070 -29072 35062 -94372 -205513 62830 375704 -83950 -48308 -174099 -126844 -337685
9251 -337685 169071 103990 -34555 -130662 151788 -89437 -3226 -316484 -238542 -369611 -253236
9240 -253236 240131 7069 -120692 195928 91182 -100992 -50541 -75715 -185000 -310607 92836
9228 -90061 -47876 -108928 -237274 -263175 -277653 55087 -204894 -36693 -64909 45482 -235467
9216 -139070 -159285 -164016 -108044 380725 5531 -127710 24431 -70470 -140103 -215778 -130377 134086
9203 -64689 -29919 -57111 -455549 78876 -165861 -215445 348872 -67775 152519 -224305 -144425
9192 -144425 -89019 -40993 -300442 -327110 -128655 296358 42602 113746 -157 -14540 65910
$$ packed form
9274A02810c1113A18795b23542m0325C7270a88980c2638C4699j135c58626B3765
9262a82070b9072C5062i4372j11141F2830L12874h3950L5642j25791M7255k10841
9251c37685A69071o5081c4555r6107A51788h9437c226l13258P7942j31069J16375
9240b53236B40131G069a20692A95928I1182a00992N0451k5174j09285j25607I2836
9228i0061M2185o1052j28346k5901j4478E5087b04894c6693k8216D5482b35467
9216a39070k0215m731N5972C80725E531a27710B4431g0470o9633p5675Q5401A34086
9203f4689b9919k7192l98438G8876a65861m9584C48872f7775A52519b24305P9880
9192a44425N5406d0993k59449k6668a28655B96358D2602P1144a57j4383F5910
$$ plain form
9180 -122474 -112464 -52914 -280675 37054 251805 -173468 -281202 26812 -73474 270390 -326121
9168 -46876 36728 -213883 75398 -455119 -107275 87190 -106711 303413 -48696 -54457 -117331
9157 -117331 83798 121048 185702 -145190 -49491 195997 68787 -387023 -42185 54083 -16328
9145 -15885 2830 87757 170704 44487 -118338 -140624 -394747 398716 26356 -274162 -19743
9133 143905 -91760 -57457 14087 -29593 -268732 -203190 96145 -13348 356985 155400 -102494
9121 -104696 22759 158695 51067 163583 6884 -15655 79152 -32444 -10684 -148943 50832
9109 -131246 -281531 128889 61761 -202813 -158804 -75016 -202857 302502 -111926 -54768
9098 96085 -185648 -118434 135179 -45594 -81804 15230 -235046 -63263 -103290 -50195 -77304
$$ packed form
9180a22474J0010e2914k27761C7054K14751a73468j07734B6812g3474B70390c26121
9168d6876C6728b13883G5398d55119a07275H7190a06711C03413d8696n761o2874
9157a17331H3798L7250O4654a45190d9491A95997F8787c87023d2185E4083a6328
9145a5885B830Q4927Q2947D4487a18338k2286k54123C98716B6356b74162a9743
9133A43905i1760L4303A4087b9593k39139O5542I6145a3348C56985A55400a02494
9121a04696B2759J35936E1067J12516F884a5655G9152c2444a0684j38259E0832
9109a31246j50285A28889F1761b02813M4009g5016j27841C02502a11926e4768
9098I6085a85648O7214A35179d5594l6210A5230b35046f3263m0027e0195k7109
$$ plain form
9087 -77304 -270327 -22826 -351103 -6516 -209217 -123146 -129583 44642 -15451 -121135 104131
9075 -76245 -7493 -221534 -166250 -11235 147882 47663 -131673 192517 62895 -418933 53019
9063 350443 -111303 30412 -159380 -288772 -173067 52258 -14356 -3982 36678 -89495 116951
9051 47232 185614 -40683 -124849 58914 -91625 185853 -124077 154651 -358996 -119605 -13500
9039 -75085 157258 -141094 37316 141038 104129 122491 -101018 -90292 -78695 227541 167654
9028 167654 -121107 -16101 38263 -40804 125346 275452 -277368 26965 -62940 -52310 209664
9016 146427 317439 151913 100152 -290895 -73121 57256 -114626 -58069 28148 -162969 -158022
9005 -158022 -106400 146033 -163701 -52795 -487005 -173342 -217358 -310894 -121600 -196603 248242
$$ packed form
9087g7304j93023b2826l28277f516k02701Q6071o437D4642a5451j05684A04131
9075g6245g493k14041N5284a1235A47882D7663a31673A92517F2895d18933E3019
9063C50443a11303C0412a59380j29392J15705E2258a4356c982C6678h9495A16951
9051D7232J38382d0683q4166E8914i1625A85853a24077A54651c58996a19605a3500
9039g5085A57258a41094C7316J03722l6909J8362a01018J0726J1597B27541n9887
9028A67654a21107a6101C8263d0804A25346J50106b77368B6965f2940J0630B09664
9016A46427J71012A51913n1761b90895g3121E7256a14626N6557B8148a62969M947
9005a58022N1622A46033a63701e2795m34210a73342m4016r3536a21600p5003B48242
$$ plain form
8993 65591 -224753 2760 -29278 272156 -390802 157153 185093 -92485 -108962 -340252 -12664
8981 99423 -51692 -18970 -158766 63400 -265578 102258 -248630 -100925 58732 -68034 -302793
8970 -302793 -8229 164161 125397 -121270 -86509 -50198 -5315 -17563 -77221 -172343 -5907 -234759
8958 -234759 -18094 -13410 -254864 114441 -51544 -43776 -151961 212987 -198047 -62391 -433124
8947 -433124 -121619 -396508 21317 -72934 -268853 -312585 81007 -116412 287048 -126677
8936 232899 15431 -353453 -18973 11576 -212500 465220 -207347 -57023 -24074 -65592 -219494
8925 -219494 -28320 478286 97282 9629 -223832 48950 63422 53091 -60892 -60892 192797 -17072
8912 415522 497314 338245 932235 730266 2149777 4083919 8484056 7819433 3992732
$$ packed form
8993F5591b24753B760b9278B72156c90802A57153K7940i2485j6477k31290a2664
8981I9423e1692a8970j39796F3400b65578A02258b48630a00925E8732f8034k34759
8970c02793h229A64161l8764a21270L4761L6311e315j2248n9658r5122e907k28852
8958b34759a8094M684k41454A14441e1544P768j08185B12987a98047f2391l70733
8947d33124a21619k74889B1317g2934j95919m3732H1007a16412B87048a26677
8936B32899A5431c53453a8973A1576b12500D65220b07347e7023b4074m1518j53902
8925b19494b8320D78286I7282I629b23832D8950J4472j0331f0892%A92797a7072
8912D15522Q1792j59069N93990k01969J419511J934142M400137o64623l826701
$$ plain form
8903 3992732 2136958 1233328 1040856 656364 383466 325278 396469 36982 19789 308434
8893 308434 349826 408487 78008 -217405 -69999 126213 -38350 130976 -314891 75446 172340
8882 172340 -244528 49473 -23342 208057 -120262 189031 -130915 -1444 180126 -186437
8871 -482527 17830 96244 34859 240842 177743 -89274 343573 -13367 208236 -222234 -53965
8859 -155323 -23632 -248660 -75723 15910 83877 -329827 -318022 -88291 -158079 191880 110657
$$ packed form
8903C992732j855774r03630j92472l84492k72898n8188P1191C6982j7193K88645
8893C08434M1392N8661G8008b17405f9999A26213c8350A30976c14891G5446R6894
8882A72340b44528D9473b3342B08057a20262A89031a30915a444A80126a86437
8871d82527A7830P8414C4859K05983o3099h9274C43573a3367B08236b22234e3965
8859a55323b3632k25028g5723A5910O7967c29827J1805h8291o9788A91880q1223
$$ [...]
##END NTUPLES=NMR SPECTRUM
##END=
