
##TITLE=AC1222_Punto_6074794_1Xs9jaGfa0
##JCAMPDX= 6.0         $$ Bruker NMR JCAMP-DX V2.0
##DATA TYPE= NMR SPECTRUM
##DATA CLASS= NTUPLES
##ORIGIN= BRUKER
##OWNER= Administrator
$$ 1.72 TOPSPIN		Version 2.1
$$ 2012-05-08 20:26:10.140 -0500  Administrator@TOPSPIN
$$ Compression mode = diff/dup
##.OBSERVE FREQUENCY= 400.13188235
##.OBSERVE NUCLEUS= ^1H
##.ACQUISITION MODE= SIMULTANEOUS (DQD)
##.ACQUISITION SCHEME= undefined
##.AVERAGES= 64
##.DIGITISER RES= 22
##SPECTROMETER/DATA SYSTEM= spect
##.PULSE SEQUENCE= noesygpps1d.comp
##.SOLVENT NAME= COFFEE_meoh
##.SHIFT REFERENCE= INTERNAL, COFFEE_meoh, 1, 14.96676
##AUDIT TRAIL= $$ (NUMBER, WHEN, WHO, WHERE, PROCESS, VERSION, WHAT)
$$ ##TITLE= Audit trail, TOPSPIN		Version 2.1
$$ ##JCAMPDX= 5.01
$$ ##ORIGIN= Bruker BioSpin GmbH
$$ ##OWNER= Administrator
$$ $$ C:\Bruker\TOPSPIN/data/COFFEE/nmr/AC1222_Punto_6074794_1Xs9jaGfa0/62/pdata/1/auditp.txt
$$ ##AUDIT TRAIL=  $$ (NUMBER, WHEN, WHO, WHERE, PROCESS, VERSION, WHAT)
(   1,<2012-05-08 20:26:05.234 -0500>,<Administrator>,<TOPSPIN>,<go>,<TOPSPIN 2.1>,
      <created by zg
	started at 2012-05-08 20:14:35.046 -0500,
	POWCHK enabled, PULCHK disabled,
       configuration hash MD5:
       AF F2 23 6B 01 CD 40 DD E5 A1 38 A0 06 EA F7 77
       data hash MD5: 64K
       DF 7B C7 17 4C 4B 12 DD A7 01 21 61 85 53 C8 AC>)
(   2,<2012-05-08 20:26:08.093 -0500>,<Administrator>,<TOPSPIN>,<proc1d>,<TOPSPIN 2.1>,
      <Start of raw data processing
       efp LB = 0.3 FT_mod = 6 PKNL = 1 PHC0 = 0 PHC1 = 0 SI = 128K 
       data hash MD5: 128K
       7A 4C C7 A5 6F E6 30 85 CD 56 F7 0E A6 5B 44 E8>)
(   3,<2012-05-08 20:26:09.328 -0500>,<Administrator>,<TOPSPIN>,<proc1d>,<TOPSPIN 2.1>,
      <pk PHC0 = 33.55774 PHC1 = 0 
       data hash MD5: 128K
       4B 8C CB 09 1F 92 9B 95 A2 90 F6 7B 7C D0 9F B8>)
(   4,<2012-05-08 20:26:09.812 -0500>,<Administrator>,<TOPSPIN>,<proc1d>,<TOPSPIN 2.1>,
      <abs ABSG = 1 
       data hash MD5: 128K
       57 28 C8 85 23 8A EF D1 D1 F0 FE 3E 70 28 E5 0B>)
(   5,<2012-05-08 20:26:09.890 -0500>,<Administrator>,<TOPSPIN>,<proc1d>,<TOPSPIN 2.1>,
      <abs ABSG = 2 
       data hash MD5: 128K
       B7 75 B4 81 F1 EE CF 68 A3 B5 CE D8 36 6A E1 9F>)
(   6,<2012-05-08 20:26:09.937 -0500>,<Administrator>,<TOPSPIN>,<proc1d>,<TOPSPIN 2.1>,
      <abs ABSG = 3 
       data hash MD5: 128K
       05 CC 45 75 CF D4 D1 B5 68 94 8F 55 A1 13 4B D5>)
(   7,<2012-05-08 20:26:10.000 -0500>,<Administrator>,<TOPSPIN>,<proc1d>,<TOPSPIN 2.1>,
      <abs ABSG = 4 
       data hash MD5: 128K
       F3 61 B8 A8 41 C8 84 3F 9C D2 A7 42 99 1A 78 DB>)
(   8,<2012-05-08 20:26:10.046 -0500>,<Administrator>,<TOPSPIN>,<proc1d>,<TOPSPIN 2.1>,
      <abs ABSG = 5 
       data hash MD5: 128K
       4E F2 51 87 53 33 E8 1C B1 D6 ED D5 BB A0 C5 E3>)
$$ ##END=
$$ 
$$ $$ hash MD5
$$ $$ 6C 0C 3F 0B FC 6E 91 81 BC EF D1 4E 49 2D 81 FF
##$RELAX= 
##$RELAX= 
##$RELAX= 
##$RELAX= 
##$RELAX= 
##$RELAX= 
##$RELAX= 
##$RELAX= 
$$ Bruker specific parameters
$$ [...]
##$TP07= 0
##$TPNAME0= <>
##$TPNAME1= <>
##$TPNAME2= <>
##$TPNAME3= <>
##$TPNAME4= <>
##$TPNAME5= <>
##$TPNAME6= <>
##$TPNAME7= <>
##$TPOAL= (0..7)
0.5 0.5 0.5 0.5 0.5 0.5 0.5 0.5
##$TPOFFS= (0..7)
0 0 0 0 0 0 0 0
##$TUNHIN= 0
##$TUNHOUT= 0
##$TUNXOUT= 0
##$USERA1= <user>
##$USERA2= <user>
##$USERA3= <user>
##$USERA4= <user>
##$USERA5= <user>
##$V9= 5
##$VALIST= <valist>
##$VCLIST= <CCCCCCCCCCCCCCC>
##$VD= 0
##$VDLIST= <DDDDDDDDDDDDDDD>
##$VPLIST= <PPPPPPPPPPPPPPP>
##$VTLIST= <TTTTTTTTTTTTTTT>
##$WBST= 1024
##$WBSW= 4
##$XGAIN= (0..3)
0 0 0 0
##$XL= 0
##$YL= 0
##$YMAX_a= 11052529
##$YMIN_a= -5923921
##$ZGOPTNS= <>
##$ZL1= 120
##$ZL2= 120
##$ZL3= 120
##$ZL4= 120
##$ABSF1= 14.96676
##$ABSF2= -5.585771
##$ABSG= 5
##$ABSL= 3
##$ALPHA= 0
##$AQORDER= 0
##$ASSFAC= 0
##$ASSFACI= 0
##$ASSFACX= 0
##$ASSWID= 0
##$AUNMP= <proc_prof1d_extract.lims>
##$AXLEFT= 0
##$AXNAME= <>
##$AXNUC= <1H>
##$AXRIGHT= 0
##$AXTYPE= 0
##$AXUNIT= <>
##$AZFE= 0.1
##$AZFW= 0.1
##$BCFW= 0
##$BC_mod= 0
##$BYTORDP= 0
##$COROFFS= 0
##$CY= 15
##$DATMOD= 1
##$DC= 0
##$DFILT= <>
##$DTYPP= 0
##$F1P= 0
##$F2P= 0
##$FCOR= 0.5
##$FTSIZE= 131072
##$FT_mod= 6
##$GAMMA= 0
##$GB= 0
##$INTBC= 1
##$INTSCL= 1
##$ISEN= 128
##$LB= 0.3
##$LEV0= 0
##$LPBIN= 0
##$MAXI= 10000
##$MC2= 0
##$MEAN= 0
##$ME_mod= 0
##$MI= 0
##$NCOEF= 0
##$NC_proc= -3
##$NLEV= 6
##$NOISF1= 0
##$NOISF2= 0
##$NSP= 0
##$NTH_PI= 0
##$NZP= 0
##$OFFSET= 14.96676
##$PC= 1
##$PHC0= 33.55774
##$PHC1= 0
##$PH_mod= 1
##$PKNL= yes
##$PPARMOD= 0
##$PPDIAG= 0
##$PPIPTYP= 0
##$PPMPNUM= 2147483647
##$PPRESOL= 1
##$PSCAL= 4
##$PSIGN= 0
##$PYNMP= <proc.py>
##$REVERSE= no
##$SF= 400.13000554198
##$SI= 131072
##$SIGF1= 0
##$SIGF2= 0
##$SINO= 400
##$SIOLD= 131072
##$SPECTYP= <>
##$SREGLST= <1H.CDCl3>
##$SSB= 0
##$STSI= 131072
##$STSR= 0
##$SW_p= 8223.68421052632
##$SYMM= 0
##$S_DEV= 0
##$TDeff= 65536
##$TDoff= 0
##$TI= <>
##$TILT= no
##$TM1= 0
##$TM2= 0
##$TOPLEV= 0
##$USERP1= <user>
##$USERP2= <user>
##$USERP3= <user>
##$USERP4= <user>
##$USERP5= <user>
##$WDW= 1
##$XDIM= 131072
##$YMAX_p= 463714430
##$YMIN_p= -70287763
##$CURPLOT= <Network HP LaserJet P1505>
##$CURPRIN= <$Network HP LaserJet P1505>
##$DFORMAT= <normdp>
##$LAYOUT= <+/1D_H.xwp>
##$LFORMAT= <normlp>
##$PFORMAT= <normpl>
##$SURQMSG= 1
$$ End of Bruker specific parameters
$$ ---------------------------------
##NTUPLES= NMR SPECTRUM
##VAR_NAME=  FREQUENCY,     SPECTRUM/REAL,   SPECTRUM/IMAG
##SYMBOL=    X,             R,               I
##VAR_TYPE=  INDEPENDENT,   DEPENDENT,       DEPENDENT
##VAR_FORM=  AFFN,          ASDF,            ASDF
##VAR_DIM=   131072,        131072,          131072
##UNITS=     HZ,            ARBITRARY UNITS, ARBITRARY UNITS
##FACTOR=    0.0627417313425165, 1,          1
##FIRST=     8223.62146879498, -4869,        -102996
##LAST=      0,             -896,            -104108
##MIN=       0,             -70287763,       0
##MAX=       8223.62146879498, 463714430,    0
$$ Real data points
##PAGE= N=1
##DATA TABLE= (X++(R..R)), XYDATA
$$ [...]
63667D31329N481L572K288L521N863O764N817M644M437M922N432N714N500M273
$$ 431329 436810 440382 442670 446191 452054 458818 464635 469279 473716 478638 484070 489784 495284 499557
63653D99557K008l10j442j224p80j308k669l535l054k076k187l636m871m332k239
$$ 499557 501565 501255 499813 498589 497809 496501 493832 490297 487243 485167 482980 479344 474473 470141 467902
63638D67902j68O63L06l40l16Q85K914M581M746L480K116J965L071M330M709M163
$$ 467902 467734 468397 468703 468363 468047 468932 471846 476427 481173 484653 486769 488734 491805 496135 500844 505007
63622E05007L446L235L619M263M690M346K850N78j159j189K05J523J760J456J724
$$ 505007 508453 511688 515307 519570 524260 528606 531456 532034 530875 529686 529891 531414 533174 534630 536354
63607E36354K639L187K579J108m52j708k774l736m435m694m469l737k527j223
$$ 536354 538993 542180 544759 545867 545415 543707 540933 537197 532762 528068 523599 519862 517335 516112
63593E16112n80r19j484j088L34J491J353N09K44P81J228J148J192K026L419M702
$$ 516112 515532 514613 513129 512041 512375 513866 515219 515728 515972 516753 517981 519129 520321 522347 525766 530468
63577E30468N523N838N822O002O938Q484R908J0927J1839J2528J2350J1566J1748
$$ 530468 535991 541829 547651 553653 560591 569075 578983 589910 601749 614277 626627 638193 649941
63564F49941J3821J6554J8084J8304J8636J9974K2103K4626K7179K9087L0170
$$ 649941 663762 680316 698400 716704 735340 755314 777417 802043 829222 858309 888479
63553H88479L1724L5088L9364M2199M3059M3857M5812M7542M7212M4885M1473
$$ 888479 920203 955291 994655 1036854 1079913 1123770 1169582 1217124 1264336 1309221 1350694
63542A350694L6885L0844K4298J8206J1869M460k425o086o542o903r426j3096
$$ 1350694 1387579 1418423 1442721 1460927 1472796 1477256 1474831 1468745 1462203 1455300 1445874 1432778
63530A432778j5956j8002k0522k3768k6803k9041l0695l1895l2352l1847l0479
$$ 1432778 1416822 1398820 1378298 1354530 1327727 1298686 1267991 1236096 1203744 1171897 1141418
63519A141418k8565k6677k5429k4700k3445k0859j7454j4380j1962r495o334k549
$$ 1141418 1112853 1086176 1060747 1036047 1012602 991743 974289 959909 947947 938452 932118 929569
63507I29569J398N005P705R042R143Q904R599J2114J6126J9946K1940K2403K3393
$$ 929569 930967 935972 943677 952719 961862 970766 980365 992479 1008605 1028551 1050491 1072894 1096287
63494A096287K6161K9586L1967L3485L5636L8810M2143M5459M9530N3962N6428
$$ 1096287 1122448 1152034 1184001 1217486 1253122 1291932 1334075 1379534 1429064 1483026 1539454
63483A539454N4827M9027M0044K8909J7249P399N26m481q921j2138j2966j2388
$$ 1539454 1594281 1643308 1683352 1712261 1729510 1736909 1737435 1732954 1724033 1711895 1698929 1686541
63471A686541j2763j4852j7536k0447k4639l0337l5967m0329m3996m7528m9882
$$ 1686541 1673778 1658926 1641390 1620943 1596304 1565967 1530000 1489671 1445675 1398147 1348265
63460A348265n0001m8745m7598m6361m3851m0441l8017l7295l6785l4894l1778
$$ 1348265 1298264 1249519 1201921 1155560 1111709 1071268 1033251 995956 959171 924277 892499
63449H92499k8565k5742k3117k0635j8408j6273j4096j2343j1730j2216j2744
$$ 892499 863934 838192 815075 794440 776032 759759 745663 733320 721590 709374 696630
63438F96630j2212j0473q276o308m574k769j040m9k89j509k836l197j842R29L448
$$ 696630 684418 673945 665669 659361 654787 652018 650978 650929 650640 649131 646295 643098 641256 642185 645633
63423F45633L870K204N79R11K755M235M512M356M493M576L958K575O94j381l058
$$ 645633 649503 651707 652286 653197 655952 660187 664699 669055 673548 678124 682082 684657 685351 683970 680912
63408F80912l650l306l087l706m648m934m280l100j867q79j96N32J662K674K402
$$ 680912 677262 673956 670869 667163 662515 657581 653301 650201 648334 647455 647259 647791 649453 652127 654529
63393F54529P69m95M00L327O833J0083J3086J5489J6552J6538J6848J8329K0305
$$ 654529 655298 654803 655203 658530 665363 675446 688532 704021 720573 737111 753959 772288 792593
63380G92593K1838K3158K5229K8431L2287L6174L9668M2375M3834M3626M1462
$$ 792593 814431 837589 862818 891249 923536 959710 999378 1041753 1085587 1129213 1170675
63369A170675L7460L2537K8102K5003K2975K1485K0742K1478K3924K7634L2233
$$ 1170675 1208135 1240672 1268774 1293777 1316752 1338237 1358979 1380457 1404381 1432015 1464248
63358A464248L7644M3348M8007N0389N0525M9341M7087M2757L5445K5986J6491
$$ 1464248 1501892 1545240 1593247 1643636 1694161 1743502 1790589 1833346 1868791 1894777 1911268
63347A911268Q424J790l678p557r662j1146j3594j7259k1120k4596k8120l2084
$$ 1911268 1919692 1921482 1917804 1910247 1900585 1889439 1875845 1858586 1837466 1812870 1784750 1752666
63335A752666l6318m0840m5826n0325n2383n1469m9637m8899m8294m5186l9178
$$ 1752666 1716348 1675508 1629682 1579357 1526974 1475505 1425868 1376969 1328675 1283489 1244311
63324A244311l2868k8512k5644k2703j9547j7126j5522j3655j0710o930l006O05
$$ 1244311 1211443 1182931 1157287 1134584 1115037 1097911 1082389 1068734 1058024 1051094 1048088 1048693
63312A048693L806O832J0144J3868J7360J9795K1210K2620K5145K9191L4276L9207
$$ 1048693 1052499 1059331 1069475 1083343 1100703 1120498 1141708 1164328 1189473 1218664 1252940 1292147
63300A292147M2696M4514M5990M8654N2198N4543N4275N2237N0003M7360M2460
$$ 1292147 1334843 1379357 1425347 1474001 1526199 1580742 1635017 1687254 1737257 1784617 1827077
63289A827077L4408K4676J5565Q015J546m331r473j3636j6816j9054k0600k2392
$$ 1827077 1861485 1886161 1901726 1909741 1911287 1906956 1897483 1883847 1867031 1847977 1827377 1804985
63277A804985k5520k9898l4113l7141l9579m2551m5895m8323m9047m8319m6535
$$ 1804985 1779465 1749567 1715454 1678313 1638734 1596183 1550288 1501965 1452918 1404599 1358064
63266A358064m3803m0474l7097l3551k9188k4243k0151j7985j7392j7715j9199
$$ 1358064 1314261 1273787 1236690 1203139 1173951 1149708 1129557 1111572 1094180 1076465 1057266
63255A057266k2085k5357k7585k8574k8928k8454k6461k3500k1244k0321j9595
$$ 1057266 1035181 1009824 982239 953665 924737 896283 869822 846322 825078 804757 785162
63244G85162j8106j6355j4986j3494j1302r109p988p749p390o686o157n782n056
$$ 785162 767056 750701 735715 722221 710919 701810 693822 686073 678683 671997 665840 660058 655002
63231F55002m240m360n620o858o972o105n122m593m620m980n003l949k065o94
$$ 655002 650762 646402 640782 633924 626952 620847 615725 611132 606512 601532 596529 592580 590515 589821
63217E89821p50j510j664j156j102j931k466j367J111L320M034L612L328L943
$$ 589821 589071 587561 585897 584741 583639 581708 579242 577875 578986 582306 586340 589952 593280 597223
63203E97223N080N812N621M793M112M222N155O422P537Q401R131R677R902J0026
$$ 597223 602303 608115 613736 618529 622641 626863 632018 638440 645977 654378 663509 673186 683088 693114
63189F93114J0624J1998J3822J5561J7029J8418J9964K1808K3876K5775K7034
$$ 693114 703738 715736 729558 745119 762148 780566 800530 822338 846214 871989 899023
63178H99023K7693K8340K9369L0532L1492L2365L3319L4127L4617L5141L5902
$$ 899023 926716 955056 984425 1014957 1046449 1078814 1112133 1146260 1180877 1216018 1251920
63167A251920L6239L5433L3969L2976L2553L1714L0137K8861K8693K8892K8183
$$ 1251920 1288159 1323592 1357561 1390537 1423090 1454804 1484941 1513802 1542495 1571387 1599570
63156A599570K6435K4508K2666J9891J4916P677m45p838j4130k0170k6393l1732
$$ 1599570 1626005 1650513 1673179 1693070 1707986 1715663 1715218 1707380 1693250 1673080 1646687 1614955
63144A614955l4847l5917l6145l5798l4131l1271k8552k6432k3701j9665j5677
$$ 1614955 1580108 1544191 1508046 1472248 1438117 1406846 1378294 1351862 1328161 1308496 1292819
63133A292819j3096j1002p629l221L89K666M966Q268J2009J5408J8289K0276K0668
$$ 1292819 1279723 1268721 1261092 1257871 1258260 1260926 1265892 1274160 1286169 1301577 1319866 1340142 1360810
63120A360810J9902J9698K0878K2089K1698K0014J8574J7912J7176J5571J3103
$$ 1360810 1380712 1400410 1421288 1443377 1465075 1485089 1503663 1521575 1538751 1554322 1567425
63109A567425J0012O484K925l68l926q660j4543k0353k5128k9140l3015l6390
$$ 1567425 1577437 1583921 1586846 1586478 1582552 1573892 1559349 1538996 1513868 1484728 1451713 1415323
63097A415323l8253l8473l8213l8577l9316l9139l7085l3433k9599k7201k6625
$$ 1415323 1377070 1338597 1300384 1261807 1222491 1183352 1146267 1112834 1083235 1056034 1029409
63086A029409k6278k3986j9687j5974j5013j5602j4841j2194r968r507r193p314
$$ 1029409 1003131 979145 959458 943484 928471 912869 898028 885834 875866 866359 857166 849852
63074H49852m895l832l647k292M01K409K515J670J045N42j05j62J275M053P047
$$ 849852 844957 841125 837478 835186 835587 837996 840511 842181 843226 843768 843663 843501 844776 848829 855876
63059H55876Q923Q825P075N249M652M804M382L407L165M124N417O436P222P204
$$ 855876 864799 873624 880699 885948 890600 895404 899786 903193 906358 910482 915899 922335 929557 936761
63045I36761N568L323K834M378N309L885J880J737L008L752L882M634N705N609
$$ 936761 942329 945652 948486 952864 958173 962058 963938 965675 968683 972435 976317 980951 986656 992265
63031I92265M516M239N320O301O154N472M877M034L016K976M605O976Q755R794
$$ 992265 996781 1001020 1006340 1012641 1018795 1024267 1029144 1033178 1036194 1039170 1043775 1050751 1059506 1069300
63017A069300J0832J2360J4235J5977J7225J8243J9840K2226K4247K4714K4246
$$ 1069300 1080132 1092492 1106727 1122704 1139929 1158172 1178012 1200238 1224485 1249199 1273445
63006A273445K4716K7021L0597L4892L9764M4394M7493M9251N1605N5848O1133
$$ 1273445 1298161 1325182 1355779 1390671 1430435 1474829 1522322 1571573 1623178 1679026 1740159
62995A740159O5928O9717P2589P4461P5755P7699Q0753Q3631Q5021Q5419Q6026
$$ 1740159 1806087 1875804 1948393 2022854 2098609 2176308 2257061 2340692 2425713 2511132 2597158
62984B597158Q6604Q5954Q4078Q2305Q1261Q0208P8637P7202P6397P5243P2133
$$ 2597158 2683762 2769716 2853794 2936099 3017360 3097568 3176205 3253407 3329804 3405047 3477180
62973C477180O6531N9068N0222L9658K7012J2820j815j6168l0084m3327n5406
$$ 3477180 3543711 3602779 3653001 3692659 3719671 3732491 3730676 3714508 3684424 3641097 3585691
62962C585691o6187p5895q4025q9010q9972q8257q6007q3420p8740p1050o1737
$$ 3585691 3519504 3443609 3359584 3270574 3180602 3092345 3006338 2922918 2844178 2773128 2711391
62951B711391n2641m4168l5881k7921k0636j3668o492O03P008J2878J8688K4009
$$ 2711391 2658750 2614582 2578701 2550780 2530144 2516476 2509984 2510587 2517595 2530473 2549161 2573170
62939B573170K7685K9322K9819L0300L1120L1944L2329L2035L1104K9749K8013
$$ 2573170 2600855 2630177 2659996 2690296 2721416 2753360 2785689 2817724 2848828 2878577 2906590
62928B906590K5505K1575J5727Q081l89q384j5587k3258l2750m3518n3474o1322
$$ 2906590 2932095 2953670 2969397 2977478 2977089 2968705 2953118 2929860 2897110 2853592 2800118 2738796
62916B738796o7437p2335p5724p7660p9209q0926q1653q0006p6266p1810o7376
$$ 2738796 2671359 2599024 2523300 2445640 2366431 2285505 2203852 2123846 2047580 1975770 1908394
62905A908394o2997n8882n5205n1540m7581m3896m0997l8396l5698l3722l3099
$$ 1908394 1845397 1786515 1731310 1679770 1632189 1588293 1547296 1508900 1473202 1439480 1406381
62894A406381l2615l0630k7623k5521k4867k4583k4254k4582k5487k5826k5266
$$ 1406381 1373766 1343136 1315513 1289992 1265125 1240542 1216288 1191706 1166219 1140393 1115127
62883A115127k4579k3747k1853j9285j7826j7721j6863j4127j1405j0704j1124
$$ 1115127 1090548 1066801 1044948 1025663 1007837 990116 973253 959126 947721 937017 925893
62872I25893j0598r160q324q308q060p378o855o197m600k726k305l618n102n666
$$ 925893 915295 906135 897811 889503 881443 874065 867210 861013 856413 853687 851382 847764 842662 836996
62858H36996n834o086n668l821j177P44Q64q30l203m423l544j867j748l789o252
$$ 836996 831162 825076 819408 815587 814410 815154 816018 815188 811985 807562 804018 802151 800403 796614 790362
62843G90362p477p520o928n469l246j769k299l751l800j939R3R04J054J589K293
$$ 790362 782885 775365 768437 762968 759722 757953 755654 751903 748103 746164 746257 747161 748215 749804 752097
62828G52097K290J499N28m80j825l198l623k736j352l66L22J188J964K004J538
$$ 752097 754387 755886 756414 755934 754109 750911 747288 744552 743200 742834 743156 744344 746308 748312 749850
62813G49850J461J730J164o18k056j639k67j88j795l116k760j668j044j25K355
$$ 749850 751311 753041 754205 753587 751531 749892 749625 749437 747642 744526 741766 740098 739054 738929 741284
62798G41284N400O435M699K286J393J998K847L362L602L463L114L460M790N603
$$ 741284 746684 753119 757818 760104 761497 763495 766342 769704 773306 776769 779883 783343 788133 793736
62784G93736M254J511j69k3J59r32k011j425J7K50p36q07J081L373M204L702L154
$$ 793736 797990 799501 799332 799309 799468 798536 796525 795100 795117 795367 794631 793824 794905 798278 802482 806184 809338
62767H09338L014K902K935L690N053O061O236O177O554P121P308P368Q159R720
$$ 809338 812352 815254 818189 821879 826932 832993 839229 845406 851960 859081 866389 873757 881916 891636
62753H91636J0789J0199Q490P495Q319J0337J2323J3934J5550J7131J8113J8399
$$ 891636 902425 912624 921114 928609 936928 947265 959588 973522 989072 1006203 1024316 1042715
62741A042715J8729J9913K2167K5243K8757L2104L4642L6283L7553L8845M0073
$$ 1042715 1061444 1081357 1103524 1128767 1157524 1189628 1224270 1260553 1298106 1336951 1377024
62730A377024M1378M3762M8385N5258O3021P0126P6141Q1904Q8412R5581J02234
$$ 1377024 1418402 1462164 1510549 1565807 1628828 1698954 1775095 1856999 1945411 2040992 2143226
62719B143226J07459J11606J15421J18397J18911J16209J11403J05881R9372R0194
$$ 2143226 2250685 2362291 2477712 2596109 2715020 2831229 2942632 3048513 3147885 3238079
62709C238079P7109O0361M1181K1037J170j7804l5933n3248o9155q2898r4320
$$ 3238079 3315188 3375549 3416730 3437767 3438937 3421133 3385200 3331952 3262797 3179899 3085579
62698C085579j03621j10522j14378j15156j13765j11243j08145j04687j00955
$$ 3085579 2981958 2871436 2757058 2641902 2528137 2416894 2308749 2204062 2103107
62689B103107r6801r1969q6530q0810p4878o8683o2716n7877n4274n0855m6707
$$ 2103107 2006306 1914337 1827807 1746997 1672119 1603436 1540720 1482843 1428569 1377714 1331007
62678A331007m2127l7764l3389k8549k4123k1764k1471k0953j8297j4350j1269
$$ 1331007 1288880 1251116 1217727 1189178 1165055 1143291 1121820 1100867 1082570 1068220 1056951
62667A056951r400p079l596n81M33N02J921M997P679Q486Q460R641J2610J6242
$$ 1056951 1047551 1040472 1036876 1036295 1036728 1037230 1039151 1044148 1051827 1060313 1068773 1078414 1091024 1107266
62653A107266J9349K1842K4487K7985L2263L6482L9891M2708M5820M9631N3867
$$ 1107266 1126615 1148457 1172944 1200929 1233192 1269674 1309565 1352273 1398093 1447724 1501591
62642A501591N8678O4948P2813Q0448Q5337Q6774Q6386Q6180Q6611Q6635Q5019
$$ 1501591 1560269 1625217 1698030 1778478 1863815 1950589 2036975 2123155 2209766 2296401 2381420
62631B381420Q1275P5521O7748N7455M4216K8671J2527k668j6598k9841m2798
$$ 2381420 2462695 2538216 2605964 2663419 2707635 2736306 2748833 2746165 2729567 2699726 2656928
62620B656928n5153o6102p4841q1121q5485q8751r1034r1777r0727q8231q4377
$$ 2656928 2601775 2535673 2460832 2379711 2294226 2205475 2114441 2022664 1931937 1843706 1759329
62609A759329p8919p2645o7650o5056o3168n9378n3541m8032m4519m2192l9422
$$ 1759329 1680410 1607765 1540115 1475059 1411891 1352513 1298972 1250940 1206421 1164229 1124807
62598A124807l5903l2418k9527k7177k5104k3046k0829j8594j6550j4609j2619
$$ 1124807 1088904 1056486 1026959 999782 974678 951632 930803 912209 895659 881050 868431
62587H68431j0920j0027r855r904j0010j0080r412p437n046l749l462k662j141
$$ 868431 857511 847484 837629 827725 817715 807635 798223 790786 785740 781991 778529 775867 774726
62574G74726o62j984l052j870K85O14r75j638L63L361M637L669K226K145L838
$$ 774726 774064 772080 769028 767158 767443 768057 767082 765444 765807 769168 773805 777474 779700 781845 785683
62559G85683O440Q646R557R201Q430Q225R010J0466J1925J3120J4571J6914J9835
$$ 785683 792123 800769 810326 819527 827957 836182 845192 855658 867583 880703 895274 912188 932023
62546I32023K2264K3851K5524K8122L1125L3451L4903L6136L7700L9975M3449
$$ 932023 954287 978138 1003662 1031784 1062909 1096360 1131263 1167399 1205099 1245074 1288523
62535A288523M7964N2071N4339N5127N5827N6413N5091N0628M3846L6320K8805
$$ 1288523 1336487 1388558 1442897 1498024 1553851 1610264 1665355 1715983 1759829 1796149 1824954
62524A824954K1350J3799N374n094j7258k8336l5472l8955m1861m6348n1260n3923
$$ 1824954 1846304 1860103 1865477 1860383 1843125 1814789 1779317 1740362 1698501 1652153 1600893 1546970
62512A546970n3472n1587n0175m9291m7793m5377m3044m1537m0224l8016l4805
$$ 1546970 1493498 1441911 1391736 1342445 1294652 1249275 1206231 1164694 1124470 1086454 1051649
62501A051649l1319k8061k5147k2824k1166j9390j6563j3094j0546r627r353q625
$$ 1051649 1020330 992269 967122 944298 923132 903742 887179 874085 863539 853912 844559 835934
62489H35934p633o942o049m006j215N34N9j711k587j316J252L181L625L575M275
$$ 835934 828301 821359 815310 811304 810089 810623 810682 808971 806384 805068 806320 809501 813126 816701 820976
62474H20976N442N878N563N818P199Q579R088R755J2063J5662J8863K0988K2950
$$ 820976 826418 832296 837859 843677 850876 859455 868543 878298 890361 906023 924886 945874 968824
62461I68824K5604K8784L2071L5390L8552M1179M3530M6551N0476N4031N5671
$$ 968824 994428 1023212 1055283 1090673 1129225 1170404 1213934 1260485 1310961 1364992 1420663
62450A420663N5371N4581N4432N4341N2495M7690M0578L2985K6021J9260J1921
$$ 1420663 1476034 1530615 1585047 1639388 1691883 1739573 1780151 1813136 1839157 1858417 1870338
62439A870338M320k456p825j1814j4162j4436j3117j1534j0261q342m735K06N226
$$ 1870338 1874658 1872202 1864377 1852563 1838401 1823965 1810848 1799314 1789053 1780711 1775976 1776182 1781408
62426A781408R733J4159J9215K5334L2531M0140M6799N1348N3773N4844N4972
$$ 1781408 1791141 1805300 1824515 1849849 1882380 1922520 1969319 2020667 2074440 2129284 2184256
62415B184256N3853N1076M6500L9988L1501K1715J1947K856o499j7746l1239m5353
$$ 2184256 2238109 2289185 2335685 2375673 2407174 2428889 2440836 2443692 2437193 2419447 2388208 2342855
62403B342855n7745o6944p2714p5584p6572p6988p7549p7570p5757p2053o7979
$$ 2342855 2285110 2218166 2145452 2069868 1993296 1916308 1838759 1761189 1685432 1613379 1545400
62392A545400o4626o1093n5824m9006m2598l8032l4778l1325k6809k1560j6736
$$ 1545400 1480774 1419681 1363857 1314851 1272253 1234221 1199443 1168118 1141309 1119749 1103013
62381A103013j3529j2124j1400j0269r063q625q256o340l256j779l442o151p058
$$ 1103013 1089484 1077360 1065960 1055691 1046628 1038003 1029747 1023407 1020151 1018372 1014930 1008779 1001721
62368A001721o555p272r873j2185j2699j2640j3698j5365j5832j4489j2378j0644
$$ 1001721 995166 987894 978021 965836 953137 940497 926799 911434 895602 881113 868735 858091
62356H58091r538q766q143p784p938q536q965q544p267n732m377l280k531k128
$$ 858091 848553 839787 831644 823860 815922 807386 798421 789877 782610 776878 772501 769221 766690 764562
62342G64562j617o35K17k0j066j532r03k34k33Q1J807M210N601N581N214N306
$$ 764562 762945 762310 762527 762507 761441 759909 759006 758772 758539 758620 760427 764637 770238 775819 781033 786339
62326G86339N741O324P148Q021Q467Q523Q797R533J0296J0791J1436J2926J5553
$$ 786339 792080 798404 805552 813573 822040 830563 839360 848893 859189 869980 881416 894342 909895
62313I09895J8980K2292K4438K5204K5698K7286L0043L2797L4633L5757L6955
$$ 909895 928875 951167 975605 1000809 1026507 1053793 1083836 1116633 1151266 1187023 1223978
62302A223978L8964M2430M7614N3836N9907O5375P0670P5714P9311Q0523P9924
$$ 1223978 1262942 1305372 1352986 1406822 1466729 1532104 1602774 1678488 1757799 1838322 1918246
62291A918246P8609P6337P1639O3745N3637M2909L2123K0664Q013n078j6791k5715
$$ 1918246 1996855 2073192 2144831 2208576 2262213 2305122 2337245 2357909 2365922 2360844 2344053 2318338
62279B318338l2213l8172m5082n2424n8312o1626o3037o3686o3438o1199n6792
$$ 2318338 2286125 2247953 2202871 2150447 2092135 2030509 1967472 1903786 1840348 1779149 1722357
62268A722357n1588m6986m3010l9085l5509l3140l1833l0413k8402k6786k6645
$$ 1722357 1670769 1623783 1580773 1541688 1506179 1473039 1441206 1410793 1382391 1355605 1328960
62257A328960k7839k9557l1215l2154l1368k8602k5229k3029k2392k2399k2216
$$ 1328960 1301121 1271564 1240349 1208195 1176827 1148225 1122996 1099967 1077575 1055176 1032960
62246A032960k1491j9949j7652j5349j3435j1103p772m831m219n428n872m499
$$ 1032960 1011469 991520 973868 958519 945084 933981 926209 921378 917159 911731 905859 901360
62234I01360k987k741k720j485M16J648K327L279M195M346M375N415O875P113
$$ 901360 898373 895632 892912 891427 891843 893491 895818 899097 903292 907638 912013 917428 924303 931416
62220I31416O293O503Q639J1080J2230J2742J4003J5665J6230J5614J5641J7785
$$ 931416 937709 944212 952851 963931 976161 988903 1002906 1018571 1034801 1050415 1066056 1083841
62208A083841K1439K4782K6874K8461L0941L4931L9870M4780M9220N3466N8065
$$ 1083841 1105280 1130062 1156936 1185397 1216338 1251269 1291139 1335919 1385139 1438605 1496670
62197A496670O3341O9167P4961P9898Q3297Q4795Q4246Q1772P7867P2869O6142
$$ 1496670 1560011 1629178 1704139 1784037 1867334 1952129 2036375 2118147 2196014 2268883 2335025
62186B335025N6411M3563K9579J6898O078m114j4546k4701l3922m2517n0912n8521
$$ 2335025 2391436 2434999 2464578 2481476 2487554 2483440 2468894 2444193 2410271 2367754 2316842 2258321
62174B258321o4303o8057p0325p1174p0069o7198o3974o1631n9748n6981n3085
$$ 2258321 2194018 2125961 2055636 1984462 1914393 1847195 1783221 1721590 1661842 1604861 1551776
62163A551776m9349m6860m5096m2802l9644l6360l3541l1085k8726k6377k3976
$$ 1551776 1502427 1455567 1410471 1367669 1328025 1291665 1258124 1227039 1198313 1171936 1147960
62152A147960k1550j9474j8031j6802j5265j3916j3653j3928j2694q885m044p18
$$ 1147960 1126410 1106936 1088905 1072103 1056838 1042922 1029269 1015341 1002647 993762 989718 989000
62140I89000J01o96j694j742r8L072O565R248J0994J2015J2000J0924J0059J0950
$$ 989000 989101 988405 986711 984969 984871 987943 994508 1003756 1014750 1026765 1038765 1049689 1059748 1070698
62126A070698J3494J6111J7601J7953J7645J7300J7785J9327K0585J9969J8019
$$ 1070698 1084192 1100303 1117904 1135857 1153502 1170802 1188587 1207914 1228499 1248468 1266487
62115A266487J7118J8465K0692K2081K2860K4424K7317L1183L5959M1747M7658
$$ 1266487 1283605 1302070 1322762 1344843 1367703 1392127 1419444 1450627 1486586 1528333 1575991
62104A575991N2012N4131N5207N6797N8607N8418N4432M7361L9640L2694K5744
$$ 1575991 1628003 1682134 1737341 1794138 1852745 1911163 1965595 2012956 2052596 2085290 2111034
62093B111034J7506Q182r97r453j7441k4915l1297l6344m0311m3260m4999m5712
$$ 2111034 2128540 2136722 2135725 2126272 2108831 2083916 2052619 2016275 1975964 1932704 1887705 1841993
62081A841993m5886m5565m4398m2320l9528l5958l1615k7116k2989j8821j4223
$$ 1841993 1796107 1750542 1706144 1663824 1624296 1588338 1556723 1529607 1506618 1487797 1473574
62070A473574j0226q145p250n433k315J95J039J688L631N810O072M051J251r57
$$ 1473574 1463348 1455203 1447953 1442520 1440205 1440400 1441439 1443127 1446758 1452568 1458640 1462691 1463942 1462985
62056A462985k198k529k277k057k137k184k184k982n246q434j1487j3801j4979
$$ 1462985 1460787 1458258 1455981 1453924 1451787 1449603 1447419 1444437 1439191 1430757 1419270 1405469 1390490
62043A390490j4429j2078q891o043m125l472m108m851l884j077J582K802L738
$$ 1390490 1376061 1363983 1355092 1349049 1344924 1341452 1337344 1332493 1328609 1327532 1329114 1331916 1335654
62030A335654N538O928O237M543M412O192Q039R223J0901J3566J6125J7913J9590
$$ 1335654 1341192 1348120 1354357 1358900 1363312 1369504 1377543 1386766 1397667 1411233 1427358 1445271 1464861
62017A464861K1425K2652K3282K4675K7257K9352K9532K8901K9679L2303L5198
$$ 1464861 1486286 1508938 1532220 1556895 1584152 1613504 1643036 1671937 1701616 1733919 1769117
62006A769117L6934L7553L8038L9181M0992M2660M3265M2534M0646L7431L2397
$$ 1769117 1806051 1843604 1881642 1920823 1961815 2004475 2047740 2090274 2130920 2168351 2200748
61995B200748K5569J7514Q538j226j0803j8572k3938k8036l2353l7493m3576n0606
$$ 2200748 2226317 2243831 2252369 2251143 2240340 2221768 2197830 2169794 2137441 2099948 2056372 2005766
61983B005766n7654o2625o4111o3054o1562o0319n8134n4063m9076m5176m3120
$$ 2005766 1948112 1885487 1821376 1758322 1696760 1636441 1578307 1524244 1475168 1429992 1386872
61972A386872m1546l8472l3538k8410k4859k2898k1361j9789j8864j8999j9468
$$ 1386872 1345326 1306854 1273316 1244906 1220047 1197149 1175788 1155999 1137135 1118136 1098668
61961A098668j9266j8186j6722j5401j4424j3605j2523j1170j0342j0768j1847
$$ 1098668 1079402 1061216 1044494 1029093 1014669 1001064 988541 977371 967029 956261 944414
61950I44414j2040j0720q920p983q116q477q103o509l984j491J33J014J730K185
$$ 944414 932374 921654 912734 904751 896635 888158 880055 873546 869562 868071 868204 869218 870948 873133
61936H73133J728L83r78j787k223k449k477k798l986n427n711m797m354n374o781
$$ 873133 874861 875244 874266 872479 870256 867807 865330 862532 858546 853119 847408 842611 838257 832883 826102
61921H26102p360p654q677r867r852q679p695p455p071n704l704k054j416j840
$$ 826102 818742 811088 802411 792544 782692 774013 766318 758863 751792 746088 742384 740330 738914 737074
61907G37074k917m096n009n478n286m407l430l098l213k804j531k5J289K574L540
$$ 737074 734157 730061 725052 719574 714288 709881 706451 703353 700140 697336 695805 695780 697069 699643 703183
61892G03183L400K436K099K876L657M070N550Q701J1548J2343J2413J3890J6160
$$ 703183 706583 709019 711118 713994 717651 721721 727271 735972 747520 759863 772276 786166 802326
61879H02326J7311J7805J9371K0978J9780J6285J4741J7110K0077J9851J7108
$$ 802326 819637 837442 856813 877791 897571 913856 928597 945707 965784 985635 1002743
61868A002743J4863J3779J2268R831P496N648L659J457l41j599k508k629j595
$$ 1002743 1017606 1031385 1043653 1053484 1060980 1066628 1070287 1071744 1071403 1069804 1067296 1064667 1063072
61855A063072m03m57j527k123j772j230m19K109O912J2170J5385J5882J4957J4095
$$ 1063072 1062669 1062212 1060685 1058562 1056790 1055560 1055141 1057250 1064162 1076332 1091717 1107599 1122556 1136651
61841A136651J3694J3133J1594Q757M940O38l797p808j0488j1433j1420j1474
$$ 1136651 1150345 1163478 1175072 1183829 1188769 1189407 1185610 1177802 1167314 1155881 1144461 1132987
61829A132987j1537j0990j0251j0625j2329j3839j3783j2515j1244j0545j0446
$$ 1132987 1121450 1110460 1100209 1089584 1077255 1063416 1049633 1037118 1025874 1015329 1004883
61818A004883j1075j2205j2743j1854j0329r750j0387j0897j0180q623p237o409
$$ 1004883 993808 981603 968860 957006 946677 936927 926540 915643 905463 896840 889603 883194
61806H83194n779m755k841o4K684M281M665N011O396Q813J1706J4690J7439J9527
$$ 883194 877415 872660 869819 869755 872439 876720 881385 886396 892792 901605 913311 928001 945440 964967
61792I64967K1042K2718K4864K6700K7401K7219K6984K7052K7478K8387K9164
$$ 964967 986009 1008727 1033591 1060291 1087692 1114911 1141895 1168947 1196425 1224812 1253976
61781A253976K8002K3756J7850J2858R392N977J837k159n519q959j2257j3266
$$ 1253976 1281978 1305734 1323584 1336442 1345834 1351811 1353648 1351489 1345970 1337011 1324754 1311488
61769A311488j0590n874j967J66J374K301L203M856P589R761R141N835K116p61
$$ 1311488 1300898 1295024 1293057 1293223 1294597 1296898 1300101 1304957 1312546 1322307 1331448 1337283 1339399 1338638
61755A338638l836q135j2805j6432j8924k1118k3314k5109k6136k6307k5811k5275
$$ 1338638 1334802 1326667 1313862 1297430 1278506 1257388 1234074 1208965 1182829 1156522 1130711 1105436
61743A105436k5403k5943k5557k3395k0341j8132j7423j7204j6070j3732j1317
$$ 1105436 1080033 1054090 1028533 1005138 984797 966665 949242 932038 915968 902236 890919
61732H90919j0224j0682j1501j1402j0299q978p971p322o996o643n331k719l42
$$ 890919 880695 870013 858512 847110 836811 827833 819862 812540 805544 798901 793570 790851 790509
61719G90509l64k741n048n496m723l898k667m46J497J199j138l145l237k155j265
$$ 790509 790145 787404 782356 776860 772137 768239 765572 765126 766623 767822 766684 763539 760302 758147 756882
61704G56882o90K21J521K652L362L860M287M516M501M360M041L311K228J339J076
$$ 756882 756192 756413 757934 760586 763948 767808 772095 776611 781112 785472 789513 792824 795052 796391 797467
61689G97467J091O65k35q54q74j081k159l331l228j988j401k659m912o482o657
$$ 797467 798558 799223 798988 798134 797260 796179 794020 790689 787461 785473 784072 781413 776501 770019 763362
61674G63362n679l846j579J37M07m27r92l51J190K570K970K408J782K167L718
$$ 763362 757683 753837 752258 752395 752802 752375 751383 751032 752222 754792 757762 760170 761952 764119 767837
61659G67837N370N890N064L608K237J294J002J528K642L698M008L156J226j107
$$ 767837 773207 779097 784161 787769 790006 791300 792302 793830 796472 800170 804178 807334 808560 807453
61645H07453k980m128m976n725n816m875l746l827n291o730o760n586m636m845
$$ 807453 804473 800345 795369 789644 783828 778953 775207 771380 766089 759359 752599 747013 742377 737532
61631G37532n596n426l769j705p96j355k329k787k788k676k442k191k529l709
$$ 737532 731936 726510 722741 721036 720240 718885 716556 713769 710981 708305 705863 703672 701143 697434
61617F97434m883m995m120l294l157l382l247k401j243p73j533k496j885K82J637
$$ 697434 692551 687556 683436 680142 676985 673603 670356 667955 666712 665939 664406 661910 660025 660307 661944
61602F61944N27j473j668r2Q08M5o75N6J274J687J767K438L058K506J406J399
$$ 661944 662471 660998 659330 659238 660046 660091 659416 659472 660746 662433 664200 666638 669696 672202 673608 675007
61586F75007K586L355K848K043K073K655K819K291J558J105J141J684K366K425
$$ 675007 677593 680948 683796 685839 687912 690567 693386 695677 697235 698340 699481 701165 703531 705956
61572G05956J349n45k428l718m314m356m134m033m182m248l974l777m180m661
$$ 705956 707305 706760 704332 700614 696300 691944 687810 683777 679595 675347 671373 667596 663416 658755
61558F58755m011k196r46j644l313l888l050k396k938m000m937o161p605p782
$$ 658755 654744 652548 651602 649958 646645 642757 639707 637311 634373 630373 625436 619275 611670 603888
61544F03888n805l225k272l003l748l740l608l701l858m579o511q528q370n782
$$ 603888 598083 594858 592586 589583 585835 582095 578487 574786 570928 566349 559838 551310 542940 537158
61530E37158l258k951m405o005o996p045n563k954j209j630k837k594q52N97P79
$$ 537158 533900 530949 526544 520539 513543 506498 500935 497981 496772 495142 492305 489711 488859 489456 490235
61515D90235L47J7k22m81p51j261k049k429j935j327j493j856j348n38j003k640
$$ 490235 490582 490599 490377 489896 489145 487884 485835 483406 481471 480144 478651 476795 475447 474909 473906 471266
61499D71266l473k471p90L68J407K965M338M556L936L429L056K137N99q34j487
$$ 471266 467793 465322 464532 464900 466307 469272 473610 478166 482102 485531 488587 490724 491323 490489 489002
61484D89002j135P3J494K241K071J763K112K953L477L025J367j098l011k864q58
$$ 489002 487867 487940 489434 491675 493746 495509 497621 500574 504051 507076 508443 507345 504334 501470 500612
61469E00612Q48N82q27j343l89Q90J489J428R60J22p68j080n64M62J536K121J550
$$ 500612 501460 502042 501215 499872 499483 500373 501862 503290 504250 504372 503604 502524 501960 502422 503958 506079 507629
61452E07629l03k402l393k975j782k62J375K399K065R63N78J225J576O35r82k211
$$ 507629 507326 504924 501531 498556 496774 496512 497887 500286 502351 503314 503892 505117 506693 507328 506346 504135
61436E04135k799k703j450Q40K648K501Q33o32r59n49M8P69J534K018K147K206
$$ 504135 501336 498633 497183 498023 500671 503172 504005 503373 502414 501865 501913 502682 504216 506234 508381 510587
61420E10587K386K713L256L845L740K356L19r94r87l22L06R26J577J628O37o82
$$ 510587 512973 515686 518942 522787 526527 528883 529202 528208 527221 526899 527205 528131 529708 531336 531973 531291
61404E31291j063k30Q35J248J282J758K760L411K994J800O03l57j278j842j199
$$ 531291 530228 529998 530833 532081 533363 535121 537881 541292 544286 546086 546689 546332 545054 543212 542013
61389E42013P63K840L765L588L149K645J631K95l41K65J507K514L057L209K911
$$ 542013 542776 545616 549381 552969 556118 558763 560394 560689 560348 560613 562120 564634 567691 570900 573811
61374E73811K305J944K014J942J363R78J602K781L274K793K234K041J482J0j566
$$ 573811 576116 578060 580074 582016 583379 584357 585959 588740 592014 594807 597041 599082 600564 600574 599008
61359E99008k153j936j813j661m01K008L868L729K316J557K065K529J583o07k720
$$ 599008 596855 594919 593106 591445 591044 593052 596920 600649 602965 604522 606587 609116 610699 610092 607372
61344F07372l691l513l009l066l669l736k359j41J334J384P99M38K16q9j05K82
$$ 607372 603681 600168 597159 594093 590424 586688 584329 584188 585522 586906 587705 588143 588359 588270 588165 588447
61328E88447K94n30j219o00Q58J710J682J786K444K876K589K134K009J953J873
$$ 588447 588741 588211 586992 586392 587250 588960 590642 592428 594872 597748 600337 602471 604480 606433 608306
61313F08306K372L639M622M156K435P89K72R45K198L365M261N196O240O671N786
$$ 608306 610678 614317 618939 623095 625530 626319 626591 627536 629734 633099 637360 642556 648796 655467 661253
61298F61253M127L024K932L225L608M544N998P119P672Q454R544R533P514M773
$$ 661253 665380 668404 671336 674561 678169 682713 688711 695830 703502 711956 721500 731033 738547 743320
61284G43320L268L332M025M845N786O471O573O628P222P810P558O777O259N731
$$ 743320 746588 749920 753945 758790 764576 771047 777620 784248 791470 799280 806838 813615 819874 825605
61270H25605M392K569J355Q91L60n19j416k457l789m349k861j31J455R96KJ9J127
$$ 825605 829997 832566 833921 834812 835172 834653 833237 830780 826991 822642 819781 819650 821105 822101 822103 822122 823249
61253H23249L056N819Q477R233P958P031Q385J1030J2753J3007J2712J2268J1330
$$ 823249 826305 832124 840601 849834 857792 864823 873208 884238 896991 909998 922710 934978 946308
61240I46308R892Q250O305M091K446J961J652j44l636p237r202r071p796o954
$$ 946308 956200 964450 970755 974846 977292 979253 980905 980761 977125 969888 960686 951615 943819 936865
61226I36865p358q042p319n238l909m665o193o519n614m584l546k014m55O00K136
$$ 936865 929507 921465 914146 908908 904999 900334 894141 887622 882008 877424 873878 871864 871409 872009 874145
61211H74145N119P892P724M964K999L608N022N404N604O847Q090P819O832O817
$$ 874145 879264 887156 894880 899844 902843 906451 911473 916877 922481 929328 937418 945237 952069 958886
61197I58886P340O664M920L995M408M682M090L773M324M261K254m77j525l55J299
$$ 958886 966226 972890 977810 981805 986213 990895 994985 998758 1003082 1007343 1009597 1009120 1007595 1007240 1008539
61182A008539J741Q66l97j173j150p04o63j452k477k926k950l316l958l781k146
$$ 1008539 1010280 1011146 1010749 1009576 1008426 1007722 1007059 1005607 1003130 1000204 997254 993938 989980 986199 984053
61167I84053K10K235L739M961N645N439M860M971O079P469Q357Q547Q172P483
$$ 984053 984263 986498 990237 995198 1000843 1006282 1011142 1016113 1022192 1029661 1038018 1046565 1054737 1062220
61153A062220O948O922P062O708N854N082M421L240J662J118K680N456P554Q335
$$ 1062220 1069168 1076090 1083152 1089860 1095714 1100796 1105217 1108457 1110119 1111237 1113917 1119373 1126927 1135262
61139A135262Q851J0154J2009J3452J3970J3843J3632J3505J3071J1859J0039
$$ 1135262 1144113 1154267 1166276 1179728 1193698 1207541 1221173 1234678 1247749 1259608 1269647
61128A269647Q431P632P299O604N164L298J530J41q93j818k856l868m419m300
$$ 1269647 1278078 1285710 1293009 1299613 1304777 1308075 1309605 1309746 1308853 1307035 1304179 1300311 1295892 1291592
61114A291592l846l615m068n446p508r218r341p763n712m429m146m761o521r247
$$ 1291592 1287746 1284131 1280063 1274617 1267109 1257891 1248550 1240787 1235075 1230646 1226500 1221739 1215218 1205971
61100A205971j1605j2317j1821j1627j2131j2078j0367p577n386m950n934o784
$$ 1205971 1194366 1182049 1170228 1158601 1146470 1134392 1124025 1116448 1111062 1106112 1100178 1093394
61088A093394o092m124k776l555n924q224r747j0899j1756j1749j0884r995r362
$$ 1093394 1087302 1083178 1080402 1076847 1070923 1062699 1052952 1042053 1030297 1018548 1007664 997669 988307
61075I88307q118n567k362J14J147J165J271K378M303N798O122O294P809J0335
$$ 988307 980189 974622 972260 972374 973521 974686 975957 978335 982638 988436 994558 1000852 1008661 1018996
61061A018996J2185J3189J5283J9375K3310K4484K3460K3273K5533K8813L0886
$$ 1018996 1031181 1044370 1059653 1079028 1102338 1126822 1150282 1173555 1199088 1227901 1258787
61050A258787L1260L1067L1363L2070L2245L1118K8894K6492K4347K1905J8593
$$ 1258787 1290047 1321114 1352477 1384547 1416792 1447910 1476804 1503296 1527643 1549548 1568141
61039A568141J4727J1046P752M660J807q56m009q270j3011j6748j8687j9143j8579
$$ 1568141 1582868 1593914 1601666 1606326 1608133 1607277 1603268 1594998 1581987 1565239 1546552 1527409 1508830
61026A508830j7326j6378j7215k0035k2993k4025k2947k1003j8874j6341j3760
$$ 1508830 1491504 1475126 1457911 1437876 1414883 1390858 1367911 1346908 1328034 1311693 1297933
61015A297933j2400j2579j2539j0350o542l561k534j864L16L467N557O106O902
$$ 1297933 1285533 1272954 1260415 1250065 1243523 1239962 1237428 1235564 1235880 1239347 1244904 1251010 1257912
61002A257912R587J3612J7025J8561J8629J8837K0866K5175L0373L4302L6230
$$ 1257912 1267499 1281111 1298136 1316697 1335326 1354163 1375029 1400204 1430577 1464879 1501109
60991A501109L7606M0350M4776M9573N3417N6137N8558O1717O6171P1711P7629
$$ 1501109 1538715 1579065 1623841 1673414 1726831 1782968 1841526 1903243 1969414 2041125 2118754
60980B118754Q3293Q8454R3254R8312J04516J12118J20091J27173J33473J40241
$$ 2118754 2202047 2290501 2383755 2482067 2586583 2698701 2818792 2945965 3079438 3219679
60970C219679J47976J55816J63129J70642J79414J89702K01537K15559K32366
$$ 3219679 3367655 3523471 3686600 3857242 4036656 4226358 4427895 4643454 4875820
60961D875820K51627K72517K94630L18175L44217L75205M14246M63228N22972
$$ 4875820 5127447 5399964 5694594 6012769 6356986 6732191 7146437 7609665 8132637
60952H132637N95609O84800P92188R15634J052630J202989J366053J539264J724091
$$ 8132637 8728246 9413046 10205234 11120868 12173498 13376487 14742540 16281804 18005895
60943A8005895J926555K135567K293483K302673K086337J657484J126903O37611
$$ 18005895 19932450 22068017 24361500 26664173 28750510 30407994 31534897 32172508
60935C2172508K87716J06126P7241J60643K80495L20903J69413k10457p45358
$$ 32172508 32460224 32566350 32643591 32804234 33084729 33405632 33575045 33364588 32619230
60926C2619230j294599j732438k001837k111083k099590k010189j878602j730716
$$ 32619230 31324631 29592193 27590356 25479273 23379683 21369494 19490892 17760176
60918A7760176j581392j436226j296110j161130j032322r12188q03888p09208
$$ 17760176 16178784 14742558 13446448 12285318 11252996 10340808 9536920 8827712
60910H827712o27529n57245m97242m46217m01819l62106l27311k98585k75294
$$ 8827712 8200183 7642938 7145696 6699479 6297660 5935554 5608243 5309658 5034364
60901E034364k54944k35654k17255k00049j83916j68968j55919j45242j36758
$$ 5034364 4779420 4543766 4326511 4126462 3942546 3773578 3617659 3472417 3335659
60892C335659j30128j24933j20012j13837j06084r8124r1436q5987q0573p4385
$$ 3335659 3205531 3080598 2960586 2846749 2740665 2642541 2551105 2465118 2384545 2310160
60882B310160o7864o2323n8883n7516n7015n6130n4631n2970n1240m9120m6694
$$ 2310160 2242296 2179973 2121090 2063574 2006559 1950429 1895798 1842828 1791588 1742468 1695774
60871A695774m4537m2943m1737m0756l9805l8241l5601l2710l1020l0552k9676
$$ 1695774 1651237 1608294 1566557 1525801 1485996 1447755 1412154 1379444 1348424 1317872 1288196
60860A288196k7450k4911k3182k1579j8986j6263j5354j6207j6361j4252j1395
$$ 1288196 1260746 1235835 1212653 1191074 1172088 1155825 1140471 1124264 1107903 1093651 1082256
60849A082256j0275j0982j1211r456o880n670o276p071o461m622k967k423k654
$$ 1082256 1071981 1060999 1049788 1040332 1033452 1027782 1021506 1014435 1007974 1003352 1000385 997962 995308
60836I95308k721k040q01K15K09q36j997k527k952m521p416j0228j1563j1496
$$ 995308 992587 990547 989746 989961 990170 989334 987337 984810 981858 977337 969921 959693 948130 936634
60822I36634j1035j0715j0410j0069r875r797r583r251r009q741q069o891n495
$$ 936634 925599 914884 904474 894405 884530 874733 865150 855899 846890 838149 830080 823189 817694
60809H17694m166l089k553k709l111l083k537j949j481q37j27j90j517l308m163
$$ 817694 813528 810439 807886 805177 802066 798983 796446 794497 793016 792179 792052 791862 790345 787037 782874
60794G82874l504j970o00k9k52p43q89o56p62j787l209l754k794j074J46L07k88
$$ 782874 779370 777400 776800 776771 776519 775776 774887 774231 773469 771682 768473 764719 761925 760851 760997 761304 761016
60777G61016j264k595m196n517n973n627n117m778m211k914j129K45N46qo00o52
$$ 761016 759752 757157 752961 747444 741471 735844 730727 725949 721738 718824 717695 717940 718486 718478 717878 717226
60761G17226m13p03j878l062k845r25J389K558K259J093n27k448m136m968n031
$$ 717226 716813 716110 714232 711170 708325 707400 708789 711347 713606 714699 714172 711724 707588 702620 697589
60746F97589m804m219l061k100k554m158n135m649l944m252m824m275k962k506
$$ 697589 692785 688566 685505 683405 680851 676693 671558 666909 662965 658713 653889 649614 646652 644146
60732F44146l344m223m054l125k403k482l281m064l952l024k527l167l702k468
$$ 644146 640802 636579 632525 629400 626997 624515 621234 617170 613218 610194 607667 604500 600798 598330
60718E98330Q1J776J595O47J99K64N60J369K720L966M831N790O762O674N212L751
$$ 598330 598411 600187 601782 602429 602628 602892 603452 604821 607541 611507 616338 622128 628890 635564 640776 644527
60702F44527L477L644K954J737J339J974K676K874K651J719k64k350k780j270
$$ 644527 648004 651648 654602 656339 657678 659652 662328 665202 667853 669572 669308 666958 664178 662908
60688F62908L70L96q95j868j549m50J54n09k030l287l825m486o190q379r466q698
$$ 662908 663278 663674 662779 660911 659362 658912 659066 658557 656527 653240 649415 644929 638739 630360 620894 612196
60672F12196o866n200m323m291m827n338n403n364n754o109n241k978o94L13K59
$$ 612196 605330 600130 595807 591516 586689 581351 575948 570584 564830 558721 553480 550502 549808 550121 550380
60657E50380J85N01Q11P21K10n03r92p73J44J002R43j14j417k036j482L1J775
$$ 550380 550565 551066 551877 552598 552808 552305 551313 550540 550684 551686 552629 552515 551098 549062 547580 547611 549386
60640E49386L074L747L955L820L407K908K473K084J968K704M272N466N200M129
$$ 549386 552460 556207 560162 563982 567389 570297 572770 574854 576822 579526 583798 589264 594464 598593
60626E98593L834M533M933M404L850L978M202M003L939M288L971K280N85P71K471
$$ 598593 602427 606960 611893 616297 620147 624125 628327 632330 636269 640557 644528 646808 647393 648164 650635
60611F50635L457K591Q97l68j336k771m594n825n660m427l486l901n064n332m230
$$ 650635 654092 656683 657580 657212 655876 653105 648511 642686 637026 632599 629113 625212 620148 614816 610586
60596F10586l090k767k092O5K287K239K43r87k15J021J372J636K706L556K823
$$ 610586 607496 604729 602637 602702 604989 607228 607471 606484 606269 607290 608662 610298 613004 616560 619383
60581F19383R72o98k100l809n328n601m715l652k679j458l74l14j122j676j529
$$ 619383 620355 619657 617557 613748 608420 602819 598104 594452 591773 590315 589941 589627 588505 586829 585300
60566E85300j185p62J46J182J225J82o09l00M59J015J782K822K885J295m07m29
$$ 585300 584115 583353 583499 584681 585906 586088 585479 585179 585638 586653 588435 591257 594142 595437 595030 594601
60550E94601L76l71k791m267l019l60J509K280K908L533L500K887K476K428K218
$$ 594601 594977 594606 591815 587548 584529 584169 585678 587958 590866 594399 597899 600786 603262 605690 607908
60535F07908J783J732K256K825L073L127K856J743m9j386j520j028p39l62Q04
$$ 607908 609691 611423 613679 616504 619577 622704 625560 627303 627254 625868 624348 623320 622581 622219 623023
60520F23023K305K930K765L586O529J0191J2129J1870J1320J2068J3409J3815
$$ 623023 625328 628258 631023 634609 641138 651329 663458 675328 686648 698716 712125 725940
60508G25940J3398J3595J4573J4613J2635J0048Q884Q948Q224N814K776J02k523
$$ 725940 739338 752933 767506 782119 794754 804802 813686 822634 830858 836672 839448 839550 837027
60495H37027n226o750n939l475r42J224L606O144P964Q759R121R432R611J0196
$$ 837027 831801 825051 819112 815637 814695 815919 819525 825669 833633 842392 851513 860945 870556 880752
60481H80752J2427J6558K0985K3718K4153K2909K0637J7768J4883J2324R595N892
$$ 880752 893179 909737 930722 954440 978593 1001502 1022139 1039907 1054790 1067114 1076709 1082601
60469A082601J371k614m649m432k982k058k992n487p618p728o222m891m419l538
$$ 1082601 1083972 1081358 1076709 1072277 1069295 1067237 1064245 1058758 1051140 1043412 1037190 1032299 1027880 1024342
60455A024342j095J985L785M077M667O979J0222J2551J3473J4380J6931K1546
$$ 1024342 1023247 1025232 1029017 1033094 1037761 1044740 1054962 1067513 1080986 1095366 1112297 1133843
60443A133843K7431L3448L8711M2776M5758M8316N1219N4642N7704N8853N7105
$$ 1133843 1161274 1194722 1233433 1276209 1321967 1370283 1421502 1476144 1533848 1592701 1649806
60432A649806N3053M8281M3463L7389K8383J6461L426r124k1092l2965m4405n4241
$$ 1649806 1702859 1751140 1794603 1831992 1860375 1876836 1880262 1871138 1850046 1817081 1772676 1718435
60420A718435o1396o5385o6361o5186o3101o0726n7661n3536m9031m5172m1933
$$ 1718435 1657039 1591654 1525293 1460107 1397006 1336280 1278619 1225083 1176052 1130880 1088947
60409A088947l8471l4657l1381k9107k7017k4098k0547j7437j5437j4393j3913
$$ 1088947 1050476 1015819 984438 955331 928314 904216 883669 866232 850795 836402 822489
60398H22489j3726j3553j3112j2382j1486j0280q467o377n159n646p091p669o405
$$ 822489 808763 795210 782098 769716 758230 747950 739483 733106 727947 722301 715210 707541 701136
60385G01136m215k649k079j791j529j972l410m801m786l209j183N6l9j204k525
$$ 701136 696921 694272 692193 690402 688873 686901 683491 678690 673904 670695 669512 669568 669529 668325 665800
60370F65800k991k407j665j793k904m293n151m827k951M6K882M444M649L953K680
$$ 665800 662809 660402 658737 656944 654040 649747 644596 639769 636818 636864 639746 644190 648839 652792 655472
60355F55472J337Q15J167R31j014l374l695j540J085K520L114L733M252M204L676
$$ 655472 656809 657624 658791 659722 658708 655334 651639 650099 651184 653704 656818 660551 664803 669007 672683
60340F72683K872J821J084J616L219M315L983L109K794K911L149M009N447N890
$$ 672683 675555 677376 678460 680076 683295 687610 691593 694702 697496 700407 703556 707565 713012 718902
60326G18902M312K356K414M248N466N027M283M433M882M644L822L010K469K424
$$ 718902 723214 725570 727984 732232 737698 742725 747008 751441 756323 760967 764789 767799 770268 772692
60312G72692L146M194M588M181L920M262M425L821L229L618M592N004M678M542
$$ 772692 775838 780032 784620 788801 792721 796983 801408 805229 808458 812076 816668 821672 826350 830892
60298H30892N159N941O046N621N855P666J0394J2249J2192J0988R812Q438N921
$$ 830892 836051 841992 848038 853659 859514 867180 877574 889823 902015 913003 922815 931253 937174
60285I37174K652K97n67j326l183n354o309n927n452n797o750p459p110n564l875
$$ 937174 939826 940123 939556 938230 935047 929693 923384 917457 912005 906208 899458 891999 884889 879325 875450
60270H75450l544m636n405m531k983k601l482m099l706l031k591j752L6K230M051
$$ 875450 871906 867270 861865 857334 854351 851750 848268 844169 840463 837432 834841 833089 833125 835355 839406
60255H39406N521P005Q412R503J0562J2082J4141J6581J9384K2237K4016K3577
$$ 839406 844927 851932 860344 869847 880409 892491 906632 923213 942597 964834 988850 1012427
60243A012427K1110J7937J4695J0457M341k544p814j0611j2705j6184k0699k3901
$$ 1012427 1033537 1051474 1066169 1076626 1080967 1078423 1070609 1059998 1047293 1031109 1010410 986509
60231I86509k4279k2517k0003j7237j4209j1425r555q457p386o064m872m178l968
$$ 986509 962230 939713 919710 902473 888264 876839 867284 858827 851441 845377 840505 836327 832359
60218H32359m062m140l680k572j674k053l549m730m596l786l723m878o293o684
$$ 832359 828297 824157 820477 817905 816231 814178 810629 805899 801303 797517 793794 788916 782623 775939
60204G75939n697m001k445j350o80n60j112j842j800p43L96N83k01j305k302k862
$$ 775939 770242 766241 763796 762446 761766 761206 760094 758252 756452 755709 756105 756688 756487 755182 752880 750018
60188G50018k371p05J004J502J228J744L301M309L681K384J846J984J861J492
$$ 750018 747647 746942 747946 749448 750676 752420 755721 760030 763711 766095 767941 769925 771786 773278
60174G73278J682K503L152L239L179L242L184K962K953L163K924J868O38J96P47
$$ 773278 774960 777463 780615 783854 787033 790275 793459 796421 799374 802537 805461 807329 807967 808163 808910
60159H08910J822L134M781O566P618P198N780M908N543O761O817N561N036O997
$$ 808910 810732 813866 818647 825213 832831 840029 845809 850717 856260 863021 869838 875399 880435 887432
60145H87432J0516J2918J2852J1453J0403J0060R877R653R381Q496O505M271L566
$$ 887432 897948 910866 923718 935171 945574 955634 965511 975164 984545 993041 999546 1003817 1007383
60132A007383M915O669O802N198L442K596J982M56j873l823m740n172n836o629
$$ 1007383 1012298 1018967 1025769 1030967 1034409 1037005 1038987 1039443 1037570 1033747 1029007 1023835 1017999 1011370
60118A011370p046p035o869o520n889n433n781o594o664n500m043l321l063k473
$$ 1011370 1004324 997289 990420 983900 978011 972578 966797 960203 953539 948039 943996 940675 937612 935139
60104I35139j830k171l498m346l568j708j96K34j80q88j379j286p19k47o9M10
$$ 935139 933309 931138 927640 923294 919726 918018 917822 918056 917876 916988 915609 914323 913604 913357 913288 913698
60088I13698J509K281J571j50j063k56J283K291K808L579M712N789O697P501P750
$$ 913698 915207 917488 919059 918909 917846 917590 918873 921164 923972 927551 932263 938052 944749 952250 960000
60073I60000O864N160L866M002N571P633Q787P981N543L249K650L449M088L783
$$ 960000 966864 972024 975890 979892 985463 993096 1001883 1009864 1015407 1018656 1021306 1024755 1028843 1032626
60059A032626L053K493K060J809K272L482M422M097K733J423J006J667L042M213
$$ 1032626 1035679 1038172 1040232 1042041 1044313 1047795 1052217 1056314 1059047 1060470 1061476 1063143 1066185 1070398
60045A070398M055K273j39j957k907l468l871l954l657l071k187j184q41j923
$$ 1070398 1074453 1076726 1076587 1074630 1071723 1068255 1064384 1060430 1056773 1053702 1051515 1050331 1049490 1047567
60031A047567m060n793n940m679l170k386k328k339k096k134l126m671n455m761
$$ 1047567 1043507 1037714 1031774 1027095 1023925 1021539 1019211 1016872 1014776 1012642 1009516 1004845 999390 994629
60017I94629l290k189j874k179k918l669l765l410m035o425q962r265p401n857
$$ 994629 991339 989150 987276 985097 982179 978510 974745 971335 967300 960875 951913 942648 935247 929390
60003I29390o145p057p010o507o976q242q786q118p264o815n880l786j708j453
$$ 929390 923245 916188 909178 902671 895695 887453 878667 870549 863285 856470 850590 846804 845096 843643
59989H43643k866l591j833J455L801M157L621L447L594L724M281N540O439N822
$$ 843643 840777 837186 835353 836808 840609 844766 848387 851834 855428 859152 863433 868973 875412 881234
59975H81234M473M278N349N543L512P97j81O16R50p08l393n090n190m948n764
$$ 881234 885707 889985 895334 900877 904389 905186 905005 905621 906571 905863 902470 897380 892190 887242 881478
59960H81478p509q874r136q864q696q278p240o525p386r259j0051q784o685n216
$$ 881478 873969 865095 855959 847095 838399 830121 822881 816356 808970 799711 789660 780876 774191 768975
59946G68975m329l391k638k741l651m695n247m721k830m89N11k90j081q7J990
$$ 768975 764646 761255 758617 755876 752225 747530 742283 737562 734732 734243 734754 734464 733383 733296 735286
59931G35286L160K907K321K107K062K315L353M684M886L399J157n92j213m56J309
$$ 735286 738446 741353 743674 745781 747843 750158 753511 758195 763081 766480 767637 767045 765832 765376 766685
59916G66685K617K037Q8j248j244j219k162l077k677j352k78L92J161J728J350
$$ 766685 769302 771339 771427 770179 768935 767716 765554 762477 759800 758448 758170 758562 759723 761451 762801
59901G62801M01K15J318K759L368K878J697K86r98j922k526k915k888k084o40
$$ 762801 763202 763417 764735 767494 770862 773740 775437 775723 774725 772803 770277 767362 764474 762390 761750
59886G61750O69J076N29m06j073j125n69K96R27Q02q3j010j181o30j84l50o53
$$ 761750 762419 763495 764024 763618 762545 761420 760851 761147 762074 762876 762793 761783 760602 759972 759788 759438 758785
59869G58785l98M45J538K962M846O584P282O957O544O656P060P341P283O536M917
$$ 758785 758387 758832 760370 763332 768178 774762 782044 789001 795545 802201 809261 816602 823885 830421 835338
59854H35338L200K600L148L581L301L344M618O186O379N039L486K633K178J643
$$ 835338 838538 841138 844286 847867 851168 854512 859130 865316 871695 876734 880220 882853 885031 886674
59840H86674J275J660K970M682N783N388L603J667R08J655L320N094O217O144
$$ 886674 887949 889609 892579 897261 903044 908432 912035 913702 914610 916265 919585 924679 930896 937040
59826I37040N154M485N031O036N845L999J906J212K062L339M151M545M874M930
$$ 937040 942194 946679 951710 957746 963591 967590 969496 970708 972770 976109 980260 984805 989679 994609
59812I94609M060K087k65k049k951l133k541j065P10J749J788J667K113K881L388
$$ 994609 998669 1000756 1000491 998442 995491 992358 989817 988752 989462 991211 992999 994666 996779 999660 1003048
59797A003048L584L765M111M813O037P360P885P467O957O763N938L614N91j443
$$ 1003048 1006632 1010397 1014508 1019321 1025358 1032718 1040603 1048070 1055027 1061790 1067728 1071342 1071933 1070490
59783A070490j833j258p10j011k770n688q286r352r346r498j0081j0634j1154
$$ 1070490 1068657 1067399 1066689 1065678 1062908 1057220 1048934 1039582 1030236 1020738 1010657 1000023 988869
59770I88869j1643j1063q561n525m409n394o096n040l545l275l739l531k707k461
$$ 988869 977226 966163 957602 952077 947668 942274 936178 931138 927593 924318 920579 917048 914341 911880
59756I11880l205m327n346o172o549o157n110l726k194q91m55q22q57J93J327
$$ 911880 908675 904348 899002 892830 886281 880124 875014 871288 869094 868203 867748 866926 866069 866262 867589
59741H67589R34r31k400k091p40j45r68k005j732k29Q92N80l90q84j268k425l469
$$ 867589 868523 867592 865192 863101 862361 862216 861248 859243 857511 857282 858174 858754 858364 857480 856212 853787 850318
59724H50318k421M13K006N84j788k147o27N15N59O97J287J331O82M92R03M65j288
$$ 850318 847897 848310 850316 850900 849112 846965 846338 846853 847412 848109 849396 850727 851409 851901 852804 853269 851981
59707H51981k546j686L97J766K120K541L338L717L452L579N120P831J0321J1127
$$ 851981 849435 847749 848146 849912 852032 854573 857911 861628 865080 868659 873779 881610 891931 903058
59693I03058R852P704O718P905J0256J1924J2152J1608J1056J0537R867R279R106
$$ 903058 912910 920614 927332 935237 945493 957417 969569 981177 992233 1002770 1012637 1021916 1031022
59680A031022R184Q971Q321P710P494P109N519K620k82j861k218k312k346j730
$$ 1031022 1040206 1049177 1057498 1065208 1072702 1079811 1085330 1087950 1087668 1085807 1083589 1081277 1078931 1077201
59666A077201o04k60j516l505m679m490l604l012l365m563n569n287m066l473
$$ 1077201 1076597 1076337 1074821 1071316 1066637 1062147 1058543 1055531 1052166 1047603 1042034 1036747 1032681 1029208
59652A029208l999m130k706r98r65k237k723j682k44R99K671M547N030L548J645
$$ 1029208 1025209 1021079 1018373 1017375 1016410 1014173 1011450 1009768 1009524 1010523 1013194 1017741 1022771 1026319 1027964
59637A027964O84J73l98J5K073M079M071K826K490L001K362K45j321j255r94j838
$$ 1027964 1028648 1028821 1028423 1028438 1030511 1034590 1038661 1041487 1043977 1046978 1049340 1049585 1048264 1047009 1046015 1044177
59621A044177k801k428j216p75j668l375n450p410q200p270n826n732p118q237
$$ 1044177 1041376 1038948 1037732 1036957 1035289 1031914 1026464 1019054 1010854 1003584 997758 992026 984908 976671
59607I76671p731o107m795m424m348l521j674K00O70o03k309k729j408O42K059
$$ 976671 968940 962833 958038 953614 949266 945745 944071 944271 944941 944338 942029 939300 937892 938534 940593
59592I40593K259J791J871L229N123N874M702K548Q38N8j00j4k22j514l908o008
$$ 940593 942852 944643 946514 949743 954866 960740 965442 967990 968828 968886 968786 968772 968550 967036 963128 957120
59576I57120o357n196l997l602l686l792l854l812l762m372o039p646p330m874
$$ 957120 950763 945567 941570 937968 934282 930490 926636 922824 919062 914690 908651 901005 893675 888801
59562H88801k211j207j810k873l815m810o011p363q737r614r090o791l572p77
$$ 888801 886590 885383 883573 880700 876885 872075 866064 858701 849964 840350 831260 824469 820897 820120
59548H20120R41J670J550O86l12n02L41J256J115k2r59q10L4P11J084J574K096
$$ 820120 821061 822731 824281 824967 824655 824153 824494 825750 826865 826843 825884 825074 825108 825819 826903 828477 830573
59531H30573K144J908K174K745K229P9k224l098k977l270l993m039l359l136l830
$$ 830573 832717 834625 836799 839544 841773 841852 839628 836530 833553 830283 826290 822251 818892 815756 811926
59516H11926m482m235l276k173j408j527k489k932j642K78M23j349k310o01K186
$$ 811926 807444 803209 799933 797760 796352 794825 792336 789404 787762 788040 788463 787114 784804 784203 786389
59501G86389L327K483J477J544K131K022O97j092j694j49K400L903M154M905O830
$$ 786389 789716 792199 793676 795220 797351 799373 800070 798978 797284 797135 799535 803438 807592 812497 819327
59486H19327Q262P916P035P285Q111Q095P723Q739J1449J4528J7001J8573J8429
$$ 819327 827589 835505 842540 849825 857936 866031 873754 882493 893942 908470 925471 944044 962473
59473I62473J5646J0792N644J348j919l904m441m466n168o202o171m792l154j880
$$ 962473 978119 988911 994555 995903 993984 990080 985639 981173 976005 969803 963632 958840 955686 953806
59459I53806o13O90J470J625J436M80j784m352n464n144n153o089o590o028n875
$$ 953806 953193 953883 955353 956978 958414 958894 957110 952758 947294 942150 936997 930908 924318 918290 912415
59444I12415p190q630q422o996o199o776p873q322p414n130k535j150j212j362
$$ 912415 905225 896595 888173 881177 874978 868202 860329 852007 844593 839463 836928 835778 834566 833204
59430H33204p58k91p65j249n89N93J079J282K535M608N878N713N012M426L755
$$ 833204 832446 832155 831390 830141 829552 830145 831224 832506 835041 839649 845527 851240 856252 860678 864433
59415H64433L291L951N571O599O239N602N830O259N496L521J484J0j098j673r83
$$ 864433 867724 871675 877246 883845 890084 895686 901516 907775 913271 916792 918276 918286 917188 915515 914532
59400I14532R72K914L578L120K805L511M998O531P751Q682R166Q790P588O533
$$ 914532 915504 918418 921996 925116 927921 931432 936430 942961 950712 959394 968560 977350 984938 991471
59386I91471O702P829Q217O548L538J125J49m24j716l321m176m328m708n434n559
$$ 991471 998173 1006002 1014219 1020767 1024305 1025430 1025579 1025155 1023439 1020118 1015942 1011614 1006906 1001472 995913
59371I95913m691l616k870j846j33J392J871K107L579O271Q823J0587J2214J4140
$$ 995913 991222 987606 984736 982890 982757 984149 986020 988127 991706 997977 1006800 1017387 1029601 1043741
59357A043741J5937J7481J9510K2466K5768K8806L1637L3893L3882K9813K1701
$$ 1043741 1059678 1077159 1096669 1119135 1144903 1173709 1205346 1239239 1273121 1302934 1324635
59346A324635J1510J668n998j0507j1801j0664p964m035Q47N450P568N339j247
$$ 1324635 1336145 1337813 1331815 1321308 1309507 1298843 1290879 1286844 1287691 1293141 1300709 1306048 1304801
59333A304801r989j7658k2154k3750k4129k4243k3548k1417j8432j5815j3968
$$ 1304801 1294812 1277154 1255000 1231250 1207121 1182878 1159330 1137913 1119481 1103666 1089698
59322A089698j2279j0162p759n572l844k417r82O15K264L745M894N546N510M834
$$ 1089698 1077419 1067257 1059498 1053926 1050082 1047665 1046683 1047298 1049562 1053307 1058201 1063747 1069257 1074091
59308A074091L979L551L910N162P142Q993R317P551M972L590M049N447O938Q401
$$ 1074091 1078070 1081621 1085531 1090693 1097835 1106828 1116145 1123696 1128668 1132258 1136307 1141754 1148692 1157093
59294A157093R537R645Q868Q533R480J0853J1312J0836J0506J1003J2093J3267
$$ 1157093 1166630 1176275 1185143 1193676 1203156 1214009 1225321 1236157 1246663 1257666 1269759 1283026
59282A283026J4157J4472J4133J3512J3144J3169J3105J2086R522N874K572N44
$$ 1283026 1297183 1311655 1325788 1339300 1352444 1365613 1378718 1390804 1400326 1406200 1408772 1409316
59270A409316j011l462o598q766r278r337j0094j1172j1728j1787j1592j0913
$$ 1409316 1408305 1404843 1398245 1389479 1380201 1370864 1360770 1349598 1337870 1326083 1314491 1303578
59258A303578r931r712j0548j0875r143n994l230j476k11O14O64M48Q75J859K927
$$ 1303578 1293647 1283935 1273387 1262512 1253369 1247375 1244145 1242669 1242458 1243072 1243736 1244184 1245059 1246918 1249845
59243A249845M606P344R247P212Q03o815j2464j5836j8116j9504j9418j7996j6123
$$ 1249845 1254451 1261795 1271042 1278254 1279057 1272242 1259778 1243942 1225826 1206322 1186904 1168908 1152785
59230A152785j4541j3723j3872j4200j3169j0418p721o913p422p084n066k668
$$ 1152785 1138244 1124521 1110649 1096449 1083280 1072862 1065141 1058228 1050806 1043722 1038656 1035988
59218A035988j209l92P59K310L534M212N053O741R018J0994J2168J2805J3326
$$ 1035988 1034779 1034387 1035146 1037456 1040990 1045202 1050255 1056996 1066014 1077008 1089176 1101981 1115307
59205A115307J3673J3539J2844J1633R805P440N184L594K228J60k514m596n501
$$ 1115307 1128980 1142519 1155363 1166996 1176801 1184241 1189425 1193019 1195247 1195407 1192893 1188297 1182796
59192A182796o167p533q881q709o973n297m798m672l532j517k09n17j457j434
$$ 1182796 1176629 1169096 1160215 1151506 1144533 1139236 1134438 1129766 1126234 1124717 1124508 1123991 1122534 1121100
59178A121100k24R75J380J655K693L986M085K677J289J479K845L628L042K119
$$ 1121100 1120876 1121851 1123231 1124886 1127579 1131565 1135650 1138327 1139616 1141095 1143940 1147568 1150610 1152729
59164A152729J961J949O05k147m602n431n253n503o450p208p215o684n769m353
$$ 1152729 1154690 1156639 1157244 1155097 1150495 1145064 1139811 1134308 1127858 1120650 1113435 1106751 1100982 1096629
59150A096629k805k016k345l199l889m193l972l097k024j605j893j999j485j078
$$ 1096629 1093824 1091808 1089463 1086264 1082375 1078182 1074210 1071113 1069089 1067484 1065591 1063592 1062107 1061029
59136A061029j491k304k571j803lK270L563K513p7j480l28J716K690L146M549
$$ 1061029 1059538 1057234 1054663 1052860 1052857 1055127 1058690 1061203 1061126 1059646 1059318 1061034 1063724 1066870 1071419
59121A071419O260O400M967L754L528L530L574M315N322N210M184M216N989P721
$$ 1071419 1077679 1084079 1089046 1092800 1096328 1099858 1103432 1107747 1113069 1118279 1122463 1126679 1132668 1140389
59107A140389P937P453P493P655P177O677P124Q078Q428P943O861M836J673j632
$$ 1140389 1148326 1155779 1163272 1170927 1178104 1184781 1191905 1199983 1208411 1216354 1223215 1228051 1229724 1228092
59093A228092l886n216o372p215p268p233q407j0628j2151j1912j0853j0641j1647
$$ 1228092 1224206 1218990 1212618 1205403 1198135 1190902 1182495 1171867 1159716 1147804 1136951 1126310 1114663
59080A114663j2586j1939r613p219o480p371q335q314p722p235o723n990n495
$$ 1114663 1102077 1090138 1080525 1073306 1066826 1059455 1051120 1042806 1035084 1027849 1021126 1015136 1009641
59067A009641n371m694k809o07P57J763L704O387Q197Q419Q107Q441R379J0374
$$ 1009641 1004270 999576 996767 996160 996917 998680 1002384 1008771 1016968 1025387 1033494 1041935 1051314 1061688
59053A061688J1302J2146J2446J1720J0066Q133O659O045O031N967N638N476N539
$$ 1061688 1072990 1085136 1097582 1109302 1119368 1127501 1134160 1140205 1146236 1152203 1157841 1163317 1168856
59040A168856M947L158J214M86N14l41k167l051j910k05J46o55j129j063j612
$$ 1168856 1173803 1176961 1178175 1178661 1179175 1178834 1176667 1173616 1171706 1171501 1171647 1170992 1169863 1168800 1167188
59025A167188l032l832k761p56j22k040n452q312r589r773r737r594q955p974
$$ 1167188 1164156 1160324 1157563 1156807 1156685 1154645 1149193 1140881 1131292 1121519 1111782 1102188 1093233 1085259
59011A085259p504q126r381j0174r690p821n114k606j391j851l284m580n305n835
$$ 1085259 1077755 1069629 1060248 1050074 1040384 1032563 1027449 1024843 1023452 1021601 1018317 1013737 1008432 1002597
58997A002597o390o371m965k360L2P36m45k325l414l086j861q41p22j192j346
$$ 1002597 996207 989836 984871 982511 982543 983279 982834 980509 977095 974009 972148 971307 970585 969393 968047
58982I68047q30k88m61j081j239n89M74J715L231M555M614L258K052K665M961
$$ 968047 967217 966929 966468 965387 964148 963559 964033 965748 968979 973534 978148 981406 983458 986123 991084
58967I91084P415Q981R668R707R326R348J0750J3210J5116J5477J5073J5029J5035
$$ 991084 998499 1007480 1017148 1026855 1036181 1045529 1056279 1069489 1084605 1100082 1115155 1130184 1145219
58954A145219J3964J1782R705Q412P199N391L693L201L510K880N41k117l187k449
$$ 1145219 1159183 1170965 1180670 1189082 1196281 1201672 1205365 1208566 1212076 1214956 1215497 1213380 1210193 1207744
58940A207744j156j00J024K314K944K329J269J096K077L303L822L312K037Q31
$$ 1207744 1206588 1206488 1207512 1209826 1212770 1215099 1216368 1217464 1219541 1222844 1226666 1229978 1232015 1232846
58926A232846R66K943N345N866L943J579J069K427L842M211M268N229P194R308
$$ 1232846 1233812 1236755 1242100 1247966 1251909 1253488 1254557 1256984 1260826 1265037 1269305 1274534 1281728 1291036
58912A291036J0895J1935J2796J3988J5863J7927J8662J6903J3568J1131J0964
$$ 1291036 1301931 1313866 1326662 1340650 1356513 1374440 1393102 1410005 1423573 1434704 1445668
58901A445668J1898J2099J1521J1347J1505J0271O766K478n19k025l419n473p489
$$ 1445668 1457566 1469665 1481186 1492533 1504038 1514309 1521075 1523553 1523034 1521009 1517590 1512117 1504628
58888A504628q495q454q129q372r586j1483j3106j3472j2310j0120p627n466m220
$$ 1504628 1496133 1487679 1479550 1471178 1461592 1450109 1437003 1423531 1411221 1401101 1393474 1388008 1383788
58875A383788m284n476p055q226q555p979o780n595n052n136n175m790m511m880
$$ 1383788 1379504 1374028 1366973 1358747 1350192 1342213 1335433 1329838 1324786 1319650 1314475 1309685 1305174 1300294
58861A300294n182l994j425J79j154m109n330l581j095j20J66J763M254N452N177
$$ 1300294 1295112 1291118 1289693 1289872 1288718 1284609 1279279 1275698 1274603 1274483 1274649 1276412 1280666 1286118 1291295
58846A291295N858Q852J2396J4270J4664J4923J4976J3849J1991J1170J2132J3780
$$ 1291295 1297153 1306005 1318401 1332671 1347335 1362258 1377234 1391083 1403074 1414244 1426376 1440156
58834A440156J4735J4612J3767J2814J2420J2744J3013J2492J1824J2364J4123
$$ 1440156 1454891 1469503 1483270 1496084 1508504 1521248 1534261 1546753 1558577 1570941 1585064
58823A585064J5418J4854J2734J0146P530M764J935o78k987m833n759n642n449
$$ 1585064 1600482 1615336 1628070 1638216 1645746 1650510 1652445 1651767 1648780 1643947 1638188 1632546 1627097
58810A627097o593r380j2501j4303j4428j3979j4139j4795j4724j3143j0839r460
$$ 1627097 1620504 1611124 1598623 1584320 1569892 1555913 1541774 1526979 1512255 1499112 1488273 1478813
58798A478813r757j0886j1671j2157j3318j5317j6800j6501j4928j3637j3070
$$ 1478813 1469056 1458170 1446499 1434342 1421024 1405707 1388907 1372406 1357478 1343841 1330771
58787A330771j2270j0838r890j0319j1286j1508j1132j0982j0791r860q975r617
$$ 1330771 1318501 1307663 1297773 1287454 1276168 1264660 1253528 1242546 1231755 1221895 1212920 1203303
58775A203303j1267j1627r994q353q316q940q750p994p314n956l283q63o80j979
$$ 1203303 1192036 1180409 1170415 1162062 1153746 1144806 1136056 1128062 1120748 1114792 1111509 1110646 1109966 1107987
58761A107987k159n36R85J113R42J915L673M752M387K873R54n92j357j552j562
$$ 1107987 1105828 1105292 1106277 1107390 1108332 1110247 1113920 1118672 1123059 1125932 1126886 1126294 1124937 1123385 1121823
58746A121823j297n70J54J81m01r74j494k429l746n016o249p575q265p466n898
$$ 1121823 1120526 1119956 1120110 1120291 1119890 1118916 1117422 1114993 1111247 1106231 1099982 1092407 1084142 1076676 1070778
58731A070778n347o173o694n564l532k192k114k869l848m296l355r58J779L647
$$ 1070778 1065431 1059258 1052564 1047000 1043468 1041276 1039162 1036293 1032445 1028149 1024794 1023836 1025615 1029262
58717A029262M396M328L485J871K4j238j489j035q01j768l977o105o762o099n426
$$ 1029262 1033658 1037986 1041471 1043342 1043366 1042128 1040639 1039604 1038803 1037035 1033058 1026953 1020191 1014092 1008666
58702A008666n399n691o183p062p624o574m124k202j822j606N7K705M796N858
$$ 1008666 1003267 997576 991393 984331 976707 970133 966009 963807 961985 960379 960436 963141 967937 973795
58688I73795O223N666M000K362K206L143L432K649K339L679N740O770O265N227
$$ 973795 980018 985684 989684 992046 994252 997395 1000827 1003476 1005815 1009494 1015234 1022004 1028269 1033496
58674A033496M898N633O713P008O193N277N443O404O672N636M490M587N509N623
$$ 1033496 1038394 1044027 1050740 1057748 1063941 1069218 1074661 1081065 1087737 1093373 1097863 1102450 1107959 1113582
58660A113582M207K309J474K235M056O090P645Q341Q291P955P414O091L638R02
$$ 1113582 1117789 1120098 1121572 1123807 1127863 1133953 1141598 1149939 1158230 1166185 1173599 1179690 1183328 1184230
58646A184230q19j372j842k949m255n294o564q690j1384j3883j5834j7114j7522
$$ 1184230 1183411 1182039 1180197 1177248 1172993 1167699 1161135 1152445 1141061 1127178 1111344 1094230 1076708
58633A076708j7340j7423j7803j7128j4616j1736j0346r991q838o846n847o471
$$ 1076708 1059368 1041945 1024142 1007014 992398 980662 970316 960325 951487 944641 938794 932323
58621I32323p222p105o998p585p859o851n283m129k900p01J973L879M653M650
$$ 932323 925101 917996 910998 903413 895554 888703 883420 879291 876391 875690 877663 881542 886195 890845
58607H90845M007L131L243N011P084P371N565L265J936J782K312K866K723J649
$$ 890845 894852 897983 901226 906237 913321 920692 926257 929522 931458 933240 935552 938418 941141 942790
58593I42790K90q39k396n205q421r896q542n452k534q46m28q81j688k379k772
$$ 942790 943080 942241 939845 934640 926219 916323 907781 902329 899795 898949 898521 897640 895952 893573 890801
58578H90801k863k543j673m15P46J182L34j748l770l878j700P98J371K9j366j649
$$ 890801 887938 885395 883722 883307 884053 885235 885569 883821 880051 876173 874473 875271 876642 876671 875305 873656
58562H73656j370j359j432r56J79J584K796L357L092K647L267N480Q242R743R025
$$ 873656 872286 870927 869495 868539 868718 870302 873098 876455 879547 882194 885461 890941 899183 908926 917951
58547I17951O732M420L350L616M243M151L210K307K360L341M289M203K914J141
$$ 917951 924683 929103 932453 936069 940312 944463 947673 949980 952340 955681 959970 964173 967087 968228
58533I68228j03j75Q82K332L112K747K105K792N302Q175R591R532R502J0288J1015
$$ 968228 968125 967950 968832 971164 974276 977023 979128 981920 987222 995397 1004988 1014520 1024022 1034310 1045325
58518A045325J0732R951R902J0786J1581J1416J0592J0101J0437J1094J1366J1502
$$ 1045325 1056057 1066008 1075910 1086696 1098277 1109693 1120285 1130386 1140823 1151917 1163283 1174785
58506A174785J2647J5419J8961K1877K3611K4445K4695K4762K5431K6995K8395
$$ 1174785 1187432 1202851 1221812 1243689 1267300 1291745 1316440 1341202 1366633 1393628 1422023
58495A422023K8302K6822K4872K2157J7494J1323O074L363K227Q02j541m410p357
$$ 1422023 1450325 1477147 1502019 1524176 1541670 1552993 1559067 1562430 1564657 1565459 1563918 1559508 1552151
58482A552151r626j0242r426q990j0344j2995j5891j9057k2704k5757k6819k6033
$$ 1552151 1542525 1532283 1522857 1513867 1503523 1490528 1474637 1455580 1432876 1407119 1380300 1354267
58470A354267k4675k3311k1628j9718j8286j7572j6863j5180j2026p865m294l032
$$ 1354267 1329592 1306281 1284653 1264935 1246649 1229077 1212214 1197034 1185008 1177143 1172849 1169817
58458A169817m024n217m920l787l548m478n181m522k808j251r60k204m086n195
$$ 1169817 1165793 1160576 1155656 1151869 1148321 1143843 1138662 1134140 1131332 1130081 1129121 1126917 1122831 1117636
58444A117636m993m101l093j835l91N05N80N95J074J480J494J962L531N300O000
$$ 1117636 1112643 1108542 1105449 1103614 1103223 1103728 1104308 1104903 1105977 1107457 1108951 1110913 1114444 1119744 1125744
58429A125744N655N065M552M343N160P125Q931R509R692J0969J3298J5513J7102
$$ 1125744 1131399 1136464 1141016 1145359 1150519 1157644 1166575 1176084 1185776 1196745 1210043 1225556 1242658
58416A242658J8217J8624J8110J7231J6376J4830J2127R338P414N273J479k935
$$ 1242658 1260875 1279499 1297609 1314840 1331216 1346046 1358173 1367511 1374925 1380198 1381677 1378742
58404A378742n442n403m447l836l466l251l381l143j408J507M118N937P661R256
$$ 1378742 1373300 1367897 1363450 1359614 1356148 1352897 1349516 1346373 1344965 1346472 1350590 1356527 1364188 1373444
58390A373444R781R269Q876Q785P705M907J221k372n640q198r363r390r503j0142
$$ 1373444 1383225 1392494 1401370 1410155 1417860 1422767 1423988 1421616 1415976 1407778 1398415 1389025 1379522 1369380
58376A369380j0455r902r022q081o393l718j170J65P11J770L861O179P554P784
$$ 1369380 1358925 1349023 1340001 1331920 1325527 1321809 1320639 1320804 1321515 1323285 1327146 1333325 1340879 1348663
58362A348663Q061R585J1636J2023J0044P729O907O442M198O49j822k681l761
$$ 1348663 1356724 1366309 1377945 1389968 1400012 1407741 1414648 1421090 1425288 1425937 1424115 1421434 1417673
58349A417673o001q016q469p874p331p059o778o328n439l994k610j859j084P60
$$ 1417673 1411672 1403656 1395187 1387313 1379982 1372923 1366145 1359817 1354378 1350384 1347774 1345915 1344831 1345591
58335A345591L256M995N690O176O529N962M720M240N076O187O541O198N638N282
$$ 1345591 1348847 1353842 1359532 1365708 1372237 1378199 1382919 1387159 1392235 1398422 1404963 1411161 1416799 1422081
58321A422081N551O333O725O488O937Q868J0578J0048Q108P186P656Q120Q579
$$ 1422081 1427632 1433965 1440690 1447178 1454115 1462983 1473561 1483609 1491717 1498903 1506559 1514679 1523258
58308A523258J0324J2902J4293J4251J4524J5633J6277J6135J6363J7007J6904
$$ 1523258 1533582 1546484 1560777 1575028 1589552 1605185 1621462 1637597 1653960 1670967 1687871
58297A687871J6372J6887J7908J7346J5546J5111J6183J5802J3014J0669J0612
$$ 1687871 1704243 1721130 1739038 1756384 1771930 1787041 1803224 1819026 1832040 1842709 1853321
58286A853321J1060J0588J0809J2777J4271J3338J1457J0634J0379J0102J1347
$$ 1853321 1864381 1874969 1885778 1898555 1912826 1926164 1937621 1948255 1958634 1968736 1980083
58275A980083J4722J7579J7986J8240K0905K3922K3672K0979J9861K1359K2678
$$ 1980083 1994805 2012384 2030370 2048610 2069515 2093437 2117109 2138088 2157949 2179308 2201986
58264B201986K1997K0504J9492J8557J7216J5930J5021J4209J3540J3561J4580
$$ 2201986 2223983 2244487 2263979 2282536 2299752 2315682 2330703 2344912 2358452 2372013 2386593
58253B386593J6603J9528K2669K4880K5978K7072K8868L0895L2925L5496L8197
$$ 2386593 2403196 2422724 2445393 2470273 2496251 2523323 2552191 2583086 2616011 2651507 2689704
58242B689704L9485L9199L9274M0711M2044M2121M2093M3021M3811M3453M3098
$$ 2689704 2729189 2768388 2807662 2848373 2890417 2932538 2974631 3017652 3061463 3104916 3148014
58231C148014M3943M5059M5497M6509M9414N3105N5840N7921O0310O2392O3395
$$ 3148014 3191957 3237016 3282513 3329022 3378436 3431541 3487381 3545302 3605612 3668004 3731399
58220C731399O4548O7465P1597P5348P8569Q2153Q6277R0528R4730R8493J01340
$$ 3731399 3795947 3863412 3935009 4010357 4088926 4171079 4257356 4347884 4442614 4541107 4642447
58209D642447J04052J08046J12994J17386J21946J29233J39069J48090J55165
$$ 4642447 4746499 4854545 4967539 5084925 5206871 5336104 5475173 5623263 5778428
58200E778428J63316J74383J86008J96254K07030K20083K33487K45362K57352
$$ 5778428 5941744 6116127 6302135 6498389 6705419 6925502 7158989 7404351 7661703
58191G661703K71252K85815L00061L15918L34210L52109L68257L86363M09639
$$ 7661703 7932955 8218770 8518831 8834749 9168959 9521068 9889325 10275688 10685327
58182A0685327M35560M60347M84811N11440N39800N69440O03372O43745O87632
$$ 10685327 11120887 11581234 12066045 12577485 13117285 13686725 14290097 14933842 15621474
58173A5621474P31725P77248Q25764Q74738R22466R72741J029063J089021J150035
$$ 15621474 16353199 17130447 17956211 18830949 19753415 20726156 21755219 22844240 23994275
58164B3994275J215434J288602J366732J447532J536539J639844J754818J876267
$$ 23994275 25209709 26498311 27865043 29312575 30849114 32488958 34243776 36120043
58156C6120043K006584K151149K309036K477424K659942K861373L080081L316165
$$ 36120043 38126627 40277776 42586812 45064236 47724178 50585551 53665632 56981797
58148E6981797L581329L889744M244956M646792N104017N628689O227385O913204
$$ 56981797 60563126 64452870 68697826 73344618 78448635 84077324 90304709 97217913
58140I7217913P718503Q681204R829341J1194460J2821570J4735281J6901419
$$ 97217913 104936416 113617620 123446961 134641421 147462991 162198272 179099691
58133A79099691J9242339K1676422K4128169K6544265K8931459L1256828L3089633
$$ 179099691 198342030 220018452 244146621 270690886 299622345 330879173 363968806
58126C63968806L3291042L0321022K3232039J2573882L27639j1120706k0085324
$$ 363968806 397259848 427580870 450812909 463386791 463714430 452593724 432508400
58119D32508400k5990562k9097544l0041385k9515169k8113425k6264330k4233314
$$ 432508400 406517838 377420294 347378909 317863740 289750315 263485985 239252671
58112B39252671k2173013k0167741j8256759j6456847j4782860j3247676j1851934
$$ 239252671 217079658 196911917 178655158 162198311 147415451 134167775 122315841
58105A22315841j0587764r449991q433858p527230o717148o001196n382226m854447
$$ 122315841 111728077 102278086 93844228 86316998 79599850 73598654 68216428 63361981
58097F3361981m403375m015778l680534l383280l110464k857882k627625k418266
$$ 63361981 58958606 54942828 51262294 47879014 44768550 41910668 39283043 36864777
58089C6864777k225006k046838j885616j739426j604092j480116j371168j276420
$$ 36864777 34639771 32592933 30707317 28967891 27363799 25883683 24512515 23236095
58081B3236095j190579j111021j038870r73579r12269q54660q03414p58994p18485
$$ 23236095 22045516 20934495 19895625 18922046 18009777 17155117 16351703 15592709 14874224
58072A4874224o79710o42752o07345n72487n38793n08085m80498m54480m29339
$$ 14874224 14194514 13551762 12944417 12371930 11833137 11325052 10844554 10390074 9960735
58063I960735m05491l82928l61730l43010l27049l11707k95109k78622k64657
$$ 9960735 9555244 9172316 8810586 8467576 8140527 7828820 7533711 7255089 6990432
58054F990432k52889k41232k29184k17617k06418j94983j84010j74438j65801
$$ 6990432 6737543 6496311 6267127 6049510 5843092 5648109 5464099 5289661 5123860
58045E123860j57709j51491j48041j45638j42347j38964j37010j35328j31562
$$ 5123860 4966151 4814660 4666619 4520981 4378634 4239670 4102660 3967332 3835770
58036C835770j25809j20070j15148j10598j06658j03713j00917r7594r4847r3472
$$ 3835770 3709961 3589891 3474743 3364145 3257487 3153774 3052857 2955263 2860416 2766944
58026B766944r1769q7913q3047p9352p6444p2566o8087o4808o2685o0136n6814
$$ 2766944 2675175 2587262 2504215 2424863 2348419 2275853 2207766 2142958 2080273 2020137 1963323
58015A963323n3419m9634m5017m0998l9166l8338l6193l3011l0890k9902k8231
$$ 1963323 1909904 1860270 1815253 1774255 1735089 1696751 1660558 1627547 1596657 1566755 1538524
58004A538524k5620k3448k1646j8853j5787j5151j7504k0117k0719j9960j9356
$$ 1538524 1512904 1489456 1467810 1448957 1433170 1418019 1400515 1380398 1359679 1339719 1320363
57993A320363j9187j9324k0048k1034k1117j9921j8334j6881j5102j3019j1765
$$ 1320363 1301176 1281852 1261804 1240770 1219653 1199732 1181398 1164517 1149415 1136396 1124631
57982A124631j2076j3285j4258j4524j4188j3660j3536j3921j3965j2899j1273
$$ 1124631 1112555 1099270 1085012 1070488 1056300 1042640 1029104 1015183 1001218 988319 977046
57971I77046j0392j0922j2767j5461j7694j7453j4230j0349q600r149j0196j0746
$$ 977046 966654 955732 942965 927504 909810 892357 878127 867778 859178 850029 839833 829087
57959H29087j0932j0452q837o992o381o916p347p364p458p195n814m286m395n669
$$ 829087 818155 807703 798866 791874 785493 778577 771230 763866 756408 749213 743399 739113 734718 729049
57945G29049n529k987q0J073P41K62n3o38j405j857j863j723j802k295l010l616
$$ 729049 723520 720533 720453 721526 722267 722529 722476 721838 720433 718576 716713 714990 713188 710893 707883 704267
57929G04267m362n812p316o910m035j096p04k248l147k667k271k695l156l339
$$ 704267 699905 694093 686777 679867 675832 674736 674032 671784 668637 665970 663699 661004 657848 654509
57915F54509l769m010k844o74M59k20j269j589j780k370k639k282k237k797k604
$$ 654509 650740 646730 643886 643212 643671 643451 642182 640593 638813 636443 633804 631522 629285 626488 623884
57900F23884p91J306J848P33j043k966m654m960l010K60K749L192J846k39j853
$$ 623884 623093 624399 626247 626980 625937 622971 618317 613357 610347 610607 613356 616548 618394 618155 616302
57885F16302k005o31J090J699Q66l61o44K74J230R62l4M06L444P261Q798P227
$$ 616302 614297 613666 614756 616455 617321 616960 616316 616590 617820 618782 618748 619154 622598 629859 638657 645884
57869F45884M482K554J533M69j162l256n407o989p575p428p005o101m346k333
$$ 645884 650366 652920 654453 654922 653760 650504 645097 638108 630533 623105 616100 609999 605653 603320
57855F03320j195j167j579k214l479n083n741m633k310k6J232J142L63J68R68
$$ 603320 602125 600958 599379 597165 593686 588603 582862 578229 575919 575893 577125 578267 578630 578798 579766
57840E79766J573R53Q3N18J771J954Q51J78P06J229Q80M63O53P40J37l94j33K57
$$ 579766 581339 582292 582375 582893 584664 586618 587469 587647 588353 589582 590462 590925 591578 592318 592455 592061 591928 592185
57822E92185j88j292k261k790l020l158l589m393m636l303j186l96j647l496m649
$$ 592185 591997 590705 588444 585654 582634 579476 575887 571494 566858 563555 562369 561973 560326 556830 552181
57807E52181n261n481m564k476n47N79K006M382O241O115M919M536N126N427M898
$$ 552181 546920 541439 536875 534399 533852 534431 536437 540819 547060 553175 558094 562630 567756 573183 578081
57792E78081M085L454L217L645M407M371L183K082J945J665K3j878j996o03q2
$$ 578081 582166 585620 588837 592482 596889 601260 604443 606525 608470 610135 610158 608280 606284 605681 605599
57777F05599j566l613m476m159l715l693l791l486k662j953k235l374m049l317
$$ 605599 604033 600420 595944 591785 588070 584377 580586 577100 574438 572485 570250 566876 562827 559510
57763E59510j888r32m23L86J317J511R97P09Q80N81p88k578l881m715n765p166
$$ 559510 557622 556690 556267 556653 557970 559481 560478 561187 562067 562648 561860 559282 555401 550686 544921 537755
57747E37755q074p597o160n430o288p276o171l129q15j033k708l945m444m592
$$ 537755 529681 522084 515924 510494 504206 496930 490759 487630 486815 485782 483074 479129 474685 470093
57733D70093l802j578Q40J949K343L576N212N259L391J556J023R78O38Q22K382
$$ 470093 466291 464713 465553 467502 469845 473421 478633 483892 487283 488839 489862 490840 491478 492300 494682
57718D94682M594O258P287Q159Q669Q267P033N450L725K082J201J527K518L097
$$ 494682 499276 505534 512821 520980 529649 537916 544949 550399 554124 556206 557407 558934 561452 564549
57704E64549K704J350q04l316n178n487m471l360l003l044k641j770j303j775
$$ 564549 567253 568603 567799 564483 559305 553818 549347 545987 542984 539940 537299 535529 534226 532451
57690E32451k460k250j216n84j005j702j786j577j806k124j534j22P72K39j134
$$ 532451 529991 527741 526525 525941 524936 523234 521448 519871 518065 515941 514407 514285 515057 515296 514162
57675E14162k086j795j18K556N241O783O726N543L898K080K94j033j501j140l26
$$ 514162 512076 510281 510163 512719 517960 524743 531469 537012 540910 542990 543284 542251 540750 539610 539284
57660E39284M47P98P08O05Q64J282J313Q91N96R09J452J261j97k272l653l816
$$ 539284 539731 540529 541237 541842 542706 543988 545301 546192 546788 547697 549149 550410 550213 547941 544288 540472
57644E40472l726m502n709n770m192k239j045k30Q44J672J629J321J506J332n94
$$ 540472 536746 532244 526535 520765 516573 514334 513289 513059 513903 515575 517204 518525 520031 521363 520769
57629E20769l652n414m598k395o24J63L53L59N87J412K635L678M601O226R036
$$ 520769 517117 511703 507105 504710 504086 504249 504602 504961 505548 506960 509595 513273 517874 524100 533136
57614E33136J2658J6513K0150K2962K4744K6670L0412L5682L9687L9653L5027
$$ 533136 545794 562307 582457 605419 630163 656833 687245 722927 762614 802267 837294
57603H37294K6791J5936L588q249j7469k3295k6444k8130k9269l0137l0357k9504
$$ 837294 864085 880021 883609 875360 857891 834596 808152 780022 750753 720616 690259 660755
57591F60755k7834k5948k3711k0493j6536j2997j0286p650m986l573m087n189
$$ 660755 632921 606973 583262 562769 546233 533236 522950 515300 510314 506741 502654 497465
57579D97465n270m468l671k757j476r39k059l235k039Q66K093K63k094k495j999
$$ 497465 492195 487727 484056 481299 479823 478884 476825 473590 471551 472417 474510 474773 472679 470184 468185
57564D68185k884m549m346j815L77Q3j768l056l317l455l611k914j164N12J052
$$ 468185 465301 460752 456406 454591 454968 455051 453283 450227 446910 443455 439844 436930 435766 436278 437330
57549D37330O60K85L88O00K17j166l055m057l088q93N12K53n01p00j160k858m616
$$ 437330 437990 438275 438663 439263 439480 438314 435259 431202 428114 427221 427733 427986 427485 426785 425625 422767 418151
57532D18151m391k423r27p38n51R7l38k416l812k243J234L722M044K996J178j212
$$ 418151 413760 411337 410410 409672 409121 409218 408880 406464 402652 400409 401643 405365 409409 412405 413583 412371
57516D12371l122l438k796k721l126k722j686j737l228m274l501j729k13J044
$$ 412371 409249 405811 403015 400294 397168 394446 392760 391023 387795 383521 380020 378291 378078 379122
57502C79122K227K637J946J200J266J382N95l51O2J865L655M463M352L510J971
$$ 379122 381349 383986 385932 387132 388398 389780 390375 390024 390086 391951 395606 400069 404421 407931 409902
57487D09902K69p36q59p60r86j393j483r72l5P74J009R61J363K297K894K512J611
$$ 409902 410171 409435 408576 407816 406830 405437 403954 402982 402947 403721 404730 405691 407054 409351 412245 414757 416368
57470D16368J025R42J173J792K925M269N447O373O950P015P122Q404J0865J2847
$$ 416368 417393 418335 419508 421300 424225 428494 433941 440314 447264 454279 461401 469805 480670 493517
57456D93517J3167J2849J3367J4069J3042J0070O853M431K255K8j464j958k553
$$ 493517 506684 519533 532900 546969 560011 570081 576934 581365 583620 583648 582184 580226 577673
57443E77673m094n970p316q237q938q921q094p655q541r685r231p042m768l575
$$ 577673 573579 567609 560293 552056 543118 534197 526103 518448 509907 500222 490991 483949 479181 475606
57429D75606l035k364j551q93k64N92J502K081K296K421K582K672K696K927L465
$$ 475606 472571 470207 468656 467763 467499 468091 469593 471674 473970 476391 478973 481645 484341 487268 490733
57414D90733L787L155J603J80k36R8M52Q90J911L025K860J188k23L76K580M484
$$ 490733 494520 497675 499278 499458 499222 499320 499772 500662 502573 505598 508458 509646 509423 509799 512379 516863
57398E16863N011M672M299M023L603K939K078J162O14R07J925K841K816J775M39
$$ 516863 521874 526546 530845 534868 538471 541410 543488 544650 545264 546171 548096 550937 553753 555528 555967
57383E55967k83N5J182K406L224L585L750L992M434M788M426L071J493Q40J250
$$ 555967 555684 555739 556921 559327 562551 566136 569886 573878 578312 583100 587526 590597 592090 592930 594180
57368E94180J751J808K071L008L765L432K798L398M986N526M081K339K341L706
$$ 594180 595931 597739 599810 602818 606583 610015 612813 616211 621197 626723 630804 633143 635484 639190
57354F39190M398L754L320M501O584P765P447O626O327O539O719O515N754M451
$$ 639190 643588 647342 650662 655163 661747 669512 676959 683585 689912 696451 703170 709685 715439 719890
57340G19890L347L633N358O674N877L931L653O062Q856R282P474N783N521N845
$$ 719890 723237 726870 732228 738902 744779 748710 752363 758425 767281 776563 784037 789820 795341 801186
57326H01186N791N881O965Q445Q719P238N349M928O537R141J1181J1684J0640
$$ 801186 806977 812858 819823 828268 836987 844225 849574 854502 861039 870180 881361 893045 903685
57313I03685Q870P507P139P250O890N965N358N584O056O201O544P776R337J0097
$$ 903685 912555 920062 927201 934451 941341 947306 952664 958248 964304 970505 977049 984825 994162 1004259
57299A004259J0034J0023J0071R263P656O722P313Q468Q984R026R293R611R393
$$ 1004259 1014293 1024316 1034387 1043650 1051306 1058028 1065341 1073809 1082793 1091819 1101112 1110723 1120116
57286A120116Q724Q083P663P803R148J1311J2281J0647P906O975Q557J0461J0594
$$ 1120116 1128840 1136923 1144586 1152389 1161537 1172848 1185129 1195776 1203682 1210657 1219214 1229675 1240269
57273A240269R313Q426R015J0748J2455J2941J1862J0246R656J0616J2198J3370
$$ 1240269 1249582 1258008 1267023 1277771 1290226 1303167 1315029 1325275 1334931 1345547 1357745 1371115
57261A371115J4110J4940J5866J6292J5917J5242J5087J5607J6100J5967J5656
$$ 1371115 1385225 1400165 1416031 1432323 1448240 1463482 1478569 1494176 1510276 1526243 1541899
57250A541899J6026J6912J7104J6040J4749J4592J5650J6877J7250J6382J4674
$$ 1541899 1557925 1574837 1591941 1607981 1622730 1637322 1652972 1669849 1687099 1703481 1718155
57239A718155J3380J3675J5084J5692J4768J4157J5907J9331K1876K2287K1553
$$ 1718155 1731535 1745210 1760294 1775986 1790754 1804911 1820818 1840149 1862025 1884312 1905865
57228A905865K0981K0889K1164K1741K2266K2402K2645K3923K6198K8265K9033
$$ 1905865 1926846 1947735 1968899 1990640 2012906 2035308 2057953 2081876 2108074 2136339 2165372
57217B165372K8421K7114K6138K6365K7650K8746K8831K8663K9296L0234L0148
$$ 2165372 2193793 2220907 2247045 2273410 2301060 2329806 2358637 2387300 2416596 2446830 2476978
57206B476978K8918K7614K6684K5621K4316K3327K2828K2574K2777K3719K4712
$$ 2476978 2505896 2533510 2560194 2585815 2610131 2633458 2656286 2678860 2701637 2725356 2750068
57195B750068K4917K5024K6316K8229K8732K7420K6225K6481K7224K7201K6816
$$ 2750068 2774985 2800009 2826325 2854554 2883286 2910706 2936931 2963412 2990636 3017837 3044653
57184C044653K7008K7605K7987K8292K8961K9953L1205L2996L5237L7328L9243
$$ 3044653 3071661 3099266 3127253 3155545 3184506 3214459 3245664 3278660 3313897 3351225 3390468
57173C390468M1684M4659M6952M7593M6767M4824M1805L8492L6488L6180L5896
$$ 3390468 3432152 3476811 3523763 3571356 3618123 3662947 3704752 3743244 3779732 3815912 3851808
57162C851808L4074L1115K8132K5154K1765J8384J5493J2644R745Q442J0374J4440
$$ 3851808 3885882 3916997 3945129 3970283 3992048 4010432 4025925 4038569 4048314 4056756 4067130 4081570
57150D081570J7616J8573J8980K0962K4520K8067L0461L1797L2703L3654L4922
$$ 4081570 4099186 4117759 4136739 4157701 4182221 4210288 4240749 4272546 4305249 4338903 4373825
57139D373825L6686L9001M1871M5328M9175N2601N4587N5164N5784N7634N9882
$$ 4373825 4410511 4449512 4491383 4536711 4585886 4638487 4693074 4748238 4804022 4861656 4921538
57128D921538O0759O0142N9475N9100N7731N5325N4153N5404N6812N5658N2481
$$ 4921538 4982297 5042439 5101914 5161014 5218745 5274070 5328223 5383627 5440439 5496097 5548578
57117E548578M9509M7000M3880M0644L8544L6800L3879L0937L0480L1806L1267
$$ 5548578 5598087 5645087 5688967 5729611 5768155 5804955 5838834 5869771 5900251 5932057 5963324
57106E963324K7430K2652J9071J6357J4041J2700J1776R428N900M203O199J0653
$$ 5963324 5990754 6013406 6032477 6048834 6062875 6075575 6087351 6096779 6102679 6106882 6113081 6123734
57094F123734J6315K4000L4136M4909N4452O2500O8677P1601P1031O8708O5921
$$ 6123734 6140049 6164049 6198185 6243094 6297546 6360046 6428723 6500324 6571355 6640063 6705984
57083F705984O2591N9386N7869N7558N5907N2442M9827M9648N0195M9732M8666
$$ 6705984 6768575 6827961 6885830 6943388 6999295 7051737 7101564 7151212 7201407 7251139 7299805
57072G299805M7224M4449M1027L9523M0111L9445L5087K7437J6059j304k4127
$$ 7299805 7347029 7391478 7432505 7472028 7512139 7551584 7586671 7614108 7630167 7628863 7604736
57061G604736m7935o9940r1487j13014j31593j46131j60099j76304j93738k12275
$$ 7604736 7556801 7486861 7395374 7282360 7150767 7004636 6844537 6668233 6474495 6262220
57051F262220k34958k62574k91614l20725l53253l89993m26049m58633m90925
$$ 6262220 6027262 5764688 5473074 5152349 4799096 4409103 3983054 3524421 3033496
57042C033496n24078n53036n74799n92527A82308d30034o10749o15240o37676
$$ 3033496 2509418 1956382 1381583 789056 182308 -430034 -1040783 -1656023 -2293699
57033b293699o80492p47706q49283r87333j157583j377211j689454k125469k693468
$$ -2293699 -2974191 -3721897 -4571180 -5558513 -6716096 -8093307 -9782761 -11908230 -14601698
57024a4601698l432076m422005n656265o889771p699009p752913p018012n701820
$$ -14601698 -18033774 -22455779 -28112044 -35001815 -42700824 -50453737 -57471749 -63173569
57016f3173569m064074k330004p20116N57590J394355J828486J987566K003115
$$ -63173569 -67237643 -69567647 -70287763 -69730173 -68335818 -66507332 -64519766 -62516651
57008f2516651J979563J997174K102757K299814K563221K860305L154250L403378
$$ -62516651 -60537088 -58539914 -56437157 -54137343 -51574122 -48713817 -45559567 -42156189
57000d2156189L573925L652107L639046L541462L372999L155711K910810K650975
$$ -42156189 -38582264 -34930157 -31291111 -27749649 -24376650 -21220939 -18310129 -15659154
56992a5659154K385376K125739J881912J656969J451850J270235J114381R80937
$$ -15659154 -13273778 -11148039 -9266127 -7609158 -6157308 -4887073 -3772692 -2791755
56984b791755Q65394P66654d75970A36498N49395M94884M49168M09373L73779
$$ -2791755 -1926361 -1159707 -475970 136498 685893 1180777 1629945 2039318 2413097
56975B413097L44667L23687L08561K97339K90828K86723K75999K50348K10626
$$ 2413097 2757764 3081451 3390012 3687351 3978179 4264902 4540901 4791249 5001875
56966E001875J64433J18876P9336N1079L6101K9849K5367J9696J3497O898n16
$$ 5001875 5166308 5285184 5364520 5415599 5451700 5481549 5506916 5526612 5540109 5547007 5546491
56955E546491p504j2798j7737k4169l1152l6735m1565m7555n4179n9211o2286
$$ 5546491 5538987 5526189 5508452 5484283 5453131 5416396 5374831 5327276 5273097 5213886 5151600
56944E151600o4934o7767p0320p3101p7421q3388r0000r6854j04126j11292j17284
$$ 5151600 5086666 5018899 4948579 4875478 4798057 4714669 4624669 4527815 4423689 4312397 4195113
56933D195113j21618j24517j26694j29617j34637j41052j46528j50392j54813
$$ 4195113 4073495 3948978 3822284 3692667 3558030 3416978 3270450 3120058 2965245
56924B965245j61669j70075j78156j85233j90753j93098j91377j86868j80902
$$ 2965245 2803576 2633501 2455345 2270112 2079359 1886261 1694884 1508016 1327114
56915A327114j72889j62023j49384j36514j23409j09748r6647q5284p5062o4976
$$ 1327114 1154225 992202 842818 706304 582895 473147 376500 291216 216154 151178
56905A51178n5591m7772G097b6026k5379j8651j2954p899m498m210o567r416j1243
$$ 151178 95587 47815 7097 -26026 -51405 -70056 -83010 -90909 -95407 -99617 -106184 -115600 -126843
56892a26843j2170j3068j4646j6766j8076j7255j4998j3336j2497j0521o823l647
$$ -126843 -139013 -152081 -166727 -183493 -201569 -218824 -233822 -247158 -259655 -270176 -276999 -280646
56880b80646k375q94L069Q108J1343J2885J5197J8935K2244K3751K3683K2241
$$ -280646 -283021 -283915 -280846 -272738 -261395 -248510 -233313 -214378 -192134 -168383 -144700 -122459
56868a22459J9009J4016P833Q18o320j1859j4558j5202j5124j4128j1681r096
$$ -122459 -103450 -89434 -81601 -80783 -87103 -98962 -113520 -128722 -143846 -157974 -169655 -178751
56856a78751q210q410p442n071l571m295n844o232n170l565k103r45R2J528L617
$$ -178751 -186961 -195371 -202813 -207884 -211455 -215750 -221594 -227826 -232996 -236561 -238664 -239609 -239517 -237989 -234372
56841b34372N659O563O189N478N416O392Q267J0483J2453J4272J6429J8535J9478
$$ -234372 -228713 -222150 -215961 -210483 -205067 -198675 -190408 -179925 -167472 -153200 -136771 -118236 -98758
56828i8758J9472K0360K2720a2099I832J6831J1297O141N18n150q988j0418I243
$$ -98758 -79286 -58926 -36206 -12099 9832 26663 37960 44101 44619 39469 30481 20063 9243
56814a843j0496q490n873l450r14K125N207P861e466G793J6216J8984K1886K5255
$$ -1843 -12339 -20829 -26702 -30152 -31066 -28941 -23734 -15873 -5466 7793 24009 42993 64879 90134
56800I0134K8489L0085K8534K3274J5165O297j012n449p332q240r675j1559j2240
$$ 90134 118623 148708 177242 200516 215681 221978 220966 215517 208185 199945 190270 178711 166471
56787A66471j0481p131l915j125K191O060R655J3487J9191K6409L2281L5274L7142
$$ 166471 155990 148859 144944 143819 146010 152070 161725 175212 194403 220812 253093 288367 325509
56774C25509L9406M0101L6468K9040K0417J1243M77j1026k0192k5136k6608k5950
$$ 325509 364915 405016 441484 470524 490941 502184 502661 491635 471443 446307 419699 393749
56762C93749k3676k0335j6733j3018q945n185k793j389O29M009Q219J2911J8054
$$ 393749 370073 349738 333005 319987 311042 305857 303064 301675 302304 306313 314532 327443 345497
56749C45497K2597K4776K4069K1467J7619J2149N007k876j0461j6993k1588k3902
$$ 345497 368094 392870 416939 438406 456025 468174 473181 470305 459844 442851 421263 397361
56737C97361k5052k6345k7056k5225k0854j6469j4002j2746j1044q544n890l403
$$ 397361 372309 345964 318908 293683 272829 256360 242358 229612 218568 210024 204134 200731
56725B00731j029J230L446N683P417P733O371L795K18m481r738j4198j6948j8034
$$ 200731 199702 200932 204378 210061 217478 225211 231582 235377 235595 231114 221376 207178 190230 172196
56711A72196j7790j6623j5455j5216j5673j5749j5161j4676j4604j4156D415f143
$$ 172196 154406 137783 122328 107112 91439 75690 60529 45853 31249 17093 4415 -6143
56698a4745p202o439o150n804m974l957l256k706j978j480j730k153j795j002
$$ -14745 -21947 -28386 -34536 -40340 -45314 -49271 -52527 -55233 -57211 -58691 -60421 -62574 -64369 -65371
56684f5371r62j767k407k638l168l929l813k551j278p17k95M49Q96N80J33L17
$$ -65371 -66333 -68100 -70507 -73145 -76313 -80242 -84055 -86606 -87884 -88601 -88896 -88447 -87551 -86971 -86838 -86521
56668h6521J012J769K399K639K173J446J354J729J220p19k737l151j893k47P29
$$ -86521 -85509 -83740 -81341 -78702 -76529 -75083 -73729 -72000 -70780 -71499 -74236 -77387 -79280 -79527 -78798
56653g8798J001J145J503J708J193M16P03K283L424K717J207O66Q15L55rJ509
$$ -78798 -77797 -76652 -75149 -73441 -72248 -71832 -71129 -68846 -65422 -62705 -61498 -60832 -60017 -59662 -59671 -58162
56637e8162M011M202J208j756j714M83K419L649N118O703P454P242O603N669b425
$$ -58162 -54151 -49949 -48741 -50497 -52211 -51728 -49309 -45660 -40542 -33839 -26385 -19143 -12540 -6871 -2425
56621G21J393D77d610o113l313P66K410J036j045k246k861l113k348o22O26K48
$$ 721 2114 477 -4610 -10723 -14036 -13270 -10860 -9824 -10869 -13115 -15976 -19089 -21437 -22059 -21433 -21185
56605b1185j289k811l925n034o244o800n809l470j213j73J69J164L022M663N463
$$ -21185 -22474 -25285 -29210 -34244 -40488 -47288 -53097 -56567 -57780 -57953 -57784 -56620 -53598 -48935 -43472
56590d3472N890O228O065N544N664O636b39F301N494N070M758L647K140J236R60
$$ -43472 -37582 -31354 -25289 -19745 -14081 -7445 -239 6301 11795 16865 21623 25270 27410 28646 29606
56575B9606Q02R12J466J518J19j797k222q45M51J78r57j300m88L96M97K96Q11
$$ 29606 30408 31320 32786 34304 34423 32626 30404 29559 30010 30188 29231 27931 27443 27839 28336 28632 29443
56558B9443K033K810K440J678J512J598J017J16P1O59L44j031j445M24K993L681
$$ 29443 31476 34286 36726 38404 39916 41514 42531 42647 42718 43377 43721 42690 41245 41669 44662 48343
56542D8343K010l91j978k374j912j208q28p32m71j22j56j49R48K774L370J972
$$ 48343 50353 49962 47984 45610 43698 42490 41662 40930 40459 40337 40181 40032 40980 43754 47124 49096
56526D9096M47O38J747J932J166P16P72N02n3j3P04J287J418J493J744K145K748
$$ 49096 49543 50181 51928 53860 55026 55742 56514 57016 56963 56950 57654 58941 60359 61852 63596 65741 68489
56509F8489L137K375P17L17K602N819P160O766P321R853J2359J2941J2132J1195
$$ 68489 71626 74001 74718 75035 77637 83456 90616 97382 104703 114556 126915 139856 151988 163183
56495A63183R912P423M124J513M88N29L45r08k790l950l625k580k010j986j762
$$ 163183 173095 180518 184642 186155 186643 187172 187517 186609 183819 179869 176244 173664 171654 169668 167906
56480A67906j271j273k033k930l413l552l552l458l367l302k904j885o67Q5L47
$$ 167906 166635 165362 163329 160399 156986 153434 149882 146424 143057 139755 136851 134966 134299 134384 134731
56465A34731M94M98J76k0O32K087L570M397M137K477j10k109k478k146k698l939
$$ 134731 135225 135723 135899 135879 136511 138598 142168 146565 150702 153179 153069 150960 148482 146336 143638 139699
56449A39699m140k715j076m60k85N77J861K134N64k097m136m303k755o70J014
$$ 139699 135559 132844 131768 131308 131023 131600 133461 135595 136159 134062 129926 125623 122868 122198 123212
56434A23212K100K404J492k55j223l05J557K640K681K613K477J279j016k777k641
$$ 123212 125312 127716 129208 128953 127730 127425 128982 131622 134303 136916 139393 140672 139656 136879 134238
56419A34238j163M3K27R4O81J896K381J142p86j244K80J909K065J560J835K450
$$ 134238 133075 133118 133345 133439 134120 136016 138397 139539 138753 137509 137789 139698 141763 143323 145158 147608
56403A47608J916L37o66l30M87P64K08j026k189j815O86L648M640L198Q48r77
$$ 147608 149524 149861 149195 148865 149352 150116 150324 149298 147109 145294 145980 149628 154268 157466 158314 157337
56387A57337j695r31R65K245J612M12Q62K468K588O22j051p44M46J070J474K308
$$ 157337 155642 154711 155676 157921 159533 159945 160807 163275 165863 166485 165434 164690 165136 166206 167680 169988
56371A69988K840K233J008N7n62r06n11N95J496J719J806J974J558N05j7P51K176
$$ 169988 172828 175061 176069 176126 175564 174658 174147 174742 176238 177957 179763 181737 183295 183800 183783 184534 186710
56354A86710L454M411M618L377J325L18Q69J458J109P97J264J505O71l26n78n73
$$ 186710 190164 194575 199193 202570 203895 204213 205082 206540 207649 208446 209710 211215 211886 211560 210982 210409
56338B10409n66M54K507L445K036J88j03N0j107k234r61J610K083j02k205k693
$$ 210409 209843 210297 212804 216249 218285 218473 218370 218420 217313 215079 214118 215728 217811 217709 215504 212811
56322B12811k907l802m242l447k443j955j120M93J683J645J497K477M004M781
$$ 212811 209904 206102 201860 198413 195970 194015 192895 193388 195071 196716 198213 200690 204694 209475
56308B09475M554L799K782J964K187L445M379L982K914K253J877J163M52O06J599
$$ 209475 214029 217828 220610 222574 224761 228206 232585 236567 239481 241734 243611 244774 245226 245832 247431
56293B47431K544K866K624J978J186Q28J327K289K930K964K674K302J872J502
$$ 247431 249975 252841 255465 257443 258629 259457 260784 263073 266003 268967 271641 273943 275815 277317
56279B77317J479J999K985L975M199L241J796J196J923L129L876M184M383M221
$$ 277317 278796 280795 283780 287755 291954 295195 296991 298187 300110 303239 307115 311299 315682 319903
56265C19903L464K817L201M244M570L634K455K203K694K827K024Q37K67P81J932
$$ 319903 323367 326184 329385 333629 338199 341833 344288 346491 349185 352012 354036 354873 355140 355921 357853
56250C57853K765K709K153K018K775M083N356O343P039P398P442P445P638P808
$$ 357853 360618 363327 365480 367498 370273 374356 379712 386055 393094 400492 407934 415379 423017 430825
56236D30825P552O926O604P156Q310R147R153Q912R466J0863J1792J1145R666
$$ 430825 438377 445303 451907 459063 467373 476520 485673 494585 504051 514914 526706 537851 547517
56223E47517R179J0258J1657J2360J3061J4724J6747J7901J8426J9645K1701K3332
$$ 547517 556696 566954 578611 590971 604032 618756 635503 653404 671830 691475 713176 736508
56211G36508K4000K4640K5946K7416K8661L0101L1748L2835L3583L5679L9818
$$ 736508 760508 785148 811094 838510 867171 897272 929020 961855 995438 1031117 1070935
56200A070935M4293M7568N0804N5947O2453O8167P2714P7661Q3703Q9921R6004
$$ 1070935 1115228 1162796 1213600 1269547 1332000 1400167 1472881 1550542 1634245 1724166 1820170
56189A820170J03033J11589J20747J29340J36774J42435J45948J48123J49973
$$ 1820170 1923203 2034792 2155539 2284879 2421653 2564088 2710036 2858159 3008132
56180C008132J50539J47581J40688J31610J20902J06593Q7393O5254M3088K1521
$$ 3008132 3158671 3306252 3446940 3578550 3699452 3806045 3893438 3958692 4001780 4023301
56170D023301l96k2479m3196o1511p7493r1468j03667j14222j22662j27998j30045
$$ 4023301 4022905 4000426 3957230 3895719 3818226 3726758 3623091 3508869 3386207 3258209 3128164
56159C128164j30029j29235j27899j25872j23214j19430j13548j06009r9011r3747
$$ 3128164 2998135 2868900 2741001 2615129 2491915 2372485 2258937 2152928 2053917 1960170
56149A960170q8740q2474p6158p1737o8445o3848n7817n2710m9617m6934m3325
$$ 1960170 1871430 1788956 1712798 1641061 1572616 1508768 1450951 1398241 1348624 1301690 1258365
56138A258365l9820l7840l6755l4836l1567k7879k4694k2287k0615j9369j7788
$$ 1258365 1218545 1180705 1143950 1109114 1077547 1049668 1024974 1002687 982072 962703 944915
56127I44915j5169j1747q670o950o551o563o261n699n198m574l396j905r21o35
$$ 944915 929746 917999 909329 902379 895828 889265 883004 877305 872107 867533 864137 862232 861311 860676
56113H60676j39J459L923O196P380P281O548O403P574R279J0094R955J0409J2503
$$ 860676 860537 861996 865919 872115 879495 886776 893324 899727 907301 916580 926674 936629 947038 959541
56099I59541J5422J7732J9004J9731K0550K2107K4709K7580K9497L0660L2748
$$ 959541 974963 992695 1011699 1031430 1051980 1074087 1098796 1126376 1155873 1186533 1219281
56088A219281L6471M0561M4093M8265N4586O2607P0825P8649Q5938R1838R5706
$$ 1219281 1255752 1296313 1340406 1388671 1443257 1505864 1576689 1655338 1741276 1833114 1928820
56077A928820R8076R8985R6483Q9001P8421O8665O1552N6179N1786M8784M6700
$$ 1928820 2026896 2125881 2222364 2311365 2389786 2458451 2520003 2576182 2627968 2676752 2723452
56066B723452M3587L8326L1968K6031K0654J4981Q365P25p686j6768k7287m0509
$$ 2723452 2767039 2805365 2837333 2863364 2884018 2898999 2907364 2908089 2900403 2883635 2856348 2815839
56054B815839n6102p1012q1750q7456q9510q8923q5833q1053p5964p0794o4774
$$ 2815839 2759737 2688725 2606975 2519519 2430009 2341086 2255253 2174200 2098236 2027442 1962668
56043A962668n8143n2214m7200m1865l5758l0118k5872k2295j8377j4297j0811
$$ 1962668 1904525 1852311 1805111 1763246 1727488 1697370 1671498 1649203 1630826 1616529 1605718
56032A605718q154o133m475k685l79K021L662M482N128N854O387O867P810R142
$$ 1605718 1597564 1591431 1586956 1584271 1583892 1585913 1589575 1594057 1599185 1605039 1611426 1618293 1626103 1635245
56018A635245J0375J1611J3269J4966J5937J6470J7682J9857K2284K4624K7131
$$ 1635245 1645620 1657231 1670500 1685466 1701403 1717873 1735555 1755412 1777696 1802320 1829451
56007A829451K9614L1437L2523L3248L3633L3817L4790L7128L9513M0202L9595
$$ 1829451 1859065 1890502 1923025 1956273 1989906 2023723 2058513 2095641 2135154 2175356 2214951
55996B214951L9503M0293M0692M0208L9670L9574L9913M1291M3977M6179M5896
$$ 2214951 2254454 2294747 2335439 2375647 2415317 2454891 2494804 2536095 2580072 2626251 2672147
55985B672147M4333M4766M7863N1071N3025N5326N9117O2983O5704O8389P2163
$$ 2672147 2716480 2761246 2809109 2860180 2913205 2968531 3027648 3090631 3156335 3224724 3296887
55974C296887P6053P8768Q0726Q2931Q5546Q8723R3048R8068J02294J05671J10204
$$ 3296887 3372940 3451708 3532434 3615365 3700911 3789634 3882682 3980750 4083044 4188715 4298919
55963D298919J17185J25558J33955J42268J50456J57966J65348J74384J85722
$$ 4298919 4416104 4541662 4675617 4817885 4968341 5126307 5291655 5466039 5651761
55954E651761J98382K11988K27019K42405K56020K68304K82153K98219L13924
$$ 5651761 5850143 6062131 6289150 6531555 6787575 7055879 7338032 7636251 7950175
55945G950175L28442L44714L64558L85594M05537M25911M48811M73480M99184
$$ 7950175 8278617 8623331 8987889 9373483 9779020 10204931 10653742 11127222 11626406
55936A1626406N28104N61908N98332O34655O71841P11832P53473P94989Q38239
$$ 11626406 12154510 12716418 13314750 13949405 14621246 15333078 16086551 16881540 17719779
55927A7719779Q86513R39897R96228J054928J116729J181722J250885J327539
$$ 17719779 18606292 19546189 20542417 21597345 22714074 23895796 25146681 26474220
55919B6474220J414090J509299J611733J723347J846680J981177K125501K280765
$$ 26474220 27888310 29397609 31009342 32732689 34579369 36560546 38686047 40966812
55911D0966812K448823K631283K833662L066371L337803L650687M008859M421854
$$ 40966812 43415635 46046918 48880580 51946951 55284754 58935441 62944300 67366154
55903F7366154M898560N443744O068066O795649P655433Q672445R874234J1294057
$$ 67366154 72264714 77708458 83776524 90572173 98227606 106900051 116774285 128068342
55895A28068342J2953659J4848730J6960472J9269363K1744132K4327501K6921812
$$ 128068342 141022001 155870731 172831203 192100566 213844698 238172199 265094011
55888B65094011K9296082L0889616L0721784K7703271K1306884J2094546J603121
$$ 265094011 294390093 325279709 356001493 383704764 405011648 417106194 418709315
55881D18709315q357706j6448122k2109134k5426744k6830380k6846513k5952781
$$ 418709315 410351609 393903487 371794353 346367609 319537229 292690716 266737935
55874B66737935k4510202k2759154k0855126j8906172j6993086j5177994j3506676
$$ 266737935 242227733 219468579 198613453 179707281 162714195 147536201 134029525
55867A34029525j2004719j0675068r504824q475626p568119o763378o047636n415525
$$ 134029525 122024806 111349738 101844914 93369288 85801169 79037791 72990155 67574630
55859F7574630m865309m391836l985677l635955l330844l058360k810585k585450
$$ 67574630 62709321 58317485 54331808 50695853 47365009 44306649 41496064 38910614
55851C8910614k381875k195757k023453j865813j724686j597762j480823j373014
$$ 38910614 36528739 34332982 32309529 30443716 28719030 27121268 25640445 24267431
55843B4267431j275788j188177j107231j031990r63380r00931q43248p90838p44964
$$ 24267431 22991643 21803466 20696235 19664245 18700865 17799934 16956686 16165848 15420884
55834A5420884p04217o65632o28645n94634n63018n31415m99662m70161m43958
$$ 15420884 14716667 14051035 13422390 12827756 12264738 11733323 11233661 10763500 10319542
55825A0319542m19770l97361l78420l63064l48507l32656l16471l01431k86994
$$ 10319542 9899772 9502411 9123991 8760927 8412420 8079764 7763293 7461862 7174868
55816G174868k72289k58235k46047k35043k23766k12327k01975j92994j84433
$$ 7174868 6902579 6644344 6398297 6163254 5939488 5727161 5525186 5332192 5147759
55807E147759j75617j66848j58847j52267j47379j43676j40089j36181j32616
$$ 5147759 4972142 4805294 4646447 4494180 4346801 4203125 4063036 3926855 3794239
55798C794239j29908j27148j22862j16930j11012j06759j04106j01661r8669r5990
$$ 3794239 3664331 3537183 3414321 3297391 3186379 3079620 2975514 2873853 2775184 2679194
55788B679194r4726r4170r2113q7446q1574p6600p2954o9731o6631o4156o2114
$$ 2679194 2584468 2490298 2398185 2310739 2229165 2152565 2079611 2009880 1943249 1879093 1816979
55777A816979n9402n5565n1436m7889m4844m1872l8967l6256l3533l0505k7140
$$ 1816979 1757577 1702012 1650576 1602687 1557843 1515971 1477004 1440748 1407215 1376710 1349570
55766A349570k3714k0873j9451j9487j9654j8670j7181j7046j8588j9895j9402
$$ 1349570 1325856 1304983 1285532 1266045 1246391 1227721 1210540 1193494 1174906 1155011 1135609
55755A135609j7885j7099j7488j8148j8253j7554j6175j4788j4362j4859j4837
$$ 1135609 1117724 1100625 1083137 1064989 1046736 1029182 1013007 998219 983857 968998 954161
55744I54161j3246j0964r489q861q111p144o593o192n064l602l208l836l663j971
$$ 954161 940915 929951 920462 911601 903490 896346 889753 883561 878497 874895 871687 867851 864188 862217
55730H62217n84j171k619k703j414p46j643l021l912m914o994j0037j3228j5962
$$ 862217 861633 860462 857843 855140 853726 852980 851337 848316 844404 839490 832496 822459 809231 793269
55716G93269j7813j8284j7316j5653j4090j2691j1035r002o981n555n152n616
$$ 793269 775456 757172 739856 724203 710113 697422 686387 677385 670404 664849 659697 654081
55704F54081o088n765m991m890n711o328o016n903p576j0670j2943j2751j0603
$$ 654081 647993 642228 637237 632347 626636 620308 614292 608389 600813 590143 577200 564449 553846
55691E53846q163o641o360p030p895q116p542o823o457o097n245m275m156n165
$$ 553846 545683 539042 532682 525652 517757 509641 502099 495276 488819 482722 477477 473202 469046 463881
55677D63881o336o408n162l617k915l128l250k407r25M3l01j816l860n807p078
$$ 463881 457545 451137 445975 442358 439443 436315 433065 430658 429733 429776 429475 427659 423799 417992 410914
55662D10914p240o555n993o206o553n746l609j641j346k213k134kK811M165L828
$$ 410914 403674 397119 391126 384920 378367 372621 369012 367371 366025 363812 361678 361676 364487 368652 372480
55647C72480L384L661L548J946l41j779k408l531n374o597o406n837o251p515
$$ 372480 375864 379525 383073 385019 384678 382899 380491 376960 371586 364989 358583 352746 346495 338980
55633C38980q455q478p977p440o836n687l523n62J925K575J633R67J774K992K777
$$ 338980 330525 322047 314070 306630 299794 294107 290584 290022 291947 294522 296155 297122 298896 301888 304665
55618C04665J009p19j303j173j201j554j902j916j323j51Q54P80k24r14n61J61
$$ 304665 305674 304955 303652 302479 301278 299724 297822 295906 294583 294432 295286 296066 295842 294928 294367 294528
55602B94528K80j54n00o05o87m81N13J953K774K544J968J765J687J124J01q58
$$ 294528 294808 294654 294154 293549 292862 292381 292894 294847 297621 300165 302133 303898 305585 306709 306810 305952
55586C05952j514j933j997j516p61k01J91O31N74q98l366m891m366l233l686n725
$$ 305952 304438 302505 300508 298992 298231 298030 298221 298852 299426 298528 295162 290271 285905 282672 278986 273261
55570B73261p369p421o546n533m224k782k398l592m938m775l416k388k167k032
$$ 273261 265892 258471 251925 246392 242168 239386 236988 233396 228458 223683 220267 217879 215712 213680
55556B13680j666j375q78N11K296K869J565m60j910k647l005k939k616k777l593
$$ 213680 212014 210639 209761 210272 212568 215437 217002 216542 214632 211985 208980 206041 203425 200648 197055
55541A97055m065l360j980p43M24J623J866L08j954k919k258j278m25J264L775
$$ 197055 192990 189630 187650 186907 187331 188954 190820 191128 189174 186255 183997 182719 182294 183558 187333
55526A87333N081L748J247K88J530L253L866L389K606K091K275L431N142O447
$$ 187333 192414 196162 197409 197697 199227 202480 206346 209735 212341 214432 216707 220138 225280 231727
55512B31727O963P258P847Q414Q411P887P165O137M467K179l94k963n156o476
$$ 231727 238690 245948 253795 262209 270620 278507 285672 291809 296276 298455 298061 295098 289942 283466
55498B83466o964p536q792r842r346p647o591p006p634p177o090n425n029m223
$$ 283466 276502 268966 260174 250332 240986 233339 226748 219742 212108 204931 198841 193416 188387 184164
55484A84164l447l578m146l841k654j788j326K5K332L497K107l33j372p61m8K6
$$ 184164 180717 177139 172993 169152 166498 164710 163384 163409 165741 169238 171345 171012 169640 168879 168831 168857
55468A68857L2K75M08N02R46J232L09j643l114l278k851k653k550k333k405k938
$$ 168857 168889 169164 169572 170074 171020 172252 172561 170918 167804 164526 161675 159022 156472 154139 151734 148796
55452A48796l388l408l334l166k319j088j044k766m446m194k787k296k759k292
$$ 148796 145408 142000 138666 135500 133181 132093 131049 128283 123837 119643 116856 114560 111801 109509
55438A09509m03J105R75K43K18M14k20j274j564j026n61l67J10Q30R76L14l48
$$ 109509 109106 110211 111186 111429 111647 112061 111841 110567 109003 107977 107416 107049 107159 107989 108965 109279 108931
55421A08931k93L21J025J640J949J511K51j146j904j912j551j044l65L79Q34O77
$$ 108931 108638 108959 109984 111624 113573 115084 115335 114189 112285 110373 108822 107778 107413 107792 108626 109303
55405A09303q3j048j687j727j265m10R25K545L494K749M64j965l250l166k127
$$ 109303 109220 108172 106485 104758 103493 103083 104008 106553 110047 112796 113260 111295 108045 104879 102752
55390A02752o25P23J261J046Q15Q39M61n88j311p99K12L84k38o40q19j631k735
$$ 102752 102127 102850 104111 105157 105972 106811 107272 106684 105373 104574 104786 105170 104932 104292 103473 101842 99107
55373I9107k525o63J006R65n6o21o42o75n04R8K57o44j356m20J202J340J28oJ748
$$ 99107 96582 95919 96925 97890 97834 97213 96571 95896 95392 95490 95747 95103 93747 93327 94529 95869 95997 95991 97739
55354I7739L063J899n13j536o24O32J054R83J171J839K686L122K626J376J38p32
$$ 97739 100802 102701 102188 100652 100028 100660 101714 102697 103868 105707 108393 111515 114141 115517 115655 114923
55338A14923j531k043j363L75J244j22k321k984k177k064l331l979k281P45K809
$$ 114923 113392 111349 109986 110361 111605 111483 109162 106178 104001 101937 98606 94627 92346 93091 95900
55323I5900L112K541J928J264L67n78j242j468j396j330j319q98K95J666K081
$$ 95900 99012 101553 103481 104745 105112 104534 103292 101824 100428 99098 97779 96881 97176 98842 100923
55308A00923J374O51P19Q97P7j519k462j821p0J537K038J247k37j429j713j337
$$ 100923 102297 102948 103667 104564 104641 103122 100660 98839 98769 100306 102344 103591 103354 101925 100212 98875
55292I8875r50p51m56L3M05M96N99P90L86j322l707m886l655j127L27k03j180
$$ 98875 97925 97174 96718 96751 97156 97652 98251 99041 99427 98105 94398 89512 85857 84730 85057 84854 83674
55275H3674p27J010K363K488K139K180K452K449K290K310K335J983J316O36l0
$$ 83674 82947 83957 86320 88808 90947 93127 95579 98028 100318 102628 104963 106946 108262 108898 108868
55260A08868o43p70j57N10K36q90j713j616j342j763k436k181q90J30p2o21J34
$$ 108868 108225 107455 107298 107808 108044 107154 105441 103825 102483 100720 98284 96103 95213 95343 95271 94650 94784
55243I4784K306L998L476J171r93j797j524q86k05K37M7n51o15J78P34j19j867
$$ 94784 97090 101088 104564 105735 104742 102945 101421 100535 100330 100567 100614 100063 99448 99626 100360 100241 98374
55226I8374k897k599j865j422q11M52J658J814J224J116J753J982R56n28j166
$$ 98374 95477 92878 91013 89591 88780 89232 90890 92704 93928 95044 96797 98779 99735 99207 98041
55211I8041r58r72j476j407j0J955L235L623L570K875R91j429k625j835l11L73
$$ 98041 97083 96111 94635 93228 93218 95173 98408 102031 105601 108476 109467 108038 105413 103578 103267 103640
55195A03640J80k4j52q21j959k715k857l069l577l488k095o5J399K039K345K387
$$ 103640 103820 103796 103644 102823 100864 98149 95292 92223 88646 85158 83063 82998 84397 86436 88781 91168
55179I1168J834J037Q89J446J648R48K78O38J450J382K96p38j140j274j234n90
$$ 91168 93002 94039 94928 96374 98022 98970 99248 99886 101336 102718 103014 102276 101136 99862 98628 98038
55163I8038L34L28q58j813j531r74j376k061j479K25J473J670J672J951J990J678
$$ 98038 98372 98700 97842 96029 94498 93524 92148 90087 88608 88833 90306 91976 93648 95599 97589 99267
55147I9267J604J662J005j50l56P48J602J133L89N13O12p16k733l265j620P63
$$ 99267 100871 102533 103538 103388 103032 103780 105382 106515 106904 107417 108029 107313 104580 101315 99695 100458
55131A00458K359K943K965K706K232J449L18o37n08P58J925J947J162L98k14o20
$$ 100458 102817 105760 108725 111431 113663 115112 115430 114793 114285 115043 116968 118915 120077 120475 120261 119641
55115A19641k94N91N60r72k107r98J020J230k31p41M57J216L96k18Q06K008J511
$$ 119641 119347 119938 120498 119526 117419 116421 117441 118671 118440 117699 118156 119372 119768 119550 120356 122364 123875
55098A23875L9n32r8J22j00j25n3m66j046j138j131j760k342j478O41K187K168
$$ 123875 123914 123382 123284 123406 123306 123181 123128 122662 121616 120478 119347 117587 115245 113767 114408 116595 118763
55081A18763J481J164Q29m35k494m249m903m542l666k512r53R36K492L019K703
$$ 118763 120244 121408 122237 121802 119308 115059 110156 105614 101948 99436 98483 99419 101911 104930 107633
55066A07633K502K886L300L118K487J809J066J70o32j262k107l175l657l098k283
$$ 107633 110135 113021 116321 119439 121926 123735 124801 124971 124339 123077 120970 117795 114138 111040 108757
55051A08757k028j815q10M22O25k0j0J155K276K360J872J535J053p4j235j218
$$ 108757 106729 104914 104104 104526 105151 105131 105121 106276 108552 110912 112784 114319 115372 115298 114063 112845
55035A12845J73J684J848M41j310j869q98N07J142R74P17O73O67Q79J801L258
$$ 112845 113018 114702 116550 116991 115681 113812 112914 113421 114563 115537 116254 116927 117594 118473 120274 123532
55019A23532M253L982K527M90j419k446k179j079j04L03L91L92L50O58J715K916
$$ 123532 127785 131767 134294 134784 133365 130919 128740 127661 127557 127860 128251 128643 128993 129651 131366 134282
55003A34282K874J160r57j948j622q62m53o16j123j390q82J14O25K44k84j52M43
$$ 134282 137156 138316 137359 135411 133789 132927 132474 131858 130735 129345 128463 128577 129202 129446 129162 129010 129453
54986A29453Q11P64M81p2r19j597j597j034l72J07J02r27k845m063k779Q06M281
$$ 129453 130264 131028 131509 131437 130518 128921 127324 126290 125918 126025 126127 125200 122355 118292 115513 116319 120600
54969A20600N314L717J192m67p36m22o00j361j641o10J002J582O48n46o27K53
$$ 120600 125914 129631 130823 130356 129620 129198 128598 127237 125596 124986 125988 127570 128218 127672 127045 127298
54953A27298Q21K95r20j824j621j26J999L429L104J318m30r82o64n90r94q67N80
$$ 127298 128119 128414 127494 125670 124049 123923 125922 129351 132455 133773 133343 132361 131697 131107 130113 129246 129826
54936A29826K560L405K440P88M4M43O95l46k065k525p49J826K677J069j122j641
$$ 129826 132386 135791 138231 139019 139063 139506 140201 139855 137790 135265 134516 136342 139019 140088 138966 137325
54920A37325l59J120J631J348Q23K40k84n95q66j290j234K73K816M394L673J579
$$ 137325 136966 138086 139717 141065 141888 142128 141844 141249 140383 139093 137859 138132 140948 145342 149015 150594
54904A50594j6m86m82n42p92j451k349k307l95K172K856R01j617k413j460j51
$$ 150594 150578 150092 149610 149068 148276 146825 144476 142169 141774 143946 146802 147703 146086 143673 142213 142062
54888A42062Q67J733K007Q86j114k070q95J157J998J234L78O59J466J334k8j351
$$ 142062 142929 144662 146669 147555 146441 144371 143476 144633 146631 147865 148243 148902 150368 151702 151674 150323
54872A50323j373k97N57K79p59j395q04Q23K506L310L152K758K790L033K676J454
$$ 150323 148950 148653 149210 149489 148730 147335 146531 147354 149860 153170 156322 159080 161870 164903 167579 169033
54856A69033K83N26K594N452P526Q016P301O228N359M764M153L037J093j256l019
$$ 169033 169316 169842 172436 177888 185414 193430 200731 206959 212318 217082 221235 224272 225365 224109 221090
54841B21090l712l936m332m444l512k191k224m073n947n915m160k315j227m79
$$ 221090 217378 213442 209110 204666 201154 198963 196739 192666 186719 180804 176644 174329 173102 172623
54827A72623K49M60l00j619k477k025j90K019L107K493J211O97J146J701J893
$$ 172623 172872 173332 173032 171413 168936 166911 166721 168740 171847 174340 175551 176248 177394 179095 180988
54812A80988K045K461L192M546O668Q505Q399O200L708K399J699L00j725l190
$$ 180988 183033 185494 188686 193232 199900 208405 216804 223004 226712 229111 230810 231110 229385 226195
54798B26195l599l518l374l043k692l032m294n602n825m802l477k889l190l593
$$ 226195 222596 219078 215704 212661 209969 206937 202643 197041 191216 186414 182937 180048 176858 173265
54784A73265l322k543k104k296k441j976j491k022l524m792m878l988k840j693
$$ 173265 169943 167400 165296 163000 160559 158583 157092 155070 151546 146754 141876 137888 135048 133355
54770A33355m12R59K082K636K465J585L96k22M62K070L079K209j49k224k747k125
$$ 133355 132943 133902 135984 138620 141085 142670 143066 142844 143306 145376 148455 150664 150515 148291 145544 143419
54754A43419j572j513j513j345j237r93J16K096L701L783K656J458N98k32r02
$$ 143419 141847 140334 138821 137476 136239 135246 135362 137458 141159 144942 147598 149056 149654 149422 148520
54739A48520p55K33J134J225Q46O58O29L61L8L82J497K362J897M00o24k36P81
$$ 148520 147765 147998 149132 150357 151203 151861 152490 152851 152889 153271 154768 157130 159027 159427 158803 158567 159348
54722A59348J000K64j93M50J586K222K202J792R13l90j221p30N77J365J269J145
$$ 159348 160348 160612 160419 160869 162455 164677 166879 168671 169584 169194 167973 167243 167820 169185 170454 171599
54706A71599J595K246K717L270M114M890N366N897O701P290P151O383N286L833
$$ 171599 173194 175440 178157 181427 185541 190431 195797 201694 208395 215685 222836 229219 234505 238338
54692B38338K092O37j09n12j185k113k915l565m337n248o077o679o929o601n783
$$ 238338 240430 241067 240958 240446 239261 237148 234233 230668 226331 221083 215006 208327 201398 194797 189014
54677A89014m995m449l613k069l69O24R09R88Q46J35p62r81m46R7M55J278K690
$$ 189014 184019 179570 175957 173888 173519 174143 175052 176040 176886 177021 176259 175278 174832 174929 175384 176662 179352
54660A79352L662L464K870L161M447N683N998N344M123K866K094J933J882J444
$$ 179352 183014 186478 189348 192509 196956 202639 208637 213981 218104 220970 223064 224997 226879 228323
54646B28323P68K12n13j998l971n247n177m461m112m121l802l098k733l024l320
$$ 228323 229091 229303 228790 226792 222821 217574 212397 207936 203824 199703 195901 192803 190070 187046 183726
54631A83726l026k581k777l450l528k410p07N51R23N78j51q49j066p81n93j000
$$ 183726 180700 178119 175342 171892 168364 165954 165247 165798 166721 167299 167148 166299 165233 164452 163859 162859
54615A62859j633j636p12N48J252R10j75r01k25J504K468J388p50j871j459q97
$$ 162859 161226 159590 158878 159426 160678 161588 161413 160512 160287 161791 164259 165647 164897 163026 161567 160670
54599A60670j178j673j620j478j859k061r61J178K927L517L376K914J916L99q36
$$ 160670 159492 157819 156199 154721 152862 150801 149840 151018 153945 157462 160838 163752 165668 166067 165231
54584A65231j140r20j165k190l249l246j679R24L298M288L665K196R60N35N68
$$ 165231 164091 163171 162006 159816 156567 153321 151642 152566 155864 160152 163817 166013 166973 167508 168076
54569A68076P9j515l461m052k352N64K505K224L20j658k461j738j08J144J057
$$ 168076 168155 166640 163179 159127 156775 157339 159844 162068 162388 160730 158269 156531 156423 157567 158624
54554A58624Qo52k22N42M58o81k179l381l907l266j203J494L226L181K172J503
$$ 158624 158632 157980 157758 158300 158758 158077 155898 152517 148610 145344 144141 145635 148861 152042 154214 155717
54538A55717J366R78P0o39n37OL03K67J79M3j64J9R11J737J247n67k262k695k146
$$ 155717 157083 158061 158131 157492 156955 156961 157264 157531 157710 157753 157589 157608 158519 160256 161503 160936 158674 155979 153833
54519A53833j348m23N74R34K07p78p88J36Q28O06j41p49p85J41J997L711L926
$$ 153833 152485 152062 152636 153570 153777 152999 152211 152347 153175 153781 153640 152891 152106 152247 154244 157955 161881
54502A61881K541O97p90j956k619k123o67L30M1n66k22Q19J449J486J549J571
$$ 161881 164422 165119 164329 162373 159754 157631 156964 157294 157335 156769 156547 157366 158815 160301 161850 163421
54486A63421Q96k19l82J196L572N087N010L841K490J482Q14K74j93m32l85j95
$$ 163421 164317 164098 163716 164912 168484 173571 178581 182422 184912 186394 187208 187482 187289 186857 186472 186277
54470A86277L1K57K18m61j529k083j693j025q17q08l80L02P22J083J783K168J167
$$ 186277 186308 186565 186783 186322 184793 182710 181017 179992 179175 178367 177987 178289 179011 180094 181877 184045 185212
54453A85212q13j992j592p83p94j297j449j347j411j251l56O83Q10J03m65n82
$$ 185212 184399 182407 180815 180032 179238 177941 176492 175145 173734 172483 172127 172810 173620 173723 173258 172676
54437A72676q48j397j444n42O01J028O79K69M43J376K703L525K982J208n15r92
$$ 172676 171828 170431 168987 168445 169046 170074 170753 171022 171465 172841 175544 179069 182051 183259 182744 181752
54421A81752k45P52J241J153P45K80M1K19O22P90O59Q20J882L493M308L154K63
$$ 181752 181507 182259 183500 184653 185398 185678 185719 185938 186560 187350 188009 188829 190711 194204 198512 201666 201929
54404B01929k743m194l690k116n67N04J112J108K69r96j598r16K05L29n81r05
$$ 201929 199186 194992 191302 189186 188619 189123 190235 191343 191612 190616 189018 188102 188307 188636 188055 187150
54388A87150M34K203K337P60n31l16K74l31j838k883l216l635m074l319q87J996
$$ 187150 187584 189787 192124 192884 192353 192037 192311 191980 190142 187259 184043 180408 176334 173015 172128 174124
54372A74124L935M842N329N319M161J828o93k230k363j643j008q37n56M96J947
$$ 174124 178059 182901 188230 193549 197710 199538 198845 196615 194252 192609 191601 190764 190208 190704 192651
54357A92651K725K545K156J942J247l63k084k903k846k415j510K3J521K374L211
$$ 192651 195376 197921 200077 202019 203266 202903 200819 197916 195070 192655 191145 191168 192689 195063 198274
54342A98274M646N458L841M53j783j418r9K63N1M43J111J150J085J916L043L072
$$ 198274 202920 208378 212219 212672 210889 209471 209372 209635 209686 210129 211240 212390 213475 215391 218434 221506
54326B21506K293K191K720K202K80j196j084p73j845l430l552k122q46o01n14
$$ 221506 223799 225990 228710 230912 231192 229996 228912 228139 226294 222864 219312 217190 216344 215743 215229
54311B15229K87J456K305K900L666M435M457L254J226n49j152o01K94Q82J264
$$ 215229 215516 216972 219277 222177 225843 230278 234735 237989 239215 238666 237514 236913 237207 238089 239353
54296B39353J867K766L643M051L537J942j47j718k468l052l809l940k741r34J41
$$ 239353 241220 243986 247629 251680 255217 257159 257012 255294 252826 249774 245965 242025 239284 238350 238491
54281B38491K52P0l33j476l015l632k736j191m0N10M83l41j763k963l521l727
$$ 238491 238743 238813 238480 237004 233989 230357 227621 226430 226390 226900 227383 227042 225279 222316 218795 215068
54265B15068l469k023K92J598Q31l52L37K454L290J602p86j448k05J095P42j298
$$ 215068 211599 209576 209868 211466 212297 211945 212282 214736 218026 219628 218842 217394 217189 218284 219026 217728
54249B17728l412l625j454J362K554J696K23p24j327j900j959j184k82q7m51o93
$$ 217728 214316 210691 209237 210599 213153 214849 215072 214348 213021 211121 209162 207978 207696 207609 207158 206465
54233B06465n93k47L56R74R44J51m63k17K8r20k453k546m13K289L308K112P2j092
$$ 206465 205872 205625 205981 206955 207899 208050 207587 207370 207398 206478 204025 201479 201066 203355 206663 208775 208847 207755
54215B07755p25M59J183R75O75J222K149K088P54m67k80R44J856J797J257J056
$$ 207755 207030 207489 208672 209647 210322 211544 213693 215781 216535 216068 215788 216732 218588 220385 221642 222698
54199B22698J575K556L165K585R77m01n11K20M62l17j293j489j006p35j073j346
$$ 222698 224273 226829 229994 232579 233556 233155 232644 232864 233326 233009 231716 230227 229221 228486 227413 226067
54183B26067o54Q74J993J652J33j337j888j517o35K89O66K60j97L01J466J816
$$ 226067 225413 226287 228280 229932 230065 228728 226840 225323 224688 224977 225643 225903 225706 226007 227473 229289
54167B29289P47n53r93j150j848k283j229M95Q87r9m31N77R64o25k435k068p8
$$ 229289 230036 229483 228490 227340 225492 223209 221980 222475 223362 223263 222832 223409 224373 223748 221313 219245 219167
54150B19167R93K99p40j183j611k176j774j59Q90p9j794j769L76K535K957K028
$$ 219167 220160 220459 219719 218536 216925 214749 212975 212816 213706 213627 211833 210064 210440 212975 215932 217960
54134B17960J088O35M01L91Q48J417J129m18k285k987k036l96N85L90n76j705
$$ 217960 219048 219683 220084 220475 221323 222740 223869 223451 221166 218179 216143 215747 216332 216722 216146 214441
54118B14441k485k377j103P70K102K304J883J609J645J775K012K427K678K362
$$ 214441 211956 209579 208476 209246 211348 213652 215535 217144 218789 220564 222576 225003 227681 230043
54104B30043J635R36K28q55k133k829k535j628o53J45M80m2j238k212k397k217
$$ 230043 231678 232614 232842 231987 229854 227025 224490 222862 222209 222354 222834 222792 221554 219342 216945 214728
54088B14728k115j582M7K142L223K834K036J789J780J241J40j039k077k802k558
$$ 214728 212613 211031 211078 213220 216443 219277 221313 223102 224882 226123 226263 225224 223147 220345 217787
54073B17787r13J221K082R89q36j695j115Q1Q71P47k26j395j764q29Q52K280L159
$$ 217787 216874 218095 220177 221166 220330 218635 217520 217601 218472 219219 218993 217598 215834 215005 215857 218137 221296
54056B21296L836M183L429J488k57l16J024K016J630O84M81J014J210N24m08q42
$$ 221296 225132 229315 232744 234232 233975 233659 234683 236699 238329 239013 239494 240508 241718 242242 241834 240992
54040B40992r44j344k011k177j334O1J105J351R41J36p70j145k70J688L408L665
$$ 240992 240048 238704 236693 234516 233182 233243 234348 235699 236640 236776 236006 234861 234591 236279 239687 243352
54024B43352K766K235L021M516N407N101M028K959K465K778L642M275L914K600
$$ 243352 246118 248353 251374 255890 261297 266398 270426 273385 275850 278628 282270 286545 290459 293059
54010B93059J181L28j80r41j918k452k347k371l225m351m500l405k064j080K09
$$ 293059 294240 294568 294388 293447 291529 289077 286730 284359 281134 276783 272283 268878 266814 265734 265943
53995B65943K292L923L389J005r52j023j2P58J391K686M368N319N284N204N812
$$ 265943 268235 272158 275547 276552 275600 274577 274565 275323 276714 279400 283768 289087 294371 299575 305387
53980C05387O724P088O611N808N525O171P168P369O350M949M219M207M360M550
$$ 305387 312111 319199 325810 331618 337143 343314 350482 357851 364201 369150 373369 377576 381936 386486
53966C86486M962N313N148M680M488M440L860K755J959K027K697L412L478J940
$$ 386486 391448 396761 401909 406589 411077 415517 419377 422132 424091 426118 428815 432227 435705 437645
53952D37645j447n134o918o517n747n960o679p148p546p836p035m902l027k870
$$ 437645 436198 431064 424146 417629 411882 405922 399243 392095 384549 376713 369678 364776 361749 358879
53938C58879l755m273m524n328o062n408l801l095l678l938k859j471r80j025
$$ 358879 355124 350851 346327 340999 334937 329529 325728 322633 318955 315017 312158 310687 309707 308682
53924C08682o91j39j67p84j163p78j27k60j624l255l563k331j296j834k724j692
$$ 308682 307991 307852 307685 306901 305738 304960 304833 304573 302949 299694 296131 293800 292504 290670 287946 286254
53908B86254J183L332L156J827J060Q75O05N76J343K195J907O60n1Q41L026N348
$$ 286254 287437 290769 293925 295752 296812 297687 298292 298868 300211 302406 304313 304973 304922 305763 308789 314137
53892C14137O543N962M300L345M231O226P768Q254Q190Q118Q313R184J1035J3405
$$ 314137 320680 326642 330942 334287 338518 344744 352512 360766 368956 377074 385387 394571 405606 419011
53878D19011J5239J5643J4221J1094P115L607J221n81k404l798m006l262k412
$$ 419011 434250 449893 464114 475208 482323 485930 487151 486570 484166 480368 476362 473100 470688
53865D70688j670o67M87J290J804K572L572M278M744N694P287Q586Q595P369N921
$$ 470688 469018 468351 468838 470128 471932 474504 478076 482354 487098 492792 500079 508665 517260 524629 530550
53850E30550N422O268P462P228M879J769l12j205j832k215j646o92j151l516o016
$$ 530550 535972 542240 549702 556930 561809 563578 563266 562061 560229 558014 556368 555676 554525 551009 544993
53835E44993p003o852o668o474n985n997p423r444j0268r445q208p570p330p021
$$ 544993 537990 531138 524470 517996 512011 506014 498591 489147 478879 469434 461226 453656 446326 439305
53821D39305o625o038m971l810l667m938o494o940o164n047m143l383k849k898
$$ 439305 432680 426642 421671 417861 414194 409256 402762 395822 389658 384611 380468 377085 374236 371338
53807C71338l494m008m010l779l850m358n043n457m986l210o92R75O20j122k507
$$ 371338 367844 363836 359826 356047 352197 347839 342796 337339 332353 329143 328451 329426 330046 328924 326417
53792C26417k649k140j837j732j377p16j00N6n25j626k277j642m55n29k200l353
$$ 326417 323768 321628 319791 318059 316682 315966 315866 315922 315397 313771 311494 309852 309397 308868 306668 303315
53776C03315j963J168L432L554K367R19n17j521j265K24J725K291K196K005J626
$$ 303315 301352 302520 305952 309506 311873 312792 312275 310754 309489 309713 311438 313729 315925 317930 319556
53761C19556R18L45M32J018J534J574R57q3o07K98K208L605L828L798M332M854
$$ 319556 320474 320819 321251 322269 323803 325377 326334 326251 325644 325942 328150 331755 335583 339381 343713 348567
53745C48567M574L979M119N068O093O789P120O807N724M557M153M403M592M490
$$ 348567 353141 357120 361239 366307 372400 379189 386309 393116 398840 403397 407550 411953 416545 421035
53731D21035M292L876L033K160J765J521P66l25j040j375j815k082j413k85m02
$$ 421035 425327 429203 432236 434396 436161 437682 438448 438123 437083 435708 433893 431811 430398 430113 429711
53716D29711k504n170o443n868m499l720m493o819r240r607p218l808j790j826
$$ 429711 427207 422037 415594 409726 405227 401507 397014 390195 380955 371348 364130 360322 358532 356706
53702C56706k648k785j930q69p02j886l621m412l668k392j776j628r01M68J303
$$ 356706 354058 351273 349343 348474 347772 345886 342265 337853 334185 331793 330017 328389 327488 327956 329259
53687C29259P68n30j403j416r59m80r2K45N69R16J216J226Q31M02N55J410K231
$$ 329259 330027 329497 328094 326678 325719 325239 325147 325392 325961 326877 328093 329319 330150 330552 331107 332517 334748
53670C34748K089R17l02n39J78R18J055R90J474K455L043K676J956J950K846L720
$$ 334748 336837 337754 337452 336913 337091 338009 339064 340054 341528 343983 347026 349702 351658 353608 356454 360174
53654C60174L726L146K905L326L820L749L228K929L375M519N685N932M901L383
$$ 360174 363900 367046 369951 373277 377097 380846 384074 387003 390378 394897 400582 406514 411415 414798
53640D14798K598K687K518J365K30P13K880M979N309L786J691M59P64K176L484
$$ 414798 417396 420083 422601 423966 424196 424909 427789 432768 438077 441863 443554 444013 444777 446953 450437
53625D50437L707K874J573j9j950l520l566k043m20R5n6J36N94N79K34L56P44
$$ 450437 454144 457018 458591 458572 456622 453102 449536 447493 447073 447168 447112 447248 447842 448421 448655 449011 449755
53608D49755J62j604k850k023J25J457J138K95J42N43P94Q24R55J060Q28N00N34
$$ 449755 449917 448313 445463 443440 443565 445022 446160 446455 446597 447140 447934 448758 449713 450773 451601 452101 452635
53591D52635O84K75n62q33k03L60M4m35J28J552K464K292J986K491L397L728L365
$$ 452635 453319 453594 453032 452199 451996 452356 452400 451965 452093 453645 456109 458401 460387 462878 466275 470003 473368
53574D73368L033L147L384L349L134L082L329L724M046M180M147M145M516N536
$$ 473368 476401 479548 482932 486281 489415 492497 495826 499550 503596 507776 511923 516068 520584 526120
53560E26120P029Q241Q447P777P134O962O603N443M312M692O439P406O055L540
$$ 526120 533149 541390 549837 557614 564748 571710 578313 583756 588068 592760 599199 606605 612660 616200
53546F16200K289L044M346M690L939K534O59j095j292R11M101N558M041J055r31
$$ 616200 618489 621533 625879 630569 634508 637042 637701 636606 635314 636225 640326 645884 649925 650980 650049
53531F50049j020k91j28p67j477j739j831k201k637k466j662j190j888l244l932
$$ 650049 649029 648738 648610 647843 646366 644627 642796 640595 637958 635492 633830 632640 630752 627508 623576
53516F23576l451k567k029j610q29pJ24n13j269j568j267l59R68K081K342J894
$$ 623576 620125 617558 615529 613919 613090 613083 613207 612694 611425 609857 608590 608231 609199 611280 613622 615516
53500F15516J490J529J767J920J966J858J604J734K830M419N145M496L632L903
$$ 615516 617006 618535 620302 622222 624188 626046 627650 629384 632214 636633 641778 646274 649906 653809
53486F53809N161O162O219N850O030P232Q959J0014R681Q831R113J0825J2506
$$ 653809 658970 665132 671351 677201 683231 690463 699422 709436 719117 727948 737061 747886 760392
53473G60392J3144J3696J5361J7395J8089J7348J6801J7489J8862K0115K1171
$$ 760392 773536 787232 802593 819988 838077 855425 872226 889715 908577 928692 949863
53462I49863K2118K2762K3186K3845K4905K6154K7657K9627L1703L3327L4826
$$ 949863 971981 994743 1017929 1041774 1066679 1092833 1120490 1150117 1181820 1215147 1249973
53451A249973L6958L9312M0459L9961L8915L8160L7384L6606L6951L8798M0364
$$ 1249973 1286931 1326243 1366702 1406663 1445578 1483738 1521122 1557728 1594679 1633477 1673841
53440A673841L9493L6151L2174K9179K7726K7739K8554K9078K8977K9114K9895
$$ 1673841 1713334 1749485 1781659 1810838 1838564 1866303 1894857 1923935 1952912 1982026 2011921
53429B011921L0000K8126K5333K3999K4711K5788K5873K5284K4545K3210K0880
$$ 2011921 2041921 2070047 2095380 2119379 2144090 2169878 2195751 2221035 2245580 2268790 2289670
53418B289670J8112J5557J3041J0237P478N131K778k40l813p127r507j0967j2236
$$ 2289670 2307782 2323339 2336380 2346617 2354095 2359226 2362004 2361764 2357951 2350824 2341317 2330350 2318114
53405B318114j4371j7664k0829k2138k1677k1491k2858k4547k4821k4216k4704
$$ 2318114 2303743 2286079 2265250 2243112 2221435 2199944 2177086 2152539 2127718 2103502 2078798
53394B078798k6627k8195k8206k7571k7461k7403k6330k4444k2716k1168j9057
$$ 2078798 2052171 2023976 1995770 1968199 1940738 1913335 1887005 1862561 1839845 1818677 1799620
53383A799620j6493j4464j3135j1519r182p002n535l812p93K775N192O019O346
$$ 1799620 1783127 1768663 1755528 1744009 1734827 1727825 1722290 1718478 1717685 1720460 1725652 1731671 1738017
53370A738017P133Q418J0053J2036J4119J6110J8596K2180K5934K7990K8078K8072
$$ 1738017 1745150 1753568 1763621 1775657 1789776 1805886 1824482 1846662 1872596 1900586 1928664 1956736
53358A956736K9493L1781L3990L6591M0203M3691M5401M5807M7110N0316N4203
$$ 1956736 1986229 2018010 2052000 2088591 2128794 2172485 2217886 2263693 2310803 2361119 2415322
53347B415322N7339N9650O1699O3703O5793O8247P0898P3035P4377P5498P6912
$$ 2415322 2472661 2532311 2594010 2657713 2723506 2791753 2862651 2935686 3010063 3085561 3162473
53336C162473P8367P9363P9770P9671P9203P8767P8709P8610P7578P5450P2867
$$ 3162473 3240840 3320203 3399973 3479644 3558847 3637614 3716323 3794933 3872511 3947961 4020828
53325D020828O9901O5740O0271N4878N0674M6811M1691L5246K8793K2953J7057
$$ 4020828 4090729 4156469 4216740 4271618 4322292 4369103 4410794 4446040 4474833 4497786 4514843
53314D514843J0613M044k383r318j7388k6206l4898m3107n0878n7857o3298o6858
$$ 4514843 4525456 4529500 4527117 4517799 4500411 4474205 4439307 4396200 4345322 4287465 4224167 4157309
53302D157309o9055p0853p2914p5097p6555p6540p5369p4341p4274p4222p2350
$$ 4157309 4088254 4017401 3944487 3869390 3792835 3716295 3640926 3566585 3492311 3418089 3345739
53291C345739o8276o4073o2347o3408o4901o4356o1591n8299n5740n3600n1124
$$ 3345739 3277463 3213390 3151043 3087635 3022734 2958378 2896787 2838488 2782748 2729148 2678024
53280B678024m8527m6641m5416m3668m0509l6491l2867l0081k7702k5593k4243
$$ 2678024 2629497 2582856 2537440 2493772 2453263 2416772 2383905 2353824 2326122 2300529 2276286
53269B276286k3675k3001k1694k0585k0642k1304k1191k0177j9405j9104j7954
$$ 2276286 2252611 2229610 2207916 2187331 2166689 2145385 2124194 2104017 2084612 2065508 2047554
53258B047554j5183j1856r175o731l766j196n76j467j549N04L648O273Q077R673
$$ 2047554 2032371 2020515 2011340 2004609 2000843 1999647 1999071 1997604 1996055 1996559 2000207 2006480 2014557 2024230
53244B024230J1482J3693J6582K0090K3471K5818K6780K6721K6589K7557L0033
$$ 2024230 2035712 2049405 2065987 2086077 2109548 2135366 2162146 2188867 2215456 2243013 2273046
53233B273046L2942L4690L4934L4532L3848L2276K9718K7236K5456K3542K0619
$$ 2273046 2305988 2340678 2375612 2410144 2443992 2476268 2505986 2533222 2558678 2582220 2602839
53222B602839J7239J4279J1244P021J836k952o867j0809j5299j9446k2163k3748
$$ 2602839 2620078 2634357 2645601 2652622 2654458 2651506 2644639 2633830 2618531 2599085 2576922 2553174
53210B553174k5709k9137l3496l6948l8049l7310l6737l7709l9730m1605m3049
$$ 2553174 2527465 2498328 2464832 2427884 2389835 2352525 2315788 2278079 2238349 2196744 2153695
53199B153695m4393m5409m5551m5028m4496m3788m2179m0059l9085m0134m1939
$$ 2153695 2109302 2063893 2018342 1973314 1928818 1885030 1842851 1802792 1763707 1723573 1681634
53188A681634m2428m0932l8581l6979l6733l7001l6234l3729l0513k8340k7869
$$ 1681634 1639206 1598274 1559693 1522714 1485981 1448980 1412746 1379017 1348504 1320164 1292295
53177A292295k8301k8611k8240k6647k3430j9391j6510j5990j6938j7637j7528
$$ 1292295 1263994 1235383 1207143 1180496 1157066 1137675 1121165 1105175 1088237 1070600 1053072
53166A053072j7265j7388j7836j8398j8773j8455j7380j6497j6846j8095j8823
$$ 1053072 1035807 1018419 1000583 982185 963412 944957 927577 911080 894234 876139 857316
53155H57316j8407j7748j7857j8396j8207j6851j5134j4198j4352j4822j4573
$$ 857316 838909 821161 803304 784908 766701 749850 734716 720518 706166 691344 676771
53144F76771j3409j2180j1801j2207j2572j2350j1645j0732r764r026q883r261
$$ 676771 663362 651182 639381 627174 614602 602252 590607 579875 570111 561085 552202 542941
53132E42941r620r716r889j0288j0321r421p998o958o504o011n120m227l704l281
$$ 542941 533321 523605 513716 503428 493107 483686 475688 468730 462226 456215 451095 446868 443164 439883
53118D39883k622k086k295l153l893m056l912l764l351k340j029j21Q3j76o57
$$ 439883 437261 435175 432880 429727 425834 421778 417866 414102 410751 408411 407382 407261 407344 407168 406511
53103D06511j251j693j670j409j545k182k641k569k634l486m539m670l808k818
$$ 406511 405260 403567 401897 400488 398943 396761 394120 391551 388917 385431 380892 376222 372414 369596
53089C69596j975p04R52J917J690J279J665K223J747L89o04p99r53j530k024j923
$$ 369596 367621 366917 367869 369786 371476 372755 374420 376643 378390 378779 378175 377376 376423 374893 372869 370946
53073C70946j343m68P53J971K322J483K53l44n6O73J213J042K17k96L67J442J125
$$ 370946 369603 369135 369888 371859 374181 375664 375917 375573 375517 376190 377403 378445 378662 378366 378733 380175 381300
53056C81300p84k113j033J526L344L803L788L490K197K19q70m18L31N0r46j466
$$ 381300 380516 378403 377370 378896 382240 386043 389831 393321 395518 395737 394867 394449 394780 394830 393884 392418
53040C92418j126n81p81k328m885o870o555m015j253M9J66K10L36L1m89l57O13
$$ 392418 391292 390711 389930 387602 382717 375847 369292 365277 364024 364073 364239 364449 364785 364816 364327 363970 364583
53023C64583J522J444L44q81j129m4J443J955J359R03J203J063p67l346m425l317
$$ 364583 366105 367549 367893 367012 365883 365839 367282 369237 370596 371499 372702 373765 372998 369652 365227 361910
53007C61910j534n41j74L33Q82Q46J94m15m38O8N93O47L11K56P78J043R2j386
$$ 361910 360376 359835 359661 359994 360876 361722 361916 361501 361063 361131 361724 362371 362682 362938 363716 364759 364851 363465
52989C63465j410O11K561J934r83l423l424j847q05j068j653j512o76K54J074
$$ 363465 362055 362666 365227 367161 366178 362755 359331 357484 356679 355611 353958 352446 351770 352024 353098
52974C53098J876K404K199J384O98N29M44J9m23m83n30j045j477r39J30L06l58
$$ 353098 354974 357378 359577 360961 361659 362188 362632 362651 362228 361745 361215 360170 358693 357754 357884 358190 357832
52957C57832K54L333O616O525K646j532k780j675j129k365l678l040o30J778K992
$$ 357832 358086 361419 368035 374560 377206 375674 372894 371219 370090 367725 364047 361007 360377 362155 365147
52942C65147L106K478J121o02j597j051M56J532J561J158J132J569K031K156J825
$$ 365147 368253 370731 371852 371250 369653 368602 369058 370590 372151 373309 374441 376010 378041 380197 382022
52927C82022J141N07M09R29J693K385K941L115K428R17m76p92j42N55P64P88J175
$$ 382022 383163 383670 384079 385008 386701 389086 392027 395142 397570 398487 398011 397219 397077 397632 398396 399184 400359
52910D00359K036L017L658L727L415L098K807K123Q46n40j362j485j201p50m64
$$ 400359 402395 405412 409070 412797 416212 419310 422117 424240 425086 424546 423184 421699 420498 419748 419284
52895D19284r60k374l635l452k187j637k564l497k764q73K42q8o18l36L3p14k314
$$ 419284 418324 415950 412315 408863 406676 405039 402475 398978 396214 395341 395583 395495 394877 394541 394574 393860 391546
52878C91546l261k705j399o02o73r61p79j30M35L44o04k058l105k745q25J536
$$ 391546 388285 385580 384181 383579 382906 381945 381166 381036 381471 381815 381211 379153 376048 373303 372478 374014
52862C74014K775K402J391R22J052R93M18j08o3K43J55m31j024j292j433j797
$$ 374014 376789 379191 380582 381504 382556 383549 383967 383859 383796 384039 384194 383763 382739 381447 380014 378217
52846C78217k325k514j944q26Pj36r99j567j191k44N08Q86J211J545J617J454
$$ 378217 375892 373378 371434 370608 370615 370479 369480 367913 366722 366478 366986 367872 369083 370628 372245 373699
52830C73699J416J368N80j009k067j211J110L013L392K919K513J938O31p66r09
$$ 373699 375115 376483 377063 376054 373987 372776 373886 376899 380291 383210 385723 387661 388292 387526 386617
52815C86617L65J709K025J672J544J737J712J187K72q74j849j921q45N06J118
$$ 386617 386982 388691 390716 392388 393932 395669 397381 398568 398840 397966 396117 394196 393351 393857 394975
52800C94975J157J436J858J502L44l49J39Q64O02n66j805k761l392l406k930l074
$$ 394975 396132 397568 399426 400928 401272 400923 401062 401926 402528 401962 400157 397396 394004 390598 387668 384594
52784C84594m493n837n113k485l23k73j582k547k457j610n95j71p79j592j151
$$ 384594 380101 374264 369151 366666 366343 366070 364488 361941 359484 357874 357279 357108 356329 354737 353586
52769C53586M32J097l49k216k173n39L33m89j604j768j470j460j327m90M41M53
$$ 353586 354018 355115 354766 352550 350377 349838 350171 349682 348078 346310 344840 343380 342053 341563 342004 342457
52753C42457l50j012j137j192j562k010k041j265M61K711M444M825M083L098K157
$$ 342457 342107 341095 339958 338766 337204 335194 333153 331888 332349 335060 339504 344329 348412 351510 353667
52738C53667Q29q81k036j930j157q10r84q62k24J00m34j095q52J79R19P27r2r57
$$ 353667 354496 353615 351579 349649 348492 347682 346698 345836 345612 345712 345278 344183 343331 343510 344429 345156 345064 344107
52720C44107j529j569r89j52L90O23R30J233R04j99j324j705j364p22J2O35P61
$$ 344107 342578 341009 340020 339868 340258 340881 341811 343044 343948 343749 342425 340720 339356 338634 338646 339281 340042
52703C40042L32j07q0L10Q26J446J831J207m94k010k079q93M94J511K035J680
$$ 340042 340374 340267 340187 340497 341323 342769 344600 345807 345313 343303 341224 340331 340825 342336 344371 346051
52687C46051M26n47pJ529K453K323K074K088J743J154J530L094M185L547K197
$$ 346051 346477 345930 345923 347452 349905 352228 354302 356390 358133 359287 360817 363911 368096 371643 373840
52672C73840J878K599L082K819K284J608N02n38l20J361L033K999J029j648l610
$$ 373840 375718 378317 381399 384218 386502 388110 388612 388074 387754 389115 392148 395147 396176 394528 390918
52657C90918m290m031l486k956k288j242K02J662K294J302r12k476j979m40q9
$$ 390918 386628 382597 379111 376155 373867 372625 372827 374489 376783 378085 377173 374697 372718 372278 372189
52642C72189j173j641m76O17J70k98J417M332N277L378J017L7m97j872l128k542
$$ 372189 371016 369375 368899 369516 369686 369388 370805 375137 380414 383792 384809 384846 384349 382477 379349 376807
52626C76807m42J097Q40m76j283p19P36J606P76j038j895r92L47O69K74J57O2
$$ 376807 376365 377462 378302 377826 376543 375824 376560 378166 378942 377904 376009 375017 375364 376033 376307 376464 376526
52609C76526r07k317k746j940j084p60j62J067J737Q05q37j391k93J601L459M950
$$ 376526 375619 373302 370556 368616 367532 366772 366610 367677 369414 370219 369382 367991 367698 369299 372758 377708
52593C77708N578M789K975J458J136J703K403K851K812J868J0j875k801k899l213
$$ 377708 383286 388075 391050 392508 393644 395347 397750 400601 403413 405281 405291 403416 400615 397716 394503
52578C94503m123m552l212l69K152K850K093J429J658K152K157K051K716M143
$$ 394503 390380 385828 382616 382247 384399 387249 389342 390771 392429 394581 396738 398789 401505 405648
52564D05648N452O109O196N422L040n95l415l710k336j699k627l529k868j281
$$ 405648 411100 417209 423405 428827 431867 431272 427857 424147 421811 420112 417485 413956 411088 409807
52550D09807m70p94j076n19J73r5j258k120j847r35n32j033j681j556n24Q71J984
$$ 409807 409337 408543 407467 406948 407121 407026 405768 403648 401801 400866 400334 399301 397620 396064 395540 396411 398395
52533C98395K233J257m51j480q90N26J176P16J88J56l4p65j251q91l74m54n61
$$ 398395 400628 401885 401434 399954 399064 399590 400766 401482 401670 401826 401792 401027 399776 398885 398511 398057 397496
52516C97496J13Q69L44j235k197j826j142r68o71M27J579J557M66l55k5R03J045
$$ 397496 397609 398478 398822 397587 395390 393564 392422 391454 390783 391210 392789 394346 394812 394457 394432 395335 396380
52499C96380m92l102m798l932j186Q84P14n40p96J76R34P72N23R10J430J383R16
$$ 396380 395888 392786 387988 384056 382870 383754 384468 383928 383132 383308 384242 385014 385537 386447 387877 389260 390176
52482C90176M69O7j52M23J721K252P55j756k821j549L46Q72N3o22j11J420L107
$$ 390176 390645 390712 390560 390983 392704 394956 395711 393955 391134 389585 389931 390803 390856 390234 390123 391543 394650
52465C94650L905L074J026n81l92J127K267J945M51j323k508k305m87J910L274
$$ 394650 398555 401629 402655 402074 401682 402809 405076 407021 407472 406149 403641 401336 400849 402759 406033
52450D06033L115K381J910J465P90P46K428N441P811P626M567J94l071l630k050
$$ 406033 409148 411529 413439 414904 415694 416440 418868 424309 432120 439746 444313 444507 441436 437806 435756
52435D35756n10o22k045l404l995m015l664k873j825r64m40l0L52M49K9q15j652
$$ 435756 435246 434624 432579 429175 425180 421165 417501 414628 412803 411839 411399 411369 411721 412170 412199 411384 409732
52418D09732j838j009K64P26o3q91k78J559K948K926K227K016K477L053L337L265
$$ 409732 407894 406885 407149 407875 407812 406921 406643 408202 411150 414076 416303 418319 420796 423849 427186 430451
52402D30451K849K275J984K191K496K331J701J208J272J564J313O8j837l583m559
$$ 430451 433300 435575 437559 439750 442246 444577 446278 447486 448758 450322 451635 451703 449866 446283 441724
52387D41724m671m184l611l617m476n404n139l529j939j554j960k064j741j533
$$ 441724 437053 432869 429258 425641 421165 415761 410622 407093 405154 403600 401640 399576 397835 396302
52373C96302j189J03K078L367L342K814K481J884O21m79m05N55J237J147O34k9
$$ 396302 395113 395216 397294 400661 404003 406817 409298 411182 411803 411324 410919 411474 412711 413858 414492 414463
52357D14463p85j190n99R16K537L682M425M868M823M570N231P642J0914J2843
$$ 414463 413678 412488 411889 412805 415342 419024 423449 428317 433140 437710 442941 450583 461497 474340
52343D74340J2105R610P200N373L110k8k721l537k986k824l582m032l195j730
$$ 474340 486445 496055 503255 508628 511738 511710 508989 505452 502466 499642 496060 492028 488833 487103
52329D87103q34p49j023j514k256k745k058K04L381N955O303L983O45j097l47
$$ 487103 486269 485520 484497 482983 480727 477982 475924 476128 479509 485464 491767 495750 496395 495298 494951
52314D94951J114J243M58Q46L098N601O742O851P242Q262R072Q901P675N731L633
$$ 494951 496065 497308 497766 498612 501710 507311 514053 520904 528146 536408 545480 554381 562056 567787 571420
52299E71420K304K523L909M981M701L686L277L644L625K686J915K436L574L814
$$ 571420 573724 576247 580156 585137 589838 593524 596801 600445 604070 606756 608671 611107 614681 618495
52285F18495L170L239M826O937Q571J0150J2211J3830J3769J2674J2626J4582
$$ 618495 621665 624904 629730 636667 645238 655388 667599 681429 695198 707872 720498 735080
52273G35080J7336J9248J9951K0206K0840K2296K4535K6896K8578K9560L0613
$$ 735080 752416 771664 791615 811821 832661 854957 879492 906388 934966 964526 995139
$$ [...]
##END NTUPLES=NMR SPECTRUM
##END=
