
##TITLE=AC1222_Punto_6074794_1Xs9jaGfa0
##JCAMPDX= 6.0         $$ Bruker NMR JCAMP-DX V2.0
##DATA TYPE= NMR SPECTRUM
##DATA CLASS= NTUPLES
##ORIGIN= BRUKER
##OWNER= Administrator
$$ 1.72 TOPSPIN		Version 2.1
$$ 2012-05-08 20:31:43.421 -0500  Administrator@TOPSPIN
$$ Compression mode = diff/dup
##.OBSERVE FREQUENCY= 400.13188235
##.OBSERVE NUCLEUS= ^1H
##.ACQUISITION MODE= SIMULTANEOUS (DQD)
##.ACQUISITION SCHEME= undefined
##.AVERAGES= 8
##.DIGITISER RES= 22
##SPECTROMETER/DATA SYSTEM= spect
##.PULSE SEQUENCE= zg30
##.SOLVENT NAME= COFFEE_meoh
##.SHIFT REFERENCE= INTERNAL, COFFEE_meoh, 1, 14.98061
##AUDIT TRAIL= $$ (NUMBER, WHEN, WHO, WHERE, PROCESS, VERSION, WHAT)
$$ ##TITLE= Audit trail, TOPSPIN		Version 2.1
$$ ##JCAMPDX= 5.01
$$ ##ORIGIN= Bruker BioSpin GmbH
$$ ##OWNER= Administrator
$$ $$ C:\Bruker\TOPSPIN/data/COFFEE/nmr/AC1222_Punto_6074794_1Xs9jaGfa0/50/pdata/1/auditp.txt
$$ ##AUDIT TRAIL=  $$ (NUMBER, WHEN, WHO, WHERE, PROCESS, VERSION, WHAT)
(   1,<2012-05-08 20:31:36.390 -0500>,<Administrator>,<TOPSPIN>,<go>,<TOPSPIN 2.1>,
      <created by zg
	started at 2012-05-08 20:30:29.875 -0500,
	POWCHK enabled, PULCHK disabled,
       configuration hash MD5:
       AF F2 23 6B 01 CD 40 DD E5 A1 38 A0 06 EA F7 77
       data hash MD5: 64K
       CE DF 8B 5E 9C F0 70 B1 03 59 F1 31 75 01 A7 07>)
(   2,<2012-05-08 20:31:38.984 -0500>,<Administrator>,<TOPSPIN>,<proc1d>,<TOPSPIN 2.1>,
      <Start of raw data processing
       efp LB = 0 FT_mod = 6 PKNL = 1 PHC0 = 0 PHC1 = 0 SI = 32K 
       data hash MD5: 32K
       88 65 F7 90 DE 59 F9 DA 6C DB BE 9D A6 DD F0 5C>)
(   3,<2012-05-08 20:31:39.375 -0500>,<Administrator>,<TOPSPIN>,<proc1d>,<TOPSPIN 2.1>,
      <pk PHC0 = 209.0533 PHC1 = 0 
       data hash MD5: 32K
       30 C8 08 50 16 F4 8A 98 A4 10 45 D0 E3 7D EB 82>)
(   4,<2012-05-08 20:31:39.468 -0500>,<Administrator>,<TOPSPIN>,<proc1d>,<TOPSPIN 2.1>,
      <abs ABSG = 1 
       data hash MD5: 32K
       22 73 DE CF DE 28 82 D1 FA 18 77 FF C3 60 25 BE>)
(   5,<2012-05-08 20:31:39.546 -0500>,<Administrator>,<TOPSPIN>,<proc1d>,<TOPSPIN 2.1>,
      <abs ABSG = 2 
       data hash MD5: 32K
       82 E2 1A 8C 01 8D CF 35 E0 46 EE 83 83 D9 D9 44>)
(   6,<2012-05-08 20:31:39.578 -0500>,<Administrator>,<TOPSPIN>,<proc1d>,<TOPSPIN 2.1>,
      <abs ABSG = 3 
       data hash MD5: 32K
       83 31 FE 39 C1 ED FF D5 AD 10 D4 72 34 3B 5F ED>)
(   7,<2012-05-08 20:31:39.609 -0500>,<Administrator>,<TOPSPIN>,<proc1d>,<TOPSPIN 2.1>,
      <abs ABSG = 4 
       data hash MD5: 32K
       6B 91 B2 61 4F A9 C0 03 A6 47 02 4D F6 29 0A 9D>)
(   8,<2012-05-08 20:31:39.640 -0500>,<Administrator>,<TOPSPIN>,<proc1d>,<TOPSPIN 2.1>,
      <abs ABSG = 5 
       data hash MD5: 32K
       16 F8 AF 6D 8D 59 EF 66 43 CB 5B F9 60 D5 17 A5>)
$$ ##END=
$$ 
$$ $$ hash MD5
$$ $$ F4 6F 7E F3 90 75 69 0B 6E E1 B1 72 09 0C 8E 04
##$RELAX= 
##$RELAX= 
##$RELAX= 
##$RELAX= 
##$RELAX= 
##$RELAX= 
##$RELAX= 
$$ Bruker specific parameters
$$ --------------------------
$$ [...]
##$TP= (0..7)
150 150 150 150 150 150 150 150
##$TP07= 0
##$TPNAME0= <>
##$TPNAME1= <>
##$TPNAME2= <>
##$TPNAME3= <>
##$TPNAME4= <>
##$TPNAME5= <>
##$TPNAME6= <>
##$TPNAME7= <>
##$TPOAL= (0..7)
0.5 0.5 0.5 0.5 0.5 0.5 0.5 0.5
##$TPOFFS= (0..7)
0 0 0 0 0 0 0 0
##$TUNHIN= 0
##$TUNHOUT= 0
##$TUNXOUT= 0
##$USERA1= <user>
##$USERA2= <user>
##$USERA3= <user>
##$USERA4= <user>
##$USERA5= <user>
##$V9= 5
##$VALIST= <valist>
##$VCLIST= <CCCCCCCCCCCCCCC>
##$VD= 0
##$VDLIST= <DDDDDDDDDDDDDDD>
##$VPLIST= <PPPPPPPPPPPPPPP>
##$VTLIST= <TTTTTTTTTTTTTTT>
##$WBST= 1024
##$WBSW= 4
##$XGAIN= (0..3)
0 0 0 0
##$XL= 0
##$YL= 0
##$YMAX_a= 539499
##$YMIN_a= -658115
##$ZGOPTNS= <>
##$ZL1= 120
##$ZL2= 120
##$ZL3= 120
##$ZL4= 120
##$ABSF1= 14.98061
##$ABSF2= -5.57192
##$ABSG= 5
##$ABSL= 3
##$ALPHA= 0
##$AQORDER= 0
##$ASSFAC= 0
##$ASSFACI= 0
##$ASSFACX= 0
##$ASSWID= 0
##$AUNMP= <proc_prof1d_extract_pilot.lims>
##$AXLEFT= 0
##$AXNAME= <>
##$AXNUC= <1H>
##$AXRIGHT= 0
##$AXTYPE= 0
##$AXUNIT= <>
##$AZFE= 0.1
##$AZFW= 0.1
##$BCFW= 0
##$BC_mod= 0
##$BYTORDP= 0
##$COROFFS= 0
##$CY= 15
##$DATMOD= 1
##$DC= 0
##$DFILT= <>
##$DTYPP= 0
##$F1P= 0
##$F2P= 0
##$FCOR= 0.5
##$FTSIZE= 32768
##$FT_mod= 6
##$GAMMA= 0
##$GB= 0
##$INTBC= 1
##$INTSCL= 1
##$ISEN= 128
##$LB= 0
##$LEV0= 0
##$LPBIN= 0
##$MAXI= 10000
##$MC2= 0
##$MEAN= 0
##$ME_mod= 0
##$MI= 0
##$NCOEF= 0
##$NC_proc= -8
##$NLEV= 6
##$NOISF1= 0
##$NOISF2= 0
##$NSP= 0
##$NTH_PI= 0
##$NZP= 0
##$OFFSET= 14.98061
##$PC= 1
##$PHC0= 209.0533
##$PHC1= 0
##$PH_mod= 1
##$PKNL= yes
##$PPARMOD= 0
##$PPDIAG= 0
##$PPIPTYP= 0
##$PPMPNUM= 2147483647
##$PPRESOL= 1
##$PSCAL= 4
##$PSIGN= 0
##$PYNMP= <proc.py>
##$REVERSE= no
##$SF= 400.13
##$SI= 32768
##$SIGF1= 0
##$SIGF2= 0
##$SINO= 400
##$SIOLD= 32768
##$SPECTYP= <>
##$SREGLST= <1H.CDCl3>
##$SSB= 0
##$STSI= 32768
##$STSR= 0
##$SW_p= 8223.68421052632
##$SYMM= 0
##$S_DEV= 0
##$TDeff= 65536
##$TDoff= 0
##$TI= <>
##$TILT= no
##$TM1= 0
##$TM2= 0
##$TOPLEV= 0
##$USERP1= <user>
##$USERP2= <user>
##$USERP3= <user>
##$USERP4= <user>
##$USERP5= <user>
##$WDW= 1
##$XDIM= 32768
##$YMAX_p= 460803081
##$YMIN_p= -653158
##$CURPLOT= <Network HP LaserJet P1505>
##$CURPRIN= <$Network HP LaserJet P1505>
##$DFORMAT= <normdp>
##$LAYOUT= <+/1D_H.xwp>
##$LFORMAT= <normlp>
##$PFORMAT= <normpl>
##$SURQMSG= 1
$$ End of Bruker specific parameters
$$ ---------------------------------
##NTUPLES= NMR SPECTRUM
##VAR_NAME=  FREQUENCY,     SPECTRUM/REAL,   SPECTRUM/IMAG
##SYMBOL=    X,             R,               I
##VAR_TYPE=  INDEPENDENT,   DEPENDENT,       DEPENDENT
##VAR_FORM=  AFFN,          ASDF,            ASDF
##VAR_DIM=   32768,         32768,           32768
##UNITS=     HZ,            ARBITRARY UNITS, ARBITRARY UNITS
##FACTOR=    0.250966925370066, 1,           1
##FIRST=     8223.43324360095, -172674,      41378
##LAST=      0,             -41738,          -83287
##MIN=       0,             -653158,         0
##MAX=       8223.43324360095, 460803081,    0
$$ Real data points
##PAGE= N=1
##DATA TABLE= (X++(R..R)), XYDATA
$$ [...]
$$ plain form
19526 -33048 85574 123683 -58057 199899 219963 -199136 175341 97645 -189139 -81530 -281899
19515 -281899 -114300 -277378 -106169 1856 -276734 -215837 -48459 -137169 16091 -93393 -370
19503 -97346 -48349 -80150 79442 -22400 51594 307940 85514 -100776 -233561 41030 -78903
19491 -251066 -13476 -71726 -220843 -10101 -45393 -202345 -147929 -5833 48760 154201 -134704
19479 -225883 -216328 215374 -188727 89896 10220 335723 -281035 -320819 56377 -290650 -143940
19467 -121989 356052 -242546 -24021 229027 -85025 -147587 259999 346984 -196341 -324903
19457 -324903 160088 113764 -174958 180374 -343138 -73974 66898 152678 -208558 -89614
19446 214501 -118793 -202090 -123205 -175298 -186569 -280482 -125488 223739 -171082 178154
$$ packed form
19526c3048H5574L8109e8057A99899K0064a99136A75341p7696a89139h1530k00369
19515b81899a14300j63078a06169A856b76734O0897d8459q8710A6091i3393c70
19503i7346d8349l1801G9442b2400E1594K56346H5514a00776j32785D1030g8903
19491b51066a3476n8250j49117a0101l5292j56952N4416e833D8760J05441a34704
19479b25883R555B15374a88727H9896A0220L25503b81035l9784E6377b90650a43940
19467a21989C56052b42546b4021B29027h5025o2562B59999Q6985a96341j28562
19457c24903A60088m6324a74958A80374c43138g3974F6898Q5780b08558h9614
19446B14501a18793q3297P8885n2093j1271r3913a25488B23739a71082A78154
$$ plain form
19435 31561 -343369 -202028 50895 -174158 -99385 133074 133877 70004 -168632 159866 -104959
19423 -9529 -152257 143132 233240 78228 -281670 20355 -356107 -227471 -342674 -346195 -226416
19412 -226416 -198557 -162971 -157868 -155809 -245513 -70255 -54505 -101838 -114727 -86723 -109037 -346403
19400 -346403 159759 124920 -7217 52017 -286270 369248 165974 -240493 -244373 -175344 -65917
19388 -21120 -163876 -122915 27085 19596 46323 -36971 -347672 -227164 -100145 60940 -175862
19376 194077 -218221 31687 -164831 -314040 -211231 175693 232939 -223152 125540 -203162
19365 168929 -76175 77696 -149653 8174 29344 -54478 -470027 -138580 184962 -37270 140728
19353 -19654 -20577 12242 -99925 17289 172598 -175177 -444197 231178 61178 44901 126958
$$ packed form
19435C1561c43369J41341E0895a74158P4773A33074Q03o3873a68632A59866a04959
19423i529j42728A43132R0108G8228b81670B0355c56107J28636j15203l521J19779
19412b26416K7859L5586N103K059q9704g0255J5750m7333j2889K8004k2314k37366
19400c46403A59759l4839g217E2017b86270C69248A65974b40493l880O9029f5917
19388b1120j42756M0961B7085p489K6727c6971l10701J20508a00145F0940a75862
19376A94077b18221C1687a64831j49209J02809A75693N7246b23152A25540b03162
19365A68929g6175G7696a49653H174K1170e4478m15549a38580A84962c7270A40728
19353a9654r23A2242i9925A7289J55309a75177k69020B31178F1178j6277Q2057
$$ plain form
19342 126958 58216 47887 -24389 -289600 -115314 37947 -118460 44903 211404 128537 -186598
19330 -138435 -174980 418446 -242403 -305843 -63966 -19027 -132171 -121652 -49652 -180875 -123778
19319 -123778 57034 360518 137186 -227336 -90625 30550 -86621 -182604 -30449 204619 -43271
19307 14045 19446 -290931 -190381 32600 -186490 30788 346808 45059 372226 -16819 -264149
19296 -264149 184307 -199242 100917 -341798 30478 -351987 -74897 -110747 -346365 -194474
19286 -194474 -75857 143678 81234 -261651 358542 -275666 26010 -45277 -110641 -76953 229433
19274 -133423 195097 -344132 -230836 13712 -239743 121424 1753 -280837 -89802 -287616
19264 -287616 24607 -377549 -142115 -194917 -153417 152080 188777 -134998 93699 -36784 -138896
$$ packed form
19342A26958E8216j0329b4389k65211a15314C7947a18460D4903J66501q2867a86598
19330a38435l6545D18446b42403o3440f3966a9027j13144J0519d9652j31223N7097
19319a23778E7034L03484A37186b27336i0625C0550h6621r5983c0449B04619d3271
19307A4045N401b90931J00550C2600a86490C0788L16020D5059L27167a6819k47330
19296b64149A84307a99242A00917c41798C0478c51987g4897l5850k35618J51891
19286a94474g5857A43678o2444b61651C58542b75666B6010d5277o5364L3688B29433
19274a33423A95097c44132J13296A3712b39743A21424A753b80837h9802j97814
19264b87616B4607c77549a42115n2802M1500A52080L6697a34998I3699c6784j02112
$$ plain form
19253 -138896 -24147 75198 -295583 -115822 -213600 28252 76507 -207568 -154728 -27194 -131576
19242 -131576 -203512 181077 -239395 -164284 -119835 -194854 16795 -81358 78714 -259898 162681
19230 -15993 374452 -29629 87744 -1390 -13265 31601 301410 -74911 -77876 -82722 20181 -36574
19217 -189781 -132882 -71899 59840 101369 -186149 -235958 -202183 -347905 -89650 4609 -293438
19205 -87972 -65678 -70209 -406705 -103977 -179895 -184563 86832 -305300 -28450 -13126 153620
19193 -170243 -306548 75029 189111 -53353 -263284 -281573 -54906 51337 53191 -391741 -155826
19181 108272 -205 -140218 36448 -167192 -152478 -42325 -312215 -112801 306049 -311034 41323
19169 -164465 -145751 -39446 141290 -66656 -100674 -240372 -168404 -27721 204214 -208504 -162079
$$ packed form
19253a38896b4147G5198b95583a15822r7778B8252M8255b07568N2840b7194j04382
19242a31576p1936A81077b39395P5111M4449p5019A6795h1358G8714b59898A62681
19230a5993C74452b9629H7744a390j1875C1601K69809g4911k965m846B0181c6574
19217a89781N6899O0983E9840M1529a86149m9809L3775j45722h9650D609b93438
19205h7972K2294m531l36496a03977p5918m668H6832c05300b8450a3126A53620
19193a70243j36305G5029J14082e3353k09931j8289e4906E1337J854c91741a55826
19181A08272b05j40013C6448a67192J4714d2325k69890a12801C06049c11034D1323
19169a64465J8714c9446A41290f6656l4018j39698P1968b7721B04214b08504M6425
$$ plain form
19158 -162079 160786 57826 -274134 -97376 -9481 -13549 71510 178568 53891 134913 -156470
19146 -82048 -75701 42201 173207 -3525 3762 97861 -184502 8616 170531 120269 192805 74415
19133 13016 -8274 265205 344005 -288910 112644 -257199 -115687 -162396 -293504 13369 60622
19122 60622 -297798 -279818 -163667 -93359 -150034 91107 -93190 -134622 -264728 20486 -68615
19110 -220317 109666 -73860 22891 -292902 4425 102192 -305553 -162703 -30261 184244 -20579
19098 -184743 -136940 -207365 -322917 86587 -114513 -181026 -232554 -88620 -123933 169908 -128571
19086 -280343 -265387 -90524 -82041 -52951 -22143 -125836 -236457 -207970 -151950 -75116 512659
19074 -154712 340064 100 -230223 -272601 -50793 -196030 138917 -134411 83050 -5158 -67218
$$ packed form
19158a62079A60786E7826b74134i7376i481m068G1510J07058E3891Q1022a56470
19146h2048O347D2201J31006c525C762R4099a84502H616J61915n0262P2536G4415
19133A3016h274B65205P8800b88910A12644b57199a15687m6709j31108A3369M7253
19122F0622b97798J7980J16151P0308n6675I1107i3190m1432j30106B0486f8615
19110b20317A09666g3860B2891b92902D425R7767c05553J42850c0261A84244b0579
19098a84743M7803p0425j15552H6587a14513o6513n1528h8620l5313A69908a28571
19086b80343J4956i0524Q483K9090b2143j03693j10621K8487N6020g5116E12659
19074a54712C40064A00b30223m2378e0793j45237A38917a34411H3050e158o2060
$$ plain form
19063 -67218 -111882 -219085 -88813 -49381 138533 -282289 138332 -300849 -185807 -12401
19052 -208236 301345 -139207 -259207 178424 -18798 -53024 21069 -118404 178348 -158309
19041 -154463 -25448 -34299 -219532 38392 143822 -65120 -325263 220646 -1318 72737 -144369
19029 -283167 98900 -250690 -80632 335923 -17916 -72876 178771 -92097 56502 205926 397399
19018 397399 203321 79418 -11159 189726 -10657 94799 -60794 -4369 405498 152599 -179092
19006 -26009 -43646 75456 -252986 73491 -210327 -213960 -123771 182697 -42982 22416 202661
18995 202661 -180969 263000 8186 106496 74155 -274929 183252 -151313 2995 -110415 191281
18983 54668 -62519 166639 138920 -110241 27221 -111486 163164 -91825 154132 -127955
$$ packed form
19063f7218m4664j07203h8813L9432A38533b82289A38332c00849J15042a2401
19052b08236C01345a39207j20000A78424a8798l4226B1069a18404A78348a58309
19041a54463b5448q851j85233C8392J05430f5120k60143B20646a318G2737a44369
19029b83167I8900b50690h0632C35923a7916n4960A78771i2097E6502J49424J91473
19018C97399j94078G9418a1159A89726a0657I4799f0794d369D05498A52599a79092
19006b6009j7637G5456b52986G3491b10327l633R0189A82697d2982B2416J80245
18995B02661a80969B63000H186R8310l2341b74929A83252a51313B995a10415A91281
18983E4668f2519A66639k7719a10241B7221a11486A63164i1825A54132a27955
$$ plain form
18972 -258149 -404878 8158 99932 -164431 -174217 -61283 -102398 391189 270097 -25256 142094
18960 -64377 28648 213929 -253391 246222 224052 269141 -198909 46817 -568 -139479 -6480
18948 -180466 -203904 60621 -337413 -124942 -93532 151819 -258654 10742 -87444 -266148
18938 -266148 -164578 55250 -140188 55504 -30158 -104483 -185459 44766 189852 -47865 -365101
18927 -365101 -48887 -280905 -120775 195617 -196089 -21201 -24495 -308154 -50083 -36980 59971
18915 114494 33403 -171181 -30257 -10869 287612 -319462 -80739 -277551 157436 16441
18904 -12239 7214 4525 -15838 -137276 -208367 -20831 86556 98279 -272871 -58648 -18881 5492
18891 182221 244674 235783 -52555 203811 -3844 -116608 110221 -225244 -36694 -205222 90142
$$ packed form
18972b58149j46729H158R1774a64431r786f1283m1115C91189j21092b5256A42094
18960f4377B8648J85281b53391B46222k2170M5089a98909D6817e68j38911f480
18948a80466k3438F0621c37413a24942L1410A51819b58654A0742h7444j78704
18938b66148J01570E5250a40188E5504c0158p4325q0976D4766J45086d7865l17236
18927c65101d8887k32018a20775A95617a96089b1201l294k83659e0083J3103E9971
18915A14494C3403a71181c0257a0869B87612c19462h0739j96812A57436A6441
18904a2239G214k689a5838j21438p1091b0831H6556J1723b72871e8648a8881E492
18891A82221O2453q891e2555B03811c844j12764A10221b25244c6694j68528I0142
$$ plain form
18879 -285918 74479 -9147 -19472 -167028 11271 265688 297698 -175110 -214448 -226270 -145388
18868 -145388 -212700 86574 -139272 205470 329967 -55782 211532 -84271 129511 227041
18858 227041 -125460 -76831 -167251 -365514 7106 -63520 51809 -150821 150188 -137836 -13219
18846 -176510 308389 30904 -189530 -50289 178873 -28674 15882 121332 -177301 -55331
18835 -16488 138234 -103642 -108499 -111267 176892 -317091 2506 53964 52877 -49676 -240770
18824 -240770 -21334 -71571 -285630 -231326 -358435 -36909 93724 -317342 -149419 129821
18813 -11873 59182 -21822 -123127 -456654 110261 122919 -34051 -106969 -5142 -155512 214294
18801 -153494 259426 -28834 163270 17910 153094 115837 94383 42418 -151505 -106958 -129404
$$ packed form
18879b85918G4479i147j0325j47556A1271K54417L2010a75110l9338j1822Q0882
18868a45388o7312H6574a39272B05470J24497e5782B11532h4271A29511R7530
18858B27041a25460M8629r0420j98263G106f3520E1809a50821A50188a37836a3219
18846a76510C08389C0904a89530e0289A78873b8674A5882J05450a77301e5331
18835a6488A38234a03642m857k768A76892c17091B506N1458j087d9676j91094
18824b40770b1334n0237k14059N4304j27109c6909I3724c17342a49419A29821
18813a1873E9182b1822j01305l33527A10261J2658c4051p2918e142j50370B14294
18801a53494B59426b8834A63270A7910J35184l7257k1454D2418a51505M4547k2446
$$ plain form
18790 -129404 84673 38414 -231527 -77137 -633030 324060 -200661 -110510 -11619 -97138 -10483
18778 -256585 68540 227767 -151329 -7355 122139 -222654 -300324 68982 -246796 -357512
18768 -357512 -281486 -193323 -155440 -174081 151588 -74027 -17863 -166342 -24901 -131252 -294126
18757 -294126 -122938 -81709 -97530 -76501 -177525 -65107 -447062 -206012 131277 -237152
18746 39156 -273945 -80493 -84404 30173 -2775 -29862 199516 -183027 -220317 -174540 21114
18734 -237496 74045 96189 -6264 -24914 -43342 -183168 -83450 291157 186732 -187281 319531
18722 -225017 -55601 341059 -208630 59963 177134 39476 -100325 -113991 -258862 -250637 -28399
18710 -37174 26650 -216598 -101316 -74118 54362 85692 -142951 83409 -135813 -287985 -151564
$$ packed form
18790a29404H4673C8414b31527g7137n55893C24060b00661R0151a1619q5519a0483
18778b56585F8540J59227a51329g355A22139b22654p7670F8982b46796j10716
18768c57512P6026Q8163L7883j8641A51588g4027a7863j48479b4901j06351j62874
18757b94126a22938M1229j5821K1029j01024f5107l81955b06012A31277b37152
18746C9156b73945h0493l911C0173b775k7087A99516a83027l7290M5777B1114
18734b37496G4045K2144f264j8650j8428j39826h3450B91157j04425a87281C19531
18722b25017e5601C41059b08630E9963J17171C9476a00325j3666j44871Q225b8399
18710c7174B6650b16598a01316K7198E4362L1330a42951H3409a35813j52172J36421
$$ plain form
18699 -151564 2936 -65385 -172648 219071 69307 -601481 106695 -6478 292732 1789 -104107
18687 -105736 -360238 21128 173763 203558 -23967 -30080 -349653 169265 -56163 -9287 -44307
18676 -44307 -203367 792 63007 -272758 -136959 -291027 136905 -229573 -190868 -259881 -14106
18664 423990 -142285 335098 241238 -73491 -47961 118634 308766 -145437 143465 95294
18654 95294 -132107 196536 388549 -291426 -65924 66370 22111 104611 -367557 -150672
18643 170177 126656 25026 -59595 58298 48105 -49295 -85464 -263549 61237 148684 261124
18632 261124 98594 -10731 -161744 -26383 6860 -94523 80382 -104167 -273206 -182524 -34760
18620 -234755 -354859 216346 -29194 -96058 63901 -134905 50864 -156808 -134163 -95736 -147244
$$ packed form
18699a51564B936f5385j07263B19071F9307f01481A06695f478B92732A789a04107
18687a05736k54502B1128J52635K9795b3967o113l19573A69265e6163i287l5020
18676d4307j59060G92O2215b72758J35799j54068A36905b29573L8705o9013a4106
18664D23990a42285C35098r3860g3491K5530A18634J90132a45437A43465m8171
18654I5294a32107A96536J92013b91426f5924F6370B2111Q2500c67557a50672
18643A70177m3521B5026e9595E8298j0193d9295l6169j78085F1237Q7447J12440
18632B61124I8594a0731j51013b6383F860i4523H0382a04167j69039R0682c4760
18620b34755j20104B16346b9194o6864F3901a34905E0864a56808K2645L8427n1508
$$ plain form
18609 -147244 -69142 102298 -66265 13626 -47593 -43838 -308186 168364 8359 102955 305417
18598 305417 -328911 163638 -62213 -340079 233891 18669 -64664 -194679 106619 -129655
18587 -154288 -123737 -11504 -119423 111682 -121719 -72361 15991 -28580 -296384 -269744 169739
18575 142430 -100950 96945 -298412 -160576 -45099 -276249 57159 49706 -98701 318766 -22114
18563 -64174 233538 282692 136699 -209478 70068 -72138 253369 109043 -221671 -135004
18553 -135004 203154 52364 216810 -134281 -96840 -154163 -102824 148289 55142 244435
18543 244435 -446970 -2763 154737 302736 133506 80974 61396 -106829 -235451 62131
18532 197226 59128 -84869 -223101 -111381 99464 248257 -411058 -146180 -291557 97454
$$ packed form
18609a47244f9142A02298f6265A3626d7593L755k64348A68364H359R4596K02462
18598C05417c28911A63638f2213k77866B33891A8669f4664j30015A06619a29655
18587a54288L0551a1504j07919A11682a21719M9358A5991b8580k67804K6640A69739
18575A42430a00950I6945b98412J37836d5099k31150E7159p453i8701C18766b2114
18563f4174B33538M9154A36699b09478G0068g2138B53369A09043b21671Q6667
18553a35004B03154E2364J64446a34281L7441n7323N1339A48289E5142J89293
18543B44435d46970b763A54737J47999A33506n2532j9578a06829j28622F2131
18532A97226E9128h4869j38232a11381I9464J48793d11058a46180j45377I7454
$$ plain form
18521 133876 116782 -144974 51227 206675 -123938 -8399 -29408 50024 77241 -59101 -50118
18510 -50118 -262717 -96077 7577 -3976 -35477 77480 372347 201531 -255103 16684 -195146
18498 -22422 -779 -4507 94408 -96767 153857 48882 -210328 272800 -13753 -254082 189350
18486 206972 -431388 -94846 232640 -101143 -6397 590543 -250423 -104694 -1958 -41411 8045
18474 -283821 -233155 37468 -95241 -252711 -132400 283123 -116430 -245610 116866 -182680
18463 -88920 304371 -71976 -290705 -185433 -4516 84562 -57056 102712 -185516 129390 150874
18452 150874 13588 -454558 -34562 74232 -7417 23322 -14682 230714 80339 -24960 -41234
18441 -41234 15006 -109281 -95960 -8165 -166684 -259990 -171855 25423 -27370 26840 -108563
$$ packed form
18521A33876j7094a44974E1227J55448a23938h399k1009E0024K7217e9101Q983
18510e0118k12599i6077G577c976l1501G7480K94867j70816b55103A6684a95146
18498b2422g79l728I4408i6767A53857D8882b10328B72800a3753k40329A89350
18486B06972d31388i4846B32640a01143f397E90543b50423a04694a958l9453H045
18474b83821N0666C7468i5241j57470J20311B83123a16430j29180A16866a82680
18463h8920C04371g1976k18729J05272d516H4562e7056A02712a85516A29390K1484
18452A50874A3588d54558c4562G4232g417B3322a4682B30714H0339b4960j6274
18441d1234A5006a09281J3321h165j58519r3306Q8135B5423b7370B6840a08563
$$ plain form
18429 180257 -314192 77806 -256620 -312539 -126214 124283 -94662 164894 -11369 -41064
18419 -41064 143945 -30988 53661 187807 -29640 202325 -315721 38710 10703 102144 -293770
18407 84974 -120381 73748 -354086 -118245 -248533 -18410 52197 -62078 -24226 -205499 -296140
18396 -296140 33189 -196202 42296 -77937 -185006 -260609 -108935 292184 -116055 -173897
18386 -173897 -129780 66522 145195 -150407 -25861 -6005 50700 31559 122372 242361 -44863
18374 204477 -25183 -166040 -56254 -505918 112712 92356 -217375 269265 -247999 45251
18363 102317 -10849 58267 133789 51970 104360 -31989 -449879 -57289 107301 150754 170282
18352 170282 -65584 156850 118231 -168880 203337 335439 257099 -256817 -137453 -280225
$$ packed form
18429A80257c14192G7806b56620n5919a26214A24283i4662A64894a1369k9695
18419d1064A43945c0988E3661J34146b9640B02325c15721C8710A0703R1441b93770
18407H4974a20381G3748c54086a18245j30288a8410E2197f2078b4226j81273r0641
18396b96140C3189a96202D2296g7937j07069p5603a08935B92184a16055n7842
18386a73897M4117F6522P8673a50407b5861f005E0700j9141R0813J19989d4863
18374B04477b5183j40857e6254m49664A12712k0356b17375B69265b47999D5251
18363A02317a0849E8267P5522E1970N2390c1989m17890e7289A07301M3453J9528
18352A70282f5584A56850l8619a68880B03337J32102p8340b56817J19364j42772
$$ plain form
18342 -280225 -82799 -298421 82507 -208229 -5877 76189 -300116 -393226 106642 -309029 164226
18330 45702 -7377 -29229 163432 52989 -83814 24363 -64717 63854 -192496 55692 82775
18319 82775 178955 -174630 -302036 -88595 -227668 -64149 -65370 112304 -77401 -27610 11841
18307 -204530 -317752 -93231 199611 85452 -274383 65487 81661 -193868 -31627 -81893 25402
18295 33302 -468672 -44291 121401 215371 13292 -117317 33339 -416286 -202465 70084 -585091
18283 -118385 176144 20950 99187 -291633 221911 -63848 -342404 -265112 -526947 29257
18272 44576 49829 -69774 -226459 156844 -226911 95487 76312 -186625 213971 -172720 -291355
18261 -291355 153494 -200007 -177017 74610 -274043 259326 -261512 73751 -68000 -193193
$$ packed form
18342b80225h2799k15622H2507b08229e877G6189c00116r3110A06642c09029A64226
18330D5702g377k1852A63432E2989h3814B4363f4717F3854a92496E5692K7083
18319H2775R6180a74630j27406h8595j39073f4149j221A12304g7401b7610A1841
18307b04530j13222i3231A99611H5452b74383F5487J6174a93868c1627n0266B5402
18295C3302d68672d4291A21401R3970A3292a17317C3339d16286b02465G0084e85091
18283a18385A76144B0950P8237b91633B21911f3848k78556P7292k61835B9257
18272D4576N253f9774j56685A56844b26911I5487j9175a86625B13971a72720j18635
18261b91355A53494b00007K2990G4610b74043B59326b61512G3751f8000j25193
$$ plain form
18251 -193193 -130335 -62709 -304360 72820 25747 307777 362259 -71480 -14665 -210562 120138
18239 -225709 -360509 134231 -300445 118314 2521 -141013 67832 -22322 -299341 -226922
18229 -226922 -130762 -20285 14141 -216976 141943 -15167 17380 61961 -58395 -438923 -72378
18217 -36537 77984 99344 -215320 -13705 -382183 51798 186458 -281554 -24035 -117690 138485
18205 172929 61340 86956 -26943 75893 232967 -238189 203395 -199756 -54803 231430
18194 42334 256993 92901 -4901 215688 -100967 -126718 -84461 -357802 -36872 5674 39412
18183 39412 274884 40848 75325 -8651 144007 -245653 -355609 -214976 199513 237378 -116822
18171 12931 95325 -269038 79617 83186 178088 -5515 63700 149397 -20809 8339 62115 195079
$$ packed form
18251a93193O2858f2709k41651G2820B5747K82030N4482g1480a4665j95897A20138
18239b25709j34800A34231c00445A18314B521a41013F7832b2322k77019P2419
18229b26922R6160b0285A4141b16976A41943a5167A7380M4581e8395l80528g2378
18217c6537G7984K1360b15320a3705l68478E1798J34660b81554b4035r3655A38485
18205A72929F1340K5616b6943G5893J57074b38189B03395a99756e4803B31430
18194D2334K14659I2901d901B15688a00967k5751M2257k73341c6872E674L3738
18183C9412K35472D0848L4477h651A44007b45653j09956J40633A99513L7865a16822
18171A2931Q2394b69038G9617L569R4902e515F3700Q5697b0809H339N3776J32964
$$ plain form
18159 195079 -188885 -96254 245463 219837 125390 -45932 -163922 -91563 257851 -15995 32347
18147 266024 -23850 -33069 39022 -171841 245618 -327848 291227 56845 -289317 -179946
18137 -179946 201196 201729 -14902 -41419 59872 -202859 -346503 4731 206546 -268249 -22479
18125 -261005 -126588 89988 -63622 329789 34382 -248935 -46888 -169758 -262458 -171212 -469
18113 -5176 -211430 -182145 -203198 228964 23665 215733 370973 218808 -100239 -104733 -132823
18102 -132823 -221470 -58710 -125408 -293525 105478 58551 82447 3147 160283 -54972 -5161
18090 -224795 -151793 -8314 -37385 -271455 -531724 -212920 -87546 -125804 51317 162181 -56011
18078 -249493 -220412 297921 -190166 -362277 102570 -84262 143150 125795 -76165 -26936
$$ packed form
18159A95079a88885R2631B45463k5626r4447d5932j17990P2359B57851a5995C2347
18147B66024b3850r219C9022a71841B45618c27848B91227E6845b89317J09371
18137a79946B01196N33a4902k6517E9872b02859j43644D731K01815b68249b2479
18125b61005a26588H9988f3622C29789C4382b48935d6888j22870r2700R1246d69
18113e176k06254K9285k1053B28964B3665J92068J55240j52165a00239m494k8090
18102a32823q8647e8710o6698j68117A05478m6927K3896C147J57136e4972e161
18090b24795P3002h314k9071k34070k60269b12920h7546l8258E1317J10864e6011
18078b49493K9081B97921a90166j72111A02570h4262A43150j7355g6165b6936
$$ plain form
18067 101796 -188317 -16235 46169 -151045 68062 59923 -125505 -164426 -28716 90005 -245982
18055 -303501 276270 61608 66646 -7391 150928 -73397 328051 109174 15580 126278 334507
18044 334507 -55649 -62269 -123148 22850 156464 -26686 -131561 232891 -55027 104996 -128921
18032 15620 166934 30591 -278068 262096 -86976 -114426 62116 -348814 -106294 276632
18021 -191038 30666 -8782 -129906 -111883 -148353 -130766 74345 -115880 -132249 153159 311207
18010 311207 368652 -193600 63251 -612923 34964 -474235 -58748 -108037 -405 29211 -52593
17998 -9201 -403581 -88631 -201365 -56288 57141 170073 -241424 39846 -13917 62502 46817
17987 46817 -42482 150579 -113687 43816 -137048 87123 55943 -298199 -162902 -21180 -74491
$$ packed form
18067A01796a88317a6235D6169a51045F8062q139a25505l8921b8716I0005b45982
18055c03501B76270F1608N038g391A50928g3397C28051A09174A5580J10698K08229
18044C34507e5649o620o0879B2850J33614b6686j04875B32891e5027A04996a28921
18032A5620J51314C0591b78068B62096h6976k7450F2116c48814a06294B76632
18021a91038C0666h782j21124J8023l6470J7587G4345a15880j6369A53159J58048
18010C11207N7445a93600F3251f12923C4964d74235e8748m9289d05B9211e2593
17998i201l94380h8631j12734e6288E7141J12932b41424C9846a3917F2502j5685
17987D6817d2482A50579a13687D3816a37048H7123l1180b98199J35297b1180n3311
$$ plain form
17976 -74491 -42087 -44046 -144227 -377725 160729 -131901 -56097 -25844 85617 -346787 82918
17964 28943 -75946 168319 -80033 -8974 64420 83065 4794 51691 -41743 -149405 34144 231060
17952 231060 227191 33085 -43299 203593 158502 73095 -198367 34730 87133 -56390 108825
17940 147615 240050 178158 -96289 8369 86618 78492 -10685 -170479 110364 84763 76575 201809
17928 201809 -145870 293756 41915 -374287 225759 -230028 -150882 -19880 -101533 112511
17917 91806 82422 -168478 -173137 -87521 -69077 88680 119645 24158 72073 93077 -13374 -346705
17905 -346705 -109175 -220498 -177675 182074 88551 25439 63239 -139920 248953 269330
17895 269330 -15231 27743 -38749 -216507 -109801 -217395 -129098 111149 -21449 254108
$$ packed form
17976g4491L2404j959j00181k33498A60729a31901e6097b5844H5617c46787H2918
17964B8943g5946A68319h0033h974F4420J8645D794M6897d1743j07662C4144J96916
17952B31060l869C3085d3299B03593m5091G3095a98367C4730N2403e6390A08825
17940A47615R2435o1892i6289H369P8249q126a0685j59794A10364k5601q188J25234
17928B01809a45870B93756D1915c74287B25759b30028P9146a9880q1653A12511
17917I1806r384a68478m659Q5616J8444H8680L0965B4158M7915K1004a3374l33331
17905c46705a09175j11323M2823A82074H8551B5439L7800a39920B48953K0377
17895B69330a5231B7743c8749j77758J06706j07594Q8297A11149b1449B54108
$$ plain form
17884 99346 137269 164465 -135028 181610 -173520 79167 110167 104247 355383 -183880 -198402
17873 -198402 -193742 -175660 -98262 -43936 -468772 -43707 73338 -231345 -20387 192945 177453
17862 177453 -376282 180368 76521 39613 -10253 -111869 208369 223559 15954 52164 -125244
17850 204412 -406622 -114867 62858 -254478 105913 55104 -155932 127165 -98857 221187
17839 -38105 -207578 22797 233300 233398 -170064 65838 176805 353586 72 -28972 122826 242616
17827 242616 -10103 52664 -159129 -106065 32779 -71584 333315 -252606 5261 131402 -201461
17815 49404 -236943 146407 -62512 -90798 -198653 -29104 72863 -246580 129440 32439 137649
17804 137649 120796 -190674 181707 -69213 -158411 -165577 96233 2774 60018 -101770 171593
$$ packed form
17884I9346L7923K7196a35028A81610a73520G9167L1000n920K51136a83880j4522
17873a98402M660J8082P7398d3936m24836d3707G3338b31345b0387A92945j5492
17862A77453c76282A80368G6521l6908a0253j01616B08369J5190A5954L6210a25244
17850B04412d06622a14867F2858b54478A05913n0809a55932A27165i8857B21187
17839c8105j69473B2797K10503R8a70064F5838J10967J76781G2b8972A22826J19790
17827B42616a0103E2664a59129N3064C2779g1584C33315b52606E261J26141b01461
17815D9404b36943A46407f2512k8286j07855b9104G2863b46580A29440C2439J05210
17804A37649j6853a90674A81707f9213q9198p166I6233B774N7244a01770A71593
$$ plain form
17792 -135478 -88745 -21409 259794 -82660 -41130 249843 -84698 -113969 -47601 232122 60161
17780 -235139 32183 -434560 106133 -60045 -143892 263158 66874 53364 -31772 228083 -117775
17768 42518 -127447 -14204 352943 40227 161053 -43094 -239480 51195 104776 171456 -19838
17756 226611 206326 124200 -32220 169153 8677 -70745 171997 -99640 279090 164131 -3037
17744 179445 -84977 47629 -5651 85314 122787 75771 184218 -209931 248197 -56171 -197785
17733 -197785 -37804 120348 475581 151091 -183182 144850 -72345 158604 -183123 51899
17722 9989 61054 -164656 -90521 274553 -45098 208526 -391642 198437 -20344 216829 97882
17710 -70333 -23323 41326 -198980 76716 96454 29472 150298 -141782 106254 -265954 -73933
$$ packed form
17792a35478M6733b1409B59794h2660d1130B49843h4698k9271d7601B32122F0161
17780b35139C2183d34560A06133f0045q3847B63158F6874j3510c1772B28083a17775
17768D2518a27447a4204C52943D0227J20826d3094j96386E1195N3581O6680a9838
17756B26611k0285q2126c2220A69153H677g0745A71997i9640B79090j14959c037
17744A79445h4977D7629e651H5314L7473m7016J08447b09931B48197e6171j41614
17733a97785c7804A20348L55233A51091a83182A44850g2345A58604a83123E1899
17722I989N1065a64656P4135B74553d5098B08526c91642A98437b0344B16829I7882
17710g0333b3323D1326a98980G6716J9738B9472J20826a41782A06254b65954g3933
$$ plain form
17698 158972 -103113 -277374 -189872 -47535 -208174 -71635 77378 -67226 -243423 -25275 83882
17686 197819 -155201 145637 69584 145011 -16016 234740 146953 318405 -6859 -15287 154169
17674 -26627 -144392 -185329 118765 -346705 205990 -28461 -97937 -276117 -8259 -74268 278424
17662 -116686 187825 -3274 140181 -103961 264841 -11608 -71278 -187700 -37663 -230108
17652 -230108 -136850 8679 222438 -76904 -126681 -3743 21000 -261566 -188762 -14331 -261830
17641 -261830 69781 -82729 -38409 -167101 -32790 82527 -475227 59051 178100 82707 195493
17630 195493 -58433 -348230 37371 200802 105761 90631 107230 230590 51428 8980 99629
17619 99629 12924 1114 7273 148665 -98735 267204 75462 -39067 130441 239112 200537
$$ packed form
17698A58972a03113j74261Q7502d7535j60639g1635G7378f7226j76197b5275H3882
17686A97819a55201A45637F9584P5427a6016B34740q7787J71452f859q428A54169
17674b6627j17765m0937A18765c46705B05990b8461o9476j78180h259o6009B78424
17662a16686A87825c274A40181a03961B64841a1608n9670j16422c7663j92445
17652b30108R3258H679K13759g6904m9777c743B1000b61566P2804a4331k47499
17641b61830F9781h2729c8409j28692c2790H2527d75227E9051J19049H2707J12786
17630A95493e8433k89797C7371J63431r5041j5130J6599J23360E1428H980R0649
17619I9629A2924A114O159J41392i8735B67204G5462c9067A30441J08671l8575
$$ plain form
17608 200537 -29995 138435 -242336 -236532 -23742 -55429 174993 -237180 260247 96150 99540
17597 99540 184080 68177 -196213 158751 -74288 -145156 256679 263400 70579 79469 -125511
17585 158045 31251 55328 86236 -132459 -64716 69590 261009 -58757 164158 -61110 162511
17573 121988 26180 205775 -73375 399786 80420 122389 221094 145473 72584 115160 87466
17562 87466 239977 247179 33429 235521 48848 -158360 98068 346541 -4154 220510 -72555
17550 64462 118850 317085 -79391 253987 -66974 384636 316172 115512 380647 291593 237839
17539 237839 367993 93080 235346 80861 110063 53803 78608 131278 112422 -77029 -356201
17528 -356201 385830 171535 68 204217 211338 -41057 284671 -209413 100864 99402 -161331
$$ packed form
17608B00537b9995A38435b42336N804b3742l1687A74993b37180B60247I6150L390
17597I9540Q4540F8177a96213A58751g4288p0868B56679O721G0579Q890a25511
17585A58045C1251K4077L0908a32459f4716F9590J91419e8757A64158f1110A62511
17573A21988B6180J79595g3375C99786H0420M1969R8705p5621G2584M2576k7694
17562H7466J52511P202C3429K02092D8848a58360I8068K48473d154B20510g2555
17550F4462N4388J98235g9391B53987f6974C84636o8464A15512K65135q9054n3754
17539B37839J30154I3080J42266H0861K9202E3803K4805N2670j8856g7029k79172
17528c56201C85830A71535F8K04149P121d1057B84671b09413A00864j462a61331
$$ plain form
17516 337686 174076 312848 116972 89974 136173 363397 379995 237184 166762 -291032
17505 154433 -25280 65838 -67374 -35480 82746 194583 -6614 41244 259108 108450 279945
17494 279945 119295 -6498 37365 197045 -226986 -64360 -303268 83947 1315 206864 387040
17483 387040 -63578 90957 81324 86145 -20191 -7913 13186 -12273 266543 158306 79149 527618
17471 527618 -278046 23434 -23453 185811 99616 207249 -101790 248867 227280 -57950
17460 188529 495128 -64088 66180 33242 20228 -7392 -25462 -34520 23713 94324 -27472 -254772
17448 -254772 69577 263729 -92067 -95751 -229503 -201368 -113789 126989 251783 65866 681750
17437 681750 453136 268854 151416 296699 370535 438372 486304 170787 109610 -71298
$$ packed form
17516C37686j63610J38772A16972k6998M6199K27224J6598j42811p0422b91032
17505A54433b5280F5838f7374L1894H2746J11837f614D1244K17864A08450J71495
17494B79945A19295f498C7365J59680b26986f4360k38908H3947A315K05549J80176
17483C87040f3578I0957r633M821b0191g913A3186a2273B66543j08237G9149M48469
17471E27618b78046B3434b3453A85811q6195J07633a01790B48867k1587e7950
17460A88529L06599f4088F6180l2938j3014g392j8070r058B3713P0611b7472k27300
17448b54772F9577J94152i2067l684j33752K8135Q7579A26989J24794F5866O15884
17437F81750k28614j84282j17438J45283P3836O7837M7932A70787o1177g1298
$$ plain form
17426 329034 320332 18303 400363 -286589 350376 -94455 186490 405433 -9886 168981 183954
17415 183954 237436 136254 116247 413041 140886 292761 258406 277554 187770 302572
17405 302572 201969 261391 439643 153023 354762 188367 122437 96749 161648 -1340 193787
17393 166935 286893 -180556 230946 252235 244267 -29094 335867 -9819 83347 118871 105436
17382 105436 291898 150271 95485 206633 299780 -19647 401601 380626 353609 149639
17371 85919 441677 162401 128194 289394 144258 -58924 -89929 86883 379885 -154217
17360 104362 134962 61634 -16152 203810 89114 127116 227779 93397 256232 -194622 240790
17348 281764 15184 247115 30337 3328 340983 -251732 -46131 345149 -11872 -48552 175079
$$ packed form
17426C29034q702A8303L82060b86589C50376i4455A86490K18943i886A68981J4973
17415A83954N3482j01182k0007K96794A40886J51875l4355J9148q9784J14802
17405C02572j00603N9422J78252A53023K01739j66395o5930k5688O4899a340A93787
17393A66935J19958a80556B30946K1289p968b9094C35867i819H3347L5524j3435
17382A05436J86462j41627n4786J11148R3147a9647D01601k0975k7017A49639
17371H5919L55758A62401l4207J61200A44258e8924l1005H6883K93002a54217
17360A04362L0600F1634a6152B03810H9114L8002J00663I3397J62835a94622B40790
17348B81764A5184K31931C0337C328L37655b51732d6131C45149a1872l6680A75079
$$ plain form
17336 182438 6188 22107 21818 137729 -31825 358929 13482 -80754 110400 91485 -122270
17324 290322 28168 -13747 146508 -123890 -31099 210469 -206689 499726 265346 17043
17313 135574 6409 341634 333890 298209 29550 21155 271208 169158 31731 56090 -49048
17301 -142798 211072 417817 273475 289664 329326 251718 252856 185807 232276 95770 208642
17290 208642 205413 212426 126498 195453 231481 460543 -165308 128203 -96857 -28115 571913
17278 188307 164053 2776 109991 114705 216125 -47440 223044 434948 156536 365488 42423
17266 8035 -3201 380772 -10538 354925 -167153 128035 78314 144499 187474 199340 148808
17255 148808 158535 324749 -126196 344106 113178 237893 324505 142864 247311 204413
$$ packed form
17336A82438F188J5919k89J15911c1825C58929A3482h0754A10400j8915a22270
17324B90322B8168a3747A46508a23890c1099B10469b06689D99726k34380A7043
17313A35574F409L35225p744l5681B9550q395K50053j02050C1731K4359d9048
17301a42798B11072K06745j44342J6189L9662p7608J138o7049M6469I5770J12872
17290B08642l229P013q5928O8955L6028K29062a65308A28203i6857b8115E71913
17278A88307k4254B776J07215M714J01420d7440B23044K11904A56536K08952D2423
17266H035c201C80772a0538C54925a67153A28035m9721O6185M2975J1866n0532
17255A48808R727J66214a26196C44106A13178J24715Q6612A42864J04447m2898
$$ plain form
17245 204413 -24938 -141855 36780 20261 237337 462793 249380 179033 437412 12613
17234 185040 378266 530007 249321 103187 72412 -89429 171969 320245 247075 353041
17224 353041 194335 105675 138107 198259 484246 415972 396590 -211574 246469 385232
17214 385232 215163 317154 -50006 67819 335714 349827 -45069 178352 413796 515252
17204 515252 291759 -9446 -44880 44899 436028 298404 29485 314300 -193953 202907
17193 248655 85489 109032 188538 309656 42611 55567 -36123 341559 140583 216182 -12613
17181 144386 354988 359394 163770 38148 -51675 137613 194298 324585 219771 287630 194507
17170 194507 585114 336396 -21133 146989 105649 244457 556733 194674 539174 227943
$$ packed form
17245B04413b4938j16917C6780j6519K17076K25456k13413p0347K58379A2613
17234A85040J93226J51741B49321A03187l0775h9429A71969J48276p3170J05966
17224C53041j58706q8660L2432O0152K85987o8274j9382b11574B46469J38763
17214C85232j70069J01991e0006F7819K67895J4113d5069A78352K35444J01456
17204E15252k23493i446l5434D4899L91129j37624B9485K84815a93953B02907
17193B48655H5489K3543P9506J21118D2611J2956c6123C41559A40583P5599a2613
17181A44386K10602M406A63770C8148e1675A37613N6685J30287j04814O7859r3123
17170A94507L90607k48718b1133A46989m1340J38808L12276A94674L44500B27943
$$ plain form
17159 289311 159479 249608 321963 166556 524269 447534 194259 280247 147410 256397
17149 256397 423338 236526 510242 544444 420902 157317 120612 371639 138056 523244
17139 523244 416948 510701 117113 73198 79576 220990 406594 573258 392247 509311
17129 509311 212856 126998 135079 387606 -47182 506288 206041 336109 139267 360775
17119 360775 633252 622441 311351 511568 559553 97326 147176 406582 47694 396753
17109 396753 144363 119794 201178 407365 583533 281411 174919 417870 412299 632569
17099 632569 543133 505551 383414 334841 337710 617717 156742 528967 409578 386030 557596
17088 557596 214759 315930 477368 636738 178644 438621 731043 463330 350029 622616
$$ packed form
17159B89311j29832R0129P2355j55407L57713p6735A94259Q5988j32837J08987
17149B56397J66941j86812K73716L4202j23542A57317l6705K51027A38056L85188
17139E23244j06296R3753A17113m3915O378J41414J85604J66664j81011J17064
17129E09311B12856q5858Q081K52527d7182E06288B06041J30068A39267K21508
17119C60775K72477j0811l11090K00217M7985I7326M9850K59406D7694L49059
17109C96753A44363k4569Q1384K06187J76168B81411j06492K42951n571K20270
17099F32569q9436l7582j22137m8573K869K80007A56742L72225j19389k3548J71566
17088E57596B14759J01171J61438J59370A78644K59977K92422k67713j13301K72587
$$ plain form
17078 622616 411893 514095 370578 647643 328933 76813 615334 202255 282390 435492
17068 435492 407590 398444 669387 434023 22061 322550 236451 794708 516708 478667 383271
17057 383271 465933 497037 476447 643773 538774 315939 386112 528546 612631 350623
17047 350623 255534 260031 306962 460714 200318 585901 425944 350598 663454 432197
17037 432197 447731 356431 542105 518944 466576 358716 527035 224566 545833 211809
17026 695595 576681 457582 601543 612876 641915 525172 417201 611286 647564 460255
17016 460255 635533 595706 622989 603297 362679 839399 676580 536142 397461 884386
17006 884386 781256 303897 499249 718623 456794 444931 582457 664128 724015 433220
$$ packed form
17078F22616k10723J02202j43517K77065l18710G6813N38521B02255Q0135J53102
17068D35492k7902r146K70943k35364B2061L00489q6099N58257k78000l8041r5396
17057C83271Q2662L1104k0590J67326j04999k22835P0173J42434Q4085k62008
17047C50623r5089M497M6931J53752B00318L85583j59957p5346L12856k31257
17037D32197J5534r1300J85674k3161n2368j07860J68319B24566L21267B11809
17026F95595j18914j19099J43961J1333K9039j16743j07971J94085L6278j87309
17016D60255J75278l9827K7283j9692k40618M76720j62819j40438j38681M86925
17006H84386j03130C03897J95352K19374k61829j1863J37526Q1671N9887k90795
$$ plain form
16996 433220 638270 757212 486012 729197 590962 570986 551778 531866 741457 744861
16986 744861 669779 557306 469330 594714 412299 1021302 626110 699845 692458 707131 696077
16975 696077 802964 935014 839064 819540 893069 857248 852899 904932 748963 982860 787227
16964 787227 897793 764094 892004 820519 713914 742984 766572 741044 540900 1036096
16954 1036096 886846 807616 941294 1269144 1095906 707809 930830 1386999 856318 1142346
16944 1142346 960283 780307 1252962 952379 931242 973906 907976 1282550 872660 995434
16934 995434 943823 1116513 1140557 957497 1098750 1234730 1003726 893386 1201738 979843
16924 979843 999875 1164823 1266458 1184748 1443342 1392180 1053309 1034280 1511200 1177307
$$ packed form
16996D33220K05050J18942k71200K43185j38235j9976j9208j9912K09591L404
16986G44861p5082j12473q7976J25384j82415O09003l95192P3735p387J4673j1054
16975F96077J06887J32050r5950j9524P3529l5821m349N2033j55969K33897j95633
16964G87227J10566j33699J27910p1485j06605K9070K3588k5528k00144M95196
16954A036096j49250p9230J33678L27850j73238l88097K23021M56169n30681K86028
16944A142346j82063j79976M72655l00583k1137M2664o5930L74574m09890J22774
16934I95434n1611J72690K4044j83060J41253J35980k31004j10340L08352k21895
16924I79843K0032J64948J01635q1710K58594n1162l38871j9029M76920l33893
$$ plain form
16914 1177307 1074088 1339353 1151068 1733125 1400671 1244343 1354242 1329119 1329856 1289180
16904 1289180 1544788 1094813 1650698 1311786 1220372 1269029 1410549 1195953 1566145 1488538
16894 1488538 1370414 1704456 1685469 1758387 1443442 1528495 1435207 1846298 1684739 1516888
16884 1516888 1743229 1577802 1708622 1747406 2028836 1745031 2026113 1968346 1802463 1867358
16874 1867358 1958775 1734372 1778702 2115874 2109351 1796131 2214316 2111549 1837409 2101768
16864 2101768 2043383 2188015 2107019 2282395 2232410 2404157 2300384 2362528 2414091 2064498
16854 2064498 2609259 2585645 2623830 2639922 2852229 2265253 2706867 2794529 2250024 3071075
16844 3071075 3141713 3063998 2776812 3192914 3011302 3061442 2891316 3076176 3130554 2975896
$$ packed form
16914A177307j03219K65265j88285N82057l32454j56328J09899k5123P37m0676
16904A289180K55608m49975N55885l38912r1414M8657J41520k14596L70192p7607
16894A488538j18124L34042j8987P2918l14945Q5053r3288M11091j61559j67851
16884A516888K26341j65427J30820L8784K81430k83805K81082n7767j65883O4895
16874A867358R1417k24403M4330L37172o523l13220M18185j02767k74140K64359
16864B101768n8385J44632q0996J75376m9985J71747j03773O2144N1563l49593
16854B064498N44761k3614L8185J6092K12307n86976M41614Q7662n44505Q21051
16844C071075P0638p7715k87186M16102j81612N0140j70126J84860N4378j54658
$$ plain form
16834 2975896 3098754 3405818 3440764 3334401 3331208 3510399 3645129 3771082 3743059 3768865
16824 3768865 3422596 4131820 4023782 3927294 4338599 4272206 4043912 4288218 4568093 4695922
16814 4695922 4935416 4699041 4954806 4614380 5168678 5405055 4927889 5269185 5300988 5409840
16804 5409840 5838670 5542409 5744026 5802254 5725892 6084044 6260917 6380082 6420395 6371667
16794 6371667 6319128 6923155 7053389 7175989 7306521 7623143 7527421 7917685 8101126 8147175
16784 8147175 8445935 8730068 8819134 9230433 9134504 9608831 9927833 9987063 10712592 10440327
16774 10440327 10588132 11441582 11880565 12087036 12208796 12560282 12914285 13443445 13615925
16765 13615925 14493907 15092601 15098899 16070411 16073600 16520062 17269228 17591900 18470699 19142195
$$ packed form
16834B975896J22858L07064L4946j06363l193J79191J34730J25953k8023K5806
16824C768865l46269P09224j08038r6488M11305o6393k28294K44306K79875J27829
16814D695922K39494k36375K55765l40426N54298K36377m77166L41296L1803J08852
16804E409840M28830k96261K01617N8228p6362L58152J76873J19165M0313m8728
16794F371667n2539O04027J30234J22600J30532L16622r5722L90264J83441M6049
16784H147175K98760K84133Q9066M11299r5929M74327L19002N9230P25529k72265
16774A0440327J47805Q53450M38983K06471J21760L51486L54003N29160J72480
16765A3615925Q77982N98694O298R71512L189M46462P49166L22672Q78799O71496
$$ plain form
16755 19142195 19852825 20724398 21614123 22065170 23116183 24118529 25014813 26096888 27011263
16746 27011263 27982834 29500211 30446534 32216103 33419848 35025591 36738891 38632904
16738 38632904 40509106 42566668 44707740 46857746 49275058 51957344 54703253 57542765
16730 57542765 61060530 64867864 68252485 72256417 76871970 81696324 86103321 91888342
16722 91888342 97884476 103568215 109954246 116669127 123778059 131260950 139120026 146891546
16714 146891546 154723320 163087055 170811675 178700763 185825474 192246967 197934179 202861619
16706 202861619 206442454 208357539 209081992 208267213 206147140 202754359 197493453 191512857
16698 191512857 185146139 177654267 169482175 161458333 153071086 144568848 136669648 128766426
$$ packed form
16755A9142195P10630Q71573Q89725M51047J051013J002346Q96284J082075R14375
16746B7011263R71571J517377R46323J769569J203745J605743J713300J894013
16738C8632904J876202K057562K141072K150006K417312K682286K745909K839512
16730E7542765L517765L807334L384621M003932M615553M824354M406997N785021
16722I1888342N996134N683739O386031O714881P108932P482891P859076P771520
16714A46891546P831774Q363735P724620P889088P124711O421493N687212M927440
16706B02861619L580835J915085P24453q14779k120073l392781n260906n980596
16698A91512857o366718p491872q172092q023842q387247q502238p899200p903222
$$ plain form
16690 128766426 121497966 113997647 106849026 100197049 94193518 88394981 82856681 77776216
16682 77776216 72934312 68510730 64605304 60727130 57317114 53960362 51001375 47974974
16674 47974974 45515199 42935162 41164374 38985473 36964660 35032477 33257558 31738653
16666 31738653 30173431 28761715 27599435 26518387 25285922 24155230 23479993 21892555
16658 21892555 21513641 20896990 19979818 19074525 18340424 17560965 16560748 16403107 15706758
16649 15706758 14905811 14506842 14355709 13928038 13417611 12896394 12177293 11975890 11789231
16640 11789231 11307226 11283916 10502231 10269130 10149734 9578347 9396149 9265913 9006354
16631 9006354 8473908 8366257 7900030 7720825 7579488 7664816 7326115 7175623 6734907 6828847
$$ packed form
16690A28766426p268460p500319p148621o651977o003531n798537n538300n080465
16682G7776216m841904m423582l905426l878174l410016l356752k958987l026401
16674D7974974k459775k580037j770788k178901k020813j932183j774919j518905
16666C1738653j565222j411716j162280j081048j232465j130692o75237j587438
16658B1892555l78914o16651r17172r05293p34101p79459j000217j57641o96349
16649A5706758q00947l98969j51133m27671n10427n21217p19101k01403j86659
16640A1789231m82005k3310p81685k33101j19396n71387j82198j30236k59559
16631I006354n32446j07651m66227j79205j41337Q5328l38701j50492m40716R3940
$$ plain form
16621 6828847 6519570 6624213 6377555 6244664 6059094 5952163 5610596 5694815 5338727 5598198
16611 5598198 5142650 5233999 4759378 5106843 4925553 5091628 4653669 4917381 4343818 4407947
16601 4407947 4276743 4163290 4096695 4051336 3920606 3574455 3542841 3610793 3753251 3269132
16591 3269132 3511869 3555044 3515562 3461595 3071104 3418968 3047992 3055310 3075278 2643762
16581 2643762 2638015 2873012 2770512 2741648 2455714 2572627 2614583 2699847 2396599 2344279
16571 2344279 2909581 2451854 2475191 2540026 2330822 2361751 2347864 2176376 2293458 2039267
16561 2039267 2133454 2009830 2103902 1826441 1954068 1913320 2039441 1701731 1844329 2343225
16551 2343225 1847961 1913162 1783370 1721508 1832867 1722984 1705487 1747000 1557673 1279184
$$ packed form
16621F828847l09277J04643k46658j32891j85570j06931l41567Q4219l56088K59471
16611E598198m55548R1349m74621L47465j81290J66075m37959K63712n73563O4129
16601D407947j31204j13453o6595m5359j30730l46151l1614O7952J42458m84119
16591C269132K42737M3175l9482n3967l90491L47864l70976P318J9968m31516
16581B643762n747K34997j02500k8864k85934J16913M1956Q5264l03248n2320
16571B344279N65302m57727K3337O4835k09204L0929j3887j71488J17082k54191
16561B039267R4187j23624R4072k77461J27627m0748J26121l37710J42598M98896
16551B343225m95264O5201j29792o1862J11359j09883j7497M1513j89327k78489
$$ plain form
16541 1279184 1519213 1453439 1453465 1473698 1299094 1456101 1829780 1153292 1410357 1410194 1162572
16530 1162572 1268171 1562766 1396726 1329975 1393542 1243203 1222008 1124073 1267806 1205620
16520 1205620 1016808 1075122 1270190 1150590 1233724 1180399 925441 1272394 1018932 1500455
16510 1500455 1133247 974281 1230797 1006910 965175 1129728 862422 1212206 931179 1025184
16500 1025184 800811 1115747 995991 740078 798492 1122175 926527 610878 882712 1044219
16490 1044219 795760 890773 1003432 763916 480731 986036 819142 588700 860699 854543
16480 854543 939750 1004250 1043847 677569 775689 813863 449096 986585 625402 609838 453776
16469 453776 748170 487662 461578 643233 354487 607666 704924 564878 573981 855397
$$ packed form
16541A279184K40029o5774K6K0233j74604J57007L73679o76488K57065j63k47622
16530A162572J05599K94595j66040o6751O3567j50339k1195r7935J43733o2186
16520A205620j88812N8314J95068j19600Q3134n3325k54958L46953k53462M81523
16510A500455l67208j58966K56516k23887m1735J64553k67306L49784k81027R4005
16500A025184k24373L14936j19756k55913N8414L23683j95648l15649K71834J61507
16490A044219k48459R5013J12659k39516k83185N05305j66894k30442K71999o156
16480H54543Q5207O4500L9597l66278R8120L8174l64767N37489l61183j5564j56062
16469D53776K94394k60508k6084J81655k88746K53179R7258j40046R103K81416
$$ plain form
16459 855397 503596 660735 679824 401396 612903 851383 486279 555157 664013 422924
16449 422924 590243 571847 490452 846264 316674 531830 607601 498310 857056 859733
16439 859733 514497 226877 626243 588570 355904 434955 458714 519434 435698 441812 253672
16428 253672 715527 769634 371738 438874 593511 466320 544619 374906 572187 239463
16417 455964 689576 476616 334236 294873 362795 332034 632986 661776 386594 758342
16407 758342 335527 371885 138266 484379 302041 364507 223412 637030 388418 174901
16396 226050 285543 542638 439640 274564 111467 240895 290474 512880 -671 389902
16385 220867 262819 444368 459295 77774 106911 272056 312296 510698 349921 174996
$$ packed form
16459H55397l51801J57139J9089k78428K11507K38480l65104O8878J08856k41089
16449D22924J67319j8396q1395L55812C16674K15156P5771j09291L58746K677
16439H59733l45236B26877L99366l7673k32666P9051K3759O0720q3736O114j88140
16428B53672M61855N4107C71738O7136J54637j27191P8299j69713J97281B39463
16417D55964K33612k12960j42380l9363O7922l0761L00952K8790k75182L71748
16407G58342C35527L6358A38266L46113j82338O2466j41095M13618k48612A74901
16396B26050N9493K57095j02998j65076A11467J29428M9579K22406f71C89902
16385B20867M1952J81549J4927G7774K9137J65145M0240J98402j60777j74925
$$ plain form
16375 174996 214273 102081 292915 257068 181287 235358 39549 369248 337613 347441 240051
16364 240051 68143 225839 65905 209089 335568 323922 497883 210497 281674 109841
16353 377856 219372 -223214 192807 244799 173714 164064 357688 268005 181010 277724 283061
16342 283061 346012 486156 -154204 -59796 -108862 222291 395050 230410 231927 -96212 369352
16330 454434 35813 328642 346437 225508 492482 607428 186013 83435 248240 491538
16320 491538 246038 435693 154693 203846 89822 250014 184377 271909 311623 429783
16310 429783 206696 189100 58985 -42245 138535 33707 372090 130523 154526 307739
16300 307739 268635 358243 104362 416159 192361 88113 48537 207795 -46904 185405
$$ packed form
16375A74996L9277A02081J90834l5847p5781N4071C9549L29699l1635R828j07390
16364B40051F8143J57696F5905J43184J26479j1646J73961B10497P1177A09841
16353C77856j58484b23214A92807N1992p1085r650J93624q9683q6995R6714N337
16342B83061O2951J40144a54204e9796m9066B22291J72759j64640J517i6212C69352
16330D54434C5813K92829J7795j20929K66974J14946A86013H3435J64805K43298
16320D91538k45500J89655A54693M9153H9822J60192o5637Q7532L9714J18160
16310D29783B06696j7596E8985d2245A38535C3707L38383A30523K4003J53213
16300C07739l9104Q9608A04362L11797A92361H8113l9576J59258d6904A85405
$$ plain form
16289 -46765 519435 227761 89250 134350 486308 204325 429843 -66437 7954 19665 218405
16278 218405 80745 306705 104534 -586 40206 50199 4955 204826 -182269 41686 74552
16267 74552 229429 24893 -39326 164053 22474 1921 519779 -110941 247995 -31990 -161580
16256 -161580 318065 18367 282200 347671 -147695 -115485 164873 134629 265407 -170338
16245 -32819 -41068 -132563 -231288 170788 25357 -108622 140516 276788 15663 -122979 176523
16233 -84976 351942 381033 -216807 142110 239861 2590 279666 29904 119977 260604 372368
16222 372368 -41098 -64156 181563 -136538 63260 -33736 12772 -94895 -379616 82702 169527
16211 169527 64024 -66181 143631 55986 79910 -187975 98105 190386 75071 -301045 -251216
$$ packed form
16289d6765E19435B27761H9250M5100L51958B04325K25518f6437G954J1711J98740
16278B18405H0745K25960A04534e86D0206R993D955J99871a82269D1686L2866
16267G4552J54877B4893c9326A64053B2474A921N17858a10941B47995c1990j29590
16256a61580C18065A8367K63833O5471a47695L2210A64873l0244J30778a70338
16245c2819q249r1495r8725A70788B5357a08622A40516J36272A5663a22979A76523
16233h4976C51942K9091b16807A42110R7751B590K77076B9904R0073J40627J11764
16222C72368d1098k3058A81563a36538F3260c3736A2772i4895k84721H2702Q6825
16211A69527F4024f6181A43631E5986K3924a87975I8105R2281G5071c01045M9829
$$ plain form
16200 -251216 287436 187358 -148814 -65952 47663 -185189 197762 -88508 64420 350694
16190 350694 -113857 210590 71885 144009 -61293 -63475 132015 278960 130957 -81957 -104882
16179 -104882 72788 -279360 77674 -116777 153483 -85758 9987 101335 25416 124993 217418
16168 217418 -152532 178387 269432 121700 -77769 -101459 141995 23551 -78838 -1839 419056
16156 -115611 119449 -141996 382170 195378 81689 151795 -120035 3895 -111522 228429
16145 -153115 96509 180893 -200024 -59784 -149552 289186 246115 167596 -248326 -57634 131658
16133 136340 68889 -97975 300999 253638 -303447 -44804 -17976 149948 -40120 111743 7959
16121 250175 201875 45177 1360 132593 -307043 94299 -18830 262810 78543 88249 -317695
$$ packed form
16200b51216B87436j00078a48814f5952D7663a85189A97762h8508F4420K86274
16190C50694a13857B10590G1885P2124f1293k182A32015J46945A30957h1957k2925
16179a04882G2788b79360G7674a16777A53483h5758I987R1348B5416R9577R2425
16168B17418a52532A78387R1045A21700g7769k3690A41995B3551g8838a839D19056
16156a15611A19449a41996C82170j86792H1689P0106a20035C895a11522B28429
16145a53115I6509Q4384b00024e9784q9768B89186m3071p8519b48326e7634A31658
16133A36340o7451i7975C00999m7361c03447d4804a7976A49948d0120A11743G959
16121B50175m8300D5177A360J31233c07043I4299a8830B62810G8543R706c17695
$$ plain form
16109 275202 100247 -28732 42304 150523 17010 6034 -215044 111416 166633 324113 -285988
16097 -184207 -5513 250241 -58206 -216823 300670 32631 77535 227539 -141231 77913 173418
16086 173418 -332056 251537 29859 260138 50183 -23649 -356429 315023 60912 259400
16076 259400 221384 -20620 145026 144216 -217707 58830 -63866 -14047 274504 -135158 -303834
16065 -303834 187738 127503 -169220 -41102 -197889 76236 -227379 -23550 -287159 -11946
16054 -125777 160782 -250776 86528 -7703 -185048 -138004 33827 -267645 501352 133715
16043 145636 -119992 -53336 -70204 -32383 111302 -270762 -131366 151895 -114335 -76180
16033 -76180 88033 -197048 90820 -76457 219321 -205191 54381 -50082 -21066 -195319 80276
$$ packed form
16109B75202A00247b8732D2304J08219A7010F034b15044A11416N5217J57480b85988
16097a84207e513B50241e8206j58617C00670C2631M4904J50004a41231G7913R5505
16086A73418c32056B51537B9859K30279E0183b3649l32780C15023F0912J98488
16076B59400l8016b0620A45026q10b17707E8830f3866a4047B74504a35158j68676
16065c03834A87738o0235a69220d1102j56787G6236b27379b3550k63609a1946
16054a25777A60782b50776H6528g703j77345M7044C3827b67645E01352A33715
16043A45636a19992e3336j6868c2383A11302b70762a31366A51895a14335L8155
16033g6180H8033a97048I0820g6457B19321b05191E4381e0082b1066j74253H0276
$$ plain form
16021 -190864 -59433 -40645 187667 -50179 68782 56542 -16222 -135374 -153090 280740 14694
16009 148675 -237872 -29927 -33547 38583 1394 -230213 -72181 211558 -75300 -161904 -144001
15998 -144001 -582170 -37530 -25295 -60243 -210842 -141129 140330 32535 43775 54869 38857
15987 38857 1447 -187337 -231539 24770 -226093 208235 11827 184568 -15679 116650 38570
15975 -69588 33233 324699 92778 278433 -116134 -63335 131294 368831 165904 249211
15965 249211 2809 161959 3524 174847 71779 16466 -208688 -243197 189074 63937 -444679
15953 54381 -210881 -58157 102680 42699 -54982 -257298 284610 96014 -162522 -115237 39063
15941 -26663 -122816 48588 -110233 -34973 -3903 -90922 450673 -94700 103216 -212199 -123942
$$ packed form
16021a90864e9433J8788A87667e0179F8782j2240a6222j19152j7716B80740A4694
16009A48675b37872b9927l620C8583A394b30213g2181B11558g5300q6604J7903
15998a44001m38169c7530J2235l4948j50599O9713A40330C2535J1240J1094j6012
15987C8857A447a87337m4202B4770b26093B08235A1827J72741a5679A16650C8570
15975f9588C3233K91466I2778J85655a16134N2799A31294K37537A65904Q3307
15965B49211B809J59150C524J71323G1779A6466b08688l4509A89074F3937d44679
15953E4381b10881e8157A02680D2699e4982k02316B84610I6014a62522M7285C9063
15941b6663r6153D8588a10233c4973c903q7019D50673i4700A03216b12199Q8257
$$ plain form
15930 -123942 30714 88224 -74421 62979 -270969 -28825 95305 -96582 -193110 -462699 -188944
15918 -69567 -218399 -141675 -132071 -5768 -179421 -436687 -103750 36286 -119634 155885 184355
15907 184355 160390 337739 222995 -254292 -16249 397607 -20749 -53243 215642 25090
15896 -52554 -146235 146252 -42573 32501 58857 74649 91493 -342926 -236390 43971 -256156
15884 -10766 -574661 -210438 -363511 224561 -212242 -131263 -9040 -124213 25570 -86826 27397
15872 -325407 39936 115883 183575 -147867 -300525 -8141 157733 195939 -244842 -14136 -115529
15861 -115529 -16508 84767 66654 -137869 -169473 -63733 -270784 -170799 -147764 -140164 -110581
15850 -110581 -2322 -56957 -68960 -202813 -114847 -186174 -128439 -191124 -142630 172077 -188219
$$ packed form
15930a23942C0714N7510g4421F2979b70969b8825I5305i6582r6528k69589a88944
15918f9567j48832P6724R604e768j73653k57266a03750C6286a19634A55885K8470
15907A84355k3965J77349j14744b54292a6249C97607b0749l2494B15642B5090
15896e2554r3681A46252d2573C2501K6356J5792J6844c42926J06536D3971b56156
15884a0766n63895b10438j53073B24561b12242Q0979i040j15173B5570h6826B7397
15872c25407C9936P5947O7692a47867j52658h141A57733L8206b44842a4136j01393
15861a15529a6508H4767j8113a37869l1604f3733k07051R9985K3035P600K9583
15850a10581b322n4635j2003j33853Q7966p1327N7735o2685M8494A72077a88219
$$ plain form
15838 89791 170103 -94725 -230752 -71334 176655 248501 -216543 -183632 39781 146200 231704
15827 231704 -200317 -102680 -521934 100688 -122420 123506 51611 -265465 -177340 23582
15816 -91026 -42303 -53597 -60866 -50732 -223871 69559 74396 -46428 -323197 95634 -179570
15804 -120372 220378 99465 -102222 -56980 -54770 -250939 -326031 -241962 101211 -1961 62447
15792 -107677 -189177 65691 -126804 -38198 -271693 -96517 142480 -88225 -64479 475288 82917
15780 -230982 -166475 69148 -338333 34536 46697 64964 -112780 205930 25749 -5785 119477
15768 39375 -106779 -251370 -262316 -150228 -403079 -250581 249970 -7849 -202906 -87481
15757 -70924 -35458 133149 38779 30513 231899 -277421 -2372 -127946 104384 -258010 -109777
$$ packed form
15838H9791Q0312i4725j36027g1334A76655P1846b16543L2911C9781J06419Q5504
15827B31704b00317R7637m19254A00688a22420A23506E1611b65465Q8125B3582
15816i1026d2303j1294p269J0134j73139F9559M837d6428k76769I5634a79570
15804a20372B20378I9465a02222M5242K210j96169p5092Q4069A01211a961F2447
15792a07677q1500F5691a26804c8198k33495i6517A42480h8225K3746D75288H2917
15780b30982O4507F9148c38333C4536J2161J8267a12780B05930B5749e785A19477
15768C9375a06779j44591j0946J12088k52851J52498B49970g849j95057h7481
15757g0924c5458A33149C8779q266K01386b77421b372j25574A04384b58010a09777
$$ plain form
15745 -137282 -48903 76361 -166007 22537 -265303 -145629 -25067 110021 -290210 -112903
15734 32852 70226 -166418 -128434 151705 270250 113028 287823 -197100 241489 22924
15723 -115232 41194 108941 -227849 -141261 193393 -143524 -90965 -84804 153603 -29011 -2679
15711 -757 115094 -141822 90584 125676 -35698 -260604 -145960 6006 58520 184846 -128335
15699 -58562 309161 66094 -143825 94625 -392608 -114008 84241 -246603 -19482 -79211 211783
15687 38704 37546 -203508 157574 -164975 94692 25938 -25114 159105 168365 224764 -103805
15675 86383 -112630 232870 130132 -151228 223910 -16825 94585 -331797 -278100 -27329
15664 172925 78563 -186347 97415 -100278 -201832 -201385 89023 115342 -273985 -31843 -52251
$$ packed form
15745a37282d8903G6361a66007B2537b65303J19674b5067A10021b90210a12903
15734C2852L7374a66418L7984A51705J18545A13028J74795a97100B41489B2924
15723a15232D1194O7747b27849Q6588A93393a43524N2559O161A53603b9011b679
15711g57A15094a41822I0584L5092c5698k24906J14644F006N2514J26326a28335
15699e8562C09161F6094a43825I4625c92608a14008H4241b46603a9482n9729B11783
15687C8704j158b03508A57574a64975I4692B5938b5114A59105R260N6399a03805
15675H6383a12630B32870j02738a51228B23910a6825I4585c31797N3697b7329
15664A72925G8563a86347I7415a00278j01554M47H9023K6319b73985c1843k0408
$$ plain form
15653 -52251 98914 12991 119699 47604 -150917 -244367 -111303 -140795 -145825 -262696 26291
15641 82527 33681 252131 -234070 -263463 109297 -56772 33382 341411 -165128 -300690
15631 -300690 -87165 -210854 -40137 332605 45375 -480628 166190 -241011 123539 -71984
15620 -35888 -49825 -56509 -92498 -207914 -347603 -24894 139966 89376 -209451 -196173 -16154
15608 -66664 80482 102210 -58473 265404 -95441 77291 496798 -191757 140258 189864 11671
15596 -205291 267146 -81430 -4612 -132149 -85804 -135193 -274722 -199713 -141583 40387 167081
15585 167081 -186549 -78430 -32648 10475 -131841 21380 -108874 155573 -109468 -350054
15575 -350054 -84567 2883 -197561 -112662 -55153 144240 399550 -140318 -315355 277736
$$ packed form
15653e2251I8914A2991J06708D7604a50917r3450a11303k9492n030j16871B6291
15641H2527C3681K18450b34070k9393A09297e6772C3382L08029a65128j35562
15631c00690h7165j23689d0137C32605D5375d80628A66190b41011A23539g1984
15620c5888j3937o684l5989j15416j39689b4894A39966n0590b09451J3278a6154
15608f6664H0482K1728e8473B65404i5441G7291M19507a91757A40258M9606A1671
15596b05291B67146h1430d612j27537M6345m9389j39529P5009N8130D0387J26694
15585A67081a86549g8430c2648A0475a31841B1380a08874A55573a09468k40586
15575c50054h4567B883a97561Q4899e5153A44240K55310a40318j75037B77736
$$ plain form
15564 -27261 -424145 -116182 129981 75630 -136 -62765 -18090 -248415 -5996 -107176 -195336
15553 -195336 -77034 -117560 -116305 -67172 201791 -39125 -63759 83463 98327 103082 386904
15542 386904 191562 110122 -163425 -90191 264398 158491 -36705 -75133 -251803 -14500
15531 111341 19604 -17121 -254832 105149 -39643 17936 -82312 41813 -107480 -84553 69917
15519 -8910 21113 -27291 -203960 106389 430206 -449754 168591 -178510 -312201 15820
15508 -87191 8191 329097 -327666 -251923 165815 -220679 216796 40588 -213719 15548 137124
15497 137124 -160657 5557 5784 85917 87731 -281710 47957 -139873 147841 -116486 -200437
15486 -200437 -102882 -173175 201690 -155299 -231744 79104 -96504 196810 35253 -272500 159818
$$ packed form
15564b7261l96884a16182A29981n4351a36o2629a8090k30325e996j01180q8160
15553a95336g7034m0526J255M9133B01791c9125k4634H3463J4864M755K83822
15542C86904A91562q1440a63425P3234B64398j05907c6705l8428j76670a4500
15531A11341A9604a7121k37711A05149c9643A7936h2312D1813a07480K2927F9917
15519h910B1113b7291j76669A06389L23817d49754A68591a78510j33691A5820
15508h7191H191L20906c27666P5743A65815b20679B16796D0588b13719A5548J21576
15497A37124a60657E557K27Q0133J814b81710D7957a39873A47841a16486q3951
15486b00437R7555p0293B01690a55299p6445G9104i6504A96810C5253b72500A59818
$$ plain form
15474 -22966 -31941 -155732 -368050 -320749 116716 274327 -156428 -18406 386655 157541
15463 54752 -146997 -85698 -73377 -43597 -45112 -90624 376463 -127950 94171 -149762 178916
15451 124149 -94610 226042 504897 273797 43303 -67983 -117083 132190 61780 34415 -211953
15439 34106 56190 256363 -97223 532911 -317638 -49696 -151929 -187275 130386 73258 170767
15428 170767 2345 255079 58825 404595 264935 -585172 180524 -83607 -90828 -49471 -405390
15417 -405390 185968 -78345 -13685 133994 -27113 46337 -174208 -119984 -100060 -100088 21222
15405 -146425 72872 156056 26532 84987 -4770 -198403 93549 20698 -14485 -57428 69774
15393 73967 -23831 -26231 191436 -76900 -170053 1308 -21658 198760 -62160 -56171 39816 24253
$$ packed form
15474b2966q975j23791k12318M7301A16716J57611a56428a8406C86655A57541
15463E4752a46997O1299J2321K9780j515m5512C76463a27950I4171a49762A78916
15451A24149i4610B26042K78855k31100D3303f7983m9100A32190F1780k7365b11953
15439C4106K2084K00173i7223E32911c17638d9696j02233l5346A30386n7128R7509
15428A70767B345K52734E8825L45770j39660e85172A80524h3607p221M1357l55919
15417d05390A85968g8345a3685A33994b7113D6337a74208N4224J9924k8B1222
15405a46425G2872Q3184B6532N8455d770j93633I3549B0698a4485m2943F9774
15393G3967b3831k400A91436g6900r3153A308b1658A98760f2160N989C9816j5563
$$ plain form
15381 24253 -4964 31753 43638 -47025 -248344 71177 292386 -62884 -96363 41633 168616
15370 168616 -130819 198864 -49077 -243446 276414 78506 -311726 -162270 -10406 -21941
15360 -21941 -227394 -206980 79542 -119369 92707 153390 -5736 -107687 115333 -151155 -54193
15348 149840 -87166 -296685 145406 -54252 26105 28161 4828 -49184 239890 207773 170760
15337 170760 15877 -111372 24660 340902 -72657 16860 -88177 58491 118784 252648 43462
15325 -86675 408387 3869 303919 -125064 225006 341620 421699 136609 107669 -38191 -126759
15314 -126759 252438 321090 16450 -9949 -36849 -365078 35668 77691 -76609 -165674 98898
15302 -114647 18846 348798 -108171 -15207 -248090 100949 -22865 257234 184632 133385
$$ packed form
15381B4253d964C1753J1885d7025k01319G1177K21209f2884l3479D1633J26983
15370A68616a30819A98864d9077j94369B76414G8506c11726J49456a0406j1535
15360b1941k05453K0414G9542a19369I2707O0683e736j01951A15333a51155e4193
15348A49840h7166k09519A45406e4252B6105K056D828d9184B39890l2117l7013
15337A70760A5877a11372B4660L16242g2657A6860h8177E8491O0293J33864D3462
15325h6675D08387C869L00050a25064B25006J16614Q0079A36609k8940c8191q8568
15314a26759B52438O8652A6450i949k6900l28229C5668M2023g6609q9065I8898
15302a14647A8846L29952a08171a5207k32883A00949b2865B57234p2602n1247
$$ plain form
15292 133385 -91493 -31444 -12287 105402 389227 -43775 129222 118929 -52653 182077 158870
15281 158870 -123810 104462 191257 -80080 -82464 90050 51346 146214 397628 110642 -6296
15269 122532 -286715 167216 106966 103 -6012 295955 -26482 66570 512166 -18841 135977
15257 -91029 70595 149642 191919 -19095 329338 222881 -135880 334043 24817 -120911 270492
15245 154543 -251335 181505 37055 -25196 263202 354982 200581 7778 452743 549394 802757
15234 802757 1048781 793120 1140305 1180094 517993 157686 148721 112213 393476 32200
15223 282182 246548 284844 182283 -148018 218348 349112 273062 149744 265169 299193
15213 299193 38584 318825 144269 127773 162688 164860 3681 193743 74069 59108 55422
$$ packed form
15292A33385i1493c1444a2287A05402K83825d3775A29222j0293e2653A82077k3207
15281A58870a23810A04462Q6795h0080k384I0050l8704R4868K51414A10642f296
15269A22532b86715A67216o0250A03f012B95955b6482F6570M45596a8841A35977
15257i1029G0595P9047M2277a9095C29338j06457a35880C34043B4817a20911B70492
15245A54543b51335A81505C7055b5196B63202R1780j54401G778M44965R6651K53363
15234H02757K46024k55661L47185L9789E17993A57686q965l6508K81263C2200
15223B82182l5634L8296j02561a48018B18348J30764p6050j23318J15425L4024
15213B99193C8584K80241A44269j6496L4915K172C681J90062G4069j4961l686
$$ plain form
15202 55422 413389 356302 290825 325962 61925 198604 -78634 -87933 -40236 92365 4803 127391
15190 127391 -35584 44433 -119599 4617 -5209 43319 46772 82021 -214321 -266861 188363
15178 201416 -291893 147850 38033 -92848 110897 88246 -167761 257344 176967 184991 3533
15166 13607 -24317 29846 122251 197539 99661 40455 -76680 230373 313834 -116952 430826
15154 -176449 -166187 342175 296155 -1008 95416 -242378 185995 -349295 220825 76791 76648
15143 76648 59884 63569 416529 362948 93377 -52796 -39971 295544 -132066 332986 -108500
15131 59901 -44919 233003 237264 179910 -33545 -149036 144233 -13341 94421 -232936 -3110
15119 -116362 33516 268947 -154877 118071 31283 81521 83388 14173 12444 95895 -81154
$$ packed form
15202E5422L57967n7087o5477L5137F1925J36679g8634r299d0236I2365D803J22588
15190A27391c5584D4433a19599D617e209D3319L453L5249b14321n2540A88363
15178B01416b91893A47850C8033i2848A10897k2651a67761B57344q0377Q024C533
15166A3607b4317B9846R2405P5288r7878D0455g6680B30373Q3461a16952D30826
15154a76449J0262C42175m6020a008I5416b42378A85995c49295B20825G6791j43
15143G6648j6764L685L52960n3581I3377e2796J2825B95544a32066C32986a08500
15131E9901d4919B33003M261n7354c3545j15491A44233a3341I4421b32936c110
15119a16362C3516K35431a54877A18071C1283N0238J867A4173j729Q3451h1154
$$ plain form
15107 -126170 -68692 -55442 408866 292347 177899 107249 -245249 182634 -107478 446039
15096 115431 8736 88380 -110425 34365 145476 -167954 -118315 438253 159578 191480 134170
15085 134170 70058 -80740 15984 295575 247008 151589 64650 119259 197578 155394 366814
15074 366814 -118627 61146 115007 -5883 -279281 410508 386993 -18968 112487 135410 97463
15063 97463 192641 53996 142000 206327 122719 302226 191102 92285 444974 -182345 402540
15051 409080 40824 -24067 237520 -100201 361735 -48148 122585 297428 519250 383622
15041 383622 72012 170089 -16873 63004 170370 423238 273191 138389 17399 126614
15031 126614 269478 43739 461468 -10828 94932 255164 290812 198066 415237 311254
$$ packed form
15107a26170N7478J3250D08866j16519j14448p0650b45249A82634a07478D46039
15096A15431H736P9644a10425C4365J11111a67954M9639D38253A59578L1902n7310
15085A34170o4112h0740A5984K79591m8567r5419F4650N4609P8319m2184K11420
15074C66814a18627F1146N3861e883k73398D10508k3515a8968A12487K2923l7947
15063I7463R5178E3996Q8004O4327q3608J79507j11124I2285L52689a82345D02540
15051D09080D0824b4067B37520a00201C61735d8148A22585J74843K21822j35628
15041C83622G2012R8077a6873F3004J07366K52868j50047j34802A7399J09215
15031A26614J42864D3739M17729a0828I4932J60232L5648r2746K17171j03983
$$ plain form
15021 311254 72143 181584 496569 -124402 104984 138169 4276 168284 494360 -1755 321472
15009 433684 225662 -53452 196144 248346 346370 348773 -156444 -218140 356142 170540 310303
14998 310303 -123595 -2187 305491 609371 -4846 518666 372229 340650 325965 324511 382010
14987 382010 292463 111393 27433 118380 130865 270079 245149 394920 -103735 260481
14976 177021 221855 460854 429832 9549 18870 85142 243237 250000 174261 411718 46563
14964 194975 217767 -59955 131515 290456 324143 80977 271970 172918 7986 17676 272658
14953 272658 504752 68113 146690 533987 47632 487299 564435 261429 188669 324849
14943 324849 365805 339698 420253 457088 339571 137999 312651 355502 133478 441816
$$ packed form
15021C11254G2143J09441L14985a24402A04984L3185D276J64008L26076a755C21472
15009D33684k08022e3452A96144N2202R8024K403a56444o1696C56142A70540J39763
14998C10303a23595b187C05491L03880d846E18666j46437l1579j4685j454N7499
14987C82010q9547A11393B7433R0947J2485J39214k4930J49771a03735B60481
14976A77021M4834K38999l1022I549R321O6272J58095O763p5739K37457D6563
14964A94975K2792e9955A31515J58941L3687H0977J90993r9052G986R690K54982
14953B72658K32094F8113P8577L87297D7632M39667P7136B61429p2760J36180
14943C24849M0956k6107Q0555L6835j17517A37999J74652M2851A33478L08338
$$ plain form
14933 441816 311678 469269 293421 189146 119661 361469 438227 525703 247729 274927
14923 274927 404396 444586 228257 217376 570617 -156184 351721 5099 -47868 474515
14912 231949 245288 150762 247521 78340 447029 312295 350339 522606 612493 494316 384189
14901 384189 45194 150130 -108802 218949 322355 341507 319019 467077 809443 204648
14890 495277 616247 185933 411528 259907 552992 272228 387007 337029 632927 444573
14880 444573 689626 412323 269367 399818 238033 548644 474226 219551 145527 292884
14870 292884 63222 468393 236827 465259 372697 344481 393015 589699 360588 445798
14860 445798 301779 689478 358537 237446 565441 592724 575440 365088 334093 387841
$$ packed form
14933D41816j30138J57591j75848j04275o9485K41808P6758Q7476B47729K7198
14923B74927J29469M0190k16329j0881L53241a56184C51721E099d7868D74515
14912B31949J3339r4526R6759G8340L68689j34734L8044J72267Q9887j18177j10127
14901C84189D5194J04936a08802B18949J03406J9152k2488J48058L42366B04648
14890D95277J20970A85933K25595j51621K93085B72228J14779m9978K95898j88354
14880D44573K45053k77303j42956J30451j61785L10611p4418B19551p4024J47357
14870B92884F3222M05171k31566K28432r2562k8216M8534J96684k29111Q5210
14860D45798j44019L87699l30941j21091L27995K7283j7284k10352l0995N3748
$$ plain form
14850 387841 299233 466371 684121 544378 455109 415011 319984 576830 413227 511415
14840 511415 292433 337594 470291 443488 377375 661146 145996 315458 658319 468765
14830 468765 338742 579381 587916 541633 504393 329311 618698 422951 569337 657798
14820 657798 457482 466809 551496 519231 657400 506162 267277 209938 826738 271029
14809 531682 191865 291102 285964 352752 436829 330149 477529 683506 633485 509033 251735
14797 597973 299538 355221 713812 699940 547645 481170 405110 806092 688308 163760
14786 318629 725100 597897 705278 511398 766757 797634 446047 631727 317049 610247
14776 610247 736203 320315 804608 826823 372404 431919 579025 729722 720637 662259
$$ packed form
14850C87841q8608J67138K17750j39743q9269m0098r5027K56846j63603R8188
14840E11415k18982M5161J32697k6803o6113K83771A45996J69462L42861j89554
14830D68765j30023K40639Q535m6283l7240j75082K89387j95747J46386Q8461
14820F57798k00316R327Q4687l2265J38169j51238k38885n7339O16800B71029
14809E31682A91865R9237n138O6788Q4077j06680J47380K05977n0021j24452B51735
14797E97973k98435N5683L58591j3872j52295o6475p6060M00982j17784A63760
14786C18629M06471j27203J07381j93880K55359L0877l51587J85680l14678K93198
14776F10247J25956C20315M84293K2215C72404N9515J47106J50697r085n8378
$$ plain form
14766 662259 602776 701802 560346 611404 591444 995430 595275 650117 457878 954881
14756 954881 473231 520504 798664 688374 483400 803922 693840 775852 578120 729198
14746 729198 526922 865247 689085 655532 533253 596072 529734 660774 976607 807911
14736 807911 650102 483383 925951 806928 1001874 793325 835861 585388 601512 781228
14726 781228 806906 659654 749872 752464 702508 710870 1063772 744691 796704 945912 821803
14715 821803 635143 932637 602851 798386 999588 847033 748568 1189156 1094086 937307
14705 937307 865667 884113 548350 950664 865594 722263 983455 1131562 1105819 815428
14695 815428 1117544 898043 934684 685755 1062485 970473 494519 1122004 923432 877363
$$ packed form
14766F62259n9483R9026j41456N1058j9960M03986m00155N4842j92239M97003
14756I54881D73231M7273K78160j10290k04974L20522j10082Q2012j97732J51078
14746G29198k02276L38325j76162l3553j22279O2819o6338J31040L15833j68696
14736H07911j57809j66719M42568j19023J94946k08549M2536k50473J6124J79716
14726G81228K5678j47252R0218K592m9956Q362L52902l19081N2013J49208j24109
14715H21803j86660K97494l29786J95535K01202j52555r8465M40588r5070j56779
14705I37307p1640J8446l35763M02314q5070j43331K61192J48107k5743k90391
14695H15428L02116k19501L6641k48929L76730r2012m75954O27485j98572m6069
$$ plain form
14685 877363 864204 940830 1248546 700676 992351 806812 1128599 1142809 815865 990126
14675 990126 960936 1206808 762974 943601 917990 1053969 882450 1037632 801742 1415327
14665 1415327 922956 1197791 1212959 1136320 1254154 940954 771961 1153430 1033679 1135279
14655 1135279 1283147 1369713 1069137 905279 1113173 780724 1152606 1330797 1237874 1250125
14645 1250125 1037086 1058629 824506 1284092 1184938 1188715 1590951 1370760 1468204 1198755
14635 1198755 1446332 1426882 1380203 1239950 1417086 978937 1026945 1475389 921997 1266374
14625 1266374 1372620 1396589 1263455 1424888 1476517 1380437 1190164 1478905 1211386 1452355
14615 1452355 1443105 1450275 1480824 1386738 1443082 1292624 1222242 1444468 1542902 1376224 1348004
$$ packed form
14685H77363j3159P6626L07716n47870K91675j85539L21787J4210l26944J74261
14675I90126k9190K45872m43834J80627k5611J35979j71519J55182k35890O13585
14665A415327m92371K74835J5168p6639J17834l13200j68993L81469j19751J01600
14655A135279J47868Q6566l00576j63858K07894l32449L71882J78191r2923J2251
14645A250125k13039K1543k34123M59586r9154L777M02236k20191R7444k69449
14635A198755K47577j9450m6679j40253J77136m38149M8008M48444n53392L44377
14625A266374J06246K3969j33134J61433N1629r6080j90273K88741k67519K40969
14615A452355r250P170L0549r4086N6344j50458p0382K22226R8434j66678k8220
$$ plain form
14604 1348004 1265846 1779950 1346240 1417222 1377326 1530826 1647590 1721775 1669375 1312819
14594 1312819 1630984 1636777 1758965 1806424 1855645 1652981 1970550 1407031 1733480 1629408
14584 1629408 1725618 1543584 1994510 1931759 1783284 1669338 2008314 2005412 1682409 1813973
14574 1813973 2045108 2036037 1909021 2043854 2032968 1871428 1796814 2091029 2021474 2221332
14564 2221332 1881809 1776782 2435802 2151613 2108547 2303786 2443523 2393447 2589949 2551694
14554 2551694 2493096 2472337 2541745 2498434 2775114 2675257 2699205 2626310 2996034 3075356 3318607
14543 3318607 3611857 3830231 3855906 4505753 4618461 4998440 5939188 7053744 8460715
14534 8460715 10606400 15034959 22220189 32204319 30801801 18032841 11002315 7348920
$$ packed form
14604A348004q2158N14104m33710P0982l9896J53500J16764P4185n2400l56556
14594A312819L18165N793J22188M7459M9221k02664L17569n63519L26449j04072
14584A629408R6210j82034M50926o2751j48475j13946L38976k902l23003J31564
14574A813973K31135r071j27016J34833j0886j61540p4614K94215o9555J99858
14564B221332l39523j05027O59020k84189m3066J95239J39737n0076J96502l8255
14554B551694n8598k0759O9408m3311K76680r9857K3948p2895L69724P9322K43251
14543C318607K93250K18374K5675O49847J12708L79979R40748J114556J406971
14534H460715K145685M428559P185230R984130j402518j2768960p030526l653395
$$ plain form
14526 7348920 5151460 4450967 3212248 3360221 2793181 2653128 2442080 2360867 2812469
14517 2812469 2233460 2291570 2623550 2298536 2508289 2296323 2698728 2533301 2380641 2700008
14507 2700008 2644275 2827516 2612496 2660436 2891920 2742990 3010613 3095528 2858417 2911403
14497 2911403 2936083 2854393 2913724 3303786 3012541 3209607 3357958 3101222 3283023 3386467
14487 3386467 3179909 2976996 3498788 3797274 3322685 3684974 3226961 3271310 3318121 3618373
14477 3618373 3447877 3674431 3935188 3553104 3639793 4018512 3959703 4096391 4121218 3915423
14467 3915423 3935733 3666337 4285400 3961861 4281888 4161861 4055581 4496983 4342240 4394572
14457 4394572 4716133 4636789 4807539 4680868 4649315 4574760 4954644 5114616 5004500 4995687
$$ packed form
14526G348920k197460p00493j238719J47973n67040j40053k11048q1213M51602
14517B812469n79009N8110L31980l25014K09753k11966M02405j65427j52660L19367
14507B700008n5733J83241k15020M7940K31484j48930K67623Q4915k37111N2986
14497B911403K4680q1690N9331L90062k91245J97066J48351k56736J81801J03444
14487C386467k06558k02913N21792K98486m74589L62289m58013M4349M6811L00252
14477C618373j70496K26554K60757l82084Q6689L78719n8809J36688K4827k05795
14467C915423K0310k69396O19063l23539L20027j20027j06280M41402j54743N2332
14457D394572L21561p9344J70750j26671l1553p4555L79884J59972j10116q813
$$ plain form
14447 4995687 5030382 5043066 5095885 5416899 5196501 5339992 5554310 5420428 5640612 5289593
14437 5289593 5536675 5618762 5917308 6099674 6153907 6120839 6270977 6216189 6150171 6433963
14427 6433963 6356122 6502860 6408927 6623547 6718177 7031553 6856465 7145207 7031822 7251663
14417 7251663 7197653 7158959 7539365 7607042 7654008 7566590 7615918 8317555 8304903 8278103 8369187
14406 8369187 8288950 8761445 8449556 8777966 9000787 9000218 8847062 9395849 9408157 9333191
14396 9333191 9741811 9911630 9983582 9955835 10417871 10483896 10486010 10932674 10921002 11149591
14386 11149591 11423433 11838550 11616407 11874071 12002784 12468190 12520474 12737489 12818274 13263676
14376 13263676 13361740 13984690 13997432 13816391 14338827 14749003 14801471 15537953 15796418 15823395
$$ packed form
14447D995687L4695J2684N2819L21014k20398J43491K14318j33882K20184l51019
14437E289593K47082Q2087K98546J82366N4233l3068J50138n4788o6018K83792
14427F433963p7841J46738r3933K14620R4630L13376j75088K88742j13385K19841
14417G251663n4010l8694L80406O7677M6966q7418M9328P01637j2652k6800R1084
14406H369187q0237M72495l11889L28410K22821n69j53156N48787J2308p4966
14396I333191M08620J69819P1952k7747M62036O6025K114M46664j1672K28589
14386A1149591K73842M15117k22143K57664J28713M65406N2284K17015Q0785M45402
14376A3263676R8064O22950J2742j81041N22436M10176N2468P36482K58465K6977
$$ plain form
14366 15823395 15954751 16219368 16471279 16884699 17194794 17548414 17885899 18223141 18423283
14357 18423283 19038905 19616758 19668335 20243267 20489510 21012746 21431063 21876194 22439186
14348 22439186 22955556 23295846 23553854 24285236 24977707 25313406 26053689 26675517 27362605
14339 27362605 27718321 28414917 29227182 30041228 30752956 31521150 32374569 33145301 34309322
14330 34309322 34977088 36186494 37155622 37777804 38603144 39886254 40807432 42040268 43380538
14321 43380538 44559535 46208140 47510995 48927550 50461199 52030202 53754702 55314893
14313 55314893 57193188 59353975 61233757 63345369 65493704 67417395 70140849 72824705
14305 72824705 75281422 78079049 80914136 84342330 87388509 90737898 94434067 98007883
$$ packed form
14366A5823395J31356K64617K51911M13420L10095L53620L37485L37242K00142
14357A8423283O15622N77853N1577N74932K46243N23236M18317M45131N62992
14348B2439186N16370L40290K58008P31382O92471L35699P40283O21828O87088
14339B7362605L55716O96596Q12265Q14046P11728P68194Q53419P70732J164021
14330C4309322O67766J209406R69128O22182Q25340J283110R21178J232836J340270
14321D3380538J178997J648605J302855J416555J533649J569003J724500J560191
14313E5314893J878295K160787J879782K111612K148335J923691K723454K683856
14305G2824705K456717K797627K835087L428194L046179L349389L696169L573816
$$ plain form
14297 98007883 102301531 106256325 110734076 115509136 120427873 125944751 131261311 137148937
14289 137148937 143270652 149727625 156529532 163844912 171738364 179781096 188490637 197860953
14281 197860953 207277493 217412120 228278111 239294469 251301613 263607506 276382938
14274 276382938 290227602 304096407 317813741 331446670 345192494 358868762 372650360
14267 372650360 385878723 397915341 409246669 419409288 428642530 437238294 444613589
14260 444613589 451339302 457213017 460454526 460803081 459908695 459664491 455921509 447927595
14252 447927595 439695421 431173469 420123148 408061215 396108076 383594465 370319794
14245 370319794 356988115 343041111 329049079 315686054 302441265 289454238 276596494
$$ packed form
14297I8007883M293648L954794M477751M775060M918737N516878N316560N887626
14289A37148937O121715O456973O801907P315380P893452Q042732Q709541R370316
14281A97860953R416540J0134627J0865991J1016358J2007144J2305893J2775432
14274B76382938J3844664J3868805J3717334J3632929J3745824J3676268J3781598
14267C72650360J3228363J2036618J1331328J0162619R233242Q595764P375295
14260D44613589O725713N873715L241509L48555q94386k44204l742982p993914
14252D47927595q232174q521952j1050321j2061933j1953139j2513611j3274671
14245C70319794j3331679j3947004j3992032j3363025j3244789j2987027j2857744
$$ plain form
14238 276596494 263892006 251610939 239961285 228478317 216894979 205509512 195315000
14231 195315000 185506284 176208525 167570789 159438526 151883907 145049929 138573124 131997728
14223 131997728 126340307 120981514 115721863 110858599 105980443 101792235 97603196 94262600
14215 94262600 90313603 86851178 83490022 80191287 77226799 74496366 71899791 69612116
14207 69612116 66821317 64824815 62875045 60458208 58714199 56451301 54716083 53207676
14199 53207676 51781911 50027247 48491712 47251867 45965756 44450693 43318188 42383486
14191 42383486 41332898 39967035 38724343 37718360 36470293 35698547 35041901 34179673
14183 34179673 33231234 32538758 31578585 30653290 30377129 29211472 28216435 27753338 27188693
$$ packed form
14238B76596494j2704488j2281067j1649654j1482968j1583338j1385467j0194512
14231A95315000r808716r297759q637736q132263p554619o833978o476805o575396
14223A31997728n657421n358793n259651m863264m878156m188208m189039l340596
14215I4262600l948997l462425l361156l298735k964488k730433k596575k287675
14207F9612116k790799j996502j949770k416837j744009k262898j735218j508407
14199E3207676j425765j754664j535535j239845j286111j515063j132505r34702
14191D2383486j050588j365863j242692j005983j248067p71746o56646q62228
14183C4179673r48439o92476r60173r25295k76161j165657r95037m63097n64645
$$ plain form
14174 27188693 26332462 25706447 25236236 24702504 24042280 23899548 23071978 22962809 22014356
14165 22014356 21597606 20958583 20828808 20254766 19856525 19397346 19311859 18713042 18329396
14156 18329396 17867610 17757626 17464893 17194450 16648162 16479792 16054103 15991831 15382922
14147 15382922 15186557 15054411 14707129 14141316 14170317 13641471 13714061 13350450 13405645 13226030
14137 13226030 12650592 12688097 12246563 12257538 12034889 11700828 11836974 11473805 11009848 10921423
14127 10921423 11273683 10863557 10779196 10526740 10396909 10208882 9910423 10155925 9599592
14118 9599592 9600687 9304507 9304349 9343287 8916773 8706034 8874517 8678501 8600655 8586967 8601696
14107 8601696 8309222 8293529 8008666 7925031 7700075 7564308 7804302 7626319 7085392 7300228
$$ packed form
14174B7188693q56231o26015m70211n33732o60224j42732q27570j09169r48453
14165B2014356m16750o39023j29775n74042l98241m59179q5487n98817l83646
14156A8329396m61786j09984k92733k70443n46288j68370m25689o2272o08909
14147A5382922j96365j32146l47282n65813K9001n28846P2590l63611N5195j79615
14137A3226030n75438L7505m41534J0975k22649l34061J36146l63169m63957q8425
14127A0921423L52260m10126q4361k52456j29831j88027k98459K45502n56333
14118I599592J095k96180j58L8938m26514k10739J68483j96016p7846j3688J4729
14107H601696k92474j5693k84863q3635k24956j35767K39994j77983n40927K14836
$$ plain form
14097 7300228 7490217 7315654 6858108 6969123 6990900 6629564 6919745 6776124 6568516 6549101
14087 6549101 6654551 6464364 6213014 6464183 6170520 6182501 6159039 6167879 5567853 5957375
14077 5957375 5694555 5844099 5795772 5464781 5250892 5568570 5238345 5207363 5266090 5318005
14067 5318005 4834462 5074888 4884017 5195130 4699430 4682202 4753540 4889393 4747889 4713140
14057 4713140 4409785 4608272 4320775 4536592 4453783 4585609 4413385 4342886 4195884 4354356
14047 4354356 4373670 4448721 4274394 3861528 4193586 4086282 4260652 4299792 4006331 4039138
14037 4039138 3717085 3712510 3829307 3759217 3740715 3701913 3624170 3625943 3574926 3436810 3394120
14026 3394120 3442943 3541649 3477403 3289512 3229031 2979581 3095817 3153299 3221424 2977144
$$ packed form
14097G300228J89989j74563m57546J11015K1777l61336K90181j43621k07608j9415
14087F549101J05450j90187k51350K51169k93663J1981k3462Q840o00026L89522
14077E957375k62820J49544m8327l30991k13889L17678l30225l0982N8727N1915
14067E318005m83543K40426j90871L11113m95700j7228P1338J35853j41504l4749
14057D713140l03355J98487k87497K15817q2809J31826j72224p0499j47002J58472
14047D354356J9314P5051j74327m12866L32058j07304J74370L9140k93461L2807
14037D039138l22053m575J16797p0090j8502l8802p7743J773n1017j38116m2690
14026C394120M8823R8706o4246j87891o0481k49450J16236N7482O8125k44280
$$ plain form
14016 2977144 3035076 2934470 2952108 3118960 3265203 3128611 2972081 2913756 2847897 2848599 2850111
14005 2850111 2608699 2690153 2828986 2453664 2758485 2565869 2487505 2820614 2376788 2676057
13995 2676057 2610306 2507225 2477532 1984100 2303340 2783100 2669876 2572957 2832991 2617669
13985 2617669 2721149 2658639 2485972 2410228 2501822 2697454 2778302 3187689 3301001 4147077
13975 4147077 5344237 6918259 10410946 16858479 26940512 31184969 20615499 13877668
13967 13877668 9755967 7645377 6078104 4946473 4384936 4593765 3744662 3418302 3168388
13958 3168388 2939985 3259140 2772583 2915431 2749696 2273297 2384119 2742952 2113629
13949 2113629 2158537 2168102 2310047 1969642 2394758 2353028 2163346 1930885 2225965 1698535
$$ packed form
14016B977144N7932j00606J7638J66852J46243j36592j56530n8325o5859P02J512
14005B850111k41412Q1454J38833l75322L04821j92616p8364L33109m43826K99269
13995B676057o5751j03081k9693m93432L19240M79760j13224r6919K60034k15322
13985B617669J03480o2510j72667p5744R1594J95632Q0848M09387J13312Q46076
13975D147077J197160J574022L492687O447533J0082033M244457j0569470o737831
13967A3877668m121701k110590j567273j131631n61537K08829q49103l26360k49914
13958C168388k28403L19155m86557J42848j65735m76399J10822L58833o29323
13949B113629M4908R565J41945l40405M25116m1730j89682k32461K95080n27430
$$ plain form
13939 1698535 2252704 2135202 2003430 2191048 2120081 2109207 1997077 1842872 1843502 1694255
13929 1694255 1958102 1826598 1929330 1582349 1878396 1693544 1813084 1486347 2012464
13920 2012464 1772850 1563675 1899906 1544973 1750645 1955628 1632415 1698786 1673220 1459509
13910 1459509 1538222 1619493 1798417 1164950 1547682 1877718 1587517 1401474 1594527 1391899
13900 1391899 1428856 1739740 1729290 1244717 1636845 1681299 1481269 1831563 1558628 1322166
13890 1322166 1379542 1327836 1456719 1591921 1526524 1388985 1590259 1465126 1506639 1050290
13880 1050290 1680569 1166011 1424468 1429038 1152777 1219918 1340010 1199384 1307887 1580037
13870 1580037 1439856 1399257 1218168 1327454 996740 1099427 1156658 1183467 1015240 1173110
$$ packed form
13939A698535N54169j17502j31772J87618p0967j0874j12130j54205O30j49247
13929A694255K63847j31504J02732l46981K96047j84852J19540l26737N26117
13920B012464k39614k09175L36231l54933K05672K04983l23213O6371k5566k13711
13910A459509P8713Q1271J78924o33467L82732L30036k90201j86043J93053k02628
13900A391899L6957L10884j0450m84573L92128M4454k00030L50294k72935k36462
13890A322166N7376n1706J28883J35202o5397j37539K01274j25133M1513m56349
13880A050290O30279n14558K58457M570k76261O7141J20092j40626J08503K72150
13870A580037j40181m0599j81089J09286l30714J02687N7231K6809j68227J57870
$$ plain form
13860 1173110 1401425 1228752 1184499 1459421 1340034 1079470 1108244 951994 1374799 1428273
13850 1428273 1220501 1139859 1063647 1152342 1305664 892379 1358991 907597 1458418 1263791
13840 1263791 1287256 1007409 1104590 1089769 1110063 1537907 995963 1038218 1012171 1175423
13830 1175423 1113702 914424 1122121 827013 979562 872912 992857 1091253 1255731 919690
13820 919690 999677 842620 1167083 972812 899146 924228 751813 1309779 683857 721861
13810 721861 1012879 879761 985813 1083494 549414 709974 1336172 991100 933441 888171
13800 888171 943999 824466 976282 607820 831204 705101 839632 692738 1055164 539074
13790 539074 966763 577328 772236 829845 554696 861255 755963 840786 852293 718773
$$ packed form
13860A173110K28315j72673m4253K74922j19387k60564K8774j56250M22805N3474
13850A428273k07772q0642p6212Q8695J53322m13285M66612m51394N50821j94627
13840A263791K3465k79847R7181j4821K0294M27844n41944M2255k6047J63252
13830A175423o1721j99278K07697k95108J52549j06650J19945R8396J64478l36041
13820I19690P9987j57057L24463j94271p3666K5082j72415N57966o25922L8004
13810G21861K91018j33118J06052R7681n34080J60560O26198l45072n7659m5270
13800H88171N5828j19533J51816l68462K23384j26103J34531j46894L62426n16090
13790E39074M27689l89435J94908N7609k75149L06559j05292Q4823J1507j33520
$$ plain form
13780 718773 1038979 712471 642792 801331 907204 726798 608150 912489 553327 699949
13770 699949 921695 845270 912743 651319 569971 1032641 680510 888369 965749 780289
13760 780289 899606 772890 783646 765349 509567 532887 683757 890613 694391 670378
13750 670378 812491 680953 506439 843073 469005 534426 330790 736710 704467 817304
13740 817304 697636 672901 881643 1113790 493407 738610 569796 712577 663882 680116
13730 680116 505398 785522 781329 534761 341229 661357 647566 640799 441931 759833
13720 759833 751806 287497 549899 335047 488125 495776 847240 574508 387748 681106
13710 681106 296513 710927 697255 529631 704701 819638 580828 624414 704293 313406
$$ packed form
13780G18773L20206l26508o9679J58539J05873j80406j18648L04339l59162J46622
13770F99949K21746p6425O7473k61424q1348M62670l52131K07859P7380j85460
13760G80289J19317j26716J0756j8297k55782K3320J50870K06856j96222k4013
13750F70378J42113j31538j74514L36634l74068O5421k03636M05920l2243J12837
13740H17304j19668k4735K08742K32147D93407K45203j68814J42781m8695J6234
13730F80116j74718K80124m193k46568j93532L20128j3791o767j98868L17902
13720G59833q027B87497K62402k14852J53078P651L51464k72732j86760K93358
13710F81106B96513M14414j3672j67624J75070J14937k38810M3586P9879C13406
$$ plain form
13699 819279 683173 699090 511822 364268 717775 490921 433257 402995 404778 749683
13689 749683 520449 563394 669590 581013 646610 860670 470963 872157 597955 465791
13679 465791 578450 401726 665748 669483 813814 440606 568607 345841 594066 437023
13669 437023 495252 472924 226897 228897 424973 344595 382050 332911 653007 564509 160127
13657 554746 584593 402290 520866 542114 408684 339021 428059 270013 828846 147993
13646 554419 245952 463461 357384 212697 420607 256396 393620 472612 537737 551238
13636 551238 605639 483000 619719 580181 527064 389782 449330 157381 344321 429178
13626 429178 548422 662919 617059 55816 680792 599466 425550 355081 383375 182657
$$ packed form
13699H19279j36106J5917j87268j47554L53507k26854n7664l0262J783L44905
13689G49683k29234M2945J06196q8577O5597K14060l89707M01194k74202j32164
13679D65791J12659j76724K64022L735J44331l73208J28001k22766K48225j57043
13669D37023N8229k2328B26897K000J96076q0378L7455m9139L20096q8498A60127
13657E54746K9847j82303J18576K1248j33430o9663Q9038j58046N58833A47993
13646E54419B45952K17509j06077j44687K07910j64211J37224P8992O5125J3501
13636E51238N4401j22639J36719l9538n3117j37282N9548A57381J86940Q4857
13626D29178J19244J14497m5860E5816O24976q1326j73916p0469K8294A82657
$$ plain form
13615 562905 201956 455263 103897 311758 440719 516901 794274 296580 650669 239523
13604 399344 530330 430298 341347 405503 647710 400286 358615 464005 890992 244763
13593 623221 253590 403241 308274 608781 158478 473687 361342 536731 488357 155417
13582 424681 156558 250417 495237 397086 616618 547964 307521 512741 389438 594176
13572 594176 388981 244603 617673 297816 155113 606752 750899 378815 377726 155551
13561 267087 485645 272074 447776 429011 737612 481469 706734 318363 360911 431388
13551 431388 228996 412774 6688 176918 326243 247634 429035 147082 159322 299471
13541 299471 532159 365288 200992 -39014 904249 203850 170245 248317 139337 542628
$$ packed form
13615E62905B01956K53307A03897K07861J28961P6182K77373B96580L54089B39523
13604C99344J30986j00032q8951O4156K42207k47424m1671J05390M26987B44763
13593F23221B53590J49651r4967L00507A58478L15209j12345J75389m8374A55417
13582D24681A56558R3859K44820r8151K19532o8654k40443K05220j23303K04738
13572E94176k05195j44378L73070B97816j42703M51639J44147l72084j089A55551
13561B67087K18558k13571J75702j8765L08601k56143K25265C18363M2548P0477
13551D31388k02392J83778F688J70230J49325p8609J81401A47082J2240J40149
13541B99471K32688j66871j64296c9014I04249B03850l3605P8072j08980M03291
$$ plain form
13531 542628 465925 223542 201736 92100 346481 -63240 304845 40346 -18994 249180 474694
13520 474694 233632 551405 564796 517908 167575 408845 484717 279230 468354 345076
13510 345076 133664 400592 50727 31652 133033 338883 338584 249430 174998 412900 274991
13499 274991 331112 -24047 534228 138282 430837 174170 188300 302505 360990 555229
13489 555229 42263 234250 414620 123370 478311 -130294 289260 378650 303617 -1531
13478 145754 240128 153995 26897 218277 114728 189196 109680 387633 485841 31341 171424
13467 171424 346956 218297 401285 463967 66359 570886 86533 326119 304447 134349
13456 131425 450857 44680 238446 311957 437647 261579 160999 -113356 25971 245826
$$ packed form
13531E42628p6703B23542k1806I2100K54381f3240C04845D0346a8994B49180K25514
13520D74694B33632L17773J3391m6888A67575K41270P5872k05487J89124j23278
13510C45076A33664K66928E0727j9075J01381K05850k99q9154p4432K37902j37909
13499B74991N6121b4047E34228A38282K92555A74170J4130J14205N8485J94239
13489E55229D2263J91987J80370A23370L54941a30294B89260Q9390p5033a531
13478A45754R4374q6133B6897J91380j03549P4468p9516K77953R8208C1341J40083
13467A71424J75532j28659J82988O2682F6359N04527H6533K39586k1672A34349
13456A31425L19432D4680J93766P3511J25690j76068j00580a13356B5971K19855
$$ plain form
13446 245826 632991 380222 270649 319059 402274 35333 328298 274391 474759 374083
13436 374083 22396 258115 309430 161476 215315 105364 191518 409780 306701 122772
13425 49334 345092 -19292 183158 219230 266621 298289 -122641 351820 -68671 212203 117754
13414 117754 21556 -156871 72385 248911 295411 230780 369188 169267 -11790 332715
13403 157354 181960 216389 204268 399512 338480 253596 160421 181085 200654 232837 166014
13392 166014 131700 29144 312586 196538 63292 140898 153994 307759 141125 586728
13382 586728 218270 506777 70564 224728 207754 468718 409372 133425 115138 319503
13372 319503 267819 9037 175230 418320 460170 295295 426920 60179 365147 524295
$$ packed form
13446B45826L87165k52769j09573M8410Q3215C5333K92965n3907K00368j00676
13436C74083B2396K35719N1315j47954N3839A05364Q6154K18262j03079A22772
13425D9334K95758a9292A83158L6072M7391L1668a22641C51820f8671B12203r4449
13414A17754B1556a56871G2385J76526M6500o4631J38408A69267a1790C32715
13403A57354K4606L4429j2121J95244o1032q4884r3175K0664J9569L2183o6823
13392A66014l4314B9144K83442j16048F3292P7606J3096J53765A41125M45603
13382E86728B18270K88507G0564J54164j6974K60964n9346A33425j8287K04365
13372C19503n1684I037J66193K43090M1850j64875J31625F0179L04968J59148
$$ plain form
13362 524295 237149 -7747 148111 405987 284766 86725 533999 506409 280980 331751
13352 331751 550210 266543 237478 -6528 535211 113964 377098 28868 418266 170813
13341 85016 21787 285564 160382 -92982 284944 542786 328701 394296 399838 50234 411189
13330 411189 539773 197163 47609 215671 169830 366485 -89923 204425 260388 235595
13320 235595 102690 173457 33408 132739 175899 -220769 112357 353251 84722 110273 314438
13309 314438 257985 33878 439631 71052 262606 129757 483211 358181 130897 151474
13299 151474 189689 -215648 536884 264351 -115314 206753 89429 61974 132990 -311503
13288 182655 401733 229080 248980 262404 217125 128823 12597 33614 -295052 207333 307135
$$ packed form
13362E24295B37149g747A48111K57876j21221H6725M47274k7590k25429N0771
13352C31751K18459B66543k9065f528E35211A13964K63134B8868L89398A70813
13341H5016B1787K63777j25182i2982B84944K57842k14085O5595N542E0234L60955
13330D11189J28584A97163D7609J68062m5841J96655h9923B04425N5963k4793
13320B35595A02690P0767C3408R9331M3160b20769A12357K40894H4722K5551K04165
13309C14438n6453C3878M05753G1052J91554A29757L53454j25030A30897K0577
13299A51474L8215b15648E36884B64351a15314B06753H9429k7455P1016c11503
13288A82655K19078j72653J9900J3424m5279q8302A2597K1017b95052B07333R9802
$$ plain form
13277 307135 54919 224684 325182 393896 26478 17751 442063 66672 -152493 9124 -110087
13265 76545 157238 348589 305638 406515 72138 80805 167116 58511 -42270 78315 15773
13253 -81528 -73824 39666 340640 -226528 -146523 140822 -145983 453260 122394 143823 -213133
13241 163772 35019 143957 256134 -56414 -1416 21272 11892 265517 -175017 357905 -232094
13229 120835 162447 77166 316728 172580 -27686 -161036 108531 65361 85588 192675
13219 192675 -171073 307476 463997 209941 -259201 44039 241431 534602 168855 165341
13209 165341 -8450 -89110 107012 18446 215798 182575 113324 276866 233242 90659 -4779
13197 -46097 -36188 192886 22318 103573 95185 198314 6283 191472 68771 -113620 167150
$$ packed form
13277C07135E4919J69765J00498O8714B6478q727M24312F6672a52493I124a10087
13265G6545Q0693J91351m2951J00877G2138Q667Q6311E8511d2270G8315A5773
13253h1528P704C9666L00974b26528Q0005A40822a45983D53260A22394K1429b13133
13241A63772C5019J08938J12177e6414a416B1272r380K53625a75017C57905b32094
13229A20835M1612G7166K39562j44148b7686j33350A08531m3170K0227J07087
13219A92675a71073C07476J56521B09941b59201D4039J97392K93171A68855l514
13209A65341h450q0660A07012A8446J97352l3223o9251J63542m3624I0659d779
13197d6097R909A92886B2318Q1255q388J03129F283J85189F8771a13620A67150
$$ plain form
13185 98935 19947 8087 117607 139364 178460 140082 -57524 -15327 -49759 244482 56914
13173 222553 -244297 228712 262297 343744 202742 -231165 -92675 68656 114983 -15961 82419
13161 116331 -92111 128821 39168 -96983 131688 130418 121134 105462 -117991 29262 227977
13150 227977 -56404 220497 5834 1944 527805 275217 -4658 120575 71234 188550 146300
13139 146300 18808 232634 -106349 -89134 47287 -78063 -172235 147414 204394 157680 11588
13127 63910 6675 -50500 296697 85175 223207 110533 -135256 156670 -96128 217417 351954
13116 351954 116548 -23640 196881 146328 205148 108765 43055 97507 349919 51869 391724
13105 391724 216597 207550 214815 162654 -20895 42902 -67793 109326 59882 -63323 290762
$$ packed form
13185I8935A9947H087J09520K1757L9096l8378e7524a5327l4432B44482E6914
13173B22553b44297B28712L3585Q1447j41002b31165i2675F8656M6327a5961H2419
13161A16331i2111A28821C9168i6983A31688j270r284j5672a17991B9262J98715
13150B27977e6404B20497E834A944N25861k52588d658A20575m9341J17316m2250
13139A46300A8808K13826a06349J7215D7287g8063r4172A47414N6980m6714A1588
13127F3910F675e0500B96697H5175J38032A10533a35256A56670i6128B17417J34537
13116C51954A16548b3640A96881n0553N8820r6383D3055N4452K52412E1869L39855
13105C91724j75127r047P265n2161b0895D2902f7793A09326m9444f3323B90762
$$ plain form
13093 -241729 161332 -138237 70475 -215434 -33881 174955 255527 -29115 195819 365883
13083 365883 -11091 113196 80256 19603 207897 -130919 -31359 -97082 186018 -103134
13072 314515 74040 -320630 27822 -78921 212712 239564 31313 -88668 -17950 -226578 198474
13060 168368 186341 -33952 -17011 54063 4006 244370 -11809 193062 338679 364143 231417
13049 231417 35783 122204 277402 7466 39925 162417 -257506 59869 -79447 153479 65221
13037 -6979 13661 174099 145028 87333 141049 124693 -141050 227448 124653 -125421 302981
13025 63029 159594 101973 141045 117635 332835 -18590 -184043 129178 271213 14697 244656
13014 244656 19484 -230514 16278 109783 84839 -56443 -125369 436888 -123180 236343 -4606
$$ packed form
13093b41729A61332a38237G0475b15434c3881A74955Q0572b9115A95819J70064
13083C65883a1091A13196l2940A9603J88294a30919c1359o5723A86018a03134
13072C14515G4040c20630B7822g8921B12712K6852C1313h8668a7950k08628A98474
13060A68368J7973c3952J6941E4063D006K40364a1809A93062J45617K5464j32726
13049B31417C5783Q6421J55198G466L2459J22492b57506E9869g9447A53479F5221
13037f979A3661J60438k9071n7695N3716j6356a41050B27448j02795a25421C02981
13025F3029R6565n7621L9072k3410K15200a8590j65453A29178J42035A4697K29959
13014B44656A9484b30514A6278R3505k4944e6443o8926D36888a23180B36343d606
$$ plain form
13002 -25328 268388 42536 265978 -4035 52288 139071 279998 -189717 253289 -6767 246377
12990 -46807 -100743 23346 20823 248847 -130237 2453 126587 161527 278521 110286 123171
12979 123171 77359 42168 3408 -123679 117644 116706 -154513 39879 161703 27709 -25572
12967 -179334 1008 -79917 90508 97013 89640 217617 -21895 -36601 255816 -17731 138075
12955 -26989 -140809 221736 -112129 146821 79015 69734 69625 396359 209431 202946 -77755
12943 -17630 -134465 175799 66315 -79536 27737 -202676 -58363 26277 85962 456515 170155
12931 -103613 -52307 -15697 -14285 60741 97811 256452 109483 -102099 -14495 100419 256040
12920 256040 -221472 -104801 68869 88469 324108 266753 -53769 52551 -2726 250290 191388
$$ packed form
13002b5328B68388D2536K23442d035E2288Q6783J40927a89717B53289f767B46377
12990d6807n3936B3346k523K28024a30237B453J24134L4940J16994A10286J2885
12979A23171m5812l5191C408a23679A17644r38a54513C9879J21824B7709b5572
12967a79334A008g9917I0508O505p373J27977b1895j4706B55816a7731A38075
12955b6989j13820B21736a12129A46821o7806r281j09L26734j86928o485g7755
12943a7630j16835A75799F6315g9536B7737b02676e8363B6277N9685L70553A70155
12931a03613N1306a5697J412F0741L7070J58641A09483a02099a4495A00419J55621
12920B56040b21472a04801F8869J9600K35639n7355e3769E2551b726B50290n8902
$$ plain form
12909 191388 -353344 53930 47580 28374 46323 -241719 18984 133488 -228818 109617 55900
12898 55900 6282 105052 -16564 130863 -60723 87361 60066 103942 192080 144510 -165361
12886 115194 -56001 -241172 20883 -50533 -83857 -388097 -78480 120528 122662 179927 -326104
12874 311775 206157 154849 -117472 -63555 -17023 94970 -23405 -456943 -117879 -30887 25422
12862 -9792 95930 -277116 119601 486364 85883 -192889 -114578 193529 -279949 68037 313296
12851 313296 156359 -116824 -109750 -126517 30462 14606 -67361 -280859 -1905 341353 -93096
12839 -184641 117669 245166 93053 -53889 29361 -26401 243366 -351167 -128779 125482
12828 115819 184652 59601 -69492 15283 -35431 447518 -17150 20277 86554 133331 -32038
$$ packed form
12909A91388c53344E3930o350j9206J7949b41719A8984J14504b28818A09617n3717
12898E5900F282R8770a6564A30863f0723H7361k7295M3876Q8138m7570a65361
12886A15194e6001j85171B0883e0533l3324l04240g8480A20528K134N7265c26104
12874C11775j05618n1308a17472N3917a7023I4970b3405m33538a17879c0887B5422
12862i792I5930b77116A19601L66763H5883a92889P8311A93529b79949F8037K45259
12851C13296A56359a16824P074j6767C0462A4606f7361k13498a905C41353i3096
12839a84641A17669J27497I3053e3889B9361b6401B43366c51167a28779A25482
12828A15819O8833E9601f9492A5283c5431D47518a7150B0277O6277M6777c2038
$$ plain form
12816 -244081 177572 116603 124776 -290672 188670 86366 78369 -53713 -74748 -98994 -77918
12805 -77918 -138890 -46205 -209333 240233 144725 68025 -54693 279777 -127935 39535 2269
12793 -136914 45386 -282552 212473 211084 -205690 -9121 46612 -108930 -76808 52912 -248296
12781 226896 149288 374091 389376 122167 -4304 9246 89173 -110273 9316 -229420 -114008
12769 -74952 -302141 -136171 -146094 134772 49349 -117310 -21230 328351 -157707 -333545
12759 -333545 -36486 -130467 -146357 -23005 59657 -141697 18765 247566 29375 155402 209324
12748 209324 -82186 -193701 52454 -33529 -65338 288609 256530 77295 176541 31971 88402
12737 88402 -1713 61457 129751 33908 -26367 41176 327492 -168243 -111167 197083 213937
$$ packed form
12816b44081A77572o0969Q173b90672A88670H6366p997e3713k1035k4246K1076
12805g7918o0972d6205j63128B40233r5508F8025e4693B79777a27935C9535B269
12793a36914D5386b82552B12473j389b05690i121D6612a08930L2122E2912b48296
12781B26896p7608K24803J5285A22167d304I246P9927a10273I316b29420a14008
12769g4952k27189a36171r923A34772D9349a17310b1230C28351a57707j75838
12759c33545c6486r3981j5890b3005E9657a41697A8765K28801B9375J26027N3922
12748B09324h2186j11515E2454c3529l1809B88609l2079G7295R9246C1971N6431
12737H8402a713F1457O8294C3908b6367D1176K86316a68243N7076A97083J6854
$$ plain form
12726 213937 246857 -31052 122145 -156449 -230779 113052 -11290 -84440 -36385 -82966 73065
12714 243276 -61154 53289 117997 181603 -159812 -50332 -44952 406641 149264 -133602 195241
12702 254362 -61337 -169615 262407 163052 163172 83988 113571 209329 71087 328276 35149
12690 -5421 -77999 88645 125149 153623 241130 278799 -207688 175840 8093 219657 309397
12679 309397 155693 -122237 264052 38077 -267940 -276962 29371 -36 86941 229992 73197
12667 85248 108474 151581 19988 106623 225152 -49617 -112694 184408 254727 -146858 -73982
12656 -73982 205464 235761 -20822 -82386 -19506 -119357 -132901 168679 177265 261296 -105606
12644 -52582 329503 90263 404868 113318 299782 -54137 44266 81453 345058 170031
$$ packed form
12726B13937L2920c1052A22145a56449p4330A13052a1290p3150c6385m6581G3065
12714B43276f1154E3289O4708O3606a59812e0332N380D06641A49264a33602A95241
12702B54362f1337j08278B62407r9355J20p9184K9583R5758G1087K57189C5149
12690e421p2578H8645L6504K8474Q7507L7669b07688A75840H093K11564Q9740
12679C09397j53704a22237B64052C8077b67940r022B9371c6H6941J43051G3197
12667H5248K3226M3107A9988Q6635J18529d9617o3077A84408P0319a46858P2876
12656g3982B05464L0297b0822o1564a9506r9851j3544A68679Q586Q4031a05606
12644e2582C29503I0263L14605A13318J86464e4137D4266L7187K63605A70031
$$ plain form
12633 232333 -5088 -33170 257343 -116423 -129529 91100 48538 -50808 39697 269844 -167779
12621 133843 -82322 66295 222644 136670 -145815 86671 -31804 227632 24422 340858 208461
12610 208461 209536 -135534 131454 306455 43248 56217 -110295 121744 100904 -202166
12599 36616 -105869 142621 137330 -196697 -267579 118743 -31301 135526 104565 46914 342001
12588 342001 1042 -4897 131050 23789 -296509 -54696 126910 39092 260975 -23644 43931
12576 -71150 -29327 153741 -103231 -235255 10062 -263455 -215849 18800 -68673 -169972 104015
12564 36676 -169284 225398 21093 -135074 40500 10228 69331 63823 130147 -22157 -7713
12552 -164418 257777 -198431 -65854 26868 55166 222089 -277150 148118 -121703 186056
$$ packed form
12633B32333e088k8082B57343a16423j3106I1100m2562e0808C9697K30147a67779
12621A33843h2322F6295J56349q5974a45815H6671c1804B27632B4422L16436j32397
12610B08461J075a35534A31454J75001D3248J2969a10295A21744k0840b02166
12599C6616a05869A42621n291a96697p0882A18743c1301A35526l0961D6914K95087
12588C42001A042d897A31050B3789b96509e4696A26910C9092K21883b3644D3931
12576g1150b9327A53741a03231j32024A0062b63455M7606A8800f8673j01299A04015
12564C6676a69284B25398B1093a35074D0500A0228N9103n508O6324b2157g713
12552a64418B57777a98431f5854B6868K8298J66923b77150A48118a21703A86056
$$ plain form
12541 98795 22386 309364 156881 135362 -79657 448728 1471 -247621 181466 87698 2182
12529 419240 18808 40542 -187880 -62144 40491 -17775 -4077 66616 255190 -173869 131915
12517 256183 70361 -376822 -99472 51372 104501 -322031 253918 -26137 -5432 177857 -176035
12505 -41201 -83574 -178628 -191432 152986 49497 -379303 -179864 188717 -29630 197582 148583
12494 148583 218311 38896 -230302 -34744 -61719 150380 122037 255907 -52851 172266 -194082
12482 143176 93847 95791 -133243 171488 24581 -193235 -53640 -80523 48629 -93492 -281084
12471 -281084 60870 -167592 -184859 -127461 -95267 188852 -169197 202122 -177196 186281
12460 -114098 -3995 102524 79596 81232 -12436 -189896 -357526 -63756 -93327 25807 102545
$$ packed form
12541I8795B2386K86978j52483k1519g9657D48728A471b47621A81466H7698B182
12529D19240A8808K1734a87880f2144D0491a7775d077F6616J88574a73869A31915
12517B56183G0361c76822i9472E1372N3129c22031B53918b6137e432A77857a76035
12505d1201m2373r5054j2804A52986D9497c79303a79864A88717b9630A97582m8999
12494A48583O9728C8896b30302c4744k6975A50380k8343J33870e2851A72266a94082
12482A43176m9329J944a33243A71488B4581a93235e3640k6883D8629i3492j87592
12471b81084F0870a67592j7267N7398L2194A88852a69197B02122a77196A86281
12460a14098c995A02524k2928J636a2436j77460j67630f3756k9571B5807P6738
$$ plain form
12449 102545 385233 86533 -301259 -9174 115130 16121 -64192 305674 -57716 -39826 12120
12437 119621 389831 137147 -34913 -13238 -62095 20817 -108483 260411 604 7147 189049
12426 189049 558 139088 -165532 -40257 155702 -363999 -71917 -377865 302600 -248360
12415 -231816 -120059 62323 -78614 248726 -52487 -144056 148013 84526 253029 10279 14866
12404 14866 -72717 20451 -32501 -132639 -3987 -55788 98834 394400 142772 61480 46945
12393 46945 181496 -49747 -318327 180514 -95300 -333460 65849 -446650 52645 154457
12383 154457 -65861 107160 -124871 16157 90318 -792 257073 -187340 309559 -58614 -90560
12372 -90560 -267776 -24819 -315789 -294536 -30196 183323 -142340 -18469 -57896 -39415 -193871
$$ packed form
12449A02545K82688H6533c01259i174A15130A6121f4192C05674e7716J7890A2120
12437A19621K70210A37147c4913a3238m8857B0817a08483B60411F04O543J81902
12426A89049E58J38530a65532d0257A55702c63999g1917l05948C02600b48360
12415b31816J11757F2323g8614B48726e2487r1569A48013o3487J68503A0279M587
12404A4866g2717B0451c2501j00138c987n1801I8834K95566A42772F1480j4535
12393D6945J34551d9747k68580A80514i5300k38160F5849d46650E2645J01812
12383A54457f5861A07160a24871A6157P4161g92B57073a87340C09559e8614l1946
12372i0560j77216b4819k90970K1253c0196A83323a42340a8469l9427J8481j54456
$$ plain form
12361 -193871 -147177 -52695 -78217 66368 110305 -185935 -82953 -164790 -19233 -50467 188034
12349 27199 -106834 195234 -239895 159835 53214 -85927 -37274 -80147 214737 97791 -26926
12337 -199266 -133430 44189 246421 -89475 -80518 -223513 180535 31796 -78498 168376 -128888
12325 131646 72571 102768 230493 -71988 264907 31758 401229 121740 -159665 -43321
12314 293701 57315 34620 39277 -140801 85562 -262998 143364 221952 64584 -219071 -11644
12302 59149 38314 -461826 38399 -433871 -117153 235100 182739 92157 229743 -188298
12291 206307 369716 272529 -123952 -146155 -7448 -44748 -150641 121587 -68061 60362 80370
12280 80370 -164515 269134 -216137 366923 256978 44031 195154 -291529 35601 62174
$$ packed form
12361a93871M6694e2695k5522F6368M3937a85935h2953q1837a9233l1234A88034
12349B7199a06834A95234b39895A59835E3214h5927c7274m2873B14737I7791b6926
12337a99266O5836D4189K02232h9475Q957j42995A80535C1796g8498A68376a28888
12325A31646n9075L0197J27725g1988B64907C1758L69471A21740a59665d3321
12314B93701E7315k2695M657a40801H5562b62998A43364P8588F4584b19071a1644
12302E9149k0835d61826C8399d33871a17153B35100n2361r0582J37586a88298
12291B06307J63409r7187a23952k2203g448l7300j05893A21587f8061F0362K0008
12280H0370a64515B69134b16137C66923j09945D4031J51123b91529C5601K6573
$$ plain form
12270 62174 146713 190994 -75152 5388 143532 61264 37353 15807 185357 170563 258358
12259 258358 222780 177808 124600 293002 162166 154009 84743 -76298 -3893 265527 398197
12248 398197 -143957 59865 136532 195146 202089 59092 -131369 257174 -178308 214994 52198
12236 62501 43824 -2390 262948 246696 -99343 -230061 50408 -64140 -18783 -93632 -176771
12225 -176771 -79285 68300 416883 178932 -48376 -26929 297689 73562 104666 -245844 306080
12213 164687 169305 336325 108266 267612 61873 3487 8036 245155 143691 160669 -22157
12201 49028 122660 35479 280463 359155 -37142 -57841 -12073 -69658 79230 339056 385821
12190 385821 114281 240904 177399 235481 130238 254536 286217 250875 73551 -18252 254765
$$ packed form
12270F2174Q4539M4281g5152E388J38144F1264k3911A5807J69550j4794Q7795
12259B58358l5578m4972n3208J68402j30836q157o9266g6298c893B65527J32670
12248C98197a43957E9865P6667N8614O943E9092a31369B57174a78308B14994E2198
12236F2501j8677b390B62948j6252i9343j30718E0408f4140a8783p4849q3139
12225a76771g9285F8300L48583A78932d8376K1447B97689G3562L1104b45844C06080
12213A64687M618J67020A08266J59346F1873C487M549K37119j01464J6978b2157
12201D9028P3632C5479K44984P8692c7142k0699a2073n7585G9230K59826M6765
12190C85821A14281J26623o3505N8082j05243J24298L1681l5342G3551a8252B54765
$$ plain form
12178 201786 380796 112042 99872 39664 -1622 288217 214935 196910 232066 -52118 99963
12166 -26335 190101 45391 195737 -43351 70617 -75161 136905 185944 249228 80686 267703
12155 267703 -41766 52592 92396 45144 195600 -125606 115920 -146713 203132 -18174
12144 37720 -305602 -236595 263444 154277 -21763 274832 226858 -175478 48793 192440
12134 192440 166453 -213048 76044 49703 -156671 498859 -181183 -132661 -50144 179953
12123 48597 -61755 -51124 -403461 -4061 319133 -124950 47926 78653 -256700 -111521 5079
12111 12153 136963 159904 -19618 -72930 -100599 -54493 -61428 -151445 -65654 -133802 126037
12099 -241064 176640 -49145 55388 17762 -318356 144919 59871 -117903 -150342 103870
$$ packed form
12178B01786J79010A12042j2170C9664a622B88217p3282j8025L5156e2118I9963
12166b6335A90101D5391J50346d3351G0617g5161A36905M9039O3284H0686J87017
12155B67703d1766E2592L9804D5144J50456a25606A15920a46713B03132a8174
12144C7720c05602O9007B63444j09167b1763B74832m7974a75478D8793J43647
12134A92440k5987b13048G6044k6341a56671D98859a81183M8522e0144A79953
12123D8597f1755J0631l52337d061C19133a24950D7926L0727b56700a11521E079
12111A2153J24810K2941a9618n3312k7669M6106o935r0017f5654o8148A26037
12099b41064A76640d9145E5388A7762c18356A44919E9871a17903l2439A03870
$$ plain form
12088 12082 -12686 -1366 -43756 -188954 -96833 49687 148491 100618 -34087 -163619 439017
12076 111076 95175 -30757 -74865 882 -115706 109001 -268873 195512 -7431 -128948 293553
12064 -420563 -25872 -145210 220878 66201 296096 763537 917015 1260840 570411 116588
12053 313250 100760 -21078 53982 -293322 71900 -93027 121042 -107165 -29177 -83075 -214885
12042 -214885 147554 200275 82534 74954 -17381 25179 3494 -42619 314355 112036 -22365
12030 -2450 405316 -71294 -7064 115165 -47412 160525 88290 -332486 75136 -167098 -180906
12019 -180906 41447 103886 -282850 -101265 301996 -330866 -301352 -147952 80824 109668
12009 109668 -53766 32912 -120091 115320 -57874 201608 -75553 56790 36077 -15134 213668
$$ packed form
12088A2082a2686a366m2390j45198R2121D9687R8804m7873c4087j29532D39017
12076A11076j5901c0757m4108H82a15706A09001b68873A95512g431j21517B93553
12064d20563b5872j19338B20878F6201K29895M67441J53478L43825E70411A16588
12053C13250A00760b1078E3982b93322G1900i3027A21042a07165b9177n3898j31810
12042b14885A47554N2721H2534p580a7381B5179C494d2619C14355A12036b2365
12030b450D05316g1294g064A15165d7412A60525p2235c32486G5136a67098j3808
12019a80906D1447O2439b82850a01265C01996c30866K9514a47952H0824K8844
12009A09668e3766C2912a20091A15320e7874B01608g5553E6790k0713a5134B13668
$$ plain form
11997 27173 -130787 189611 136435 185587 -78171 -329835 283111 57746 133558 -88358 -81085
11986 -81085 238857 202466 -120219 -29568 369064 -92452 176268 -68680 89841 157180 -75806
11974 66325 -77498 -44544 197068 6848 90942 62215 223874 -332043 -168243 -60444 -53492
11963 -53492 -57613 70748 -114061 41228 -110310 -398067 114147 -71499 -83274 -130152 -293865
11952 -293865 3342 -57530 -229296 -158527 -77592 -256972 -195831 62617 -270062 -8610 51003
11940 247152 169214 40158 116339 228741 101522 168842 -395060 -47374 61013 -128551 165346
11928 -315172 -77393 18602 92679 -149791 -388958 34792 -176430 -37019 -169233 -320987
11918 -320987 -168732 -214571 113104 136178 -161977 50278 123220 96695 -285133 179184
$$ packed form
11997B7173a30787A89611n3176M9152g8171k51664B83111E7746P5812h8358P273
11986h1085B38857l6391a20219b9568C69064i2452A76268f8680H9841O7339g5806
11974F6325g7498L2954A97068F848Q4094k8727J61659c32043J63800f0444O952
11963e3492m121G0748a14061D1228a10310k87757A14147g1499j1775m6878j63713
11952b93865C342e7530j71766P0769g7592j79380O1141F2617b70062h610E1003
11940B47152p7938D0158P6181J12402A01522O7320c95060d7374F1013a28551A65346
11928c15172g7393A8602P4077a49791k39167C4792a76430c7019j32214j51754
11918c20987J52255m5839A13104K3074a61977E0278P2942k6525b85133A79184
$$ plain form
11907 173002 -473376 -215916 -148955 160274 -91294 -145990 31911 224145 236517 -104516
11896 187897 -542 -143678 -16895 302838 -12627 -7727 -88184 -73351 137186 -252373 -43223
11884 43582 -11509 -360194 -166444 145595 173236 20975 -98957 -417986 -146511 -197644 117757
11872 -270435 -59270 -330987 173642 19820 -475728 -13859 13914 -88320 -192165 83062 -129608
11860 43272 -310705 -70501 -144597 3977 -47840 -189374 -234183 -367310 47377 -138489 -96378
11849 -96378 -73654 -70837 -246217 -65499 -202990 64620 -101545 55115 212937 -210595 -52426
11837 54387 150250 -184419 71979 89704 47601 -104300 161060 -128815 -103784 222780 -168926
11825 -44129 13447 -344162 -211137 -77791 72573 112389 -250559 295522 -29773 -258411 -62132
$$ packed form
11907A73002d73376b15916O6961A60274i1294n4696C1911J92234J2372a04516
11896A87897e42j43136a6895C02838a2627M900q0457J4833A37186b52373d3223
11884D3582a1509l48685a66444A45595K7641B0975i8957l19029a46511n1133A17757
11872b70435e9270k71717A73642A9820d75728a3859A3914h8320j03845H3062a29608
11860D3272c10705g0501p4096C977d7840j41534m4809j33127D7377a38489M2111
11849i6378K2724K817j75380f5499j37491F4620a01545E5115J57822b10595e2426
11837E4387R5863a84419G1979J7725m2103a04300A61060a28815K5031B22780a68926
11825d4129A3447c44162J33025g7791G2573L9816b50559B95522b9773k28638f2132
$$ plain form
11813 -172032 -21601 7645 -355162 -8326 21689 -426526 90438 83465 -34180 -307750 -43883
11801 -99606 -45803 335052 -35052 -8326 -303998 -51656 -213240 136966 -124298 -308436 -40569
11789 -251582 -46138 153308 -198760 209385 249526 -57704 192068 -75227 309931 -85876
11778 4203 14453 -58500 -154410 -68250 91739 -310656 -102717 -143341 -10482 107650 34326
11766 236475 183163 17897 292976 -170111 -83594 -86813 -63946 -93425 -149860 37758 141050
11755 141050 -216263 105917 76490 56222 138101 -275388 48294 39237 8904 -286851 415534
11743 -144392 297421 -176255 48620 -81660 114692 -81167 -77946 -138157 52090 249860 455908
11732 455908 -131263 -45155 -93369 -239559 95893 128661 236238 241125 -78031 131319 -135620
$$ packed form
11813a72032b1601G645c55162h326B1689d26526I0438o973c4180k73570d3883
11801i9606d5803C35052c5052h326k95672e1656j61584A36966a24298j84138d0569
11789b51582d6138A53308a98760B09385M0141e7704A92068g5227C09931h5876
11778D203J0250e8500r5910f8250I1739c10656a02717m0624a0482A07650C4326
11766B36475n3312A7897K75079a70111h3594l219K2867k9479n6435C7758J03292
11755A41050b16263A05917k9427k0268Q1879b75388D8294r057H904b86851D15534
11743a44392B97421a76255D8620h1660A14692h1167L221o0211E2090J97770K06048
11732D55908a31263d5155m8214j46190I5893L2768J07577M887g8031A31319a35620
$$ plain form
11720 -8961 206015 106936 74939 106515 -25804 -104450 -35627 39984 176905 198990 27207
11708 210560 111396 -92639 154884 83123 -253998 229769 108431 105528 -58328 -76177 121126
11696 -349820 -27285 253614 91471 -33288 341114 261 199850 17471 -109637 80179 65961
11685 65961 7445 -38874 -181258 -226645 -57872 25272 101782 -199942 180592 -161881 -61567
11673 -108357 -199579 -161073 152965 69654 4045 -111795 35227 739 -85060 -75319 -3646 -147337
11661 -147337 214385 -42705 123277 107060 -212507 15217 -388683 -9105 -66693 492897 86736
11649 -311331 246165 -245778 12448 -53534 44276 -80906 342862 145764 -1050 -150599 230071
11637 -443736 -82315 203841 -168627 -94456 -90660 97993 13718 -57464 157818 -138249 -27500
$$ packed form
11720h961B06015r9079l1997L1576b5804p8646c5627C9984J36921K2085B7207
11708B10560r9164i2639A54884p1761b53998B29769A08431k903e8328j7849A21126
11696c49820b7285B53614I1471c3288C41114B61J99589A7471a09637H0179j4218
11685F5961G445c8874j42384m5387e7872B5272P6510a99942A80592a61881f1567
11673a08357r1222L8506A52965F9654D045a11795C5227G39h5060R741c646j43691
11661a47337B14385d2705A23277j6217b12507A5217c88683i105n7588D92897H6736
11649c11331B46165b45778A2448e3534D4276h0906C42862A45764a050j49549B30071
11637d43736h2315B03841a68627P4171L796I7993A3718e7464A57818a38249b7500
$$ plain form
11625 -9048 -201570 -33118 -65419 -12705 65272 14902 -66243 34179 225802 123176 248768
11614 248768 11588 -370498 -77045 -174068 189824 148573 -2359 324424 112320 306789 -76224
11602 176702 185068 36355 158187 -38952 22466 -135966 19493 7678 -299666 78892 -161509
11590 -140092 92245 -125127 -100331 160229 74323 490234 -239364 -99314 194925 -62503
11579 -400005 -352619 -5596 123176 156669 -145187 575344 310132 266326 -57650 81759 12797
11567 26278 370090 151085 319291 -163538 200895 23376 158035 -18300 -75085 81597
11556 349319 167106 130585 111694 166339 91539 374965 203385 170482 -158193 134570
11545 -146753 43042 88421 -179655 -26148 86517 -71627 169530 -16054 28158 -119859 111181
$$ packed form
11625i048j92522c3118l2301a2705F5272A4902f6243C4179J91623j02626J25592
11614B48768A1588c70498g7045r7023A89824m1251b359C24424A12320J94469g6224
11602A76702Q366C6355J21832c8952B2466a35966A9493G678b99666G8892a61509
11590a40092I2245a25127K4796A60229G4323M15911b39364i9314A94925f2503
11579d00005M7386e596A23176L3493a45187E75344k65212m3806e7650H1759A2797
11567B6278L43812A51085J68206a63538B00895B3376J34659a8300n6785H1597
11556C49319A67106l6521j8891N4645p4800K83426j71580l2903a58193A34570
11545a46753D3042M5379a79655b6148H6517g1627A69530a6054B8158a19859A11181
$$ plain form
11533 71935 443544 228250 318061 93842 95662 148899 104159 317295 -246862 38340 -54025
11521 39587 196638 217551 -252601 111982 75593 -159169 68044 272918 169814 70862
11510 273845 135186 -49583 -37818 65025 -80121 19502 -78514 -107007 87514 383122 160903
11498 -97159 161897 143151 -64648 118130 36557 -177944 137562 28215 -221585 50488 142768
11487 142768 87204 5903 8978 340733 16608 -110931 55888 128718 -154628 -35417 8828
11475 23474 -24812 -92320 -152761 384060 385080 -62265 -16119 -90853 176096 -53009 172266
11463 66099 261360 250183 222598 -17670 146951 170920 440464 233145 -15058 196272 220276
11452 220276 -91076 244015 282577 106680 154112 26125 48824 353149 158361 610300
$$ packed form
11533G1935L71609k15294Q9811I3842J820N3237m4740K13136b46862C8340e4025
11521C9587J57051K0913b52601A11982l6389a59169F8044K04874j03104G0862
11510B73845A35186d9583J1765F5025h0121A9502g8514k8493H7514K95608A60903
11498i7159A61897j8746f4648A18130C6557a77944A37562B8215b21585E0488R2280
11487A42768n5564E903L075L31755A6608a10931E5888P2830a54628c5417H828
11475B3474b4812o7508o0441C84060J020f2265a6119p4734A76096e3009A72266
11463F6099J95261j1177k7585a7670A46951K3969K69544k07319a5058A96272K4004
11452B20276i1076B44015L8562A06680M7432B6125K2699L04325A58361M51939
$$ plain form
11442 610300 16411 168432 118881 -210828 -209495 -14315 159662 112793 141806 188270 -10125
11430 189182 -111458 287539 57606 373252 31602 172153 188774 111621 -33444 331640
11419 214266 105509 53193 -116780 -267977 -165152 -72400 330969 -204920 163756 -46277
11408 -91016 -187085 52170 -91316 -2939 94066 -62462 306567 -51067 -302125 -103549 149070
11396 -355223 29282 46151 -205571 -150076 -116479 -69799 70586 131366 59857 168969 210575
11385 210575 -69906 227297 286273 237943 170202 -10774 -37414 158648 153441 -366 239186
11373 -10853 -88827 1804 -17221 -43222 -251397 -269230 50390 6176 154650 33414 45419 -419996
11360 -181383 -103137 126842 -27595 5974 157096 -30857 -257119 -317067 10382 -142052 -125269
$$ packed form
11442F10300A6411J52021m9551b10828J333a4315A59662m6869K9013M6464a0125
11430A89182a11458B87539E7606L15646C1602J40551J6621p7153c3444C31640
11419B14266A05509n2316a16780j51197J02825g2400C30969b04920A63756d6277
11408i1016r6069E2170i1316b939I4066f2462C06567e1067k51058a03549A49070
11396c55223B9282J6869b05571N5495L3597M6680G0586O0780E9857J09112M1606
11385B10575f9906B27297N8976m8330o7741a0774k6640A58648n207c66B39186
11373a0853p7974A804a7221k6001k08175j7833E0390F176J48474C3414J2005d19996
11360a81383P8246A26842b7595E974J51122c0857k26262n9948A0382a42052J6783
$$ plain form
11349 -125269 209340 -241260 -12539 -120687 44761 -185241 105641 -211259 208166 -182952
11338 130958 -241565 -293392 -143409 -429973 -111513 86542 -142658 243162 25835 -84278
11327 -204834 173773 193989 -2337 -229041 97895 10195 -220830 121622 -152779 -274003
11317 -274003 -270957 21695 -119992 45100 -73819 -99460 1639 519131 -22559 -219052 -95581
11305 -2668 38691 -190543 169096 -24335 -266466 -76270 -121470 129290 -435173 172456 -70721
11293 -2604 -79872 -254622 -39627 317727 103904 -175272 -68412 -67441 190066 85447 42037
11281 -19946 -119606 -221429 -21319 78571 -181934 -337877 -169610 22521 56523 58363 -163073
11269 -307784 -84812 -79523 -121091 9311 376667 -81191 354358 217052 -72439 -60061 -159195
$$ packed form
11349a25269B09340b41260a2539j08148D4761a85241A05641b11259B08166a82952
11338A30958b41565n1827a43409k86564a11513H6542a42658B43162B5835h4278
11327b04834A73773K0216b337k26704I7895A0195b20830A21622a52779j21224
11317b74003L046B1695a19992D5100g3819k5641A639N17492b2559j96493i5581
11305b668C8691a90543A69096b4335k42131g6270m5200A29290d35173A72456g0721
11293b604p7268j74750c9627C17727A03904a75272f8412R71A90066H5447D2037
11281a9946r9660j01823b1319G8571a81934j55943J68267B2521L4002J840a63073
11269c07784h4812N289m1568I311L67356h1191C54358j37306g2439J2378r9134
$$ plain form
11258 -159195 204039 78132 207400 -114220 -86445 -9379 201893 -2867 -344269 83304 -194026
11246 -84810 161 -129157 49562 213174 45507 -79275 -106478 -173615 93755 -332136 -87693
11234 -71891 -47338 -117647 44714 18848 -280356 -100179 -59744 -116835 -84109 -196554 -150756
11223 -150756 -99070 73489 23878 -8105 136703 40435 120791 -263917 -15046 -50934 -7689
11211 52191 -406833 -62732 -123436 -20246 -104000 -16780 112341 -69518 274466 36593 -421258
11199 -21532 34931 84121 -145573 -137005 -152230 268030 198365 -9792 -231642 -294292 49850
11187 -63343 67538 301908 -282495 88574 273624 259911 -233167 1123 64219 -281361 -464107
11176 -464107 -13406 -174557 -87211 148052 -208909 -436618 -145563 4466 -20984 -10393 -120212
$$ packed form
11258a59195B04039G8132J29268a14220K7775i379B01893b867l41402H3304a94026
11246h4810A61a29157D9562J63612D5507g9275k7203o7137I3755c32136h7693
11234g1891K4553p0309D4714A8848b80356a00179M0435n7091L2726j12445M5798
11223a50756N1686G3489B3878h105A36703D0435Q0356b63917a5046l5888g689
11211E2191d06833f2732o0704b0246q3754a6780A12341f9518B74466C6593d21258
11199b1532C4931M9190a45573Q568j5225B68030o9665i792k21850o2650D9850
11187f3343F7538K34370b82495H8574J85050j3713b33167A123O3096b81361j82746
11176d64107a3406j61151h7211A48052b08909k27709a45563D466b0984a0393j09819
$$ plain form
11165 -120212 -139459 -68351 -226436 -411827 19306 -12700 258633 8867 -275649 -171934 -32339
11153 -174754 -71015 245084 58994 -34468 140470 253139 130168 -218222 -241836 -48439
11142 -174290 68085 -42193 -162406 112574 -336034 -209448 -265294 -220299 99759 -168863
11131 -8407 -78522 55635 -175946 -190259 19392 91848 -82670 60420 -184050 142184 -145807
11119 -342938 -7736 39213 160269 157250 -62970 137471 222891 11674 264783 108951 -387786
11107 7687 10209 -268929 -73746 189932 271117 98057 81126 258437 59718 73914 1872 62724
11095 62724 -29697 -2557 203398 73096 -7220 330388 264807 277901 54354 96788 215205
11084 215205 361062 26943 81568 -163837 71334 -22629 -42250 139488 -152648 -19555 97963
$$ packed form
11165a20212j9247f8351j58085j85391A9306a2700B58633H867b75649J03715c2339
11153a74754g1015B45084E8994c4468A40470J12669j22971b18222k3614d8439
11142a74290F8085d2193j20213A12574c36034J26586n5846M4995I9759a68863
11131h407p0115E5635a75946j4313A9392P2456h2670F0420a84050A42184a45807
11119c42938g736C9213J21056l019f2970A37471Q5420A1674K53109A08951c87786
11107G687K522b68929g3746A89932Q1185I8057j6931J77311E9718J4196A872O0852
11095F2724b9697b557B03398G3096g220C30388o5581J3094E4354M2434J18417
11084B15205J45857B6943N4625a63837G1334b2629j9621A39488a52648a9555I7963
$$ plain form
11072 130353 228140 248627 269517 447122 322396 273596 285093 155471 566110 356190
11062 356190 66066 65670 62288 51122 290830 61401 330145 297431 304895 372922 253232 280599
11050 280599 437595 27999 446275 377161 280533 573451 530124 279034 668098 686124
11040 686124 477358 567304 401336 950490 553099 814101 357056 436588 527341 732123
11030 732123 554524 737151 788994 536875 913207 654350 610644 471001 629867 946058
11020 946058 610942 725653 691833 383772 818765 535894 370224 736210 871881 492580
11010 492580 678149 594020 683538 495289 745231 559080 537477 790984 595894 582808
11000 582808 584793 249936 449142 344699 505150 418686 594419 601320 768253 554007
$$ packed form
11072A30353R7787K0487K0890J77605j24726m8800J1497j29622M10639k09920
11062C56190F6066l96l382j1166K39708F1401K68744l2714P464O8027j19690K7367
11050B80599J56996B7999M18276o9114r6628K92918m3327k51090L89064J8026
11040F86124k08766Q9946j65968N49154l97391K61002C57056P9532R0753K04782
11030G32123j77599J82627N1843k52119L76332k58857m3706j39643J58866L16191
11020I46058l35116J14711l3820l08061M34993k82871j65670L65986J35671l79301
11010D92580J85569q4129Q9518j88249K49942j86151k1603K53507j95090j3086
11000E82808J985B49936J99206j04443J60451q6464J75733O901J66933k14246
$$ plain form
10990 554007 367534 435750 753719 530546 647034 298934 610274 700672 419219 680484
10980 680484 670400 515262 687949 751537 855040 907237 788050 728881 765697 563017
10970 563017 896330 728046 771168 888198 1342041 1218949 1453079 1384406 1106327 2104366
10960 2104366 2012365 2206568 2370111 2493499 2184538 2294655 2155247 2423245 2019117 1766259
10950 1766259 1382243 1404161 1575722 1273554 1341889 1379916 1525061 1572612 1421986 1366341
10940 1366341 1066927 1231411 893711 1358291 782627 646859 665118 688858 474328 297131
10930 297131 268116 217856 397950 49323 91935 179033 -210497 326721 -282454 292268
10919 108963 68532 103920 -73608 -149980 86864 -142138 371345 -133968 -96342 31224 -80146
$$ packed form
10990E54007j86473O8216L17969k23173J16488B98934L11340R0398k81453K61265
10980F80484j0084j55138J72687O3588J03503N2197j19187n9169L6816k02680
10970E63017L33313j68284M3122J17030M53843j23092K34130o8673k78079R98039
10960B104366r2001J94203J63543J23388l08961J10117j39408K67998m04128k52858
10950A766259l84016K1918J71561l02168O8335L8027J45145M7551j50626n5645
10940A366341k99414J64484l37700M64580n75664j35768J8259K3740k14530j77197
10930B97131k9015n0260J80094D9323M2612Q7098b10497C26721b82454B92268
10919A08963m0431L5388g3608p6372H6864a42138C71345a33968L7626C1224h0146
$$ plain form
10907 202980 -1300 -139549 134975 -120098 191957 -40143 -96828 -39859 -33070 249842 -123937
10895 -231469 198323 -12270 115762 -133894 -340997 -50469 49072 -46650 -78225 -276596
10885 -276596 -93783 -101109 186161 -65163 -153557 -133975 17512 20873 36876 104807 185336 187924
10873 187924 -110171 -315544 45563 140941 -221512 -185593 -35654 -472315 119655 90007
10863 90007 276265 -177067 -73838 -97407 -160849 32430 -166077 -387069 -122867 -270595
10853 -270595 165480 -297333 101152 337238 -166843 -94649 144282 -53554 -144594 217374
10842 -300887 -53660 -180863 121202 105241 326749 67296 2017 245836 172870 -114957 123203
10830 82797 141973 225213 -94416 -12554 81818 -83102 -112994 -247791 93440 192429 -161289
$$ packed form
10907B02980a300j38249A34975a20098A91957d0143n6685c9859O789B49842a23937
10895b31469A98323a2270A15762a33894k07103e0469D9072d6650l1575j98371
10885b76596i3783p326A86161f5163q8394J9582A7512L361J6003O7931Q0529K588
10873A87924a10171k05373D5563R5378b21512L5919c5654m36661A19655k9648
10863I0007J86258a77067g3838k3569o3442C2430a66077k20992a22867j47728
10853b70595A65480b97333A01152K36086a66843P2194A44282e3554r1040B17374
10842c00887e3660j27203A21202j5961K21508F7296B017K43819p2966a14957A23203
10830H2797N9176Q3240i4416a2554H1818h3102k9892j34797I3440R8989a61289
$$ plain form
10818 -361064 -64841 65073 183539 -99800 301964 -309517 -341815 -258219 -226168 -64278 451
10806 -262323 -136315 -4184 370152 -15959 -133171 -75448 -285840 144102 -138365 -50934
10795 -192514 -222265 -127713 -218475 129092 70849 -877 36918 -77802 -283928 58912 -132246
10783 -162077 -135930 71890 -69040 61540 -80914 66398 -8141 89229 -26170 64760 -21786 -17140
10771 -17140 -38566 -233428 256847 -279701 -169828 -7257 478 97805 75459 -128196 -185509
10760 -185509 117069 384658 -226837 236072 -137214 57956 -92463 159659 27391 -201700
10749 -253072 -31316 249351 247406 -17268 -193721 357710 -119502 -284479 84301 -185149
10738 -478949 120734 -183363 -49504 120375 -134985 -17079 -211821 79213 -49046 175188
$$ packed form
10818c61064f4841F5073J18466i9800C01964c09517l2298Q3596L2051f4278D51
10806b62323J26008d184C70152a5959j17212N7723k10392A44102a38365e0934
10795a92514k9751R4552r0762A29092n8243h77C6918g7802k06126E8912a32246
10783a62077K6147G1890f9040F1540h0914F6398h141H9229b6170F4760b1786M646
10771a7140k1426j94862B56847b79701J09873g257D78R7327k2346a28196n7313
10760a85509A17069K67589b26837B36072a37214E7956i2463A59659B7391b01700
10749b53072c1316B49351j945a7268j76453C57710a19502j64977H4301a85149
10738d78949A20734a83363d9504A20375a34985a7079j94742G9213d9046A75188
$$ plain form
10727 -285319 22835 -37017 117545 32574 49079 -153087 175839 -30883 -383177 13195 -85292
10715 -13176 -123829 -125197 335172 -176515 66715 6182 -264677 -63611 -288974 -198373 129416
10703 -262774 -232056 -150366 64238 -116005 -232791 57680 10768 -23927 -270982 227513 172411
10692 172411 20598 44366 -168539 369545 156186 -36077 85159 201549 80441 -296219
10681 -98622 -19122 175915 7522 146313 -163198 -75380 55338 21541 10107 91863 -218744
10669 295421 48366 236783 -476085 -177245 -1664 -103326 34121 -5051 -167168 16401 24036
10658 24036 -174009 26125 13991 18671 -290855 118750 -62860 165084 -199568 111982 -85378
10646 88445 -62298 -47909 124271 -271265 -46297 -80354 29518 160690 353499 -19694 87992
$$ packed form
10727b85319B2835c7017A17545C2574J6505a53087A75839c0883l52294A3195h5292
10715a3176j10653j368C35172a76515F6715F182b64677f3611k25363R0601A29416
10703b62774L0718Q1690F4238a16005j16786E7680A0768b3927k47055B27513n5102
10692A72411B0598K3768a68539C69545A56186c6077H5159J16390H0441b96219
10681i8622a9122A75915G522J38791a63198g5380E5338B1541A0107Q1756b18744
10669B95421D8366J88417d76085a77245a664j01662C4121e051j62117A6401P635
10658B4036a74009B6125j2134M680b90855A18750f2860A65084a99568A11982h5378
10646H8445f2298J4389A24271b71265d6297l4057B9518J31172J92809a9694H7992
$$ plain form
10634 -432190 179505 240735 -226160 34766 -332605 5816 52157 18418 -28313 61137 38685
10623 38685 -221639 77820 -112597 -166386 -80746 -269422 -12021 -218623 117763 -3990 -55099
10612 -55099 -100600 -318531 -155645 -71449 -214070 145888 1864 -182362 97138 -135917 -71324
10601 -71324 205901 39354 207365 -12017 -200514 -60312 31358 -132935 -41063 -21490 -39762
10590 -39762 -107819 -179105 77549 -162153 -188606 -321152 -135477 -170770 -8035 -207502 -151571
10579 -151571 -190159 -211121 -51097 -174905 -108932 -227043 -298793 -99899 151413 -88958 59583
10567 5864 11582 -16401 -191348 -381837 -147137 45898 311620 -475688 -148345 -361100 -190271
10556 -190271 -66617 -227540 -52275 -377447 65817 -181526 55184 -2769 84213 54602 -160640
$$ packed form
10634d32190A79505O1230b26160C4766c32605E816M6341A8418b8313F1137k2452
10623C8685b21639G7820a12597n3789h0746j88676a2021k06602A17763c990n1109
10612e5099m5501k17931a55645g1449j42621A45888A864a82362I7138a35917O4593
10601g1324B05901C9354J68011a2017j88497f0312C1358a32935d1063J9573j8272
10590c9762o8057p1286G7549a62153k6453j32546a35477l5293h035j99467N5931
10579a51571l8588k0962e1097j23808O5973j18111p1750i9899A51413h8958E9583
10567E864N718a6401j74947j90489a47137D5898K65722d75688a48345k12755J70829
10556a90271f6617j60923e2275l25172F5817a81526E5184b769H4213k9611a60640
$$ plain form
10544 -25239 -283231 -169201 84243 -277748 -207387 -89961 -44343 92871 -49515 174152 323807
10533 323807 -172432 -288423 147119 80260 58217 -188930 -22859 -311330 -202925 -230026
10523 -230026 40645 -52842 -190354 -168678 169311 59060 -213347 18485 -49367 19808 -103045
10511 28415 -106041 42671 8112 -66548 145383 -63217 -293602 -62720 99140 18917 -64316
10499 72489 -24817 165574 -41746 -167325 -214397 -231920 -253492 -162257 -22361 36505 254904
10488 254904 -376331 -143566 279446 -5107 17540 -130514 184437 -41981 -116490 -141215 37908
10476 114570 36310 47762 174896 -174609 -56527 334087 254598 164377 72978 260507 444978
10465 444978 242262 -76467 433458 40742 163842 -83011 279563 23645 -12073 48082 -223991
$$ packed form
10544b5239k57992J14030H4243b77748P0361h9961d4343I2871d9515A74152J49655
10533C23807a72432j15991A47119o6859k2043a88930b2859k88471J08405k7101
10523b30026D0645e2842j37512K1676A69311E9060b13347A8485d9367A9808a03045
10511B8415a06041D2671H112f6548A45383f3217k30385f2720I9140A8917f4316
10499G2489b4817A65574d1746j25579m7072j7523k1572R1235b2361C6505K18399
10488B54904c76331a43566B79446e107A7540a30514A84437d1981p4509k4725C7908
10476A14570C6310J1452J27134a74609e6527C34087p9489r0221G2978J87529J84471
10465D44978k02716g6467D33458D0742J23100h3011B79563B3645a2073D8082b23991
$$ plain form
10453 -26381 -111278 139530 -93313 134972 160997 -20013 111757 63063 166740 -214995 195694
10441 -47767 -20347 -237099 180773 -182280 -421550 277744 142211 56054 -178500 -69919
10430 44537 16391 78795 -108757 -176682 -225938 -194796 -70918 -34896 -110520 225063 -37803
10418 42674 51424 112370 -113480 164667 -154760 -189616 -135411 -229067 -65224 -40573 280868
10406 10004 243747 74808 -445449 144529 191931 -14358 35823 -101665 37790 -155824 11371
10394 40625 -143385 -413732 102409 -235592 13784 -148572 -81882 32103 24629 -200657 -358967
10383 -358967 84298 203139 222493 104192 52390 -110121 166158 -22663 -101590 25290 142247
10372 142247 -154325 39760 57530 -92067 183979 177900 27606 -33076 -27611 224372 175193
$$ packed form
10453b6381q4897A39530i3313A34972K6025b0013A11757m8694J03677b14995A95694
10441d7767b0347k16752A80773a82280k39270B77744j35533E6054a78500f9919
10430D4537A6391O2404a08757o7925m9256L1142g0918c4896p5624B25063c7803
10418D2674Q750O0946a13480A64667a54760l4856N4205r3656f5224K4651B80868
10406A0004K33743G4808d45449A44529M7402a4358C5823a01665C7790a55824A1371
10394D0625a43385k70347A02409b35592A3784a48572O6690C2103p474b00657j58310
10383c58967H4298J18841J9354A04192n1802a10121A66158b2663p8927B5290J16957
10372A42247a54325C9760J7770i2067A83979o079B7606c3076N465B24372m9179
$$ plain form
10361 175193 302451 227051 196593 363134 227556 -42242 154149 200404 102396 306067
10351 306067 499764 410783 242324 284196 37375 191256 286425 314027 222356 23783 493194
10340 493194 277476 295339 346204 472044 295902 149569 385949 242623 711270 -63392
10329 80828 277409 216556 551972 -28440 155228 85952 218901 310500 372312 228094 -190431
10317 28925 -70181 232695 163739 186166 374767 -88170 35228 112864 204500 194584 328229
10306 328229 54194 -519 58515 324392 2328 265659 -83257 -307368 6381 -42379 -45836 80570
10293 -70564 8367 9036 -117605 185536 -87258 -239612 -71894 -66298 -208127 -126031 108552
10281 -45511 5059 226854 153444 -43325 90035 -62139 -171749 -68939 72616 -103941 -1524
$$ packed form
10361A75193J27258p5400l0458J66541j35578d2242A54149M6255r8008K03671
10351C06067J93697q8981j68459M1872C7375J53881R5169K7602r1671B3783M69411
10340D93194k15718J7863N0865J25840j76142j46333K36380j43326M68647f3392
10329H0828J96581o0853L35416b8440A55228o9276J32949R1599O1812j44218a90431
10317B8925g0181B32695o8956K2427J88601h8170C5228P7636R1636r916J33645
10306C28229E4194e19E8515K65877B328K63331h3257k24111F381d2379l457H0570
10293g0564H367O69a17605A85536h7258j52354g1894N596j41829Q2096A08552
10281d5511E059K21795p3410d3325I0035f2139j09610f8939G2616a03941a524
$$ plain form
10269 -303802 140059 -6028 -79762 -166437 -91966 -42365 -202447 -90740 -376233 -80946 -197747
10258 -197747 27175 -366662 143460 -211418 290957 53097 204290 255488 178315 196600
10248 196600 246425 485627 195031 214131 458513 219992 197391 196170 104800 -55708 177511
10236 23125 35333 142418 74597 -53197 101759 -44580 150411 58019 71702 -154799 -372544
10225 -372544 235233 135604 17958 -204736 139737 287171 1994 80511 -6329 -196070 75196
10213 -10500 -84690 -33005 -377479 118209 10990 90390 327867 104861 -139859 -28690 -1264
10201 -185059 -199660 51903 -178315 97201 270308 47039 112004 -29781 -30588 164478 -194711
10189 -221885 319779 -145236 42694 -407278 -242810 7333 -179529 -158450 116740 -150785
$$ packed form
10269c03802A40059f028p3734q6675P4471d2365j60082i0740k85493h0946j16801
10258a97747B7175c66662A43460b11418B90957E3097J51193N1198p7173J8285
10248A96600M9825K39202A95031J9100K44382B19992k2601j221r1370e5708A77511
10236B3125J2208J07085o7821e3197A01759d4580A50411E8019J3683a54799k17745
10225c72544B35233r9629A7958b04736A39737J47434A994P8517f329j89741G5196
10213a0500p4190c3005l44474A18209A0990P9400K37477A04861a39859b8690a264
10201a85059j4601E1903a78315I7201J73107D7039O4965b9781q07A64478a94711
10189b21885C19779a45236D2694d07278J64468G333a79529K1079A16740a50785
$$ plain form
10178 360042 -267874 -186247 195924 -171403 -171001 -363828 -294398 72418 -34702 -186150 -192679
10167 -192679 -203544 -58729 55550 22949 20929 -187072 -114111 -29090 -193316 8014 118908
10156 118908 -97539 -150261 -258489 -195613 235155 -55203 -144229 -240214 -192177 25438 -48632
10144 -405101 -162103 -107196 -77351 -80124 170470 176234 -219636 141438 -336188 56347 -127079
10132 -415431 -196357 -48205 -88599 -101869 148363 117451 -99933 -94245 -89425 5872 -204882
10120 -73061 -84351 349651 260234 -443296 -225318 128496 -330683 -62502 21117 -122316
10109 124198 -121791 28908 -54875 -219783 -47352 77282 83636 -225985 14347 -240844 50729
10097 107220 -52662 -284352 180647 -35417 -139310 44201 -137683 -100089 -153504 75502 67410
$$ packed form
10178C60042b67874Q1627A95924a71403M02j92827O9430G2418c4702j51448o529
10167a92679j0865e8729E5550B2949k020a87072P2961b9090j64226H014J10894
10156A18908i7539n2722j08228O2876B35155e5203q9026r5985M8037B5438d8632
10144d05101a62103N4907K9845k773A70470N764b19636A41438c36188E6347a27079
10132d15431a96357d8205m0394j3270A48363l0912i9933N688M820E872b04882
10120g3061j1290C49651q9417d43296K17978A28496c30683f2502B1117a22316
10109A24198a21791B8908e4875j64908d7352G7282O354b25985A4347b40844E0729
10097A07220e2662k31690A80647c5417j03893D4201a37683L7594n3415G5502q092
$$ plain form
10086 67410 -31506 -166362 48490 119065 346337 216126 62889 60767 46974 -108146 9619
10074 -88061 -165012 -251475 75401 34976 -203951 228817 -8519 94562 -118423 -82760 -237490
10063 -237490 -170415 -15337 -261217 -61199 -65261 -56562 -39977 -83972 -208990 -244621 -114243
10051 116030 69555 -113559 -34535 76058 304423 29054 -34211 192787 -203434 -47234 110322
10039 -193119 231096 -268568 342400 -185810 -151293 -173160 -167528 -183509 -81163 -254444 -122948
10027 -14328 -48735 198515 -211233 230146 108263 -200882 -80009 -133368 245442 23135
10016 166961 -8210 -28132 -208518 125075 145215 -77821 110799 -57371 155616 28795 74145
10005 74145 -51459 -293785 -229798 17739 325077 -119020 -253269 -4302 -25810 129076 -269104
$$ packed form
10086F7410c1506j34856D8490P0575K27272j30211F2889k122j3793a08146I619
10074h8061p6951q6463G5401C4976b03951B28817h519I4562a18423L5663j54730
10063b37490O7075a5337k45880f1199m062Q699J6585m3995j25018l5631a14243
10051A16030m6475a13559c4535G6058K28365B9054c4211A92787b03434d7234A10322
10039a93119B31096b68568C42400a85810L4517k1867N632j5981h1163j73281a22948
10027a4328l4407A98515b11233B30146A08263b00882h0009n3359B45442B3135
10016A66961h210j9922j80386A25075K0140g7821A10799e7371A55616B8795M5350
10005G4145e1459k42326O3987A7739L07338a19020j34249d302k1508A29076b69104
$$ plain form
9993 43817 -137236 -57757 -184383 -49880 -77055 -100036 21102 -104071 186886 -155254 132263
9981 -36635 4642 140583 31197 -5460 -15559 -519382 -282542 -325287 -194064 -90343 123896
9969 -9259 -229249 18799 -189666 -222739 -416678 -184095 -249075 3411 -299016 -85370 -85642 -88749
9957 -88749 -256052 -197419 -82385 82440 13644 -15123 -39013 26994 -314492 -399915 -201178
9946 -201178 222394 45011 -110172 34137 24019 -165125 -24208 212155 -47332 175041 133268
9935 133268 179345 116436 22014 -10908 -44699 -64382 -24995 -199498 -182193 -279726 -17904
9923 -285616 -121335 -267909 -28938 218513 -179895 -97872 -18240 71722 114617 -352752 -176847
9912 -176847 -145162 198743 -147410 -197755 -329912 -279463 75514 -269053 -363333 93109 -177240
$$ packed form
9993D3817a37236e7757j26626d9880k7175k2981B1102a04071A86886a55254A32263
9981c6635D642J35941C1197e460j0099n03823K36840m2745J31223i0343A23896
9969i259k19990A8799a89666l3073j93939a84095o4980C411b99016h5370k72l107
9957h8749j67303N8633h2385H2440A3644a5123k3890B6994c14492q5423J98737
9946b01178B22394D5011a10172C4137j0118a65125b4208B12155d7332A75041m1773
9935A33268M6077o2909B2014a0908l3791j9683b4995j74503J7305r7533a7904
9923b85616a21335j46574b8938B18513a79895Q2023a8240G1722M2895c52752J75905
9912a76847L1685A98743a47410n0345j32157N0449G5514b69053r4280I3109a77240
$$ plain form
9900 -34956 -47307 31733 45869 -53002 -159294 -281934 -2759 -208969 86476 255447 -221316
9888 -45059 -312548 144162 -28548 -138915 -90597 -128456 300830 -175976 -155453 -150310 -220624
9877 -220624 -152042 -245271 -18947 -81611 -138373 -350332 -283344 28031 -103952 -35734 73633
9865 -83573 -124040 210079 -78221 63530 143020 20663 25928 -331130 14819 -33892 -208721
9854 -208721 -214941 -189670 -97820 -101359 6189 -88361 230091 -242271 -209860 -193007 -57010 112816
9841 23515 359444 -265990 -14776 248248 -143102 29903 -58966 -65449 -292380 -82080 212475
9829 -431988 -266027 -159147 -189284 173549 -234441 208880 -293934 -350719 -225672 -183484
9819 -183484 -368340 -42746 50865 -163779 -328881 188151 -35253 -296016 -115984 -17149
$$ packed form
9900c4956j2351C1733J4136e3002j06292j22640b759k06210H6476J68971b21316
9888d5059k67489A44162b8548j10367M8318l7859C00830a75976K0523N143p0314
9877b20624O8582r3229a8947o2664n6762k11959O6988B8031a03952c5734G3633
9865h3573m0467B10079g8221F3530P9490B0663N265c31130A4819c3892j74829
9854b08721o220K5271R1850l539F189h8361B30091b42271L2411J6853e7010A12816
9841B3515L35929b65990a4776B48248a43102B9903e8966o483k26931h2080B12475
9829d31988J65961J06880l0137A73549b34441B08880b93934n6785J25047M2188
9819a83484j84856d2746E0865a63779j65102A88151c5253k60763a15984a7149
$$ plain form
9808 58030 -207488 -111458 -178624 19811 72499 -205980 -175160 7606 -42962 80743 -168769
9796 83024 -415319 56585 -13942 -34628 35524 -24322 -79411 -298184 -52785 -70645 -166949
9785 -166949 76508 -85939 2394 228322 247708 348789 -187903 174524 -106774 109051 134250
9774 134250 -137312 -32512 -275698 150071 -3011 26869 368938 151342 114621 7965 163477
9763 163477 -51549 13782 -86710 -18692 85625 -79105 78949 75132 233797 -186108 -162850
9752 -162850 64918 -72030 -226352 -283744 151333 165420 133739 44153 -88011 -126485 -297928
9741 -297928 -48843 23094 -70117 189826 143210 -184067 -101647 -155065 351074 -158776 216451
9729 197009 21054 -120625 -388699 -314831 225275 77378 -237620 -330512 -1545 423634 -144897
$$ packed form
9808E8030b07488R6030o7166A9811N2688b05980L0820G606d2962H0743a68769
9796H3024d15319E6585a3942k0686C5524b4322n5089k18773e2785j7860r6304
9785a66949G6508h5939B394K25928J9386J01081a87903A74524a06774A09051K5199
9774A34250a37312c2512k43186A50071c011B6869L42069A51342l6721G965J55512
9763A63477e1549A3782h6710a8692H5625g9105G8949l817J58665a86108K3258
9752a62850F4918g2030j54322n7392A51333J4087l1681D4153h8011l8474j71443
9741b97928d8843B3094g0117A89826m6616a84067Q2420n3418C51074a58776B16451
9729A97009B1054a20625k68074P3868B25275G7378b37620r2892a545D23634a44897
$$ plain form
9717 289845 -158369 -311652 -192345 136057 -129095 -272019 -225900 -87125 10509 -205491
9706 -102358 -343186 -195465 -51331 -184939 -254522 -59190 30040 -132779 -227009 -95857 -63447
9695 -63447 513 153402 278916 302638 2484 86242 -178898 -14432 175959 -224974 -35941
9683 -101793 -335665 -118595 269785 -78993 36698 88594 -135180 -75688 227709 183164 -325612
9671 71891 -8212 208805 -58418 -88537 -134784 -324323 -28443 195701 -60965 -152489 -1804 -127857
9659 -127857 -140937 60315 133195 -162820 89738 -245781 -117270 4359 10273 195259 -64751
9647 -164562 -287908 -164982 7474 18376 -224695 36349 201154 -46230 -136581 77961 -258673
9635 -322729 150340 -382228 -124911 58142 -218676 256809 -81000 202110 -134449 -83940
$$ packed form
9717B89845a58369j53283J19307A36057a29095j42924M6119h7125A0509b05491
9706a02358k40828J47721e1331j33608o9583e9190C0040a32779r4230i5857L2410
9695f3447E13J52889J25514K3722B484Q3758a78898a4432A75959b24974c5941
9683a01793k33872a18595B69785g8993C6698N1896a35180N9492B27709m4545c25612
9671G1891h212B08805e8418l0119m6247j89539b8443A95701f0965r1524a804j26053
9659a27857j3080F0315P2880a62820H9738b45781a17270D359N914J84986f4751
9647a64562j23346J22926G474J0902b24695C6349J64805d6230r0351G7961b58673
9635c22729A50340c82228a24911E8142b18676B56809h1000B02110a34449N0509
$$ plain form
9625 -83940 -45557 40094 66666 72918 -279913 -420209 115756 112300 -26209 111764 -167637
9613 -232507 -3955 198363 -136741 -78661 466128 -89663 -316029 17401 -108469 -202769 64339
9601 126264 -4393 9572 27260 317891 -401687 253202 23260 276423 -457212 277 264481
9590 264481 202520 70012 -44769 311819 -176568 116058 -250459 -35966 -539230 -563171 227595
9578 289647 -182494 -213331 -125234 -322766 -72243 -110969 -250618 444554 70620 -174570 -238542
9567 -238542 -126987 -223078 -51487 174769 50092 -85841 -18931 -271939 17549 -129444 -31454
9555 -288572 93243 -210539 -274484 -213791 -168159 197213 -42744 66677 -250235 75442 -250090
9543 -7792 80616 -128080 -459182 221008 45662 -186896 -17179 292840 -339076 -148170 -81578
$$ packed form
9625h3940L8383D0094K6572O252b79913j40296A15756l456b6209A11764a67637
9613b32507c955A98363a36741N8080D66128h9663k26366A7401a08469r4300F4339
9601A26264d393I572J7688K90631d01687B53202B3260K53163d57212B77K64204
9590B64481o1961G0012d4769C11819a76568A16058b50459c5966n03264k3941B27595
9578B89647a82494l0837Q8097j97532g2243l8726j39649D44554G0620a74570o3972
9567b38542J11555r6091e1487A74769E0092h5841a8931k53008A7549a29444c1454
9555b88572I3243b10539o3945O0693M5632A97213d2744F6677b50235G5442b50090
9543g792H0616a28080l31102B21008D5662a86896a7179B92840c39076a48170O6592
$$ plain form
9532 -81578 200019 -52705 -137487 -7113 88685 -177288 -72854 24367 -29449 -113692 108049
9520 -203449 -151611 -30561 -152612 -41828 -16850 29615 -152124 -95522 -245836 -106811 -209923
9509 -209923 43390 76945 34877 -310696 -4328 31558 -283083 7191 -270037 -48965 185814
9497 90590 116002 -236580 -34330 -288141 -117911 12636 -5249 26674 -3005 133070 173026
9486 173026 -62077 -128319 56317 -99992 271208 -165121 -15467 -380648 165785 90587 -182873
9474 -314059 20631 37960 -308951 -74484 -225571 92368 48526 -116270 -234217 -11051 -165946
9463 -165946 232281 -275773 -103468 61534 289340 257678 258718 -29885 -252497 -241651 96001
9451 -64818 -329637 89872 -148519 -212551 -31545 -300882 99840 809 192821 -111050 -216146
$$ packed form
9532h1578B00019e2705q4782g113H8685a77288g2854B4367b9449q4243A08049
9520b03449N1838c0561j22051d1828a6850B9615a52124N6602j50314a06811j03112
9509b09923D3390L3555C4877c10696d328C1558b83083G191b70037d8965A85814
9497I0590K5412b36580c4330k53811a17911A2636e249B6674c005A33070L9956
9486A73026f2077o6242E6317i9992B71208a65121a5467l65181A65785p5198a82873
9474c14059B0631J7329c08951g4484j51087I2368m3842a16270j17947a1051j54895
9463a65946B32281b75773a03468F1534K27806l1662J040b9885k22612J0846I6001
9451f4818k64819H9872a48519o4032c1545k69337I9840H09J92012a11050j05096
$$ plain form
9440 -216146 135166 -327847 -61861 -322767 -71040 -196071 -13850 -10195 17466 -418768 -250813
9429 -250813 -80234 13794 -87429 -149562 -180625 -25703 -71297 700 178456 -229710 51931 -334137
9416 -108853 1302 232250 -394402 -30889 291092 -47290 -288540 -10905 -38940 -152773 263876
9404 145326 24288 169688 -490592 -384249 93189 -292378 -125710 81505 -174209 -55745
9393 -74101 -84807 -317363 42076 -168234 74889 -199177 -26280 -166714 -264472 31275 -39120
9381 93543 -201182 99650 70816 -537976 79699 -17609 -163239 -181259 -96159 -98907 -81389
9370 -81389 -104224 -204944 -121269 -44053 -274104 -255873 -23574 127129 -254963 173816 -63761
9358 -113080 258729 318813 -152364 -59442 -85843 -114450 -132365 195528 -82920 8158 68224
$$ packed form
9440b16146A35166c27847f1861k60906g1040j25031a3850L655A7466d18768J67955
9429b50813h0234A3794h7429o2133l1063b5703m5594G00J77756b29710E1931c34137
9416a08853A302K30948c94402c0889B91092d7290k41250a0905k8035j13833B63876
9404A45326B4288J45400d90592J06343I3189b92378a25710H1505a74209e5745
9393g4101j0706k32556D2076a68234G4889a99177b6280j40434r7758C1275c9120
9381I3543b01182I9650k8834e37976G9699a7609j45630j8020Q5100k748J7518
9370h1389k2835j00720Q3675d4053k30051J8231b3574A27129b54963A73816f3761
9358a13080B58729O0084a52364e9442k6401k8607j7915A95528h2920H158O0066
$$ plain form
9347 68224 -203287 -113667 -169537 -65604 -59903 93620 -36546 -59057 145496 -81673 282723
9335 -149770 130400 -36990 -347343 -193874 43342 -72423 -232426 -43150 -165934 186002
9324 -29772 -23866 88969 49000 68014 246091 176986 -308895 -178500 -239781 2509 -267182
9312 69905 74127 56996 -182226 -44961 6592 -309223 144972 -16586 -67829 85752 129722 251607
9300 251607 -211226 -49734 -98195 -242582 -118036 -67829 -212400 -149900 -200107 60426 -97772
9288 181614 -35708 38181 9183 -126942 56969 -261362 4385 -189588 -104592 -40069 34770
9276 -42062 -66090 -100193 -368173 -21039 -84528 133670 -124029 -219434 247533 174934 17655
9264 -243148 -35206 -329049 -97784 208473 -169531 -153173 -236098 -2394 35319 -81489 136603
$$ packed form
9347F8224b03287Q9620n5870f5604N701I3620c6546k2511A45496h1673B82723
9335a49770A30400c6990l10353J53469D3342g2423j60003d3150j22784A86002
9324b9772N906H8969l9969J9014J78077o9105c08895J30395o1281B509b67182
9312F9905M222j7131a82226d4961F592c09223A44972a6586n1243H5752M3970J21885
9300B51607b11226d9734m8461j44387a18036N0207j44571O2500n0207F0426i7772
9288A81614c5708C8181I183a26942E6969b61362D385a89588Q4996d0069C4770
9276d2062k4028l4103k67980b1039o3489A33670a24029r5405B47533p2599A7655
9264b43148c5206k93843i7784B08473a69531J6358q2925b394C5319h1489A36603
$$ plain form
9252 -211112 -10863 -63896 -128227 -57216 -31160 -150151 -118617 -197074 105441 -515094 77031
9240 191767 -2477 -40087 -148768 -335405 230196 -23475 -169123 318669 69191 -188994 47609
9228 -169812 -241679 193480 -10086 -98090 -23819 133700 -315573 -10455 296425 -348968 117297
9216 28862 4410 279191 -163356 -176549 -103165 21449 131100 -66780 84640 -300044 335154
9204 -312729 172473 271453 -150640 86023 -17305 -194684 80416 56428 -40348 -90078 39477
9192 -72701 -194795 -273976 -91466 -142073 -438954 -8778 -187456 -254265 -128132 131849 -165901
9180 -317164 -33551 -232580 -9245 -126475 -10208 -165602 -102398 26350 124159 -29580 73934
9168 338217 -150541 79931 -151548 66769 -13009 -328671 8312 -264602 -129754 -8727 131031
$$ packed form
9252b11112a0863n3033o4331e7216K6056j18991L1534p8457A05441e15094G7031
9240A91767b477l7610j08681j86637B30196b3475j45648C18669F9191a88994D7609
9228a69812p1867A93480a0086q8004b3819A33700c15573a0455B96425c48968A17297
9216B8862D410K74781a63356j3193P3384B1449J09651f6780H4640c00044C35154
9204c12729A72473R8980a50640H6023a7305j77379H0416k3988d0348m9730C9477
9192g2701j22094p9181i1466n0607k96881h778j78678o6809J26133A31849a65901
9180c17164c3551j99029i245j17230a0208j55394O3204B6350R7809b9580G3934
9168C38217a50541G9931a51548F6769a3009l15662H312b64602a29754h727A31031
$$ plain form
9156 -295824 -149712 -49991 -93421 35880 204547 209691 -36748 -169796 -6663 352692 -80232
9144 61346 106598 -210671 -238644 69952 110957 85025 69512 362763 -255436 40828 188100
9133 188100 -277290 -105036 -329163 -60348 149501 -112801 99186 131450 88174 -59694 139380
9121 -136502 -304156 30190 -339417 106087 23773 -32832 178568 5471 -418225 63144 -23426
9109 85511 -201989 -56522 -219414 212089 29798 -214966 -172907 -358087 109492 -70512 -367136
9098 -367136 -64240 288227 383090 292859 -70097 59445 -299241 21177 351007 186033 -161040
9086 -366136 -304838 -58058 99055 -57193 -96845 -27916 83880 67817 190290 -97246 143352
9074 31426 -79814 -168946 -58394 265718 -43976 -317045 88989 -255537 10271 -312671 -126853
$$ packed form
9156b95824J46112d9991m3430C5880J68667N144c6748j33048f663C52692h0232
9144F1346M5252b10671k7973F9952M1005k5932j5513K93251b55436D0828J47272
9133A88100b77290a05036k24127f0348A49501a12801I9186L2264m3276e9694A39380
9121a36502j67654C0190c39417A06087B3773c2832A78568E471d18225F3144b3426
9109H5511b01989e6522j62892B12089B9798b14966M2059j85180A09492g0512k96624
9098c67136f4240B88227R4863r0231g0097E9445b99241B1177L29830j64974a61040
9086c66136O1298e8058I9055e7193l9652b7916H3880j6063J22473i7246A43352
9074C1426g9814q9132e8394B65718d3976k73069H8989b55537A0271c12671a26853
$$ plain form
9062 457718 -71876 -165852 -61007 -18540 -314260 71148 212590 -319492 59926 230249 -80626
9050 -214492 -16970 -167548 -129013 -66341 -203811 37137 -452030 62224 -319600 -365948 152816
9038 -175598 16704 -81654 -361203 112213 218070 19494 -63434 -72168 -183022 -159246 -61691
9026 -34013 72034 -160444 -101077 -186144 -112216 -4892 -232818 175173 -116646 58148 -110773
9014 22418 -117675 -172822 -16525 -268001 -77553 21781 -127667 93159 210592 -135307 119603
9002 -416973 339140 -300596 -26960 186205 97780 -60756 337726 -327325 101305 -52701
8991 -19170 -196024 -245729 -112715 119743 123721 -21044 -232588 -231942 -9789 99412 -143336 223038
8978 179303 -115902 38795 -99468 -33914 -23836 -85258 -107861 -38064 94641 -357111 -200741
$$ packed form
9062D57718g1876r3976f1007a8540k95720G1148J41442c19492E9926J70323h0626
9050b14492a6970j50578L8535O2672j37470C7137d52030F2224c19600m6348A52816
9038a75598A6704h1654k79549A12213J05857A9494f3434q734j10854K3776f1691
9026c4013G2034a60444N9367q5067P3928d892k27926A75173a16646E8148a10773
9014B2418a17675n5147a6525k51476g7553B1781a27667I3159J17433a35307A19603
9002d16973C39140c00596b6960A86205q8425f0756C37726c27325A01305e2701
8991a9170j76854m9705a12715A19743L978b1044k11544O46i789I9412a43336B23038
8978A79303a15902C8795i9468c3914J0078o1422k2603c8064I4641c57111J56370
$$ plain form
8967 -200741 236218 297890 -20116 -141950 125959 247434 210464 93493 262339 -36750 111980
8955 -246713 16166 124135 -46672 -103645 -119781 31311 -63366 -113976 174997 2748 222043
8944 222043 49954 200273 -54029 -214910 86719 -70781 248398 116541 -179580 9062 3731
8932 -61819 25754 -110162 1767 80136 -37584 320068 62484 -238515 -16436 -377847 -25976
8920 -70923 25582 389643 425078 325526 45345 86865 709793 150756 566809 887858 985906
8909 985906 1647748 2887881 4829505 9302127 7887856 3701147 1891288 1293128 673805
8900 673805 625613 298894 186240 359699 197195 132010 257019 365475 331177 292298
8890 292298 85146 54389 -22998 -210380 6709 -178396 120930 -301845 51789 -106151 100954
$$ packed form
8967b00741B36218O1672b0116j21834A25959J21475l6970I3493J68846c6750A11980
8955b46713A6166J07969d6672n6973j6136C1311f3366n0610A74997B748K19295
8944B22043D9954J50319e4029j60881H6719g0781B48398A16541a79580I062C731
8932f1819B5754a10162A767P8369c7584C20068F2484b38515a6436l61411b5976
8920g0923B5582L64061L5435r9552D5345M1520O22928A50756M16053L21049R8048
8909I85906O61842J240133J941624M472622j414271C701147j809859n98160o19323
8900F73805m8192B98894j12654J73459j62504o5185J25009J08456l4298l8879
8890B92298H5146l0757b2998j87382F709a78396A20930c01845E1789a06151A00954
$$ plain form
8878 17083 -78940 -121763 -42483 -322032 -37138 -20147 -271195 75809 65133 -143283 113141
8866 273578 -214830 -220296 -169096 21507 -107041 -261948 -87606 -298918 52216 124989 33968
8854 -51038 -172570 26234 -131760 253744 57901 -220833 105597 220604 -93256 -320961
8844 -320961 -330153 32269 375559 86198 -156529 176761 -193469 -93353 -229742 -64855 168916
8832 73649 -193849 190577 -270412 37146 -209064 -68260 61239 -119082 36318 -132864 -228813
8821 -228813 43397 104495 60028 -220812 -197602 -41001 -1970 -259431 155011 53826 -81519
$$ packed form
8878A7083g8940m2823d2483k79549c7138J6991k51048G5809j0676a43283A13141
8866B73578b14830n466N1200B1507a07041j54907h7606k11312E2216P2773C3968
8854e1038j21532B6234a31760B53744E7901b20833A05597J15007i3256k27705
8844c20961r192C2269L43290H6198a56529A76761a93469i3353j36389f4855A68916
8832G3649a93849A90577b70412C7146b09064f8260F1239a19082C6318a32864r5949
8821b28813D3397O1098m4467b20812K3210d1001a970k57461A55011E3826h1519
$$ [...]
##END NTUPLES=NMR SPECTRUM
##END=
