
##TITLE=AC1222_Punto_6074794_1Xs9jaGfa0
##JCAMPDX= 6.0         $$ Bruker NMR JCAMP-DX V2.0
##DATA TYPE= NMR SPECTRUM
##DATA CLASS= NTUPLES
##ORIGIN= BRUKER
##OWNER= Administrator
$$ 1.72 TOPSPIN		Version 2.1
$$ 2012-05-08 20:44:47.921 -0500  Administrator@TOPSPIN
$$ Compression mode = diff/dup
##.OBSERVE FREQUENCY= 400.13188235
##.OBSERVE NUCLEUS= ^1H
##.ACQUISITION MODE= SIMULTANEOUS (DQD)
##.ACQUISITION SCHEME= undefined
##.AVERAGES= 64
##.DIGITISER RES= 22
##SPECTROMETER/DATA SYSTEM= spect
##.PULSE SEQUENCE= noesygpps1d.comp
##.SOLVENT NAME= COFFEE_meoh
##.SHIFT REFERENCE= INTERNAL, COFFEE_meoh, 1, 14.9667
##AUDIT TRAIL= $$ (NUMBER, WHEN, WHO, WHERE, PROCESS, VERSION, WHAT)
$$ ##TITLE= Audit trail, TOPSPIN		Version 2.1
$$ ##JCAMPDX= 5.01
$$ ##ORIGIN= Bruker BioSpin GmbH
$$ ##OWNER= Administrator
$$ $$ C:\Bruker\TOPSPIN/data/COFFEE/nmr/AC1222_Punto_6074794_1Xs9jaGfa0/52/pdata/1/auditp.txt
$$ ##AUDIT TRAIL=  $$ (NUMBER, WHEN, WHO, WHERE, PROCESS, VERSION, WHAT)
(   1,<2012-05-08 20:44:43.140 -0500>,<Administrator>,<TOPSPIN>,<go>,<TOPSPIN 2.1>,
      <created by zg
	started at 2012-05-08 20:33:12.640 -0500,
	POWCHK enabled, PULCHK disabled,
       configuration hash MD5:
       AF F2 23 6B 01 CD 40 DD E5 A1 38 A0 06 EA F7 77
       data hash MD5: 64K
       DC CF DC 11 19 95 E5 88 82 8E EA 79 92 23 9D 19>)
(   2,<2012-05-08 20:44:46.000 -0500>,<Administrator>,<TOPSPIN>,<proc1d>,<TOPSPIN 2.1>,
      <Start of raw data processing
       efp LB = 0.3 FT_mod = 6 PKNL = 1 PHC0 = 0 PHC1 = 0 SI = 128K 
       data hash MD5: 128K
       8A 19 4F AD 29 4E DB B2 2D CD 6B 7F 97 71 45 98>)
(   3,<2012-05-08 20:44:47.203 -0500>,<Administrator>,<TOPSPIN>,<proc1d>,<TOPSPIN 2.1>,
      <pk PHC0 = 31.00891 PHC1 = 0 
       data hash MD5: 128K
       01 5D 6B 45 83 71 98 C8 AB C3 5F 71 E2 4E 44 9C>)
(   4,<2012-05-08 20:44:47.421 -0500>,<Administrator>,<TOPSPIN>,<proc1d>,<TOPSPIN 2.1>,
      <abs ABSG = 1 
       data hash MD5: 128K
       EB 1A 58 28 48 09 B8 C1 DE 37 F9 1F 7C 0D FB 5E>)
(   5,<2012-05-08 20:44:47.515 -0500>,<Administrator>,<TOPSPIN>,<proc1d>,<TOPSPIN 2.1>,
      <abs ABSG = 2 
       data hash MD5: 128K
       02 D3 0D CE B2 FC F4 4C A3 84 D9 E4 34 90 5A D4>)
(   6,<2012-05-08 20:44:47.734 -0500>,<Administrator>,<TOPSPIN>,<proc1d>,<TOPSPIN 2.1>,
      <abs ABSG = 3 
       data hash MD5: 128K
       12 1C 8C 02 AF AC 14 8D 2D 18 A6 F1 55 1F 31 8D>)
(   7,<2012-05-08 20:44:47.796 -0500>,<Administrator>,<TOPSPIN>,<proc1d>,<TOPSPIN 2.1>,
      <abs ABSG = 4 
       data hash MD5: 128K
       70 17 E8 C7 43 63 23 25 2D FC C3 07 3C 3F 1D D2>)
(   8,<2012-05-08 20:44:47.843 -0500>,<Administrator>,<TOPSPIN>,<proc1d>,<TOPSPIN 2.1>,
      <abs ABSG = 5 
       data hash MD5: 128K
       2E 18 48 2C 89 9C AD 7E 85 A9 2B 52 FC EE 68 4A>)
$$ ##END=
$$ 
$$ $$ hash MD5
$$ $$ C0 E2 00 9B C8 6F BE 25 BB C8 30 13 03 1B 10 B6
##$RELAX= 
##$RELAX= 
##$RELAX= 
##$RELAX= 
##$RELAX= 
##$RELAX= 
##$RELAX= 
##$RELAX= 
$$ Bruker specific parameters
$$ [...]
##$TP07= 0
##$TPNAME0= <>
##$TPNAME1= <>
##$TPNAME2= <>
##$TPNAME3= <>
##$TPNAME4= <>
##$TPNAME5= <>
##$TPNAME6= <>
##$TPNAME7= <>
##$TPOAL= (0..7)
0.5 0.5 0.5 0.5 0.5 0.5 0.5 0.5
##$TPOFFS= (0..7)
0 0 0 0 0 0 0 0
##$TUNHIN= 0
##$TUNHOUT= 0
##$TUNXOUT= 0
##$USERA1= <user>
##$USERA2= <user>
##$USERA3= <user>
##$USERA4= <user>
##$USERA5= <user>
##$V9= 5
##$VALIST= <valist>
##$VCLIST= <CCCCCCCCCCCCCCC>
##$VD= 0
##$VDLIST= <DDDDDDDDDDDDDDD>
##$VPLIST= <PPPPPPPPPPPPPPP>
##$VTLIST= <TTTTTTTTTTTTTTT>
##$WBST= 1024
##$WBSW= 4
##$XGAIN= (0..3)
0 0 0 0
##$XL= 0
##$YL= 0
##$YMAX_a= 11093367
##$YMIN_a= -6148075
##$ZGOPTNS= <>
##$ZL1= 120
##$ZL2= 120
##$ZL3= 120
##$ZL4= 120
##$ABSF1= 14.9667
##$ABSF2= -5.585831
##$ABSG= 5
##$ABSL= 3
##$ALPHA= 0
##$AQORDER= 0
##$ASSFAC= 0
##$ASSFACI= 0
##$ASSFACX= 0
##$ASSWID= 0
##$AUNMP= <proc_prof1d_extract.lims>
##$AXLEFT= 0
##$AXNAME= <>
##$AXNUC= <1H>
##$AXRIGHT= 0
##$AXTYPE= 0
##$AXUNIT= <>
##$AZFE= 0.1
##$AZFW= 0.1
##$BCFW= 0
##$BC_mod= 0
##$BYTORDP= 0
##$COROFFS= 0
##$CY= 15
##$DATMOD= 1
##$DC= 0
##$DFILT= <>
##$DTYPP= 0
##$F1P= 0
##$F2P= 0
##$FCOR= 0.5
##$FTSIZE= 131072
##$FT_mod= 6
##$GAMMA= 0
##$GB= 0
##$INTBC= 1
##$INTSCL= 1
##$ISEN= 128
##$LB= 0.3
##$LEV0= 0
##$LPBIN= 0
##$MAXI= 10000
##$MC2= 0
##$MEAN= 0
##$ME_mod= 0
##$MI= 0
##$NCOEF= 0
##$NC_proc= -3
##$NLEV= 6
##$NOISF1= 0
##$NOISF2= 0
##$NSP= 0
##$NTH_PI= 0
##$NZP= 0
##$OFFSET= 14.9667
##$PC= 1
##$PHC0= 31.00891
##$PHC1= 0
##$PH_mod= 1
##$PKNL= yes
##$PPARMOD= 0
##$PPDIAG= 0
##$PPIPTYP= 0
##$PPMPNUM= 2147483647
##$PPRESOL= 1
##$PSCAL= 4
##$PSIGN= 0
##$PYNMP= <proc.py>
##$REVERSE= no
##$SF= 400.130005565018
##$SI= 131072
##$SIGF1= 0
##$SIGF2= 0
##$SINO= 400
##$SIOLD= 131072
##$SPECTYP= <>
##$SREGLST= <1H.CDCl3>
##$SSB= 0
##$STSI= 131072
##$STSR= 0
##$SW_p= 8223.68421052632
##$SYMM= 0
##$S_DEV= 0
##$TDeff= 65536
##$TDoff= 0
##$TI= <>
##$TILT= no
##$TM1= 0
##$TM2= 0
##$TOPLEV= 0
##$USERP1= <user>
##$USERP2= <user>
##$USERP3= <user>
##$USERP4= <user>
##$USERP5= <user>
##$WDW= 1
##$XDIM= 131072
##$YMAX_p= 442132431
##$YMIN_p= -34075231
##$CURPLOT= <Network HP LaserJet P1505>
##$CURPRIN= <$Network HP LaserJet P1505>
##$DFORMAT= <normdp>
##$LAYOUT= <+/1D_H.xwp>
##$LFORMAT= <normlp>
##$PFORMAT= <normpl>
##$SURQMSG= 1
$$ End of Bruker specific parameters
$$ ---------------------------------
##NTUPLES= NMR SPECTRUM
##VAR_NAME=  FREQUENCY,     SPECTRUM/REAL,   SPECTRUM/IMAG
##SYMBOL=    X,             R,               I
##VAR_TYPE=  INDEPENDENT,   DEPENDENT,       DEPENDENT
##VAR_FORM=  AFFN,          ASDF,            ASDF
##VAR_DIM=   131072,        131072,          131072
##UNITS=     HZ,            ARBITRARY UNITS, ARBITRARY UNITS
##FACTOR=    0.0627417313425165, 1,          1
##FIRST=     8223.62146879498, -5179,        -107237
##LAST=      0,             -3566,           -110489
##MIN=       0,             -34075231,       0
##MAX=       8223.62146879498, 442132431,    0
$$ Real data points
##PAGE= N=1
##DATA TABLE= (X++(R..R)), XYDATA
$$ [...]
64792 317527 313282 308863 305349 302950 300854 298283 294918 290502 285077 279842 276770 276683 278193 278985 277783
64777 277783 274726 270559 266255 263058 261807 262030 262428 262497 263008 264588 266520 267594 267644 267484 267626 268032 269159
64760 269159 272166 277451 283642 288786 292324 295353 299096 303703 308535 313121 317662 322881 329459 337458
64746 337458 346316 355519 365072 375109 385329 395098 403778 410567 414446 414998 413059 409900 406015 401417
64732 401417 396769 392953 389480 384572 377317 368804 360755 354045 349103 346523 346291 347215 348106 348854 349471
64717 349471 349028 346928 344609 344334 346403 349091 351403 354373 359170 365335 371676 377836 384119 390552 397074
64702 397074 404140 412204 420800 428867 435954 442568 449419 456675 463887 470271 475145 478465 480914 483296
64688 483296 485873 488402 490580 492083 492352 490735 487013 481614 475230 468239 460468 451502 441349 430853
64674 430853 421357 413780 407999 403131 398436 394009 390590 388584 387259 385201 381782 377903 374912 373057
64660 373057 371498 369697 368087 367209 366909 366778 366945 367880 369675 371984 374537 377282 379973 382094 383426
64645 383426 384453 385912 387866 389503 389993 389316 387869 385397 381027 374643 367575 361318 356012 350962 346288
64630 346288 342976 341314 340369 339409 338923 339740 341951 345383 350355 356999 364157 369979 373590 375551 376770
64615 376770 377803 379196 381630 385266 389507 393803 398288 403197 408140 412670 417407 423750 431978 440144
64601 440144 445481 446886 445544 443101 439878 435188 428831 421607 414545 408289 403230 399635 397448 396308
64587 396308 395813 395531 395002 394335 394606 396772 400155 402985 404854 407648 413399 421970 431623 441144 450590
64572 450590 460540 471722 484945 500127 515426 528423 538263 545725 551211 553918 553322 550309 546176
64559 546176 541411 536071 530396 524029 515473 503685 490013 477314 467070 458466 450447 443464 438435
64546 438435 434988 431780 428163 424545 421371 418814 417417 417804 419313 420060 419225 418320 419034 420481 420152 417431
64530 417431 414414 412817 411736 409530 406590 404706 404404 404505 404075 403350 402704 402109 401964 403269 406408 410605
64514 410605 415052 419708 424481 428566 431408 433714 436622 440115 442800 442964 439425 431974 421781 411039
64500 411039 401382 392680 383846 374551 365568 357795 351691 347443 344784 342663 339884 336172 332043 327830
64486 327830 323716 320603 319611 320348 320856 320096 319501 321035 324430 327496 328897 329412 330507 332717 335625 338381
64470 338381 339785 338711 335289 331270 328485 327088 325808 323793 321572 320230 320260 321508 323787 326993 330777
64455 330777 334540 337859 340621 342697 343882 344456 345496 348140 352494 357607 362562 367226 371893 376726
64441 376726 381987 388452 396933 407235 417939 427429 435062 441417 447648 454591 462159 469369 474978 478206
64427 478206 479013 477967 476004 473988 472163 470146 467720 465284 463039 460094 455333 449206 443620 439634
64413 439634 436253 432227 428182 425809 425422 425749 426079 427242 429940 433317 436122 438576 442038 447150 453236
64398 453236 459410 465275 470421 474182 476493 478483 481629 486511 492687 499430 506138 512437 518655 526207
64384 526207 536786 550905 567633 585764 604602 623435 641285 658079 675558 695994 720135
64373 720135 747267 777108 810488 847966 889087 933655 982758 1037664 1098494 1165093 1238597
64362 1238597 1320830 1412211 1511392 1617017 1728674 1845719 1966062 2086627 2204426 2316815
64352 2316815 2421395 2516232 2599762 2670122 2725025 2762656 2782326 2784052 2768246 2736193 2690052
64341 2690052 2631523 2560974 2478553 2385535 2283700 2173976 2057173 1936082 1815535 1699842
64331 1699842 1590888 1488921 1394048 1306266 1224942 1149346 1079568 1016241 959567 909091 864160
64320 864160 824073 788052 755655 726874 701193 676947 652706 629328 609375 593932 580938
64309 580938 567497 553097 539426 527394 515744 502978 489522 477077 466419 456804 447474 438876
64297 438876 432011 427069 423223 419647 416416 414358 414122 415451 417326 418960 420730 424016 429895 438010
64283 438010 446796 454731 461095 465593 467789 467337 464575 460407 455576 450389 445143 440369 436388 432996
64269 432996 429908 427262 425211 423291 420809 417960 415997 415969 417563 419342 419825 418141 414163 408669 403294
64254 403294 399659 398207 398014 397859 397336 396781 396288 395166 392522 388324 383670 379872 377312 375263 372652
64239 372652 368918 364367 360081 357375 356863 357884 359202 360416 362316 365673 370044 374034 376434 376953 376265
64224 376265 375759 376862 379964 384100 387979 391195 394153 397256 400722 405013 410688 417747 425589 433666
64210 433666 441753 449560 456560 462315 466686 469783 472075 474334 476894 478951 479243 477621 475441 474210
64196 474210 474271 474945 475427 475233 474222 472577 470561 468017 464212 458373 450372 440985 431604 423377 416252
64181 416252 409052 401057 393348 387961 385768 385750 386249 386173 385045 382903 380469 378579 377067 374986 372240
64166 372240 370092 369494 369705 369247 367582 365213 362791 360910 360191 360704 361525 361539 360442 358578 356375 354535
64150 354535 354109 355440 357371 358325 357913 356854 355805 355149 355433 356865 358553 359309 359160 359140 359735 360686 362300
64133 362300 365712 371401 378362 385260 391756 398487 406503 416924 430155 444869 458600 470083 480474
64120 480474 491540 503104 513029 519471 522372 522690 520928 516776 509841 500177 488144 474293 459714
64107 459714 446036 434292 423905 413700 404050 396825 392516 388699 382744 375307 369442 366548 365003
64094 365003 363027 361010 360236 360743 361675 362789 364514 367061 370450 374937 380532 386444 391773 396475 400901
64079 400901 404711 407116 408034 408173 407931 406978 405172 403308 402543 403312 405062 406911 408311 409008 408606 406654
64063 406654 403434 400425 399451 401340 405682 411790 419458 428860 440219 453482 467788 481469 493426
64050 493426 504529 516706 530469 544325 556858 568151 578550 587317 593583 597771 600901 603267
64038 603267 605132 608153 614426 623967 634435 643688 651555 658722 664888 668798 669622 667659 663764 658375
64024 658375 651121 641365 629209 615724 602027 588506 575346 563264 552898 543685 534251 524096
64012 524096 514213 505969 499957 496027 493680 492137 490620 488928 487351 485896 484162 482300 481434 482587
63998 482587 485505 488977 492106 494906 497905 501617 506433 512730 520851 530708 541230 550519 557337 562619
63984 562619 568946 578085 589464 601349 612919 624521 636371 648130 659875 672420 685894 698477
63972 698477 707421 711452 711723 710326 708395 705918 702850 699666 696756 693878 690532 686703 683026 680290
63958 680290 678834 678200 677294 675107 671512 667247 663055 658952 654295 648329 640711 631980 623722 617758 614700
63943 614700 613488 612623 611544 610507 609608 608637 607781 607853 609692 613588 619194 625722 632475 639581 648029 658565
63927 658565 670800 683907 697829 713007 729140 745289 761461 779143 799706 822848 847144
63916 847144 871694 896689 922689 949948 978525 1008686 1041047 1076189 1113995 1153537 1194039
63905 1194039 1235982 1280799 1329434 1381746 1437568 1497843 1564351 1638638 1721510 1813247 1914057
63894 1914057 2024620 2146435 2281414 2431055 2596505 2779471 2982163 3205624 3448650
63885 3448650 3709002 3985165 4276094 4579544 4891633 5208030 5524663 5837082 6139818
63876 6139818 6426585 6690634 6925060 7123834 7283159 7401452 7477728 7510558 7498754 7442245
63866 7442245 7341621 7197500 7011411 6787377 6532039 6253164 5958145 5653410 5344393
63857 5344393 5035837 4732318 4438195 4156518 3888437 3634562 3396855 3178190 2979884
63848 2979884 2800706 2638736 2493065 2362891 2245935 2139198 2041150 1952020 1871876 1799352
63838 1799352 1732542 1670332 1612470 1558889 1509383 1463598 1421030 1381256 1344229 1310081 1278630
63827 1278630 1249495 1222647 1198301 1176332 1156551 1139651 1126960 1118757 1113594 1109909 1107792 1108454
63815 1108454 1112404 1118891 1126989 1136551 1148042 1161807 1177449 1193796 1209754 1225192 1240433 1254728
63803 1254728 1266156 1273693 1278490 1282197 1284715 1284712 1281825 1276970 1270661 1262342 1251471 1238053 1221843 1202203
63789 1202203 1179145 1153595 1126344 1097714 1068587 1040498 1013973 987739 960515 932883 906452
63778 906452 881720 857695 833302 808275 782873 757515 732714 708707 685147 661711 638999
63767 638999 618335 600539 585213 571229 557600 543957 530582 518119 507102 497652 489500 482066
63755 482066 474541 466423 458306 451691 447471 444757 441684 437290 432158 427307 423014 419030 415542 413402
63741 413402 413195 414227 414795 413601 410711 406983 402930 398712 394932 392505 391460 390540 388476 385167 381242
63726 381242 377041 372638 368521 365539 364135 364022 364518 364898 364547 363115 360666 357707 355155 354070 354776
63711 354776 356131 356278 354484 351841 349923 349353 349953 351476 353488 355222 356409 357823 360188 362907 364879
63696 364879 366312 368698 372850 377834 381944 384069 384050 382534 380774 379917 380072 380428 380423 380467 381462 384065 388427
63679 388427 394087 399943 404789 408175 410549 412506 414207 415520 416432 417359 419256 423160 429126 435821 441671
63664 441671 446242 450037 453384 456367 459506 463291 467024 469278 469791 469852 470395 470827 470420 469917 470802 473407
63648 473407 476481 478362 478184 476374 474390 473479 473326 472470 470402 468413 467826 468252 468545 468742 469893 472335
63632 472335 475301 478137 480856 483507 485976 488582 491978 496222 500561 504354 507582 510353 512551 514185
63618 514185 515444 516223 516238 515875 516234 517894 520139 521865 522873 523791 525065 526595 528295 530448 533289 536338
63602 536338 538336 538030 535229 530973 526426 521696 516138 509778 503869 499837 498042 497753 497946 497905 497527 497473
63586 497473 498752 501742 505718 509531 512555 514844 516841 519325 523301 529327 537044 545730 555102 565138
63572 565138 575382 585227 594960 605850 618892 633838 649612 665191 679983 694016 708226 724096
63560 724096 742538 763425 786552 812413 841325 872274 903787 935882 970100 1007360 1046868
63549 1046868 1087687 1130299 1175542 1222687 1269739 1315240 1358319 1396829 1427136 1446828 1456934
63538 1456934 1460527 1459686 1454792 1446268 1435504 1423753 1411184 1397617 1383239 1367731 1349329 1325949
63526 1325949 1297322 1265227 1231505 1196778 1161459 1127072 1095525 1067325 1041426 1016891 993932
63515 993932 973164 954712 938622 925600 916554 911535 909653 909970 912018 915651 921003 928659 939221
63502 939221 952473 967419 983432 1000986 1020976 1043660 1068527 1094947 1122704 1152184 1184370
63491 1184370 1220389 1260626 1304385 1350708 1399402 1450916 1505173 1560561 1613839 1660897 1698126
63480 1698126 1723780 1738205 1742714 1738517 1727052 1710771 1692603 1674405 1656410 1638195 1619445 1599487
63468 1599487 1576822 1549860 1517997 1481518 1440738 1395846 1347713 1298236 1249500 1202554 1157142
63457 1157142 1112599 1068986 1027353 988885 953705 920701 888751 858222 830928 808255 789417
63446 789417 772055 754737 738345 724491 713055 702269 691163 680696 671970 664435 656995 650080
63434 650080 645145 642238 639672 636500 634047 634130 636646 639753 641843 642513 642137 641527 641867 644006 647671 651946
63418 651946 656566 662026 668236 673751 676848 677182 676006 674750 673627 671762 668596 664816 661546 658889
63404 658889 655999 652708 650227 649598 650113 650174 649343 648612 648812 649867 651791 655350 661081 668294 675732 682989
63388 682989 690812 700210 711607 724811 739520 755858 774375 795475 818965 844523 872433 903327
63376 903327 937266 973728 1012581 1054141 1097700 1140590 1179457 1212423 1239750 1262883 1283506
63365 1283506 1303265 1323676 1345947 1371035 1399835 1433112 1471235 1513907 1559939 1607418 1654716
63354 1654716 1701571 1748527 1794772 1837030 1871263 1895363 1909808 1916165 1915744 1909593 1898902 1884952
63342 1884952 1868736 1850566 1829867 1805623 1777329 1745238 1709419 1669208 1624301 1575906 1525919
63331 1525919 1475250 1424040 1373325 1325170 1280852 1240073 1202499 1169023 1140701 1117174 1097094
63320 1097094 1079671 1065002 1053176 1043945 1037305 1033817 1034138 1038430 1046195 1056489 1068531 1082440 1099218
63307 1099218 1119831 1144423 1172550 1203723 1237402 1272977 1310411 1350728 1395206 1444021 1495986
63296 1495986 1549528 1603502 1657140 1709654 1759891 1806015 1845600 1876545 1898127 1910939 1915771
63285 1915771 1912932 1902757 1886516 1866512 1845214 1824111 1803064 1780647 1755147 1725282 1690179
63274 1690179 1649306 1603042 1553152 1502086 1451615 1402373 1354610 1308908 1266099 1226972 1192228
63263 1192228 1162218 1136438 1113726 1093301 1075221 1059221 1043379 1024762 1001732 975272 947844
63252 947844 921227 895704 870960 847141 824915 804823 786827 770347 754615 739218 724533
63241 724533 711646 701616 694659 689913 685772 680546 673292 664521 655938 649016 643763 639142 634538 630290
63227 630290 626821 623893 620997 617908 614481 610391 605635 601001 597458 595170 593562 592208 591100 590025
63213 590025 588331 585695 582856 581209 581638 583811 586616 589206 591564 594117 597095 600605 605152 611507
63199 611507 619818 629287 638998 648592 657803 665961 672786 679452 687972 699294 712569 726398 740293
63186 740293 754634 769686 785116 800474 816017 833151 853876 879253 908245 938510 968697
63175 968697 999690 1033147 1069020 1105129 1139438 1172255 1205560 1240223 1274645 1306675 1336351
63164 1336351 1365892 1397060 1429449 1461657 1493208 1524606 1555975 1586306 1613738 1636151 1652041
63153 1652041 1661516 1666060 1666584 1662069 1650868 1632952 1609911 1583042 1552561 1518628 1482046 1443897
63141 1443897 1405597 1369369 1337411 1310208 1286709 1266367 1249738 1236738 1226046 1217274 1212247 1212667
63129 1212667 1217524 1224370 1232395 1242535 1255010 1268680 1282992 1298770 1316497 1335142 1353449 1371382
63117 1371382 1389589 1408253 1427204 1446515 1466080 1484845 1501167 1513887 1522764 1528020 1529847 1528158
63105 1528158 1522490 1512170 1496721 1475992 1449931 1418676 1383134 1345128 1306561 1268484 1231071
63094 1231071 1194209 1157932 1122652 1089353 1059298 1033002 1009563 987416 965862 945537 927336
63083 927336 911240 896385 882030 868175 855291 843729 833543 824771 817643 812354 808696 806128
63071 806128 804263 803130 802890 803507 804904 807242 810673 814848 819098 823341 828468 835419 843938 852563 859820
63056 859820 865173 868935 871820 874740 878519 883301 888465 893488 898724 904908 912086 919566 926822 933867
63042 933867 940694 946953 952463 957476 962072 965728 967931 968978 969736 970836 972582 975444 979992 986177
63028 986177 993052 999575 1005588 1011831 1018935 1026525 1033504 1039377 1045119 1052446 1062229 1073942 1086577 1099590
63014 1099590 1112908 1126844 1142555 1161861 1185585 1212139 1238749 1264387 1290830 1320499 1353876
63003 1353876 1389661 1426980 1466550 1509591 1556411 1606690 1660810 1720032 1785074 1854956 1927698
62992 1927698 2001991 2077818 2155617 2235298 2316107 2397049 2477430 2557285 2637294 2717887 2798584
62981 2798584 2878679 2958334 3038087 3117219 3193729 3266353 3335459 3401099 3461174 3512742 3554471
62970 3554471 3586363 3607408 3615132 3607787 3585770 3550481 3502855 3443587 3373982 3295870 3211165 3122042
62958 3122042 3031169 2941474 2855833 2776773 2705530 2641320 2582652 2530017 2486370 2454064 2432062
62947 2432062 2417181 2407640 2404280 2408504 2420161 2437605 2458933 2482827 2508771 2536806 2566730 2597399
62935 2597399 2627266 2655750 2683593 2711662 2739830 2767195 2792836 2815783 2834519 2847175 2852451
62924 2852451 2850050 2840052 2822038 2794994 2758061 2711229 2655273 2591271 2520507 2444769 2366279 2286975
62912 2286975 2207975 2129986 2053993 1981117 1911883 1846187 1784136 1726451 1673653 1625146 1579626
62901 1579626 1536337 1495430 1457009 1420449 1385103 1351372 1320364 1292346 1265959 1239320 1211728
62890 1211728 1184078 1157765 1133468 1110843 1089037 1067419 1046033 1025485 1006317 988503 971637
62879 971637 955478 940115 925695 912308 900058 888959 878773 869219 860370 852457 845322 838524
62867 838524 832077 826580 822328 818816 815497 812475 809874 806968 802836 797787 793194 789660 786155 781560
62853 781560 776443 772526 770519 769159 766544 761963 756242 750751 746296 742674 738988 734540 729677 725655
62839 725655 723442 722820 722913 723300 724057 724788 724438 722455 719644 717369 716180 715638 715165 714533 713717 712889 712561
62822 712561 713261 714962 717195 719561 721702 723029 723289 723386 724678 727148 729205 729804 729788 730340 730999 730405 728478
62805 728478 726473 725039 723801 723069 724298 727881 731821 733987 734969 737119 741068 744906 747141 748865 752044
62790 752044 756774 761477 765130 767894 769793 770218 769140 767713 767093 767392 768248 769664 771663 773778 775664
62775 775664 777705 780246 782732 784502 786063 788452 791531 794136 796023 798424 802283 807029 811742 816558
62761 816558 822102 828263 834504 841047 848784 858073 868140 877682 885855 893039 900980 911532 924626
62748 924626 937978 949552 959935 971464 985446 1001325 1018410 1037116 1058121 1081304 1106121
62737 1106121 1132420 1160434 1190495 1223192 1259306 1299068 1341740 1386438 1433399 1484224 1540841
62726 1540841 1604242 1674176 1750125 1832441 1921940 2018235 2119477 2224583 2334790 2451373
62716 2451373 2572141 2692050 2807416 2917485 3021228 3114871 3194244 3257847 3305550 3335506
62706 3335506 3344879 3333253 3302957 3256001 3192962 3115271 3026340 2929446 2826203 2718043 2607458
62695 2607458 2496561 2385900 2276098 2169234 2067060 1969228 1875280 1787312 1708062 1636746
62685 1636746 1569479 1504335 1443584 1389875 1342230 1297455 1254157 1213538 1176870 1143909 1113866
62674 1113866 1086670 1062869 1042936 1026927 1014437 1004731 997057 990913 986151 983150 982857 985932 991603
62661 991603 997937 1003649 1009170 1015680 1023898 1034393 1048259 1066330 1087959 1111493 1136018 1162207
62649 1162207 1191713 1226273 1266931 1313306 1363757 1416980 1473375 1534322 1600521 1671781 1747874
62638 1747874 1828409 1912044 1997015 2082454 2168047 2252342 2332714 2407252 2475256 2535318 2584348
62627 2584348 2619592 2640645 2648353 2642491 2621798 2585921 2536119 2474175 2401680 2320626 2233859 2144473
62615 2144473 2055025 1967307 1882399 1800587 1721506 1644780 1570763 1500655 1435604 1375564 1319363
62604 1319363 1266217 1216691 1171495 1129855 1090205 1052400 1017913 987571 960423 935467 913157
62593 913157 894254 878175 863588 849844 836750 823682 810188 797018 785406 775677 767541 761129
62581 761129 756448 752310 747449 742584 739792 739576 739932 738775 736173 733758 732914 733944 736123 738103 739020
62566 739020 739558 741248 744662 749092 754011 759626 765773 771607 777018 783214 791109 800088 809266 819158
62552 819158 831259 846531 864914 885466 906259 925150 941963 959422 980849 1007213 1037258
62541 1037258 1069827 1104805 1142216 1182026 1224952 1272036 1322836 1375152 1427184 1479111 1531751
62530 1531751 1584301 1634354 1679940 1720548 1755899 1784432 1803779 1812587 1811236 1800622 1780948 1752234
62518 1752234 1715514 1672587 1624804 1573033 1518828 1464393 1410921 1357983 1305345 1254530 1207679
62507 1207679 1165433 1126852 1090947 1057412 1026206 997435 971392 947968 926420 906576 889652
62496 889652 876566 865734 854148 840789 827566 816554 807767 800265 793970 789251 785683 782504 779858
62483 779858 778586 779060 780999 784134 788233 792771 797351 802305 808141 814552 820731 826556 832682 839425
62469 839425 846359 853306 861115 871127 884284 900983 921262 944721 970644 998724 1029637 1064472
62457 1064472 1103589 1146311 1191783 1239856 1290897 1344859 1400756 1457005 1512024 1564507 1613518
62446 1613518 1658692 1700017 1736912 1767513 1789486 1801778 1805215 1801366 1791551 1777319 1760993 1744692
62434 1744692 1729018 1713689 1699433 1688219 1681335 1678311 1678540 1683223 1694628 1713596 1738872 1769089
62422 1769089 1804488 1846019 1893323 1944401 1997155 2050539 2104073 2156868 2207545 2254590 2296138
62411 2296138 2329544 2352051 2362410 2361525 2350987 2330911 2299557 2255296 2198825 2133370 2062790 1989635
62399 1989635 1914861 1838841 1762188 1685750 1610537 1538053 1470275 1408636 1353000 1302153 1255381
62388 1255381 1213140 1176051 1143777 1115244 1089598 1066589 1046329 1029097 1015183 1004530 996587
62377 996587 990728 986602 983809 981597 979332 976948 974428 971071 965960 958934 950409 940408 928672 915636
62363 915636 902230 888570 874064 859311 846634 837672 831263 824782 816950 808208 799019 789424 780249
62350 780249 773152 768890 766483 764528 762457 760127 757145 753384 749578 746742 745316 745162 745800 746298 745734
62335 745734 744499 744485 747179 752056 757616 763383 769736 776192 781410 785200 789260 795191 802668 810403 818330
62320 818330 827886 840180 854650 869806 884982 901025 919295 940137 962544 985371 1008605 1033209
62308 1033209 1059946 1088944 1120343 1154743 1192685 1234195 1279224 1328221 1381775 1439846 1501904
62297 1501904 1567835 1638222 1713381 1792305 1872782 1952491 2029750 2103232 2171187 2231218 2280784
62286 2280784 2317906 2341721 2352847 2353165 2344565 2327459 2300782 2263766 2217383 2163708 2104455 2040922
62274 2040922 1975092 1909669 1846726 1786968 1730456 1677256 1627082 1579291 1533983 1492455 1455723
62263 1455723 1422937 1392104 1362078 1332945 1304562 1275843 1245897 1215120 1184645 1155176 1126844
62252 1126844 1099855 1074617 1051203 1029043 1007392 986087 965923 948260 934030 922963 913901
62241 913901 905999 899506 895205 893082 891674 888813 883284 876088 870159 868333 871090 876176 880595 882973
62227 882973 884034 885282 887848 892475 899780 909853 921877 934661 947541 960405 973026 984935
62215 984935 996127 1007403 1019658 1033144 1047807 1064151 1083298 1106212 1133194 1164101 1198596
62204 1198596 1236065 1275739 1317433 1362090 1411228 1465745 1525484 1590042 1659622 1734687 1814886
62193 1814886 1898788 1984581 2070307 2153070 2228933 2294811 2350327 2396786 2434188 2460391 2473624
62182 2473624 2474600 2465176 2445826 2415727 2374926 2325125 2268363 2206051 2139408 2069852 1998707 1927332
62170 1927332 1857603 1791309 1728728 1668699 1610367 1554000 1499920 1447835 1397886 1351299 1309112
62159 1309112 1271048 1236370 1204891 1176179 1148751 1121530 1095558 1072676 1052771 1033924 1015459
62148 1015459 999200 987011 978297 970772 962938 955035 948217 943707 942381 944239 948166 952766 957580
62135 957580 963249 970486 979145 988380 997615 1007310 1018705 1032635 1048600 1065243 1081813 1098864 1117332
62122 1117332 1137235 1157685 1178065 1198706 1220030 1241300 1260822 1277726 1293279 1310016 1329815
62111 1329815 1353335 1381089 1413909 1451785 1493168 1536474 1582012 1631621 1686420 1745519 1806661
62100 1806661 1867283 1924967 1977731 2024153 2062801 2091772 2109668 2117110 2116335 2108975 2095032 2074278
62088 2074278 2047626 2016335 1980528 1939359 1892517 1841216 1788162 1736757 1689573 1646885 1607240
62077 1607240 1570038 1536825 1509238 1486511 1466509 1448844 1435311 1426943 1422174 1418712 1415998 1414751
62065 1414751 1414912 1415448 1415973 1417343 1420355 1424547 1428448 1430449 1429355 1424942 1418508 1412454 1408733 1407648 1408094
62050 1408094 1408395 1406595 1400679 1389672 1374775 1358858 1344479 1332421 1321960 1312081 1302558 1294376 1289197
62037 1289197 1287899 1289486 1291944 1294196 1296620 1299658 1303023 1306828 1312375 1320683 1330812 1340864 1350491
62024 1350491 1361240 1374387 1389491 1405331 1421336 1437671 1454744 1473161 1493673 1516732 1542396
62013 1542396 1570732 1601646 1634131 1666536 1698235 1730501 1765145 1802693 1842329 1883133 1924653
62002 1924653 1966590 2008673 2050800 2092615 2132732 2168699 2197880 2218373 2229358 2230976 2223943 2209095
61990 2209095 2187218 2159087 2125221 2085521 2039688 1988263 1932784 1874583 1814039 1751586 1688977
61979 1688977 1628632 1571716 1517539 1464987 1414206 1366766 1324406 1287613 1255211 1225409 1197360
61968 1197360 1171483 1148173 1126738 1106082 1086038 1067364 1050625 1035673 1022068 1009341 996803
61957 996803 983684 969633 954839 939765 925150 911973 900762 890964 881662 872964 865985 861296
61945 861296 857988 854591 850533 846512 843763 843037 843885 844871 844877 844161 843695 843653 843329 842430 841335 839801 836597
61928 836597 831155 824617 818284 811773 803918 795047 786976 780687 775272 769530 763537 757942 752520 746368
61914 746368 739292 732244 726248 721451 717367 713657 710332 707309 704146 700351 695832 690936 686221 682368
61900 682368 680059 679487 679921 680216 680028 680151 681392 683529 685880 688508 692113 696786 701698 706349 711538
61885 711538 718591 727891 738569 749506 760400 772050 785835 802710 822339 843193 863655 882950
61873 882950 900993 917758 933250 947907 962502 977517 992830 1007865 1021670 1032973 1040786 1045267
61861 1045267 1047620 1048886 1049090 1047748 1044923 1041466 1038384 1036259 1035168 1035049 1036215 1039470 1045411 1053618
61847 1053618 1063032 1073322 1085193 1098854 1112810 1125050 1135079 1143844 1151716 1157552 1159955 1158569
61835 1158569 1153802 1146124 1136276 1125483 1114626 1103459 1091250 1078031 1064657 1051753 1039169 1026503
61823 1026503 1013774 1001469 990164 979962 970114 959352 946956 933421 919839 906780 894120
61812 894120 881782 870118 859580 850456 843109 838103 835816 836049 838160 841522 845792 850772 856142 861544
61798 861544 867084 873616 882219 893419 907329 924434 945476 970202 996864 1023710 1050649 1078792
61786 1078792 1108471 1138299 1166177 1190815 1212381 1232000 1250439 1266913 1279458 1286939 1290312 1291360
61774 1291360 1290668 1287704 1282525 1276194 1269518 1262557 1255709 1250296 1247579 1247893 1250960 1256200 1262480 1268653
61760 1268653 1274883 1282407 1291175 1298586 1301457 1298551 1290391 1277495 1260175 1239608 1217570 1194942 1171371
61747 1171371 1146479 1120544 1094004 1067269 1041163 1016612 993557 970921 948068 925769 905455
61736 905455 887984 873365 861060 850191 839844 829534 819196 808813 798532 789103 781441 775481
61724 775481 770129 764662 759525 755423 752320 749899 748275 747400 746241 743543 739337 734973 731678 729762
61710 729762 729148 729807 731398 733140 734471 735467 736346 736980 737235 737450 738217 739875 742520 746246 750956 756025
61694 756025 760464 763503 764862 764725 763801 763235 763833 765134 765629 764182 761088 757529 754257 751128 747751
61679 747751 744214 741132 739207 738712 739149 739447 738768 737209 735592 734681 734858 736289 738707 740902 741178 738933
61663 738933 735626 733742 734894 738917 744293 749116 752254 754336 757325 762399 768387 772960 775127 775731
61649 775731 775681 774977 773771 773024 773194 773126 771411 768384 765644 763709 761227 756768 750609 744328 739115 734887
61633 734887 730745 726016 720875 716091 712129 708659 705099 701457 698265 695762 693558 691138 688325 685210
61619 685210 681977 678872 676034 673216 669900 665766 660902 655684 650834 647507 646717 648316 650871 652766
61605 652766 653374 653132 652874 653205 654239 655579 656559 656567 655196 652432 649014 646420 645919 647603 650587 653894
61589 653894 656671 658001 657644 657003 658215 661819 666222 669785 672371 674409 675737 676442 677624 679894 681824
61574 681824 681576 679643 678295 678244 677583 674513 669727 665283 662127 659576 656655 653190 649832 647335 645534
61559 645534 643026 638520 632556 627175 623724 621809 620464 619202 617432 614092 608834 602750 596937 591023
61545 591023 584096 576470 569349 563104 557120 551192 545880 541325 536872 532290 528427 525989 524183 521293
61531 521293 516468 510523 504871 500026 495420 490694 486647 484366 483598 482721 480560 477507 474579 472148 470107
61516 470107 468529 467419 466452 465649 465623 466252 465988 463854 461528 461731 464646 467621 468616 468250 467941 467701 466838
61499 466838 465511 464375 463587 463356 464710 468348 473136 477021 479330 481080 483038 484543 484592 483308 481847
61484 481847 481231 481544 482086 482231 482242 483005 484749 486403 486798 486280 486436 488125 490434 491796 491616 490466 489068
61467 489068 487603 485948 484170 482528 481080 479565 477880 476543 476289 477120 478124 478538 478700 479583 481569
61452 481569 484054 486085 486994 486530 484998 483376 482850 483821 485514 486776 487132 486969 486854 486968 487265 487878 488978
61435 488978 490151 490320 488840 486586 485399 486116 487605 488129 487297 486226 486040 486853 488210 489847 491904 494764
61419 494764 498758 503622 508107 510757 511411 511483 512353 513852 514872 515145 515591 516919 518690 520201 521609 523468
61403 523468 525407 526032 524293 520523 516123 512716 511625 513289 516587 519225 519535 517831 515631 513968 513110
61388 513110 513488 515716 519437 523090 525340 526273 526898 528119 530526 534379 539077 543109 545335 546159 546985
61373 546985 548863 552181 557115 563281 569023 572186 572217 571014 571155 573445 576376 577854 577291 576078 576059 577642
61357 577642 579662 581156 582614 584943 587702 589402 589508 589163 589575 590368 590034 587549 583130 577844 572917
61342 572917 569112 566345 564039 562066 560958 560888 560955 560163 558927 558814 560642 563425 565517 566411 566858 567401
61326 567401 567470 566315 564509 563798 565261 568112 570772 572704 574515 576493 578119 579354 581483 585837 592095
61311 592095 598583 603977 608031 610883 612702 614145 616284 619553 623323 626928 630576 634711 638995 642679
61297 642679 645808 649298 653754 658866 664161 669813 676346 683907 692191 700800 709412 717750 725685 733132
61283 733132 739645 744465 747451 749823 753389 758901 765474 771699 777007 781900 787132 792792 797923 801064
61269 801064 801564 800490 799868 800779 802446 803322 802693 801034 799271 798170 798171 799236 800852 802554 804485 807152
61253 807152 810712 814846 819371 824648 831325 839850 850326 862565 876179 890645 905268 918954 930255
61240 930255 938086 942587 945060 946822 948208 948652 947490 944436 939459 932674 924577 916123 908101 900386
61226 900386 892193 883316 874689 867303 860905 854484 847949 842478 839079 837622 837664 839305 842526 846423 850083
61211 850083 853702 857836 861867 864414 865309 866036 867990 871275 875546 881025 888095 896635 906332 916951
61197 916951 927647 936682 942687 945914 947654 948834 949878 951433 954161 957831 961465 964502 967178 969688
61183 969688 971680 972734 972765 971803 969950 967683 965635 963888 962094 960421 959619 959837 960205 960158 960360 961518
61167 961518 963011 963858 964688 967402 972734 979282 985297 990426 995171 999667 1003950 1008843 1015479 1023936 1033028
61152 1033028 1041458 1048705 1054877 1060303 1065349 1070243 1074835 1078749 1081832 1084472 1087637 1092595 1100103 1109565
61138 1109565 1119440 1128916 1138717 1149767 1161688 1173464 1185137 1197643 1211044 1224014 1235128 1243642
61126 1243642 1249034 1251197 1251487 1252292 1254673 1257361 1258772 1258970 1258761 1257885 1255354 1251000 1245465 1239144 1232342
61111 1232342 1226051 1221151 1216905 1211536 1204544 1197377 1191496 1186667 1181450 1174577 1165563 1154724 1143050
61098 1143050 1131569 1120481 1109268 1097708 1086242 1075335 1065106 1055750 1047667 1040944 1035234 1030312
61086 1030312 1026107 1022010 1016792 1009586 1000518 990202 979239 968380 958502 949974 942546 936173 931354
61073 931354 928320 926546 925593 925898 928136 932290 937916 944904 953260 962504 972188 982935 996109 1012153
61059 1012153 1029880 1047849 1066078 1085965 1108762 1134592 1162950 1193484 1225843 1259081 1291881
61048 1291881 1323432 1353599 1382186 1408749 1433370 1456851 1479528 1500535 1518894 1534673 1548128
61037 1548128 1558289 1563648 1564047 1560630 1554080 1544283 1531812 1518189 1504058 1488461 1470673 1451670
61025 1451670 1432892 1414589 1396357 1378381 1360950 1343455 1325266 1307327 1291576 1278740 1267718
61014 1267718 1257350 1247910 1240522 1235713 1233009 1231711 1231719 1233529 1237523 1243561 1251585 1262338 1276745 1294497
61000 1294497 1314060 1334465 1356309 1380464 1406577 1433743 1462160 1493117 1527391 1564421 1603218
60989 1603218 1643699 1687071 1735037 1788430 1846484 1907810 1972179 2040833 2114961 2194636 2279565
60978 2279565 2369910 2465880 2567516 2675741 2792596 2919183 3053946 3194205 3339014 3489328
60968 3489328 3645898 3808719 3978834 4159271 4353476 4563448 4789749 5032830 5293999
60959 5293999 5575657 5881174 6215155 6584497 6999417 7472659 8017132 8644702 9367138
60950 9367138 10196518 11143923 12219875 13438303 14819102 16384644 18153318 20132175
60942 20132175 22299660 24572936 26783719 28705463 30141273 31018568 31417187 31513979 31497792
60933 31497792 31514583 31646703 31892988 32144369 32195706 31823657 30894518 29424964 27555824
60924 27555824 25472958 23339388 21269468 19331591 17557505 15952531 14508212 13212916
60916 13212916 12055382 11024159 10108418 9299375 8588689 7965342 7415590 6926268 6487386
60907 6487386 6091934 5734478 5410105 5113818 4840680 4587040 4351716 4135513 3939294
60898 3939294 3762263 3601422 3452389 3311404 3177234 3050837 2932776 2821602 2715371
60889 2715371 2614049 2519215 2431551 2349672 2271688 2197178 2127235 2063003 2004394 1949961 1897705
60878 1897705 1846075 1794488 1743267 1693459 1646439 1602859 1561659 1520731 1479155 1438280 1400061
60867 1400061 1364773 1331137 1298370 1267093 1238087 1211051 1185163 1160415 1137730 1117712 1099686
60856 1099686 1082304 1065016 1048619 1034187 1021788 1010679 1000525 991721 984459 978167 972201 966591
60844 966591 961740 957822 954907 953296 953234 954506 956615 959119 961555 963403 964494 965178 965716 965764 964682 962044
60828 962044 957627 951424 944042 936540 929305 921585 912692 903159 893911 884740 874663 863689 853151
60815 853151 844104 836294 829055 822310 816073 809743 802838 796279 791903 790389 790156 788815 785497 781331
60801 781331 777777 775020 772204 768710 764754 760955 757812 755443 753425 751002 747981 745292 743983 743676
60787 743676 742622 739469 734460 728941 724478 722518 723819 727514 731369 733577 733929 732941 730625 726835 722148
60772 722148 717565 713595 710308 707855 706281 705155 704178 703867 704829 706525 707545 707246 706400 706052 706253 706150
60756 706150 705024 702994 700723 698628 696625 694758 693538 692998 691877 688915 684915 682015 680566 678355
60742 678355 673782 668130 663282 658756 653029 646754 642184 639641 636883 632248 626446 620728 615189 609675
60728 609675 604759 600764 596976 592744 588491 584976 582499 581369 581960 583550 584281 583268 581787 581389 581877
60713 581877 582362 583314 585987 590260 594667 598553 602758 607964 613532 618430 622398 625739 628608 631058 633407
60698 633407 636141 639591 643789 648312 652140 654056 653610 651748 650296 650551 652151 653396 652991 651430 650208
60683 650208 649695 648591 645888 642407 639430 636377 631213 623236 614311 606860 601453 596806 591427 584675
60669 584675 576875 569191 562987 558552 554654 550147 545753 543297 543129 543372 542142 539582 537021 534917 532624
60654 532624 529787 526939 524777 523647 523677 524586 525447 525631 526008 528087 531740 534989 536638 537867 540370 543949
60638 543949 547084 549101 550587 552251 554612 558216 562815 566711 568448 568881 570044 572187 573823 574858
60624 574858 577424 582686 588786 593419 596949 601189 606176 610183 612515 614410 617024 620076 622863 625278
60610 625278 627301 628530 628876 628908 628816 627648 624351 619205 613516 608126 602949 597904 593546 590535 589052
60595 589052 589006 590300 592416 594172 594615 594109 593969 594925 596543 598140 599526 600578 600867 600225 599086 597704
60579 597704 595639 592675 589607 587257 585229 582683 579969 578301 577932 577838 577191 576005 574315 572037 569900
60564 569900 569128 569602 569560 567905 565768 564923 565550 566525 567186 567719 568251 568632 569034 570047 572157 575414 579296
60547 579296 582635 584186 583737 582222 580465 578519 576666 576101 577753 581140 585290 590194 596251 602742 608042
60532 608042 611328 613099 614064 614380 614009 613045 611564 609694 607913 606887 607084 608855 612463 617472 622517
60517 622517 626520 630091 635079 642852 653476 666194 679948 693689 707024 720585 735178 750612
60505 750612 765800 779634 791192 799588 804544 806866 807519 806518 803652 799987 797425 796709 796824 796530
60491 796530 795608 794645 794533 796309 800620 807240 815899 827428 843018 862273 883155 904106 925148
60478 925148 946681 968394 989723 1010188 1028632 1043178 1052718 1057737 1059117 1057060 1051820 1044685 1037345
60465 1037345 1030833 1025610 1021901 1019172 1016036 1011652 1006854 1003209 1001413 1001304 1002836 1006037 1010286 1014672
60451 1014672 1019215 1025102 1033588 1044990 1058748 1074299 1092124 1114073 1142129 1176553 1215737 1258207
60439 1258207 1304112 1354244 1408289 1464838 1522571 1580486 1637246 1691078 1740111 1782188 1814781
60428 1814781 1835940 1845091 1842178 1826413 1796995 1754904 1702921 1643911 1580172 1514380 1449561 1387333
60416 1387333 1327222 1268567 1212340 1160210 1112525 1068315 1026965 988808 954136 922711 894448
60405 894448 869612 847858 827932 809048 791979 777893 766394 755733 744903 734551 725575 717880
60393 717880 711017 705035 699795 694230 687464 680268 674215 669615 665495 661471 658249 656112 654355 652677
60379 652677 651776 651839 651724 650534 648878 647489 645680 642503 638659 635801 634392 633628 633051 632730 632027 629831
60363 629831 626335 623333 622327 623194 624782 625773 625025 622446 619910 619886 622497 625072 625406 624359 624393 626553
60347 626553 630058 634068 638482 643292 648316 653527 658726 663002 665465 666529 667647 669641 672011 673979
60333 673979 675503 677024 678878 681206 683934 686599 688729 690636 693348 697382 702071 706547 710910 715831
60319 715831 721171 725789 728912 731229 734229 738577 743428 747443 750406 753583 758314 764404 770227 774541
60305 774541 777739 781015 784773 788472 791836 795407 799709 804673 810290 817264 826284 836884 847633 857457
60291 857457 866403 875252 884790 895293 906029 915247 921269 923823 923866 922038 917944 911224 902702 893945
60277 893945 885915 878475 870955 862902 854484 846501 839800 834481 829936 825795 822386 819852 817332 813671
60263 813671 808770 803787 800205 799064 800691 804513 809227 813889 818920 825560 834359 844698 855818 867777
60249 867777 881340 897331 916150 937428 959989 982411 1003625 1022680 1038181 1048532 1052719 1050409
60237 1050409 1041499 1026331 1006365 983760 959995 935540 911125 888546 869591 854631 842638
60226 842638 832233 822448 813082 804918 799182 796202 794793 793366 791364 789191 787171 785182 783112 780974
60212 780974 778547 775380 771256 766429 761474 757134 753962 751707 749258 745827 742019 739222 737979 737541
60198 737541 736995 736139 735128 733966 732748 731863 731457 731097 730396 729651 729315 729141 728547 727802 728130 730353 733959
60181 733959 737818 741349 744504 746928 747853 746981 745135 743911 744797 748367 753782 759125 762816 764981 767018
60166 767018 769792 772841 775620 778586 782333 786276 789258 791256 793483 796776 800781 804905 809190 813868
60152 813868 818796 823934 829835 837141 845886 855729 866518 878163 890109 901342 911030 919154 926675
60139 926675 934883 944154 953419 961385 968104 974525 980607 985193 988202 991515 996546 1001944 1005167 1005721
60125 1005721 1005280 1004784 1003096 998987 993077 987102 982049 977737 973608 969229 964348 958948 953076 946418
60111 946418 938465 929461 920726 913571 908043 903150 898200 893558 890077 888035 886718 885132 883131 881682
60097 881682 881763 883166 884749 885699 886024 885942 885543 885212 885581 886621 887460 887673 888196 890284 893932 898094 902105
60080 902105 906005 909640 912612 915478 919866 926530 933833 939186 941977 944307 948704 955726 963957 971580
60066 971580 977343 980584 981322 980549 979802 980149 981861 984976 989548 995042 1000132 1003691 1005744 1007107 1008494
60051 1008494 1010414 1013478 1017956 1023174 1028045 1032155 1035550 1037539 1036734 1032794 1027433 1023122 1021127 1021032 1021490
60036 1021490 1020830 1017594 1011531 1004141 997568 992792 989219 985915 982669 979812 977630 976239 975598 975254 974353
60021 974353 972334 969569 966915 964564 961626 957132 951333 945679 941396 938210 934682 929678 923306 916495
60007 916495 909938 903548 896714 888984 880636 872612 865668 859500 852960 845400 837560 830800 825515 820727
59993 820727 815413 809901 805559 803178 802067 800913 799205 797489 796558 796967 799334 804239 811335 819041 825681
59978 825681 830752 834718 838090 841388 845526 851149 857470 862680 865773 867309 868166 868315 867206 864645 860805
59963 860805 855911 850391 844781 839042 832506 824961 817217 810024 803035 795576 787906 780775 774090 767026
59949 767026 759387 751862 744836 737840 730529 723522 717830 713863 711317 709711 708702 708028 707403 706544 705385
59934 705385 704301 703867 704211 704941 705951 707833 710940 714402 716841 717997 718998 721037 724313 728157 731550
59919 731550 733615 734327 734704 735630 736606 736491 735327 734249 733459 731697 728297 724559 722191 721416 721643 722968
59903 722968 725496 727837 728185 727115 727667 731817 737890 742324 743275 741588 738821 735607 732112 728958 726906
59888 726906 726065 726098 726952 728581 729959 729453 726794 724005 723422 725084 726887 727160 726133 724896 724104 724154 725569
59871 725569 728326 731375 733685 735538 738205 742514 748178 754309 760236 766070 772642 780441 788373 794429
59857 794429 798114 801411 806410 812686 818087 821532 823698 825282 826263 827008 828584 831293 834153 836530 839250
59842 839250 843224 847821 851624 854190 856124 857870 859459 861217 863645 866597 869505 872569 876843 882655
59828 882655 888626 892988 895685 898596 903532 910370 917463 923690 929573 936156 943305 949823 955192 960281
59814 960281 965964 971727 976271 979005 980070 979206 975717 969808 963128 957423 953154 949917 947776 947420 949046
59799 949046 951720 954229 956351 959090 963736 970811 979852 989945 1000226 1009877 1017990 1023928 1027832 1030397
59785 1030397 1031914 1031946 1030367 1028348 1027454 1027516 1026114 1020709 1010980 998592 985144 971284 957676 945572
59771 945572 935669 927096 918442 909530 901569 895715 892170 890427 889472 887646 883441 877119 870884 866631
59757 866631 863768 860000 854187 847662 842551 839389 836881 833726 830096 827145 825490 824652 824000 823608 823727
59742 823727 823788 822853 821198 820647 822683 826619 830138 831412 830212 827382 824057 821399 820174 820101 820007 818969
59726 818969 817124 815228 813776 812830 812386 812536 813214 813859 813345 810580 805647 800313 796769 795710 796194 797508
59710 797508 800233 804840 810050 813788 815570 816922 819410 823210 827791 832931 838490 844031 849449 855563
59696 855563 863316 872624 882574 892433 901940 910988 919857 929565 940948 953265 964598 973997 982427
59683 982427 991182 1000129 1008247 1015259 1021722 1027761 1032783 1036588 1039872 1043111 1045559 1045973 1044117 1041042
59669 1041042 1037955 1035296 1032913 1030628 1028237 1025176 1020749 1015034 1009384 1005594 1004218 1003831 1002269 998678
59655 998678 994219 990683 988648 987087 984612 980800 976411 972700 970617 970278 970819 970925 969985 968734 968309
59640 968309 968580 968108 966253 964808 966573 972210 979335 984959 988063 989375 989482 988306 986205 984485 984319
59625 984319 985648 987419 988558 988485 987118 984819 982242 979844 977497 974602 970590 965340 959338 953468 948435
59610 948435 944169 939876 934776 928802 922606 917006 912358 908325 904246 899867 895696 892477 890470 889458
59596 889458 889242 889601 889919 889613 889190 890231 893758 899059 904613 909709 914447 918542 921085 921634 920693 918780
59580 918780 915690 911132 905613 900085 895020 890342 886048 882235 878592 874593 870466 867261 865379 863526
59566 863526 859919 854475 848956 844668 840801 835644 828939 822143 816472 811545 806225 800079 793508 786915
59552 786915 780449 774437 769497 766085 764223 763707 764358 766009 768478 771593 774986 777859 779230 778733 777134
59537 777134 775909 776165 777790 779556 780144 779286 778056 777989 779832 782981 785981 787568 787557 786971 787149 788370
59521 788370 789352 788380 785063 780700 776767 773375 769642 765313 761284 758208 755323 751465 747029 743842 742761
59506 742761 742412 741176 739725 740300 743653 748011 751357 753490 755160 756350 756621 756529 757361 759537 762243 764728
59490 764728 767066 769556 772191 775014 778307 782111 786160 790577 796205 804011 814525 827997 844574
59477 844574 864079 885882 908782 930354 946679 954241 952949 946499 938992 931819 924409 916866 910368
59464 910368 905388 901095 896814 893022 890578 889775 890401 891955 893524 894209 893996 893611 893287 892388 890533 888137
59448 888137 885218 880573 873057 863332 853517 845249 838697 833149 827773 821984 815837 810078 805300 801214
59434 801214 797390 794447 793465 794199 794902 794286 792760 791327 790244 789497 789765 791765 795062 798597 802302 807148
59418 807148 813502 820397 826815 832914 839458 846576 853648 860058 865475 869558 871861 872154 870686 868310
59404 868310 866412 866251 867894 870108 871780 873254 875659 879187 882915 886386 890383 895580 901280 906345
59390 906345 911016 916926 925376 936300 948684 961089 971647 978626 981632 981818 980491 978005 974300
59377 974300 969738 964762 959299 953347 947623 942701 937867 932109 926186 922388 921828 923206 924916 927370
59363 927370 932253 940254 950703 963023 977299 993359 1010411 1028031 1046894 1068182 1092714 1120939
59351 1120939 1153097 1188505 1224351 1255558 1276577 1284307 1279969 1268251 1254341 1241538 1231244 1224402
59339 1224402 1222302 1225992 1234995 1246235 1254233 1253350 1241036 1219115 1191789 1162796 1134571 1108799
59327 1108799 1086308 1066779 1049773 1035850 1025499 1017412 1009560 1002094 997323 996214 996652 996198 995082
59314 995082 995174 997215 1000670 1005379 1011546 1018411 1024586 1029803 1035072 1041067 1047507 1054222 1061630 1069818 1078083
59299 1078083 1085756 1092851 1099764 1107054 1115561 1125786 1136868 1146994 1155248 1162506 1170259 1179159 1188950
59286 1188950 1199167 1209536 1220202 1231854 1245084 1259480 1273949 1288092 1302380 1316544 1328676
59275 1328676 1336750 1340659 1342089 1342698 1342862 1341818 1338437 1332088 1323317 1313581 1303948 1294187 1283429 1271417
59261 1271417 1258776 1246405 1234956 1224661 1215286 1206537 1198871 1193442 1190676 1189372 1188022 1186843 1187617
59248 1187617 1191371 1197014 1202623 1207506 1212475 1218389 1224877 1230383 1232941 1230759 1222553 1208130 1189007
59235 1189007 1168075 1147880 1129070 1110851 1092881 1075993 1060983 1047659 1035677 1025511 1017598
59224 1017598 1011075 1004579 998172 993291 990608 989100 987717 987007 988228 991510 995763 1000183 1005065 1011229
59210 1011229 1019277 1029436 1041510 1054686 1067696 1079520 1090023 1099953 1110289 1121351 1132276 1141421
59198 1141421 1147464 1150152 1150085 1148069 1144725 1140313 1134610 1127291 1118760 1110214 1102356 1094459 1085435 1075723
59184 1075723 1067234 1061383 1058005 1056332 1056036 1056802 1057855 1058822 1060506 1063868 1068609 1073605 1078431 1083483 1088778
59169 1088778 1093730 1098190 1102617 1106943 1110206 1111735 1111832 1110841 1108447 1104479 1099605 1094457 1088727 1082040 1075165
59154 1075165 1069385 1064909 1060858 1056668 1052643 1049141 1046114 1043524 1041434 1039510 1037128 1034185 1031289 1028961
59140 1028961 1027229 1026110 1025837 1026257 1026513 1025819 1024345 1023036 1022640 1022995 1023185 1022450 1021155 1020672 1021948 1024342
59124 1024342 1026376 1027562 1028907 1031583 1035656 1040275 1044689 1048928 1053777 1060059 1067574 1074850 1080428 1084255
59110 1084255 1087368 1090543 1094151 1099059 1106406 1116079 1126457 1136109 1144942 1153209 1160257 1164950 1166822 1166428
59096 1166428 1165184 1165042 1167221 1170428 1171178 1166881 1158172 1147650 1137077 1126700 1116461 1106449 1096369
59083 1096369 1085759 1074796 1064033 1053356 1042075 1030086 1018225 1007432 998168 990580 984536 979440
59071 979440 974607 969879 965569 962036 959742 959194 960098 961131 961613 962941 967035 973553 980228 986155 993003
59056 993003 1002224 1012565 1021623 1028876 1035842 1043768 1052505 1061400 1070009 1077783 1084143 1089347 1094588 1100722
59042 1100722 1107271 1113115 1117871 1122143 1126440 1130302 1132752 1133462 1133104 1132404 1131105 1128249 1123487 1117720 1112316
59027 1112316 1108091 1105317 1104248 1104881 1106137 1105972 1102859 1096974 1089603 1081623 1073043 1063905 1054840 1046392
59013 1046392 1038371 1030440 1022968 1016548 1010856 1004771 997717 990173 982677 975124 967498 960647 955612 952420
58999 952420 950094 947760 945211 942430 938987 934261 928312 922386 918121 915976 914780 913325 911953 911778
58985 911778 912750 913804 914884 917240 921220 925256 927890 929424 930544 930774 929874 929583 931960 936557 941175
58970 941175 945073 949440 954765 959921 964479 970040 978255 988767 1000044 1011273 1022652 1034668 1047868
58957 1047868 1062667 1078672 1094633 1109456 1122744 1134129 1142937 1148921 1152581 1154409 1154671 1154276 1154734
58944 1154734 1156428 1157797 1157184 1155008 1153237 1153177 1154613 1156795 1159397 1162465 1166027 1169884 1173668 1177186 1180727
58929 1180727 1184623 1188492 1191427 1193103 1194112 1195111 1196289 1197840 1200060 1202569 1204370 1205389 1207273 1211875
58915 1211875 1219381 1228550 1238350 1248695 1259990 1272641 1286869 1302497 1318956 1335670 1352163 1367841
58903 1367841 1382288 1395888 1409303 1422028 1432423 1439713 1445081 1450089 1454789 1458113 1459386 1458569 1455688
58890 1455688 1450945 1444953 1438082 1430015 1420654 1410854 1401507 1392483 1383213 1373559 1363306 1351765 1339072
58877 1339072 1327028 1317101 1308242 1298370 1287722 1278879 1273328 1269706 1265904 1261434 1257074 1253353 1250192
58864 1250192 1247230 1243911 1239885 1235733 1232692 1231346 1231185 1231600 1232486 1233629 1234342 1234144 1233166 1231652 1229853
58849 1229853 1228753 1229961 1234265 1240848 1248488 1256966 1266744 1277887 1290026 1303051 1317080 1331823 1346491
58836 1346491 1360417 1373479 1385944 1398107 1410079 1421822 1433335 1444716 1455973 1467027 1478107
58825 1478107 1489845 1502645 1516175 1529800 1542973 1554716 1563419 1568279 1570546 1572122 1572980 1571335 1566389
58812 1566389 1559387 1551539 1542466 1531532 1519286 1506433 1492615 1477679 1463219 1451057 1440516 1428866
58800 1428866 1414595 1398829 1383426 1369077 1355737 1343510 1332222 1320934 1308847 1296155 1283331
58789 1283331 1270244 1256819 1243988 1232755 1222446 1211155 1198189 1185008 1173273 1162942 1153035
58778 1153035 1143365 1134331 1125615 1116483 1107322 1099419 1092934 1086413 1078945 1071563 1065579 1060609 1055520 1050563
58764 1050563 1047055 1045217 1043822 1042061 1040370 1039104 1037679 1035783 1034430 1034954 1037380 1040465 1043019 1044757
58750 1044757 1046148 1047860 1050158 1052529 1054100 1054566 1054354 1053733 1052178 1048819 1043130 1035099 1025387 1015594 1007588
58735 1007588 1001821 996694 990265 982391 974626 968314 963499 959593 956314 953702 951812 950779 950838 951798 952726
58720 952726 952727 952191 952756 955579 959849 963572 965727 966945 967891 967903 965924 962098 957415 952144 945910 939274
58704 939274 933865 930369 927501 923814 919711 916588 914533 912105 908456 904660 902434 902163 902681 902880 903012
58689 903012 904242 907109 910811 914197 917125 920310 923920 927106 929348 931729 936118 943159 951600 959648
58675 959648 966444 972105 976874 980887 984699 989414 995846 1003578 1011119 1017043 1020936 1023398 1025501 1028221
58661 1028221 1031980 1036431 1040813 1044658 1048110 1051639 1055810 1061249 1068235 1076176 1083981 1091086 1097483 1102679
58647 1102679 1105701 1106700 1107399 1108887 1109726 1107440 1101321 1092520 1081923 1069496 1055554 1040970 1025839
58634 1025839 1009359 991487 973562 956780 941074 925886 911094 896865 883643 872515 864393
58623 864393 858438 852590 846157 840505 836437 832434 826707 819851 814019 810241 807878 806229 805357 805570 807055
58608 807055 809851 813492 817103 820512 824733 830584 837416 844028 850103 855789 860502 863321 864088 863116 860285
58593 860285 855526 849604 843214 835883 827125 818262 811472 807230 804192 801512 799506 797868 795062 790242
58579 790242 784533 779710 776588 775132 774943 775006 773981 771550 768868 767301 767485 769675 773679 777898 779821
58564 779821 778567 776044 774728 775180 776551 778384 780613 782722 784492 787123 792070 798977 806122 812664
58550 812664 818992 824912 829290 831995 834722 839050 844784 850932 857126 863081 867714 870273 871796 874067
58536 874067 877258 879827 880775 880809 881073 881831 882835 884106 885845 888332 892333 898774 907371 916307 924108
58521 924108 931291 939399 948812 958411 967079 974693 981797 989219 998017 1008994 1022028 1036265 1050822
58508 1050822 1064972 1078218 1091090 1105535 1123390 1144573 1167735 1192421 1219278 1248188 1277775
58497 1277775 1307078 1336088 1364003 1388561 1408273 1424114 1437795 1449346 1457710 1462845 1465712 1466644
58485 1466644 1465162 1461220 1455316 1447455 1437247 1425166 1412516 1399723 1385531 1368421 1348391 1326957
58473 1326957 1305619 1284599 1263105 1240875 1219220 1199916 1183054 1166928 1150577 1135426 1123398
58462 1123398 1114172 1105559 1096235 1086749 1077888 1069465 1061170 1053594 1047623 1043187 1039148 1034419 1029075 1024335
58448 1024335 1021195 1019130 1016720 1013768 1011945 1012647 1014982 1016878 1017612 1018034 1018519 1018169 1016372 1014221 1013790
58433 1013790 1016387 1021643 1027893 1033337 1037143 1039560 1041120 1042411 1044719 1049787 1057968 1067324 1075710 1083301
58419 1083301 1092085 1103315 1116566 1130921 1145752 1160486 1174818 1189145 1203833 1218185 1231002
58408 1231002 1241723 1249895 1254209 1253753 1249949 1245486 1241352 1236740 1231793 1228296 1227165 1227397 1228398 1231363
58394 1231363 1237241 1245063 1253664 1263345 1274267 1284560 1292056 1296992 1301048 1304164 1304282 1300238 1293249 1285173
58380 1285173 1276615 1267235 1256959 1246306 1236069 1227177 1220528 1216600 1215145 1215262 1215844 1216342 1217351 1220105
58366 1220105 1225125 1231669 1238703 1245876 1253127 1259944 1265890 1271569 1278152 1285663 1292357 1296167 1296493 1294242
58352 1294242 1290306 1284581 1276782 1267817 1259573 1253163 1248024 1243186 1238801 1235661 1233647 1231601 1228671 1224959
58338 1224959 1220903 1216942 1213925 1212961 1214417 1217497 1221000 1224113 1226619 1229032 1232448 1237517 1243478 1248991
58324 1248991 1253856 1259007 1264687 1269813 1273672 1277328 1282627 1290353 1300042 1311212 1324104 1339142 1355944
58311 1355944 1373027 1388738 1402673 1415989 1430153 1445817 1463024 1481479 1499837 1515806 1528403
58300 1528403 1539602 1552355 1567405 1583441 1599877 1617501 1636445 1655529 1673995 1692042 1709038
58289 1709038 1723042 1733064 1740495 1747485 1755167 1764114 1775038 1787902 1801295 1813803 1825490 1837573
58277 1837573 1851428 1868129 1887854 1909219 1930359 1951127 1973167 1997481 2023194 2049158 2075237
58266 2075237 2101215 2125902 2148368 2169110 2189210 2209206 2229205 2248968 2267530 2284125 2299872
58255 2299872 2316940 2335599 2354004 2371673 2391071 2414455 2440988 2468500 2496493 2525767 2556452
58244 2556452 2588221 2621456 2656663 2693438 2731200 2770071 2810052 2850527 2891650 2934972 2981450
58233 2981450 3030086 3079751 3130929 3184196 3238384 3292082 3346021 3402262 3461635 3523404 3586879
58222 3586879 3652198 3720109 3791850 3868446 3949458 4033434 4120177 4211191 4307382 4408059 4512871
58211 4512871 4622637 4737245 4855006 4975472 5100745 5232580 5370559 5514801 5667888
58202 5667888 5831957 6006249 6189995 6385317 6594432 6815893 7046580 7285708 7533965
58193 7533965 7790251 8052592 8321257 8598029 8883169 9175724 9476122 9786135 10107066
58184 10107066 10440199 10788227 11154512 11542079 11954820 12397655 12873438 13381583 13921706
58175 13921706 14496360 15108204 15757363 16444368 17172847 17946265 18764740 19628286 20540313
58166 20540313 21504500 22521515 23593169 24727382 25935306 27226382 28609869 30097263
58158 30097263 31697846 33414465 35248110 37203242 39284199 41491438 43828678 46311519
58150 46311519 48964164 51812438 54887031 58229465 61887463 65908559 70346613 75272686
58142 75272686 80775541 86959960 93954259 101913571 111007533 121412211 133319179 146932109
58134 146932109 162430285 179936456 199522734 221224432 245044668 270998173 299145493
58127 299145493 329352147 360613236 390370230 414658928 429423481 432241533 423232323
58120 423232323 404629171 379581512 351094479 321524398 292497013 265001658 239546887
58113 239546887 216327128 195348973 176507178 159641573 144583206 131170645 119242981
58106 119242981 108640157 99214948 90835042 83373282 76705851 70721331 65324689 60434017
58098 60434017 55982002 51920375 48214821 44833694 41745392 38923592 36346960 33993077
58090 33993077 31838013 29861596 28048280 26383460 24853376 23447291 22154682 20961129
58082 20961129 19851455 18815944 17849286 16944923 16095105 15295188 14542866 13833834 13162524
58073 13162524 12526235 11924214 11353683 10811129 10296361 9810582 9351178 8913282 8495900
58064 8495900 8101561 7730055 7377570 7042446 6726895 6431923 6154806 5892921 5646257
58055 5646257 5414580 5195323 4985834 4785220 4592863 4407591 4229309 4059253 3897790
58046 3897790 3743845 3596926 3457691 3326224 3201825 3084759 2976145 2875908 2782780 2696321
58036 2696321 2616774 2542956 2472554 2404670 2339982 2278570 2219906 2164709 2114011 2066308 2018627
58025 2018627 1970843 1926006 1885514 1846850 1807339 1767572 1729541 1693553 1658845 1625630 1594693
58014 1594693 1565803 1537833 1509841 1481322 1452231 1423331 1395612 1368942 1342251 1315493 1290423
58003 1290423 1268890 1251161 1236176 1222635 1209650 1197075 1185244 1173778 1161162 1146450 1130697
57992 1130697 1115247 1099269 1080922 1060666 1041329 1024739 1010217 996518 983242 969938 955878
57981 955878 941461 928073 915823 903066 888926 874743 862181 851367 841694 832894 824348 814725
57969 814725 803472 791660 780432 769543 758264 746708 735425 724614 714488 705471 697226 688473
57957 688473 678653 668970 660928 654653 649465 645236 642054 639127 635216 630109 624885 620763 618127 616545
57943 616545 615325 614112 613108 612686 612926 613818 615605 618349 621469 624493 627945 632403 636815 639091 638626
57928 638626 636917 635122 632203 626365 617538 607508 598054 589731 582228 575229 568857 563510 559318 555809
57914 555809 552208 547864 542298 535383 527978 521825 518052 516160 515075 514526 514508 514201 512909 511565 511736
57899 511736 513311 514699 515160 515264 515069 513684 510969 507940 505061 501786 498378 496367 496290 496553 495586 493878
57883 493878 492817 492699 492951 493248 493368 493048 493069 495412 500932 507596 512382 514611 516220 519031 522864 526292
57867 526292 528384 529471 530541 531829 531961 528994 522552 514415 506718 500077 493748 486939 479633 472699
57853 472699 467509 464856 464015 463469 462538 461573 460703 459670 459003 459794 461803 463266 463456 464053 466826 471064
57837 471064 474451 475662 474959 473043 470632 468730 468209 469236 471629 475154 478858 480908 480071 476949 473117
57822 473117 469694 467272 466326 466656 467052 466343 464241 460665 455395 449371 445089 444144 445062 445039 443291 441184
57806 441184 439524 437478 434245 430313 426719 424198 423381 424870 428637 433870 439580 444983 449513 453131
57792 453131 456553 460578 465249 470058 474696 479019 482599 484911 485766 485191 483353 481110 479863 480023 480127
57777 480127 478347 474494 469765 465111 460786 456884 453119 448476 442341 435780 430577 427152 424507 421984
57763 421984 419845 418257 417065 416661 417742 419901 421601 421913 421277 420183 418147 414534 409594 403998 397837
57748 397837 390640 382255 373546 366273 362005 360648 360367 359463 357944 356627 355433 353864 352594 352763 353535
57733 353535 352331 348381 344502 344038 346978 350462 352524 353884 356169 359748 363865 368093 372787 378203
57719 378203 383773 388675 392958 397597 403190 409038 413975 417845 421512 425489 429283 432271 434597 436828
57705 436828 439108 441094 442598 443941 445518 447131 447892 447004 444589 441468 438056 433811 427980 420649 413022
57690 413022 407003 404353 405409 408357 410569 411158 411391 412167 412271 410225 406892 404749 405022 406919 409351
57675 409351 411900 414134 415569 416720 418944 422775 427275 431317 434538 436835 438029 438503 439159 440186 440719
57660 440719 440196 439293 438883 438774 438041 436179 433498 430791 428869 427801 426395 423161 418131 412993 409073
57645 409073 406113 403521 401755 401358 401378 400117 397357 394673 393278 392496 390920 388468 386576 386395 387316 387523
57629 387523 385756 382311 378543 375784 374708 375075 375812 375799 375077 375040 377106 381541 387852 395794 405417 416735
57613 416735 430097 446449 466364 489232 514414 542909 576586 615373 655856 692569 720022
57602 720022 734017 732686 717168 690917 658109 622746 588350 557025 528711 502368 477912 456136
57590 456136 437126 420293 405816 394311 384895 375461 365573 357282 352069 348549 344389 339146 333910
57577 333910 329340 325570 323122 322243 321822 320432 318160 316238 315204 314645 314423 314785 315199 314291 311385 307420
57561 307420 304103 302458 302096 301455 299027 294806 290304 286888 284539 282656 281330 280945 281105 280958 280373 279921
57545 279921 279900 280147 280614 281361 282160 282829 283681 284883 285623 284827 282558 279786 276928 273666 270245 267759 266695
57528 266695 266000 264146 260596 255818 250439 245025 240436 237707 237259 238316 239311 239154 238185 237748 238742 240735
57512 240735 242511 243131 242405 240798 239163 238121 237419 236203 234135 231836 230071 229191 229562 231692 235234
57497 235234 238602 240401 240778 240690 240511 240227 240353 241418 242792 243257 242791 242753 244196 246801 249556 251675 252701
57480 252701 252548 251748 251126 251052 251442 252432 254419 257339 260449 262901 264166 264134 263397 263269 264800 267717 270935
57463 270935 273896 276739 279373 281415 283055 285004 287338 289351 290832 292557 295053 297740 300009 302409
57449 302409 305903 310226 313850 315649 316149 316846 318425 319883 319631 317502 315185 314303 314494 314093 312448 310600
57433 310600 309590 308994 307622 305062 301972 299203 296995 294861 292065 288458 285052 283463 284503 287389
57419 287389 290413 292263 292715 292320 291596 290516 288856 286916 285441 284691 284208 283905 284683 287183 290519 293290
57403 293290 295472 298094 301215 303632 304786 305523 306478 307026 306761 306937 309287 313978 319700 325345 330628
57388 330628 335450 339743 344003 349034 354888 360566 364939 367561 368605 368665 368758 369978 372652 376156 379937
57373 379937 384418 390232 396661 401680 404116 405264 407625 412235 418077 424048 430372 437539 444910 451310
57359 451310 456509 461136 465501 469451 473189 477179 481202 484419 486620 488668 491497 495292 499782 504734
57345 504734 509918 515100 520188 524984 528914 531667 534069 537528 542501 548194 553847 559514 565501 571891
57331 571891 578835 586409 593943 600450 606181 612795 621408 631299 641163 650785 660647 670534 679548 687235
57317 687235 693984 700517 707583 715884 725600 735983 745817 754291 761380 767813 774896 783886 795019 807372
57303 807372 819865 831981 843397 853752 863395 873742 886019 899861 913705 926446 938230 949869
57291 949869 961978 974577 987214 999601 1012273 1026201 1041521 1057155 1072059 1086360 1100864
57280 1100864 1115954 1131545 1147629 1164243 1181089 1197712 1213875 1229575 1245193 1261934 1281369
57269 1281369 1303845 1327912 1352036 1376358 1401881 1428453 1454715 1479977 1505149 1531619 1559936
57258 1559936 1589726 1620350 1651481 1683429 1716930 1752380 1789456 1827766 1867376 1908136 1949012
57247 1949012 1988852 2027397 2064607 2099362 2130136 2156986 2181768 2206073 2230005 2253306 2276522
57236 2276522 2300291 2324359 2348283 2372680 2398906 2427719 2459060 2493143 2531011 2573701 2621192
57225 2621192 2672360 2725776 2780483 2836292 2893465 2951873 3010196 3066044 3117169 3162649 3202791
57214 3202791 3237974 3268010 3292821 3313309 3331083 3347500 3363473 3380071 3398687 3420516 3446448
57203 3446448 3477573 3515065 3559078 3608178 3660322 3714168 3769313 3825807 3883963 3944111 4005837
57192 4005837 4067546 4127375 4184485 4239071 4291175 4339997 4384508 4424424 4460382 4493290 4523669
57181 4523669 4551720 4577953 4603494 4629727 4658015 4689984 4727259 4769928 4815643 4861486 4906835
57170 4906835 4953249 5001451 5049937 5097150 5143607 5190822 5239286 5288823 5340027 5393865 5450272
57159 5450272 5508383 5567815 5628526 5689738 5750327 5810205 5869978 5929146 5985802 6038482 6087394
57148 6087394 6133512 6177381 6219302 6260086 6301036 6343265 6387129 6432115 6477452 6523019 6569362
57137 6569362 6616482 6663178 6708271 6752078 6795928 6840488 6885287 6929334 6971101 7008219 7038560
57126 7038560 7062109 7080968 7097382 7112480 7126995 7142287 7160150 7182077 7208927 7240838 7277235
57115 7277235 7317085 7359010 7400971 7440463 7475816 7507123 7535227 7560106 7581016 7598002 7612430
57104 7612430 7626087 7640390 7656230 7673939 7693732 7716862 7745981 7783549 7830286 7885776 7949673
57093 7949673 8020966 8096528 8171791 8242657 8305868 8358456 8398703 8427433 8446625 8456745 8456808 8446652
57081 8446652 8427263 8399011 8361533 8315508 8262757 8204562 8141800 8076686 8011798 7946734 7877936
57070 7877936 7802624 7720673 7631676 7532424 7418691 7287727 7137669 6966281 6771901 6554517
57060 6554517 6314734 6052844 5769419 5464894 5137165 4781022 4390863 3962321 3490524
57051 3490524 2969355 2394507 1765924 1085956 356918 -418131 -1234177 -2085468 -2966336
57042 -2966336 -3869312 -4784247 -5700647 -6608735 -7497156 -8353062 -9167858 -9942453 -10686783
57033 -10686783 -11416317 -12147223 -12888137 -13635121 -14379714 -15116970 -15826923 -16447666 -16911664
57024 -16911664 -17268045 -17778704 -18836581 -20715056 -23354095 -26373812 -29283620 -31685762
57016 -31685762 -33332531 -34075231 -33822747 -32560376 -30388204 -27523113 -24251580 -20860036
57008 -20860036 -17578832 -14560294 -11886046 -9583402 -7637407 -6001012 -4609340 -3395171
57000 -3395171 -2299496 -1276919 -298841 646238 1556887 2424639 3238144 3986005 4660092
56991 4660092 5257749 5780649 6232095 6616112 6938046 7204180 7420225 7590776 7720269
56982 7720269 7814125 7879158 7923221 7954098 7978099 7999548 8021347 8045367 8072366 8102845 8138726
56971 8138726 8182792 8234226 8283923 8315006 8309269 8254789 8149624 8000449 7818465 7615660 7402957
56960 7402957 7189366 6980824 6779266 6583751 6393290 6208425 6030049 5857662 5689504
56951 5689504 5523683 5358236 5190569 5017954 4838681 4652045 4457649 4255783 4048503
56942 4048503 3839150 3630325 3423020 3217982 3016972 2822221 2635490 2458468 2293364
56933 2293364 2141989 2004335 1878861 1764249 1660296 1567185 1484605 1411739 1347440 1290153
56923 1290153 1238115 1190022 1145153 1102658 1061231 1019945 979135 939849 902410 865950 829539
56912 829539 793530 759554 729124 702231 677371 653117 629669 608688 591608 578488 568620 561744
56900 561744 558121 557731 560087 564833 571792 580012 587071 589804 585866 574842 558312 539099 519970
56887 519970 502477 486772 472563 460031 449705 441763 435976 432454 432029 435538 442802 452592 463653
56874 463653 475532 488377 502319 517406 533691 550465 565197 574154 574944 568308 556922 542811
56862 542811 526643 509126 491748 475710 461074 447588 435572 425141 415139 403996 391680
56851 391680 380027 370925 364764 360763 358094 356213 354561 352610 350328 348425 348083 350374 355662 363390
56837 363390 372558 382507 393158 404527 416479 429239 443861 461600 482703 506037 529974 553356
56825 553356 575550 595920 613527 627266 636153 639734 638497 633682 626312 616451 603867 589406 575198
56812 575198 563212 553996 547063 542115 539441 539458 542518 549183 560222 576267 597642 624206 654711
56799 654711 686374 715727 740128 758128 768626 770719 764811 753074 738090 721413 703847 686476
56787 686476 670643 657400 647744 642970 643802 649442 658633 671723 690620 716530 748892 786888 830611
56774 830611 879604 930848 979221 1019735 1048801 1064113 1064638 1050909 1024717 988731 946906 904336
56762 904336 864969 829224 795312 763400 737102 719949 711488 708159 707413 709653 716571 729112 747362
56749 747362 771014 798955 828824 857656 882794 901865 912327 911845 899487 876476 845750 810770
56737 810770 774554 739334 706545 676737 649713 625238 603709 585776 571374 559870 551438 547402
56725 547402 548430 553057 559117 566284 575869 587891 599521 606905 607744 601799 589975 573685 554447
56712 554447 533183 510133 485928 462263 440930 422433 406017 390661 375692 361026 347489
56701 347489 336348 327666 319420 309214 296870 284658 274945 268181 263065 257968 252121 245979 240643
56688 240643 236624 233295 229843 226360 223402 220871 218243 215727 214157 213645 213373 212976 213092 213996 214596 213574
56672 213574 211018 208207 206234 205471 205990 207548 209198 209694 208581 206534 204439 202560 200807 199508 199424
56657 199424 200910 203342 205580 206933 207438 207291 206318 204214 201068 197524 194571 193255 194136 196679 199453
56642 199453 201368 202579 203862 205462 207051 208583 210476 212896 215378 217320 218551 219495 221006 223828
56628 223828 227666 230990 232434 232371 232529 233999 236244 238100 239185 240146 241991 245288 249620 253768 256754
56613 256754 258557 259537 259727 259408 259809 261988 265188 267640 269025 270723 273314 275374 275475 274141 272995
56598 272995 273002 274389 277161 280660 283523 285197 286764 289219 291709 292735 292409 292053 291931 290864 288067 284031
56582 284031 279469 274562 269495 264750 260598 257099 254771 254426 256055 258602 261028 262970 264221 264442 263738
56567 263738 262820 262142 261459 260707 260776 262700 266244 269925 272549 274417 276725 279882 282803 284088 283597 282291
56551 282291 280745 278710 276440 275390 276805 280218 284203 287980 291287 293237 292798 290465 288192 287295 287295
56536 287295 287109 286461 285681 284940 284299 283953 283945 283983 283829 283485 282846 281777 280753 280701 281736 282702 282636 282260 283220
56517 283220 285947 288972 290598 290922 291818 295004 300296 305944 310536 314224 318000 322354 327093 332003 336957
56502 336957 341578 345711 350272 356796 365761 375910 385474 393559 400055 404822 407467 407752 406009 403290
56488 403290 400959 399538 397910 394379 388822 383128 379106 376596 374185 371200 368224 365902 364049 361996
56474 361996 359345 356308 353577 351862 351300 351274 350913 349669 347398 344326 341327 339871 340966 343895 346429
56459 346429 346681 344727 342229 340641 340202 340683 342368 345458 348750 350039 348406 345424 343463 343334 344264
56444 344264 345513 346834 347569 346604 343629 339715 336425 334849 335375 337379 339063 338767 336963 336102 337882
56429 337882 341316 343960 344359 342883 340903 339813 340177 341144 341159 339736 338016 337162 337054 337274 338449 341450
56413 341450 345634 349134 350895 351531 352146 353073 353909 354207 353958 353701 354068 354999 355772 356144 356813 358107 358832
56396 358832 357540 354719 352556 352445 353716 355016 355912 356705 357484 358126 358870 360277 362656 365697 368626 370764
56380 370764 372119 373381 375065 376821 377929 378254 378172 377778 376930 376076 376215 377756 380040 382269 384282 385990
56364 385990 386672 385625 383363 381548 381497 383019 384808 385824 386079 386082 385864 384995 383530 382226 381410 380249 377847
56347 377847 374676 372042 370375 369100 368210 368746 371176 374276 376450 377615 378985 381195 383377 384090 382878
56332 382878 380872 379953 381016 383007 384064 383763 383589 384910 387155 388590 388317 386786 384837 383126 382252
56317 382252 382496 383412 384408 385710 387976 390908 393183 394134 394818 396952 401127 406354 410969 413864 415355
56302 415355 417064 420401 424924 428811 431151 432885 435077 437337 438960 440619 443428 446792 448928 449657
56288 449657 450998 454396 458825 462501 465192 467603 469480 469972 469466 469400 470115 470341 469377 468666 470340 474715
56272 474715 479979 484156 486881 489339 492905 498025 504306 511341 518914 526308 532217 536156 539502 544120
56258 544120 550035 555445 559008 561047 562398 563453 564913 568074 573221 578694 582825 586154 590443 595987
56244 595987 601436 606156 611252 617893 625824 634073 642159 649974 657182 663479 669129 674913 681764 690442
56230 690442 700950 712148 722705 732699 743424 755233 766605 776244 785296 796340 810535 826860
56218 826860 843922 861296 878997 896966 915682 936362 959681 984743 1010055 1035232 1061167
56207 1061167 1088747 1118165 1149504 1183304 1220253 1260705 1304810 1352860 1405236 1462098 1523288
56196 1523288 1588508 1657648 1731214 1810536 1897217 1992075 2094726 2204404 2321018 2445247
56186 2445247 2577791 2718711 2867185 3021341 3178417 3335538 3490376 3640670 3783255
56177 3783255 3914362 4031063 4131664 4214140 4274890 4310135 4318670 4302665 4265594 4209790 4136082
56166 4136082 4045350 3939994 3823784 3700213 3571113 3437258 3300392 3163887 3030644 2900947
56156 2900947 2773709 2649789 2532522 2424222 2323434 2226937 2133707 2045425 1963440 1886961
56146 1886961 1814585 1746114 1682048 1622460 1567382 1517457 1473013 1432871 1395240 1359585 1326651
56135 1326651 1296850 1269753 1245083 1222934 1202746 1183362 1164697 1148218 1134928 1123880 1113707
56124 1113707 1104768 1098353 1094141 1089987 1084521 1078812 1074920 1073494 1073294 1072672 1071147 1069764 1070172 1073183 1078205
56109 1078205 1084132 1090623 1098243 1107667 1119215 1132943 1148500 1164936 1181251 1197128 1212697 1227814
56097 1227814 1242490 1258043 1276747 1299780 1326107 1353968 1383011 1414493 1449694 1488791 1531384
56086 1531384 1577784 1629493 1688276 1754960 1829535 1912357 2004357 2105396 2212958 2323117 2432182
56075 2432182 2536578 2632205 2716057 2788768 2854080 2915257 2973047 3027123 3077587 3124056 3164747
56064 3164747 3197965 3223807 3243220 3255929 3260400 3255502 3241019 3216412 3179742 3128181 3059878 2976040
56052 2976040 2881511 2782737 2684774 2590461 2501902 2421124 2348778 2283639 2224469 2171532 2125515
56041 2125515 2086094 2052641 2025286 2003873 1986481 1970491 1954930 1940825 1929566 1921884 1917989 1917611
56029 1917611 1919934 1924236 1930383 1938228 1947213 1957285 1969390 1984013 1999859 2015075 2029340 2043790
56017 2043790 2059455 2076809 2096208 2117679 2140750 2165488 2192938 2223327 2254744 2285187 2315320
56006 2315320 2347477 2382339 2418318 2454072 2489982 2527172 2566587 2608880 2653673 2698973 2742898
55995 2742898 2786046 2830749 2878104 2927345 2978022 3030917 3086475 3144032 3202956 3262990 3323179
55984 3323179 3382255 3440848 3501919 3568160 3639827 3715345 3792925 3871440 3951142 4033999 4122245
55973 4122245 4216510 4316420 4422596 4536136 4656108 4779771 4905818 5035456 5169746 5308191
55963 5308191 5451128 5601458 5762342 5934533 6117409 6311291 6517149 6734912 6963533
55954 6963533 7202132 7449961 7705862 7969034 8240111 8520637 8811601 9112908 9424151
55945 9424151 9745806 10080093 10430631 10800701 11192040 11606003 12045305 12513391 13012543
55936 13012543 13543962 14109280 14710218 15347055 16019513 16729384 17480588 18276496 19118885
55927 19118885 20009444 20950498 21944507 22995229 24109692 25297090 26565738 27923025
55919 27923025 29377702 30939319 32615255 34410626 36330362 38378342 40555881 42866613
55911 42866613 45324624 47954960 50786778 53851127 57186232 60839842 64865179 69320653
55903 69320653 74277599 79826307 86075111 93149895 101196927 110380930 120877463 132869879
55895 132869879 146552095 162126941 179801198 199787668 222303094 247531628 275537060
55888 275537060 306107917 338491599 371036888 400986357 424805007 439164948 442132431
55881 442132431 433811349 416070504 391665632 363377736 333531246 303851282 275480349
55874 275480349 249063000 224875978 202965836 183252667 165595642 149834421 135808415
55867 135808415 123356297 112313246 102518009 93821019 86083721 79175764 72978512 67390330
55859 67390330 62327086 57720789 53519654 49685442 46186354 42992144 40075183 37411760
55851 37411760 34979384 32754582 30715014 28842025 27119995 25535040 24075199 22729697
55843 22729697 21486776 20333918 19260988 18261186 17328141 16454132 15632213 14858228 14129508
55834 14129508 13442937 12794951 12181920 11599984 11046256 10520703 10024950 9558228 9116011
55825 9116011 8693350 8288093 7900247 7529984 7177400 6842948 6527109 6230259 5952926
55816 5952926 5694860 5453590 5225309 5007384 4798744 4598029 4403392 4214434 4032360
55807 4032360 3857813 3690485 3531282 3382487 3244771 3116097 2994769 2881607 2777814
55798 2777814 2682466 2593735 2511196 2435318 2365698 2301179 2240765 2183326 2127410 2072485 2019372
55787 2019372 1968410 1918304 1867930 1818157 1770604 1725531 1682286 1640844 1601453 1563451 1526012
55776 1526012 1489685 1455820 1424758 1395693 1368061 1341925 1317187 1293451 1270721 1249378 1229436
55765 1229436 1210308 1191276 1171949 1152653 1134581 1118805 1104692 1090021 1073322 1055414 1037983
55754 1037983 1021449 1005190 989191 974359 961369 949918 938885 926804 912885 898308 885895
55743 885895 877538 872330 867932 863224 858647 854528 850432 846158 842261 839281 837145 835505 834177 833062
55729 833062 831966 830483 828025 824333 820155 816751 814272 811241 806191 799017 789984 778299 763143 745820
55715 745820 729455 716224 705784 696546 687578 678964 671111 664217 657978 651452 643575 634039 623473
55702 623473 612709 602221 592325 583539 576503 571662 569026 568018 567568 566590 564525 561442 557676 553356
55688 553356 548131 541441 533281 524585 516383 508740 501150 493803 487463 481864 475511 467805 460330 455017
55674 455017 451708 448678 444963 440943 436936 432588 427803 423144 418921 414633 409631 403879 397952 392680
55660 392680 388630 385422 381801 377077 372282 369130 368024 368061 368787 370708 373799 376786 378668 380225 383132
55645 383132 387756 392223 393597 390080 382610 374355 368001 363365 358182 351220 343729 337587 333046 328993
55631 328993 324695 320456 316880 314187 312169 310434 308796 307538 307007 306929 306661 306247 306526 307927 309919 311969
55615 311969 314118 316091 316838 315876 314275 313247 312560 311547 310989 312281 315039 317310 318330 319340 321211
55600 321211 322964 323597 323834 324737 325621 324813 321947 318224 314779 312025 310319 309945 310382 310630 310427 310193 309777
55583 309777 308307 305532 302278 299235 296216 293120 290686 289546 289113 288087 285673 281813 276733 270936
55569 270936 265293 260476 256333 252203 247716 243215 239717 238453 239634 241404 241024 237859 234296 232756
55555 232756 232552 230931 226734 221565 217475 214931 213320 212052 210584 208374 205561 203072 201534 200574 199578
55540 199578 198511 197490 196075 193638 190260 186944 185038 185458 187957 190964 192547 191819 189314 186211 183732
55525 183732 183083 184890 188306 191433 193144 194102 195842 199480 205419 213362 222107 230180 237274 244431 252338
55510 252338 260345 267857 275658 284575 293343 299186 300620 298799 295979 293318 290215 285268 277830 268939
55496 268939 260625 254021 248465 242679 236262 229533 222619 215586 208998 203366 198352 193457 189243 186785
55482 186785 185992 185492 184280 182566 180939 179666 179010 179299 180287 181210 181837 182828 184750 187349 190055 192565
55466 192565 194637 195961 196607 197051 197436 197315 196354 194744 192675 190054 187068 184343 182146 180031 177631
55451 177631 175143 172648 169725 166343 163331 161185 159116 156240 153172 151229 150400 149354 147475 145631
55437 145631 144648 144188 143669 143292 143403 143537 142959 141729 140422 139186 137943 137292 138167 140392 142416 142896 141983
55420 141983 140678 139535 138500 137474 136316 134609 132057 128985 125848 122499 118777 115671 114799 116373
55406 116373 118560 119417 118789 117759 116921 116096 115307 115033 115389 115688 115030 113051 110275 107981 107421 108649 110351
55389 110351 111343 111991 113548 116394 119761 123071 126427 129510 130954 129616 126106 122437 120241 119577 119356
55374 119356 118625 117340 115951 114404 112071 108960 106498 106360 108627 111809 114603 116797 118433 119188 119175
55359 119175 119481 120974 122917 123630 122623 121486 122419 126049 130726 133882 134125 132149 129745 128150 127476
55344 127476 127336 127460 127761 128294 129175 130139 130285 128914 126685 125195 125193 125828 125967 125534 125153 125117 125296 125644 126252
55325 126252 127197 128706 131096 134043 136308 136684 135113 132519 129927 127990 126896 126258 125527 124953 125630 127901
55309 127901 130275 130837 129510 128038 127753 128196 128078 126872 125170 123913 123533 123618 123335 122326 120985 119667
55293 119667 118027 115724 113441 112420 113022 114435 115808 116948 117871 118468 118923 119813 121349 122956 123853 123684
55277 123684 122333 119662 115868 111876 109075 108589 110636 114136 117074 117992 117331 116740 117020 117454 117409 117529
55261 117529 118643 120369 121792 122939 124364 125612 125494 124084 123194 124239 126491 128090 128073 126774 124972
55246 124972 123619 123969 126733 130911 134362 135747 135252 133376 130160 126257 123644 123946 126329 128217 128101
55231 128101 126682 125281 124337 123888 124249 125301 125901 125164 123878 123616 124657 125887 126694 127781 129780 132068
55215 132068 133532 133830 133365 132547 131713 131391 132022 133519 135447 137350 138672 138780 137663 136300 135732 135857
55199 135857 135746 135045 134425 134556 135271 136047 136783 137640 138362 138305 137165 135390 133774 132789 132400 132392 132669 133118 133320
55180 133320 132645 130816 128285 125922 124350 123618 123421 123468 123708 124384 125849 128110 130497 131929 131661 129830
55164 129830 127347 125205 123785 122688 121373 120000 119485 120509 122715 125054 126699 127320 126832 125559 124523
55149 124523 124759 126059 127055 126932 126489 127024 128740 130898 133084 135386 137412 138139 137097 135166 133807 133816
55133 133816 134942 136378 137392 137794 137949 138114 137868 136692 135086 134294 134634 134940 134258 133352 133630 135080 136369
55116 136369 136742 136585 135942 133717 129168 123517 119250 118051 119808 123229 126737 129115 130183 131014 132888
55101 132888 135761 138096 138464 137022 135222 134365 134723 135849 137315 139091 141406 144228 146768 147688 146292
55086 146292 143601 141829 142372 144472 146124 146154 145104 144297 144534 145667 146903 147389 146909 146162 145898 145682 144173
55069 144173 140928 137274 134790 133532 132564 131800 132208 134262 137216 140209 143217 146437 149395 151234 151574
55054 151574 150718 149328 148125 147550 147389 147035 146344 145924 146356 147582 149174 150635 151112 149504 145662 141144
55038 141144 138157 137780 139508 142061 144109 144718 144034 143426 144123 145781 147111 147830 148948 151016 153176 154548
55022 154548 155638 157529 160160 162203 162402 160385 156464 151507 147005 144414 144043 145007 146391 147948 149462
55007 149462 150138 149310 147553 146432 146968 148589 149661 148894 146405 143710 142691 144145 147208 150258 152369
54992 152369 153689 154633 155227 155345 155016 154246 152890 151004 148980 147055 145117 143290 142293 142701 144204 146065
54976 146065 147974 149952 151834 153500 155252 157129 158218 157685 156283 155650 156047 156062 154846 153335 152591 152151
54960 152151 150973 149167 147716 147072 147002 147379 148170 148975 149462 150054 151364 153169 154701 155702 156409 156775 156574
54943 156574 156115 155921 155716 154620 152516 150435 149414 149510 150055 150352 150163 149994 150750 152594 154453 155361 155871
54926 155871 157021 158273 157960 155933 154304 154990 157742 161191 164636 167791 169865 170143 169125 168073 167685
54911 167685 167869 168405 169041 169329 169113 168953 169359 169864 169618 168656 167793 167479 167594 168317 170216 173187 176054 177688
54893 177688 178184 178620 179882 181761 182984 182210 179338 175913 173928 174238 176278 178911 181000 181424 179549
54878 179549 175999 172336 169660 167966 166941 166610 166801 166814 166385 166432 168013 170896 174095 177500 181715 186239
54862 186239 189208 189701 189325 190520 194017 198983 204971 212173 219912 226551 231470 235841 240689 245278 248390
54847 248390 250246 251930 253476 253868 252714 250638 247996 244405 239779 234774 229812 224580 218959 213619
54833 213619 209118 205091 201039 197466 195498 195469 196411 196995 196785 196537 197200 198577 199313 198585 197363 197213 198271
54816 198271 199539 201124 204638 210849 218227 224728 230009 234948 239894 244613 249340 254526 259645 263295
54802 263295 264575 263775 261906 260046 258728 257204 253667 247013 238177 229167 221320 215165 211118 208947
54788 208947 207081 203977 200015 196666 193934 190337 185610 181640 180057 180362 181183 181971 182512 182083 180378
54773 180378 178373 177091 176259 175258 174574 174963 175861 176171 176168 176997 178368 178508 176725 174413 172878 171629 169895
54756 169895 168652 169639 172857 176355 178431 178940 178441 177203 175570 174358 174126 174434 174531 174499 175091 176529 178109
54739 178109 179096 179489 179789 180485 181946 184321 187189 189764 191763 193662 195743 197414 198062 198106 198303 198284 196890
54722 196890 194068 191392 190220 190161 189982 189377 189051 189553 190860 192968 196076 200058 204369 208592 212611 216145
54706 216145 218679 220201 221633 224119 228012 232827 238067 243695 249793 256154 262478 268696 274696 279765
54692 279765 282800 283350 282212 280646 279152 277193 273999 269303 263454 257139 250941 244844 238309 231176
54678 231176 224342 219092 215855 214118 213361 213305 213247 212089 209470 206229 203471 201883 202187 205179 210509 216225
54662 216225 220568 223707 226752 229585 230963 230719 230618 232641 237196 243178 249094 253987 257910 261643 265368
54647 265368 267799 267484 264820 261591 258368 253820 247217 240185 234871 231329 228041 224294 220652 217433
54633 217433 214205 210998 208861 208743 210305 211922 211481 207566 200790 193847 189435 188004 188122 188572 189079
54618 189079 189302 188650 187289 185904 184197 181201 177594 175865 177046 178893 178932 177915 178263 180027 180827 179566
54602 179566 177814 177122 177101 177095 177901 180512 184297 187630 189601 190187 189540 188145 187075 187067 187647 187885 187575 187026
54584 187026 186322 185623 185623 186682 187840 187692 186043 183950 182417 181882 182494 183899 185082 185584 186567 189360 193063
54567 193063 195103 194420 192635 191584 191159 190461 189821 190337 192047 193717 194266 193666 192661 192185 192786 194072
54551 194072 194949 194744 193700 192159 190038 187679 186334 186744 187700 187097 184339 180876 178666 178951 182133 187484
54535 187484 192815 195721 195763 194733 194423 194916 195446 195928 196815 198063 199179 200069 201022 201859 201785 200271 197728
54518 197728 195118 193144 191931 191357 191493 192612 194676 196937 198274 198004 196168 193137 189385 185697 182995
54503 182995 181557 180798 180332 180881 183413 187510 191376 193719 194978 196242 197468 197459 195649 193302 192593 194595
54487 194595 198416 202261 205035 206784 207918 208576 208912 209387 210246 210966 210906 210508 211157 213497 216450 218294
54471 218294 218313 216917 214648 211870 209231 207521 206914 207015 207774 209535 211781 212759 211225 208146 205737 204979
54455 204979 204924 204460 203775 203673 204216 204763 204986 205164 205478 205634 205381 204985 204840 204739 204043 202728 201916 202739 204721
54436 204721 205889 204913 202636 200828 199854 198517 196224 194188 193915 195295 197012 198313 199365 200010 199347
54421 199347 197044 194376 193267 194446 196983 199540 201660 203788 206384 209304 211994 214099 215822 217702
54407 217702 220092 222830 225411 227392 228548 228693 227670 225784 224117 223930 225522 227891 229694 230385 230275
54392 230275 229823 229250 228619 227879 226872 225688 224919 225065 225706 225832 225137 224381 224181 224008 222979 221376 220689
54375 220689 222046 224971 227860 229437 229556 228765 227469 225797 224154 223403 224122 225857 227467 228097 227595 226223
54359 226223 224562 223549 223834 224893 225420 224959 224621 225833 228783 232450 235676 237741 238318 237572 236246 235259
54343 235259 235176 236134 237964 240169 242189 243956 245794 247520 248261 247742 247207 248272 251040 254023 255756 255888
54327 255888 254875 253345 251798 250355 248710 246704 244738 243191 241762 240094 238787 238853 240170 241427 241919
54312 241919 242493 244273 247024 249398 250491 250723 251363 253471 257142 261526 265592 268895 271595 273928 275972
54297 275972 277725 279091 279926 280426 281198 282469 283486 283334 282088 280495 278728 276313 273225 270156 267568
54282 267568 265336 263421 261999 260749 258907 256259 253218 249771 245508 241110 238595 239175 241633 243559
54268 243559 243568 241807 239233 237189 236808 237801 238424 237516 235912 235075 235210 235867 237450 240494 243901 245661 245289
54251 245289 244099 243041 241848 240545 240129 241014 242139 242458 242272 242203 241744 239810 236254 232036 228350 226263
54235 226263 226646 229578 233936 238139 241131 242367 241438 238536 234984 232473 231695 232145 232995 233597 233453 232545
54219 232545 231698 231847 232757 233162 232388 231120 230287 229868 229363 228837 228769 229262 230130 231612 234091 237093 239471
54202 239471 240912 242452 244971 247921 250234 251909 253647 255227 255451 253924 251885 250889 251390 252956 255021
54187 255021 256878 257791 257878 258222 259236 259537 257572 254059 251541 251434 252555 252849 251652 249956 249235 250426
54171 250426 253273 256102 256829 254732 250950 247007 243480 240532 238845 238930 239739 239128 236116 232159 229783
54156 229783 230139 232103 233633 233777 233303 233462 234420 235128 234692 233414 232346 232130 232652 233612 235070 237283 240154
54139 240154 242881 244332 244031 242836 242263 242890 243637 242955 240539 237572 235387 234304 233840 233639 233812 234408
54123 234408 234959 234882 234195 233470 232990 232469 231946 232546 235622 241163 247564 253041 256802 258892 259578 259156 257883
54106 257883 255761 252739 249303 246473 245008 244963 246034 247758 249252 249592 248864 248090 247671 246653 244250 241290
54090 241290 239196 238070 236899 235329 234068 233628 233777 234435 236028 238571 241228 243269 244894 246687 248698
54075 248698 250420 251344 251333 250735 250215 250197 250357 250103 249485 249136 249299 249574 249728 250171 251342 253061 254671 255461
54057 255461 255073 254108 254213 256627 260443 263221 263574 262303 260747 259213 257653 256688 256933 258160 260152 263541
54041 263541 268572 273656 276593 277003 276336 275773 275428 275414 276125 277123 277161 275877 274391 273657 273204 272236 271209
54024 271209 271508 273956 278191 283175 287933 292187 296618 302105 308458 314294 318282 320071 319960 318424 316073
54009 316073 313179 309013 302789 295819 291488 292017 295991 300083 302476 303554 304037 304048 303746 303317 302225 299752
53993 299752 296559 294526 294600 295814 297005 298645 302219 308230 315425 321862 326468 329726 333057 337514 343187
53978 343187 349833 357453 365673 373259 379265 384421 390253 397033 403792 410256 417284 425054 432323 438109
53964 438109 442778 446720 449347 450496 451602 454101 457538 460521 462712 464464 465158 463649 460066 455600
53950 455600 450526 443962 435735 427087 419215 412290 406169 400888 396103 391153 386073 381532 377461 372919
53936 372919 367759 363215 360151 357901 355657 353846 353083 352630 351111 348185 344418 340084 335290 330936 328267
53921 328267 327439 327406 327216 326567 325303 323377 321442 320545 320982 322080 323169 324072 324617 324596 324484 325343 327461
53904 327461 329656 330431 329486 327812 326749 327245 329602 333415 337962 342917 348428 354415 360252 365497 370468
53889 370468 375663 380974 386034 391107 396988 404087 412185 421164 431432 443373 456706 470613 484163
53876 484163 496271 505515 510654 511615 509742 506810 503869 501173 498934 497490 496603 495259 492809 490183
53862 490183 489325 491313 495483 500507 505862 511962 519246 527560 536256 544536 551811 558052 563779 569378
53848 569378 574423 577929 579351 579104 578022 576559 574719 572593 570626 569149 567727 565135 560191 552769
53834 552769 544071 535789 528822 522735 516495 509672 502677 495775 488313 479438 469483 460044 452368 446136
53820 446136 440178 434000 428093 422991 418733 415189 412266 409581 406470 402697 398758 395185 391845 388221
53806 388221 384145 379918 375852 371974 368041 363718 358944 354319 350807 348713 347185 345109 342259 339109
53792 339109 335837 332277 328912 327032 327347 328871 329749 329054 327417 326134 326098 327398 329259 330294 329561 327798
53776 327798 327109 328820 331901 334156 334746 334713 334998 335036 333958 332354 331824 333087 335518 338389 341428 343891
53760 343891 344396 342649 340724 341488 345665 351085 354922 356131 355647 354858 354514 354990 356940 361084 367270 374195
53744 374195 380553 386395 392885 400700 409164 417096 423952 429886 435231 440352 445411 449750 452052 451925
53730 451925 450970 451351 453407 455563 456577 456855 457284 457717 457241 455350 452264 448413 444150 439782 435576 431815
53714 431815 428847 426612 424023 419519 412739 405194 398766 393927 389880 385927 381939 377811 373401 369002
53700 369002 365122 361645 357869 353576 349509 346552 344912 344343 344638 345546 346575 347300 347653 347644 347172 346557 346939
53683 346939 349374 353325 356552 356938 354423 350997 348907 348996 350594 352622 354539 356383 358325 360410 362580
53668 362580 364632 366237 367253 368112 369586 371972 374688 376938 378645 380404 382635 385186 387950 391376
53654 391376 395937 401307 406479 410698 413901 416329 418313 420539 423812 428044 431993 434685 436719 439344
53640 439344 442475 444665 445216 445295 446434 448598 450431 450898 450175 449427 450328 454247 460975 468426 474459 478875
53624 478875 482917 487013 490075 491128 490506 488982 486615 483132 478809 474245 469717 465482 462384 461366
53610 461366 462387 464393 466402 468190 469866 471262 471982 471896 471417 471298 472024 473290 474190 474032 472821 470970
53594 470970 468915 467274 466888 468148 470449 472757 474581 475925 476604 476420 476046 476843 479310 482391 484980
53579 484980 487642 491980 498304 504792 509363 511884 514014 517181 521343 525718 529907 533901 537477 540443
53565 540443 543412 547556 553250 559391 564530 568479 572443 577751 584677 592372 599608 605686 610870 615904
53551 615904 621018 625694 629614 633389 637851 642915 647800 652218 656573 660907 664474 666711 668028 669134
53537 669134 670013 670104 669306 668274 667800 668168 669041 669755 669856 669516 669260 669068 668060 665410 661350 656933 653106
53520 653106 650421 649302 649739 650681 650602 649058 647119 645831 644795 642895 640088 637664 636633 636525 636133 635113
53504 635113 634529 635951 640193 646732 654056 660546 665208 667763 668382 667678 666908 667603 670516 675007 679767
53489 679767 684073 688085 692164 696314 700363 704293 708329 713031 719243 727426 736889 746294 755324 765412
53475 765412 778211 793668 810202 826645 843233 860616 878649 896683 914584 932864 951882
53464 951882 971488 991647 1013039 1036607 1062473 1089633 1116965 1144406 1172854 1203026 1234821
53453 1234821 1267820 1302031 1337880 1375789 1415878 1457652 1499704 1540192 1578170 1614295 1649915
53442 1649915 1685764 1721803 1757717 1792913 1826458 1857965 1888348 1918936 1949986 1980851 2011319
53431 2011319 2041641 2071375 2099501 2125873 2151275 2175769 2198483 2219691 2241502 2265135 2288734
53420 2288734 2309447 2326922 2343077 2358797 2372668 2383091 2390036 2394124 2395203 2392700 2386699 2377956
53408 2377956 2367102 2354210 2338931 2320989 2300757 2279295 2257413 2234826 2210707 2185028 2158781
53397 2158781 2132928 2107644 2082509 2056851 2029996 2001866 1973362 1945662 1919207 1893856 1869655
53386 1869655 1846685 1824612 1803494 1784743 1770003 1759164 1750808 1744455 1740661 1738803 1737008 1735088
53374 1735088 1735419 1739487 1745381 1750593 1755866 1764184 1776925 1793196 1812240 1834072 1857891 1882287 1907394
53361 1907394 1934883 1965267 1997028 2028985 2061896 2097005 2134568 2174648 2217775 2263867 2311827
53350 2311827 2361383 2414079 2471246 2532143 2595369 2660984 2729633 2800538 2872234 2944840 3019774
53339 3019774 3097297 3176010 3254901 3334391 3415029 3496511 3578316 3660054 3740706 3818760 3893707
53328 3893707 3966492 4037848 4107153 4173396 4236188 4295021 4348554 4395773 4437253 4474174 4506507
53317 4506507 4533136 4553328 4566906 4573164 4570883 4559804 4541152 4516222 4484975 4446372 4399760 4345638
53305 4345638 4285406 4220570 4151930 4079455 4003192 3924293 3844807 3766358 3689277 3612958 3536729
53294 3536729 3460449 3384790 3311103 3240560 3173172 3107847 3043522 2980045 2918115 2858781 2802882
53283 2802882 2750322 2699814 2650022 2601172 2554884 2512127 2472087 2433560 2396838 2363417 2334120
53272 2334120 2308151 2283880 2260134 2236894 2215020 2195018 2175852 2155623 2133854 2112361 2093162
53261 2093162 2076346 2061098 2047958 2038261 2031422 2024751 2016651 2008650 2003448 2002146 2004316 2009565 2017505
53248 2017505 2026715 2035304 2042774 2050640 2061170 2076004 2095553 2118746 2143336 2167446 2191221 2216596
53236 2216596 2245284 2277270 2311163 2345451 2379388 2413138 2447233 2481571 2514966 2546007 2574260
53225 2574260 2600182 2624007 2645249 2663153 2676951 2685699 2688722 2686492 2680372 2671175 2658516 2641791
53213 2641791 2621057 2596549 2568211 2536462 2502811 2468612 2433434 2395752 2355392 2314377 2274789
53202 2274789 2236362 2196803 2154237 2108800 2062021 2015313 1969380 1924521 1880817 1838004 1795687
53191 1795687 1753990 1713545 1674474 1635725 1596017 1555410 1515383 1477313 1441442 1407443 1375326
53180 1375326 1345184 1316414 1287877 1258980 1230265 1202800 1177141 1153116 1130592 1110163 1092600
53169 1092600 1077527 1063248 1048440 1033530 1019532 1005742 989868 970790 950040 929846 910663
53158 910663 891545 872127 852885 833841 814474 795052 776848 760615 745729 731309 717471
53147 717471 704867 693538 682728 671571 659687 647402 635619 625044 615308 605258 594329 583111
53135 583111 572241 561406 550087 538849 529082 521411 514936 508197 500621 492995 486658 482188 478759
53122 478759 475020 470656 466684 463944 461813 458962 455004 450678 446658 443004 439756 437200 435252 433258
53108 433258 430755 427934 425046 421993 418946 416831 416414 417161 417715 417555 417554 418736 420885 422665 422907 421553
53092 421553 419450 417431 415723 414261 413411 413908 415830 417968 418772 417956 416688 416088 415955 415208 413247 410576
53076 410576 408279 407202 407463 408455 409349 409763 409877 409845 409359 408066 406175 404303 402884 402041 401870 402401 403347
53059 403347 404392 405608 407101 408290 408231 406891 405441 404929 405203 405571 405960 406785 408009 409014 409352 409102
53043 409102 408517 407653 406302 404101 401053 398161 396952 397750 398968 398900 397860 397514 398389 399251 398980 397847
53027 397847 396616 395666 395474 396727 399088 400769 400331 398266 396011 394164 392656 391973 392785 394550 395732
53012 395732 395457 394037 391922 389209 386299 384048 382888 382456 382259 382087 381773 381361 381537 382947 384860 385532
52996 385532 384337 382593 381744 381697 381725 382146 383988 387389 391297 394616 396897 398119 398558 398838 399286 399228 397669
52979 397669 394846 392399 391552 391590 390656 387944 384667 382755 382812 383654 383886 383625 384260 386655 390085 393073 394718
52962 394718 394975 394213 393064 392364 392512 392944 392709 391630 390544 390489 391888 394383 397047 398949 400010 401288
52946 401288 403915 407742 411414 413760 414609 414298 413108 411519 410420 410427 411204 411909 412257 412787 414075 416029
52930 416029 418087 419849 421277 422373 422981 422957 422319 421108 419326 417292 415816 415613 416653 418508 421210
52915 421210 425040 429406 432808 434470 435349 436889 439231 441385 442708 443382 443649 443587 443669 444597 446291 447661
52899 447661 447778 446824 445656 444861 444459 444108 443344 441866 439780 437329 434355 430473 425924 421921 419870 420313
52883 420313 422544 424969 426028 425264 423537 421829 419940 416877 412420 407579 403434 400239 397839 396236
52869 396236 395385 395059 395251 396251 398002 399898 401518 402959 404061 403973 402083 398985 396045 394267 393927 394835
52853 394835 396563 398729 401298 404104 405983 405351 402262 399022 397860 398517 399057 398482 397489 396987 397060 397364
52837 397364 397577 397290 396304 395162 394722 395085 395552 395647 395565 395565 395637 395776 395979 395905 395212 394228 393598 393307 392860 392501
52817 392501 393318 395858 399515 403599 408112 412883 416734 418273 417146 414048 410009 406225 403955 403705 404660
52802 404660 405592 406195 407032 408351 409647 410384 410508 410084 409004 407429 406151 405977 406651 406752 405059 402026
52786 402026 399563 399130 400186 400783 399393 395805 390518 384095 377403 371841 368690 368204 369547 371538 373321
52771 373321 374469 374679 373564 371000 367680 364877 363229 362129 360837 359873 360430 362519 364691 365819 366241
52756 366241 366750 367372 367753 367996 368313 368384 367941 367610 368283 369782 370961 371290 371708 373546 376815 379784 380357
52739 380357 378015 374376 371555 370063 368784 366909 365002 363809 362977 361692 359977 358613 358258 359228 361508
52724 361508 364194 365673 365480 365291 366713 368571 368141 365110 362421 362575 364730 366489 367207 368084 369655 370733
52708 370733 369899 367137 363857 361791 361855 363567 365500 366510 366453 365735 364727 363884 363876 364966 366628 368229 369785
52691 369785 371556 373281 374448 375036 375422 375811 376399 377708 379919 382111 383195 383620 385216 389050 394234
52676 394234 399012 402240 403554 403176 402198 402246 404024 406623 408934 411172 414189 417732 420367 421060 419994
52661 419994 417913 415449 413119 411184 409352 407262 405278 404174 404008 404124 404321 405049 406213 406859 406558 406120
52645 406120 406169 405902 404251 401584 399196 397670 396891 397207 399079 401588 402710 401539 399263 397660 397544 398937
52629 398937 401526 404243 405488 404776 403628 403921 405759 407731 408843 409256 409310 408744 407149 404699 402272 400980
52613 400980 401392 402871 403942 403700 402615 401590 400646 399288 397918 397931 400111 403572 406631 408391 409169 409669
52597 409669 410179 410623 411172 412499 415154 418756 422236 425045 427642 430420 432662 433256 432219 430805 429975
52582 429975 429318 427714 424746 421294 418917 418602 419952 421661 422960 424325 426458 429033 431100 432573 434467
52567 434467 437521 441346 445241 449203 453507 457631 460306 460749 459409 457219 454401 450456 445388 440339
52553 440339 436484 433582 430382 426393 422444 419392 417231 415803 415270 415204 414323 412156 410181 410089 411636 413399
52537 413399 414908 416534 417920 418462 419020 421141 424473 427016 428239 429758 432275 434112 433984 433127 432996
52522 432996 432700 430716 427818 426079 425851 425928 426077 427189 429051 430131 429829 429121 428664 427903 426547 425351
52506 425351 424833 424486 423817 422983 421841 419637 416417 413757 413152 414387 416112 417273 417308 415781 412849 409679
52490 409679 407575 406810 406764 406891 407089 407422 407907 408316 408002 406460 404355 403331 404305 406459 408387 409565 410086
52473 410086 409670 407988 405747 404511 405330 408036 411778 415637 418827 420889 421870 422046 421637 420972 420526 420330
52457 420330 419830 418992 419100 421490 425667 429758 432864 435885 439735 443855 447246 450148 453668 458051 462165
52442 462165 464734 465488 465053 464205 463384 462584 461462 459617 456832 453139 448807 444374 440473 437456 435312
52427 435312 433994 433490 433327 432445 430203 427405 425674 425675 426419 426623 426291 426527 428119 430739 433476 435746 437636
52410 437636 439659 442239 445267 448138 450392 452270 454371 456784 458897 460199 461027 462276 464554 467763
52396 467763 471393 474888 477707 479270 479167 477577 475299 472973 470158 465607 458933 451742 446384 443561
52382 443561 441827 439536 436524 433516 430902 428971 428566 430145 432307 432619 430387 427668 426994 428808 431736
52367 431736 434689 437680 440778 443288 444308 443739 442438 441546 441778 443182 445304 447576 449666 451739 454477
52352 454477 458686 464561 471358 478020 484162 490287 497182 505402 515113 525750 535644 542653 545683 545336
52338 545336 542953 539502 535662 532180 529278 526072 521480 515683 509961 505149 501062 497551 495266 494916
52324 494916 496432 499359 503459 508232 512255 513956 513243 511787 511499 513140 516477 521100 526533 531990 536934
52309 536934 541965 548439 556799 565735 573506 579742 585355 590893 595766 599249 601502 603239 604958 606917
52295 606917 609429 612637 616265 620054 624156 628652 633023 636801 640602 645768 652901 661363 670242 679230
52281 679230 688483 698293 709164 721572 735344 749743 764480 780186 797587 816730 837324 859195
52269 859195 881989 905128 928829 954590 983740 1015792 1049082 1082768 1117089 1151805 1185709
52258 1185709 1218149 1249900 1281814 1313409 1343589 1372109 1399311 1424783 1447348 1466466 1482829
52247 1482829 1497478 1511022 1523799 1536012 1547257 1556585 1563626 1569349 1575185 1581542 1587559 1592164 1594933
52234 1594933 1596039 1595777 1594209 1590994 1585548 1577703 1568237 1558533 1549744 1542506 1537246 1534156 1532814 1532489
52220 1532489 1533175 1535827 1541160 1548646 1557354 1567486 1580368 1596786 1615873 1635799 1655258 1674255
52208 1674255 1693799 1714884 1737401 1760006 1781280 1800870 1818971 1834965 1847589 1856673 1863744 1870244
52196 1870244 1875868 1879396 1880564 1880285 1879470 1878571 1877918 1877331 1875504 1870913 1863562 1854882 1845670 1835164 1822458
52181 1822458 1807698 1791287 1772977 1752715 1731593 1710954 1691118 1672077 1654813 1640511 1628566
52170 1628566 1616855 1604340 1592197 1581879 1573219 1565374 1558750 1554710 1553502 1553581 1553306 1552616 1552642 1554090
52156 1554090 1556558 1559337 1562320 1565862 1570067 1574652 1579460 1584686 1590521 1596921 1603803 1610982 1617718 1622958
52142 1622958 1626568 1629817 1633919 1638444 1641863 1643422 1643628 1643161 1642437 1642247 1643580 1646370 1649411 1651943 1654358
52127 1654358 1656860 1658608 1659122 1659542 1661278 1664097 1666745 1668865 1670820 1671963 1670753 1666817 1661442 1655545
52113 1655545 1648512 1639861 1630883 1623442 1617738 1612430 1606866 1602192 1599970 1600324 1601847 1603173 1604356 1606631
52099 1606631 1610932 1616880 1623312 1629430 1635086 1640250 1644878 1649341 1654310 1659990 1665993 1672073 1678382 1684739
52085 1684739 1690492 1695628 1701333 1708653 1716954 1724608 1731100 1737779 1746523 1758213 1772529 1788592 1805571
52072 1805571 1823092 1841353 1860764 1881558 1904017 1928873 1956913 1987968 2020711 2053667 2086385
52061 2086385 2119676 2155002 2193539 2235274 2278738 2321853 2363225 2402478 2439417 2473403 2503765
52050 2503765 2530332 2553126 2571833 2586055 2595881 2601659 2603227 2599945 2591793 2580052 2566534 2552160
52038 2552160 2536495 2518661 2498600 2477492 2457108 2438803 2423038 2409677 2398450 2388832 2379639 2369371
52026 2369371 2357406 2344710 2332929 2322813 2313949 2306028 2299779 2296220 2295375 2296303 2298397 2302233 2309105
52013 2309105 2319968 2334762 2352314 2370765 2388569 2405502 2422606 2440836 2459727 2477517 2492589
52002 2492589 2504732 2514959 2524132 2531854 2536881 2538543 2537433 2534517 2529970 2523328 2514370 2503064 2488791
51989 2488791 2470678 2449096 2425877 2402366 2377986 2351579 2323590 2295709 2268481 2240499 2210299
51978 2210299 2178068 2144990 2111791 2078729 2046487 2016068 1987918 1961890 1938151 1917449 1900172
51967 1900172 1885577 1872373 1859888 1848375 1838207 1829001 1819574 1808717 1796077 1782379 1768708 1755430
51955 1755430 1741831 1726981 1710979 1695138 1680700 1667337 1653071 1635809 1614944 1591527 1567070
51944 1567070 1542350 1517278 1491618 1465523 1439399 1413422 1387503 1361773 1336837 1313280 1290909
51933 1290909 1268847 1246589 1224805 1204791 1187180 1171492 1156944 1143357 1131043 1120125 1110341
51922 1110341 1101382 1092971 1084610 1075733 1066242 1056443 1046130 1034225 1019832 1003349 986091 969104
51910 969104 953043 938764 926898 916763 906926 897341 889816 885687 884139 883882 885436 890151 897577
51897 897577 905623 913311 921591 931032 940412 948311 954602 959247 960918 958361 952498 945870 940299 936125
51883 936125 933274 931757 931245 931394 932833 936888 944095 953756 965136 978224 992924 1008236 1022921
51870 1022921 1036775 1050719 1065405 1079726 1090913 1096609 1097119 1095114 1092732 1089555 1084044 1076226 1067731
51857 1067731 1059301 1049536 1036389 1019078 998268 975221 951177 926947 902737 878707 855706 834941
51845 834941 816993 801845 789695 780674 773802 767574 762109 759452 760986 765590 771250 777469 784850
51832 784850 793013 800239 804959 806468 804445 798930 790916 782071 773643 766098 759606 754096 749054 744143
51818 744143 740107 738165 738401 739585 740736 742038 743968 746497 749637 753913 759443 765062 769255 771839
51804 771839 773951 776307 778059 777663 774603 770027 765773 762840 760685 757879 753518 748205 743834 742295
51790 742295 744056 747865 751902 755271 758140 760487 761377 760000 757026 754090 751874 749361 745200 739199
51776 739199 732156 724825 717678 711288 706107 701728 697062 691699 686740 683854 683609 685081 686897 688146
51762 688146 688214 686483 682769 677787 672611 667717 662947 658205 653683 649576 646311 644983 646613 650615 654954
51747 654954 658360 661611 665900 670760 674749 677554 680092 682636 684337 684902 685377 686450 686960 685127 680828
51732 680828 675744 671436 667935 664172 659152 652708 645685 639552 635403 633093 631566 630181 629514 630670
51718 630670 633991 638686 643670 648404 652795 656657 659702 661875 663183 663200 661493 658866 657563 659619 665347
51703 665347 673903 684754 697663 711618 725030 737234 748803 760020 769897 777117 781079 781478 777735
51690 777735 769896 759576 748972 738951 728816 717920 706783 696603 688338 682453 679052 677940
51678 677940 678793 681380 685488 690807 697299 705561 716247 728950 742091 754100 764391 773072 780231
51665 780231 785995 791010 796265 802173 807954 812017 812992 810520 805272 798382 790900 783647 777213 771719
51651 771719 766610 761045 754717 748228 742489 737820 733706 729347 724344 718940 713793 709654 707136 706584
51637 706584 707921 710482 713086 714593 714688 714164 714274 715592 717525 718940 719112 717982 715766 712777 709579
51622 709579 706775 704355 701693 698571 695880 694821 695673 697841 700865 704676 708956 713136 717315 722504
51608 722504 729623 738802 749933 763158 778188 793694 808101 820696 831237 838826 841981 839957
51596 839957 833455 824140 813989 804910 798043 793051 788625 784028 779783 776642 774339 771704 767754 762318
51582 762318 755762 748445 740493 731992 723241 714587 706008 697208 688400 680576 674433 669276 663726 657529
51568 657529 651934 648251 646743 647090 649004 651835 654329 655534 655608 655242 654695 654002 653589 653780 653887 652789
51552 652789 650488 648355 647618 648159 648952 649056 647968 645640 642621 639865 638129 637747 638982 641987 646146
51537 646146 650149 653389 656962 662565 670586 679886 689265 698245 706273 712086 714604 714120 712000 709433
51523 709433 706952 705020 704366 705480 708186 711993 716703 722586 730202 740171 752839 767896 784485 801849
51509 801849 819728 838086 856911 876583 898032 921853 947293 972623 996564 1019029 1040617
51498 1040617 1062152 1084989 1111078 1141909 1177355 1215752 1254948 1292993 1328053 1358175 1381493
51487 1381493 1396746 1403799 1403572 1397145 1384664 1365384 1339031 1306911 1271468 1234926 1198513 1162601
51475 1162601 1127136 1092138 1058240 1026643 998231 972808 949628 928356 908990 891057 873778
51464 873778 857232 842706 831508 823792 818775 815503 812997 810038 805495 798933 790712 781566 772206
51451 772206 763079 754372 746428 740118 736200 733988 731248 726118 718902 711357 704436 697519 689883 682079
51437 682079 675470 670919 668402 667517 667829 668818 669917 670726 671039 670675 669542 667857 666076 664499 663024 661404
51421 661404 659596 657674 655458 652556 648995 645450 642447 639371 634882 628560 621727 616197 612405 609215
51407 609215 605381 600734 595979 591943 589142 587584 586669 585626 584304 583227 582682 582204 581554 581820 584697
51392 584697 590407 597004 602236 605824 609389 614339 620458 626720 632848 639463 646980 655130 663856 674056
51378 674056 686703 701149 714785 724821 730487 733399 735736 738193 739900 740186 739784 739728 739352 736415
51364 736415 729682 720786 712888 707781 704946 703085 701650 700722 700385 700802 702413 705377 708969 711953 713585
51349 713585 714048 714091 714429 715361 716668 717839 718502 718653 718642 719118 720762 723545 726307 727748 728030 728719 730865
51332 730865 733909 737057 740939 747015 755920 767492 782025 800021 820575 841471 861640 882697
51320 882697 907344 936938 971235 1009782 1052589 1099824 1151658 1208100 1268045 1328414 1384988
51309 1384988 1434310 1474544 1505005 1525854 1538177 1543187 1540739 1529327 1508087 1478246 1442003 1400551
51297 1400551 1354021 1303122 1249880 1196579 1144584 1094415 1046441 1001120 958946 920536 886554
51286 886554 857088 831162 807334 784909 764367 746435 730947 716875 703409 690665 679263
51275 679263 669501 661225 654249 648392 643119 637732 632248 627640 624626 622441 619437 615067 610734 608407
51261 608407 608627 610104 611029 610573 609273 608292 608287 608936 609534 609897 610377 611058 611460 611223 610572 609758 608491 606447
51243 606447 603923 601420 598831 595743 592377 589455 587163 585096 583332 582743 583783 585731 587552 588928
51229 588928 589909 590202 589603 588718 588378 588521 588511 588641 590464 595246 602510 610439 617397 622871 627251 631035
51213 631035 634270 636707 638418 639944 641521 642534 642430 642132 643610 647618 652534 656138 658088 659817 662199
51198 662199 664372 665116 664388 662751 660047 655884 651357 648786 648939 649364 646651 640072 632008 624993 619622
51183 619622 615556 612953 611683 610078 606175 600262 594971 592493 592437 592751 591947 590009 587730 585888 584866
51168 584866 584552 584444 583880 582216 579092 575030 571626 570497 571788 574217 576731 579628 583815 589560 596279
51153 596279 602923 608120 610637 610540 609575 609567 610549 611146 610649 609862 609836 610697 612112 614135 616835 619456 620802
51136 620802 620546 619635 619103 618908 618324 617194 616146 615497 614725 613567 613028 614176 616092 616297 613850 611015
51120 611015 610905 614068 618416 622090 625084 628045 630787 632669 633597 633974 634088 634083 634141 634214 633898 633033 632172 632057
51102 632057 632817 634054 635481 637176 639493 643079 648565 655598 662346 666673 667899 667046 665419 663565 661590
51087 661590 659713 658080 656473 654623 652526 650114 646906 642491 637206 632011 627635 624124 621173 618738
51073 618738 617249 617321 619065 621590 623444 623879 623593 623870 625114 626600 627681 628733 630710 634099 638658
51058 638658 643915 649533 655153 660186 663981 666256 667418 668409 670101 672723 675912 679306 682923 686906
51044 686906 691118 695179 698771 701785 704245 706229 707785 708833 709270 709300 709582 710847 713435 717205 721668
51029 721668 726065 729631 732180 734282 736467 738318 738903 738253 737823 739049 741669 744052 745240 746213 748701
51014 748701 752929 757041 759086 759263 759772 762595 767973 775137 783683 793616 804578 816021 828192 842238
51000 842238 859114 878892 901238 925938 952446 979229 1003954 1024517 1040238 1052747 1065681
50989 1065681 1082519 1103917 1127342 1149633 1169424 1186654 1200555 1209500 1212850 1211768 1207612 1200284
50977 1200284 1188945 1174095 1158146 1143724 1131573 1120076 1106557 1089193 1068126 1045097 1022121
50966 1022121 1000563 981349 965519 953813 945633 939150 933047 927918 925324 925635 927427 929087 930319
50953 930319 931836 934368 938566 945228 954640 965865 977489 989068 1001112 1013634 1025732 1037047
50941 1037047 1048887 1063089 1079950 1097829 1114833 1130550 1146027 1162194 1178543 1193667 1207107
50930 1207107 1220059 1233690 1247278 1259058 1268736 1278075 1288749 1300789 1313628 1327550 1343217 1360632
50918 1360632 1379568 1400311 1422881 1446046 1468488 1490816 1515252 1543330 1575081 1610595 1651030
50907 1651030 1697437 1749605 1806880 1869480 1938122 2012647 2091813 2174382 2259813 2347807 2437611
50896 2437611 2527988 2617664 2705648 2791247 2873924 2953022 3027386 3095119 3154061 3202949 3242166
50885 3242166 3272990 3296185 3311852 3320854 3325565 3328453 3330089 3329061 3323595 3312815 3296808 3276277
50873 3276277 3252212 3225426 3196264 3164994 3132123 3097863 3061496 3021866 2978334 2930690 2878501
50862 2878501 2821431 2760104 2695785 2629083 2559840 2488518 2416954 2347395 2281197 2218468 2158348
50851 2158348 2099702 2042432 1988259 1939377 1896142 1856926 1820314 1786243 1754636 1724383 1694710
50840 1694710 1666540 1641305 1619056 1598953 1581016 1566081 1554198 1544336 1535756 1528591 1522871 1517932
50828 1517932 1513247 1509200 1506619 1505980 1507304 1510441 1515153 1521154 1528207 1536002 1544035 1552002 1560475 1570882
50814 1570882 1584628 1602182 1622777 1644787 1666752 1688643 1712046 1738647 1768606 1801010 1835769
50803 1835769 1874186 1917395 1965075 2016314 2071163 2130596 2195300 2265371 2341131 2423400 2512717
50792 2512717 2609051 2712707 2824982 2947379 3080535 3224528 3379783 3546649 3724083 3909773
50782 3909773 4101990 4300343 4504050 4710299 4915267 5116130 5310806 5495969 5666792
50773 5666792 5819062 5950518 6059783 6145183 6205605 6241923 6256666 6252441 6231311 6195531 6148400
50762 6148400 6094300 6037971 5983265 5932168 5885080 5842026 5803026 5767098 5731631 5693293 5649152
50751 5649152 5596591 5532959 5456256 5365886 5261986 5144306 5012484 4867340 4711163 4546825
50741 4546825 4377203 4205372 4034588 3867842 3707648 3556060 3414331 3282691 3161041
50732 3161041 3049821 2949711 2860654 2781791 2712221 2651234 2597970 2551773 2512905 2481917 2457957
50721 2457957 2438441 2420823 2404089 2388138 2372483 2356356 2339685 2323091 2306900 2290643 2273642
50710 2273642 2255705 2237174 2218542 2200078 2181595 2162471 2142052 2120170 2097272 2074088 2051244
50699 2051244 2029212 2008435 1989272 1971815 1955971 1941763 1929329 1918450 1908540 1899701 1893666 1893065
50687 1893065 1899494 1912484 1930218 1950712 1972600 1996011 2023205 2057461 2100442 2150930 2206514
50676 2206514 2265980 2329714 2398640 2473590 2555047 2642480 2734330 2829456 2928075 3030352 3134652
50665 3134652 3238475 3340800 3442242 3543036 3642145 3738213 3829943 3915325 3991851 4057840
50655 4057840 4112293 4153223 4177735 4184594 4175476 4152969 4118688 4074397 4023651 3970715 3918532 3869075
50643 3869075 3824967 3788866 3761053 3739035 3719944 3702458 3686211 3670426 3653753 3634694 3611333
50632 3611333 3580910 3540520 3488638 3425923 3354458 3276289 3192934 3106323 3019770 2937249 2861357
50621 2861357 2792288 2728999 2671194 2619986 2576937 2542787 2517043 2498677 2487289 2483604 2488674 2502626
50609 2502626 2524383 2552365 2584961 2620384 2656833 2693119 2728810 2763674 2797428 2830081 2861961
50598 2861961 2893345 2924685 2957221 2992478 3030772 3070964 3111997 3153898 3196931 3240862 3285858
50587 3285858 3333185 3384013 3438112 3494750 3554419 3618512 3687550 3760687 3836788 3914965 3994091
50576 3994091 4072739 4149874 4224975 4297434 4366463 4431485 4491976 4546930 4595375 4637617 4675254
50565 4675254 4709373 4738767 4759766 4767444 4757400 4727622 4679629 4618057 4549086 4478909 4412701
50554 4412701 4353762 4303193 4260664 4225630 4197769 4176689 4161752 4151933 4145206 4138186 4127115 4109409
50542 4109409 4083953 4049987 4006214 3950969 3882986 3802346 3711183 3613152 3511512 3407846 3303158
50531 3303158 3199623 3100119 3006070 2916834 2831407 2749899 2673247 2602483 2538546 2481902 2431781
50520 2431781 2386405 2344372 2305486 2270244 2239229 2213000 2191747 2174850 2161635 2152639 2149082 2150863
50508 2150863 2156288 2164268 2175456 2190391 2207852 2226439 2246971 2271715 2301423 2334449 2368994 2405308
50496 2405308 2445347 2490798 2541589 2596042 2652401 2710244 2770171 2832164 2894950 2957212 3018630
50485 3018630 3079309 3139192 3198894 3260291 3325163 3393843 3466357 3544350 3630511 3726291 3831437
50474 3831437 3945603 4069068 4201829 4343433 4494038 4654366 4824153 5001786 5185916
50465 5185916 5376234 5571995 5770855 5970112 6168211 6364004 6555015 6737253 6906344
50456 6906344 7058309 7189953 7299530 7386645 7450610 7489039 7498853 7478526 7428836 7351831 7250072
50445 7250072 7126896 6986629 6834280 6675296 6515382 6359915 6213553 6080592 5965145
50436 5965145 5870138 5796428 5743680 5711748 5700021 5705491 5722804 5746585 5772598 5796182 5810690
50425 5810690 5808501 5783181 5730403 5647981 5536304 5398432 5238823 5062043 4873122 4678309
50415 4678309 4483928 4294210 4110990 3935433 3769023 3612698 3466311 3329786 3204099
50406 3204099 3090128 2986867 2891898 2803910 2723956 2653672 2592700 2538679 2489644 2445490 2406613
50395 2406613 2372120 2340551 2312119 2288820 2271896 2260258 2252056 2246819 2245151 2247078 2251926 2259389
50383 2259389 2269608 2282462 2297932 2316843 2339733 2364912 2389122 2410597 2430235 2449181 2466760
50372 2466760 2481759 2494671 2507334 2521049 2536258 2553609 2574024 2597714 2624081 2652650 2683487
50361 2683487 2716947 2753680 2794648 2840407 2890586 2944827 3003758 3068019 3136751 3208502 3283663
50350 3283663 3364517 3452383 3545914 3642902 3742382 3843786 3944862 4041951 4132355 4215418 4291077
50339 4291077 4358161 4414521 4458446 4489572 4508357 4514552 4506103 4479750 4433138 4366689 4283631 4188501
50327 4188501 4085664 3978857 3871563 3767374 3669649 3580565 3500683 3429946 3369298 3320915
50317 3320915 3286540 3265839 3256598 3256090 3261820 3271225 3281401 3289316 3291998 3286465 3269875 3240127 3196445
50304 3196445 3139525 3071294 2994442 2911798 2825757 2738048 2649825 2561876 2474990 2390390 2309732
50293 2309732 2234298 2164116 2098213 2035981 1978112 1926031 1880583 1841547 1808240 1780285 1757872
50282 1757872 1741669 1732372 1729619 1730980 1732499 1730836 1724900 1715390 1703369 1689868 1676304 1664154 1653929
50269 1653929 1645105 1637096 1629699 1622727 1616249 1611396 1609843 1611848 1615622 1619219 1622262 1625205 1627941 1630124
50255 1630124 1632052 1633931 1634887 1633986 1631865 1629995 1628580 1626630 1624072 1622364 1622819 1625686 1631052 1639155 1649371
50240 1649371 1660260 1671244 1682973 1695558 1707973 1720159 1734242 1752200 1773202 1794641 1815218
50229 1815218 1835809 1857884 1882308 1909271 1938158 1967749 1997691 2029593 2065588 2105912 2148511
50218 2148511 2190240 2226887 2252447 2260731 2249168 2220729 2181809 2138615 2095228 2053675 2014786
50207 2014786 1979110 1947233 1919152 1893944 1870965 1851097 1835651 1824018 1813841 1804023 1796380 1793635
50195 1793635 1796739 1804928 1817330 1833260 1851525 1870885 1891382 1914256 1940222 1968320 1996578 2023322
50183 2023322 2047701 2069489 2088862 2106315 2122503 2137909 2152514 2165695 2176399 2183403 2185427 2181255
50171 2181255 2169977 2151154 2124818 2091710 2053680 2013268 1972309 1931300 1890723 1852412 1818517
50160 1818517 1789180 1762368 1736100 1709685 1682501 1653003 1620007 1584156 1547243 1510714 1475636
50149 1475636 1443333 1414747 1389479 1366541 1345931 1328400 1313720 1300319 1287038 1274476 1264050
50138 1264050 1256044 1248855 1240053 1228389 1215204 1203621 1195719 1190451 1184827 1176944 1167301 1157475 1148562
50125 1148562 1141019 1134918 1129767 1124608 1118719 1111855 1103902 1095085 1086686 1080468 1076793 1074110 1070932 1067519
50111 1067519 1064960 1063445 1062523 1062404 1063764 1066466 1069685 1073263 1077947 1084231 1091938 1101036 1111870 1124413
50097 1124413 1138279 1153750 1171695 1191874 1212317 1231251 1248973 1267067 1286397 1306766 1328002
50086 1328002 1350202 1372995 1395504 1417197 1438150 1458517 1478464 1498670 1520253 1544133 1571104
50075 1571104 1602449 1639575 1682747 1730889 1782931 1838540 1897018 1956283 2013784 2068184 2119608
50064 2119608 2168720 2216237 2263037 2309700 2355597 2398807 2436936 2467669 2488765 2498369 2495709 2481227
50052 2481227 2455937 2421083 2378450 2330392 2279107 2226107 2172562 2119690 2068367 2018704 1970665
50041 1970665 1925080 1883514 1846908 1814691 1785503 1758577 1734106 1712312 1692500 1673308 1653995
50030 1653995 1635396 1619375 1607104 1597854 1589659 1581321 1573510 1567667 1564053 1561431 1558715 1556216 1554729
50017 1554729 1553850 1551994 1548023 1542071 1534705 1526127 1516619 1506924 1497307 1486771 1474188 1460104 1446443
50004 1446443 1434324 1423090 1411880 1401291 1392700 1386486 1381794 1377962 1375395 1374840 1376382 1379439 1383382
49991 1383382 1387834 1392629 1397894 1404126 1411829 1420892 1430545 1440149 1449944 1460737 1472762 1485086 1496387
49978 1496387 1506242 1515397 1524688 1533944 1542111 1548409 1553265 1558101 1564134 1571310 1578411 1584377 1589453 1594844
49964 1594844 1601336 1608655 1616281 1624331 1633221 1642901 1653126 1664478 1678339 1695583 1715735 1737709
49952 1737709 1760883 1785046 1809744 1834229 1857863 1879926 1899161 1914335 1925571 1934605 1943313 1952304
49940 1952304 1961144 1969287 1976054 1979907 1978661 1970815 1956428 1936522 1911949 1883054 1850207 1814317
49928 1814317 1776765 1738885 1701452 1664573 1628032 1591771 1556069 1521384 1488105 1456326 1425759
49917 1425759 1395988 1366921 1338847 1311933 1285959 1260813 1236976 1215049 1194962 1176125 1158238
49906 1158238 1141408 1125588 1110595 1096794 1084949 1075053 1065949 1056612 1047299 1038997 1032277 1027226 1023967
49893 1023967 1022458 1022110 1022440 1023987 1027829 1034239 1042427 1051617 1061577 1072045 1082515 1092983 1104191
49880 1104191 1116574 1129288 1140813 1150315 1158111 1165058 1171799 1178232 1183213 1184864 1181755 1173991 1162934
49867 1162934 1149832 1134946 1118049 1099483 1080526 1062838 1047610 1035088 1024702 1015729 1008037 1002213
49855 1002213 998762 997258 996609 996303 996893 998931 1001891 1004781 1007532 1010826 1014558 1017637 1019797 1022560 1027472
49840 1027472 1034122 1041040 1048066 1056476 1066810 1077971 1088990 1100544 1113902 1129004 1144293 1157981
49828 1157981 1168759 1175804 1179111 1179917 1179924 1179663 1177911 1173003 1164456 1153140 1140215 1126476 1112660 1099696
49814 1099696 1088042 1076953 1065004 1051545 1037318 1023601 1011219 1000577 992014 985516 980408 975979
49802 975979 972254 969705 968531 968834 971189 976183 983392 991654 1000396 1009880 1020044 1030122 1039835 1050064
49788 1050064 1061684 1074358 1087151 1099804 1112662 1125658 1138039 1148915 1157623 1163790 1167529 1169433
49776 1169433 1169999 1169225 1167026 1163559 1158643 1151338 1140945 1128324 1115593 1104450 1095218 1087293 1079876
49763 1079876 1072392 1065051 1059185 1056342 1056626 1058437 1060225 1062157 1065628 1071482 1079249 1088032 1097506 1107721
49749 1107721 1118285 1128361 1137659 1146985 1157287 1168166 1177834 1184750 1188980 1191703 1193748 1194998 1195027
49736 1195027 1193851 1191932 1189641 1186725 1182210 1174926 1164307 1150652 1134622 1116782 1097855 1079080
49724 1079080 1061877 1047097 1034674 1023928 1014174 1005260 997665 991811 987280 983163 979281 976375 974727
49711 974727 973368 971362 969326 968775 970372 973826 979178 986922 996699 1007092 1017206 1027507 1038564
49698 1038564 1049707 1059632 1067783 1074553 1080609 1086672 1093462 1100948 1107670 1111456 1110983 1106426 1098834 1089349
49684 1089349 1078933 1068289 1057821 1047823 1038667 1030658 1023977 1018998 1016296 1015854 1016495 1016826 1016736 1017413 1019823
49669 1019823 1023784 1028577 1033618 1038063 1040629 1040896 1040604 1042631 1048311 1056355 1064708 1072837 1081670 1091845
49655 1091845 1103031 1114995 1128354 1143593 1159703 1174469 1186067 1193931 1198216 1199169 1197388 1194164
49643 1194164 1190904 1188155 1185563 1182760 1179996 1177867 1176739 1176565 1176963 1177279 1176641 1174096 1168833 1160533 1149813
49628 1149813 1138284 1127732 1119041 1112199 1107341 1105222 1106293 1109825 1114618 1120349 1127651 1137026 1148394
49615 1148394 1161703 1177194 1194917 1214591 1236100 1259312 1282959 1304345 1320808 1331228 1336001
49604 1336001 1336308 1333985 1331286 1329795 1329738 1330990 1334225 1340213 1348381 1357071 1364879 1370623 1372222 1367216 1354935
49589 1354935 1337152 1316125 1292956 1268427 1244302 1222667 1204262 1188209 1173247 1158861 1145506
49578 1145506 1134198 1125727 1119982 1116134 1113420 1111303 1109028 1105869 1101974 1098149 1094511 1090344 1085615 1081520
49564 1081520 1078643 1075604 1070627 1063736 1056253 1048651 1040276 1031097 1022513 1016164 1012656 1011449 1011251 1010452
49550 1010452 1008017 1004293 1000625 998197 997519 998692 1001428 1004893 1008158 1010936 1013538 1016303 1019461 1023169
49536 1023169 1027032 1029880 1030812 1030419 1030404 1032046 1035370 1039389 1042586 1043763 1043388 1043751 1046707 1051418 1055251
49521 1055251 1056764 1056770 1056661 1057047 1058167 1060271 1063049 1065515 1067082 1068206 1069845 1072863 1077882 1084850 1092675
49506 1092675 1100185 1107549 1115790 1124916 1133744 1141859 1150420 1160464 1171342 1181460 1189726 1195819 1199829
49493 1199829 1202036 1202341 1199787 1193695 1185394 1177585 1171604 1166688 1162272 1159360 1158805 1159969 1162248 1166384
49479 1166384 1172734 1179665 1185449 1190766 1197479 1205730 1214178 1222527 1231646 1241293 1249895 1257166 1265316 1276897
49465 1276897 1292454 1310817 1330791 1351966 1374271 1397047 1418493 1436530 1450689 1462436 1472811
49454 1472811 1480715 1484885 1486731 1489223 1493281 1497407 1501051 1506216 1514991 1527351 1542230 1558856 1575553
49441 1575553 1588680 1594613 1592357 1583182 1568535 1549518 1527609 1504272 1480017 1455104 1431001 1409828
49429 1409828 1392138 1376331 1360687 1345280 1331626 1321045 1313641 1308374 1303802 1299137 1294874 1292160
49417 1292160 1291313 1291200 1290374 1288721 1287676 1288641 1291300 1293740 1294304 1293103 1291549 1290792 1291153 1292843 1296305 1301390
49401 1301390 1306822 1311207 1314495 1317970 1322836 1329097 1335826 1342174 1347944 1353268 1357917 1361146 1362319 1361450
49387 1361450 1358843 1354388 1347807 1339725 1331891 1325945 1322144 1319621 1317652 1316424 1316750 1319333 1324190 1330596
49373 1330596 1337759 1345705 1355381 1367796 1383355 1402166 1424490 1450336 1478725 1508007 1537261 1567279
49361 1567279 1599965 1636748 1677793 1723016 1773460 1830426 1891895 1949911 1992997 2012582 2007660
49350 2007660 1983804 1948856 1909852 1872297 1839805 1813438 1792225 1775061 1762021 1753789 1750431 1751156
49338 1751156 1754905 1760739 1767923 1776038 1784992 1794629 1804441 1813905 1823010 1832073 1840985 1848986 1855253 1859356
49324 1859356 1860985 1859671 1855221 1848166 1839289 1828898 1817164 1805060 1793998 1784212 1774449 1764000 1754248
49311 1754248 1747166 1742784 1739487 1736686 1735648 1737225 1740205 1742908 1745326 1748371 1751644 1753513 1753365 1752318
49297 1752318 1751277 1749522 1746088 1741666 1737923 1735033 1730981 1723790 1713889 1703782 1695585 1689367 1683901 1678518
49283 1678518 1673924 1671428 1671823 1674974 1680058 1685844 1690916 1693949 1694096 1691347 1686793 1682394 1679949 1679738 1680143
49268 1680143 1679009 1675643 1671479 1668743 1668574 1670573 1673926 1678392 1683939 1690057 1696287 1703392 1713004 1725615
49254 1725615 1739653 1753217 1766091 1779229 1792867 1806438 1820132 1834945 1850679 1865098 1875722
49243 1875722 1881460 1881796 1875628 1862380 1843789 1823168 1802839 1783211 1764233 1746590 1731153 1718169
49231 1718169 1707493 1699109 1692987 1688781 1685822 1683155 1679659 1674824 1669612 1665843 1664247 1663506 1661640 1657953
49217 1657953 1653147 1647988 1642657 1637536 1633826 1632709 1633966 1635888 1636825 1636600 1636177 1636187 1636268 1635880 1635114 1634327
49201 1634327 1633496 1632526 1631841 1632005 1632851 1633758 1634919 1637737 1643800 1653990 1668756 1688520 1713204 1741644
49187 1741644 1772058 1803110 1834194 1864589 1892385 1914310 1926977 1928900 1921550 1908185 1891540 1872801
49175 1872801 1852610 1832264 1813505 1797613 1785135 1776138 1770221 1766570 1764550 1764122 1765283 1767242 1768744
49162 1768744 1769342 1769946 1771920 1775873 1781361 1787492 1793577 1799395 1805164 1811471 1819182 1829007 1840926 1854234
49148 1854234 1868566 1884655 1903378 1923952 1944015 1962045 1979094 1997342 2017362 2037786 2057491
49137 2057491 2077193 2098555 2122348 2147756 2173008 2196506 2217824 2237943 2258259 2279175 2299895
49126 2299895 2319638 2338666 2357930 2378101 2399193 2420854 2442734 2464729 2487125 2510557 2535905
49115 2535905 2564260 2596648 2633279 2673086 2714557 2757196 2801906 2850055 2902600 2959807 3020604
49104 3020604 3081539 3136949 3181055 3210325 3224505 3226428 3221061 3213492 3206669 3201096 3196878 3195232 3197440
49091 3197440 3203293 3211677 3222218 3235220 3250237 3265989 3281812 3298239 3315974 3335048 3355220 3376534
49079 3376534 3399309 3424017 3451045 3480000 3509434 3538054 3566117 3594803 3624486 3654720 3685785
49068 3685785 3718765 3753684 3788993 3823600 3858258 3894145 3931223 3968890 4007268 4046625 4086373
49057 4086373 4125918 4166029 4208122 4252653 4299491 4349695 4405637 4469315 4541563 4623060 4715237
49046 4715237 4820218 4940761 5080218 5241188 5423077 5620583 5824091 6021832 6204346
49037 6204346 6370298 6527761 6685384 6838295 6963317 7031799 7030019 6968127 6870052 6755384
49027 6755384 6629645 6488256 6326532 6145832 5953084 5757372 5567320 5389822 5229286
49018 5229286 5087533 4964473 4858805 4768193 4689735 4621166 4561478 4509877 4464578 4423425 4385386
49007 4385386 4350611 4319202 4290896 4265836 4244332 4225481 4207084 4187667 4168009 4150170 4135487
48996 4135487 4123780 4113789 4103971 4093649 4084050 4077702 4076154 4078546 4082688 4086876 4090281 4092521 4093863
48983 4093863 4095369 4097824 4100785 4103489 4106494 4111439 4119201 4129064 4139725 4150257 4159882 4167566 4172441
48970 4172441 4174506 4174718 4174410 4174415 4174466 4173516 4170935 4167230 4163352 4159673 4156076 4152723 4150056 4148249 4147363 4148005
48954 4148005 4151049 4156562 4163588 4171199 4179261 4188069 4197746 4208223 4219387 4231069 4243269 4256379 4270625
48941 4270625 4285192 4298552 4309944 4319864 4328662 4335361 4338700 4338982 4337987 4336888 4335041 4331271 4325848 4320486
48927 4320486 4316287 4312287 4306523 4298356 4289229 4281119 4274887 4270452 4267782 4266814 4266704 4266297 4265599 4265973 4268440
48912 4268440 4272445 4276919 4282020 4289006 4298514 4309710 4321261 4332568 4343678 4354296 4363448 4370295 4375102
48899 4375102 4379205 4383951 4389826 4396626 4404278 4413236 4424230 4437953 4454986 4475699 4500050 4527610
48887 4527610 4557833 4590294 4624978 4662753 4705405 4754424 4809451 4868286 4928734 4990084 5052753
48876 5052753 5117180 5183673 5252773 5324879 5399628 5476332 5554957 5635953 5719061 5803111 5887346
48865 5887346 5972214 6058354 6145338 6232097 6318272 6404370 6490594 6576205 6660205 6742203 6822419
48854 6822419 6901246 6979011 7055749 7130849 7203205 7272044 7337494 7400026 7459501 7515108 7566200
48843 7566200 7612927 7656120 7696797 7735618 7772406 7806143 7835835 7861578 7884499 7905518 7924300
48832 7924300 7939542 7950045 7955389 7955773 7951445 7942205 7927365 7906290 7879145 7846998 7811046 7771677
48820 7771677 7728368 7680555 7628648 7574015 7517700 7459158 7396753 7329759 7259348 7187120 7113161
48809 7113161 7036448 6956897 6875862 6794426 6712293 6629006 6545477 6463637 6385114 6310735 6240666
48798 6240666 6174360 6110996 6050803 5995618 5947301 5905930 5870291 5839644 5813903 5792281 5773186
48787 5773186 5755932 5741656 5731983 5727347 5727020 5730192 5736459 5745633 5757733 5773197 5792747 5816797 5844859
48774 5844859 5875492 5906992 5938422 5969918 6001991 6034807 6068288 6102377 6136694 6170368 6202940
48763 6202940 6235195 6268344 6302499 6336644 6370077 6402989 6435577 6467410 6498039 6527715 6557266
48752 6557266 6587640 6619488 6652649 6686099 6719003 6751667 6784647 6817216 6847872 6876506 6904787
48741 6904787 6934112 6964417 6995536 7028243 7062790 7097405 7129551 7158399 7185206 7211682 7238650
48730 7238650 7265667 7291097 7313085 7331345 7347429 7362305 7374269 7380492 7380250 7375256 7366986 7355071
48718 7355071 7338437 7316548 7288894 7254386 7212184 7162519 7106015 7042639 6971993 6894570 6812222
48707 6812222 6727319 6641536 6555406 6468951 6382646 6297591 6214748 6134418 6056656 5981624 5909112
48696 5909112 5838338 5769069 5702572 5640553 5583337 5530014 5480226 5434781 5394448 5359197 5328820
48685 5328820 5303198 5281643 5263084 5247431 5235719 5228093 5222577 5216876 5210850 5206302 5204730 5206287 5210527
48672 5210527 5216910 5224317 5231093 5236206 5239983 5243352 5246616 5249195 5250323 5249749 5247785 5244867 5241112 5236262
48658 5236262 5229953 5222063 5213007 5203881 5196000 5189793 5184118 5177189 5168358 5158626 5149359 5141171 5134210 5128711
48644 5128711 5124499 5120390 5114939 5107857 5100305 5093917 5089812 5088136 5087958 5087808 5086932 5085938 5085816 5086680 5088133
48629 5088133 5090502 5094693 5100845 5108135 5116114 5125140 5135005 5144169 5151112 5155791 5158931 5160564 5160251 5158218
48615 5158218 5155095 5150723 5144478 5136775 5128834 5120483 5109543 5094473 5076644 5058665 5040951 5021316
48603 5021316 4997824 4970456 4939665 4904816 4865287 4822230 4777840 4732950 4686410 4636865 4584246
48592 4584246 4529283 4472422 4413821 4353930 4293555 4233570 4174934 4118838 4066391 4018136 3973927
48581 3973927 3933136 3894946 3858745 3824484 3792445 3762556 3734222 3706883 3680210 3653521 3625755
48570 3625755 3596780 3568294 3542454 3519634 3498321 3477175 3456288 3436246 3417021 3398387 3380580
48559 3380580 3363653 3346684 3328516 3309114 3289499 3270675 3253547 3239628 3230450 3225655 3222643 3218871
48547 3218871 3214080 3209772 3207249 3207020 3209526 3214980 3222271 3229162 3234213 3237869 3241173 3244119 3246065 3247270
48533 3247270 3248929 3251649 3254679 3256880 3257760 3257247 3255093 3251054 3245218 3237453 3226782 3211967 3192885 3170857
48519 3170857 3147516 3123792 3100105 3077002 3055132 3034825 3016147 2999273 2984408 2971318 2959338
48508 2959338 2947929 2937030 2926855 2917767 2910530 2906162 2904903 2905447 2905793 2905025 2903770 2902596 2900432 2895168
48494 2895168 2885751 2873104 2858808 2843304 2825838 2806108 2785389 2765687 2747911 2731388 2715390
48483 2715390 2700524 2687810 2676558 2664279 2649279 2632420 2615395 2598116 2579301 2559400 2540952
48472 2540952 2525363 2511009 2495914 2481127 2469640 2462413 2457363 2452513 2448511 2447354 2449865 2455320 2462488
48459 2462488 2469716 2474366 2473490 2465550 2451193 2432416 2411315 2389493 2368102 2348086 2330379 2315731
48447 2315731 2304301 2295687 2289578 2286255 2286367 2290369 2298265 2309605 2323732 2340374 2360007 2382826 2406890
48434 2406890 2427796 2440893 2443858 2437114 2422553 2402544 2379729 2356740 2335618 2317444 2302150 2288596
48422 2288596 2275487 2262615 2250591 2238986 2225821 2209841 2192445 2176145 2161739 2148335 2135424
48411 2135424 2123094 2110536 2096524 2081786 2068941 2059316 2051514 2043918 2036906 2031354 2026569 2021422 2016473
48398 2016473 2013220 2011788 2010885 2009773 2008925 2008983 2010280 2013195 2017703 2022580 2026129 2027738 2027825 2026338 2022364
48383 2022364 2015489 2006761 1998072 1990986 1985874 1981538 1975958 1968222 1959527 1951557 1944332 1936573 1927695 1918045
48369 1918045 1907442 1895135 1881574 1868769 1858268 1849768 1842207 1835109 1828227 1820827 1812318 1803106 1794104
48356 1794104 1785690 1777491 1768801 1758880 1747357 1734785 1722458 1711465 1702128 1694210 1686993 1679236 1670086
48343 1670086 1660396 1652293 1646960 1643472 1640176 1636357 1632078 1627332 1622254 1617613 1614130 1611410 1608276 1604229
48329 1604229 1600068 1596850 1594400 1591194 1586147 1580487 1576999 1576699 1577088 1574938 1570374 1566591 1565642 1566360 1566952
48314 1566952 1567729 1570060 1573969 1578243 1582105 1585453 1587966 1589313 1590107 1591653 1594686 1598984 1604273 1611027
48300 1611027 1620264 1632498 1646704 1660748 1673555 1686618 1702276 1720704 1739975 1759046 1778850
48289 1778850 1800092 1822092 1844975 1871105 1902705 1939287 1978853 2020259 2062686 2104044 2142185
48278 2142185 2177352 2211803 2247281 2284224 2323015 2364602 2410088 2460655 2517392 2580267 2648139
48267 2648139 2720904 2800701 2889818 2988496 3096059 3212768 3338759 3472554 3612971 3761791
48257 3761791 3922495 4097160 4286712 4493506 4721446 4974274 5255966 5572417 5931027
48248 5931027 6339850 6809353 7353851 7988928 8728626 9586755 10577949 11714312 13004779
48239 13004779 14462816 16112138 17980257 20089050 22448372 25027340 27685133 30115732
48231 30115732 31903208 32698661 32392567 31141572 29247441 27011189 24662421 22357565
48223 22357565 20193336 18215384 16432717 14837389 13416466 12155023 11038859 10057232
48215 10057232 9200332 8454803 7804905 7237357 6742189 6309653 5929288 5591982 5290786
48206 5290786 5020050 4775754 4556195 4360277 4185160 4026961 3883213 3753075 3635685
48197 3635685 3529866 3434898 3349855 3272525 3200621 3133845 3073267 3018882 2969223 2923190 2880767
48186 2880767 2841957 2806392 2774027 2744855 2717855 2691633 2666347 2643653 2624224 2606257 2586901
48175 2586901 2564282 2537810 2507434 2473264 2435554 2394748 2351964 2309362 2269193 2232113 2196925
48164 2196925 2162173 2127405 2092744 2058169 2023812 1990377 1958616 1928647 1900185 1873073 1847101
48153 1847101 1821655 1796194 1770931 1746469 1722711 1698673 1673549 1647552 1621508 1595916 1570770
48142 1570770 1546079 1522115 1499040 1476661 1454778 1433616 1413734 1395476 1378564 1362069 1344848
48131 1344848 1326400 1307484 1289601 1273576 1259017 1245480 1233604 1224234 1216738 1209276 1200935 1192639
48119 1192639 1185549 1179495 1173674 1168152 1163693 1160409 1157475 1154150 1150433 1146659 1142970 1139203 1134922 1129657
48105 1129657 1123577 1117834 1113704 1111369 1110047 1109235 1109147 1109714 1109843 1108272 1104964 1101320 1099081 1099047 1100626 1102417
48089 1102417 1103512 1104396 1106305 1109491 1112463 1113390 1112169 1110746 1111483 1115409 1121861 1129172 1135548 1139869 1142286
48074 1142286 1144078 1146695 1150869 1156640 1163839 1172124 1180695 1188559 1195374 1201857 1209217 1218289 1229117 1240946
48060 1240946 1252560 1263205 1273618 1285705 1300575 1317017 1332487 1345669 1357599 1370339 1385067
48049 1385067 1401689 1419773 1439318 1460616 1483528 1507094 1530128 1552440 1575166 1599413 1624715
48038 1624715 1649426 1672616 1694926 1717454 1740640 1764592 1789586 1815384 1840538 1863370 1883713
48027 1883713 1903014 1922574 1942187 1960566 1976703 1990653 2003259 2015224 2026318 2035565 2042431 2047632
48015 2047632 2052455 2057486 2062451 2067194 2072177 2077887 2084170 2090293 2095341 2098679 2100557 2102362 2105582 2110176
48001 2110176 2114429 2116723 2116875 2115397 2112258 2107244 2101081 2094998 2089041 2081648 2071196 2057414 2041036
47988 2041036 2022736 2002697 1980664 1955923 1927713 1896261 1863188 1830443 1798969 1768678 1739241
47977 1739241 1710238 1680850 1650354 1619113 1588421 1559146 1531052 1503682 1477272 1452354 1428918
47966 1428918 1406531 1385100 1364922 1346056 1328105 1310782 1294427 1279721 1266910 1255423 1244367
47955 1244367 1233478 1223325 1214339 1205801 1196413 1185977 1175875 1167560 1161077 1155624 1151014 1147659 1145216
47942 1145216 1142313 1138183 1133984 1131785 1132293 1134080 1135142 1134791 1133689 1132458 1131001 1129322 1128174 1128129 1128337
47927 1128337 1127130 1123933 1119796 1115915 1112454 1109179 1106374 1104436 1103129 1101890 1100481 1098794 1096545 1093802
47913 1093802 1091201 1088762 1085138 1079215 1072263 1067250 1065911 1067473 1070285 1073485 1076780 1079784 1082345 1084840
47899 1084840 1087499 1089898 1091556 1092578 1093469 1094814 1097435 1102234 1109503 1118806 1129658 1141671 1153932
47886 1153932 1165246 1175499 1185914 1197326 1209091 1220409 1231804 1244210 1257201 1269316 1279775
47875 1279775 1288822 1296659 1303272 1309239 1315461 1321790 1326931 1330013 1331358 1331306 1329254 1324534 1317658 1309886
47861 1309886 1301905 1293602 1284919 1276216 1267692 1258997 1249691 1239824 1229803 1219880 1210159 1201128 1193678 1188099
47847 1188099 1183247 1177364 1169992 1162635 1157157 1153988 1152357 1151882 1153139 1156700 1162342 1169379 1177249 1185668
47833 1185668 1194768 1205373 1218493 1233947 1249856 1264098 1276187 1287200 1298045 1308592 1318665
47822 1318665 1329040 1340589 1352820 1364101 1373396 1380961 1387042 1390739 1390998 1388252 1384155 1379650 1374077
47809 1374077 1366356 1356381 1344925 1332677 1319801 1306107 1291349 1275538 1259108 1242551 1225912 1209126
47797 1209126 1192902 1178623 1167019 1157460 1148874 1140754 1132830 1124461 1115195 1105659 1097204 1090805 1086679
47784 1086679 1084537 1083567 1082581 1081112 1080264 1081635 1085362 1089978 1094230 1098267 1102887 1108225 1113553 1117901 1120684
47769 1120684 1122098 1123045 1124394 1126291 1128426 1130621 1132609 1133598 1133177 1132643 1134198 1138411 1143438 1147364 1150344
47754 1150344 1153695 1157864 1162514 1168069 1175710 1185786 1197412 1209971 1224168 1241269 1261961 1286347
47742 1286347 1314349 1345563 1379148 1414339 1450708 1487485 1523115 1556216 1586718 1615250 1641456
47731 1641456 1663790 1681203 1694200 1703783 1710002 1712280 1710686 1706071 1699064 1689686 1678002 1664530 1649897
47718 1649897 1634569 1618963 1603279 1587192 1570352 1553379 1537654 1523839 1511251 1499094 1487644
47707 1487644 1477666 1469243 1461889 1455457 1450121 1445534 1440637 1434417 1426735 1418637 1412041 1408498 1407752 1407843 1407153
47692 1407153 1405871 1404977 1404564 1404284 1404919 1408117 1414388 1422492 1431104 1440171 1450345 1461947 1475038 1489893
47678 1489893 1506832 1525832 1546416 1567508 1587456 1604983 1620404 1635315 1650770 1666295 1680813
47667 1680813 1693767 1704873 1713430 1718508 1719586 1716768 1710701 1702416 1692684 1681293 1667507 1651363 1633817
47654 1633817 1615329 1595247 1573243 1550619 1529379 1510400 1493222 1477114 1461590 1446273 1431254
47643 1431254 1417635 1406919 1399653 1395046 1391971 1390048 1389691 1391346 1394720 1398817 1403021 1408044 1415262 1425059
47629 1425059 1436623 1449592 1464919 1483403 1504220 1525822 1547587 1569438 1590408 1608977 1624833
47618 1624833 1639111 1652666 1665014 1675184 1682743 1687704 1690176 1690427 1688755 1684968 1678422 1668719 1656025
47605 1656025 1640779 1623593 1605385 1587003 1568702 1550459 1532507 1514863 1496718 1477453 1458112
47594 1458112 1440549 1424960 1409697 1393955 1379200 1367144 1357721 1350146 1344759 1342221 1341674 1341358 1340822
47581 1340822 1341084 1342743 1345337 1348642 1353079 1358295 1362631 1364878 1365851 1367376 1370154 1373329 1376011 1378593
47567 1378593 1382506 1388986 1398218 1409607 1422799 1438130 1455960 1475970 1497668 1521261 1547180 1574761
47555 1574761 1602300 1628776 1654771 1681148 1707343 1731470 1751608 1766408 1774886 1776514 1771627 1761230
47543 1761230 1746182 1726661 1702211 1672150 1636275 1595689 1552738 1509725 1467749 1426962 1387504
47532 1387504 1349577 1312997 1277467 1243245 1210913 1180590 1152176 1126229 1103626 1084184 1066680
47521 1066680 1050627 1036988 1026424 1017739 1009079 1000054 991609 984146 977009 969830 963269 957988 953638
47508 953638 949238 944077 937978 931253 924780 919645 916242 913881 911543 908795 905782 902696 899600 896583
47494 896583 893766 891269 889258 887811 886540 884587 881377 877332 873649 871320 870360 869896 869017 867728 867048
47479 867048 867909 870036 872157 873297 873428 872918 872099 871519 871825 872792 873101 871787 869523 867749 866905 866278 865304
47462 865304 864076 862592 860500 857845 855352 853657 852842 852823 853489 854283 854588 854974 857146 861859 867543 871893
47446 871893 874250 875437 875670 874061 870425 866373 863917 863545 864206 864658 864328 863259 861878 860770 860220 860026
47430 860026 859997 860464 861905 864208 866828 869653 873182 877545 881738 884366 885088 885040 885755 888065 892183 898329
47414 898329 906496 915456 922715 926153 925825 923967 923253 925059 928946 933252 936341 937871 938916 940514 942281
47399 942281 943104 942986 943212 944467 945928 946800 947717 949693 952602 955936 960503 967786 977705 988407 998500
47384 998500 1008329 1018799 1030201 1042723 1056968 1073179 1090779 1109411 1129706 1152286 1176654 1201783
47372 1201783 1227192 1252759 1278192 1303570 1329850 1357805 1386730 1414867 1440694 1463083 1480936
47361 1480936 1493902 1503068 1509667 1513174 1511827 1504928 1493525 1478874 1461470 1441790 1420778 1399219
47349 1399219 1377557 1356538 1336974 1318640 1300537 1282679 1266449 1252615 1240059 1227285 1214329
47338 1214329 1202516 1193095 1186738 1183412 1181913 1180406 1178330 1177102 1178079 1180696 1183643 1187092 1192372 1199919
47324 1199919 1208790 1217883 1226426 1233641 1239319 1244592 1250651 1256542 1259639 1258732 1255443 1251994 1248610 1243807
47310 1243807 1236463 1226892 1216307 1205708 1194961 1182787 1168160 1151811 1135630 1120425 1105196 1089028
47298 1089028 1072690 1057483 1043272 1028700 1013078 997087 981733 967425 954212 942257 931720
47287 931720 922521 914361 906874 899750 892971 886918 882011 878148 874633 870803 866881 864227 864389 867491
47273 867491 871667 874719 876386 878416 882195 887098 891587 895249 898905 903156 907761 912290 916435 919531
47259 919531 920585 919308 916776 914708 914192 915112 916525 917499 917784 917713 917354 916170 914025 912232 912639 915544
47243 915544 919418 923101 927377 933655 941792 950274 958306 966704 976597 988094 1000466 1012980 1025227
47230 1025227 1037144 1049136 1061829 1075406 1089356 1103091 1116524 1129908 1143394 1156920 1170212
47219 1170212 1182752 1194087 1204370 1214176 1223598 1232038 1239243 1245938 1252873 1259703 1265560 1270500 1275601
47206 1275601 1281661 1288512 1295654 1303020 1310928 1319621 1328771 1337012 1342127 1342269 1337011 1326837 1312081 1293267
47192 1293267 1272250 1251727 1233175 1216165 1200134 1185911 1174840 1167062 1161355 1156198 1150589 1144430
47180 1144430 1138828 1135509 1135251 1137167 1139974 1143498 1148459 1155317 1163954 1173943 1184400 1194120 1202842 1211990
47166 1211990 1223162 1236041 1248738 1260106 1270729 1281508 1292169 1301559 1308842 1314175 1318484 1322592
47154 1322592 1326266 1328373 1328418 1327441 1326556 1324990 1320762 1313351 1304570 1296507 1289601 1283216 1277168 1271911 1267693
47139 1267693 1264200 1260980 1258039 1256230 1256969 1261045 1267711 1275544 1284187 1294452 1306652 1319861 1333216
47126 1333216 1347071 1362371 1379642 1399180 1421403 1446144 1472073 1497670 1522560 1547346 1572463
47115 1572463 1597725 1622656 1646637 1668931 1689130 1707428 1723988 1738285 1749546 1757558 1762683 1765363
47103 1765363 1766111 1765649 1764421 1762133 1758223 1752546 1745106 1735549 1723728 1710606 1697875 1686548 1676418
47090 1676418 1666856 1657532 1648418 1639774 1632262 1626518 1622412 1619096 1615969 1613228 1611408 1610807 1611493 1613442
47076 1613442 1616419 1619958 1623657 1627344 1630892 1634045 1636401 1637341 1636088 1632155 1625818 1617817 1608496 1597521
47062 1597521 1584503 1569700 1554015 1538427 1523308 1508072 1491667 1473766 1455339 1437709 1421182
47051 1421182 1405173 1389426 1374288 1359681 1344819 1329453 1314572 1301082 1288422 1275543 1262946
47040 1262946 1252549 1245345 1240123 1234942 1229169 1223585 1219157 1216382 1215396 1215867 1216854 1217523 1218205 1220239 1224597
47025 1224597 1230964 1238174 1245141 1251467 1257646 1264827 1273689 1283453 1292637 1300939 1309418 1318391 1326279 1331504
47011 1331504 1334708 1337729 1340940 1343191 1344262 1345649 1348459 1351991 1355161 1358138 1361624 1365529 1369477 1373921
46997 1373921 1379611 1386372 1393474 1400907 1409131 1417798 1425929 1433569 1442161 1452749 1464540 1475815 1485817
46984 1485817 1495248 1505196 1516060 1527387 1538463 1549052 1559709 1571260 1583894 1596952 1609769 1622434
46972 1622434 1635345 1648044 1659218 1668387 1677194 1687999 1700925 1713147 1721761 1726702 1729932 1732430
46960 1732430 1733304 1731674 1727873 1722486 1715677 1708128 1701355 1696127 1691504 1686288 1680530 1674838 1669280 1664127
46946 1664127 1660590 1659350 1659175 1658494 1657691 1658220 1660112 1662321 1665108 1669846 1676375 1682852 1688706 1695548 1704321
46931 1704321 1713777 1723024 1733622 1747325 1763231 1779038 1794079 1809241 1824737 1840096 1855910 1873515
46919 1873515 1892798 1912146 1930900 1950215 1970951 1992134 2012279 2031147 2049277 2066607 2082437
46908 2082437 2096328 2108365 2118839 2128146 2136724 2144648 2151579 2157421 2162693 2167863 2172629 2176232 2178346
46895 2178346 2179455 2180690 2183510 2189084 2197406 2207248 2217412 2227833 2239061 2250919 2262424 2273101
46883 2273101 2283655 2295041 2307376 2320187 2333320 2346954 2360842 2374247 2386921 2399641 2413300
46872 2413300 2427560 2440694 2450772 2456798 2458904 2457868 2454570 2449507 2442510 2432920 2420244 2404550 2386303
46859 2386303 2366109 2344786 2323394 2302672 2282434 2261997 2241489 2222452 2206760 2194903 2185666
46848 2185666 2177570 2170321 2164754 2161813 2162135 2166320 2174766 2186918 2201471 2217938 2237540 2261783 2290366
46835 2290366 2321308 2353089 2385783 2419923 2455169 2490692 2526144 2561486 2596150 2629050 2659292
46824 2659292 2686381 2709939 2729868 2746893 2762401 2777520 2792440 2806579 2819153 2829744 2838742
46813 2838742 2847335 2856846 2868057 2881164 2896016 2912058 2928466 2945023 2962647 2982289 3003400 3024454
46801 3024454 3045144 3066949 3090843 3115253 3137322 3155836 3171975 3187242 3201593 3213789 3222879
46790 3222879 3228864 3232302 3233619 3232659 3228768 3221568 3211754 3200869 3190077 3179359 3168125 3156388 3145140
46777 3145140 3135697 3128890 3124817 3123144 3123563 3125993 3130355 3136282 3143211 3150729 3158693 3167130 3176304 3186719
46763 3186719 3198510 3210731 3221794 3230916 3238705 3245964 3252392 3256915 3258927 3258540 3255874 3250801 3243355
46750 3243355 3233802 3222257 3208735 3193615 3177595 3161197 3144700 3128480 3112804 3097385 3081810
46739 3081810 3066489 3052412 3039831 3027974 3016327 3005407 2995826 2987402 2979837 2973614 2969510 2967659
46727 2967659 2967788 2969847 2973675 2978453 2983393 2988796 2995613 3004052 3013349 3022780 3032113 3041100 3049371 3057164
$$ [...]
##END NTUPLES=NMR SPECTRUM
##END=
