
##TITLE=AC1222_Punto_6074794_1Xs9jaGfa0
##JCAMPDX= 6.0         $$ Bruker NMR JCAMP-DX V2.0
##DATA TYPE= NMR SPECTRUM
##DATA CLASS= NTUPLES
##ORIGIN= BRUKER
##OWNER= Administrator
$$ 1.72 TOPSPIN		Version 2.1
$$ 2012-05-09 00:10:54.812 -0500  Administrator@TOPSPIN
$$ Compression mode = diff/dup
##.OBSERVE FREQUENCY= 400.13188235
##.OBSERVE NUCLEUS= ^1H
##.ACQUISITION MODE= SIMULTANEOUS (DQD)
##.ACQUISITION SCHEME= undefined
##.AVERAGES= 8
##.DIGITISER RES= 22
##SPECTROMETER/DATA SYSTEM= spect
##.PULSE SEQUENCE= zg30
##.SOLVENT NAME= COFFEE_meoh
##.SHIFT REFERENCE= INTERNAL, COFFEE_meoh, 1, 14.98061
##AUDIT TRAIL= $$ (NUMBER, WHEN, WHO, WHERE, PROCESS, VERSION, WHAT)
$$ ##TITLE= Audit trail, TOPSPIN		Version 2.1
$$ ##JCAMPDX= 5.01
$$ ##ORIGIN= Bruker BioSpin GmbH
$$ ##OWNER= Administrator
$$ $$ C:\Bruker\TOPSPIN/data/COFFEE/nmr/AC1222_Punto_6074794_1Xs9jaGfa0/70/pdata/1/auditp.txt
$$ ##AUDIT TRAIL=  $$ (NUMBER, WHEN, WHO, WHERE, PROCESS, VERSION, WHAT)
(   1,<2012-05-09 00:10:48.093 -0500>,<Administrator>,<TOPSPIN>,<go>,<TOPSPIN 2.1>,
      <created by zg
	started at 2012-05-09 00:09:41.250 -0500,
	POWCHK enabled, PULCHK disabled,
       configuration hash MD5:
       AF F2 23 6B 01 CD 40 DD E5 A1 38 A0 06 EA F7 77
       data hash MD5: 64K
       93 3F 31 06 91 D3 25 9C 5A 5C 55 CF BE C0 36 6E>)
(   2,<2012-05-09 00:10:50.656 -0500>,<Administrator>,<TOPSPIN>,<proc1d>,<TOPSPIN 2.1>,
      <Start of raw data processing
       efp LB = 0 FT_mod = 6 PKNL = 1 PHC0 = 0 PHC1 = 0 SI = 32K 
       data hash MD5: 32K
       55 E9 9A 33 9D 8F 14 E2 08 42 A2 5F 0C 85 86 27>)
(   3,<2012-05-09 00:10:51.062 -0500>,<Administrator>,<TOPSPIN>,<proc1d>,<TOPSPIN 2.1>,
      <pk PHC0 = 212.3767 PHC1 = 0 
       data hash MD5: 32K
       89 34 F5 75 CA 20 34 3B 86 10 4B 71 D2 0A 43 DB>)
(   4,<2012-05-09 00:10:51.156 -0500>,<Administrator>,<TOPSPIN>,<proc1d>,<TOPSPIN 2.1>,
      <abs ABSG = 1 
       data hash MD5: 32K
       9B 27 B7 13 9F CD B7 67 B4 DA 02 D9 A6 F0 54 C8>)
(   5,<2012-05-09 00:10:51.203 -0500>,<Administrator>,<TOPSPIN>,<proc1d>,<TOPSPIN 2.1>,
      <abs ABSG = 2 
       data hash MD5: 32K
       89 39 4C D6 80 E9 E0 F6 28 AC F8 29 DE 97 88 A6>)
(   6,<2012-05-09 00:10:51.218 -0500>,<Administrator>,<TOPSPIN>,<proc1d>,<TOPSPIN 2.1>,
      <abs ABSG = 3 
       data hash MD5: 32K
       52 9C 91 BC 58 FA 39 D5 05 83 BB 3A EA 9F 06 77>)
(   7,<2012-05-09 00:10:51.250 -0500>,<Administrator>,<TOPSPIN>,<proc1d>,<TOPSPIN 2.1>,
      <abs ABSG = 4 
       data hash MD5: 32K
       03 44 3D A3 B7 ED 05 D4 76 BB D8 43 B6 C9 7D 44>)
(   8,<2012-05-09 00:10:51.281 -0500>,<Administrator>,<TOPSPIN>,<proc1d>,<TOPSPIN 2.1>,
      <abs ABSG = 5 
       data hash MD5: 32K
       3E 57 89 6A 00 CE F1 CF A0 46 89 6F 20 79 42 06>)
$$ ##END=
$$ 
$$ $$ hash MD5
$$ $$ CA F6 A5 37 E2 D1 74 5F 0B 07 01 6C 83 72 F2 75
##$RELAX= 
##$RELAX= 
##$RELAX= 
##$RELAX= 
##$RELAX= 
##$RELAX= 
##$RELAX= 
$$ Bruker specific parameters
$$ --------------------------
$$ [...]
##$TP= (0..7)
150 150 150 150 150 150 150 150
##$TP07= 0
##$TPNAME0= <>
##$TPNAME1= <>
##$TPNAME2= <>
##$TPNAME3= <>
##$TPNAME4= <>
##$TPNAME5= <>
##$TPNAME6= <>
##$TPNAME7= <>
##$TPOAL= (0..7)
0.5 0.5 0.5 0.5 0.5 0.5 0.5 0.5
##$TPOFFS= (0..7)
0 0 0 0 0 0 0 0
##$TUNHIN= 0
##$TUNHOUT= 0
##$TUNXOUT= 0
##$USERA1= <user>
##$USERA2= <user>
##$USERA3= <user>
##$USERA4= <user>
##$USERA5= <user>
##$V9= 5
##$VALIST= <valist>
##$VCLIST= <CCCCCCCCCCCCCCC>
##$VD= 0
##$VDLIST= <DDDDDDDDDDDDDDD>
##$VPLIST= <PPPPPPPPPPPPPPP>
##$VTLIST= <TTTTTTTTTTTTTTT>
##$WBST= 1024
##$WBSW= 4
##$XGAIN= (0..3)
0 0 0 0
##$XL= 0
##$YL= 0
##$YMAX_a= 542459
##$YMIN_a= -651202
##$ZGOPTNS= <>
##$ZL1= 120
##$ZL2= 120
##$ZL3= 120
##$ZL4= 120
##$ABSF1= 14.98061
##$ABSF2= -5.57192
##$ABSG= 5
##$ABSL= 3
##$ALPHA= 0
##$AQORDER= 0
##$ASSFAC= 0
##$ASSFACI= 0
##$ASSFACX= 0
##$ASSWID= 0
##$AUNMP= <proc_prof1d_extract_pilot.lims>
##$AXLEFT= 0
##$AXNAME= <>
##$AXNUC= <1H>
##$AXRIGHT= 0
##$AXTYPE= 0
##$AXUNIT= <>
##$AZFE= 0.1
##$AZFW= 0.1
##$BCFW= 0
##$BC_mod= 0
##$BYTORDP= 0
##$COROFFS= 0
##$CY= 15
##$DATMOD= 1
##$DC= 0
##$DFILT= <>
##$DTYPP= 0
##$F1P= 0
##$F2P= 0
##$FCOR= 0.5
##$FTSIZE= 32768
##$FT_mod= 6
##$GAMMA= 0
##$GB= 0
##$INTBC= 1
##$INTSCL= 1
##$ISEN= 128
##$LB= 0
##$LEV0= 0
##$LPBIN= 0
##$MAXI= 10000
##$MC2= 0
##$MEAN= 0
##$ME_mod= 0
##$MI= 0
##$NCOEF= 0
##$NC_proc= -8
##$NLEV= 6
##$NOISF1= 0
##$NOISF2= 0
##$NSP= 0
##$NTH_PI= 0
##$NZP= 0
##$OFFSET= 14.98061
##$PC= 1
##$PHC0= 212.3767
##$PHC1= 0
##$PH_mod= 1
##$PKNL= yes
##$PPARMOD= 0
##$PPDIAG= 0
##$PPIPTYP= 0
##$PPMPNUM= 2147483647
##$PPRESOL= 1
##$PSCAL= 4
##$PSIGN= 0
##$PYNMP= <proc.py>
##$REVERSE= no
##$SF= 400.13
##$SI= 32768
##$SIGF1= 0
##$SIGF2= 0
##$SINO= 400
##$SIOLD= 32768
##$SPECTYP= <>
##$SREGLST= <1H.CDCl3>
##$SSB= 0
##$STSI= 32768
##$STSR= 0
##$SW_p= 8223.68421052632
##$SYMM= 0
##$S_DEV= 0
##$TDeff= 65536
##$TDoff= 0
##$TI= <>
##$TILT= no
##$TM1= 0
##$TM2= 0
##$TOPLEV= 0
##$USERP1= <user>
##$USERP2= <user>
##$USERP3= <user>
##$USERP4= <user>
##$USERP5= <user>
##$WDW= 1
##$XDIM= 32768
##$YMAX_p= 459300021
##$YMIN_p= -843631
##$CURPLOT= <Network HP LaserJet P1505>
##$CURPRIN= <$Network HP LaserJet P1505>
##$DFORMAT= <normdp>
##$LAYOUT= <+/1D_H.xwp>
##$LFORMAT= <normlp>
##$PFORMAT= <normpl>
##$SURQMSG= 1
$$ End of Bruker specific parameters
$$ ---------------------------------
##NTUPLES= NMR SPECTRUM
##VAR_NAME=  FREQUENCY,     SPECTRUM/REAL,   SPECTRUM/IMAG
##SYMBOL=    X,             R,               I
##VAR_TYPE=  INDEPENDENT,   DEPENDENT,       DEPENDENT
##VAR_FORM=  AFFN,          ASDF,            ASDF
##VAR_DIM=   32768,         32768,           32768
##UNITS=     HZ,            ARBITRARY UNITS, ARBITRARY UNITS
##FACTOR=    0.250966925370066, 1,           1
##FIRST=     8223.43324360095, -62004,       -280483
##LAST=      0,             -31721,          67240
##MIN=       0,             -843631,         0
##MAX=       8223.43324360095, 459300021,    0
$$ Real data points
##PAGE= N=1
##DATA TABLE= (X++(R..R)), XYDATA
$$ [...]
19529a84844j12888a03218A49952J4112a93441b2289A3646a21294j1286M4763
$$ -184844 -297732 -103218 149952 164064 -193441 -22289 13646 -121294 -132580 -87817
19519h7817j2636a6545D0164a91811j71611a46178J1782E9083P2840b32370O1534
$$ -87817 -100453 -16545 40164 -191811 -363422 -146178 -134396 59083 131923 -232370 -170836
19508a70836I5455d5058C4013c44691a60905b2671j7676J0868k6488g561k14503
$$ -170836 95455 -45058 34013 -344691 -160905 -22671 -40347 -29479 -55967 -7561 -222064
19497b22064B15976C4573b00666m1652I1242b79417q611P9100e400o4718j02966
$$ -222064 215976 34573 -200666 -242318 91242 -279417 -288028 -208928 -5400 -70118 -173084
19486a73084p6112F4978J2214d3454p1745j72106E3804i9678E8906b10099A84006
$$ -173084 -249196 64978 77192 -43454 -115199 -287305 53804 -99678 58906 -210099 184006
19474b41187N5979C66909a73569Q2275m075p7379A19147b21447Q6532q0029A09244
$$ -241187 -185208 366909 -173569 -91294 -95369 -172748 119147 -221447 -134915 -214944 109244
19462A2397J66073b79712C25822A15477d47101A19498a61796N0685E1068O1350
$$ 12397 178470 -279712 325822 115477 -447101 119498 -161796 -111111 51068 112418
19452A12418b43232p6216B00748a5224j25282D8136L9831b5173D10694F476k461
$$ 112418 -243232 -319448 200748 -15224 -140506 48136 87967 -25173 410694 6476 4015
19441D015b79824D4036B1103f1203k2966A81329q1155e8k76860J28271k54147
$$ 4015 -279824 44036 21103 -61203 -84169 181329 100174 -58 -276918 -148647 -402794
19430d02794f2618l44119a9757F4465c6459A44834c72056a04446E8795a43059
$$ -402794 -62618 -406737 -19757 64465 -36459 144834 -372056 -104446 58795 -143059
19419A7752f8733k64211B3713J21578a31591e2908p8877f0322D4985g0115j6668
$$ 17752 -68733 -332944 23713 145291 -131591 -52908 -131785 -60322 44985 -70115 -86783
19408h6783A01005b89595I7295b58310p5566A87928m2480K24308a08663a1244
$$ -86783 101005 -289595 97295 -258310 -333876 187928 145448 369756 -108663 -11244
19397c46354A21953a44300B6505b29843C65944g9761q0839J8473j082d9699m7833
$$ -346354 121953 -144300 26505 -229843 365944 -79761 -160600 -142127 -143209 -49699 -97532
19386i7532f662n21870A27709h7782D2391q9D447M44836B01604b73670b0339j07431
$$ -97532 -6662 -528532 127709 -87782 42391 42302 4447 449283 201604 -273670 -20339 -127770
19374a27770l17507c3091p468k13670A23869b3490G3273b62764B39025a91754
$$ -127770 -445277 -33091 -40559 -254229 123869 -23490 73273 -262764 239025 -191754
19363c25479b1448D39871f0600A87933q6565b56791l9969h7437C00497j04597
$$ -325479 -21448 439871 -60600 187933 101368 -256791 -296760 -87437 300497 195900
19353A95900A545a02600A3386K24867B4217b67790Q2129d6857A43708c9709j6006
$$ 195900 1545 -102600 13386 238253 24217 -267790 -185661 -46857 143708 -39709 -55715
19342e5715q425J269j95051b3334k7967A800a82139c1709l933n0046A40851M6254
$$ -55715 -64140 -62871 -257922 -23334 -51301 1800 -182139 -31709 -35642 -85688 140851 187105
19330A87105g5679A95991d0600A32658N9955c727A53821A5908b57604Q4541j16991
$$ 187105 -75679 195991 -40600 132658 192613 -3727 153821 15908 -257604 -173063 -290054
19319b90054a40464j20194k5827e9946A19762J09351o62i5786l2350E0992a8189
$$ -290054 -140464 -260658 -286485 -59946 119762 229113 228451 -95786 -128136 50992 -18189
19307e1578j0251A49286a9061C03906b2667B01405a88365P4657M9507j05640c9174
$$ -51578 -61829 149286 -19061 303906 -22667 201405 -188365 -113708 -64201 -169841 -39174
19295c17149A68519c26022A54668a72606j62396g4323I0872c07140Q8511n9715
$$ -317149 168519 -326022 154668 -172606 -335002 -74323 90872 -307140 -218629 -278344
19285b78344g6575D9056g8666m6386K3265j14684A772Q0547b24746E0871a40052
$$ -278344 -76575 49056 -78666 -125052 -101787 -216471 1772 82319 -224746 50871 -140052
19273G5805h5550k06618a10541A51372k5176K5244a74145r406K1778M5009K0421
$$ 75805 -85550 -292168 -110541 151372 126196 151440 -174145 -183551 -161773 -116764 -96343
19262i6343l40690a64001F1115b52801a09536A14768i6272r9441j07410a16372
$$ -96343 -437033 -164001 61115 -252801 -109536 114768 -96272 -195713 -303123 -116372
19251i8009k1407H8840c9301l93581a55338k0749l573p6789a1799o1564p5383
$$ -98009 -119416 88840 -39301 -432882 -155338 -176087 -179660 -256449 -11799 -73363 -148746
19240a48746l49447b20187n1629q6055J40687K9739O4337L1326m6380A85757g2271
$$ -148746 -498193 -220187 -271816 -357871 -217184 -187445 -123108 -91782 -138162 185757 -72271
19228H1808I575g4773a5545k1305r8356A04959J426d39959M1336C5207J05813
$$ 81808 9575 -74773 -15545 -36850 -135206 104959 106385 -439959 -398623 35207 141020
19217A41020b11321c9104j99964a18359A06627b31441j36583J67022A32581b07236
$$ 141020 -211321 -39104 -239068 -118359 106627 -231441 -368024 -201002 132581 -207236
19206C6182b61925c980A61755b41789f4268D04397d14210H3045h0688j69660h1358
$$ 36182 -261925 -3980 161755 -241789 -64268 404397 -414210 83045 -80688 -250348 -81358
19194B1039c12573C27054I2769b3923N858l3802C3342J60357m9646f5961A1228
$$ 21039 -312573 327054 92769 -23923 -18065 -51867 33342 193699 144053 -65961 11228
19182H3470c8782g640A06628f5697C60841B1604M000J31415e4838A1745g9849
$$ 83470 -38782 -7640 106628 -65697 360841 21604 25604 157019 -54838 11745 -79849
19170b37808A31420d6649A25999n7443c85731a9609D2777c76056a76416m7730
$$ -237808 131420 -46649 125999 68556 -385731 -19609 42777 -376056 -176416 -224146
19160b24146b4415M967j87676B98925A12135b21497Q0072a7302l7289a0495q0749
$$ -224146 -24415 -19448 -207124 298925 112135 -221497 -141425 -17302 -54591 -10495 -91244
19149i1244N035l4366k5515B42666b08021c5094j10692j46396K8961P9465j39306
$$ -91244 -86209 -120575 -146090 242666 -208021 -35094 -145786 -292182 -263221 -183756 -323062
19138c23062g7383l3261B3937b19982I411i7275m9033E8504L02870f879D7549
$$ -323062 -77383 -110644 23937 -219982 9411 -97275 -146308 58504 361374 -6879 47549
19126G5861K01655E26a3862I6968c54278Q3771A14138J35104r840B7252a2828
$$ 75861 277516 526 -13862 96968 -354278 -270507 114138 249242 239402 27252 -12828
19114b6351G8827J26312a71110h0721E6026b16649j5320A15455a16640r6617A82080
$$ -26351 78827 205139 -171110 -80721 56026 -216649 -231969 115455 -116640 -213257 182080
19102B79597D7517e4201B83869b7028D7396J5261a29510d1131D2505e00752a32718
$$ 279597 47517 -54201 283869 -27028 47396 62657 -129510 -41131 42505 -500752 -132718
19090h5288k22791B38524a59443g7153r1673m9180L0691b0024j38461B24427J14963
$$ -85288 -308079 238524 -159443 -77153 -168826 -218006 -187315 -20024 -158485 224427 339390
19079C39390c2097d865j40403k09540a70788e0859D485b12346p7888H2671K2537
$$ 339390 -32097 -4865 -145268 -354808 -170788 -50859 4485 -212346 -290234 82671 105208
19068A05208h5699G4071a64734B17988e6232k31948C25083i0707a7593n9448B0114
$$ 105208 -85699 74071 -164734 217988 -56232 -288180 325083 -90707 -17593 -77041 20114
19056b46683A36394m2459a75354m0730R757d8620p2489E7765f7430o9610m393
$$ -246683 136394 93935 -175354 -216084 -206327 -48620 -121109 57765 -67430 -137040 -141433
19045a41433P695A724b45253M8034k66712a32459A07380c1250j52056B82045G8913
$$ -141433 -133738 1724 -245253 -197219 -463931 -132459 107380 -31250 -183306 282045 78913
19033C02596a6806l98053B8682a6087B6981b87694i0298n6982J1078B02930a85624
$$ 302596 -16806 -414859 28682 -16087 26981 -287694 -90298 -147280 -136202 202930 -185624
19021a71093A51396F5484J2098i2315j96511a0868j78125B55211b43978a7663
$$ -171093 151396 65484 77582 -92315 -288826 -10868 -188993 255211 -243978 -17663
19010C48988A02614k6723k468h2515k640k51139G9916c83915f759c220j11701
$$ 348988 102614 75891 73423 -82515 -85155 -336294 79916 -383915 -6759 -3220 -114921
18999a14921b6300r7507k63770a43758F3223b24068D0090g4602k6332q232r3292
$$ -114921 -26300 -123807 -387577 -143758 63223 -224068 40090 -74602 -100934 -109166 -202458
18988b02458h045A02177J30691h7750B245c8300D8503M172J82593p3224B3813
$$ -202458 -8045 102177 232868 -87750 2245 -38300 48503 52675 235268 162044 23813
18976a83071E9994c0812m4227H4090a67277j3949G9501b3168l3031o79j83628
$$ -183071 59994 -30812 -75039 84090 -167277 -181226 79501 -23168 -56199 -56878 -240506
18965b40506B8202g8437D1998J91413b77130G964d2911I2155k6561c20004A01873
$$ -240506 28202 -78437 41998 233411 -277130 7964 -42911 92155 65594 -320004 101873
18953c04587f1308A22867c1069G0794N9135b09185i9265l5723A42355i0743l01669
$$ -304587 -61308 122867 -31069 70794 129929 -209185 -99265 -134988 142355 -90743 -392412
18942c92412C4573L4748a31400E5292a6129H0224a28678N5264A29694a86985B81330
$$ -392412 34573 69321 -131400 55292 -16129 80224 -128678 -73414 129694 -186985 281330
18930I1467a3173B7258b27298P8836j26749J35352B20517o2753J04769b42557
$$ 91467 -13173 27258 -227298 -148462 -275211 -139859 220517 157764 262533 -242557
18919C80409A86055b02777F5071b048j12851A38534f496k23627e0559j1640B02910
$$ 380409 186055 -202777 65071 -2048 -114899 138534 -6496 -230123 -50559 -62199 202910
18907i4803B46166l3168a08178K6746j4488I7796i7148a1187m0704o5252B64704
$$ -94803 246166 212998 -108178 -81432 -95920 97796 -97148 -11187 -51891 -117143 264704
18895a30074o553F1733a42308f6173j73225P2490F9086N8620g4406j69443b0504
$$ -130074 -136627 61733 -142308 -66173 -239398 -166908 69086 127706 -74406 -243849 -20504
18883A66926b29932e6868A44142N7953b29900H4321b11367Q5531A34137a37134
$$ 166926 -229932 -56868 144142 202095 -229900 84321 -211367 -125836 134137 -137134
18872e63369c3565j22575A60781b40530B16008a70993K9211d8212E9044b23302
$$ -563369 -33565 -156140 160781 -240530 216008 -170993 -141782 -48212 59044 -223302
18861d8431n6023A59528a50870A12208b65275a8952l1228A20947d05649a2420
$$ -48431 -104454 159528 -150870 112208 -265275 -18952 -50180 120947 -405649 -12420
18850A15152H282e0809m02050A46355a67303j70412a38530A08911c12419C08349
$$ 115152 8282 -50809 -452859 146355 -167303 -337715 -138530 108911 -312419 308349
18839C158a2676D27359c14204A31668C21L56923H0263O2156A7680J03398g6924
$$ 3158 -12676 427359 -314204 131668 321 357244 80263 142419 17680 121078 -76924
18827a59990j14338A34345b88257B5986b76957K5790a03057I4206C0916c66606
$$ -159990 -274328 134345 -288257 25986 -276957 -251167 -103057 94206 30916 -366606
18816b90051O364l4917R0668a08534d3793j87065I7294c27971e8524j58280B7947
$$ -290051 -283687 -318604 -227936 -108534 -43793 -230858 97294 -327971 -58524 -216804 27947
18804c7746o3012L6824j43695e1292A29347D1158h2395A7270h6526H9045Q2112
$$ -37746 -100758 -63934 -207629 -51292 129347 41158 -82395 17270 -86526 89045 171157
18793A71157f0511R109J0865B03667r1200a34356e8363F7923d1935j93997J02977
$$ 171157 -60511 -51402 -40537 203667 112467 -134356 -58363 67923 -41935 -235932 -132955
18782a32955M8441B81679o6138i2066b0087k01636F7084L9101O0066a18924o0870
$$ -132955 -84514 281679 215541 -92066 -20087 -221723 67084 106185 166251 -118924 -179794
18771a79794q195j02991A00426a42028l27835a60670A1787R9992a2950A50036
$$ -179794 -187989 -290980 100426 -142028 -469863 -160670 11787 111779 -12950 150036
18760i4031r7624A78084c90799i9321q6360G7957J46373a35381f6268B1406N1564
$$ -94031 -191655 178084 -390799 -99321 -185681 77957 224330 -135381 -66268 21406 72970
18749G2970M2879a37750f1288K0156l14905E9522K0129J67646e9712o8701j06164
$$ 72970 115849 -137750 -61288 -41132 -356037 59522 79651 247297 -59712 -128413 -234577
18738b34577d0306A05778B312c48447A68132C9335a51724o6760A11629J0025i6026
$$ -234577 -40306 105778 2312 -348447 168132 39335 -151724 -218484 111629 121654 -96026
18726i6854A09771d24919G0098b71389M6361L321P0083j05813B32519D6048b55143
$$ -96854 109771 -424919 70098 -271389 -225028 -221707 -151624 -257437 232519 46048 -255143
18714C50230a06131B8350b065r8099p4685B6940g4640j7735H8229b92680J16920
$$ 350230 -106131 28350 -2065 -100164 -174849 26940 -74640 -92375 88229 -292680 -175760
18703a75760C05777c98237E5971M0021b9649F2851a68063C0701J39797c23846
$$ -175760 305777 -398237 55971 95992 -29649 62851 -168063 30701 170498 -323846
18692A06723K53287A44546K2277a35489n4356L5812A25360F0303B073b11808B05391
$$ 106723 360010 144546 166823 -135489 -189845 -154033 125360 60303 2073 -211808 205391
18680a10578j844k84990a29965B81042B2250R045a97033B66041E6483e8281k64951
$$ -110578 -112422 -397412 -129965 281042 22250 31295 -197033 266041 56483 -58281 -323232
18669c23232J20035a5777k13080j50368a56502d6225j14990M5898o3819G0761
$$ -323232 -203197 -15777 -228857 -379225 -156502 -46225 -161215 -115317 -179136 70761
18658a31167j17418A38305g8666m2160j63218m40758A17591b33016B58004a82334
$$ -131167 -248585 138305 -78666 -120826 -284044 -724802 117591 -233016 258004 -182334
18647a87506B12455b18782D3646P075a0557A22010A8923d64r0768k43383A53984
$$ -187506 212455 -218782 43646 50721 -10557 122010 18923 -464 -91232 -334615 153984
18635a31691B63241a21543A79164b60576A04142b08932h9289p0497j17148C5600
$$ -131691 263241 -121543 179164 -260576 104142 -208932 -89289 -159786 -276934 35600
18624e5803B57027b12734e449A06651E0947g9255j16996B68963F6404b53400Q8897
$$ -55803 257027 -212734 -5449 106651 50947 -79255 -196251 268963 66404 -253400 -164503
18613a64503A50828b7947C2809K32719d8156j06263q126j06352B8914c6397D9321
$$ -164503 150828 -27947 32809 265528 -48156 -154419 -162545 -268897 28914 -36397 49321
18601B5020N255c5139H2979a60323J0480j01213A86812l4265m5632b24228a11301
$$ 25020 30275 -35139 82979 -160323 -149843 -251056 186812 152547 106915 -224228 -111301
18589c22151H208c00760a02379j85609N070g5964j72393K1209R2996A07029a72257
$$ -322151 8208 -300760 -102379 -287988 -282918 -75964 -248357 -227148 -134152 107029 -172257
18577g4985j13199n8892C18887A35825c0078C41140a02446B4607a4412j20219
$$ -74985 -188184 -247076 318887 135825 -30078 341140 -102446 24607 -14412 -134631
18567a34631d4744k63313A19575a2233A66291h2384A07982i6966A1619b37678
$$ -134631 -44744 -308057 119575 -12233 166291 -82384 107982 -96966 11619 -237678
18556A09400j5597a61402G4791c300F5777b24169A41547d00438J04332B03283
$$ 109400 93803 -161402 74791 -3300 65777 -224169 141547 -400438 -296106 203283
18545C9206J6127h5823B33812a01840A30278m833d3519E0221b35137j5903i8459
$$ 39206 55333 -85823 233812 -101840 130278 125445 -43519 50221 -235137 -251040 -98459
18533b58148k35292C721b0167r8865G0572q317N4741J08182A3293e8389j11416
$$ -258148 -493440 3721 -20167 -119032 70572 62255 116996 225178 13293 -58389 -169805
18522a69805H5270C0758K51000a34718A14907b27490B28980o9654R323C2729J11278
$$ -169805 85270 30758 281758 -134718 114907 -227490 228980 159326 168649 32729 144007
18511A44007a28428j21598G3148a58141M0169e6986j07805b3883l0462I7778a51985
$$ 144007 -128428 -250026 73148 -158141 -117972 -56986 -164791 -23883 -54345 97778 -151985
18499A56155l4937a35393p1a4651k06328E4559c47887A84871e7314B58821A03005
$$ 156155 121218 -135393 -135464 -14651 -220979 54559 -347887 184871 -57314 258821 103005
18487a8772j81523b1394A63320j1667a89236A49080C8375i460k48582b9802n1230
$$ -18772 -200295 -21394 163320 151653 -189236 149080 38375 -9460 -258042 -29802 -81032
18476h1032I6869b8555A56681a67265l8417g2114l64740E2206F651R0209c4573
$$ -81032 96869 -28555 156681 -167265 -205682 -72114 -436854 52206 6651 96860 -34573
18464b72550Q8513F8419a20944B1103c30244C31996a86441A29398k1302a47156
$$ -272550 -184037 68419 -120944 21103 -330244 331996 -186441 129398 108096 -147156
18453b13589B13497B3546K021R6925a18165L6891M93j072k53127a00468c2544
$$ -213589 213497 23546 25567 122492 -118165 -81274 -80781 -81853 -334980 -100468 -32544
18441D3695a11081C2259e4617k22361I8619d81559a86339j4459O0160E0772h5621
$$ 43695 -111081 32259 -54617 -276978 98619 -481559 -186339 -200798 -140638 50772 -85621
18429A72727k0532g3325q4755L0431j5716A41973a32115j34297a4984B52134i1381
$$ 172727 152195 -73325 -158080 -127649 -143365 141973 -132115 -266412 -14984 252134 -91381
18417a0625A65795b95882B25766a5817p6058j05141g2348A17142a99937A89475
$$ -10625 165795 -295882 225766 -15817 -91875 -197016 -72348 117142 -199937 189475
18406b93898E9230f5385A39132E2339c31567A32522a39776a7442A15445i5445
$$ -293898 59230 -65385 139132 52339 -331567 132522 -139776 -17442 115445 -95445
18395B24799b47731M0397A40292h3288a8982A37179l0525g2463b0225j30973C1425
$$ 224799 -247731 -207334 140292 -83288 -18982 137179 106654 -72463 -20225 -151198 31425
18383h03p349l74177c6593F860R9046A8145K6139l543A6980N020K84782b49569
$$ -803 -8152 -382329 -36593 6860 105906 18145 44284 40741 16980 22000 306782 -249569
18370b66622J24829d7181B49463d2771j64094J4895N5855N0025I6774b01002L4110
$$ -266622 -141793 -47181 249463 -42771 -206865 -191970 -136115 -86090 96774 -201002 -166892
18359a66892B51383b47926B31573A11790a84259A3525M8636K08105b7436j52013
$$ -166892 251383 -247926 231573 111790 -184259 13525 62161 270266 -27436 -179449
18349a79449B2132g5404A36403d2860a799j28263k1122j0682Q0839C0111J166
$$ -179449 22132 -75404 136403 -42860 -1799 -130062 -151184 -161866 -81027 30111 31277
18338C1277J17469a24449k67660i0650b3969k36779C04535b55050b6752I7161
$$ 31277 148746 -124449 -392109 -90650 -23969 -260748 304535 -255050 -26752 97161
18327B45J45581b47729E6590M7956B1978G671a5813r6204C0643K65012d10102
$$ 245 145826 -247729 56590 104546 21978 7671 -15813 -112017 30643 295655 -410102
18315H4913A8927J02536k1281c2029k70269d6702J5360r20D2478k0269a35427
$$ 84913 18927 121463 100182 -32029 -302298 -46702 -31342 -32262 42478 22209 -135427
18303d9307A81920a8918j28265c7552k93313a35284l4459B85336b48618F1267
$$ -49307 181920 -18918 -147183 -37552 -330865 -135284 -169743 285336 -248618 61267
18292a26023q1523H6584K12683F5207A3658J12327a04976L8975a568A13518O4881
$$ -126023 -207546 86584 299267 65207 13658 125985 -104976 -66001 -1568 113518 178399
18281A78399O3849n980R1781C1403e4196G8754J37850f4763r2179l46950f6211
$$ 178399 242248 236268 328049 31403 -54196 78754 216604 -64763 -156942 -503892 -66211
18269a95763a2696p2352k6153c3352I0657a00576A46396e6894l35192d7487A59300
$$ -195763 -12696 -85048 -111201 -33352 90657 -100576 146396 -56894 -392086 -47487 159300
18257e0207j5579p142a5940A719K60998D7089I959a5971p5371G1720c64545a01087
$$ -50207 -65786 -72928 -15940 1719 262717 47089 9959 -15971 -91342 71720 -364545 -101087
18244a61316B25113d6229H368N1977e02609A63607m4813f9473k07765b2209A57212
$$ -161316 225113 -46229 8368 60345 -502609 163607 118794 -69473 -277238 -22209 157212
18232a23062c8279B4228H554b91363E5141K74509d7862l06876F665c43697A53289
$$ -123062 -38279 24228 8554 -291363 55141 329650 -47862 -354738 6665 -343697 153289
18220a70140I0188C7475J7630P4658c3753r9598B03032m029D8298n884h726l97444
$$ -170140 90188 37475 55105 129763 -33753 -133351 203032 199003 48298 42414 -8726 -406170
18208d06170a38625A18543l1564j6076j7894k6303b00470L9392j68192f0765D3625
$$ -406170 -138625 118543 86979 70903 53009 26706 -200470 -161078 -329270 -60765 43625
18196D592b31528c9391A00418a20758j52014B26871H5755c1744p4827A67570N6578
$$ 4592 -231528 -39391 100418 -120758 -272772 226871 85755 -31744 -106571 167570 224148
18185B24148e0935J4635A66710e651A23541d97757f4059l9554q2919B34731b43705
$$ 224148 -50935 -36300 166710 -5651 123541 -497757 -64059 -103613 -186532 234731 -243705
18173A83077i7232l08897C9739a37642A52451b0261A47555m1132r798O9793e6295
$$ 183077 -97232 -406129 39739 -137642 152451 -20261 147555 106423 96625 166418 -56295
18161A02581A4630K50706H5128b79949e1888K26l0655m594m14470F8702b22130
$$ 102581 14630 265336 85128 -279949 -51888 -51662 -82317 -86911 -501381 68702 -222130
18149b61059B94843a69886B71055F508b71722a16900k3923d2673j25723A37727
$$ -261059 294843 -169886 271055 6508 -271722 -116900 -140823 -42673 -168396 137727
18138A57038l3749M7021a75485A15289I73f6672c2195A75186a46851M3625A6752
$$ 157038 123289 170310 -175485 115289 973 -66672 -32195 175186 -146851 -103226 16752
18126B12879b49147C22519A25176c40646B23461N8021a88519j6814F4012K05353
$$ 212879 -249147 322519 125176 -340646 223461 281482 -188519 -205333 64012 269365
18116B69365c2613k52283A70237b37437d7895k59906i8360J0054B58873b03765
$$ 269365 -32613 -284896 170237 -237437 -47895 -307801 -98360 -88306 258873 -203765
18105B418b6925A63638j8434J16636c90537J83038l3039b6311A19843n4814e0348
$$ 2418 -26925 163638 145204 261840 -390537 -207499 -240538 -26311 119843 65029 -50348
18093b77070h5157L3263j5041k98405h8960B05436a41770G7633P4468C3532a31370
$$ -277070 -85157 -51894 -66935 -365340 -88960 205436 -141770 77633 152101 33532 -131370
18081a01552r0716j9509j01816G2672J19802L2449a01598H6661a82931A05579
$$ -101552 -192268 -211777 -313593 72672 192474 224923 -101598 86661 -182931 105579
18070h2650A4365J80848H41b21112i4881B4598J39277B8594N2525d2107m05338
$$ -82650 14365 195213 841 -221112 -94881 24598 163875 28594 81119 -42107 -447445
18059d47445a91568e4429r6076A90675G0394a3731A27340l5601j5450D292K96207
$$ -447445 -191568 -54429 -150505 190675 70394 -13731 127340 91739 76289 4292 300499
18048C00499b67323b6158A47601b09542Q3563A78533a12281B64232Q1955A43165
$$ 300499 -267323 -26158 147601 -209542 -125979 178533 -112281 264232 346187 143165
18037B55972K0946A1730b9629A8661g5871A08842a91846n570f4652A33953c59224
$$ 255972 276918 11730 -29629 18661 -75871 108842 -191846 -197416 -64652 133953 -359224
18025G7920J10499f932A40343b42203A40013l7684j4708K34793m904b75220a14458
$$ 77920 188419 -6932 140343 -242203 140013 102329 87621 322414 317510 -275220 -114458
18013a19570d8745r9895N5497k4159A4230b22012A74692a1421j90381h9300k36580
$$ -119570 -48745 -148640 -93143 -117302 14230 -222012 174692 -11421 -201802 -89300 -325880
18002c25880A166J8415K41491A4426N1482Q5078K3592b4953n7044A99989b39657
$$ -325880 1166 19581 261072 14426 65908 150986 174578 -24953 -81997 199989 -239657
17990a92981B83210c58218a74239A26200b28886j25445b7407A33700a67397A43547
$$ -192981 283210 -358218 -174239 126200 -228886 -354331 -27407 133700 -167397 143547
17979a36580k59895J23134a32425C9548J82492C602d40359i1381B22034J61132
$$ -136580 -396475 -273341 -132425 39548 222040 3602 -440359 -91381 222034 383166
17969C83166b85108A95938d19782A00097j7718b53162L2346i0220H6827a11066
$$ 383166 -285108 195938 -419782 100097 82379 -253162 -220816 -90220 86827 -111066
17958B51341I4852g2096B67901a2910A52070a1810F5767C1432i9120F678a15474
$$ 251341 94852 -72096 267901 -12910 152070 -11810 65767 31432 -99120 6678 -115474
17946D465K23536f1161E7835B6638M1198a79646D0818a88850P1475F2606K0994
$$ 4465 228001 -61161 57835 26638 67836 -179646 40818 -188850 -117375 62606 83600
17935H3600K1583C5040b3328A6328O2767C4543K87760I8384b1265j49116A01806
$$ 83600 105183 35040 -23328 16328 79095 34543 322303 98384 -21265 -170381 101806
17923B4739a80880c888j857j73392d5903p3120p6664A22955N121J9075b51618
$$ 24739 -180880 -3888 -5745 -179137 -45903 -119023 -195687 122955 128076 147151 -251618
17911G2465B4971J38525n4632c2065F1285b16007j9304m9469E7836a52625A28717
$$ 72465 24971 163496 108864 -32065 61285 -216007 -235311 -284780 57836 -152625 128717
17899b10518A97137e2077A45145n8772J44172A10616J20439p1370M2289b76022
$$ -210518 197137 -52077 145145 86373 230545 110616 231055 159685 201974 -276022
17888a6785A14232a58430H5481L9051C9510c15153N49a36747j52018B89319q0682
$$ -16785 114232 -158430 85481 124532 39510 -315153 -314604 -136747 -288765 289319 208637
17877B08637a26919A4755a20265M109G7808a9934C2324J01576N615J47002h629
$$ 208637 -126919 14755 -120265 -116156 77808 -19934 32324 133900 139515 286517 -8629
17865f7941D8139a09550c3815E22947b6071P915q9524A90878D3862b48386A7968
$$ -67941 48139 -109550 -33815 522947 -26071 -18156 -107680 190878 43862 -248386 17968
17853A47724b40923A31502c23252e6707A41843F1329J27565b75520J28207P2355
$$ 147724 -240923 131502 -323252 -56707 141843 61329 188894 -275520 -147313 -74958
17843g4958o5215L8476H0070i3213j94746d9908J9023A06504J38595O4182I5703
$$ -74958 -140173 -101697 80070 -93213 -287959 -49908 -30885 106504 245099 309281 95703
17831d08593G8248L3536M1382g2480o527K642B21927i2605A52810a8106j51390
$$ -408593 78248 111784 153166 -72480 -79007 -76365 221927 -92605 152810 -18106 -169496
17820a69496B95082C7784K47429G6251K01754D2452P5803a02036o4336b8391e997
$$ -169496 295082 37784 285213 76251 278005 42452 118255 -102036 -166372 -28391 -5997
17808b26539A72186a31303f0253I5429J00513g9279j22453K1745j32073J45121
$$ -226539 172186 -131303 -60253 95429 195942 -79279 -201732 -179987 -312060 -166939
17798a66939f7697B42058h8937k34406g749l02560J23930b4469A60813a30690
$$ -166939 -67697 242058 -88937 -323343 -7749 -310309 -186379 -24469 160813 -130690
17787I6093c9988m5561B73112j08182a32214M6179C95133b10897i3438D18410
$$ 96093 -39988 -85549 273112 164930 -132214 -86035 395133 -210897 -93438 418410
17776a94528b8744F2731J26603c6564j43371P5654a444k22199E1710a78485B00859
$$ -194528 -28744 62731 189334 -36564 -179935 -104281 -1444 -223643 51710 -178485 200859
17764E1690B5706b37065A74193d193B04713p455a2602D6402b69740E6966b9239
$$ 51690 25706 -237065 174193 -4193 204713 197258 -12602 46402 -269740 56966 -29239
17752c05579b211G0585a45932m0997F559K8890P7670e2640A06480b98233a29370
$$ -305579 -2211 70585 -145932 -186929 6559 35449 113119 -52640 106480 -298233 -129370
17740B4798M9416b13353a4079A5591K37444L6486m3156F8380a3173j64209o9298
$$ 24798 74214 -213353 -14079 15591 253035 289521 246365 68380 -13173 -177382 -246680
17729b46680B49761a42463a4755N181B6667J95442c1704m2856A16681n7240B3923
$$ -246680 249761 -142463 -14755 -9574 26667 222109 -31704 -74560 116681 59441 23923
17717A69941J0258l1315a05347A98895j7350a38251J6201p4508B05103K1785b07954
$$ 169941 180199 148884 -105347 198895 181545 -138251 -122050 -196558 205103 226888 -207954
17705b14428L7461B62716D4981g6657k0140k04574I737B935a11351J6939F2046
$$ -214428 -176967 262716 44981 -76657 -96797 -301371 9737 2935 -111351 -94412 62046
17693F654a20077B61836f2535r8160A27712E7771c8589k24385e9273A41169a0854
$$ 6654 -120077 261836 -62535 -160695 127712 57771 -38589 -262974 -59273 141169 -10854
17681C8855d76612a63573j45577B03649o3211c20691A77095c14029A76997F8139
$$ 38855 -476612 -163573 -309150 203649 140438 -320691 177095 -314029 176997 68139
17670c9105A3599J26500a20291A00390E0167J39172o9485b74999C28862a66756
$$ -39105 13599 140099 -120291 100390 50167 189339 119854 -274999 328862 -166756
17659C6907b12666B77127a05139B28616e88191a45480B62790p2031L387a19209
$$ 36907 -212666 277127 -105139 228616 -588191 -145480 262790 190759 194146 -119209
17648D99147H5344C4879b17140k6392Q7730l3579q533P9673d3820A54494e5610
$$ 499147 85344 34879 -217140 -243532 -155802 -189381 -197914 -118241 -43820 154494 -55610
17636D2426a20707B29802i5867A16037g4961C3543a1592j22428F0532K76201J06929
$$ 42426 -120707 229802 -95867 116037 -74961 33543 -11592 -134020 60532 336733 443662
17625D43662b12415j30920d3181C48773A06754g5969E4754f8587j9871A41879
$$ 443662 -212415 -343335 -43181 348773 106754 -75969 54754 -68587 -88458 141879
17614A03634e4897j83703f2796A31767a56108E9564J87211a06437A38698J57621
$$ 103634 -54897 -238600 -62796 131767 -156108 59564 246775 -106437 138698 296319
17604B96319A18070i792B11117a6608A44607e1634a1335k12909A47667c33945
$$ 296319 118070 -9792 211117 -16608 144607 -51634 -11335 -224244 147667 -333945
17593C4586c5126j5019B09898O7191a48112I7887h9777K8892f405B9394RL4320
$$ 34586 -35126 -50145 209898 277089 -148112 97887 -89777 -60885 -6405 29394 29403 63723
17581F3723Q9998p0887b87396A1723d11j75201I2676J91263B6508K72582A3039
$$ 63723 153721 82834 -287396 11723 -411 -175612 92676 283939 26508 299090 13039
17569A3870K9809a90175B01010L6438A4680b17057M6506A72155a25679e3743B27229
$$ 13870 43679 -190175 201010 237448 14680 -217057 -170551 172155 -125679 -53743 227229
17557F9527K98341b6408B90557m6677J5925a57641C23871b36422B65830a1468
$$ 69527 367868 -26408 290557 243880 259805 -157641 323871 -236422 265830 -11468
17546I0274J35116G9412L43463A997b27222E2560J43680h1741A11305Q5119A8256
$$ 90274 225390 79412 422875 1997 -227222 52560 196240 -81741 111305 196424 18256
17534a5222A06819a6429C38674m2287b242C55742b8925E0088j2769K45454a51216
$$ -15222 106819 -16429 338674 296387 -2242 355742 -28925 50088 37319 282773 -151216
17522D71712j92944k2459j26366h3812A89198i7029A51783D7094j5148Q2722d0574
$$ 471712 278768 256309 129943 -83812 189198 -97029 151783 47094 31946 114668 -40574
17510C73553m5592c11062J663a31374C09555A31633K7249J92077a145A12525f2005
$$ 373553 327961 -311062 -309399 -131374 309555 131633 158882 350959 -1145 112525 -62005
17498a04587p1807B06823H6166a50649j73487I6888j0328q437J65962a05886L3728
$$ -104587 -176394 206823 86166 -150649 -324136 96888 86560 78123 244085 -105886 -72158
17487g2158A11852a1577A06901K65501a18927j3875a5475B7633i9180l5676C62714
$$ -72158 111852 -11577 106901 372402 -118927 -132802 -15475 27633 -99180 -134856 362714
17475B48141k0870M3314I066J28650J156a26973B99301B5202GJ32238i9351F0257
$$ 248141 227271 270585 9066 137716 138872 -126973 299301 25202 7 132245 -99351 60257
17462B39194p5380G7145K3521J05070f2130B70669j34840J08324g7258F8148h8232
$$ 239194 163814 77145 100666 205736 -62130 270669 135829 244153 -77258 68148 -88232
17450A94025j1844b29766D8435J42130p0970B9502K89011a22128b6089B55057
$$ 194025 182181 -229766 48435 190565 119595 29502 318513 -122128 -26089 255057
17439C58266J09267A82075L41606G4649K97174A15012L18917K7721F3880a73456
$$ 358266 467533 182075 523681 74649 371823 115012 433929 461650 63880 -173456
17428B06778N1360P3017F7835M05565a21591B60776P2341G6999J05864P2692n3165
$$ 206778 258138 331155 67835 473400 -121591 260776 333117 76999 182863 255555 202390
17417B02390E8028K7896i5077M111D31682A22829Q7226o4660L19228k1732A74028
$$ 202390 58028 85924 -95077 -90966 431682 122829 210055 145395 464623 442891 174028
17405F2504n628O13338l08714A25887J19783P3140A08001A720J13929K71544A87658
$$ 62504 56876 670214 361500 125887 245670 318810 108001 1720 115649 387193 187658
17393A12595P8515K3685p7371j1639K51926g2533B65139a41214A43017K9478o6267
$$ 112595 191110 214795 137424 125785 377711 -72533 265139 -141214 143017 172495 106228
17382A06228l1953K16202I9624J51771a56724C53313m39q2946a22642B17801R5700
$$ 106228 74275 290477 99624 251395 -156724 353313 352874 269928 -122642 217801 313501
17371C13501a65106B7227g2854B21769I7990J17450m3324n1485a29849j16554
$$ 313501 -165106 27227 -72854 221769 97990 215440 172116 120631 -129849 -246403
17361b46403d1802B39195a5636B37149b9967A71951c7389A42634l2626J17308
$$ -246403 -41802 239195 -15636 237149 -29967 171951 -37389 142634 110008 227316
17351B27316a69817C5372J73699h5118F40218B38878n8378c319B63171c1153E9671
$$ 227316 -169817 35372 209071 -85118 640218 238878 180500 -3319 263171 -31153 59671
17339C53627A52453c21574C44606C1763M50492r9105C1299L93213j88979b03058
$$ 353627 152453 -321574 344606 31763 482255 383150 31299 424512 235533 -203058
17328i0993F6663A617N71819A55322O4798l5715J34576J21230j79733a8784A83705
$$ -90993 66663 1617 573436 155322 220120 184405 318981 440211 260478 -18784 183705
17316B14929n9443N3905p4627L1292B874a75841B45966J8192H4223C0955K00909
$$ 214929 155486 209391 134764 166056 2874 -175841 245966 264158 84223 30955 231864
17305B31864O8541i6765E049J89200J40923i9497c4315H1373M9626i9290k33916
$$ 231864 300405 -96765 5049 194249 335172 -99497 -34315 81373 130999 -99290 -333206
17294c33206H5700a36841A58507c0762A25896c4528C01984j1847a43751B13052
$$ -333206 85700 -136841 158507 -30762 125896 -34528 301984 290137 -143751 213052
17283I7855N240L7893o5985A0676J40849a23531A6763J16342P3713e8107A86091
$$ 97855 103095 140988 75003 10676 151525 -123531 16763 133105 206818 -58107 186091
17271E7411b08034q1172B34872J01439j14292e0456C23544a13375B78412M931
$$ 57411 -208034 -289206 234872 336311 222019 -50456 323544 -113375 278412 283343
17261B83343A4638c2142C32261j03741e3644C44552j40652R527i9489A11044R8212
$$ 283343 14638 -32142 332261 228520 -53644 344552 203900 213427 -99489 111044 209256
17250B09256j03542N110K93868a2144F2139Q6939J68875C0079J82585a1017C56009
$$ 209256 105714 110824 404692 -12144 62139 149078 317953 30079 212664 -11017 356009
17238B10759r3375L797P8561L1347C6133j938b1718B04369F4525j0337M70798
$$ 210759 117384 121181 199742 231089 36133 34195 -21718 204369 64525 54188 524986
17227E24986k19598n2114F664J87808J38731c7290D94016G3393I271M14175a07228
$$ 524986 305388 253274 6664 194472 333203 -37290 494016 73393 9271 423446 -107228
17215A40466M7960q090l6304F9735K57456j21397N8582H8525K31468A28935K15692
$$ 140466 188426 180336 144032 69735 327191 205794 264376 88525 319993 128935 344627
17204C44627j27907K60439j45626A3154J50643R0178M1082q6179F2838K65556
$$ 344627 216720 477159 331533 13154 163797 253975 295057 208878 62838 328394
17194C28394p2030a6729B59033n8244d8637A35016K2724K3396L97605B31567A6226
$$ 328394 256364 -16729 259033 200789 -48637 135016 157740 181136 578741 231567 16226
17182D4063L39941I8427K48761A39043P3022F2177N3221R4809K19838A59706L05150
$$ 44063 384004 98427 347188 139043 212065 62177 115398 210207 430045 159706 464856
17171D64856H3701J97912k3835M0178A20347J48889D1331J54355K17831E2075
$$ 464856 83701 281613 257778 297956 120347 269236 41331 195686 413517 52075
17160B79020j26299K31232m4615p4890J32278A68796R244L56881B37871R8617
$$ 279020 152721 383953 339338 264448 396726 168796 178040 534921 237871 336488
17150C36488R4931p9145A65337K65482A85472A0633N11593A26779J08042j1132
$$ 336488 431419 352274 165337 430819 185472 10633 522226 126779 234821 223689
17140B23689K25531m9157A58387K29895J01372k39446N6944o6160a29799D2973
$$ 223689 449220 400063 158387 388282 489654 250208 307152 240992 -129799 42973
17129C14078j38639L09635j15484k5745J48113q1142a71670E16516m7470B32772
$$ 314078 175439 485074 369590 343845 491958 410816 -171670 516516 469046 232772
17118D00985j53743J60741j9908j72874J02036L26908k51151j1309m9853d1762
$$ 400985 247242 407983 388075 215201 317237 644145 392994 381685 331832 -41762
17107D42556n0253j08946A31399L30960J47208C9938L0153L04801A09091L37746
$$ 442556 392303 283357 131399 462359 609567 39938 70091 374892 109091 446837
17097D46837r5869I2544j7930K04436M21697C14710r7142J33325K63330A17209
$$ 446837 350968 92544 74614 279050 700747 314710 217568 350893 614223 117209
17086C26243O0556P6353j52399L5087J92816A30826J60595J73675k02180K99735
$$ 326243 386799 463152 310753 345840 538656 130826 291421 465096 262916 562651
17076E62651A35571M13633j78689j06945D0102Q7321K75170j0107A82686Q2455
$$ 562651 135571 549204 370515 263570 40102 127423 402593 392486 182686 265141
17066B65141R2608p1298K00068A96908K70386J24087B28923M88520B44465K50162
$$ 265141 357749 286451 486519 196908 467294 591381 228923 717443 244465 494627
17056D94627q0748Q5727g3905D75479k00502K40751B15628J61428J30902n9119
$$ 494627 413879 499606 -73905 475479 274977 515728 215628 377056 507958 448839
17046D48839K9720K23422C19823K94319p5293L0835B22211J67136L91033k36115
$$ 448839 478559 701981 319823 614142 538849 569684 222211 389347 780380 544265
17036E44265L2042L0382B52942M79465j41185j84764K4626J34677B59158L66713
$$ 544265 576307 606689 252942 732407 591222 406458 431084 565761 259158 625871
17026F25871j58350M6822m1009j00897J97288j68270K33768k82900P408M08845
$$ 625871 467521 514343 473334 372437 569725 401455 635223 352323 359731 768576
17016G68576l15838J29666j72288L15666k34966L75894l91617K57968C50545L89545
$$ 768576 452738 582404 410116 725782 490816 866710 475093 733061 350545 740090
17006G40090l15009J11221Q3086P3217r9099j65601K64242j75629L77090k81526
$$ 740090 425081 536302 619388 692605 593506 427905 692147 516518 893608 612082
16996F12082m2430J34373j2563j58348J90305j19878j08468J84691n516k97110
$$ 612082 569652 704025 691462 533114 723419 603541 495073 679764 674248 377138
16986C77138N22537l17438J17590P1336j0975p8292J24575J59632j05794D00424
$$ 377138 899675 582237 699827 771163 760188 681896 806471 966103 860309 400424
16975I38199D00848K57970N5829k58596L49933l47428M12434k06138k3252P1974
$$ 938199 400848 658818 714647 456051 805984 458556 870990 664852 641600 713574
16965G13574O0084R5897n2885J2501N5364k20032J78830j17354L7900K29679l8337
$$ 713574 773658 869555 816670 829171 884535 664503 843333 725979 763879 993558 955221
16954I55221l9438j0672k55778M62484p3812l02710K64049k43051M28390k2293
$$ 955221 915783 905111 649333 1111817 1038005 735295 999344 756293 1184683 1162390
16944A162390j59894k00409L9885j55080M73605j31453m3081L4548j69420O5594
$$ 1162390 1002496 802087 841972 686892 1160497 1029044 985963 1020511 851091 916685
16934I16685n1122L42086r0979j69027M39007k67913k83201N83566j34241q9640
$$ 916685 865563 1207649 1116670 947643 1386650 1118737 835536 1419102 1284861 1195221
16924A195221k4773J44230k17379M40481m81383K09977n6060n0721j83741N2467
$$ 1195221 1170448 1314678 1097299 1537780 1056397 1266374 1210314 1159593 975852 1028319
16914A028319J50544k40241K67227j85081J88167k03475N56898k93757J65743
$$ 1028319 1178863 938622 1205849 1020768 1208935 1005460 1562358 1268601 1434344
16905A434344j90574J74152J67176m283l46902J14870J89738K62548l12661k18429
$$ 1434344 1243770 1417922 1585098 1580815 1233913 1348783 1538521 1801069 1488408 1269979
16895A269979J20019L01874j94109J0365J15780k94723M959O1000K40968k03205
$$ 1269979 1389998 1691872 1497763 1508128 1623908 1329185 1334144 1395144 1636112 1432907
16885A432907P5010L1567M81785j74198M7333k87561j31973P88401m51113J48187
$$ 1432907 1507917 1539484 2021269 1847071 1894404 1606843 1474870 2263271 1812158 1960345
16875A960345j29944J16784L0406k0618R9941o2499L52137k05872k84636L41817
$$ 1960345 1830401 1947185 1977591 1956973 2056914 1994415 2346552 2140680 1856044 2197861
16865B197861N7092l30007K25478p9912K11903n12143O77755k63700k02121K81537
$$ 2197861 2254953 1924946 2150424 2070512 2282415 1770272 2448027 2184327 1982206 2263743
16855B263743J04781J1828K53762m92061K22192K70955Q9311N0486K02364J5469
$$ 2263743 2368524 2380352 2634114 2142053 2364245 2635200 2724511 2774997 2977361 2992830
16845B992830l20913N6613J65223R7147j70681K98945j50163J51149j52478K43932
$$ 2992830 2671917 2728530 2893753 2990900 2820219 3119164 2969001 3120150 2967672 3211604
16835C211604J4749M2688j8292K50075n9191J46672l0982L1806J22513j80503
$$ 3211604 3226353 3269041 3250749 3500824 3441633 3588305 3557323 3589129 3711642 3531139
16825C531139K52353L6340n6431P7712K233L96828j47605J60304J26636p8288
$$ 3531139 3783492 3819832 3763401 3841113 3843346 4240174 4092569 4252873 4379509 4301221
16815D301221L40693m03119K37046K54969M7024K66130j00177K45367k0611R7840
$$ 4301221 4641914 4238795 4475841 4730810 4777834 5043964 4943787 5189154 5168543 5266383
16805E266383L98786J72063O1948k19977J28546J50767J63645M2375r5649M29897
$$ 5266383 5665169 5837232 5899180 5679203 5807749 5958516 6122161 6164536 6068887 6498784
16795F498784K33210j22809N97852j79886j69650L06214M63248L62610j20347
$$ 6498784 6731994 6609185 7207037 7027151 6857501 7163715 7626963 7989573 7869226
16786G869226K02078K21074M53884j27834K84592K14229L07620L03264K02765
$$ 7869226 8071304 8292378 8746262 8618428 8903020 9117249 9424869 9728133 9930898
16777I930898K73522L26029j35326P66050K97562O64788l07232K56705N55084
$$ 9930898 10204420 10530449 10395123 11161173 11458735 12123523 11816291 12072996 12628080
16768A2628080L56703N22391M32024M03850M48293K96129N62506O83699O21600
$$ 12628080 12984783 13507174 13939198 14343048 14791341 15087470 15649976 16333675 16955275
16759A6955275N30589O25664O75250L93691Q14687O32312J047094P12283J081490
$$ 16955275 17485864 18111528 18786778 19180469 19995156 20627468 21674562 22386845 23468335
16750B3468335N46581J113437J156562J396722P94621J432257J068813J326278
$$ 23468335 24014916 25128353 26284915 27681637 28476258 29908515 30977328 32303606
16742C2303606J372192J639443J662621J741177K071925J900894K217471K341724
$$ 32303606 33675798 35315241 36977862 38719039 40790964 42691858 44909329 47251053
16734D7251053K562958K711416L044519K971900L348486L353123L385738M317733
$$ 47251053 49814011 52525427 55569946 58541846 61890332 65243455 68629193 72946926
16726G2946926M005813N050022N048268N142049N666843N971902O512208O488716
$$ 72946926 76952739 82002761 87051029 92193078 97859921 103831823 110344031 116832747
16718A16832747P126394P831234P467488P715801P614792Q404935P774956P272189
$$ 116832747 123959141 131790375 139257863 146973664 154588456 162993391 170768347 178040536
16710A78040536P752886O620099N790480M722848L709132J912152Q74837j291237
$$ 178040536 185793422 192413521 198204001 202926849 206635981 208548133 209422970 208131733
16702B08131733k023510l796241m805379n802711p115963p201185q128520p937655
$$ 208131733 206108223 202311982 197506603 191703892 184587929 177386744 169258224 161320569
16694A61320569q466553q300603q382351p939825p520587o921930p019753p119460
$$ 161320569 152854016 144553413 136171062 128231237 120710650 113788720 106768967 99649507
16686I9649507n664373n768047n532715m868814m957843m101080m037725m045163
$$ 99649507 93985134 88217087 82684372 77815558 72857715 68756635 64718910 60673747
16678F0673747l229627l406601k905937k678663k527702k903584k003596k444908
$$ 60673747 57444120 54037519 51131582 48452919 45925217 43021633 41018037 38573129
16670C8573129j210448k356015j625605j520448j340311j494155j255113j453657
$$ 38573129 37362681 35006666 33381061 31860613 30520302 29026147 27771034 26317377
16662B6317377q52496r98543p30354j383471q78085p45485j043093o20176p20494
$$ 26317377 25464881 24466338 23735984 22352513 21474428 20728943 19685850 19065674 18345180
16653A8345180n51185q93678k69217n43836o18754m13925q36251m02964j42944
$$ 18345180 17793995 16900317 16631100 16087264 15468510 15054585 14218334 13815370 13672426
16644A3672426o78650o6312o62178l8372m65955q38312m21763J27090k81621k39815
$$ 13672426 12993776 12927464 12265286 12226914 11760959 10922647 10500884 10627974 10346353 10106538
16634A0106538o40643j66870o27696R6247k29897K70287q35875r9181j4032k38338
$$ 10106538 9465895 9299025 8671329 8767576 8537679 8807966 7972091 7872910 7858878 7620540
16624G620540l81053k57231O6367n12239L79779l30649k43833o0894k71023K30030
$$ 7620540 7239487 6982256 7048623 6536384 6916163 6585514 6341681 6280787 6009764 6239794
16614F239794k63684k96488k35746m1011p8285l01040M11318m67906J67362m41432
$$ 6239794 5976110 5679622 5443876 5402865 5324580 5023540 5434858 4966952 5134314 4692882
16604D692882L83465k89732l22501l19288L03631q7744l16645l9432j98412j1299
$$ 4692882 5076347 4786615 4464114 4144826 4448457 4360713 4044068 4004636 3806224 3794925
16594C794925O1110r4585L9545j16334j69712L79867n21976O1096j98342l2246
$$ 3794925 3856035 3761450 3800995 3684661 3514949 3894816 3372840 3433936 3235594 3203348
16584C203348j01617k92561L07675j14042l7292O0345j02682J47710k93177m7735
$$ 3203348 3101731 2809170 3116845 3002803 2965511 3025856 2923174 3070884 2777707 2729972
16574B729972j1781l4864j31087L7666l18943J20023J9290K63206l71702p7772
$$ 2729972 2718191 2683327 2552240 2589906 2270963 2390986 2410276 2673482 2301780 2224008
16564B224008j95363L42398l74184M20730k27499P2785l09425N559K36881k64432
$$ 2224008 2028645 2371043 1996859 2417589 2190090 2262875 1953450 1959009 2195890 1931458
16554A931458p1976O4717k6115N5926l38064L92897k94517J47704k86458o3396
$$ 1931458 1859482 1924199 1898084 1954010 1615946 2008843 1714326 1862030 1575572 1512176
16544A512176j32748L09692K2591J56927K0928o4256m06563J70364Q76n2289j17653
$$ 1512176 1379428 1689120 1711711 1868638 1889566 1825310 1418747 1589111 1589987 1537698 1420045
16533A420045r5267l29418N30217P8237k09282K038j35782Q003J94275l54347
$$ 1420045 1324778 995360 1525577 1603814 1394532 1396570 1260788 1268791 1463066 1108719
16523A108719J97945l08072L99382j91841K8397J29744o8208m9091j89023J25875
$$ 1108719 1306664 998592 1397974 1206133 1234530 1364274 1296066 1246975 1057952 1183827
16513A183827l36537J32687j01334n9652L07899j2733J29527K6495p3320o1151
$$ 1183827 847290 979977 878643 818991 1126890 1114157 1243684 1270179 1196859 1135708
16503A135708l84757J27076Q3854K19981j48992j32394L17729p2478m92418M6775
$$ 1135708 750951 878027 961881 1181862 1032870 900476 1218205 1145727 653309 700084
16493G00084N204K27237Q05n0667l87814M36719J90563l78179J7112L11065n4608
$$ 700084 705288 932525 933330 882663 494849 931568 1122131 743952 761064 1072129 1017521
16482A017521D93472J5910N89454j40195K5476l73107m8894M51617l44145L87094
$$ 1017521 493472 509382 1098836 958641 984117 611010 562116 1013733 669588 1056682
16472A056682n1420j62983k49283L08868j97304j4949k96398M29596l41999J00002
$$ 1056682 1005262 842279 592996 901864 704560 689611 393213 822809 480810 580812
16462E80812R4659K04285k03720j22672j13698L01975p5766M9765j33675m6526
$$ 580812 675471 879756 676036 553364 439666 741641 665875 715640 581965 535439
16452E35439m5247P1016p610Q6767m7238r4350k48783L11543j92161A63134K01532
$$ 535439 490192 561208 553598 640365 593127 498777 249994 561537 369376 163134 364666
16441C64666L08362j48046J7927j71589K69631N6508o3851B56548L76772j1780
$$ 364666 673028 524982 542909 371320 640951 697459 633608 256548 633320 621540
16431F21540M8913j23850r1396k4345N2282j77411L22037B13094J65229K2690
$$ 621540 670453 546603 455207 430862 483144 305733 627770 213094 378323 401013
16421D01013J88110k90658J14573F3306N76436r5706k05695n478A61230K47252
$$ 401013 589123 298465 413038 63306 639742 544036 338341 332863 161230 408482
16411D08482j33417j1186K22909j53504J78923l7737r4765K11628j82884N7050
$$ 408482 275065 263879 486788 333284 512207 474470 379705 591333 408449 465499
16401D65499j77591K62155n7351A20787J04573j11351L09556j47951j19392K12029
$$ 465499 287908 550063 492712 120787 225360 114009 423565 275614 156222 368251
16391C68251J26158j10347j1392J86558A54686J11346m4382J03736R993J0816
$$ 368251 494409 384062 372670 559228 154686 266032 221650 325386 335379 346195
16381C46195J86530j24233A20804K95488r2617j43808K7621n9356J7313j8181
$$ 346195 532725 408492 120804 416292 323675 179867 207488 148132 165445 147264
16371A47264J57434K0975m9433K1194J6091A25981M66599j20981A78809L8964
$$ 147264 304698 325673 276240 297434 313525 125981 592580 471599 178809 217773
16361B17773F7707J98316K63260j12023K8727j72270k9874R9880l4901A20195
$$ 217773 67707 266023 529283 417260 445987 273717 243843 343723 308822 120195
16350A6917M8720k3961L47504R4666B10655K31014A6900n210J38220J31433M6972
$$ 16917 65637 41676 389180 483846 210655 441669 16900 11690 149910 281343 328315
16339C28315c22352C22474H5057n88K24234A29655O6371c6587B0138o925L52642
$$ 328315 -322352 322474 85057 84469 308703 129655 196026 -36587 20138 13213 365855
16328C65855G2664J60090l5155H9796K40820n6060a60945I4895B7801Q348K8355
$$ 365855 72664 232754 197599 89796 330616 274556 -160945 94895 27801 36149 64504
16317F4504a08863B41879N9258N7091O4006a7450E04416B21025b36486A53411
$$ 64504 -108863 241879 301137 358228 422234 -17450 504416 221025 -236486 153411
16306D97489F7387J44011K18372o8103p0164r722N039C6363c00588A09914a43375
$$ 497489 67387 211398 429770 361667 291503 281781 286820 36363 -300588 109914 -143375
16294B18872g9915C08251B6298J66666C1524K43549j24584J75727o1377D4220
$$ 218872 -79915 308251 26298 192964 31524 275073 150489 326216 264839 44220
16283D2402J9007K69002K935a8420D45937j62903I5413Q4688d6156B663a3536
$$ 42402 61409 330411 333346 -18420 445937 283034 95413 180101 -46156 2663 -13536
16271A15757J3864P8469B0446L01300a33B14523I9971j4542A486a19778H7667
$$ 115757 129621 208090 20446 321746 -133 214523 99971 85429 1486 -119778 87667
16259A36970a18139C8904K71435e6007A11263J85262g3918C15007a6669j6177
$$ 136970 -118139 38904 310339 -56007 111263 296525 -73918 315007 -16669 -32846
16249c2846k72797j49376C45782j01030a27358j60233A81407J4463H6121L8686
$$ -32846 -305643 -455019 345782 244752 -127358 -287591 181407 195870 86121 124807
16239A24807d4017G0630K1851d299A46520J28575a68180A74449a61221A41904
$$ 124807 -44017 70630 92481 -4299 146520 275095 -168180 174449 -161221 141904
16228B46284b12992B36331p2095K5180J48142i7155p095B15377A6855P9251l0901
$$ 246284 -212992 236331 164236 189416 337558 -97155 -104250 215377 16855 96106 65205
16217F5205B4460K11005l3183h0011j20981E3423d5451j64598G935Q9607m7990
$$ 65205 24460 235465 202282 -80011 -200992 53423 -45451 -210049 7935 97542 49552
16206D9552O6561g7724B76327c6660C31603q8570f5989H0907J45643L9983j30489
$$ 49552 116113 -77724 276327 -36660 331603 243033 -65989 80907 226550 266533 136044
16195A36044L611a62716c059k02449A4610N31327f4979A22115J77565a95750D2042
$$ 136044 139655 -162716 -3059 -205508 14610 545937 -64979 122115 299680 -195750 42042
16183B43452n6569o8310O5273b58596C44457K6816A8514h0015j05108o9934B22062
$$ 243452 186883 118573 183846 -258596 344457 371273 18514 -80015 -185123 -255057 222062
16171A19316d4049o1989A03844J18931a16828B14057b6150K941k37768E1843g8570
$$ 119316 -44049 -106038 103844 222775 -116828 214057 -26150 -23209 -260977 51843 -78570
16159G5215a59717A85782c4756C9196P5928q797i9851A6623g4341B4885e8837
$$ 75215 -159717 185782 -34756 39196 115124 106327 -99851 16623 -74341 24885 -58837
16147C4414a79602O2607K0787E3436d9306C0547b10990F4056J14520a94125Q5616
$$ 34414 -179602 -116995 -96208 53436 -49306 30547 -210990 64056 178576 -194125 -108509
16136a08509G8548K3732D2784c8829C7128M07102F6225e3594A58077b56653C23237
$$ -108509 78548 102280 42784 -38829 37128 444230 66225 -53594 158077 -256653 323237
16124D23274a4158n8531K7147j92276J16182l2421G2724B4205b2102q5930j66688
$$ 423274 -14158 -72689 -45542 -237818 -121636 -154057 72724 24205 -22102 -108032 -274720
16113b74720E5840J62830o7210b54187N0070h7699n7587f4193A17754g0959k1433
$$ -274720 55840 218670 151460 -254187 -204117 -87699 -145286 -64193 117754 -70959 -92392
16102i2392A40148B7831c33386A8301O3204a85211E2347a01860m7956L0908c6455
$$ -92392 140148 27831 -333386 18301 81505 -185211 52347 -101860 -149816 -118908 -36455
16090G3937b32932I6074K04529A22813R3159a4836A9329J08963a76230K0468j62224
$$ 73937 -232932 96074 300603 122813 215972 -14836 19329 128292 -176230 -155762 -317986
16079c17986A60737a73775D260O8035d1583j59285A40444b18145D3653J8476e7858
$$ -317986 160737 -173775 4260 72295 -41583 -200868 140444 -218145 43653 62129 -57858
16067A8663L41343c16458e4915p4709B78912c06133e3997a2448o8246l64731D06027
$$ 18663 360006 -316458 -54915 -129624 278912 -306133 -53997 -12448 -80694 -445425 406027
16055B42362d4333Q100J5339j97441A85483G7998d19207I911b7524B5422K30419
$$ 242362 -44333 -36233 -20894 -218335 185483 77998 -419207 9911 -27524 25422 255841
16044B55841E844c60916I3496J19619D012i7813R156K0973j3160E6503a13951
$$ 255841 5844 -360916 93496 213115 4012 -97813 -88657 -67684 -80844 56503 -113951
16032B89788i602A59871F7654r485P4900b03561g9427D3067A8580R3355h4391
$$ 289788 -9602 159871 67654 58169 133069 -203561 -79427 43067 18580 111935 -84391
16020f5209B64486L0757d39796B76493m0638D2223K08614G4127i9799k39938J03567
$$ -65209 264486 295243 -439796 276493 235855 42223 250837 74127 -99799 -339737 -236170
16009b36170P7457C7741O7183J67420d7482r4199J7588k1875O3425B9947e659
$$ -236170 -158713 37741 104924 272344 -47482 -141681 -124093 -145968 -82543 29947 -5659
15997f8209p1330L0389B12126d9018k21208A97382c4861G6918b95108B5028J85817
$$ -68209 -139539 -109150 212126 -49018 -270226 197382 -34861 76918 -295108 25028 210845
15986B10845b7736j60786k22688A22231a30879K6455G8641b2617j3155k84622
$$ 210845 -27736 -188522 -411210 122231 -130879 -104424 78641 -22617 -35772 -320394
15976c20394a02308A41574b42075B73493A5883K7240K41062o8347L16171B52648
$$ -320394 -102308 141574 -242075 273493 15883 43123 284185 215838 532009 252648
15965A02767R5043K3317J12519A66202G903g4141B16959b04309I6746A0695b23506
$$ 102767 197810 221127 333646 166202 7903 -74141 216959 -204309 96746 10695 -223506
15953a85307o1939f5171j20078k43958f331j42055q3933A3848L31584g5964m0257
$$ -185307 -247246 -65171 -185249 -429207 -6331 -148386 -232319 13848 345432 -75964 -116221
15942a16221A00353g0303k06514k22518e4519n669D445c38589B65516a23739d3614
$$ -116221 100353 -70303 -276817 -499335 -54519 -60188 4445 -338589 265516 -123739 -43614
15930h2243B32700b89653C2147c0542C1539b36470J00071r0070G1047k3950J65212
$$ -82243 232700 -289653 32147 -30542 31539 -236470 -136399 -226469 71047 47097 212309
15919B12309H3791m375Q555b8652k62828A88210a81706A63671e51701a28281J8431
$$ 212309 83791 79416 87971 -28652 -291480 188210 -181706 163671 -551701 -128281 -109850
15908a09850C32055a30121b9124j87842c2829j2895k6375j46204I7131J13879
$$ -109850 332055 -130121 -29124 -216966 -32829 -45724 -72099 -218303 97131 211010
15898B11010a1461m1632C3364J89161c61077J67790C7019b49283E7028c2914B61297
$$ 211010 -11461 -53093 33364 222525 -361077 -193287 37019 -249283 57028 -32914 261297
15886b32022L0372R6560j13674A19708g0816B3315R1460b39348e2696j13825d8777
$$ -232022 -201650 -105090 -218764 119708 -70816 23315 114775 -239348 -52696 -166521 -48777
15874c92423B99461j40664c22276j05825A29757e1575A1492c07264J15573R1498
$$ -392423 299461 158797 -322276 -428101 129757 -51575 11492 -307264 -191691 -100193
15864a00193K8243a6596J921l6824A7788a42017l0834H0819o18j7893b46621J05336
$$ -100193 -71950 -16596 -14675 -51499 17788 -142017 -172851 80819 80201 62308 -246621 -141285
15852a41285m607B2527b06255Q6490c7345k40151B27989c4931o5381A88813b54104
$$ -141285 -145892 22527 -206255 -119765 -37345 -277496 227989 -34931 -100312 188813 -254104
15840b37364I9586h2655l36701A23386M6933O8454a62882A2008Q80Q9605j1982
$$ -237364 99586 -82655 -419356 123386 170319 238773 -162882 12008 12888 102493 90511
15829I0511d67416b31945C359f3211n2750F5319a9068H7453J33120b1003r1186
$$ 90511 -467416 -231945 3359 -63211 -115961 65319 -19068 87453 220573 -21003 -112189
15818a12189A8805a25871b6316A57729b39784A51702B8556M1480b36280m5334
$$ -112189 18805 -125871 -26316 157729 -239784 151702 28556 70036 -236280 -281614
15808b81614F2811a5498l2782j23622F8803b67125c5295r9623B56720a85696C4842
$$ -281614 62811 -15498 -48280 -171902 68803 -267125 -35295 -134918 256720 -185696 34842
15796a14106b5685k77130J22580b4109A213L2330a01863B44683l0880b8957C86552
$$ -114106 -25685 -302815 -180235 -24109 1213 33543 -101863 244683 213803 -28957 386552
15784B3418L7205B6306K52881f8954F6876K8497K62961E4038i6061A2891K18717
$$ 23418 60623 26306 279187 -68954 66876 95373 358334 54038 -96061 12891 231608
15773B31608b30765a4595m76910a70957H9963c06855E424K03672q1827J91312
$$ 231608 -230765 -14595 -491505 -170957 89963 -306855 5424 209096 127269 318581
15763C18581a88313B30801g5292j31991B48472h7103k9591K7723C053g3268C7241
$$ 318581 -188313 230801 -75292 -207283 248472 -87103 -116694 -88971 3053 -73268 37241
15751a20817k85089A11529A5961N9729K0713c7227j40130b6399l6572B04353J08648
$$ -120817 -405906 111529 15961 75690 96403 -37227 -177357 -26399 -62971 204353 313001
15740C13001c38552a08235L0748H5920a7677p3634i220A0613b37233A14207a97922
$$ 313001 -338552 -108235 -77487 85920 -17677 -91311 -9220 10613 -237233 114207 -197922
15728E7034K807m22i9834E2368a00338o940B7383a87697A1616N4576a66309E1171
$$ 57034 59841 59419 -99834 52368 -100338 -107278 27383 -187697 11616 66192 -166309 51171
15715a87587k3537h1746B22292R0533a95914B9703P579a705k99239H6276i4576
$$ -187587 -211124 -81746 222292 312825 -195914 29703 37282 -1705 -300944 86276 -94576
15703h4181k4057q9106E0493K67251e7307D36165C1012a48081n4747c8081B5622
$$ -84181 -108238 -197344 50493 317744 -57307 436165 31012 -148081 -202828 -38081 25622
15691a89471k7672f3994A5523Q1425a67581G642B953d8522F8243h2796j02887
$$ -189471 -217143 -63994 15523 96948 -167581 7642 2953 -48522 68243 -82796 -185683
15680a85683f4851m7796c0757B79422M4715r4036d8554H6587b5371R329C47971
$$ -185683 -64851 -112647 -30757 279422 324137 230101 -48554 86587 -25371 -16042 347971
15668b51437d4926m0580j38929j85178J28410o3568i0647j60015e9500o8914G1534
$$ -251437 -44926 -85506 -224435 -409613 -281203 -344771 -90647 -250662 -59500 -128414 71534
15656A44481a27116F6126i9224l9730C177a78720g2396j8395A39448B9906c6727
$$ 144481 -127116 66126 -99224 -138954 3177 -178720 -72396 -90791 139448 29906 -36727
15644A76798G6871c5884k89096f2877b456k62575J29140n5178j63907A10449a54896
$$ 176798 76871 -35884 -324980 -62877 -2456 -265031 -135891 -191069 -354976 110449 -154896
15632B01964c25138f0219j75238e8561J1375l50632a80373a6449C0668R4351a52898
$$ 201964 -325138 -60219 -235457 -58561 -47186 -397818 -180373 -16449 30668 125019 -152898
15620a41320A33108b06179b9662j91418m8414f3724b0401E0033A3826a96961Q6944
$$ -141320 133108 -206179 -29662 -221080 -269494 -63724 -20401 50033 13826 -196961 -110017
15609a10017j59881J06762A89438a20821B63725n5040E9826b85880A14949Q9508
$$ -110017 -269898 -163136 189438 -120821 263725 208685 59826 -285880 114949 204457
15599B04457a57227N2448K9507G8061e7480O687A54521n5557a48362B54042G8022
$$ 204457 -157227 -104779 -75272 78061 -57480 -50793 154521 98964 -148362 254042 78022
15587B63069A5033g7836D1644b24904A83840J04444I6209J5616m7814m769b20810
$$ 263069 15033 -77836 41644 -224904 183840 288284 96209 111825 64011 59242 -220810
15575F3166J48139j01318A2883c00842O8002C68451G7527a08345c8780k97484
$$ 63166 211305 109987 12883 -300842 -232840 368451 77527 -108345 -38780 -336264
15565c36264B2056K91796g0003E5430p630e3393D2892a36747N9307n1155A50373
$$ -336264 22056 313852 -70003 55430 47800 -53393 42892 -136747 -77440 -128595 150373
15553A08783b88962c9808l60604A12057J11584a20874D4603L1254J96175d18948
$$ 108783 -288962 -39808 -400412 112057 223641 -120874 44603 75857 272032 -418948
15542G7804K26187K4974A07175n360a68165C7084a18501J7860B33596i9090L4120
$$ 77804 303991 328965 107175 101815 -168165 37084 -118501 -100641 233596 -99090 -64970
15531f4970K2193D58322F7626J26217b07222B38416A12613D7264a17539b9556
$$ -64970 -42777 458322 67626 193843 -207222 238416 112613 47264 -117539 -29556
15520e9932J699B2707a73596A04605a31648j37784P4860B28209B8604J11718b85273
$$ -59932 -58233 22707 -173596 104605 -131648 -269432 -194572 228209 28604 140322 -285273
15508c06329J31498K3766P2442K804l10552A56359b29578C63156A07777a01856
$$ -306329 -174831 -151065 -78623 -75819 -386371 156359 -229578 363156 107777 -101856
15497A83725b12228a3217A81234a33742k77550B21435J17643i6791D75a79250
$$ 183725 -212228 -13217 181234 -133742 -411292 221435 339078 -96791 475 -179250
15486a7453F9580i5272B28828b9023E0958i7552b2555l0659I1868k646B2604J92395
$$ -17453 69580 -95272 228828 -29023 50958 -97552 -22555 -53214 91868 89222 22604 214999
15474B14999E3621P9514l1583d7071B34717i462m9108j68585C5486J09020j721
$$ 214999 53621 133135 101552 -47071 234717 -9462 -58570 -227155 35486 144506 142785
15463A42785J34557F3778I947b45984g3308j37852a46k42308g0745A50753c3576
$$ 142785 277342 63778 9947 -245984 -73308 -211160 -146 -242454 -70745 150753 -33576
15451C61536l2707b15804Q4897C0559N6393f0293k29951F5526J87565I5567L8622
$$ 361536 328829 -215804 -130907 30559 86952 -60293 -290244 65526 253091 95567 134189
15440A34189J2010L10261E7782J35681c61562I1749L75874A66426J005e27626
$$ 134189 146199 456460 57782 193463 -361562 91749 467623 166426 167431 -527626
15429b09661R2275B62831h6409L081b2043j15067h373j51162i561C64712a07290
$$ -209661 -117386 262831 -86409 -83328 -22043 -137110 -8373 -159535 -9561 364712 -107290
15417C0167K366b80568G3111a41597a7092I1072b96202A7209k441O8570C613K5569
$$ 30167 32533 -280568 73111 -141597 -17092 91072 -296202 17209 14768 83338 3613 29182
15405B9182J6261A9416J37685D7102a78350a7878F6660J38498D1268K9281M3826
$$ 29182 45443 19416 157101 47102 -178350 -17878 66660 205158 41268 70549 114375
15394A14375c00637A8719L8205K59797J50399k02059j22066a50297d4640l1378
$$ 114375 -300637 18719 56924 316721 467120 265061 142995 -150297 -44640 -76018
15384g6018l04678B1749R2905b19633i2932A74738J8486a10393j51020M4326q9407
$$ -76018 -380696 21749 114654 -219633 -92932 174738 193224 -110393 -261413 -217087 -306494
15373c06494B30675b53591i9919B17492i1073c7746l20487A04539R4705b38209
$$ -306494 230675 -253591 -99919 217492 -91073 -37746 -358233 104539 199244 -238209
15362A46118c17225a07500B93399r8653e0365R857E5850c80605a9826B5577b71013
$$ 146118 -317225 -107500 293399 194746 -50365 -40508 55850 -380605 -19826 25577 -271013
15350a02939j24894q418B5824a40467A69511f4748B453a08045M4322a1537H4508
$$ -102939 -227833 -236251 25824 -140467 169511 -64748 2453 -108045 -63723 -11537 84508
15338G4250B4720a92976F4617b4426o2264m95L66C37818c21687a25290E4275k3919
$$ 74250 24720 -192976 64617 -24426 -86690 -87185 -86819 337818 -321687 -125290 54275 30356
15326C0356a01950M4775A78463j0772c439C82272a61828I843K9466b76329A36530
$$ 30356 -101950 -57175 178463 167691 -3439 382272 -161828 9843 39309 -276329 136530
15314E381J68852B0103K37971b64431M377A01111C6097f3477A58330P6347g9016
$$ 5381 174233 20103 258074 -264431 -260054 101111 36097 -63477 158330 234677 -79016
15302a64990K068C44066b97893E95a36809M9850H5812a26421a3977G9173J45893
$$ -164990 -162922 344066 -297893 595 -136809 -86959 85812 -126421 -13977 79173 225066
15291B25066d02373A82142m5376L9316F6592M863a42357A07212C2332K17056I1598
$$ 225066 -402373 182142 136766 176082 66592 71455 -142357 107212 32332 249388 91598
15279A15833J1386e1177B01368b77322q8155a26069B66924D7086a26189O1043
$$ 115833 127219 -51177 201368 -277322 -365477 -126069 266924 47086 -126189 -65146
15269f5146H8104g7574j05815h9059H9590M3372J7846J8743d2995j69510h0356
$$ -65146 88104 -77574 -183389 -89059 89590 132962 150808 169551 -42995 -212505 -80356
15257I7638L1159a60080e7846A86637a94221B53552k0756A9137J76220f5365A31265
$$ 97638 128797 -160080 -57846 186637 -194221 253552 232796 19137 195357 -65365 131265
15245a51421J5892A34518K58630H5548d6170D19525c3364A43038J83523R5154
$$ -151421 -135529 134518 393148 85548 -46170 419525 -33364 143038 326561 421715
15235D21715L16186K68000m32076P96765l70148D52438r9960m6423F1844J86344
$$ 421715 737901 1005901 573825 1370590 1000442 452438 352478 306055 61844 248188
15225B48188c41847A46296d7241A41756D2430a9666o3229A0006c7723A2799e2560
$$ 248188 -341847 146296 -47241 141756 42430 -19666 -82895 10006 -37723 12799 -52560
15213e2373G1372c48799E7264b220B83260c1747j26244C49764m9955d3269B61037
$$ -52373 71372 -348799 57264 -2220 283260 -31747 -157991 349764 299809 -43269 261037
15201C14095a40793B29916a12493C41331L6859H9590P3663B3866g850G6723J52013
$$ 314095 -140793 229916 -112493 341331 378190 89590 163253 23866 -7850 76723 228736
15190B28736A10140J06149a9537B95011b9414A097b40010A18328J15099D4827
$$ 228736 110140 216289 -19537 295011 -29414 1097 -240010 118328 233427 44827
15179B69448P8313E1767J30383K38647j91459a19336a9089B31090I7068K07743
$$ 269448 347761 51767 182150 420797 229338 -119336 -19089 231090 97068 304811
15169C04811A20593M0295J58287L7581a47312p3714e6931D30590C1722K0560k4072
$$ 304811 120593 160888 319175 356756 -147312 -221026 -56931 430590 31722 52282 28210
15158B8210b34919G4349J06892D6674L9802L517J35396D4066A6511K53241A15877
$$ 28210 -234919 74349 181241 46674 86476 89993 225389 44066 16511 269752 115877
15146b15789J00738A61056R4590F6472a91315B71593f2428A43858B0067O3980
$$ -215789 -115051 161056 255646 66472 -191315 271593 -62428 143858 20067 84047
15136H4047o458J14854A0461a12051C56749c97536B5915h6669C76979j79057H4039
$$ 84047 77589 192443 10461 -112051 356749 -397536 25915 -86669 376979 197922 84039
15124e6256A35782j2983a43891B38949f5458D5973Q0670l091a4679p7191F5152
$$ -56256 135782 122799 -143891 238949 -65458 45973 126643 123552 -14679 -91870 65152
15112D64868f3140D70751b36757h2413o7251D44904P2467A98903K4522G5500M8655
$$ 464868 -63140 470751 -236757 -82413 -149664 444904 517371 198903 223425 75500 124155
15101A24155K22256A46803c230q6744b9960k0982j69402B09314E1109M0490K10950
$$ 124155 346411 146803 -3230 -89974 -29960 -50942 -220344 209314 51109 91599 302549
15090C02549k0637e8133n069C9289K89269a24668E0543f411E2369d1592E7420
$$ 302549 281912 -58133 -63202 39289 328558 -124668 50543 -6411 52369 -41592 57420
15078E04787j9370F3655J54333J99883q4262a19706B19618F8925f2750A79409
$$ 504787 485417 63655 217988 417871 333609 -119706 219618 68925 -62750 179409
15067A73091F2882J32653L51212k25443E5160J73373a49893A54554j4989l4394
$$ 173091 62882 195535 546747 321304 55160 228533 -149893 154554 139565 105171
15057A05171a72978C53826j29764j0508N4646n8210O0122C7281J19979J679D9519
$$ 105171 -172978 353826 224062 213554 268200 209990 270112 37281 157260 158939 49519
15045H5968J08907l4575b940B09156A02363M6790E0366J41458d5160N365o9603
$$ 85968 194875 160300 -2940 209156 102363 149153 50366 191824 -45160 -39795 -109398
15034a09398D30138A516f3791A14397O5127d4757B95525A29279J24176c5862j16516
$$ -109398 430138 1516 -63791 114397 179524 -44757 295525 129279 253455 -35862 -152378
15023a52378I1341l4702a07591p7614G2499b0329I7970O8346O383n6182J62106
$$ -152378 91341 56639 -107591 -185205 72499 -20329 97970 166316 172699 116517 278623
15012B78623D8187J43103J97503q5885K8959H453O5170a3648A6096N27267a07201
$$ 278623 48187 191290 388793 302908 331867 8453 73623 -13648 16096 543363 -107201
15000B80947a315A37708K3810M0023n2033M6527R8824L4374e9072A45594R4953
$$ 280947 -1315 137708 161518 201541 149508 196035 294859 329233 -59072 145594 240547
14989B40547J16802l5970j29693K59361j67314P5930C0857A3699R98Q2841D4279
$$ 240547 357349 321379 191686 451047 283733 359663 30857 13699 14697 97538 44279
14977e4142A22130K63423d7418F5918J24721J33180O533A44048K48143k9829A20439
$$ -54142 122130 385553 -47418 65918 190639 323819 330352 144048 392191 362362 120439
14965B07522M5947A05321L39610E7055N88834F1459L16042A31608o2103i5961
$$ 207522 253469 105321 444931 57055 645889 61459 377501 131608 69505 -95961
14954B68217p3298j7860J85995q0770K8570J4925K88321B56768j2168P0176r9441
$$ 268217 194919 177059 363054 282284 310854 325779 614100 256768 244600 314776 215335
14943B15335a99970C32944l2114A39670k0232L42899j60396a40254D71111A16263
$$ 215335 -199970 332944 300830 139670 119438 462337 301941 -140254 471111 116263
14932A01442j5223O1327O60911C75279e1233B37717H7508L36121F5354K31730
$$ 101442 86219 147546 808457 375279 -51233 237717 87508 423629 65354 297084
14922B97084j02863J94739a67029C68233D6364L91239b26501D53795B06901J15415
$$ 297084 194221 388960 -167029 368233 46364 437603 -226501 453795 206901 322316
14912C22316K42359B40493k2678J98604K6047j90433L44512B60820R2441N5922
$$ 322316 564675 240493 217815 416419 442466 252033 596545 260820 353261 409183
14902D09183r0694P2860I1061l0396L62787r2815J4103J52924H2611K96550K32229
$$ 409183 318489 391349 91061 60665 423452 330637 344740 497664 82611 379161 611390
14891F11390k68535A60649b3459A60514K38234q5150A06623J64974K28396N5369
$$ 611390 342855 160649 -23459 160514 398748 313598 106623 271597 499993 555362
14881E55362j17940l4002K31034k17345j61734L63561k46263A80787M87235l3939
$$ 555362 437422 403420 634454 417109 255375 618936 372673 180787 668022 634083
14871F34083j34883k16146K71340A97455k6690O6965J37352m83o4160j960o6219
$$ 634083 499200 283054 554394 197455 170765 237730 375082 374599 310439 308479 242260
14860B42260J80845K51278j66914n5183A88490L87260m0389A31403K47743j64690
$$ 242260 423105 674383 507469 452286 188490 575750 535361 131403 379146 214456
14850B14456J46038K29672B81873L02872j99140J5451J29080N7098j32615k4230
$$ 214456 360494 590166 281873 584745 385605 401056 530136 587234 454619 430389
14840D30389E3962N31422n5380p3748p8378p2231R3753J70011K24022B67969J92047
$$ 430389 53962 585384 530004 456256 377878 305647 399400 569411 793433 267969 460016
14829D60016J47201k91580K2644J11759j81144K69333R7179R927j43797B18328
$$ 460016 607217 315637 338281 450040 268896 538229 635408 645335 501538 218328
14818C60502j0865L58155C19757J18363k0780j36818Q8009A40946P0543J0718
$$ 360502 349637 707792 319757 438120 417340 280522 368531 140946 211489 222207
14808B22207L04268Q9006k0932j00657N1441j13219Q4824j5629m0420r0696K82328
$$ 222207 526475 615481 594549 493892 545333 432114 516938 501309 460889 370193 652521
14797F52521R570B76617N57566k64970k3688M20692m31616j07160K61949j6370
$$ 652521 662091 276617 834183 569213 545525 966217 534601 427441 689390 673020
14787F73020J24551k4101j02194B42009K89590p7844R2151R172j59546K89776
$$ 673020 797571 773470 671276 242009 531599 453755 545906 555078 395532 685308
14777F85308p2166j00787K29670j79637p55j41908J5803L05308j21857p5175N1287
$$ 685308 613142 512355 742025 562388 561633 419725 435528 740836 618979 543804 595091
14766E95091j01556K9932L05719l6752l03513O8903k75836O71714l98319J10578
$$ 595091 493535 523467 829186 792434 488921 557824 281988 953702 555383 665961
14756F65961J50176j21354k66233L58811j3652o6645j57225q684L17634j7808
$$ 665961 816137 694783 428550 787361 773709 707064 549839 541155 858789 840981
14746H40981j31246k12610J89366M4523K32703k44053J67365k52287J7689J8706
$$ 840981 709735 497125 686491 731014 963717 719664 887029 634742 652431 671137
14736F71137M66336l58558j66609j77296K03303N2803l3100R5052P1155m02922
$$ 671137 1137473 778915 612306 435010 638313 691116 658016 753068 824223 421301
14726D21301M10962k31243L21376J80532k73965j03984O0859k24129J13700K6544
$$ 421301 832263 601020 922396 1102928 828963 724979 785838 561709 675409 701953
14716G01953L00060j2240k26305j70710K17351k84070K03732j00435L73861l94287
$$ 701953 1002013 989773 763468 592758 810109 526039 729771 629336 1003197 608910
14706F08910L6943K47617k68350R071N10421k91440J52355l23773O7661K36447
$$ 608910 645853 893470 625120 634191 1144612 853172 1005527 681754 749415 985862
14696I85862J27331j15328j06672j44318L23521E28197K26163K3803l5706M5512
$$ 985862 1113193 997865 891193 746875 1070396 528197 754360 778163 742457 787969
14686G87969l1554J70096o717j57341O1841q9730R8031L02250j49931j40175K99034
$$ 787969 756415 926511 919794 762453 824294 734564 832595 1134845 984914 844739 1143773
14675A143773l35919j53784K97633J89414j2441k25569M30720j20198k82680j06022
$$ 1143773 807854 654070 951703 1141117 1128676 903107 1333827 1213629 930949 824927
14665H24927L30108K3813j08787j06882N2480L2321L835j27492N85344l58872
$$ 824927 1155035 1178848 1070061 963179 1015659 1047980 1051815 924323 1509667 1150795
14655A150795o8374J86137k2203j18120j93913K1062J12986L59875l21700K53517
$$ 1150795 1082421 1268558 1246355 1128235 934322 955384 1068370 1428245 1106545 1360062
14645A360062l19407R5037M05096m43682n8247K2681M43544l01972k6739L3623
$$ 1360062 1040655 1135692 1540788 1097106 1038859 1061540 1505084 1203112 1176373 1209996
14635A209996k32700L32768n9906l33907N46064j67599k8689J85027q7403J37669
$$ 1209996 977296 1310064 1250158 916251 1462315 1294716 1266027 1451054 1363651 1501320
14625A501320j33437K89309k19019j64205j0663L07107j23351j23297P7352J04443
$$ 1501320 1367883 1657192 1438173 1273968 1263305 1570412 1447061 1323764 1401116 1505559
14615A505559j49572J4192j85942K46658R3712n3769J01312J46897j56296k42272
$$ 1505559 1355987 1370179 1184237 1430895 1524607 1470838 1572150 1719047 1562751 1320479
14605A320479J38921O2655M6083j93688J29544L03369j22264J25451J00750k26937
$$ 1320479 1459400 1522055 1568138 1374450 1503994 1807363 1685099 1810550 1911300 1684363
14595A684363o4214M614j32856Q8154K14651P0212j68630j09260K08787j15003
$$ 1684363 1620149 1624763 1491907 1580061 1794712 1864924 1696294 1587034 1795821 1680818
14585A680818K61308K471k13532r0319L20709K55026n33721M19907o57379L26626
$$ 1680818 1942126 1944597 1731065 1640746 1961455 2216481 1682760 2102667 1445288 1771914
14575A771914J28649J01855p3197J88123Q4960j57840J53009Q6663J52984j66809
$$ 1771914 1900563 2002418 1929221 2117344 2202304 2044464 2197473 2284136 2437120 2270311
14565B270311M3044k08627J1789R5499n2034L3883K12520j14651M85803j80058
$$ 2270311 2313355 2104728 2116517 2212016 2159982 2193865 2406385 2291734 2777537 2597479
14555B597479j24379p2860L29886j24429l5473M6326J95775J49997J21018J51265
$$ 2597479 2473100 2400240 2730126 2605697 2570224 2616550 2812325 2962322 3083340 3234605
14545C234605N4905L74673l1732j27766L70958L59797L08864O13380N45393J356995
$$ 3234605 3289510 3664183 3632451 3504685 3875643 4235440 4544304 5157684 5703077 7060072
14535G060072J188078K683365L630207O756627J0259225r03628j3038144p047351
$$ 7060072 8248150 10931515 14561722 21318349 31577574 30673946 17635802 10588451
14527A0588451l524376j862771p03064j062287j87817l08002M1361l56912j05684
$$ 10588451 7064075 5201304 4498240 3435953 3248136 2940134 2981495 2624583 2518899
14518B518899J05991l32986K54768k35270K63734R7380k45480J79035j16141M01595
$$ 2518899 2624890 2291904 2546672 2311402 2575136 2672516 2427036 2606071 2489930 2891525
14508B891525k95703J37963m7955j14584K87478j69472j48741M83664J97819n32135
$$ 2891525 2595822 2733785 2685830 2571246 2858724 2689252 2540511 3024175 3221994 2689859
14498B689859M90893k78042r2760J00120m8954K38717j73144R70K95719K9234
$$ 2689859 3180752 2902710 2809950 2910070 2861116 3099833 2926689 2927659 3223378 3252612
14488C252612K20806j69885o043O7801K6671J50132J9716n7672N0483J94746n7420
$$ 3252612 3473418 3303533 3297490 3365291 3391962 3542094 3561810 3504138 3554621 3749367 3691947
14477C691947l52530N14866J09715J29878n69125K12215J00862O4020J69926p3940
$$ 3691947 3339417 3854283 3963998 4093876 3524751 3736966 3837828 3901848 4071774 3997834
14467C997834o7678K2184L71113l05172P1066N37484n68669L00357J31592P6303
$$ 3997834 3930156 3952340 4323453 4018281 4089347 4626831 4058162 4358519 4490111 4566414
14457D566414j94055L65969J7995K1094j46912M48367k53092q272J69025l00907
$$ 4566414 4372359 4738328 4756323 4777417 4630505 5078872 4825780 4817508 4986533 4685626
14447D685626P58091k83523J33212R2355l85322O20331m29958M92788p8961J28906
$$ 4685626 5443717 5160194 5293406 5385761 5000439 5620770 5190812 5683600 5604639 5733545
14437E733545J94062l02442L11208K72996j80202m5953J99203J39816K96088k12095
$$ 5733545 5927607 5625165 5936373 6209369 6029167 5983214 6182417 6322233 6618321 6406226
14427F406226M36974o9855k9317j16552L70123n01311L90757K4764K14861j30166
$$ 6406226 6843200 6773345 6744028 6627476 6997599 6496288 6887045 6911809 7126670 6996504
14417F996504L49642K87607o4801L00364m09925K54306K49816O5930J64041J97029
$$ 6996504 7346146 7633753 7568952 7869316 7459391 7713697 7963513 8029443 8193484 8390513
14407H390513R5098J42982M8926l6741J85385J73374L39323j70464L64256K83832
$$ 8390513 8485611 8628593 8677519 8640778 8826163 8999537 9338860 9168396 9532652 9816484
14397I816484k29490N84898l34486K68160L69919K41029j28268J65162k1710K82014
$$ 9816484 9586994 10171892 9837406 10105566 10475485 10716514 10588246 10753408 10731698 11013712
14387A1013712M58863k9980j70274O26039K50799J82158K09711k00225M61831
$$ 11013712 11472575 11442595 11272321 11898360 12149159 12331317 12541028 12340803 12802634
14378A2802634R475N39215L89236m00856M78010N90917M7231K99933K45533J73483
$$ 12802634 12812109 13351324 13740560 13339704 13817714 14408631 14455862 14755795 15001328 15174811
14368A5174811M37742M7792M34046J9324N83464K03966L33852N67246j16367O84543
$$ 15174811 15612553 15660345 16094391 16113715 16697179 16901145 17234997 17802243 17685876 18370419
14358A8370419J09225N85678K94602O17789M30428P7201N15736L77545M45323
$$ 18370419 18479644 19065322 19359924 19977713 20408141 20485342 21001078 21378623 21823946
14349B1823946L42604P47817L56157O01024N12891J87576R59727M44688Q54716
$$ 21823946 22166550 22914367 23270524 23871548 24384439 24572015 25531742 25976430 26831146
14340B6831146M58786R12539Q72785L46665N50742Q52777O98708J166128M41977
$$ 26831146 27289932 28202471 29075256 29421921 29972663 30825440 31524148 32690276 33132253
14331C3132253M91305J484374P96768Q44401J010695R08007J340680Q60101J798225
$$ 33132253 33623558 35107932 35904700 36749101 37759796 38667803 40008483 40868584 42666809
14322D2666809R77765J103061J564398J090306J384553J681892J479446J510591
$$ 42666809 43644574 44747635 46312033 47402339 48786892 50468784 51948230 53458821
14314E3458821K004510J563808J821227K280035J915454K200045K251078K379124
$$ 53458821 55463331 57027139 58848366 61128401 63043855 65243900 67494978 69874102
14306F9874102K404951K739917K792337K590471L096912L553038K928790L692989
$$ 69874102 72279053 75018970 77811307 80401778 83498690 87051728 89980518 93673507
14298I3673507L786357L773164M320694M052951M557781M773419N213111N239457
$$ 93673507 97459864 101233028 105553722 109606673 114164454 118937873 124150984 129390441
14290A29390441N725277N895841O183492O985396O836703P326397P619053Q329138
$$ 129390441 135115718 141011559 147195051 154180447 161017150 168343547 175962600 184291738
14282A84291738Q732690R025909R356443J0462000J0695683J0739161J1507854
$$ 184291738 193024428 202050337 211406780 221868780 232564463 243303624 254811478
14275B54811478J2546096J2960582J2652104J2914032J3148640J3089458J2840990
$$ 254811478 267357574 280318156 292970260 305884292 319032932 332122390 344963380
14268C44963380J3194916J2033224J2375373J1976943J1378970J0731406R043144
$$ 344963380 358158296 370191520 382566893 394543836 405922806 416654212 425697356
14261D25697356Q002253P060996O497103N586268L502896J710449J242700k481487
$$ 425697356 433699609 440760605 447257708 452843976 456346872 458057321 459300021 456818534
14253D56818534q451853q006022q724374r918873r277100j1257562j1581035j2810030
$$ 456818534 448366681 440360659 431636285 421717412 412440312 401182750 389601715 376791685
14245C76791685j2617604j3144288j4080197j3798103j2560760j2881188j3278406
$$ 376791685 364174081 351029793 336949596 323151493 310590733 297709545 284431139
14238B84431139j3215740j2154138j1956235j1253281j1314218j1143271j0881858
$$ 284431139 271215399 259061261 247105026 235851745 224537527 213394256 202512398
14231B02512398r751062r588928q619014q160484p701454p456950o626278o881673
$$ 202512398 192761336 183172408 174553394 166392910 158691456 151234506 144608228 137726555
14223A37726555n802963n407515n695867n042790m947222m637276l623659l994190
$$ 137726555 131923592 126516077 120820210 115777420 110830198 106192922 102569263 98575073
14215I8575073m161753l256159l500513l336796l103849l082836k957464k220549
$$ 98575073 94413320 91157161 87656648 84319852 81216003 78133167 75175703 72955154
14207G2955154k654221k382026k079579k349886k033719k164287j490783k156157
$$ 72955154 70300933 67918907 65839328 63489442 61455723 59291436 57800653 55644496
14199E5644496j495376j143965j741340j676433j656746j244709j294785q36092
$$ 55644496 54149120 53005155 51263815 49587382 47930636 46685927 45391142 44555050
14191D4555050j267836j303993j095340j282348p04363q52982j048624j105895
$$ 44555050 43287214 41983221 40887881 39605533 38901170 38048188 36999564 35893669
14183C5893669j011817q32592q58917p77562q55335q05694q82983p28103l83239
$$ 35893669 34881852 34049260 33190343 32412781 31557446 30751752 29868769 29140666 28757427
14174B8757427p56535n30891p80871l56104o64979p28987m19296m73331o12444
$$ 28757427 28000892 27470001 26689130 26333026 25668047 24939060 24519764 24046433 23433989
14165B3433989l81598p37555k47187n46549k60116o51904k23220n28244m24299
$$ 23433989 23052391 22314836 22067649 21521100 21260984 20609080 20385860 19857616 19433317
14156A9433317l21860l91911k11948n77250k44514j50178n96214l48844r2670
$$ 19433317 19111457 18719546 18507598 17930348 17685834 17535656 16939442 16590598 16497928
14147A6497928l31184k50020k65151n67080K00054o56272o1651l76683j9962l61753
$$ 16497928 16166744 15916724 15651573 15084493 15284547 14628275 14566624 14189941 14169979 13808226
14137A3808226l70582j11933r1205j32669k13515m8430l50661l52100k21687j70743
$$ 13808226 13437644 13325711 13234506 13101837 12888322 12839892 12489231 12137131 11915444 11744701
14127A1744701j48884k71332P276o9680k74618j14225k27556k64243J72957m98847
$$ 11744701 11595817 11324485 11331761 11262081 10987463 10873238 10645682 10381439 10554396 10055549
14117A0055549L9553k75344j11560J44147m11256j11220q856j55329J98760n47346
$$ 10055549 10095102 9819758 9708198 9852345 9441089 9329869 9321013 9165684 9364444 8817098
14107H817098k6427j11295k08217r4654k28920J16747j84832K3589l28502j46467
$$ 8817098 8790671 8679376 8471159 8376505 8147585 8264332 8079500 8103089 7774587 7628120
14097G628120J80650M8611n75513K37192M0000m88766K57776l18875k86592K01019
$$ 7628120 7808770 7857381 7281868 7519060 7559060 7070294 7328070 7009195 6722603 6923622
14087F923622J43157k63833l36970j21973r6699K92790Q7496k43147l18925M94811
$$ 6923622 7066779 6802946 6465976 6344003 6247304 6540094 6627590 6384443 6065518 6560329
14077F560329m23379n10334L70295k94956K29485j63740J69062l16054M8462j0240
$$ 6560329 6136950 5626616 5996911 5701955 5931440 5767700 5936762 5620708 5669170 5658930
14067E658930l71290L3273k12851J2714O9305N9654l47795K17061m3922l1182
$$ 5658930 5287640 5320913 5108062 5120776 5190081 5249735 4901940 5119001 5075079 5043897
14057E043897j49437k78071j6947j3741K74613q3819M4967j4694k66813j25641
$$ 5043897 4894460 4616389 4599442 4585701 4860314 4776495 4821462 4806768 4539955 4414314
14047D414314M09037l46626L4053n8269n633j18300j29426J45577k92224k11225
$$ 4414314 4823351 4476725 4510778 4452509 4446876 4328576 4199150 4344727 4052503 3841278
14037C841278L08186J57690k96571l28418O9313K73129k21771r9688Q2206J25179
$$ 3841278 4149464 4307154 4010583 3682165 3751478 4024607 3802836 3703148 3785354 3910533
14027C910533n4372k48588j92509K53092J53621n78552K41955o1420K06418p3837
$$ 3910533 3856161 3607573 3415064 3668156 3821777 3243225 3485180 3423760 3630178 3556341
14017C556341P4870k03782j12120j74236j5577M17490m41709n126P4407l36948
$$ 3556341 3631211 3427429 3315309 3141073 3125496 3542986 3101277 3096151 3170558 2833610
14007B833610J42745N7712l10495L95981l19075K97026R1487o15305K53871L2181
$$ 2833610 2976355 3034067 2723572 3119553 2800478 3097504 3188991 2573686 2827557 2859738
13997B859738k96668L69839l04244j7943M433J36952K3798k95400L14092l13282
$$ 2859738 2563070 2932909 2628665 2610722 2615155 2752107 2775905 2480505 2794597 2481315
13987B481315R3817J11187K32930m23998L33656J10151k01965n705M80525L82514
$$ 2481315 2575132 2686319 2919249 2495251 2828907 2939058 2737093 2731388 3211913 3594427
13977C594427N39485K57600R11230K016689L008309N896683J0766596M066850
$$ 3594427 4133912 4391512 5302742 7319431 10327740 16224423 26991019 31057869
13969C1057869j0626981o320208l925441k458298j436250j031165m34434l38527
$$ 31057869 20430888 14110680 10185239 7726941 6290691 5259526 4825092 4486565
13961D486565n34986l66383k31817k12116l5893M4488k07887l04545K62583j09927
$$ 4486565 3951579 3585196 3353379 3141263 3105370 3149858 2941971 2637426 2900009 2790082
13951B790082J17212k28080j47437j25736j9739J37370L6245l92918p4171K99767
$$ 2790082 2907294 2679214 2531777 2406041 2386302 2523672 2559917 2166999 2092828 2392595
13941B392595j23205K28041l61314j61154R7207N5888j40431R9263K13684J9693
$$ 2392595 2269390 2497431 2136117 1974963 2072170 2128058 1987627 2086890 2300574 2320267
13931B320267l51699J96742l04936K59600j32456l1562K15930m52647m9637K81599
$$ 2320267 1968568 2165310 1860374 2119974 1987518 1955956 2171886 1719239 1669602 1951201
13921A951201j69425K09734j59799j9202N1343j08756M45170r7185J95364n36039
$$ 1951201 1781776 1991510 1831711 1812509 1863852 1755096 2200266 2103081 2298445 1762406
13911A762406l5427P6366L15410k52448K4453l73771K78305l29819J02250L3534
$$ 1762406 1726979 1803345 2118755 1866307 1890760 1516989 1795294 1465475 1567725 1601259
13901A601259k5308L349Q0045K19446j11041k22291L56321l41052j99327K31893
$$ 1601259 1575951 1579300 1659345 1878791 1767750 1545459 1901780 1560728 1361401 1593294
13891A593294k21843j14839K16067K80449o01658M38778k4115j78314l557j650
$$ 1593294 1371451 1256612 1472679 1753128 1151470 1590248 1566133 1387819 1384262 1382612
13881A382612K51857p8299N5986l60743O89699o40822O2253N44830l31959l5123
$$ 1382612 1634469 1556170 1612156 1251413 1941112 1300290 1362543 1907373 1575414 1540291
13871A540291q7359J5865j26209M26429k23213j50614k83669K26143o326l6644
$$ 1540291 1452932 1468797 1342588 1769017 1545804 1395190 1111521 1337664 1331338 1294694
13861A294694N6629L51308m43576K10502n3638m36571K55407j70772J40433N9209
$$ 1294694 1351323 1702631 1259055 1469557 1415919 979348 1234755 1063983 1204416 1263625
13851A263625l29564N34577l42280j89041J13523N4879J64887n0176o2961j38860
$$ 1263625 934061 1468638 1126358 937317 1050840 1105719 1270606 1220430 1157469 1018609
13841A018609J30494j64657K70568l3750L29096k37960l05941L90142m80364L48411
$$ 1018609 1149103 984446 1255014 1221264 1550360 1312400 1006459 1396601 916237 1264648
13831A264648m14245M59425k51699J40218l8040k5189k25674J52482P3050j66015
$$ 1264648 850403 1309828 1058129 1198347 1160307 1135118 909444 1061926 1134976 968961
13821I68961J9379J51399P7891l61805L22072l53317M85736l30387j36114M18543
$$ 968961 988340 1139739 1217630 855825 1177897 824580 1310316 979929 843815 1262358
13811A262358j50863j7012k15486K17906k37763j1846K99498j15114k64045L17610
$$ 1262358 1111495 1094483 878997 1096903 859140 847294 1146792 1031678 767633 1085243
13801A085243j61841J84379l19140K13497q9429q4306K10384m31149M01015j96219
$$ 1085243 923402 1107781 788641 1002138 912709 828403 1038787 607638 1008653 812434
13791H12434J50003j30264j33753J42082K99025j59203J01685l3996K27768n12282
$$ 812434 962437 832173 698420 840502 1139527 980324 1082009 1048013 1275781 763499
13781G63499K62551k30141j24185L12197k43143K87178m39422L15043l45462K42264
$$ 763499 1026050 795909 671724 983921 740778 1027956 588534 903577 558115 800379
13771H00379K17912k28613m5546J74169k45169L21702k13557m6739J73569K9847
$$ 800379 1018291 789678 744132 918301 673132 994834 781277 734538 908107 937954
13761I37954m41970L80899p7661K42729l2127k51418N4300J0571j41177J1223
$$ 937954 495984 876883 799222 1041951 1009824 758406 812706 823277 682100 693323
13751F93323J64664L3596j63479o7309J22978q204k28853K50384J94895p0358
$$ 693323 857987 891583 728104 660795 783773 775569 546716 797100 991995 921637
13741I21637k14712j73042K06272N1156R2106J06641j18827k35141j98932J83871
$$ 921637 706925 533883 740155 791311 883417 990058 871231 636090 437158 621029
13731F21029L30426j78205l20702K09068m8179M0015K14515j72293j52028J57157
$$ 621029 951455 773250 452548 661616 613437 653452 867967 695674 543646 700803
13721G00803n3195M3842j18659l5427K38162j09126j9344K76311k87701j91732
$$ 700803 647608 691450 572791 537364 775526 666400 647056 923367 635666 443934
13711D43934L04885n9133j13282J39756k8229k53901M42928R497j63590j26962
$$ 443934 748819 689686 576404 716160 687931 434030 876958 886455 722865 595903
13701E95903j09202j3607q8591K14101B98789L82793j34354P2671j62072L22441
$$ 595903 486701 473094 384503 598604 298789 681582 547228 619899 457827 780268
13691G80268k37167Q0763M6493j81183J2787J08708K96762D09281J57366J69208
$$ 780268 543101 623864 670357 489174 501961 610669 907431 409281 566647 735855
13681G35855l0290R6484k88090L0859P4993K24638k79883A41070N30187B78610
$$ 735855 705565 802049 513959 544818 619811 844449 564566 141070 671257 278610
13670G18368l4221j87129M39062l64041J02277l03987J20775J67021j49328j5886
$$ 718368 684147 497018 936080 572039 674316 370329 491104 658125 508797 492911
13660D92911J54161J62885k95822q9041K0201J63793n1443j3421j63366J31146
$$ 492911 647072 809957 514135 425094 445295 609088 557645 544224 380858 512004
13650E12004K17190q0738r0617k16004R8639o0865J32011K9546K28386n3642k24882
$$ 512004 729194 648456 557839 341835 440474 379609 511620 541166 769552 715910 491028
13639D91028K58054j60956J65702k25049P0937j05899J19012O1481j82112k45234
$$ 491028 749082 588126 753828 528779 599716 493817 612829 674310 492198 246964
13629B46964J44586L54579j66826j12359p2J36545k64279A26026M51918Q7970
$$ 246964 391550 746129 579303 466944 466872 603417 339138 126026 577944 665914
13619F65914B10157O481L08849j72967A46663M06586q7799K29570l03792K78237
$$ 665914 210157 216638 525487 352520 146663 553249 465450 695020 391228 669465
13609F69465J75188k76888k12812k2671K13077j78209K6289r6284J61817J60718
$$ 669465 844653 567765 354953 332282 545359 367150 393439 297155 458972 619690
13599F19690J61631B35544N0456L13998j76243k07611m028q9763K63184J94587
$$ 619690 781321 235544 286000 599998 423755 216144 212116 122353 385537 580124
13589E80124j11223B20436O0988O5728J88072A04406J72061J48007K34193k31310
$$ 580124 468901 220436 281424 347152 535224 104406 276467 424474 658667 427357
13579D27357K01731k83708A55362N83788j63079B80146L96270C29365J14808j99048
$$ 427357 629088 345380 155362 739150 576071 280146 676416 329365 444173 245125
13569B45125M98575k30415k00116K10235r9164J03404J72993l08064q6131L58279
$$ 245125 743700 513285 313169 523404 424240 527644 700637 392573 306442 664721
13559F64721B93396J61944j71847H1488J22568p4746K60651j39615O8472M6556
$$ 664721 293396 455340 283493 81488 204056 129310 389961 250346 318818 365374
13549C65374j74063J50782j6059K64630B8549N55389Q3956k98136k673j39214
$$ 365374 191311 342093 326034 590664 28549 583938 667894 369758 367085 227871
13539B27871L10369b1770A75405K86481j20492m6006J98549j44642K1713j74801
$$ 227871 538240 -21770 175405 461886 341394 295388 493937 349295 371008 196207
13529A96207J58642q2173j9867J78167k15180L82693I5333J65271K29999k02999
$$ 196207 354849 272676 252809 430976 215796 598489 95333 260604 490603 287604
13519B87604R8494k4806J09724I5935M24166j10953j7665J07127p1009l3620j56969
$$ 287604 386098 361292 471016 95935 520101 409148 391483 498610 427601 393981 237012
13508B37012K22863I6823L22312P2452j68942J65842j55941A08479L26652A18
$$ 237012 459875 96823 419135 491587 322645 488487 332546 108479 435131 118
13497D37399k16176E3138a3874C10988Q2956k8064K06094c3248F79694k66922
$$ 437399 221223 53138 -13874 310988 393944 365880 571974 -33248 679694 412772
13487D12772A41910C4250K14605L22888j05779k9613J7765k9230K9863B9105J10211
$$ 412772 141910 34250 248855 571743 465964 436351 454116 424886 454749 29105 139316
13476A39316P5066N3680A5391M34567j50937o1400k3335I3697L94281k35032N9637
$$ 139316 214382 268062 15391 449958 299021 237621 214286 93697 487978 252946 312583
13465C12583J617J81219K27189A49790K23006k6383K2590j25870J55575N4499
$$ 312583 314200 495419 722608 149790 372796 346413 369003 243133 398708 453207
13455D53207N8131j6701j20216j0041j59317K28176A86219K47087A02340J74803
$$ 453207 511338 494637 374421 364380 205063 433239 186219 433306 102340 277143
13445B77143L11239I1584h8220D16568A87428B3969L8691K36554N9929A07082
$$ 277143 588382 91584 -88220 416568 187428 23969 62660 299214 359143 107082
13434A94002H3427J555K21213N9191j32161j8159N533M347J93505Q5920M549B53591
$$ 194002 83427 84982 306195 365386 233225 215066 220599 224946 418451 504371 508920 253591
13421B49562o3181j2512L11989A14250g3092C79225A76807F3874L00000A0L98934
$$ 249562 186381 173869 485858 114250 -73092 379225 176807 63874 363874 10 398944
13410C98944D4082K00049r1630K26804j0911C1091K61452j24835a89911B72189
$$ 398944 44082 244131 152501 379305 368394 31091 292543 167708 -189911 272189
13399B16724k6155N7427J22634B266L78503L75149A96155K15648j18130D7433
$$ 216724 190569 247996 370630 2266 380769 755918 196155 411803 293673 47433
13388B49141o7116c7746D12559j67718C9867J58637M76331B75008r1378K39643
$$ 249141 182025 -37746 412559 244841 39867 198504 674835 275008 183630 423273
13378D23273L8867A85291d3793A52875J37360A5908J71981a19602B86889o2677
$$ 423273 462140 185291 -43793 152875 290235 15908 187889 -119602 286889 224212
13368B24212A07368K81826B5193J23498L23972J80669H2600R3622K29487A77676
$$ 224212 107368 389194 25193 148691 472663 653332 82600 176222 405709 177676
13357A43609M07489D6309N37147k05182K8313K46714B64920A16458J69832l2568
$$ 143609 551098 46309 583456 378274 406587 653301 264920 116458 286290 253722
13347B53722R6723h29A11124l2469Q7794J64440A42818k0105J67299K142q1575
$$ 253722 350445 -829 111124 78655 166449 330889 142818 122713 290012 292154 210579
13336B10579N1131p4605k6287J17714K13386j74751K11968B08106R0231j40827
$$ 210579 261710 187105 160818 278532 491918 317167 529135 208106 298337 157510
13326A57510K80892F4871J75142K5216a11500D76132A18923J79207J1463h885
$$ 157510 438402 64871 240013 265229 -111500 476132 118923 298130 309593 -8885
13315E20981D7042J17237R6255A13009K18936A16118M41375I7666H107K85350
$$ 520981 47042 164279 260534 113009 331945 116118 557493 97666 8107 293457
13305B93457K80252r0934j86426A17140c9164F1774J60995n9937J11346F5161
$$ 293457 573709 482775 296349 117140 -39164 61774 222769 162832 274178 65161
13294B32419Q4678n4502J89065j72277N8665c8077B57580A9913J52071m8275l0912
$$ 232419 317097 262595 451660 279383 338048 -38077 257580 19913 171984 123709 92797
13283I2797b6163A03635K29609m6352j06014J47245P5982n8645j42049n6755R199
$$ 92797 -26163 103635 333244 286892 180878 328123 404105 345460 203411 146656 155855
13272A55855Q3577d8007C00468n0758e0019A89832f6491E3421e9723B01155m9184
$$ 155855 239432 -48007 300468 249710 -50019 189832 -66491 53421 -59723 201155 151971
13261A51971d6517B31726K42194f3472B43541D9347K37069a01789D53374j13530
$$ 151971 -46517 231726 473920 -63472 243541 49347 286416 -101789 453374 339844
13251C39844n8196I306L12447M3756A46107a63829O6672A15663J66149j35204
$$ 339844 281648 9306 321753 365509 146107 -163829 -97157 115663 281812 146608
13241A46608J65945F1473J05062G5638J78719j2144a93089A22726J37855C7613
$$ 146608 312553 61473 166535 75638 254357 242213 -193089 122726 260581 37613
13230D44588A32062J26466O9345A38483J27306A22392c09678C54881d42C54667
$$ 444588 132062 258528 327873 138483 265789 122392 -309678 354881 -442 354667
13219a0446p2919C9108a17537A39242c995C404L60796b6105B56020d8960D75846
$$ -10446 -83365 39108 -117537 139242 -3995 3404 364200 -26105 256020 -48960 475846
13207A55090J94147D1003L57844L31j13643G6176k0192K07477e3558C32061g3734
$$ 155090 349237 41003 398847 399178 285535 76176 55984 263461 -53558 332061 -73734
13195E1108J32825J85714q0360j41334R4089o4597L479j7328N0176J30162A25269
$$ 51108 183933 369647 289287 147953 242042 177445 180924 163596 213772 343934 125269
13183H4362L3564g1247C43819A05772L01433j43929K6460a18863I9071a10806
$$ 84362 117926 -71247 343819 105772 407205 263276 289736 -118863 99071 -110806
13172C04146a37229D8569J63287J13656N2996b24032f5139D10001A29292P926
$$ 304146 -137229 48569 211856 325512 378508 -224032 -65139 410001 129292 137218
13162A37218h8426H7269B406O7713M0687j77L9663k6451J28300K5468A05784J52077
$$ 137218 -88426 87269 2406 70119 110806 110629 150292 123841 252141 277609 105784 257861
13150B57861f819A58193K28560J0718j04511i4431B75350E6242K57285f8511B80278
$$ 257861 -6819 158193 386753 397471 292960 -94431 275350 56242 313527 -68511 280278
13138F1080J98953C8379J28366J46243K5115E2111L21989j82017b9914o8488B02704
$$ 61080 260033 38379 166745 312988 338103 52111 374100 192083 -29914 -98402 202704
13126A22881n0598I805J59791h6652A66259J81332j59874E7145m037k1429a72858
$$ 122881 72283 9805 169596 -86652 166259 347591 187717 57145 53108 31679 -172858
13114g0693I664a68088N3276G4124L8732Q3540p0299J470o2765a47259D3710J12667
$$ -70693 9664 -168088 -114812 74124 112856 196396 126097 127567 64802 -147259 43710 156377
13102A56377P1812K949H6445d0507a6636D4575O4570d249C26385a50346F1114
$$ 156377 228189 231138 86445 -40507 -16636 44575 109145 -4249 326385 -150346 61114
13090B21450a65530B35436a43877A91655b19252A06015J45891a281j03470B26015
$$ 221450 -165530 235436 -143877 191655 -219252 106015 251906 -1281 -104751 226015
13079h4386A05601M5873M2866f4025j29153J8524A9979J98900a8935j29328A2455
$$ -84386 105601 151474 194340 -64025 -193178 -174654 19979 218879 -18935 -148263 12455
13067D0982M70279C3591J98984a52831B52402a3118l287L833B04129J47443K7207
$$ 40982 511261 33591 232575 -152831 252402 -13118 -16405 -12572 204129 351572 378779
13056C78779a20285C1249K96515E4894L75160j92777R2999b20837B72497j1598
$$ 378779 -120285 31249 327764 54894 430054 237277 330276 -220837 272497 260899
13046B60899c24265M2017C4561M30679G9501l4950a42588B01779E0837J74506
$$ 260899 -324265 -282248 34561 465240 79501 44551 -142588 201779 50837 225343
13036B25343m9717n9317K51826b06499A32333g7497D69765A38694L16904b0662
$$ 225343 175626 116309 368135 -206499 132333 -77497 469765 138694 455598 -20662
13025E9929M6281b09808A68888J52226G2902J2154N0988a92284C6204J71889J90787
$$ 59929 106210 -209808 168888 321114 72902 85056 136044 -192284 36204 208093 398880
13014C98880g2216B05362O8241L760J06076k5701j588H4796J68324d7073j73872
$$ 398880 -72216 205362 273603 277363 383439 357738 356150 84796 253120 -47073 -220945
13003b20945A4526J31276A096R1081L47817B03795o5905m8275K98419A36155L68271
$$ -220945 14526 145802 1096 92177 439994 203795 137890 89615 388034 136155 504426
12992E04426B07151N9673n951b07357g7688A20082m7379J28038l7332O9835J5793
$$ 504426 207151 266824 260873 -207357 -77688 120082 72703 200741 163409 233244 249037
12981B49037c0655B3191K50540r9342A6455i0386c2542j10115A49257f2144n6153
$$ 249037 -30655 23191 273731 174389 16455 -90386 -32542 -142657 149257 -62144 -118297
12970a18297n7940C59256Q1897D0024A1663L62372B0568K34553G9090c065A44560
$$ -118297 -176237 359256 441153 40024 11663 374035 20568 255121 79090 -3065 144560
12958A00386b29809F188a59792e7996j89036k8030E7007L17091j13378j25391
$$ 100386 -229809 6188 -159792 -57996 -247032 -275062 57007 374098 260720 135329
12948A35329m0615E05R0746K22429g0710B44396i462D569O0696a54890E6278b9611
$$ 135329 94714 505 91251 313680 -70710 244396 -9462 4569 65265 -154890 56278 -29611
12935H4628N3043i6070F7445b16896A95421P6402d2061A99409a07457C18191H6490
$$ 84628 137671 -96070 67445 -216896 195421 271823 -42061 199409 -107457 318191 86490
12923a69547P8511A54222m5979j7127J80089q5607b6491B9070c6020O138A75510
$$ -169547 -91036 154222 108243 91116 271205 185598 -26491 29070 -36020 -29882 175510
12911C13817F7444J45676c07923A63149F6444a73886g4913A86601n1654i2772
$$ 313817 67444 213120 -307923 163149 66444 -173886 -74913 186601 134947 -92772
12900C49386A12325e5659J6860k82188A64015K54389b99629b3546C22954L2013
$$ 349386 112325 -55659 -38799 -320987 164015 418404 -299629 -23546 322954 354967
12890C54967r6293c5760r0738d3044k7003A07096a10326B62297k4761F0280K78733
$$ 354967 258674 -35760 -126498 -43044 -70047 107096 -110326 262297 237536 60280 339013
12879C39013B0176L25062E4464b00702B68397a40955B30833c4709j30537A56875
$$ 339013 20176 345238 54464 -200702 268397 -140955 230833 -34709 -165246 156875
12868B07493J42666g0210C4902K25162M9372A33558c29037A8034a62272b3039
$$ 207493 350159 -70210 34902 260064 309436 133558 -329037 18034 -162272 -23039
12857D2917J03934B0197K3441A2222a42311f056j10770A7670N107a44589A78293
$$ 42917 146851 20197 43638 12222 -142311 -6056 -116826 17670 22777 -144589 178293
12845D9432c098B34910b83859A31584F0291I090J62254G0485a61580A98983N5941
$$ 49432 -3098 234910 -283859 131584 60291 9090 171344 70485 -161580 198983 254924
12834B54924j12036M2992b5894B15665I5987D7622J8957a04348j0225C84927a00168
$$ 254924 142888 185880 -25894 215665 95987 47622 66579 -104348 -114573 384927 -100168
12822A24628a52206n3375h2629k00198A21216h0635D3790J06773i3768B25020
$$ 124628 -152206 -205581 -82629 -282827 121216 -80635 43790 150563 -93768 225020
12811B4590e0840B29445J42336h8329D06244a16935H1224l0457c1429C2449c2054
$$ 24590 -50840 229445 371781 -88329 406244 -116935 81224 50767 -31429 32449 -32054
12799B7073J12939o1681b55782E2623e5727B93326I6358c3922A5836a81405A01075
$$ 27073 140012 78331 -255782 52623 -55727 293326 96358 -33922 15836 -181405 101075
12787c07941b4853j14089D90638k20711a12832B41122a62017A02950B2905K3189
$$ -307941 -24853 -138942 490638 269927 -112832 241122 -162017 102950 22905 46094
12777D6094b6861G4557B6721R8275D7373Q8012a58540A09050c47263F8476J02162
$$ 46094 -26861 74557 26721 124996 47373 135385 -158540 109050 -347263 68476 170638
12766A70638h2019L1050F2137b474H7344b59776B38551q3960a21500B0320K74862
$$ 170638 -82019 -50969 62137 -2474 87344 -259776 238551 154591 -121500 20320 295182
12755B95182E8284b7731j11313A17963J9809f477E8025b39325B18139l0130D3365
$$ 295182 58284 -27731 -139044 117963 137772 -6477 58025 -239325 218139 188009 43365
12743f2646B84803c44860D5107N2518b10980A97543F2688a73561G3574R7855a49829
$$ -62646 284803 -344860 45107 97625 -210980 197543 62688 -173561 73574 171429 -149829
12731A94071R3450g8700l00315f9527A22971a03755c4368l0616p6173h78F2834
$$ 194071 287521 -78700 -379015 -69527 122971 -103755 -34368 -64984 -141157 -878 62834
12719a27134I8269J10764d4488C98555A08651b89313F3485J55916B8708K5364
$$ -127134 98269 209033 -44488 398555 108651 -289313 63485 219401 28708 54072
12709E4072P6932m2166P0930O7526n6547a41198j3444B77378b65938R0724F9851
$$ 54072 131004 88838 159768 227294 170747 -141198 -154642 277378 -265938 -175214 69851
12697A86570H580a12671C36092j32397J66564o5769H7905k8496c0599A92039H7091
$$ 186570 8580 -112671 336092 203695 370259 304490 87905 59409 -30599 192039 87091
12685a55675C1386J2974J60888E1672i2385B10726a36600A04939L20717d6212
$$ -155675 31386 44360 205248 51672 -92385 210726 -136600 104939 425656 -46212
12674a78456j59810A64073j8323o4274d9617q7157q2209i1474M0353B69786J87796
$$ -178456 -338266 164073 145750 81476 -49617 -136774 -218983 -91474 -51121 269786 457582
12663D57582B06627H1332f0048A50961l6374K72085A92792F5005k9554Q058J97507
$$ 457582 206627 81332 -60048 150961 114587 386672 192792 65005 35451 43509 241016
12652B41016J15412A04271E0558K4344a92471A06709R6751I9925J8726a57812
$$ 241016 356428 104271 50558 74902 -192471 106709 203460 99925 118651 -157812
12641b34508H3367d0458G4392Q1795b422D51151j41945M85a56318I4173J29593
$$ -234508 83367 -40458 74392 156187 -2422 451151 309206 309691 -156318 94173 223766
12630B23766p3107a5567E2622K45919l6471q7456k3832N4302h0344D9742b83975
$$ 223766 150659 -15567 52622 298541 262070 174614 150782 205084 -80344 49742 -283975
12618A05245J20442G4095J55567c4806D41648j17058j47790K04022G5989L24281
$$ 105245 225687 74095 229662 -34806 441648 324590 176800 380822 75989 400270
12608D00270C1281K92396A24337e5791H9583L7950J61419A39041K08894B6919
$$ 400270 31281 323677 124337 -55791 89583 127533 288952 139041 347935 26919
12597c92552B37759A10528R5555A811J86676o8667N014J21814D8962L10820A75240
$$ -392552 237759 110528 206083 1811 188487 119820 124834 246648 48962 359782 175240
12585B0410J7407J99174a76344B46466p1993C3912b31417B76727j8885B3967a87016
$$ 20410 37817 236991 -176344 246466 174473 33912 -231417 276727 257842 23967 -187016
12573B15996C1895K8167a92492Q202C60402e3298C0921b47883g3603o1937b828
$$ 215996 31895 60062 -192492 -184290 360402 -53298 30921 -247883 -73603 -135540 -2828
12561C30040f0546A96430e6988A89277l4686o1176M1071E9655K87776a02591J8813
$$ 330040 -60546 196430 -56988 189277 154591 93415 134486 59655 347431 -102591 -83778
12550h3778k6944B89263j8637A34b03680B39393n9276H925J65931E2676J33219
$$ -83778 -110722 289263 270626 134 -203680 239393 180117 8925 174856 52676 185895
12539A85895i8542B13490c379k0809j14039F3588K9219n176M1883a20064r295
$$ 185895 -98542 213490 -3379 -24188 -138227 63588 92807 87631 129514 -120064 -129359
12528a29359A76597a5375l72532E08181j36624a90954B82917E3416f1865A45406
$$ -129359 176597 -15375 -387907 508181 371557 -190954 282917 53416 -61865 145406
12517a55074m6206A52728p2601a89905M2046H5892M22739g4614D2490A1208a72446
$$ -155074 -201280 152728 80127 -189905 -147859 85892 508631 -74614 42490 11208 -172446
12505A83516K45533i5823P334p6468B07703c9566A35175o0638L80008b9133B73242
$$ 183516 429049 -95823 -88489 -164957 207703 -39566 135175 74537 454545 -29133 273242
12493a27175o2650a4658B01991C6369J0810d3968J6600B40966m6552b84722A09951
$$ -127175 -189825 -14658 201991 36369 47179 -43968 -27368 240966 194414 -284722 109951
12481A26887D1618h9257n1027A15420e2469B03502F0476O5458a94090C6649K11916
$$ 126887 41618 -89257 -140284 115420 -52469 203502 60476 125934 -194090 36649 248565
12470B48565D0518P3144g731C55175D5387L66689b4748l9590C1101Q3558m1751
$$ 248565 40518 113662 -7731 355175 45387 412076 -24748 -64338 31101 114659 72908
12459G2908b00548I6543J75507a41801f944A1657J74316M0289G9943b6485G0049
$$ 72908 -200548 96543 272050 -141801 -6944 11657 185973 226262 79943 -26485 70049
12447a63261I4829a09831D8955h6774B03803l1746p057A5462b770A60397a94086
$$ -163261 94829 -109831 48955 -86774 203803 172057 165000 15462 -2770 160397 -194086
12435i4568A34415L45403A2586J38970d183B70438g7880j15959A67249c28530
$$ -94568 134415 479818 12586 151556 -4183 270438 -77880 -193839 167249 -328530
12424I2367N8388J57089A30360J06157E3478c52458F6480b44327E9252N0483b62601
$$ 92367 150755 307844 130360 236517 53478 -352458 66480 -244327 59252 109735 -262601
12412A84995C9823a28990l37928A15309a3296j37903M1584A64143m3948a75658
$$ 184995 39823 -128990 -466918 115309 -13296 -151199 -109615 164143 120195 -175658
12401d98642a99496c5752F2391Q0680A1601K8247b55023J00757B9288O2210e5970
$$ -498642 -199496 -35752 62391 143071 11601 39848 -255023 -154266 29288 91498 -55970
12389E1563a10674G6864K9244d9297j50690C1617c1606A80906N3750b1012A31656
$$ 51563 -110674 76864 106108 -49297 -199987 31617 -31606 180906 234656 -21012 131656
12377c24415A8267P2049b75838C93979a4964E9540a09417l35315a57845B8205
$$ -324415 18267 90316 -275838 393979 -14964 59540 -109417 -444732 -157845 28205
12366F8524g4261a1325r6658J993E4985B2324a14769j28866d0759B44459A8704
$$ 68524 -74261 -11325 -107983 -105990 54985 22324 -114769 -243635 -40759 244459 18704
12354A5563L83686a49688j66390J40891E35671a40212f0013C28811b16706B38100
$$ 15563 399249 -149688 -316078 -175187 535671 -140212 -60013 328811 -216706 238100
12343a15666G3733K14369f4001o8837N1632c8720o0783A12557a72429g0524I2144
$$ -115666 73733 288102 -64001 -132838 -81206 -38720 -99503 112557 -172429 -70524 92144
12331F119L4372J44069a86281C30459a24550j1428A76428d163f61k45351M7733
$$ 6119 40491 184560 -186281 330459 -124550 -135978 176428 -4163 -661 -246012 -198279
12320a98279I335L9437b4614A6961J02368D5871R0014b8958B00004h857l71760
$$ -198279 9335 48772 -24614 16961 119329 45871 135885 -28958 200004 -8857 -380617
12309c80617a19598B19000a01807d6335j8264j96667A09598c9764B3488J68067
$$ -380617 -119598 219000 -101807 -46335 -64599 -261266 109598 -39764 23488 191555
12299A91555n3215J45279j10886K3440a42555P0660q0070e9886l6631J3399d555
$$ 191555 138340 283619 172733 196173 -142555 -71895 -151965 -59886 -96517 -83118 -4555
12287A83466c78339B0859P0151e5739m0956F1958a18162e6153k38974a6998A75093
$$ 183466 -378339 20859 91010 -55739 -96695 61958 -118162 -56153 -295127 -16998 175093
12275a08408b0863N749A28777d1405q7438C20994j32764H27J53704o4096J64806
$$ -108408 -20863 -15114 128777 -41405 -128843 320994 188230 827 154531 90435 255241
12264B55241e1468I0390J35538k6825F4814c4666G3927E747K62689p7459k2721
$$ 255241 -51468 90390 225928 199103 64814 -34666 73927 5747 268436 190977 168256
12253A68256p0287a03394b3290A948J57507J23200D8163b56665B61710b59401
$$ 168256 97969 -103394 -23290 1948 159455 282655 48163 -256665 261710 -259401
12242C09204a66754A12602a04555B95864g3159A38908i587C00152b36224I9553
$$ 309204 -166754 112602 -104555 295864 -73159 138908 -9587 300152 -236224 99553
12231A41870J45371d4297C74819j87321o1672N6891k466p858K30896a43439A53055
$$ 141870 287241 -44297 374819 187498 125826 182717 180251 172393 403289 -143439 153055
12219I2216l6713J6664B681a73308B07576q0792L47480B25824J19032A06524J20542
$$ 92216 55503 72167 2681 -173308 207576 126784 474264 225824 344856 106524 227066
12208B27066n9789R842C6847K37734K41706A58482h3011C54753r6388A12504L0146
$$ 227066 167277 177119 36847 274581 516287 158482 -83011 354753 258365 112504 142650
12197A42650O6526K75764b69107A1477M15516j42121j08927G1706A3234J35295
$$ 142650 209176 484940 -269107 11477 426993 284872 175945 71706 13234 148529
12187A48529Q251b9344A19199i1185A24115F0004K0818K41421J72579A93825J76364
$$ 148529 156780 -29344 119199 -91185 124115 60004 80822 322243 494822 193825 370189
12176C70189a05459B89626h9615B59320j27589J00155F0815f2496D6012K76906
$$ 370189 -105459 289626 -89615 259320 131731 231886 60815 -62496 46012 322918
12166C22918g7563o7838f3586A91439G4336Q5917k0937L7053D1894J79066a7312
$$ 322918 -77563 -145401 -63586 191439 74336 160253 139316 176369 41894 220960 -17312
12154b4804B64165j12297F5732J45073j9273J00251J79277H0244A2113J53935
$$ -24804 264165 151868 65732 210805 191532 291783 471060 80244 12113 166048
12144A66048J27305c12833B97774B2573L1299J17493a08197n5464c498C50299
$$ 166048 293353 -312833 297774 22573 53872 171365 -108197 -163661 -3498 350299
12133a43889D6501K50896b5489E9069J37385a6917I2657L0507C3980M7628L4222
$$ -143889 46501 297397 -25489 59069 196454 -16917 92657 123164 33980 81608 115830
12122A15830Q9933B7016L4320b45341B58738b09358h9490F3173i1133C9204J83520
$$ 115830 205763 27016 61336 -245341 258738 -209358 -89490 63173 -91133 39204 222724
12111B22724b26629O7828A50111i6802C1961K91213j38430Q595b88246O8027R7952
$$ 222724 -226629 -158801 150111 -96802 31961 323174 184744 193339 -288246 -220219 -122267
12100a22267F2823K5142a80005n1894a9520A27713b28895j30935M1784B15639
$$ -122267 62823 87965 -180005 -231899 -19520 127713 -228895 -359830 -318046 215639
12089D4185P9012R3845I7436l6137j103Q4102J55637A01097L0087d1116C22056
$$ 44185 123197 217042 97436 61299 60196 144298 299935 101097 131184 -41116 322056
12077B9668J76366J55920e9193r1699G2441h1555C03736b02365C732a52414B20744
$$ 29668 206034 361954 -59193 -150892 72441 -81555 303736 -202365 3732 -152414 220744
12065A36466C419J08150l7369b2832B28931a75242D72170Q7650Q65373E38359
$$ 136466 3419 111569 74200 -22832 228931 -175242 472170 559820 1425193 538359
12054D93816A69854h727B3768O0325c32561I2274J8192e7009A25960d7908m2362
$$ 493816 169854 -8727 23768 84093 -332561 92274 110466 -57009 125960 -47908 -90270
12043i0270A45531f6937p204q8086A9302B696J13815H641N1591B4675Q2044c71738
$$ -90270 145531 -66937 -74141 -162227 19302 2696 116511 8641 60232 24675 106719 -371738
12030I85L70498b01165A26997L8056j9380k679b10072b259B2976P4158c03070
$$ 985 371483 -201165 126997 165053 145673 142994 -210072 -2259 22976 97134 -303070
12018A0308a63401B10353d5573j69431E530B710J6036a17672n103B03852B3525
$$ 10308 -163401 210353 -45573 -215004 5530 2710 18746 -117672 -122775 203852 23525
12006c04009I8991k1119N3420K2929B6869b52542a23813k5485A21813C272c5885
$$ -304009 98991 77872 131292 154221 26869 -252542 -123813 -149298 121813 3272 -35885
11994D9440K4823A7018b7155G9365b01168P1667J3083j47169H841e475j20604
$$ 49440 74263 17018 -27155 79365 -201168 -129501 -116418 -263587 8841 -5475 -126079
11983a26079F1024b533k5781k13460A13844D6484q423b9713k939j42772N4559
$$ -126079 61024 -2533 -28314 -241774 113844 46484 38061 -29713 -32652 -175424 -120865
11972a20865D30133b99529m5326B25685J50448A56017h4689D9938K01468a10506
$$ -120865 430133 -299529 -344855 225685 376133 156017 -84689 49938 251406 -110506
11961F254R9283a47061B35425a63690C9728a43636A85046a74679m8261B1147J36754
$$ 6254 105537 -147061 235425 -163690 39728 -143636 185046 -174679 -222940 21147 157901
11950A57901n6814b591C4330h0797J4265J3672B84363a68485b0935n9712k68691
$$ 157901 101087 -2591 34330 -80797 -66532 -52860 284363 -168485 -20935 -80647 -349338
11939c49338J23950B16378l8042k3817a11402K5093i630A12952b095r6680J4381
$$ -349338 -225388 216378 178336 154519 -111402 -86309 -9630 112952 -2095 -98775 -84394
11928h4394a9084p5718b0100A1449i5072K0023j11774B49696b8973C6975a3156
$$ -84394 -19084 -94802 -20100 11449 -95072 -75049 -186823 249696 -28973 36975 -13156
11916a66695B69012J18197a87584L1158B35290c25306i8146A69458b69357H4504
$$ -166695 269012 387209 -187584 -156426 235290 -325306 -98146 169458 -269357 84504
11905A59432a9345j70590A75324m9031D7916N1441a91850h7107D9874K3211d1477
$$ 159432 -19345 -189935 175324 126293 47916 99357 -191850 -87107 49874 73085 -41477
11893a52626M2237r6355d1892B13825a36296D3525O1631a0357B7021N5941B761
$$ -152626 -110389 -206744 -41892 213825 -136296 43525 105156 -10357 27021 82962 2761
11881B2780J74327q9666d6757k5723A25423J1472J46535G1544O8674a22349N7958
$$ 22780 197107 107441 -46757 -72480 125423 136895 283430 71544 140218 -122349 -64391
11870f4391L1828m8866G9882c02268A95041f0199m3418p1299C69537p6457a43047
$$ -64391 -32563 -81429 79882 -302268 195041 -60199 -103617 -174916 369537 293080 -143047
11858c19195J44005a136A21635d24597G3892h207j09680l11030R5482D3263J37261
$$ -319195 -175190 -1136 121635 -424597 73892 -8207 -117887 -428917 -333435 43263 180524
11847A80524D7038K22247c2005B97233a98967C24275a09268k7210E2454b04174
$$ 180524 47038 269285 -32005 297233 -198967 324275 -109268 -136478 52454 -204174
11836a95071A15576b01455D66686a2330j95038F7966a98463j16047b6425B29851
$$ -195071 115576 -201455 466686 -12330 -207368 67966 -198463 -314510 -26425 229851
11825A153h0353A01477g8995j18461B21257b00907C561a57474D6177d8202B24982
$$ 1153 -80353 101477 -78995 -197456 221257 -200907 3561 -157474 46177 -48202 224982
11813b06215o7135P6315B78518b18862G5094e6153B68937F139a81629h5179B2752
$$ -206215 -273350 -197035 278518 -218862 75094 -56153 268937 6139 -181629 -85179 22752
11801i3012B3566J14440b25120A30389f0914g285j08870D9050h8786A4254O3643
$$ -93012 23566 138006 -225120 130389 -60914 -7285 -116155 49050 -88786 14254 77897
11790G7897c8359l3109j89339d6661m9819j81728d3729k08657C06563b16271j11535
$$ 77897 -38359 -71468 -260807 -46661 -96480 -278208 -43729 -252386 306563 -216271 -327806
11779c27806F6242d9533B73909D9642M2130J43082K68662B9267J93440A8181J23550
$$ -327806 66242 -49533 273909 49642 91772 234854 503516 29267 222707 18181 141731
11768A41731O025J0601f191F6781i1015l187p3530g0158b1913j22048p7007c9311
$$ 141731 147756 158357 -6191 66781 -91015 -94202 -167732 -70158 -21913 -143961 -220968 -39311
11755E1732a6829A35849J5434a18781A22361b67554A64732K53279a70815A50436
$$ 51732 -16829 135849 151283 -118781 122361 -267554 164732 418011 -170815 150436
11744b10426b6718B36006a70367A17988b248l1478j19696A96553h2757j80878
$$ -210426 -26718 236006 -170367 117988 -2248 -33726 -153422 196553 -82757 -263635
11734b63635A30829a31307B33389j15069J6156A345i3606b3108F9594r631R3969
$$ -263635 130829 -131307 233389 118320 134476 1345 -93606 -23108 69594 59963 153932
11723A53932m0003a47810b5844B8950a3599k23926a06015B23273b09495G6318
$$ 153932 113929 -147810 -25844 28950 -13599 -237525 -106015 223273 -209495 76318
11712B1413a3941H4866c27080c029l79085B97108i2305l22667h0325C8994f522
$$ 21413 -13941 84866 -327080 -3029 -382114 297108 -92305 -414972 -80325 38994 -6522
11700B70219B9626L3988J29343g3750j35945a00081D12820g3493A47905k9812
$$ 270219 29626 63614 192957 -73750 -209695 -100081 412820 -73493 147905 118093
11690A18093a23002B6767L70861a34336I3496B1826K54212m8354h0928q7914D9453
$$ 118093 -123002 26767 397628 -134336 93496 21826 276038 227684 -80928 -168842 49453
11678A62347F4353J30318C5645i0524M0190F692e625p389A41873a7055A05183
$$ 162347 64353 194671 35645 -90524 -50334 6692 -5625 -13014 141873 -17055 105183
11666a61348A47867b01297A38779b71678A2368e7073q6942B32432A5578K4661
$$ -161348 147867 -201297 138779 -271678 12368 -57073 -144015 232432 15578 40239
11656D0239J60732J4127A602d9291k123J1974j80248e9996b0493l37147B04157
$$ 40239 200971 215098 1602 -49291 -51414 -39440 -219688 -59996 -20493 -357640 204157
11644b14054B01556E2272L1903b7962r4355a8131j63777C5506J34992c3363C5705
$$ -214054 201556 52272 84175 -27962 -122317 -18131 -181908 35506 170498 -33363 35705
11632F0503k2930j5603a54746j09652e0153p253l13872b7194B6930b9892A17188
$$ 60503 37573 21970 -154746 -264398 -50153 -57406 -371278 -27194 26930 -29892 117188
11620B4165a63198H166a14478a3328A30474d9807B49745d4593B33263j01931D7082
$$ 24165 -163198 8166 -114478 -13328 130474 -49807 249745 -44593 233263 131332 47082
11608i2820A90513J33096a14757r5j7293A06770c3135E7614J85568H0418f5974
$$ -92820 190513 323609 -114757 -114852 -132145 106770 -33135 57614 243182 80418 -65974
11596I9891k7835a46994l6212D8860e2342B0118b7594E8980b40074h4268B13355
$$ 99891 72056 -146994 -183206 48860 -52342 20118 -27594 58980 -240074 -84268 213355
11584c63544b2623A06456D6042h0278m3034B27728a19769j30135B52912C7952
$$ -363544 -22623 106456 46042 -80278 -123312 227728 -119769 -249904 252912 37952
11573I6070K74891a86775M3852B34097K38338B01694a3192L59j04409C46021h727
$$ 96070 370961 -186775 -142923 234097 472435 201694 -13192 -12833 -117242 346021 -8727
11561A69917a37021j33642j94107a62071D2824R8002b52493C27922B861L5941
$$ 169917 -137021 -270663 -464770 -162071 42824 140826 -252493 327922 2861 38802
11551C8802b39116J08343A99406a47114e2112A81517K24889C293J78469J28367
$$ 38802 -239116 -130773 199406 -147114 -52112 181517 406406 3293 181762 310129
11541C10129j38518k947k1229a7277D8814N3280f0117j85843B34803h6483J5607
$$ 310129 171611 168664 147435 -17277 48814 102094 -60117 -245960 234803 -86483 -70876
11530g0876A87608i0720B6745a28170C8712M418a5523j52844N0245J7416E9787
$$ -70876 187608 -90720 26745 -128170 38712 43130 -15523 -168367 -118122 -100706 59787
11518a09169a0899A00252l8942i893B13171n0852K9742K4905a49908B62665Q8432
$$ -109169 -10899 100252 61310 -9893 213171 162319 192061 216966 -149908 262665 351097
11507C51097j32506O5170F1776L05049g2717F1620a82143C9058j0481J52402K53682
$$ 351097 218591 283761 61776 366825 -72717 61620 -182143 39058 28577 180979 434661
11496D34661o8031j34240g1371A4960J40142J31901n9319c40067J51793D8421
$$ 434661 366630 232390 -71371 14960 155102 287003 227684 -340067 -188274 48421
11485B5705K21507R9719A49575K02555A49440O9338p1979l0612K97858g3395C96806
$$ 25705 247212 346931 149575 352130 149440 218778 146799 116187 414045 -73395 396806
11473A79536C6537c1525q1253M8693J8301C80856A62869L8998E6184b38170f2854
$$ 179536 36537 -31525 -112778 -64085 -45784 380856 162869 201867 56184 -238170 -62854
11461C07400e0477A00875N5401K4956b1342B38458c825j08714B4141M19100I5252
$$ 307400 -50477 100875 156276 181232 -21342 238458 -3825 -112539 24141 443241 95252
11449D85901F9838h1954B97155e992A34661E4691M2720h0609I9354L50544A11539
$$ 485901 69838 -81954 297155 -5992 134661 54691 97411 -80609 99354 449898 111539
11437a48387B72274H5675O2953Q2286M9578E0173P2970J2954a78952o3032a15958
$$ -148387 272274 85675 148628 230914 280492 50173 123143 136097 -178952 -241984 -115958
11425a77645f3353A42370J72599A53770h7091o2135I925M0340L6467a0855A82408
$$ -177645 -63353 142370 314969 153770 -87091 -149226 9925 50265 86732 -10855 182408
11413i6954D4837a75740j54755I2480J68912j15128O6827F090b13727B14010b54929
$$ -96954 44837 -175740 -330495 92480 261392 146264 213091 6090 -213727 214010 -254929
11401c9083A29895a44331J0198F404a54736B68552g3233l4392n590j03673h4417
$$ -39083 129895 -144331 -134133 6404 -154736 268552 -73233 -107625 -113215 -216888 -84417
11389A50202P6968i3352D498J59394l1906K44936j54683J79904a21224F94b64677
$$ 150202 227170 -93352 4498 163892 131986 376922 222239 402143 -121224 694 -264677
11377b58293a01897B7248K81194j22855a45060B13021j4120a24182j0336f4123
$$ -258293 -101897 27248 308442 185587 -145060 213021 198901 -124182 -134518 -64123
11366a08252k82562I1908P4106M9923J8537d2366E1209a43088b7806A00023e2537
$$ -108252 -390814 91908 166014 215937 234474 -42366 51209 -143088 -27806 100023 -52537
11354B20284a72259k28855E5805O529c24529D2445K454J44331a22857C5866a30259
$$ 220284 -172259 -401114 55805 62334 -324529 42445 44899 189230 -122857 35866 -130259
11342b37670m1528F3359L0039d9554A39320f3685C2434N874J15357b6924j09168
$$ -237670 -279198 63359 93398 -49554 139320 -63685 32434 38308 153665 -26924 -136092
11331a36092I7672b6601I718a77666g7299G6617K9048m4383J40129q9835f3578
$$ -136092 97672 -26601 9718 -177666 -77299 76617 105665 61282 201411 111576 -63578
11319B01785a60411e6465J4213l95611b14888C7710K25886i2300c110k02645m56
$$ 201785 -160411 -56465 -42252 -437863 -214888 37710 263596 -92300 -3110 -205755 -206211
11308b06211H8569a46656A25856n1404a87087B0556a87840b9182A170a32575B59631
$$ -206211 88569 -146656 125856 74452 -187087 20556 -187840 -29182 1170 -132575 259631
11296b79027A27946e8997B78472a15727H607e4845K2016A39500c46350i3610q5934
$$ -279027 127946 -58997 278472 -115727 8607 -54845 -32829 139500 -346350 -93610 -179544
11285a79544e494F5027c77419d6393A87091a99832j9944i6048H0614A0360b821
$$ -179544 -5494 65027 -377419 -46393 187091 -199832 -219776 -96048 80614 10360 -2821
11273c11557a09174p0068b0339j57778B63007H0803b08419c582B61034p7503A6228
$$ -311557 -109174 -179242 -20339 -178117 263007 80803 -208419 -3582 261034 183531 16228
11261I8999N9390J12305A24328k7258b42009h9828G9020a28961H3346P7948f3856
$$ 98999 158389 270694 124328 97070 -242009 -89828 79020 -128961 83346 161294 -63856
11249b27164B35700l6127D9054a1638j79377B20656n2551a67727A3036a40496
$$ -227164 235700 199573 49054 -11638 -191015 220656 168105 -167727 13036 -140496
11238A7655h0365j21517k35346B0737J72072c1198I4082a4658F110a27984o8288
$$ 17655 -80365 -201882 -437228 20737 192809 -31198 94082 -14658 6110 -127984 -196272
11227a96272B59559g7857l96073b35730d119k5037B7232b22131A04692P2885b3067
$$ -196272 259559 -77857 -473930 -235730 -4119 -29156 27232 -222131 104692 177577 -23067
11215g1752j67458C9827K99490c59424B34814a9178j91803j59544b8413l5896
$$ -71752 -239210 39827 339317 -359424 234814 -19178 -210981 -370525 -28413 -64309
11205f4309j07301B08164d0132a2676j5572m9047j18229I7413b94492a19980b2569
$$ -64309 -171610 208164 -40132 -12676 -28248 -77295 -195524 97413 -294492 -119980 -22569
11193C6927i4287H1557B1700J68246G029g4588r3011a2815A69174a06537A66703
$$ 36927 -94287 81557 21700 189946 7029 -74588 -167599 -12815 169174 -106537 166703
11181a63412f9913A84497B1114b32011A17968g381j36112d0648E6845i9852A12128
$$ -163412 -69913 184497 21114 -232011 117968 -7381 -143493 -40648 56845 -99852 112128
11169C7986e9570n1857L5934H8016a88038K7528B22551r1488e720A73183H2777
$$ 37986 -59570 -111427 -75493 88016 -188038 -160510 222551 131063 -5720 173183 82777
11157A4723g156k5609j15473B3996b05811O9363p753R488B91553d13743J74152
$$ 14723 -7156 -32765 -148238 23996 -205811 -136448 -144201 -134713 291553 -413743 -239591
11146b39591Q5487k3555A23820J8972B1454g8709j2698O559l2998A55281h7610
$$ -239591 -154104 -177659 123820 142792 21454 -78709 -91407 -84848 -117846 155281 -87610
11134b14530f7871l39960G3434a70419B1689J35080i1769c7075E9015J46218n7512
$$ -214530 -67871 -407831 73434 -170419 21689 156769 -91769 -37075 59015 205233 147721
11123A47721C4111J18345D4729J28474N3540e9855m7489A09960a8206n707A11724
$$ 147721 34111 152456 44729 173203 226743 -59855 -107344 109960 -18206 -23913 111724
11111A58292J72196c40773a37964A73380g3640C7418J49980a15710M3388A92878
$$ 158292 330488 -340773 -137964 173380 -73640 37418 187398 -115710 -72322 192878
11100h2254D21386b12288i0553B23916k3172G9197J78681a81637g2827a2007A31746
$$ -82254 421386 -212288 -90553 223916 200744 79197 257878 -181637 -72827 -12007 131746
11088I846K08594m1007n9799M41981k28604A51745K37636j57619J56346L25538
$$ 9846 218440 177433 117634 559615 331011 151745 389381 231762 388108 713646
11078G13646A63929A8388c7209D44306a174D27592F7217K37199R7509b0058A54143
$$ 713646 163929 18388 -37209 444306 -1174 427592 67217 304416 401925 -20058 154143
11066A90237m5964C2686J97962M2256K1100j46975J69199A42793J18766O5264
$$ 190237 144273 32686 230648 272904 294004 147029 316228 142793 261559 326823
11056C26823K97551B78918j02936C9732K19725L4260k2061K64994J44460B30088
$$ 326823 624374 278918 175982 39732 259457 293717 271656 536650 681110 230088
11045H03019l30283J96501n0089j46627P8686N9700O0504J74123r8419N8213J44449
$$ 803019 472736 669237 619148 472521 551207 610907 671411 845534 747115 805328 949777
11034I49777k69554k36474l215K24174l4344K43026k50210J58193p8080j18681
$$ 949777 680223 443749 440534 664708 630364 873390 623180 781373 703293 584612
11024E84612l9242J71825K2672J00716k08978J16156j33728j02998r9978O1675
$$ 584612 545370 717195 739867 840583 631605 747761 614033 511035 411057 472732
11014D72732K30010r5785M8520o9471q172J49228N4052j42640K42740l35916j66200
$$ 472732 702742 606957 655477 586006 577834 727062 781114 638474 881214 545298 379098
11003C79098K67083J0910N6112j59882M21246A16437O55887j34054j12802K43638
$$ 379098 646181 657091 713203 553321 974567 116437 772324 638270 525468 769106
10993G69106J40115k36719B89955K78462k271J57675k7486p0058L7571J94848
$$ 769106 909221 672502 289955 568417 566146 723821 696335 626277 663848 858696
10983H58696l49027L84341j77854l9120k51549R1686K37249L08849k15222Q9360
$$ 858696 509669 894010 716156 677036 425487 517173 754422 1063271 848049 937409
10973I37409l83898K03487n1568L66796l0350K81982l04742K14396j31062L22386
$$ 937409 553511 756998 705430 1072226 1041876 1323858 1019116 1233512 1102450 1424836
10963A424836j17228J78716N74214J13916k21290N68366K13991o8181k78973j4812
$$ 1424836 1307608 1486324 2060538 2174454 1953164 2521530 2735521 2667340 2388367 2373555
10953B373555l44357l9761m77063R8853R3955r3873l58883J27766J27490k4646
$$ 2373555 2029198 1989437 1512374 1611227 1705182 1611309 1252426 1380192 1507682 1483036
10943A483036J04224k26618k783J41231j74571m15480j32713j47206O3182l411
$$ 1483036 1587260 1360642 1357859 1499090 1324519 909039 776326 629120 692302 688891
10933F88891Q6241k78748B20586K26015A84517J56968M8412D9542N9180J43866
$$ 688891 775132 496384 220586 446601 184517 341485 389897 49542 108722 252588
10923B52588I4368D4835h6810E3901M3025A2855J12541c9045C04516b62180e368
$$ 252588 94368 44835 -86810 53901 96926 12855 125396 -39045 304516 -262180 -5368
10911D4629A4644b11259b4057j63987d0481J5226b096A49837f01108G2643b7813
$$ 44629 14644 -211259 -24057 -188044 -40481 -25255 -2096 149837 -601108 72643 -27813
10899a5154A54761k7382k6361f2072q8358N6233L5023A53555c8667A52372n968
$$ -15154 154761 127379 101018 -62072 -150430 -94197 -59174 153555 -38667 152372 146404
10888A46404J7839a46441B14547h6693L7662j37303K8368A69052b7090k89859
$$ 146404 164243 -146441 214547 -86693 -49031 -186334 -157966 169052 -27090 -316949
10878c16949J7912B6058g2265l13055a46363C4456K3998J45947a56571P3402A61195
$$ -316949 -299037 26058 -72265 -385320 -146363 34456 58454 204401 -156571 -83169 161195
10866F0752f05526c3381k3610A45059J30407F89J21943b41211d5311k8898j64450
$$ 60752 -605526 -33381 -56991 145059 275466 689 122632 -241211 -45311 -74209 -238659
10855b38659a12508B05263d6878k68716J8658E4217b92380J45237c1783C40901
$$ -238659 -112508 205263 -46878 -315594 -296936 54217 -292380 -147143 -31783 340901
10844A75865a6273k2795A20856a157A24564m9876O0469d4312B98369j46299n6249
$$ 175865 -16273 -39068 120856 -1157 124564 74688 135157 -44312 298369 152070 95821
10833I5821m488J8704d3328l7653p3578b9651M355o9445A61677b52835B78060
$$ 95821 91333 110037 -43328 -80981 -154559 -29651 -25296 -94741 161677 -252835 278060
10821F6999a05574j90768c9472L947k53710A80225a78181F917c13545A70932b9575
$$ 66999 -105574 -296342 -39472 -35525 -289235 180225 -178181 6917 -313545 170932 -29575
10809b23332c4859j7226f270k09559e8053k22384B2700a30177e6925n5060n1546
$$ -223332 -34859 -52085 -6270 -215829 -58053 -280437 22700 -130177 -56925 -111985 -163531
10798a63531F8794a59846d4250q7923r6328f7066Q392k50359C153N2277a71922
$$ -163531 68794 -159846 -44250 -132173 -228501 -67066 -58674 -309033 3153 55430 -171922
10786f1570K2389j53702o0668L1619G8675k499e35373a4513I6270M8545k2910
$$ -61570 -39181 -192883 -253551 -221932 78675 76176 -535373 -14513 96270 144815 121905
10775A21905D6694J5858i8648k5474M4703D3774a73797c0268L566k39928B5081
$$ 121905 46694 62552 -98648 -124122 -79419 43774 -173797 -30268 -26702 -266630 25081
10763b00674A63760b28061C02197i2730L2278C1121J92044n3668b81612h780C13335
$$ -200674 163760 -228061 302197 -92730 -60452 31121 223165 169497 -281612 -8780 313335
10751I5053J78403o2472B0243c71571c8237A19902D6295L4935b25036B87013a556
$$ 95053 273456 210984 20243 -371571 -38237 119902 46295 81230 -225036 287013 -1556
10739d24371a17455K8828b1362D526P0539e6609H9847J88312j18837J08581a50781
$$ -424371 -117455 -88627 -21362 4526 75065 -56609 89847 278159 159322 267903 -150781
10727I4197c21873J51894E4794b59720k9030k9428A37254e0323n9414A97670J723
$$ 94197 -321873 -169979 54794 -259720 -288750 -318178 137254 -50323 -109737 197670 199393
10716A99393G1608d34097E1613a13165n4271G4927M4204a76468h2693B10648b3660
$$ 199393 71608 -434097 51613 -113165 -167436 74927 119131 -176468 -82693 210648 -23660
10704A7297a11866j12499R4706B50630m0516F2625P8840h0807A25577b64331a16003
$$ 17297 -111866 -224365 -129659 250630 210114 62625 141465 -80807 125577 -264331 -116003
10692A430a14753j54283a31489k8331i553A967P809b16848R731j29397M2706k0564
$$ 1430 -114753 -269036 -131489 -159820 -9553 1967 9776 -216848 -207117 -336514 -293808 -314372
10680c14372B06257a59081B60190O0357a28364D7299a61914A25889J55479b7683
$$ -314372 206257 -159081 260190 320547 -128364 47299 -161914 125889 281368 -27683
10669A15191A4159a48543j90454J13940A84671p8878D523J42530H847K80815H93
$$ 115191 14159 -148543 -338997 -225057 184671 105793 4523 147053 8847 289662 893
10657b0892A45479a25384A97221q7214b48159d7716A0335J47045R3721b13403
$$ -20892 145479 -125384 197221 110007 -248159 -47716 10335 157380 251101 -213403
10646F1116A1589a44032j21660J00477r2488E934J07979C9495J51894e2658G6370
$$ 61116 11589 -144032 -265692 -165215 -257703 5934 113913 39495 191389 -52658 76370
10634e1128r6443l5266M0382j29929a29049A12648f3825j35176E139d34742a93698
$$ -51128 -147571 -182837 -142455 -272384 -129049 112648 -63825 -199001 5139 -434742 -193698
10622e577k1024H2115K715c28233C7576a25107B23693c63891a51691k4985A87496
$$ -5577 -26601 82115 84830 -328233 37576 -125107 223693 -363891 -151691 -176676 187496
10610a69801o3858N1245h3311l420q7571D0841b36986R7230B43501E4578P518
$$ -169801 -233659 -182414 -83311 -86731 -174302 40841 -236986 -139756 243501 54578 62096
10599F2096b17830e4579p4869I8518b61231a2504M672o140k03536C7287b45575
$$ 62096 -217830 -54579 -129448 98518 -261231 -12504 -7832 -13972 -217508 37287 -245575
10587a61491k1061q1333A34725a70821P2689A03825a38455c9066r9154A45295
$$ -161491 -182552 -263885 134725 -170821 -98132 103825 -138455 -39066 -138220 145295
10576b28690a9165j7373l3040H8481C7332b23662a03365A1678b18482C5296a32669
$$ -228690 -19165 -36538 -69578 88481 37332 -223662 -103365 11678 -218482 35296 -132669
10564h3808G0634J24095a35830N5699F0931a21796N101j40217A53365C4756L815
$$ -83808 70634 194729 -135830 -80131 60931 -121796 -116695 -256912 153365 34756 38571
10553C8571j5051j0696J53704b27862B1110r127a81662A55428a871A04197g2826
$$ 38571 23520 12824 166528 -227862 21110 11983 -181662 155428 -1871 104197 -72826
10541a01216G267d5103I6487b37841B22264j07643L32p812m1387a65556M1712
$$ -101216 7267 -45103 96487 -237841 222264 114621 114953 107141 65754 -165556 -123844
10530a23844B82297j22657b98953A33702c46337a4788B5879a64119A95116b38852
$$ -123844 282297 159640 -298953 133702 -346337 -14788 25879 -164119 195116 -238852
10519D9694L6375a06760j02433N5364K4608C37611a67462A40911a79212L3627
$$ 49694 86069 -106760 -209193 -153829 -129221 337611 -167462 140911 -179212 -145585
10509a45585j06406E1070J6267R9763F3811c48857a01120B53828b42513d7889
$$ -145585 -251991 51070 67337 167100 63811 -348857 -101120 253828 -242513 -47889
10498a08828O400K7809A24240C5577a39424r5853C48629a30370A07439b5533j52994
$$ -108828 -102428 -74619 124240 35577 -139424 -235277 348629 -130370 107439 -25533 -178527
10487a78527A1089g1952N05n7422A51851c70959a3506r744n7861j56628B742P6901
$$ -178527 11089 -71952 -71447 -128869 151851 -370959 -13506 -23250 -81111 -237739 2742 79643
10475G9643J78601f2601A27403i8285R693G0413J14202O4056o990L01643G9212
$$ 79643 258244 -62601 127403 -98285 -88592 70413 184615 248671 241681 543324 79212
10463B93954A24664L5746d8364j08650I5714d9432H8622L53717j33804C2664a48489
$$ 293954 124664 160410 -48364 -157014 95714 -49432 88622 442339 308535 32664 -148489
10451c5403j1931B3253g8709r6241j60525J53716k46627A79008l3222k0369E8296
$$ -35403 -47334 23253 -78709 -174950 -335475 -181759 -428386 179008 145786 125417 58296
10439i4784A04342E1221P4398j6580c1574F9227j7086b35917h6233k15932r531
$$ -94784 104342 51221 125619 109039 -31574 69227 52141 -235917 -86233 -302165 -311696
10428c11696B19547a44538k3332A58217n7468b80533B31878H925c6783I7308J78508
$$ -311696 219547 -144538 -167870 158217 100749 -280533 231878 8925 -36783 97308 275816
10417B75816E0862J129d6587C76772c17218a13529L6886A79572a88446A05246
$$ 275816 50862 51991 -46587 376772 -317218 -113529 -76643 179572 -188446 105246
10406h2448A4488b78976B53343C3286P3389d09870a102j13862M3448A82600h9771
$$ -82448 14488 -278976 253343 33286 106675 -409870 -1102 -114964 -71516 182600 -89771
10394B1470f3072I394K6361a97776I7142b13833G3903i6496I6134l3836a26774
$$ 21470 -63072 9394 35755 -197776 97142 -213833 73903 -96496 96134 62298 -126774
10382F7263c41019g3430D2484a5406C6971h2854C19252F6272J78376a05526C05249
$$ 67263 -341019 -73430 42484 -15406 36971 -82854 319252 66272 244648 -105526 305249
10370B93969R6966a16683A22635a08595F2390L20526o4840E0018K19975P0545
$$ 293969 390935 -116683 122635 -108595 62390 382916 318076 50018 269993 340538
10360C40538J11450j34513p0591J2647K63865k18378A20143P3023L0853R2802
$$ 340538 451988 317475 246884 259531 523396 305018 120143 193166 224019 316821
10350C16821R9302I4533K07568A27026M10640r4358A10561K41153m7091G2315
$$ 316821 416123 94533 302101 127026 537666 443308 110561 351714 304623 72315
10339A85739K04900J848A52824J75070J74783r3091P3427B24825M0840M1076o1663
$$ 185739 390639 392487 152824 327894 502677 409586 483013 224825 265665 306741 245078
10328B45078J71821k2208j08963A01145K98691j92524N9631J6893L9762A27273
$$ 245078 416899 394691 285728 101145 399836 207312 266943 283836 323598 127273
10317C61141b37345c8415D29699H8027J54344m4338J13495f5227A36317Q8081
$$ 361141 -237345 -38415 429699 88027 242371 198033 311528 -65227 136317 224398
10307B24398c36242A77464F2461H13e4639B5350K81932a587B14767h3529A36750
$$ 224398 -336242 177464 62461 813 -54639 25350 307282 -1587 214767 -83529 136750
10295C65216A50830d5773I505e0143A55503b01478F3039a06327A31431a41950
$$ 365216 150830 -45773 9505 -50143 155503 -201478 63039 -106327 131431 -141950
10284a17562b8066G2967R0605A4482J01902b77649D8284d4463k5439D7920K04860
$$ -117562 -28066 72967 163572 14482 116384 -277649 48284 -44463 -69902 47920 252780
10273B52780c5103F2171f1324A19297F071J77365n0091F552d16006a08499N3144
$$ 252780 -35103 62171 -61324 119297 6071 183436 133345 6552 -416006 -108499 -55355
10262e5355D5754d84725A1502Q5873c12989E2328M4178K43285c46204B01571h5991
$$ -55355 45754 -484725 11502 97375 -312989 52328 96506 339791 -346204 201571 -85991
10250B20342H9819d1048J198A0265P5047B6837L56974f7305B02380g5084B38017
$$ 220342 89819 -41048 -39850 10265 85312 26837 383811 -67305 202380 -75084 238017
10238A73646C8612d4276n6749A79347A6413J53825F1648b6960m1196j39581A24008
$$ 173646 38612 -44276 -101025 179347 16413 170238 61648 -26960 -68156 -207737 124008
10226b39836g7547o5823B6163R9933d48119b21310i4561B7850a83224A68165f8200
$$ -239836 -77547 -143370 26163 126096 -448119 -221310 -94561 27850 -183224 168165 -68200
10214b01792I0204i7737K5093p4578G2672a16978j25355A44229a26955r0461j27867
$$ -201792 90204 -97737 -72644 -147222 72672 -116978 -242333 144229 -126955 -217416 -345283
10203c45283a48251k6239F513N7740P0402i9274H9478a11619A64026a30702D7079
$$ -345283 -148251 -174490 6513 64253 134655 -99274 89478 -111619 164026 -130702 47079
10191c53810g6362E5422M826g9179p6948n1625j75605Q5337a01406A16794J13160
$$ -353810 -76362 55422 60248 -79179 -156127 -207752 -383357 -298020 -101406 116794 229954
10180B29954a00510O684B8203c426B7727d8872a5527j52091C7450f0607E54a62271
$$ 229954 -100510 -93826 28203 -3426 27727 -48872 -15527 -167618 37450 -60607 554 -162271
10167b70474g7237F194P6547e2069q2905A42758b21459C2594h9465J2389G9886
$$ -270474 -77237 6194 82741 -52069 -134974 142758 -221459 32594 -89465 -77076 79886
10155a61329r1253A65320d8943j74034o9126N9578h1573a47C721O213J97107a70555
$$ -161329 -252582 165320 -48943 -222977 -292103 -232525 -81573 -147 3721 9934 207041 -170555
10142e5249C8006b30448A91779G8264f5764D02033H3221a57634F2823a17299A60758
$$ -55249 38006 -230448 191779 78264 -65764 402033 83221 -157634 62823 -117299 160758
10130d35269G0684d4363C53690f5793l42107J5157F599b49289G0308j9593P0143
$$ -435269 70684 -44363 353690 -65793 -407900 -392743 6599 -249289 70308 50715 120858
10119A20858d20501a02372h591j96113B47551a28798M8151A28325a76897k88056
$$ 120858 -420501 -102372 -8591 -204704 247551 -128798 -80647 128325 -176897 -464953
10109d64953a47410l0170c4798C5958a93724P7471A20472c61653c1887H8346c76858
$$ -464953 -147410 -177580 -34798 35958 -193724 -116253 120472 -361653 -31887 88346 -376858
10097c09245F9306d5932A82461a8250k42332J27204C419M6769M176a40821A92981
$$ -309245 69306 -45932 182461 -18250 -260582 -133378 3419 50188 54364 -140821 192981
10085a62156L9349A73128K25777h8181k00533A52120Q697a21026D6632Q9939p347
$$ -162156 -122807 173128 398905 -88181 -288714 152120 160817 -121026 46632 136571 129224
10074A29224a36304B0826L7734b23669L2944m3873O5055A41496h9318l10500i2140
$$ 129224 -136304 20826 58560 -223669 -190725 -234598 -169543 141496 -89318 -399818 -92140
10062C17450A21868A0641L09211C8980b16242B08067a4351m1472k30314B62102
$$ 317450 121868 10641 319852 38980 -216242 208067 -14351 -55823 -286137 262102
10051A43178d2690A93634b56598a23429l7662A28717l4049a26136A89127b1699
$$ 143178 -42690 193634 -256598 -123429 -161091 128717 94668 -126136 189127 -21699
10040A18818J28931d6331k32570a07035k25901h2680j55786h5085j39841h3337
$$ 118818 247749 -46331 -278901 -107035 -332936 -82680 -238466 -85085 -224926 -83337
10029d57742b05014k64185g8265k06364n8115O8919G2383h9892M0278D883g5448
$$ -457742 -205014 -469199 -78265 -284629 -342744 -273825 72383 -89892 -49614 4883 -75448
10017C79711A2706d1781A26431C4937J66527c98047a0012j37110j42472a09411
$$ 379711 12706 -41781 126431 34937 201464 -398047 -10012 -147122 -289594 -109411
10006E948a64050K2578F2246R8041n7838c0859l68699C33855c16081E3186f8706
$$ 5948 -164050 -141472 62246 160287 102449 -30859 -399558 333855 -316081 53186 -68706
9994g438l32247R6345q9204E7989B7276i2194G6507J63164b20942H6952a05410
$$ -7438 -339685 -243340 -332544 57989 27276 -92194 76507 239671 -220942 86952 -105410
9982g0166C6911K2595b73186E0583K21553C712b67013P4379A41642a23261A53211
$$ -70166 36911 59506 -273186 50583 272136 3712 -267013 -192634 141642 -123261 153211
9970a87819L9025H6770Q9191J12008c39088J30365j44979a19956e8820E4398f4867
$$ -187819 -148794 86770 175961 287969 -339088 -208723 -353702 -119956 -58820 54398 -64867
9958B60418G7815c82324A0098c41935J01088D56806A9245K9678c7863A14482k6677
$$ 260418 77815 -382324 10098 -341935 -240847 456806 19245 48923 -37863 114482 87805
9947H7805N902b53695G4136a41469D4304j8569f3749k31149h7426C3304b4389
$$ 87805 93707 -253695 74136 -141469 44304 25735 -63749 -294898 -87426 33304 -24389
9935c23297f728H0999a6583B9191g3637B46678C61Q5922b23773n2122g4550k09411
$$ -323297 -6728 80999 -16583 29191 -73637 246678 361 86283 -223773 -275895 -74550 -283961
9923b83961e7820b6195i836B6419a84188h3351a5812q4050D0279a79750D7345
$$ -283961 -57820 -26195 -9836 26419 -184188 -83351 -15812 -99862 40279 -179750 47345
9911a9761C4362a611j8979A10812d5353A04457b13149A48418J35610a69612E35
$$ -19761 34362 -1611 -20590 110812 -45353 104457 -213149 148418 284028 -169612 535
9899a67227m0226B6574c19791C13364b00484E2101b75501J05093f4810j17632
$$ -167227 -207453 26574 -319791 313364 -200484 52101 -275501 -170408 -64810 -182442
9889a82442E7828M6609d8986D2473D172i3880j0140A07097b23179F8051J05395
$$ -182442 57828 104437 -48986 42473 4172 -93880 -104020 107097 -223179 68051 173446
9878A73446i9916n10542A35953c50727D2352a10427l1075d9378A91920n8051b29988
$$ 173446 -99916 -610458 135953 -350727 42352 -110427 -141502 -49378 191920 133869 -229988
9866A22850a99014K1709A75764J42605h1710A73034a47252K0540e3031B7784b54392
$$ 122850 -199014 -177305 175764 318369 -81710 173034 -147252 -126712 -53031 27784 -254392
9854C95371b71376E1272i8677j14176B11397i9188j45325b4040k9747A74803b56823
$$ 395371 -271376 51272 -98677 -212853 211397 -99188 -244513 -24040 -53787 174803 -256823
9842a378o9769I4800a84698A20087n3959a29531N1533m0329k86758g2197p5647
$$ -1378 -71147 94800 -184698 120087 66128 -129531 -77998 -118327 -405085 -72197 -147844
9831a47844n2922n2182a24181d5264F6902a01763B61436C0165J2923b7635r1342
$$ -147844 -200766 -252948 -124181 -45264 66902 -101763 261436 30165 43088 -27635 -118977
9820a18977k1054G5153d01204a56955K9737F0020b82644A50180a33067j97637
$$ -118977 -140031 75153 -401204 -156955 -127218 60020 -282644 150180 -133067 -330704
9810c30704B46978G1320c4772J5264j79217A40089r262a77561j97958a38942l4612
$$ -330704 246978 71320 -34772 -19508 -198725 140089 130827 -177561 -375519 -138942 -173554
9799a73554J9293A42866h2236b5548h099G3648C5671i2570B2185a00600k06024
$$ -173554 -154261 142866 -82236 -25548 -8099 73648 35671 -92570 22185 -100600 -306624
9788c06624f2405h516j73841b6676j65778j33193D1242J05730j991b25751j56686
$$ -306624 -62405 -8516 -182357 -26676 -192454 -325647 41242 146972 144981 -225751 -382437
9777c82437F5101a38267j10077c9022j78812j19493c3976j68128J7004K1544A83510
$$ -382437 65101 -138267 -248344 -39022 -217834 -337327 -33976 -202104 -185100 -163556 183510
9765a30024N5179A11151m8910R078B9663L7999o984a20825C22315A29105M2673
$$ -130024 -74845 111151 62241 71319 29663 67662 60678 -120825 322315 129105 171778
9754A71778b64197g9259l9530b0115j05768e8684C11929b64417K9282k2835d1327
$$ 171778 -264197 -79259 -118789 -20115 -125883 -58684 311929 -264417 -235135 -257970 -41327
9742c42303c3383B26509i8217k64873a36283J0117k10575i6656B24883C5154J7715
$$ -342303 -33383 226509 -98217 -363090 -136283 -126166 -336741 -96656 224883 35154 52869
9731E2869i2484j9611d998k38209A73020g1773l76411e3445o7619q9011B12895
$$ 52869 -92484 -112095 -4998 -243207 173020 -71773 -448184 -53445 -121064 -210075 212895
9719A54182a22201j83099i3192n5477M8917A30508a88990A15418R941a00155B70006
$$ 154182 -122201 -305300 -93192 -148669 -99752 130508 -188990 115418 125359 -100155 270006
9707b96261A07015a32464o9696K7848L9860A61439i1876H4770b28804M1400j34394
$$ -296261 107015 -132464 -202160 -174312 -134452 161439 -91876 84770 -228804 -187404 -321798
9696c21798L2863a23309q165C97536b87409a2029l72689c9874j61828H1594e9255
$$ -321798 -288935 -123309 -131474 397536 -287409 -12029 -384718 -39874 -201702 81594 -59255
9684a06154B07347d35409A03261j0689K6356R690n5174O2804E2850K2845a40397
$$ -106154 207347 -435409 103261 92572 118928 128618 73444 136248 52850 75695 -140397
9672d7346C2592a22242l426B40599E9463a07672A979Q0747J53759b46843J4166
$$ -47346 32592 -122242 -125668 240599 59463 -107672 1979 82726 236485 -246843 -232677
9661b32677p5131B36509i0064o999A0275h0493I1670A2216c81727C9146K41881
$$ -232677 -307808 236509 -90064 -97063 10275 -80493 91670 12216 -381727 39146 281027
9650B81027b78432A2256d97498a0410A02678a11027C98a52047ol22031a51844
$$ 281027 -278432 12256 -497498 -10410 102678 -111027 398 -152047 -152053 -474084 -151844
9638a50563B06723r3032J1189j5555d50874B04446c72173a42854A02127p859b8956
$$ -150563 206723 113691 124880 109325 -450874 204446 -372173 -142854 102127 94268 -28956
9626d02247A6234d633n5886j90616a6022n30531f9212R104A82529J04255q5447
$$ -402247 16234 -4633 -60519 -251135 -16022 -546553 -69212 -60108 182529 286784 201337
9615B01337b25195q7947A11303l415b0949F6248J23931N6623d73686A28658b03560
$$ 201337 -225195 -313142 111303 107888 -20949 66248 190179 246802 -473686 128658 -203560
9603b64675e8966k71026g3495j06820M4735L2745F8341c9563q8637f0822A30768
$$ -264675 -58966 -329992 -73495 -180315 -135580 -102835 68341 -39563 -128200 -60822 130768
9591b10709O7371e851j58106j40405G1895f21758A19429m1086l7305J8097a32256
$$ -210709 -143338 -5851 -163957 -304362 71895 -621758 119429 78343 41038 59135 -132256
9579a93500A91500r2197E930N1725c11868C09475A31311k377b4560k09039O3434
$$ -193500 191500 99303 5930 57655 -311868 309475 131311 128934 -24560 -233599 -170165
9568a70165O309F3038A5963Q8864a6836A15432O3796h7649A97712D1759a15766
$$ -170165 -163856 63038 15963 104827 -16836 115432 179228 -87649 197712 41759 -115766
9556b2146H0241a70941j86837R0718o8146J51815A45137E5882B1181a97551M8762
$$ -22146 80241 -170941 -357778 -267060 -335206 -183391 145137 55882 21181 -197551 -148789
9545a48789F8195a17697a3418k44039A10671B0552b85577P7848A7210b25212O6168
$$ -148789 68195 -117697 -13418 -257457 110671 20552 -285577 -207729 17210 -225212 -159044
9534a59044A00746b50656C1769i3857k3176J1191I5968a36065d2982H412e29609
$$ -159044 100746 -250656 31769 -93857 -117033 -105842 95968 -136065 -42982 8412 -529609
9522f0372l25486N0267a47935f9962B53516b12736e3421j54458P2346b7204C81279
$$ -60372 -385858 -335591 -147935 -69962 253516 -212736 -53421 -207879 -135533 -27204 381279
9510a56273e0605E070a31070N4168k2484b2025B27644H9585l7857g7361m088F7719
$$ -156273 -50605 5070 -131070 -76902 -99386 -22025 227644 89585 51728 -77361 -81449 67719
9497B6904A1068M4827f4772j92549B91397b09185G6433a78393M6478k5024g0581
$$ 26904 11068 55895 -64772 -257321 291397 -209185 76433 -178393 -131915 -156939 -70581
9485A65220a63135M3436C94321b45183r8319d7868q0844j38154a28021E480e8647
$$ 165220 -163135 -119699 394321 -245183 -343502 -47868 -128712 -266866 -128021 5480 -58647
9473i4493L9135A06560a09986E8685a03242D1848O6446a04099j6535r1435A1807
$$ -94493 -55358 106560 -109986 58685 -103242 41848 108294 -104099 -120634 -212069 11807
9461c17146E1869M7624M5275b49627B22459a34916B47098g5440n1354M3892j97444
$$ -317146 51869 99493 144768 -249627 222459 -134916 247098 -75440 -126794 -82902 -280346
9450b80346E1930a83041q4839R3447h3978F4765b46616h520C0953G550g1844j01821
$$ -280346 51930 -183041 -267880 -174433 -83978 64765 -246616 -8520 30953 7550 -71844 -173665
9438a73665D039g3571c4555l15615J51038l540h9348j93268B11894n9849h8801
$$ -173665 4039 -73571 -34555 -350170 -199132 -202672 -89348 -282616 211894 152045 -88801
9426F3622J02003i6054k66750e4127K2983B1943M92J71300a14136A17692a90244
$$ 63622 165625 -96054 -362804 -54127 -31144 21943 22435 193735 -114136 117692 -190244
9414A18006i2910d673k16293R2828a5032A64364G8060d38052J77954M0086M8988
$$ 118006 -92910 -4673 -220966 -128138 -15032 164364 78060 -438052 -260098 -220012 -171024
9403a71024k00612F7567b09356A18766d1852l02966A01470a9669A14015b6475
$$ -171024 -371636 67567 -209356 118766 -41852 -344818 101470 -19669 114015 -26475
9392C12450b52937A14280D0999O6934M5579a98445n1505J24883H3840A6727J5447
$$ 312450 -252937 114280 40999 107933 153512 -198445 -249950 -125067 83840 16727 32174
9381C2174a10462E130d12616B7688A740b707j08588L1468K5507A26315a04199
$$ 32174 -110462 5130 -412616 27688 1740 -2707 -111295 -79827 -54320 126315 -104199
9369c08397N8770M6176b3403m5621k95713f868k35729A32850d9160D36a02890
$$ -308397 -249627 -203451 -23403 -69024 -364737 -6868 -242597 132850 -49160 436 -102890
9357a29310d1880l98202I9574a97214n3557b0278l7980F3238J19783k3118G698
$$ -129310 -41880 -440082 99574 -197214 -250771 -20278 -58258 63238 183021 159903 7698
9345i6250q8762l4750B9412f8499j46550B6375Q4950b1518o0007k1840N768f181
$$ -96250 -185012 -219762 29412 -68499 -215049 26375 111325 -21518 -81525 -103365 -97597 -6181
9332A91012a96181k1854P7644E1061K32609c8299r6850r35N6488m5390c0830a857
$$ 191012 -196181 -218035 -140391 51061 283670 -38299 -135149 -136084 -79596 -124986 -30830 -1857
9319e7325p2251D1832a21102e5063k50823b1006j96344j55253g4260m0921d3619
$$ -57325 -129576 41832 -121102 -55063 -305886 -21006 -217350 -372603 -74260 -115181 -43619
9307A05171j6055j7113J66221d0417J7798n0162A60958b45212j7865C4569h9519
$$ 105171 89116 72003 238224 -40417 -22619 -72781 160958 -245212 -263077 34569 -89519
9295f6107k04084j9998d2704I5158J7111b5818B24882a96150Q0414C86892c1771
$$ -66107 -270191 -290189 -42704 95158 112269 -25818 224882 -196150 -115736 386892 -31771
9283A43835j6597Q859a23324D9413c5033j32240a8631A62833E686h413n32840
$$ 143835 127238 136097 -123324 49413 -35033 -167273 -18631 162833 5686 -8413 -541253
9272e41253a11327p051c0667q3377D16411A0029g1385I0715m2079K44273c6089
$$ -541253 -111327 -118378 -30667 -114044 416411 10029 -71385 90715 48636 292909 -36089
9260d3702I0125a86320r2540b2627R244l41764j03409I8161l9370j2399a42479
$$ -43702 90125 -186320 -278860 -22627 -13383 -355147 -458556 98161 58791 46392 -142479
9248A26329a37385q6409j07262i4476C1227e61602K28638E3869c06332g4296K8282
$$ 126329 -137385 -223794 -331056 -94476 31227 -561602 -332964 53869 -306332 -74296 -46014
9237d6014q6641H4439b30561Q5932G5647c26588J37621l0805b5162A4098F541
$$ -46014 -132655 84439 -230561 -144629 75647 -326588 -188967 -219772 -25162 14098 6541
9225f2524A3919b66858A74161b25017a2395A45936d8748k06751e2151k03331h1327
$$ -62524 13919 -266858 174161 -225017 -12395 145936 -48748 -255499 -52151 -255482 -81327
9213g7824G6184d00883E442c85064A63733b83313a15508B36292g5769B4985J99072
$$ -77824 76184 -400883 5442 -385064 163733 -283313 -115508 236292 -75769 24985 224057
9202B24057E4690a72646n4548d3935b0319n1354B36285a41251A9549f7179m02678
$$ 224057 54690 -172646 -227194 -43935 -20319 -71673 236285 -141251 19549 -67179 -469857
9191d69857a23649b3100k10140H55a53806A08577J14224A2095k082c93262e7686
$$ -469857 -123649 -23100 -233240 855 -153806 108577 222801 12095 10013 -393262 -57686
9179b54343P5076A00472a68436c0286k98448e3162H7190b12173N2081a9457j02445
$$ -254343 -179267 100472 -168436 -30286 -328734 -53162 87190 -212173 -160092 -19457 -121902
9168a21902L2701A9887n950c43000B65976A2806b14670k20930A31648J34912a08739
$$ -121902 -89201 19887 13937 -343000 265976 12806 -214670 -435600 131648 266560 -108739
9156b09543j1449Q6866H6662c10862A8239a32694o9523M8752M4065j80592j89436
$$ -209543 -220992 -134126 86662 -310862 18239 -132694 -202217 -153465 -109400 -289992 -479428
9145d79428A03354G190e297j64331o433Q7377k56502R5951g0002C57398O1657
$$ -479428 103354 7190 -5297 -169628 -176061 -88684 -345186 -249235 -70002 357398 419055
9134D19055F0916e66347K20308E3430K91583E6596b0511A11445a59434A47754
$$ 419055 60916 -566347 -346039 53430 345013 56596 -20511 111445 -159434 147754
9123b18374J5277N3643d3327Q230j47759f169H9734c9469B18960e0625j36322
$$ -218374 -203097 -149454 -43327 -35097 -182856 -6169 89734 -39469 218960 -50625 -186947
9112a86947d9229o6737b2767q7499j16075d8211f99F1579a36976C7140P560Q7912
$$ -186947 -49229 -115966 -22767 -110266 -226341 -48211 -699 61579 -136976 37140 44700 132612
9100A32612a0353j28367I4587h5565K8700j83181H3929J44532b64665i146A46912
$$ 132612 -10353 -138720 94587 -85565 -56865 -240046 83929 228461 -264665 -9146 146912
9088a74906b65k65257a4834A647J01661a25147B6582N4420O7464b4701a1268l9956
$$ -174906 -265 -265522 -14834 1647 103308 -125147 26582 81002 148466 -24701 -11268 -51224
9076e1224l9198A22757d86108a15430j22119B18064d84365a3611k54373R7852
$$ -51224 -90422 122757 -486108 -115430 -237549 218064 -484365 -13611 -267984 -170132
9066a70132Q1073j75583B4015a402q7280A21600a9917j3042N558G5199Q3293b09230
$$ -170132 -89059 -264642 24015 -1402 -88682 121600 -19917 -32959 -27401 75199 158492 -209230
9053b94073D3555a16756e2004E227a40794j06176F3497A3990b21592j60548D2071
$$ -294073 43555 -116756 -52004 5227 -140794 -246970 63497 13990 -221592 -382140 42071
9041B15990a15447I6369A5303b8562q3836C30987m6840a15964q6292f8622k45957
$$ 215990 -115447 96369 15303 -28562 -112398 330987 284147 -115964 -202256 -68622 -314579
9030c14579a27193r4137R1582e0608G8847B7914a11282A70717b20211E9505d0122
$$ -314579 -127193 -221330 -129748 -50608 78847 27914 -111282 170717 -220211 59505 -40122
9018a17150r5888B05330q839c03688b5473B17820f6441A31289N7442b70384J30417
$$ -117150 -213038 205330 196491 -303688 -25473 217820 -66441 131289 188731 -270384 -139967
9007a39967L4030A15786m7383b52676A80835J72962g2933j36201h5973q7986j07816
$$ -139967 -105937 115786 68403 -252676 180835 353797 -72933 -209134 -85973 -173959 -281775
8996b81775E9983b04998F3369b71412C57893I4102k4927A9130a22510A9747O0578
$$ -281775 59983 -204998 63369 -271412 357893 94102 69175 19130 -122510 19747 80325
8985H0325c48901A89661J8050a92203a7334F9924a42074B28469D1478a76131J1954
$$ 80325 -348901 189661 207711 -192203 -17334 69924 -142074 228469 41478 -176131 -164177
8974a64177b5430j66562K4997l33423A10964a01486M0920n6282j22062a02048
$$ -164177 -25430 -191992 -166995 -500418 110964 -101486 -60566 -116848 -238910 -102048
8963A27566c71765B2389P694c16656N9249B71442n139G8249q05c7549A39883k7560
$$ 127566 -371765 22389 30083 -316656 -257407 271442 266303 78249 77444 -37549 139883 112323
8951A12323P2029f449j65255K9979B00959I4188a54807A70437e3432j18967k0236
$$ 112323 184352 -6449 -171704 -141725 200959 94188 -154807 170437 -53432 -172399 -192635
8940a92635l7087o6757k3743R5656c6803A96700c926l248j33590A11686b3556
$$ -192635 -229722 -296479 -320222 -224566 -36803 196700 -3926 -7174 -140764 111686 -23556
8928c682k30927O7200P6689j24167d4388k9665J8512B63913a26928A56866K36603
$$ -3682 -234609 -167409 -90720 -214887 -44388 -74053 -55541 263913 -126928 156866 393469
8917C93469g1583B72751L4425M9778j2923J08274j52663Q62558J90674P87804
$$ 393469 -71583 272751 307176 356954 344031 452305 299642 1162200 1352874 2140678
8907B140678J095084M585576N52156C304935j513843m81759m58793Q4344C08534
$$ 2140678 3235762 7821338 8373494 3304935 1791092 1309333 850540 934884 308534
8897B07998J17107K4161H1127K74765j14328p3682a34000A9079a34423A26890
$$ 207998 325105 349266 81127 355892 241564 167882 -134000 19079 -134423 126890
8886d7940C9037a50741l1415B07602a45756K8167C15760b03551A80817E3992J60294
$$ -47940 39037 -150741 -182156 207602 -145756 -117589 315760 -203551 180817 53992 214286
8875B14286a65664K7137j3079M9540A3722b67006h8118H6560J6859a24722A97154
$$ 214286 -165664 -138527 -151606 -102066 13722 -267006 -88118 86560 103419 -124722 197154
8863B3721b81215a27363m0118h0401j55362N506A10545b23484A73093d6739r4221
$$ 23721 -281215 -127363 -167481 -80401 -235763 -230257 110545 -223484 173093 -46739 -140960
8852a40960K3070k132H4781L7570O1739J199l7756a70118P2011Q775A52331a6710
$$ -140960 -117890 -120022 84781 122351 184090 185289 147533 -170118 -98107 -89332 152331 -16710
$$ [...]
##END NTUPLES=NMR SPECTRUM
##END=
