
##TITLE=AC1222_Punto_6074794_1Xs9jaGfa0
##JCAMPDX= 6.0         $$ Bruker NMR JCAMP-DX V2.0
##DATA TYPE= NMR SPECTRUM
##DATA CLASS= NTUPLES
##ORIGIN= BRUKER
##OWNER= Administrator
$$ 1.72 TOPSPIN		Version 2.1
$$ 2012-05-09 00:23:58.718 -0500  Administrator@TOPSPIN
$$ Compression mode = diff/dup
##.OBSERVE FREQUENCY= 400.13188235
##.OBSERVE NUCLEUS= ^1H
##.ACQUISITION MODE= SIMULTANEOUS (DQD)
##.ACQUISITION SCHEME= undefined
##.AVERAGES= 64
##.DIGITISER RES= 22
##SPECTROMETER/DATA SYSTEM= spect
##.PULSE SEQUENCE= noesygpps1d.comp
##.SOLVENT NAME= COFFEE_meoh
##.SHIFT REFERENCE= INTERNAL, COFFEE_meoh, 1, 14.9668
##AUDIT TRAIL= $$ (NUMBER, WHEN, WHO, WHERE, PROCESS, VERSION, WHAT)
$$ ##TITLE= Audit trail, TOPSPIN		Version 2.1
$$ ##JCAMPDX= 5.01
$$ ##ORIGIN= Bruker BioSpin GmbH
$$ ##OWNER= Administrator
$$ $$ C:\Bruker\TOPSPIN/data/COFFEE/nmr/AC1222_Punto_6074794_1Xs9jaGfa0/72/pdata/1/auditp.txt
$$ ##AUDIT TRAIL=  $$ (NUMBER, WHEN, WHO, WHERE, PROCESS, VERSION, WHAT)
(   1,<2012-05-09 00:23:53.937 -0500>,<Administrator>,<TOPSPIN>,<go>,<TOPSPIN 2.1>,
      <created by zg
	started at 2012-05-09 00:12:23.703 -0500,
	POWCHK enabled, PULCHK disabled,
       configuration hash MD5:
       AF F2 23 6B 01 CD 40 DD E5 A1 38 A0 06 EA F7 77
       data hash MD5: 64K
       4C D7 89 8C 2B 5E BC B4 B5 86 24 9E 50 6C D4 BB>)
(   2,<2012-05-09 00:23:56.625 -0500>,<Administrator>,<TOPSPIN>,<proc1d>,<TOPSPIN 2.1>,
      <Start of raw data processing
       efp LB = 0.3 FT_mod = 6 PKNL = 1 PHC0 = 0 PHC1 = 0 SI = 128K 
       data hash MD5: 128K
       59 2F 4C D5 2D 21 D4 D2 A2 B9 DD 4E E3 93 54 2D>)
(   3,<2012-05-09 00:23:57.937 -0500>,<Administrator>,<TOPSPIN>,<proc1d>,<TOPSPIN 2.1>,
      <pk PHC0 = 34.17847 PHC1 = 0 
       data hash MD5: 128K
       D0 59 76 1F CA CC FB 18 7B BF 8D 7C EC 16 1E B1>)
(   4,<2012-05-09 00:23:58.406 -0500>,<Administrator>,<TOPSPIN>,<proc1d>,<TOPSPIN 2.1>,
      <abs ABSG = 1 
       data hash MD5: 128K
       B5 15 5E 34 E3 07 80 A8 8A 33 4B 00 9E 26 A9 6C>)
(   5,<2012-05-09 00:23:58.484 -0500>,<Administrator>,<TOPSPIN>,<proc1d>,<TOPSPIN 2.1>,
      <abs ABSG = 2 
       data hash MD5: 128K
       D7 D9 55 08 3C 86 D0 92 80 72 5A 83 DD 6D F5 56>)
(   6,<2012-05-09 00:23:58.531 -0500>,<Administrator>,<TOPSPIN>,<proc1d>,<TOPSPIN 2.1>,
      <abs ABSG = 3 
       data hash MD5: 128K
       20 A4 D3 EB 20 A5 E1 86 65 EB E8 37 1B 08 EE 85>)
(   7,<2012-05-09 00:23:58.593 -0500>,<Administrator>,<TOPSPIN>,<proc1d>,<TOPSPIN 2.1>,
      <abs ABSG = 4 
       data hash MD5: 128K
       BB EC 57 42 73 12 D9 FC F0 26 F7 70 87 27 B7 00>)
(   8,<2012-05-09 00:23:58.640 -0500>,<Administrator>,<TOPSPIN>,<proc1d>,<TOPSPIN 2.1>,
      <abs ABSG = 5 
       data hash MD5: 128K
       CC 72 30 A0 0A 25 8D 4F 80 BD A8 D0 57 B2 0C F2>)
$$ ##END=
$$ 
$$ $$ hash MD5
$$ $$ B5 11 0C 56 DF E8 47 A5 0E 11 66 50 DD 56 E1 45
##$RELAX= 
##$RELAX= 
##$RELAX= 
##$RELAX= 
##$RELAX= 
##$RELAX= 
##$RELAX= 
##$RELAX= 
$$ Bruker specific parameters
$$ [...]
##$TP07= 0
##$TPNAME0= <>
##$TPNAME1= <>
##$TPNAME2= <>
##$TPNAME3= <>
##$TPNAME4= <>
##$TPNAME5= <>
##$TPNAME6= <>
##$TPNAME7= <>
##$TPOAL= (0..7)
0.5 0.5 0.5 0.5 0.5 0.5 0.5 0.5
##$TPOFFS= (0..7)
0 0 0 0 0 0 0 0
##$TUNHIN= 0
##$TUNHOUT= 0
##$TUNXOUT= 0
##$USERA1= <user>
##$USERA2= <user>
##$USERA3= <user>
##$USERA4= <user>
##$USERA5= <user>
##$V9= 5
##$VALIST= <valist>
##$VCLIST= <CCCCCCCCCCCCCCC>
##$VD= 0
##$VDLIST= <DDDDDDDDDDDDDDD>
##$VPLIST= <PPPPPPPPPPPPPPP>
##$VTLIST= <TTTTTTTTTTTTTTT>
##$WBST= 1024
##$WBSW= 4
##$XGAIN= (0..3)
0 0 0 0
##$XL= 0
##$YL= 0
##$YMAX_a= 11070859
##$YMIN_a= -6056777
##$ZGOPTNS= <>
##$ZL1= 120
##$ZL2= 120
##$ZL3= 120
##$ZL4= 120
##$ABSF1= 14.9668
##$ABSF2= -5.585731
##$ABSG= 5
##$ABSL= 3
##$ALPHA= 0
##$AQORDER= 0
##$ASSFAC= 0
##$ASSFACI= 0
##$ASSFACX= 0
##$ASSWID= 0
##$AUNMP= <proc_prof1d_extract.lims>
##$AXLEFT= 0
##$AXNAME= <>
##$AXNUC= <1H>
##$AXRIGHT= 0
##$AXTYPE= 0
##$AXUNIT= <>
##$AZFE= 0.1
##$AZFW= 0.1
##$BCFW= 0
##$BC_mod= 0
##$BYTORDP= 0
##$COROFFS= 0
##$CY= 15
##$DATMOD= 1
##$DC= 0
##$DFILT= <>
##$DTYPP= 0
##$F1P= 0
##$F2P= 0
##$FCOR= 0.5
##$FTSIZE= 131072
##$FT_mod= 6
##$GAMMA= 0
##$GB= 0
##$INTBC= 1
##$INTSCL= 1
##$ISEN= 128
##$LB= 0.3
##$LEV0= 0
##$LPBIN= 0
##$MAXI= 10000
##$MC2= 0
##$MEAN= 0
##$ME_mod= 0
##$MI= 0
##$NCOEF= 0
##$NC_proc= -3
##$NLEV= 6
##$NOISF1= 0
##$NOISF2= 0
##$NSP= 0
##$NTH_PI= 0
##$NZP= 0
##$OFFSET= 14.9668
##$PC= 1
##$PHC0= 34.17847
##$PHC1= 0
##$PH_mod= 1
##$PKNL= yes
##$PPARMOD= 0
##$PPDIAG= 0
##$PPIPTYP= 0
##$PPMPNUM= 2147483647
##$PPRESOL= 1
##$PSCAL= 4
##$PSIGN= 0
##$PYNMP= <proc.py>
##$REVERSE= no
##$SF= 400.130005527765
##$SI= 131072
##$SIGF1= 0
##$SIGF2= 0
##$SINO= 400
##$SIOLD= 131072
##$SPECTYP= <>
##$SREGLST= <1H.CDCl3>
##$SSB= 0
##$STSI= 131072
##$STSR= 0
##$SW_p= 8223.68421052632
##$SYMM= 0
##$S_DEV= 0
##$TDeff= 65536
##$TDoff= 0
##$TI= <>
##$TILT= no
##$TM1= 0
##$TM2= 0
##$TOPLEV= 0
##$USERP1= <user>
##$USERP2= <user>
##$USERP3= <user>
##$USERP4= <user>
##$USERP5= <user>
##$WDW= 1
##$XDIM= 131072
##$YMAX_p= 439042712
##$YMIN_p= -88588336
##$CURPLOT= <Network HP LaserJet P1505>
##$CURPRIN= <$Network HP LaserJet P1505>
##$DFORMAT= <normdp>
##$LAYOUT= <+/1D_H.xwp>
##$LFORMAT= <normlp>
##$PFORMAT= <normpl>
##$SURQMSG= 1
$$ End of Bruker specific parameters
$$ ---------------------------------
##NTUPLES= NMR SPECTRUM
##VAR_NAME=  FREQUENCY,     SPECTRUM/REAL,   SPECTRUM/IMAG
##SYMBOL=    X,             R,               I
##VAR_TYPE=  INDEPENDENT,   DEPENDENT,       DEPENDENT
##VAR_FORM=  AFFN,          ASDF,            ASDF
##VAR_DIM=   131072,        131072,          131072
##UNITS=     HZ,            ARBITRARY UNITS, ARBITRARY UNITS
##FACTOR=    0.0627417313425165, 1,          1
##FIRST=     8223.62146879498, 577,          -111109
##LAST=      0,             2750,            -110759
##MIN=       0,             -88588336,       0
##MAX=       8223.62146879498, 439042712,    0
$$ Real data points
##PAGE= N=1
##DATA TABLE= (X++(R..R)), XYDATA
$$ [...]
63699C77494K381O80j894l341k387k57R30P08J90J31L07M17N80R18J450K323L493
63682C84123M263L862K559J546J572K211K662K700K562K398K287K497L221M145
63668D22608M734M867M860M903M953N177N917O909P136N925L901K261J486J315
63654D86952J586K170K182N71k166l922l376j686r30j557k323k415k354k734l046
63639D66952k324n29J203J710J114Q50K016L830M388L265K325L212M932N277M098
63624E02319L405M204N036M355K741J566P44o44k140k078j0K481L754L808L484
63609E33025L034K292J625J650K163K259J590Q25O29O80J49j238k950m271m809
63594E36653m558l779k811j859r50j69L17N83R35J312J129K20m52K61K270M417
$$ plain form
63699 377494 379875 380555 378661 375320 372933 372676 373606 374314 374504 374635 374942 375359 375939 376857 378307 380630 384123
63682 384123 388386 392248 394807 396353 397925 400136 402798 405498 408060 410458 412745 415242 418463 422608
63668 422608 427342 432209 437069 441972 446925 452102 458019 464928 472064 477989 481890 484151 485637 486952
63654 486952 488538 490708 492890 493461 491295 487373 483997 482311 481381 479824 477501 475086 472732 469998 466952
63639 466952 464628 464099 465302 467012 468126 468976 470992 474822 479210 482475 484800 488012 492944 498221 502319
63624 502319 505724 509928 514964 519319 522060 523626 524370 523726 521586 519508 519498 521979 525733 529541 533025
63609 533025 536059 538351 539976 541626 543789 546048 547638 548463 549092 549772 549921 548683 545733 541462 536653
63594 536653 532095 528316 525505 523646 522696 522527 522844 523427 524362 525674 526803 527023 526571 526832 529102 533519
63578E33519N975P197Q352R082R070Q701Q719R558J1169J2968J3949J3572J2711
63565F64542J2959J4749J6963J8614J9929K1365K2734K4045K6155K9448L2697
63554I04200L4399L4900L5922L8303M1214M3445M4545M4803M5040M6170M8088
63543A361029M9041M6962M1313L3088K3479J3569M831j485n621q800j1457j3014
63531A532935j3466j3882j5119j7188k0184k4534k9823l4479l7295l8418l8301
63520A250246l6769l3873l0723k8439k6795k4672k1561j7941j4557j1895r985
63509I93036q213n659k043J963N592Q683J1318J3449J5281J7273J9318K0721K1449
63496A112168K2561K4730K7274K9509L2121L5971M0358M3956M6935N0454N4223
$$ plain form
63578 533519 539494 546691 555043 564125 573195 581896 590615 600173 611342 624310 638259 651831 664542
63565 664542 677501 692250 709213 727827 747756 769121 791855 815900 842055 871503 904200
63554 904200 938599 973499 1009421 1047724 1088938 1132383 1176928 1221731 1266771 1312941 1361029
63543 1361029 1410070 1457032 1498345 1531433 1554912 1568481 1573312 1571827 1566206 1557406 1545949 1532935
63531 1532935 1519469 1505587 1490468 1473280 1453096 1428562 1398739 1364260 1326965 1288547 1250246
63520 1250246 1213477 1179604 1148881 1120442 1093647 1068975 1047414 1029473 1014916 1003021 993036
63509 993036 984823 979164 977121 979084 984676 993359 1004677 1018126 1033407 1050680 1069998 1090719 1112168
63496 1112168 1134729 1159459 1186733 1216242 1248363 1284334 1324692 1368648 1415583 1466037 1520260
63485A520260N6445N6414N5333N3766M9903M1729K9935J7313N941l818j2012j8330
63473A852879k2707k5380k6061k4236k0790j8413j9512k4148l0513l6880m2404
63462A561835m6644m9366n0881n1797n2308n2135n1000m8709m5087m0638l6819
63451A036451l4563l2744k9511k5229k2366k1849k1444j8923j5307j3143j2733
63440G88639j2182j0724r550r266q637o718m543l594l705l500k313p36L64P77
63426G14312R97J557K203K016Q59K37J576L943M915L805K453K339K599J861N51
63411G46223n6k6m26j357j892j853k328m114o485p789o905m108r43R33J220J221
63395G11315K245M066N287N039L956L590M994P629R694J0125J0086J1660J4959
$$ plain form
63485 1520260 1576705 1633119 1688452 1742218 1792121 1833850 1863785 1881098 1887039 1883221 1871209 1852879
63473 1852879 1830172 1804792 1778731 1754495 1733705 1715292 1695780 1671632 1641119 1604239 1561835
63462 1561835 1515191 1465825 1414944 1363147 1310839 1258704 1207704 1158995 1113908 1073270 1036451
63451 1036451 1001888 969144 939633 914404 892038 870189 848745 829822 814515 801372 788639
63440 788639 776457 765733 756183 746917 738280 731562 727019 723425 719720 716220 713907 713171 713535 714312
63426 714312 715309 716866 719069 721085 721944 722181 723757 727700 732615 736420 738873 741212 743811 745672 746223
63411 746223 746167 746141 745715 744358 742466 740613 738285 734171 727686 719897 712992 708884 707941 708874 710094 711315
63395 711315 713560 717626 722913 727952 731908 735498 740492 748121 757815 767940 778026 789686 804645
63382H04645J7862J9024J9745K1842K4959K7481K9234L1560L5054L8788M1728
63371A111922M3528M3808M2038L8526L4531L0903K7479K4216K2177K2762K6210
63360A468100L1217L5939L9437M2354M6062N0883N5389N7757N7295N4256M8733
63349A987422M0630L0368J8820O866m214j2497j6858j8567k0259k3136k6214k8414
63337A933947l0200l2768l6535m0988m5348m8936n1423n2949n3586n2750m9816
63326A438648m5322m0647l6425l2307k8352k5483k3853k1927j8063j2481o925
63315A146863k759L0K345N127Q640J2234J5034J7044J9078K1521K3922K6209K9299
63302A324587L3813L8819M2827M5592M8062N0849N3611N5866N7535N8507N8331
$$ plain form
63382 804645 822507 841531 861276 883118 908077 935558 964792 996352 1031406 1070194 1111922
63371 1111922 1155450 1199258 1241296 1279822 1314353 1345256 1372735 1396951 1419128 1441890 1468100
63360 1468100 1499317 1535256 1574693 1617047 1663109 1713992 1769381 1827138 1884433 1938689 1987422
63349 1987422 2028052 2058420 2077240 2084106 2079892 2067395 2050537 2031970 2011711 1988575 1962361 1933947
63337 1933947 1903747 1870979 1834444 1793456 1748108 1699172 1647749 1594800 1541214 1488464 1438648
63326 1438648 1393326 1352679 1316254 1283947 1255595 1230112 1206259 1184332 1166269 1153788 1146863
63315 1146863 1144104 1144134 1146479 1151606 1160246 1172480 1187514 1204558 1223636 1245157 1269079 1295288 1324587
63302 1324587 1358400 1397219 1440046 1485638 1533700 1584549 1638160 1694026 1751561 1810068 1868399
63291A868399N6545N2909M7145L8888K8221J6155M349n734j3468j9066k2971k5422
63279B025950k6673k7335k8137k9565l2053l6232m2202m8657n3576n5975n6333
63268A589212n5281n2932m9674m6379m3142l9030l3949k9564k6985k4605k0163
63257A167508j4582j1701j3792j8998k3771k6422k7401k7518k7227k6902k6393
63246I22801k4703k1262j7403j5228j4969j4652j2845j0607r734r974r294o768
63234G55362l873k600l276m872o512p642p373n118j946o0m25j819k656k845l140
63219G01205l573l657l623m164n082n324m562l691l475l462k802j496k98L60Q39
63204F57195J789L352M790M984L642J984J666L052M981O336P087P731Q479R372
$$ plain form
63291 1868399 1924944 1977853 2024998 2063886 2092107 2108262 2112611 2106877 2093409 2074343 2051372 2025950
63279 2025950 1999277 1971942 1943805 1914240 1882187 1845955 1803753 1755096 1701520 1645545 1589212
63268 1589212 1533931 1480999 1431325 1384946 1341804 1302774 1268825 1239261 1212276 1187671 1167508
63257 1167508 1152926 1141225 1127433 1108435 1084664 1058242 1030841 1003323 976096 949194 922801
63246 922801 898098 876836 859433 844205 829236 814584 801739 791132 781398 771424 762130 755362
63234 755362 751489 748889 745613 740741 734229 726587 719214 714096 712150 712090 711665 709846 707190 704345 701205
63219 701205 697632 693975 690352 686188 681106 675782 671220 667529 664054 660592 657790 656294 655996 656356 657195
63204 657195 658984 662336 667126 672110 675752 677736 679402 682454 687435 693771 700858 708589 717068 726440
63190G26440J0434J1300J1430J1218J2070J4582J7440J9059J9654K0611K2394
63179H96632K4343K6200K8296L0261L1129L1019L1251L2236L2652L1546K9997
63168A225562K9630L0386L0987L0865L0383K9614K8333K7088K6996K8115K9002
63157A546961K8222K5670K2185J8395J4293R607M191j786q003j4207k0049k4797
63145A600682k7845k9758l1998l5011l7220l6842l4134l0829k7892k4926k1543
63134A262684j7899j3906r206m287m48J780L278N138P674J0769J4149J6984J8339
63121A295049J8510J8883J9970K0635J9835J8069J6446J5320J4629J4437J4215
63110A485998J2596R080N139K394L02l024q215j4160j9790k4921k9354l2491l4194
$$ plain form
63190 726440 736874 748174 759604 770822 782892 797474 814914 833973 853627 874238 896632
63179 896632 920975 947175 975471 1005732 1036861 1067880 1099131 1131367 1164019 1195565 1225562
63168 1225562 1255192 1285578 1316565 1347430 1377813 1407427 1435760 1462848 1489844 1517959 1546961
63157 1546961 1575183 1600853 1623038 1641433 1655726 1665333 1669524 1667738 1659735 1645528 1625479 1600682
63145 1600682 1572837 1543079 1511081 1476070 1438850 1402008 1367874 1337045 1309153 1284227 1262684
63134 1262684 1244785 1230879 1221673 1217386 1216938 1218718 1221996 1227134 1234808 1245577 1259726 1276710 1295049
63121 1295049 1313559 1332442 1352412 1373047 1392882 1410951 1427397 1442717 1457346 1471783 1485998
63110 1485998 1498594 1507674 1512813 1515207 1515509 1512485 1504270 1490110 1470320 1445399 1416045 1383554 1349360
63097A349360l5109l5847l6412l6596l6289l5328l3491l0878k7988k5538k4091
63086I91793k3486k2497j9903j6276j3647j2751j1792r058n674m189n115o547
63074H40858o834n929m286k257p14o12j459j545j11J934L637M998O040O332N959
63059H46011N654N514M900M091M459O178P275O194M048L023L515M279M665N110
63045I14916N730N928N467M867M538M335M134M102M271M336M164M170M840N979
63031I81777O645O123M996M686N548O059M766K590J890L428N690P332Q639J0016
63017A060185J0850J0923J1519J3704J6523J8355J9164K0046K1291K2437K3706
63006A248703K5758K8260L0247L1875L4428L8419M2971M7261N1398N5591N9465
$$ plain form
63097 1349360 1314251 1278404 1241992 1205396 1169107 1133779 1100288 1069410 1041422 1015884 991793
63086 991793 968307 945810 925907 909631 895984 883233 871441 862383 856709 852520 847405 840858
63074 840858 834024 828095 823809 821552 820838 820226 818767 817222 817111 819045 822682 827680 833720 840052 846011
63059 846011 851665 857179 862079 866170 870629 876807 884082 890276 894324 897347 900862 905141 909806 914916
63045 914916 920646 926574 932041 936908 941446 945781 949915 954017 958288 962624 966788 970958 975798 981777
63031 981777 988422 994545 999541 1004227 1009775 1015834 1020600 1023190 1025080 1028508 1034198 1041530 1050169 1060185
63017 1060185 1071035 1081958 1093477 1107181 1123704 1142059 1161223 1181269 1202560 1224997 1248703
63006 1248703 1274461 1302721 1332968 1364843 1399271 1437690 1480661 1527922 1579320 1634911 1694376
62995A694376O2623O5184O7516P0008P3015P6284P8595P8973P8209P8066P8891
62984B501740P9231P8121P6461P5536P5313P5015P4410P3621P2265O9784O6233
62973C317730O1880N6355M8908L9296K7796J4624J04j4845k9160m2611n5571o7702
62961C356804p7607q4089q7231q7900q6626q3442p8531p2518o6040n9333n2146
62950B521341m3998l4694k4936j6186r366l755K164Q673J4450J8521K1679K5086
62938B478979K8205K9482K8871K8227K8908L0194L0656K9949K8457K6059K2351
62927B790338J7485J1883N508j621q656j4805k0858k8618l8584m9127n8239o5323
62915B539383p0928p5423p8469p9520p8509p6101p3253p0253o6458o1472n6255
$$ plain form
62995 1694376 1756999 1822183 1889699 1959707 2032722 2109006 2187601 2266574 2344783 2422849 2501740
62984 2501740 2580971 2659092 2735553 2811089 2886402 2961417 3035827 3109448 3181713 3251497 3317730
62973 3317730 3379610 3435965 3484873 3524169 3551965 3566589 3566693 3551848 3522688 3480077 3424506 3356804
62961 3356804 3279197 3195108 3107877 3019977 2933351 2849909 2771378 2698860 2632820 2573487 2521341
62950 2521341 2477343 2442649 2417713 2401527 2392161 2388406 2390570 2399243 2413693 2432214 2453893 2478979
62938 2478979 2507184 2536666 2565537 2593764 2622672 2652866 2683522 2713471 2741928 2767987 2790338
62927 2790338 2807823 2819706 2825214 2823593 2814937 2800132 2779274 2750656 2712072 2662945 2604706 2539383
62915 2539383 2468455 2393032 2314563 2235043 2156534 2080433 2007180 1936927 1870469 1808997 1752742
62904A752742n2215m9301m6041m1797l7886l5877l5543l5304l4080l1995k9695
62893A323008k7856k7007k6928k6363k4269k1431j9917k0673k2444k3363k2885
62882A059872k1660k0261j8839j7541j6411j5129j3634j2646j2723j2867j1341
62871H86820q157n538n262o423o780n595m088l500l838m422m637m061k722j410
62857H20387j034j603k426l270m448n758o269n489m088l075k875l347m081m555
62843G68069m581m605m900m729l364j740j550k622k947j782q42j353j835n48J429
62828G32100J695K67m63P41K525L197K705J836R04q0p93q03J9J344K367K178Q33
62811G50572l32j15J080J895J610L60j509l216l326j264J423K684K440J976J523
$$ plain form
62904 1752742 1700527 1651226 1605185 1563388 1525502 1489625 1454082 1418778 1384698 1352703 1323008
62893 1323008 1295152 1268145 1241217 1214854 1190585 1169154 1149237 1128564 1106120 1082757 1059872
62882 1059872 1038212 1017951 999112 981571 965160 950031 936397 923751 911028 898161 886820
62871 886820 878663 873125 867863 861440 854660 849065 844977 841477 837639 833217 828580 824519 821797 820387
62857 820387 819353 817750 815324 812054 807606 801848 795579 790090 786002 782927 780052 776705 772624 768069
62843 768069 763488 758883 753983 749254 745890 744150 742600 739978 737031 735249 734407 733054 731219 730671 732100
62828 732100 733795 734062 733599 734340 736865 740062 742767 744603 745507 745427 744634 743831 743850 745194 747561 749739 750572
62811 750572 750240 750125 751205 753100 754710 755070 753561 750345 747019 745755 747178 749862 752302 754278 755801
62796G55801M34n58K35K509L735K747J430J726K956L459L253L376L743L388K094
62781G90328M91q99j709j467l26P09J096J428J945J661K09p29M76K725L621K926
62765H02485K637L778N217N835N968O180O159N727N626O478P753Q570Q839R034
62751H90286R366R733J0056J0307J0566J1230J2684J4626J6323J7722J9577K2154
62739A054630K4513K5635K5823K6447K8472L1644L4964L7650L9801M2252M5733
62728A417564N0156N4911N9655O4429O9238P4126P9588Q6049R2904R8896J03647
62717B251163J07896J11837J14244J13938J11159J06475R9165Q8091P3725N7728
62707C235421M0625K1530P15j9325l6504n1601o6527q0953r2461r9899j04664
$$ plain form
62796 755801 756235 755677 755912 758421 762156 764903 766333 768059 771015 774474 777727 781103 784846 788234 790328
62781 790328 790819 789920 788211 786744 786418 787127 788223 789651 791596 793257 793466 792737 793213 795938 799559 802485
62765 802485 805122 808900 814117 819952 825920 832100 838259 843986 849612 856090 863843 872413 881252 890286
62751 890286 899652 909385 919441 929748 940314 951544 964228 978854 995177 1012899 1032476 1054630
62739 1054630 1079143 1104778 1130601 1157048 1185520 1217164 1252128 1289778 1329579 1371831 1417564
62728 1417564 1467720 1522631 1582286 1646715 1715953 1790079 1869667 1955716 2048620 2147516 2251163
62717 2251163 2359059 2470896 2585140 2699078 2810237 2916712 3015877 3103968 3177693 3235421
62707 3235421 3276046 3297576 3298291 3278966 3242462 3190861 3124334 3043381 2950920 2851021 2746357
62696B746357j08202j09985j09100j06442j03731j01060r7101r1611q6017q1263
62686A751845p6592p1216o5825o1331n7089n1828m5853m0876l7668l5145l2031
62675A176391k8325k4633k1126j7891j5535j4360j3357j1088p580m369k532j590
62663A014005o68K31Q89K036M629Q118J0665J1412J1647J3127J6069J9526K3066
62650A134752K7030L1356L5262L8353M1272M4887M9295N3897N8123O1868O5549
62639A641644O9793P4724P9463Q2804Q4384Q4719Q4077Q1948P7771P1501O3166
62628B495994N2653M0268K6842J2797k132j7660l2258m4588n5007o4679p3637
62617B338593q0841q5743q8596q9422q8003q4976q1557p7911p3112o7191o1883
$$ plain form
62696 2746357 2638155 2528170 2419070 2312628 2208897 2107837 2010736 1919125 1833108 1751845
62686 1751845 1675253 1604037 1538212 1476881 1419792 1367964 1322111 1281235 1243567 1208422 1176391
62675 1176391 1148066 1123433 1102307 1084416 1068881 1054521 1041164 1030076 1022496 1018127 1015595 1014005
62663 1014005 1013337 1013568 1014457 1016493 1021122 1029240 1039905 1051317 1062964 1076091 1092160 1111686 1134752
62650 1134752 1161782 1193138 1228400 1266753 1308025 1352912 1402207 1456104 1514227 1576095 1641644
62639 1641644 1711437 1786161 1865624 1948428 2032812 2117531 2201608 2283556 2361327 2432828 2495994
62628 2495994 2548647 2588915 2615757 2628554 2626422 2608762 2576504 2531916 2476909 2412230 2338593
62617 2338593 2257752 2172009 2083413 1993991 1905988 1821012 1739455 1661544 1588432 1521241 1459358
62606A459358n8417n5796n2352m8063m4091m0808l7769l5107l3290l1583k8547
62595I93535k4373k1127j9950j9485j8016j6004j5003j4973j4296j2251r962q626
62583G99469q088p592o950o318n560m428l075j843r62n82p69j159j110m23M79
62568G51089J262J908K079J192l06o83J112L892N595N822N901O856Q442J0090
62554H04251J1511J2291J2192J2093J3447J6230J8542J9014J8724J9796K2704
62543I80795K5927K7983K8936K9980L2104L5239L8404M0776M2751M5611M9817
62532A378323N4116N6677N6676N4382N0246M4582L7802L0147K1371J1397J124
62521A796843q217j6444k4314l1980l8446m3022m6505n0115n3610n5334n4217
$$ plain form
62606 1459358 1400941 1345145 1292793 1244730 1200639 1159831 1122062 1086955 1053665 1022082 993535
62595 993535 969162 948035 928085 908600 890584 874580 859577 844604 830308 818057 808095 799469
62583 799469 791381 783789 776839 770521 764961 760533 757458 755615 754653 754071 753302 752143 751033 750610 751089
62568 751089 752351 754259 756338 757530 757224 756541 757653 761545 767140 772962 778863 785719 794161 804251
62554 804251 815762 828053 840245 852338 865785 882015 900557 919571 938295 958091 980795
62543 980795 1006722 1034705 1063641 1093621 1125725 1160964 1199368 1240144 1282895 1328506 1378323
62532 1378323 1432439 1489116 1545792 1600174 1650420 1695002 1732804 1762951 1784322 1795719 1796843
62521 1796843 1788626 1772182 1747868 1715888 1677442 1634420 1587915 1537800 1484190 1428856 1374639
62510A374639n1147m8003m5731m3800m1340l8285l5145l2194k9404k6932k5075
62499I57583k3647k1999j9814j7445j5202j2856j0246p939o711o539o612o268
62487H02305n407m120k477p71N19J198J489J664J855K362L581N328O615O554N435
62472H26130M481M586N660P187Q934J0929J3129J5497J8071K0592K2416K3367
62460I80979K4435K6839L0383L3642L5992L8510M2254M6540M9885N1949N3433
62449A414841N4432N4165N2326M9474M5741M0307L2749K4123J6061R170K887l382
62437A792894r299j3753j5961j6513j6831j7184j5918j1710n986j467J579N724
62425A675575J2550K0378K6790L1693L6360M0935M4802M8412N2626N6497N7740
$$ plain form
62510 1374639 1323492 1275489 1229758 1185958 1144618 1106333 1071188 1038994 1009590 982658 957583
62499 957583 933936 911937 892123 874678 859476 846620 836374 828435 821724 815185 808573 802305
62487 802305 796898 792778 790301 789530 790049 791247 792736 794400 796255 798617 802198 807526 814141 820695 826130
62472 826130 830611 835197 840857 848044 856978 867907 881036 896533 914604 935196 957612 980979
62460 980979 1005414 1032253 1062636 1096278 1132270 1170780 1213034 1259574 1309459 1361408 1414841
62449 1414841 1469273 1523438 1575764 1625238 1670979 1711286 1744035 1768158 1784219 1793389 1796276 1792894
62437 1792894 1783595 1769842 1753881 1737368 1720537 1703353 1687435 1675725 1669739 1668272 1669851 1675575
62425 1675575 1688125 1708503 1735293 1766986 1803346 1844281 1889083 1937495 1990121 2046618 2104358
62414B104358N5551N1291M6092L9385L0321J9401P914l356j4221k4589l4431m3841
62402B233875n2655o0396o6717p1515p4640p5990p5903p4846p2799o9615o5755
62391A473044o1767n7112n0849m3659l7797l4281l1395k7052k1675j7417j5129
62380A074911j3561j1452r044p160n915m849l791k996k769l263m387n701o724
62367I93299p525q645j0256j1818j2776j3178j3253j2887j2059j1273j0867j0198
62355H58564q553o687o281p566q779q466p221o228n358l987k832l007l717k867
62341G77015k67J698J285k88o81O84K777M750O331P061O594N531M924N077N584
62326H28075O320P614R524J1500J2720J2633J1682J1524J3557J6756J8313J7297
$$ plain form
62414 2104358 2159909 2211200 2257292 2296677 2326998 2346399 2354313 2350957 2336736 2312147 2277716 2233875
62402 2233875 2181220 2120824 2054107 1982592 1907952 1831962 1756059 1681213 1608414 1538799 1473044
62391 1473044 1411277 1354165 1303316 1259657 1221860 1187579 1156184 1129132 1107457 1090040 1074911
62380 1074911 1061350 1049898 1040854 1033694 1027779 1022930 1019139 1016143 1013374 1010111 1005724 1000023 993299
62367 993299 985774 977129 966873 955055 942279 929101 915848 902961 890902 879629 868762 858564
62355 858564 850011 843324 837043 829477 820698 812232 805011 798783 793425 789438 786606 783599 779882 777015
62341 777015 776748 778446 779731 779443 778762 779446 782223 786973 793304 800365 806959 812490 817414 822491 828075
62326 828075 834395 842009 851533 863033 875753 888386 900068 911592 925149 941905 960218 977515
62314I77515J6364J8446K2860K6468K7947K8815L0529L2755L4852L7160M0145
62303A293856M3630M7519N2016N6707O0702O4262O8916P5141Q1088Q4605Q5645
62292B014087Q5655Q5266Q3608P9445P2170O1918M9392L5468K0653N340r311k1513
62280B562178l0612l8070m5918n4530o2485o8251p1343p2081p1129o9304o7162
62269A911293o4549o0911n6264n1506m7505m4079m0327l6086l2638l1384l1908
62258A414136l2148l0731k8401k6714k6127k6171k6678k7678k8425k7847k5887
62247A107329k3369k0645j7599j4817j3371j3085j2433j0555q241o478n264m411
62235I57061m240m584m243k370K66K312L345L685L489K975K814L458M572N886
$$ plain form
62314 977515 993879 1012325 1035185 1061653 1089600 1118415 1148944 1181699 1216551 1253711 1293856
62303 1293856 1337486 1385005 1437021 1493728 1554430 1618692 1687608 1762749 1843837 1928442 2014087
62292 2014087 2099742 2185008 2268616 2348061 2420231 2482149 2531541 2567009 2587662 2593002 2583691 2562178
62280 2562178 2531566 2493496 2447578 2393048 2330563 2262312 2190969 2118888 2047759 1978455 1911293
62269 1911293 1846744 1785833 1729569 1678063 1630558 1586479 1546152 1510066 1477428 1446044 1414136
62258 1414136 1381988 1351257 1322856 1296142 1270015 1243844 1217166 1189488 1161063 1133216 1107329
62247 1107329 1083960 1063315 1045716 1030899 1017528 1004443 992010 981455 973214 966736 961472 957061
62235 957061 952821 948237 943994 941624 941890 944202 947547 951232 954721 957696 960510 963968 968540 974426
62221I74426P901J0898J3966J5942J6765J7055J7030J6752J6833J7715J8790J9446
62209A163519K0482K3176K7227L1034L3925L6778M0266M3939M7432N1383N6431
62198A575592O2162O7782P3219P8847Q4387Q8747R0908R0766Q8989Q5991Q0996
62187B468386P2525O0239M5921L1921J8901O072o497j7196k5185l2256m1153n2447
62175B529231o4033p3532q0052q3618q4250q2529q0090p8233p6159p1885o5211
62164A689639n8595n4429n2330n0157m6967m3600m0719l7754l4217l0714k8116
62153A212041k6503k5434k4438k2730j9421j4754j0453q036p252o900o537o467
62141A033116o489n716l720j006J618L670M990N697O228P096Q542J0450J2370
$$ plain form
62221 974426 982327 993225 1007191 1023133 1039898 1056953 1073983 1090735 1107568 1125283 1144073 1163519
62209 1163519 1184001 1207177 1234404 1265438 1299363 1336141 1376407 1420346 1467778 1519161 1575592
62198 1575592 1637754 1705536 1778755 1857602 1941989 2030736 2121644 2212410 2301399 2387390 2468386
62187 2468386 2540911 2601150 2647071 2678992 2697893 2703965 2697468 2680272 2655087 2622831 2581678 2529231
62175 2529231 2465198 2391666 2311614 2227996 2143746 2061217 1981127 1902894 1826735 1754850 1689639
62164 1689639 1631044 1576615 1524285 1474128 1427161 1383561 1342842 1305088 1270871 1240157 1212041
62153 1212041 1185538 1160104 1135666 1112936 1093515 1078761 1068308 1060272 1053020 1046120 1039583 1033116
62141 1033116 1026627 1020911 1017191 1016185 1017803 1021473 1026463 1032160 1038388 1045484 1054026 1064476 1076846
62128A076846J3594J3832J4010J5678J9048K2389K3970K3972K3702K3643K3367
62117A294051K2887K2795K3136K3289K3214K3823K5861K9069L2680L6182L9496
62106A596483M2927M6967N1629N6011N9102O0896O2084O2659O1521N7577N0672
62095B208528M1435L0752J9537Q416k383j2535k1301k8323l4427m0656m6638n0989
62083B071416n3364n4975n6664n7550n6203n2306m6606m0037l3656k8625k5251
62072A566179k2366j8649j4373j0965q967p377n145k465r4J801L342L929K485
62059A487335r89m804p034p323o798o432o097n247l950k952l037m574p353j0583
62045A410162j3293j4952j5599j5304j3860j1209p786m231j035J372K703L220
$$ plain form
62128 1076846 1090440 1104272 1118282 1133960 1153008 1175397 1199367 1223339 1247041 1270684 1294051
62117 1294051 1316938 1339733 1362869 1386158 1409372 1433195 1459056 1488125 1520805 1556987 1596483
62106 1596483 1639410 1686377 1738006 1794017 1853119 1914015 1976099 2038758 2100279 2157856 2208528
62095 2208528 2249963 2280715 2300252 2308668 2306285 2293750 2272449 2244126 2209699 2169043 2122405 2071416
62083 2071416 2018052 1963077 1906413 1848863 1792660 1740354 1693748 1653711 1620055 1591430 1566179
62072 1566179 1543813 1525164 1510791 1499826 1490859 1483482 1478337 1475872 1475778 1477579 1480921 1484850 1487335
62059 1487335 1486346 1481542 1474508 1467185 1460387 1453955 1447858 1442611 1438661 1435709 1432672 1428098 1420745 1410162
62045 1410162 1396869 1381917 1366318 1351014 1337154 1325945 1318159 1313928 1312893 1314265 1316968 1320188
62033A320188L673M471N324N838O062O201O384O945Q272J0045J1438J2488J4223
62020A421552J6773J8618J8877J9299K2201K7092L1098L2680L3109L4124L5829
62009A711252L7466L8786L9824M0385M0659M1610M3920M7011M9595N0765N0188
61998B191461M7743M3351L6886K8203J7804P354j429q541j5494k3191l0953l8021
61986B255173m4840n2104n9369o5307o8862o9754o8506o6481o4996o3788o1223
61975A569943n6613n1424m7334m3998l9955l5019l0487k7400k5837k5601k6176
61964A160099k6180k4320k1256j9164j9005j9347j8516j6810j5683j5595j5776
61953I48447j5636j5209j4338j2590j0181q122p053o574o046n365m544l298j760
$$ plain form
62033 1320188 1323861 1328332 1333656 1339494 1345556 1351757 1358141 1365086 1373358 1383403 1394841 1407329 1421552
62020 1421552 1438325 1456943 1475820 1495119 1517320 1544412 1575510 1608190 1641299 1675423 1711252
62009 1711252 1748718 1787504 1827328 1867713 1908372 1949982 1993902 2040913 2090508 2141273 2191461
61998 2191461 2239204 2282555 2319441 2347644 2365448 2372802 2371373 2362832 2347338 2324147 2293194 2255173
61986 2255173 2210333 2158229 2098860 2033553 1964691 1894937 1826431 1759950 1694954 1631166 1569943
61975 1569943 1513330 1461906 1414572 1370574 1330619 1295600 1265113 1237713 1211876 1186275 1160099
61964 1160099 1133919 1109599 1088343 1069179 1050174 1030827 1012311 995501 979818 964223 948447
61953 948447 932811 917602 903264 890674 880493 872371 865318 858744 852698 847333 842789 839491 837731
61940H37731q94j169j345J00K449L255J692j80l60L21l03k432m244m682m650n340
61924H19949o862q715j0418j1283j0724r179p804o950n934m646m115m878n887
61911G22554n918n145m462m003l333k512k020j997k308k987l842m104l247j824
61897F74852o87J69J143J860J637Q38O27J401K531L703N356P603R751J1325J2550
61882G34659J3501J3798J3773J4744J7104J9069J8711J6802J6046J7496J9246
61871I14949J9183J7666J6423J5825J4640J2289R903Q715Q393P541N402K507j23
61858A053313k033l558n167o578o814n434l331j603J02L113P429J1157J2770J2846
61844A066212J2755J2699J2144J1296J0614R404O535K489q16k407l261m696o923
$$ plain form
61940 837731 836837 835668 834323 834423 836872 840127 841819 841639 841279 841600 841297 838865 834621 829939 825289 819949
61924 819949 813087 804372 793954 782671 771947 762768 754964 748014 742080 737434 733319 728441 722554
61911 722554 716636 711491 707029 703026 699693 697181 695161 693164 690856 687869 684027 679923 676676 674852
61897 674852 674165 674334 675477 677337 678974 679812 680439 681840 684371 688074 693430 701033 710784 722109 734659
61882 734659 748160 761958 775731 790475 807579 826648 845359 862161 878207 895703 914949
61871 914949 934132 951798 968221 984046 998686 1010975 1020878 1029593 1037986 1045527 1050929 1053436 1053313
61858 1053313 1051280 1047722 1042555 1035977 1029163 1023729 1020398 1018795 1018897 1022010 1029439 1040596 1053366 1066212
61844 1066212 1078967 1091666 1103810 1115106 1125720 1135124 1141659 1144148 1143332 1140925 1137664 1132968 1126045
61831A126045r445j1677j2875j2523j1263j0472j0528j0504r812r116r196j0034
61819I98600j1382j3031j4084j3423j1700j1258j2967j4512j3349j0153p582o530
61807H58629n571l795k079j295q56L22K444M825O558P100O867P285R488J3089
61793I03011J6822K0022K2584K4017K3958K3392K3894K5535K6953K7551K8026
61782A165765K8341K6972K3142J8228J3786R505M499m56l721n158o060p061p733
61769A260049q035q406q224n953j523K953N760P615R962J2269J2589J0295O743
61756A296094L259j75m014q176j2483j7096k1869k5987k8792l0365l0876l0062
61744A089458k7993k5573k3585k1820j9950j8508j8049j7868j6795j4935j3331
$$ plain form
61831 1126045 1116600 1104923 1092048 1079525 1068262 1057790 1047262 1036758 1026946 1017830 1008634 998600
61819 998600 987218 974187 960103 946680 934980 923722 910755 896243 882894 872741 865159 858629
61807 858629 853058 849263 847184 845889 845033 845355 847799 852624 859182 866282 873149 880434 889922 903011
61793 903011 919833 939855 962439 986456 1010414 1033806 1057700 1083235 1110188 1137739 1165765
61782 1165765 1194106 1221078 1244220 1262448 1276234 1285739 1290238 1289782 1286061 1280903 1274843 1267782 1260049
61769 1260049 1252014 1243608 1235384 1229431 1227908 1230861 1236621 1244236 1254198 1266467 1279056 1289351 1296094
61756 1296094 1299353 1299178 1295164 1286988 1274505 1257409 1235540 1209553 1180761 1150396 1119520 1089458
61744 1089458 1061465 1035892 1012307 990487 970537 952029 933980 916112 899317 884382 871051
61733H71051j2255j1195j0370j0505j0958r919p180m967m982o097o291n431m591
61720G66310l680j896Q8M74j085k948l786l748l115j588L75J108j41j768j773
61705G42827l23Q39R68Q46R97R38M44K39Q69J773K220K408K797K937K001K23j138
61688G61865j403j150j125j316j471j796k553l513m415n331o002n420l018M5J841
61673G25238J777Q83K06r7j08K67P37O74J72J97J276K708L491L395K834K334K392
61656G48376L067L550K947J765J421K054K085P05p12p82m00j315l365m842n093
61641G49461m960m844m147k829j946k134k757l203l859n149o515p158p159p023
61627F85778o514m891k314k29%j413k976l582l478l450l641l694l665l871l935
$$ plain form
61733 871051 858796 847601 837231 826726 815768 805849 798669 793702 788720 782623 776332 770901 766310
61720 766310 762630 760734 760822 761296 760211 757263 753477 749729 746614 745026 745401 746509 746368 744600 742827
61705 742827 742504 743343 744311 745157 746154 747092 747536 747775 748644 750417 752637 755045 757842 760779 762780 763003 761865
61688 761865 760462 759312 758187 756871 755400 753604 751051 747538 743123 737792 731790 726370 723352 723397 725238
61673 725238 727015 727898 728104 728007 727899 728166 728903 729577 729749 729946 731222 733930 737421 740816 743650 745984 748376
61656 748376 751443 754993 757940 759705 761126 763180 765265 765970 765258 764476 764076 762761 759396 754554 749461
61641 749461 744501 739657 735510 732681 730735 728601 725844 722641 718782 713633 707118 699960 692801 685778
61627 685778 679264 674373 672059 671830 671830 670417 667441 663859 660381 656931 653290 649596 645931 642060 638125
61612F38125l008j237L7Jo47j058j542k639l772l980l337k588j772m34J140K050
61596F15339K151K172K566L034L282L300K941J923L53j247k307k275q21J451L122
61581F34984L622L915M667M710K878N06M0J401J915J32k278l124k428j533r96
61566F48411n58l59r58k458m166n035m423k963k393l534m749l807j200J86j016
61551F10978k971l714l926n193o979p268n581l615l065l997n380o190n940m852
61537E42307l639k913k886l530m389m376k799p76l86k006l853m660n140n841n473
61522D89640l214j054j549l992n339m538l474l455l300j837k01j40j358j981r66
61507D53242J160L367M799M736L031P11o47l64Q85K072K723K775K082O35q62j264
$$ plain form
61612 638125 635117 633880 633917 633918 633271 632213 630671 628032 624260 620280 616943 614355 612583 612149 613289 615339
61596 615339 617490 619662 622228 625262 628544 631844 634785 636708 637061 635814 633507 631232 630411 631862 634984
61581 634984 638606 642521 647188 651898 654776 655282 655322 656723 658638 658770 656492 653368 650940 649407 648411
61566 648411 647853 647494 646536 644078 639912 634877 630454 627491 625098 621564 616815 613008 611808 611994 610978
61551 610978 608007 604293 600367 595174 588195 580927 575346 571731 568666 564669 559289 553099 547159 542307
61537 542307 538668 535755 532869 529339 524950 520574 517775 516999 516613 514607 510754 506094 500954 495113 489640
61522 489640 486426 485372 483823 479831 474492 469954 466480 463025 459725 457888 457687 457547 456189 454208 453242
61507 453242 454402 457769 462568 467304 470335 471046 470399 470035 470920 472992 475715 478490 480572 481207 480345 479081
61491D79081j63J470K313K199K118K615K900J983J82j087q93K86J157Q29l98j290
61475D93302r30J55O13J95K10J489K780K274K37j293j306r07j313k118k315j878
61459D89195j372p65J59P03j14j823k558j275R30K175J817N65p07j441j108M04
61443D84785K082K396J079m07o50P8M83P6m75n28k39j71p49k018l392l672k024
61426D76654R14L405M226L570K439J702J713K197K491K433K840M312N750N305
61412E19951L034J307J856L568M065K614L96j309k007j559k45P54J45j908l773
61397E26889m150l276k154j221j39J496L454M828M748L341J851J413J847K081
61383E41008J721J624K698M524N585M848K897J277P82Q06O22P23K001L824M199
$$ plain form
61491 479081 478918 480388 482701 484900 487018 489633 492533 494516 494698 493611 492718 493004 494161 494990 494592 493302
61475 493302 492372 492527 493140 493335 493545 495034 497814 500088 500325 499032 497726 496819 495506 493388 491073 489195
61459 489195 487823 487058 487217 487920 487806 485983 483425 482150 483080 485255 487072 487637 486930 485489 484381 484785
61443 484785 486867 489263 490342 489935 489285 489363 489846 489922 489447 488919 488680 488509 487760 485742 482350 478678 476654
61426 476654 477568 480973 485199 488769 491208 492910 494623 496820 499311 501744 504584 508896 514646 519951
61412 519951 522985 524292 526148 529716 533781 536395 536791 535482 533475 531916 531671 532425 532570 530662 526889
61397 526889 522739 519463 517309 516088 515949 517445 520899 525727 530475 533816 535667 537080 538927 541008
61383 541008 542729 544353 547051 551575 557160 562008 564905 566182 566964 567770 568392 569115 571116 574940 579139
61368E79139K324j81j348j258j336j964k130j224R0J031J667K340K886K893K295
61353E85224J397N53l3m54j007j725k187k188k311l159m194m141k606n93P67J249
61337E64592J100L91o34j237r41k68p8l27k00N41J008M17o06n73R80K694K912
61320E69771J681O84J169K622L759M184M427M722M603L770K608J630R00L23Q4
61305F06937M35J271K326L500M696N425N075L682K242K006L462N944Q147R065
61291F64213Q641P728P303P633Q236Q548Q391P639O007L702J982K175M081O139
61277G52418P333P997Q399P764N664L371K527K852K543P44j601l189l543k770
61263G90509j408n38q33j477j171j38L81M74J493L415M506M367N048P787J0689
$$ plain form
61368 579139 581463 581282 579934 578676 577340 575376 573246 572022 572112 573143 574810 577150 580036 582929 585224
61353 585224 586621 587174 587141 586687 585680 583955 581768 579580 577269 574110 569916 565775 563169 562576 563343 564592
61337 564592 565692 566083 565449 564212 563271 563003 562925 562598 562398 562939 563947 564364 563758 563185 564165 566859 569771
61320 569771 571452 572136 573305 575927 579686 583870 588297 593019 597622 601392 604000 605630 606530 606853 606937
61305 606937 607372 608643 610969 614469 619165 624590 629665 633347 635589 637595 641057 647001 655148 664213
61291 664213 672854 680582 687885 695518 703754 712302 720693 728332 734339 738041 740023 742198 746279 752418
61277 752418 759751 767748 776147 783911 789575 792946 795473 798325 800868 801612 800011 796822 793279 790509
61263 790509 789101 788563 787730 786253 785082 784944 785325 785799 787292 790707 795213 799580 804628 812415 823104
61248H23104J1475J0905J1386J3384J5293J5984J5363J3138R214N043K494J459
61236I48242K81j652l519m950o309p177o682n564n771p486q608p886o624o289
61222H70006o287n440m173l664l787l400k100m29J212K826M136M577M015L067
61208H60559K651L235M258M505L651L091M282O538P827P654P454P828P344N078
61194I35955K547J675K198K652K795L324L905L395J778L31j30J28P37J558J979
61179I64827J276j49q76k16R43J296M19j114k268k073m55J407K170J909J876K725
61163I71697L769M192M137M151M329M444M497M677N145O075P429Q498Q269O687
61149A047996N041M558N015N273M816M044L313K645K462L704O533R543J1068J1138
$$ plain form
61248 823104 834579 845484 856870 870254 885547 901531 916894 930032 939246 944289 946783 948242
61236 948242 948523 946871 943352 938402 932093 924916 918234 912670 906899 899413 890805 882919 876295 870006
61222 870006 863719 858279 854106 850442 846655 843255 841155 840726 841938 844764 848900 853477 857492 860559
61208 860559 863210 866445 870703 875208 878859 881950 886232 892770 900597 908251 915705 923533 930877 935955
61194 935955 938502 940177 942375 945027 947822 951146 955051 958446 960224 960555 960425 960553 961290 962848 964827
61179 964827 966103 965954 965078 964862 965805 967101 967520 966406 964138 962065 961610 963017 965187 967096 968972 971697
61163 971697 975466 979658 983795 987946 992275 996719 1001216 1005893 1011038 1017113 1024542 1033040 1041309 1047996
61149 1047996 1053037 1057595 1062610 1067883 1072699 1076743 1080056 1082701 1085163 1088867 1095400 1104943 1116011 1127149
61135A127149J1381J2870J4883J6018J5796J4511J2265R150O065M114L114J801
61123A249117o6j061k57R68N29j548l228l236k424k251l039m235n390o205o291
61108A211383n704n297n835o955p673p720p706q017q395q717r354j0270j0540
61095A109200r502q024p607q307q589p485n992n536n871n651m777m853o843r380
61081A010783j0228q932p135o449o827p071o336m796l200k058j228j91J191K398
61067I49921K978L386M583O778R194J1269J3452J6241J8995K0520K0717K0767
61055A098801K1581K2871K4068K5388K7248K9157L0077K9794K9195K9010K8908
61044A396098K8147K6599K4724K2713K0104J6455J2113Q060M938K439j35k902
$$ plain form
61135 1127149 1138530 1151400 1166283 1182301 1198097 1212608 1224873 1234023 1240088 1244202 1247316 1249117
61123 1249117 1249051 1247990 1247733 1248701 1249230 1247682 1244454 1241218 1238794 1236543 1233504 1229269 1223879 1217674 1211383
61108 1211383 1205679 1200382 1194547 1187592 1179919 1172199 1164493 1156476 1148081 1139364 1130010 1119740 1109200
61095 1109200 1099698 1091674 1084067 1075760 1067171 1059686 1053694 1048158 1042287 1036636 1031859 1027006 1020163 1010783
61081 1010783 1000555 991623 984488 978039 971212 964141 957805 953009 949809 947751 946523 946332 947523 949921
61067 949921 952899 956285 960868 967646 976840 988109 1001561 1017802 1036797 1057317 1078034 1098801
61055 1098801 1120382 1143253 1167321 1192709 1219957 1249114 1279191 1308985 1338180 1367190 1396098
61044 1396098 1424245 1450844 1475568 1498281 1518385 1534840 1546953 1555013 1559951 1562390 1562255 1559353
61032A559353n413p552r735j2076j3960j4975j5670j6878j8566j9957k0380j9517
61020A384674j7307j4368j2025j1077j0745r724p938o329n282m316l059j341J415
61007A282578N467R522J1749J2126J2370J3466J4864J6248J8170K0661K3021K5600
60995A465842K9611L4436L7341L7118L6056L6932M0020M4385M9881N5948O0547
60984A928117O2706O4439O7845P2041P5480P9438Q6061R4384J01821J08655J17256
60973B858243J27326J35654J40854J44830J49197J53753J59231J68116J81456
60964D218660J97621K15293K34976K56514K77945K98179L18571L41268L68639
60955F727666M04755M53725N15433N86558O67105P61697Q72715R97325J134027
$$ plain form
61032 1559353 1553940 1546388 1536653 1524577 1510617 1495642 1479972 1463094 1444528 1424571 1404191 1384674
61020 1384674 1367367 1352999 1340974 1329897 1319152 1309428 1301490 1295161 1289879 1285563 1282504 1281163 1282578
61007 1282578 1288045 1297567 1309316 1321442 1333812 1347278 1362142 1378390 1396560 1417221 1440242 1465842
60995 1465842 1495453 1529889 1567230 1604348 1640404 1677336 1717356 1761741 1811622 1867570 1928117
60984 1928117 1990823 2055262 2123107 2195148 2270628 2350066 2436127 2530511 2632332 2740987 2858243
60973 2858243 2985569 3121223 3262077 3406907 3556104 3709857 3869088 4037204 4218660
60964 4218660 4416281 4631574 4866550 5123064 5401009 5699188 6017759 6359027 6727666
60955 6727666 7132421 7586146 8101579 8688137 9355242 10116939 10989654 11986979 13121006
60946A3121006J286693J458360J647592J854398K073707K260952K308824K095750
60938B8107282J593477R29091L18941p3491k18008j75346j5708J92854L38354
60929C0997446K69806j03669p16524j371372j871452k132873k187344k110780
60921B0773238j965596j790154j608094j432498j267946j116198r79356q58044
60913I755352p51276o59532n84302n23705m72233m26093l85613l51412l21578
60904E279608k94241k70014k49890k32718k16440k00190j83899j67452j51534
60895C313230j37994j28163j21580j16855j12731j08010j01902r4917q8229q1924
60885B220925p5227o8419o2866n8940n5658n2542n0009m7719m4658m1252l9285
$$ plain form
60946 13121006 14407699 15866059 17513651 19368049 21441756 23702708 26011532 28107282
60938 28107282 29700759 30629850 30948791 30875300 30657292 30481946 30466238 30659092 30997446
60929 30997446 31267252 31163583 30447059 29075687 27204235 25071362 22884018 20773238
60921 20773238 18807642 17017488 15409394 13976896 12708950 11592752 10613396 9755352
60913 9755352 9004076 8344544 7760242 7236537 6764304 6338211 5952598 5601186 5279608
60904 5279608 4985367 4715353 4465463 4232745 4016305 3816115 3632216 3464764 3313230
60895 3313230 3175236 3047073 2925493 2808638 2695907 2587897 2485995 2391078 2302849 2220925
60885 2220925 2145698 2077279 2014413 1955473 1899815 1847273 1797264 1749545 1704887 1663635 1624350
60874A624350l9066l8744l7217l5599l4887l4300l3074l1927l1465l0945k9886
60863A247240k9043k8520k6831k3383k0062j8564j7865j6263j4314j3559j3675
60852A025161j3233j2309j1942j1627r720o241l231k281l188m899o207n850l509
60839I30924o96P41Q04P56Q29J48j253k198k313k509l333m274m976n688o361o697
60823H93904p289q976j0819j0608q178o271o920q626q801p615p372q740r801q922
60809G74966o730m742l450k567k114k266k638k571j903r64j05M03K59n59j535
60794G43484k193k705l332l534k497o52K80p57k746l756l031j362J80J165J637
60779G20181J654J200K74r02j728j742j470k022l442m242l364j787j144j463j639
$$ plain form
60874 1624350 1585284 1546540 1509323 1473724 1438837 1404537 1371463 1339536 1308071 1277126 1247240
60863 1247240 1218197 1189677 1162846 1139463 1119401 1100837 1082972 1066709 1052395 1038836 1025161
60852 1025161 1011928 999619 987677 976050 966330 960089 956858 954577 951389 946490 940283 934433 930924
60839 930924 930228 930969 931773 932529 933358 933506 932253 930055 927742 925233 921900 917626 912650 906962 900601 893904
60823 893904 886615 877639 866820 856212 848034 841763 834843 826217 817416 809801 802429 793689 783888 774966
60809 774966 768236 763494 760044 757477 755363 753097 750459 747888 745985 745021 744916 745319 745578 745019 743484
60794 743484 741291 738586 735254 731720 729223 728571 728851 728094 725348 721592 718561 717199 717379 718544 720181
60779 720181 721835 723035 723309 722407 720679 718937 717467 715445 712003 707761 704397 702610 701466 700003 698364
60764F98364j592k209l298l496k586k154l102m129l670k147j077r68j398k324
60750F64214l863n186n063l438j530l91k69j251l375n843p064o149l993k405k243
60735F12151k761k844k520k830m144n353n164l762k413j789j607j655k017k318
60721E70974j946j166q00o36L54J878K152P42j60J355M198N998O269O099N739
60706F01050M666L407L080L229K232J40r36K28K299L373L073J889n0k316l399
60691F21965k113O58K709K790J428k75j669k423k210j076K37O27m86k603m538
60676F13021n418n369n177n481o318p124p019n500l282k083k998n240o961p034
60662E38017n585l235p22R83J214M51k48p06j647l084l746k719q49K62J92j32
$$ plain form
60764 698364 696772 694563 691265 687769 685183 683029 679927 675798 672128 669981 668904 667936 666538 664214
60750 664214 660351 655165 650102 646664 645134 644743 644474 643223 639848 634005 626941 620792 616799 614394 612151
60735 612151 609390 606546 604026 601196 597052 591699 586535 582773 580360 578571 576964 575309 573292 570974
60721 570974 569028 567862 567062 566426 566780 568658 570810 571552 571392 572747 576945 582943 589212 595311 601050
60706 601050 605716 609123 612203 615432 617664 617804 616868 617096 619395 622768 625841 627730 627680 625364 621965
60691 621965 619852 620510 623219 626009 627437 627162 625493 623070 620860 619784 620021 620648 620162 617559 613021
60676 613021 607603 602234 597057 591576 585258 578134 571115 565615 562333 560250 557252 552012 545051 538017
60662 538017 532432 529197 528475 529458 530672 531123 530875 530169 528522 525438 521692 518973 518124 518386 518578 518446
60646E18446J59J053K118L092L768L739K643Q08n43q0K166M382M558K707R20J045
60630E50981K675L895L592K485K010K716L911M588M447L946L553L205K583J791
60616E96378J363J642K378L009L084K468J434N70K67J87m52j953l763n107n609
60601E95896n201l945k332j333j544k365k609j997j527k078l141l363k110K6K194
60586E64571M062N408N660M532K800J717J531J235q6k115l804m481m221l505k897
60571E70407k735k804k631k236k214k666k687j469M52J712J742J188Q28P31N86
60556E58204L43K08L10M93M06n2l27L66J923L142L030J932P84j04p15l66J570
60539E71147M110N225M219K456J415J209J429K127L129L459K613J649J815K653
$$ plain form
60646 518446 518605 519658 521776 524868 528636 532375 535018 535826 535283 535203 537369 541751 546309 549016 549936 550981
60630 550981 553656 557551 561143 563628 565638 568354 572265 576853 581300 585246 588799 592004 594587 596378
60616 596378 597741 599383 601761 604770 607854 610322 611756 612326 612593 612780 612328 610375 606612 601505 595896
60601 595896 590695 586750 584418 583085 581541 579176 576567 574570 573043 570965 567824 564461 562351 562377 564571
60586 564571 568633 574041 579701 584233 587033 588750 590281 591516 591430 589315 585511 581030 576809 573304 570407
60571 570407 567672 564868 562237 560001 557787 555121 552434 550965 551417 553129 554871 556059 556887 557618 558204
60556 558204 558547 558755 559065 559558 559964 559912 559585 559951 561874 565016 568046 569978 570762 570658 569943 569577 571147
60539 571147 575257 580482 584701 587157 588572 589781 591210 593337 596466 599925 602538 604187 606002 608655
60525F08655K674J501Q5r89j969k641j947M53L341N336O377P185P974Q541R120
60510F53696J0218J1782J3306J4638J5931J6853J6675J5341J3721J2333J0384
60499H04878O704J443l599o476o760n744n045m978m297j776K067N258O514O626
60485G94815P414R689J2681J5221J6905J8166J9601K1298K2609K2704K1519J9785
60473A002407J7767J4591R512L566j090l505m693n872o958p294p099p272q088
60460I95972q794q486o988m893k965j452N4J989M098N752O901Q197J0168J2858
60446A012411J6281K0408K4540K7667K9965L3033L7857M3340M7690N0530N2626
60435A396348N4195N4702N3987N2256M9076M3616L6015K7349J7970P059n730j9179
$$ plain form
60525 608655 611329 612830 612915 611926 609957 607316 605369 605822 609163 614499 620876 628061 636035 644576 653696
60510 653696 663914 675696 689002 703640 719571 736424 753099 768440 782161 794494 804878
60499 804878 811582 813025 809426 802950 796190 790446 785401 780423 776126 774350 776417 781675 788189 794815
60485 794815 802229 811918 824599 839820 856725 874891 894492 915790 938399 961103 982622 1002407
60473 1002407 1020174 1034765 1044277 1047843 1046753 1043248 1038555 1032683 1025725 1018431 1011332 1004060 995972
60460 995972 987178 978692 971704 966811 963846 962394 962448 964437 968535 974287 981188 989385 999553 1012411
60446 1012411 1028692 1049100 1073640 1101307 1131272 1164305 1202162 1245502 1293192 1343722 1396348
60435 1396348 1450543 1505245 1559232 1611488 1660564 1704180 1740195 1767544 1785514 1792573 1786843 1767664
60423A767664l1678m2667n2168n9609o4018o5183o3903o1134n7487n3509m9906
60412A166402m7071m4627m1745l8084l4268l1190k8863k6383k3175j9819j7229
60401H13948j5378j3583j1714j0479j0329j0776j0920j0234q785p168o208o242
60389F92132o614o476n968n924o396o400n443m323l886l798l287k422j850j635
60375F27710j260n43J65N70N74J4j011j728j402m40L1j63N4J235K234J614l36
60358F27318j829j776q55l30n04p78o94l20K44J155K383L346L387K635J983K078
60342F37443K544K573K176K226L035L493K388L24n62R29L648N524N771N025L996
60327F80533K912K057J821K022K110K192K987M434N253M614L481L326M016M056
$$ plain form
60423 1767664 1735986 1693319 1641151 1581542 1517524 1452341 1388438 1327304 1269817 1216308 1166402
60412 1166402 1119331 1074704 1032959 994875 960607 929417 900554 874171 850996 831177 813948
60401 813948 798570 784987 773273 762794 752465 741689 730769 720535 711750 704582 698374 692132
60389 692132 685518 679042 673074 667150 660754 654354 648911 644588 640702 636904 633617 631195 629345 627710
60375 627710 626450 625907 626072 626642 627216 627230 626219 624491 623089 622649 622680 622517 622571 623806 626040 627654 627318
60358 627318 625489 623713 622858 622528 622024 621246 620552 620232 620476 621631 624014 627360 630747 633382 635365 637443
60342 637443 639987 642560 644736 646962 649997 653490 655878 656202 655640 656569 660217 665741 671512 676537 680533
60327 680533 683445 685502 687323 689345 691455 693647 696634 701068 706321 710935 714416 717742 721758 725814
60313G25814K960K204L288N615P032O240M004K060J416J927K922L727L920L731
60299G76860M077N505P050P069N555M587N731P941R179R362J0109J1796J2695
60286H77516J1258P799L354j435n555p355o423m777m751o374p960q559q414p645
60272H30679o134m607m219m863n153m363l316k980l228l435l329k792j534K93
60258G81019J774K201K130K873M924P352Q915R558J0571J3141J6925K0385K2356
60245I04124K2811K2140K0511J8211J5727J2878Q695K884l341q861j4204k0183
60233I81392k5505k7561k5724k2334j9841j8191j5903j2724j0152r483j0160j0245
60221G73569q435n374k848j703j131j97O95N76n36j802k852l765m140l431k174
$$ plain form
60313 725814 728774 730978 734266 739881 746913 753153 757157 759217 760633 762560 765482 769209 773129 776860
60299 776860 780937 786442 793492 800561 806116 810703 816434 824375 833554 842916 853025 864821 877516
60286 877516 888774 896573 899927 898492 892937 885582 879159 874382 869631 863257 855297 846738 838324 830679
60272 830679 824545 819938 815719 810856 805703 801340 798024 795044 791816 788381 785052 782260 780726 781019
60258 781019 782793 784994 787124 789997 794921 802273 811188 820746 831317 844458 861383 881768 904124
60245 904124 926935 949075 969586 987797 1003524 1016402 1025097 1027981 1024640 1015779 1001575 981392
60233 981392 955887 928326 902602 880268 860427 842236 826333 813609 803457 793974 783814 773569
60221 773569 765134 759760 756912 755209 754078 753881 754576 755152 754616 752814 749962 746197 742057 738626 736452
60206G36452j643k137k766l028l441m241m748m480l871l202j984n5J495J508K25
60191G04084j187k021k176j399M93K716L799L182K069K209L843N265M735K594
60177G28206R65J242K601L356L010K218J479R67J224K639M313M650L244J276p8
60162G61312o72p84n62k43P1R99L209N985P634P565O896O689O818O921P225P704
60146H26767P576O537N665O203Q022R929J0995J1067J0508R845R339Q668P585
60133I38706O735O912P584P323N747L738J729o49k823l151j487j99j300l897n706
60118I59262n981n582n194m921m914n135n081m711m834n633n887m917m093m869
60104H87510o242o037m082k238j595j442r94m57j67L4K40L99Q18J763K494J822
$$ plain form
60206 736452 734809 732672 729906 726878 723437 719196 714448 709968 706097 702895 700911 700856 702351 703859 704084
60191 704084 702897 700876 698700 697301 697794 700510 704309 707491 709560 711769 715612 720877 725612 728206
60177 728206 729171 730413 733014 736370 739380 741598 743077 744044 745268 747907 752220 756870 760114 761390 761312
60162 761312 760640 759856 759294 759051 759122 760121 763330 769315 776949 784514 791410 798099 804917 811838 819063 826767
60146 826767 834343 840880 846545 852748 860770 870699 881694 892761 903269 913114 922453 931121 938706
60133 938706 945441 952353 959937 967260 973007 976745 978474 977825 975002 971851 970364 970165 968865 964968 959262
60118 959262 953281 947699 942505 937584 932670 927535 922454 917743 912909 907276 901389 896472 892379 887510
60104 887510 881268 875231 871149 868911 867316 865874 864880 864423 864256 864290 864530 864929 865747 867510 870004 871826
60088H71826k50k265k851j820J43K063L077L028K652K633K879L278M396O413Q058
60073I03260P964O615N612N361M992M344M299M963N136M126K824K405K932L713
60059I68546M180M029L300K587K467K607K240J511J379K066K683K672K447K257
60045A004971J530j9j618k427k694l183l960m362l857k649j668k022l880n820
60031I68342n969m090j914j142j758k615k958k886k798k948l273l348k768j721
60017I28154r44q53j158j472j909k859m378o035p210p618p661q140r229r933r141
60002H49614p199n833o382q441j0312j0452q529n533l028k027k389l192l479k632
59988G70186o53J563K753K610K133K263K816L383M382O143P560P089M949L067
$$ plain form
60088 871826 871576 869311 866460 864640 864783 866846 869923 872951 875603 878236 881115 884393 888789 895202 903260
60073 903260 911224 917839 923451 928812 933804 938148 942447 947410 952546 956672 959496 961901 964833 968546
60059 968546 972726 976755 980055 982642 985109 987716 989956 991467 992846 994912 997595 1000267 1002714 1004971
60045 1004971 1006501 1006482 1004864 1002437 999743 996560 992600 988238 984381 981732 980064 978042 974162 968342
60031 968342 962373 958283 956369 955227 953469 950854 947896 945010 942212 939264 935991 932643 929875 928154
60017 928154 927210 926357 925199 923727 921818 918959 914581 908546 901336 893718 886057 877917 868688 858755 849614
60002 849614 842415 836582 830200 821759 811447 800995 792466 786933 783905 781878 779489 776297 772818 770186
59988 770186 769533 771096 773849 776459 778592 780855 783671 787054 791436 797579 805139 812228 817177 820244
59974H20244K716L291L680L769M078M586M466K839j89l187m506m153l969n221
59960H28444o818o948n812n346o513q323r456r478q460o772n421n352o126o419
59946G31200n925n472n284m642l564l221m022m822m632l823k835j135J374L174
59932F86371K771R00j92N99K257L163K794J939J634K007K234J820J455J952K765
59917G14469K655J609P73N94M09l5l40q97k681m930n156k621J09N57l83l62O92
59900G04462J067N20N65J672K401J718M62PO44J798K765K895J917M90k54n2J57
59883G23234n64k085l394l523k234k46J282J773J611J347J002N13K55M47O35N37
59867G20590Q83K425M492N619N495N173N398N813O050O487P376Q061P688O165
$$ plain form
59974 820244 822960 826251 829931 833700 837778 842364 846830 849669 849480 846293 841787 837634 833665 828444
59960 828444 821626 814678 808866 803520 797007 788684 779228 769750 761290 754518 749097 743745 737619 731200
59946 731200 725275 719803 714519 709877 706313 703092 699070 694248 689616 685793 682958 681823 683197 686371
59932 686371 689142 690042 689850 690449 692706 695869 698663 700602 702236 704243 706477 708297 709752 711704 714469
59917 714469 717124 718733 719506 720100 720509 720474 720134 719237 716556 711626 706470 703849 703958 704515 704132 703770 704462
59900 704462 705529 706049 706614 708286 710687 712405 712867 712874 713518 715316 718081 720976 722893 723383 723129 723077 723234
59883 723234 722670 720585 717191 713668 711434 711188 712470 714243 715854 717201 718203 718716 718971 719418 720053 720590
59867 720590 721473 723898 728390 734009 739504 744677 750075 755888 761938 768425 775801 783862 791550 797715
59853G97715M047J899J95o23m55L38J382K556L555L759L072K456K900L991M346
59838H31133L523K710L031M120M963N453N923N725L891J325N24K297M356M447
59824H83421L531M073O115P276O444N196N137N763N769M980L985K994K023J285
59810I47992O69m21j996l087l071k541k316k352k261j947j225L08K341L790M357
59795I38240N116O812Q694R823J0337J0372R063O051K831R88l9j679l490l725
59781I99394k306j237j937l974o620r792j2749j3584j1348p792n812o387p936
59768I07920q512p889p156o744n722l458j238r89k477l350k509j761k902m696
59754H48517m580k557j216k128m101n200m811l388j655n16m82p94k85O34K47j857
$$ plain form
59853 797715 801762 803661 803856 803233 802778 803116 804498 807054 810609 814368 817440 819896 822796 826787 831133
59838 831133 834656 837366 840397 844517 849480 854933 860856 866581 870472 871797 872321 874618 878974 883421
59824 883421 886952 891025 897140 904416 910860 916056 921193 926956 932725 937705 941690 944684 946707 947992
59810 947992 948661 948240 946244 943157 940086 937545 935229 932877 930616 928669 927444 927752 930093 933883 938240
59795 938240 943356 950168 958862 968685 979022 989394 998457 1004508 1007339 1008327 1008288 1006609 1003119 999394
59781 999394 997088 995851 993914 989940 983320 973528 960779 947195 935847 928055 922243 915856 907920
59768 907920 899408 891519 884363 877619 871897 868439 867201 866212 863735 860385 857876 856115 853213 848517
59754 848517 843937 841380 840164 838036 833935 828735 823924 820536 818881 818365 817883 817089 816804 817438 817685 815828
59738H15828l919m393l855l540l342k528j420r48j068r34m19j38l4P21K160K924
59722G95095J913j85j787k338k514k686k205o45J040J467O75J46Q90K237K861
59707G93964K329J244L62J98J116L176N848Q148R144Q479O802N571N759O644O661
59692H65445N668N384P064R709J1455J1872J1883J1980J1686J0602R030P608O893
59679I86279P004P276O671N152L942L789L716K470M77q22r74o88m98n10j020k185
59663A020079l376m088m970o632q011p579n744m313l734k868j380l77l00l37m03
59648I65967j611l815m738k881J62J816J708J381J703K120J949J177J97m82m18
59633I64235L80J655L496N878P459O391K937j11p59k62j046l236m938n163m703
$$ plain form
59738 815828 811909 807516 803661 800121 796779 794251 792831 791883 790815 789881 789462 789324 789290 790011 792171 795095
59722 795095 797008 796823 795036 792698 790184 787498 785293 784648 785688 787155 787830 787976 788866 791103 793964
59707 793964 796293 797537 797899 798097 799213 802389 808237 816385 825529 834008 840810 846381 852140 858784 865445
59692 865445 871113 876497 883561 893270 904725 916597 928480 940460 952146 962748 971778 979386 986279
59679 986279 993283 1000559 1007230 1012382 1016324 1020113 1023829 1026299 1026776 1025954 1024980 1024292 1023794 1023284 1022264 1020079
59663 1020079 1016703 1012615 1007645 1001013 993002 985423 979679 975366 971632 968764 967384 967007 966707 966370 965967
59648 965967 964356 960541 955803 952922 953084 954900 956608 957989 959692 961812 963761 964938 965135 964653 964235
59633 964235 964615 966270 969766 975644 983103 989494 992431 992320 991561 991299 990253 987017 982079 976916 972213
59618I72213m347l912l212k666k585k810l354m590o411p792p608n760l457k336
59604I11373l100m801n781n429m532l836l064j722l3J519K862L896M216L881L697
59589H99146L894L511K039O98P22J242O19p91j126k04n0j857m266n485n569n557
59573H86966n634n336m735m253l897l605l871n035o348o633n662m185k878k015
59559H22879j840k393l150l632m223n450o678o595n186m011m046m288l298j321
59545G66768N5o2j083j893j785o23J051K104J849R60P08J268J632J224N68J68
59529G72909j74m84j90O20O24r07k567k415p01M88J12p26p35j09K53P9l84j008
59511G64685j689k204k728l815n356o051m712j700J364L065K979J519l09j284
$$ plain form
59618 972213 967866 963954 960742 958076 955491 952681 949327 944737 938326 930534 922926 917166 913709 911373
59604 911373 908273 903472 897691 892262 887730 883894 880830 879108 879075 880594 883456 887352 891568 895449 899146
59589 899146 903040 906551 908590 909288 910010 911252 911871 911080 909954 909750 909700 907843 903577 898092 892523 886966
59573 886966 881332 875996 871261 867008 863111 859506 855635 850600 844252 837619 831957 827772 824894 822879
59559 822879 821039 818646 815496 811864 807641 802191 795513 788918 783732 779721 775675 771387 768089 766768
59545 766768 766823 766761 765678 763785 762000 761377 762428 764532 766381 767341 768049 769317 770949 772173 772741 772909
59529 772909 772735 772251 772061 772681 773305 772398 769831 767416 766715 767203 767315 766589 765854 765745 765998 766077 765693 764685
59511 764685 762996 760792 758064 754249 748893 742842 738130 736430 737794 740859 743838 745357 745048 743764
59497G43764r04J23Q29J230J998L086L550K978K283K526L530M382M919N829P275
59482G87398Q353Q424Q236Q998J0818J2885J4928J7240J9073J8260J3434O093
59470I34140m87m247n642o193o594o450n319l547k052j474j634j914j919j518
59456H85150n47P95J458M75j539k853k845k602k892l090k927l658o013q321q554
59441H42037p264o541o736o457n425m934n369n495m675l766l202k142k79J299
59427G81051J943K380L009K989K107J839L237N168N964N558M772L928L517M677
59413H32139P306Q996P893N481M484M902M516K763J462J603J887J089j18n54j59
59398H83690O20J787L200M147M324M418N011N757O246O909Q216R672J0493J0781
$$ plain form
59497 743764 742860 742983 743812 745042 747040 750126 753676 756654 758937 761463 764993 769375 774294 780123 787398
59482 787398 795751 804175 812411 821409 832227 845112 860040 877280 896353 914613 928047 934140
59470 934140 933653 929406 923764 917571 910977 904527 899208 895661 893609 892135 890501 888587 886668 885150
59456 885150 884603 885398 886856 887331 885792 882939 880094 877492 874600 871510 868583 864925 858912 850591 842037
59441 842037 834773 828232 821496 815039 809614 804680 799311 793816 789141 785375 782173 780031 779752 781051
59427 781051 782994 785374 788383 791372 793479 795318 798555 803723 809687 815245 820017 823945 827462 832139
59413 832139 839445 848441 856334 861815 866299 871201 875717 878480 879942 881545 883432 884521 884403 883849 883690
59398 883690 884310 886097 889297 893444 897768 902186 907197 912954 919200 926109 934325 943997 954490 965271
59384I65271J1076J1026R382N582P56l135m977n203m978m959m927m443l527k595
59370I64349k046k065k499k773k279j113nP33J720L573N934Q023R687J1323J3137
59355A005699J5186J7780K1156K5074K9424L4568L9763M1646L6148K2756O003
59344A295203p882j5403j7007j5256j2560r731n675J011R272J4830J3209L771
59332A253782r608k1651k9025l1238k9614k6071k2271j9115j6698j4670j2593
59321A021228j0115p233m456k423j209k97P15J766K710L511L875L397K632L140
59307A017241N455P582P027M245K455L559N926O994O514N780N141M248L935N473
59293A091575Q122R590R214Q658Q993R214Q529Q121R196J0906J1804J2140J3027
$$ plain form
59384 965271 976347 987373 996755 1002337 1003093 999958 994981 989778 984800 979841 974914 970471 966944 964349
59370 964349 962303 960238 957739 954966 952687 951574 951569 952302 954022 957595 963529 971552 981239 992562 1005699
59355 1005699 1020885 1038665 1059821 1084895 1114319 1148887 1188650 1230296 1266444 1289200 1295203
59344 1295203 1287321 1271918 1254911 1239655 1227095 1217364 1211689 1212700 1221972 1236802 1250011 1253782
59332 1253782 1244174 1222523 1193498 1162260 1132646 1106575 1084304 1065189 1048491 1033821 1021228
59321 1021228 1011113 1003880 999424 997001 995792 995495 996210 997976 1000686 1004197 1008072 1011469 1014101 1017241
59307 1017241 1022696 1030278 1037305 1041550 1044005 1047564 1053490 1060484 1066998 1072778 1077919 1082167 1086102 1091575
59293 1091575 1099697 1109287 1118501 1127159 1136152 1145366 1153895 1162016 1171212 1182118 1193922 1206062 1219089
59280A219089J4233J4589J3956J3072J1855R639O948N259M796M049J889j136m022
59267A314216o523q499r200q272o898o877q626j0669j1260j0158q659q026q084
59254A202465p664o288m800m115l930l265j824j06J547L225M894O225O911O445
59240A199720L859j395q198j4207j7843j9285j9453j8842j7661j6290j5004j3697
59228A041704j2419j1713j1813j1779j0179o734k879m16P4o47j582k283k527j853
59214I64954K7K577M802O411Q011R978J1767J2754J3221J3788J4236J3672J1866
59201A088064R694Q050O871N519L668J534n90k582m310n558o237o597p037p756
59187A082733q620r267r077p348m045m93J364R08m37q49J01J803L812N664O261
$$ plain form
59280 1219089 1233322 1247911 1261867 1274939 1286794 1296433 1303381 1308640 1313436 1317485 1319374 1318238 1314216
59267 1314216 1307693 1299194 1289994 1281722 1274824 1267947 1259321 1248652 1237392 1227234 1218575 1210549 1202465
59254 1202465 1194801 1188513 1183713 1179598 1175668 1172403 1170579 1170473 1172020 1175245 1180139 1186364 1193275 1199720
59240 1199720 1203579 1202184 1193986 1179779 1161936 1142651 1123198 1104356 1086695 1070405 1055401 1041704
59228 1041704 1029285 1017572 1005759 993980 983801 977067 974188 973772 973846 973199 971617 969334 966807 964954
59214 964954 964981 967558 972360 978771 986782 996760 1008527 1021281 1034502 1048290 1062526 1076198 1088064
59201 1088064 1097758 1105808 1112679 1118198 1121866 1123400 1122810 1120228 1115918 1110360 1104123 1097526 1090489 1082733
59187 1082733 1074113 1064846 1055769 1048421 1044376 1043883 1045247 1046155 1045718 1044869 1044970 1046773 1050585 1056249 1062510
59172A062510N047L429L354M407M222K041q8l95L08N09L39M25m5k074m647n845
59156A073497n610n458n816n630m595l896m277n000n221n084m860m191k895j618
59142A009346j071j188j495j730j780j648j711k395l352l542k511r54K97J152
59128I87418J824K197K234K455L239L938L516K121J284K128L813M411L303K038
59114A025919K457M473O366O944O664O610P114P718P873P456O876O802P408Q003
59100A118683P889P257O457M881J826j751l927m456n066o749q539r587j0520j1731
59086A084667j2144j1163j0151j0333j0640r600q063p940r075r591q804p719o966
59073I62478o172n307m850m591l820k624j670r30J09J247K025K886M459O143O983
$$ plain form
59172 1062510 1067557 1070986 1074340 1078747 1082969 1085010 1084922 1084527 1084835 1085344 1085683 1086108 1086063 1083989 1079342 1073497
59156 1073497 1067887 1062429 1056613 1050983 1046388 1042492 1038215 1033215 1027994 1022910 1018050 1013859 1010964 1009346
59142 1009346 1008275 1007087 1005592 1003862 1002082 1000434 998723 996328 992976 989434 986923 985969 986266 987418
59128 987418 989242 991439 993673 996128 999367 1003305 1006821 1008942 1010226 1012354 1016167 1020578 1023881 1025919
59114 1025919 1028376 1032849 1039215 1046159 1052823 1059433 1066547 1074265 1082138 1089594 1096470 1103272 1110680 1118683
59100 1118683 1126572 1133829 1140286 1145167 1146993 1145242 1141315 1136859 1131793 1125044 1116505 1106918 1096398 1084667
59086 1084667 1072523 1061360 1051209 1040876 1030236 1020636 1012573 1004633 995558 985967 977163 969444 962478
59073 962478 956306 950999 946149 941558 937738 935114 933444 932514 932623 933870 935895 938781 943240 949383 956366
59058I56366P397Q302R124Q607P149O275O212O150O464Q093R895R507P229O197
59044A062967P770R470Q713O183L993K541R64p21j701j766j367r71r69j466j745
59029A091895j093k87q70k714l987l930l748m173m263l494l021l695m755n602
59015A046263o833q291q287o509n523p157r234q498n407l307l695n083o138p113
59001I55188q049q021o915n958n667m872k679k21N89n78k236k805k028p86j24
58986I04838m78j563k564k427o65J687K547J128o63m03J591K752K002J094J709
58971I10585L141L960M296N010N904O377P048R008J1823J3695J3576J2221J1272
58958A017916J1869J3873J5942J6655J5821J4158J1873Q697N410L618L376K699
$$ plain form
59058 956366 963763 972065 981189 989796 996945 1003220 1009432 1015582 1022046 1030139 1040034 1049541 1056770 1062967
59044 1062967 1070737 1080207 1088920 1095103 1099096 1101637 1102601 1101880 1100179 1098413 1097046 1096075 1095106 1093640 1091895
59029 1091895 1090802 1090515 1089645 1086931 1082944 1079014 1075266 1071093 1066830 1063336 1060315 1056620 1051865 1046263
59015 1046263 1039430 1031139 1022852 1016343 1010820 1003663 994429 985931 980524 977217 973522 968439 962301 955188
59001 955188 947139 939118 932203 926245 920578 915706 913027 912806 913395 912817 910581 907776 905748 904962 904838
58986 904838 904360 902797 900233 897806 897141 898828 901375 902503 901840 901437 903028 905780 907782 908876 910585
58971 910585 913726 917686 921982 926992 932896 939273 946321 955329 967152 980847 994423 1006644 1017916
58958 1017916 1029785 1043658 1059600 1076255 1092076 1106234 1118107 1126804 1132214 1135832 1139208 1141907
58946A141907M76j811k492k216k392k549j348Q18K280K680L008L533L568L292
58932A148754L873N505O851O789N490L638J770N84O81J536J764Q18j64L29K520
58917A190738N244P082P517P240P407Q542J0209J1752J2887J3616J4173J5098
58905A311505J6523J7400J6426J4016J2133J1713J1550J0374Q553O950N460L801
58893A446404K333R08j781o180j0402j2397j2517j2325j2020j1007j0036j0380
58881A350600j1366j1044r242p827p833q293q212p793p212n942m075k898l298
58868A255565m582n448n397m738m019l699l660l007j201N74M39j598l231k642
58854A213356p02L94kn62p8J005J602J901L338O435R559J0690J0057R774J1025
$$ plain form
58946 1141907 1142383 1140572 1138080 1135864 1133472 1130923 1129575 1130393 1132673 1135353 1138361 1141894 1145462 1148754
58932 1148754 1152627 1158132 1164983 1171772 1177262 1180900 1182670 1183254 1183935 1185471 1187235 1188053 1187889 1188218 1190738
58917 1190738 1195982 1203064 1210581 1217821 1225228 1233770 1243979 1255731 1268618 1282234 1296407 1311505
58905 1311505 1328028 1345428 1361854 1375870 1388003 1399716 1411266 1421640 1430193 1437143 1442603 1446404
58893 1446404 1448737 1449645 1447864 1441684 1431282 1418885 1406368 1394043 1382023 1371016 1360980 1350600
58881 1350600 1339234 1328190 1318948 1311121 1303288 1294995 1286783 1278990 1271778 1265836 1261761 1258863 1255565
58868 1255565 1250983 1245535 1240138 1235400 1231381 1227682 1224022 1221015 1219814 1220388 1220827 1219229 1215998 1213356
58854 1213356 1212654 1213048 1213046 1212484 1212406 1213411 1215013 1216914 1220252 1226687 1236246 1246936 1256993 1266767 1277792
58839A277792J2863J4110J4914J5692J5882J4857J3230J2153J1879J1806J1338
58828A426516J0243Q840Q211R191J0849J1295J0383R837J0185R714P507N087L489
58815A541347J200k766o172o867o772r163j3250j5242j4051j2277j1653j1209
58803A433125j0328j0168j1087j1646j1245j1173j2025j2521j2001j1800j2910
58792A306221j4306j4852j4934j5046j4560j3206j2054j1739j1309j0121r241
58781A164853r595j0176r742q965r152r844r515q087p106p479q424q650p705o046
58767A044367m446l416k840k246j538j075r04m92M89J559J961J485O10J14M96
58752A034124J491K280K493K627L033L109K217Q45k00j193k854m746n639n374
$$ plain form
58839 1277792 1290655 1304765 1319679 1335371 1351253 1366110 1379340 1391493 1403372 1415178 1426516
58828 1426516 1436759 1445599 1453810 1463001 1473850 1485145 1495528 1505365 1515550 1525264 1532771 1537858 1541347
58815 1541347 1542547 1539781 1533609 1526742 1519970 1510807 1497557 1482315 1468264 1455987 1444334 1433125
58803 1433125 1422797 1412629 1401542 1389896 1378651 1367478 1355453 1342932 1330931 1319131 1306221
58792 1306221 1291915 1277063 1262129 1247083 1232523 1219317 1207263 1195524 1184215 1174094 1164853
58781 1164853 1155258 1145082 1135340 1126375 1117223 1107379 1097864 1089777 1082671 1075192 1066768 1058118 1050413 1044367
58767 1044367 1039921 1036505 1033665 1031419 1029881 1028806 1027902 1027410 1027899 1029458 1031419 1032904 1033514 1033628 1034124
58752 1034124 1035615 1037895 1040388 1043015 1046048 1049157 1051374 1052219 1052019 1050826 1047972 1043226 1037587 1032213
58738A032213n125n789p220q867j0013r638p374m550k991k969l477m159n350o435
58724I48256o020l932j545P4J001J475J592J909K868L654L188K084J752J792M55
58709I58603k288m509n461o444p896q141o214l737k601k653k933l488m465m973
58695H92800m251k826j374K02J612J695M32j43J398L645M386L670L104L099K813
58680I10262K331K924N041P398Q447P884O509N230M375L772L265L076L346L731
58666I77591L953M324M948M975L856K800L440N305O374O037N559N554N224M509
58652A044449M683N920O473N391M060L745L448J803m81j742j804j818k717m930
58638A066480q533j2456j4799j5189j5600j7508j9458j9109j6518j3730j1875
$$ plain form
58738 1032213 1027088 1021299 1014079 1005212 995199 985561 978187 973637 970646 967677 964200 960041 954691 948256
58724 948256 942236 938304 936759 936833 937834 939309 940901 942810 945678 949332 952520 954604 956356 958148 958603
58709 958603 956315 951806 946345 939901 932005 923864 917650 913913 911312 908659 905726 902238 897773 892800
58695 892800 888549 885723 884349 884551 886163 887858 888290 888147 889545 893190 897576 901246 904350 907449 910262
58680 910262 912593 915517 920558 927956 936403 944287 950796 956026 960401 964173 967438 970514 973860 977591
58666 977591 981544 985868 990816 995791 999647 1002447 1005887 1011192 1017566 1023603 1029162 1034716 1039940 1044449
58652 1044449 1049132 1055052 1061525 1066916 1070976 1074721 1078169 1079972 1079491 1077749 1075945 1074127 1071410 1066480
58638 1066480 1057947 1045491 1030692 1015503 999903 982395 962937 943828 927310 913580 901705
58627I01705j0593r736r767j0286r822p616m834l492m429o414p291o162m294l395
58613H03574l408k938j444K91J763L253M632N213N223N803P058P663O929N855
58599H49467N486N645N707N227L448j12m177o518o810o846p555p867p105o182
58585H21808n521m210k328j745l121m359l635k000j273j338j259j230j525j254
58571G87010L5J193J555K413M495N870M618J935L48J66L3k04L64J540K185K036
58555H15592J687J399J347K137L704M815M901N049N870O055M635K913K333K225
58541H64662J651J634L133M543L866K071J576K500L004K471J825J403R67J128
58527H96434K540M323N251N698O540P241P107P166Q504J0104J0689J1330J3442
$$ plain form
58627 901705 891112 881376 871609 861323 851501 843885 839051 835559 831130 824716 817425 811263 806969 803574
58613 803574 800166 797228 795784 796075 797838 801091 805723 810936 816159 821962 829020 836683 843612 849467
58599 849467 854953 860598 866305 871532 874980 874868 870691 864173 857363 850517 842962 835095 827990 821808
58585 821808 816287 812077 809749 808004 804883 800524 796889 794889 793616 792278 791019 789789 788264 787010
58571 787010 787045 788238 789793 792206 796701 802571 807189 809124 809472 809638 809671 809467 809831 811371 813556 815592
58555 815592 817279 818678 820025 822162 825866 830681 835582 840631 846501 852556 857191 860104 862437 864662
58541 864662 866313 867947 871080 875623 879489 881560 883136 885636 888640 891111 892936 894339 895306 896434
58527 896434 898974 903297 908548 914246 920786 928027 935134 942300 950804 960908 971597 982927 996369
58514I96369J5600J5332J3117J1537J1332J1412J1796J3240J4584J4071J2960
58503A141350J4346J8385K2093K3964K5290K6583K6345K4369K2921K3221K3376
58492A392243K1301J7365J2909Q184L166j187l861m900m917m510m468n367o757
58479A419201p889r142j1439j4476j7068j8906k0539k1871k2394k2475k2717k2377
58467A207908k0295j7005j4144j2202j0670r732r790r888q896p694p883q863q572
58454A062274o770n057m099l354l063l774m227k706k93L25p60p33J201K541J612
58439A033117r5p72o48m29J16R01J135J043J899L657M740M790N244O517P185O799
58423A075199O937Q286R108Q047O495O754R361J3196J6730J8458J7812J6266J5828
$$ plain form
58514 996369 1011969 1027301 1040418 1051955 1063287 1074699 1086495 1099735 1114319 1128390 1141350
58503 1141350 1155696 1174081 1196174 1220138 1245428 1272011 1298356 1322725 1345646 1368867 1392243
58492 1392243 1413544 1430909 1443818 1452002 1455168 1453981 1450120 1445220 1440303 1435793 1431325 1425958 1419201
58479 1419201 1411312 1402170 1390731 1376255 1359187 1340281 1319742 1297871 1275477 1253002 1230285 1207908
58467 1207908 1187613 1170608 1156464 1144262 1133592 1123860 1114070 1104182 1095286 1087592 1079709 1070846 1062274
58454 1062274 1055504 1050447 1046348 1042994 1039931 1036157 1031930 1029224 1028931 1029256 1028496 1027763 1028964 1031505 1033117
58439 1033117 1033022 1032250 1031602 1031173 1031289 1032190 1033325 1034368 1036267 1039924 1044664 1049454 1054698 1061215 1068400 1075199
58423 1075199 1082136 1090422 1099530 1107577 1114072 1120826 1130187 1143383 1160113 1178571 1196383 1212649 1228477
58410A228477J5905J3709Q504L201O45J97o62k877n250o165m926k137N54J790
58396A250965J813J774K187L071M862P658J0126J0943J0692J0551R965P832N025
58383A337464L027Q65l521r176j2706j2954j1949j1047r367o536l808j722M69
58370A259039K399K527J182Q81K784N264O701P179P045O390O333P977R823R174
58356A334698O453M758M760L588k82m568o850p417p129n730l793l318m737n953
58342A304480n653m931m574l545j585l34m62l18J239L292N182P569R965J0199
58328A320524P765N048L846L427L155M107O654R094J0041R738Q164M836J288M70
58314A398157K523M420M874O032R062J1859J2836J3374J4558J5052J4267J4268
$$ plain form
58410 1228477 1244382 1258091 1266595 1269796 1270441 1270638 1269976 1267099 1261849 1255684 1250758 1248621 1249175 1250965
58396 1250965 1252778 1254552 1256739 1259810 1264672 1272330 1282456 1293399 1304091 1314642 1324607 1332439 1337464
58383 1337464 1340491 1341356 1337835 1328659 1315953 1302999 1291050 1280003 1270636 1264100 1260292 1258570 1259039
58370 1259039 1261438 1263965 1265147 1266028 1268812 1274076 1280777 1287956 1295001 1301391 1307724 1315701 1325524 1334698
58356 1334698 1341151 1345909 1350669 1354257 1353975 1349407 1342557 1335140 1328011 1322281 1318488 1315170 1310433 1304480
58342 1304480 1298827 1293896 1289322 1285777 1284192 1283858 1283396 1283078 1284317 1287609 1292791 1300360 1310325 1320524
58328 1320524 1328289 1333337 1337183 1340610 1343765 1347872 1354526 1363620 1373661 1383399 1391563 1396399 1397687 1398157
58314 1398157 1400680 1405100 1409974 1416006 1425068 1436927 1449763 1463137 1477695 1492747 1507014 1521282
58302A521282J6314J8579J9430J9942K1141K1825K1300K1283K2795K3853K2466
58291A750210J9550J7022J5325J4236J3779J3099J1050Q662Q276R731J0714J1072
58279A902726J2785J5327J5810J4473J4987J8090K0185J9953K0769K4356K7543
58268B107004K8011K7997K9361L0057K8630K7310K7503K6899K4134K1584K0558
58257B399048J8818J5864J5270J8386K1153K0831K0416K2601K5012K5595K6985
58246B629979L0918L3989L3874L4075L7344L9952L8272L5716L7116M0993M3505
58235C035733M5356M8632N1256N0890N0309N2780N6102N7038N7488O0212O2821
58224C628617O2292O1339O3801O7803O9855P1647P6136Q0944Q2468Q2841Q6092
$$ plain form
58302 1521282 1537596 1556175 1575605 1595547 1616688 1638513 1659813 1681096 1703891 1727744 1750210
58291 1750210 1769760 1786782 1802107 1816343 1830122 1843221 1854271 1862933 1871209 1880940 1891654 1902726
58279 1902726 1915511 1930838 1946648 1961121 1976108 1994198 2014383 2034336 2055105 2079461 2107004
58268 2107004 2135015 2163012 2192373 2222430 2251060 2278370 2305873 2332772 2356906 2378490 2399048
58257 2399048 2417866 2433730 2449000 2467386 2488539 2509370 2529786 2552387 2577399 2602994 2629979
58246 2629979 2660897 2694886 2728760 2762835 2800179 2840131 2878403 2914119 2951235 2992228 3035733
58235 3035733 3081089 3129721 3180977 3231867 3282176 3334956 3391058 3448096 3505584 3565796 3628617
58224 3628617 3690909 3752248 3816049 3883852 3953707 4025354 4101490 4182434 4264902 4347743 4433835
58213D433835R1154R5206R9995J08042J16543J21951J26699J34553J43427J49995
58203E621400J57064J68772J82413J92707K00510K09814K20079K28957K38506
58194G420222K51020K62896K70284K76516K86207K96912L04696L12917L26738
58185A0008408L44010L60448L78626M02498M28320M50634M72059M97187N22465
58176A3864655N42560N61191N84940O11909O37492O65346P01200P41924P82594
58167A9693811Q27896Q84203R47365J011409J082036J167758J265279J367971
58159B8247728J480035J606209J736093J856115J969276K086449K208617K336738
58151D3527260K488056K680050K907472L157120L434236L750767M101250M479091
$$ plain form
58213 4433835 4524989 4620195 4720190 4828232 4944775 5066726 5193425 5327978 5471405 5621400
58203 5621400 5778464 5947236 6129649 6322356 6522866 6732680 6952759 7181716 7420222
58194 7420222 7671242 7934138 8204422 8480938 8767145 9064057 9368753 9681670 10008408
58185 10008408 10352418 10712866 11091492 11493990 11922310 12372944 12845003 13342190 13864655
58176 13864655 14407215 14968406 15553346 16165255 16802747 17468093 18169293 18911217 19693811
58167 19693811 20521707 21405910 22353275 23364684 24446720 25614478 26879757 28247728
58159 28247728 29727763 31333972 33070065 34926180 36895456 38981905 41190522 43527260
58151 43527260 46015316 48695366 51602838 54759958 58194194 61944961 66046211 70525302
58143G0525302M905036N409952O002408O685007P487043Q444380R563857J0847525
58135A29870510J2329702J4040182J5953956J8033812K0292621K2746964K5354123
58128B58621870K8062073L0752773L2800606L2651609K8322354J8898348N714489
58121D35824122q124724j9563075k7088479l0828897l1713657l0737197k8701703
58114B59066390k6182666k3525586k0910186j8454248j6242936j4298816j2599429
58107A26852523j1132424r895304q853267p945799p135964o418865n786574n220334
58099F4463992m715238m279424l906583l575105l273898l005244k763743k536171
58091C6408586k322072k132953j970412j823686j688035j567229j458305j351444
$$ plain form
58143 70525302 75430338 80840290 86842698 93527705 101014748 109459128 119022985 129870510
58135 129870510 142200212 156240394 172194350 190228162 210520783 233267747 258621870
58128 258621870 286683943 317436716 350237322 382888931 411211285 430109633 435824122
58121 435824122 427699398 408136323 381047844 350218947 318505290 287768093 259066390
58114 259066390 232883724 209358138 188447952 169993704 153750768 139451952 126852523
58107 126852523 115720099 105824795 96971528 89025729 81889765 75470900 69684326 64463992
58099 64463992 59748754 55469330 51562747 47987642 44713744 41708500 38944757 36408586
58091 36408586 34086514 31953561 29983149 28159463 26471428 24904199 23445894 22094450
58083B2094450j245612j148876j063284r83565r09763q46922p93072p41069o91463
58074A3670824o50625o17230n83505n48723n18765m93257m65768m36384m11820
58065H944747l93032l74205l54011l36705l21885l04131k83468k65747k51994
58056F059569k37214k20442k06481j96703j87167j76859j69225j64575j59050
58047D341853j51967j46619j43220j38494j32587j29062j27706j24471j18726
58038C129001j13608j09274j02926r5421r0522q7480q1694p3132o6903o4725o2718
58027B180598n8574n4369n1248m7550m3292m0894m0551l9909l8543l7757l6404
58016A691507l2460k8021k6919k7918k6559k3179k2480k5227k7261k7011k7255
$$ plain form
58083 22094450 20848838 19699962 18636678 17653113 16743350 15896428 15103356 14362287 13670824
58074 13670824 13020199 12402969 11819464 11270741 10751976 10258719 9792951 9356567 8944747
58065 8944747 8551715 8177510 7823499 7486794 7164909 6860778 6577310 6311563 6059569
58056 6059569 5822355 5601913 5395432 5198729 5011562 4834703 4665478 4500903 4341853
58047 4341853 4189886 4043267 3900047 3761553 3628966 3499904 3372198 3247727 3129001
58038 3129001 3015393 2906119 2803193 2707772 2617250 2529770 2448076 2374944 2308041 2243316 2180598
58027 2180598 2122024 2067655 2016407 1968857 1925565 1884671 1844120 1804211 1765668 1727911 1691507
58016 1691507 1659047 1631026 1604107 1576189 1549630 1526451 1503971 1478744 1451483 1424472 1397217
58005A397217k8670k8346k5809k4215k4212k2640j8719j5887j6020j7106j7749
57994A157844j8776j9585j8325j6475j7669k1091k1832j8770j6129j5946j5191
57983I58055j2176r795r931j0296r380r320j1189j2292j0954r515r829j0131r091
57970H24156q788j0809j3161j3719j3406j3555j3460j2784j3048j4410j4161j0801
57958F72054o740m868n101n954o736o684m810k077r44j572j558k93K9j238j781
57943F21727q48j074l721n971n315l264k253k141k104k923m822n894n189m740
57929E71468o253q259q824q485q185o978m289k156k476m004m410l693l323l559
57915D96574l677l466k914j819q34j240k543k479n11R82L45r60j123o78n42J57
$$ plain form
58005 1397217 1368547 1340201 1314392 1290177 1265965 1243325 1224606 1208719 1192699 1175593 1157844
57994 1157844 1139068 1119483 1101158 1084683 1067014 1045923 1024091 1005321 989192 973246 958055
57983 958055 945879 936084 926153 915857 906477 897157 885968 873676 862722 853207 843378 833247 824156
57970 824156 815368 804559 791398 777679 764273 750718 737258 724474 711426 697016 682855 672054
57958 672054 665314 660446 655345 649391 642655 635971 631161 629084 628140 626568 625010 624717 624746 623508 621727
57943 621727 620879 619805 616084 610113 604798 601534 599281 597140 595036 592113 587291 581397 576208 571468
57929 571468 565215 556956 548132 539647 531462 524484 520195 518039 515563 511559 507149 503456 500133 496574
57915 496574 492897 489431 486517 484698 483864 482624 480081 477602 477091 478073 478418 477458 476335 475657 475115 475272
57899D75272K115L669K877L27j888k787k614j767r13q33j115n18P26Q85k93q38
57883D72305L18J805K420K769L236K931J919J936L392M346L844L567M469M707
57869E13964K890O66j40m37j602k749k732k686l973n462n388m250l641l770m154
57854D76536m953n746m872k097R8o8j133j294j406k425k518K0K962K856J73j587
57838D54546q80Q61K330L319L318J961M58J12J59o25j255k43J095J81k505l822
57822D59010k549o61J02J33J05l53j506k920m369n776o315n255l501k646k770
57807D20729k927l197m090m409k231J736M167L088R4j881j436R67L954O059O739
57792D27362O923P668Q459P923N894L520J641M41J47N14J00k148m835n567m258
$$ plain form
57899 475272 477387 481056 483933 484260 482372 479585 476971 475204 474291 473458 472343 471825 472551 473436 473143 472305
57883 472305 472623 474428 476848 479617 482853 485784 487703 489639 493031 497377 501221 504788 509257 513964
57869 513964 516854 517520 517380 516943 515341 512592 509860 507174 503201 497739 492351 488101 484460 480690 476536
57854 476536 471583 465837 460965 458868 458966 458898 457765 456471 455065 452640 450122 450142 453104 455960 456133 454546
57838 454546 453666 454527 456857 460176 463494 465455 465913 466025 466184 465559 464304 464061 465156 465337 462832 459010
57822 459010 456461 455800 455902 456035 456140 455787 454281 451361 446992 441216 434901 429646 426145 423499 420729
57807 420729 417802 414605 410515 406106 403875 405611 409778 412866 412960 411079 409643 410610 414564 420623 427362
57792 427362 434285 441953 450412 458335 464229 467749 469390 469831 469978 470492 470592 468444 463609 458042 453784
57777D53784l019k807k406j150m17j430l209l978l503k966l254m176m977m942
57763D11550l869k167m35R39J602J215J31o17p87j627l955o341o638m913l320
57748C80768l254m232n502o980q208p995n897l114j149l36j48k73p32j338j573
57733C30037j004K04J188J150M09J96J066K129K382K092K070K331K437K668L613
57718C52968M940N612N350M955N164N880O443O125M609K528J147R58R93J83j169
57703D06686k035k254k621l626m861n500m974l584k697l562n470o156m592k322
57689C52432j209j098p93j95j21p71j632k226k074q45N81N75o76o76J747M159
57673C47178L888K017J411K117J848L38j38J412L421M602N309N458L917R54j161
$$ plain form
57777 453784 450765 447958 445552 444402 443985 442555 439346 435368 431865 428899 425645 421469 416492 411550
57763 411550 407681 405514 405079 406018 407620 408835 408966 408349 407562 405935 401980 395639 389001 384088 380768
57748 380768 377514 373282 367780 360800 352592 344597 338700 335586 334437 334101 333953 333680 332948 331610 330037
57733 330037 329033 329237 330425 331575 331984 332180 333246 335375 337757 339849 341919 344250 346687 349355 352968
57718 352968 357908 363520 368870 373825 378989 384869 391312 397437 402046 404574 405721 406679 407672 407855 406686
57703 406686 404651 402397 399776 396150 391289 385789 380815 377231 374534 370972 365502 359346 354754 352432
57689 352432 351223 350125 349332 349137 349016 348245 346613 344387 342313 341468 342049 342624 341948 341272 343019 347178
57673 347178 351066 353083 354494 356611 358459 358797 358659 360071 363492 368094 373403 378861 382778 383732 382571
57658C82571j185n15p09j313j376j236j414j303m59L8r32k603l273k585j627j275
57642C60804j425j600j501j108p35p79j227j700j956j856j040M29J258K8k654
57627C44938m320l450j166L44K98m10n45L71J910L184L793M319N489P165Q898
57612C70818J1182J4941J9857K4531K8400L2201L6067L8483L7641L2873K4249
57601F71243J2053k471j6601k7381l3342l4895l3567l1046k8314k5367k2038j8806
57589D09468j6230j3990j1611r806r690j0660j0643q798o554n312m556l042q09
57576B97767J025J683J135l11j959k728j900J16K027K452P76k128m224m263l292
57561B86176l294m470n083m112k602j943k069k027j309j00J016J256L65o68o83
$$ plain form
57658 382571 381386 380871 380162 378849 377473 376237 374823 373520 373061 373099 372167 369564 366291 363706 362079 360804
57642 360804 359379 357779 356278 355170 354435 353656 352429 350729 348773 346917 345877 346306 347564 347592 344938
57627 344938 340618 337168 336002 336346 336644 336234 335689 336060 337970 341154 344947 349266 354755 361920 370818
57612 370818 382000 396941 416798 441329 469729 501930 537997 576480 614121 646994 671243
57601 671243 683296 680825 664224 636843 603501 568606 535039 503993 475679 450312 428274 409468
57589 409468 393238 379248 367637 357831 348141 337481 326838 318040 311486 306174 301618 298576 297767
57576 297767 298792 300475 301610 301299 299340 296612 294712 294828 296855 299307 300083 297955 293731 289468 286176
57561 286176 282882 278412 273329 269217 266615 264672 262603 260576 259267 259167 260183 261439 261804 261136 260453
57546B60453j55o33k213l179k664j897j982k138j413o23j066k345l043k868k659
57531B31575k752k668k174j579j168j073j427j949j962j424j301k104k817k323
57517B04854j289j348k670l536k384M09K895L200J061j765k969k043p67q89j994
57502A90765k516k085j605j356m87J290K677K214J52j774k273j685j165j124r39
57487A80089j08R59J609J796J616O04j492l528l756j964K92J626J912J329j69
57472A80815j898k355j081M00M38p83j959k435k221j104J039L374M584M146K626
57457A83586J047L97J086K305K516J277q7k33N38J193J659K502L504L759L022
57442B08071J956J226J080J609K601L334L219K466J687J164R66J170J370O93q66
$$ plain form
57546 260453 260298 259665 257452 254273 251609 249712 247730 245592 244179 243556 242490 240145 237102 234234 231575
57531 231575 228823 226155 223981 222402 221234 220161 218734 216785 214823 213399 212098 209994 207177 204854
57517 204854 203565 202217 199547 196011 193627 194036 196931 200131 201192 199427 196458 194415 193648 192759 190765
57502 190765 188249 186164 184559 183203 182716 184006 186683 188897 189049 187275 185002 183317 182152 181028 180089
57487 180089 179981 180940 182549 184345 185961 186565 185073 181545 177789 175825 176117 177743 179655 180984 180815
57472 180815 178917 176562 175481 175881 176319 175536 173577 171142 168921 167817 168856 172230 176814 180960 183586
57457 183586 184633 185030 186116 188421 190937 192214 192127 191894 192432 193625 195284 197786 201290 205049 208071
57442 208071 210027 211253 212333 213942 216543 219877 223096 225562 227249 228413 229379 230549 231919 232612 231746
57427B31746j909j328K0N28J29J19J014J974K335K397K470K244J502O23K2l26
57411B43560m46m1J110K633L737L849L104K224J653R18o47k540l307k440j149
57396B52218p38j051j202r56o03j55L65N37K37L2J29j74j034j168L70K487L630
57379B52924M053M860N609N019L536K884L185K829J459P78J698K824K797K301
57365B96756K549L225L281K679K104J747J456J381J555J508J100J106K194L885
57351C26526N279O161O727O966O987P273P779P497N807L656K553K910M190O047
57337D06358Q169R592R449Q306P592P705P748P180O637O757P161P173O867O891
57323E13585P572Q686R842J0815J1616J2400J3131J3368J2736J1631J1041J1387
$$ plain form
57427 231746 229837 228509 228529 229057 229186 229305 230319 232293 234628 237025 239495 241739 243241 243864 243886 243560
57411 243560 243114 243073 244183 246816 250553 254402 257506 259730 261383 262301 261654 259114 255807 253367 252218
57396 252218 251480 250429 249227 248271 247668 247513 247878 248415 248652 248684 248813 248639 247605 246437 246807 249294 252924
57379 252924 256977 261837 267446 272465 276001 278885 282070 284899 286358 287136 288834 291658 294455 296756
57365 296756 299305 302530 305811 308490 310594 312341 313797 315178 316733 318241 319341 320447 322641 326526
57351 326526 331805 337966 344693 351659 358646 365919 373698 381195 387002 390658 393211 396121 400311 406358
57337 406358 414527 424119 433568 441874 449466 457171 464919 472099 478736 485493 492654 499827 506694 513585
57323 513585 521157 529843 539685 550500 562116 574516 587647 601015 613751 625382 636423 647810
57311F47810J2077J2386J2361J2289J1866J0599Q914P979Q257R020R620J0329
57299G73507J1365J1854J0909R256Q611R439J0537J1013J1404J2331J3317J3745
57287I07288J3988J4534J4802J4167J3475J4126J5811J6616J5506J3446J1927
57276A065686J1518J2212J3852J5590J6006J4751J3433J3966J6329J8665J9321
57265A231329J8326J7074J6972J8110J8971J7887J5152J3081J3409J5171J6137
57254A411619J5827J5869J7209J8450J7868J6157J5778J7765K0542K2186K2669
57243A611939K2940K2899K1817K0322K0148K1529K2458K1485J9927J9959K1585
57232A847008K3044K3651K4341K5465K5938K5171K4352K4931K6783K8617K9479
$$ plain form
57311 647810 659887 672273 684634 696923 708789 719388 728302 736281 744538 753558 763178 773507
57299 773507 784872 796726 807635 816891 825502 834941 845478 856491 867895 880226 893543 907288
57287 907288 921276 935810 950612 964779 978254 992380 1008191 1024807 1040313 1053759 1065686
57276 1065686 1077204 1089416 1103268 1118858 1134864 1149615 1163048 1177014 1193343 1212008 1231329
57265 1231329 1249655 1266729 1283701 1301811 1320782 1338669 1353821 1366902 1380311 1395482 1411619
57254 1411619 1427446 1443315 1460524 1478974 1496842 1512999 1528777 1546542 1567084 1589270 1611939
57243 1611939 1634879 1657778 1679595 1699917 1720065 1741594 1764052 1785537 1805464 1825423 1847008
57232 1847008 1870052 1893703 1918044 1943509 1969447 1994618 2018970 2043901 2070684 2099301 2128780
57221B128780K9243K8417K8101K9354L1821L3709L3901L3406L3846L5116L5766
57210B481460L5349L5118L6240L8371M0294M1228M1144M0490L9970M0136M0732
57199B910532M0777L9629L7800L6381L5893L6091L6698L7886L9845M2333M5010
57188C338875M8000N1603N5380N8128N9230N9652O0855O2900O4314O3976O2339
57177C985252O0456N8592N6427N3992N1600M9140M6336M3536M1360L9475L6791
57166D522957L3250L0600L0421L1941L2804L2069L1384L2720L5699L8158L9164
57155D891167M0368M3926M9758N5646N9735O2079O3719O5185O6375O7271O8035
57144E533264O8626O8861O8615O7479O4494N8976N1677M4368L8094L2508K7180
$$ plain form
57221 2128780 2158023 2186440 2214541 2243895 2275716 2309425 2343326 2376732 2410578 2445694 2481460
57210 2481460 2516809 2551927 2588167 2626538 2666832 2708060 2749204 2789694 2829664 2869800 2910532
57199 2910532 2951309 2990938 3028738 3065119 3101012 3137103 3173801 3211687 3251532 3293865 3338875
57188 3338875 3386875 3438478 3493858 3551986 3611216 3670868 3731723 3794623 3858937 3922913 3985252
57177 3985252 4045708 4104300 4160727 4214719 4266319 4315459 4361795 4405331 4446691 4486166 4522957
57166 4522957 4556207 4586807 4617228 4649169 4681973 4714042 4745426 4778146 4813845 4852003 4891167
57155 4891167 4931535 4975461 5025219 5080865 5140600 5202679 5266398 5331583 5397958 5465229 5533264
57144 5533264 5601890 5670751 5739366 5806845 5871339 5930315 5981992 6026360 6064454 6096962 6124142
57133F124142K2829K0500J9989K0011J9795J9638J9786J9677J8815J7686J7113
57122F339981J7006J6556J5453J4280J3514J2931J2175J1320J0365Q626N385J141
57110F478733k412l898l554k864l111m287n108m027n05M409Q926J2182J4898J8229
57096F507611K2226K5906K8458K9523K8275K3445J4990M977m247j2521k1507l2039
57084F615097m2860n2120n9230o4843o9873p4906p9849q3695q5447q5883q7777
57073E828614r3670j03748j16303j29677j43146j56520j69798j82983j95724k07515
57063D329530k18696k30707k44683k60354k76866k94015l11894l30298l49640
57054A812377l71902l99358m32507A38324c73618n57775o08338o64246p26674
$$ plain form
57133 6124142 6146971 6167471 6187460 6207471 6227266 6246904 6266690 6286367 6305182 6322868 6339981
57122 6339981 6356987 6373543 6388996 6403276 6416790 6429721 6441896 6453216 6463581 6472207 6477592 6478733
57110 6478733 6476321 6472423 6468869 6466005 6462894 6458607 6453499 6449472 6448967 6453376 6462302 6474484 6489382 6507611
57096 6507611 6529837 6555743 6584201 6613724 6641999 6665444 6680434 6685411 6681164 6668643 6647136 6615097
57084 6615097 6572237 6520117 6460887 6396044 6326171 6251265 6171416 6087721 6002274 5916391 5828614
57073 5828614 5734944 5631196 5514893 5385216 5242070 5085550 4915752 4732769 4537045 4329530
57063 4329530 4110834 3880127 3635444 3375090 3098224 2804209 2492315 2162017 1812377
57054 1812377 1440475 1041117 608610 138324 -373618 -931393 -1539731 -2203977 -2930651
57045b930651p97271q77635r69023j071539j182619j297202j410509j520314j626515
57036a3683278j730461j836020j949670k078117k227230k403405k612423k855017
57028c1375621l126812l424296l747323m097822m487789m947553n491176o029635
57020f6728027o317267o037141n000255l289546j216100Q58240K667440M072949
57012h0989707N030666N565058N754996N706249N517169N261471M988299M723861
57004c8441938M472984M228267L982022L730185L469888L199599K921500K640354
56996i797139K360628K087047J826132J583855e76898E85439R83755Q27346O91832
56987C088372N75552M78163L98446L32074K74483K24939J85127J54721J31049
$$ plain form
57045 -2930651 -3727922 -4605557 -5574580 -6646119 -7828738 -9125940 -10536449 -12056763 -13683278
57036 -13683278 -15413739 -17249759 -19199429 -21277546 -23504776 -25908181 -28520604 -31375621
57028 -31375621 -34502433 -37926729 -41674052 -45771874 -50259663 -55207216 -60698392 -66728027
57020 -66728027 -73045294 -79082435 -84082690 -87372236 -88588336 -87730096 -85062656 -80989707
57012 -80989707 -75959041 -70393983 -64638987 -58932738 -53415569 -48154098 -43165799 -38441938
57004 -38441938 -33968954 -29740687 -25758665 -22028480 -18558592 -15358993 -12437493 -9797139
56996 -9797139 -7436511 -5349464 -3523332 -1939477 -576898 585439 1569194 2396540 3088372
56987 3088372 3663924 4142087 4540533 4872607 5147090 5372029 5557156 5711877 5842926
56978E842926J12519R9555R2271Q9350Q9293R1098R3901R6964R9085R6606Q3326
56967F886894N4974J3992l1344p2264j03606j24601j37945j47442j54795j58978
56957F024885j59528j58674j58524j57862j54248j48229j42831j39534j37327
56948D668128j35353j34049j33692j34051j35558j38931j43738j49066j55174
56939C408516j62467j69125j72162j70933j67589j63870j59344j52915j44149
56930A945962j32988j20073j07437r6925q7775p7816o7158n8360n2587m8115m3524
56919A053204l9939l8664l8585l7611l5355l2790l0367k7880k5423k3185k0903
56908G02502j8438j6342j4966j3554j1059p424l478j0K573M171N133N971O543
$$ plain form
56978 5842926 5955445 6055000 6147271 6236621 6325914 6417012 6510913 6607877 6706962 6803568 6886894
56967 6886894 6941868 6955860 6924516 6852252 6748646 6624045 6486100 6338658 6183863 6024885
56957 6024885 5865357 5706683 5548159 5390297 5236049 5087820 4944989 4805455 4668128
56948 4668128 4532775 4398726 4265034 4130983 3995425 3856494 3712756 3563690 3408516
56939 3408516 3246049 3076924 2904762 2733829 2566240 2402370 2243026 2090111 1945962
56930 1945962 1812974 1692901 1585464 1488539 1400764 1322948 1255790 1197430 1144843 1096728 1053204
56919 1053204 1013265 974601 936016 898405 863050 830260 799893 772013 746590 723405 702502
56908 702502 684064 667722 652756 639202 628143 620719 617241 617231 619804 623975 629108 635079 641622
56895F41622N981L715J70l780p514j0600j2665j3592j3458j2228j0047p673n866
56882E54065m408k558l79J366K658M470P333J0643J3604J5979J7755J8991K0044
56869F59563K0818J9732J4792O124l726j2338j8956k3189k4100k1820j8732j7416
56857E80752j7903j8227j7198j5422j3831j2478j0979r277p676o494n910n817
56845D39540n799n425m584l566k797k428k126j421l76M42R36J787L274M463M478
56830D26398L956M100M709M638L940L842M338L684R01k724n458p094q087q143
56816D29000p051n835n512n155k833J601N941Q142Q520R182J1810J6289K1208
56803D85307K5426K9024L2549L5578L6723L5112L1147K5394J7623P815k424j0499
$$ plain form
56895 641622 647603 651318 651488 647708 640194 629594 616929 603337 589879 577651 567604 559931 554065
56882 554065 549657 547099 546720 548086 550744 555214 562547 573190 586794 602773 620528 639519 659563
56869 659563 680381 700113 714905 721029 717303 704965 686009 662820 638720 616900 598168 580752
56857 580752 562849 544622 527424 512002 498171 485693 474714 465437 457761 451267 445357 439540
56845 439540 433741 428316 423732 420166 417369 414941 412815 411394 411018 411460 412396 414183 417457 421920 426398
56830 426398 430354 434454 439163 443801 447741 451583 455921 459605 460506 457782 452324 445230 437143 429000
56816 429000 421949 416114 410602 405447 402614 404215 410156 418298 426818 436000 447810 464099 485307
56803 485307 510733 539757 572306 607884 644607 679719 710866 736260 753883 761698 759274 748775
56791G48775j4966j6413j6201j4969j2593r163n375j847J632N791J0762J5730
56779F91163J9952K3653K7450L1362L5056L8724M2494M4937M3221L5376K1991
56768A055379N685j0314k3112l1008l4411l5368l5470l4518l1662k7165k2294
56757G75742j7650j2573o354N28O746J1463J4931J7767K0119K1835K3047K3775
56745H79376K2949J8889J1165J259r086j9102k8003l3988l5713l4143l1498k8807
56733G13298k5783k2544j9697j6872j3015q304m213j425Q16L064M939O334P686
56720F24284Q605P845N261K122j193n956j2455j8322k1055k0972k0221j9825j9295
56707E08823j8391j7608j7101j6384j5087j3288j1292r549q400p476o102m598
$$ plain form
56791 748775 733809 717396 701195 686226 673633 664470 659095 657248 658880 664671 675433 691163
56779 691163 711115 734768 762218 793580 828636 867360 909854 954791 998012 1033388 1055379
56768 1055379 1061064 1050750 1027638 996630 962219 926851 891381 856863 825201 798036 775742
56757 775742 758092 745519 739165 739693 746439 757902 772833 790600 810719 832554 855601 879376
56745 879376 902325 921214 932379 933638 924552 905450 877447 843459 807746 773603 742105 713298
56733 713298 687515 664971 645274 628402 615387 607083 602870 601445 602261 605325 610264 616598 624284
56720 624284 632889 640734 645995 648117 646924 640968 628513 610191 589136 568164 547943 528118 508823
56707 508823 490432 472824 455723 439339 424252 410964 399672 390123 381723 374247 368145 363547
56695C63547m284n480o658o482n653n645o396o603n673m281l254k936l187l238
56681B93777k113o0J142L22j292j603l61R30J306J094O02l82j621k210j752q91
56665B86888l97l25l01J0P56J729K341K258J926J903J931J345K43m68l00K86O40
56648C00465N66M5j024k440l415l127j542M26J672J848J567J691K473L521M270
56633C06996M274L325J751L58m17r24j433j403l57R63J431J155J098J330J066
56618C19213L02n5K57O85J239K404L572L359J866P20N02P7r09j164k67K21n74
56601C31448j205n02M01L65M86J842K899J724o34j593q10n8n3J9M05M68K23J13
56583C35538l15j566k531j806k19J06j160k466k932k789j712P27L042K975R43
$$ plain form
56695 363547 359263 353783 347125 340643 334990 329345 322949 316346 310673 306392 303138 300202 297015 293777
56681 293777 291664 291604 292746 293068 291776 290173 289812 290742 292048 293142 293744 293362 291741 289531 287779 286888
56665 286888 286491 286166 285865 285875 286631 288360 290701 292959 294885 296788 298719 300064 300307 299839 299539 299825 300465
56648 300465 301031 301076 300052 297612 294197 291070 289528 289954 291626 293474 295041 296732 299205 302726 306996
56633 306996 311270 314595 316346 316704 316287 315363 313930 312527 312170 313133 314564 315719 316817 318147 319213
56618 319213 319515 319460 319717 320402 321641 324045 327617 330976 332842 333562 334064 334141 333232 332068 331801 332022 331448
56601 331448 330243 329741 330142 330507 330993 332835 335734 337458 336824 335231 334421 334363 334310 334329 334734 335202 335425 335538
56583 335538 335223 333657 331126 329320 329101 329207 328047 325581 322649 319860 318148 318875 321917 324892 325835
56568C25835j99O97J619Q41n67q47j66K52J77K25O71J372K048K011N14k026m007
56551C28450m286l162j571k12M44L07j8P6K25k39q87o94K17P33N78M96O59M35
56533C21551j24j33N73J237J692K488L224K484P8k047j944L07L050M572L955J685
56517C42648l16l91Q54J402N92k84j48O91J680K724L514L655L693M518N607N484
56501C75923M133L247L848N514P937J1055J3265J2066P414K335q28k648m177m726
56487D34358l627k099j493j276m90K26j73j176j719k127l343n073o223o508o242
56472C93015n279l450j486l06J46M67Q15J086J232Q45n78k249k302l28J609J559
56456C84796N9j139j458j341r05j95J36k90q01q30r12j459j690r63q3l2m80p85
$$ plain form
56568 325835 325636 326333 327952 328793 328226 327379 327213 327465 327642 327867 328538 329910 331958 333969 334483 332457 328450
56551 328450 324164 321002 319431 319219 319663 319970 319952 320028 320253 320014 319127 318433 318650 319383 319961 320457 321116 321551
56533 321551 321427 321294 321867 323104 324796 327284 330508 332992 333070 331023 329079 329386 332436 337008 340963 342648
56517 342648 342332 341941 342795 344197 344789 344505 344357 345048 346728 349452 352966 356621 360314 364832 370439 375923
56501 375923 380056 383303 387151 392665 400602 411657 424922 436988 444402 446737 445909 443261 439084 434358
56487 434358 430731 428632 427139 425863 425373 425599 425426 424250 422531 420404 417061 411988 405765 399257 393015
56472 393015 387736 384286 382800 382494 382640 383107 383922 385008 386240 387085 386507 384258 381956 381628 383237 384796
56456 384796 384855 383716 382258 380917 380012 379817 379953 379663 378862 378032 377120 375661 373971 373008 372925 372893 372413 371628
56438C71628j190j652r08J571L848L730J719j03j294k917m864n623m626k896j214
56423C55209O19K469L323K526N88j349k216j579l11p4j122j421P35M055N740M982
56407C72174L276J772M43l57L14K096L107K366J103Q94J676K332K352K065J727
56392C97340J199M14k61k51N74J477J516P04J13N49J667K609K798J908J2j783
56376D10585j907k59J381J582Q61L31m2o49r43k72P85J288J438J908K394K124
56360D20605J180Q3j173k470k800j627k03L4m02p1R21J348J132J268J785J710
56344D21320R99O90J094J393J187J008J124J155R90R93J308J818K526L067K505
56329D43177P41o34l29O77P01J12M82J737K368K102K023K096J117o96j415l87
$$ plain form
56438 371628 370438 368786 367878 369449 373297 377027 378746 378643 377349 374432 369568 363945 359319 356423 355209
56423 355209 355828 358297 361620 364146 364734 363385 361169 359590 359279 359205 358083 356662 357397 361452 367192 372174
56407 372174 375450 377222 377665 377308 377622 379718 382825 385191 386294 387188 388864 391196 393548 395613 397340
56392 397340 398539 398953 398692 398441 399015 400492 402008 402712 402825 403374 405041 407650 410448 412356 412368 410585
56376 410585 408678 408419 409800 411382 412243 412574 412532 411883 410940 410668 411453 412741 414179 416087 418481 420605
56360 420605 421785 421868 420695 418225 415425 413798 413595 413629 413227 413156 414077 415425 416557 417825 419610 421320
56344 421320 422319 423009 424103 425496 426683 427691 428815 429970 430960 431953 433261 435079 437605 440672 443177
56329 443177 443918 443284 442955 443632 444333 444445 444927 446664 449032 451134 453157 455253 456370 455674 454259 453872
56313D53872P23N94J74Q94K525L634L176J128j386k397q95J597K629K002J705
56298D69975K683L634L450K846K749K877K805K938L474L659K998K130J775J756
56284E09749J502O66r15k695k981o08K917M744M379M092N355O955P400O931O147
56269E53638M749K919K081K765L480L074K560L105L895L751L288L543L813K990
56255E99651J857J850K395J829N28O49K833N272O368O460O436O326N879N276M707
56240F58316M260M575O366Q890J0146R374Q260Q718J0383J1474J1491J1584J2354
56227G76191J2725J1617R645Q341Q318R131J0448J2229J3950J4835J5171J6249
56215I18850J8575K1061K2545K3209K3802K4498K5305K6709K8811L0611L1450
$$ plain form
56313 453872 454595 455189 455363 456257 458782 462416 465592 466720 465334 462937 462042 463639 466268 468270 469975
56298 469975 472658 476292 479742 482588 485337 488214 491019 493957 497431 501090 504088 506218 507993 509749
56284 509749 511251 511917 511002 508307 505326 504718 507635 512379 516758 520850 526205 533160 540560 547491 553638
56269 553638 558387 561306 563387 566152 569632 572706 575266 578371 582266 586017 589305 592848 596661 599651
56255 599651 601508 603358 605753 607582 608110 608759 611592 616864 623232 629692 636128 642454 648333 653609 658316
56240 658316 662576 667151 673517 682407 692553 701927 710187 718905 729288 740762 752253 763837 776191
56227 776191 788916 800533 810178 818519 826837 835968 846416 858645 872595 887430 902601 918850
56215 918850 937425 958486 981031 1004240 1028042 1052540 1077845 1104554 1133365 1163976 1195426
56204A195426L2442L5109L9074M2643M5380M8510N2730N7188O0961O4397O8567
56193A742427P4276Q1731R0243R8271J04815J10899J18593J28228J37568J44107
56183B831158J47389J48747J49501J49676J48116J43570J35774J25191J11570
56174D090692R3672P1192M6147K1287k220k4558m5580o4694q1780r6792j08997
56163C898369j18002j24878j30616j34165j33925j30800j27573j25293j22360
56154B750757j17388j11095j04945r9582r4959r0656q5756p9608p2893o6802o1520
56143A765553n6700n2698m9772m6740m2447l7947l4979l2892k9640k5404k2469
56132A333865k1505k0840j9567j8507j7670j5734j2657j0075q385o210l454k035
$$ plain form
56204 1195426 1227868 1262977 1302051 1344694 1390074 1438584 1491314 1548502 1609463 1673860 1742427
56193 1742427 1816703 1898434 1988677 2086948 2191763 2302662 2421255 2549483 2687051 2831158
56183 2831158 2978547 3127294 3276795 3426471 3574587 3718157 3853931 3979122 4090692
56174 4090692 4184364 4255556 4301703 4322990 4320770 4296212 4250632 4185938 4104158 4007366 3898369
56163 3898369 3780367 3655489 3524873 3390708 3256783 3125983 2998410 2873117 2750757
56154 2750757 2633369 2522274 2417329 2317747 2222788 2132132 2046376 1966768 1893875 1827073 1765553
56143 1765553 1708853 1656155 1606383 1559643 1517196 1479249 1444270 1411378 1381738 1356334 1333865
56132 1333865 1312360 1291520 1271953 1253446 1235776 1220042 1207385 1197310 1188925 1182715 1179261 1177226
56120A177226k584l221k669j833j243J90K594M257M751N948Q270R083O996M815
56106A212580N620Q320R983J0462J1612J3526J4601J4660J5230J7029J9223K1045
56094A373891K2615K4395K6819K9980L3107L5286L7168M0676M6412N2956N9224
56083A782529O5801P3239Q0928Q8366R5526J01228J03294J01166R6158Q8587P7523
56072B754345O4290N3088M6479M3057M0904M0011L9413L5740K7593J8543J2710
56061C176173R667O560K500k452j0318k3280l9870n6229p0142q1214q8585r1428
56049B731382r0682q7708q2229p3918o4561n6291m8986m1784l5478l0900k6574
56038B092271k0805j4852j1174r638q087n629k921k67K289M052N001O682R722
$$ plain form
56120 1177226 1174642 1171421 1168752 1166919 1165676 1165866 1168460 1172717 1177468 1183416 1191686 1200769 1207765 1212580
56106 1212580 1218200 1226520 1236503 1246965 1258577 1272103 1286704 1301364 1316594 1333623 1352846 1373891
56094 1373891 1396506 1420901 1447720 1477700 1510807 1546093 1583261 1623937 1670349 1723305 1782529
56083 1782529 1848330 1921569 2002497 2090863 2186389 2287617 2390911 2492077 2588235 2676822 2754345
56072 2754345 2818635 2871723 2918202 2961259 3002163 3042174 3081587 3117327 3144920 3163463 3176173
56061 3176173 3185840 3192400 3194900 3192448 3182130 3158850 3118980 3062751 2992609 2911395 2822810 2731382
56049 2731382 2640700 2552992 2470763 2396845 2332284 2275993 2227007 2185223 2149745 2118845 2092271
56038 2092271 2071466 2056614 2045440 2035802 2027715 2022086 2019165 2018898 2021187 2025239 2030240 2036922 2046644
56025B046644J2088J2038J1103J1661J3316J4307J4819J6164J8119J9675K1135
56014B211069K3067K4643K5198K5819K7309K8555K9013L0337L3237L5356L5050
56003B528653L4508L6184L8856M0406M1577M3535M4704M3880M3573M6212M9771
55992B991859N1431N2637N6054O0190O1981O2150O3016O3603O2218O1390O4396
55981C650925O8960P0363O9169O9880P3414P7076Q0663Q6231R2545R6139R7688
55970D533053J01415J08310J15468J21887J29381J37861J45183J51642J59550
55961E703750J68698J77218J86112J97720K10595K21374K30653K41398K52673
55952G590191K61151K67847K77050K89209L01052L12106L24904L39645L54801
$$ plain form
56025 2046644 2058732 2070770 2081873 2093534 2106850 2121157 2135976 2152140 2170259 2189934 2211069
56014 2211069 2234136 2258779 2283977 2309796 2337105 2365660 2394673 2425010 2458247 2493603 2528653
56003 2528653 2563161 2599345 2638201 2678607 2720184 2763719 2808423 2852303 2895876 2942088 2991859
55992 2991859 3043290 3095927 3151981 3212171 3274152 3336302 3399318 3462921 3525139 3586529 3650925
55981 3650925 3719885 3790248 3859417 3929297 4002711 4079787 4160450 4246681 4339226 4435365 4533053
55970 4533053 4634468 4742778 4858246 4980133 5109514 5247375 5392558 5544200 5703750
55961 5703750 5872448 6049666 6235778 6433498 6644093 6865467 7096120 7337518 7590191
55952 7590191 7851342 8119189 8396239 8685448 8986500 9298606 9623510 9963155 10317956
55943A0317956L71940L93498M17061M38569M59504M83929N10117N32993N53160
55934A4478727N75390N99896O23844O49852O83668P24553P67441Q13267Q67231
55925B0783869R28383R91744J059643J139486J231093J328025J430658J544987
55917C0437888J668287J789424J904688K021244K145123K279430K434127K622267
55909D7302478K845076L094828L372494L687517M041790M432534M871245N381051
55901G9029013N975935O662718P461362Q399415R488627J0734408J2165114J3819528
55893A53736120J5709066J7830943K0211175K2878130K5781359K8757846L1485317
55886C16389956L3265076L2818834K8637686K0009563P921597n157376j6575142
$$ plain form
55943 10317956 10689896 11083394 11500455 11939024 12398528 12882457 13392574 13925567 14478727
55934 14478727 15054117 15654013 16277857 16927709 17611377 18335930 19103371 19916638 20783869
55925 20783869 21712252 22703996 23763639 24903125 26134218 27462243 28892901 30437888
55917 30437888 32106175 33895599 35800287 37821531 39966654 42246084 44680211 47302478
55909 47302478 50147554 53242382 56614876 60302393 64344183 68776717 73647962 79029013
55901 79029013 85004948 91667666 99129028 107528443 117017070 127751478 139916592 153736120
55893 153736120 169445186 187276129 207487304 230365434 256146793 284904639 316389956
55886 316389956 349655032 382473866 411111552 431121115 439042712 433885336 417310194
55879D17310194k4757602k9493095l1385596l1236040k9762804k7539017k4967734
55872B18168306k2299196j9698796j7287887j5132740j3247267j1629145j0272314
55865A08600961r143909q183923p342628o600232n946730n366299m848734m395017
55857E6773489m001705l654288l341334l060909k809067k576614k361634k171484
55849C2796454k007793j861536j726351j604239j494444j389048j284344j185879
55841B0242820j097709j016429r39669q70897q11716p58167p08385o65589o29957
55832A2744302n95737n60039n26733m98171m70686m42001m15931l95606l78407
55823H460991l61390l45888l32984l19849l04098k87218k70935k54646k38653
$$ plain form
55879 417310194 392552592 363059497 331673901 300437861 270675057 243136040 218168306
55872 218168306 195869110 176170314 158882427 143749687 130502420 118873275 108600961
55865 108600961 99457052 91273129 83930501 77330269 71383539 66017240 61168506 56773489
55857 56773489 52771784 49117496 45776162 42715253 39906186 37329572 34967938 32796454
55849 32796454 30788661 28927125 27200774 25596535 24102091 22713043 21428699 20242820
55841 20242820 19145111 18128682 17189013 16318116 15506400 14748233 14039848 13374259 12744302
55832 12744302 12148565 11588526 11061793 10563622 10092936 9650935 9235004 8839398 8460991
55823 8460991 8099601 7753713 7420729 7100880 6796782 6509564 6238629 5983983 5745330
55814E745330k25155k13967k02084j89388j79746j74493j69969j63686j57838
55805D069004j54222j50653j45115j38976j33341j26506j17773j09877j04940
55796B887601j01553r8064r5098r2608q8195q0957p3714o9021o5821o2129n8155
55785B002286n4772n1683m8873m7276m6543m4802m1804l9376l7784l5037l0993
55774A523343k8561k9038k9786k8462k6397k5635k5595k4841k3645k2718k1629
55763A237036k0275j9742k0261k0514k0107k0290k1072k0410j7718j5424j5418
55752A025805j6537j7166j7632j8340j8065j6110j3902j2531j0860p896n039l940
55740H67787m014l822l369l295l272k802k363k450k735l003l523l823k856j125
$$ plain form
55814 5745330 5520175 5306208 5104124 4914736 4734990 4560497 4390528 4226842 4069004
55805 4069004 3914782 3764129 3619014 3480038 3346697 3220191 3102418 2992541 2887601
55796 2887601 2786048 2687984 2592886 2500278 2412083 2331126 2257412 2188391 2122570 2060441 2002286
55785 2002286 1947514 1895831 1846958 1799682 1753139 1708337 1666533 1627157 1589373 1554336 1523343
55774 1523343 1494782 1465744 1435958 1407496 1381099 1355464 1329869 1305028 1281383 1258665 1237036
55763 1237036 1216761 1197019 1176758 1156244 1136137 1115847 1094775 1074365 1056647 1041223 1025805
55752 1025805 1009268 992102 974470 956130 938065 921955 908053 895522 884662 876766 871727 867787
55740 867787 863773 859951 856582 853287 850015 847213 844850 842400 839665 836662 833139 829316 826460 825335
55726H25335o47j902k793j751j4J73k022o195j1232j4956j5359j3254j1700j1788
55712G31895j1144p589k133K915O548Q425P633L857j602p068j1553j4090j3949
55699F92145j2217j1105j1004j0274q526p579q278r113r160r740j1526j2753j2101
55686E58769j0999j1068j1473j0855r874r677r587q398o515n010l914l013k795
55673D55591l199l078k359k833n192p239o962n427m660m513l862l256l885n198
55659C93928n764n467m856l508j152P12N58n80k82K157N398P963Q893P492M165
55644D09657P35j505l082m526m899l764k992m302o430p107o663p040q049p516
55630C42517m954k524k017k926l857m181l837k854j498j39J000J554J113K73O00
$$ plain form
55726 825335 824688 822786 819993 818242 818228 818401 816379 810184 798952 783996 768637 755383 743683 731895
55712 731895 720751 713162 711029 713944 720492 728917 736550 740407 738805 731737 720184 706094 692145
55699 692145 679928 668823 657819 647545 639019 631440 623162 614049 604889 595149 583623 570870 558769
55686 558769 547770 536702 525229 514374 504500 494823 485236 476838 470323 465313 461399 458386 455591
55673 455591 452392 449314 446955 444122 438930 431691 424729 419302 414642 410129 406267 403011 399126 393928
55659 393928 388164 382697 377841 374333 373181 373893 374451 373871 373589 375746 381144 389107 398000 405492 409657
55644 409657 410392 408887 405805 401279 396380 392616 389624 385322 378892 371785 365122 358082 350033 342517
55630 342517 337563 335039 333022 330096 326239 322058 318221 315367 313869 313730 314730 316284 317397 317670 318270
55615C18270K529M318M212K626J019k19j320j831j464j292k274l373k860q23J244
55600C18762K542L035K326L70j337j208K98J548K058K187J478o03k908l712l225
55585C21611k900k729j539L20J075M48R6P77J257N52p49k085l928o304p974q080
55569B89848p430p175p181o557n045l236j945j737k521l419l541k956k386k132
55555B32587j975j871k008k278k420k410k163j316j26K23q81k333k878k918l380
55540B03853l624k423m57K67n06r55k19L02o28k056k339j310K2R78J450J260K58
55523A93873j182k155j744L61L330N554O125N805N871O400O564O280O359P098
55509B48539P767P649O722N336L952L091K732J908j00k482l814m057m379n183
$$ plain form
55615 318270 320799 325117 329329 331955 332974 332755 331435 329604 328140 326848 324574 321201 318341 317518 318762
55600 318762 321304 324339 326665 327035 325698 324490 324788 326336 328394 330581 332059 331456 328548 324836 321611
55585 321611 318711 315982 314443 314763 315838 316286 316382 317159 318416 318968 318219 316134 312206 305902 297928 289848
55569 289848 282418 275243 268062 261505 256460 253224 251279 249542 247021 243602 240061 237105 234719 232587
55555 232587 230612 228741 226733 224455 222035 219625 217462 216146 216020 216243 215362 213029 210151 207233 203853
55540 203853 200229 197806 197349 197616 197110 196155 195936 196238 195610 193554 191215 189905 189927 190905 192355 193615 193873
55523 193873 192691 190536 188792 189153 192483 198037 204162 209967 215838 222238 228802 235082 241441 248539
55509 248539 256306 263955 270677 276013 279965 283056 285788 287696 287596 285114 281300 277243 272864 267681
55495B67681n659n453n457o441p909q680p966n758k948j123j302k769l877l940
55481A98399l516l038k385j800j969k787l078j984Q0K056L122K911J675L73j54
55466A87905k13p18j702k306k150j778j628j584j701k424l701m761n043m756m358
55451A49082m042l749l170j909l20K44r53k558k449m93J337J654J138R75J135
55436A35922P74m80k214l595l746k429n61N53O77P13J354K286K758K305R50n87
55420A34680j187n57J70l6n36j16Q35Q69rk33P05J357O13n89p49K20J326J820
55402A38583J475L75q71j421j142o31p6R18K106K383J386K17j40j72p45j519j581
55385A39145j072j027j726k177j573n63n37j583j915Q2L397N109L891J593N18
$$ plain form
55495 267681 262022 256569 251112 244671 236762 228082 220116 214358 211410 210287 208985 206216 202339 198399
55481 198399 194883 191845 189460 187660 185691 182904 179826 177842 177922 179978 183100 186011 187686 188059 187905
55466 187905 187692 186974 185272 182966 180816 179038 177410 175826 174125 171701 168000 163239 158196 153440 149082
55451 149082 145040 141291 138121 136212 135892 136136 135183 132625 130176 129683 131020 132674 133812 134787 135922
55436 135922 136696 136216 134002 130407 126661 124232 123671 124224 124901 125614 126968 129254 132012 134317 135267 134680
55420 134680 133493 132936 133106 133070 132534 132418 133253 134122 134113 133880 134585 135942 136555 135966 135217 135437 136763 138583
55402 138583 140058 140433 139562 138141 136999 136368 136292 137210 139316 141699 143085 143302 143162 142990 142245 140726 139145
55385 139145 138073 137046 135320 133143 131570 131007 130470 128887 126972 127054 130451 135560 139451 141044 141562
55370A41562L68o39k560l596k907j591p30j65L68N17K76K76N55L37l58k01J554
55353A33066L634M155K742O18q61j238r08m94r2P31J885K275J195l54q74m22j47
55336A44911l04k76k27p95j333m85J343K142J327N10O14M35q77k011j562l61k24
55319A42827j479k971l673l254j909n30j99q66j298p87J15P90J267J414Q49K8
55303A30324r4K01l10j432j487j81O87J97k82K52P04R0p30j072j759k837k340
55286A19931L56K412J316j047j133J081K699K446J431J96j651l140k400K06K011
55271A24714J540o4j295j810j471P5K245L536L217J873L86m75J24K023L257K109
55255A39984l84j777j677j673k067j292R67K527J572r79k897l056j748R7J309
$$ plain form
55370 141562 141930 141291 138731 135135 132228 130637 129907 129742 130110 130627 130903 131179 131734 132071 131713 131512 133066
55353 133066 136700 140855 143597 144215 143354 142116 141208 140714 140622 141353 143238 145513 146708 146354 145480 145058 144911
55336 144911 144607 144331 144104 143309 141976 141491 142834 144976 146303 146813 147427 147862 146985 144974 143412 143051 142827
55319 142827 141348 138377 134704 131450 129541 129011 128812 127946 126648 125861 125976 126766 128033 129447 130296 130324
55303 130324 130230 130431 130121 128689 127202 127021 127708 127905 127623 127875 128579 128669 127939 126867 125108 122271 119931
55286 119931 120287 122699 124015 122968 121835 122916 125615 128061 129492 129688 128037 124897 122497 122703 124714
55271 124714 126254 126190 124895 123085 121614 121689 123934 127470 130687 132560 132946 132471 132595 134618 137875 139984
55255 139984 139600 137823 136146 134473 132406 131114 132081 134608 136180 135201 132304 129248 127500 127597 128906
55240A28906J199L95R0M34N95K87q7n29j143j101K71J670J247k47k77J282J611
55223A34603m10k000n85K322L590K857K050J769Q52r32k159j892q72k20j96m54
55207A38323n95l28K45M33k92j464k079j756q36M21J928L151L196J843O4q61n91
55190A40802J45N39N14M10J68n90j602j867r85k7k61j369j863j060K06P67K85
55173A34212p97j705j633l67J316K362K415J618q4k392l786k697K10K229J593
55158A32494n82j840j060Q42K189J990N52r02j350p77K47J333K124K066J140M18
55142A38884P30J264O88o58j179m82K40K98L45P37P28j16j111j671k060k292j699
55125A32646k78Q47J027R74J299J484J151R21J083P31n38j348m01J411K232J856
$$ plain form
55240 128906 130105 130500 130590 131024 131619 131906 131819 131290 130147 129046 129317 130987 132234 131987 131710 132992 134603
55223 134603 134193 132193 131608 133930 137520 140377 142427 144196 145048 144116 141957 140065 139193 138973 138777 138323
55207 138323 137728 137400 137645 138078 137786 136322 134243 132487 131651 132072 134000 137151 140347 142190 142254 141393 140802
55190 140802 140947 141486 142000 142410 142578 141988 140386 138519 137534 137507 137246 135877 134014 132954 133160 133927 134212
55173 134212 133415 131710 130077 129710 131026 133388 135803 137421 137337 134945 131159 128462 128672 130901 132494
55158 132494 131912 130072 129012 129854 132043 134033 134585 133683 132333 131556 131803 133136 135260 137326 138466 138884
55142 138884 139614 140878 141566 140908 139729 139247 139487 139785 140130 140867 141595 141479 140368 138697 136637 134345 132646
55125 132646 132368 133215 134242 135216 136515 137999 139150 140071 141154 141885 141347 139999 139598 141009 143241 145097
55109A45097J538J815J953J408M41o01j506j793j147k13o6p93j447j384r54p69
55093A41579r28j128j063n46M72J815L055L607L034J509j29j181j687j846j315
55078A45248O1J305J290N04M16J082J072l2q29m66l0n95j400j249m29M8Q1J59
55060A46236M03R30K017K915J959q03k624j501P67J074o25j822j454p79m60M04
55044A46637J963K670J555k98j219o51J004K827L368J779o80j706r77m58j193
55029A54621j704n59J135J333k4j154q66M98K025K966K860J958J292J447J577
55014A67405N82j020j473j25J667K292J682Q19J69n21j185j274p91n72r57r78
54998A65720J64J437J118n58j461o08M20k4j251j576q29J6P79J804K361J316p48
$$ plain form
55109 145097 146635 148450 150403 151811 152252 151651 150145 148352 147205 146992 146926 146133 144686 143302 142348 141579
55093 141579 140651 139523 138460 137914 138386 140201 143256 146863 149897 151406 151277 150096 148409 146563 145248
55078 145248 145309 146614 147904 148408 148824 149906 150978 150946 150117 149651 149621 149026 147626 146377 145948 145996 146077 146236
55060 146236 146639 147569 149586 152501 154460 153657 151033 149532 150299 151373 150748 148926 147472 146693 146233 146637
55044 146637 148600 151270 152825 152527 151308 150657 151661 154488 157856 159635 158955 157249 156272 155814 154621
55029 154621 152917 152358 153493 154826 154802 153648 152782 153280 155305 158271 161131 163089 164381 165828 167405
55014 167405 167987 166967 165494 165369 167036 169328 171010 171829 171998 171477 170292 169018 168227 167655 166698 165720
54998 165720 165884 167321 168439 167881 166420 165812 166232 166208 164957 163381 162552 162568 163347 165151 167512 168828 168080
54981A68080j925j660j293j672k061j866j695j802j207N52K124K160J268P63M18
54966A60184q00k290j978P84L864M537K310r07k830k596q98R34J946J874R13n60
54950A64487k035l024l276k820j857q11k53l12l14M42J581K020J504R90J243J875
54934A59440K160K042J684P30j089k964l562k581j056m5L97P99J346J697J533
54919A60531J066Q81J357K181K601K218J387P49M73J46o39j636j945q58J151K520
54903A72183K074L74q12n00M78O66k72j341j566j054n59l59N9J077K151K384J759
54886A76742J161J043Q72L28J58J015K069J959P87j08k69o01j491j910j091Q9
54870A80753M74M05J017K277L005K604J689R93O21O16J322K778M286N117N315
$$ plain form
54981 168080 166155 164495 163202 161530 159469 157603 155908 154106 152899 153451 155575 157735 159003 159766 160184
54966 160184 159384 157094 155116 155900 159764 164301 166611 165704 162874 160278 159380 160314 162260 164134 165047 164487
54950 164487 162452 159428 156152 153332 151475 150664 150411 150099 149785 150227 151808 153828 155332 156322 157565 159440
54934 159440 161600 163642 165326 166056 164967 162003 158441 155860 154804 154759 155156 155955 157301 158998 160531
54919 160531 161597 162478 163835 166016 168617 170835 172222 172971 173444 173590 172951 171315 169370 168512 169663 172183
54903 172183 174257 174631 173819 173319 173797 174463 174191 172850 171284 170230 169671 169312 169371 170448 172599 174983 176742
54886 176742 177903 178946 179818 180146 180304 181319 183388 185347 186134 186026 185757 185156 183665 181755 180664 180753
54870 180753 181227 181632 182649 184926 187931 190535 192224 193217 193838 194454 195776 198554 202840 207957 213272
54855B13272N346N161M263K840K208L452N724O743N408L215K268K322J031k672
54841B60581o634p756n561k599j503k465l717l820l061k736l467m437m344k842
54827B05639q52M51O37J13l88l67J15N80P33P20O55L37r8K01J685L296L613K909
54809B19979K787L782M806N355O456Q470R480P474L175q53l276m655n524n623
54795B51833n148n081n747o120n211l406k035k150l812n894o616n094k515r17
54781A92087p44o57O1L58p04k140k329j288m45n79j111j292r78k54O53J039J88
54764A81865j417k193j242N68J686J560P25j64p43p51j48N08N06j48o98n93j00
54747A79221K00J60J64O97J919L287L626K067p71k983l267k137r01J85J820L825
$$ plain form
54855 213272 218618 223779 228042 230882 233090 236542 242266 249009 254417 257632 259900 262222 263253 260581
54841 260581 253947 246191 240630 238031 236528 234063 230346 226526 223465 220729 217262 212825 208481 205639
54827 205639 204787 205238 205875 205988 205600 205233 205348 205928 206661 207381 208036 208373 208275 208476 210161 213457 217070 219979
54809 219979 222766 226548 231354 236709 243165 251635 261115 268589 271764 270911 267635 262980 257456 251833
54795 251833 246685 241604 235857 229737 224526 221120 219085 216935 213123 207229 200613 195519 193004 192087
54781 192087 191343 190686 190747 191105 190401 188261 185932 184644 184199 183620 182509 181217 180239 179985 180638 181677 181865
54764 181865 180448 178255 177013 177581 179267 180827 181552 181388 180645 179894 179746 180254 180760 180612 179914 179321 179221
54747 179221 179421 179581 179745 180442 182361 185648 189274 191341 190570 187587 184320 182183 181282 181467 183287 187112
54731A87112M558K800l09k138j427L37P15q28k421k129k19J410J668J308J382
54716A91819J606J022k26p43L56K279L428L088K011J468J924K649K705K254K372
54701B18012L494M685M897M387M106M324M739N478O725P465O200L156M91m01n81
54686B77177j847m265o382p189o879o065n185m496l987l403k741k440k653k835
54672B16810k493j883j459j189r06p35n20M46K289L788L732K638J974K129K373
54657B26994K561L367M632N013L942K784L121M532N069L717J389n03j796l295
54643B61527n059n791m483k205j258k409m026m376l738l369l418l171k725k847
54629B12652l336l076j814n52R1N46J080J167O24R0j68p47j713j976r77J13Rq66
$$ plain form
54731 187112 191670 194470 194161 192023 190596 190933 191648 190820 188399 186270 186051 187461 189129 190437 191819
54716 191819 193425 194447 194221 193478 193834 196113 199541 202629 204640 206108 208032 210681 213386 215640 218012
54701 218012 221506 226191 231088 235475 239581 243905 248644 254122 260847 268312 274512 277668 278159 277758 277177
54686 277177 275330 271065 264683 257494 250615 244550 239365 234869 230882 227479 224738 222298 219645 216810
54672 216810 214317 212434 210975 209786 208880 208145 207625 208071 210360 214148 217880 220518 222492 224621 226994
54657 226994 229555 232922 237554 242567 246509 249293 252414 256946 262015 265732 267121 266618 264822 261527
54643 261527 256468 250677 246194 243989 242731 240322 236296 231920 228182 224813 221395 218224 215499 212652
54629 212652 209316 206240 204426 203874 203965 204511 205591 206758 207382 207472 207304 206557 204844 202868 201891 202004 202013 201147
54611B01147j326j284j262q87M26J706J178j063k842k775j877j717k296k672k493
54596A81963j863n14J547L177L131J763N98L08K61P8L32J191J626Q33l18l09R67
54579A94771K068J770K03j650k729k346o23J352K444K535K126J233l21j739j812
54564A97282q43n76j596k372j794j123j916l194k691l04J762K140J644J289Q23
54549A88531j04r21j165j192j077j0K136L724L119J016l09K57J645K262J707O96
54533B00315n4m71q21r66l00J287K655K450Q23p33j347j468j348l34J510K458
54517B03656J185j119k152j511p13o35o08j81n6p46j578j734j329q12j18Q10J425
54500A93784J292R65J317K288K951K758K099J609J331P77l25j513j912j182QP25
$$ plain form
54611 201147 199821 198537 197275 196388 196814 198520 199698 198635 195793 193018 191141 189424 187128 184456 181963
54596 181963 180100 179586 181133 184310 187441 189204 189802 190110 190371 190449 190781 191972 193598 194431 194113 193804 194771
54579 194771 196839 198609 198812 197162 194433 192087 191464 192816 195260 197795 199921 201154 200833 199094 197282
54564 197282 196439 195863 194267 191895 190101 188978 187062 183868 181177 180873 182635 184775 186419 187708 188531
54549 188531 188427 187506 186341 185149 184072 184062 186198 189922 193041 194057 193748 194005 195650 197912 199619 200315
54533 200315 200261 199790 198969 198003 197703 198990 201645 204095 204918 204185 202838 201370 200022 199688 201198 203656
54517 203656 204841 203722 201570 200059 199346 198711 198103 197922 197866 197120 195542 193808 192479 191667 191549 192359 193784
54500 193784 195076 196041 197358 199646 202597 205355 207454 209063 210394 211171 210846 209333 207421 206239 206247 206972
54484B06972R43J413K361K961K522J652J484K001J989P87o54r67j57M96J60n93
54468B23370q26n56m55o10l82L56O62l24k011k858k199j027p15j337j674r33J01
54451B08582Q8r11j311j40J548K178J879J959K517K176M82j054j135m98n12j035
54435B14813j103p78p50q01k92K21l16j315j019P23K111K184K045K443K171K15
54419B20552k053k639j725r47n97M45K221L071J932j72j439j235k15O52Q35M77
54403B19163K36M62O26N8q06p93K81J168Q77K8j34N43J159J200J127J297J090
54386B27582k74k240k970j341J587L689M142L847L536K690Q17j281k488k810k786
54371B31700k220q82J61l21j419q07J830L950L484J442J6l92q32j483j444m92
$$ plain form
54484 206972 207915 209328 211689 214650 217172 218824 220308 222309 224298 225085 224431 223464 223307 223803 223963 223370
54468 223370 222544 221988 221533 220923 220541 220897 221559 221235 219224 216366 214167 213140 212425 211088 209414 208481 208582
54451 208582 208670 207759 206448 206308 207856 210034 211913 213872 216389 218565 219047 217993 216858 216360 215848 214813
54435 214813 213710 212932 212182 211381 211089 211310 210994 209679 208660 209383 211494 213678 215723 218166 220337 220552
54419 220552 218499 215860 214135 213188 212591 213036 215257 218328 220260 220088 218649 217414 217199 217851 218686 219163
54403 219163 219399 219861 220487 220545 219739 218946 219227 220395 221272 221300 221166 221709 222868 224068 225195 226492 227582
54386 227582 227308 225068 222098 220757 222344 226033 230175 234022 237558 240248 241065 239784 237296 234486 231700
54371 231700 229480 228598 228759 228438 227019 226212 228042 231992 235476 236918 236934 236542 235710 234227 232783 232291
54355B32291N02R41J089J221J079L77p90k033k715k228q49J33Nj14J294L726N025
54338B38954M230K679J940J918J756J462J659K260K458J893J188J266K358L607
54324B69628L659J926o30k302k281j158J3N16l8j572l144l534k526j022K81J461
54308B59277K442K698K325K257K755K823K001J436J955K293R97q18p23J363K905
54293B85986K328Q25o8p03j941l112k986j991j895l343m964n109l639j740m74
54278B57174Kj5n48j880l656m637l904k067n75M0L48N99K52o78r55L09K108K569
54260B44486J186p41j690j332m56j13p40j679j669j54K000L395L404K273M22j662
54244B46930l135l231k150j011p07j120j454j053J21J424J966J374K04o49q77
$$ plain form
54355 232291 232793 233734 234823 236044 237123 237500 236710 234677 231962 229734 228885 229018 229023 228909 230203 233929 238954
54338 238954 243184 245863 247803 249721 251477 252939 254598 256858 259316 261209 262397 263663 266021 269628
54324 269628 273287 275213 274583 272281 270000 268842 268855 269371 269333 267761 264617 261083 258557 257535 257816 259277
54308 259277 261719 264417 266742 268999 271754 274577 276578 278014 279969 282262 283259 282441 281718 283081 285986
54293 285986 288314 289139 289071 288368 286427 283315 280329 278338 276443 273100 268136 263027 259388 257648 257174
54278 257174 257176 257161 256613 254733 251077 246440 242536 240469 239894 239934 240282 240881 241133 240455 239500 239809 241917 244486
54260 244486 245672 244931 243241 241909 241453 241340 240600 238921 237252 237098 239098 242493 245897 248170 248592 246930
54244 246930 243795 240564 238414 237403 236696 235576 234122 233069 233190 234614 236580 237954 238158 237509 236632
54229B36632q58r64j117r94l72P20J917K653K583J925J189O89L95M5p07j924k884
54212B38928k493o16J388K224K250K625L109K106p85l434l416r43J441J882R27
54197B45193K00L84J031J775K714L652L793K712J154K74J89k5q53j491j025Q6
54181B59763M10o77k187k662j704j71Q70J019M86m52j570k397k338j428o11o72
54165B45679j097q01K8p8j567k650j427J390L205K794J580J368J994J954O95p32
54149B52335j204r78j118j742j655j13J648J572m45k149j756q4R10P64M21L19
54133B46725R8j17K46Q97R76P68J471K862K969R11j484k110j289p29q72r45p98
54116B49579r59j137m55P86J229O62N81J824K961K213K14n06J291L941M822L179
$$ plain form
54229 236632 235774 234810 233693 232699 232327 233047 234964 237617 240200 242125 243314 244003 244398 244443 243736 241812 238928
54212 238928 236435 235819 237207 239431 241681 244306 247415 249521 248736 245302 241886 240943 242384 244266 245193
54197 245193 245393 245777 246808 248583 251297 254949 258742 261454 262608 262882 263071 263046 262193 260702 259677 259763
54181 259763 260173 259496 257309 254647 252943 252772 253642 254661 255147 254695 253125 250728 248390 246962 246351 245679
54165 245679 244582 243781 243809 243731 242164 239514 238087 239477 242682 245476 247056 248424 250418 252372 253067 252335
54149 252335 251131 250153 249035 247293 245638 245525 247173 248745 248300 246151 244395 244311 245221 245985 246406 246725
54133 246725 246823 246706 246952 247849 248825 249593 251064 253926 256895 257806 256322 254212 252923 252194 251322 250377 249579
54116 249579 248620 247483 247028 247814 249043 249705 250286 252110 255071 257284 257498 256992 258283 262224 267046 270225
54100B70225M26j959l857n618o671n999l801j560l10K75P28P75J81l47q8M56L22
54083B43178l47n84j69J98J87J61J69j40m45J94J724K720K223J063N50N93O1j435
54065B49901k960l217j694Q64K717K456N88o95N6J821K590J893R53O98Q78J097
54049B57946J485K086K516K619K699K651J741j81j946k286j416o53p94j451j845
54034B63171j547n57P74J746J783J074M92P05J612K693L695M774O050P095P075
54019C00635N638L693K803L461M408M022K019p03l253m990n083l269r76l59j664
54004C06382k786k045k94O05K92k78o56j120j503j240m91O5M70J298K300K587
53988C03586K318K705L990M877M648M390N148O081N803M679M348N392O700P020
$$ plain form
54100 270225 270651 268692 264835 259217 252546 246547 242746 241186 240876 241151 241879 242654 242835 242488 242400 242856 243178
54083 243178 242831 242247 242078 242276 242463 242624 242793 242653 242208 242402 244126 246846 249069 250132 250682 251275 251336 249901
54065 249901 246941 243724 242030 242894 245611 248067 248655 247960 248016 249837 252427 254320 255273 255971 256849 257946
54049 257946 259431 261517 264033 266652 269351 272002 273743 273562 271616 269330 267914 267261 266467 265016 263171
54034 263171 261624 261067 261841 263587 265370 266444 266936 267641 269253 271946 275641 280415 286465 293560 300635
54019 300635 306273 309966 312769 316230 320638 324660 326679 325976 322723 317733 312650 309381 308405 308046 306382
54004 306382 303596 301551 301257 301862 302154 301876 301220 300100 298597 297357 296866 296931 297401 298699 300999 303586
53988 303586 305904 308609 312599 317476 322124 326514 331662 337743 343546 348225 352573 357965 364665 371685
53974C71685O211N084M734N827P780Q926Q270O699N671N199M265K888K363L253
53960D48855M411M401L059J183n73k083l428m549n090m778m247m841o828q427
53946D17065p865n986n266o294p012n805l648k414k611l660m995n772m823k284
53932C48630k63m55j979k820k526j993j447n05L59K50m28m38J15q0j217k039k062
53915C31102k293l107l281j999k11J000J929K977L297K240R89J122K221K579J860
53900C40425J356J736K114J657Q74Q42J956L745N311N812N122M182M090M951O090
53885C90263P237Q599R906J0449J0292J0421J1223J1691J0738Q592O195L835J338
53872E00779q23j621r71k86j026k952m367m055k462q30L84J579K838L601L731
$$ plain form
53974 371685 377896 382980 387714 393541 401321 410247 418517 425216 430887 436086 440351 443239 445602 448855
53960 448855 453266 457667 460726 461909 461336 459253 455825 451276 446186 441408 437161 432320 425492 417065
53946 417065 409200 403214 397948 391654 384642 378837 375189 372775 370164 366504 361509 355737 350914 348630
53932 348630 348367 347912 345933 343113 340587 338594 337147 336642 337001 337251 336823 336385 336500 336420 335203 333164 331102
53915 331102 328809 325702 322421 320422 320211 321211 323140 326117 329414 331654 332643 333765 335986 338565 340425
53900 340425 341781 343517 345631 347288 348162 349004 350960 354705 360016 365828 370950 375132 379222 384173 390263
53885 390263 397500 406099 416005 426454 436746 447167 458390 470081 480819 489411 495606 499441 500779
53872 500779 499956 498335 497364 497078 496052 493100 488733 484678 482216 481386 481770 483349 486187 489788 493519
53857D93519M043N250O989Q521R681J0397R955P873N162L428K832K147Q32k88
53843E70341p11j174k317l491l728l068k155j350r62j614l583o179q393r695r880
53828E12041q963p781p618q460q595p005n154n010o153o467n220l765l263l477
53814D25110l924m629n324n238m402m000m717n627n423m182l164l187l759l730
53800C63804k740j890k477l855l641r78J551R62j942l640k907k089k900l755k804
53785C30699j294j684l837n270m482k124N37K573L250K483J312O30k4j280k250
53770C19239j589L21J963K929L734L923K548M73k16O16R07o9l54J378L524M088
53754C43415L607L623L893L308K401K542L326L175K223K231L513M298L830L786
$$ plain form
53857 493519 497562 502812 509801 518322 528003 538400 548355 556228 561390 564818 567650 569797 570629 570341
53843 570341 569630 568456 566139 562648 558920 555852 553697 552347 551385 549771 546188 540009 531616 521921 512041
53828 512041 503078 495297 487679 479219 470624 463619 458465 453455 447302 440835 435615 431850 428587 425110
53814 425110 421186 416557 411233 405995 401593 397593 392876 387249 381826 377644 374480 371293 367534 363804
53800 363804 361064 359174 356697 352842 349201 348223 349774 350736 348794 345154 342247 340158 337258 333503 330699
53785 330699 329405 327721 323884 318614 314132 312008 312545 315118 318368 320851 322163 322793 322769 321489 319239
53770 319239 317650 317971 319934 322863 326597 330520 333068 333541 333325 333941 334848 334779 334425 335803 339327 343415
53754 343415 347022 350645 354538 357846 360247 362789 366115 369290 371513 373744 377257 381555 385385 389171
53740C89171N392O974O195L661K334L648N889O657N638M307L766L712L323K433
53726D53100J694J772K560L211K904J604j9j292k046k517l015l803n037o445p153
53711D35518o263l943j752j489l521o493q586q960p951o266m407k742j722j601
53697C69822k083k487k419k104j900j790j585j451j594j494k40K007L578L105
53683C59365J302J08K33N88J67n40n00M10J500K299K719K608J812N99m53r02m81
53666C70834Q91K650L507K593N77r63j244p39j1J047K649M453N868O607O635O023
53650D11377N112M406L986L410K456J594J359J689K288L147M129M492L698K466
53636D55609K131K861L426K992K349K833M582O478P370O861N223L187J603P02
$$ plain form
53740 389171 394563 401537 407732 411393 413727 417375 423264 429921 435559 439866 443632 447344 450667 453100
53726 453100 454794 456566 459126 462337 465241 466845 466826 465534 463488 460971 457956 454153 449116 442671 435518
53711 435518 429255 425312 423560 422071 418550 412057 403471 394511 386560 380294 375887 373145 371423 369822
53697 369822 367739 365252 362833 360729 358829 357039 355454 354003 352409 350915 350675 352682 356260 359365
53683 359365 360667 360775 361008 361596 361763 361223 360723 361133 362633 364932 367651 370259 372071 372670 372217 371315 370834
53666 370834 371725 374375 377882 380475 381052 380089 378845 378106 378095 379142 381791 386244 392112 398719 405354 411377
53650 411377 416489 420895 424881 428291 430747 432341 433700 435389 437677 440824 444953 449445 453143 455609
53636 455609 457740 460601 464027 467019 469368 472201 476783 483261 490631 497492 502715 505902 507505 508207
53622E08207j44j482k759k999k364k181l096l989l337j214P00J020O1p52n35J91
53606D85327K95n35j402j418q90q39j518k096j927j339q89n02J48R44J569K026
53590D76954K338K139J292N60Q45J845K322J748R84J073J962K765K868K495K401
53575E04591L100M222M791M457M234N266P009P508N828L406K500L792O137Q099
53561E74940R042Q960Q073O877O071N958O010N338L790K437K606M323O186P027
53547F57638P180P494P640O495M036J696N71L76N45J165K071K166Q13q74j318
53532F97694n76J08L57P03Q52l16k560l860l130j951k316l689l933k624j581j913
53516F71265k370j429K61Q48j0q13n35J14R5l51l37Q3J4o71q17N11K576L670L120
$$ plain form
53622 508207 508063 506581 503822 500823 498459 496278 493182 489193 485856 484642 485342 486362 486423 485671 485136 485327
53606 485327 485622 485087 483685 482267 481377 480538 479020 476924 474997 473658 472769 472267 472415 473359 474928 476954
53590 476954 479292 481431 482723 483283 484128 485973 488295 490043 491027 492100 494062 496827 499695 502190 504591
53575 504591 507691 511913 516704 521161 525395 530661 537670 545178 551006 554412 556912 560704 566841 574940
53561 574940 583982 592942 601015 607892 613963 619921 625931 631269 635059 637496 640102 644425 650611 657638
53547 657638 664818 672312 679952 686447 690483 692179 692750 693126 693671 694836 696907 699073 699886 699012 697694
53532 697694 697118 697226 697583 698286 699138 698822 696262 692402 689272 687321 685005 681316 677383 674759 673178 671265
53516 671265 668895 667466 667727 668575 668565 667752 667217 667331 667426 667075 666738 666821 666835 666164 665347 665858 668434 672104 675224
53497F75224K032J928L026M221M591M279L825L263K537K355L662O077P869P957
53483G32846P254P331Q428R567J0194J0655J1175J1483J1581J2062J3235J4594
53471H60405J5449J5693J5783J6356J7888K0215K2410K3697K4427K5417K6445
53460A084185K6509K5792K5981K7998L0487L1689L1914L2942L5328L7735L8950
53449A429510L9392M0127M1215M1716M1120M0163L9879M0127L9574L7502L5103
53438A865428L4149L4609L4647L3165L1180L0130K9931K9593K8873K8301K8034
53427B208040K7689K6992K5816K4013K1947K0642K0449K0170J8626J6511J5320
53416B446215J4710J2674Q458L750M08j738m083p247j0735j3974j6870j9556k2012
$$ plain form
53497 675224 677256 679184 682210 686431 691022 695301 699126 702389 704926 707281 710943 717020 724889 732846
53483 732846 740100 747431 755859 765426 775620 786275 797450 808933 820514 832576 845811 860405
53471 860405 875854 891547 907330 923686 941574 961789 984199 1007896 1032323 1057740 1084185
53460 1084185 1110694 1136486 1162467 1190465 1220952 1252641 1284555 1317497 1352825 1390560 1429510
53449 1429510 1468902 1509029 1550244 1591960 1633080 1673243 1713122 1753249 1792823 1830325 1865428
53438 1865428 1899577 1934186 1968833 2001998 2033178 2063308 2093239 2122832 2151705 2180006 2208040
53427 2208040 2235729 2262721 2288537 2312550 2334497 2355139 2375588 2395758 2414384 2430895 2446215
53416 2446215 2460925 2473599 2482057 2485807 2486215 2484477 2480394 2473147 2462412 2448438 2431568 2412012 2390000
53403B390000k3818k4331k3425k2038k1406k1916k3290k5545k8711l1642l2531
53392B111347l1065k9043k8209k8317k7932k6271k3652k0902j8917j8124j7645
53381A841270j5772j1963p750m919l523k383q41J064L508O642R719J1665J2474
53368A839191J3158J4438J6377J9117K2766K6580K9440L1328L3146L4952L5815
53357B116308L5943L7369M1249M5663M7770M7640M8233N1537N6287N9972O1861
53346B649832O3192O5260O8218P1290P3425P4066P3935P4767P7599Q1478Q4450
53335C457512Q5538Q5188Q4209Q3215Q2806Q3090Q2870Q0559P6286P1916O8501
53324D341690O4866N9709N3878M9131M5257M0092L2443K3644J5794R384L319l335
$$ plain form
53403 2390000 2366182 2341851 2318426 2296388 2274982 2253066 2229776 2204231 2175520 2143878 2111347
53392 2111347 2080282 2051239 2023030 1994713 1966781 1940510 1916858 1895956 1877039 1858915 1841270
53381 1841270 1825498 1813535 1805785 1800866 1797343 1794960 1794119 1795183 1798691 1805333 1815052 1826717 1839191
53368 1839191 1852349 1866787 1883164 1902281 1925047 1951627 1981067 2012395 2045541 2080493 2116308
53357 2116308 2152251 2189620 2230869 2276532 2324302 2371942 2420175 2471712 2527999 2587971 2649832
53346 2649832 2713024 2778284 2846502 2917792 2991217 3065283 3139218 3213985 3291584 3373062 3457512
53335 3457512 3543050 3628238 3712447 3795662 3878468 3961558 4044428 4124987 4201273 4273189 4341690
53324 4341690 4406556 4466265 4520143 4569274 4614531 4654623 4687066 4710710 4726504 4735888 4739207 4735872
53312D735872j0271j6653k2586k9434l8260m8132n6892o3748o9979p6402q1540
53301D221975q3581q3148q2434q2289q1977q1369q1122q0647p8224p3863p0017
53290C343304o8407o7906o6679o4753o3075o1469n9304n7146n5898n4899n2599
53279B671169m8901m5247m2429l9757l6488l2929k9823k7512k5873k4503k2933
53268B294774k1211k0051j9769j9561j8599j7402j7012j7225j6864j5651j4407
53257B097022j3314j1410q189m427r36K305N086O381N960N618P397J0998J4234
53244B116725J5960J7138J8867K0758K2060K3321K5749K9272L2490L4498L5800
53233B392638L7074L8065L8237L7683L6625L4689L1673K8442K5893K3364J9385
$$ plain form
53312 4735872 4725601 4708948 4686362 4656928 4618668 4570536 4513644 4449896 4379917 4303515 4221975
53301 4221975 4138394 4055246 3972812 3890523 3808546 3727177 3646055 3565408 3487184 3413321 3343304
53290 3343304 3274897 3206991 3140312 3075559 3012484 2951015 2891711 2834565 2778667 2723768 2671169
53279 2671169 2622268 2577021 2534592 2494835 2458347 2425418 2395595 2368083 2342210 2317707 2294774
53268 2294774 2273563 2253512 2233743 2214182 2195583 2178181 2161169 2143944 2127080 2111429 2097022
53257 2097022 2083708 2072298 2064109 2059682 2058746 2061051 2066137 2072518 2078478 2084096 2091493 2102491 2116725
53244 2116725 2132685 2149823 2168690 2189448 2211508 2234829 2260578 2289850 2322340 2356838 2392638
53233 2392638 2429712 2467777 2506014 2543697 2580322 2615011 2646684 2675126 2701019 2724383 2743768
53222B743768J4003Q965N358K381j108n136r331j3759j8262k1989k4670k7366
53210B652854l0893l4371l6523l7659l9011m0739m2013m2709m3571m4757m5600
53199B215008m5905m6295m7096m7765m7661m6681m5097m3471m2496m2250m1836
53188A718455m0638l9469l9441m0129m0048l8827l7383l6113l4417l2190l0231
53177A309569k8750k6905k4456k2490k1712k1262k0147j8853j8446j8769j8597
53166A069182j7388j6041j5951j7595j9950k1314k1051k0335k0493k1012k0305
53155H57747j8277j6586j6087j5694j4519j3569j4084j5341j5571j4392j3069
53144F90558j2706j3149j3487j2936j1503j0205j0119j0848j0720r053p202o640
$$ plain form
53222 2743768 2757771 2766736 2772094 2774475 2773367 2768231 2758900 2745141 2726879 2704890 2680220 2652854
53210 2652854 2621961 2587590 2551067 2513408 2474397 2433658 2391645 2348936 2305365 2260608 2215008
53199 2215008 2169103 2122808 2075712 2027947 1980286 1933605 1888508 1845037 1802541 1760291 1718455
53188 1718455 1677817 1638348 1598907 1558778 1518730 1479903 1442520 1406407 1371990 1339800 1309569
53177 1309569 1280819 1253914 1229458 1206968 1185256 1163994 1143847 1124994 1106548 1087779 1069182
53166 1069182 1051794 1035753 1019802 1002207 982257 960943 939892 919557 899064 878052 857747
53155 857747 839470 822884 806797 791103 776584 763015 748931 733590 718019 703627 690558
53144 690558 677852 664703 651216 638280 626777 616572 606453 595605 584885 575832 568630 561990
53132E61990p067p399p524p723p354n744l888l518m631n480n027l973l287l039
53118D86336l012l282l874m607n366n726m686j994N18N15j739l541l343k403k206
53103D41590k085q52P63J108J91o00r05j665k964l408k232o03o3o11j239j588
53087D24837k028k443k078p41N86P89j46j186j368o75J13K53k39o40l39L90O49
53070D15734L2p88q62o2P76Q80L43j39j45K7j65o04m46P79K163K351J466J182
53052D22522K312L389K626M99j030j338j495j923j671n64j36j314k705k629j585
53037D14958j114j175n91L90J96j295k002n27J676K060J23k235l101k439j648
53022D03276j778k470k518j349K99J200Q33l96j750k588k629k225k075k258j990
$$ plain form
53132 561990 554923 547524 540000 532277 524923 519179 515291 511773 507142 501662 496635 492662 489375 486336
53118 486336 483324 480042 476168 471561 466195 460469 455783 453789 454307 454822 453083 449542 446199 443796 441590
53103 441590 439505 438653 439416 440524 440715 440115 439210 437545 434581 431173 428941 428338 428275 427664 426425 424837
53087 424837 422809 420366 418288 417547 418133 418922 418776 417590 416222 415547 415660 415913 415674 415034 414695 415085 415734
53070 415734 415766 414978 414116 414054 414830 415710 416053 415914 415769 415796 415631 415027 414581 415360 417523 419874 421340 422522
53052 422522 424834 428223 430849 431348 430318 428980 427485 425562 423891 423327 423191 421877 419172 416543 414958
53037 414958 413844 412669 412078 412468 412664 411369 409367 408840 410516 412576 412699 410464 407363 404924 403276
53022 403276 401498 399028 396510 395161 395460 396660 397493 397097 395347 392759 390130 387905 385830 383572 381582
53007C81582q10M86Q62M90L18N66O54L44p6n83j379k064j858p33O39J992L470
52990C83900M651M789M058L388K873J756J25q50q22q54j467j669q30k0k98r88
52974C97742r75n39n00m93K58J222J175j2j533l008m174m012j988K96O92m36o98
52957C83017P55K293K715K878L572L830K652Q61j72m44o80q06m57j05k78k93Q17
52940D00155K517L292K617J269n7j177j704j259l78Kn7J81M23m70k276k952j237
52923C98889J478K947K766K169J896J601J115R43J297J672J718J773K162K504
52909D24930K185J223K82nL61P18K88r67j987j508M61K284K284N37j211j450m01
52892D28024M89K33q84k012k670k741k038n00J235K105J688O09l60j148k102l230
$$ plain form
53007 381582 380772 381258 382120 382610 382928 383494 384148 384492 384416 383833 382454 380390 378532 377799 378438 380430 383900
52990 383900 388551 393340 397398 400786 403659 405415 405540 404690 403868 403014 401547 399878 399048 399028 398730 397742
52974 397742 396767 396228 395728 395235 395493 396715 397890 397878 396345 393337 389163 385151 383163 383459 384151 383715 383017
52957 383017 383772 386065 388780 391658 395230 399060 401712 402573 402401 401957 401277 400471 400014 399909 399631 399338 400155
52940 400155 402672 405964 408581 409850 409793 408616 406912 405653 405275 405277 405220 405401 405824 405354 403078 400126 398889
52923 398889 400367 403314 406080 408249 410145 411746 412861 413804 415101 416773 418491 420264 422426 424930
52909 424930 427115 428338 428620 428615 428976 429694 429982 429015 427028 425520 425981 428265 430549 431086 429875 428425 428024
52892 428024 428513 428746 427862 425850 423180 420439 418401 417901 419136 421241 422929 423538 423178 422030 419928 416698
52876D16698m126m462m116l040j419J86J206J487J144L46l88j88J049J933R72
52861D07282j277k471j281R56J901Q91o67j136l36M92Lj717k946k077L16J959
52845C99892J578K05o86j104j592j565k18J444J503L6p02M15J668J079o91j476
52829C99786p45j0m16j437k063j992j331r4J372K255K174J678J343R15M9o15q0
52812D00789J380K173J329k80j117p73K6O80J251J798K062J907J586J405J496
52797D15712J907K405K342J347J25k96k27j131l368n274n330m278l869m247m082
52782C91736k980k140k330k644j949n75K42P7l30k68O2j13j039j933j802q01k04
52765C73009o11q56M19K558L429K080k61j906k279j650n41K21O6k95M04J793J797
$$ plain form
52876 416698 412572 408110 403994 400954 399535 399721 400927 402414 403558 403904 403516 403328 404377 406310 407282
52861 407282 406005 403534 402253 403209 405110 406001 405334 404198 403862 404354 404357 402640 399694 397617 397933 399892
52845 399892 401470 401675 400989 399885 398293 396728 396510 397954 399457 399493 398791 399206 400874 401953 401262 399786
52829 399786 399041 399031 398615 397178 395115 393123 391792 391698 393070 395325 397499 399177 400520 401435 401484 400869 400789
52812 400789 402169 404342 405671 405391 404274 403501 403527 404207 405458 407256 409318 411225 412811 414216 415712
52797 415712 417619 420024 422366 423713 423838 423542 423315 422184 418816 413542 408212 403934 400065 395818 391736
52782 391736 388756 386616 384286 381642 379693 379118 379360 379437 379107 378839 378901 378788 377749 375816 374014 373213 373009
52765 373009 372398 371542 371961 374519 377948 380028 379767 377861 375582 373932 373391 373612 373678 373383 373787 375580 377377
52748C77377l21k387j975M94K741L721L940L538K017j21j326r39Q1O31M82l23
52732C87630j690k791k453q14M89L16o91j370j497j385j033n20m04q17q50K05
52716C72325J571J841P69p48j985k738k650j470Q8P45K28m73o37o96j138j371
52700C63661m77J275K501K283J169M04N08Q91P89L11K13O64Q18nj080r81N51K227
52682C75722K897K870L138L911M612M857M699M113L053J924J316J130O74k97j242
52667D13377j675j598r69M66K261L048K048K39p79o79l90n91j192k031k918l090
52651D05527j777M11J780J508L30j034k766m602n007l086l70P53Rp80m32L88P83
52634C91635R38J256J324O23l49m34R18L103M784M741K800K60j044m68R11J651
$$ plain form
52748 377377 377056 374669 372694 373188 375929 379650 383590 387128 389145 389024 387698 386759 386840 387471 387953 387630
52732 387630 385940 383149 380696 379882 380371 380687 379996 378626 377129 375744 374711 374191 373787 372970 372120 372325
52716 372325 373896 375737 376506 375758 373773 371035 368385 366915 367003 367748 367976 367503 366866 366170 365032 363661
52700 363661 363184 364459 366960 369243 370412 370816 371324 372215 373004 373315 373528 374192 375010 375005 373925 372944 373495 375722
52682 375722 378619 381489 384627 388538 393150 398007 402706 406819 409872 411796 413112 414242 414916 414619 413377
52667 413377 411702 410104 409135 409601 411862 414910 416958 417197 416418 415739 415349 414758 413566 411535 408617 405527
52651 405527 403750 404161 405941 407449 407779 406745 403979 399377 394370 391284 390914 391667 391676 390896 390464 390852 391635
52634 391635 392573 393829 395153 395776 395427 394993 395911 399014 403798 408539 411339 411599 410555 410087 410998 412649
52618D12649J319L90o69j629k285k461k171j478m13O84J174P91N3k98r4L27O03
52601D06492M78j70j034j327m97J163K901M154M516L677K046J074J972M097N393
52586D34935M655K652R47K69L16M72K65l88r94q31Q6P96N06l56p41l33K02K87
52568D42745K11O93J891L086L421K917K543K873L024J715o07j878j272p43k399
52553D58220n264o507n578m874n768o213l838K07K622K321J234R55P92k30j341
52538D26738j207j8Q34O58P2q2L31P39M72n04j299r94R7P30M17j6N1O7l85l91
52518D26310R28K575K620P38j451k514k412j679o50J90L21K7J96Q89J113M04m20
52501D27185o37p16j219j511o75P85J249p5k284l778l681k401j247j242j947j838
$$ plain form
52618 412649 413968 414358 413689 412060 409775 407314 405143 403665 403252 403936 405110 405901 405954 405656 405562 405889 406492
52601 406492 406970 406800 405766 404439 403942 405105 408006 412160 416676 420353 422399 423473 425445 429542 434935
52586 434935 439590 442242 443189 443458 443774 444246 444511 444123 443129 442298 442384 443180 443686 443330 442589 442256 442458 442745
52568 442745 442956 443649 445540 448626 452047 454964 457507 460380 463404 465119 464512 462634 461362 460619 458220
52553 458220 452956 446449 440871 435997 430229 424016 420178 420385 423007 425328 426562 427517 428309 428079 426738
52538 426738 425531 425513 426347 427005 427077 426995 427326 428065 428537 428033 426734 425740 425837 426567 426984 426968 427019 427086 426701 426310
52518 426310 427238 429813 432433 433171 431720 429206 426794 425115 424465 424655 424976 425003 425199 426088 427201 427605 427185
52501 427185 426548 425832 424613 423102 422427 423212 424461 424386 422102 418324 414643 412242 410995 409753 407806 405968
52485D05968k65J600K308K027J902K013J291m55j718j128P87K327K615K170J755
52470D23197J479J128P92P91J123J395J332J060P31K12n05q25j18J232K040J763
52454D36827J107Q54Q13N01K26O20J518K192K560L203M129M428L523K074J202
52439D65777J155J121K19j527l137l602k960k277k393k954l129k896k976l542
52425D36879l727k652n24J510K339J764P41N31J269J665P68m37j50J698L287L392
52409D48353K746K413K081R59m95r49P3J745L018L432K983J993J025M82K45k9
52393D70075l92p00q83q58n56l49r89k555l947m060l130k242j823j408p07j54
52377D45322l83j591l354m523l784j011K077L397K552Q20n34r80j52K067M627
$$ plain form
52485 405968 405703 407303 409611 411638 413540 415553 416844 416389 414671 413543 414330 416657 419272 421442 423197
52470 423197 424676 425804 426596 427387 428510 429905 431237 432297 433028 433240 432735 431910 431792 433024 435064 436827
52454 436827 437934 438788 439601 440102 440328 440948 442466 444658 447218 450421 454550 458978 462501 464575 465777
52439 465777 466932 468053 468272 466745 463608 460006 457046 454769 452376 449422 446293 443397 440421 436879
52425 436879 433152 430500 429976 431486 433825 435589 436330 436861 438130 439795 440563 440126 439976 441674 444961 448353
52409 448353 451099 453512 455593 456552 456057 455108 455181 456926 459944 463376 466359 468352 469377 469859 470104 470075
52393 470075 469683 468983 468100 467242 466686 466337 465348 462793 458846 454786 451656 449414 447591 446183 445476 445322
52377 445322 444939 443348 439994 435471 431687 430676 432753 436150 438702 439522 438988 438008 437856 439923 444550
52362D44550N678M502K293O17j62n04n84k23N53J482K364L057L587M441O139Q317
52346D86107R809J0036R710R749J0077R924Q641N903J752k892o448q068q262p766
52332E28272o580m800l331k720k124p70K98l82j939j838N84L053L490K553K069
52317E15835K274K048J152Q03K073M572O810P467O581N698O394Q294R238Q010
52303E87249O069N661O785P373O223M396L398L280L163K720K369K406K766L373
52289F47231M188M992N574N992O347O511O419O427O930P875R111J0976J3767J6728
52275G59068J8424J8414J7788J7690J8075J8477J9267K1202K4123K7072K9476
$$ plain form
52362 444550 450228 454730 457023 457640 457478 456974 456390 456167 456720 458202 460566 463623 467210 471651 477790 486107
52346 486107 495916 505952 515662 525411 535488 545412 554053 559956 561708 558816 552368 544300 536038 528272
52332 528272 521692 516892 513561 510841 508717 507947 508245 507863 505924 504086 504670 507723 511213 513766 515835
52317 515835 518109 520157 521309 522112 524185 528757 535567 543034 549615 555313 561707 570001 579239 587249
52303 587249 593318 598979 605764 613137 619360 623756 627154 630434 633597 636317 638686 641092 643858 647231
52289 647231 651419 656411 661985 667977 674324 680835 687254 693681 700611 708486 717597 728573 742340 759068
52275 759068 777492 795906 813694 831384 849459 867936 887203 908405 932528 959600 989076
$$ [...]
##END NTUPLES=NMR SPECTRUM
##END=
