
##TITLE=AC1222_Punto_6074794_1Xs9jaGfa0
##JCAMPDX= 6.0         $$ Bruker NMR JCAMP-DX V2.0
##DATA TYPE= NMR SPECTRUM
##DATA CLASS= NTUPLES
##ORIGIN= BRUKER
##OWNER= Administrator
$$ 1.72 TOPSPIN		Version 2.1
$$ 2012-05-09 00:29:48.062 -0500  Administrator@TOPSPIN
$$ Compression mode = diff/dup
##.OBSERVE FREQUENCY= 400.13188235
##.OBSERVE NUCLEUS= ^1H
##.ACQUISITION MODE= SIMULTANEOUS (DQD)
##.ACQUISITION SCHEME= undefined
##.AVERAGES= 8
##.DIGITISER RES= 22
##SPECTROMETER/DATA SYSTEM= spect
##.PULSE SEQUENCE= zg30
##.SOLVENT NAME= COFFEE_meoh
##.SHIFT REFERENCE= INTERNAL, COFFEE_meoh, 1, 14.98061
##AUDIT TRAIL= $$ (NUMBER, WHEN, WHO, WHERE, PROCESS, VERSION, WHAT)
$$ ##TITLE= Audit trail, TOPSPIN		Version 2.1
$$ ##JCAMPDX= 5.01
$$ ##ORIGIN= Bruker BioSpin GmbH
$$ ##OWNER= Administrator
$$ $$ C:\Bruker\TOPSPIN/data/COFFEE/nmr/AC1222_Punto_6074794_1Xs9jaGfa0/80/pdata/1/auditp.txt
$$ ##AUDIT TRAIL=  $$ (NUMBER, WHEN, WHO, WHERE, PROCESS, VERSION, WHAT)
(   1,<2012-05-09 00:29:41.390 -0500>,<Administrator>,<TOPSPIN>,<go>,<TOPSPIN 2.1>,
      <created by zg
	started at 2012-05-09 00:28:34.796 -0500,
	POWCHK enabled, PULCHK disabled,
       configuration hash MD5:
       AF F2 23 6B 01 CD 40 DD E5 A1 38 A0 06 EA F7 77
       data hash MD5: 64K
       D0 A4 96 97 71 51 C1 87 11 FF CE 6E 69 9D 4F 1B>)
(   2,<2012-05-09 00:29:43.968 -0500>,<Administrator>,<TOPSPIN>,<proc1d>,<TOPSPIN 2.1>,
      <Start of raw data processing
       efp LB = 0 FT_mod = 6 PKNL = 1 PHC0 = 0 PHC1 = 0 SI = 32K 
       data hash MD5: 32K
       4F C1 6C B1 4B CE 06 3D D1 E6 21 67 CC 97 DC BF>)
(   3,<2012-05-09 00:29:44.281 -0500>,<Administrator>,<TOPSPIN>,<proc1d>,<TOPSPIN 2.1>,
      <pk PHC0 = 210.564 PHC1 = 0 
       data hash MD5: 32K
       6A 43 52 E9 F6 B8 96 14 74 07 11 FD 03 1F 87 5A>)
(   4,<2012-05-09 00:29:44.437 -0500>,<Administrator>,<TOPSPIN>,<proc1d>,<TOPSPIN 2.1>,
      <abs ABSG = 1 
       data hash MD5: 32K
       63 C2 04 7F 9F 22 C6 DB 95 E2 38 1E 36 D3 1E DE>)
(   5,<2012-05-09 00:29:44.484 -0500>,<Administrator>,<TOPSPIN>,<proc1d>,<TOPSPIN 2.1>,
      <abs ABSG = 2 
       data hash MD5: 32K
       63 E5 09 A1 50 A4 48 AD F1 EF 23 75 15 61 45 61>)
(   6,<2012-05-09 00:29:44.546 -0500>,<Administrator>,<TOPSPIN>,<proc1d>,<TOPSPIN 2.1>,
      <abs ABSG = 3 
       data hash MD5: 32K
       7B BC 45 FC FE 9A 01 B8 43 93 BE CE 10 C3 F7 A7>)
(   7,<2012-05-09 00:29:44.578 -0500>,<Administrator>,<TOPSPIN>,<proc1d>,<TOPSPIN 2.1>,
      <abs ABSG = 4 
       data hash MD5: 32K
       6B 42 EB EC F0 CC AF FA DD B5 6F 2F 2E B6 FB 9E>)
(   8,<2012-05-09 00:29:44.609 -0500>,<Administrator>,<TOPSPIN>,<proc1d>,<TOPSPIN 2.1>,
      <abs ABSG = 5 
       data hash MD5: 32K
       E2 2D 71 77 D6 1A B3 14 C5 0D 21 16 FC 4A 39 E3>)
$$ ##END=
$$ 
$$ $$ hash MD5
$$ $$ EA 51 8C 81 B4 1D 02 C0 8C CE 84 E9 48 19 45 29
##$RELAX= 
##$RELAX= 
##$RELAX= 
##$RELAX= 
##$RELAX= 
##$RELAX= 
##$RELAX= 
$$ Bruker specific parameters
$$ --------------------------
$$ [...]
##$TP= (0..7)
150 150 150 150 150 150 150 150
##$TP07= 0
##$TPNAME0= <>
##$TPNAME1= <>
##$TPNAME2= <>
##$TPNAME3= <>
##$TPNAME4= <>
##$TPNAME5= <>
##$TPNAME6= <>
##$TPNAME7= <>
##$TPOAL= (0..7)
0.5 0.5 0.5 0.5 0.5 0.5 0.5 0.5
##$TPOFFS= (0..7)
0 0 0 0 0 0 0 0
##$TUNHIN= 0
##$TUNHOUT= 0
##$TUNXOUT= 0
##$USERA1= <user>
##$USERA2= <user>
##$USERA3= <user>
##$USERA4= <user>
##$USERA5= <user>
##$V9= 5
##$VALIST= <valist>
##$VCLIST= <CCCCCCCCCCCCCCC>
##$VD= 0
##$VDLIST= <DDDDDDDDDDDDDDD>
##$VPLIST= <PPPPPPPPPPPPPPP>
##$VTLIST= <TTTTTTTTTTTTTTT>
##$WBST= 1024
##$WBSW= 4
##$XGAIN= (0..3)
0 0 0 0
##$XL= 0
##$YL= 0
##$YMAX_a= 543585
##$YMIN_a= -657871
##$ZGOPTNS= <>
##$ZL1= 120
##$ZL2= 120
##$ZL3= 120
##$ZL4= 120
##$ABSF1= 14.98061
##$ABSF2= -5.57192
##$ABSG= 5
##$ABSL= 3
##$ALPHA= 0
##$AQORDER= 0
##$ASSFAC= 0
##$ASSFACI= 0
##$ASSFACX= 0
##$ASSWID= 0
##$AUNMP= <proc_prof1d_extract_pilot.lims>
##$AXLEFT= 0
##$AXNAME= <>
##$AXNUC= <1H>
##$AXRIGHT= 0
##$AXTYPE= 0
##$AXUNIT= <>
##$AZFE= 0.1
##$AZFW= 0.1
##$BCFW= 0
##$BC_mod= 0
##$BYTORDP= 0
##$COROFFS= 0
##$CY= 15
##$DATMOD= 1
##$DC= 0
##$DFILT= <>
##$DTYPP= 0
##$F1P= 0
##$F2P= 0
##$FCOR= 0.5
##$FTSIZE= 32768
##$FT_mod= 6
##$GAMMA= 0
##$GB= 0
##$INTBC= 1
##$INTSCL= 1
##$ISEN= 128
##$LB= 0
##$LEV0= 0
##$LPBIN= 0
##$MAXI= 10000
##$MC2= 0
##$MEAN= 0
##$ME_mod= 0
##$MI= 0
##$NCOEF= 0
##$NC_proc= -8
##$NLEV= 6
##$NOISF1= 0
##$NOISF2= 0
##$NSP= 0
##$NTH_PI= 0
##$NZP= 0
##$OFFSET= 14.98061
##$PC= 1
##$PHC0= 210.564
##$PHC1= 0
##$PH_mod= 1
##$PKNL= yes
##$PPARMOD= 0
##$PPDIAG= 0
##$PPIPTYP= 0
##$PPMPNUM= 2147483647
##$PPRESOL= 1
##$PSCAL= 4
##$PSIGN= 0
##$PYNMP= <proc.py>
##$REVERSE= no
##$SF= 400.13
##$SI= 32768
##$SIGF1= 0
##$SIGF2= 0
##$SINO= 400
##$SIOLD= 32768
##$SPECTYP= <>
##$SREGLST= <1H.CDCl3>
##$SSB= 0
##$STSI= 32768
##$STSR= 0
##$SW_p= 8223.68421052632
##$SYMM= 0
##$S_DEV= 0
##$TDeff= 65536
##$TDoff= 0
##$TI= <>
##$TILT= no
##$TM1= 0
##$TM2= 0
##$TOPLEV= 0
##$USERP1= <user>
##$USERP2= <user>
##$USERP3= <user>
##$USERP4= <user>
##$USERP5= <user>
##$WDW= 1
##$XDIM= 32768
##$YMAX_p= 463948860
##$YMIN_p= -721213
##$CURPLOT= <Network HP LaserJet P1505>
##$CURPRIN= <$Network HP LaserJet P1505>
##$DFORMAT= <normdp>
##$LAYOUT= <+/1D_H.xwp>
##$LFORMAT= <normlp>
##$PFORMAT= <normpl>
##$SURQMSG= 1
$$ End of Bruker specific parameters
$$ ---------------------------------
##NTUPLES= NMR SPECTRUM
##VAR_NAME=  FREQUENCY,     SPECTRUM/REAL,   SPECTRUM/IMAG
##SYMBOL=    X,             R,               I
##VAR_TYPE=  INDEPENDENT,   DEPENDENT,       DEPENDENT
##VAR_FORM=  AFFN,          ASDF,            ASDF
##VAR_DIM=   32768,         32768,           32768
##UNITS=     HZ,            ARBITRARY UNITS, ARBITRARY UNITS
##FACTOR=    0.250966925370066, 1,           1
##FIRST=     8223.43324360095, -55595,       -140686
##LAST=      0,             -22137,          220098
##MIN=       0,             -721213,         0
##MAX=       8223.43324360095, 463948860,    0
$$ Real data points
##PAGE= N=1
##DATA TABLE= (X++(R..R)), XYDATA
$$ [...]
19541a49389d6331D2469d6450m3334B03593D0354c79436B08750b96471d8304j96967
19530b45271A92201h7572A33156c24011a05071b3466I4409a31896G4008b20989
19519A32124a21680j90675J07764j00759B81614p6696d26294I1949L9804a09809
19508H52J92342d5436D3592L0853a43211b5872j86800g9280k23880c5474a2906
19496e0192A20641B014c42898F4855R7879c0165k23168B87161A00193c9091A97086
19484b05455c620G8296J5436d1897l21062A37158D8532L3494d5676j89984M8435
19473a87225Q1927G71c2082j8487K3146k8341A25976g6433K837j18628A66082
19461d9144A68972a01912q9594c6931j21846b8481p0815F4202a79485A34424a47793
$$ y = [-149389, -46331, 42469, -46450, -89784, 203593, 40354, -379436, 208750, -296471, -48304, -245271, 192201, -87572, 133156, -324011, -105071, -23466, 94409, -131896, 74008, -220989, 132124, -121680, -312355, -204591, -305350, 281614, 204918, -426294, 91949, 131753, -109809, 852, 193194, -45436, 43592, 74445, -143211, -25872, -212672, -79280, -303160, -35474, -12906, -50192, 120641, 2014, -342898, 64855, 162734, -30165, -253333, 287161, 100193, -39091, 197086, -205455, -3620, 78296, 93732, -41897, -362959, 137158, 48532, 82026, -45676, -235660, -187225, -105298, 771, -32082, -50569, -27423, -55764, 125976, -76433, -73596, -192224, 166082, -49144, 168972, -101912, -191506, -36931, -158777, -28481, -99296, 64202, -179485, 134424, -147793]
19449G6306C0633b0700m33119P3313h7610a7234p6822D00253a98681d0584C6583
19437E9497i1606F9646f1925j27228j95270b5684j57702L5139a5240m23370A5183
19425A38372a12662E9893f168B06542b15095c9420E8925g0420k02690J20480B61593
19413c83405B11302c83936d8084k85979B1608J34338h6102B70909b13434i5161
19402A26372e7752B4180L10958a42228L0979A93768a73665I7518b98477r38i6979
19390b829m0567B29982G0305L921g2993k08235j34349a15667L628B22551a19129
19378a41720J321m3819a1555A19887l4646K23003b29322o8901G5707e6533O530
19367e0003o762k00298A03472g5659p4141J1135I8345a09324A66458b88888e169
$$ y = [76306, 30633, -20700, -453819, -380506, -87610, -17234, -94056, 400253, -198681, -40584, 36583, 59497, -91606, 69646, -61925, -189153, -384423, -25684, -183386, -148247, -15240, -438610, 15183, 138372, -112662, 59893, -6168, 206542, -215095, -39420, 58925, -70420, -273110, -152630, 261593, -383405, 211302, -383936, -48084, -334063, 21608, 155946, -86102, 270909, -213434, -95161, 126372, -57752, 24180, 335138, -142228, -111249, 193768, -173665, 97518, -298477, -299415, -96979, -2829, -43396, 229982, 70305, 74226, -72993, -281228, -415577, -115667, -112039, 222551, -119129, -141720, -140399, -184218, -11555, 119887, 85241, 308244, -229322, -298223, 75707, -56533, -50003, -56765, -257063, 103472, -75659, -149800, -138665, 98345, -109324, 166458, -288888, -5169]
19355a98819L896J4068P7327b2470j75907R1865j42018M0979C5714a00844E527
19343h0016k22907E3310a90145c7480F824b54898B80581o4893H7665a08885A7462
19331C0609a46717m7786O94f4404A15747c81904B6014a44823A72776b63242A39252
19319a76954A13350E4681J38222a91235E0941a91726a2425j98510J6703B27396
19308a59638A5882a58835A62719J47234a67952G9633k1176j8888c1153p9343n8813
19297a69309f5305p4661A74264A2281a51036f8029A99862a38785j96077A67534
19286A65202B0989I539b46393e9870F1359R8836a26009q6351O252a5718j77620
19275a93338B01132E2627d59382h2106F1351L7696b18580P6156G1031p0a35163
$$ y = [-198819, -194923, -180855, -103528, -22470, -198377, -106512, -248530, -207551, 35714, -100844, 5527, -80016, -302923, 53310, -190145, -37480, 6824, -254898, 280581, 215688, 87665, -108885, 17462, 30609, -146717, -194503, -193809, -64404, 115747, -381904, 26014, -144823, 172776, -263242, 139252, -176954, 113350, 54681, 192903, -191235, 50941, -191726, -12425, -210935, -194232, 227396, -159638, 15882, -158835, 162719, 309953, -167952, 79633, 58457, 39569, -31153, -110496, -169309, -65305, -139966, 174264, 12281, -151036, -68029, 199862, -138785, -334862, 167534, 165202, 20989, 9539, -246393, -59870, 61359, 160195, -126009, -212360, -206108, -15718, -193338, 201132, 52627, -459382, -82106, 61351, 99047, -218580, -142424, 71031, 70961, -135163]
19263a14706d3922j47316a3218j54401J1744C5299b05892o3792D11025h1206A41614
19251D2011M1926J75277H0369b57720E3735b05562d3022r9985j21281G2977M3097
19240A16074a43694A8922K45995a7941j50034k38197J23298o4920A71305d7467
19229g044A50258a60083B75133l7189A0244f3666K7130A9517a97911P0458c9005
19217A35855c75347F1388b52516C58082a49250O7497m8011o4923A42826b22061
19206a41268D13965A68652a90075D6991k0629J23402i3657d3393E5412p352f7485
19194a12275D32385b7983G0973J56154b43382d1999F4966g7258j03729g0917k9337
19183a00254k19778i1649j32012A08187b3091k4612a4156m4976P643o0440j14928
$$ y = [-114706, -43922, -191238, -13218, -167619, -155875, 35299, -205892, -269684, 411025, -81206, 141614, 42011, 83937, 259214, 80369, -257720, 53735, -205562, -43022, -143007, -264288, 72977, 116074, -143694, 18922, 264917, -17941, -167975, -406172, -282874, -347794, 171305, -47467, -7044, 150258, -160083, 275133, 237944, 10244, -63666, -36536, 19517, -197911, -127453, -39005, 135855, -375347, 61388, -252516, 358082, -149250, -81753, -129764, -194687, 142826, -222061, -141268, 413965, 168652, -190075, 46991, 26362, 149764, -93657, -43393, 55412, 48060, -67485, -112275, 432385, -27983, 70973, 227127, -243382, -41999, 64966, -77258, -180987, -70917, -100254, -320032, -91649, -223661, 108187, -23091, -47703, -14156, -59132, -51489, -111929, -226857]
19172b26857a01705B25542h4385A9047a00585k3417A9183e1924j96951d7875A69510
19160b28407g7613j25861f205k4294k99816J7531a09114L9140a485r8050J9562
19149g9973A03676a75850A73841b00060P621F272d74331B29673b98426a37945
19138B20433b71479A51002b48490f8151J803k07800e1962H6374c8355k45391d3443
19126B04780Q893A9133a40501A21800b1066B18950a58635B56303D829b1158e126
19114a12539c655j86578j137e834j14247p180B02072i507j52417j41891a906j59474
19102a61380A43649d7498B06775A1536J14541b45385A12332a8102j80965m3583
19092b42650A56452d0801p4296J8584m8313k04220a30031c8364A27139b33298
$$ y = [-226857, -101705, 225542, -84385, 19047, -100585, -124002, 19183, -51924, -248875, -47875, 169510, -228407, -77613, -203474, -6205, -30499, -330315, -312784, -109114, -69974, -1485, -99535, -79973, 103676, -175850, 173841, -200060, -192439, 6272, -474331, 229673, -298426, -137945, 220433, -271479, 151002, -248490, -68151, -66348, -274148, -51962, 86374, -38355, -283746, -43443, 204780, 213673, 19133, -140501, 121800, -21066, 218950, -158635, 256303, 4829, -21158, -5126, -112539, -3655, -190233, -191370, -5834, -120081, -127261, 202072, -9507, -161924, -303815, -1906, -161380, 143649, -47498, 206775, 11536, 126077, -245385, 112332, -18102, -199067, -242650, 156452, -40801, -115097, -96513, -144826, -349046, -130031, -38364, 127139, -233298]
19081I9980h4095q570E8257E247K14692a78113H2585a50481b2202j39870j17841
19070b79913j9879a44831j9062B24750i5900B02057i0013A04698A7098b11348
19059b37200B3561a01606j29261a00560I4274a27559j5276I262D210J33866b63795
19047A90666a90871P0722A12484J854h4772F9021p975b49165R3169A58502f7052
19035d0107O822F5691K42785j24653H4808g7332A21185c82304J20138A77239a28048
19023B08300r9077d41270B35256a11124c9968A33148g0838A09425c475B16727
19012B36515H2446j396M7076a02078M0455m2261a2177l34106A25983a46809B83564
19000b87173A2196D007c0218k74457k1055C9264a05472A37122c0693C8079f0173
$$ y = [99980, -84095, -92665, 58257, 5247, 219939, -178113, 82585, -150481, -22202, -162072, -279913, -299792, -144831, -163893, 224750, -95900, 202057, -90013, 104698, 17098, -211348, -237200, 23561, -101606, -230867, -100560, 94274, -127559, -142835, 9262, 4210, 138076, -263795, 190666, -190871, -120149, 112484, 114338, -84772, 69021, 61046, -249165, -155996, 158502, -67052, -40107, -33285, 65691, 308476, 183823, 84808, -77332, 121185, -382304, -262166, 177239, -128048, 208300, 109223, -441270, 235256, -111124, -39968, 133148, -70838, 109425, -3475, 216727, 236515, 82446, 81050, 128126, -102078, -61623, -103884, -12177, -346283, 125983, -146809, 283564, -287173, 12196, 4007, -30218, -304675, -325730, 39264, -105472, 137122, -30693, 38079, -60173]
18988a03394F993a44386M6399H962d7221l99777a57833C27713a34900k07875I3489
18976b67970A95407b93899F5427J39254e6842a6315A57680R7363C4135J61503
18966A95638H7374K08193a04996n4552C2588b29810k27490J4904D5112A2688l924
18955H764a56067A91414e8823C5536a1061j21372k5873K9862A47389d05535A19328
18943e7449B76961G4814c18670c7384l00850a22896q3379B87555j34116E1252
18932A35647d09242C6369K96886F8504J52618h0959b1829m9512j19203C5236b6419
18920B7182a58152B0794O5087g8716j465b8590j51417j30166g2597j04979e8563
18908D232f0468j12977a4582A84462k123c11308a2219j3176A2930b19538k06090
$$ y = [-103394, 6993, -144386, -97987, 8962, -47221, -446998, -157833, 327713, -134900, -342775, 93489, -267970, 195407, -293899, 65427, 204681, -56842, -16315, 157680, 255043, 34135, 195638, 87374, 295567, -104996, -159548, 32588, -229810, -457300, -442396, 45112, 12688, 8764, -156067, 191414, -58823, 35536, -11061, -132433, -158306, -128444, 147389, -405535, 119328, -57449, 276961, 74814, -318670, -37384, -338234, -122896, -206275, 287555, 153439, 51252, 135647, -409242, 36369, 333255, 68504, 221122, -80959, -21829, -71341, -190544, 35236, -26419, 27182, -158152, 20794, 85881, -78716, -80181, -28590, -180007, -310173, -72597, -177576, -58563, 4232, -60468, -173445, -14582, 184462, 182339, -311308, -12219, -25395, 12930, -219538, -425628]
18897d25628H6504b37958M5549A70000a28785C7872a89249A37646b28877A36831
18886A79436K60953G737c2526k45095A83079b05034i6047D4707P2484b04456c2513
18874d0735k07333O9894c7244G2100b78457f6791j77538C10201i4844E1616j8921
18863C2695b294I4069c8079D5628a37751F4558a1851k832A21394C8873a75466
18851a0820D2466A2205J16896g0479q0577k01575J19034E5458Q7879a80011j30944
18840c10955I2412D456J87384a95955D97132a74140j2158j27067J5035a05853
18829B39563J9533p2103h3781m8916k11318P7161F8814H581J5189a99285B66197
18817c3176k45008p272C6348J20219M5146p4368e0367l9275J0972j30621C40427
$$ y = [-425628, 86504, -237958, -192409, 170000, -128785, 37872, -189249, 137646, -228877, 136831, 179436, 440389, 7737, -32526, -277621, 183079, -205034, -96047, 44707, 117191, -204456, -32513, -40735, -248068, -178174, -37244, 72100, -278457, -66791, -244329, 310201, -94844, 51616, 32695, -2294, 94069, -38079, 45628, -137751, 64558, -11851, -14683, 121394, 38873, -175466, -10820, 42466, 12205, 129101, -70479, -151056, -352631, -233597, 55458, 143337, -180011, -310955, 92412, 4456, 191840, -195955, 497132, -174140, -186298, -313365, -298330, -105853, 239563, 259096, 186993, -83781, -132697, -344015, -266854, 68814, 8581, 23770, -199285, 266197, -33176, -278184, -285456, 36348, 156567, 201713, 127345, -50367, -89642, -78670, -209291, 340427]
18805a29075C15228D8368a10823c0786n29245h7699C188c3392A41775o3046J17363
18794A96092g1397j36840C1729K7732J38310r2939a53533D373a61095L5389J6173
18783a09533j30129B19890a19014L1461b9644q1011D3613P0478c50750a1993I2504
18771A8569a69528d6888A86310F4274i9062l41390o3089a22482N2848H2335b86998
18759a21973k9020c4080m255F4513p217b35899j7633L9116B83001b77406C9389
18747h7881A58855b92355C6999a29044H6673c66767b0513A4013M8619K2401J25630
18736B10663h3587p5285K9820j44339J16175Q7B33224A3111J7971J34598a20945
18724a15557K8901A0736b77829A07471b28497A22028d1523l8914k06210J07483
$$ y = [-129075, 315228, 48368, -110823, -30786, -560031, -87699, 3188, -33392, 141775, 78729, 196092, -71397, -208237, 31729, 59461, 197771, 104832, -153533, 4373, -161095, -125706, -109533, -239662, 219890, -119014, -87553, -29644, -110655, 43613, 114091, -350750, -11993, 92504, 18569, -169528, -46888, 186310, 64274, -99062, -440452, -503541, -122482, -69634, 82335, -286998, -121973, -150993, -34080, -38335, 64513, 57296, -235899, -253532, -214416, 283001, -277406, 39389, -87881, 158855, -292355, 36999, -129044, 86673, -366767, -20513, 14013, 62632, 85033, 210663, -83587, -158872, -129052, -273391, -157216, -157129, 233224, 13111, 31082, 165680, -120945, -115557, -86656, 10736, -277829, 107471, -228497, 122028, -41523, -80437, -286647, -179164]
18714a79164b8448A55466a52662j3479a7133D09232b34435a16973a2128A0001
18703E2250c6141J0691C8734b66462A8220a96402f3999b1776E8324c40919n5596
18692c96515A49169b47586N9020a223k92762r861n3541A12680m648K23473g4380
18680A08127c64347B7027b5713k8450b0062j08373c1243C2404d147m7224B7234
18668C74130b26491j19266e7374n18005I1078a11868n1377J3734A89350G0957
18657B17279a27034C16450b12838J1436f9978M106A99956B4197d5550D6150b11437
18645a59974F0690a65508C1787a46476G262e3806A95231F453J05038M1653d6770
18633C12952A6137N0229J31175a94808A6944K0468J53182Q4403E7965K33161D7483
$$ y = [-179164, -28448, 155466, -152662, -166141, -17133, 409232, -234435, -116973, -12128, 10001, 52250, -36141, -25450, 38734, -266462, 18220, -196402, -63999, -21776, 58324, -340919, -396515, 149169, -247586, -188566, -1223, -293985, -303846, -357387, 112680, 108032, 331505, -74380, 108127, -364347, 27027, -25713, -54163, -20062, -128435, -31243, 32404, -4147, -51371, 27234, 374130, -226491, -345757, -57374, -575379, 91078, -111868, -163245, -149511, 189350, 70957, 217279, -127034, 316450, -212838, -201402, -69978, -65872, 199956, 24197, -45550, 46150, -211437, -159974, 60690, -165508, 31787, -146476, 7262, -53806, 195231, 6453, 111491, 153144, -46770, 312952, 16137, 66366, 197541, -194808, 16944, 37412, 190594, 274997, 57965, 291126, 47483]
18621g2120j66165J14765N8813k76471A36786a5831r3301I8669J21539I2331b05747
18609d42170C7170g5301A7205b12943b654A87152H2724b0272j0271r1101m41465
18598e63109b8518A67887g7693E8550g7790k08506O977k27234A33267E236a34526
18586g4461q5246L9531c1375k8633H5282a04690G4482i2388m581o9483A71771
18574B11169a2303C2435a18104B23190b5730o4941E0496i1214C3978G721a09290
18562a0676k10853d3484j53367F5199J26533k2413e6946o411A38482c58626e2976
18550A78820e6911Q508G0690a12242C8740J38740b27606Q2950j0214H8225K3311
18539A11536H465a47736n73477h5717k20914Q1138e1704j44343B26932d1578k09149
$$ y = [-72120, -238285, -123520, -64707, -341178, 136786, -15831, -109132, 98669, 220208, 92331, -205747, -442170, 37170, -75301, 17205, -212943, -2654, 187152, 82724, -20272, -30543, -121644, -563109, -28518, 167887, -77693, 58550, -77790, -286296, -279319, -506553, 133267, 5236, -134526, -74461, -159707, -120176, -31375, -60008, 85282, -104690, 74482, -92388, -96969, -166452, 171771, 211169, -12303, 32435, -118104, 223190, -25730, -90671, 50496, -91214, 33978, 7721, -109290, -10676, -221529, -43484, -196851, 65199, 191732, 169319, -56946, -63357, 138482, -358626, -52976, 178820, -56911, -48403, 70690, -112242, 38740, 177480, -227606, -144656, -154870, 88225, 111536, 8465, -147736, -721213, -85717, -306631, -225493, -51704, -196047, 226932, -41578, -250727]
18528b50727d4720l75321a69232a4545C66467a54934d2277k37851k0718a24349
18517b08426j71815A3385a52746d2459L228l04182a1345j68172j34772J2813g4676
18505c5706A21918a71952c5395k02868D699b0972l4962j57390m7622l9681a21143
18493C8110J45647B5992a8862k42437a2628B57181b20229e5933A54423d4430B08670
18481A27290c8000B55487c00551j27166I3853J09092a90440m9211g9320I1190
18470c62342a71934I912a94732L0978M3472A01587a33763A06022h0113k23412
18460c03525C4001L3029e4119K5417A75838c8568F3758b60047i8550A95001l9623
18449A55378a53260j4749O7334A31774a81713B71998e6758A86259c44354a13179
$$ y = [-250727, -44720, -420041, -169232, -14545, 366467, -154934, -42277, -280128, -300846, -124349, -208426, -380241, 13385, -152746, -42459, -39231, -343413, -11345, -179517, -314289, -301476, -74676, -35706, 121918, -171952, -35395, -238263, 4699, -20972, -55934, -213324, -260946, -300627, -121143, 38110, 183757, 25992, -18862, -261299, -12628, 257181, -220229, -55933, 154423, -44430, 208670, 127290, -38000, 255487, -300551, -427717, 93853, 202945, -190440, -239651, -79320, 91190, -362342, -171934, 9912, -194732, -163754, -120282, 101587, -133763, 106022, -80113, -303525, 34001, 67030, -54119, -28702, 175838, -38568, 63758, -260047, -98550, 195001, 155378, -153260, -168009, -100675, 131774, -181713, 271998, -56758, 186259, -344354, -113179]
18438g0268a0219B11066o5854d39274b01107O1473B03766b77120J01078L4267
18428a41775n8267o1949I4363c17652C07877b56780g9080A43625M3579l7600a96101
18416a48275q660A92696C820b3598E6894K45716d28202D11758a97366j46683f0791
18404b01557A58406b74256D8508b63863G2581a65568F3696a48982M9129A22857
18393i4739C64964D8473J09141a23340j26228A3386a1723l65470e2437j32951
18383a85388c2598l17695B65640R1773H4985a08830B30833e0270l0265A06819
18372A1723J76761r2575l4208h9661j1966j28365p9643i0120D3795J97713d5557
18360a42896e2332F2854a28078A98262b3769D1020a65077A78075p0499C7991K6890
$$ y = [-70268, -10219, 211066, 145212, -439274, -201107, -139634, 203766, -277120, -176042, -141775, -200042, -261991, 94363, -317652, 307877, -256780, -79080, 143625, 187204, 149604, -196101, -148275, -156935, 192696, 3820, -23598, 56894, 302610, -428202, 411758, -197366, -344049, -60791, -201557, 158406, -274256, 48508, -263863, 72581, -165568, 63696, -148982, -99853, 122857, -94739, 364964, 48473, 157614, -123340, -249568, 13386, -11723, -377193, -52437, -185388, -32598, -350293, 265640, 357413, 84985, -108830, 230833, -50270, -80535, 106819, 11723, 188484, 95909, 61701, -89661, -101627, -229992, -309635, -90120, 43795, 241508, -45557, -142896, -52332, 62854, -128078, 198262, -23769, 41020, -165077, 178075, 107576, 37991, 64881]
18349F4881O5517P3143J02392r8362a20346j4286m33B4653a55989K0528F9168
18337A11893A9982h7827a8978A07780E3450b42287E9709f9087J1819p6630l8642
18326a72540P2045m16066A4321a76410r727h2602F5674g9689r1343G467J3330
18315B0797b02557A9361a52007b1753B29650H2704b35922j13143J41812A29118
18304A41964a98342i4374E0541a26081B87112a51493O6975I7920a19278J9354
18294i9924c9617j72567A25437J67966j19166a50314k3102A38372n1262J587l3082
18283E5615b5427j81153F6213c2165j72280A7492O2583a9507A47500i650q6198
18272i5848j17008e4468l7069q0074H7909a4916k89988B60974a70280P1051A8894
$$ y = [64881, 130398, 203541, 305933, 207571, -120346, -134632, -135065, 24653, -155989, -135461, 69168, 111893, 19982, -87827, -18978, 107780, 53450, -242287, 59709, -69087, -57268, -133898, -172540, -100495, -516561, 14321, -176410, -186137, -82602, 65674, -79689, -171032, 7467, 20797, -202557, 19361, -152007, -21753, 229650, 82704, -235922, -349065, -207253, 129118, 141964, -198342, -94374, 50541, -126081, 287112, -151493, -84518, 97920, -119278, -99924, -39617, -212184, 125437, 293403, 174237, -150314, -173416, 138372, 87110, 88697, 55615, -25427, -206580, 66213, -32165, -204445, 17492, 80075, -19507, 147500, -9650, -95848, -212856, -54468, -91537, -171611, 87909, -14916, -304904, 260974, -170280, -99229, 18894]
18260c91697F217K94209b13456B40611a37325j17322b8711l4891G7950a2184D3445
18248A26371d21430f9135J7382k17366A26272e55493A37870b56577a09184p531
18238a16715E7546K6299l242M0956b75465B06574F3101n015a78323k7559c0722
18226a74617g0747o4609A47422c9982k63838a47822k874j53178f1763J4315r3195
18215a40643A43013h3428D2488b34754j84259A49802D6953a86980D683a04029
18204A82676P8357b93712a0423k0899C0518M2983b16575C51752A01479c4925E1997
18192c0100q7192l0161A69602f2869m4959e0900j56986i2511j42421I5254f5911
18180a29965F7794b39090B65509A054J33834g3141B71901o3270H052O6040B977
$$ y = [-391697, 6217, 300426, -213456, 240611, -137325, -254647, -28711, -63602, 77950, -12184, 43445, 126371, -421430, -69135, -51753, -269119, 126272, -555493, 137870, -256577, -109184, -116715, 57546, 83845, 80603, 121559, -275465, 206574, 63101, 58086, -178323, -205882, -30722, -174617, -70747, -135356, 147422, -39982, -303820, -147822, -150696, -303874, -61763, -47448, -140643, 143013, -83428, 42488, -234754, -419013, 149802, 46953, -186980, 4683, -104029, 182676, 261033, -293712, -10423, -31322, 30518, 73501, -216575, 351752, 101479, -34925, 51997, -30100, -117292, -147453, 169602, -62869, -107828, -50900, -207886, -92511, -234932, 95254, -65911, -129965, 67794, -239090, 265509, 1054, 134888, -73141, 271901, 208631, 8052, 74092, 2977]
18168A76611Q3953b2451j418k375c00l8680A62883K7086G9431b71014I848L66665
18156C76513A02303C1064J10463a1955l79823D8317b89029K8844B2103i0482r086
18145i9568B62174a59296H3804D1685R0296O9794Q1741b99872j46519g7328j47097
18134b24425q310d4764k16790A2666a44458A46808c4219A5337a25529j36701A88363
18122a53651b8851j95603A27473c644p9715A4302b70215a10734a0335l17024a15146
18110b68499B4844m792b07525C35a64467P8255B02127f3190G4230J70120c7425
18098B7858c56381J35404H1897b62489C8526R9454D6357K9550K87561a5465K94
18087a5171q7184q3259f3857k63414H3989K5a64076B89577b05213D9063g1935
$$ y = [176611, 260564, -22451, -23869, -26244, -300, -38980, 162883, 189969, 79431, -271014, 9848, 376513, 102303, 31064, 141527, -11955, -391778, 48317, -289029, -260185, 22103, -90482, -99568, 262174, -159296, 83804, 41685, 131981, 201775, 283516, -299872, -446391, -77328, -224425, -232735, -44764, -261554, 12666, -144458, 146808, -34219, 15337, -125529, -262230, 188363, -153651, -28851, -224454, 127473, -3644, -83359, 14302, -270215, -110734, -10335, -327359, -115146, -268499, 24844, 20052, -207525, 335, -164467, -86212, 202127, -63190, 74230, 244350, -37425, 27858, -356381, -220977, 81897, -262489, 38526, 137980, 46357, 75907, 363468, -15465, -15171, -102355, -185614, -63857, -327271, 83989, 84014, -164076, 289577, -205213, 49063, -71935]
18075H8557a85383B63146k7094j5150a07514j18660n1617H5846d2190j60015A48021
18063a1065G9472i5859C03294I13g210k7248k45094d0772C87837a35322J1653
18052a23669G5325M2212B8757N4194d2276I9570c7524K373p8722a2108n7319C02775
18039c84237A37654l6918a92917f912l37003A06298a12901A81580b59807b5349
18028D2526O3549J4802a0717A80782a33376A14492a11072B64582C529d2964K1150
18017b1814l08022B8646r564b5569D0515a00617k91389i0691A58687a20936L6799
18006h4137A06820J93531r6279a19067H687J23161n7269L7216c6381J4613F7125
17994C0018i9099F0940a68109N0449K6310B8618b66216A46561N9861A6145i8983
$$ y = [88557, -185383, 263146, 236052, 220902, -107514, -226174, -277791, 85846, -42190, -202205, 148021, -11065, 79472, -95859, 303294, 913, -7210, -34458, -279552, -40772, 387837, -135322, -123669, 75325, 117537, 28757, 82951, -42276, 99570, -37524, -35151, -113873, -12108, -69427, 302775, -384237, 137654, 100736, -192917, -6912, -343915, 106298, -112901, 181580, -259807, -25349, 42526, 106075, 120877, -10717, 180782, -133376, 114492, -111072, 264582, 3529, -42964, -21814, -329836, 28646, 19082, -25569, 40515, -100617, -392006, -90691, 158687, -120936, -84137, 106820, 300351, 204072, -119067, 8687, 131848, 74579, 111795, -36381, -21768, 67125, 30018, -99099, 60940, -168109, -117660, -91350, 28618, -266216, 146561, 206422, 16145, -98983]
17982a63549c6579A42881n0272L2461d0658q6867A99157q7752h3584B00418a27952
17970E41602A76081a92577A72016M2108a37037A06237l2822k1294A3847J61238
17960A75085d29670e1034A10489J7179b69618k3438K9933Q1270M2726A22213E4484
17948g7196o8763L1397j30462o4979a36564F1615g9760B21768h5452A75639Q6387
17937B62026a43176A91810L0069a64144A53751A9366M13494C7407b10922D3778
17926a28948I1508h7851D13477h4747B07292b6448j02733D6216P8624a68076A84444
17914h5903E0001K08143b15572m4222I1959A4928K38864B1212b13086A93759a14504
17902a51964H4689J57926O9989d5639o781n81C0945K9243B4607e9367k96926G385
$$ y = [-163549, -36579, 142881, 92609, 125070, -40658, -127525, 199157, 111405, -83584, 200418, -127952, 541602, 176081, -192577, 172016, 214124, -137037, 106237, 73415, 52121, 13847, 175085, -429670, -51034, 110489, 127668, -269618, -293056, -263123, -181853, -139127, 122213, 54484, -77196, -145959, -114562, -245024, -310003, -136564, 61615, -79760, 221768, -85452, 175639, 262026, -143176, 191810, 221879, -164144, 153751, 19366, 432860, 37407, -210922, 43778, -128948, 91508, -87851, 413477, -84747, 207292, -26448, -129181, 46216, 124840, -168076, 184444, -85903, 50001, 258144, -215572, -259794, 91959, 14928, 253792, 21212, -213086, 193759, -114504, -151964, 84689, 242615, 312604, -45639, -52420, -53001, 30945, 60188, 24607, -59367, -356293, 7385]
17889a81855A19501J48171J3161c28198J11241F1230H32K59946C5655a02119p6400
17878a78519e0549C24305a17182C8819c9555H3223N4267a07822B22262J9250C5234
17866E909h0147A99420E9814d9551n4453G9190l4495H134c1389G5572M7197o0769
17854F2000L5575k3153H809J1189M0578b48367C08631c23755a24467j7277D03238
17842A1596b257A386K66112B4817g3588A20299f4373A17572i0874A58305k7701
17831A30604J21638b94925A68270D7564a60632A55514a96913B1950d1041j73208
17821b14249C4247a87580b7291n7187B70172c9145j14611G3980P8023a67901d1059
17809a10898B90922I6762j4547b1635j05670A06225a55187l8512A13957b41874
$$ y = [-181855, 119501, 267672, 280833, -328198, -216957, 61230, 832, 260778, 35655, -102119, -178519, -50549, 324305, -117182, 38819, -39555, 83223, 137490, -107822, 222262, 241512, 35234, 5909, -80147, 199420, 59814, -49551, -104004, 79190, 44695, 8134, -31389, 75572, 122769, 62000, 97575, 74422, 8809, 19998, 60576, -248367, 308631, -323755, -124467, -141744, 403238, 11596, -2257, 1386, 267498, 24817, -73588, 120299, -64373, 117572, -90874, 158305, 130604, 252242, -294925, 168270, 47564, -160632, 155514, -196913, 21950, -41041, -214249, 34247, -187580, -27291, -84478, 270172, -39145, -153756, 73980, 152003, -167901, -41059, -110898, 290922, 96762, 82215, -21635, -127305, 106225, -155187, -193699, 113957, -241874]
17798f4528A45501c9822j31735j345f1795B7071a14664C36599B9037a71566O7341
17787a04225A24961E120P8789a64756A21884g041r374r0448J3220F563e951F2286
17774A25377b1030A93868a93302k27281J11798a15560k55637A97880d1191k83066
17764c24257h1423F9224A0315N5461K8476q712R0693d0092k09357R4663A27862
17752A04978J52319j22929L626n915e3817A9391J41268m6057Q2973e0771l1539
17741h2310K2353j14436M3294n3679j09976G143P0789J06420a50770N7454F8821
17729a57943L6046b6968p3030l130E7360c78512e062G7597a35255p7453h6260
17717h0355j6288j53523I2379a14359j53753B61344a4635C11051a71223j32079
$$ y = [-64528, 145501, -39822, -171557, -172902, -61795, 27071, -114664, 336599, 29037, -171566, -104225, 124961, 5120, 83909, -164756, 121884, -7041, -16415, -106863, -93643, 6563, -5951, 62286, 125377, -21030, 193868, -193302, -420583, -308785, -115560, -371197, 197880, -41191, -324257, -81423, 69224, 10315, 65776, 94252, 85540, 176233, -40092, -249449, -154786, 127862, 104978, 257297, 134368, 137994, 132079, -53817, 19391, 160659, 114602, 197575, -50771, -82310, -59957, -174393, -131099, -184778, -294754, 7143, 77932, 184352, -150770, -93316, 68821, -157943, -121897, -26968, -99998, -103128, 57360, -378512, -5062, 77597, -135255, -212708, -86260, -80355, -96643, -250166, 92379, -114359, -268112, 261344, -14635, 311051, -171223, -303302]
17707c03302B06008A01962a85108e3786L248G4235Q7022K44851j87759a7778N357
17696a2421k5165G8966P5315P7720o4283i4981A35934b11403C56930I2866O0222
17685A53088K8729b39860C6171c52203C02219e449C5721c20288B7623b59304a3463
17673A34619g5255l9883a2553C0251b05852i8095j05135A36643J4662m1945f9692
17661a94191A75554f8682A26694e0065A46973a19732d7597k42461g1529A46199
17650b08449e341j5059A03415j2747C6281b1818A05989h5905E2846L15374a18081
17638A14280a24844a1607j43390a227n0344B9987a11692A33866O3521M2047A07116
17626e9791H4330i3952B77558A09433i5597G7275C184K1656K18573I0499b83982
$$ y = [-303302, 206008, 101962, -185108, -53786, -50538, 74235, 161257, 406108, 218349, -17778, -12421, -37586, 78966, 154281, 232001, 167718, -94981, 135934, -211403, 356930, 92866, 153088, 181817, -239860, 36171, -352203, 302219, -5449, 35721, -320288, 27623, -259304, -13463, 134619, -75255, -115138, -12553, 30251, -205852, -98095, -203230, 136643, 151305, 109360, -69692, -194191, 175554, -68682, 126694, -50065, 146973, -119732, -47597, -290058, -71529, 146199, -208449, -5341, -20400, 103415, 90668, 36281, -21818, 105989, -85905, 52846, 368220, -118081, 114280, -124844, -11607, -154997, -1227, -51571, 29987, -111692, 133866, 197387, 239434, 107116, -59791, 84330, -93952, 277558, 109433, -95597, 77275, 3184, 24840, 243413, 90499, -283982]
17614A55286f2573A62829L1349a57699I5229o422G087J82598F1449a06047a2829
17602H1766b4859l004G2707J18631m7181a00202d4306j51431G4055a06225m1394
17591a47619k06860A46867m5465a72271d7863C01409c9557A52744a82769B444
17580a88679C06569h4070A26279l218g1991A20954A5882J74579A0251a4963q1220
17569i6183A14318k7474A3658J2205K77348A7457J03463O7256c90479d003D31849
17557a07138E2649N3290J35629a12295L862j05534B86511g5430j50061A80492
17546e8862k9350C9920O0015N2509c11075J05647B13171a17035B73475P4933a26026
17534I571K58567a48185A53581k6867C456a36563o4702A68106C7945N9334J01039
$$ y = [155286, -62573, 162829, 194178, -157699, 95229, 88807, 7087, 189685, 61449, -106047, -12829, 81766, -24859, -27863, 72707, 191338, 144157, -100202, -44306, -195737, 74055, -106225, -147619, -354479, 146867, 101402, -172271, -47863, 301409, -39557, 152744, -182769, 2444, -188679, 306569, -84070, 126279, 123061, -71991, 120954, 15882, 190461, 10251, -14963, -96183, 114318, 86844, 13658, 25863, 303211, 17457, 120920, 188176, -390479, -4003, 431849, -107138, 52649, 105939, 241568, -112295, -108433, -213967, 286511, -75430, -225491, 180492, -58862, -88212, 39920, 99935, 152444, -311075, -205428, 213171, -117035, 273475, 348408, -126026, 9571, 268138, -148185, 153581, 126714, 3456, -136563, -201265, 168106, 37945, 97279, 198318]
17523A98318c1848A10545N114d2898F8464c97458B38412G2916K32393j45858c3155
17511C4525a15860B41846a62792A71173B35b00539H473g745B59274E2457J10780
17500A63237k8576k8018Q8155f6951C32227A02872J84715h0009j40661A49215
17489D4799l674h5377A81027C5307P2811J46364d2514k3837B8710K69238n3936
17478B44012i6801A00239N9472k9806b50624i6298B32703h3802a3617I634M30433
17467D40067c33264B80581K2976l3906k3746q4108J58698F9343Q5400J72885j14309
17456B13319a01535A4194J18957j2420k5771c5930o6274I6282b28885l0751D07483
17444B32247F7244J09634j5682b9087B96303m1720J07825j04914a0353B60288
$$ y = [198318, -31848, 110545, 115659, -42898, 68464, -397458, 238412, 72916, 305309, 159451, -33155, 34525, -115860, 241846, -162792, 171173, 235, -200539, 8473, -7745, 259274, 52457, 163237, 134661, 106643, 194798, -66951, 332227, 102872, 287587, -80009, -220670, 149215, 44799, 41125, -85377, 181027, 35307, 108118, 254482, -42514, -66351, 28710, 297948, 244012, -96801, 100239, 159711, 129905, -250624, -96298, 232703, -83802, -13617, 9634, 440067, -333264, 280581, 303557, 269651, 245905, 161797, 320495, 69343, 154743, 327628, 213319, -101535, 14194, 133151, 120731, 94960, -35930, -102204, 96282, -228885, -259636, 407483, 232247, 67244, 176878, 161196, -29087, 296303, 254583, 362408, 257494, -10353, 260288]
17433F0190P4104K31501Q3782A22649A8398b04708A08010l5836a4496m5876q7839
17422a48211l9604C05585j1838H6451J47149Q3434r9009p1329J92279j54126J41572
17411C26421J42154H8705R8732J3762F1965K656L01515p4995e1597B90947J1304
17400C02251J75318B09373Q5742E5506N1115L93582F3493O802K15131j15304m9809
17389A20313E0364K53707q4468G391d1900B43810K3583r1157G3204e150j43821
17378a48971A05802J41737M0926a40306B10526J89373b3427A86356P8753A16892
17367D3085R2180h305k4278E2923A3457a75200F6324K06781A14704K06337j50408
17356A70633m8982r560i5899C19437j32951a8621A35937a13196b3872o93A25220
$$ y = [60190, 134294, 365795, 449577, 122649, 18398, -204708, 108010, 72174, -14496, -60372, -148211, -187815, 305585, 293747, 86451, 233600, 317034, 218025, 146696, 338975, 184849, 326421, 468575, 88705, 187437, 201199, 61965, 64621, 366136, 291141, -51597, 290947, 302251, 477569, 209373, 295115, 55506, 106621, 500203, 63493, 70295, 285426, 170122, 120313, 50364, 304071, 219603, 7391, -41900, 243810, 267393, 176236, 73204, -5150, -148971, 105802, 247539, 288465, -140306, 210526, 399899, -23427, 186356, 265109, 116892, 43085, 135265, -8305, -32583, 52923, 13457, -175200, 66324, 273105, 114704, 321041, 170633, 121651, 112091, -95899, 319437, 186486, -18621, 135937, -113196, -23872, -24565, 125220]
17344C63348I2876h7117A31097K3763K96871a54119B27758h4153k73959D00407
17333D40835G6934A1062K1494K81097A51536a8033H6377K8596a53361I1832J04765
17322A96597A7864J46350a59398j82175A96546g3425G4719B5188J49039N8841
17312B33068p8995b07585A86172k4029C9362K77964b53077A78348M2458b37352
17301H2069N8182a17219B12011r7000l1664a03693A06190J64972a70443A8327
17290A51950p4a75492p9857H0452a592I3701e9705I2463J16037J0462J02920M4358
17278C66240j9987A35354D0982a33078A75034Q1685L21778E1216a61905B7348
17267B26873F1689L7033K07019E7102M54443G8050c4855C10340a3473C49711b8735
$$ y = [363348, 92876, -87117, 131097, 154860, 451731, -154119, 227758, -84153, -358112, 400407, 440835, 76934, 11062, 32556, 313653, 151536, -18033, 86377, 114973, -153361, 91832, 196597, 17864, 164214, -159398, -341573, 196546, -73425, 74719, 25188, 174227, 233068, 154073, -207585, 186172, 162143, 39362, 317326, -253077, 178348, 220806, -237352, 82069, 140251, -117219, 212011, 115011, 83347, -103693, 106190, 271162, -170443, 18327, 151950, 151876, -175492, -255349, 80452, -1592, 93701, -59705, 92463, 208500, 218962, 321882, 366240, 346253, 135354, 40982, -133078, 175034, 256719, 578497, 51216, -161905, 27348, 226873, 61689, 98722, 305741, 57102, 511545, 78050, -34855, 310340, -13473, 349711, -28735]
17255A19061D4321a2306A729K65779O9161E875L47708A46431a39564H9799L60114
17244D49913B14144K67341B7689K48968J16742j22935l2979o7248K9661J1350
17234B11248F1184f6327B03002D9123R9699J60134j03458a39827B01574F4116
17223E38210G8122G183J72715J2278p6934L9133J24107K43583k56381K53187k51311
17212B67560K82701d1752E87924I4457K52349A31398O00767A99463I5015J65030
17202B60045J79052A27115J88192A50658n9165J31831H8163M79102k74924a13340
17191A30211O9211p7757J21635E3974B1581r312K38891b4319A56841P2266A07103
17179C27047r3973Q5238J17275B4188K97761M0776A11234b82025D1869P0640a8429
$$ y = [119061, 44321, -12306, 1729, 267508, 336669, 5875, 353583, 146431, -139564, 89799, 449913, 214144, 481485, 27689, 276657, 393399, 270464, 237485, 170237, 199898, 211248, 61184, -66327, 203002, 49123, 148822, 308956, 205498, -139827, 201574, 64116, 538210, 78122, 7183, 179898, 192176, 115242, 154375, 278482, 522065, 265684, 518871, 267560, 550261, -41752, 587924, 94457, 346806, 131398, 732165, 199463, 95015, 260045, 439097, 127115, 315307, 150658, 91493, 223324, 88163, 567265, 292341, -113340, 130211, 199422, 121665, 243300, 53974, 21581, 12269, 251160, -24319, 156841, 229107, 107103, 327047, 233074, 318312, 435587, 24188, 321949, 362725, 111234, -282025, 41869, 112509, -18429]
17167B21410a45456C89472j07468r5905F8706O9200g7927I3873K21072C6758M68721
17156E05479A76222p6885L59841A75204k7487L05278j30653A15345L29546A39183
17145A17495J01569J82161k00489m6496J08515K82582j36554o1223o2917j1642
17135B73001E0114M76943k42632k6017n0339j7876J85726J056j82899K9294L38283
17124E61653k51077J96934L7857A04719K24350J63756B19611Q7252L36937k02262
17114D41538A83618R4470m1147L26415A40238K21288j8120j21201J54001p0211
17104C05995I9125K16784J3173r1113A7170K59350o9503R5940K0029l0458M6926
17093C39454M0759p50R5710A93977L21309B51035J69615M2128J02777r6678k32407
$$ y = [221410, -145456, 389472, 282004, 186099, 68706, 137906, -77927, 93873, 314945, 36758, 505479, 176222, 99337, 459178, 175204, 147717, 452995, 322342, 115345, 444891, 139183, 117495, 219064, 401225, 200736, 154240, 262755, 545337, 408783, 347560, 284643, 273001, 50114, 527057, 284425, 258408, 208069, 190193, 375919, 376975, 194076, 223370, 561653, 310576, 507510, 545367, 104719, 329069, 492825, 219611, 306863, 643800, 441538, 183618, 278088, 236941, 563356, 140238, 361526, 343406, 222205, 376206, 305995, 99125, 315909, 329082, 237969, 17170, 276520, 207017, 302957, 322986, 292528, 339454, 380213, 379463, 475173, 193977, 515286, 251035, 420650, 462778, 565555, 468877, 236470]
17082B36470J23228L8316k1704j78620M52202j02657j44600A36360K02757L79172
17072G18289a709A49277K02226J03076j6782p5217A64346A8184L57998n6245J90132
17061E10069B53615k1441f0872F05661j28239Q1178n2986n7241K2375L4933J55976
17050F61657l19646j38132L99584B47644K07537G8570M42484j66424L68809k1778
17040G01661l40185j64682M26385N1243L27064B04438K17630a0040E92034j45027
17030D47007J3673j53813L35135q5146J40479B61908J16791j56446N80312k80418
17020E22147j65554J84956B54815N69577j92150p1921k74605L00810k45134J28068
17010D69460L77029k57773J05982p8300k6406M6662K88155m60426J86122k71532
$$ y = [236470, 359698, 398014, 376310, 197690, 649892, 547235, 402635, 136360, 339117, 718289, -1709, 149277, 351503, 454579, 437797, 362580, 164346, 18184, 376182, 319937, 510069, 253615, 232174, -60872, 605661, 477422, 558600, 505614, 448373, 470748, 505681, 661657, 342011, 203879, 603463, 247644, 455181, 78570, 521054, 354630, 723439, 701661, 361476, 196794, 623179, 674422, 1001486, 204438, 422068, -10040, 592034, 447007, 460680, 306867, 642002, 556856, 697335, 261908, 378699, 222253, 802565, 522147, 356593, 541549, 254815, 824392, 632242, 560321, 285716, 586526, 341392, 469460, 846489, 588716, 694698, 616398, 589992, 636654, 924809, 464383, 650505, 378973]
17000C78973M75251j18177n9200r5148o4811j80213J74250K72395l24850Q7361
16990E45831j60412J75080K40113k29212n6202K69809M2988j77310j97468N64747
16980A017964l20388j78022P9906O5031j00263p7945J15077J6274J88932k35356
16970E71210L21824K4671O618p3376R7663J53695l33797R0128j64488J4538J40199
16959H48885L7532j6357K4588J26359l98962L42348l22240L14025k37056J43725
16949H62847J95629k52570M46349l63991O607K52482J27769k7063k33602k27345
16939G87112K6461k45522L86271j55884J53775N8548n2064j31249l15924M55858
16929I67382k44674J75050N7099j45849J45294J60483p9548j04587N72846k65773
$$ y = [378973, 854224, 736047, 676847, 581699, 516888, 336675, 510925, 783320, 458470, 545831, 385419, 560499, 800612, 571400, 515198, 785007, 827995, 650685, 453217, 1017964, 697576, 519554, 599460, 664491, 564228, 486283, 601360, 617634, 806566, 571210, 893034, 917705, 924323, 850947, 948610, 1102305, 768508, 858636, 694148, 708686, 848885, 886417, 870060, 894648, 1021007, 622045, 964393, 642153, 956178, 719122, 862847, 1058476, 805906, 1252255, 888264, 894871, 1147353, 1275122, 1248059, 1014457, 787112, 813573, 568051, 954322, 798438, 952213, 1010761, 958697, 827448, 511524, 967382, 722708, 897758, 954857, 809008, 954302, 1114785, 1035237, 930650, 1503496, 1237723]
16919A237723Q1946j33967j90285Q4716J049K00276l73083L21226k241M80709
16909A708069o37070o9041N04871n5658j7015Q587j18974j12858K12919j5316
16899A408514n2352k0384l8515K5252R3819R9571K2670k2069o6543m436J64630
16888A610157k39879N93375n10667J26873k22204L29374k07672N00140m10123
16879A569374J06665Q9212j20406M24820m15025L64983j37960k48190L41620o3059
16869A912034p343N2658j65488J76685L80617j84533l32028J63433J74929K6048
16859B197012J14399N2881j61489j37999J49351J60482N1671K6943J91685k30506
16849B414430k94515L57128L13741m69872L35226J19399J24608j96820K97100
$$ y = [1237723, 1319669, 1185702, 995417, 1080133, 1081182, 1281458, 908375, 1229601, 1227360, 1708069, 1070999, 1001958, 1506829, 1451171, 1434156, 1442743, 1323769, 1210911, 1423830, 1408514, 1356162, 1335778, 1297263, 1322515, 1416334, 1515905, 1538575, 1516506, 1449963, 1445527, 1610157, 1370278, 1963653, 1452986, 1579859, 1357655, 1687029, 1479357, 1979497, 1569374, 1676039, 1765251, 1644845, 2069665, 1654640, 2019623, 1881663, 1633473, 1975093, 1912034, 1904691, 1957349, 1791861, 1968546, 2349163, 2164630, 1832602, 1996035, 2170964, 2197012, 2311411, 2364292, 2202803, 2064804, 2214155, 2374637, 2426308, 2453251, 2644936, 2414430, 2119915, 2477043, 2790784, 2320912, 2656138, 2775537, 2900145, 2703325, 3000425]
16840C000425J5020n25648M02268M698K05302o9292j58952J77052M2086j1281
16830C081678k41476O76387q5779n3917L1299J64674o6802K46095J71979o3194
16820C860944Q3154n76195Q97568j68512K02456J08799j41073J02941J70950j75273
16810D365759L44657O0786k2944K34653l83236O91517j46807j6506K07391M98658
16800E833928j62734Q2309j6647M12287L350M59196M5535O603J37577j32604O1045
16789F729845K68146M02281k36279L24252P3365K86760J82626L2560P21736k06659
16779H578633O16725L84278o3946j06174P12949J39306K86113K10215M33798L30077
16769A1521974K13422L62651L67868O45317L9659O86050K75490J4797P46760M73861
$$ y = [3000425, 3015445, 2489797, 2892065, 2896763, 3102065, 3032773, 2873821, 3050873, 3092959, 3081678, 2840202, 3516589, 3430810, 3376893, 3408192, 3572866, 3506064, 3752159, 3924138, 3860944, 3944098, 3367903, 4265471, 4096959, 4299415, 4408214, 4267141, 4370082, 4541032, 4365759, 4710416, 4771202, 4748258, 4982911, 4599675, 5291192, 5144385, 5127879, 5335270, 5833928, 5671194, 5753503, 5736856, 6149143, 6152493, 6611689, 6657224, 6663827, 6801404, 6668800, 6729845, 6997991, 7400272, 7163993, 7488245, 7561610, 7848370, 8030996, 8063556, 8785292, 8578633, 9195358, 9579636, 9515690, 9409516, 10122465, 10261771, 10547884, 10758099, 11191897, 11521974, 11735396, 12098047, 12465915, 13111232, 13150891, 13836941, 14112431, 14127228, 14873988, 15347849]
16759A5347849N64584O83472O74189M26360N44421O11839R13691M60887Q78138
16750B1105430R33101O63292J041744R39072R33408Q85336J637217P45699J590010
16741C0474309J442568J498337J469319J830525J421831K417785K062856J887177
16733D4504707K534448K275579K956256K785793K859745L619006L372348M165570
16725F9073452M162151M661119M063531N789038N920371N491739O273120O924063
16717A12358584P026821P498638P859965P796917Q325444Q498051P815862Q111569
16709A75291851P926334P062340O122143N491519M615580L200783J239368J43075
16701B11092993j496570k774657m364810n434560o637016o580451p716436q115810
$$ y = [15347849, 15912433, 16595905, 17270094, 17696454, 18240875, 18852714, 19766405, 20227292, 21105430, 22038531, 22701823, 23743567, 24682639, 25616047, 26501383, 28138600, 28884299, 30474309, 31916877, 33415214, 34884533, 36715058, 38136889, 40554674, 42617530, 44504707, 47039155, 49314734, 52270990, 55056783, 57916528, 61535534, 64907882, 69073452, 73235603, 77896722, 81960253, 87749291, 93669662, 99161401, 105434521, 112358584, 119385405, 126884043, 134744008, 142540925, 150866369, 159364420, 167180282, 175291851, 183218185, 190280525, 196402668, 201894187, 206509767, 209710550, 210949918, 211092993, 209596423, 206821766, 202456956, 197022396, 190385380, 183804929, 176088493, 167972683]
16693A67972683q019343q163989q175890q056992p742070p139640p341302o906775
16685A06426682o175242n770465n775085n474395m979665m794908m463627l807093
16677F5186202l884064l276622l383427l205964k820589k669451k365524k556122
16669D1024439j895488j508165j916367k030386j472145j663107j204989j328472
16661B8005320r66827j489657r39824j053783r22271j564203n50065o52913p70223
16652A9095554r40130m17501q90114n17268l18863p54374k95986r59014l01095
16643A3701209l52212k66493l09529m66627n30909k84657n31724k42758l83482
16634A0332818k74060o11403N24849n45962p55906j42079j10320m55007J53139
$$ y = [167972683, 159953340, 151789351, 143613461, 135556469, 127814399, 120674759, 113333457, 106426682, 100251440, 94480975, 88705890, 83231495, 78251830, 73456922, 68993295, 65186202, 61302138, 58025516, 54642089, 51436125, 48615536, 45946085, 43580561, 41024439, 39128951, 37620786, 35704419, 33674033, 32201888, 30538781, 29333792, 28005320, 27038493, 25548836, 24609012, 23555229, 22632958, 21068755, 20518690, 19865777, 19095554, 18155424, 17737923, 16847809, 16330541, 16011678, 15257304, 14961318, 14002304, 13701209, 13348997, 13082504, 12772975, 12306348, 11775439, 11490782, 10959058, 10716300, 10332818, 10058758, 9447355, 9972204, 9426242, 8670336, 8528257, 8417937, 7962930, 8116069]
16625H116069k11428l44906M02215o17302o87497L11971n66505M73468n97988
16616F278097L1960j0570k50938n27953J19980l64404O0011J94531k18752l37609
16606D974353M5179j08796m81506K67779j14713k58180L6163m9648J18300l72029
16596D056902L10686k07151m04236K44950j54799k47275P4637j36994r4803j17922
16586C323995m78012N37531r8459J05195k98765K45507k49879j47034p2075J64287
16576C032291j07312k45011L7665M87817n66869J43186j84286P815j65594j70383
16566B269319P930L35864k23312l54879M63609m106l73505L994O0553r6165j05586
16555A983716J16456L6302k03500l22590L74470k05081K34907m41238M8701J89410
$$ y = [8116069, 7904641, 7559735, 7961950, 7344648, 6657151, 6969122, 6402617, 6876085, 6278097, 6310057, 6299487, 6048549, 5520596, 5640576, 5276172, 5336183, 5530714, 5311962, 4974353, 5019532, 4910736, 4429230, 4697009, 4582296, 4324116, 4360279, 4310631, 4428931, 4056902, 4367588, 4160437, 3756201, 4001151, 3846352, 3599077, 3673714, 3536720, 3441917, 3323995, 2845983, 3383514, 3285055, 3390250, 3091485, 3336992, 3087113, 2940079, 2868004, 3032291, 2924979, 2679968, 2717633, 3205450, 2638581, 2781767, 2597481, 2605296, 2439702, 2269319, 2277249, 2613113, 2389801, 2034922, 2498531, 2494425, 2120920, 2124914, 2185467, 2089302, 1983716, 2100172, 2136474, 1932974, 1610384, 1984854, 1779773, 2014680, 1573442, 1622143, 1811553]
16545A811553J92756k8p2014l55181K68185n03436M37733j12482q1435j10010
16535A475641L45516l74659j3264J40956j05031k35782K99457m483k84908L47776
16525A591219m29352N29334j88037k67412O7084K09642m25420J66653Q1487k40743
16515A094455K59170j03048k59925L49541j53249j10870r9263o8463J60592l191
16505A065749L4092J8012l9907q4686j46740Q2668J94868k03647n1790J57730
16495A026349j39732J28388j44551J13365k84454L92263m55702k2894J24913J17294
16485H55239K53109k32814L8607j8306l51399M60820m8042m60867P23947l99002
16475H21292J0508j81286K0636N4943K14337P7100C24031N36001J73403m44159
$$ y = [1811553, 2004309, 2004281, 1932267, 1577086, 1845271, 1341835, 1779568, 1667086, 1585651, 1475641, 1821157, 1446498, 1433234, 1574190, 1469159, 1233377, 1532834, 1528351, 1243443, 1591219, 1161867, 1691201, 1503164, 1235752, 1302836, 1512478, 1087058, 1253711, 1335198, 1094455, 1353625, 1250577, 990652, 1340193, 1186944, 1076074, 976811, 908348, 1068940, 1065749, 1099841, 1117853, 1077946, 993260, 846520, 929188, 1124056, 920409, 868619, 1026349, 886617, 1015005, 870454, 983819, 699365, 1091628, 635926, 613032, 737945, 855239, 1108348, 875534, 914141, 895835, 544436, 1005256, 957214, 496347, 1220294, 821292, 831800, 650514, 671150, 726093, 940430, 1017530, 324031, 860032, 1033435, 589276]
16465E89276J31981J26297L07176m75703j9906r562J36845j46508P2697j22675
16455E89918L489p4311j17817J97685n7001L02714j91663k12768A91493K27719
16445D19212Q7321l2423J31998O1556q5428k4779K16694k68875B09997N86619
16435G96616E4163N66831k19384K02295r4129E0402L22683K08879j95318K84969
16425F71615k78461J43764j4454q9739M7831j27395J75227J47941k78440j26481
16415B71408K44629B50075L41158k26632j25231j0482K63127M86469m78619n3410
16405D46455l3783O5457B12087J92534j22618p503L30623I6288M45585j18895
16395D22978j07219N1197j67225K44964j06817n3913p9886a9530B46968H473L52445
$$ y = [589276, 721257, 847554, 1154730, 679027, 659121, 649559, 786404, 639896, 712593, 589918, 593407, 519096, 401279, 598964, 541963, 844677, 653014, 440246, 191493, 419212, 506533, 474110, 606108, 667664, 582236, 557457, 774151, 505276, 209997, 796616, 54163, 620994, 401610, 603905, 509776, 50402, 373085, 581964, 386646, 671615, 393154, 536918, 522464, 432725, 480556, 353161, 528388, 676329, 397889, 271408, 516037, 250075, 591233, 364601, 239370, 228888, 492015, 978484, 499865, 446455, 412672, 478129, 212087, 404621, 282003, 274500, 605123, 96288, 541873, 422978, 315759, 366956, 199731, 444695, 337878, 283965, 204079, -19530, 246968, 8473, 360918]
16384C60918J60252m1803A23987K6651K97492o7137j57274q281a27938C45589
16373C41922O1014C2926R0541D205L31756A39896L3031i3565D04457B4912M83631
16362E08543A70972J56606M7864j54194q4838n384L07056k14045j3806L05656
16352E15887j49606L6987K9415Q6800j71033J48261l7156J077J35295B65409P5857
16341C41266m2112G3775M08886C8273L20601h1658B55305I4071J80837f1620D23888
16329G6959l6145K48618h5319A61648p4973b48210h770C69769j49752J7245L638
16318B40900K4697f2304b133B25905q5022K70621q1817A32824I491K64439K60650
16307E34580B25699n6453l000k3520K79652j06919M5390K87764a21586A12641
$$ y = [360918, 521170, 479367, 123987, 150638, 448130, 380993, 223719, 215438, -127938, 345589, 341922, 402936, 32926, 123467, 4205, 335961, 139896, 172927, -93565, 404457, 24912, 508543, 170972, 327578, 375442, 221248, 136410, 131026, 438082, 224037, 210231, 515887, 366281, 403268, 432683, 519483, 348450, 496711, 459555, 460632, 595927, 265409, 341266, 299154, 73775, 482661, 38273, 358874, -81658, 255305, 94071, 274908, -61620, 423888, 76959, 40814, 289432, -85319, 161648, 86675, -248210, -8770, 369769, 220017, 237262, 240900, 265597, -62304, -2133, 225905, 140883, 411504, 329687, 132824, 9491, 273930, 534580, 225699, 169246, 166246, 142726, 422378, 315459, 360849, 648613, -121586, 112641]
16296A4571K0509Q0104K43531j36057J30443j44513H7496r886K09971r7966L18481
16285E08096a38592L4573B79633f4858B37720j17384P7051d7439B5104L67656
16275C92760A72688D0803K7240Q3638i2571B97344j05781A172J61820o8859J96745
16264B90878c7561j02274C09564f8063I2387K60096G7599b01029f5212C06872
16253A03186O2975J02324h7004A52508a40693B10233R2689J961a42653L2793A74816
16241a69304A56232L6996P177D7423a04303A47341C8368j6304b19941B80599J26456
16230D07055j94244H1141M13023K8073e7482o6263C18885F9220j1846K21343m0547
16219B38170F7081K3111K13286n5905O3336j11481J10019e2837A08335J57267
$$ y = [14571, 35080, 115184, 358715, 222658, 353101, 208588, 87496, 77610, 287581, 189615, 508096, -138592, -104019, 279633, -64858, 237720, 120336, 197387, -47439, 25104, 392760, 172688, 40803, 68043, 151681, -92571, 297344, 191563, 1172, 162992, 94133, 290878, -37561, -139835, 309564, -68063, 92387, 352483, 77599, -201029, -65212, 306872, 103186, 166161, 268485, -87004, 152508, -140693, 210233, 302922, 304883, -142653, -109860, 174816, -169304, 156232, 193228, 200405, 47423, -104303, 147341, 38368, 22064, -219941, 280599, 407055, 212811, 81141, 494164, 522237, -57482, -123745, 318885, 69220, 57374, 278717, 238170, 67081, 90192, 303478, 247573, 310909, 199428, 309447, -52837, 108335, 265602]
16209B65602A17110B8206J42869o3440J76071A5156K82018A3491Q5138c4940k28227
16198b63167C7364b2544A58734A0905L65733F0491K60142f47634b33157a06932
16187c646n05239E331N7983M9355n123L5660C7908g3455E6240k2908N4683a16979
16174g6082B47195A20817B1563J69476M9254J52369b52310r1713q5468C7489a38867
16162e3472N001P139j95599B65386a77903A60672b32816A30302K43624a90681
16151A58353c0985j08277B08445a11147I8880n362A2332J93785d0217j06672A73185
16139b70609H0209d1088j03194j36033a0328k17660o4621f981j02764j69166c3254
16127A87493E2953O3186d07665A49871b19777I1303c6161A61653a45289L6624
$$ y = [265602, 117110, 28206, 171075, 107635, 283706, 15156, 297174, 13491, 98629, -34940, -263167, 37364, -22544, 158734, 10905, 376638, 60491, 320633, -647634, -233157, -106932, -3646, -508885, 5331, 63314, 112669, 107546, 143206, 37908, -73455, 56240, 33332, 88015, -116979, -76082, 247195, 120817, 21563, 191039, 240293, 392662, -252310, -344023, -429491, 37489, -138867, -53472, -48471, -41332, -236931, 265386, -177903, 160672, -232816, 130302, 373926, -190681, 158353, -30985, -139262, 208445, -111147, 98880, 93518, 12332, 206117, -40217, -146889, 173185, -270609, 80209, -41088, -144282, -280315, -10328, -227988, -292609, -6981, -109745, -278911, -33254, 187493, 52953, 116139, -407665, 149871, -219777, 91303, -36161, 161653, -145289, -108665]
16117a08665A51566J44727a26705E4806b15927K9461G8398a32094O670a3828q020
16106b1848A85434c9696F6908b56556A39282R2396h3125c4628j26131A2524a86918
16094d5660K0222A06641k5063L10343j70036j07656n5399J8189J60440B2534K6949
16083D9483N5626e3403G6033a0259F572b01001A77224a23754F5501P6564c54385
16071F6379P6456c6134E6578b71905a02965c5129k23598A28145b968l25207K0576
16060c07599C42806A14820e2188K4100n8454B03543j01543J49919I297b67840
16049B23069B1371a08620j02567k7522A52397c76165D5781b44175E0369J32251
16039A82620F2408K7154A546Q6005b76967B706a38006A4505K27748c9088D73212
$$ y = [-108665, 151566, 296293, -126705, 54806, -215927, -186466, 78398, -132094, -125424, -13828, -21848, 185434, -39696, 66908, -256556, 139282, 231678, -83125, -34628, -160759, 12524, -186918, -45660, -25438, 106641, 81578, 391921, 221885, 114229, 58830, 77019, 237459, 22534, 49483, 105109, -53403, 76033, -10259, 6572, -201001, 177224, -123754, 65501, 142065, -354385, 66379, 142835, -36134, 56578, -271905, -102965, -35129, -258727, 128145, -2968, -328175, -307599, 342806, 114820, -52188, -28088, -86542, 203543, 102000, 251919, 9297, -267840, 223069, 21371, -108620, -211187, -238709, 152397, -376165, 45781, -244175, 50369, 182620, 62408, 89562, 1546, 87551, -276967, 2706, -138006, 14505, 242253, -39088, 473212]
16027F8206B7516L746e17199C67114b07576K7950B79104E215e2231B35281m2029
16016A93252c527p1921k75239A73515D223J36068K3383O8038a28272D6095b49249
16004a18898D5071J24950f6827H2753d8722A56366L6031a39146E970a74586D1644
15992f3737g662o0057G1297b66673G0591b42901A6692M2474q048c50173a00231
15980b07519P9875M3603D1018g9884h875l9976F8832a14569l4380A37047D0647
15968D05776a44214K9343C72269i679A1494R821J09245N3439h7672A1419K9707
15957D1126b33229J08707r1012D1100a97626i8626k4575A12819m544d5698P27
15946d4971C32128a47884N7422m8210l83745a58892j2744p4582i7618N987G9460
$$ y = [68206, 27516, 31262, -517199, 367114, -207576, -179626, 279104, 5215, -52231, 235281, 193252, -3527, -75448, -350687, 173515, 4223, 140291, 163674, 231712, -128272, 46095, -249249, -118898, 45071, 170021, -66827, 82753, -48722, 156366, 192397, -139146, 5970, -174586, 41644, -63737, -7662, -67719, 71297, -266673, 70591, -242901, 16692, 59166, 51118, -350173, -100231, -207519, -127644, -84041, 41018, -79884, -8875, -48851, 68832, -114569, -148949, 137047, 40647, 405776, -144214, -114871, 372269, -9679, 11494, 21315, 130560, 183999, -87672, 11419, 41126, -233229, -124522, -215534, 41100, -197626, -98626, -123201, 112819, 108275, -45698, -44971, 332128, -147884, -90462, -138672, -522417, -158892, -171636, -246218, -97618, -91631, 79460]
15934b09076P5888A19627c3804D0891h7054B37688a45416d9601k57575A75704
15923A05459O4022a22104e6398K5107M730p8980j03523k5722H9232h4762A29681
15911c68158a14554n9874g2687B16289B5617a14947C217i6707r1782g6610F1298
15899a03004l01871A17027b3916D8139P5011b66778j13727e998j34193e244l70789
15888c76033J39888B6151J02198f1577A36280O7148C3401b07154A40238A6232
15877a5568j98430B77551a8844D8967a12612e2532G1147a48511j9897c9183L269
15866c5914m6309q4218A9282c37725J7481A79008J01634c7832q7503A24230b92369
15854A213i0264j21181o7476J34718H8512J314b63341A00756a89725R675P7466
$$ y = [-209076, -133188, 119627, -33804, 40891, -87054, 237688, -145416, -49601, -307176, 175704, 105459, 169481, -122104, -56398, -31291, -26561, -105541, -209064, -234786, 89232, -84762, 129681, -368158, -114554, -174428, -72687, 216289, 25617, -114947, 3217, -96707, -188489, -76610, 61298, -103004, -404875, 117027, -23916, 48139, 123150, -266778, -380505, -5998, -140191, -5244, -376033, -236145, 26151, 128349, -61577, 136280, 203428, 33401, -207154, 140238, 16232, -15568, -213998, 277551, -18844, 48967, -112612, -52532, 71147, -148511, -168408, -39183, -35914, -82223, -166441, 19282, -337725, -320244, 179008, 280642, -37832, -125335, 124230, -292369, 1213, -90264, -211445, -278921, -144203, 88512, 89826, -263341, 100756, -189725, -180050, -102584]
15843a02584A57606o8860a82177K7156A53975K1798m7838g5799b0897E2120K5288
15832G7408J56186j06411J31205a95165O1220B21851A5738M1073K00002g0502
15821a18724B30150H8563B4266J11150a79954L7940o2323C0608a17085C61551
15810c69624j08214c8265k23362H3646b55008i832A57758E7721N895K34369k5046
15799B72939j19485a73826c7423j21993A1270a61906d9152B18124g174G9271a90622
15787a77799d5086n4187j6676F2412d93136A64252a91901j36683a41239A39377
15776e2120o5787n5771n5033F4163b65353a07502B58886C9057d02367e1932k24111
15765b76043b1242k89377J19896G4113A0355b31519h4580J7035A24793b89549
$$ y = [-102584, 157606, 88746, -182177, -155021, 153975, 175773, 127935, -75799, -20897, 52120, 77408, 233594, 127183, 258388, -195165, -133945, 221851, 15738, 56811, 256813, -70502, -118724, 230150, 88563, 24266, 135416, -179954, -142014, -204337, 30608, -117085, 361551, -369624, -477838, -38265, -261627, 83646, -255008, -9832, 157758, 57721, 63616, 297985, 272939, 153454, -173826, -37423, -159416, 11270, -161906, -49152, 218124, -7174, 79271, -190622, -177799, -45086, -99273, -115949, 62412, -493136, 164252, -191901, -328584, -141239, 139377, -52120, -117907, -173678, -228711, 64163, -265353, -107502, 258886, 39057, -402367, -51932, -276043, -21242, -310619, -190723, 74113, 10355, -231519, -84580, -67545, 124793, -289549]
15754a83834l07905a72329P5532A12678E2085d5010k02720I0445J67877G7826
15743e5103B91268a6948j04900m4785P7565A54562J01851E238K07522k8196E5917
15731a6329k20909j11654A80657a65130N4963n8358A59319K2746b41449Q7368
15721a54081n275C6790r798Q1301b44078P2237j07428d3050j23909J6334j32617
15710b83242g7219A9613g0200j01911C2375b33164c0666g34j61558P2607I410
15698F2423J07118M3131b3355j30336j53184k5910B8692a03731L3581k29624B6244
15686i2615K5441b935p6214k15823I0604J55260b10100d2800n7768J8871A80359
15674d6189l09720h6149C6596a09363C66264j54872r5469c53639G4840l3772K06151
$$ y = [-183834, -491739, -172329, -96797, 112678, 52085, -45010, -247730, 90445, 258322, 77826, -55103, 291268, -16948, -121848, -166633, -89068, 154562, 256413, 5238, 212760, 184564, 55917, -16329, -237238, -348892, 180657, -165130, -110167, -168525, 159319, 182065, -241449, -154081, -159356, 36790, 26992, 108293, -244078, -171841, -279269, -43050, -166959, -150625, -283242, -77219, 19613, -70200, -172111, 32375, -233164, -30666, -734, -162292, -89685, 9410, 62423, 169541, 212672, -23355, -153691, -306875, -332785, 28692, -103731, -70150, -299774, 26244, -92615, -67174, -2935, -79149, -294972, 90604, 245864, -210100, -42800, -100568, -81697, 180359, -46189, -355909, -86149, 36596, -109363, 366264, 211392, 115923, -353639, 74840, 41068, 247219]
15663B47219c31797f4203p1700p568j12772H5533g9176C8600a84340d1608A39192
15651a05325A72115h4910H2337R0837h3814b3547k59533G0148L4505J41364n9341
15640A86676C050J35428a7322C8215K65808h7926F261a61783d5603j15142I2920
15628I6293b44558A27698c5668A23873a22016e2844m8666A52536A1828a81183
15617B4337J28363a26204K1696B98049i884A47680b56229e7463A70527d4622B42414
15605F7764d26507h1341A60109a00342p1242M8885k1911B02985J66874c2286B9981
15593c9094l00160A34771b22428b8601C21910a44332j00719l9047A40523i5060
15582G0032O193K47824g9526K1953j56500O6825k6029f2201A9894K36775a26938
$$ y = [247219, -331797, -64203, -135903, -143471, -256243, 85533, -79176, 38600, -184340, -41608, 139192, -105325, 172115, -84910, 82337, 173174, -83814, -23547, -283080, 70148, 104653, 246017, 186676, 3050, 138478, -17322, 38215, 304023, -87926, 6261, -161783, -45603, -160745, 92920, 96293, -244558, 127698, -35668, 123873, -122016, -52844, -101510, 152536, 11828, -181183, 24337, 152700, -126204, -104508, 298049, -9884, 147680, -256229, -57463, 170527, -44622, 242414, 67764, -426507, -81341, 160109, -100342, -171584, -122699, -144610, 202985, 369859, -32286, 29981, -39094, -339254, 134771, -222428, -28601, 321910, -144332, -245051, -284098, 140523, -95060, 70032, 76225, 324049, -79526, -57573, -214073, -147248, -173277, -62201, 19894, 256669, -126938]
15570a07370B16342B9787d28783g7194A05172h3941C0030a43901A7458a67252
15559c7138l4128A44140d9491p5658k52881a25549C4323J81297c20276K5397B89033
15547F8545c18500a54140p6095A04828m0291h8646j34905N8797D8104b37094O2224
15536a74870A08523O1563a27618H3311c5781r1141J3646C10926j54500g5020E4074
15524A60817a68475P349B4888M1861a97176O1955F9065b21172N7925B04926B2939
15512A19681a93040K0801A85869c0749F541c3398D3419J35035E7437J5732a08996
15500d0946A61386b2794F8091a6288B1337a00066D5187e1782j09552A74569h5884
15488D5266a58109g0132k8048l124C0248e648j72516D1560O4868i1506E5127g2052
$$ y = [-107370, 216342, 29787, -428783, -77194, 105172, -83941, 30030, -143901, 17458, -167252, -37138, -71266, 144140, -49491, -125149, -378030, -125549, 34323, 215620, -320276, -294879, 289033, 68545, -318500, -154140, -230235, 104828, 64537, -88646, -223551, -164754, 48104, -237094, -174870, 108523, 170086, -127618, 83311, -35781, -126922, -113276, 310926, 156426, -75020, 54074, 160817, -168475, -161126, 24888, 66749, -197176, -135221, 69065, -221172, -163247, 204926, 22939, 119681, -193040, -172239, 185869, -30749, 6541, -33398, 43419, 178454, 57437, 73169, -108996, -40946, 161386, -22794, 68091, -16288, 21337, -100066, 45187, -51782, -161334, 174569, -85884, 45266, -158109, -70132, -98180, -101304, 30248, -5648, -178164, 41560, 106428, -91506, 55127, -72052]
15475b78042B11104b05299E8019a48779j23973c6143m125p2959p9711A0609J6801
15464B7410J76957a89042E2123J05343A8937a05551a7143j31809F8768k5908I845
15452A49662e6525k94434e7803E1669d1976A22031N8875a27887A37469B6100a5203
15440a78873A73948m7018N7036C0898L5359Q3001G2580a01891q7588B48153a93992
15428C01798a44279E1080P2972g8432C1429c62118A20694R5309a0499l2409A9123
15416H2946M5111A0629c00982a40529D39021a5007q6395q4315C37419g0960F3204
15404D60182a03889l8372l0779a0441p8047j02417A46070g3384j63771a10649
15393b52308E07652h7859B29384a06510o8651N4697p3556j23179J54911B18622
$$ y = [-278042, 211104, -205299, 58019, -148779, -272752, -36143, -40268, -113227, -192938, 10609, 27410, 204367, -189042, 52123, 157466, 18937, -105551, -17143, -148952, 68768, 42860, 9845, 149662, -56525, -350959, -57803, 51669, -41976, 122031, 180906, -127887, 137469, 26100, -15203, -178873, 173948, 126930, 183966, 30898, 66257, 149258, 72580, -101891, -189479, 248153, -193992, 301798, -144279, 51080, 124052, -78432, 31429, -362118, 120694, 216003, -10499, -42908, 19123, 82946, 128057, 10629, -300982, -140529, 439021, -15007, -101402, -185717, 337419, -70960, 63204, 460182, -103889, -142261, -173040, -10441, -88488, -190905, 146070, -73384, -237155, -110649, -252308, 507652, -87859, 229384, -106510, -175161, -120464, -194020, -317199, -162288, 218622]
15382B6017L05484b37010A29530a42800A02772k6524b59168g0800A08224R7463
15372B05687P6985A6006L31435g522l14249J50022A19161L7199a79086A46471
15361I0033K38632g6548A52085n2418b12415j13026D1364a51373f5479j43737
15351b09216c3228j30268c7805j5399A19578R0822f2894A6052C054b938A65893
15339D93808C0444c02779J31888B4475h8785l71082H8791J26736l2287a44122
15328A83605a43395J6399q2173C09139b0337j38499j27636F9670a5046C4796a45129
15316B28292G9034L9520j4389d31434a40924k08467B00596b11540j0190C20423
15305f730D48964g0771L2871B62409b5278e177A82924B9253R6888b1101k50493
$$ y = [26017, 331501, -237010, 129530, -142800, 102772, 76248, -259168, -70800, 108224, 205687, 282672, 16006, 347441, -7522, -321771, -171749, 119161, 156360, -179086, 146471, 90033, 328665, -76548, 152085, 99667, -212415, -325441, 41364, -151373, -65479, -209216, -33228, -163496, -37805, -53204, 119578, 210400, -62894, 16052, 3054, -2938, 165893, 493808, 30444, -302779, -170891, 24475, -88785, -459867, 88791, 215527, 183240, -144122, 183605, -143395, -126996, -209169, 309139, -20337, -158836, -286472, 69670, -15046, 34796, -145129, 228292, 79034, 118554, 104165, -431434, -140924, -349391, 200596, -211540, -221730, 320423, -6730, 448964, -70771, -37900, 262409, -25278, -5177, 182924, 29253, 126141, -21101, -271594]
15294b71594o5679a01813A71463d410D5926b35483B51758R2634E9628k603b656
15282C75160h4439L0719e860A9769J4609L04852b6694A0985K4664P82b8514j3874
15270d2388l36606d4241o1326g505B85258c9967A49732J3436J40898C080Q539
15259A1619L8587c17350e6620c561A16920a87678B68709E2960G637f9798K1578
15248d8220J9136B57273I0919J5947a31119A13099B3371f2851D9073K20046J53082
15237D22201r3803J91731M64625L4137k06589J10292j72750B17588O1782A37655
15226C61500d5682E7155b75025H4251O443K39762K996d5834B54844f2130B68103
15214C28548r1000e7065c899C97K05118K25493C3024M3894k4177K10014h0887
$$ y = [-271594, -337273, -101813, 171463, -4410, 45926, -235483, 251758, 344392, 59628, 57025, -2656, 375160, -84439, -53720, -5860, 19769, 34378, 339230, -26694, 10985, 35649, 36431, -28514, -42388, -378994, -44241, -105567, -7505, 285258, -39967, 149732, 163168, 304066, 3080, 11619, 50206, -317350, -56620, -3561, 116920, -187678, 268709, 52960, 7637, -69798, -48220, -29084, 257273, 90919, 106866, -131119, 113099, 23371, -62851, 49073, 269119, 422201, 328398, 520129, 984754, 1018891, 812302, 922594, 749844, 217588, 279370, 137655, 361500, -45682, 57155, -275025, 84251, 90694, 330456, 333452, -45834, 254844, -62130, 268103, 328548, 237548, -57065, -3899, 397, 205515, 431008, 33024, 76918, 52741, 262755, -80887]
15202D38074A129L27463F2463C0084L0666K62071e3234H4051g5706j48929E4838
15190C52564E5602J19274R917B049c15242B36479L09745G3237O7237E2741K05529
15179B58270a66547B8371J27212K32710b01597A6150L7557N8114k3614k6910d6304
15167A61338F7136L28131A41284a05289H2822L09081E7720A0128f3305A06108
15156a33791L6597B51846E316J67873L721m3703A9404J28655N4336j00186J43147
15145B45356b27221B09202l1885C4496b64218A16697A5285M44725a75962a3371
15134G2571J82972a53426D40107o3661A73597D6596B3126b2550A98109i7611C5324
15122C4733J49736H1068h4800A3008i7553B49705q2167K75061G1815J39990f1240
$$ y = [438074, 1129, 328592, 62463, 30084, 60750, 322821, -53234, 84051, -75706, -224635, 54838, 352564, 55602, 174876, 184793, 2049, -315242, 236479, 546224, 73237, 140474, 52741, 258270, -166547, 28371, 155583, 388293, -201597, 16150, 53707, 111821, 88207, 61297, -46304, 161338, 67136, 395267, 141284, -105289, 82822, 391903, 57720, 10128, -63305, 106108, -133791, -97194, 251846, 5316, 173189, 176910, 133207, 19404, 148059, 202395, 102209, 245356, -227221, 209202, 177317, 34496, -264218, 116697, 15285, 460010, -175962, -13371, 72571, 255543, -153426, 440107, 376446, 173597, 46596, 23126, -22550, 198109, -97611, 35324, 34733, 184469, 81068, -84800, 13008, -97553, 249705, 167538, 442599, 71815, 211805, -61240]
15110E6781J74515f8788j26521B62453r796J22544A62035G1551J79300e1352A95951
15098i3397A78183n2347J70789j31602K84065o1621c381p6746A29710N7871a84953
15086D03045c5244B19855D2159K79436K1557A42878A5886J27830m3031M0015K60705
15075D01405j60944h0513I6523l8714R0002C6515J98509d7864L683B13378O1175
15064B74553E5935i9698B07339M55744A65022J71901G7635L4919P7319K0742E990
15052d128C67070a85A13468J61919j36528K56196A85215d7550B69731i3135j13653
15041b06788I1106Q9647K0136b2683B82256r1844n9700b47959d4753B08712a20490
15029B86897m8506P7773a50846C01842B9917M16921I3976l5960a24426D63435
$$ y = [56781, 231296, -68788, -195309, 262453, 252657, 375201, 162035, 71551, 250851, -51352, 195951, -93397, 178183, 125836, 296625, 165023, 449088, 387467, -3381, -80127, 129710, 187581, -184953, 403045, -35244, 219855, 42159, 321595, 343152, 142878, 15886, 143716, 100685, 140700, 401405, 240461, -80513, 96523, 57809, 147811, 36515, 235024, -47864, -44181, 213378, 274553, 55935, -99698, 207339, 663083, 165022, 336923, 77635, 112554, 189873, 210615, 5990, -4128, 367070, -185, 113468, 275387, 138859, 395055, 185215, -47550, 269731, -93135, -206788, 91106, 180753, 200889, -22683, 282256, 190412, 130712, -247959, -44753, 208712, -120490, 286897, 238391, 316164, -150846, 301842, 29917, 446838, 93976, 58016, -124426, 463435]
15018A01451J09620L7048j13093E107K37649a14877A91640d8618e561D43175j86617
15007B56558m0827I6449J49465k81P9334k7710j43620J14649A29756D3912J24152
14996A68064J71830j23649j01120L66121B33008n3602J51331R1298j06942H8731
14985B35188M1299k6046q8579b8833B90270Q6041j64279K21623A37960R6913n1352
14974A83521J11223o3944J23750j00630q7191O5642r1766a371D50622B02760K43598
14963D46358C0087K14693J02889H0872J18532L9523J55532f6235B95881n8862
14953B37019m2297J27968j40913K57437q5869Q023k487j36571q956a00056A70147
14941A99347J47818J36357j897o7152k7800F9826L31429m8186j68662P445R4145
$$ y = [101451, 211071, 248119, 135026, 5107, 242756, -114877, 191640, -48618, -5561, 443175, 256558, 215731, 96449, 245914, 245633, 324967, 297257, 153637, 268286, 129756, 43912, 168064, 339894, 216245, 115125, 481246, 233008, 179406, 330737, 422035, 315093, 88731, 235188, 276487, 250441, 161862, -28833, 290270, 376311, 212032, 433655, 137960, 234873, 183521, 294744, 230800, 354550, 253920, 166729, 232371, 140605, -1371, 450622, 202760, 446358, 30087, 244780, 347669, 80872, 199404, 238927, 394459, -66235, 295881, 237019, 194722, 322690, 181777, 439214, 353345, 361368, 358881, 222310, 213354, -100056, 170147, 199347, 347165, 483522, 481625, 414473, 386673, 69826, 401255, 353069, 184407, 191852, 285997]
14930B85997M861B7663J29189K24629j60863J35821P8441j01993k3844n5609j8187
14919B35247j10027K81106n3742L7670J35742n5803A55806J70152G2147L54140
14909D26287K3221j60550K4705q1783d9932A58879L06685A20845L01305o7168
14899C54982j08128N4407K2033J6267j9536R0670j4545j16458H9811k820J52346
14888B39337F7342M62135J10092F1985n670L4403k2933K07055O8017K96052k81191
14877C57718j18846J7920L13651A85875K04898r4151A38196L83929A99309m4700
14867A54609J56453J82308k09057K65399g2520D75453j88928L5273p7217K47307
14857D91888L50671B97430J7513K37673B56723L90398k61929K53774N0445B51193
$$ y = [285997, 290858, 27663, 156852, 381481, 220618, 356439, 434880, 332887, 309043, 253434, 235247, 125220, 406326, 352584, 390254, 525996, 470193, 155806, 325958, 72147, 426287, 449508, 288958, 313663, 231880, -49932, 158879, 465564, 120845, 422150, 354982, 246854, 301261, 323294, 339561, 320025, 410695, 396150, 279692, 89811, 86991, 239337, 67342, 529477, 639569, 61985, 56315, 90718, 67785, 274840, 342857, 638909, 357718, 238872, 256792, 570443, 185875, 390773, 296622, 138196, 522125, 199309, 154609, 311062, 493370, 284313, 549712, -72520, 475453, 286525, 321798, 244581, 491888, 842559, 297430, 314943, 552616, 256723, 647121, 385192, 638966, 689411, 251193]
14846C44443J57313B27790H6560L38657J03566k1955A27593J27846M47057k65342
14836D37154P819M4467A81407L77784A97775K70311j01174N0309m8886j8559n2139
14825B97637q875K39780k09465P7955N9485R0795j39351Q8176L4934k11932L49905
14814F69044o9836q2734N2887j29133j33248L52927B74805l8646N68756l55258
14804D49657N1264J36239J10157k89022K70785j15880K4096J29464l44659q7764
14794C34337J73545r1005j55657j26581N15833j21550j19063L18045j96558K02266
14784G33612C42073J51592L7215K07571k79252L61433m9671l12345K79739l35085
14774D03270J73918A38425N28117j36607l9262n2807K45661l20454J08824K46529
$$ y = [344443, 501756, 227790, 86560, 425217, 528783, 506828, 127593, 255439, 702496, 437154, 444973, 489440, 181407, 559191, 197775, 468086, 366912, 417221, 368335, 349776, 297637, 288762, 528542, 319077, 397032, 456517, 547312, 407961, 496137, 531071, 319139, 669044, 599208, 516474, 569361, 440228, 306980, 659907, 274805, 236159, 804915, 449657, 500921, 637160, 747317, 458295, 729080, 613200, 637296, 766760, 422101, 334337, 507882, 416877, 261220, 134639, 650472, 528922, 409859, 727904, 531346, 733612, 342073, 493665, 530880, 738451, 459199, 820632, 770961, 458616, 738355, 403270, 577188, 138425, 666542, 529935, 490673, 437866, 683527, 363073, 471897, 718426]
14764G18426R9201l59291N7912n4695J85572o1591O6309L2688j02942J46792j96147
14753E32234K02826k33834j69817L64941k73156L24655K13332k15661B53931L11270
14743E65201l5329M23863D51573K47655k99J21123J09963m08180J89410p100j7688
14732F86457K06806j01036r2774k8907K92791l76628B56148L94496j78333K20774
14722F93085Q0163J46267k51464j32604l3611k8140N15165l75416J86760j22166
14712F78039k79331K36744K38679m30455O08477p9298m37007L08791l4893o7169
14702G42577K65143k58651Q9288j90798K61723J763K10351m19844J63173l36910
14692E27815L04110k61692M0709K35942L15898r7893j34207K33584j97561j31093
$$ y = [718426, 817627, 458336, 516248, 461553, 647125, 585534, 651843, 684531, 581589, 728381, 532234, 735060, 501226, 331409, 696350, 423194, 747849, 961181, 745520, 253931, 565201, 529872, 953735, 451573, 699228, 698929, 820052, 930015, 521835, 711245, 704145, 686457, 893263, 792227, 699453, 670546, 963337, 586709, 256148, 650644, 472311, 693085, 773248, 919515, 668051, 535447, 501836, 473696, 988861, 613445, 800205, 678039, 398708, 635452, 874131, 443676, 1052153, 972855, 535848, 844639, 809746, 742577, 1007720, 749069, 838357, 647559, 909282, 911045, 1121396, 701552, 864725, 527815, 831925, 570233, 610942, 846884, 1162782, 1064889, 930682, 1164266, 966705, 835612]
14682H35612K32134k19906o9110L06296k72448M3543j85812K67003C45731O92444
14672A038175K8452M7038j28256j09137K2399j0688K28338k78277r2657L40876
14662A086263j570Q022n9362m28789M04791j4386J04219p7245K79967q5999j14237
14651A101674M00481l16220p6208k82493O44954k9410m8332l76886J89037J39841
14641A346438j29548N6655j01253o3812k5333J54320M816J8835q9189k0641K11585
14630A362873j96151J43816k77837L1965L93393l28637K09248k28016J12001n6298
14620A166357Q236N01216j47837l47771J14911J05741l5289K51806k77825N12676
14610A852221n62927K22146J35890j62364N9706r9544J93841k1733J63964j50948
$$ y = [835612, 1067746, 847840, 778730, 1085026, 812578, 856121, 670309, 937312, 345731, 1038175, 1066627, 1113665, 985409, 876272, 898671, 887983, 1116321, 838044, 745387, 1086263, 1084693, 1092715, 1033353, 604564, 1009355, 994969, 1099188, 1021943, 1301910, 1215911, 1101674, 1502155, 1185935, 1109727, 827234, 1472188, 1442778, 1394446, 1017560, 1206597, 1346438, 1216890, 1273545, 1172292, 1108480, 1083147, 1237467, 1242283, 1261118, 1171929, 1151288, 1362873, 1166722, 1310538, 1032701, 1064666, 1458059, 1129422, 1338670, 1110654, 1222655, 1166357, 1174593, 1675809, 1527972, 1180201, 1295112, 1400853, 1365564, 1617370, 1339545, 1852221, 1289294, 1511440, 1647330, 1484966, 1544672, 1445128, 1638969, 1617236, 1781200, 1630252]
14600A630252M4890k02128J93705j75073J56121J5989o3746k57790K92093n4655
14590A579658L34911l66769J91923J7861m0277n374K14517k93601o5796L70303
14580A937356l00080L89076m22807L27885j88244R6537K8948L66888m06901J82949
14570B011607Q2955R5688l36623M83912l70692K26117K70747n79764L73274k19779
14560B037442J59456l49228M02308J31350k39599N1449M4390K05726j41191L77841
14550B679944J26172M7787q009j09069J79300L68130k73487M71128L41924P3459
14540C897279J80506L99730O67870O78645Q69842J446406K211362M719628P261631
14531B2332899R996376k621513j2231314o679714l345387j943117j105756o09303
$$ y = [1630252, 1675142, 1473014, 1666719, 1491646, 1647767, 1663756, 1600010, 1342220, 1634313, 1579658, 1914569, 1547800, 1739723, 1757584, 1717307, 1711933, 1926450, 1632849, 1567053, 1937356, 1637276, 2026352, 1603545, 1931430, 1743186, 1839723, 1868671, 2235559, 1828658, 2011607, 2094562, 2190250, 1853627, 2337539, 1966847, 2192964, 2463711, 1883947, 2257221, 2037442, 2196898, 1847670, 2249978, 2381328, 2141729, 2193178, 2237568, 2443294, 2302103, 2679944, 2806116, 2853903, 2845894, 2736825, 2916125, 3284255, 3010768, 3481896, 3823820, 3897279, 4077785, 4477515, 5145385, 5824030, 6693872, 8140278, 10351640, 15071268, 22332899, 32329275, 29707762, 17476448, 10796734, 7451347, 5508230, 4402474, 3793171]
14523C793171j48578o84458j39781J26935l64824L99185l80654o6496k69424J54144
14513B419220K01818k31776J71069N040l72984L06416K8846J09253k47322K66610
14503B656190O7930K35888m6375p10J26222k26923p3027K18569l7823J16881j62969
14492B873853K74734j30940r4216K21546j77901J95267j36800L33721j31085l7937
14482C190242L11887j27000Q2723k82542L19271n0656K01842L3792J07221K5849
14472C812629K04381l75906J60026K30275n3975K4622k88499J33426M15952m9434
14462D213497p354k9084J82514j06329M023k56216J123660p56155K41197k4271
14452D585482M4742J75686j67127L44488J02898l43405K86735J83370l42371J25774
$$ y = [3793171, 3644593, 2960135, 2820354, 2947289, 2582465, 2981650, 2600996, 2534500, 2265076, 2419220, 2621038, 2389262, 2560331, 2565371, 2192387, 2498803, 2527649, 2636902, 2389580, 2656190, 2724120, 2960008, 2913633, 2912923, 3039145, 2812222, 2739195, 2957764, 2919941, 3036822, 2873853, 3148587, 3017647, 2923431, 3144977, 2967076, 3162343, 3025543, 3359264, 3228179, 3190242, 3502129, 3375129, 3457852, 3175310, 3494581, 3443925, 3645767, 3679559, 3786780, 3812629, 4017010, 3641104, 3801130, 4031405, 3977430, 4002052, 3713553, 3846979, 4262931, 4213497, 4206143, 4177059, 4359573, 4253244, 4257267, 4001051, 5124711, 4368556, 4609753, 4585482, 4630224, 4805910, 4638783, 4983271, 5086169, 4742764, 5029499, 5212869, 4870498, 4996272]
14442D996272L63750K1885j30542J12947L53897J47789n22653L58103L00329l48886
14432E652891L86278J32075m14274M4723M26461m0513Q6657R5691N58066l47050
14422F581005K36265o6641J0979k9608M20613J0411J53952J5796J03322q9981
14412G346113L13138J93828k20759K57977J92075K39773R1079k50788L26997O6741
14402H556174o4860M23865J38532J31980K56639k08769J55630L59060L5189K20485
14392A0003925K13128R5071p450K51091J57780K18878L62870q942N26988l18105
14382A1495234O65941k00740M72945Q0730J66255K51866R5268L36063N7575L17721
14372A3738858M65976K28683J94878J06941J23691M65015J87574M43533M07560
$$ y = [4996272, 5360022, 5381907, 5251365, 5364312, 5718209, 5865998, 5343345, 5701448, 6001777, 5652891, 6039169, 6171244, 5756970, 5801693, 6228154, 6187641, 6274298, 6369989, 6928055, 6581005, 6817270, 6750629, 6761608, 6732000, 7152613, 7163024, 7316976, 7332772, 7436094, 7346113, 7659251, 7853079, 7632320, 7890297, 8082372, 8322145, 8413224, 8162436, 8489433, 8556174, 8491314, 8915179, 9053711, 9185691, 9442330, 9233561, 9389191, 9748251, 9783440, 10003925, 10217053, 10312124, 10304674, 10555765, 10713545, 10932423, 11295293, 11286351, 11813339, 11495234, 12161175, 11960435, 12433380, 12514110, 12680365, 12932231, 13027499, 13363562, 13421137, 13738858, 14204834, 14433517, 14628395, 14735336, 14859027, 15324042, 15511616, 15955149, 16362709]
14363A6362709K15144K30272N5245M52521P50824K55965M25631M77327j7401N09110
14353A9717347M98016N49664K61660O38433r6903J050522P2733N92330N97210
14344B3881012M04492O85961Q97978L61267M07588O66142O56354R71412K58862
14335B9191068J005417Q77893P13195R22193N19086J009599Q97505J010030Q25036
14326C6971022R95432J203814J069837J224807J039329J454700Q19711J730380
14318D6509032J003629J853130J306291J582526J695299J438234K355797K077669
14310E9821607J814253K257007K154168K305539K140795K603474K524615K910896
14302G8532354K932259L216306L212284L432349L855777L650781M025135M700203
$$ y = [16362709, 16577853, 16808125, 16863370, 17315891, 18066715, 18322680, 18748311, 19225638, 19208237, 19717347, 20215363, 20765027, 21026687, 21665120, 21568217, 22618739, 22691472, 23283802, 23881012, 24285504, 24971465, 25869443, 26230710, 26638298, 27304440, 27960794, 28932206, 29191068, 30196485, 31074378, 31787573, 32709766, 33228852, 34238451, 35135956, 36145986, 36971022, 37966454, 39170268, 40240105, 41464912, 42504241, 43958941, 44778652, 46509032, 47512661, 49365791, 50672082, 52254608, 53949907, 55388141, 57743938, 59821607, 61635860, 63892867, 66047035, 68352574, 70493369, 73096843, 75621458, 78532354, 81464613, 84680919, 87893203, 91325552, 95181329, 98832110, 102857245, 107557448]
14294A07557448M137946M898629N142331N088091N921746O092942N973931O968416
14286A51781480P354184P431189Q164857Q054922R181599R506179R967131J0369655
14278B21811196J1265209J1460358J2045782J2915023J3417427J4114376J4728331
14271C11757702J4931110J4846905J4647687J4523325J3449756J2414058J1521698
14264D08092241J0630038R366966Q384373P644840O750905O331520M973471J703702
14256D63878056k63974L34778m086486q237966q261461j0204163j0229278j1142194
14248D11787312j2239500j1171345j3001316j2649279j2767312j3476645j2887092
14241C23594823j1905130j3405083j2986031j2251310j1801016j1564629j1280584
$$ y = [107557448, 111695394, 116594023, 121736354, 126824445, 132746191, 138839133, 144813064, 151781480, 159135664, 166566853, 174731710, 182786632, 191968231, 201474410, 211441541, 221811196, 233076405, 244536763, 256582545, 269497568, 282914995, 297029371, 311757702, 326688812, 341535717, 356183404, 370706729, 384156485, 396570543, 408092241, 418722279, 428089245, 436473618, 444118458, 450869363, 457200883, 462174354, 463878056, 463614082, 463948860, 459862374, 451624408, 443362947, 433158784, 422929506, 411787312, 399547812, 388376467, 375375151, 362725872, 349958560, 336481915, 323594823, 311689693, 298284610, 285298579, 273047269, 261246253, 249681624, 238401040]
14234B38401040j0447264j0641693r947981j0069267q998294q662833q938351
14227A70695357q314936q322580p072651p029963o176444n772682n661886n554819
14219A16789396n129564m442991m202032m045818m329244l779752l156773l262447
14211H4440775l495063k795383l034711k802977k512346k398312k150988k378889
14203F2872106j886351k113334j870194j791311j814952j076135k066373j359465
14195D8893991j429900j505443j041411p64323j716649j216016j285174j115510
14187C8819565p20898j113334p71150p80854j262734q46320q38530r50310m98572
14178C1036863q49837n91384r19921p06277o03629q58993l77942o13542o75650
$$ y = [238401040, 227953776, 217312083, 207364102, 197294835, 188296541, 179633708, 170695357, 162380421, 154057841, 146985190, 139955227, 133778783, 128006101, 122344215, 116789396, 111659832, 107216841, 103014809, 98968991, 94639747, 90859995, 87703222, 84440775, 80945712, 78150329, 75115618, 72312641, 69800295, 67401983, 65250995, 62872106, 60985755, 58872421, 57002227, 55210916, 53395964, 52319829, 50253456, 48893991, 47464091, 45958648, 44917237, 44152914, 42436265, 41220249, 39935075, 38819565, 38098667, 36985333, 36214183, 35433329, 34170595, 33324275, 32485745, 31535435, 31036863, 30187026, 29595642, 28675721, 27969444, 27365815, 26506822, 26128880, 25515338, 24839688]
14169B4839688o18093m90409k57836p13932m30355o10707r5800m66322m78580
14160B0677654j36877q61255l06755n17373l26927p3687o69758r4128o01088j70759
14150A6919047l10179j06047m85938m82760j44821p8866n08713R7375n99516r2392
14140A4207190n4197l69236k03621R4168k98214l56853j79857m40204J4064k63102
14130A2150138q6524k84840k44505J91751j36544n38574m4200k20438l67647k4583
14120A0394034j99021r7676k7802l35967j99688J12925l27522J11512j74279j46093
14110I110423m66437P4259J62739j33555m02403k1932N5372J47717m32615j96850
14100G896718l61860J26621j57088j23802K35674j68888l89666J1086Q6658m43615
$$ y = [24839688, 24221595, 23731186, 23473350, 22759418, 22329063, 21718356, 21622556, 21156234, 20677654, 20540777, 19679522, 19372767, 18855394, 18528467, 18454780, 17785022, 17690894, 17089806, 16919047, 16608868, 16502821, 16016883, 15534123, 15389302, 15310436, 14801723, 14899098, 14299582, 14207190, 14152993, 13783757, 13580136, 13674304, 13376090, 13019237, 12839380, 12399176, 12413240, 12150138, 12063614, 11778774, 11534269, 11726020, 11589476, 11050902, 11006702, 10786264, 10418617, 10394034, 10195013, 10097337, 10069535, 9733568, 9533880, 9646805, 9319283, 9430795, 9256516, 9110423, 8643986, 8718245, 8880984, 8747429, 8345026, 8323094, 8378466, 8526183, 8093568, 7896718, 7534858, 7661479, 7504391, 7380589, 7616263, 7447375, 7057709, 7068795, 7155453, 6711838]
14090F711838J65165j79364J98498m86376L1576j241l7313j06105j8518j79886
14080F098274L15885o02224J05961P4602P8467k19646r7567l56611K72058K1506
14070E690705j67817o3916j80173o7259j15599R8201k09056K91433m38887K10775
14060E048407R3840k55727K02006m22063Q9744j69817L38210j08468k88156m25876
14050D102100J19199Q6599p5378J52651k35355N9235m3661M19091l71115J73605
14040D386971n0346k30608p7327j40078K9330K96150j71344k00631J08522J6153
14030C966792l70691L41895k40397M8062j81336j38229R3145k67162j59614J63528
14020C255993N60324l27245l62486P3915K7185k30432J76295R706j08351j22078
$$ y = [6711838, 6877003, 6697639, 6896137, 6409761, 6441337, 6440096, 6402783, 6296678, 6278160, 6098274, 6414159, 5811935, 5917896, 5992498, 6070965, 5851319, 5753752, 5397141, 5669199, 5690705, 5522888, 5458972, 5278799, 5211540, 5095941, 5194142, 4985086, 5276519, 4837632, 5048407, 5142247, 4886520, 5088526, 4666463, 4756207, 4586390, 4924600, 4816132, 4527976, 4102100, 4221299, 4307898, 4232520, 4385171, 4149816, 4209051, 4165390, 4584481, 4213366, 4386971, 4336625, 4106017, 4028690, 3888612, 3917942, 4214092, 4042748, 3842117, 3950639, 3966792, 3596101, 3937996, 3697599, 3745661, 3564325, 3426096, 3519241, 3252079, 3092465, 3255993, 3816317, 3489072, 3126586, 3200501, 3227686, 2997254, 3173549, 3183255, 3074904, 2952826]
14010B952826J85051j22815k99622M82654l89674L8124o5231J360J36765j36267
14000B783171k50876K10709k05757O0686J32304k7784k86559N1962J44765Q4204
13990B696825l45914n4901K84316l62214J68794k0359M6085M75993n62230J18349
13980B444744M37585K7980M03330K99228N49383P77846J823095L465077O798246
13971A7026514J0474359K860212r821901o564757l849328k162982j593770n77426
13963E790921r54124l67679k94422k42898l69701l026l59120n8036j71709q3223
13953B886983m4019J13477k57241j43141q5204j89662K08871L0268o74731O99292
13943B544893k21644j20912K64826J28431n02842N8887J76293k38277q8638N5399
$$ y = [2952826, 3137877, 3015062, 2715440, 3198094, 2808420, 2846544, 2781313, 2782673, 2919438, 2783171, 2532295, 2743004, 2537247, 2597933, 2730237, 2702453, 2415894, 2467856, 2612621, 2696825, 2350911, 2296010, 2580326, 2218112, 2386906, 2366547, 2412632, 2888625, 2326395, 2444744, 2882329, 2910309, 3313639, 3612867, 4162250, 4940096, 6763191, 10228268, 17026514, 27500873, 30361085, 20539184, 13974427, 10125099, 7962117, 6368347, 5790921, 4836797, 4469118, 4174696, 3931798, 3562097, 3559071, 3199951, 3141915, 2970206, 2886983, 2842964, 2956441, 2699200, 2556059, 2470855, 2281193, 2490064, 2520332, 1845601, 2544893, 2323249, 2202337, 2467163, 2595594, 2092752, 2151639, 2327932, 2089655, 2001017, 2056416]
13933B056416m1469Q1690m57355L50656K61827o6599n10107K53520P6287J86300
13923B191166n49900M48208l53291J41776r01N1870k98521L50259k00782l28205
13913A451679L66339n6761j19643k84044L35430J10278l63300L51981q2603M0192
13903A749548K47934l31196n8781n0835O5123m1600J08407n2804q5261j87162
13893A363373J84670n32065N22636Q618o8576r0602L97883n29109K57244j66401
13883A347671J14781K05324k98068Q4266J3163j12070j48932R9666J90719k99051
13873A197469p4503L04101q1334P4124q9483j89903O8611j27291M14862K7904
13863A524557k26895J2112l73309p4357N20379J87574l25748Q7006j24769m8442
$$ y = [2056416, 2014947, 2096637, 1639282, 1989938, 2251765, 2185166, 1675059, 1928579, 2004866, 2191166, 1641266, 2089474, 1736183, 1877959, 1877058, 1928928, 1630407, 1980666, 1779884, 1451679, 1818018, 1761257, 1641614, 1357570, 1693000, 1803278, 1439978, 1791959, 1709356, 1749548, 1997482, 1666286, 1607505, 1556670, 1621793, 1580193, 1688600, 1635796, 1550535, 1363373, 1548043, 1015978, 1538614, 1547232, 1478656, 1388054, 1785937, 1256828, 1514072, 1347671, 1462452, 1667776, 1369708, 1453974, 1467137, 1355067, 1206135, 1305801, 1496520, 1197469, 1122966, 1427067, 1345733, 1419857, 1330374, 1140471, 1209082, 1081791, 1496653, 1524557, 1297662, 1309774, 936465, 862108, 1382487, 1570061, 1244313, 1331319, 1206550, 1158108]
13853A158108K56130k13606j04152j3885K94333k74144K5036K5587m0006n7467
13843A055934L16090o8480k68029J54538m22983M33379J79102N7111n02859K28316
13833A162119j46234P8411P7789j40696J18344l28897K23943L2278K06567j14414
13823A169210k7165n1243J50486k27974M7896J03474m49295L29407J02835L0480
13813A178111j25860l75080N68171l83901Q6831K60044j71144j908l01989P3528
13803H06803J27908J64073l49153O5030K64090j47414j19171L51105k32476L88612
13793A319407D24552L68254K3123M6141p8339N5221j01738k2966K81218j04101
13783H91365r9557K23019j19764k79539j01098O57849l80971L45964l18859k07309
$$ y = [1158108, 1414238, 1200632, 1096480, 1082595, 1376928, 1102784, 1127820, 1153407, 1113401, 1055934, 1372024, 1303544, 1035515, 1190053, 767070, 1200449, 1379551, 1436662, 933803, 1162119, 1015885, 1094296, 1172085, 1031389, 1149733, 820836, 1044779, 1077057, 1283624, 1169210, 1142045, 1090802, 1241288, 1013314, 1061210, 1164684, 715389, 1044796, 1147631, 1178111, 1052251, 677171, 1245342, 861441, 948272, 1208316, 1037172, 1035264, 733275, 806803, 934711, 1098784, 749631, 814661, 1078751, 931337, 812166, 1163271, 930795, 1319407, 424552, 792806, 815929, 862070, 783731, 838952, 737214, 714248, 995466, 891365, 791808, 1014827, 895063, 615524, 514426, 1172275, 791304, 1137268, 818409, 611100]
13773F11100O570L00862j23120C58073K07009N12748k3128Q3341k03380l10767
13763F23896Q7971M59409k18379l38961n2502O6351J65372J02914k55205K38711
13753H79577J13862j96448J57793j59470k74629R6675L43347k24873r6438J05640
13743G45036j08931L09335r7217j67499k12029K22231k20582L47756j81663O3933
13733G00370n5600M78195j85522k71595N3356j21459k08827j27575L19592L70753
13723I51688j89803k11515l1575L22991l51295K19975R6990k97633J06799J02544
13713G19166k02787J42555R7391k06924o7301J49699K24338j86692j14797k63457
13703B91191K68180J44750p5100j4766j76225K84784l47702J16459K34623j44632
$$ y = [611100, 617670, 918532, 795412, 358073, 565082, 1077830, 1054702, 1138043, 934663, 623896, 711867, 1171276, 952897, 613936, 561434, 627785, 793157, 896071, 640866, 879577, 993439, 796991, 954784, 795314, 520685, 617360, 960707, 735834, 639396, 745036, 636105, 945440, 848223, 680724, 468695, 690926, 470344, 818100, 636437, 700370, 644770, 1122965, 937443, 665848, 719204, 597745, 388918, 261343, 580935, 951688, 761885, 550370, 518795, 841786, 490491, 710466, 807456, 509823, 616622, 719166, 516379, 658934, 756325, 549401, 482100, 631799, 856137, 669445, 554648, 291191, 559371, 704121, 629021, 614255, 438030, 722814, 375112, 491571, 726194, 581562]
13693E81562j39714P4869j43965R2018B08549M30315L25730k04756R2055C76224
13682D53521J34018q2080p5798J65858R1356J18893B99908K67385J54589L1367
13672G53249k09735J91186k17111L30423k57054j02785K9208j96338L36504j36197
13662E21350K12287J92926l74667k64276k7820J1223N8166n1616K77351k37705
13652C17219N75175m08573K25385J08231A79033J92780J21630k21023J7412K74599
13642E64431q432j67772L21053q596C08288J80295M9658j58917l1148J11594m5419
13631D14351J54093p6949O26J46517j13042K01672J846e992B79545O5340R6744
13620D41629J45804A96938L79142j44349G3058Q0421K83778q9746J29628L3359
$$ y = [581562, 441848, 516717, 372752, 464770, 208549, 638864, 964594, 759838, 851893, 376224, 453521, 587539, 505459, 429661, 595519, 686875, 805768, 299908, 567293, 721882, 753249, 543514, 734700, 517589, 848012, 590958, 488173, 517381, 321043, 657547, 521350, 733637, 926563, 551896, 287620, 259800, 271023, 329189, 277573, 554924, 317219, 892394, 483821, 709206, 817437, 179033, 371813, 493443, 272420, 289832, 564431, 555999, 388227, 709280, 700684, 308288, 488583, 538241, 379324, 348176, 459770, 414351, 568444, 491495, 492121, 638638, 525596, 727268, 729114, -5992, 279545, 344885, 441629, 587433, 196938, 576080, 431731, 73058, 153479, 437257, 347511, 477139, 510498]
13610E10498l7810j18009L63262j20122k53431Q5420m5935J26415r3013j60961
13600B56314B9933L34572n4959j12263J93657Q5136j43020J10392N8724m7174
13590D54998k3966N258R3314k19254L08978l08193J72851j39983m7083J93825
13580D90745A55420M85085m444p0547n415R7359O4707A79976J20198G2240J17286
13569A89526C8354J65632J02750J04624K08567m4927k08651J79504B64387J96215
13559D60602j43255L4010r0465K1963M92626C17401n1449o3475J63246j18973
13549B46750N7196Q517R3089n1268A62972J75823L25813B65118K071J21993j0993
13538C78189A09705K75804J10502A98534l1130m0705O1006K88062A85537M5564
$$ y = [510498, 472688, 354679, 717941, 597819, 344388, 429808, 383873, 510288, 417275, 256314, 29933, 364505, 309546, 197283, 390940, 476076, 333056, 443448, 502172, 454998, 431032, 436290, 529604, 310350, 619328, 311135, 483986, 344003, 296920, 490745, 155420, 640505, 636061, 565514, 560099, 657458, 722165, 179976, 300174, 72240, 189526, 38354, 203986, 306736, 411360, 619927, 575000, 366349, 545853, 264387, 460602, 317347, 351357, 260892, 282855, 775481, 317401, 265952, 202477, 365723, 246750, 303946, 312463, 405552, 354284, 162972, 338795, 664608, 265118, 267189, 389182, 378189, 109705, 385509, 496011, 198534, 167404, 126699, 187705, 475767, 185537, 231101]
13528B31101K19766J14096k56361L9475n3455K9915K9234K3994A73138O03334
13518G76472B76347J38374j02985o4695L0097A29593j3813N2985J90373h57G7571
13506A73527J33068l1284j22186J25874K47708Q1454A97228p9967J48516p424
13496B58353o3586K25179N6434A32687M20464j41406K5502j96211M6177j29864
13486A57349k1396J88675A32624B9870K5908J19760K64032G6480K02408k6672
13476B52216i1818C89470Q1223o6220M3913r1069K46893o3434F0118K19082m7759
13465B31441P449l3641j7278J2076m6894O7771P7794L00193k20518H6599K20734
13454C07333K27326k25330j05028F3328b2312C01552j04466K24634n956A19897
$$ y = [231101, 450867, 564963, 308602, 348077, 294622, 324537, 353771, 377765, 173138, 776472, 276347, 414721, 311736, 247041, 277138, 129593, 115780, 168765, 359138, -857, 77571, 173527, 306595, 275311, 153125, 278999, 526707, 608161, 197228, 117261, 265777, 258353, 194767, 419946, 476380, 132687, 553151, 411745, 437247, 241036, 287213, 157349, 135953, 324628, 132624, 29870, 55778, 175538, 439570, 76480, 278888, 252216, -91818, 389470, 470693, 404473, 448386, 357317, 604210, 540776, 60118, 279200, 231441, 238890, 205249, 187971, 200047, 153153, 220924, 298718, 598911, 378393, 86599, 307333, 534659, 309329, 204301, 63328, -22312, 301552, 197086, 421720, 415764, 119897]
13443B58338J82313j12299m7864o6610K34041A99461l5852J7231a8557A84277
13432f0527h329B10750k401J10558K60739A17479J84863c687A47843M0738n7208
13421A31373J53881a40786D53428A90935K08069O2962B07027B210L22287m2706
13411B81791E8329j228K8621O646J59207q9428J80166b6889A80088J91877A77504
13399C27781A17073L2396L08679j62001a2968C17667j58573J39600a86683B72363
13388B33690J31185J7047I9662l4683L31307K06992k19517j02309C4475M3465
13378G7940K15757J20766K2417F714K96472A11314J80625j25714J3324H7255J80895
13367B68150q0084N1147C4806M7361J31267A8798K30982j12202J54986j02701
$$ y = [258338, 440651, 328352, 280488, 213878, 447919, 199461, 163609, 180840, -18557, 184277, -60527, -8329, 210750, 208349, 318907, 579646, 117479, 302342, -3687, 147843, 188581, 131373, 285254, -140786, 453428, 190935, 399004, 461966, 207027, 2210, 324497, 281791, 58329, 57101, 85722, 92368, 251575, 162147, 342313, -26889, 180088, 371965, 177504, 327781, 117073, 149469, 458148, 296147, -12968, 317667, 159094, 298694, -186683, 272363, 233690, 364875, 381922, 99662, 64979, 396286, 603278, 383761, 281452, 34475, 77940, 293697, 414463, 436880, 6714, 303186, 111314, 291939, 166225, 179549, 87255, 268150, 188066, 239213, 34806, 82167, 213434, 18798, 249780, 137578, 292564, 189863]
13357A89863P8737M3198K58569k25242j62063P958K0373q2871K26431l1427A25381
13345D09693B4268M70185j51151o7781j01019J16790K57655C5004K51712j39950
13335A46766K74932D5891K7804J8670N73790I0513J2046R669J68866m1615J15155
13324C54634j55095J06796K43856b79840G5435K26007j17855l1276b0550C28608
13313D06735P1969R6142k39372O3537j09887n9184P1918K09874m2102B21813J72777
13302C94590A46099K83273A67885L85102k45014o9771J12112E0831K00886m4929
13292B06788e4785j2960B50895b7712D26611A68539a46052A01530J26220a48249
13281C18172j01380M5729I0243N0025m3276J92737r4781a03612A19526n0985K66019
$$ y = [189863, 268600, 311798, 570367, 345125, 183062, 191020, 211393, 128522, 354953, 323526, 125381, 409693, 24268, 494453, 343302, 275521, 174502, 291292, 548947, 35004, 286716, 146766, 421698, 45891, 73695, 92365, 666155, 90513, 102559, 112228, 281094, 239479, 354634, 199539, 306335, 550191, -279840, 75435, 301442, 183587, 152311, -20550, 328608, 406735, 478704, 574846, 335474, 399011, 289124, 229940, 301858, 511732, 469630, 221813, 394590, 146099, 429372, 167885, 552987, 307973, 238202, 350314, 50831, 251717, 206788, -54785, -67745, 250895, -27712, 426611, 168539, -146052, 101530, 227750, -148249, 318172, 216792, 262521, 90243, 140268, 96992, 289729, 194948, -103612, 119526, 68541, 334560]
13270C34560H7633Q9569g7663A51476O0321k6221F5444Q5149O9177K7369q2762
13259A64377K82015H5907M5106L9347k2099b0551A64913m7994h6420F3958B7662
13247B34562p2917J71697I5477J07178J479a50841A1694d8798D47782i8731A36817
13235B24019Q9173J7842c9792B21179F3856O7464J2662Q9048n715H7958e7062
13223A87105K14317j25009J23812A19422h4251B29793B6484L77446C161N63847
13213E67008b22750C05616E9141K00182j24026n564M7886f2654o112A62457R3318
13202B55775n7197E3932j8604A176a43528A41076a46432G0307J70687L2305j17118
13191A56181J53749D7692b35573A61150k0323Q199b18046J07390A2367O0153P764
$$ y = [334560, 87633, 177202, -77663, 151476, 211797, 185576, 65444, 150593, 219770, 247139, 164377, 446392, 85907, 131013, 170360, 148261, -20551, 164913, 116919, -86420, 63958, 27662, 234562, 161645, 333342, 95477, 202655, 204134, -150841, 11694, -48798, 447782, -98731, 136817, 224019, 313192, 331034, -39792, 221179, 63856, 131320, 143982, 233030, 227315, 87958, -57062, 187105, 401422, 276413, 400225, 119422, -84251, 229793, 26484, 403930, 3161, 567008, -222750, 305616, 59141, 259323, 135297, 129733, 177619, -62654, -68766, 162457, 255775, 198578, 53932, 35328, 1176, -143528, 141076, -146432, 70307, 240994, 273299, 156181, 309930, 47692, -235573, 161150, 140827, 149026, -218046, -110656, 12367, 72520, 80284]
13180H0284J9151c06510c1372G3321n311K82160B4463J30280B3453J06531K5399
13169A55383C6983O1751B2834N5324J51062n6269e3620p654F0714L1040C1668
13157A10034C2527J82623M4606P964G6744L34739j59778c06024B90671b75850
13146D17352b89313f3983p3776B90685J92197g4036A85553d2280A7591J34152
13136A51743E2718K30356E3664K06163m0630r0121A5602M51339a28328A68508
13125B39527A00844A8711M2797j4761J9303b08053A24241C1772K24837A2760K07273
13114B20033a87343G3990b57049e8375A88189q9220J1777k9355R8887E7957J59224
13103B17181G5056N4726J84360b2967B71399I8384J51677D8318b8618j01780H6776
$$ y = [80284, 99435, -306510, -31372, 73321, 68010, 350170, 24463, 154743, 23453, 129984, 155383, 36983, 98734, 22834, 78158, 229220, 172951, -53620, -61274, 60714, 91754, 31668, 110034, 32527, 215150, 259756, 267720, 76744, 411483, 251705, -306024, 290671, -275850, 417352, -289313, -63983, -137759, 290685, 482882, -74036, 185553, -42280, 17591, 151743, 52718, 283074, 53664, 259827, 219197, 129076, 15602, 466941, -128328, 168508, 239527, 100844, 18711, 61508, 46747, 66050, -208053, 124241, 31772, 256609, 12760, 220033, -187343, 73990, -257049, -58375, 188189, 98969, 110746, 81391, 180278, 57957, 217181, 75056, 129782, 314142, -22967, 271399, 98384, 250061, 48318, -28618, -130398, 86776]
13091A92191f3445j50459N9446A63802L6360L6980a74107b4264l6528f086j08207
13080a14293l0067j30891A00318h3249B34370M0359J07746b28058C54329d6647
13069B56165j18122m3735K7432A1036J28770J66019r4666D6056P6014J5767P0296
13058B08133b79747D5179J44173h4995B69548A17361m0948h6410A69618P4615
13048B44233D7092b3483j35950A53548K17330e5656B91210b35795M5560A05186
13037B66447H9743e7139A73107N6160l1535K71329H3109J13023c8634C99156A21662
13025B30459E1976J97237d5580l1446A57678k1633d0388A66167c4426A47850a21548
13013C08120A9770L16219j22009a04727o3090J061J9865G6863K05062o7969b48896
$$ y = [192191, -63445, -213904, -154458, 163802, 200162, 237142, -174107, -24264, -60792, -6086, -114293, -144360, -275251, 100318, -83249, 234370, 274729, 382475, -228058, 354329, -46647, 256165, 138043, 94308, 121740, 11036, 139806, 305825, 211159, 46056, 122070, 137837, 208133, -279747, 45179, 189352, -84995, 269548, 117361, 76413, -86410, 169618, 244233, 47092, -23483, -159433, 153548, 370878, -55656, 291210, -235795, -190235, 105186, 266447, 89743, -57139, 173107, 229267, 197732, 469061, 83109, 196132, -38634, 399156, 121662, 230459, 51976, 249213, -45580, -77026, 157678, 136045, -40388, 166167, -34426, 147850, -121548, 308120, 19770, 335989, 213980, -104727, -167817, -166756, -146891, 76863, 281925, 213956, -248896]
13001H8874O8351C593f0709B12688J33360j04007m8166i9812A14672j7171K22479
12990C19980j06186I0905J57843F7851A1240a13435n9206A83593L79421B15396
12979B08811J09315a57286M7511j36064C0575J58809K68817B16023H3679I794
12968A47846a16526B73079A22672N9239Q9859E2687K28383A01555b01370B65046
12957A90802D0223P9409a59878P9083A76454a48219O4072B52074j17766J5560
12947A49868b04993A11204N674a01533a4915p8115A60447c28260a32153a5501
12936A06271J08713Q4920c6811F7810a2224G0136c9772A23928a11132E994J43797
12925A49791O9955b31031B00976h8867A30020g7703B88090c7191A20401m2920
$$ y = [88874, 157225, 3593, -60709, 212688, 346048, 242041, 193875, -99812, 114672, 97501, 319980, 213794, 90905, 248748, 67851, 11240, -113435, -172641, 183593, 563014, 215396, 208811, 318126, -157286, -109775, -245839, 30575, 189384, 458201, 216023, 83679, 9794, 147846, -116526, 273079, 122672, 181911, 271770, 52687, 281070, 101555, -201370, 265046, 190802, 40223, 119632, -159878, -80795, 176454, -148219, -84147, 252074, 134308, 149868, -204993, 111204, 116878, -101533, -14915, -93030, 160447, -328260, -132153, -15501, 106271, 214984, 299904, -36811, 67810, -12224, 70136, -39772, 123928, -111132, 5994, 149791, 219746, -231031, 200976, -88867, 130020, -77703, 288090, -37191, 120401, 77481]
12915G7481K4168b04309F2600M6637N3039K3312K4441C6341i312k8977A034c6962
12902A74368d5676r6395l9736d9159I0299F037J05209b4287I4034h7040C2149
12890b99556A49501a48247B81632a03129A66592k0767A9411b84463p4776b9476
12879a98318D58411k07364j24617J53693H4342k8121a41081C78571E4420J08182
12869A62602G4188a14232b0639j60396C50073A14788K8918a2772E452M1775K26209
12858B73436I4424f8562q2695A56878a98903A47684a27709E0784j2393a7423r0333
12847a07756L9324q3747P5260B80552k7895o1010B1971a45604B0848a10709A78956
12835i2928A30611J43105c29259H7663b73922b8235j0862A65673K7881a43548
$$ y = [77481, 101649, -204309, 62600, 109237, 162276, 185588, 210029, 36341, -9312, -38289, 1034, -36962, 174368, -45676, -142071, -181807, -49159, 90299, 6037, 111246, -24287, 94034, -87040, 32149, -299556, 149501, -148247, 281632, -103129, 166592, 145825, 19411, -284463, -359239, -29476, -198318, 458411, 251047, 126430, 280123, 84342, 56221, -141081, 378571, 54420, 162602, 74188, -114232, -20639, -181035, 350073, 114788, 143706, -12772, 5452, 47227, 273436, 94424, -68562, -151257, 156878, -198903, 147684, -127709, 50784, 38391, -17423, -107756, -68432, -152179, -76919, 280552, 252657, 191647, 21971, -145604, 20848, -110709, 178956, -92928, 130611, 273716, -329259, 87663, -273922, -28235, -39097, 165673, 193554, -143548]
12824D51409e3919A85096a51662A17876C8092J88309A0243a64868M7001M1364
12814g6503B95405e3092A06245a65701F6372K8486m2371f0659j25455H6351K41467
12803C27818A62836J40272F5156R8313D0180c39840A46739I095J1580K91123h9968
12791i164A35911b48845A96194n9752b39218D27430g1518A01915J95743l8507
12781B59151b08471B36530p5245M9761a57308f2274j94674C46534A21948C443
12770e9409j1487C13010b5756D1674J52894M1683A10081b30371g7833j81060E5197
12758C7001c22919C9191a52417k7717f5560k6433j89948H9968f0592G334K9181
12747C6515Q645M5796g2068C31573I6225B5045a16174i777A79051b06333A93196
$$ y = [451409, -53919, 185096, -151662, 117876, 38092, 226401, 10243, -164868, -117867, -76503, 295405, -53092, 106245, -165701, 66372, 94858, 52487, -60659, -186114, 86351, 327818, 162836, 303108, 65156, 163469, 40180, -339840, 146739, 9095, 20675, 311798, -89968, -9164, 135911, -248845, 196194, 136442, -239218, 427430, -71518, 101915, 297658, 259151, -208471, 236530, 161285, 211046, -157308, -62274, -256948, 346534, 121948, 3443, -59409, -70896, 313010, -25756, 41674, 194568, 236251, 110081, -230371, -77833, -258893, 55197, 37001, -322919, 39191, -152417, -180134, -65560, -91993, -281941, 89968, -60592, 7334, 36515, 45160, 90956, -72068, 331573, 96225, 25045, -116174, -9777, 179051, -206333, 193196]
12735g1344J3619A21700N1941a01423B49358F8008J74005c20545f4038A09316
12724A1022M69674b02777G3085J04451B1320J11559a49739C81520a07205o4306
12714a71511A80593A6535J8315M7632B3639Q3479b44286F49L6106a11291G5348
12702B75058A31298b2605I1860B9249R3708L7833A2888J01334j3375i3656A90003
12690F3930J62392k9582e9522A11041i4974A9110a23015D47673H1459P3371l7484
12679A17346I585b01874N223g6712b3569H3952a59082g6635A45300a93529L5227
12668a58302b0986D3026Q4967a50965A01709K00763A26940b6415B46664D0824
12657B12641p1735E9403K8449J19687m4554b8817B25244A4662b2911K007A02287
$$ y = [-71344, -57725, 121700, 173641, -101423, 249358, 68008, 242013, -320545, -64038, 109316, 11022, 480696, -202777, 73085, 177536, 21320, 132879, -149739, 381520, -107205, -171511, 180593, 16535, 34850, 82482, 23639, 107118, -244286, 649, 36755, -111291, 75348, 275058, 131298, -22605, 91860, 29249, 122957, 160790, 12888, 114222, 100847, -93656, 190003, 63930, 226322, 196740, -59522, 111041, -94974, 19110, -123015, 447673, 81459, 154830, 117346, 9585, -201874, -196651, -76712, -23569, 83952, -159082, -76635, 145300, -193529, -158302, -20986, 43026, 127993, -150965, 101709, 302472, 126940, -26415, 246664, 40824, 212641, 140906, 59403, 87852, 207539, 162985, -28817, 225244, 14662, -22911, -20904, 102287]
12645g2012A74592a83423k56913H3912h328B60070A3734K69028b6359E9368K27502
12634B86870A28583K54214A69543C8407a54199J1493C46153b82646D2324J1347
12624E3671K63975a5747A05223A6320f6860D4465r901a26516C14910k066o8675
12613B44169K67872j17566D4842A1289L7514O6078L6829o2597J4913L00412a28649
12601E4392c92391A56315F7245i3701j70968e7414B53026b2450C1181K86237A0051
12589A15686C3503J35188H0394b12514n2812D7504K69563A47742K9973a06240
12578A571O8190J5471b33354a1817j89722l5178B7204f8219A37786h2266m2437
12567a24703j10592a0566A02539c7905o9409A26425L4671B5223O3022J45390a69229
$$ y = [-72012, 174592, -183423, -440336, 83912, -8328, 260070, 13734, 282762, -26359, 59368, 286870, 128583, 382797, 169543, 38407, -154199, -142706, 346153, -282646, 42324, 53671, 317646, -15747, 105223, 16320, -66860, 44465, 34564, -126516, 314910, 312844, 244169, 512041, 394475, 44842, 11289, 48803, 114881, 151710, 89113, 104026, 404438, -128649, 54392, -392391, 156315, 67245, -93701, -264669, -57414, 253026, -22450, 31181, 317418, 10051, 115686, 33503, 168691, 80394, -212514, -265326, 47504, 317067, 147742, 177715, -106240, 1571, 69761, 85232, -233354, -11817, -201539, -236717, 27204, -68219, 137786, -82266, -124703, -235295, -10566, 102539, -37905, -107314, 126425, 161096, 25223, 88245, 233635, -169229]
12555h6427A59382J45797O1440E7107M1505K5800a36006G8062N3824f9978C9677
12543a57647e5269G7984k4881b11589j38571h2225k1214P355B30347b11191B58994
12531A56620a99703A26109k7452m2824o148a03964A72910p5391K67620b59311
12520A55964e3792G6474C3169a34404N0811P101J6509A27199L15307A83385b74458
12508C5708J25995K25078C1182J53676a1825B55046a47169A83198C4263J73278
12498B07541a43617A407J55400h4963D5705L8094d922l77174B5683J92123b12636
12486a28153b3966H4332c3693j0298A54218d7868A54782j4142F1637C982c49365
12474I8089C7625J69046a36790A91249A9647K58120a07701l57428b07546d2388
$$ y = [-86427, 159382, 305179, 366619, 57107, 98612, 124412, -136006, 78062, 131886, -69978, 39677, -157647, -55269, 77984, 53103, -211589, -350160, -82225, -103439, -96084, 230347, -211191, 258994, 156620, -199703, 126109, 98657, 55833, 49685, -103964, 172910, 97519, 365139, -259311, 155964, -53792, 76474, 33169, -134404, -83593, -76492, -59983, 127199, 442506, 183385, -274458, 35708, 161703, 386781, 31182, 184858, -11825, 255046, -147169, 183198, 34263, 207541, -143617, 1407, 156807, -84963, 45705, 83799, -4922, -382096, 25683, 217806, -212636, -128153, -23966, 84332, -33693, -43991, 154218, -47868, 154782, 140640, 61637, 3982, -349365, 98089, 37625, 206671, -136790, 191249, 19647, 277767, -107701, -465129, -207546, -42388]
12463d08096I5542k0480a11997q6810F0629H758d25613B4652J39786k9492P9035
12452B13981a07428A53523a73199n0594I9029b82503M0116c2952A90609H6273
12441b63830N5083I904N6540l3095J81102a04248g17q124j27397A50967O9957
12430B20924A00014b58867J09879B45831h851j66396A22852j6331J79116d6120
12419a54270B31189E9766K30252b15288k92687A31061E1956j6067J82304E3399
12408B0720a88871A16957c270C7419d4467l7976j6808l5502q6418E1201i7423
12396f2341j58976I4714f9907A66448a45010B51768b81589A20447L64125b24093
12385a13493j9524A46468C757J21240l8145b70645A89462F2225a42188I2175a02163
$$ y = [-408096, 95542, 75062, -111997, -198807, 60629, 8758, -425613, 24652, 164438, 134946, 213981, -107428, 153523, -173199, -223793, 99029, -282503, -242387, -32952, 190609, 86273, -263830, -208747, 9904, 66444, 33349, 214451, -104248, -717, -8841, -136238, 150967, 220924, 100014, -258867, -148988, 245831, -8851, -175247, 122852, 106521, 285637, -46120, -154270, 231189, 59766, 290018, -215288, -507975, 131061, 51956, 35889, 218193, 53399, 20720, -188871, 116957, -3270, 37419, -44467, -82443, -99251, -134753, -221171, 51201, -97423, -62341, -221317, 94714, -69907, 166448, -145010, 251768, -281589, 120447, 484572, -224093, -113493, -133017, 146468, 3757, 124997, 86852, -270645, 189462, 62225, -142188, 92175, -102163]
12373a44005O0965j5186j76698D6463B1306a20997A11806n553a4045k4920k50025
12362b88990N9555N8386b1341A40134b27630f0249A38675h7881k87412a2250j08014
12351a20264m8543j5246c5828p0420A91916h742k33598C04756E2148c48101D10512
12339B59908a4393o5649G8749C4071j0452g214l18695g1703j49638C00812M5103
12328C45915a9263G4413b40429i7651A63198b72154I2776C1327b3948l53397i1190
12316h249B23508a81873j78200b2578p8898j41642A29212a897k63369H4726f1561
12304e7803l9607M3534j93278A36331l1597a28051A72928a57351O0350H8330K37337
12293C25667c6310B38064K4430a29352j37327b3950p6151j24955A48571F8668
$$ y = [-144005, -83040, -98226, -274924, 46463, 21306, -120997, 111806, 106253, -14045, -38965, -288990, -229435, -171049, -21341, 140134, -227630, -60249, 138675, -87881, -375293, -12250, -120264, -168807, -184053, -35828, -106248, 191916, -8742, -242340, 304756, 52148, -348101, 410512, 259908, -14393, -80042, 78749, 34071, 23619, -7214, -325909, -71703, -221341, 300812, 345915, -19263, 74413, -240429, -97651, 163198, -272154, 92776, 31327, -23948, -377345, -91190, -8249, 223508, -181873, -360073, -22578, -101476, -243118, 129212, -1897, -265266, 84726, -61561, -57803, -97410, -53876, -247154, 136331, 104734, -128051, 172928, -157351, -97001, 88330, 325667, -36310, 238064, 262494, -129352, -266679, -23950, -100101, -225056, 148571, 68668]
12282G4949a05784B04378c89713A7444K19766b68128G0308c8809E59636i449C01762
12270b0378F3676O6094a91745a1740B56218o41E3404b54651B05033C1486g5287
12258B3478N171N8152c199A37621R7346I4127a40346I3930R3576K00956a41598
12246C52262r2711a07029l7146A50609F1191B5498K42565b15364C43258B3978
12235A52736F899J84127J8039J27758i1966A15132N3763J08885g2559A14470J7962
12224A32432j740g1845e800I2364L26407n2895D1877a98022A41403L96646k51380
12213B86669p4587a32606B90454J64162n3180A97773P5671n711G0621g0441j16723
12202a87164E3136R0099P7499N8349a4520C66431H8960d462j1143B16621h9667
$$ y = [74949, -105784, 204378, -389713, 17444, 237210, -268128, 70308, -38809, 559636, -9449, 301762, -20378, 63676, 129770, -191745, -11740, 256218, 255577, 53404, -254651, 205033, 31486, -75287, 23478, 28649, 86801, -3199, 137621, 234967, 94127, -140346, 93930, 187506, 388462, -141598, 352262, 259551, -107029, -144175, 150609, 61191, 25498, 268063, -215364, 343258, 23978, 152736, 6899, 191026, 209065, 336823, -91966, 115132, 168895, 277780, -72559, 114470, 132432, 130692, -71845, -5800, 92364, 418771, 365876, 41877, -198022, 141403, 538049, 286669, 212082, -132606, 290454, 454616, 401436, 197773, 273444, 267733, 70621, -70441, -187164, 53136, 143235, 220734, 279083, -14520, 366431, 88960, -4462, -15605, 216621, -89667]
12190b10094C97791b36797A41336C8217h9479j38450C93652K6158D6993K27646
12180B74639J57341j31582A6339Q3316L19316A58845K01039I4556J51899A20022
12169A99344H8036b53820B11765c3889A36319J8354O7708g8594B75466j06843
12159A68623a4344A30195R721c0161D4864b06022c8646j18477B46747j02785a54425
12147a78904j8303Q5236H4546a55531A49214O6719a77291B26459p5675L4623J87481
12136C72888A5907a9601o8065C4714J85057c23720o5707B2310a48778b1125n1635
12125g2760B75812N01I780J15423E2134b20147e4820o3422I1591g6688A59465
12113H7861P7039C4843P6819d9304b2913B91851k7783a14717I6001J68514d00319
$$ y = [-210094, 397791, -236797, 141336, 38217, -89479, -227929, 393652, 419810, 46993, 274639, 431980, 300398, 16339, 99655, 418971, 158845, 359884, 94556, 246455, 120022, 199344, 88036, -253820, 211765, -33889, 136319, 154673, 222381, -78594, 275466, 168623, -14344, 130195, 139916, -30161, 44864, -206022, -38646, -157123, 246747, 143962, -154425, -178904, -197207, -111971, 84546, -155531, 149214, 215933, -177291, 226459, 150784, 185407, 372888, 15907, -19601, -87666, 34714, 219771, -323720, -389427, 22310, -148778, -21125, -72760, 275812, 276313, 9780, 125203, 52134, -220147, -54820, -118242, 91591, -76688, 159465, 87861, 164900, 34843, 111662, -49304, -22913, 291851, 264068, -114717, 96001, 264515, -400319]
12101b80686K6029A8423f1744K250j84500o8742C67300a44550B4913a6629H8813
12089C34046f4086k75672B26904D1846f3656G0965l5029b24487i5595D3036h4482
12077F3367H581a50363f9674K0092D0810J54897A7159J13642d3463A90864j0792
12066A80072c7249C9966J2924K12225K3243a7176C01648G6961N24583O77937D16792
12054C20411J36528B09553o5465K9065G0109J92743A20620B1151a066B68319A14422
12042a99255A4381J33219b45599G1964a34608B38881a5581B21276I9465e4281
12031b29660d9291j15278g0343B06281r8757a24312q7919C5212a57824A43944
12020a39261j83303B3412a06848k76620J64880E6848b12675A66642j3618n1843
$$ y = [-280686, -254657, 18423, -61744, -59494, -243994, -312736, 367300, -144550, 24913, -16629, 88813, 334046, -64086, -339758, 226904, 41846, -63656, 70965, 35936, -224487, -95595, 43036, -84482, 63367, 8581, -150363, -69674, -49582, 40810, 195707, 17159, 130801, -43463, 190864, 180072, -37249, 39966, 52890, 265115, 288358, -17176, 301648, 76961, 601544, 1279481, 416792, 320411, 456939, 209553, 144088, 173153, 70109, 262852, 120620, 21151, -1066, 268319, 114422, -199255, 14381, 147600, -245599, 71964, -134608, 238881, -15581, 221276, 99465, -54281, -229660, -49291, -164569, -70343, 206281, 107524, -124312, -212231, 35212, -157824, 143944, -139261, -322564, 23412, -106848, -383468, -218588, 56848, -212675, 166642, 153024, 101181]
12010A01181a21226j7968c2021l391l9282B42865A01713N6192C6371K490f7193
11998b55431A47431c8489B01028a62774c8482a7388H6501K09685a40894D1664
11987a6818A12111J6322J30168c7399q9412j27757J21125H6226b56991A02211
11976C04071b99977J08362Q6327l2180A39843h9582j44821J09641l8780F1988
11965g7440j0955D1907h2476N107B19280e0260k37694F2548K41969h1294A41943
11953D4417K76706g6793a5937j03815B56331b70174A02671P632C3135a21165k10550
11942c31715A2034b97689b2203k18625a03419p2797f075B55108G6417a00149M3722
11931e6427j87859C49091a09303B32745d42A12011k3875O9221b77853h6319a4198
$$ y = [101181, -121226, -139194, -32021, -35412, -74694, 242865, 101713, 157905, 36371, 38861, -67193, -255431, 147431, -38489, 201028, -162774, -38482, -17388, 86501, 296186, -140894, 41664, -16818, 112111, 128433, 258601, -37399, -126811, -254568, -133443, 86226, -256991, 102211, 304071, -299977, -191615, -105288, -137468, 139843, -89582, -234403, -124762, -163542, 61988, -77440, -88395, 41907, -82476, -77369, 219280, -50260, -287954, 62548, 304517, -81294, 141943, 44417, 321123, -76793, -15937, -119752, 256331, -270174, 102671, 110303, 33135, -121165, -331715, 12034, -297689, -22203, -240828, -103419, -176216, -6075, 255108, 76417, -100149, -56427, -244286, 349091, -109303, 232745, -442, 112011, 88136, 157357, -277853, -86319, -14198]
11919C3923g9812j25547A73672J8944A9147a73496j01318K5155l7458J17848J577
11908a67692B02310b7912A568K8988b97730c3456j73794c8940n2281H5689h8871
11896f4440m98551H9954K2258k9998M00827G2659i1867j81084M2245B44338B5385
11884a06872A03618c0505j17791j3583A46559E9964c3263D0845L16172g9527K2902
11873e6625l70855f2838q2423M6984j16452J4522k9195j80474a9274k00078j51204
11862c70556h7917G9860b89304n7415a16946j71899a22565b8478j03606m31468
11852e63552a85283B35856c00052C42478f325B2056J25455g4178m8368j794k2364
11841a46704f216C198M4422A5373F758L10227a18163j89651A33769b866B28498
$$ y = [33923, -79812, -205359, 173672, 192616, 19147, -173496, -274814, -249659, -287117, -169269, -167692, 202310, -27912, 1568, 30556, -297730, -33456, -207250, -38940, -91221, 85689, -88871, -64440, -562991, 89954, 112212, 82214, 483041, 72659, -91867, -272951, -230706, 244338, 25385, -106872, 103618, -30505, -148296, -161879, 146559, 59964, -33263, 40845, 357017, -79527, -56625, -427480, -62838, -145261, -98277, -214729, -200207, -229402, -409876, -19274, -219352, -370556, -87917, 79860, -289304, -346719, -116946, -288845, -122565, -28478, -132084, -563552, -185283, 235856, -300052, 342478, -6325, 22056, 147511, -74178, -122546, -124340, -146704, -6216, 3198, 47620, 15373, 6758, 316985, -118163, -307814, 133769, -2866, 228498]
11829C3091b15581J01313B00023H2085K32934G0313A5082b30258I3735c59345
11818g1729A73301f7915j77995A89245b0908m0071j49346a04493k70945C7939
11807b61322p731B09336h4713A14499b47306H344g8844a3087E5658a76018C7371
11795g444A31919C2728a10130j63467A10254M4098P9159b9272F3318J2669f2183
11783B03178J11395e3469j03793A95448F0510O1502K4213N44J33054G1777f7208
11771D53197D0004K11313F4N9703g0345j36499J02703k48812A11794h7898B46581
11759A81345a10203D17955a43909A27565c6246G6865R1815N134a66248A48013
11748I5095f02964A65594k9069a95487o5819K1293g7836C2896J56472L11022A05491
$$ y = [33091, -215581, -114268, 200023, 82085, 315019, 70313, 15082, -230258, 93735, -359345, -71729, 173301, -67915, -245910, 189245, -20908, -60979, -210325, -104493, -375438, 37939, -261322, -269053, 209336, -84713, 114499, -247306, 8344, -78844, -13087, 55658, -176018, 37371, -7444, 131919, 32728, -110130, -273597, 110254, 154352, 233511, -29272, 63318, 75987, -62183, 203178, 314573, -53469, -157262, 195448, 60510, 122012, 146225, 146769, 279823, 71777, -67208, 453197, 40004, 251317, 64, 59767, -70345, -206844, -104141, -352953, 111794, -87898, 246581, 181345, -110203, 417955, -143909, 127565, -36246, 76865, 168680, 173814, -166248, 148013, 95095, -602964, 165594, 136525, -195487, -261306, -240013, -77836, 32896, 189368, 500390, 105491]
11736b93373l0047a43143e8996C36727b62270L9041p4669A01952a36872m3314
11726a80186b4454j04992C09892n6210k3983l7661a76958A31688b38040C5279
11715A01417b62447A66569L2362b13742J01375H6751J52243G4607L3777h9624
11704a3581G7168a31994D9096c1767p0050o2083C46766G1162J42879a57851j08285
11693b66136A54959f8619j21921B1381J32196f2404A09001O4281b34131A6165
11682H7835C9104M58885q1615A03907M8662j4069D9142J13149n3623a99987c9317
11670B117M86578k30200a51358k1573F0981A8361J98310p8440h9006j27629F2848
11658I1428f6406j52648e7059j37819j1445I808b8640j1488q8350q1458Q1039
$$ y = [-293373, -323420, -143143, -58996, 336727, -262270, -223229, -297898, 101952, -136872, -180186, -24454, -129446, 309892, 253682, 229699, 192038, -176958, 131688, -238040, 35279, 101417, -262447, 166569, 198931, -213742, -112367, 86751, 238994, 74607, 108384, -89624, -13581, 77168, -131994, 49096, -31767, -101817, -163900, 346766, 71162, 214041, -157851, -266136, 154959, -68619, -190540, 21381, 153577, -62404, 109001, 173282, -234131, 16165, 87835, 39104, 497989, 416374, 103907, 152569, 138500, 49142, 162291, 108668, -199987, -39317, 2117, 488695, 258495, -151358, -172931, 60981, 18361, 216671, 138231, -89006, -216635, 62848, 91428, -66406, -219054, -57059, -194878, -206323, 9808, -28640, -40128, -128478, -209936, -128897]
11647a28897m1662B83148A15251n2038e8956F812J90727b87416E4334f775B27226
11635C61986A43453a11152d4354j60804g4890A94569a97165m2530h8549I9669
11624a49002A1685a04184K7387C2172J32858F3394d872B25349G3042N3114d96686
11612A14225J5905J79186b23098f5218I7231b50778L1687A51918A0576b80552
11601A1477Q3845j6056b68823h5312A00126a21547j82876E04476b10478k3107
11591b33585f9853A06742c17429I78a52155B50008a19939A58186J8891C8465a68548
11579a80720q3366a07393E174J33427P3092i3703J3083A70089G7313J57548A3401
11567C32588L06525D9366i442j52717b2400B21382D2207b08865E28999G8134J77800
$$ y = [-128897, -170559, 283148, 115251, 63213, -58956, 6812, 197539, -287416, 54334, -6775, 227226, 361986, 143453, -111152, -44354, -205158, -74890, 194569, -197165, -239695, -88549, 99669, -149002, 11685, -104184, -76797, 32172, 165030, 63394, -4872, 225349, 73042, 126156, -496686, 114225, 130130, 309316, -223098, -65218, 97231, -250778, -219091, 151918, 10576, -280552, 11477, 95322, 79266, -268823, -85312, 100126, -121547, -304423, 504476, -210478, -233585, -69853, 106742, -317429, 978, -152155, 250008, -119939, 158186, 177077, 38465, -168548, -180720, -264086, -107393, 5174, 138601, 211693, -93703, -80620, 170089, 77313, 234861, 13401, 332588, 639113, 49366, -9442, -162159, -22400, 221382, 42207, -208865, 528999, 78134, 255934]
11556B55934r1832n9960K25228g0615j05135B44985a05307A83936m1769a07911
11545b23661A15503D0002a70436o3788B44759j0288a01308c6632A94061j5892
11535A78169i5939q9867F2696K8238e5887A89933p7069L0415m720a25242B56606
11523A32848e8665C0849K4710f1617A45203k3859D989a43200A1561a0988F0968
11511b21272A34069d5836j05703C55209f326l6866F3143K58301h3160A31039d6794
11499e3003C78392I8471l8645r182d6017o4403D00243a8347l2725C40642j38463
11488B02179h7036a9472C07129E6649e6999b3443H1618Q0060H0240J026i7169
11476A66731F4943I699b0000F9401N9970k9903e3351A31576J05104J84284C6117
$$ y = [255934, 164102, 104142, 329370, -70615, -175750, 244985, -105307, 183936, 142167, -107911, -223661, 115503, 40002, -170436, -234224, 244759, 234471, -101308, -36632, 194061, 178169, -95939, -185806, 62696, 90934, -55887, 189933, 112864, 143279, 138559, -125242, 256606, 132848, -58665, 30849, 55559, -61617, 145203, 121344, 4989, -143200, 11561, -10988, 60968, -221272, 134069, -45836, -151539, 355209, -6326, -43192, 63143, 321444, -83160, 131039, -46794, -53003, 378392, 98471, 59826, 50644, -46017, -110420, 400243, -18347, -51072, 340642, 202179, -87036, -19472, 307129, 56649, -56999, -23443, 81618, 161678, 80240, 81266, -97169, 166731, 64943, 9699, -20000, 69401, 129371, 99468, -53351, 131576, 236680, 420964, 36117]
11464A69715q869A3497J09307J7066N8775b27515C14609a48058N4519A74843h0705
11452A30707M4564B0595d8976B27903d6528A57519n4294J05364D4644J63489a21501
11440B73036a02589C4637J79427b29864A28336K82874l9493H286a64348Q1283
11430h3065K5786l4763A03862a12831A31590A8559N113Q7743B9151a06969A28648
11418C3584J17349C4393d2701B40996J24584O0583A02351j1258K4176L2519a07834
11406g1278l3900M115M8683q3689M593C9588b12894n5321J10456A10655b98261
11394a78840g7095k8025C13692a03488C335J15375J36915l054a80104d5581j97221
11383b42802B33277I8373Q5870A4493c38433A87762c98238a59398L646j1155M9284
$$ y = [169715, 160846, 13497, 122804, 139870, 198645, -227515, 314609, -148058, -93539, 174843, -80705, 130707, 175271, 20595, -48976, 227903, -46528, 157519, 103225, 208589, 44644, 208133, -121501, 273036, -102589, 34637, 214064, -229864, 128336, 411210, 371717, 8286, -164348, -83065, -57279, -92042, 103862, -112831, 131590, 18559, 23672, 111415, 29151, -106969, 128648, 33584, 150933, 34393, -42701, 240996, 365580, 426163, 102351, 91093, 115269, 147788, -107834, -71278, -105178, -101063, -52380, -136069, -131476, 39588, -212894, -268215, -157759, 110655, -298261, -178840, -77095, -105120, 313692, -103488, 3335, 118710, 255625, 252571, -180104, -45581, -242802, 233277, 98373, 184243, 14493, -338433, 187762, -398238, -159398, -155752, -166907, -117623]
11372a17623J0000B10298g030l5450G0162N5003a87086A4362c16713C10481b53968
11360B06222b4717D9301c79335B4540N4033d3449B80338E5020b20480K5335g8896
11348a23845q3597I5878a41476A93515h089k84028E0125K21085a8180j03611k30286
11337c52077I8444K43032f462A14860a32184B48354g051A22904N2490J43325q8997
11326B29722B3143e202j2947B1150J57559f0540b5198O9C7193K6770K4773B1218
11313g9418b0642j42186a7596m6627Q34C2520a47614B4192d6666j68189A8085
11301B43960E8162e11656A04364d1717C093c17549f4752B77010b0424j8646E9486
11289a53787D7427Q8477B0011a03161d9462A28642a11303I5766a81073C66441
$$ y = [-117623, -107623, 210298, -7030, -42480, 70162, 125165, -187086, 14362, -316713, 310481, -253968, 206222, -24717, 49301, -379335, 24540, 78573, -43449, 280338, 55020, -220480, -195145, -78896, -123845, -207442, 95878, -141476, 193515, -8089, -292117, 50125, 271210, -18180, -121791, -352077, 98444, 341476, -6462, 114860, -132184, 248354, -7051, 122904, 175394, 318719, 229722, 23143, -5202, -18149, 21150, 178709, -60540, -25198, -25129, 37193, 63963, 88736, 21218, -79418, -20642, -162828, -17596, -64223, -63389, 32520, -147614, 24192, -46666, -214855, 18085, 243960, 58162, -511656, 104364, -41717, 3093, -317549, -64752, 277010, -20424, -39070, 59486, -153787, 47427, 135904, 20011, -103161, -49462, 128642, -111303, 95766, -181073, 366441]
11278a17334B77904b57830A38306D7369K5774a63345g1351r2336j48737O195a50466
11266A69997H3027C9600a86232k37481b09929g1019Q332k02114G2392a24147B87947
11254d8991k13718K2467J0044Q5379B22349F7078P0808h4426F994a12441B39431
11242B67317a90384e7005F025J90847b69313N3537J9906A86700L36g7890a8875
11230C9512a40253k7084B3169a9647l32095C4574P6819b52671K4528P4139A47131
11218a53044G4153h1784f432A86684a07343A37283C9557h2505n5602e1764F7443
11206d8847J7300k47616a06107c9965A9511R4540a02476F1727i7460k421j3621
11195a13502G1449b99600D4677g718k22223B27001A07255Q4646b0068A88373b7344
$$ y = [-117334, 277904, -257830, 138306, 47369, 73143, -163345, -71351, -163687, -312424, -306229, -150466, 169997, 83027, 39600, -186232, -423713, -209929, -71019, -62687, -264801, 72392, -124147, 287947, -48991, -262709, -240242, -230198, -144819, 222349, 67078, 137886, -84426, 6994, -112441, 239431, 267317, -190384, -57005, 6025, 196872, -269313, -215776, -195870, 186700, 187036, -77890, -18875, 39512, -140253, -167337, 23169, -19647, -351742, 34574, 111393, -252671, -228143, -154004, 147131, -153044, 74153, -81784, -6432, 186684, -107343, 137283, 39557, -82505, -138107, -51764, 67443, -48847, -31547, -279163, -106107, -39965, 19511, 114051, -102476, 61727, -97460, -99881, -113502, 71449, -299600, 44677, -7718, -229941, 227001, 107255, 191901, -20068, 188373, -27344]
11183b3486A04891b60269Q3369j5061j17270d5273B80424j37663d7127A20650
11172a0278j41163e7395B77242h8976B25388b27281R2151j77480C09350B7064
11161a04904j26411f9928o9134b0702p7932j07477A55376b43800K3242B83825
11150D8943b0127p3653a7950A29343b56176E6110B0177J7580A0360P7595P9999
11139A67954b90125O5729c5227j56775j21483a40100O4836O851H3594e7243A9209
11127a62358b4870H7897J10510C5805R1644a20910C90928A80852a40108E6949
11116a82726h2853D8154K30786h2335j8387A72393b7107H4061d3673A29960H382
11104A7177d9513I6118i3145j8324d4008j26229G555O1868a00958A54376f8736
$$ y = [-23486, 104891, -260269, -176900, -191961, -309231, -45273, 280424, 142761, -47127, 120650, -10278, -151441, -57395, 277242, -88976, 225388, -227281, -135130, -312610, 309350, 27064, -104904, -231315, -69928, -139062, -20702, -98634, -206111, 155376, -243800, -220558, 283825, 48943, -20127, -93780, -17950, 129343, -256176, 56110, 20177, 37757, 10360, 87955, 167954, -290125, -224396, -35227, -192002, -313485, -140100, -75264, -68413, 83594, -57243, 19209, -162358, -24870, 87897, 198407, 35805, 127449, -120910, 390928, 180852, -140108, 56949, -182726, -82853, 48154, 278940, -82335, -100722, 172393, -27107, 84061, -43673, 129960, 8382, 17177, -49513, 96118, -93145, -111469, -44008, -170237, 7555, 69423, -100958, 154376, -68736]
11092b01573H6374b0058A96744B9853O1535J27096B1153L60461D6730P3301a27693
11080G8168R2047m8730J79898a8542B10472a14561A0308M71764A82103J04787
11070B86890G0874f6979A37131K7695Q7779r3238j2845K19269j64463B5259L11382
11059C36641J42443j36718A42744K3930L48833M7318B47602K21314j9013N2235
11049E02138j09032j53067J09941A27758M21415k51020j134R6353L9133J03353
11039E35858l9154L85694k25296p6588j88652K82786j20343K64419l0085j56463
11029F32176K14664C83358J30100L22300l30081K59073J0822j18601j49377J84498
11019F92092J02121j61851j55021N6123J08255k8192K46970o9349j26103J38726
$$ y = [-201573, 86374, -20058, 196744, 29853, 91388, 218484, 21153, 381614, 46730, 120031, -127693, 78168, 170215, 121485, 301383, -18542, 210472, -114561, 10308, 482072, 182103, 286890, 70874, -66979, 137131, 164826, 252605, 159367, 146522, 365791, 201328, 25259, 336641, 479084, 342366, 142744, 166674, 515507, 562825, 247602, 468916, 449903, 502138, 393106, 240039, 349980, 127758, 549173, 298153, 297019, 393372, 432505, 535858, 496704, 882398, 657102, 580514, 391862, 674648, 554305, 818724, 788639, 632176, 846840, 383358, 513458, 835758, 505677, 764750, 775572, 656971, 507594, 692092, 794213, 632362, 477341, 533464, 641719, 613527, 860497, 791148, 665045, 803771]
11009H03771j63011k30289L31415Q0719j77810K3273k54046K24157A75858K57759
10999D33617J28272J58565k46413k09693n8666K67544J66137C00717j8773L11672
10989E93616n7255J38225r9189J45059N3352O6966n6815j04472q0186J68661l00555
10978D67407j37850L19779J39410j29347R0243L07550r9625L6306j19365j65687
10968G08821L28160K69491p4482o040J11935J05146L26129L8912L28343N7420
10958B193835K45742k08119K06232k4569k52657m8916J7987k98811j23681j61278
10948A545765j24722N3096j24265K10520k50016L65440k45166J87157m89137P7685
10938A206357j61697m0260R2888E00218N7978k18703l7548J92848L4909b14757
$$ y = [803771, 640760, 410471, 741886, 822605, 644795, 668068, 414022, 638179, 175858, 433617, 561889, 720454, 474041, 264348, 205682, 473226, 639363, 300717, 281944, 593616, 536361, 674586, 575397, 720456, 773808, 840774, 783959, 679487, 599301, 767962, 467407, 329557, 649336, 788746, 659399, 749642, 1057192, 957567, 993873, 874508, 708821, 1036981, 1306472, 1231990, 1225950, 1337885, 1443031, 1769160, 1808072, 2136415, 2193835, 2439577, 2231458, 2437690, 2413121, 2160464, 2111548, 2129535, 1830724, 1707043, 1545765, 1421043, 1474139, 1349874, 1560394, 1310378, 1675818, 1430652, 1617809, 1128672, 1206357, 1044660, 1004400, 1097288, 500218, 558196, 339493, 301945, 494793, 529702, -214757]
10927B47824F319J66242M8446a66406F7045K3779a40805K9290Q546c3898a649
10915A50680n2400J05670K2543G1527J28594r2816C8429g7032C51169c33202B67315
10903B24346B7543b44448g7410B50902b36923A04230a03651d3287m3621C91745
10892D02816c7011F5380f5921H5842b39314O5368D3904J99429g0781A55966g7525
10880f2052B65054E7474A3341d02609E8359M6525L7796h8842r0135n9453R9621
10869a38809C06709b82497J38407H8214M3273b25299B1271J30728b34982h4850
10858a3134o1976j75532Q0074k5424e5760h351r8233K0432p1449B83071A41295
10846H7261J25701a17212d1055A9554P0212O1145D4955J33114o4739c17440c9363
$$ y = [247824, 6319, 172561, 221007, -166406, 67045, 90824, -140805, -111515, -102969, -33898, -1649, 150680, 98280, 203950, 226493, 71527, 200121, 107305, 38429, -77032, 351169, -333202, 267315, 224346, 27543, -244448, -77410, 250902, -236923, 104230, -103651, -43287, -86908, 391745, 402816, -37011, 65380, -65921, 85842, -239314, -173946, 43904, 243333, -70781, 155966, -77525, -62052, 265054, 57474, 13341, -402609, 58359, 104884, 142680, -88842, -178977, -238430, -138809, 306709, -282497, -144090, 88214, 131487, -225299, 21271, 151999, -234982, -84850, -13134, -75110, -250642, -170568, -195992, -55760, -8351, -106584, -86152, -157601, 283071, 141295, 87261, 212962, -117212, -41055, 19554, 89766, 150911, 44955, 178069, 113330, -317440, -39363]
10834c56214F6252a02059H6440e6691j53765Q4615d715k95317i5195N560A75296
10822b83104A13612a17612C1262b39521c4100p9614k7513k46452a02408A44817
10811A27200O1057b1420I1068a42116j0083F4714a0162k00778J00879K6732j9631
10800a02960C8589c9100l7852G2664b81273n1360e7j5891r1208n7993j22869m168
10788b92186b1701j8609C54970r3580c9485j20335A05418c11823d4333q3749G2626
10776A68896K95784k06131b53562H8080a43922A1178g1898j6961m21275b5861
10765e382F7808a24766i751A5763b82315A9582J02190n9079h7398A98150e8626
10753A43485O3493a24727q807A10679b8748I705h5112A93124e4553A8078a32797
$$ y = [-356214, 66252, -102059, 86440, -56691, -210456, -125841, -4715, -300032, -95195, -89635, 175296, -283104, 113612, -117612, 31262, -239521, -34100, -113714, -141227, -387679, -102408, 144817, 127200, 188257, -21420, 91068, -142116, -152199, 64714, -10162, -210940, -110061, -83329, -102960, 38589, -39100, -76952, 72664, -281273, -332633, -57, -15948, -107156, -165149, -288018, -292186, -21701, -40310, 354970, 261390, -39485, -159820, 105418, -311823, -44333, -128082, 72626, 168896, 464680, 258549, -253562, 88080, -143922, 11178, -71898, -88859, -510134, -25861, -5382, 67808, -124766, -9751, 15763, -282315, 19582, 121772, 62693, -87398, 198150, -58626, 143485, 206978, -124727, -133534, 110679, -28748, 9705, -85112, 193124, -54553, 18078, -132797]
10741B47150h3034F8875d7177D7635A3248a1542A2427J7438g8519l99688F5399
10729C5616J54576a05328l148G496J34707f2571A47326c87220A92329g0009j30464
10718b00473R8684A28197i4595j37055A25265b44092J6300A25260d9373B6164
10707i8079A27860n1939B8836J34649a63494P8704j6535A97002a0497o4130B33148
10695a90666B00763b01478d5554p536j75177B70991i6883j38849c063A6526c4126
10683d106F5737a61710k0263f322j03041G0561c03361R7855J9127A87431a54502
10671b09946H8267J0209Q4529a45137O0666k923g772k95563E9594d6699o6803
10660a13502A89407r4050K9519e8806E6500R1658K9300H8135a37159B9242M8327
$$ y = [247150, -83034, 68875, -47177, 47635, 13248, -11542, 12427, 29865, -78519, -478207, 65399, 35616, 190192, -105328, -108476, 7496, 142203, -62571, 147326, -387220, 192329, -70009, -200473, -101789, 128197, -94595, -231650, 125265, -244092, -227792, 125260, -49373, 26164, -98079, 127860, 75921, 28836, 163485, -163494, -84790, -101325, 197002, -10497, -74627, 233148, -190666, 200763, -201478, -45554, -53090, -228267, 270991, -96883, -235732, -3063, 16526, -34126, -4106, 65737, -161710, -181973, -6322, -109363, 70561, -303361, -205506, -186379, 187431, -154502, -209946, 88267, 98476, 183005, -145137, -84471, -87394, -7772, -303335, 59594, -46699, -113502, 189407, 95357, 124876, -58806, 56500, 148158, 177458, 88135, -137159, 29242, 77569]
10649G7569a90429N9844A29682c4264q4313A79154a61428H5992a08765B56617
10638G0882g1632j82638A49152b3954k21175d5499j18437N2747j09709O9381M5687
10627a05830D6937a56981B55503D0255i7925j43550A61965c1495j91431J05590
10617a17336a8113j9773j19926j29176d1807k7785j65989b8601C5495b24759R7654
10606a27105O455B83682f3178p5211D1480b44991A86545n2d7230H2991A7037b96530
10593g9943h893k11017F4610c30464a14009I305L28521b6374A16313a22286k7110
10582a49396D1240K19582A13341b05552L5073D9506d01587A81118n8689c62638
10571h910j53683A77589J3395a20372C4358Q5304b07831A27872d89948b0478j03833
$$ y = [77569, -190429, -130585, 129682, -34264, -118577, 179154, -161428, 85992, -108765, 256617, 70882, -71632, -254270, 149152, -23954, -245129, -45499, -163936, -111189, -220898, -151517, -105830, 46937, -156981, 255503, 40255, -97925, -241475, 161965, -31495, -222926, -117336, -18113, -37886, -157812, -286988, -41807, -69592, -235581, -28601, 35495, -224759, -127105, -120650, 283682, -63178, -138389, 41480, -244991, 186545, 186493, -47230, 82991, 17037, -296530, -79943, -8893, -219910, 64610, -330464, -114009, 9305, 337826, -26374, 116313, -122286, -149396, 41240, 260822, 113341, -205552, -170479, 49506, -401587, 181118, 122429, -362638, -8910, -162593, 177589, 190984, -120372, 34358, 119662, -207831, 127872, -489948, -20478, -124311]
10560a24311p0697h4809n0391C8504i7879k31379A39843a04181m0827j73318B3056
10548a94630A30904o3927c9763p6663M9114G9162B881J59513o8958K13720a6671
10536I9046h8177j63871h6271k593C75a7852A08696a56925A69742c41094A8215
10524a34576c8302D0393O2955C6122P9570g4414n7343r8015B15685D8325K38534
10513B86859G6913a25550p4005B95980m7889d0201l16419h1405j34565a01143
10502g3618B63719m6014p2213c44199A1548J00680f2317A3559L6409a21751H6521
10490d83838A39750f9242B3766R3105e2622e954j25364m8822a9568C2015b39741
10478D686d2274j35448a8955G0714g2309B23954b74486A59771o3619L5205L27411
$$ y = [-124311, -195008, -84809, -135200, 38504, -97879, -329258, 139843, -104181, -145008, -318326, 23056, -194630, 130904, 66977, -39763, -116426, -67312, 79162, 2881, 162394, 93436, 307156, -16671, 99046, -88177, -252048, -86271, -88864, 375, -17852, 108696, -156925, 169742, -341094, 18215, -134576, -38302, 40393, 103348, 36122, 115692, -74414, -131757, -229772, 215685, 48325, 286859, 76913, -125550, -199555, 295980, 248091, -40201, -356620, -81405, -215970, -101143, -73618, 263719, 217705, 145492, -344199, 11548, 112228, -62317, 13559, 49968, -121751, 86521, -483838, 139750, -69242, 23766, 116871, -52622, -5954, -131318, -180140, -19568, 32015, -239741, 4686, -42274, -177722, -18955, 70714, -72309, 223954, -274486, 159771, 96152, 131357, 458768]
10467D58768k13428B0578M23228M9532j03691B4452b02777R9347k4507b4892j93935
10456b18827A91665K74784a41991k06586O0915b584B30503b70759e6283A50364
10445h7821D94824C6221a79133n501A83613a19647A33017j6654F319c94080f7039
10433C03856j39458h882B34394b47093K4770A6945a64021C9500J90509J30836
10423C60845a62630f0646k3538G5689K43547F8574J9165b0505n53149A03458O5846
10412A69304a41839j47653D567b0838k13787A8912a8261m04590c5766l54027A33
10400g6645b2959D38135e4496a1067G0128K3260d06764a20319G4582c05098e1450
10388c03704b8753l16118J66923C33102h8039k0819r6772A66654a8796j15627
$$ y = [458768, 245340, 20578, 443806, 493338, 389647, 24452, -202777, -103430, -127937, -24892, -218827, 191665, 466449, -141991, -348577, -287662, -2584, 230503, -270759, -56283, 150364, -87821, 494824, 36221, -179133, -184634, 183613, -119647, 133017, 116363, 6319, -394080, -67039, 303856, 164398, -8882, 234394, -247093, -222323, 16945, -164021, 39500, 230009, 360845, -162630, -60646, -84184, 75689, 319236, 68574, 87739, -20505, -573654, 103458, 169304, -141839, -289492, 4567, -20838, -234625, 18912, -18261, -422851, -35766, -389793, 133, -76645, -22959, 438135, -54496, -11067, 70128, 93388, -406764, -120319, 74582, -305098, -51450, -303704, -28753, -344871, -177948, 333102, -88039, -108858, -205630, 166654, -18796, -134423]
10378a34423A17041a10988F9247a71454N5671D08327a97324a5870C26649b92128
10367g3983A4595L7196J67537k4893p6044l8237b5560B80753J30352j69165c5918
10355B42400J52059j45418Q0717O4318j84403j2917R7561L3352j43289n5536J35423
10344B64267J07327m0768J27369n8957A30990d1753B80257m4872L7796J66040
10334D39221n8400q9077J20461E4066M43341Q8302j12374j48968q9197F6729p913
10323E8816f5290b5328D2608K73833F6979e8865a3445A60309a8725H7160B1420
10311A57682C7264J977J22411J55759A28266K14597d08806A59921o2229J55759
10301B53451o1474p2710D8372c95897A7793i5009l4589d5541p0674I7179c727
$$ y = [-134423, 117041, -110988, 69247, -171454, -115783, 408327, -197324, -15870, 326649, -292128, -73983, 14595, 51791, 219328, 194435, 118391, 80154, -25560, 280753, 411105, 241940, -35918, 242400, 394459, 249041, 329758, 394076, 209673, 196756, 294317, 327669, 184380, 128844, 264267, 371594, 330826, 458195, 399238, 130990, -41753, 280257, 235385, 273181, 439221, 380821, 291744, 412205, 54066, 497407, 585709, 473335, 324367, 235170, 66729, 58816, -65290, -25328, 42608, 316441, 66979, -58865, -13445, 160309, -18725, 87160, 21420, 157682, 37264, 39241, 161652, 317411, 128266, 342863, -408806, 159921, 97692, 253451, 191977, 119267, 48372, -395897, 17793, -95009, -129598, -45541, -116215, 97179, -3727]
10289a50090m0820i1694l3352c6358B21043e6468j19923a6197H3700b2502q1072
10278a03574A43669b36963g633C10801a39714O5478d492A14093a95708d923B27605
10266a58739A42044c38056b0507A25773B7917d7565k26286F4023a77761e0377
10255a87588H3200a09591o6267B61938b3015G7561R9444f9754A56000L48125A79364
10243A9186N29o620J26949b46620b4589j46250K4217a472j1021j4482j38595D07434
10230a52768P3173B08333G6489N7362F0560O1973g9711A24412k4966A4281a26921
10218A26640d6412C47019j18002c90485J00520I9275b91338a06156b6283k1912
10208d8195A55822c43746a10264j04002f4121m0411A3318K31661d8891E5322b51326
$$ y = [-150090, -190910, -91694, -125046, -36358, 221043, -56468, -176391, -16197, 83700, -22502, -103574, 143669, -236963, -7633, 310801, -139714, -74236, -4492, 114093, -195708, -4923, 227605, -158739, 142044, -338056, -20507, 125773, 27917, -47565, -273851, 64023, -177761, -50377, -187588, 83200, -109591, -175858, 261938, -23015, 77561, 177005, -69754, 156000, 504125, 179364, 19186, 19715, 13095, 140044, -246620, -24589, -170839, -146622, -1472, -12493, -26975, -165570, 407434, -152768, -79595, 208333, 76489, 133851, 60560, 122533, -79711, 124412, 99446, 14281, -126921, 126640, -46412, 347019, 229017, -390485, -289965, 99275, -291338, -106156, -26283, -48195, 155822, -343746, -110264, -214266, -64121, -104532, 13318, 244979, -48891, 55322, -251326]
10196a63438L6508j10906A71334a53555B58819a30639f2290l7425j3402Q992B48802
10184A34154J04841b11074q6352a567C1265b62767A2615K35154c56659g3674E4521
10172A04808b37112A12117l9910k4055a83800A10715F831J8953L5088B1757c07290
10160i5618j19682e6409g662k64287A45931b23416D2929c7100I5766J06021l4717
10149A67070E6680J18714b69617F5082h7511B43419N5871I6836d98393A64882
10138a60522L533b8669p3198A06235d9372A73870c04759c1555q2948b0083l54165
10127c74248B12963a09137k98503f9801j19915A8971f2318b0686j56182g2948
10116B1817d29344K0573a7133l1095k43682h9460A29710J21270b0189k82580a15284
$$ y = [-163438, -126930, -237836, 171334, -153555, 258819, -130639, -62290, -99715, -113117, -104125, 248802, 134154, 238995, -211074, -297426, -1567, 31265, -262767, 12615, 247769, -356659, -73674, 54521, 104808, -237112, 112117, 72207, 48152, -183800, 110715, 6831, 25784, 60872, 21757, -307290, -95618, -215300, -56409, -7662, -271949, 145931, -223416, 42929, -37100, 95766, 201787, 167070, 56680, 175394, -269617, 65082, -87511, 243419, 299290, 96836, -498393, 164882, -160522, -156989, -28669, -101867, 106235, -49372, 173870, -304759, -31555, -114503, -20083, -374248, 212963, -109137, -407640, -69801, -189716, 18971, -62318, -20686, -176868, -72948, 21817, -429344, -408771, -17133, -48228, -291910, -89460, 129710, 250980, -20189, -302769, -115284]
10104a18352H9878M1616F992e7469H341K8566K89155b3392B1541d04584h9184
10092B73686C9574b66631h2839n5244I5433b0837k56030c3162B05908b79401R4778
10081a84623R09f3088H8596b53896J23610O0270B95556f7432l74140p2408a8267
10069b01701R195B0041b32675C6717K3787a25028j01707C6071J34266a99878d5130
10057g4731m8465D4027h5561r2131J048I8678a0686B02683E4372J75267i0887
10045H6808d06335a79361o5852N4694c5726B04675g8728k76714H6428B1253a09536
10033a47751a2264A93066a15749N359B20421i8999C5037a56430k47038d0288j98735
10022b39023B4580b89602Q2903c2730A53780o6885K55188a4921j84949b4373m5616
$$ y = [-118352, 89878, 131494, 6992, -57469, 8341, 36907, 326062, -23392, 21541, -404584, -89184, 273686, 39574, -266631, -82839, -138083, 95433, -20837, -276867, -33162, 205908, -279401, -184623, -183714, -63088, 88596, -253896, -130286, -70016, 295556, -67432, -441572, -513980, -18267, -201701, -192506, 20041, -232675, 36717, 60504, -125028, -226735, 36071, 170337, -199878, -45130, -74731, -123196, 44027, -85561, -177692, -176644, 98678, -10686, 202683, 54372, 229639, -90887, 86808, -406335, -179361, -245213, -190519, -35726, 204675, -78728, -355442, 86428, 21253, -109536, -147751, -12264, 193066, -115749, -110390, 220421, -98999, 35037, -156430, -403468, -40288, -239023, 24580, -289602, -206699, -32730, 153780, 86895, 342083, -14921, -199870, -24373, -69989]
10011f9989j40895e9002k2334q2296f1104p325B3969d8473r9194A5715b57584
9999b54686p7325F5292a53436L329A70273p0868C8947g9924j83297k44841I7999
9987B18801C4399K15128a60264l17864K29748a02420r706B01250r6642d8394j39303
9976a87697I9805R7120I668a83894A25336J35583N7048a79006f2334r703q6369
9965a58406j78132J09469g0180A14903a01260A46018b9482l65334d8450D7630
9954B09126g9732k6434a8318j34338B53186j21804E9231J55657e4417C4660b16218
9942G7452b90932a29943C20933d1924A07126a72361P76A7059N6877c0078I8768
9930A66011c77773J45782R8955J5867A52418g1601B10056a3752A47126E6832e2140
$$ y = [-69989, -210884, -59002, -81336, -163632, -61104, -68429, 23969, -48473, -147667, 15715, -257584, -254686, -332011, 65292, -153436, -150107, 170273, 99405, 38947, -79924, -263221, -508062, 97999, 218801, 34399, 249527, -160264, -478128, -248380, -102420, -112126, 201250, 104608, -48394, -187697, 99805, 196925, 9668, -183894, 125336, 260919, 317967, -179006, -62334, -72037, -158406, -336538, -227069, -70180, 114903, -101260, 146018, -29482, -394816, -48450, 47630, 209126, -79732, -106166, -18318, -152656, 253186, 131382, 59231, 214888, -54417, 34660, -216218, 77452, -290932, -129943, 320933, -41924, 107126, -172361, -171585, 17059, 73936, -30078, 98768, 166011, -377773, -231991, -133036, -117169, 152418, -71601, 210056, -13752, 147126, 56832, -52140]
9918b64127a09770j41904K8697J05123A49279d5108N735j19267P4114k08420g238
9906a50207o7781K9758j44922h0313b440j33359N7234n6489A77892B0493i5282
9894a16242D4349a57915G4033K15385D3387c7044k18343e4608F1469a12127M1701
9883g0426k95673L6893m8234A79211a51404A6582a20437M2345F5661a53596j07851
9872b61447a1722A00861L7896a38794K3356J7427K6220A94880G527d9629I7847
9860I6637b8894A60211B9638a51667O5922j9909L8698R718A68367b94350h6618
9848c77219a54751j09039d1599B11360d73446a41040H713b48478J3639A80331
9837b6700k47816J33721a1883j06569A75972d04360a21718l19855C4721c9114
$$ y = [-264127, -109770, -251674, -222977, -117854, 149279, -45108, -39373, -158640, -84526, -292946, -7238, -150207, -217988, -188230, -333152, -80313, -2440, -135799, -78565, -135054, 177892, 20493, -95282, -116242, 44349, -157915, 74033, 289418, 43387, -37044, -255387, -54608, 61469, -112127, -70426, -366099, -329206, -377440, 179211, -151404, 16582, -120437, -78092, 65661, -153596, -261447, -11722, 100861, 138757, -138794, -115438, -98011, -71791, 194880, 7527, -49629, 97847, 96637, -28894, 160211, 29638, -151667, -85745, -105654, -66956, -57238, 168367, -294350, -86618, -377219, -154751, -263790, -41599, 211360, -473446, -141040, 8713, -248478, -234839, 180331, -26700, -274516, -140795, -11883, -118452, 175972, -404360, -121718, -441573, 34721, -39114]
9826b62693a14123A08268f7286n6369F0268a11504A5191P5047O5454i6876d4785
9814A13461a992B01188a15952J78H7585c48637B70344c2613B32561r8467d2208
9802g1702F8332a97452A36130O4391c30938J01159J01597A06056b06173m2235
9792b48408j27363B06619c5652j9630j15105A03101c9343j90041e6435j09526
9782a65961A57215k1054b93156E5052a56261B81261a08423d7912o5412b2969m17648
9771d40617J38311J41250j7214N8278M4054l38459Q4481I1109L61190c7084n3720
9760i0804K6594F426c5766A51330m1030b47409A14084c36907J50181K1684o6504
9749b31546A64530B2641a18698F6404d7299A1724J06106b51072b7263A4912a02361
$$ y = [-262693, -114123, 108268, -67286, -123655, 60268, -111504, 15191, 90238, 155692, -96876, -44785, 113461, -1992, 201188, -115952, -115774, 87585, -348637, 270344, -32613, 232561, 134094, -42208, -71702, 68332, -197452, 136130, 200521, -330938, -229779, -128182, 106056, -206173, -248408, -375771, 206619, -35652, -55282, -170387, 103101, -39343, -229384, -56435, -165961, 157215, 136161, -293156, 55052, -156261, 281261, -108423, -47912, -113324, -22969, -440617, -302306, -161056, -178270, -119992, -75938, -414397, -329916, 91109, 452299, -37084, -90804, -64210, 6426, -35766, 151330, 110300, -247409, 114084, -336907, -186726, -165042, -231546, 164530, 22641, -118698, 66404, -47299, 11724, 117830, -251072, -27263, 14912, -102361]
9737i7150B15335b65596C20286e5449H9883d2993k31771C3622h6093q1473d7490
9725g8754K2418k10888f6570A04934a1623j25697O1131B86123A03359d1621l6163
9714g7784m6550M9805a3076j46919N643G6130K4161c35618b8149q4898d8156B49886
9701c40913Q4728a1593A62567c7461F4395b7993k46785J25100j47847c3302m58924
9690d92226a38223j12888N9415k13633L8167A50065b50097I7390a23640o8640
9680a92280f8661l2547k429k03090J33412P2683o2882I5466A813a12451j44125
9669b56576A00666o435K129N6050b47304J22251C602J87889m0760a74883O98k03085
9657c77270J59788d8465k07043c1543R707j18502e9936A3953a95902i5307m2693
$$ y = [-97150, 215335, -265596, 320286, -55449, 89883, -42993, -274764, 33622, -86093, -167566, -47490, -78754, -56336, -267224, -66570, 104934, -11623, -137320, -76189, 286123, 103359, -41621, -77784, -124334, -74529, -13076, -159995, -154352, 76130, 100291, -335618, -28149, -113047, -48156, 249886, -340913, -256185, -11593, 162567, -37461, 64395, -27993, -274778, -149678, -297525, -33302, -492226, -138223, -251111, -191696, -405329, -367162, 150065, -250097, 97390, -123640, -192280, -68661, -101208, -103637, -306727, -173315, -100632, -163514, 95466, 1813, -112451, -256576, 100666, 94231, 96360, 152410, -247304, -125053, 3602, 191491, 150731, -174883, -174185, -377270, -217482, -48465, -255508, -31543, -21836, -140338, -59936, 13953, -195902, -95307, -138000]
9646a38000M2025K0798H5846e3491D35967A41183K1191g2693B43459e11435l5565
9635e47000C428J65431a82585j3568L8728D1415J8411q063c7647B98263a13025
9623A57928a72575A14729a13168k72446B67833E0084L7546l6631c07936J48022
9613a59914B48848D7210g7531R009j07117g5964p9026q7066a3204k1648J0598
9602b4254H8726e4502j26381m7678A31146G839b33219B35676c64088J72541A11859
9590b15912c8207j5569A68554p0710b9218A72325K3352a52068B17538f3251G823
9578a38508F7151e0942A28809d67630a2022j89020A72109d2525l47387A2198b1244
9566A11926c38748R5737F4489O0476a97176j0138A34888E888e2698m2261a3847
$$ y = [-138000, -95975, -75177, 85846, -53491, 435967, 141183, 162374, -72693, 243459, -511435, -547000, 3428, 168859, -182585, -196153, -157425, 41415, 59826, 51763, -37647, 298263, -113025, 157928, -172575, 114729, -113168, -385614, 267833, 50084, 87630, 50999, -307936, -159914, 248848, 47210, -77531, -68522, -175639, -75964, -154990, -242056, -13204, -34852, -24254, 88726, -54502, -180883, -228561, 131146, 7839, -233219, 235676, -364088, -191547, 111859, -215912, -38207, -53776, 168554, 97844, -29218, 172325, 195677, -152068, 217538, -63251, 7823, -138508, 67151, -50942, 128809, -467630, -12022, -201042, 172109, -42525, -389912, 12198, -21244, 111926, -338748, -243011, 64489, 124965, -197176, -207314, 134888, 5888, -52698, -94959, -13847]
9554b08828A46581f42n4030A39915c9835p043A04188c01149E1992b58257A32211
9542e20098C92a44824D115d8165l42005A78662B7075h040p3529j71185L8697a02408
9529a72857j03832A11529c0394H1070b14833C81246a29487j42327G6647L1224
9519A07871B086a37866m85505b2310j4806j86q0207d1395j1904D069i691k17851
9507b27542q1159B07128a65799k12075l6247a91457d6394i526A4586d7448j15746
9496a63194c4423B4805b37305C40739a01547C20117I9356Q8275l4774c47677B16691
9484i750m32875a53958A69300b73764l6152C0442a09266j67574j29777A28758
9473e7135p261n5556Q11d7560A13861f5515B06496a26138p9959A08236b69361
$$ y = [-208828, 146581, -642, -54672, 139915, -39835, -46878, 104188, -301149, 51992, -258257, 132211, -520098, 392, -144824, 4115, -48165, -390170, 178662, 27075, -8040, -81569, -252754, -214057, -102408, -172857, -276689, 111529, -30394, 81070, -214833, 381246, -129487, -271814, 76647, 107871, 2086, -137866, -623371, -22310, -37116, -37302, -117509, -41395, -53299, 4069, -9691, -227542, -308701, 207128, -165799, -377874, -414121, -191457, -46394, -9526, 14586, -47448, -163194, -34423, 24805, -237305, 340739, -101547, 320117, 99356, 187631, 152857, -347677, 216691, -9750, -442625, -153958, 169300, -273764, -309916, 30442, -109266, -276840, -406617, 128758, -57135, -64396, -119952, -119141, -47560, 113861, -65515, 206496, -126138, -206097, 108236, -269361]
9461H0129a16537C3622J63833D6445a42012L8845j01193C05888a27760C8842c60741
9449A14353b65996A70836g330l12919K8862B3180b3707r628m6283A22893a3754
9437E4184a18572d644B09195a17462a4332A12785c92412B38497b02482R4561r5248
9426b03169q5255A6327l272J46907j9125F4402a88094f8947b9973B31731D3081
9414E7821A1018J17693B0659K2436c63906C26420A28818a69565c2829A28842b0923
9402b49997O5965A37716E9965J77160A05706e983q587k02537E842f8694a3521
9390E7090A6794L105a04188L2458q195j18506j36629A18829a44775L4227b8228
9378b5501H4250a68450j60110F8425b51163A04074h8627A50943j0193i4159j32609
$$ y = [80129, -116537, 33622, 197455, 46445, -142012, -103167, -204360, 305888, -127760, 38842, -360741, 114353, -265996, 170836, -7330, -320249, -291387, 23180, -23707, -33335, -79618, 122893, -13754, 54184, -118572, -4644, 209195, -117462, -14332, 112785, -392412, 238497, -202482, -107921, -203169, -288424, 16327, 13055, 159962, 140837, 64402, -188094, -68947, -29973, 231731, 43081, 57821, 11018, 128711, 20659, 43095, -363906, 326420, 128818, -169565, -32829, 128842, -20923, -249997, -184032, 137716, 59965, 237125, 105706, -5983, -14570, -217107, 5842, -68694, -13521, 57090, 16794, 19899, -104188, -71730, -79925, -198431, -335060, 118829, -144775, -110548, -28228, -25501, 84250, -168450, -328560, 68425, -251163, 104074, -88627, 150943, 140750, -94159, -226768]
9367b26768d5798k62036M2280i328B38124b32170J00985j16027r6188A43494B8478
9355b80413D4680b70160e2089j01767l9858D3998c3550I2442j4638b7252p1330
9344i8582G9786b02341G9146b14694A43454D9664A6119a3917p7435l21273B15182
9332A67146J02776c06721j96580a91513D317J41764m5630a04282M7001q0824q8259
9321b26364h5970k07597A11941a73575A1130c70850f6104A91872c41892G367b15999
9309a12336A21451a75752j12559c708j48609j500j52665J03674q4066A8587R347
9298B7934a61067B3034h5308L6049J8283o8833a3458A21349N985a48731P3739
9287g4992l14354c1365A09288E055g5396E25906i8951p8754E9340O137c09715
$$ y = [-226768, -45798, -307834, -265554, -9328, 238124, -232170, -131185, -247212, -343400, 143494, 28478, -280413, 44680, -270160, -52089, -153856, -193714, 43998, -33550, 92442, 77804, -27252, -98582, 79786, -202341, 79146, -214694, 143454, 49664, 16119, -13917, -91352, -412625, 215182, 167146, 269922, -306721, -503301, -191513, 4317, 146081, 100451, -104282, -57281, -138105, -226364, -85970, -293567, 111941, -173575, 11130, -370850, -66104, 191872, -341892, 7367, -215999, -112336, 121451, -175752, -288311, -3708, -152317, -153817, -306482, -202808, -286874, 18587, 27934, -161067, 23034, -85308, -49259, -30976, -99809, -13458, 121349, 127334, -148731, -74992, -389346, -31365, 109288, 5055, -75396, 525906, -98951, -177705, 59340, 65477, -309715]
9275A6558J78918Q3981b37676a18193A93168a99820B54155a79523A53501J478
9265A54979a91590Q906d3091j36516O6484F1183c19128d6094J2897k04390k30278
9254d67865C418g5503G4924a11948p1129P9749b3132B19889a31945C23228i426
9242a41996k65401h4266M0811A14908d6507n5572A16779a25075C2029J7295P546
9231E6870a62297B93924H7073b45119A43902h3051I1971D298c23946A44226a2505
9219B6362e8390l10963A04256e4998o279A91276b15292g3929A60658a51452k7718
9208a79170f5160j09815j81051P5600O5939g7690B21059a97868g0096j35726B7979
9196A30535a13181K3744G8131b03134b3158J0994A80264l0110a18386B99345F5287
$$ y = [16558, 195476, 279457, -237676, -118193, 193168, -199820, 254155, -179523, 153501, 154979, -191590, -182684, -43091, -179607, -113123, 61183, -319128, -46094, -33197, -237587, -467865, 3418, -75503, 74924, -111948, -183077, -103328, -23132, 219889, -131945, 323228, -9426, -141996, -407397, -84266, -43455, 114908, -46507, -102079, 116779, -125075, 32029, 49324, 56870, -162297, 293924, 87073, -245119, 143902, -83051, 91971, 4298, -323946, 144226, -12505, 26362, -58390, -369353, 104256, -54998, -61277, 191276, -215292, -73929, 160658, -151452, -179170, -65160, -174975, -356026, -280426, -214487, -77690, 221059, -197868, -70096, -205822, 27979, 130535, -113181, -89437, 78131, -203134, -23158, -12164, 180264, 150154, -118386, 299345, 65287]
9184c51593I0200h527H6825R7040h3547A29031E9144b83178i8132d3035q452G6565
9171E8812a67112D8822e8012A07885f3479j61795c5538l51637a4342A74663n2790
9160A21873L2266K48902a82814h1413l0525A25448b13989D15522b09511O2396
9150a47115m9624P535N7552j5167l58723d4291j83521k64600H5568A3991F49a53696
9137a3091j37956k49264a6499r7496j26399f4919j85457b2360o6387F7285b75925
9125b50451C33305H2423i8281A36157J31319A15955O2034b833A98051E2305c7412
9113A65169C2619a29424I5220J2185J32788a85919B36633n9748a83537m2605A99701
9101c22708E1057a99441N5816A89038B779a00222A25444a80354p2403B28973a34624
$$ y = [-351593, 90200, -8527, 86825, 183865, -83547, 129031, 59144, -283178, -98132, -43035, -51487, 76565, 58812, -167112, 48822, -58012, 107885, -63479, -225274, -35538, -387175, -14342, 174663, 121873, 154139, 403041, -182814, -81413, -111938, 125448, -213989, 415522, -209511, -147115, -196739, -189204, -131652, -146819, -505542, -44291, -227812, -492412, 85568, 13991, 649, -153696, -13091, -151047, -400311, -16499, -113995, -240394, -64919, -250376, -22360, -88747, 67285, -275925, -250451, 333305, 82423, -98281, 136157, 267476, 115955, 177989, -2833, 198051, 52305, -37412, 165169, 32619, -129424, 95220, 107405, 240193, -185919, 236633, 176885, -183537, -226142, 199701, -322708, 51057, -199441, -143625, 189038, 2779, -100222, 125444, -180354, -252757, 228973, -134624]
9089A00958J84706A30035b24215M4241E984c25245A37429C6477K51963b78265
9078b78626j61488A0091a13778j25110A15924a42741F7913K15337a33649A07747
9067a21900j37170B7420a0709A92284e3848a751j36767c6452H7574a72640C22997
9055a80795c7152m9750G0364d48713d1012A25794C0187f9614B04647b16473J03624
9044a12849e2295q6114n5919d6718D334a87343m283A01334q617a39078N8951B78976
9031b78477k08847h1818k37314a51348f9888j77825B2621J9458c20503d4738o9376
9020a14114a204k72545a4127C5087J22405g7851B0488h8202k47183A39907E0294
9008a76786A81356a89804j58172f9471o2926N9619B3589M5166a37517O7224B04359
$$ y = [100958, 285664, 130035, -224215, -179974, 5984, -325245, 137429, 36477, 288440, -278265, -278626, -440114, 10091, -113778, -238888, 115924, -142741, 67913, 283250, -133649, 107747, -121900, -259070, 27420, -10709, 192284, -53848, -1751, -138518, -36452, 87574, -172640, 322997, -180795, -37152, -86902, 70364, -448713, -41012, 125794, 30187, -69614, 204647, -216473, -112849, -52295, -138409, -194328, -46718, 4334, -187343, -191626, 101334, 92717, -139078, -80127, 278976, -278477, -487324, -81818, -319132, -151348, -69888, -247713, 22621, 42079, -320503, -44738, -114114, -1204, -273749, -14127, 35087, 157492, -77851, 20488, -88202, -335385, 139907, 50294, -176786, 181356, -189804, -347976, -69471, -132397, -72778, 23589, 68755, -137517, -70293, 204359]
8996a09887k25322k2913A77161h5938E9852a78297j99372a7518k14627i809k31502
8985b41311O8860d2113C36603a25564l2660C5321j0954a11857H7294g5808r1472
8974a67280A71318j4899g4358G7621J2940L7884D0339a0513k1182A11519Q8301
8963A99820C0187b28592k3275h6012C809a6705F243O8063g8130b2524A88788h6462
8950b26672b4631l65565D5338f9967A1748J74006P8960n8210E2153e8213l3880
8939i2093l1760A6804a0656j02413E0591P0812C4449d6505j9182j10966J0769
8928a65884B78165i6212j34217A02554j5011k971A4597g4779C62406J0612E1090
8916A72240a1846H1406Q5452k2275Q9088K78994N77000L09621J204313J865287
$$ y = [-109887, -335209, -358122, 177161, -85938, 59852, -178297, -377669, -17518, -232145, -9809, -241311, -172451, -42113, 336603, -125564, -158224, 35321, 24367, -111857, 87294, -75808, -167280, 171318, 156419, -74358, 77621, 90561, 128445, 40339, -10513, -31695, 111519, 199820, 30187, -228592, -251867, -86012, 3809, -16705, 6243, 74306, -78130, -22524, 188788, -86462, -226672, -24631, -390196, 45338, -69967, 11748, 185754, 264714, 206504, 52153, -58213, -92093, -123853, 16804, -10656, -113069, 50591, 121403, 34449, -46505, -65687, -176653, -165884, 278165, -96212, -230429, 102554, 87543, 84572, 14597, -74779, 362406, 373018, 51090, 172240, -11846, 81406, 166858, 144583, 233671, 512665, 1089665, 1399286, 2603599, 4468886]
8906D468886N683721l041344C286022j160836r07954k34077D27734C6838K92543
8897C29381H6905L93499A58537J81094n0220b8852C56448j65148A3452Q4102c73111
8885E3881r213L85574a2374e692A18457B7223g7007A03577i6351c4814l4309r7772
8873a66895N096A10030O6724b31882D1645b42675B2855Q3061B6141b91902A10569
$$ y = [4468886, 10152607, 7111263, 3286022, 2125186, 1217232, 983155, 427734, 36838, 329381, 86905, 480404, 158537, 339631, 289411, -28852, 356448, 191300, 13452, 97554, -373111, 53881, 44668, 430242, -12374, -5692, 118457, 27223, -77007, 103577, -96351, -34814, -69123, -166895, -161799, 110030, 176754, -231882, 41645, -242675, 22855, 105916, 26141, -291902, 110569]
$$ [...]
##END NTUPLES=NMR SPECTRUM
##END=
