
##TITLE=AC1222_Punto_6074794_1Xs9jaGfa0
##JCAMPDX= 6.0         $$ Bruker NMR JCAMP-DX V2.0
##DATA TYPE= NMR SPECTRUM
##DATA CLASS= NTUPLES
##ORIGIN= BRUKER
##OWNER= Administrator
$$ 1.72 TOPSPIN		Version 2.1
$$ 2012-05-09 00:42:51.859 -0500  Administrator@TOPSPIN
$$ Compression mode = diff/dup
##.OBSERVE FREQUENCY= 400.13188235
##.OBSERVE NUCLEUS= ^1H
##.ACQUISITION MODE= SIMULTANEOUS (DQD)
##.ACQUISITION SCHEME= undefined
##.AVERAGES= 64
##.DIGITISER RES= 22
##SPECTROMETER/DATA SYSTEM= spect
##.PULSE SEQUENCE= noesygpps1d.comp
##.SOLVENT NAME= COFFEE_meoh
##.SHIFT REFERENCE= INTERNAL, COFFEE_meoh, 1, 14.96668
##AUDIT TRAIL= $$ (NUMBER, WHEN, WHO, WHERE, PROCESS, VERSION, WHAT)
$$ ##TITLE= Audit trail, TOPSPIN		Version 2.1
$$ ##JCAMPDX= 5.01
$$ ##ORIGIN= Bruker BioSpin GmbH
$$ ##OWNER= Administrator
$$ $$ C:\Bruker\TOPSPIN/data/COFFEE/nmr/AC1222_Punto_6074794_1Xs9jaGfa0/82/pdata/1/auditp.txt
$$ ##AUDIT TRAIL=  $$ (NUMBER, WHEN, WHO, WHERE, PROCESS, VERSION, WHAT)
(   1,<2012-05-09 00:42:47.125 -0500>,<Administrator>,<TOPSPIN>,<go>,<TOPSPIN 2.1>,
      <created by zg
	started at 2012-05-09 00:31:16.953 -0500,
	POWCHK enabled, PULCHK disabled,
       configuration hash MD5:
       AF F2 23 6B 01 CD 40 DD E5 A1 38 A0 06 EA F7 77
       data hash MD5: 64K
       5D 22 DE 1C FA 70 27 51 54 71 04 BC 36 B3 E7 F4>)
(   2,<2012-05-09 00:42:49.828 -0500>,<Administrator>,<TOPSPIN>,<proc1d>,<TOPSPIN 2.1>,
      <Start of raw data processing
       efp LB = 0.3 FT_mod = 6 PKNL = 1 PHC0 = 0 PHC1 = 0 SI = 128K 
       data hash MD5: 128K
       80 1C 0A 3D 9F 62 0F B9 75 FF 25 76 2C AD 7A 1C>)
(   3,<2012-05-09 00:42:51.109 -0500>,<Administrator>,<TOPSPIN>,<proc1d>,<TOPSPIN 2.1>,
      <pk PHC0 = 32.7832 PHC1 = 0 
       data hash MD5: 128K
       76 20 4C 07 0A 68 13 65 A3 04 60 4B 7A F0 F1 21>)
(   4,<2012-05-09 00:42:51.343 -0500>,<Administrator>,<TOPSPIN>,<proc1d>,<TOPSPIN 2.1>,
      <abs ABSG = 1 
       data hash MD5: 128K
       6A 90 5A 03 A1 B1 83 7C B5 FB 07 E9 EE E1 BF 39>)
(   5,<2012-05-09 00:42:51.421 -0500>,<Administrator>,<TOPSPIN>,<proc1d>,<TOPSPIN 2.1>,
      <abs ABSG = 2 
       data hash MD5: 128K
       BA 70 36 D7 64 77 F3 F5 7A 10 0D BA C1 8E 6A 67>)
(   6,<2012-05-09 00:42:51.656 -0500>,<Administrator>,<TOPSPIN>,<proc1d>,<TOPSPIN 2.1>,
      <abs ABSG = 3 
       data hash MD5: 128K
       32 91 B4 17 16 C8 5E 8D EC B9 01 A3 59 4E 88 11>)
(   7,<2012-05-09 00:42:51.718 -0500>,<Administrator>,<TOPSPIN>,<proc1d>,<TOPSPIN 2.1>,
      <abs ABSG = 4 
       data hash MD5: 128K
       B6 5C 65 95 69 14 10 49 41 E9 98 E3 E2 4E 59 45>)
(   8,<2012-05-09 00:42:51.765 -0500>,<Administrator>,<TOPSPIN>,<proc1d>,<TOPSPIN 2.1>,
      <abs ABSG = 5 
       data hash MD5: 128K
       80 FA C6 23 2A 1D 00 E5 6F 1B 2C 9B 43 5A D8 B4>)
$$ ##END=
$$ 
$$ $$ hash MD5
$$ $$ 1D F7 97 D7 59 8A A0 39 41 F0 B4 96 01 40 10 09
##$RELAX= 
##$RELAX= 
##$RELAX= 
##$RELAX= 
##$RELAX= 
##$RELAX= 
##$RELAX= 
##$RELAX= 
$$ Bruker specific parameters
$$ [...]
##$TP07= 0
##$TPNAME0= <>
##$TPNAME1= <>
##$TPNAME2= <>
##$TPNAME3= <>
##$TPNAME4= <>
##$TPNAME5= <>
##$TPNAME6= <>
##$TPNAME7= <>
##$TPOAL= (0..7)
0.5 0.5 0.5 0.5 0.5 0.5 0.5 0.5
##$TPOFFS= (0..7)
0 0 0 0 0 0 0 0
##$TUNHIN= 0
##$TUNHOUT= 0
##$TUNXOUT= 0
##$USERA1= <user>
##$USERA2= <user>
##$USERA3= <user>
##$USERA4= <user>
##$USERA5= <user>
##$V9= 5
##$VALIST= <valist>
##$VCLIST= <CCCCCCCCCCCCCCC>
##$VD= 0
##$VDLIST= <DDDDDDDDDDDDDDD>
##$VPLIST= <PPPPPPPPPPPPPPP>
##$VTLIST= <TTTTTTTTTTTTTTT>
##$WBST= 1024
##$WBSW= 4
##$XGAIN= (0..3)
0 0 0 0
##$XL= 0
##$YL= 0
##$YMAX_a= 11053588
##$YMIN_a= -6089086
##$ZGOPTNS= <>
##$ZL1= 120
##$ZL2= 120
##$ZL3= 120
##$ZL4= 120
##$ABSF1= 14.96668
##$ABSF2= -5.585851
##$ABSG= 5
##$ABSL= 3
##$ALPHA= 0
##$AQORDER= 0
##$ASSFAC= 0
##$ASSFACI= 0
##$ASSFACX= 0
##$ASSWID= 0
##$AUNMP= <proc_prof1d_extract.lims>
##$AXLEFT= 0
##$AXNAME= <>
##$AXNUC= <1H>
##$AXRIGHT= 0
##$AXTYPE= 0
##$AXUNIT= <>
##$AZFE= 0.1
##$AZFW= 0.1
##$BCFW= 0
##$BC_mod= 0
##$BYTORDP= 0
##$COROFFS= 0
##$CY= 15
##$DATMOD= 1
##$DC= 0
##$DFILT= <>
##$DTYPP= 0
##$F1P= 0
##$F2P= 0
##$FCOR= 0.5
##$FTSIZE= 131072
##$FT_mod= 6
##$GAMMA= 0
##$GB= 0
##$INTBC= 1
##$INTSCL= 1
##$ISEN= 128
##$LB= 0.3
##$LEV0= 0
##$LPBIN= 0
##$MAXI= 10000
##$MC2= 0
##$MEAN= 0
##$ME_mod= 0
##$MI= 0
##$NCOEF= 0
##$NC_proc= -3
##$NLEV= 6
##$NOISF1= 0
##$NOISF2= 0
##$NSP= 0
##$NTH_PI= 0
##$NZP= 0
##$OFFSET= 14.96668
##$PC= 1
##$PHC0= 32.7832
##$PHC1= 0
##$PH_mod= 1
##$PKNL= yes
##$PPARMOD= 0
##$PPDIAG= 0
##$PPIPTYP= 0
##$PPMPNUM= 2147483647
##$PPRESOL= 1
##$PSCAL= 4
##$PSIGN= 0
##$PYNMP= <proc.py>
##$REVERSE= no
##$SF= 400.130005574331
##$SI= 131072
##$SIGF1= 0
##$SIGF2= 0
##$SINO= 400
##$SIOLD= 131072
##$SPECTYP= <>
##$SREGLST= <1H.CDCl3>
##$SSB= 0
##$STSI= 131072
##$STSR= 0
##$SW_p= 8223.68421052632
##$SYMM= 0
##$S_DEV= 0
##$TDeff= 65536
##$TDoff= 0
##$TI= <>
##$TILT= no
##$TM1= 0
##$TM2= 0
##$TOPLEV= 0
##$USERP1= <user>
##$USERP2= <user>
##$USERP3= <user>
##$USERP4= <user>
##$USERP5= <user>
##$WDW= 1
##$XDIM= 131072
##$YMAX_p= 448067388
##$YMIN_p= -68520187
##$CURPLOT= <Network HP LaserJet P1505>
##$CURPRIN= <$Network HP LaserJet P1505>
##$DFORMAT= <normdp>
##$LAYOUT= <+/1D_H.xwp>
##$LFORMAT= <normlp>
##$PFORMAT= <normpl>
##$SURQMSG= 1
$$ End of Bruker specific parameters
$$ ---------------------------------
##NTUPLES= NMR SPECTRUM
##VAR_NAME=  FREQUENCY,     SPECTRUM/REAL,   SPECTRUM/IMAG
##SYMBOL=    X,             R,               I
##VAR_TYPE=  INDEPENDENT,   DEPENDENT,       DEPENDENT
##VAR_FORM=  AFFN,          ASDF,            ASDF
##VAR_DIM=   131072,        131072,          131072
##UNITS=     HZ,            ARBITRARY UNITS, ARBITRARY UNITS
##FACTOR=    0.0627417313425165, 1,          1
##FIRST=     8223.62146879498, 2417,         -111084
##LAST=      0,             7869,            -109676
##MIN=       0,             -68520187,       0
##MAX=       8223.62146879498, 448067388,    0
$$ Real data points
##PAGE= N=1
##DATA TABLE= (X++(R..R)), XYDATA
$$ [...]
63704C40348K304J761K463M093M670L678K367J284j68j599j429L16J255n1j782
63689C59510j429P97K754L427L385L005K188J495J768K654K948K382J849J958
63675C88691K526L379M361M701L788K510K429L497M032L263K392K640L685M692
63661D36586N566O261N975M249K203J491K300L251L140K075R42K98q9q17j976
63646D71455k756k235o05P92Q16m01j787k367j865p40K32O79J030J932L308M370
63630D71858M555M046L369K855K592K464K269K064K260L012L644L210J629j71
63616E09656j164j003j60L79q8j075j178J66J812K440K312K514L001K689J251
63601E21552m79j862l100m356n312n693n427m340k582j131q12r54k39J300K412
$$ y = [340348, 342652, 344413, 346876, 350969, 355639, 359317, 361684, 362968, 362800, 361201, 359772, 360088, 361343, 361292, 359510, 358081, 358878, 361632, 365059, 368444, 371449, 373637, 375132, 376900, 379554, 382502, 384884, 386733, 388691, 391217, 394596, 398957, 403658, 407446, 409956, 412385, 415882, 419914, 423177, 425569, 428209, 431894, 436586, 442152, 448413, 454388, 458637, 460840, 462331, 464631, 467882, 471022, 473097, 474039, 474337, 474248, 473431, 471455, 468699, 466464, 465859, 466651, 467467, 467066, 465279, 462912, 461047, 460307, 460539, 461218, 462248, 464180, 467488, 471858, 476413, 480459, 483828, 486683, 489275, 491739, 494008, 496072, 498332, 501344, 504988, 508198, 509827, 509656, 508492, 507489, 507329, 507708, 507620, 506545, 505367, 505533, 507345, 509785, 512097, 514611, 517612, 520301, 521552, 521073, 519211, 516111, 511755, 506443, 500750, 495323, 490983, 488401, 487270, 486458, 485504, 485265, 486565, 488977]
63586D88977K612K581K646K472K377L194M534M960M416M619O361Q232R073R791
63572E56845J1401J2923J2965J2168J2238J3343J4189J4253J4292J4926J6052
63561G05595J7600J9730K2297K5034K8075L1524L4767L7099L8804M0731M2960
63550A044216M4771M5869M6833M8163M9563N0239M9520M6979M2374L5697K7411
63539A531635J8596J0594M128j126n733r650j2793j5884j9613k3088k4596k4194
63527A428276k4241k6865l1862l7370m1423m2511m0147l5731l1768k9443k7863
63516A059052k6025k4046k1877j8623j4239j0380q142o326l353L24L327N677Q256
63503I43625J0917J2979J4879J7557K0656K3041K4725K6658K9066L1476L3952
$$ y = [488977, 491589, 494170, 496816, 499288, 501665, 504859, 509393, 514353, 518769, 523388, 529749, 537981, 547054, 556845, 568246, 581169, 594134, 606302, 618540, 631883, 646072, 660325, 674617, 689543, 705595, 723195, 742925, 765222, 790256, 818331, 849855, 884622, 921721, 960525, 1001256, 1044216, 1088987, 1134856, 1181689, 1229852, 1279415, 1329654, 1379174, 1426153, 1468527, 1504224, 1531635, 1550231, 1560825, 1564953, 1563827, 1558094, 1548444, 1535651, 1519767, 1500154, 1477066, 1452470, 1428276, 1404035, 1377170, 1345308, 1307938, 1266515, 1224004, 1183857, 1148126, 1116358, 1086915, 1059052, 1033027, 1008981, 987104, 968481, 954242, 943862, 935720, 929394, 926041, 926365, 929692, 935369, 943625, 954542, 967521, 982400, 999957, 1020613, 1043654, 1068379, 1095037, 1124103, 1155579, 1189531]
63492A189531L6693L8912L9940M1009M4061M8978N3780N7302N9538N9377N4544
63481A723665M4599L2080J9814Q670j344r499j5101j8463k0064j9887j8610j8279
63469A707581k0406k4218k8063l1841l6718m2747m8245n1686n3128n3424n2943
63458A264162n1583m9505m7159m4661m1770l8585l5716l3450l1106k7945k4469
63447H38213k2031k0989k0118j8200j5465j3046j1633j1159j1143j0779r431p543
63435F66676o329n955n092l116j539j927l319l422j793m5P45J033J252J232J365
63420F39766K550M320M737L087J258J243K418K552R16r87j622j278j444k908m832
63405F49776n652m743k989j663j122r64j009j345j624j219j55Q54J526K558M683
$$ y = [1189531, 1226224, 1265136, 1305076, 1346085, 1390146, 1439124, 1492904, 1550206, 1609744, 1669121, 1723665, 1768264, 1800344, 1820158, 1828828, 1827484, 1817985, 1802884, 1784421, 1764357, 1744470, 1725860, 1707581, 1687175, 1662957, 1634894, 1603053, 1566335, 1523588, 1475343, 1423657, 1370529, 1317105, 1264162, 1212579, 1163074, 1115915, 1071254, 1029484, 990899, 955183, 921733, 890627, 862682, 838213, 816182, 795193, 775075, 756875, 741410, 728364, 716731, 705572, 694429, 683650, 674219, 666676, 660347, 654392, 649300, 646184, 644645, 642718, 639399, 635977, 634184, 634139, 634884, 635917, 637169, 638401, 639766, 642316, 646636, 651373, 654460, 655718, 656961, 659379, 661931, 662847, 661860, 660238, 658960, 657516, 654608, 649776, 644124, 639381, 636392, 634729, 633607, 632643, 631634, 630289, 628665, 627446, 627291, 628145, 629671, 632229, 636912]
63390F36912P616J0207J1510J1723J2177J4053J6872J8756J8841J8795K1060K5809
63378H24331L0760L3981L5843L7901M0735M3329M4135M2473L9077L5357L2144
63367A240066K9456K7513K7079K8277K9975L1377L3397L7182M2006M6158M9539
63356A622025N3470N7942O0776O0033N5856M9366M1066L1104K0136R142r71r249
63344B050696j4949j8293k0371k2043k3604k5506k8440l2456l6954m1644m6638
63333A739798n1382n4700n6156n6328n5399n2741m8428m3958m0646l8085l4921
63322A207054l0468k5111j9833j5793j3448j1697q797m587p88J460L248O243J0477
63309A097960J4796J8737K2743K6922L0750L3950L6961M0446M4570M8576N1112
$$ y = [636912, 644528, 654735, 666245, 677968, 690145, 704198, 721070, 739826, 758667, 777462, 798522, 824331, 855091, 889072, 924915, 962816, 1003551, 1046880, 1091015, 1133488, 1172565, 1207922, 1240066, 1269522, 1297035, 1324114, 1352391, 1382366, 1413743, 1447140, 1484322, 1526328, 1572486, 1622025, 1675495, 1733437, 1794213, 1854246, 1910102, 1959468, 2000534, 2031638, 2051774, 2060916, 2059945, 2050696, 2035747, 2017454, 1997083, 1975040, 1951436, 1925930, 1897490, 1865034, 1828080, 1786436, 1739798, 1688416, 1633716, 1577560, 1521232, 1465833, 1413092, 1364664, 1320706, 1280060, 1241975, 1207054, 1176586, 1151475, 1131642, 1115849, 1102401, 1090704, 1081907, 1077320, 1076532, 1077992, 1081240, 1087483, 1097960, 1112756, 1131493, 1154236, 1181158, 1211908, 1245858, 1282819, 1323265, 1367835, 1416411, 1467523]
63298A467523N1635N1622N3405N7303O0799O1220N8283N3323M6890L8416K7824
63287B028243J6221N015m918j3160j9455k3625k5572k5607k5010k5740k8940l3901
63275A823551l8871m2771m5866m8984n2287n4763n5022n2890m9925m7595m5311
63264A289266m1388l5933l1136k8188k5488k1251j6743j5304j8353k3727k8021
63253A003734k9603k9144k8047k6896k5266k2777k0007j8040j7275j7204j7287
63242G52188j7204j6329j4060j1086r192r126r571q971p490o292n753n513n634
63229F25967o359p041o539m815l256l215m714o537p179n909l389j022M90J505
63215E67987K125J608j25j388n76J401K024M30j534j782k02J989L908N248N708
$$ y = [1467523, 1519158, 1570780, 1624185, 1681488, 1742287, 1803507, 1861790, 1915113, 1962003, 2000419, 2028243, 2044464, 2049479, 2044561, 2031401, 2011946, 1988321, 1962749, 1937142, 1912132, 1886392, 1857452, 1823551, 1784680, 1741909, 1696043, 1647059, 1594772, 1540009, 1484987, 1432097, 1382172, 1334577, 1289266, 1247878, 1211945, 1180809, 1152621, 1127133, 1105882, 1089139, 1073835, 1055482, 1031755, 1003734, 974131, 944987, 916940, 890044, 864778, 842001, 821994, 803954, 786679, 769475, 752188, 734984, 718655, 704595, 693509, 684317, 675191, 665620, 656649, 649159, 642867, 637114, 631601, 625967, 619608, 612567, 606028, 601213, 597957, 594742, 590028, 583491, 576312, 570403, 567014, 565992, 566482, 567987, 570112, 571720, 571595, 570207, 569631, 571032, 573056, 573486, 571952, 570170, 569968, 571957, 575865, 581113, 586821]
63200E86821N161M166L587L829M720N994P400Q513Q978R144J0012J2176J4901
63187F85402J6678J6874J6492J7002J8653K0324K1043K1165K2006K4552K8473
63176I08664L2193L4148L4259L4043L4802L6026L6203L4930L3301L2252L1555
63165A282376L0694K9829K9434K9647L0366L1325L1783L0834K8417K5530K2961
63154A603196K0291J6359J0272J946p499j5847k1297k4263k6840l0177l3399l5464
63142A457278l6561l6913l5540l1645k6417k2008j9077j6487j3086q759m035L01
63130A207051L352M869N838P544J0078J2489J4296J6066J8293K0433K1352K0593
63118A362254J9010J8019J8127J8409J7900J7107J7107J7284J5435J0599M473
$$ y = [586821, 591982, 596148, 599735, 603564, 608284, 614278, 621678, 630191, 639169, 648313, 658325, 670501, 685402, 702080, 718954, 735446, 752448, 771101, 791425, 812468, 833633, 855639, 880191, 908664, 940857, 975005, 1009264, 1043307, 1078109, 1114135, 1150338, 1185268, 1218569, 1250821, 1282376, 1313070, 1342899, 1372333, 1401980, 1432346, 1463671, 1495454, 1526288, 1554705, 1580235, 1603196, 1623487, 1639846, 1650118, 1652064, 1644565, 1628718, 1607421, 1583158, 1556318, 1526141, 1492742, 1457278, 1420717, 1383804, 1348264, 1316619, 1290202, 1268194, 1249117, 1232630, 1219544, 1210785, 1206750, 1207051, 1210403, 1215272, 1221110, 1228654, 1238732, 1251221, 1265517, 1281583, 1299876, 1320309, 1341661, 1362254, 1381264, 1399283, 1417410, 1435819, 1453719, 1470826, 1487933, 1505217, 1520652, 1531251, 1535724]
63107A535724q74n361r979j4714j8942k3005k7675l2341l5394l6477l7032l8365
63095A255565m0160m1024l9858l6602l2372k8782k6484k4515k1772j8671j6486
63084I28839j5451j4649j3664j3059j2995j2564j0999q811p104o270n810n140
63072H02323m193l336k766k063n78J576L242L335K112R66J124K679M681N962O133
63057H21197N959O387P310P842P792P836Q059P560O056M713M565N036N036M571
63043I09919M303M338M516N059N802N704M345L065L171L818L297J750Q17J058
63029I60962J634K231L339M548M686M006M301O159P902Q088P640Q378J0663J3522
63015A048059J6158J8174J9107J8949J8791J9918K2298K4644K5993K6639K7532
$$ y = [1535724, 1534850, 1529489, 1519510, 1504796, 1485854, 1462849, 1435174, 1402833, 1367439, 1330962, 1293930, 1255565, 1215405, 1174381, 1134523, 1097921, 1065549, 1036767, 1010283, 985768, 963996, 945325, 928839, 913388, 898739, 885075, 872016, 859021, 846457, 835458, 826647, 819543, 813273, 807463, 802323, 798130, 794794, 792028, 789965, 789387, 790963, 794205, 797540, 799652, 800618, 801742, 804421, 809102, 815064, 821197, 827156, 833543, 840853, 848695, 856487, 864323, 872382, 879942, 885998, 890711, 895276, 900312, 905348, 909919, 914222, 918560, 923076, 928135, 933937, 939641, 943986, 947051, 950222, 954040, 957337, 959087, 959904, 960962, 962596, 964827, 968166, 972714, 977400, 981406, 985707, 991866, 999768, 1007856, 1015496, 1023874, 1034537, 1048059, 1064217, 1082391, 1101498, 1120447, 1139238, 1159156, 1181454, 1206098, 1232091, 1258730, 1286262]
63004A286262K9214L1632L4694L8491M2854M7073N0628N4058N8387O3696O8988
62993A805977P3652P7910Q1506Q3201Q2522Q0930Q0112P9985P9542P8789P8426
62982B682552P8317P7872P7484P7906P8451P7455P4480P0550O6160O0526N2938
62971C474691M3512L2347J9231M560j0512k5103l8993n1924o3373p2939q0127
62960C231370q4096q4709q3392q1743p9540p5437o9186o1780n3834m5531l7675
62949B474447l0851k3813j4891n032K856P808J1798J6430K1013K4644K7737L0470
62937B542616L1876L1800L1751L2425L2317L0325K7954K7052K6721K4358J8925
62926B858120J1584L814l787j1460k0122l0540m1801n1541n8456o3529o8139p2366
$$ y = [1286262, 1315476, 1347108, 1381802, 1420293, 1463147, 1510220, 1560848, 1614906, 1673293, 1736989, 1805977, 1879629, 1957539, 2039045, 2122246, 2204768, 2285698, 2365810, 2445795, 2525337, 2604126, 2682552, 2760869, 2838741, 2916225, 2994131, 3072582, 3150037, 3224517, 3295067, 3361227, 3421753, 3474691, 3518203, 3550550, 3569781, 3574341, 3563829, 3538726, 3499733, 3447809, 3384436, 3311497, 3231370, 3147274, 3062565, 2979173, 2897430, 2817890, 2742453, 2673267, 2611487, 2557653, 2512122, 2474447, 2443596, 2419783, 2404892, 2399860, 2402716, 2410524, 2422322, 2438752, 2459765, 2484409, 2512146, 2542616, 2574492, 2606292, 2638043, 2670468, 2702785, 2733110, 2761064, 2788116, 2814837, 2839195, 2858120, 2869704, 2873518, 2869731, 2858271, 2838149, 2807609, 2765808, 2714267, 2655811, 2592282, 2524143, 2451777]
62914B451777p5934p9060q1105q0219p5974p0819o7029o3877n9802n5771n3694
62903A688493n2535m9187m3121l7329l4266l3181l2122l0535k8978k7838k7303
62892A292098k7453k7771k7395k6252k5037k3956k2472k0542j8961j8226j7942
62881A036091j7729j7732j7962j7920j7215j5877j3957j1655r880r576j0177r735
62869H66676p219m019k545l730o216p677o751m158k137k312m040n203m704l539
62855H02426l320m368n636n998n183l774k627k249k513k963l260l359l360l506
62841G50310m059m876n293m700l207j494k23K18k05r36j054k57O59P07j11j047
62825G24432j595j632j000K73J437J638J041N68M69O7q03j122j61J047O97j366
$$ y = [2451777, 2375843, 2296783, 2215678, 2135459, 2059485, 1988666, 1921637, 1857760, 1797958, 1742187, 1688493, 1635958, 1586771, 1543650, 1506321, 1472055, 1438874, 1406752, 1376217, 1347239, 1319401, 1292098, 1264645, 1236874, 1209479, 1183227, 1158190, 1134234, 1111762, 1091220, 1072259, 1054033, 1036091, 1018362, 1000630, 982668, 964748, 947533, 931656, 917699, 906044, 896164, 886588, 876411, 866676, 859457, 855438, 852893, 849163, 842947, 835270, 828519, 824361, 822224, 819912, 815872, 810669, 805965, 802426, 799106, 794738, 789102, 783104, 777921, 774147, 771520, 769271, 766758, 763795, 760535, 757176, 753816, 750310, 746251, 741375, 736082, 731382, 728175, 726681, 726458, 726676, 726471, 725535, 724481, 724224, 724883, 725590, 725479, 724432, 722837, 721205, 720205, 720478, 721915, 723553, 724594, 725162, 725631, 725698, 724895, 723773, 723612, 724659, 725356, 723990]
62809G23990l105k583k28J721J778N76l12r5J025K537L757L745K221M66K04J520
62793G37217K838L054K753K860L249L271K854K362J983J859K169K550K092N20
62779G71631j186j908j580p57K59J230J718J703J903K732L568L682L243K769K371
62764G91378K285L178M991O262N816M393L533L599M085N073O871Q786R913J0771
62750H70934J2542J4775J5617J4503J3105J3170J4673J6499J7900J8854J9784
62739A042356K1234K3265K5242K6873K9045L2514L6310L8879M0728M4084M9670
62728A410200N5534N9879O3587O8863P6377Q4693R2001R7595J02085J06689J11939
62717B329442J16794J19405J18806J15315J09467J01425R1385P9489O5156M7697
$$ y = [723990, 720885, 718302, 718074, 719795, 721573, 722149, 721837, 721742, 722767, 725304, 729061, 732806, 735027, 735493, 735697, 737217, 740055, 743109, 745862, 748722, 751971, 755242, 758096, 760458, 762441, 764300, 766469, 769019, 771111, 771631, 770445, 768537, 766957, 766200, 766459, 767689, 769407, 771110, 773013, 775745, 779313, 782995, 786238, 789007, 791378, 793663, 796841, 801832, 808094, 813910, 818303, 821836, 825435, 829520, 834593, 841464, 850250, 860163, 870934, 883476, 898251, 913868, 928371, 941476, 954646, 969319, 985818, 1003718, 1022572, 1042356, 1063590, 1086855, 1112097, 1138970, 1168015, 1200529, 1236839, 1275718, 1316446, 1360530, 1410200, 1465734, 1525613, 1589200, 1658063, 1734440, 1819133, 1911134, 2008729, 2110814, 2217503, 2329442, 2446236, 2565641, 2684447, 2799762, 2909229, 3010654, 3102039, 3181528, 3246684, 3294381]
62707C294381K7896P872j1077k9316m7175o3625p7483q8810r8195j05496j10173
62696B698799j12263j12223j10399j07314j03820j00278r6183r1140q5555p9827
62686A699797p3760o7471o1896n7515n3451m8878m4343m0505l6622l1862k7383
62675A156111k5065k4414k2790j9058j5091j2930j2005j0362p471m515k521j374
62663I98515l74J126L535O612R328J0755J1158J1779J3426J5740J7889J9645K1720
62650A140854K5082K9978L5456M0121M3600M7042N1766N7689O3608O8825P3706
62639A677727P8541Q2704Q5398Q6659Q6954Q6223Q3973Q0092P4752O7666N8146
62628B548835M6160L2686J8707M351j0599k5707l9855n2104o2334p1023p8507
$$ y = [3294381, 3322277, 3330149, 3319072, 3289756, 3242581, 3178956, 3101473, 3012663, 2914468, 2808972, 2698799, 2586536, 2474313, 2363914, 2256600, 2152780, 2052502, 1956319, 1865179, 1779624, 1699797, 1626037, 1558566, 1496670, 1439155, 1385704, 1336826, 1292483, 1251978, 1215356, 1183494, 1156111, 1131046, 1106632, 1083842, 1064784, 1049693, 1036763, 1024758, 1014396, 1006925, 1002410, 999889, 998515, 998141, 999267, 1002802, 1009414, 1018742, 1029497, 1040655, 1052434, 1065860, 1081600, 1099489, 1119134, 1140854, 1165936, 1195914, 1231370, 1271491, 1315091, 1362133, 1413899, 1471588, 1535196, 1604021, 1677727, 1756268, 1838972, 1924370, 2011029, 2097983, 2184206, 2268179, 2348271, 2423023, 2490689, 2548835, 2594995, 2627681, 2646388, 2650739, 2640140, 2614433, 2574578, 2522474, 2460140, 2389117, 2310610]
62617B310610q4499q8346q9816q9358q7510q4353q0004p5313p1320o8104o4811
62606A427176o0907n6738n2762m8895m4871m0694l6527l2672k9683k7800k6236
62595I69391k3976k1404j9956j9788j9168j6990j4563j3705j4040j3682j2000
62584G80119j0138q981q109o829n141l408j943j086q93p62l1J044J621J568J608
62569G38639K146K681K525J599M80M5Q72K509L672L727L566M326N849P240Q438
62554G88314J0048J1972J3497J4588J5865J7321J8382J9187K0563K2527K4186
62543I76450K5441K7388L0638L4387L7780M1078M4785M8521N1483N3275N3838
62532A425064N3242N2028N1008N0112M8009M3252L5489K5533J4882N089l371j1655
$$ y = [2310610, 2226111, 2137765, 2047949, 1958591, 1871081, 1786728, 1706724, 1631411, 1560091, 1491987, 1427176, 1366269, 1309531, 1256769, 1207874, 1163003, 1122309, 1085782, 1053110, 1023427, 995627, 969391, 945415, 924011, 904055, 884267, 865099, 848109, 833546, 819841, 805801, 792119, 780119, 769981, 761000, 752891, 746062, 740921, 737513, 735570, 734484, 733591, 732829, 732798, 733842, 735463, 737031, 738639, 740785, 743466, 745991, 747590, 748070, 748115, 748987, 751496, 755168, 758895, 762461, 766787, 772636, 779876, 788314, 798362, 810334, 823831, 838419, 854284, 871605, 889987, 909174, 929737, 952264, 976450, 1001891, 1029279, 1059917, 1094304, 1132084, 1173162, 1217947, 1266468, 1317951, 1371226, 1425064, 1478306, 1530334, 1581342, 1631454, 1679463, 1722715, 1758204, 1783737, 1798619, 1803708, 1800337, 1788682]
62520A788682k0987l0653l8720m4641m9519n3596n5489n4621n2494n0482m8153
62509A289327m5135m2797m2128m1429l8398l3692l0039k8281k6598k3737k0755
62498I16338j9033j8280j7348j5622j3041r930p432o941q299r513q971p129n290
62485G69509l619j432J117K905L281K832K569K940L709M247L918K762J929K861
62471G99528N688Q859J0763J1412J2064J3464J5191J6719J8362K0774K4017K7596
62459I84437L1118L4477L7626M0603M3661M6962N0218N2911N4695N5377N4759
62448A486844N2828M9738M5371L9400L2203K4983J8302J1301L367m161r368j2350
62436A738458j4850j7347j8344j6875j4021j1209q364m613K90O110J2578J8896
$$ y = [1788682, 1767695, 1737042, 1698322, 1653681, 1604162, 1550566, 1495077, 1440456, 1387962, 1337480, 1289327, 1244192, 1201395, 1159267, 1117838, 1079440, 1045748, 1015709, 987428, 960830, 937093, 916338, 897305, 879025, 861677, 846055, 833014, 823084, 815652, 808711, 800412, 790899, 781928, 774799, 769509, 765890, 764458, 765575, 768480, 771761, 774593, 777162, 780102, 783811, 788058, 791976, 794738, 796667, 799528, 805216, 814075, 824838, 836250, 848314, 861778, 876969, 893688, 912050, 932824, 956841, 984437, 1015555, 1050032, 1087658, 1128261, 1171922, 1218884, 1269102, 1322013, 1376708, 1432085, 1486844, 1539672, 1589410, 1634781, 1674181, 1706384, 1731367, 1749669, 1760970, 1764337, 1760176, 1750808, 1738458, 1723608, 1706261, 1687917, 1671042, 1657021, 1645812, 1637448, 1632835, 1633125, 1639235, 1651813, 1670709]
62424A670709K3885K7659L2027L8145M4638M9347N2101N4231N5949N5939N3471
62413B158101M9383M4512L8376L0048J9632Q308k773j3317k3796l4675m5601n5460
62401B172738o3257o8784p2364p4411p5449p5968p5851p4258p0589o5254n9229
62390A397324n3328m8112m3903m0327l6407l1690k6822k2537j8637j4657j0986
62379A049918q474p256o627n908m873l632k686k760m069n952p592q758r570j0230
62365I61531j1303j3398j5943j7167j6054j3605j1368r733q473p949q431r042
62353H19065q842q318q472r048r085q562p931o716m440k349j978k396j321R33
62339G40540J402r70l358k956n70J286J929K282K624K679L017M325N866O408O317
$$ y = [1670709, 1694594, 1722253, 1754280, 1792425, 1837063, 1886410, 1938511, 1992742, 2048691, 2104630, 2158101, 2207484, 2251996, 2290372, 2320420, 2340052, 2348360, 2345587, 2332270, 2308474, 2273799, 2228198, 2172738, 2109481, 2040697, 1968333, 1893922, 1818473, 1742505, 1666654, 1592396, 1521807, 1456553, 1397324, 1343996, 1295884, 1251981, 1211654, 1175247, 1143557, 1116735, 1094198, 1075561, 1060904, 1049918, 1041444, 1034188, 1027561, 1021653, 1016780, 1013148, 1010462, 1007702, 1003633, 997681, 990089, 981331, 971761, 961531, 950228, 936830, 920887, 903720, 887666, 874061, 862693, 852960, 844487, 836538, 828107, 819065, 810223, 801905, 793433, 784385, 775300, 766738, 758807, 752091, 747651, 745302, 743324, 740928, 739607, 740540, 741942, 740972, 737614, 734658, 734088, 735374, 737303, 739585, 742209, 744888, 747905, 752230, 758096, 764504, 770821]
62324G70821O957Q353R157Q956Q980J0202J2157J4043J5816J7642J9255K0496
62312I22835K1775K3445K5270K6925K8533L0378L2568L5345L9166M4056M9281
62301A279577N4151N8819O3862O9350P4909Q0390Q5750R0229R2376R1311Q7641
62290B128365Q2579P6338O7844N6215M2167K7654J4164J665j0679k2969l4112
62279B429231m3007m9940n6354o3139o9445p3483p4312p2437o8938o4559n9772
62268A733845n5105n0912m7004m2865l8271l3681l0137k8654k9274l0701l1391
62257A315850l1115l0866l1130l1122l0164k8788k7638k6125k3546k0889j9904
62246A014563k0332j9839j7256j4335j3209j3280j2190r283o495n614n995n704
$$ y = [770821, 777778, 786131, 795288, 804244, 813224, 823426, 835583, 849626, 865442, 883084, 902339, 922835, 944610, 968055, 993325, 1020250, 1048783, 1079161, 1111729, 1147074, 1186240, 1230296, 1279577, 1333728, 1392547, 1456409, 1525759, 1600668, 1681058, 1766808, 1857037, 1949413, 2040724, 2128365, 2210944, 2287282, 2355126, 2411341, 2453508, 2481162, 2495326, 2496991, 2486312, 2463343, 2429231, 2386224, 2336284, 2279930, 2216791, 2147346, 2073863, 1999551, 1927114, 1858176, 1793617, 1733845, 1678740, 1627828, 1580824, 1537959, 1499688, 1466007, 1435870, 1407216, 1377942, 1347241, 1315850, 1284735, 1253869, 1222739, 1191617, 1161453, 1132665, 1105027, 1078902, 1055356, 1034467, 1014563, 994231, 974392, 957136, 942801, 929592, 916312, 904122, 894839, 888344, 882730, 876735, 871031]
62234H71031m015j879l17O63J429J856J712J456J938L313M910O311P851R728J1294
62219I17281J1853J1792J2175J3417J5007J6431J7633J8594J9169J9599K0622
62208A093573K2801K6031K9735L3269L6275L9176M3112M8688N4884O0140O4519
62197A552203O9677P6301Q2871Q7705R1041R3783R5044R2666Q6054P6932O6909
62186B471186N5691M2372K7473J2713o02j2194k2315l1633m1235n1656o1839o9937
62174B318024p5277p8642q0479p9963p6577p1680o7325o4013o0726n6967n3455
62163A552920n0721m8224m5351m2251l9159l5874l2620l0364k9307k7949k4914
62152A146186k1140j8772j8203j7780j6461j5091j4539j4106j2701j0489q312
$$ y = [871031, 867016, 865137, 864820, 865483, 866912, 868768, 870480, 871936, 873874, 877187, 882097, 888408, 896259, 905987, 917281, 929134, 940926, 953101, 966518, 981525, 997956, 1015589, 1034183, 1053352, 1072951, 1093573, 1116374, 1142405, 1172140, 1205409, 1241684, 1280860, 1323972, 1372660, 1427544, 1487684, 1552203, 1621880, 1698181, 1781052, 1868757, 1959798, 2053581, 2148625, 2241291, 2327345, 2404277, 2471186, 2526877, 2569249, 2596722, 2609435, 2608833, 2596639, 2574324, 2542691, 2501456, 2449800, 2387961, 2318024, 2242747, 2164105, 2083626, 2003663, 1927086, 1855406, 1788081, 1724068, 1663342, 1606375, 1552920, 1502199, 1453975, 1408624, 1366373, 1327214, 1291340, 1258720, 1228356, 1199049, 1171100, 1146186, 1125046, 1106274, 1088071, 1070291, 1053830, 1038739, 1024200, 1010094, 997393, 986904, 978592]
62141I78592o286m110k072o06P72K867N272O693O906P219Q639J0514J1588J1701
62127A037689J1832J2905J5153J8078K0547K1356K0500J9595K0232K2053K3300
62116A243240K3111K2349K2046K2153K2463K3748K6950L1705L6701M1419M6569
62105A562454N2651N8930O4126O7591O9293O9062O6333O0705N2484M2610L2085
62094B198324K1473J1011J003q263j6935k5359l3200l9486m4058m8181n2799n6698
62082A906832n7671n5368n1738m8527m5531m1726l6912l1639k6354k1394j7205
62071A472767j3878j0938q119n859m555l711k353J3K959N251N433L104k40k483
62057A437391l142l363l711l458k552k583m628p504r480j0580j1797j3038j3546
$$ y = [978592, 972306, 968196, 966124, 965518, 966290, 969157, 974429, 981122, 988028, 995247, 1003886, 1014400, 1025988, 1037689, 1049521, 1062426, 1077579, 1095657, 1116204, 1137560, 1158060, 1177655, 1197887, 1219940, 1243240, 1266351, 1288700, 1310746, 1332899, 1355362, 1379110, 1406060, 1437765, 1474466, 1515885, 1562454, 1615105, 1674035, 1738161, 1805752, 1875045, 1944107, 2010440, 2071145, 2123629, 2166239, 2198324, 2219797, 2230808, 2231811, 2223548, 2206613, 2181254, 2148054, 2108568, 2064510, 2016329, 1963530, 1906832, 1849161, 1793793, 1742055, 1693528, 1647997, 1606271, 1569359, 1537720, 1511366, 1489972, 1472767, 1458889, 1447951, 1439832, 1433973, 1429418, 1425707, 1423354, 1423367, 1426326, 1431577, 1437010, 1440114, 1439874, 1437391, 1434249, 1430886, 1427175, 1423717, 1421165, 1418582, 1413954, 1406450, 1396970, 1386390, 1374593, 1361555, 1348009]
62044A348009j3572j3882j4034j2813j0178p313m940k913j208R8J584L731N693
62031A278262O327O198O870Q318R013Q704R053J0898J2856J3585J3816J4967J7085
62018A415952J9393K1811K4664K7572K9787L1284L2651L4222L5943L7739L9487
62007A750505M0905M1893M2792M4153M6515N0100N4040N6195N4714M9791M2868
61996B274471L4477K4344J3444L880l832j1472k0239k8952l6299m3047n0328n7221
61984B099226o1991o4739o6772o8052o7411o4988o2330n9945n6709n2163m7669
61973A426457m4470m1951l8778l4841l1055k7923k5232k2879k1144k0077j9243
61962A098864j8134j6650j5111j3950j3439j3526j3852j3969j3653j3056j2543
$$ y = [1348009, 1334437, 1320555, 1306521, 1293708, 1283530, 1276217, 1271277, 1268364, 1267156, 1267254, 1268838, 1272569, 1278262, 1284589, 1290787, 1297657, 1305975, 1314988, 1323692, 1332745, 1343643, 1356499, 1370084, 1383900, 1398867, 1415952, 1435345, 1457156, 1481820, 1509392, 1539179, 1570463, 1603114, 1637336, 1673279, 1711018, 1750505, 1791410, 1833303, 1876095, 1920248, 1966763, 2016863, 2070903, 2127098, 2181812, 2231603, 2274471, 2308948, 2333292, 2346736, 2350616, 2346784, 2335312, 2315073, 2286121, 2249822, 2206775, 2156447, 2099226, 2037235, 1972496, 1905724, 1837672, 1770261, 1705273, 1642943, 1582998, 1526289, 1474126, 1426457, 1381987, 1340036, 1301258, 1266417, 1235362, 1207439, 1182207, 1159328, 1138184, 1118107, 1098864, 1080730, 1064080, 1048969, 1035019, 1021580, 1008054, 994202, 980233, 966580, 953524, 940981]
61951I40981j2312j2255j2111j1599j0380q315n975m399l899l540k349o91L33
61938H53489M54K94P4o34j792k669k938l050l258l190k744k439k622l233m508
61923H21234o745r055r736q544p318p577q596q851q151p276o527n792n298n142
61909G16626m761l925l490m117n031n132m573l983l007j053J073J883J189R3n90
61894F81202p09l2J440K847L547M296N888P244O824N516N927Q736J1818J3346
61880G57890J3658J3630J3310J3154J4529J7702K0691K1528K0484J9003J7721
61869I43300J6586J5729J4830J2727R143N793M200L338J265j539k661j547n71
61856A020593j643l509l696j906m3O25J072L050O929J1288J4320J5332J4995J4292
$$ y = [940981, 928669, 916414, 904303, 892704, 882324, 874009, 868034, 863635, 859736, 856196, 853847, 853156, 853489, 853943, 854237, 854311, 853677, 851885, 849216, 846278, 843228, 839970, 836780, 834036, 831597, 828975, 825742, 821234, 814489, 805434, 795698, 787154, 779836, 772259, 763663, 754812, 746661, 739385, 732858, 727066, 721768, 716626, 711865, 707940, 704450, 700333, 695302, 690170, 685597, 681614, 678607, 677554, 678627, 680510, 681699, 681792, 681202, 680493, 680461, 681901, 684748, 688295, 692591, 698479, 705723, 712547, 718063, 723990, 732726, 744544, 757890, 771548, 785178, 798488, 811642, 826171, 843873, 864564, 886092, 906576, 925579, 943300, 959886, 975615, 990445, 1003172, 1012315, 1018108, 1022308, 1025646, 1026911, 1025372, 1022711, 1021164, 1020593, 1018950, 1015441, 1011745, 1009839, 1009796, 1010421, 1011493, 1014543, 1021472, 1032760, 1047080, 1062412, 1077407, 1091699]
61842A091699J3451J2036R906P681N926M280J841j600n259q339j0741j2508j3155
61829A095218j2368j1017j0517j1121j1723j1547j1085j0961j0855j0372j0172
61818I73480j1112j2698j3510j3048j2174j1800j1934j2038j1540j0018p607n270
61806H40731l904l224k214n29J428L622O345R040J0536J0877J1685J4019J6878
61793I15290J8647J9156J9520K0679K2882K5910K8882L0405K9860K8187K6565
61782A185983K4738K1551J6881J2038Q253N650L730K073L20j792m043n750o412
61769A263220o088n049l448j390R36L390N892Q214R825J0083Q651N898K816J87
61755A303137k281n700j0616j6282k1452k5528k8484l0218l0527k9555k7638k5023
$$ y = [1091699, 1105150, 1117186, 1127092, 1134773, 1140699, 1144979, 1146820, 1145220, 1139961, 1131622, 1120881, 1108373, 1095218, 1082850, 1071833, 1061316, 1050195, 1038472, 1026925, 1015840, 1004879, 994024, 983652, 973480, 962368, 949670, 936160, 923112, 910938, 899138, 887204, 875166, 863626, 853608, 846001, 840731, 836827, 833603, 831389, 830860, 832288, 835910, 842255, 851295, 861831, 872708, 884393, 898412, 915290, 933937, 953093, 972613, 993292, 1016174, 1042084, 1070966, 1101371, 1131231, 1159418, 1185983, 1210721, 1232272, 1249153, 1261191, 1269444, 1275094, 1278824, 1280897, 1281217, 1279425, 1275382, 1269632, 1263220, 1257132, 1252083, 1248635, 1247245, 1248181, 1251571, 1257463, 1265677, 1275502, 1285585, 1294236, 1300134, 1302950, 1303137, 1300856, 1295156, 1284540, 1268258, 1246806, 1221278, 1192794, 1162576, 1132049, 1102494, 1074856, 1049833]
61743A049833k2224k0342k0056k0425j9584j7022j4309j3187j3527j3801j3150
61732H62206j2224j2023j2473j2497j1283r200p357o348n776n153m840n462o599
61719G50971o863n560l562k028r51K39J142O72j042k236j588M6Q06K38m26k10
61703G29648M65Q43J118J940L196M015L899L200K457J884J635J972K765L141K216
61688G64394J96j663k338k118k083k654l033k355j043m97j353k665l124k631k043
61673G34990j736j202j47Q26J028O98O38J161J853K225K179J850J454J329J812
61658G48958K787L583L514K551J344N12O2m04r90j332j232j126j514k155k347
61643G52211k076k201l279m717n475n245m441l466k602k334l041m289n069m963
$$ y = [1049833, 1027609, 1007267, 987211, 966786, 947202, 930180, 915871, 902684, 889157, 875356, 862206, 849982, 837959, 825486, 812989, 801706, 792506, 785149, 778801, 773025, 767872, 763032, 757570, 750971, 744108, 738548, 734986, 732958, 732007, 732246, 733388, 734060, 733018, 730782, 729194, 729240, 730046, 730284, 729858, 729648, 730113, 730956, 732074, 734014, 737210, 741225, 745124, 748324, 750781, 752665, 754300, 756272, 759037, 762178, 764394, 764590, 762927, 760589, 758471, 756388, 753734, 750701, 748346, 747303, 746806, 745453, 742788, 739664, 737033, 734990, 733254, 732052, 731905, 732731, 733759, 734457, 735095, 736256, 738109, 740334, 742513, 744363, 745817, 747146, 748958, 751745, 755328, 758842, 761393, 762737, 763249, 763311, 762907, 761917, 760585, 759353, 758227, 756713, 754558, 752211, 750135, 747934, 744655, 739938, 734463, 729218, 724777, 721311, 718709, 716375, 713334, 709045, 703976, 699013]
61629F99013m548m493m729m696m078k974j768j038j252k253l274l745l773l684
61615F52708l468k982k379j954j794j844k043k076j486m02K14l70j648k423k062
61600F25991p17J194K935L452K488J466K018L640M072K323n8j118p06J69R74J630
61584F49753J776J212O42R30J922K669K542J552J03r90r36q5J05r18j752j057
61568F57468K52J93j485l326m432n037n088m213l138l238m169l845j541O51N52
61553F19604j235k451k209j709k420m617p351r118q970p510o414o542p031o664
61539E45363n387l951k730j598o11j76o81k174m028n120n017m825n760o937o166
61524D90202l330j143j658l503m001k666j062k66k16r62k687m613n375m627l204
$$ y = [699013, 694465, 689972, 685243, 680547, 676469, 673495, 671727, 670689, 669437, 667184, 663910, 660165, 656392, 652708, 649240, 646258, 643879, 641925, 640131, 638287, 636244, 634168, 632682, 632280, 632494, 632124, 630476, 628053, 625991, 625274, 626468, 629403, 632855, 635343, 636809, 638827, 642467, 646539, 648862, 648804, 647686, 646980, 647149, 648123, 649753, 651529, 652741, 653383, 654313, 656235, 658904, 661446, 662998, 663101, 662111, 661175, 661090, 661195, 660277, 658525, 657468, 657720, 657913, 656428, 653102, 648670, 643633, 638545, 634332, 631194, 627956, 623787, 619942, 618401, 619052, 619604, 618369, 615918, 613709, 612000, 609580, 604963, 597612, 588494, 579524, 572014, 565600, 559058, 552027, 545363, 539976, 536025, 533295, 531697, 531086, 530910, 530229, 528055, 524027, 518907, 513890, 509065, 503305, 496368, 490202, 486872, 485729, 484071, 480568, 476567, 473901, 472839, 472573, 472357, 471395, 468708, 464095, 458720, 454093, 450889]
61509D50889j850q26m90j021j608j079N40K087K828L005K830K061Q59Q5K73R32
61493D59515J264J155J074J231J169L10r90j273M78L210M657M038K818K370K151
61478D83177J093l78j086r36o50l13L94R70O55j41k86L50R09J033J071R60K77
61461D87099o98j113p70k24J05J1q60k314l055k186p38k47m22J18J352K085K232
61444D80375K619K768J360q64j363M21J974J385k19j058j288j723j909j168l3
61429D81277R21K163L597L545J165j424j569L53J828J885J683J849J612P67N27
61414E00179J754L677M879M672L188R87r98j906j670r93n19l33j60K89R69J285
61398E15300O30n57r61n0J094J303R06R64J599K120K353K668K956K685J807P49
$$ y = [450889, 449039, 448213, 447723, 446702, 445094, 444015, 444555, 446642, 449470, 452475, 455305, 457366, 458225, 458310, 458583, 459515, 460779, 461934, 463008, 464239, 465408, 465718, 464728, 463455, 463933, 467143, 471800, 475838, 478656, 481026, 483177, 484270, 483892, 482806, 481870, 481220, 480907, 481301, 482271, 482926, 482785, 482499, 482849, 483758, 484791, 485862, 486822, 487099, 486401, 485288, 484518, 484294, 484399, 484410, 483550, 481236, 478181, 475995, 475257, 475010, 474588, 474706, 476058, 478143, 480375, 482994, 485762, 487122, 486258, 484895, 485316, 487290, 488675, 488456, 487398, 486110, 484387, 482478, 481310, 481277, 482198, 484361, 487958, 491503, 492668, 491244, 489675, 490028, 491856, 493741, 495424, 497273, 498885, 499652, 500179, 501933, 505610, 510489, 515161, 518349, 519336, 518338, 516432, 514762, 513769, 513250, 512917, 512757, 513046, 514015, 515300, 515930, 515373, 514412, 514362, 515456, 516759, 517665, 518629, 520228, 522348, 524701, 527369, 530325, 533010, 534817, 535566]
61382E35566l85j598k265j671k29R64J802L125M715M833K650J09J5K522M765M235
61366E59153J655j57J72J134O26j163k049p51J619L138L256K674J926J011J89
61351E72433lK91J16j056k497l124k815k342k194k209k389l199m493m813k858
61336E38848M76K646K381R52P7k78j021j860j547J60K096L068K773J600N64R31
61320E51866K722M043L322J754J794L524M626M001L117L233L505K903J972J420
61306E93802P16m54q87M09K404L447L433L197L030L146M398O813Q574Q275P273
61291F47576P817R666J0638R940Q761P912P039O193N992O025N152L809L894N710
61277G46124O975O044M460M788O993Q511P470M570J881O49M68Q4j202k894m010
$$ y = [535566, 535181, 533583, 531318, 529647, 529418, 530382, 532184, 535309, 540024, 544857, 547507, 547616, 547631, 550153, 554918, 559153, 560808, 560651, 560823, 561957, 562583, 561420, 559371, 558620, 560239, 563377, 566633, 569307, 571233, 572244, 572433, 572430, 572721, 572837, 571781, 569284, 566160, 563345, 561003, 558809, 556600, 554211, 551012, 546519, 541706, 538848, 539324, 541970, 544351, 545303, 545380, 545102, 544081, 542221, 540674, 540834, 542930, 545998, 548771, 550371, 550935, 551866, 554588, 558631, 561953, 563707, 565501, 569025, 573651, 577652, 580769, 584002, 587507, 590410, 592382, 593802, 594518, 594064, 593177, 593586, 595990, 599437, 602870, 606067, 609097, 612243, 616641, 623454, 632028, 640303, 647576, 655393, 665059, 675697, 685637, 694398, 702310, 709349, 715542, 721534, 727559, 732711, 736520, 740414, 746124, 753099, 759143, 763603, 768391, 775384, 783895, 791365, 795935, 797816, 798465, 798933, 799017, 797815, 794921, 790911]
61262G90911m221l969l551k681j036J110K991L898L820L671M527O298P683Q013
61248H17464Q487J0532J3419J4826J3884J2250J1720J1883J0960Q273M860J933
61236I40491l80k574m580n617n266m327m255n713q049j0116j1148j0746q880o381
61222H52459m799m956n911o010m765l092j940j264l48J413L860N984O739O245
61208H43615N677N592N186L945L115M169O360P349O409N408O098P695Q059O403
61194I25080L844J806Q42R24J805K891L457L454L543L906L596J969K97N58K415
61179I60387L109J161j294j558m14q10l154m681l740j979j252q54N66K439L514
61164I51440M123N125N816N080L799L938N566O850O898O697P097P527P217O394
$$ y = [790911, 786690, 782721, 779170, 776489, 775453, 776563, 779554, 783452, 787272, 790943, 795470, 801768, 809451, 817464, 825951, 836483, 849902, 864728, 878612, 890862, 902582, 914465, 925425, 933698, 938558, 940491, 940111, 937537, 932957, 927340, 922074, 917747, 913492, 907779, 899730, 889614, 878466, 867720, 858840, 852459, 847660, 842704, 836793, 830783, 826018, 822926, 820986, 819722, 819374, 820787, 824647, 830631, 837370, 843615, 849292, 854884, 860070, 864015, 867130, 871299, 877659, 885008, 891417, 896825, 902923, 910618, 918677, 925080, 928924, 930730, 931572, 932496, 934301, 937192, 940649, 944103, 947646, 951552, 955148, 957117, 957414, 957972, 960387, 963496, 964657, 963363, 961805, 961391, 960581, 957427, 952746, 949006, 947027, 945775, 944921, 945487, 947926, 951440, 955563, 960688, 966504, 971584, 975383, 979321, 984887, 991737, 998635, 1005332, 1012429, 1019956, 1027173, 1033567]
61150A033567N783N720N997O035N289M028L338L682M065L510K780L474N878Q826
61136A101972J1378J3454J5100J6206J6758J6538J5010J2318R676P818N883L134
61124A245245P39K54J088J371O79K7m24j478k958l799m096m949o163o347n572
61109A213617n687p269q498p945o601n952n862n677n977p576r716j0732j0102
61096A116023q822q104q418r409j0126r715q339p001o308n952n585n464n951p021
61082A009808q429r778j0408r933q916q196p703o775n574n013n128m671k608P26
61068I17402M198O804Q164Q849J0010J1882J3075J2653J2228J4268J8466K1865
61056A059864K2762K2525K3031K4261K5420K6631K8313K9974L0874L1025L0654
$$ y = [1033567, 1039350, 1045070, 1051067, 1057102, 1062391, 1066419, 1069757, 1073439, 1077504, 1081014, 1083794, 1087268, 1093146, 1101972, 1113350, 1126804, 1141904, 1158110, 1174868, 1191406, 1206416, 1218734, 1228410, 1236228, 1242111, 1245245, 1245984, 1246238, 1247326, 1248697, 1249376, 1249403, 1248979, 1247501, 1244543, 1240744, 1236648, 1231699, 1225536, 1219189, 1213617, 1207930, 1200661, 1192163, 1184218, 1177617, 1171665, 1165803, 1160126, 1154149, 1146573, 1136857, 1126125, 1116023, 1107201, 1099097, 1090679, 1081270, 1071144, 1061429, 1053090, 1046089, 1039781, 1033829, 1028244, 1022780, 1016829, 1009808, 1001379, 991601, 981193, 971260, 962344, 954148, 946445, 939670, 934096, 929083, 923955, 919284, 916676, 917402, 921600, 928404, 936568, 945417, 955427, 967309, 980384, 993037, 1005265, 1019533, 1037999, 1059864, 1082626, 1105151, 1128182, 1152443, 1177863, 1204494, 1232807, 1262781, 1293655, 1324680, 1355334]
61045A355334K9431K7084K4158K1498J9385J7515J5386J2523Q887N069J610j623
61033A536257m670o844q069j0033j4153j8786k0726j9503j7971j8184j9080j9089
61021A359149j8710j9066j9698j9416j8180j6755j5420j4116j2992j1768r497
61010A183531o016k847j572j732j289J052M555P415Q787R833J2350J6115J8734
60997A248916J8890J8511K0146K3459K6476K9233L3316L8274M1613M2747M3977
60986A585558M7017N1331N6452O2881O9699P4423P6913Q0686Q8454R8596J07837
60975B399847J15288J22011J28410J34114J39137J43708J48210J54184J63670
60966C648579J76571J90529K04284K19097K36069K54502K74009K96006L22333
$$ y = [1355334, 1384765, 1411849, 1436007, 1457505, 1476890, 1494405, 1509791, 1522314, 1531201, 1536270, 1537880, 1536257, 1531587, 1524743, 1516674, 1506641, 1492488, 1473702, 1452976, 1433473, 1415502, 1397318, 1378238, 1359149, 1340439, 1321373, 1301675, 1282259, 1264079, 1247324, 1231904, 1217788, 1204796, 1193028, 1183531, 1177515, 1174668, 1173096, 1171364, 1170075, 1171127, 1175682, 1183097, 1191884, 1201717, 1214067, 1230182, 1248916, 1267806, 1286317, 1306463, 1329922, 1356398, 1385631, 1418947, 1457221, 1498834, 1541581, 1585558, 1632575, 1683906, 1740358, 1803239, 1872938, 1947361, 2024274, 2104960, 2193414, 2292010, 2399847, 2515135, 2637146, 2765556, 2899670, 3038807, 3182515, 3330725, 3484909, 3648579, 3825150, 4015679, 4219963, 4439060, 4675129, 4929631, 5203640, 5499646, 5821979]
60957E821979L55106L98261M55423N25177O02590O86720P82042Q91333J013599
60948A1532230J151315J311396J494251J691413J900022K121383K319541K387620
60940B5909171K197052J715159J069991M75208Q2688q7312q9347K7067K11880
60931C1511557L56106L01353n0304o38639j276254j780355k073020k174761k140620
60922B2035063k019853j853207j673619j498689j332062j175927j036125r15350
60914A0530231q09907p15991o33502n62057m98845m42710l95548l57602l25401
60905E788668k96246k70970k50481k33134k17172k02524j88708j74277j59830
60896C795326j48233j40311j33468j26120j20072j16549j13143j07188r9600r2896
$$ y = [5821979, 6177085, 6575346, 7030769, 7555946, 8158536, 8845256, 9627298, 10518631, 11532230, 12683545, 13994941, 15489192, 17180605, 19080627, 21202010, 23521551, 25909171, 28106223, 29821382, 30891373, 31366581, 31449269, 31361957, 31272610, 31299677, 31511557, 31867663, 32169016, 32118712, 31480073, 30203819, 28423464, 26350444, 24175683, 22035063, 20015210, 18162003, 16488384, 14989695, 13657633, 12481706, 11445581, 10530231, 9720324, 9004333, 8370831, 7808774, 7309929, 6867219, 6471671, 6114069, 5788668, 5492422, 5221452, 4970971, 4737837, 4520665, 4318141, 4129433, 3955156, 3795326, 3647093, 3506782, 3373314, 3247194, 3127122, 3010573, 2897430, 2790242, 2690642, 2597746]
60886B597746q7522q2433p7525p3313o9517o5677o2051n8806n5625n2787n1019
60875A861471m9751m7491m4546m2991m3264m3289m1886m0372l9609l8223l5240
60864A394809l1970k9738k8040k6456k5840k6126k5501k3500k2309k3090k3644
60853A108595k1897j9189j7641j6549j4110j0752q008n926m148l761n197n999
60841I75418l791k32J184J37p88o06p87j910k716k806l504n358p082p648p647
60826I31864p980q694r575j0562j1184j0736r310p845p069p099p815q815r346
60813H15834r090q655q565q307p226n639m204k904j550m68K15R64J502L56k880
60798G59383n929o246m245k509k339k782k637j812q26k78o35j649k343k316k181
$$ y = [2597746, 2510224, 2427791, 2350266, 2276953, 2207436, 2141759, 2079708, 2020902, 1965277, 1912490, 1861471, 1811720, 1764229, 1719683, 1676692, 1633428, 1590139, 1548253, 1507881, 1468272, 1430049, 1394809, 1362839, 1333101, 1305061, 1278605, 1252765, 1226639, 1201138, 1177638, 1155329, 1132239, 1108595, 1086698, 1067509, 1049868, 1033319, 1019209, 1008457, 1000449, 994523, 990375, 986614, 981417, 975418, 971627, 971395, 972579, 972716, 971928, 971322, 970535, 968625, 965909, 963103, 959599, 954241, 947159, 939511, 931864, 923884, 915190, 905615, 895053, 883869, 873133, 863823, 855978, 848909, 841810, 833995, 825180, 815834, 806744, 798089, 789524, 781217, 773991, 768352, 764148, 761244, 759694, 759226, 759441, 760405, 761907, 762263, 759383, 753454, 747208, 742963, 740454, 738115, 735333, 732696, 730884, 730058, 729780, 729145, 727496, 725153, 722837, 720656]
60783G20656j955m68K304L856K077j547l881m325m718n741o096n216m177l511
60769F87258k328l06J296J403M73m54p80j70J310K462J789m50k210k104p98L03
60753F86694N50j96j998m253n614n260l811k586k401l195m239m572l868k969k988
60738F39294m002n134n704n589m701l124j685j442k500l989n208n991o135n293
60724E78797l604j726j87Q24J199R77N16J31q3K39J638L636M543L458J630P47
60708E92735P43O78Q39K136L880M239K944J777J973K762K928K466K101K237K833
60693F27271L494L464K302P26l3K75Q20R26N29l64j578k458k680l041m240n366
60677F20047n111m107m164n434o280o083o003o486o245m688l379l804n155n666
$$ y = [720656, 718701, 718233, 720537, 724393, 726470, 724923, 721042, 716717, 711999, 706258, 700162, 694946, 690769, 687258, 684930, 684624, 685920, 687323, 687796, 687342, 686562, 686392, 687702, 690164, 691953, 691503, 689293, 687189, 686391, 686694, 687244, 687048, 685050, 680797, 675183, 669923, 666112, 663526, 661125, 657930, 653691, 649119, 645251, 642282, 639294, 635292, 630158, 624454, 618865, 614164, 611040, 609355, 607913, 605413, 601424, 596216, 590225, 584090, 578797, 575193, 573467, 573280, 574104, 575303, 576280, 576796, 576927, 576844, 577083, 578721, 582357, 586900, 590358, 591988, 592735, 593478, 594156, 594995, 597131, 601011, 605250, 608194, 609971, 611944, 614706, 617634, 620100, 622201, 624438, 627271, 630765, 634229, 636531, 637257, 637224, 637499, 638319, 639245, 639774, 639410, 637832, 635374, 632694, 629653, 625413, 620047, 614936, 610829, 606665, 601231, 594951, 588868, 582865, 576379, 570134, 565446, 562067, 558263, 553108, 547442]
60663E47442n013m137l627l414l342l126k336j135l35k42k63j22l38r21q88J48
60647E18351J146J299J325J960K384J601L82K68J265K100K292K444K696K496J932
60632E43941J987L086M376M794M176L172K594K901L757M223L856L354L533M046
60618E93796M015L518L450L966M246L903L400K838J476q50k930l620l403l539
60604F10266m228m654m518m336m190l363j656j11K75r2j06L65L98n18j641j796
60588E80095n47J488L114L450K741K073J796O88k267n609o408l938q94j74j646
60573E73962l183l660l488k972j932q05n33j120j552j311r25q09n76J44J046J662
60557E53948J813J396M51l67k37P19J562J974K581L506L590J880q72k874l186
$$ y = [547442, 542429, 538292, 534665, 531251, 527909, 524783, 522447, 521312, 520977, 520735, 520472, 520350, 520012, 519091, 518203, 518351, 519497, 520796, 522121, 524081, 526465, 528066, 528448, 528716, 529981, 532081, 534373, 536817, 539513, 542009, 543941, 545928, 549014, 553390, 558184, 562360, 565532, 568126, 571027, 574784, 579007, 582863, 586217, 589750, 593796, 597811, 601329, 604779, 608745, 612991, 616894, 620294, 623132, 624608, 623758, 620828, 617208, 613805, 610266, 606038, 601384, 596866, 592530, 588340, 584977, 583321, 583210, 583485, 583393, 583287, 583652, 584050, 583532, 581891, 580095, 579548, 581036, 584150, 587600, 590341, 592414, 594210, 594898, 592631, 587022, 580614, 576676, 575782, 575608, 573962, 570779, 567119, 563631, 560659, 558727, 557922, 557389, 556269, 554717, 553406, 552481, 551672, 551096, 551240, 552286, 553948, 555761, 557157, 557608, 557241, 557004, 557723, 559285, 561259, 563840, 567346, 570936, 572816, 571944, 569070, 565884]
60542E65884k264r47M59K080L831N042M906L380J500M17L96J061K143L270L419
60527E94577J913j35n21J430L878M585L293J582J081K297M571O802Q489J0078
60513F43920J1774J2501J1276R463R825J2838J5687J5931J4547J3815J3611J1833
60501G97021P844L362p7k650m907o480o902o578o125n382l713r73K264N207P384
60486G79295Q971J0630J2746J4967J6800J8375K0019K1258K1281K0380J9931K0397
60474I85050K0260J7573J2219N956P00k724m456n105n418n869o373o621o622o636
60460I91934o627o183n011l285j428K32J601K887M502O657R004J0971J2501J4175
60446A031930J6587J9904K4104K9169L4850M0504M5523M9730N3160N5693N7113
$$ y = [565884, 563620, 562673, 563132, 565212, 569043, 574085, 578991, 582371, 583871, 584288, 584684, 585745, 587888, 591158, 594577, 596490, 596355, 595834, 597264, 601142, 605727, 609020, 610602, 611683, 613980, 618551, 625353, 633842, 643920, 655694, 668195, 679471, 688934, 698759, 711597, 727284, 743215, 757762, 771577, 785188, 797021, 804865, 808227, 808150, 805500, 800593, 794113, 787211, 780633, 774508, 769126, 765413, 764440, 766704, 771911, 779295, 788266, 798896, 811642, 826609, 843409, 861784, 881803, 903061, 924342, 944722, 964653, 985050, 1005310, 1022883, 1035102, 1041058, 1041758, 1039034, 1034578, 1029473, 1024055, 1018186, 1011813, 1005192, 998570, 991934, 985307, 979124, 974113, 970828, 969400, 969632, 971233, 974120, 978622, 985279, 994283, 1005254, 1017755, 1031930, 1048517, 1068421, 1092525, 1121694, 1156544, 1197048, 1242571, 1292301, 1345461, 1401154, 1458267]
60435A458267N7336N6347N4083N0540M5658L8974K9876J8540O169o196j8578l1099
60423A759917m2740n1990n8462o2721o4769o4015o0974n7609n5217n2942m9227
60412A139251m4048l8955l5325l3240l1822l0103k7747k5281k3360k1718j9406
60401H08246j6215j3170j1171r890q522o962n675m986n134o364q296r754r853
60388F92254q856p432n792m135l131l058l140k657j997j706j325m47j73j848m647
60373F41910o116n171l120j548o80k38m06j237j996k016j526j010k94R29K064
60358F19545J802l61l110m192k575M51K711L539L923M439M390L475K787L005K969
60343F42798J562k1J84J850K968L050L399M244M083K504J340J910K969K839K076
$$ y = [1458267, 1515603, 1571950, 1626033, 1676573, 1722231, 1761205, 1791081, 1809621, 1815790, 1809594, 1791016, 1759917, 1717177, 1665187, 1606725, 1544004, 1479235, 1415220, 1354246, 1296637, 1241420, 1188478, 1139251, 1095203, 1056248, 1020923, 987683, 955861, 925758, 898011, 872730, 849370, 827652, 808246, 792031, 778861, 767690, 757800, 749278, 742316, 736641, 731655, 726521, 720157, 711861, 702107, 692254, 683398, 675966, 670174, 666039, 662908, 659850, 656710, 654053, 652056, 650350, 649025, 648578, 648405, 646557, 641910, 635794, 630623, 627503, 625955, 625275, 625037, 624631, 623394, 621398, 619382, 617856, 616846, 616552, 617481, 619545, 621347, 620986, 617876, 613684, 611109, 611560, 614271, 617810, 621733, 626172, 630562, 634037, 636824, 639829, 642798, 644360, 644339, 644523, 646373, 649341, 652391, 655790, 660034, 664117, 666621, 667961, 669871, 672840, 675679, 677755]
60328F77755K436M130N577N468L979K235J328J561K141K014J373J590L186M736
60314G19509M612L226K523L462M851M829L065J119O39J495K254K502L601O358
60300G64045R139R825Q884Q580R384R467Q137P402Q973J1610J2851J2008J0020
60287H90325P546M760K162N4k200n154p935r174q805p946p416p401p935q510p803
60272H24568n221k417j743l261m663m321k952j917j311o14j19n15j455j676n28
60257G91855J462L663O149Q953J1264J2323J2830J4303J6836J8715J8963J9075
60245I36391K0906K3525K3825K0165J3946P430J446m301r974j5340j9911k2774
60233I75334k3168k1651j9881j8759j7689j5953j3857j1991j0488r506r341r408
$$ y = [677755, 680191, 684321, 689898, 695366, 699345, 701580, 702908, 704469, 706610, 708624, 709997, 711587, 714773, 719509, 724121, 727347, 729870, 733332, 738183, 743012, 746077, 747196, 747835, 749330, 751584, 754086, 757687, 764045, 773184, 783009, 791893, 800473, 809857, 819324, 827461, 834863, 843836, 855446, 868297, 880305, 890325, 897871, 902631, 904793, 904847, 902647, 897493, 889558, 880384, 871579, 863633, 856217, 848816, 840881, 832371, 824568, 819347, 816930, 815187, 811926, 807263, 802942, 799990, 798073, 796762, 796148, 796029, 795514, 794059, 792383, 791855, 793317, 796980, 803129, 812082, 823346, 835669, 848499, 862802, 879638, 898353, 917316, 936391, 957297, 980822, 1004647, 1024812, 1038758, 1046188, 1047634, 1043333, 1033359, 1018019, 998108, 975334, 952166, 930515, 910634, 891875, 874186, 858233, 844376, 832385, 821897, 812391, 803050, 793642]
60221G93642q273n607k984j834j666j372j076j368j805j809k269m296o763p095
60207G45425m681j774n34p02r44j099j874l132l774l245k268j853k164k535k270
60192G12576j115O61K298K787J718Rq04k29Q22J537K218L117L320J992J62k71
60176G30798Q65J883J698J032R17J369J917K264K073J213M78Q30J782J899J142
60161G52160J114K512M115M947N648O721P179O265N048M849N415N892O447P418
60147H25730Q107P909P636Q168Q848Q752Q539R309J0414J0297Q934P632O900O229
60133I43404N693N852O265N703M022K444J798J654J212J39j430k880l371k902
60119I67603k651l429m459m696m510m875n663o094o158o118n377l556j982k253
$$ y = [793642, 785369, 779762, 776778, 774944, 773278, 771906, 770830, 769462, 767657, 765848, 763579, 759283, 752520, 745425, 740744, 738970, 738436, 737734, 736790, 735691, 733817, 730685, 726911, 723666, 721398, 719545, 717381, 714846, 712576, 711461, 712122, 714420, 717207, 718925, 718934, 718130, 717901, 718723, 720260, 722478, 725595, 728915, 730907, 731069, 730798, 731663, 733546, 735244, 736276, 737193, 738562, 740479, 742743, 744816, 746029, 746507, 747337, 749119, 751018, 752160, 753274, 755786, 759901, 764848, 770496, 777217, 784396, 790661, 795709, 800558, 805973, 811865, 818312, 825730, 833837, 841746, 849382, 857550, 866398, 875150, 883689, 892998, 903412, 913709, 922643, 930275, 937175, 943404, 949097, 954949, 961214, 966917, 970939, 973383, 975181, 976835, 978047, 978186, 976756, 973876, 970505, 967603, 964952, 961523, 957064, 952368, 947858, 942983, 937320, 931226, 925068, 918950, 913573, 910017, 908035, 905782]
60105I05782l772m597m334m224m676m814m356l860l018r83J359J695m89k924l584
60090H63205k784j529K73K682M499M686L970L685L865L605K731J967J856K368
60076H95079L317M521N696O573O989O847O265N674N223M365K830J759K654N110
60062I62902O810O236M407L360L744M480M249K775R39m9K42J129J731J896J886
60047A006737J691J258R17Q73P65L89J46n9j338l929n838n160l026k124k759k736
60031I85807j107M47M35n69j687l256n468p258p668p021n797l870j780j162k632
60016I37414m449m549k967j285o34j280l058n158o314o248o186p129q514r351
60002H70292r542r163p709n356l812m346n756n910m789m269n099n741m567j932
$$ y = [905782, 902010, 897413, 893079, 888855, 884179, 879365, 875009, 871149, 868131, 867148, 868507, 870202, 869713, 866789, 863205, 860421, 858892, 859165, 861847, 866346, 871032, 875002, 878687, 882552, 886157, 888888, 890855, 892711, 895079, 898396, 902917, 908613, 915186, 922175, 929022, 935287, 940961, 946184, 950549, 953379, 955138, 957792, 962902, 969712, 975948, 980355, 983715, 987459, 991939, 996188, 998963, 999902, 999853, 1000095, 1001224, 1002955, 1004851, 1006737, 1008428, 1009686, 1010603, 1011476, 1012241, 1012630, 1012776, 1012717, 1011379, 1007450, 1001612, 996452, 993426, 991302, 988543, 985807, 984700, 985147, 985582, 985013, 983326, 980070, 974602, 967344, 959676, 952655, 946858, 942988, 941208, 940046, 937414, 932965, 928416, 925449, 924164, 923530, 922250, 919192, 914034, 907720, 901472, 895286, 888157, 879643, 870292, 860750, 851587, 843878, 838522, 834710, 830364, 824608, 818698, 813909, 809640, 804541, 798800, 794233, 792301]
59988G92301M26J321J024P10J277K585L788M398M690N018N210M940M179L067J779
59973H36713Q58R62J940K694K426J512Q09N65M00j70j431l243m877n679n989o698
59957H20792p850q623q809r155r845r899q710p108o095n564n048m814n177n600
59943G18495n469n130n198n396m907l454j381P02J822J151n13q74J147L627L931
59928F98553K103N58Q59K323L656M360M384L651K496J614J186O64k97j290j729
59913G23091j519r44l51n3k36p66j202j049K8J783L116K788R21p94r48n3L70p9
59895G24103m45o0O08R09Q61O39m0j431l000l819l597k823j866n98Q24J481P79
59878G12525l30k42J037J677N79r62j065K01J420K142L092M325M884M461L885
$$ y = [792301, 792727, 794048, 795072, 795782, 797059, 799644, 803432, 807830, 812520, 817538, 822748, 827688, 831867, 834934, 836713, 837571, 838533, 840473, 843167, 845593, 847105, 847914, 848479, 848879, 848709, 847278, 844035, 839158, 833479, 827490, 820792, 812942, 804319, 795510, 786355, 776510, 766611, 757901, 750793, 744698, 739134, 734086, 729272, 724095, 718495, 713026, 707896, 702698, 697302, 692395, 688941, 687560, 688262, 690084, 691235, 690722, 689848, 690995, 694622, 698553, 700656, 701214, 702073, 704396, 708052, 712412, 716796, 720447, 722943, 724557, 725743, 726407, 726110, 724820, 723091, 721572, 720628, 720277, 720224, 719988, 719222, 718020, 716971, 716999, 718782, 721898, 724686, 725607, 724813, 723865, 723812, 724182, 724103, 723658, 723598, 724206, 725115, 725976, 726615, 726575, 725144, 722144, 718325, 714728, 711905, 710039, 709441, 710265, 711746, 712525, 712195, 711953, 712990, 714667, 715246, 714284, 713219, 713420, 714840, 716982, 720074, 724399, 729283, 733744, 737629]
59863G37629L804M040M556N676P057P743P545P159O672N459L816L032L211K804
59849H10203J254L30J488L439L902K719J724K271M281O926Q899Q696O089K918
59835H65139J252J208J584J821K090K121J480P13Q44J946L302M762O698Q821J0209
59820I13990J0435R737Q265O190M208K946K105J207Q11J695L015K790L81k643
59806I65132m425m625m009l222k410j393J49K239M222N310N568N890O885Q271
59792I83582R364R705R105P475M831J437j946m083m082k389n39K91j04j831n307
59777A005509j0064j4121j5576j4535j2745j1589j1059j0190q048m705j637n23
59765H90717j312k345k682l010l645l368j563m6q24l110m586m815n157n736n009
$$ y = [737629, 741433, 745473, 750029, 755705, 762762, 770505, 778050, 785209, 791881, 797340, 801156, 804188, 807399, 810203, 811457, 811787, 813275, 816714, 820616, 823335, 825059, 827330, 831611, 838537, 847436, 856132, 862221, 865139, 866391, 867599, 869183, 871004, 873094, 875215, 876695, 877408, 878252, 880198, 883500, 888262, 894960, 903781, 913990, 924425, 934162, 942427, 948617, 952825, 955771, 957876, 959083, 959894, 961589, 964604, 967394, 967775, 965132, 960707, 956082, 952073, 948851, 946441, 945048, 945197, 947436, 951658, 956968, 962536, 968426, 975311, 983582, 992946, 1002651, 1011756, 1019231, 1024062, 1025499, 1023553, 1019470, 1015388, 1012999, 1012460, 1012751, 1012647, 1010816, 1005509, 995445, 981324, 965748, 951213, 938468, 926879, 915820, 905630, 897582, 892877, 891240, 890717, 889405, 887060, 884378, 881368, 877723, 874355, 872792, 872746, 871922, 868812, 864226, 859411, 854254, 848518, 843509]
59750H43509k571k18M71k41j613l634n808o428m467j341N04L09p07j334j600j998
59734H12833k336j815j32J793K499J498j73j157j143p61n34n28q01j489k479l444
59718H01831m052l913k600l58J612K157J356K20m67m79K46J558K871L670M150
59703H07802M785N485N688N187M424M036M433N507O538O837O751P358Q855J0034
59689H93720R933R184R089J0000J1301J2297J2515J1743J0428R323Q402P008N380
59676A020323M537M193K711J37r13Q80K766J451k175m462m105k870k030j177n67
59661A018699j533l993o051o775p099p454o747m661k857k627l023k469r65K72
59647I62717L39q71k720l828l094j168J86M32P34J848L063L730M348N444O637
$$ y = [843509, 840938, 840720, 841191, 840950, 839337, 835703, 829895, 823467, 819000, 817659, 818163, 818472, 817765, 816431, 814831, 812833, 810497, 808682, 808550, 810343, 812842, 814340, 814167, 813010, 811867, 811106, 810572, 810044, 809243, 807754, 805275, 801831, 797779, 793866, 791266, 790908, 792520, 794677, 796033, 796253, 795786, 795307, 795553, 797111, 799982, 803652, 807802, 812587, 818072, 823760, 828947, 833371, 837407, 841840, 847347, 853885, 860722, 867473, 874831, 883686, 893720, 903653, 912837, 921926, 931926, 943227, 955524, 968039, 979782, 990210, 999533, 1007935, 1014943, 1020323, 1024860, 1029053, 1031764, 1031901, 1030988, 1031868, 1034634, 1036085, 1033910, 1029448, 1025343, 1022473, 1020443, 1019266, 1018699, 1017166, 1013173, 1007122, 1000347, 993248, 985794, 979047, 974386, 971529, 968902, 965879, 963410, 962445, 962717, 963056, 962185, 959465, 955637, 952543, 951375, 951561, 951993, 952727, 954575, 957638, 961368, 965716, 971160, 977797]
59632I77797P417P730P290N552K947R07P9m17j453k736l602l884l581k771k131
59617I89144k330k866k837k890m526p207q375p073n464n571o534o561n815n565
59603I15530n773n376m174k842j638m12O62J430K214L035L111K151J294J701K940
59588I13853L712L530K695J490K91k59j92n41j866l359m319n300o598o801m709
59573H91627j828r53k520m238m432l971m386n553o129n505m450l965m049l788
59559H35860k746j886k496m310n619n541n064n297n857n852n416m984l994j827
59545G74971M65J081J6p60j6J259J488N75l45m63J42J057J989K708L048L023K795
59528G93033K407J677N38o19j209j225j373k196l316l999m095m016l965l832l559
$$ y = [977797, 985214, 992944, 1000234, 1005786, 1008733, 1009640, 1009719, 1009302, 1007849, 1005113, 1001511, 997627, 994046, 991275, 989144, 986814, 983948, 981111, 978221, 973695, 966488, 958113, 951040, 945576, 940005, 933471, 926910, 921095, 915530, 909757, 904381, 900207, 897365, 895727, 895315, 895977, 897407, 899621, 902656, 905767, 907918, 909212, 910913, 913853, 917565, 921095, 923790, 925280, 925571, 925312, 925120, 924579, 922713, 919354, 915035, 909735, 903137, 896336, 891627, 889799, 888846, 886326, 882088, 877656, 873685, 869299, 863746, 857617, 852112, 847662, 843697, 839648, 835860, 833114, 831228, 828732, 824422, 818803, 813262, 808198, 802901, 797044, 791192, 785776, 780792, 776798, 774971, 775436, 776517, 776533, 775773, 775757, 777016, 778504, 779079, 778734, 778271, 778413, 779470, 781459, 784167, 787215, 790238, 793033, 795440, 797117, 797655, 797036, 795827, 794602, 793229, 791033, 787717, 783718, 779623, 775607, 771642, 767810, 764251]
59513G64251l062k145j124j028k194l190k457p23j50j098j526l3K105K764J524
59498G51914m23j814j963r27K71N35L65J502M286O748P185O380O095O628P148
59483G93930P568Q544J0063J1322J1947J2534J4164J7507K1676K3639K0184J1446
59471I64524J549n218p997q516q129p196o225n638m762k668O1J610J129m13j480
59456I10631j424p70o81j877l654m539m293m397n872p608p865o605n212m572m586
59441H46676n029n726o205o109n676n116m146k829k019k090k140j477q78j242
59427G95994j893j627n62M26J310K433L287L400L690N102O609O616N791O274Q193
59412H45043R315Q420O717N379L814J381q53j392k33J477K815L415L185K510K132
$$ y = [764251, 761189, 759044, 757920, 756892, 754698, 751508, 749051, 748328, 748178, 747080, 745554, 745521, 747626, 750390, 751914, 751491, 749677, 747714, 746787, 747058, 747593, 747958, 749460, 753746, 760494, 767679, 774059, 780154, 786782, 793930, 801498, 810042, 820105, 831427, 843374, 855908, 870072, 887579, 909255, 932894, 953078, 964524, 966073, 960855, 952858, 944342, 936213, 929017, 922792, 917154, 912392, 909724, 909785, 911395, 912524, 912111, 910631, 909207, 908437, 907756, 905879, 902225, 897686, 893393, 888996, 883124, 875516, 867651, 861046, 855834, 851262, 846676, 841647, 835921, 829716, 823607, 817931, 812815, 808669, 805840, 803821, 801731, 799591, 798114, 797236, 795994, 794101, 792474, 791912, 792338, 793648, 796081, 799368, 802768, 806458, 811560, 818169, 824785, 830576, 836850, 845043, 854358, 862778, 869495, 874874, 878688, 880069, 879216, 877824, 877591, 879068, 881883, 885298, 888483, 890993, 893125]
59397H93125K349K808L358M300N590O636P174P631Q266Q759R002R478J0314J0615
59383I89405R408O864M111J937O9k248n017p068p250n982m934m835m693l723k942
59368I63102l509m405l478n70K129L024L040M199P329J1499J4920J6317J6256
59355A029853J6948J9867K3972K7514L0899L5503L9454L7474K6541J0241m278
59344A293988j2644j5256j4297j1251p089k527K689R078J4766J5056O607q082
59332A271038k2034l0021l2302l1946l0446k7464k3467j9910j6930j3220q853
59321A014445o079o140p068o201l511q24J103K782M113M356L852L939M968N829
59307A015564N644M878M566N336P104R008R868R468Q879Q758Q151O279M558M991
$$ y = [893125, 895474, 898282, 901640, 905940, 911530, 918166, 925340, 932971, 941237, 949996, 958998, 968476, 978790, 989405, 998813, 1005677, 1009788, 1011725, 1011794, 1009546, 1004529, 997461, 990211, 984229, 979295, 974460, 969767, 966044, 963102, 959593, 955188, 951710, 951140, 953269, 956293, 959333, 963532, 970861, 982360, 997280, 1013597, 1029853, 1046801, 1066668, 1090640, 1118154, 1149053, 1184556, 1224010, 1261484, 1288025, 1298266, 1293988, 1281344, 1266088, 1251791, 1240540, 1233451, 1230924, 1233613, 1242691, 1257457, 1272513, 1279120, 1271038, 1249004, 1218983, 1186681, 1154735, 1124289, 1096825, 1073358, 1053448, 1036518, 1023298, 1014445, 1008366, 1002226, 995158, 988957, 985446, 984622, 985725, 988507, 992620, 996976, 1000828, 1004767, 1009735, 1015564, 1021208, 1026086, 1030652, 1035988, 1043092, 1052100, 1061968, 1071436, 1080315, 1089073, 1097224, 1103503, 1108061, 1113052]
59293A113052P124Q574Q396P874P972Q234Q660J0391J3601J6336J6822J5558J4171
59280A256765J3197J2104J0709R424Q554Q004P368O026L674R48j175k765m888
59267A327945p873j0575j1834j1793j1338j0891j0318r446q234o880n945n816
59255A217002o077n970n487n132m658l108l08K612M552N447N813O069O416O480
59241A223651M975Q55n032j0434j4049j6371j8090j9035j9061j8620j7861j6391
59229A074537j4495j3321j3055j2298j0212q081p505p982p664n862l410r95J503
59216I71160L964N542N692N120N336P303J0504J3132J3609J2160J0623J0483J1361
59203A085989J1721J0671Q653O620M957L333J378p08k445l838n350o952p879p870
$$ y = [1113052, 1120176, 1128750, 1137146, 1145020, 1152992, 1161226, 1169886, 1180277, 1193878, 1210214, 1227036, 1242594, 1256765, 1269962, 1282066, 1292775, 1302199, 1310753, 1318757, 1326125, 1332151, 1335825, 1336773, 1335598, 1332833, 1327945, 1320072, 1309497, 1297663, 1285870, 1274532, 1263641, 1253323, 1243877, 1235643, 1228763, 1222818, 1217002, 1210925, 1204955, 1199468, 1194336, 1189678, 1186570, 1186262, 1188874, 1193426, 1198873, 1204686, 1210755, 1217171, 1223651, 1228626, 1229481, 1224449, 1214015, 1199966, 1183595, 1165505, 1146470, 1127409, 1108789, 1090928, 1074537, 1060042, 1046721, 1033666, 1021368, 1011156, 1003075, 995570, 987588, 979924, 974062, 970652, 969657, 971160, 975124, 980666, 986358, 991478, 996814, 1004117, 1014621, 1027753, 1041362, 1053522, 1064145, 1074628, 1085989, 1097710, 1108381, 1117034, 1123654, 1128611, 1131944, 1133322, 1132614, 1130169, 1126331, 1120981, 1114029, 1106150, 1098280]
59189A098280p882q791r893r737q060n801l613j562n4M21M61J277K890M024M090
59174A056050L822L750L389K531K043K652L881M816M986M068J817j040k870k899
59160A086996k182k251l525n386p021p743p320o426n960n674m542k698j698k275
59146A022295l170k975j912r99n44m44q71j570j486k27Q94N14q13j517j263r59
59130A004953r10l75Q94J868J443r8j167l43K237M897O041N687N058M938N096
59115A040219N254N463N481M825L805L438L879M125L772L836N023O330O456N690
59101A107596N300N711O276O431O074N240M086K920J748J74j776l424m561o006
59087A135789q435j1312j3568j4722j4776j3799j2249j0978j0309r745r028q570
$$ y = [1098280, 1090398, 1081607, 1071714, 1061977, 1053917, 1048116, 1044503, 1042941, 1042887, 1043308, 1043769, 1045046, 1047936, 1051960, 1056050, 1059872, 1063622, 1067011, 1069542, 1071585, 1074237, 1078118, 1082934, 1087920, 1091988, 1093805, 1092765, 1089895, 1086996, 1084814, 1082563, 1079038, 1073652, 1066631, 1058888, 1051568, 1045142, 1039182, 1033508, 1028966, 1026268, 1024570, 1022295, 1019125, 1016150, 1014238, 1013239, 1012695, 1012251, 1011380, 1009810, 1008324, 1008097, 1008991, 1009505, 1008692, 1007175, 1005912, 1004953, 1004043, 1003668, 1004562, 1006430, 1007873, 1007775, 1006608, 1006265, 1008502, 1013399, 1019440, 1025127, 1030185, 1035123, 1040219, 1045473, 1050936, 1056417, 1061242, 1065047, 1068485, 1072364, 1076489, 1080261, 1084097, 1089120, 1095450, 1101906, 1107596, 1112896, 1118607, 1124883, 1131314, 1137388, 1142628, 1146714, 1149634, 1151382, 1151556, 1149780, 1146356, 1141795, 1135789, 1127354, 1116042, 1102474, 1087752, 1072976, 1059177, 1046928, 1035950, 1025641, 1015896, 1006868, 998298]
59075I98298q319p427n846m977n698o846o930o200n668m980l103m96J270J940
59061I35018K934N089P401Q455Q129P507P714R022J0646J1441J1127J0484J0048
59048A045015R379Q191P348P605Q077P300N463M054L489K658J061m7N93K355L445
59033A115986K908J265m98j854k691k925k505j789j524k093k968l386l489m163
59019A090274n603o926p526p979q968r995j0082r251q388p910p476o955o748o975
59005I79492p014o328n350n081n800o546o184m806l598l197k879j899q57q42j698
58990I17413k300k251k059j782j020l11q94k584l449k384o22K31M30J268K993
58975I02679M750N915O399O215N611N156N029M808M578N375P685J0168J1009J0076
$$ y = [998298, 989979, 982552, 976706, 971729, 966031, 959185, 952255, 946055, 940387, 935407, 932304, 931808, 933078, 935018, 937952, 943041, 950442, 958897, 967026, 974533, 982247, 991269, 1001915, 1013356, 1024483, 1034967, 1045015, 1054394, 1062585, 1069933, 1077538, 1085615, 1092915, 1098378, 1102432, 1105921, 1108579, 1109640, 1109593, 1110186, 1112541, 1115986, 1118894, 1120159, 1119661, 1117807, 1115116, 1112191, 1109686, 1107897, 1106373, 1104280, 1101312, 1097926, 1094437, 1090274, 1084671, 1077745, 1070219, 1062240, 1053272, 1043277, 1033195, 1023944, 1015556, 1007646, 1000170, 993215, 986467, 979492, 972478, 966150, 960800, 955719, 949919, 943373, 937189, 932383, 928785, 925588, 922709, 920810, 919953, 919111, 917413, 915113, 912862, 910803, 909021, 908001, 907690, 906796, 904212, 900763, 898379, 897757, 897988, 898418, 899686, 902679, 907429, 913344, 919743, 925958, 931569, 936725, 941754, 946562, 951140, 956515, 964200, 974368, 985377, 995453]
58961I95453Q923R007J0557J2772J4542J5218J5065J4647J3757J1774R133P171
58949A138019O173M885K632N63j38L8J8k12k12k39m42L7J708L363L610L112L606
58932A166521N101N747M439K144L62m92p65o09J08J301K486L122L152L217M065
58917A199899N727P584R059R861R862R452R583J0641J1846J2803J4720J8174K0623
58904A349834J8867J3898J0249J0048J0864J0396R869J0782J1434R402N273J223
58892A472139k331n957q710r310q712q912r930j0381j0237j0621j1404j1318j0114
58879A354202q759p856p495p924q789q630o842n121n165o030n793m576l820l649
58865A263753l271l021l606m287m112m043n335o781o233l982k046q38O19K118
$$ y = [995453, 1004376, 1013383, 1023940, 1036712, 1051254, 1066472, 1081537, 1096184, 1109941, 1121715, 1130848, 1138019, 1144192, 1149077, 1151709, 1152272, 1152134, 1152172, 1152190, 1151978, 1151766, 1151527, 1151085, 1151122, 1152830, 1156193, 1159803, 1162915, 1166521, 1171622, 1177369, 1181808, 1183952, 1184314, 1183822, 1183057, 1182448, 1182556, 1183857, 1186343, 1189465, 1192617, 1195834, 1199899, 1205626, 1213210, 1222269, 1232130, 1241992, 1251444, 1261027, 1271668, 1283514, 1296317, 1311037, 1329211, 1349834, 1368701, 1382599, 1392848, 1402896, 1413760, 1424156, 1434025, 1444807, 1456241, 1465643, 1470916, 1472139, 1469808, 1463851, 1455141, 1445831, 1437119, 1428207, 1418277, 1407896, 1397659, 1387038, 1375634, 1364316, 1354202, 1345443, 1337587, 1330092, 1322168, 1313379, 1304749, 1297907, 1292786, 1287621, 1281591, 1275798, 1271222, 1267402, 1263753, 1260482, 1257461, 1253855, 1249568, 1245456, 1241413, 1236078, 1229297, 1223064, 1219082, 1217036, 1216198, 1216817, 1218935]
58851A218935K757L334N114O933O722N408N837Q287J0522J2072J4534J7515J8338
58838A336308J6577J4959J4906J4749J3465J2425J2087J0689Q015O875Q691J0840
58826A480586J0824J0026J0596J1349R975P298N959O129N545L229M89j552l236
58813A557217n108p031q652r831j0683j1719j3399j5139j5576j4355j2611j1297
58801A421816j0261r433r424j0125j0256r382q997j0487j3109j5193j6280j6846
58789A282023j6847j5765j3717j1587j0346j0496j1605j2252j1356r716r163j0089
58777A139084j1056j0931r986q695p157o148o952r260j0695r375n916k397m38
58764A040078n68k092l160k370n22O32J222K811N115N806M286K952L461M148K820
$$ y = [1218935, 1221692, 1225026, 1230140, 1237073, 1243795, 1249203, 1255040, 1263327, 1273849, 1285921, 1300455, 1317970, 1336308, 1352885, 1367844, 1382750, 1397499, 1410964, 1423389, 1435476, 1446165, 1454180, 1461055, 1469746, 1480586, 1491410, 1501436, 1512032, 1523381, 1533356, 1540654, 1546613, 1552742, 1558287, 1561516, 1562005, 1560453, 1557217, 1552109, 1545078, 1536426, 1526595, 1515912, 1504193, 1490794, 1475655, 1460079, 1445724, 1433113, 1421816, 1411555, 1402122, 1392698, 1382573, 1372317, 1362935, 1353938, 1343451, 1330342, 1315149, 1298869, 1282023, 1265176, 1249411, 1235694, 1224107, 1213761, 1203265, 1191660, 1179408, 1168052, 1158336, 1149173, 1139084, 1128028, 1117097, 1107111, 1098416, 1091259, 1085111, 1078159, 1068899, 1058204, 1048829, 1042913, 1040516, 1040078, 1039510, 1037418, 1034258, 1031888, 1031366, 1031998, 1033220, 1036031, 1041146, 1046952, 1051238, 1054190, 1057651, 1061799, 1064619]
58749A064619Q4j945k510k097r85L00L66j458l802m931m804m338l803l326l791
58734A027579n733q050r128q680p545o464n794n579n127l473q82J140J763J655
58720I65682J460J051P02J192K018J533k41r68N08K082J352j126l310m700n925
58705I61310o681o288n437n451o258o562n641l901k251j698k656l974l764j956
58691H98792o31r69j521n62J476L115L868L886L170K421L042M881N784M782L806
58676I35340M580N904O135O244P680R028P928N211L893M546M862L780L019L955
58662A012105N449N788N006M334M496N307O157O529O448O388O463O164N388M935
58648A090957N199N197L842J414j094l397n673p677r160j0566j2330j4031j4988
$$ y = [1064619, 1064703, 1062758, 1060248, 1058151, 1057166, 1057466, 1057832, 1056374, 1052572, 1047641, 1042837, 1038499, 1034696, 1031370, 1027579, 1021846, 1013796, 1004668, 995988, 988443, 981979, 976185, 970606, 965479, 962006, 961124, 962264, 964027, 965682, 967142, 968193, 968895, 970087, 972105, 973638, 973397, 972429, 972937, 975019, 976371, 975245, 971935, 967235, 961310, 954629, 948341, 942904, 937453, 931195, 924633, 918992, 915091, 912840, 911142, 908486, 904512, 900748, 898792, 898161, 897192, 895671, 895109, 896585, 899700, 903568, 907454, 910624, 913045, 916087, 920968, 926752, 931534, 935340, 939920, 945824, 951959, 958203, 965883, 974911, 982839, 988050, 991943, 996489, 1001351, 1005131, 1008150, 1012105, 1017554, 1023342, 1028348, 1032682, 1037178, 1042485, 1048642, 1055171, 1061619, 1068007, 1074470, 1080634, 1086022, 1090957, 1096156, 1101353, 1105195, 1106609, 1105515, 1102118, 1096445, 1088768, 1079608, 1069042, 1056712, 1042681, 1027693]
58635A027693j5139j4828j4462j4682j5740j6433j5175j2542j0937j1072j0842
58624H75841q716o069m724m296l745l486m057m398l606k791l118l525k700j710
58610H18900k185l109k071J110M427O574P506O998N078L449M017O179P478O639
58596H70990M254J127k037l933l862l342m493p017q602q101o598n495n222n670
58582H11999o372o401n216l439j846l30J221J939J114p08k693m512n191l166R14
58567G77313L468K185p96k163k041k608l887m181l564l595m080l300j222M15J123
58552G53067K091L638M754N245O020P114P603P370P056O493N216M143M431N069
58538H29310L948J252n04J08K000L480L781K864J539J455L222N059N155M569N653
$$ y = [1027693, 1012554, 997726, 983264, 968582, 952842, 936409, 921234, 908692, 897755, 886683, 875841, 867125, 861056, 856332, 852036, 848291, 844805, 840748, 836350, 832744, 829953, 826835, 823310, 820610, 818900, 816715, 813606, 811535, 812645, 817072, 823646, 831152, 838150, 843228, 846677, 850694, 856873, 864351, 870990, 875244, 876371, 874334, 870401, 866539, 863197, 858704, 851687, 843085, 834984, 828386, 822891, 817669, 811999, 805627, 799226, 794010, 790571, 788725, 788395, 789616, 791555, 792669, 791961, 789268, 784756, 779565, 776399, 777313, 780781, 782966, 782170, 780007, 777966, 775358, 771471, 767290, 763726, 760131, 756051, 752751, 751529, 751944, 753067, 755158, 758796, 763550, 768795, 774815, 781929, 789532, 796902, 803958, 810451, 815667, 819810, 824241, 829310, 833258, 834510, 834006, 834114, 836114, 839594, 843375, 846239, 847778, 849233, 852455, 857514, 862669, 867238, 872891]
58523H72891Q268J0039R989R527J0020J1436J3230J4604J4345J2354J0762J1575
58511A009040J3776J4770J3972J2878J2570J3341J5788J9710K2850K3323K2437
58500A194455K2658K3884K4416K4409K5144K5925K4972K2575K0093J6788J1238
58489A436557N115J658Q09l74k872n069o600q696j0793j1035j0355j1919j6038
58476A360388j9603k1057k1810k2238k0763j7878j6701j8004j8819j7473j6107
58465A149935j6393j6626j5165j3232j2113j0755q361o500o433o846o199n004
58453A026308m148l358k763l413m796m534k093j29n13j675j595q30o76p86o26
58438I94373j013k204k489o53J895L168L208L127L093K753K345K243K483L341
$$ y = [872891, 881159, 891198, 901187, 910714, 920734, 932170, 945400, 960004, 974349, 986703, 997465, 1009040, 1022816, 1037586, 1051558, 1064436, 1077006, 1090347, 1106135, 1125845, 1148695, 1172018, 1194455, 1217113, 1240997, 1265413, 1289822, 1314966, 1340891, 1365863, 1388438, 1408531, 1425319, 1436557, 1441672, 1443330, 1444139, 1443765, 1440893, 1435824, 1429224, 1420528, 1409735, 1398700, 1388345, 1376426, 1360388, 1340785, 1319728, 1297918, 1275680, 1254917, 1237039, 1220338, 1202334, 1183515, 1166042, 1149935, 1133542, 1116916, 1101751, 1088519, 1076406, 1065651, 1057290, 1050790, 1044357, 1037511, 1031312, 1026308, 1022160, 1018802, 1016039, 1012626, 1007830, 1003296, 1001203, 1001074, 1000561, 998886, 997291, 996461, 995785, 994999, 994373, 993360, 991156, 988667, 988014, 989909, 993077, 996285, 999412, 1002505, 1005258, 1007603, 1009846, 1012329, 1015670]
58424A015670N132P207Q694J0078J2150J3824J3487J2139J2199J3466J3640J2730
58412A150416J3178J5161J5817J3832J0896P774L178k196m937m070k882l560l983
58399A208624k140J89Q56R15J943K991L070L714O193Q663Q932P714O672N461L149
58384A266946M17j865m281p171r359j0247j0859j1437j0570q183o436o149n402
58371A175404l289j598j013O51M036O001M632K902M128O922Q077P602P419P568
58357A229442O979N904M619J939k162m904m585l653m880o899o794m854l474l220
58343A203458l159l464m580n315m439k920k261k190j881j589j161Q35M471P366
58329A183171Q069Q051Q423P724N240L386M153O039P139Q221J0022J0708R119
$$ y = [1015670, 1020802, 1028009, 1036703, 1046781, 1058931, 1072755, 1086242, 1098381, 1110580, 1124046, 1137686, 1150416, 1163594, 1178755, 1194572, 1208404, 1219300, 1227074, 1230252, 1228056, 1223119, 1219049, 1216167, 1212607, 1208624, 1206484, 1206673, 1207529, 1208444, 1210387, 1213378, 1216448, 1220162, 1226355, 1235018, 1243950, 1251664, 1258336, 1263797, 1266946, 1267363, 1265498, 1261217, 1254046, 1244687, 1234440, 1223581, 1212144, 1201574, 1193391, 1186955, 1180806, 1175404, 1172115, 1170517, 1169504, 1170155, 1174191, 1180192, 1184824, 1187726, 1191854, 1198776, 1206853, 1214455, 1221874, 1229442, 1236421, 1242325, 1246944, 1248883, 1246721, 1241817, 1237232, 1233579, 1228699, 1221800, 1215006, 1210152, 1206678, 1203458, 1200299, 1196835, 1192255, 1186940, 1182501, 1179581, 1177320, 1175130, 1173249, 1171660, 1170499, 1171334, 1175805, 1183171, 1191240, 1199291, 1207714, 1215438, 1220678, 1224064, 1228217, 1234256, 1241395, 1249616, 1259638, 1270346, 1279465]
58316A279465P586Q272R564R183Q080Q098Q537Q231Q276R613J0681J0524J1153
58303A397263J3714J5572J4627J3139J3722J4912J4573J4297J6084J7930J7204
58292A563037J5557J5798J6609J5042J1891R936R123Q022P742R813J2187J2048
58280A706805J0740J1433J3738J4951J5083J6215J8320J9743K0443K1275K1675
58269A890421K1290K1800K3941K5247K4010K2621K3307K3752K1031J6938J5115
58258B129473J5665J6638J7952J9768K0054J8028J6830J8731K1181K1655K2303
58247B338278K5230K7572K6676K5777K8579L2256L2146K9811K9898L2207L3302
58236B661732L3079L3569L4118L3640L4500L8316M1473M0697L9158M0892M3585
$$ y = [1279465, 1287051, 1295323, 1304887, 1314070, 1322150, 1330248, 1338785, 1347016, 1355292, 1364905, 1375586, 1386110, 1397263, 1410977, 1426549, 1441176, 1454315, 1468037, 1482949, 1497522, 1511819, 1527903, 1545833, 1563037, 1578594, 1594392, 1611001, 1626043, 1637934, 1647870, 1656993, 1665015, 1672757, 1682570, 1694757, 1706805, 1717545, 1728978, 1742716, 1757667, 1772750, 1788965, 1807285, 1827028, 1847471, 1868746, 1890421, 1911711, 1933511, 1957452, 1982699, 2006709, 2029330, 2052637, 2076389, 2097420, 2114358, 2129473, 2145138, 2161776, 2179728, 2199496, 2219550, 2237578, 2254408, 2273139, 2294320, 2315975, 2338278, 2363508, 2391080, 2417756, 2443533, 2472112, 2504368, 2536514, 2566325, 2596223, 2628430, 2661732, 2694811, 2728380, 2762498, 2796138, 2830638, 2868954, 2910427, 2951124, 2990282, 3031174, 3074759]
58225C074759M3639M3653M7386N1856N2642N2635N6857O2616O4008O2750O5101
58214C677902P0915P5053P6983P9913Q2919Q3176Q3450Q8309R5416R9660J02938
58203D616634J10390J19981J25896J29445J36349J45762J52498J57702J66654
58194E861311J78300J87513J95509K07225K20947K31412K40717K54857K72158
58185G849949K86648K99999L18207L39581L58480L77684M03956M34624M62350
58176A1131478M90051N26613N70729O13812O55971P03814P55298Q02890Q49106
58167A7099762R02776R62727J021770J083150J155519J235609J314608J397122
58159B6173043J493684J599474J702799J810045J938331K087405K243769K408231
$$ y = [3074759, 3118398, 3162051, 3209437, 3261293, 3313935, 3366570, 3423427, 3486043, 3550051, 3612801, 3677902, 3748817, 3823870, 3900853, 3980766, 4063685, 4146861, 4230311, 4318620, 4414036, 4513696, 4616634, 4727024, 4847005, 4972901, 5102346, 5238695, 5384457, 5536955, 5694657, 5861311, 6039611, 6227124, 6422633, 6629858, 6850805, 7082217, 7322934, 7577791, 7849949, 8136597, 8436596, 8754803, 9094384, 9452864, 9830548, 10234504, 10669128, 11131478, 11621529, 12148142, 12718871, 13332683, 13988654, 14692468, 15447766, 16250656, 17099762, 18002538, 18965265, 19987035, 21070185, 22225704, 23461313, 24775921, 26173043, 27666727, 29266201, 30969000, 32779045, 34717376, 36804781, 39048550, 41456781]
58151D1456781K592714K794756L004658L233760L504654L818650M167561M572924
58143F9146458N076382N696393O434163P312743Q360815R566143J0902980J2399771
58135A34895848J4112675J6032717J8086446K0215694K2376447K4508257K6659103
58128B76887187K9064140L1702820L3520063L2386172K6421592J5671471K413943
58121D48067388j0249356k0112602k6481277k9704017l0521872k9727598k8004753
58114B73265913k5818780k3436637k1045546j8800673j6778461j4972834j3362780
58107A39050202j1941471j0684080r547222q514328p600923o808670o112405n496714
58099G2344389m967123m517954m122784l764604l446440l166309k909358k670734
$$ y = [41456781, 44049495, 46844251, 49848909, 53082669, 56587323, 60405973, 64573534, 69146458, 74222840, 79919233, 86353396, 93666139, 102026954, 111593097, 122496077, 134895848, 149008523, 165041240, 183127686, 203343380, 225719827, 250228084, 276887187, 305951327, 337654147, 371174210, 403560382, 429981974, 445653445, 448067388, 437818032, 417705430, 391224153, 361520136, 330998264, 301270666, 273265913, 247447133, 224010496, 202964950, 184164277, 167385816, 152412982, 139050202, 127108731, 116424651, 106877429, 98363101, 90762178, 83953508, 77841103, 72344389, 67377266, 62859312, 58736528, 54971924, 51525484, 48359175, 45449817, 42779083]
58091D2779083k460535k279817k114556j958221j818240j695520j578926j465034
58083B7408234j363270j276563j195509j116353j046798r89486r36767q86110
58075A8597378q44114q10769p75539p33905o93036o56726o19244n78677n42337
58066A2343031n13729m86741m57590m30764m08750l87219l64568l45429l30843
58057H617398l15363k97309k81884k70866k59249k45257k33728k26498k19062
58048F268182k09792k02930j99304j93499j83453j74042j68111j62650j56495
58039D617906j53016j52186j48722j41201j34732j31662j27969j21555j15831
58030C391032j12112j06821r9425r4853r4559r3240q8068q3481q2901q3121q0921
$$ y = [42779083, 40318548, 38038731, 35924175, 33965954, 32147714, 30452194, 28873268, 27408234, 26044964, 24768401, 23572892, 22456539, 21409741, 20420255, 19483488, 18597378, 17753264, 16942495, 16166956, 15433051, 14740015, 14083289, 13464045, 12885368, 12343031, 11829302, 11342561, 10884971, 10454207, 10045457, 9658238, 9293670, 8948241, 8617398, 8302035, 8004726, 7722842, 7451976, 7192727, 6947470, 6713742, 6487244, 6268182, 6058390, 5855460, 5656156, 5462657, 5279204, 5105162, 4937051, 4774401, 4617906, 4464890, 4312704, 4163982, 4022781, 3888049, 3756387, 3628418, 3506863, 3391032, 3278920, 3172099, 3072674, 2977821, 2883262, 2790022, 2701954, 2618473, 2535572, 2452451, 2371530]
58019B371530p8317p7096p4667o9486o4597o2010n9102n4069m9386m6668m3593
58008A692539l9004l5666l5022l4392l2197l0653l0679k9433k5612k2108k0879
57997A356894k0199j9011j8802j9245j7584j4296j3572j6074j7255j5055j3058
57986A172743j3486j3465j1294j0080j1772j3436j2915j2470j3424j3004j0135
57975A037262q578j0452j2273j1452j1074j3831j6578j5844j3800j3784j4310
57964H95286j2621j0283j0146j1142j0797r798r733r297o889m207l315l139k368
57951G91551k685n255p240n918l350k948m213m851n279o863q143p039m861m181
57937G18725m578m071k894k375j874j68J825K697L205M420N300M844M387M832
$$ y = [2371530, 2293213, 2216117, 2141450, 2071964, 2007367, 1945357, 1886255, 1832186, 1782800, 1736132, 1692539, 1653535, 1617869, 1582847, 1548455, 1516258, 1485605, 1454926, 1425493, 1399881, 1377773, 1356894, 1336695, 1317684, 1298882, 1279637, 1262053, 1247757, 1234185, 1218111, 1200856, 1185801, 1172743, 1159257, 1145792, 1134498, 1124418, 1112646, 1099210, 1086295, 1073825, 1060401, 1047397, 1037262, 1028684, 1018232, 1005959, 994507, 983433, 969602, 953024, 937180, 923380, 909596, 895286, 882665, 872382, 862236, 851094, 840297, 830499, 820766, 811469, 804580, 800373, 797058, 793919, 791551, 788866, 783611, 776371, 770453, 767103, 764155, 759942, 755091, 749812, 742949, 734806, 727767, 722906, 718725, 714147, 710076, 707182, 704807, 702933, 702765, 704590, 707287, 710492, 714912, 720212, 725056, 729443, 734275]
57923G34275M016J57m304n746m458l404l677m401n512p304q520p925o670o442
57909F70085o589n560l828k817k337j374r8J018K478M150M292K334N43P28J398
57894F64423N65q62j118r23j898l519m290m269l952k519K28K142J587J89K25J283
57878F47292K036L151N426P201O744N370M987M479J856j545k586j017N30K75j645
57863F82554m678p760q992p932o850p428q107p222o371p347q138n954k390j283
57849E92102k655l172j745l10M88K025M023M251K453J041J213J544R93L72J91
57834F02814k25q49o16M36J071J190J942L147K955P29j807l011l155l258l647
57819E97716m247n037n808o250o347o055n130l925l489l911l741k226p24o47j358
$$ y = [734275, 738291, 738448, 734144, 728398, 723940, 720536, 716859, 712458, 706946, 699642, 691122, 683197, 676527, 670085, 663496, 657936, 654108, 651291, 648954, 647580, 647482, 648500, 650978, 655128, 659420, 661754, 662297, 663025, 664423, 664988, 664126, 663008, 662085, 660187, 656668, 652378, 648109, 644157, 641638, 641866, 644008, 645595, 645784, 646009, 647292, 649328, 652479, 657905, 665106, 671850, 677220, 682207, 686686, 688542, 686997, 684411, 683394, 683924, 684199, 682554, 677876, 670116, 661124, 653192, 646342, 638914, 630807, 623585, 617214, 609867, 601729, 595775, 593385, 592102, 589447, 586275, 584530, 584220, 584708, 586733, 590756, 595007, 597460, 598501, 599714, 601258, 602251, 602623, 602814, 602589, 601740, 601124, 601560, 602631, 603821, 605763, 608910, 611865, 612594, 610787, 607776, 604621, 601363, 597716, 593469, 588432, 582624, 576374, 570027, 563972, 558842, 554917, 551428, 547517, 543776, 541550, 540826, 540179, 538821]
57804E38821j596j485j402o15J113K293K156K478M634O743O496M973M621N148
57790E74378M680L534L261L144J497m29J51K626L343R49k196m050m937n288m706
57775E75957l861m154n076m701l167k721l930m796m218l331k798j697P1R34K35
57760E32747p36j113j532k190k218j774k371m323n966o214n823n564n199m869
57746D82855n277n954n388l535k137k038k213j985k026k616k855k236j152M00
57732D43843K641M485M425L131K762L543L689K947L152M712N647N181N242O971
57718E02371Q575Q238O714N362L969K356J937L579N605N887M693L778L802M081
57704E70947L923L086J750P64R45J711J689Q94P00J375J494K19j783m049o729
$$ y = [538821, 537225, 535740, 534338, 533723, 534836, 537129, 539285, 541763, 546397, 553140, 559636, 564609, 569230, 574378, 579058, 582592, 585853, 588997, 590494, 590065, 590216, 592842, 596185, 597134, 594938, 590888, 585951, 580663, 575957, 572096, 567942, 562866, 558165, 554998, 552277, 548347, 543551, 539333, 536002, 533204, 531507, 531578, 532512, 532747, 532011, 530898, 529366, 527176, 524958, 523184, 520813, 516490, 510524, 504310, 498487, 492923, 487724, 482855, 477578, 471624, 466236, 462701, 460564, 458526, 456313, 454328, 452302, 449686, 446831, 444595, 443443, 443843, 446484, 450969, 455394, 458525, 461287, 464830, 468519, 471466, 474618, 479330, 484977, 490158, 495400, 502371, 510946, 519184, 525898, 531260, 535229, 537585, 539522, 543101, 548706, 554593, 559286, 563064, 566866, 570947, 574870, 577956, 579706, 580470, 581415, 583126, 584815, 585709, 586409, 587784, 589278, 589497, 587714, 583665, 576936]
57689E76936q931r147p881p263p416o214l569k515m320n930m722k704k988m614
57675D98722m401k172n74o13p14J01J029J509K031K723L012K888K956L076K382
57660E11955P76o95j157q22n37q87j554j443K4J707J829L04j247j940k441k976
57644E00896k606j341q99k030k902j778L83J634J989K701L775M044K982R52j690
57629E06110m316n702n336m335l942l958l611k835j595O93L743N807O106O477
57615D93306Q828J2141J4018J4359J5479J9057K4681L0896L6115L8814L8144L3995
57603G79833K5883J3113k713j7043k6179l0654l3059l3972l2390k8999k6047k4203
57591E63570k2126j9094j5880j2953j0024p533o522o733o681n924n501n812n757
$$ y = [576936, 568005, 558858, 550977, 543714, 536298, 530084, 526515, 524000, 519680, 513750, 509028, 506324, 503336, 498722, 494321, 492149, 491575, 490962, 490248, 490349, 491378, 492887, 494918, 497641, 500653, 503541, 506497, 509573, 511955, 512731, 512036, 510879, 510057, 509520, 508633, 507079, 505636, 505660, 507367, 509196, 509500, 508253, 506313, 503872, 500896, 498290, 496949, 496050, 494020, 491118, 489340, 489723, 491357, 493346, 496047, 499822, 503866, 506848, 507800, 506110, 501794, 496092, 490756, 486421, 482479, 478521, 474910, 472075, 470480, 471173, 474916, 480723, 486829, 493306, 502134, 514275, 528293, 542652, 558131, 577188, 601869, 632765, 668880, 707694, 745838, 779833, 805716, 818829, 816116, 799073, 772894, 742240, 709181, 675209, 642819, 613820, 587773, 563570, 541444, 522350, 506470, 493517, 483493, 475960, 469438, 462705, 456024, 450100, 444599, 438787, 433030]
57578D33030m553k802j275P7J296J776J116j85j286j709j521j340j913l016l415
57563D14280k694k233l106m018l113j136n42j793k794k233j233j070j225p49k3
57548C86318k1q00j610j795j123J22J003O79n18j596k427l708n302n931m983l408
57532C54900k302j596q43k78l65q87j318j566j817k005j944j697j414j041m84
57517C35343J9l2r09k199k923k445j299o89j004j380r11L48J806K875K862J380
57501C30842n82j232m53l34k189m430m866l739k663j773j45J662K091J314J124
57486C14627J982K400J609P06O87J229J918K796L115J506j626l647k785l16J363
57471C25564J623J499J745K178K257J574K44p00j19J668L087L441L690M712O019
$$ y = [433030, 428477, 425675, 424400, 424477, 425773, 427549, 428665, 428480, 427194, 425485, 423964, 422624, 420711, 417695, 414280, 411586, 409353, 406247, 402229, 399116, 397980, 397438, 395645, 392851, 390618, 389385, 388315, 387090, 386341, 386318, 386297, 385497, 383887, 382092, 380969, 381091, 382094, 382773, 382255, 380659, 378232, 374524, 369222, 363291, 358308, 354900, 352598, 351002, 350159, 349881, 349516, 348629, 347311, 345745, 343928, 341923, 339979, 338282, 336868, 335827, 335343, 335362, 335330, 334421, 332222, 329299, 326854, 325555, 324866, 323862, 322482, 321571, 321919, 323725, 326600, 329462, 330842, 330260, 329028, 328575, 328241, 326052, 321622, 316756, 313017, 310354, 308581, 308436, 310098, 312189, 313503, 314627, 316609, 319009, 320618, 321324, 322011, 323240, 325158, 327954, 331069, 332575, 330949, 327302, 324517, 324201, 325564, 327187, 328686, 330431, 332609, 334866, 336440, 336684, 335984, 335865, 337533, 340620, 344061, 347751, 352463, 358482]
57456C58482O966P961R541J1179J1970J1750J0804R305P810P324P873P884O048
57443D74897L234J333O58j94j942l396l165j790j292k630m406m635l352k363k446
57428D48511k232p04P43L84q04m80J201J614j93j929j530k1M39m87j791l115m480
57411D35126n169m578l554l311l533k972j462kR18J598J916J208l39j360r32J82
57395D13736N10k21p56pJ305J353k81j617p14J584K681J810R04J674L503M951
57379D30415N601N450M002J509j55M33K078K579J879J859L262M716N072M987N550
57364D79237O480O541N136K890J002L87J123K439L334L405L019K876L383M297
57350E25549M960N088N231N943O657O218M672L522L758M592M690L787K448J213
$$ y = [358482, 365448, 373409, 382950, 394129, 406099, 417849, 428653, 437958, 445768, 453092, 460965, 468849, 474897, 478131, 479464, 480122, 479928, 477986, 474590, 471425, 469635, 468343, 465713, 461307, 456672, 453320, 450957, 448511, 446279, 445575, 446318, 446702, 445898, 445418, 446619, 448233, 448040, 446111, 444581, 444560, 444999, 444512, 442721, 439606, 435126, 429957, 425379, 421825, 418514, 414981, 412009, 410547, 410545, 411463, 413061, 414977, 416185, 415846, 414486, 413554, 413736, 414246, 414025, 413269, 413262, 414567, 415920, 415639, 414022, 413308, 414892, 417573, 419383, 420287, 421961, 425464, 430415, 436016, 441466, 445468, 446977, 446822, 447255, 449333, 451912, 453791, 455650, 458912, 463628, 468700, 473687, 479237, 485717, 492258, 497394, 500284, 501286, 501673, 502796, 505235, 508569, 511974, 514993, 517869, 521252, 525549, 530509, 535597, 540828, 546771, 553428, 559646, 564318, 567840, 571598, 576190, 580880, 584667, 587115, 588328]
57336E88328P53J847M154N888N863N085N112N759N890N710O364P701Q424Q496
57322F65374R263J0758J0903Q453N077L289L412L937M024M257N208O433O943O101
57308G53432M124K165J516K220K887K574K263L540O085P745P300N960N546O148
57294H13505O567O394O435P111P651P385O927P398Q907J0478J1289J1297J0738
57281I22082R661Q138O547N517N587O763Q263R127R331R768J0787J1499J1247
57268A034317J0976J1885J3328J3640J2864J2818J4206J5577J5834J6003J7284
57257A188732J8896J9432J9179J9427K0105J9966J8795J7848J7934J8477J8638
57246A397429J8223J7272J5861J4665J4777J6384J8329J9418J9676J9859K0260
$$ y = [588328, 589081, 590928, 595082, 600970, 606833, 611918, 617030, 622789, 628679, 634389, 640753, 648454, 656878, 665374, 674637, 685395, 696298, 704751, 709828, 713117, 716529, 720466, 724490, 728747, 733955, 740388, 747331, 753432, 757556, 759721, 761237, 763457, 766344, 768918, 771181, 774721, 780806, 788551, 795851, 801811, 807357, 813505, 820072, 826466, 832901, 840012, 847663, 855048, 861975, 869373, 878280, 888758, 900047, 911344, 922082, 931743, 939881, 946428, 951945, 957532, 964295, 972558, 981685, 991016, 1000784, 1011571, 1023070, 1034317, 1045293, 1057178, 1070506, 1084146, 1097010, 1109828, 1124034, 1139611, 1155445, 1171448, 1188732, 1207628, 1227060, 1246239, 1265666, 1285771, 1305737, 1324532, 1342380, 1360314, 1378791, 1397429, 1415652, 1432924, 1448785, 1463450, 1478227, 1494611, 1512940, 1532358, 1552034, 1571893, 1592153]
57235A592153K0565K0648K0954K1895K3132K3869K3923K4089K5029K6100K6084
57224A848441K4967K3994K3744K3323K2055K0871K0963K1835K1985K0990J9782
57213B092950J9074J8745J8679J9046J9594J9718J9471J9694K0860K2446K3676
57202B313953K4300K4386K3992K3335K2859K2819K3059K3343K3662K4140K4837
57191B574685K5737K6746K7678K8292K8288K7527K6495K6344K7708K9483K9763
57180B878746K8181K6385K5821K6160K6453K6567K6519K5605K3540K1562K1044
57169C156583K1752K2824K4699K8337L3146L7417M0637M3603M6451M8330M9123
57158C552902M9799N0828N1739N2364N3022N3373N2755N1839N2093N3243N3098
$$ y = [1592153, 1612718, 1633366, 1654320, 1676215, 1699347, 1723216, 1747139, 1771228, 1796257, 1822357, 1848441, 1873408, 1897402, 1921146, 1944469, 1966524, 1987395, 2008358, 2030193, 2052178, 2073168, 2092950, 2112024, 2130769, 2149448, 2168494, 2188088, 2207806, 2227277, 2246971, 2267831, 2290277, 2313953, 2338253, 2362639, 2386631, 2409966, 2432825, 2455644, 2478703, 2502046, 2525708, 2549848, 2574685, 2600422, 2627168, 2654846, 2683138, 2711426, 2738953, 2765448, 2791792, 2819500, 2848983, 2878746, 2906927, 2933312, 2959133, 2985293, 3011746, 3038313, 3064832, 3090437, 3113977, 3135539, 3156583, 3178335, 3201159, 3225858, 3254195, 3287341, 3324758, 3365395, 3408998, 3455449, 3503779, 3552902, 3602701, 3653529, 3705268, 3757632, 3810654, 3864027, 3916782, 3968621, 4020714, 4073957, 4127055]
57147D127055N0542M7025M4300M2391M0656L9160L7811L5569L1914K8072K5653
57136D550148K4914K5261K6471K8344L0098L1091L1434L1217L0106K8430K7476
57125D864990K7756K8200K7881K7175K6217K3898J9956J6458J5150J4612J2429
57114E104722R176P608Q275Q824P889O984P619Q896R340R364J0250J1818J2838
57101E223603J3135J3672J4605J4529J2178Q097M033J057j086k939m366n001m874
57088E286643l934j393L295R017J3747J6792J9005K0578K0221J7229J2866Q668
57076E422734M694O27k686m293m786n631p637j1340j7729k6998l7551m7845n8507
57063E203052p1179q6348j03907j24510j48192j72847j96541k20541k47573k77905
$$ y = [4127055, 4177597, 4224622, 4268922, 4311313, 4351969, 4391129, 4428940, 4464509, 4496423, 4524495, 4550148, 4575062, 4600323, 4626794, 4655138, 4685236, 4716327, 4747761, 4778978, 4809084, 4837514, 4864990, 4892746, 4920946, 4948827, 4976002, 5002219, 5026117, 5046073, 5062531, 5077681, 5092293, 5104722, 5113898, 5121506, 5129781, 5138605, 5146494, 5153478, 5161097, 5169993, 5179333, 5188697, 5198947, 5210765, 5223603, 5236738, 5250410, 5265015, 5279544, 5291722, 5299819, 5303852, 5304909, 5303823, 5300884, 5296518, 5291517, 5286643, 5282709, 5281316, 5284611, 5293628, 5307375, 5324167, 5343172, 5363750, 5383971, 5401200, 5414066, 5422734, 5427428, 5428055, 5425369, 5421076, 5416290, 5410659, 5403022, 5391682, 5373953, 5346955, 5309404, 5261559, 5203052, 5131873, 5045525, 4941618, 4817108, 4668916, 4496069, 4299528, 4078987, 3831414, 3553509]
57053C553509l09856l43353l79886m19370m60218n02414n47218b613o39330o82265
57043a324208p22746p59764p91757q20092q48532q79946r18388r74785j065900
57034i106118j206857j407300j671319j992805k350940k715987l055523l329537
57026b6836386l503069l607761l792509m239859m949767n604322n720257m999031
57018f3252961l541138j726088Q3258J710396L111662M251012N061574N493129
57010d8809156N557001N324817M899227M381980L851626L358190K931639K588337
57002a5916339K328434K136005J989794J873133J772557J673618J564955a133120
56993A85296J191647J067816R50483Q43216P47495O63163N89808N25489M65916
$$ y = [3553509, 3243653, 2900300, 2520414, 2101044, 1640826, 1138412, 591194, -2613, -641943, -1324208, -2046954, -2806718, -3598475, -4418567, -5267099, -6147045, -7065433, -8040218, -9106118, -10312975, -11720275, -13391594, -15384399, -17735339, -20451326, -23506849, -26836386, -30339455, -33947216, -37739725, -41979584, -46929351, -52533673, -58253930, -63252961, -66794099, -68520187, -68436929, -66726533, -63614871, -59363859, -54302285, -48809156, -43252155, -37927338, -33028111, -28646131, -24794505, -21436315, -18504676, -15916339, -13587905, -11451900, -9462106, -7588973, -5816416, -4142798, -2577843, -1133120, 185296, 1376943, 2444759, 3395242, 4238458, 4985953, 5649116, 6238924, 6764413, 7230329]
56984G230329M07921L52726L03310K59981K21091J86732J58549J36530J18968
56975I376137J05482R7537R5652R7694R9399R4836P7587M4655J91m6222q5407
56964I957541j12295j25601j26978j20843j12580j05461r9908r5503r2380r0717
56954H875275r0389r1520r4130r7077r8520r7830r6070r4706r4733r6892j01387
56943G822021j07350j13676j20428j28372j37217j45470j52062j56909j60050
56934F600487j61589j62639j64914j68939j73662j77942j81287j83065j82503
56925E043947j80191j78289j78561j80994j84865j90147j97020k04770k12069
56916C337041k17904k21663k22589k19846k13128k02969j90536j77090j63385
$$ y = [7230329, 7638250, 7990976, 8294286, 8554267, 8775358, 8962090, 9120639, 9257169, 9376137, 9481619, 9579156, 9674808, 9772502, 9871901, 9966737, 10044324, 10088979, 10089170, 10042948, 9957541, 9845246, 9719645, 9592667, 9471824, 9359244, 9253783, 9153875, 9058372, 8965992, 8875275, 8784886, 8693366, 8599236, 8502159, 8403639, 8305809, 8209739, 8115033, 8020300, 7923408, 7822021, 7714671, 7600995, 7480567, 7352195, 7214978, 7069508, 6917446, 6760537, 6600487, 6438898, 6276259, 6111345, 5942406, 5768744, 5590802, 5409515, 5226450, 5043947, 4863756, 4685467, 4506906, 4325912, 4141047, 3950900, 3753880, 3549110, 3337041, 3119137, 2897474, 2674885, 2455039, 2241911, 2038942, 1848406, 1671316, 1507931]
56907A507931j49528j35475j21393j07383r3302p9354o6366n4898m4600l5138
56897F20494k7149k1451j7858j5841j5843j8519k2908k6760k8715k9035k8287
56886C68128k6658k4560k2593k0593j7917j4760j1944r294n764j453K054M013
56874B18659N657Q141J0774J2312J2888J3169J2312Q268L39r396j7396k1319k1643
56861B32765k0970k1486k3001k3639k2193j9195j5984j3539j2233j1803j1471
56850C7251j0800j0286E836d191q315n982m957n424n350l402o19J472K808L934
56836c0026M657M720M737N438c688D939J1221J4286J6675J7783J8213J8269J7070
56823A18456J4276J1357R774Q910P321N063L237K003P70j14L59K137M145N960
$$ y = [1507931, 1358403, 1222928, 1101535, 994152, 900850, 821496, 755130, 700232, 655632, 620494, 593345, 571894, 554036, 538195, 522352, 503833, 480925, 454165, 425450, 396415, 368128, 341470, 316910, 294317, 273724, 255807, 241047, 229103, 219809, 214045, 212592, 214646, 218659, 224316, 232457, 243231, 255543, 268431, 281600, 293912, 302180, 302519, 293123, 275727, 254408, 232765, 211795, 190309, 167308, 143669, 121476, 102281, 86297, 72758, 60525, 48722, 37251, 26451, 16165, 5836, -4191, -12506, -18488, -23445, -28869, -34219, -37621, -38240, -36768, -33960, -30026, -25369, -20649, -15912, -10474, -3688, 4939, 16160, 30446, 47121, 64904, 83117, 101386, 118456, 132732, 144089, 153863, 162773, 170094, 175157, 178394, 180397, 181167, 181053, 181412, 183549, 187694, 193654]
56809A93654P983J0115J1698J2923J4954J8305K2306K6372L0711L5192L8409L8480
56797D61102L4451K6676J6410N386m528j1808j5674j6395j5168j3313j1163q131
56785D47845l985M29M186P469J1218J5952K1444K7215L2840L8110M3144M7833
56773F93700N0810M9661M2833L1034J6453J272j2668k3824l1538l6234l8336l7604
56761G05559l4172k9379k4675k0207j5425j0393n581r56L640P784J1188J4646
56749F02029J9010K3493K6145K5872K2852J7310R169r80j1576k1074k8472l2997
56737F50781l4160l2416k9138k5713k2838k0449j7880j4421j0148n928k274J150
56725D36566M404O574P122P140Q053R496R636P367L145k059p565j2772j7078k0123
$$ y = [193654, 201637, 211752, 223450, 236373, 251327, 269632, 291938, 318310, 349021, 384213, 422622, 461102, 495553, 522229, 538639, 544025, 539497, 527689, 512015, 495620, 480452, 467139, 455976, 447845, 443860, 444289, 448475, 455944, 467162, 483114, 504558, 531773, 564613, 602723, 645867, 693700, 744510, 794171, 837004, 868038, 884491, 885763, 873095, 849271, 817733, 781499, 743163, 705559, 671387, 642008, 617333, 597126, 581701, 571308, 565727, 564771, 568411, 576195, 587383, 602029, 621039, 644532, 670677, 696549, 719401, 736711, 745880, 744900, 733324, 712250, 683778, 650781, 616621, 584205, 555067, 529354, 506516, 486067, 468187, 453766, 443618, 437690, 435416, 436566, 440970, 447544, 454666, 461806, 469859, 479355, 488991, 496358, 499503, 497444, 489879, 477107, 460029, 439906]
56711D39906k1663k1558k0333j9173j8648j8142j7234j6751j7314j7810j6647
56700B34633j4008j1380r475q018p096p108p560p398o423n163l744k274j797l099
56686A40090m915n128l677k433k289k305j846j470j333o81L62M14r61k241k056
56671A09531r58k16j45m38r99j572j540q56k20J21O91J468J513N51k96j55M62
56654A06942R21J647K920L583K328k83k226k258r61K41N41K91L88J097J593J038
56638A17802k79j531k533l319l108j316O62O52j081j732K08K814L416J870O0n43
56622A12042L36K251M054M451L588L264M559O239O549N613M703M090L044J591
56608A66374P45J015J765K235K410K730L360L906L813L073K417K424K856L411
$$ y = [439906, 418243, 396685, 376352, 357179, 338531, 320389, 303155, 286404, 269090, 251280, 234633, 220625, 209245, 199770, 191752, 184656, 177548, 169988, 162590, 156167, 151004, 147260, 144986, 143189, 140090, 135175, 130047, 126370, 123937, 121648, 119343, 117497, 116027, 114694, 114013, 114375, 114789, 113828, 111587, 109531, 108573, 108357, 108212, 107774, 106775, 105203, 103663, 102807, 102587, 102708, 103399, 104867, 106380, 106931, 106635, 106480, 106942, 107863, 109510, 112430, 116013, 118341, 118058, 115832, 113574, 112613, 112854, 113395, 113686, 114074, 115171, 116764, 117802, 117523, 115992, 113459, 110140, 107032, 105716, 106378, 107030, 105949, 104217, 104425, 107239, 110655, 112525, 112585, 112042, 112378, 114629, 118683, 123134, 126722, 129986, 134545, 140784, 147333, 152946, 157649, 161739, 164783, 166374, 167119, 168134, 169899, 172134, 174544, 177274, 180634, 184540, 188353, 191426, 193843, 196267, 199123, 202534]
56594B02534M510O255P193N855L251J798J739Q66j549l189k266l40J88n51j131
56579B25163j739l328m970m622k240N3P99L90m25j409k130j970j135m28J6O15
56563B02640J101P64J0K66J880L300K867Q03j159j610o46M41M44o81j937k414
56547B06069j981r63J86P80L86l34j89O96P42p82k509k890k205j565j029j57M92
56530A94747M9r71j160j49J164K061K463K224J201l2n79k87L05P91J010Q67Q43
56513B04547J888L883N073M170K264J198R60M84L44K372O533J0244J1384J0528
56499B65872R681R979J1055J1585J0151O552K482K6n62o78j099j281q97o84j233
56484C20949k152k893l447l793l643l071k585k228j517n75m10j584l348m474m325
$$ y = [202534, 207044, 213299, 220492, 226347, 229598, 231396, 233135, 234001, 232452, 229263, 226997, 226657, 226845, 226294, 225163, 223424, 220096, 215126, 210504, 208264, 208317, 209116, 209506, 209081, 207672, 205542, 203572, 202437, 202009, 202025, 202640, 203741, 204505, 204515, 204781, 206661, 209961, 212828, 213631, 212472, 210862, 210216, 210657, 211101, 210420, 208483, 206069, 204088, 203125, 203311, 204091, 204477, 204143, 203954, 204650, 205392, 204610, 202101, 199211, 197006, 195441, 194412, 194255, 194747, 194796, 193825, 192665, 192516, 193680, 195741, 198204, 200428, 201629, 201597, 201018, 200731, 201036, 201827, 202837, 203704, 204547, 206435, 210318, 215391, 219561, 221825, 223023, 223983, 224467, 224811, 227183, 233716, 243960, 255344, 265872, 275553, 285532, 296587, 308172, 318323, 324875, 327357, 327383, 326821, 326143, 325044, 323763, 322866, 322182, 320949, 318797, 315904, 312457, 308664, 305021, 301950, 299365, 297137, 295620, 295045, 294635, 293051, 289703, 285229, 280904]
56469B80904k878n04J859L030K532Q88j078k671l156k122k80Q54N11o57j579j866
56453B73787j683j313j109j348j858k206k331k530k672k117o24J119K089J822
56439B59026P16k16j66N30N38o92j810j142Q55J940R98o35j181p37p93j998l238
56422B51995k909p57J664K448J390K95Q43K527L407K691J631J675K637L225K833
56407B75595K110J885K035J738O61m31n68J27N58J04n05p6J566L210L299J447
56391B92755q64j538l09Q05L70q6J655M475M840J976p27n89Q00P87k08k86K10
56374C04066k86j003L30L416N215M118J719Mq42j243r14K06J246J505J279J042
56358C19858P90M69K38J17Q3K94M80k98k114l174j873P29K144J707P64J69l29
$$ y = [280904, 278026, 277522, 279381, 282411, 284943, 285831, 284753, 282082, 278926, 276804, 276524, 277378, 277889, 277232, 275653, 273787, 272104, 270791, 269682, 268334, 266476, 264270, 261939, 259409, 256737, 254620, 253996, 255115, 257204, 259026, 259742, 259526, 259360, 259890, 260428, 259736, 257926, 256784, 257639, 259579, 260577, 259942, 258761, 258024, 257231, 255233, 251995, 249086, 248329, 249993, 252441, 253831, 254126, 254969, 257496, 260903, 263594, 265225, 266900, 269537, 272762, 275595, 277705, 279590, 281625, 283363, 284024, 283593, 283025, 283152, 283710, 283814, 283309, 283233, 284799, 288009, 291308, 292755, 291891, 290353, 290044, 290849, 291219, 291133, 292788, 297263, 302103, 304079, 303352, 302763, 303563, 304350, 304142, 303856, 304066, 303780, 302777, 303107, 306523, 311738, 315856, 317575, 317579, 316737, 315494, 314580, 314786, 316032, 317537, 318816, 319858, 320648, 321117, 321355, 321472, 321555, 321849, 322329, 322031, 319917, 316743, 314870, 315599, 317743, 319450, 320214, 320383, 320054]
56341C20054m86L13J311J008k47n78K27K33j245k254j278M38J026O57N86R21P71
56324C21457k92j942l532m226l686l072m060o316p375n809l065j208l00P81K141
56309B79496L012L382M098N449O635O731N768M787M823N634N823M642L149K780
56295C46209L323L438K693J811J272J082J509K575L160K347J259J763L600M726
56281C80767M363L553K932K202J827K727M026L705K000J552L533O043P243P524
56267D33997P703P500O970P066P458O249L187Q74J142K402K340J222P39J261K048
56252D92158K750L172K864K176K213K822K455J019N98K104L704M087M667O572
56238E33361Q088P552O470O983Q210Q087P114P213Q174Q378Q068Q829J0481J1420
$$ y = [320054, 319568, 319881, 321192, 322200, 321953, 321375, 321602, 321835, 320590, 318336, 317058, 317496, 318522, 319179, 319765, 320686, 321457, 321165, 319223, 315691, 311465, 307779, 304707, 300647, 294331, 286956, 281147, 278082, 276874, 276574, 277355, 279496, 282508, 285890, 289988, 295437, 302072, 308803, 314571, 319358, 324181, 329815, 335638, 340280, 343429, 346209, 349532, 352970, 355663, 357474, 358746, 359828, 361337, 363912, 367072, 369419, 370678, 372441, 376041, 380767, 385130, 388683, 391615, 393817, 395644, 398371, 402397, 406102, 408102, 409654, 413187, 419230, 426473, 433997, 441700, 449200, 456170, 463236, 470694, 476943, 480130, 481004, 482146, 484548, 486888, 488110, 488849, 490110, 492158, 494908, 498080, 500944, 503120, 505333, 508155, 510610, 511629, 512227, 514331, 518035, 522122, 526789, 533361, 541449, 549001, 555471, 562454, 570664, 578751, 585865, 593078, 601252, 609630, 617698, 626527, 637008, 648428]
56224F48428J1662J2708J4547J5403J4655J3707J3745J4484J5407J6574J8004
56213H09324J9574K1472K3679K5490K6600K7956L0290L2755L4362L5752L7908
56202A125162M0246M1920M4021M8298N4277N9810O4086O8186P3038P8767Q5714
56191A783525R4110J02906J10766J18027J25967J34380J41665J47094J51212J54040
56181C063692J54653J52661J48522J42132J32516J19040J01959Q1865N9682L6922
56171D193644J4707p239k9527n1399p1222q8246j02616j14070j22078j27077j30298
56160C364579j32343j32858j31531j28608j24585j20036j15357j10338j04614
56151B264309r8786r3946q9645q3889p6124o8615o3610o0531n7398n3705n0245
$$ y = [648428, 660090, 672798, 687345, 702748, 717403, 731110, 744855, 759339, 774746, 791320, 809324, 828898, 850370, 874049, 899539, 926139, 954095, 984385, 1017140, 1051502, 1087254, 1125162, 1165408, 1207328, 1251349, 1299647, 1353924, 1413734, 1477820, 1546006, 1619044, 1697811, 1783525, 1877635, 1980541, 2091307, 2209334, 2335301, 2469681, 2611346, 2758440, 2909652, 3063692, 3218345, 3371006, 3519528, 3661660, 3794176, 3913216, 4015175, 4097040, 4156722, 4193644, 4208351, 4201112, 4171585, 4120186, 4048964, 3960718, 3858102, 3744032, 3621954, 3494877, 3364579, 3232236, 3099378, 2967847, 2839239, 2714654, 2594618, 2479261, 2368923, 2264309, 2165523, 2071577, 1981932, 1898043, 1821919, 1753304, 1689694, 1629163, 1571765, 1518060, 1467815]
56140A467815m7201m4070m0629l6689l1867k6784k3391k2738k3382k3097k1071
56129A126896j7678j3718j0827j0613j2065j1916r056o377o376p417o655m338
56117A009860k545j572m15P74J457K476M501O278O828P532R468J0734R570Q027
56103A072973R038J1651J2970J3205J4689J7091J7954J7359J7894K0190K2451
56092A247465K4335K7534L2298L6788M0185M3496M7280N1552N7697O7292P9089
56081A755011R0040R9066J06816J12164J12377J06814R7524Q6342P4209O2964
56071B703327N4610M8990M4877M2474M1908M0422L5036K7142K0545J5731J0115
56060C085177L268k962r420j9726l4678n0848o5415p8316q8887r4676r4839r1255
$$ y = [1467815, 1420614, 1376544, 1335915, 1299226, 1267359, 1240575, 1217184, 1194446, 1171064, 1147967, 1126896, 1109218, 1095500, 1084673, 1074060, 1061995, 1050079, 1041023, 1034646, 1028270, 1020853, 1014198, 1009860, 1007315, 1005743, 1005328, 1006102, 1007559, 1010035, 1014536, 1020814, 1027642, 1035174, 1044642, 1055376, 1064946, 1072973, 1082011, 1093662, 1106632, 1119837, 1134526, 1151617, 1169571, 1186930, 1204824, 1225014, 1247465, 1271800, 1299334, 1331632, 1368420, 1408605, 1452101, 1499381, 1550933, 1608630, 1675922, 1755011, 1845051, 1944117, 2050933, 2163097, 2275474, 2382288, 2479812, 2566154, 2640363, 2703327, 2757937, 2806927, 2851804, 2894278, 2936186, 2976608, 3011644, 3038786, 3059331, 3075062, 3085177, 3088445, 3085483, 3076063, 3056337, 3021659, 2970811, 2905396, 2827080, 2738193, 2643517, 2548678, 2457423]
56048B457423q5352p7132o7740n9448n2573m5766l9429l5169l2020k7434k2061
56037A913299j8980j7935j5101r360l992j117P75K697L366L024M301P470R234
56024A877681Q155P151Q713J1584J3953J6041J7881J8382J8201J9728K2723K4089
56012B064282K3319K3754K6702K8967K8425K7632K9275L1937L3136L3067L2903
56001B383399L2548L2227L3223L5223L6019L5371L5787L8148M0063L9969L9305
55990B781282L9387L9760M0628M3133M6288M7576M7379M8574N1293N2767N2885
55979C290952N4620N8289O0920O2107O4588O8122O9249O8503P0948P7696Q3797
55968D029791Q6806R0316R6276J01173J03258J06531J13490J20523J24526J28029
$$ y = [2457423, 2372071, 2294939, 2227199, 2167751, 2115178, 2069412, 2029983, 1994814, 1962794, 1935360, 1913299, 1894319, 1876384, 1861283, 1851923, 1847931, 1846814, 1847589, 1850286, 1853652, 1856676, 1860977, 1868447, 1877681, 1885836, 1892987, 1901700, 1913284, 1927237, 1943278, 1961159, 1979541, 1997742, 2017470, 2040193, 2064282, 2087601, 2111355, 2138057, 2167024, 2195449, 2223081, 2252356, 2284293, 2317429, 2350496, 2383399, 2415947, 2448174, 2481397, 2516620, 2552639, 2588010, 2623797, 2661945, 2702008, 2741977, 2781282, 2820669, 2860429, 2901057, 2944190, 2990478, 3038054, 3085433, 3134007, 3185300, 3238067, 3290952, 3345572, 3403861, 3464781, 3526888, 3591476, 3659598, 3728847, 3797350, 3868298, 3945994, 4029791, 4116597, 4206913, 4303189, 4404362, 4507620, 4614151, 4727641, 4848164, 4972690, 5100719]
55958E100719J33766J40252J46491J55075J66842J78446J88687K00978K16214
55949F627470K30029K40667K52588K68370K84313K98124L13561L33110L53394
55940I201626L72409L93849M19855M47051M74248N06019N44062N83165O20480
55931A3562764O60378P05599P52464P99347Q50314R05868R60638J014979J077537
55922B1289888J151103J228224J306419J394214J495320J601439J708871J827350
55914C3002828J963364K110028K263325K432591K624635K834555L063731L329144
55906E3624201L642962M002554M414505M907918N509666O228517P076986Q079817
55898I7487126R242123J0541413J1975878J3588668J5420010J7473326J9751616
$$ y = [5100719, 5234485, 5374737, 5521228, 5676303, 5843145, 6021591, 6210278, 6411256, 6627470, 6857499, 7098166, 7350754, 7619124, 7903437, 8201561, 8515122, 8848232, 9201626, 9574035, 9967884, 10387739, 10834790, 11309038, 11815057, 12359119, 12942284, 13562764, 14223142, 14928741, 15681205, 16480552, 17330866, 18236734, 19197372, 20212351, 21289888, 22440991, 23669215, 24975634, 26369848, 27865168, 29466607, 31175478, 33002828, 34966192, 37076220, 39339545, 41772136, 44396771, 47231326, 50295057, 53624201, 57267163, 61269717, 65684222, 70592140, 76101806, 82330323, 89407309, 97487126, 106729249, 117270662, 129246540, 142835208, 158255218, 175728544, 195480160]
55891A95480160K2266461K4961540K7676750L0201800L2191745L2846109L0814988
55884C96439553K4870434J5011913K902362q945941j8517312k5006310k8588974
55877C58165725k9856798k9470793k8036491k6020611k3719603k1327714j9007212
55870A80726503j6874198j4967785j3280438j1801571j0513296r377744q362379
55863I5549092p462485o679600n997120n395291m870720m421767m030836l678644
55855E3012629l362052l082592k831257k599195k390412k209662k048965j898768
55847C2589726j761094j639647j527825j418644j316472j227350j147067j069914
55839B1481713j000129r43490q95660q49480q06316p70110p37082p01215o63752
$$ y = [195480160, 217746621, 242708161, 270384911, 300586711, 332778456, 365624565, 396439553, 421309987, 436321900, 439224262, 430278321, 411761009, 386754699, 358165725, 328308927, 298838134, 270801643, 244781032, 221061429, 199733715, 180726503, 163852305, 148884520, 135604082, 123802511, 113289215, 103911471, 95549092, 88086607, 81407007, 75409887, 70014596, 65143876, 60722109, 56691273, 53012629, 49650577, 46567985, 43736728, 41137533, 38747121, 36537459, 34488494, 32589726, 30828632, 29188985, 27661160, 26242516, 24926044, 23698694, 22551627, 21481713, 20481584, 19538094, 18642434, 17792954, 16986638, 16216528, 15479446, 14778231, 14114479]
55830A4114479o28416n93267n55740n19876m90453m65404m41316m20318m04242
55821I595447l88214l67846l47080l31257l17901l01901k84660k70506k58752
55812F727330k46755k36381k30146k24903k16214k05466j96349j88173j78669
55803D804274j69587j63444j58366j51812j45632j42051j38759j33498j29085
55794C472040j28056j26745j21001j13602j09422j07057j02146r5706r2073r1089
55784B385143q9172q6204q4935q5124q4057q1576p9315p6383p0820o3860n8187
55773A525510n3601m8709m4748m3252m2112l8644l4366l2113l0712k7473k3797
55762A105983k3065k4551k4585k2533k0826k0115j8897j7031j5647j4533j3140
$$ y = [14114479, 13486063, 12892796, 12337056, 11817180, 11326727, 10861323, 10420007, 9999689, 9595447, 9207233, 8839387, 8492307, 8161050, 7843149, 7541248, 7256588, 6986082, 6727330, 6480575, 6244194, 6014048, 5789145, 5572931, 5367465, 5171116, 4982943, 4804274, 4634687, 4471243, 4312877, 4161065, 4015433, 3873382, 3734623, 3601125, 3472040, 3343984, 3217239, 3096238, 2982636, 2873214, 2766157, 2664011, 2568305, 2476232, 2385143, 2295971, 2209767, 2124832, 2039708, 1955651, 1874075, 1794760, 1718377, 1647557, 1583697, 1525510, 1471909, 1423200, 1378452, 1335200, 1293088, 1254444, 1220078, 1187965, 1157253, 1129780, 1105983, 1082918, 1058367, 1033782, 1011249, 990423, 970308, 951411, 934380, 918733, 904200, 891060]
55751H91060j2664j3644j3517j0344o895o869r163j0083r188q487p908o264m909
55738G71125n582o242l839J27J690O83O4K51o92k244k011n85q08k497k743j185
55722G45512l04p18q98j415m534r244j1570j0414q718q152p138m867k996k218
55708F72326j232l08j938o563j1191j3682j5037j6193j5980j3998j2375j2669
55696E51160j3394j2517j0330q210o388m556l304l431m589n528n245l789k508
55683D67371k969m795n566m067k307k459l356k648j161j905n211q183r054r024
55669D04666r352r387q317o710n422m620m213l961l223j899j071j278j165L30
55655C44378J727J270J46P19K639L825M207N202O093M727J586o33j583l575o854
$$ y = [891060, 878396, 864752, 851235, 840891, 833996, 827127, 817964, 807881, 798693, 790206, 782298, 776034, 771125, 765543, 759301, 755462, 755589, 757279, 757962, 758026, 758277, 757585, 755341, 753330, 752745, 751937, 749440, 746697, 745512, 745208, 744490, 743592, 742177, 737643, 728399, 716829, 706415, 697697, 689545, 682407, 677540, 674544, 672326, 671094, 670786, 668848, 662285, 651094, 637412, 622375, 606182, 590202, 576204, 563829, 551160, 537766, 525249, 514919, 506709, 500321, 495765, 492461, 489030, 484441, 478913, 473668, 469879, 467371, 464402, 459607, 454041, 449974, 447667, 445208, 441852, 439204, 438043, 436138, 430927, 422744, 413690, 404666, 395314, 385927, 377610, 370900, 365478, 360858, 356645, 352684, 349461, 347562, 346491, 345213, 344048, 344378, 346105, 347375, 347521, 348240, 350879, 354704, 358911, 364113, 370206, 374933, 376519, 375886, 374303, 370728, 363874]
55640C63874q559p433n999o545p998q451p945p140n714l735k559k812l242k774
55626B82968j937j224o6J448J754Q1k048k828k280j347l28O67R92K94p95j484
55610B73867j529r24J01P61N92M34J075J375k67k768l122n30K502L630K985J586
55594B79768j29j435j302l01l77j812k568j624o64j047j348J48K354K897J531
55579B74091L2o53j290k710m666o396p375p518p114o532n864n079m329l676k841
55564B08080j910j662k269k380q95R96J307K67k00K26j44j912l437l400k562k133
55548A87972k102k050j998j823j222p54j366k404j980O4J439N62j243j835j045
55533A70215k39k70r89j867k269j896j385j510j628l24K048L195J979J16j99J043
$$ y = [363874, 355315, 347882, 341883, 335338, 327340, 318889, 310944, 303804, 298090, 294355, 291796, 288984, 285742, 282968, 281031, 279807, 279741, 281189, 282943, 283024, 280976, 278148, 275868, 274521, 274193, 274860, 275852, 276146, 275351, 273867, 272338, 271414, 271515, 272276, 272868, 273302, 274377, 275752, 275485, 272717, 269595, 269065, 271567, 275197, 278182, 279768, 279639, 278204, 276902, 276601, 276224, 274412, 271844, 270220, 269556, 268509, 267161, 267309, 269663, 272560, 274091, 274123, 273470, 272180, 269470, 264804, 258408, 251033, 243515, 236401, 229869, 224005, 218926, 214597, 210921, 208080, 206170, 204508, 202239, 199859, 198964, 199960, 201267, 201534, 201334, 201560, 201416, 199504, 196067, 192667, 190105, 187972, 185870, 183820, 181822, 179999, 178777, 178023, 176657, 174253, 172273, 172337, 173776, 174338, 173095, 171260, 170215, 169976, 169706, 168717, 166850, 164581, 162685, 161300, 159790, 158162, 157838, 159886, 163081, 165060, 165176, 164977, 166020]
55517A66020K404L267M205N853Q243J0713J2085J1621J0073Q885Q266P170N199
55504B64004L185J652J56j453k602l275m344o058p504q088q269q368q000p127
55490B03909o385n886m993l707k890k685k195j136l47j33M07J654K513J908J75
55475A80209j574k416j721L07K088K101J066J040K230K671J517M90J075K297K461
55460A93841J648J238K032L707N157M954K522q52l419n259p644j0317j1533j0947
55446A65128j0064r463q078n846m503m720m962m197l379l084k311j057j379l950
55432I8135n950m698j508L86K61J1R11K262K689J418j013k644j873J38N93r50
55416H8168k010j259l23l00L36K295L064P30k312k616o23P40N91K6r47k917m494
$$ y = [166020, 168424, 171691, 175896, 181749, 189992, 200705, 212790, 224411, 234484, 243369, 251635, 258805, 264004, 267189, 268841, 268997, 267544, 264942, 261667, 257323, 251265, 243761, 235673, 227404, 219036, 211036, 203909, 197524, 191638, 186645, 182938, 180048, 177363, 175168, 174032, 173685, 173552, 173959, 175613, 178126, 180034, 180209, 178635, 176219, 174498, 174805, 176893, 178994, 180060, 181100, 183330, 186001, 187518, 188008, 189083, 191380, 193841, 195489, 196727, 198759, 202466, 207623, 212577, 215099, 214247, 210828, 205569, 197925, 187608, 176075, 165128, 155064, 145601, 137523, 131677, 127174, 122454, 117492, 113295, 109916, 106832, 104521, 103464, 102085, 98135, 92185, 87487, 85979, 86365, 86626, 86637, 87548, 89810, 92499, 93917, 92904, 90260, 88387, 88525, 89118, 88168, 86158, 84899, 84576, 84276, 84612, 86907, 89971, 90701, 88389, 85773, 85150, 85890, 86481, 86507, 85560, 82643, 78149]
55399G8149l664j214K39K83P86K156K551J096o29r63m9J027J504J084J32l67j5
55382H2106L44J19J20Q96J269K48r26o50L68N81N63J827L567L513J562j83q55
55365I4469j532k463k362q95N10Q94P69M91l25j322j283p6R87J149R97Q96L56
55348I1260n80r18k13P31J106Q45N4j120j910j581o83m28q05p24N7O27O42P54
55330H7114J143J058J73q29j346j493j445j156p30k25P94K495L845L490J428j118
55314I3198k982l358j704J231L100K316K52n28L35J065O70j54o94r41q40m48o12
55297H9906j832k911k476j262r19j169m82R13J216J81n06j36J77j27k43R8J96
55280H0624K04J054K207J905J50r59n00J21N7L64J388J374o23k581k116K76K182
$$ y = [78149, 74485, 73271, 73510, 73793, 74579, 76735, 79286, 80382, 79753, 78790, 78741, 79768, 81272, 82356, 82488, 82121, 82106, 82450, 82569, 82689, 83585, 84854, 85102, 84176, 83526, 83894, 84475, 85038, 86865, 90432, 93945, 95507, 95324, 94469, 92937, 90474, 88112, 87217, 87727, 88621, 89390, 89881, 89556, 88234, 86951, 86875, 87862, 89011, 90008, 90904, 91260, 90680, 89762, 89549, 90280, 91386, 92231, 92285, 91165, 89255, 87674, 86991, 86563, 85758, 85034, 85091, 85718, 86360, 87114, 88257, 89315, 89488, 88659, 87313, 85820, 84375, 83219, 82489, 82264, 83058, 85553, 89398, 92888, 94316, 93198, 90216, 86858, 85154, 86385, 89485, 91801, 92053, 91525, 91860, 92925, 93595, 93441, 92747, 91806, 90966, 90518, 89906, 88074, 85163, 82687, 81425, 80506, 79337, 78855, 79768, 80984, 81165, 80659, 80523, 80700, 80573, 80330, 80428, 80624, 80828, 81882, 84089, 85994, 86144, 85185, 84685, 84806, 84863, 85227, 86615, 87989, 87366, 84785, 82669, 82945, 85127]
55263H5127K225Q09q72j446j16K154L199K182M40n98r78j132r23n72r91k205k762
55246H3541j638M14K027K546J786Mj417r93O27J159m1j123p18K95P59Q30N81o21
55228H8018k173k041RJ353M27o06P11L113L631J997L74k02m85q14o44p4J30j43
55210I2581m59p63r38k68J273K161J345J87N59J935K304J209p4q43j344j325k61
55193I7279J056J084k27j463j915k178k602k753k476j948q03J319L259L159R70
55178I1761j329k222j996j346l21Q63J429J224J163J721J978R69q54k213k566
55163H8261k253j566m36J002K118K335J802J300J262J129J30j380k033j177K70
55148I0764J034Q75K88l17m47N26K307L329K591J261J145K044K096O38q92j179
$$ y = [85127, 87352, 88161, 87289, 85843, 85727, 87881, 91080, 93262, 93702, 93104, 92126, 90994, 90071, 89499, 88508, 86303, 83541, 81903, 82317, 84344, 86890, 88676, 88680, 87263, 86270, 86897, 88056, 88015, 86892, 86174, 86469, 87228, 88058, 88639, 88018, 85845, 83804, 83813, 85166, 85593, 84987, 85698, 88811, 92442, 94439, 94813, 94611, 94126, 93312, 92668, 92594, 92724, 92581, 92122, 91359, 90421, 90153, 91426, 93587, 94932, 95119, 95678, 97613, 99917, 101126, 101052, 100209, 98865, 97540, 97279, 98335, 99419, 99192, 97729, 95814, 93636, 91034, 88281, 85805, 83857, 83054, 84373, 87632, 90791, 91761, 90432, 88210, 86214, 84868, 84547, 85410, 86839, 88063, 89226, 90947, 92925, 93894, 93040, 90827, 88261, 86008, 84442, 84006, 85008, 87126, 89461, 91263, 92563, 93825, 94954, 95084, 93704, 91671, 90494, 90764, 91798, 92673, 92961, 92644, 92197, 92723, 95030, 98359, 100950, 102211, 103356, 105400, 107496, 108134, 107242, 106063]
55132A06063p98j029j897k272j415K51J746K445K365J796Q27n74j970k447j557
55117A01534n7P95N57p7j77M83J296J437P11j60k95L62J108J488J669J743J440
55100A13857P00r7q13j728k699k920k016p60j24j80m08n33m23L09J933L974N348
55083A13420N097L069L18j406j252k80n1n26n22J1j31j036j110L98K033K258J345
55066A21635J92j166k568k870j606l25n62j596j700o90L50R76J296R08l22j161
55050A10791m15J082J580R39M45O22R01R74Q20Lj403j855k74J719J712L02L73
55033A18316K652M479L635J093r15j580j280l27Q92J672J823J821J775J314P59
55018A36129R92J750J533j14j643j646p03k06m89j065j668k094j850r15j95k98
$$ y = [106063, 105265, 104236, 102339, 100067, 98652, 98903, 100649, 103094, 105459, 107255, 108082, 107508, 105538, 103091, 101534, 101477, 102272, 102829, 102752, 102575, 103058, 104354, 105791, 106502, 106342, 106047, 106409, 107517, 109005, 110674, 112417, 113857, 114557, 114460, 113647, 111919, 109220, 106300, 104284, 103524, 103400, 103220, 102812, 102279, 101856, 102165, 104098, 108072, 113420, 118517, 121586, 121904, 120498, 119246, 118966, 118915, 118389, 117867, 117878, 117747, 116711, 115601, 115999, 118032, 120290, 121635, 121827, 120661, 118093, 115223, 113617, 113292, 112730, 111134, 109434, 108744, 109094, 110070, 111366, 112274, 111952, 110791, 110376, 111458, 113038, 113977, 114422, 115044, 115945, 116919, 117739, 117742, 116339, 114484, 114210, 115929, 117641, 117943, 118316, 120968, 125447, 129082, 130175, 129260, 127680, 126400, 126073, 126965, 128637, 130460, 132281, 134056, 135370, 136129, 137121, 138871, 140404, 140290, 138647, 137001, 136298, 136092, 135603, 134538, 132870, 130776, 128926, 128011, 127816, 127518]
55002A27518n78j61O44Q35J98n19p03m48k19l75q61j187q88j95J38j21l12J50
54984A22916Q38P53l24j239n08J853L782L179N23j487j281k02j71r37j104p24
54968A25867q05r38K14K117K489P45r41r17m12j211k764l269k520j813j550o43
54952A13649J567M053N140M261K347Q27L77O06Q06O66J37q65k001k237r88P11
54936A29056J268O49L42J099J912J585L43o54n67O76K506L912M073L057J457m05
54920A50309k236l134k421r23k00n07p60m30k7K94Q84J219K22j498j752Q6J926
54903A41052K026J325J296J292q2k225l255k731j748q64K78J450J741J057L55
54888A40967K19L30M80R88J842K285J713M13p50j091n15M16Q90N76j75r21j540
$$ y = [127518, 126940, 126779, 127423, 128258, 128456, 127937, 127234, 126786, 126567, 126192, 125331, 124144, 123256, 123061, 123199, 123078, 122766, 122916, 123754, 124507, 124183, 122944, 122436, 124289, 128071, 131250, 131773, 130286, 129005, 128803, 128632, 127695, 126591, 125867, 125062, 124124, 124338, 126455, 128944, 129689, 128748, 127831, 127419, 126208, 123444, 120175, 117655, 115842, 114292, 113649, 115216, 119269, 124409, 128670, 131017, 131844, 132221, 132827, 133633, 134299, 134436, 133571, 131570, 129333, 128345, 129056, 130324, 130973, 131315, 132414, 134326, 135911, 136254, 135600, 135033, 135709, 138215, 142127, 146200, 149257, 150714, 150309, 148073, 144939, 142518, 141595, 141395, 140888, 140128, 139698, 139671, 139965, 140849, 142068, 142290, 140792, 139040, 139126, 141052, 143078, 144403, 145699, 146991, 146909, 144684, 141429, 138698, 136950, 136086, 136364, 137814, 139555, 140612, 140967, 141186, 141516, 141996, 142984, 144826, 147111, 148824, 149237, 148487, 147396, 146881, 147297, 148187, 148763, 148588, 147667, 146127]
54871A46127j829j374l02M17J06n51k43J433L648N281N701M972L740K820K627
54856A72573L126M220N598O286N422L765L323M896O912P349N894L482Q08j665
54842B31989l186l601m123n881q027q542o841m351k587j680r56j19M55K12r05
54827A81857j998j876n47M75O4r65j005O2Q30L43r01j830j776n71J421L268M223
54810A81074M590N211O178O750O594O218O045N682M473K307l54k892m771n646
54796B21459n530m919m573m987n721n590m064k369k248l573m343l530k575l099
54782A64338m332m266k674j214r00j182j552k402l725m334l231r56J218K738L732
54767A41258L928K583l23l387m660l387p01J566K512K367J393l48k086k346o74
$$ y = [146127, 144298, 142924, 142622, 143039, 143145, 142594, 142351, 143784, 147432, 152713, 158414, 163386, 167126, 169946, 172573, 175699, 179919, 185517, 191803, 197225, 200990, 204313, 209209, 216121, 223470, 229364, 232846, 233654, 231989, 228803, 225202, 221079, 215198, 207171, 198629, 191788, 187437, 184850, 183170, 182214, 182095, 182550, 182762, 181857, 179859, 177983, 177436, 177911, 177975, 177010, 176005, 176067, 176897, 177240, 176339, 174509, 172733, 172162, 173583, 176851, 181074, 185664, 190875, 197053, 203803, 210397, 216615, 222660, 228342, 232815, 235122, 234768, 231876, 227105, 221459, 215929, 211010, 206437, 201450, 195729, 190139, 186075, 183706, 181458, 177885, 173542, 170012, 167437, 164338, 160006, 155740, 153066, 151852, 150952, 149770, 148218, 145816, 142091, 137757, 134526, 133570, 134788, 137526, 141258, 145186, 147769, 147446, 144059, 139399, 136012, 135311, 136877, 139389, 141756, 143149, 142801, 140715, 138369, 137695]
54752A37695J468K422K212J827J358K52j074j373l41J039J989K550K618J756M81
54737A54879L24J805L316L063J445M49J001J963J822N39o56q78n49p31j766k843
54721A63183k919j848l61Q42J661K261K551K276J561J096J460K215K190J017K
54706A77187O36K447L375K491J250J466L001M300M505M130M141N131P022Q797
54692B29879Q968P046M129J444j088l988o630p820p437o396n233l975l113l261
54678B02525l882l665k454j524j708k403k790k833k652j949p41K03L55K08N41
54663A77231J386K174K511K450K395K796L605M122M012M202N684P525P458M855
54649B32406J798M62O90R88P34J56r83k987m951n449m693m551n946p330o614l861
$$ y = [137695, 139163, 141585, 143797, 145624, 146982, 147234, 146160, 144787, 144446, 145485, 147474, 150024, 152642, 154398, 154879, 155203, 157008, 160324, 163387, 164832, 165281, 166282, 168245, 170067, 170606, 169950, 169072, 168523, 167792, 166026, 163183, 160264, 158416, 158055, 158897, 160558, 162819, 165370, 167646, 169207, 170303, 171763, 173978, 176168, 177185, 177187, 177823, 180270, 183645, 186136, 187386, 188852, 191853, 196153, 200658, 204788, 208929, 214060, 221082, 229879, 238847, 245893, 250022, 251466, 250378, 246390, 239760, 231940, 224503, 218107, 212874, 208899, 205786, 202525, 198643, 194978, 192524, 191000, 189292, 186889, 184099, 181266, 178614, 176665, 175924, 176127, 176482, 176690, 177231, 178617, 180791, 183302, 185752, 188147, 190943, 194548, 198670, 202682, 206884, 212568, 220093, 227551, 232406, 234204, 234666, 235356, 236344, 237078, 237234, 236251, 233264, 228313, 222864, 218171, 213620, 207674, 200344, 193730, 189869]
54633A89869j149o9l71j112k081l373m204l349r83Q99N07j685l524l468j799J61
54617A64269J271J150J80q78j642k360l171l474k634j038L20J108J677J971J391
54602A58140o6j397j652q23M53J359J045p02k669l027j437N25J447J656K030K222
54586A57104J301l80j299q21n6k47j103j229J05K151L540L532K371P78n57j171
54570A64019j012o18o68j005n81J117K837K648L20k130k598j096N24P39j96r29
54554A61371p39k70m76j118r12O71K456K886J815L59n87r16p58l00o0m44r84q52
54536A61142j02L88K45QJ17L09K34j47q81j818k018n63J745K721J479l03o69J60
54518A62047O36L28J88P49J455J755J775J614R41l36j534j796r47M64J697K161
$$ y = [189869, 188720, 188651, 188280, 187168, 185087, 181714, 177510, 174161, 173178, 174077, 174584, 172899, 169375, 165907, 164108, 164269, 165540, 166690, 166870, 165992, 164350, 161990, 158819, 155345, 152711, 151673, 151993, 153101, 154778, 156749, 158140, 158074, 156677, 155025, 154202, 154655, 156014, 157059, 156357, 153688, 150661, 149224, 149749, 151196, 152852, 154882, 157104, 158405, 158025, 156726, 155905, 155849, 155602, 154499, 153270, 153375, 155526, 159066, 162598, 164969, 165747, 165190, 164019, 163007, 162389, 161721, 160716, 160135, 161252, 164089, 166737, 167057, 164927, 162329, 161233, 161757, 162496, 162300, 161371, 160632, 160362, 159886, 158768, 157856, 158527, 160983, 163869, 165684, 166043, 165456, 164540, 163782, 163482, 163422, 162978, 161994, 161142, 161040, 161428, 161673, 161681, 161798, 162107, 162341, 162194, 161313, 159495, 157477, 156914, 158659, 161380, 162859, 162556, 161887, 162047, 162683, 163011, 163199, 163948, 165403, 167158, 168933, 170547, 171488, 171152, 169618, 167822, 166875, 167339, 169036, 171197]
54502A71197J568K56p35l31J364K796K388L14j668k318k207k451k911k515j009
54487A63738O34J574J894J988J980K032K426L048L311K846J759K11j586k886k809
54472A80160j529l57k53r16j529j645j124lJ135J382N18p42j759k446k563j609
54456A66720J01J292J333J125J520J912J334K41j78J04N6n58p82l5J013J528J529
54439A78255J326O47q82k663l309k148j81R18O50J17M56J446K112K201K259K467
54423A83671K304J439K12q17j171m10J372L035L368K630K075J939J226k49j119
54408A99505n78K65J21m89k81O97J256Q08k22j255j889j796j221j033j430j237
54392A91221M28K416K774J310l55j091j277j523j627j162k21Q06J595J964K001
$$ y = [171197, 172765, 173021, 172286, 171955, 173319, 176115, 178503, 178817, 177149, 174831, 172624, 170173, 167262, 164747, 163738, 164372, 165946, 167840, 169828, 171808, 173840, 176266, 179314, 182625, 185471, 187230, 187441, 185855, 182969, 180160, 178631, 178274, 178021, 177105, 175576, 173931, 172807, 172804, 173939, 175321, 175839, 175097, 173338, 170892, 168329, 166720, 166821, 168113, 169446, 170571, 172091, 174003, 175337, 175578, 175400, 175504, 175560, 175002, 174220, 174185, 175198, 176726, 178255, 179581, 180228, 179346, 176683, 173374, 171226, 171045, 171963, 172613, 172730, 173186, 174632, 176744, 178945, 181204, 183671, 185975, 187414, 187626, 186809, 185638, 185228, 186600, 189635, 193003, 195633, 197708, 199647, 200873, 200624, 199505, 198927, 199192, 199313, 198824, 198543, 199240, 200496, 201304, 201082, 199827, 197938, 196142, 194921, 193888, 192458, 191221, 191649, 194065, 196839, 198149, 197794, 196703, 195426, 193903, 192276, 191114, 190893, 191699, 193294, 195258, 197259]
54377A97259K044K068J469P5j101j048l87n35j407j294N63K564K712J116m78j134
54361B02486j578k478k992j915J93J219J92j296j276j00L46l86q36j60P73J303
54345A93495K121L536M338L706K759K655K506J022q17q74Q85K309K022O30q15
54330B19478j768j561L11K854L972K743L12j638k251j399L78J734J533J96r05
54315B23989j238j137m60J104K578K340N41q82q38m7Q04J850K559J620o00j532
54299B30651L04L177M595M348L696L073K270J657J382M85j457k864k244r07j346
54284B46820l486m885m509l841l871l453j637K72M68q05j855j878j409r76n88
54269B14367l51m73n86LJ114J511M74r46j011M68J715J210l18r31j97K22j007
$$ y = [197259, 199303, 201371, 202840, 202915, 201814, 200766, 200379, 199844, 198437, 197143, 197706, 200270, 202982, 204098, 203620, 202486, 200908, 198430, 195438, 193523, 193716, 194935, 195127, 193831, 192555, 192455, 192801, 192415, 191579, 191419, 192192, 193495, 195616, 199152, 203490, 207196, 209955, 212610, 215116, 216138, 215321, 214447, 215332, 217641, 219663, 220293, 219478, 217710, 216149, 216460, 219314, 223286, 226029, 226341, 224703, 222452, 221053, 221431, 223165, 224698, 224894, 223989, 222751, 221614, 221154, 222258, 224836, 227176, 227717, 226835, 225997, 225950, 226754, 228604, 231163, 232783, 232183, 230651, 230955, 234132, 238727, 243075, 246771, 249844, 252114, 253771, 255153, 255638, 254181, 251317, 249073, 248166, 246820, 243334, 238449, 233940, 230099, 226228, 222775, 221138, 221410, 221878, 221073, 219218, 217340, 215931, 214955, 214367, 214016, 213543, 212957, 212960, 214074, 215585, 216059, 215113, 214102, 214570, 216285, 217495, 217177, 216246, 216049, 216271, 215264]
54252B15264k954l675k654r47N97J938K728K081O8j657j587j96Q28O81o8p07j024
54235B08716p45N19K267K995J861m8q87j95Q89J392J459J452J013k81j933k830
54219B15644k411j067M55J558J891J491J009J263K249K842J913k36j942j927p25
54204B22007Q8j29n74n35m30p22p14M43K087K674J828N88k97r31j069k4J845L043
54186B29178K967K590K469J734L5j190q67k10p55j735j421j28L62j99l62L05N83
54169B33356j46r55j189j492k401l289l342k552j410m85l15p97q22L02J502J407
54153B17372O24P11J273M64j580k485j462o58j517k297j025J157J792Q00J09M21
54137B13699N02n66k131k937k300n09J216J571O85J45Q88J965K126J613J300J187
$$ y = [215264, 212310, 208635, 205981, 205034, 205631, 207569, 210297, 212378, 212446, 210789, 209202, 209006, 209834, 210515, 210447, 209740, 208716, 207971, 208490, 210757, 213752, 215613, 215565, 214678, 214483, 215372, 216764, 218223, 219675, 220688, 220407, 218474, 215644, 213233, 212166, 212621, 214179, 216070, 217561, 218570, 219833, 222082, 224924, 226837, 226601, 224659, 222732, 222007, 222095, 221966, 221392, 220857, 220427, 219705, 218991, 219434, 221521, 224195, 226023, 226611, 226314, 225383, 224314, 224290, 226135, 229178, 232145, 234735, 237204, 238938, 238973, 237783, 236916, 236706, 235951, 234216, 232795, 232667, 233029, 232830, 232468, 232773, 233356, 233210, 232255, 231066, 229574, 227173, 223884, 220542, 217990, 216580, 216095, 215780, 214983, 214161, 214463, 215965, 217372, 217996, 218707, 219980, 220444, 218864, 216379, 214917, 214259, 212742, 210445, 209420, 210577, 212369, 213169, 213278, 213699, 214201, 213635, 211504, 208567, 206267, 205758, 206974, 208545, 209230, 209375, 210263, 212228, 214354, 215967, 217267, 218454]
54121B18454R24Q91J290J104n06k338k385o41R12J003L58J84O59J142R92Mj329
54104B20718k057j724q86j79N19J305J531Q23J29N21J475J619Q24J40r7o05j581
54087B22475k179j846j052m28o4P2j63p05j128j016j53J356K680K575R61m38p0
54070B20877J307J723Q37K10P79J648J671R71L60J84K05K5n62j107n74J261K862
54053B32677K549Q67m1O46J608J698J364J194O29p46j887j468K54J782K109J425
54037B44660N46K98J001J957J896M49j235j825j238k55P42J929L216M025L888
54022B60054K974J934J428J624K173K741L460M452N174M873L621K179Q53o43k136
54007B94761k784k321j673j779k479l051l161k722j509L56J937K282J500N65K35
$$ y = [218454, 219378, 220269, 221559, 222663, 222157, 219819, 217434, 216793, 217705, 218708, 219066, 219250, 219909, 221051, 222043, 222047, 220718, 218661, 216937, 216051, 215872, 216391, 217696, 219227, 220050, 220179, 220700, 222175, 223794, 224618, 224758, 224661, 224056, 222475, 220296, 218450, 217398, 216970, 216906, 216978, 216815, 216110, 214982, 213966, 213813, 215169, 217849, 220424, 221385, 220947, 220877, 222184, 223907, 224744, 224954, 225733, 227381, 229052, 230023, 230383, 230567, 230772, 230797, 230235, 229128, 228554, 229815, 232677, 235226, 236093, 236052, 236698, 238306, 240004, 241368, 242562, 243191, 242445, 240558, 239090, 239344, 241126, 243235, 244660, 245206, 245504, 246505, 248462, 250358, 250807, 249572, 247747, 246509, 246254, 246996, 248925, 252141, 256166, 260054, 263028, 264962, 266390, 268014, 270187, 272928, 276388, 280840, 286014, 290887, 294508, 296687, 297540, 296897, 294761, 291977, 289656, 287983, 286204, 283725, 280674, 277513, 274791, 273282, 273638, 275575, 277857, 279357, 279922, 280157]
53992B80157M82P56N27j40l77O76K633M064M239L989M400N286N648N143M382M139
53976C26004M829O470Q410R413Q745P071N780N499N782N873N222L558J390K27
53962D04273J315L862N401M348J618o21j261q47m50o51j430k364k902k889k933
53947D04469l796n336o493o506n743m988m431l872l592m156n387o317o426o142
53933C31284n813m992l376j698p69j60J065K531K668Q33j737l460m005l895l337
53918C05139k216q23K38P31Q43O70J30o14j140j261j213j173q39J46J514K473
53902C02605K710K826L378L768K948J184J53Q47K312L178L576M495N820O391N811
53887C52002M995M876N694P483J0031J2124J2296J0948J0334J1657J3209J2444
$$ y = [280157, 280639, 281395, 281922, 281782, 281405, 282081, 284714, 288778, 293017, 297006, 301406, 306692, 312340, 317483, 321865, 326004, 330833, 337303, 345713, 355126, 363871, 370942, 376722, 382221, 388003, 393876, 399098, 402656, 404046, 404273, 405588, 409450, 414851, 419199, 420817, 420196, 418935, 418088, 417638, 416987, 415557, 413193, 410291, 407402, 404469, 400673, 395337, 388844, 382338, 376595, 371607, 367176, 363304, 359712, 355556, 350169, 343852, 337426, 331284, 325471, 320479, 317103, 315405, 314636, 314476, 315541, 318072, 320740, 321573, 319836, 316376, 312371, 308476, 305139, 302923, 302100, 302338, 303069, 303912, 304582, 304712, 304098, 302958, 301697, 300484, 299311, 298472, 298618, 300132, 302605, 305315, 308141, 311519, 315287, 318235, 319419, 319572, 320419, 322731, 325909, 329485, 333980, 339800, 346191, 352002, 356997, 361873, 367567, 375050, 385081, 397205, 409501, 420449, 430783, 442440, 455649, 468093]
53875D68093R012M697J075j494k989l234k448j341m26K91R39J593K340L002L024
53860D82134K245J611K381M528O587P219O480N503N376O324P442P220N096K449
53846E52595J328J939K285Q23j485k610k300k179l328n037o318p289q354q971
53832E11099q384p033o147o052o033n770n866o641p522q084q744r701j0083q961
53818D06078o700m427k750j772j869l259n035n797n307m559m176l603k225m68
53804C54131N87K10j462l405m186l200j486p11j239k012k299k545l157l526k993
53789C22707k076j854k551l315l286k412j346p86q21q40k92N33R17P34M58J71
53773C05941m71j247j280l35P53J455K306L580M206L189J389O46J361K191K134
$$ y = [468093, 477105, 481802, 482877, 481383, 478394, 475160, 472712, 471371, 470945, 471236, 472175, 473768, 476108, 479110, 482134, 484379, 485990, 488371, 492899, 499486, 506705, 513185, 518688, 524064, 530388, 537830, 545050, 550146, 552595, 553923, 555862, 558147, 558970, 557485, 554875, 552575, 550396, 547068, 542031, 535713, 528424, 520070, 511099, 502715, 495682, 489535, 483483, 477450, 471680, 465814, 459173, 451651, 443567, 434823, 425122, 415039, 406078, 399378, 394951, 392201, 390429, 388560, 385301, 380266, 374469, 369162, 364603, 360427, 356824, 354599, 354131, 354718, 354928, 353466, 350061, 345875, 342675, 341189, 340478, 339239, 337227, 334928, 332383, 329226, 325700, 322707, 320631, 318777, 316226, 312911, 309625, 307213, 305867, 305081, 304260, 303420, 303128, 303661, 304578, 305312, 305770, 305941, 305470, 304223, 302943, 302608, 303361, 304816, 307122, 310702, 314908, 318097, 319486, 320132, 321493, 323684, 325818]
53758C25818J678J639J844J614Q78K16J56Q44K193L818M945M976M287L986M611
53743C63503N465N650N344N350N612N268M293L872M519N019M186K707J861J385
53729D24034K73q42j69K233M028L677K187J048J83j009k180k916l851n375o259
53714D15062n130k790j542k487m688o720p887q039p307o137m799l123j291m71
53700C52651j536l481m246l158j530p64r30j380j840k321k621k478j993j487j036
53685C21850l36Q31K032K271J019q74j785r40R50K705L606L366K058N28j9P07
53669C37969J879K886L820M326L347R45r98j112m12n17j052n82Q76K159L217M933
53653C61684O907P514O379M963M370M294M421N093O003N977M901M255M774N056
$$ y = [325818, 327496, 329135, 330979, 332593, 333471, 333687, 333843, 334687, 336880, 340698, 345643, 350619, 354906, 358892, 363503, 368968, 374618, 379962, 385312, 390924, 396192, 400485, 404357, 408876, 413895, 418081, 420788, 422649, 424034, 424307, 423465, 423296, 425529, 429557, 433234, 435421, 436469, 436652, 435643, 433463, 430547, 426696, 421321, 415062, 409932, 407142, 405600, 403113, 398425, 391705, 383818, 375779, 368472, 362335, 357536, 354413, 353122, 352651, 351115, 347634, 343388, 340230, 338700, 337936, 337006, 335626, 333786, 331465, 328844, 326366, 324373, 322886, 321850, 321514, 322345, 324377, 326648, 327667, 326793, 325008, 324068, 325018, 327723, 331329, 334695, 336753, 337281, 337262, 337969, 339848, 342734, 346554, 350880, 354227, 355172, 354174, 353062, 352650, 352133, 351081, 350499, 351375, 353534, 356751, 361684, 368591, 376105, 382484, 387447, 391817, 396111, 400532, 405625, 411628, 417605, 422506, 426761, 431535, 436591]
53639D36591L724J680Q06J352K087K378K658L072L127K830L020M084N076M621
53625D77106K452l10k281l015l044k943k689k089j421j164j267j292j226j481
53611D55336k036k214j604o73j28p6j25k6J35K32K98L88L37j91j127j657j050
53594D45819O1J27j146k023j043P96J495J015J166K681M208M435L682K792J979
53579D66044J473J991L529M773M706L983L713L762L472L290M237N975O861O100
53565E23909M746M170M399M608M613N145O584Q098Q413P264N713M906M982N350
53551F02900N623N761N632N098M454M194M432N034O104P591Q535P650M824J353
53537F79185j386k898l215k577j736j649k397k989k562j335k15m3j218l252m653
$$ y = [436591, 440315, 441995, 442801, 444153, 446240, 448618, 451276, 454348, 457475, 460305, 463325, 467409, 472485, 477106, 479558, 479248, 476967, 473952, 470908, 467965, 465276, 463187, 461766, 460602, 459335, 458043, 456817, 455336, 453300, 451086, 449482, 448809, 448681, 448605, 448480, 448454, 448589, 448821, 449119, 449507, 449844, 449653, 448526, 446869, 445819, 445880, 446007, 444861, 442838, 441795, 442591, 444086, 445101, 446267, 448948, 453156, 457591, 461273, 464065, 466044, 467517, 469508, 473037, 477810, 482516, 486499, 490212, 493974, 497446, 500736, 504973, 510948, 517809, 523909, 528655, 532825, 537224, 541832, 546445, 551590, 558174, 566272, 574685, 581949, 587662, 592568, 597550, 602900, 608523, 614284, 619916, 625014, 629468, 633662, 638094, 643128, 649232, 656823, 665358, 673008, 677832, 679185, 677799, 674901, 671686, 669109, 667373, 665724, 663327, 660338, 657776, 656441, 656226, 656183, 654965, 651713, 647060]
53522F47060m143k228p02n02j005j510k118k730k601j622p80n80k40O37J014K72
53506F28222k49P50K043J401q87k111q25J431K599K656K844L628M474M996N187
53491F56159M801L432J539P17K256N478Q112Q686Q058P959Q633R065R158J0036
53477G44089J1797J2762J2009J1161J2240J4825J6998J8362K0228K2986K5134
53466I22591K5344K4141K3099K3200K4335K5661K6260K6071K6218K7786L0433
53455A205139L2857L4331L5081L5527L6162L7735M0183M1775M0880L8499L7379
53444A615548L8330L9303L8667L7452L7280L7738L7388L6167L5062L4211L3033
53433B020179L1819L1490L1753L1155K9187K7086K6008K5563K4723K3367K2123
$$ y = [647060, 642917, 640689, 639987, 639485, 638480, 636970, 634852, 632122, 629521, 627899, 627119, 626539, 626299, 626936, 627950, 628222, 627973, 628723, 630766, 632167, 631280, 629169, 628344, 629775, 632374, 635030, 637874, 641502, 645976, 650972, 656159, 660960, 664392, 665931, 666648, 668904, 674382, 682494, 691180, 699238, 707197, 715830, 724895, 734053, 744089, 755886, 768648, 780657, 791818, 804058, 818883, 835881, 854243, 874471, 897457, 922591, 947935, 972076, 995175, 1018375, 1042710, 1068371, 1094631, 1120702, 1146920, 1174706, 1205139, 1237996, 1272327, 1307408, 1342935, 1379097, 1416832, 1457015, 1498790, 1539670, 1578169, 1615548, 1653878, 1693181, 1731848, 1769300, 1806580, 1844318, 1881706, 1917873, 1952935, 1987146, 2020179, 2051998, 2083488, 2115241, 2146396, 2175583, 2202669, 2228677, 2254240, 2278963, 2302330, 2324453]
53422B324453K1261K0538J9784J8971J7750J5596J2466Q923N510K342p30l947
53410B462917p707j2204j6634j9424j9920j9516k0194k2022k3148k2486k1335
53399B258327k1656k3720k6343k8655l0406l1068l0153k8475k7686k8173k8521
53388A953471k7504k5505k3445k1339j8754j5875j3260j1064r335q376p849o222
53376A764943k462K058M843N454N936P780R999J1130J1731J3458J6471J9428K1748
53363A892517K4303K7601L0866L3466L5935L8687M0909M1927M2749M4762M7507
53352B301229M9514N1064N4062N8776O2819O4530O5534O8288P2361P5276P6388
53341B999841P7637Q0413Q3668Q5814Q6753Q7219Q7318Q6843Q6084Q5356Q4408
$$ y = [2324453, 2345714, 2366252, 2386036, 2405007, 2422757, 2438353, 2450819, 2459742, 2465252, 2467594, 2466864, 2462917, 2455210, 2443006, 2426372, 2406948, 2387028, 2367512, 2347318, 2325296, 2302148, 2279662, 2258327, 2236671, 2212951, 2186608, 2157953, 2127547, 2096479, 2066326, 2037851, 2010165, 1981992, 1953471, 1925967, 1900462, 1877017, 1855678, 1836924, 1821049, 1807789, 1796725, 1787390, 1779014, 1771165, 1764943, 1762481, 1764539, 1769382, 1774836, 1780772, 1788552, 1798551, 1809681, 1821412, 1834870, 1851341, 1870769, 1892517, 1916820, 1944421, 1975287, 2008753, 2044688, 2083375, 2124284, 2166211, 2208960, 2253722, 2301229, 2350743, 2401807, 2455869, 2514645, 2577464, 2641994, 2707528, 2775816, 2848177, 2923453, 2999841, 3077478, 3157891, 3241559, 3327373, 3414126, 3501345, 3588663, 3675506, 3761590, 3846946, 3931354]
53330C931354Q3070Q1802Q0712P8716P4688O9061O3364N8475N4109M9576M4064
53319D668991L6600K7039J7192R689N241J838l049j0207j8818k7845l6681m5105
53307D624885n3351o1701o9590p5632p9089q0744q1782q2391q2273q1870q1983
53296C794479q2391q1991q0341p8000p5307p1997o8491o6326o6356o7245o6829
53285B989205o4578o1770n9454n7311n4641n1507m8373m5170m1381l7035l3121
53274B434864l0789l0018k9262k6837k2832j9313j8158j9026j9942j9771j9129
53263B179787j8798j8220j6421j3806j1921j1278j0433p857m105j200m0N63K022
53250B068293M208O301Q405J1021J3412J4259J4105J5351J9036K3137K5306K6025
$$ y = [3931354, 4014424, 4096226, 4176938, 4255654, 4330342, 4399403, 4462767, 4521242, 4575351, 4624927, 4668991, 4705591, 4732630, 4749822, 4759511, 4764752, 4766590, 4763541, 4753334, 4734516, 4706671, 4669990, 4624885, 4571534, 4509833, 4440243, 4364611, 4285522, 4204778, 4122996, 4040605, 3958332, 3876462, 3794479, 3712088, 3630097, 3549756, 3471756, 3396449, 3324452, 3255961, 3189635, 3123279, 3056034, 2989205, 2924627, 2862857, 2803403, 2746092, 2691451, 2639944, 2591571, 2546401, 2505020, 2467985, 2434864, 2404075, 2374057, 2344795, 2317958, 2295126, 2275813, 2257655, 2238629, 2218687, 2198916, 2179787, 2160989, 2142769, 2126348, 2112542, 2100621, 2089343, 2078910, 2071053, 2066948, 2065748, 2065708, 2066271, 2068293, 2072501, 2078802, 2087207, 2098228, 2111640, 2125899, 2140004, 2155355, 2174391, 2197528, 2222834, 2248859]
53238B248859K7465L0168L2799L4699L6646L8889M0334M0258L9356L8282L6469
53227B644224L3187K8826K4336K0151J6308J2854R466N441O43m212q670j3113
53215B769441j7676k1541k4080k5895k7886l0087l2239l4694l7762m0781m2880
53204B433920m4159m5219m6085m6508m6777m7184m7229m6477m5712m5976m6857
53193A925737m6997m6088m5156m4924m5046m4913m4173m2497l9986l7643l6414
53182A451900l5757l4285l1768k9348k7839k7044k6682k6557k5762k3204j9387
53171A144267j6335j5305j5766j6860j8405j9853j9994j8755j7943j8912k0521
53160I45618k0714j9295j7879j7563j7995j8456j8756j9009j9220j9126j8148
$$ y = [2248859, 2276324, 2306492, 2339291, 2373990, 2410636, 2449525, 2489859, 2530117, 2569473, 2607755, 2644224, 2677411, 2706237, 2730573, 2750724, 2767032, 2779886, 2789352, 2794793, 2795436, 2791224, 2782554, 2769441, 2751765, 2730224, 2706144, 2680249, 2652363, 2622276, 2590037, 2555343, 2517581, 2476800, 2433920, 2389761, 2344542, 2298457, 2251949, 2205172, 2157988, 2110759, 2064282, 2018570, 1972594, 1925737, 1878740, 1832652, 1787496, 1742572, 1697526, 1652613, 1608440, 1565943, 1525957, 1488314, 1451900, 1416143, 1381858, 1350090, 1320742, 1292903, 1265859, 1239177, 1212620, 1186858, 1163654, 1144267, 1127932, 1112627, 1096861, 1080001, 1061596, 1041743, 1021749, 1002994, 985051, 966139, 945618, 924904, 905609, 887730, 870167, 852172, 833716, 814960, 795951, 776731, 757605, 739457]
53149G39457j5961j3340j1790j1761j2140j2080j2306j3640j5134j5113j3414
53138E92778j1292r585q390q067q905r906r636q455q241r427j0025q372n429l316
53124D73732k673k667k748l091l718m285m573m527m065l563l828m849n174l752
53110D20219j915j997m015n304l909r69R42P82n02j662k171k065j687j400j059
53095C93288j06J259J657J12k389l793l222j549j31J42j001k817l535j931J026
53080C77010L220L845L607K815J106q06j289m12l38j975l208k104q4K36r53j235
53064C79435J44J529J721J302Q99K74l86j47J050J994J997J609J179K72q44q68
53048C91160M20J230J82j615k138j216l20l51r16j400j608j510j211j063j198
$$ y = [739457, 723496, 710156, 698366, 686605, 674465, 662385, 650079, 636439, 621305, 606192, 592778, 581486, 571901, 563511, 555444, 546539, 536633, 526997, 518542, 510301, 500874, 490849, 482477, 477048, 473732, 471059, 468392, 465644, 462553, 458835, 454550, 449977, 445450, 441385, 437822, 433994, 429145, 423971, 420219, 418304, 416307, 412292, 406988, 403079, 402110, 403052, 403834, 403332, 401670, 399499, 397434, 395747, 394347, 393288, 393182, 394441, 396098, 396210, 393821, 390028, 386806, 385257, 385126, 385268, 384267, 381450, 377915, 375984, 377010, 380230, 384075, 387682, 390497, 391603, 390797, 389508, 389096, 388758, 386783, 383575, 381471, 381387, 381623, 380670, 379435, 379579, 381108, 382829, 384131, 385030, 385304, 384918, 384771, 385821, 387815, 389812, 391421, 392600, 392872, 392028, 391160, 391580, 392810, 392992, 391377, 389239, 388023, 387703, 387352, 386436, 385036, 383428, 381918, 380707, 379644, 378446]
53033C78446j270j055q29p69n89k72l10o49k60J232K456J956L45n58l37l29j454
53016C75754k956l494k579o80J244K189J745N17n64j292k031k745k973k614j929
53001C57592r08M35J305Q40k54j45J482K533J213j298k262r45P18R94M05L05O47
52984C62657L06r50k022k069j442q08j46Q53J971K625K531J752N55l65j28J182
52968C66502K105J488R7m19J87P65P87Q27R32K39j135j540j32J502J416Mq03k95
52950C72527N73J055J392J693J445N31l06n01m24p36j408j824j572q78l36j42
52934C71089K71J491K992L384K164O03K28R62J410P12o74j798k082j422p2J472
52918C80730K774L594L684K926J890J597K208K676K315J919K452L311L084J622
$$ y = [378446, 377176, 376121, 375292, 374523, 373934, 373662, 373352, 372703, 372443, 373675, 376131, 378087, 378432, 377874, 377537, 377208, 375754, 372798, 369304, 366725, 366045, 367289, 369478, 371223, 371740, 371176, 369884, 367853, 365108, 362135, 359521, 357592, 356684, 357119, 358424, 359264, 359010, 358865, 360347, 362880, 364093, 362795, 360533, 359588, 360306, 361300, 361705, 362010, 362657, 362963, 362013, 359991, 357922, 356480, 355672, 355526, 356379, 358350, 360975, 363506, 365258, 365813, 365448, 365320, 366502, 368607, 370095, 370192, 369773, 369960, 370725, 371512, 372339, 373271, 373510, 372375, 370835, 370703, 372205, 373621, 373625, 372822, 372527, 373100, 374155, 375547, 377240, 378685, 379216, 378910, 378409, 377985, 377249, 375841, 374017, 372445, 371567, 371231, 371089, 371360, 372851, 375843, 379227, 381391, 381994, 382222, 383184, 384594, 385306, 384632, 382834, 380752, 379330, 379258, 380730, 383504, 387098, 390782, 393708, 395598, 397195, 399403, 402079, 404394, 406313, 408765, 412076, 415160, 416782]
52904D16782K14j43L78J172J725J524L20j318k406k467j593p7J253J038j131l559
52888D11712m088k719j404j420k311l311m200m461l283j048N01L68m61n56R4N04
52872C83917J58p07j675k379k465j853o96Q94K626L623L085J404k61j527k803
52857C81341l834l665k408j524j616j417M4J582J411k95j760j843q06O29J798
52842C67637J994J012k82p33j87N18O24J8q68j246n33P82J359N91o41j234j152
52825C67659p39K26J810L051L006K196J802J917J768J291J155J450J582J456J413
52810C91043J099k72k200k836j217J319K644K067N63o13r60o97k36K59Q06J161
52794C91930Q14j83q58m39N02P16j01j217k149k979l558l448k878k737l292l829
$$ y = [416782, 416996, 416853, 417231, 418403, 420128, 421652, 421972, 420654, 418248, 415781, 414188, 414111, 415364, 416402, 415271, 411712, 407624, 404905, 403501, 402081, 399770, 396459, 392259, 387798, 384515, 383467, 383968, 384336, 383875, 383319, 383413, 383917, 384075, 383368, 381693, 379314, 376849, 374996, 374300, 375194, 377820, 381443, 384528, 385932, 385671, 384144, 381341, 377507, 373842, 371434, 369910, 368294, 366877, 366921, 368503, 369914, 369619, 367859, 366016, 365210, 365839, 367637, 369631, 370643, 370361, 369628, 369441, 369959, 370583, 370601, 369733, 368487, 367954, 368736, 370095, 370686, 370045, 368811, 367659, 366920, 367146, 368956, 372007, 375013, 377209, 379011, 380928, 382696, 383987, 385142, 386592, 388174, 389630, 391043, 392142, 391870, 389670, 386834, 385617, 386936, 389580, 391647, 392210, 391597, 390637, 389940, 389704, 389963, 390769, 391930, 392744, 392561, 391703, 391264, 391766, 392482, 392381, 391164, 389015, 386036, 382478, 379030, 376152, 373415, 370123, 366294]
52778C66294l856l761l876l753k921j669n53K64P81Q48O03N97R22Q86P7p37m99
52761C49647P19J814J900R87l48j405j678j224o39m05l79j46L40P59Q17M67l4
52744C51192j98J50L34n66k320l418k754q75Q79J762J649N50j001j720r16L03
52728C43051L14p31j157l40L53l45j719k074q92P24J359M37j446k902k761j290
52712C30581k7J3l92J91J777K755J828m96k470k781j516K34J391J691J612J679
52696C36070J979K278K354J937Q46m51p93M34K191K719J689O26Q41J826K312K181
52680C59039K316K844K864K025J357J849K977L442K985K539K578K259O46j684
52666C88036k962k144r3J314J057k25j237j387j053p96q36j196j867k603k901
$$ y = [366294, 362438, 358677, 354801, 351048, 348127, 346458, 345905, 346169, 346950, 347798, 348401, 348998, 349920, 350806, 350883, 350146, 349647, 350366, 352180, 354080, 355067, 354719, 353314, 351636, 350412, 349773, 349368, 348989, 348843, 349183, 349942, 350759, 351226, 351192, 350994, 351144, 351478, 350912, 348592, 345174, 342420, 341545, 342424, 344186, 345835, 346385, 345384, 343664, 342748, 343051, 343365, 342634, 341477, 341137, 341490, 341145, 339426, 337352, 336460, 337184, 338543, 338980, 337534, 334632, 331871, 330581, 330554, 330567, 330175, 330366, 332143, 334898, 336726, 336230, 333760, 330979, 329463, 329697, 331088, 332779, 334391, 336070, 338049, 340327, 342681, 344618, 345464, 345013, 344220, 344654, 346845, 349564, 351253, 351879, 352720, 354546, 356858, 359039, 361355, 364199, 367063, 369088, 370445, 372294, 375271, 378713, 381698, 384237, 386815, 389074, 389720, 388036, 385074, 382930, 382837, 384151, 385208, 384983, 383746, 382359, 381306, 380510, 379674, 378478, 376611, 374008, 371107]
52651C71107k494j621o26M03J344J803J653J450J703J964J332k20j660k153j837
52636C72148j251o43j04K69N78R93J197O77k09l19O22J372Q75k90j038j478k140
52619C71259k257o29J934K911J310r07j465n71o6p14j548j451l27J105J985J882
52603C72451J234J044J703K442K406J852J733K390L218L478K927J899J184J486
52589D01447K575L322K946J779L99j197k857l603k787j440j051j454j275k84L07
52574C96827J04L34J774L334L676L084K664K563K218J780J964K668K753J492m43
52559D26792j735j842j496j797k788l112j655O03J224p83l500m200k387L6J162
52544D04522P78k19j171k031k849l312k906j490L39J690K140J891J327P45M27
$$ y = [371107, 368613, 366992, 366366, 366769, 368113, 369916, 371569, 373019, 374722, 376686, 378018, 377798, 376138, 373985, 372148, 370897, 370254, 370150, 370419, 370997, 371990, 373187, 373864, 373655, 373336, 373958, 375330, 376205, 375915, 374877, 373399, 371259, 369002, 368373, 370307, 373218, 374528, 373621, 372156, 371585, 371519, 370805, 369257, 367806, 367479, 368584, 370569, 372451, 373685, 374729, 376432, 378874, 381280, 383132, 384865, 387255, 390473, 393951, 396878, 398777, 399961, 401447, 404022, 407344, 410290, 412069, 412468, 411271, 408414, 404811, 402024, 400584, 399533, 398079, 396804, 396520, 396827, 396931, 397265, 399039, 402373, 406049, 409133, 411797, 414360, 416578, 418358, 420322, 422990, 425743, 427235, 426792, 425057, 423215, 421719, 419922, 417134, 414022, 412367, 412970, 414194, 413411, 409911, 405711, 403324, 403360, 404522, 405300, 405081, 403910, 401879, 399030, 395718, 392812, 391322, 391661, 393351, 395491, 397382, 398709, 399454, 399881]
52529C99881L82K11k21j78R69K258J911j96k124k469k010j999k167j646p22k29
52513C91651L4P63J602J692J338J575K314K463J763R84K77r93k469k627j035O51
52497C99983Q42M0k74O1j69j693l753m968m689l435k187j314m25O60J349J241
52481C81269R79J234J423O78k85Q5J540J986M92j263j467o20l43q80j148m64R21
52464C84137K566L925M181L041J532J030J620K132J735P72M0q9K71R75K078L585
52448D13531M954N207M062K667K315K599J977K90p70k44N64J35j012j517j551
52433D33207k282l607m154l522k898l238l966l887k544m63J286J699O91o75j290
52418D04357j150q11k38Q98K186K848L045L518M006L317J278o15r75l4J067J601
$$ y = [399881, 400263, 400474, 400253, 400075, 401044, 403302, 405213, 405017, 402893, 400424, 398414, 396415, 394248, 392602, 391880, 391651, 391685, 392448, 394050, 395742, 397080, 398655, 400969, 403432, 405195, 406179, 406456, 405463, 402994, 400367, 399332, 399983, 400825, 400865, 400591, 400652, 400483, 398790, 395037, 390069, 385380, 381945, 379758, 378444, 378019, 378679, 380028, 381269, 382248, 383482, 384905, 385583, 385298, 385383, 386923, 388909, 389401, 388138, 386671, 386051, 385708, 384828, 383680, 383216, 384137, 386703, 390628, 394809, 397850, 399382, 400412, 402032, 404164, 405899, 406671, 406711, 406622, 406893, 407868, 409946, 413531, 418485, 423692, 427754, 430421, 432736, 435335, 437312, 437602, 436832, 436588, 437152, 437287, 436275, 434758, 433207, 430925, 427318, 423164, 419642, 416744, 413506, 409540, 405653, 403109, 402646, 403932, 405631, 406322, 405647, 404357, 403207, 402396, 402158, 403056, 405242, 408090, 411135, 414653, 418659, 421976, 423254, 422639, 421664, 421630, 422697, 424298]
52402D24298J396O02j46J5J079K045K329K530L138L319J974m25k146k353j930
52387D35725k044k580k541j513k59J62m73j418j879j849j912k358k722k352j261
52372D10726k35j7m48n87J60J222J531R16L21M71J014J240J087Q48M36l01r24
52355D17460q14N3J491L801O938R396R389P425O191P233Q999R131P590O228N909
52340E06420N536L875J026k145n055p295q202p329n234l306k521k504j971l20
52326D70975J488J888P26l46J91J812K623J773M11J41J264K964M585O020P086
52311E03601P332O754O081N958O130N893N229M908N335N844N512M341L139K375
52297E78432J740J073J020K252M242N517N279M287L779L931M005L818M248N909
$$ y = [424298, 425694, 426296, 426150, 426165, 427244, 429289, 431618, 434148, 437286, 440605, 442579, 442154, 440008, 437655, 435725, 433681, 431101, 428560, 427047, 426788, 426950, 426477, 425059, 423180, 421331, 419419, 417061, 414339, 411987, 410726, 410491, 410474, 410026, 409439, 409599, 410821, 412352, 413268, 413589, 414060, 415074, 416314, 417401, 418249, 418685, 418384, 417460, 416646, 416699, 418190, 421991, 428929, 438325, 447714, 455139, 461330, 468563, 477562, 486693, 494283, 500511, 506420, 511956, 515831, 516857, 514712, 509657, 502362, 494160, 486831, 481597, 478291, 475770, 473266, 471295, 470975, 472463, 474351, 475077, 474731, 474922, 476734, 479357, 481130, 481541, 481682, 482946, 485910, 490495, 496515, 503601, 510933, 517687, 523768, 529726, 535856, 541749, 546978, 551886, 557221, 563065, 568577, 572918, 576057, 578432, 580172, 581245, 582265, 584517, 588759, 594276, 599555, 603842, 607621, 611552, 615557, 619375, 623623, 629532]
52283F29532Q022R280R558R972J1172J2432J2806J2613J3117J4885J7180J9058
52271G79627K0565K2376K4471K5915K6214K6299K7493K9673L1440L2174L2827
$$ y = [629532, 637554, 646834, 656392, 666364, 677536, 689968, 702774, 715387, 728504, 743389, 760569, 779627, 800192, 822568, 847039, 872954, 899168, 925467, 952960, 982633, 1014073, 1046247, 1079074]
$$ [...]
##END NTUPLES=NMR SPECTRUM
##END=
