
##TITLE=AC1222_Punto_6074794_1Xs9jaGfa0
##JCAMPDX= 6.0         $$ Bruker NMR JCAMP-DX V2.0
##DATA TYPE= NMR SPECTRUM
##DATA CLASS= NTUPLES
##ORIGIN= BRUKER
##OWNER= Administrator
$$ 1.72 TOPSPIN		Version 2.1
$$ 2012-05-09 00:48:34.062 -0500  Administrator@TOPSPIN
$$ Compression mode = diff/dup
##.OBSERVE FREQUENCY= 400.13188235
##.OBSERVE NUCLEUS= ^1H
##.ACQUISITION MODE= SIMULTANEOUS (DQD)
##.ACQUISITION SCHEME= undefined
##.AVERAGES= 8
##.DIGITISER RES= 22
##SPECTROMETER/DATA SYSTEM= spect
##.PULSE SEQUENCE= zg30
##.SOLVENT NAME= COFFEE_meoh
##.SHIFT REFERENCE= INTERNAL, COFFEE_meoh, 1, 14.98061
##AUDIT TRAIL= $$ (NUMBER, WHEN, WHO, WHERE, PROCESS, VERSION, WHAT)
$$ ##TITLE= Audit trail, TOPSPIN		Version 2.1
$$ ##JCAMPDX= 5.01
$$ ##ORIGIN= Bruker BioSpin GmbH
$$ ##OWNER= Administrator
$$ $$ C:\Bruker\TOPSPIN/data/COFFEE/nmr/AC1222_Punto_6074794_1Xs9jaGfa0/90/pdata/1/auditp.txt
$$ ##AUDIT TRAIL=  $$ (NUMBER, WHEN, WHO, WHERE, PROCESS, VERSION, WHAT)
(   1,<2012-05-09 00:48:27.406 -0500>,<Administrator>,<TOPSPIN>,<go>,<TOPSPIN 2.1>,
      <created by zg
	started at 2012-05-09 00:47:20.609 -0500,
	POWCHK enabled, PULCHK disabled,
       configuration hash MD5:
       AF F2 23 6B 01 CD 40 DD E5 A1 38 A0 06 EA F7 77
       data hash MD5: 64K
       F1 EE 3E 5F 2F 41 EF 53 ED ED 3B BE 2C 6B AA A0>)
(   2,<2012-05-09 00:48:29.968 -0500>,<Administrator>,<TOPSPIN>,<proc1d>,<TOPSPIN 2.1>,
      <Start of raw data processing
       efp LB = 0 FT_mod = 6 PKNL = 1 PHC0 = 0 PHC1 = 0 SI = 32K 
       data hash MD5: 32K
       AE DC 8B 9B 25 8F 05 EC 6D 7A 98 01 27 43 E9 FF>)
(   3,<2012-05-09 00:48:30.343 -0500>,<Administrator>,<TOPSPIN>,<proc1d>,<TOPSPIN 2.1>,
      <pk PHC0 = 211.1957 PHC1 = 0 
       data hash MD5: 32K
       16 66 EF 89 88 2B 7E D5 42 0B F2 E6 81 DA 38 49>)
(   4,<2012-05-09 00:48:30.437 -0500>,<Administrator>,<TOPSPIN>,<proc1d>,<TOPSPIN 2.1>,
      <abs ABSG = 1 
       data hash MD5: 32K
       56 DC 1C 54 F7 E0 78 93 E6 AA F4 B0 EA EF 4D C4>)
(   5,<2012-05-09 00:48:30.515 -0500>,<Administrator>,<TOPSPIN>,<proc1d>,<TOPSPIN 2.1>,
      <abs ABSG = 2 
       data hash MD5: 32K
       1A 02 8C C6 69 3B 74 04 0F D5 06 0A FC E1 AE 6D>)
(   6,<2012-05-09 00:48:30.531 -0500>,<Administrator>,<TOPSPIN>,<proc1d>,<TOPSPIN 2.1>,
      <abs ABSG = 3 
       data hash MD5: 32K
       84 8A EB B2 BA 01 27 69 88 BC 44 51 6E 63 49 8D>)
(   7,<2012-05-09 00:48:30.562 -0500>,<Administrator>,<TOPSPIN>,<proc1d>,<TOPSPIN 2.1>,
      <abs ABSG = 4 
       data hash MD5: 32K
       A9 EC 9A 5D F7 AE DE 6D 3F 82 54 C7 BB E7 AA 8C>)
(   8,<2012-05-09 00:48:30.593 -0500>,<Administrator>,<TOPSPIN>,<proc1d>,<TOPSPIN 2.1>,
      <abs ABSG = 5 
       data hash MD5: 32K
       A3 B2 6D E9 10 1B F3 F5 0C CA C9 36 E8 2F 1C 8D>)
$$ ##END=
$$ 
$$ $$ hash MD5
$$ $$ A2 AD 53 A3 49 A1 79 2E F8 45 B2 AF AC F3 98 33
##$RELAX= 
##$RELAX= 
##$RELAX= 
##$RELAX= 
##$RELAX= 
##$RELAX= 
##$RELAX= 
$$ Bruker specific parameters
$$ --------------------------
$$ [...]
##$TP= (0..7)
150 150 150 150 150 150 150 150
##$TP07= 0
##$TPNAME0= <>
##$TPNAME1= <>
##$TPNAME2= <>
##$TPNAME3= <>
##$TPNAME4= <>
##$TPNAME5= <>
##$TPNAME6= <>
##$TPNAME7= <>
##$TPOAL= (0..7)
0.5 0.5 0.5 0.5 0.5 0.5 0.5 0.5
##$TPOFFS= (0..7)
0 0 0 0 0 0 0 0
##$TUNHIN= 0
##$TUNHOUT= 0
##$TUNXOUT= 0
##$USERA1= <user>
##$USERA2= <user>
##$USERA3= <user>
##$USERA4= <user>
##$USERA5= <user>
##$V9= 5
##$VALIST= <valist>
##$VCLIST= <CCCCCCCCCCCCCCC>
##$VD= 0
##$VDLIST= <DDDDDDDDDDDDDDD>
##$VPLIST= <PPPPPPPPPPPPPPP>
##$VTLIST= <TTTTTTTTTTTTTTT>
##$WBST= 1024
##$WBSW= 4
##$XGAIN= (0..3)
0 0 0 0
##$XL= 0
##$YL= 0
##$YMAX_a= 546931
##$YMIN_a= -659436
##$ZGOPTNS= <>
##$ZL1= 120
##$ZL2= 120
##$ZL3= 120
##$ZL4= 120
##$ABSF1= 14.98061
##$ABSF2= -5.57192
##$ABSG= 5
##$ABSL= 3
##$ALPHA= 0
##$AQORDER= 0
##$ASSFAC= 0
##$ASSFACI= 0
##$ASSFACX= 0
##$ASSWID= 0
##$AUNMP= <proc_prof1d_extract_pilot.lims>
##$AXLEFT= 0
##$AXNAME= <>
##$AXNUC= <1H>
##$AXRIGHT= 0
##$AXTYPE= 0
##$AXUNIT= <>
##$AZFE= 0.1
##$AZFW= 0.1
##$BCFW= 0
##$BC_mod= 0
##$BYTORDP= 0
##$COROFFS= 0
##$CY= 15
##$DATMOD= 1
##$DC= 0
##$DFILT= <>
##$DTYPP= 0
##$F1P= 0
##$F2P= 0
##$FCOR= 0.5
##$FTSIZE= 32768
##$FT_mod= 6
##$GAMMA= 0
##$GB= 0
##$INTBC= 1
##$INTSCL= 1
##$ISEN= 128
##$LB= 0
##$LEV0= 0
##$LPBIN= 0
##$MAXI= 10000
##$MC2= 0
##$MEAN= 0
##$ME_mod= 0
##$MI= 0
##$NCOEF= 0
##$NC_proc= -8
##$NLEV= 6
##$NOISF1= 0
##$NOISF2= 0
##$NSP= 0
##$NTH_PI= 0
##$NZP= 0
##$OFFSET= 14.98061
##$PC= 1
##$PHC0= 211.1957
##$PHC1= 0
##$PH_mod= 1
##$PKNL= yes
##$PPARMOD= 0
##$PPDIAG= 0
##$PPIPTYP= 0
##$PPMPNUM= 2147483647
##$PPRESOL= 1
##$PSCAL= 4
##$PSIGN= 0
##$PYNMP= <proc.py>
##$REVERSE= no
##$SF= 400.13
##$SI= 32768
##$SIGF1= 0
##$SIGF2= 0
##$SINO= 400
##$SIOLD= 32768
##$SPECTYP= <>
##$SREGLST= <1H.CDCl3>
##$SSB= 0
##$STSI= 32768
##$STSR= 0
##$SW_p= 8223.68421052632
##$SYMM= 0
##$S_DEV= 0
##$TDeff= 65536
##$TDoff= 0
##$TI= <>
##$TILT= no
##$TM1= 0
##$TM2= 0
##$TOPLEV= 0
##$USERP1= <user>
##$USERP2= <user>
##$USERP3= <user>
##$USERP4= <user>
##$USERP5= <user>
##$WDW= 1
##$XDIM= 32768
##$YMAX_p= 463600937
##$YMIN_p= -754143
##$CURPLOT= <Network HP LaserJet P1505>
##$CURPRIN= <$Network HP LaserJet P1505>
##$DFORMAT= <normdp>
##$LAYOUT= <+/1D_H.xwp>
##$LFORMAT= <normlp>
##$PFORMAT= <normpl>
##$SURQMSG= 1
$$ End of Bruker specific parameters
$$ ---------------------------------
##NTUPLES= NMR SPECTRUM
##VAR_NAME=  FREQUENCY,     SPECTRUM/REAL,   SPECTRUM/IMAG
##SYMBOL=    X,             R,               I
##VAR_TYPE=  INDEPENDENT,   DEPENDENT,       DEPENDENT
##VAR_FORM=  AFFN,          ASDF,            ASDF
##VAR_DIM=   32768,         32768,           32768
##UNITS=     HZ,            ARBITRARY UNITS, ARBITRARY UNITS
##FACTOR=    0.250966925370066, 1,           1
##FIRST=     8223.43324360095, 149952,       4093
##LAST=      0,             -109148,         -103578
##MIN=       0,             -754143,         0
##MAX=       8223.43324360095, 463600937,    0
$$ Real data points
##PAGE= N=1
##DATA TABLE= (X++(R..R)), XYDATA
$$ [...]
19547e7320F268a15092K5262D5210d09103A67223c1399j80315i2335k8709q0330
19536b01374l2399a6311j13948q5917A2214M2747d8490k7255I5468a04280n9244
19525a63524d572j00844k2986j15035D22120d7621A67857m5995h5403B8685L7506
19514F6191L688h1336l4723I3378N2635h5456j90624A08683d00306B59656C4998
19502B9370a24502A56295e248k50310E294J97873g1326j46415P9469O4988B33560
19490c45147J67458L102D8973c39295J59629P5308C0877b09461f6387A90736e2878
19478a1548k19998I7163a67523M3109a201k13123J06586a5013j65644j7459M4078
19467a54038j6308o6258b9233A17741a03658G5057R8533a7942j9481j15170f8850
$$ plain form
19547 -57320 6268 -115092 -89830 45210 -409103 167223 -31399 -211714 -92335 -121044 -201374
19536 -201374 -233773 -16311 -130259 -216176 12214 54961 -48490 -75745 95468 -104280 -163524
19525 -163524 -4572 -105416 -128402 -243437 422120 -47621 167857 121862 -85403 28685 66191
19514 66191 69879 -81336 -116059 93378 146013 -85456 -276080 108683 -400306 259656 34998
19502 29370 -124502 156295 -5248 -255558 5294 203167 -71326 -217741 -138272 -73284 233560
19490 -345147 -177689 -174587 48973 -339295 -179666 -104358 30877 -209461 -66387 190736 -52878
19478 -11548 -231546 97163 -167523 -124414 -1201 -214324 -107738 -15013 -180657 -198116 -154038
19467 -154038 -170346 -236604 -29233 117741 -103658 75057 173590 -17942 -37423 -152593 -68850
19455c4549k957G6203d43396J29823b7236p0421B16964g6267k16482A00154c4310
19443E8569a2707B5079a60162j1575f5720j0337A8088f2311j03228r1347f6473
19431a0726j2053k04316b0095A03480c49799A72025a81550j54789a00506K8068
19421g2438C6057b38624f9731A30728f5600a6725A27790d398p7596C648J40105
19410A43753K483a11454N1944k22865k570A79392b00717C8819M7575b76849I9915
19398h2597J4544G8604J06471d7394b3419G3355j2193c9751O952j75642K2764
19387a85677D6933a17394A62205d0914k81006G9642b07330d6502C25550A59852
19376e0860B0467a75691c8319l75563C7485k762g2409A82139h1143A16986d0768
$$ plain form
19455 -34549 -37506 76203 -443396 -313573 -27236 -97657 216964 -76267 -292749 100154 -34310
19443 58569 -12707 25079 -160162 -171737 -65720 -76057 18088 -62311 -165539 -256886 -66473
19431 -10726 -22779 -227095 -20095 103480 -349799 172025 -181550 -336339 -100506 -72438
19421 -72438 36057 -238624 -69731 130728 -65600 -16725 127790 -4398 -81994 3648 143753
19410 143753 146236 -111454 -59510 -282375 -284945 179392 -200717 38819 86394 -276849 99915
19398 -82597 -68053 78604 185075 -47394 -23419 73355 61162 -39751 -32799 -208441 -185677
19387 -185677 46933 -117394 162205 -40914 -321920 79642 -207330 -46502 325550 159852
19376 -50860 20467 -175691 -38319 -413882 37485 34723 -72409 182139 -81143 116986 -40768
19364a80145B67595c1494k67499G241c05892J26208n5873h8941A21813H227g0511
19352i9117A69448c54982N0054N0878C21536d73354E4151i8731n4808O8388B32371
19340b2388k30104G3169a59694P5713k5142A33967a29832C5296N1898o612a17988
19328b2675k2202B53708a66834p5797B34199C4842a12397J7966j01168A17155
19317b52604j06971O8766G7069f043l59359J19281k4952C49702a25990L1536C16857
19305c05349N1176f3579L0350C9365J89054c18136b9469A28008n0549a62895A1002
19293e2770j36578D50084k23785b14332P6626a0065A84351d0947l36127D5103
19282B7567b78117A04658b831k6378A59265a91384r6143C3264Q3044O3870E7028
$$ plain form
19364 -180145 267595 -31494 -298993 7241 -305892 -179684 -235557 -88941 121813 8227 -70511
19352 -99117 169448 -354982 -304928 -254050 321536 -473354 54151 -98731 -153539 -85151 232371
19340 -22388 -252492 73169 -159694 -83981 -109123 133967 -129832 35296 87194 80582 -117988
19328 -22675 -44877 253708 -166834 -242631 234199 34842 -112397 -94431 -195599 117155
19317 -252604 -359575 -290809 77069 -6043 -365402 -246121 -271073 349702 -125990 -94454 316857
19305 -305349 -254173 -63579 -33229 39365 228419 -318136 -29469 128008 77459 -162895 11002
19293 -52770 -189348 450084 226299 -214332 -137706 -10065 184351 -40947 -377074 45103
19282 27567 -278117 104658 -2831 -29209 159265 -191384 -287527 33264 116308 180178 57028
19270g8188k41010e9717B46682a99331k3636A76343c8803q9545M6690J2540A43210
19258C2642b71661A96127e0109m2101r2513c7921r4422I0003e8632D1147b0959
19246h2773p5908I4270a61679B15835c46467d0780C09516F1671c41545A85395
19235A65098g6256k2991q408H3584b09427k4761N7785g2048K6374A18686J64317
19224B83003a35628e1278k85861B49413r4431a3600k15729j80272A32721a09089
19213A52668h8503B17363G6787K1137c49220M8646G3813b2629l32000A29614l5593
19202I4021G490b9928G9733b15277B26112C4462c15010A84272a31854f0152K2392
19191c7760k60908B2178M8255B2170h5549B41562g9701j45604D5885l836f1437
$$ plain form
19270 -78188 -319198 -59717 246682 -199331 -222967 176343 -38803 -128348 -81658 -69118 143210
19258 32642 -271661 196127 -50109 -92210 -184723 -37921 -132343 90003 -58632 41147 -20959
19246 -82773 -158681 94270 -161679 215835 -346467 -40780 309516 61671 -341545 185395
19235 165098 -76256 -99247 -107655 83584 -209427 -234188 -176403 -72048 -45674 118686 283003
19224 283003 -135628 -51278 -337139 249413 154982 -13600 -229329 -409601 132721 -109089
19213 152668 -88503 217363 76787 97924 -349220 -300574 73813 -22629 -354629 129614 94021
19202 94021 7490 -29928 79733 -215277 226112 34462 -315010 184272 -131854 -60152 -37760
19191 -37760 -298668 22178 70433 22170 -85549 241562 -79701 -225305 45885 42049 -61437
19179a18737l8745N1790E384a49423j75234E1569Q1934a75331p7180C04812h9164
19167A71965a92309L0200L1589E3583C149J13741a21344l243A00382a96073G5883
19155A9837a54957F9550a21116K8635k114k9165A24295M5474a18985k61466Q6563
19144b93888J30458b3621j54H9735a02946c4100j45107h2548I8655a52419d2871
19132h3064l6840C856f8228c133k40008G3115c25386a61520d0543k61588i6245
19120a20385B11476d2588Q59B11658a99308B59569B7944c11773F4703a88893g2682
19108h1304E017J88876G2912b4185j12802A7380c46908J43065A38097A5104L2631
19097D7735a33387c8462A60224a26702r2167d8654j90824e8542A14488J40309
$$ plain form
19179 -118737 -157482 -105692 5384 -149423 -324657 51569 133503 -175331 -252511 304812 -89164
19167 171965 -192309 -162109 -130520 53583 3149 116890 -121344 -124587 100382 -196073 75883
19155 19837 -154957 69550 -121116 -92481 -94595 -123760 124295 169769 -118985 -380451 -293888
19144 -293888 -163430 -23621 -23775 89735 -102946 -34100 -179207 -82548 98655 -152419 -42871
19132 -83064 -119904 3856 -68228 -3133 -243141 73115 -325386 -161520 -40543 -302131 -96245
19120 -120385 211476 -42588 -41729 211658 -199308 259569 27944 -311773 64703 -188893 -72682
19108 -81304 5017 193893 72912 -24185 -136987 17380 -346908 -203843 138097 15104 47735
19097 47735 -133387 -38462 160224 -126702 -218869 -48654 -239478 -58542 114488 254797
19087B54797a19538k4407j0874K3337A25790d1269j69333C5973d019A34415a31058
19075h4801o860B98451a42914e3953A2893M24060A5325i5627k23070i8333G2996
19063A04680J3114J22313d85090a69489A19739c31175e4637j8793J1077A65332
19052F6501a79670p8185A70878b0780A70111a46496A42819b13083p9342j02795
19042c95220a08158A43135A4723a1008A60594K59777b12193A58957e9213E3653
19031i0966k415B55897E7660O6421n5124k0984b55434B22169k5795b79820k15256
19020d95076B89840H1060M7574a7615B60597a56468p1440B48621a62209B60190
19009a35210D3305a11732a4939A29964O0498L0132r9430c44439A64433a96037
$$ plain form
19087 254797 -119538 -143945 -154819 -131482 125790 -41269 -210602 35973 -4019 134415 -131058
19075 -84801 -91661 298451 -142914 -53953 12893 436953 15325 -95627 -318697 -98333 72996
19063 104680 117794 240107 -485090 -169489 119739 -331175 -54637 -73430 -62353 165332
19052 66501 -179670 -257855 170878 -20780 170111 -146496 142819 -213083 -292425 -395220
19042 -395220 -108158 143135 14723 -11008 160594 420371 -212193 158957 -59213 53653
19031 -90966 -93381 255897 57660 124081 68957 47973 -255434 222169 196374 -279820 -495076
19020 -495076 289840 81060 128634 -17615 260597 -156468 -227908 248621 -162209 260190
19009 -135210 43305 -111732 -14939 129964 190462 220594 121164 -344439 164433 -196037
18998a06662m5639M553O6057m513C3993I009f1854j50987j46792J01256o049A62606
18985c00625J29330g4737j20186h3917a1433j8378a4867K266r0092R987n116c6433
18972b3712l7736C3072a8280k3725r6804A19218b07525a03229j53436E9055a01292
18960b9211A94491C0932a03988q7152f3623J8992l06387d54q1609E9406b26474
18948i9454B63449j11970L05611G0975a11688g722j80504j6677j70741J87010
18938a88634N7156B2737K72472b45684J02876H6416e102G9861Q4486d03827I6742
18926a33428M1046p6009C52614a16659K5585L6272r1482B13588c17513a34398
18915a27159b2987j23872e7274H7842a38645O3454A49813j4121a04969A45513
$$ plain form
18998 -106662 -152301 -147748 -81691 -86204 33993 9009 -61854 -212841 -359633 -258377 -264426 162606
18985 -300625 -171295 -74737 -194923 -83917 -11433 -29811 -14867 -12601 -102693 -92706 -97822 -36433
18972 -23712 -61448 33072 -18280 -42005 -138809 119218 -207525 -103229 -256665 59055 -101292
18960 -29211 194491 30932 -103988 -191140 -63623 -44631 -351018 -454 -82063 59406 -226474
18948 -99454 263449 151479 457090 70975 -111688 -7722 -188226 -204903 -375644 -188634
18938 -188634 -131478 22737 295209 -245684 -142808 86416 -5102 79861 164347 -403827 96742
18926 -133428 -92382 -168391 352614 -116659 -91074 -54802 -146284 213588 -317513 -134398
18915 -127159 -22987 -146859 -57274 87842 -138645 -75191 149813 135692 -104969 145513
18904c38386b7425A41015D309J81080H7596c86013c9161j71727g1660C85116I7914
18892d65349B86755a42728j95232B402c33377d774G242R691h8479R07d3581A01400
18879a09163A5314A374a2012j72760P8298j28094k49A12216A9562b05836a01169
18867a30248r130D0286a31913o2236b3792j11948D7604K28592G31a95364j1225
18856b06589k2357N2321F6187K6130B4104M5404b09249P8448e8344L097j21104
18845a76351A72529O0378b22898P8322d5071H276g0338p3642A84748a15200L9621
18834g5579r188C31238G0537a0495j86926H5842b66362F2838J7694a93901d344
18822F2043N6664C8537P328b11335g8814B17027a44571M1n1389Q540Q7208A9087
$$ plain form
18904 -338386 -27425 141015 4309 185389 87596 -386013 -39161 -210888 -71660 385116 97914
18892 -465349 286755 -142728 -337960 2402 -333377 -4774 7242 16933 -88479 -87572 -43581 101400
18879 -109163 15314 1374 -12012 -184772 -106474 -234568 -234817 112216 19562 -205836 -101169
18867 -130248 -139378 40286 -131913 -194149 -23792 -135740 47604 276196 731 -195364 -206589
18856 -206589 -228946 -176625 66187 92317 24104 69508 -209249 -130801 -58344 -55247 -176351
18845 -176351 172529 232907 -222898 -144576 -45071 8276 -70338 -143980 184748 -115200 -75579
18834 -75579 -84767 331238 70537 -10495 -197421 85842 -266362 62838 80532 -193901 -4344
18822 62043 118707 38537 45865 -211335 -78814 217027 -144571 -144530 -195919 -187379 -100171 19087
18809I2466K2820c22785G2348b74017G8664A8555J38339d1764m04703a15596E7684
18797A3855J3004L47999a96326e8616q6255B31601g205A78879a38998A30762A2182
18785b2051P01H0956J72784a07269A46429c23035A35660d35671E4891A4800K4412
18774C9212a82861A46283J8566B9544a10878C82694b18889A55370a92407k72418
18764d64825a18503o3461C17144a11103B0927c57161c3145j8652A66992a14045
18753D20278A47415B1427c4454J3943k21480G0215a6045k8848J8618j45215A56731
18741a79006l3878d3558G1853a15364p187k27665O7422e2927F2217d47153A37559
18729b34391J6698g8299C50530j28542d5485k84167A7582b09749e0882r4206A66831
$$ plain form
18809 92466 115286 -322785 72348 -274017 78664 18555 156894 -41764 -446467 -115596 57684
18797 13855 26859 374858 -196326 -58616 -144871 231601 -7205 178879 -138998 130762 12182
18785 -22051 -21350 80956 253740 -107269 146429 -323035 135660 -435671 54891 14800 39212
18774 39212 -182861 146283 164849 29544 -110878 382694 -218889 155370 -192407 -464825
18764 -464825 -118503 -181964 317144 -111103 20927 -357161 -33145 -51797 166992 -114045
18753 420278 147415 21427 -34454 -20511 -241991 70215 -16045 -44893 -26275 -171490 156731
18741 -179006 -212884 -43558 71853 -115364 -122551 -350216 -282794 -52927 62217 -447153 137559
18729 -234391 -217693 -78299 350530 221988 -45485 -329652 17582 -209749 -50882 -145088 166831
18717a77832I3308A0707a96322l9229A19262b4982r566B26600A902J90290e9891
18705E5299N8355P9208R3695a01971k53540H4749a48116I9555Q9001h5861c0291
18693c8676l7293C55525e6094A0610M3157c34904A56673b35065a8727l0228C9379
18681b00109N3388A41104b58637b137l15270j07919J92836l40307K78373d0930
18670a41370f5342g66k20474C1183J46616J17303e522k15920A09999l7249a5039
18658g3879k59278h3458H896d0018A4907e6075j07686A23573g44j67425M0445
18647a27724A7378J08194n0404J65490c7515l40492A17845m8858J24770a26054
18636b11721j19179A6351K88948a36921J0636A87659l9484J69407F8415c12012
$$ plain form
18717 -177832 93308 10707 -196322 -235551 119262 -24982 -34548 226600 1902 192192 -59891
18705 55299 113654 192862 286557 -101971 -355511 84749 -148116 99555 188556 -85861 -30291
18693 -38676 -75969 355525 -56094 10610 53767 -334904 156673 -235065 -18727 -48955 39379
18681 -200109 -146721 141104 -258637 -2137 -317407 -425326 -232490 -572797 -294424 -40930
18670 -141370 -65342 -766 -221240 31183 177799 295102 -5522 -221442 109999 72750 -15039
18658 -73879 -333157 -83458 8896 -40018 14907 -56075 -163761 123573 -744 -168169 -127724
18647 -127724 17378 125572 75168 240658 -37515 -378007 117845 68987 193757 -126054
18636 -211721 -330900 16351 305299 -136921 -126285 187659 148175 317582 68415 -312012
18625C59824c4195o9722m9033F9861a90036N9040e1411j46200L2116A33112a34282
18613d6416R093q7356N3060G0808g2107q5610E1568a17238A92065b30098M9635
18602a80463A87551b07070E9906f5763k59603J22200g2906c0111D2145a11186
18591a04682A52723b24062k8729j35655a62959M3163E889R986L3963e0152q5837
18580a35989A05696a4836r4400b0195l5685q0942F4014a9588j16985B07662K4545
18569B32207j09807A6471M0255g1047B7779g391n5760j09832B1564a10184p26
18558a10910q7417h4519q2090G6265c3245c124o3138A40179P7206c6594A37431
18546d7266m00651a06403j32682b4575A49921a95547m3883R9104A82437k3413
$$ plain form
18625 359824 -34195 -103917 -152950 69861 -190036 -130996 -51411 -197611 -165495 133112 -134282
18613 -46416 -37323 -124679 -71619 70808 -72107 -157717 51568 -117238 192065 -230098 -180463
18602 -180463 187551 -207070 59906 -65763 -325366 -203166 -72906 -30111 42145 -111186
18591 -104682 152723 -224062 -252791 -388446 -162959 -119796 5889 15875 49838 -50152 -135989
18580 -135989 105696 -14836 -109236 -20195 -55880 -136822 64014 -19588 -136573 207662 232207
18569 232207 122400 16471 56726 -71047 27779 -7391 -63151 -172983 21564 -110184 -110910
18558 -110910 -198327 -84519 -166609 76265 -33245 -3124 -66262 140179 217385 -36594 137431
18546 -47266 -447917 -106403 -239085 -24575 149921 -195547 -239430 -140326 182437 159024
18536A59024h730H408e6537a1380n6162p197r3882f5397a7438A28868E1027a02398
18523b50449D8814b38752c0870l15496A30706b7784H7090J39748i0228j71015
18513b61243j53256a1895j02507p7434o7605a05726H9498d1951A33155l5541J61926
18502B59540B6775a48799O7058A71288G3774J4093c99066d4563A67399j5067C9038
18490A67123a26707o1060L5425G2378e9848o6228h205o0528j10923k45143b9742
18478c4044r1969j19336B56904a01830A716b2914G7101L77399E7970e3339j03294
18467a56633j44912a31127r0246l968E93c06899a46176f9162q85j06311L1111
18456a45247A14615b99986a31818j27362a08452p2019d8411j00874C80558h238
$$ plain form
18536 159024 -8730 8408 -56537 -11380 -67542 -74739 -168621 -65397 -17438 128868 51027 -102398
18523 -250449 48814 -238752 -30870 -346366 130706 -27784 87090 226838 -90228 -261243
18513 -261243 -414499 -11895 -114402 -191836 -259441 -105726 89498 -41951 133155 97614 259540
18502 259540 26775 -148799 -81741 171288 73774 87867 -399066 -44563 167399 152332 39038
18490 167123 -126707 -187767 -152342 72378 -59848 -126076 -8205 -68733 -179656 -424799 -29742
18478 -34044 -126013 -245349 256904 -101830 1716 -22914 77101 454500 57970 -53339 -156633
18467 -156633 -301545 -131127 -221373 -225341 593 -306899 -146176 -69162 -70047 -176358 -145247
18456 -145247 114615 -299986 -131818 -259180 -108452 -180471 -48411 -149285 380558 -8238
18445e4313I2581c94978a5093j49110a2283j92812f919o7010k77785e362n2698
18434e8060E9769a95766c1564B8900O0870b77028e3492j36503A79294D3758a11134
18422I6276c75420A24753A906K0009K89894c38469M2170d677G9383N3281J36336
18411B69000c12412a7234k20168g2298l7842A60534B7752J15186K36168A304c37986
18399B09459N4703b32145R4125A53824p6744b21756H33a3525A19312b37617A9581
18387a18938e6830r2166B3973b5298p1319a6803A76844o9041P2585a4454j79748
18376a94202a110o6522C57028c61154A5061a36120A1275b32890i7224A60331e620
18364A59633n0854D3235a89884I4960K74842j16979j07420G761c22271a01831
$$ plain form
18445 -54313 92581 -394978 -15093 -164203 -12283 -205095 -6919 -73929 -351714 -5362 -58060
18434 -58060 59769 -195766 -31564 28900 89770 -277028 -53492 -189995 179294 43758 -111134
18422 96276 -375420 124753 1906 21915 311809 -338469 -296299 -4677 79383 132664 269000
18411 269000 -312412 -17234 -237402 -72298 -110140 160534 27752 142938 379106 1304 -337986
18399 209459 264162 -232145 -138020 153824 77080 -221756 833 -13525 119312 -237617 19581
18387 -118938 -56830 -148996 23973 -25298 -96617 -16803 176844 107803 180388 -14454 -194202
18376 -194202 -1110 -67632 357028 -361154 15061 -136120 11275 -232890 -97224 160331 -5620
18364 159633 108779 43235 -189884 94960 369802 252823 145403 7761 -322271 -101831
18353c79904B43729E5922J26880r021g5009n2331l5825A82008a44785A61026l2939
18342A28087b34814B31609a52772b1601n5121B17240b23905C61168A71459h3031
18331D4309g6169j18933A13959N8220B0903c97788J72907a2114p3415r8135B77356
18319a17574F07947o5130c75124c5470A02509d3346j88165R8617m3116C7502P0286
18308A07788c0533E0018a7733j3783j38319f4976o574H1269B0749c75835a85080
18296b5891A04936a24551I661a5547j7437B50476f9587k04670j03275J30804d6878
18284a6552n492B34152E2155e503C8753g1909j21605A84605D5193N9209b04239
18272d19372h6920n5441M2550L4014G2283e7356A1566h591l5671q9428j9302H2528
$$ plain form
18353 -379904 243729 55922 182802 173781 -75009 -127340 -163165 182008 -144785 161026 128087
18342 128087 -234814 231609 -152772 -21601 -76722 217240 -223905 361168 171459 -83031
18331 44309 -76169 -195102 113959 172179 20903 -397788 -224881 -12114 -85529 -183664 277356
18319 -117574 607947 542817 -375124 -35470 102509 -43346 -231511 -132894 -176010 37502 107788
18308 107788 -30533 50018 -17733 -31516 -169835 -64976 -71550 81269 20749 -375835 -185080
18296 -25891 104936 -124551 9661 -15547 -32984 250476 -69587 -274257 -377532 -246728 -46878
18284 -16552 -22044 234152 52155 -5503 38753 -71909 -193514 184605 45193 104402 -204239
18272 -419372 -86920 -142361 -99811 -65797 72283 -57356 11566 -8591 -44262 -133690 -152992 82528
18259a84231c8590D5185P0317a807k7318F272J00257C095J37225a37384f1734
18247D1040J01493P0838B0950L8148a24642j3989g108l33582d5288n2678R230
18236h8736j66238B9758e8510A67600c18153a14099F5879k8163J38293R0975A07755
18224a66651q0307B21264C6808A7214J03994d6893e384k61056Q6297m4481M4794
18213a79830C7937K8688J04562f9145B12454b25865c6265m6683m0486d2733A79659
18201a04182j44490P7258a2169l76106A73498R7510b11834g1337j5458A74779
18190a1801o370A32147F2361J2446K15690a49994L0217J2712A27476a76489B4142
18178b09644K0748K4923P2378K7125k1731j4720j5542N6785C75828a32678c643
$$ plain form
18259 -184231 -38590 45185 115502 -1807 -29125 6272 106529 3095 140320 -137384 -61734
18247 41040 142533 213371 20950 59098 -124642 -138631 -7108 -340690 -45288 -97966 -88736
18236 -88736 -254974 29758 -58510 167600 -318153 -114099 65879 37716 176009 266984 107755
18224 -166651 -246958 221264 36808 17214 121208 -46893 -5384 -266440 -180143 -224624 -179830
18213 -179830 37937 66625 171187 -69145 212454 -225865 -36265 -82948 -123434 -42733 179659
18201 -104182 -248672 -171414 -12169 -388275 173498 271008 -211834 -71337 -86795 174779
18190 -11801 -18171 132147 62361 74807 290497 -149994 -119777 -107065 127476 -176489 24142
18178 -209644 -188896 -163973 -91595 -64470 -86201 -100921 -116463 -59678 375828 -132678 -3643
18166a49877B44036q9977K20689D0389K65613a45528c4035I3406a16696l30563
18156d47259a48351B37354e5951k92505A81802n0385a88770G7750R5778a66653
18145a62213e6853k94050H5723a24140O1308B30174a37855k03673K2565B26831
18134b09009B00796A7234J23037m6248b78752C52121E6284b61056f7787o4610
18124a32397A13221b80053C3097d3153A13356J41333o9271a83904I5624P1307
18114A66931g0788A03095g286A74769o1491b10238B92958H2392a00711A07542
18103B82186e70310A91478I4096A1203g7231C0490A4316N8695J76649a09771A13837
18091A13262c60614e2754B07883N9422d08414B22413i9265E6800a49271A682d5798
$$ plain form
18166 -149877 244036 154059 374748 40389 306002 -145528 -34035 93406 -116696 -447259
18156 -447259 -148351 237354 -55951 -348456 181802 131417 -188770 77750 173528 -166653
18145 -162213 -56853 -350903 85723 -124140 -62832 230174 -137855 -341528 -318963 226831
18134 -209009 200796 17234 140271 94023 -278752 352121 56284 -261056 -67787 -132397
18124 -132397 113221 -280053 33097 -43153 113356 254689 185418 -183904 95624 166931
18114 166931 -70788 103095 -7286 174769 113278 -210238 292958 82392 -100711 107542
18103 282186 -570310 191478 94096 11203 -77231 30490 14316 73011 249660 -109771 113837
18091 113262 -360614 -52754 207883 267305 -408414 222413 -99265 56800 -149271 1682 -45798
18079H726b9239j38619N8033k72051N6844A74601a90640g5688l9366B02439q5863
18068A16576J71866C684a73625j37668a19624C9937h5919k21575J2847g9612E409
18056B42787b51841P6394j48755G4000b07398E3466r994a13805o9060H097K37319
18045B45416r1968j563a39015N5060B69751b439C5480d8487j21677h2780p2566
18034a55346O5418B44150F3750b48623l9969E5438a16698A8046K16854m0242c3113
18022b7920F1525J71176a14344j43402D0203J92584i2843I373f8308j81342L5997
18011b13653i4454A16638A2521a39227f5117A20542a49567f7635D1332j2282g9480
17999b583C5662e8094j14121F2453i040A03325g3643j09001I8554b02469i2382
$$ plain form
18079 8726 -29239 -167858 -109825 -381876 -325032 174601 -190640 -75688 -115054 202439 116576
18068 116576 288442 3684 -173625 -311293 -119624 39937 -85919 -307494 -294647 -79612 5409
18056 242787 -251841 -175447 -324202 74000 -207398 53466 43472 -113805 -182865 8097 245416
18045 245416 153448 151885 -139015 -83955 269751 -2439 35480 -48487 -170164 -82780 -155346
18034 -155346 -89928 244150 63750 -248623 -288592 55438 -116698 18046 234900 194658 -33113
18022 -27920 61525 232701 -114344 -257746 40203 232787 -92843 9373 -68308 -249650 -213653
18011 -213653 -94454 116638 12521 -139227 -65117 120542 -149567 -67635 41332 29050 -79480
17999 -2583 35662 -58094 -172215 62453 -9040 103325 -73643 -182644 98554 -202469 -92382
17987D5064f9979C0714c5922B2973b0832j84613B227P2081a13264F1006O7021
17976A28027L7247d22815A11073l4605e15580a59859N4500C1224J23038a03960
17965G8839e1227m1432N52J8839B86504a53710G7977C5598J21096Q4938b79437
17953A6756N5393f3448B10172a43771m95F9613g8840m5272j29479K0575O1095
17942a71921C2889R8283a52653A03491f3942A34744P5611b42115C9877j1650e4284
17930a00429m3708K4991Q820e4606C97806A56875o1258a34364b0426j38024K6302
17919a32148L5355B35937e1971B63125g2249q3833B64285e25l38290O3342B6450
17907a3341o7452j5210c3870F0085j66A9422a1927B2739b29044L0518c5854A18062
$$ plain form
17987 45064 -69979 30714 -35922 22973 -20832 -205445 2227 74308 -113264 61006 128027
17976 128027 165274 -422815 111073 76468 -515580 -159859 -105359 31224 154262 -103960
17965 78839 -51227 -92659 -92107 -73268 286504 -153710 77977 35598 156694 241632 -279437
17953 16756 72149 -63448 210172 -143771 -144266 69613 -78840 -124112 -253591 -233016 -171921
17942 -171921 32889 131172 -152653 103491 -63942 134744 210355 -242115 39877 28227 -54284
17930 -100429 -144137 -119146 -110326 -54606 397806 156875 95617 -134364 -20426 -158450 -132148
17919 -132148 -96793 235937 -51971 263125 -72249 -156082 264285 -525 -338815 -275473 26450
17907 -13341 -80793 -96003 -33870 60085 59919 19422 -11927 22739 -229044 -198526 -35854 118062
17894d5883A7757i8377A05497i5017A01244h1162F9995d0410k8594D659a06854
17882a3613n5026C0724d14384H7980m288c62879I7754A590a69087p8842C53560
17870a72439e0802j7979F0795N8513a1063B4795P4937e6890D4317b17358j8328
17859b35686D4568g0685a8895F5417a49486A82744h0148F4539c06150c172m30602
17848d33774A8508i9025H1118a70041f0057K9113k85717B51517J64059f4968E1639
17836C33355C9779g7209j21278A90558G4058J46229A2835a0073B75423G4560M0043
17825A14603B2666J69768a64699C965M33765G4750L6831J38090j13065P9829a39757
17813c15875H8085N5779b5983A03100i842k35650h2866A6468R7695J33348d8053
$$ plain form
17894 -45883 17757 -98377 105497 -95017 101244 -81162 69995 -40410 -69004 4659 -106854
17882 -13613 -68639 30724 -414384 87980 83692 -362879 97754 1590 -169087 -247929 353560
17870 -172439 -50802 -68781 60795 119308 -11063 24795 99732 -56890 44317 -217358 -235686
17859 -235686 44568 -70685 -18895 65417 -149486 182744 -80148 64539 -306150 -3172 -433774
17848 -433774 18508 -99025 81118 -170041 -60057 -30944 -316661 251517 415576 -64968 51639
17836 333355 39779 -77209 -198487 190558 74058 220287 12835 -10073 275423 74560 114603
17825 114603 22666 192434 -164699 3965 437730 74750 111581 249671 136606 216435 -139757
17813 -315875 88085 143864 -25983 103100 -9842 -245492 -82866 16468 114163 247511 -48053
17801A43314c6089F7943c5114n3016m6289b7602k8460j81795H8700b16346B414
17789a57678c5024A65456n4508k4714J67693F8754o448d6302B02286h2678a8416
17777b34253B96548M3622b29673A26015O7844a27471A69335r777G4643J22531
17767A97174b2138E7110L1116l2671b6215j03786A00415b47812H0300M5132f834
17755a74243B8256j2516b4897m60976e4655G5830J24718a3951j80562l7379R7623
17744a34269k56353I9958c47673P2097B03335J42987E601h8484G7052J80339L5807
17733B93198A7202d0486D90037f9742m5761E6640A482Q354K92026b0673A35191
17721C0367a0466j95157j74525A17858e2102p7543E07916B05066I9792M5296o6997
$$ plain form
17801 143314 -36089 67943 -35114 -88130 -134419 -27602 -56062 -237857 88700 -216346 2414
17789 -157678 -35024 165456 110948 86234 253927 68754 62306 -46302 202286 -82678 -18416
17777 -234253 296548 340170 -229673 126015 193859 -127471 169335 159558 74643 197174
17767 197174 -22138 57110 88226 55555 -26215 -130001 100415 -247812 80300 125432 -6834
17755 -174243 28256 15740 -24897 -485873 -54655 75830 200548 -13951 -194513 -231892 -134269
17744 -134269 -390622 99958 -347673 -275576 203335 346322 5601 -88484 77052 257391 293198
17733 293198 17202 -40486 490037 -69742 -115503 56640 1482 9836 301862 -20673 135191
17721 30367 -10466 -205623 -380148 117858 -52102 -129645 507916 205066 99792 145088 78091
17710G8091c26568A68952m1360h3783H0642k323c7626A58900N594a37735k186
17699a39921N557D59127e748j53518B12268I2657D1702b2030A07563J59455J1275
17688B78293K6311b38337L1330a8302I0738O8488J16111a48255a2700n4636p9438
17677a46774c5996D59378C2302L4030M4299k3794M6444a16436j2617E9941b44473
17665C69021b5803k8166I9391A7748O0245a74897c1871B08803h7773A99281a39216
17653a12271G1517a24462j2656k0973j10604B22036m7340a76492A86030J4319
17643B00349a70792E9054a57235f3058A11998a79312C7406l571f4447A6173L36938
17632C53111q5950j08252a54056L222B3295K15820d378C04450L280a88967A28768
$$ plain form
17710 78091 -326568 168952 127592 -83783 80642 78319 -37626 158900 164494 -137735 -139921
17699 -139921 -134364 459127 -5748 -159266 212268 92657 41702 -22030 107563 267018 278293
17688 278293 304604 -238337 -207007 -18302 90738 159226 275337 -148255 -12700 -67336 -146774
17677 -146774 -35996 459378 32302 66332 110631 86837 133281 -116436 -129053 59941 -244473
17665 369021 -25803 -53969 99391 17748 77993 -174897 -31871 208803 -87773 199281 -139216
17653 -112271 71517 -124462 -137118 -158091 -268695 222036 174696 -176492 186030 200349
17643 200349 -170792 59054 -157235 -63058 111998 -179312 37406 33835 -64447 16173 353111
17632 353111 267161 158909 -154056 -150834 23295 239115 -4378 304450 307730 -188967 128768
17620A99127k5594j7041K0178c2074B75320b976F1802c09623c3123A54722m0846
17609A13876a85380A46500a72756B03834h2947H8757a37716A66982F1698J11748
17599A73446a72515B4220c623C8138L65711D1712L11984a63832B35574J44736
17589C80310j63366b3550B03683a54388M1730B1952P1981K33708A25782K02131
17579C27913E4065J7551a75482E0629c98213a75503G628J09785b8866A82303D5810
17567D2553b68456a03544p0677C32295G7641J84634n4263a70346A28013h8087
17556b19311B50540F9984A4945J89358c7311j01198I6365g0108C0377b81013O2538
17545b18475F6892a34683d6626K0808B07889d8309A33346P4376a03919c2677n15
$$ plain form
17620 199127 173533 156492 176670 -32074 275320 -2976 61802 -309623 -33123 154722 113876
17609 113876 -185380 146500 -172756 203834 -82947 88757 -137716 166982 61698 173446
17599 173446 -172515 24220 -3623 38138 403849 41712 353696 -163832 235574 380310
17589 380310 216944 -23550 203683 -154388 -112658 21952 93933 327641 125782 327913
17579 327913 54065 71616 -175482 50629 -398213 -175503 7628 117413 -28866 182303 45810
17567 42553 -268456 -103544 -174221 332295 77641 262275 208012 -170346 128013 -88087
17556 -219311 250540 69984 14945 204303 -37311 -138509 96365 -70108 30377 -281013 -218475
17545 -218475 66892 -134683 -46626 -25818 207889 -48309 133346 207722 -103919 -32677 -33192
17534c3192B40302I2424J85221a49882E58560A85676c2828k14893B02033J3378
17524B15411a64414B9759K10922l1846c2238r1866c8077B49911I032B426i5322
17512B83475f8287B413J25422L3849J98801A35668D664L21739q4411A8975N81589
17501F00564i3045A10546d1556G4673a58550G2276R6681m5050a24743A83606B0467
17489d159H0353K45457c4678k25741h6299A82412p9407a0420B58206l1643b8618
17477D5292K120P857O2043R4588a15062B27892q9986a60551A18826B251K45935
17466B48186a95728C2662K02607b67948B31828D6947J2112M1958d0346A05601
17455B75666A12897b4126G2729a7536j14227D290J18100a02879B82894D3285b09582
$$ plain form
17534 -33192 240302 92424 277645 -149882 558560 185676 -32828 -247721 202033 215411
17524 215411 -164414 29759 240681 208835 -32238 -124104 -38077 249911 9032 2426 -95322
17512 283475 -68287 2413 127835 161684 360485 135668 4664 326403 241992 18975 600564
17501 600564 -93045 110546 -41556 74673 -158550 72276 168957 123907 -124743 183606 20467
17489 -4159 80353 325810 -34678 -260419 -86299 182412 103005 -10420 258206 226563 -28618
17477 45292 47412 55269 117312 211900 -115062 227892 137906 -160551 118826 2251 248186
17466 248186 -195728 32662 235269 -267948 231828 46947 59059 101017 -40346 105601
17455 275666 112897 -24126 72729 -17536 -131763 4290 122390 -102879 282894 43285 -209582
17443C11055a54075A86372J18560B3698i1102G2012L34653j65660R85L557J88371
17432D33918j5122k6413A40355N4753a4698B85881P7576J49649B01522J77725
17422C79247j10816R2237p6051l1807O7724j23417r249H3725J49058l6363c03224
17410d9370D41458p6003P0479A43193D727N94640j83069A96804i254k3484C58086
17398A57887b31453C94034j37134j07105J7604p1286C1659M05796b3870E4612
17387d405A25927K65870A48330p3594a23404D27981A36117F4145J30561J8458
17377B13164K12534e4647A35211h6966E8777b138C09171a25387B71911A21941
17366A61746F587K13422J43113A27217k7519a21173C07349A37530K39346r3694
$$ plain form
17443 311055 -154075 186372 304932 23698 -91102 72012 406665 241005 241990 245547 433918
17432 433918 418796 392383 140355 195108 -14698 285881 363457 513106 201522 379247
17422 379247 268431 360668 284617 252810 320534 197117 187868 83725 232783 196420 -303224
17410 -49370 441458 365455 435934 143193 4727 599367 416298 196804 -9254 -32738 358086
17398 157887 -231453 394034 256900 149795 167399 96113 31659 437455 -23870 54612
17387 -4405 125927 391797 148330 74736 -123404 427981 136117 64145 194706 213164
17377 213164 425698 -54647 135211 -86966 58777 -2138 309171 -125387 271911 121941
17366 161746 6587 220009 363122 127217 99698 -121173 307349 137530 376876 283182
17356B83182H5139J05804p3066E8400J17654a19549D06263a23928B31282O8279
17346B99561d1265F2918d0003B76324L6535f1764A15767K79952A81101N8103n0177
17335A89027b2657C53550A04480K82425C040N8806L07530A02256J45436M383q723
17324B43352K17505j76519j03961C6336J9721K36673r471m2746J65742I0566g9996
17312A08506a06991A13357O3389a52636B85837b3965C31203f0464N990A66927
17301A84829f4961A75707K55490O1027b34448a01608K8103I018J62536d73543
17290b46498A22411e2800D19006I4078Q3757a7441N216C12258p7079k7430D3734
17278b92098d7159D45690k09028i1005B99611j5975A14596A7709b1452I8179K96670
$$ plain form
17356 283182 85139 190943 117877 58400 176054 -119549 406263 -123928 231282 299561
17346 299561 -41265 62918 -40003 276324 312859 -61764 115767 395719 181101 239204 189027
17335 189027 -22657 353550 104480 386905 3040 61846 369376 102256 247692 252075 243352
17324 243352 460857 284338 180377 36336 56057 292730 283259 240513 406255 90566 -79996
17312 108506 -106991 113357 176746 -152636 285837 -23965 331203 -60464 -54474 166927
17301 184829 -64961 175707 431197 492224 -234448 -101608 -73505 9018 171554 -473543
17290 -246498 122411 -52800 419006 94078 177835 -17441 -12225 312258 235179 207749 43734
17278 -292098 -47159 445690 236662 -91005 299611 283636 114596 17709 -21452 98179 394849
17267C94849b20651H0672J10757F6542K73164j09507j06831B9377J63367J06424
17257B99168J7823b4451j31532B35404k4053o0959J36504m4359i2316D51964J46742
17246E98706k47909F5424J06045C5184H280J72759L05057j74782o5194B1092J68229
17235A89321a89864H5690a80716h947A56128m2668K50050j60120A01133a05669
17224d74877C40096j58402E8469K4575j6386J39760G5222M7460A848a74869C47631
17212C8719L49061J53574A39636f4916B14158a98619C96820a8639j4865C34813
17201C29386k8939R9705b061E9763A65K84721A11831J45920P6502a48861B39478
17189E7246K83871q6483E6194J3299L86483j60129p3328F2048J51294L13425B63347
$$ plain form
17267 394849 -220651 80672 191429 66542 339706 230199 123368 29377 192744 299168
17257 299168 316991 -24451 -155983 235404 211351 150392 286896 242537 -92316 451964 598706
17246 598706 350797 65424 171469 35184 8280 181039 486096 311314 246120 21092 189321
17235 189321 -189864 85690 -180716 -8947 156128 113460 363510 203390 101133 -105669
17224 -474877 340096 181694 58469 83044 66658 206418 75222 122682 1848 -174869 347631
17212 38719 387780 541354 139636 -64916 214158 -198619 396820 -18639 -33504 334813
17201 329386 300447 400152 -2061 59763 165 284886 111831 257751 334253 -148861 239478
17189 57246 341117 254634 56194 69493 455976 295847 222519 62048 213342 526767 263347
17177E1106J18065L97492B48403H9159K92548A70864P4293D8344K27354j11783
17167A63915J14124J92601j04979j44131q6330K57288A34298J30259J76961I5250
17156C35392j55809K42455r4920m0508I1356j1085K83649B6952K56170J18305
17146D01427A98245C1248J07387j1541L08599j95105M83557B56800K93126B25136
17135B76242J67879k14836l9588J65554A18251M681K20480f004C10175N5572j55118
17124B10629B484N38409F4506M00615D1982K89321k5469F6214K68807J8412J6014
17113C69447A82947K38526p8128M50173B34453L65675A8115L22062j37027b4109
17102C21930K00852B39741P101q6617N05627j81629j73863A48751K79120k07659
$$ plain form
17177 51106 169171 566663 248403 89159 381707 170864 245157 48344 275698 163915
17167 163915 278039 470640 365661 221530 135200 392488 134298 264557 441518 95250
17156 335392 179583 422038 327118 286610 91356 80271 363920 26952 283122 401427
17146 401427 198245 31248 138635 127094 435693 240588 724145 256800 549926 225136
17135 276242 444121 229285 189697 355251 118251 122932 343412 -6004 310175 365747 210629
17124 210629 2484 540893 64506 465121 41982 331303 305834 66214 335021 353433 369447
17113 369447 182947 421473 343345 793518 234453 600128 18115 340177 203150 -24109
17102 321930 522782 239741 246842 160225 665852 484223 310360 148751 427871 220212
17092B20212j0982J14668P9413A97252L74822j24184j0526j11626C8885K91248
17082C30133J06547m1254j59047J57091J30010k32814J86893A97273Q0020J31589
17072D08882j7664p6908j09574K57221q2048A00401N76137C08262J96241j87991
17062C16512N90593B60987M4755M97883l94199K23733j11428n9401J05304B47005
17051C01974O55257k63219A87053K96105L23417B26537K45136k13336K28347j38933
17041C47751k4282L28083P8249j73722O2834k39518q2442K53835A85345O43025
17031H28370l13299j8271j0826n6185l2578M515J38490j41625M24823D07372j20987
17020B86385J04727R2509O4299o9956K60234l31872J68377P6236q2479J99435
$$ plain form
17092 220212 209230 323898 403311 197252 572074 447890 437364 325738 38885 330133
17082 330133 436680 395426 236379 393470 523480 290666 477559 197273 277293 408882
17072 408882 391218 314310 204736 461957 379909 100401 676538 308262 504503 316512
17062 316512 907105 260987 305742 803625 409426 633159 521731 462330 567634 247005
17051 301974 957231 694012 187053 483158 806575 226537 471673 258337 486684 347751
17041 347751 323469 651552 729801 556079 618913 379395 296953 550788 185345 828370
17031 828370 515071 496800 485974 429789 397211 401726 540216 398591 823414 407372 286385
17020 286385 391112 483621 547920 477964 738198 406326 574703 650939 568460 767895
17010G67895k79263J58525j12280k2397K52339K360l18445n4521K25417j98129
17000D21501J2909M00803k58206L9940n1224K34766k09386J64343K5292O2688
16990H43426j67345O9195l220L20603n04777L57727L9076j03962j43422l0858
16980F76443J9510J64625J4000m8218k42543m4100L21409j99736K8268J1185N9389
16969G60232N8304C40086O50725j35707j61578n4555K40819k06532J68853p2963
16959G69148Q1099K81936P3016l03870j35961P4747R2101N5624j14800M9734k67094
16948F55680L37135q3430L59106m3266o0999l68195N6963J98261m62389K07667
16938G96533R1349Q2533P0482L4645K0473M03111m97779J00482L0071K274k27181
$$ plain form
17010 767895 488632 647157 534877 512480 764819 767179 448734 394213 619630 421501
17000 421501 434410 835213 577007 616947 565723 800489 591103 755446 780738 843426
16990 843426 676081 745276 742056 1062659 557882 915609 954685 850723 707301 676443
16980 676443 695953 860578 874578 826360 583817 539717 861126 661390 689658 700843 760232
16969 760232 818536 340086 990811 855104 693526 638971 879790 673258 842111 769148
16959 769148 850247 1132183 1205199 901329 765368 840115 932216 987840 873040 922774 655680
16948 655680 992815 909385 1268491 1225225 1164226 796031 852994 1051255 588866 796533
16938 796533 887882 970415 1040897 1075542 1096015 1499126 1001347 1101829 1131900 1134174 906993
16927I06993o0906N61324l21466k15608O69154m91560l139K26223K74015j43535
16917A401495j33091J02930j25283r5003J48736O7669l40976K64942l25261J51805
16907A117963J09496j06289Q2638K25006n0626Q8627J72397j49292m03537J81221
16897A267604L98688m39571J82268L4991Q6793K335K38172p6080k04956j21678
16887A368566j93822O99056m86032K74953j02272M93109k05296j85299r2842N13125
16877B083246j56297k50737K48977M9878J9899R725J45866k24108J64517j30872
16867A960094J90451J8956r9489k7694k64659O40895k37751L14241k77223J29000
16857B346821n20093L39862J27405j73125K38686J54489L39948m11554J02217
$$ plain form
16927 906993 846087 1407411 1085945 870337 1539491 1047931 1044792 1271015 1545030 1401495
16917 1401495 1268404 1371334 1246051 1151048 1299784 1367453 1026477 1291419 966158 1117963
16907 1117963 1227459 1121170 1203808 1428814 1378188 1466815 1639212 1489920 1086383 1267604
16897 1267604 1666292 1226721 1408989 1443980 1530773 1533108 1771280 1695200 1490244 1368566
16887 1368566 1174744 1873800 1387768 1662721 1560449 2053558 1848262 1662963 1570121 2083246
16877 2083246 1926949 1676212 1925189 1975067 1994966 2004691 2150557 1926449 2090966 1960094
16867 1960094 2150545 2169501 2070012 2042318 1777659 2418554 2180803 2495044 2217821 2346821
16857 2346821 1826728 2166590 2293995 2120870 2359556 2514045 2853993 2442439 2544656
16848B544656L13725l25043L28435j9209j28094N6125R0939K98010n86297L61440
16838B934687J85612O4929k17528L76139n8872Q7992l32972K09775N0889j33441
16828C167210N07396m81475L23519R741k32950L56857J33217J89534K2995P6550
16818D072594K98631l56826q489L68599J56848r0282j98042K00338L30308K82152
16808E055831N178j08900J7538J80244l46216P67586J2035J25728M6582M26842
16798F182448k10713R4138L33740q7843R2511M19487o6082K11885K5624r3458
16788F901737O17714K34462M13730j56686J1408M63083j41952N34635P6516L81584
16778I336231J19566q880K65100L31811J54957N43964M03348J11614Q33865k12739
$$ plain form
16848 2544656 2858381 2533338 2861773 2842564 2714470 2770595 2861534 3159544 2573247 2934687
16838 2934687 3120299 3185228 2967700 3343839 3284967 3372959 3039987 3249762 3300651 3167210
16828 3167210 3674606 3193131 3516650 3526391 3293441 3650298 3783515 3973049 3996044 4072594
16818 4072594 4371225 4014399 4005910 4374509 4531357 4441075 4243033 4443371 4773679 5055831
16808 5055831 5061009 4952109 4969647 5149891 4803675 5571261 5583296 5709024 5755606 6182448
16798 6182448 5971735 6065873 6399613 6311770 6404281 6823768 6757686 6969571 6995195 6901737
16788 6901737 7519451 7753913 8167643 8010957 8022365 8485448 8343496 8878131 8954647 9336231
16778 9336231 9455797 9446917 9712017 10043828 10198785 10742749 11146097 11257711 12091576 11878837
16768A1878837L50819P92771L46763K82189N84150J96353L78529M87723P08190
16759A6006324M01943O50168P64025K60285P13619P65160O41466O14993J042514
16750B1860497J020258K11015J512489J121820R42489J308400J085431J454388
16742C0516787J119677J354306J769839J447712J816871J587764J827994K206005
16734D3646955K462487K222680K738420L012840K859757L206941L717637L509188
16726F7376905M190917M318441M758399M793606N381495N548820O082508O522640
16718A08973731O660519P535346P321577P764661Q137839Q095059Q192460Q117161
16710A70798353Q075676P585396O897010O177780M901304M119666K128649J348601
$$ plain form
16768 11878837 12229656 13022427 13369190 13651379 14235529 14431882 14810411 15298134 16006324
16759 16006324 16408267 17058435 17822460 18082745 18796364 19561524 20202990 20817983 21860497
16750 21860497 22880755 23091770 24604259 25726079 26668568 27976968 29062399 30516787
16742 30516787 31636464 32990770 34760609 36208321 38025192 39612956 41440950 43646955
16734 43646955 46109442 48332122 51070542 54083382 56943139 60150080 63867717 67376905
16726 67376905 71567822 75886263 80644662 85438268 90819763 96368583 102451091 108973731
16718 108973731 115634250 123169596 130491173 138255834 146393673 154488732 162681192 170798353
16710 170798353 178874029 186459425 193356435 199534215 204435519 208555185 210683834 212032435
16702B12032435J74476k266555l371000m567159n908544o436429p562026p688748
16694A74406450q557706q421327q196890q146810p881411q093630p248869p002265
16686A10857542o771318o215939o069628n671113n006866m959720m721360m303970
16678F7137628m026160l727321l221922l022075k897014k757157k599038k734941
16670D2152000j930855k046562j780541k026739j768906j366073j241735j833715
16662B8156874q16709j417142j169386r81465j226646p67258q12012j265996J4984
16653A9715244j249654k85093r63588n75007m27380p05167o02332m64457l86632
16644A4055934o98237n17793k8264n36314j94264j90173p20594l89290m61794
$$ plain form
16702 212032435 212206911 209940356 206569356 202002197 196093653 189657224 182095198 174406450
16694 174406450 165848744 157427417 149230527 141083717 133202306 125108676 117859807 110857542
16686 110857542 104086224 97870285 91800657 86129544 81122678 76162958 71441598 67137628
16678 67137628 63111468 59384147 56162225 53140150 50243136 47485979 44886941 42152000
16670 42152000 40221145 38174583 36394042 34367303 32598397 31232324 29990589 28156874
16662 28156874 27340165 25923023 24753637 23772172 22545526 21778268 20966256 19700260 19715244
16653 19715244 18465590 18180497 17216909 16641902 16214522 15509355 14907023 14442566 14055934
16644 14055934 13357697 12839904 12811640 12275326 12081062 11890889 11170295 10781005 10319211
16635A0319211l46091j45378j67703Q7025q99676k83107j12026K01377k79591
16626H374041o05923P0812j10540j76879m14969l4822J1908o71803L58007n29267
16616F270565j79405L474k78044j97171K20384o31705M41162m55448R598j41835
16606E061575j25606l84420L14219Q3442n18550J24992q4991j25658l77800r1661
16596C875542n3361L2520k55564N21145l57114n8054k25046R5048m94419M12113
16586C492810J57363n00906J36953J19496l26870K53436l41712R8648J3742l66541
16576B736419j88573K8625J51448j90374n7104k1906K06976l29710L21027o1324
16566B595504j82429K44601l46552J68599M0191l49198l47340K81935J17906o6038
$$ plain form
16635 10319211 9973120 9827742 9660039 9747064 8847388 8564281 8452255 8653632 8374041
16626 8374041 7768118 7838930 7728390 7551511 7136542 7101720 7113628 6441825 6799832 6270565
16616 6270565 6091160 6094634 5816590 5619419 5839803 5208098 5649260 5193812 5203410 5061575
16606 5061575 4935969 4551549 4865768 4949210 4430660 4555652 4470661 4345003 3967203 3875542
16596 3875542 3822181 3854701 3599137 4120282 3763168 3705114 3480068 3575116 3080697 3492810
16586 3492810 3650173 3149267 3286220 3405716 3078846 3332282 2990570 3089218 3102960 2736419
16576 2736419 2547846 2576471 2727919 2537545 2480441 2458535 2665511 2335801 2656828 2595504
16566 2595504 2413075 2657676 2311124 2479723 2519914 2170716 1823376 2105311 2223217 2157179
16556B157179j67672M6055j40220L27906l98180J80078j66153J5729k92414o6622
16546A495686L17780K7068j06128Q8689k49309K62407k79107J29286J67540m70673
16536A383239L56407J29406m55664m7818j27892K7447O8593j94578N5107N0626
16526A244873J93164J8661q3543j62492r6824k02415K57397j7168n5636J76921
16516A272938O5494j50332k72996J4979K0241K04584K8411o6104Q9271l22639
16506H83847J75125P84K16572J58039l48818j98141N6913m1406q3387j02326Q6082
16495H03284Q7539K29561j60260j46879K33691l87785R1899J97132K46290n19330
16485F75142J18503k59755J83445N6581J74901j41748j18356L76245l84541K3705
$$ plain form
16556 2157179 1989507 2035562 1895342 2223248 1825068 2005146 1838993 1854722 1562308 1495686
16546 1495686 1813466 1840534 1734406 1823095 1573786 1836193 1557086 1686372 1853912 1383239
16536 1383239 1739646 1869052 1413388 1365570 1237678 1265125 1333718 1139140 1194247 1244873
16526 1244873 1438037 1456698 1373155 1210663 1113839 911424 1168821 1151653 1096017 1272938
16516 1272938 1338432 1188100 915104 930083 950324 1154908 1183319 1117215 1206486 883847
16506 883847 1058972 1059756 1276328 1434367 1085549 887408 944321 902915 819528 717202 803284
16495 803284 890823 1120384 960124 813245 1046936 659151 751050 948182 1194472 675142
16485 675142 793645 533890 717335 773916 948817 807069 688713 1064958 680417 704122
16475G04122L05107l28799p1433J08615j74728K33011N4053j66854K44290k35504
16465F71880l2908j15831M20246l70535j56650K83896j18702r3127m6278J98634
16455F40625Q3182A35786N71032l00617O9886j78069L02234j60297A43274J58662
16445C01936J93513j805k40654K97477O1251j84516L10497j70997j77304J00420
16435D89818l6662P8180j11877l9572O19372C84435J38002k37403M50179B62690
16424G88596k11132A17842M98358k14565J33826j63124j506j55681M8385p0948
16414A92587M06408k25157J52525K37002B92422P0785d4995D64644A85295K09940
16404C95235j62108J47127q7838O6563J02847k03972L15399J20057q2668k03271
$$ plain form
16475 704122 1009229 680430 608997 717612 542884 775895 829948 663094 907384 671880
16465 671880 638972 523141 943387 572852 416202 700098 581396 488269 441991 640625
16455 640625 723807 135786 706818 406201 476087 298018 600252 439955 143274 301936
16445 301936 495449 493644 252990 550467 611718 427202 737699 566702 389398 489818
16435 489818 453156 531336 419459 379887 999259 384435 522437 285034 735213 262690
16424 788596 577464 117842 616200 401635 535461 372337 370831 215150 263535 192587
16414 192587 598995 373838 526363 763365 292422 363207 -44995 464644 185295 395235
16404 395235 233127 380254 292416 358979 461826 257854 573253 693310 610642 407371
16394D07371j72348o3204L45668m708j48933R2243j74636L2313A54458O6492K32752
16383D53702j95721J43983p2669M682A37057M78414l867h5535D93360k04554J75927
16372D64733b9457C19311J41998n9817R9637j19599A61475O2815J23267m3482
16362C04075J00745k00118K56589D678N6254K26195R8064A11213K71280n8727
16352C23766J67837j80175j19559K07991k49j51788F7371J26761J90134O5187
16342D49453L6147a00910B27906k6658J39779j45050q4681K9987J62159N7384
16332C60826d3899C58733P299j08010m8647N233r7240L10018A99882J55440E304
16320A16186N2346n7930A7891M4593a2250o8405A22416J06160J08765J0456J10433
$$ plain form
16394 407371 235023 171819 517487 512779 363846 456089 281453 313766 154458 220950 453702
16383 453702 257981 401964 329295 333977 137057 615471 611604 -85535 493360 288806 464733
16372 464733 -29457 319311 461309 401492 501129 381530 161475 224290 347557 304075
16362 304075 404820 204702 461291 4678 60932 287127 385191 111213 382493 323766
16352 323766 491603 311428 191869 399860 399611 247823 67371 194132 384266 449453
16342 449453 485600 -100910 227906 201248 341027 195977 111296 141283 303442 360826
16332 360826 -43899 358733 366032 258022 209375 214608 117368 427386 199882 355322 5304
16320 116186 168532 110602 17891 62484 -12250 -80655 122416 228576 337341 347797 458230
16309D58230A54890B7800L0651N7239j4938J70427F1482R5366J93159d6814B65536
16297h7052A05049Q9061H1979A1871J08952J16876M35845B63273J8236A01124
16286B95814j25271J37357j44709N0267G3288M3933O5421D6816b6368B33947H8413
16274A97373N0457a2850B48430r9975B068K41899b713C56893A40216O7630K5307
16263B33153r8295N937B3301O7909J95505A39013J39775k0586j22624b77267F77740
16251G7451h1279o1475e4049j91090D49954R4290D236J82156A6164M57212j83694
16240B89682i4989F6116a47225m9909A03938a72501A72305j8876J92202B8390
16229i0240G6420c5749B33559r6105j1370M63940A02127N0278h4699n3653B6541
$$ plain form
16309 458230 154890 27800 58451 115690 100752 271179 61482 156848 350007 -46814 265536
16297 -87052 105049 194110 81979 11871 120823 237699 673544 263273 281509 101124
16286 295814 170543 307900 163191 213458 73288 117221 182642 46816 -26368 233947 88413
16274 197373 247830 -12850 248430 148455 2068 243967 -2713 356893 140216 207846 233153
16263 233153 134858 140795 23301 91210 286715 139013 278788 258202 135578 -277267 677740
16251 77451 -81279 -142754 -54049 -245139 449954 544244 4236 186392 16164 473376 289682
16240 289682 -94989 66116 -147225 -197134 103938 -172501 172305 153429 345631 28390
16229 -90240 76420 -35749 233559 137454 126084 590024 102127 152405 -84699 -138352 26541
16217b9521G4183j1221A5437J31605j7669A647J82825f4412C52318i173A58495
16205A06310c9925B73889a52492C1970P0281C1996J32742N8735m9749a52780e0326
16193A16093d2756A97737k5787K42735e3383F4585f8523A53960b32175R1892B30504
16181a91837B26801E7714a08105L6549e136A32466C4642J10065b9867B98863A03783
16169G4348h1411j10674b9464B77623e9360K2181B03007j00729i3556J9554A06472
16157d2791B2640i6906L9675A34650a39429E3059B5493L7012K47194a97299N5562
16146a41737A58440a5066p653o4162j234j78806A9207b18192f4455a4268A62353
16134a23045B44043D3789K27415a416D8688c83822J84510A11780a2435j7279o9496
$$ plain form
16217 -29521 74183 62962 15437 147042 129373 1647 184472 -64412 352318 -9173 158495
16205 106310 -39925 273889 -152492 31970 102251 31996 164738 223473 173724 -152780 -50326
16193 116093 -42756 197737 171950 414685 -53383 64585 -68523 153960 -232175 -140283 230504
16181 -191837 226801 57714 -108105 -71556 -5136 132466 34642 144707 -29867 298863 103783
16169 74348 -81411 -192085 -29464 277623 -59360 -37179 203007 102278 -93556 -74002 106472
16157 -42791 22640 -96906 -57231 134650 -139429 53059 25493 62505 309699 -197299 -141737
16146 -141737 158440 -15066 -22719 -86881 -88115 -266921 19207 -218192 -64455 -14268 162353
16134 -123045 244043 43789 271204 -1416 48688 -383822 -199312 111780 -12435 -29714 -99210
16123i9210E4768j5230f064k51022D0677a19659k0606A95272b475A01252M7629
16112A48881a21802D6406a93973a1023D8660a25916F230c17428H9837P4628M8346
16101B12811l5215a37319A7157b18698b3115C84744b08750D10646A30889K32306
16091C63195l0541a04085c5440J5243B65241p8485n7590i028G3433B0242J3788
16080C4030k21c15680H4473b77907a37873b5532I6702a30394B49163c4570j60208
16069a94778A89130b82235G1176B9027J68627a06759A29226a56676E3421f9957
16058a55584L1045A05215a71412A4978b43825C5280L0758a07170K5892G3481L70979
16047D44460a15536r3974A41041b17832N1106A65135j0317F8699c8315C4433a56524
$$ plain form
16123 -99210 54768 39538 -6064 -257086 40677 -119659 -140265 195272 -2475 101252 148881
16112 148881 -121802 46406 -193973 -11023 48660 -125916 6230 -317428 89837 164465 212811
16101 212811 177596 -137319 17157 -218698 -23115 384744 -208750 410646 130889 363195
16091 363195 332654 -104085 -35440 -20197 265241 186756 129166 -9028 73433 20242 34030
16080 34030 33809 -315680 84473 -277907 -137873 -25532 96702 -130394 249163 -34570 -194778
16069 -194778 189130 -282235 71176 29027 197654 -106759 129226 -156676 53421 -69957
16058 -155584 -124539 105215 -171412 14978 -243825 35280 66038 -107170 -81278 73481 444460
16047 444460 -115536 -209510 141041 -217832 -166726 165135 154818 68699 -38315 34433 -156524
16035b836m515j90479d7110e385k15940C02193f9924l73932c4948r356o7474j66854
16023b78632B11872C1127K95116a11972B80210i3982a7411k20977A40924c6589
16012A34317e6043D3613J70247B3023O3655b24154k7142B87600a72971P75M4676
16001a27520A12284h5449j177B20057b379B081a02141G1558b31393j55004E9872
15989A26462e74168B18216a63185M6825a6839B34022c66372I0100b5746j73778
15979a99524L2173l6987M8313e1187l5295l35802f1683B94052b18841O8453B79068
15967d2801B79684i5439B70912K3426d8079A87874d1657J8297D9748a23734m1235
15956a64969P9831f51o6506l39350A43363A485J7965g6872o8329A6612C897O3527
$$ plain form
16035 -2836 -7351 -197830 -47110 -5385 -221325 302193 -69924 -443856 -34948 -44304 -111778 -278632
16023 -278632 211872 31127 326243 -111972 280210 -93982 -17411 -238388 140924 -36589
16012 134317 -56043 43613 213860 23023 86678 -224154 -251296 287600 -172971 -172196 -127520
16001 -127520 112284 -85449 -86626 220057 -2379 2081 -102141 71558 -231393 -386397 59872
15989 126462 -574168 218216 -163185 -116360 -16839 234022 -366372 90100 -25746 -199524
15979 -199524 -167351 -204338 -156025 -51187 -86482 -422284 -61683 294052 -218841 -150388 279068
15967 -42801 279684 -95439 270912 294338 -48079 187874 -41657 -23360 49748 -123734 -164969
15956 -164969 -85138 -651 -67157 -406507 143363 1485 19450 -76872 -145201 16612 3897 67424
15944F7424Q3883a27318B01620l0274b42670a05217G99L226a28427j83778h4601
15932A85078p5237c42105F1595e4351A14659b73158B32575C1064c23814a46028
15921a50359A95152A9349D757c79949B8957a0620C0298c59199a9683f54k25829
15910b26483i1898j18186i0054j27201a9151O643D3004a29835L4611G3302H75
15898B89514a19352k52733a44803K5447A7631K10021c3963Q625E5526a5353j31018
15887a46371H0841b10509A3521K53281a97376L7550A66906a60892A16492h8669
15876B1105b29610B50028D2082a20854k42928f1787a5994G3181k2275J32421a91413
15864a71908f4547j35641e6942k42881k062J13006c9693l6140c3946j58066e1690
$$ plain form
15944 67424 151307 -127318 201620 171346 -242670 -105217 799 4025 -128427 -312205 -84601
15932 185078 109841 -342105 61595 -54351 114659 -273158 232575 31064 -323814 -146028
15921 -150359 195152 19349 4757 -379949 28957 -10620 30298 -359199 -19683 -654 -226483
15910 -226483 -91898 -210084 -90054 -217255 -19151 -12508 43004 -129835 -95224 73302 875
15898 289514 -119352 -372085 -144803 -119356 17631 227652 -33963 -25338 55526 -15353 -146371
15887 -146371 80841 -210509 13521 266802 -197376 -159826 166906 -160892 116492 -88669
15876 21105 -229610 250028 42082 -120854 -363782 -61787 -15994 73181 50906 183327 -191413
15864 -171908 -64547 -200188 -56942 -299823 -301885 -188879 -39693 -75833 -33946 -192012 -51690
15852a32909j03805G0615B5829f8036A63006b13971I1817a34790B4311a44538
15841c3401m5683J8903F6066a18048m0129k74676b5446B52394C9916g9195H2624
15829E5712b1808j8783k84794g2898A60664c60919F724i351i68l28083A15055
15817B6781Q6009g7535C951O7130a21039A44018Q1234a48949k327c2654k88004
15806c20658Q295J03900P5392l3614F8377R2864O7594q8699c08816h5864B39852
15794B75419E379d0699j05820B85206a98177b6560A79986a70981o3617e5267H5395
15782a24611K6182B58825M5943C8849K1456c54411J22919F3317a38848k357A37736
15770a61924A49785c414j11636J959H9416g4360J3865j28679g6821E36905h7632
$$ plain form
15852 -132909 -236714 70615 25829 -68036 163006 -213971 91817 -134790 24311 -144538
15841 -33401 -79084 -60181 66066 -118048 -158177 -432853 -25446 252394 39916 -79195 82624
15829 55712 -21808 -40591 -325385 -72898 160664 -360919 6724 -9351 -968 -329051 115055
15817 26781 112790 -77535 3951 71081 -121039 144018 225252 -148949 -151276 -32654 -320658
15806 -320658 -312363 -208463 -133071 -166685 68377 161241 228835 140136 -308816 -85864 239852
15794 275419 5379 -40699 -146519 285206 -198177 -26560 179986 -170981 -234598 -55267 85395
15782 -124611 -98429 258825 304768 38849 60305 -354411 -231492 63317 -138848 -141205 137736
15770 -161924 149785 -3414 -115050 -113091 89416 -74360 -60495 -189174 -76821 536905 -87632
15758a42722b0112C54403a46864L1930M9930r5117g7820c4396k9607a3334j14172
15747a27506B4440a74346A24471b41207B0038J65364c0131C9601a49379j76116
15737c25495B34423B8602J0092J30778b14053A48286B6788a22642K7704c3604
15726a03225H0309N6292b31188f5342j27749o4453a801I4148a7211k03740j56436
15715c77387f5903A36209J93564I4362c7823B02613J28745j01865i1111o4265
15705a55376A42749d307C4376K49991J6026b61667A64182p0084a26462A5788K6443
15694D2231g6066A79808e29496a1625C9267a70442I1547h8427l6029M9101b0209
15682D592L10889c0811j07812o7049L7177F8499B5107a46553A20358e2006B84720
$$ plain form
15758 -142722 -20112 354403 -146864 -114934 -65004 -160121 -77820 -34396 -64003 -13334 -127506
15747 -127506 24440 -174346 124471 -241207 20038 185402 -30131 39601 -149379 -325495
15737 -325495 234423 28602 38694 169472 -214053 148286 26788 -122642 -94938 -33604
15726 -103225 80309 136601 -231188 -65342 -193091 -257544 -1801 94148 -17211 -220951 -377387
15715 -377387 -65903 136209 329773 94362 -37823 202613 331358 229493 -91111 -155376
15705 -155376 142749 -4307 34376 284367 300393 -261667 164182 94098 -126462 15788 42231
15694 42231 -76066 179808 -529496 -11625 39267 -170442 91547 -88427 -124456 -75355 -20209
15682 4592 315481 -30811 -138623 -205672 -168495 68499 25107 -146553 120358 -52006 284720
15670G1512K46064D8176a79945B0508J12555a15041l6290C7197b3671j27962F8069
15658a48659B32535r5553R4083c34181J53865Q9865B75620a25897D9666c86926
15647c4796l30521J74037G0832J3538B1632a61427N7814F6961B6421c65289b3917
15635I9359j3891a70007L9207A58503a36346A78679a68174j81060A4580b36611
15624A04874J42572a82344g0156j76844C1449b11146g4456C12925A5985a67435
15613C45839j41084d9383B20942D8290i3787k7814a9234j28449B06322I8126a35187
15601a45480J1576A28080J2126g8642A8892a86822p3396a30005r3476j7615A32480
15589C37732G2759b32303C09568a47240k1490A56880D2506a01506H5920c8955
$$ plain form
15670 71512 317576 48176 -179945 20508 133063 -115041 -151331 37197 -23671 -151633 68069
15658 -148659 232535 136982 231065 -334181 -180316 -90451 275620 -125897 49666 -386926
15647 -34796 -365317 -191280 70832 84370 21632 -161427 -103613 66961 26421 -365289 -23917
15635 99359 85468 -170007 -130800 158503 -136346 178679 -168174 -349234 14580 -236611
15624 104874 247446 -182344 -70156 -247000 31449 -211146 -74456 312925 15985 -167435
15613 345839 204755 -49383 220942 48290 -93787 -121601 -19234 -147683 206322 98126 -135187
15601 -145480 -133904 128080 140206 -78642 18892 -186822 -260218 -130005 -223481 -241096 132480
15589 337732 72759 -232303 309568 -147240 -168730 156880 42506 -101506 85920 -38955
15578B47131C1210N9090Q8789a42515E1602b56730B05377a02051A415J84964b17218
15566a74135D4041M9305c1653k24254J04109b9368j91763j3251a14091A79107
15555a03025l29159B47961b17719a03704j21156A29514a02389A42512F4301h6357
15544A61662g3615j16916B27094f0549o0219B91553H3257M8459b40436I9225b99692
15532a76674a6903n9198B0536J21181N6893I3705O8590G4721K2618h3489r3145
15521a76634D7151a31913H5872c22416F8528c70254a39820a8684B3328K22526
15511B45854b41245C2880d007A43917M9674c8075q2395k9595d9397C39516A60980
15499b3218C5305K99922j20575A03146N1106J60725A22605a52713N9818A56274
$$ plain form
15578 247131 31210 90300 179089 -142515 51602 -256730 205377 -102051 1415 186379 -217218
15566 -174135 44041 93346 -31653 -255907 -151798 -29368 -221131 -234382 -114091 179107
15555 -103025 -432184 247961 -217719 -103704 -224860 129514 -102389 142512 64301 -86357
15544 161662 -73615 -190531 227094 -60549 -120768 291553 83257 131716 -240436 99225 -299692
15532 -176674 -16903 -76101 20536 141717 198610 93705 162295 74721 97339 -83489 -176634
15521 -176634 47151 -131913 85872 -322416 68528 -370254 -139820 -18684 23328 245854
15511 245854 -241245 32880 -4007 143917 193591 -38075 -120470 -150065 -49397 339516 160980
15499 -23218 35305 335227 214652 103146 154252 314977 122605 -152713 -92895 156274
15488A61578a95615c7812C6442a06438A13366i0541B52090o0493f3331D4788e9706
15476b35255c6380J0539A26685E5435h384k17740A63890c55032h400j67216F627
15464A92130A9773L01540C0736M9649e1692A16144B9229b27658J8094A79460b14937
15452B71021a30693J175e6231j15154A2408b11826c3808B04029r3242o326a1037
15440e5640l01800e3183B626a37684P48D1600J01314e0700B39850o4031c14552
15428A27298N5056a22260l1359A69006i611A49240K819f0222j43439A95607h915
15416e5087b6145C1645i699k05071B13114F0895n265L3710b2681A69006a38137
15404a52711N6492J909B64442b00654O3314p7368i256k8987C9662a27718M068
$$ plain form
15488 161578 -195615 -37812 36442 -106438 113366 -90541 252090 191597 -63331 44788 -59706
15476 -235255 -36380 -25841 126685 55435 -8384 -226124 163890 -355032 -8400 -175616 6627
15464 192130 19773 321313 30736 80385 -51692 116144 29229 -227658 -209564 179460 -214937
15452 271021 -130693 -129518 -56231 -171385 12408 -211826 -33808 204029 110787 104461 -11037
15440 -55640 -357440 -53183 2626 -137684 -136936 41600 142914 -50700 239850 175819 -314552
15428 127298 182354 -122260 -153619 169006 -9611 149240 152059 -60222 -203661 195607 -8915
15416 -55087 -26145 31645 -9699 -214770 213114 60895 55630 89340 -22681 169006 -138137
15404 -152711 -96219 -94310 264442 -200654 -137340 -214708 -9256 -38243 39662 -127718 -123650
15393a23650L6984G9177d8040m9961j32200N9069c5588l8376k12516D9778d2570
15381b03304D8485a67877B91788e5988j94009C86120A91630b09841C09717e230
15370a69699O3428o0714B2944a91334f5826j6530N294j629j33404C43126i3830
15358i8813B328a29778A58615o0524J22755B3468a18696B18199k156j2813H2903
15346e9061r1587G9052j6771K2493b5954g89j92504P7861A49788j3974J3816b00283
15333A61885b24380a008B3889L24814j20447b6694m4280j56845j7921A16765N860
15322A22625b9904B04826G211a51986d331A49809a20259D87702a41682B51599
15311a1026A08614J81238H7812K61972b46591B53671F4665b51667a5392C21714
$$ plain form
15393 -123650 -86666 79177 -48040 -98001 -230201 -171132 -35588 -73964 -286480 49778 -42570
15381 -203304 48485 -167877 291788 -55988 -249997 386120 191630 -209841 309717 -5230
15370 -169699 -106271 -166985 22944 -191334 -65826 -82356 -77062 -78691 -212095 343126 -93830
15358 -98813 2328 -129778 158615 98091 220846 23468 -118696 218199 216043 203230 82903
15346 -59061 -150648 79052 62281 84774 -25954 -789 -193293 -115432 149788 135814 149630 -200283
15333 161885 -224380 -1008 23889 348703 228256 -26694 -70974 -227819 -245740 116765 122625
15322 122625 -29904 204826 7211 -151986 -4331 149809 -120259 487702 -141682 251599
15311 -11026 108614 289852 87812 349784 -246591 253671 64665 -251667 -15392 321714
15300G0123R9497A7300K64683A10928b32503L1227a0390B65295k8667j01845b60588
15288A23664J84499I6537N5275A5940c6175C3504a13089A28405B1937O6671j2083
15277G6525A6669h5055B2731b17606C4852a4232p298A06477D2022a51719A64608
15265A85995a8015B02636b7013j89598O352B84433j34627i8552D1781J50123J0784
15254B02688G5503a11884d8812j62755G4048J30947K5037p8335Q1034a09824p5657
15243a85481O9071j10962D2121J17903K81939I3125K40342M41542j19179l5424
15233F20406L45241J83133l42331B04646J13774A53037b83602C68595K5049B3989
15222A32679d0089A201b67982I6897R4983a06610A53984G4233L9533J7738F444
$$ plain form
15300 70123 169620 17300 281983 110928 -232503 -201276 -10390 265295 236628 134783 -260588
15288 123664 308163 96537 151812 15940 -36175 33504 -113089 128405 21937 88608 76525
15277 76525 16669 -85055 22731 -217606 34852 -14232 -21530 106477 42022 -151719 164608
15265 185995 -18015 202636 -27013 -216611 -210259 284433 149806 -98552 41781 191904 202688
15254 202688 75503 -111884 -48812 -211567 74048 204995 230032 151697 232731 -109824 -185481
15243 -185481 -116410 -227372 42121 160024 441963 93125 333467 775009 655830 620406
15233 620406 965647 1148780 806449 204646 318420 153037 -283602 368595 393644 23989
15222 132679 -40089 1201 -267982 96897 191880 -106610 153984 74233 113766 131504 6444
15210B51939a35701F2268g2843A20664K36336f5073A85495b65879A23072c5759
15199F1360a80384h5940K4414A13458i2274B46748H2844b69208C1663d99363a0098
15187A67690H3444a4532A67239J52932A38855Q8188G1477K10487F2027J5343M16816
15176D94186E0156f8528B21477K3119b09638D6983Q9448J56410p7959p4866d7190
15164C0805R4634g1810E18L0173a30589A60186J12557i2988M0665B07725c3211
15152C6375J51945a37405B86282f1003A96332c0773I0987D0552b6288J1056C46539
15140C0048J12049J37403b09168H214R9439J03825b4491J1531G2883L7622l007
15129A07498D4739J03744k2196J65494L06318I8508R499b43619A95654a91458
$$ plain form
15210 251939 -135701 62268 -72843 120664 357000 -65073 185495 -265879 123072 -35759
15199 61360 -180384 -85940 -61526 113458 -92274 246748 82844 -269208 31663 -499363 -10098
15187 167690 83444 -14532 167239 320171 138855 227043 71477 281964 62027 77370 494186
15176 494186 50156 -68528 221477 244596 -209638 46983 136431 292841 214882 140016 -47190
15164 30805 125439 -71810 518 30691 -130589 160186 272743 -92988 -52323 207725 -33211
15152 36375 188320 -137405 286282 -61003 196332 -30773 90987 40552 -26288 -15232 346539
15140 30048 142097 279500 -209168 8214 107653 211478 -24491 -12960 72883 110505 107498
15129 107498 44739 148483 126287 291781 598099 98508 108007 -243619 195654 -191458
15118I9266a0386G3079Q0068L3570P9069O7020J06369m4837D4230L54788c73768
15106B53118B5855N651a92124C7370K13069G7192K3008a14739A7544g3666I7613
15094a20600A85367m297e1545A67777H0136b708B97854A44143a9145c265E5692
15082B95886o23B5071b3469C08311b7767j68086A13087J41901b1327D74048A56037
15070B34623A14479J43635j15341J04670j19415C2725K83261j02761J20437j00152
15060B33510H9856L23669j77956J1957d0289A44059J90516A10600d9201D3206
15049a05051A41351J9583M6121C177J90377M8400A14312B6074K10932M4506C8376
15037B73442C3719K8087L47654A4229L82252i5589D82436E4985L38591q4158o2005
$$ plain form
15118 99266 -10386 73079 153147 186717 265786 332806 439175 394338 44230 399018 -373768
15106 253118 25855 31506 -192124 37370 250439 77192 100200 -114739 17544 -73666 97613
15094 -120600 185367 181070 -51545 167777 80136 -2708 297854 144143 -19145 -3265 55692
15082 295886 295263 25071 -23469 308311 -27767 -195853 113087 254988 -21327 474048 156037
15070 234623 114479 258114 142773 247443 128028 32725 315986 213225 333662 233510
15060 233510 89856 413525 235569 247526 -40289 144059 334575 110600 -49201 43206
15049 -105051 141351 160934 207055 3177 193554 241954 114312 26074 237006 281512 38376
15037 273442 33719 61806 409460 14229 396481 -95589 482436 54985 393576 309418 247413
15026B47413A6812J16203g0684F7577J11493b28870B06631I5818g5237A32909
15015B45290A06440M55979F0746J31685B3712M8243L01509c8026C1478J01961
15005A33439E4353K41969H0352B5365J16895m7615d6692B83804A27450C6076L97812
14994D33888B11697m8434J65651J1566K18823B40917J0248J06062k8982e6464
14983B52212O2380r1047J97562k08209J71419a04776B08342r5503m8970R2536
14973A56405L13021A86852K25321q9178J0432j33884j9056q6654b2131B41227
14962A07546K95662K35650j60888B6862e8360D91096j84655C673J80710K92137
14952D76520j93211A29323L10915q3360r1877P0987F3843K14275m3613a8088A69240
$$ plain form
15026 247413 16812 133015 -70684 67577 179070 -228870 206631 95818 -75237 132909
15015 245290 106440 562419 60746 192431 23712 71955 373464 -38026 31478 133439
15005 133439 54353 296322 80352 25365 142260 94645 -46692 283804 127450 36076 433888
14994 433888 211697 163263 328914 340480 559303 240917 251165 357227 328245 -56464
14983 252212 314592 223545 421107 212898 384317 -104776 208342 112839 63869 156405
14973 156405 469426 186852 412173 322995 333427 199543 180487 93833 -22131 241227
14962 107546 403208 638858 477970 26862 -58360 491096 306441 3673 184383 476520
14952 476520 283309 129323 440238 356878 265001 335988 63843 278118 234505 -18088 169240
14940C27336P3251R3003B17633K394L24901j42440j79407J8696R7883c51542A55423
14928B20122d6383C50618j05505j0165K94493j08471j50003j19535M71696A13091
14917A35897F4457K52791o5918R5195o4173N7181r0195L36122j25686P6094k25613
14906C10255J79308J52557B76332J98977A82430K21076K7073A30558K40621A08262
14895E12844P3232k57296k6589J8838L856K75078k45226L56113A79142J90784
14885C69926l208G4266L03869m9607j0588O3477j47029P2010L45498A36696K79290
14874D15986L31030C01421J25217j89353J4264J77746j60410e1560C35885l6459
14864B99426j18090K83668A11641L52292J73085k54752r9327l2937M06060l23558
$$ plain form
14940 327336 400587 493590 217633 220027 544928 402488 223081 241777 339660 -351542 155423
14928 220122 -46383 350618 245113 234948 529441 420970 270967 151432 623128 113091
14917 135897 64457 317248 251330 346525 282352 339533 249338 585460 459774 535868 310255
14906 310255 489563 642120 276332 475309 182430 403506 430579 130558 371179 108262
14895 512844 586076 328780 302191 321029 324885 599963 354737 710850 179142 369926
14885 369926 366718 74266 378135 328528 317940 381417 234388 306398 651896 136696 415986
14874 415986 747016 301421 426638 237285 251549 429295 268885 -51560 335885 299426
14864 299426 181336 465004 111641 463933 637018 382266 282939 250002 656062 332504
14854C32504j54492K34231J52070j7066Q8923k04405H9659L80088K05655q6446
14844E88956K7999B61945J99874j21722J40265J24289j17696K31614j81355k20709
14834C16505J57002J90069k91549K38602E2220P32429k96030J00608j29633j93547
14824B66047L47120j71937j91217r8273L81071K395p0336j1387N2786k09420J56382
14813D53231c7712H04488C22374Q3118O8149M8727j04733K02631K01817j8298
14803H03785l56205J66365k48068K26778j21709o4107r72J93694p6141j49635
14793C73785M4165j97013J31612L62721B09243J76592J26392J90315l29597N2634
14783D25579r312J36729Q3390m1575M4625P7969L6098l1270j79973j23861L61183
$$ plain form
14854 332504 178012 412243 564313 547247 636170 431765 89659 469747 675402 588956
14844 588956 616955 261945 461819 340097 480362 604651 486955 718569 537214 316505
14834 316505 473507 663576 372027 610629 52220 784649 488619 589227 459594 266047
14824 266047 613167 441230 250013 151740 532811 535206 464870 453483 506269 296849 453231
14813 453231 -37712 804488 322374 405492 473641 522368 417635 620266 822083 803785
14803 803785 447580 613945 365877 592655 470946 406839 405867 599561 523420 373785
14793 373785 417950 220937 352549 715270 209243 385835 512227 702542 372945 425579
14783 425579 416267 552996 636386 594811 639436 717405 753503 722233 542260 418399 779582
14772G79582j65482k1344B09581M83527l3706n4255j25653J09428J06456j94061
14762E01317r2263K17221J88596B54852L37693J01498m7395j49518K57528J13395
14752H68053C52684M17833j05468L60679l33624k48561J74789J49178l6957j66498
14742E64055L09417j8368J5167j39146B60687N30736j13827L4921J30577k41538
14732F01556k10996R7434K43622j42470M6457j67814M00376l7666M8949l33207
14722E46241J46988j8689J43943l65248K77990m20J98903j57234O3074O41848
14712A477396o71173p8671j58309K67133k15916K47959m1572J25206q2608o0990
14702H08455k24542J91866L71146k60235k55333J8472K86996j07241K52795k5243
$$ plain form
14772 779582 614100 592756 209581 693108 659402 605147 479494 588922 695378 501317
14762 501317 409054 626275 814871 254852 592545 694043 646648 497130 754658 868053
14752 868053 352684 770517 665049 1025728 692104 443543 618332 767510 730553 564055
14742 564055 873472 855104 870271 731125 260687 791423 677596 712517 843094 601556
14732 601556 390560 487994 731616 589146 635603 467789 868165 830499 879448 546241
14722 546241 693229 674540 818483 453235 731225 730805 929708 772474 835548 1477396
14712 1477396 806223 727552 569243 836376 620460 868419 826847 952053 869445 808455
14702 808455 583913 775779 1146925 886690 631357 649829 936825 829584 1082379 1057136
14692A057136m50016N54762J7677m87343M68433J966k65795j10444O8275N17447
14682A372098n32543J01398j35101q75L09488m1425L7983k31036k03450N01749
14672A178286j572j24819p5496L82929j84856j06936K95715k22986k60030K83832
14662A164067k48839L54090j27587k05600K46940j48084K27057o299k59297J69292
14652A165740J62376k73559j40636J68337L23209m75538K54486J3421l41225J90642
14642A047253J76525p8791j9760M958J41966p9386l09452K38559K21612Q0176
14632A423660j61419Q7409O2004k17470j49853n0246N89945n8992k90012l209
14622A231817K29736l4765j4617m6453K6138J12449l5551L4628j11424K06980
$$ plain form
14692 1057136 607120 1161882 1179559 692216 1160649 1162615 896820 786376 854651 1372098
14682 1372098 839555 940953 805852 804977 1114465 1073040 1111023 879987 676537 1178286
14672 1178286 1176714 1051895 976399 1359328 1174472 1067536 1363251 1140265 880235 1164067
14662 1164067 915228 1269318 1141731 936131 1183071 1034987 1262044 1255745 996448 1165740
14652 1165740 1328116 1054557 913921 1082258 1405467 929929 1184415 1197836 856611 1047253
14642 1047253 1223778 1144987 1125227 1130185 1272151 1192765 883313 1121872 1343484 1423660
14632 1423660 1262241 1349650 1411654 1194184 1044331 994085 1584030 1525038 1235026 1231817
14622 1231817 1461553 1426788 1412171 1365718 1391856 1504305 1468754 1503382 1391958 1598938
14612A598938J6841k47149L8432K55966l52485r195K34639j63954M33641o06504
14602A199170L39313l97395N52870L2472l85091M11886o2627j46253J92434l5645
14592A701134K01778m9403O8559j15667q6308K10015k45791q1010J04370j816
14582A705861J97426l9022j06862J81455j1100k86392M05203j15983l1738j25883
14572A772965k25317L59873K21467k35808L81679m15072r8495L48605L07240R0290
14562B507427K021j49619n2699J37442l75361K72085O0023J37056J90003m45859
14552B282519J56481K1016M92897j96365J47202J69605j1159J6632p9285Q6038
14542C085581N37469M53050J02693J98158P38762O97523Q72366J562144K938629
$$ plain form
14612 1598938 1615779 1368630 1407062 1663028 1310543 1301348 1535987 1372033 1805674 1199170
14602 1199170 1538483 1141088 1693958 1726430 1341339 1753225 1690598 1544345 1736779 1701134
14592 1701134 1902912 1853509 1922068 1806401 1720093 1930108 1684317 1603307 1707677 1705861
14582 1705861 1903287 1864265 1757403 1938858 1927758 1641366 2046569 1930586 1898848 1772965
14572 1772965 1547648 1907521 2128988 1893180 2274859 1859787 1761292 2109897 2417137 2507427
14562 2507427 2509448 2359829 2307130 2444572 2069211 2341296 2401319 2538375 2728378 2282519
14552 2282519 2439000 2460016 2952913 2756548 2903750 3073355 3062196 3078828 2999543 3085581
14542 3085581 3623050 4076100 4178793 4376951 5115713 5813236 6685602 8247746 11186375
14533A1186375M439589P143830R518977l253065j0788270p155719l975548k174466
14525D941703p65861p87768J48770n56051l31781L01714l65822j686P153n8107
14515B532264J16438l69739N35335k75472j19627N00821m17841J61176q0227j02040
14505B481088n3026L57646k70830M43166k97847J06826j64262L56572M7202k9237
14495B977298p3578L23611m28600M06754n5747N7956r0942K67960j4719j49444
14485C220549O0196O1907k6577K80693P7291q0698j66303L31383k04149J95246
14475C749538o232J71287l89446K15604J12457P1097K06642j14573j4023q982
14465C993369P1758R2121k16445L32409o1404J23926J87681l35557J36796q8482
$$ plain form
14533 11186375 15625964 22769794 32288771 29035706 18247436 11091717 7116169 4941703
14525 4941703 4175842 3388074 3536844 2980793 2649012 2950726 2584904 2583218 2590371 2532264
14515 2532264 2648702 2278963 2814298 2538826 2419199 2920020 2502179 2663355 2583128 2481088
14505 2481088 2428062 2785708 2514878 2958044 2660197 2767023 2602761 2959333 3006535 2977298
14495 2977298 2903720 3227331 2798731 3205485 3149738 3207694 3116752 3384712 3369993 3220549
14485 3220549 3280745 3342652 3316075 3596768 3674059 3593361 3427058 3758441 3554292 3749538
14475 3749538 3743306 3914593 3525147 3740751 3853208 3924305 4130947 4016374 4002351 3993369
14465 3993369 4065127 4157248 3940803 4273212 4211808 4335734 4523415 4187858 4324654 4236172
14455D236172N47420K63387j01950m82870L47667l069o189L07177p9403q1404
14445D946938M63041K37051m62313K99777j68495J53987K18306M0871j60555k5750
14435E542858P11743k31453O7482M2102j5255J23714j72416J63157K93560n3659
14425F471833p8877L79654M8371l23105M09273K86876k5011j51039L21036P9031
14415G418042k06058L88853j53108J68504K13470K78443k24315N45929m9537Q7335
14405H467558M8013Q7547M15462M0364p4166K83444k62968M33359j72237J70376
14395I436752L60921L35859o7804J67214J60597L4850M3656K64746O04306K49905
14385A1591002k75938M15249J69079J26675l7044K05427N81908L1991L94194K18932
$$ plain form
14455 4236172 4783592 5046979 4945029 4462159 4809826 4806757 4800568 5107745 5028342 4946938
14445 4946938 5409979 5647030 5184717 5484494 5315999 5469986 5688292 5729163 5568608 5542858
14435 5542858 6254601 6023148 6090630 6132732 6117477 6241191 6068775 6231932 6525492 6471833
14425 6471833 6392956 6772610 6820981 6497876 6907149 7194025 7169014 7017975 7339011 7418042
14415 7418042 7211984 7600837 7447729 7616233 7829703 8108146 7883831 8429760 8380223 8467558
14405 8467558 8515571 8603118 9018580 9058944 8984778 9268222 9005254 9438613 9266376 9436752
14395 9436752 9797673 10133532 10065728 10232942 10393539 10428389 10472045 10736791 11341097 11591002
14385 11591002 11315064 11730313 11899392 12026067 11989023 12194450 12776358 12808349 13202543 13421475
14375A3421475J9065M86764j06346N70920L4673N7865N09732L5771P72943J28382
14365A5931244J89890L53587L09389K82748K41410N21469J36678O90289J70378
14356A8827082M05408L43205L72976L51299O92075N32458K22082N75535N29174
14347B2851294O70695P6579M55617O08200N65520N90397P73606P44151P68259
14338B8104318L83298N85592R07736L19022R84909J091941Q01702J028001O70603
14329C4877122Q92176N84127J191704J209667J185627O47905R60648J703350J471766
14320D4724092R68907J619078J335724J665788J187250J722460J750211J565743
14312E6539253K178823J738779K141176J829173J992322K637414K393080L153835
$$ plain form
14375 13421475 13440540 13927304 13820958 14391878 14426551 14484416 14994148 15029919 15802862 15931244
14365 15931244 16121134 16474721 16784110 17066858 17308268 17829737 17966415 18656704 18827082
14356 18827082 19232490 19575695 19948671 20299970 20992045 21524503 21746585 22322120 22851294
14347 22851294 23521989 23598568 24054185 24662385 25227905 25818302 26591908 27336059 28104318
14338 28104318 28487616 29073208 29980944 30299966 31284875 32376816 33178518 34206519 34877122
14329 34877122 35769298 36353425 37545129 38754796 39940423 40588328 41548976 43252326 44724092
14320 44724092 45692999 47312077 48647801 50313589 51500839 53223299 54973510 56539253
14312 56539253 58718076 60456855 62598031 64427204 66419526 69056940 71450020 74603855
14304G4603855K439314K641883K903875L215101L486430L520266M216510K977390
14296A00004624M695489M462976M564615M744480N104985N518977N309842O610632
14288A41016620O053191P157990O852843P527370Q266404Q541319R038299R175611
14280B03629647R955651J0257994J1435945J1072552J2190788J2690143J3282485
14273B84515205J3787873J4065217J4270777J4645861J4009259J3577788J3093183
14266C81965163J2045063J2020430J0823879J0124327R208738P969263P545559
14259D51702422O150127L998511J060398J60651N28828l223324p473786o181965
14251D46721862q636554r416650j1026342j2015408j2869368j3413035j3353365
$$ plain form
14304 74603855 77043169 79685052 82588927 85804028 89290458 92810724 97027234 100004624
14296 100004624 104700113 109163089 113727704 118472184 123577169 129096146 134405988 141016620
14288 141016620 147069811 154227801 161080644 168608014 176874418 185415737 194454036 203629647
14280 203629647 213585298 223843292 235279237 246351789 258542577 271232720 284515205
14273 284515205 298303078 312368295 326639072 341284933 355294192 368871980 381965163
14266 381965163 394010226 406030656 416854535 426978862 436187600 444156863 451702422
14259 451702422 457852549 461851060 462911458 463072109 463600937 460377613 452903827 446721862
14251 446721862 438085308 428668658 417642316 405626908 392757540 379344505 365991140
14244C65991140j3189648j3659318j3395171j2604796j3378168j3877219j2373360
14237B73513460j2247353j2346627j1401848j0885373j0807172r637312r685729
14230A96502046r802795q918047q717129q450130p614106p104977o864483n990365
14222A33040014n614410n522808n767182m738058m650976m139419l898707m157393
14214I4551061l746269l254276l133502l480340k755939l302319k265321k659203
14206F9953892k447799k328809k342540j916316j999270k015316j575931j708965
14198E3618946j393809j645732j511120j536353j359812r18475j162900j237733
14190D2853012j729850j106009j438974m68030q05447p57573j167484q31176q77607
$$ plain form
14244 365991140 352801492 339142174 325747003 313142207 299764039 285886820 273513460
14237 273513460 261266107 248919480 237517632 226632259 215825087 206187775 196502046
14230 196502046 186699251 177781204 169064075 160613945 152999839 145894862 139030379 133040014
14222 133040014 127425604 121902796 116135614 111397556 106746580 102607161 98708454 94551061
14214 94551061 90804792 87550516 84417014 80936674 78180735 74878416 72613095 69953892
14206 69953892 67506093 65177284 62834744 60918428 58919158 56903842 55327911 53618946
14198 53618946 52225137 50579405 49068285 47531932 46172120 45253645 44090745 42853012
14190 42853012 41123162 40017153 38578179 38110149 37304702 36547129 35379645 34548469 33670862
14181C3670862j128503o95155o17032p28414p31746j062986o72452p62964l21334
14172B6950276o31479k33169r51610p81837o40953l93412o01623n51751j32503
14163B2031939o24387j63117l52124m93622n37319l06784m52984l09961n68427
14154A8223214p1946k72029m52827n93399j45831k13602m37530k67638P3822p56331
14144A5085903k5652m40738j05146j83436J64509p59646k41369k34605p236j20961
14134A3131623j98664n02945J23818m80127j92k45015l35355J58434k90229n29537
14124A0831811K15830m32057k18257O4780k14846J66607n91634j73604K21184
14115I869814k39104n07344J45320L4607l39182K42323l02938l5623k74367k50368
$$ plain form
14181 33670862 32542359 31847204 31230172 30501758 29770012 28707026 28034574 27271610 26950276
14172 26950276 26318797 26085628 25134018 24352181 23711228 23317816 22716193 22164442 22031939
14163 22031939 21407552 21244435 20892311 20398689 19861370 19554586 19101602 18791641 18223214
14154 18223214 18151268 17879239 17426412 16833013 16687182 16473580 16036050 15768412 15842234 15085903
14144 15085903 15060251 14619513 14514367 14330931 14495440 13735794 13494425 13259820 13252584 13131623
14134 13131623 12932959 12430014 12553832 12073705 12073513 11828498 11493143 11651577 11361348 10831811
14124 10831811 11047641 10615584 10397327 10462107 10247261 10413868 9822234 9648630 9869814
14115 9869814 9630710 9123366 9268686 9303293 8964111 9206434 8903496 8867873 8593506 8343138
14105H343138K43515k26967k21403J04449m42675j54335m4740k98685K01693K37150
14095G741140l29036l25898j69464N7023L6918k73722O1382R0590m43998K62109
14085F707044n16555K22640k21897K3770o8722J54122k52715R9496j85194l07640
14075E654349K64202K84072n22893o4654k8850j6490K69963k69122l33314L3652
14065E270915l9366M0604p4703k84534M5316l74165L86448k86569j08294J3308
14055D588960J48327j40533k52207J6547K15053m03065J53251J19636K38894j40098
14045D544765r2016j722k23355J39110k03549k50204J72090k19058K47597j15159
14035C998499R0615j35915K8k12486k44744J22290k31889K79109j99689k09204
$$ plain form
14105 8343138 8586653 8359686 8138283 8242732 7800057 7645722 7600982 7302297 7503990 7741140
14095 7741140 7412104 7086206 6916742 6973765 7010683 6736961 6798343 6888933 6444935 6707044
14085 6707044 6190489 6413129 6191232 6215002 6146280 6300402 6047687 6147183 5961989 5654349
14075 5654349 5918551 6202623 5679730 5615076 5586226 5569736 5839699 5570577 5237263 5270915
14065 5270915 5231549 5272153 5197450 4912916 4958232 4584067 4970515 4683946 4575652 4588960
14055 4588960 4737287 4596754 4344547 4361094 4576147 4173082 4326333 4445969 4684863 4544765
14045 4544765 4452749 4451027 4227672 4366782 4163233 3913029 4085119 3866061 4113658 3998499
14035 3998499 4089114 3953199 3953227 3740741 3495997 3618287 3386398 3665507 3465818 3256614
14025C256614K14390L0409j77719J41644K339q2241k91205K59950J96677l92752
14015C158106K70896P211r6345p01090L68506p5150O655J0977k7657J93786r494
14004C106401o50781L62240k78335K97224P7277k36321j95596K38965k06072K30558
13994B745560n5467o31J26701o73087N57045o5908j49185L3125J67258q2426n7998
13983B544987L61624m03501L88051l29465O11072J02242L87553L03420J419915
13974E385898J779551L826831O462897J0362090K278571r065048o761820m393820
13966I875150k269952j632660p47079p04975k64603n4473m09992n11859j15761
13957C163796n0315L12908j76484l69258j50856J0905J8057k82856k99953M8155
$$ plain form
14025 3256614 3471004 3501413 3323694 3465338 3467677 3385436 3094231 3354181 3550858 3158106
14015 3158106 3429002 3436213 3339868 2638778 3007284 2932134 2938789 2949766 2922109 3115895 3106401
14004 3106401 2455620 2817860 2539525 2836749 2914026 2677705 2482109 2721074 2515002 2745560
13994 2745560 2690093 2689462 2816163 2143076 2700121 2634213 2485028 2518153 2685411 2602985 2544987
13983 2544987 2906611 2503110 2891161 2561696 3172768 3275010 3662563 3965983 5385898
13974 5385898 7165449 10992280 17455177 27817267 30095838 21030790 14268970 9875150
13966 9875150 7605198 5972538 5225459 4520484 4255881 4201408 3791416 3279557 3163796
13957 3163796 3113481 3426389 3249905 2880647 2729791 2740696 2758753 2475897 2175944 2224099
13947B224099L79217m55987K24606q2013K97985o49800K46j36642K46614O2111
13937B110436K4434m24015N31064J93301o24162m4387K25621K08186k53537J5771
13927A962712j85130j65303L07423K97660l87213K22814q7903l70755J34217N1357
13917A779879n0914K31599l60068K32792l18300L25256j97471K1072N7064O3147
13907A784056j83220J94286k24762K03892J8036j7452J21861j98972j10372o9121
13897A518232j02442J19839J90439m84794L49116m516J27243r5823m3089K03514
13887A777719m47071J99842j13852M33948n13918L14659l90619J51935M6538j69154
13877A290027j25115L40472l42362L16978m72118J50848M3150j92212L74418j43599
$$ plain form
13947 2224099 2603316 2147329 2371935 2289922 2587907 1938107 1938353 1801711 2048325 2110436
13937 2110436 2134870 1710855 2241919 2435220 1811058 1766671 1992292 2200478 1946941 1962712
13927 1962712 1777582 1612279 1919702 2217362 1830149 2052963 1965060 1594305 1728522 1779879
13917 1779879 1728965 1960564 1600496 1833288 1514988 1840244 1642773 1663845 1720909 1784056
13907 1784056 1600836 1795122 1570360 1774252 1792288 1774836 1896697 1697725 1587353 1518232
13897 1518232 1415790 1535629 1726068 1241274 1590390 1585874 1713117 1617294 1574205 1777719
13887 1777719 1330648 1530490 1416638 1850586 1336668 1651327 1260708 1412643 1459181 1290027
13877 1290027 1164912 1505384 1163022 1480000 1007882 1158730 1201880 1009668 1384086 1240487
13867A240487j1517J23625L5793l26317p5577J70807R9224K3719O5904j96871
13857A149277n3447n0745K63600J48266m71532J82066n9806K28459J03151k66458
13847A172831j42107J24946J03785K13323k72159P3897j31009n0666J45024n0328
13837A187537k48238K93240j24738n0114P2075l40602L11727n7552k1339J36489
13827A158485j35827L38972o08702L85076j94087l03301K7250L54129J92505k69920
13817I44580J88030k18559L21947l29386J43008j08463j5633K7898j01349K86291
13807A138364n6723j00519l08806L97561q2453r4762j30791R9424k87278M69712
13797A043729J89914n10549j45591L23845N6442Q7414p1711k21041O94979m25138
$$ plain form
13867 1240487 1228970 1352595 1388388 1062071 986494 1157301 1256525 1280244 1346148 1149277
13857 1149277 1095830 1045085 1308685 1456951 985419 1167485 1107679 1336138 1439289 1172831
13847 1172831 1030724 1155670 1259455 1472778 1200619 1274516 1143507 1092841 1237865 1187537
13837 1187537 939299 1232539 1107801 1057687 1129762 789160 1100887 1043335 1021996 1158485
13827 1158485 1022658 1361630 752928 1138004 943917 640616 667866 1021995 1214500 944580
13817 944580 1132610 914051 1235998 906612 1049620 941157 925524 953422 852073 1138364
13807 1138364 1081641 981122 672316 1069877 987424 892662 761871 861295 574017 1043729
13797 1043729 1233643 723094 577503 901348 957790 1045204 973493 752452 1447431 1022293
13787A022293j05910m1833l2856N9374R6544D18422K72431K23882k8886k47393
13777F38456J94552j24901K05754k59932K75258J34473l22075K21897k08861M00562
13767A155183l64166J42075l04867N62655l60565l36877M49361q9745q9053K41216
13757A005217k28170j796Q0752N7834m9910k20364L67511j16004l70462J78024
13747G02632J15967J08013q1163p8036o8206l2120l9691K2528K50848j09822O2346
13736H53296l92839O3301J35842L20097m20444P2287J31808J7308O1671k92161
13726E50166L10524L4463M0196k52430K2799j76461L39003k02593M8286j09382
13716F04571L61724k07687M2799k25514J6151J819J89492k56614L59009j69295
$$ plain form
13787 1022293 916383 874550 841694 901068 997612 418422 690853 914735 885849 638456
13777 638456 833008 708107 913861 653929 929187 1063660 741585 963482 754621 1155183
13767 1155183 791017 933092 628225 1190880 830315 493438 942799 853054 764001 1005217
13757 1005217 777047 775251 856003 913837 863927 643563 1011074 895070 524608 702632
13747 702632 818599 926612 845449 767413 699207 667087 627396 649924 900772 790950 853296
13736 853296 460457 523758 659600 979697 559253 631540 763348 780656 842327 550166
13726 550166 860690 895153 935349 682919 705718 529257 868260 665667 713953 604571
13716 604571 966295 758608 801407 575893 592044 593863 783355 526741 885750 716455
13706G16455K070j42906j196n8740K37360K67171k86253l28078N65790D32808
13695F84876N4273r1833L95987D48890m9566q6472L70846l17344K07808I8468
13684G50608C23339K76082B43940K90139q324J49081J32681l82900p1702L7828
13674C90743P2951M5314J61702B33387J36471m523N4502J19366J959A80941L31169
13663E12110k7605A94990J18393J21956K16277J28681l19504j26311J28775j12015
13653C51242p6114R8244M8271N8925q7853L82799k75373l9839O6691K81153l14040
13642D94106L7460n6154j50229J12299j1377O9292L47227p0295j32876j40192
13632D99261o5424L8142K81303H2691K29129N31895C80197K42953j08583K56152
$$ plain form
13706 716455 718525 575619 574423 515683 753043 1020214 733961 405883 971673 432808
13695 684876 739149 647316 1043303 448890 399324 312852 683698 366354 574162 98468
13684 750608 323339 599421 243940 534079 525755 674836 807517 424617 352915 390743
13674 390743 463694 509008 670710 233387 369858 365335 419837 539203 541162 180941 512110
13663 512110 484505 194990 313383 435339 651616 780297 460793 334482 463257 351242
13653 351242 275128 373372 421643 480568 392715 775514 500141 460302 526993 808146 494106
13642 494106 531566 475412 325183 437482 426105 495397 842624 772329 639453 499261
13632 499261 433837 471979 753282 82691 311820 843715 380197 623150 514567 770719
13622G70719C76171J89128k65834L23625k64683J67267B35387P4774Q4764K65584
13612F60509p1882k12220J07596q6132K24946j40512J3285K20600J39565A05627
13601C06337J58447K3831B03502L42227j85198m5422j44764M22162r9325A58936
13590E58653j84106o2269O4679M6536J11331P4909B25245N3661J30348C1257K72876
13579C04133K92805j97263J95029B7627N54460A31396L30081N972k9199j76563
13569B61687m604J08488D5684J19319O0821L15355B15738H0591K34158q4546o9595
13558A60608P6582p0699m6500K30169n8937J31161A85779N3405l9875L43936B14069
13546B12014J41744j59619l6034L94679j88035j65107J3920n0346L0971K77043
$$ plain form
13622 770719 376171 565299 299465 623090 358407 525674 235387 310161 394925 660509
13612 660509 588627 376407 484003 397871 622817 482305 495590 716190 855755 105627
13601 306337 464784 488615 203502 545729 360531 315109 170345 592507 493182 158936
13590 558653 374547 312278 376957 423493 534824 609733 225245 278906 409254 31257 304133
13579 304133 596938 399675 594704 27627 582087 131396 461477 467449 438250 261687
13569 261687 257083 365571 45684 165003 225824 541179 215738 80591 314749 230203 160608
13558 160608 237190 166491 119991 350160 291223 422384 185779 239184 199309 543245 214069
13546 212014 353758 194139 158105 552784 364749 199642 213562 163216 194187 471230
13536D71230j25357j20138L46780O4458l08902G7300K69478L31009k87199B8267
13525C49090r1820J05808K66411l03868n6559M48585C03449P2842K74745H1429
13514B0552K9255L29063n0390J05726j47905H6050N49564E338K16601J77739N9231
13503D58909E9928N45559j43277n9243j41332q6802L00982B21369N67707C07013
13492A35657L0997C5802I75c5785C87299A83453M19138A49823o4432L10559k5920
13481C70030A59384K23274D9156a72339B22073J39309p5856M4204j23980O8842
13471B74592o8884j1317L76569k55482l401A14026N27993k34528N8858M8174A76681
13459B31502P4170J0444M8710d8503A74053K72129j17343d288o3061D62633m0455
$$ plain form
13536 471230 345873 225735 572515 636973 328071 77300 346778 677787 390588 28267
13525 349090 257270 363078 629489 325621 269062 717647 303449 376291 651036 81429
13514 20552 49807 378870 328480 434206 286301 86050 635614 5338 221939 399678 458909
13503 458909 59928 605487 462210 402967 261635 174833 475815 221369 789076 307013
13492 135657 166654 35802 975 -35785 387299 183453 602591 149823 85391 395950 370030
13481 370030 159384 382658 49156 -172339 222073 361382 285526 329730 205750 274592
13471 274592 205708 194391 570960 315478 312077 114026 642019 407491 466349 514523 176681
13459 231502 305672 316116 364826 -48503 174053 446182 328839 -4288 -67349 462633 422178
13448D22178j406j67345J10817O1109C4712K66939L4071B9339o285L47026J34062
13437E04142q8670O3314r7026J08464A16835l7553K45147b1518E50989a0318F01999
13425B62847o5092K71254j67637J35133o6150k0131l372g9952E6417K33136I0296
13413A03267J13636j02232K62360j35863L4259A16290J8058K62204A15353J99676
13403C15029j3659o8117h1672D07845j61156J2710A10908J00695l7875K85523
13393D59251A97006E6554K49635b0739D90873a88649C3888P715R0164J18209M7440
13382B97416O074j16766K01585A81504P3781E5574J37467l4010K50863g8927A52758
13370a20806A36987J28736e9156p1038l9117D53624A85612B6518J2764J71501
$$ plain form
13448 422178 420772 253427 364244 425353 34712 301651 335722 29339 23054 370080 504142
13437 504142 415472 478786 381760 490224 116835 79282 324429 -21518 550989 -10318 601999
13425 262847 197755 469009 301372 436505 370355 350224 346852 -79952 56417 289553 90296
13413 103267 216903 114671 377031 241168 275427 116290 134348 396552 115353 315029
13403 315029 301370 233253 -81672 407845 246689 259399 110908 211603 173728 459251
13393 459251 197006 56554 306189 -20739 490873 -188649 33888 41603 131767 249976 297416
13382 297416 303490 186724 388309 181504 255285 55574 193041 159031 409894 -78927 152758
13370 -120806 136987 265723 -59156 -130194 -169311 453624 185612 26518 39282 210783
13360B10783A00181m7424L2544A6996b8473B35575A05229P4015K05373n8579q716
13349C17322A11186J42414J50818j75029a21531C57359q4226J85582A88889J816
13339A90705g8936C75928D9461L06002O0550A14014K1625M47215A90354M7508
13329B37862o3777N7322F6011M08727k01332M09237A89064P9810j11231c857D3051
13317A36382K40421m8397A01256K86059I2559J06485g005p8464B08648D4540K50699
13306B95239J51597j2295F4491K45540k543j0522j38731e4817C00109o3682a19961
13294B55297J23153A63720L96020A75973C0829K9841O38437A99343I3011G945
13283C58263A46262Q987K73110A30220K71175p4395A44307R7720j10333n4316
$$ plain form
13360 210783 100181 52757 85301 16996 -28473 235575 105229 179244 384617 326038 317322
13349 317322 111186 253600 404418 229389 -121531 357359 273133 458715 188889 190705
13339 190705 -78936 375928 49461 355463 416013 114014 135639 582854 190354 237862
13329 237862 174085 231407 66011 474738 273406 682643 189064 268874 157643 -3857 43051
13317 136382 376803 328406 101256 387315 92559 199044 -7005 -85469 208648 44540 295239
13306 295239 446836 434541 64491 310031 307488 296966 158235 -54817 300109 236427 -119961
13294 255297 378450 163720 559740 175973 30829 60670 699107 199343 93011 7945
13283 358263 146262 155249 428359 130220 401395 327000 144307 242027 131694 77378
13273G7378a43570C88803r4124C2050L19082a10281e554B81288A17921K54081
13263C72002a68943C95494b9235H1670b2090h42H1709k9511J84017J26142E8757
13251A78797J62101a29212I3875k6820J59090a7469B7826K54497o5161a77977
13240B67703n9431J82122a45236B1025d5772J1521p5780B01726J20903j04634
13230B17995K78908I6856e9279B18468C6800P615J33574P0034b86461e3815m0273
13219i4088J8328F2073e5438A67359N3855B7901K00985G5338L31519j71378h889
13207A79870m8511g6649C60298E2106c6546A31158m7109K06479h5607b4299j49741
13196a74040B816J51032G6239L8318C7184N4694K41135P9009C9427K37386j2448
$$ plain form
13273 77378 -143570 388803 294679 32050 351132 -110281 -5554 281288 117921 372002
13263 372002 -168943 395494 -29235 81670 -22090 -842 81709 52198 236215 362357 58757
13251 178797 340898 -129212 93875 67055 226145 -17469 27826 282323 217162 -177977
13240 267703 208272 390394 -145236 21025 -45772 -34251 -110031 201726 322629 217995
13230 217995 496903 96856 -59279 218468 36800 44415 177989 248023 -286461 -53815 -94088
13219 -94088 -75760 62073 -55438 167359 221214 27901 228886 75338 406857 235479 -8889
13207 179870 131359 -76649 360298 52106 -36546 131158 84049 290528 -85607 -24299 -174040
13196 -174040 2816 153848 76239 114557 37184 91878 333013 412022 39427 276813 264365
13185B64365B2451J04533F0090J94911A9422a15914C56426A16817n0402K70599
13175C37014A27088a02717C24745A24523J77298j10406H6880N0622c10750G2452
13164A13929L462c6872L613C49896A42376i3046A02189K8235L60E2177J44046
13153A96223d435B21457q8444K47467h9869J9329B51186q4466J30520a30115c1882
13141A99904I545R7954D0508p293a34624B85452A5039Q2926a17404A70711G3298
13129F005J26308i2647A48739o7074J29920R6992g8619D44580j61466b05415C24050
13117H9214K83264n062h778C84661j08935K764c13958C2599q481K52936l2499
13106B44555E2151O0904L7269K5819a13080H2337J64459C8810O3610a50565m8086
$$ plain form
13185 264365 22451 126984 60090 255001 19422 -115914 356426 116817 66415 337014
13175 337014 127088 -102717 324745 124523 301821 191415 86880 137502 -310750 72452
13164 113929 117391 -36872 -33259 349896 142376 -93046 102189 130424 130784 52177 196223
13153 196223 -4435 221457 133013 380480 -89869 -70540 251186 166720 297240 -130115 -31882
13141 199904 9545 107499 40508 33215 -134624 285452 15039 97965 -117404 170711 73298
13129 6005 132313 -92647 148739 81665 211585 308577 -78619 444580 283114 -205415 324050
13117 89214 372478 367416 -8778 384661 275726 278490 -313958 32599 24118 277054 244555
13106 244555 52151 113055 150324 176143 -113080 82337 246796 38810 102420 -150565 -198651
13095a98651e3339k5169B82074a4612C00059F9803c86687C23360A35205a17233
13084D4877K31878J23424A03835K31999H4324Q7468a1119B42867a01168G6843
13073a12337A23397h0571C73955a46579j15079C56987g7959A56183J00379m7096
13063B09466p6526M5766K123J4272M1368J51888A39727P8406a3090o0816l7576
13052a11482C98241a14666G1503k4847N0760J17885K1718M304b04323D9488Q2725
13041A32213b5731B07975C5935L79118R1861C7502J80469M6310a84035B02678
13030A60426g2355H8726K06301a59899D51892f2869B31847f9679A67134B6014
13019A69206a68443A85850G3111k4782B0106h5557F46206a1118B5365J99745a0910
$$ plain form
13095 -198651 -53339 -78508 282074 -14612 300059 69803 -386687 323360 135205 -117233
13084 44877 276755 400179 103835 335834 84324 171792 -11119 242867 -101168 76843
13073 -112337 123397 -80571 373955 -146579 -261658 356987 -77959 156183 256562 209466
13063 209466 132940 178706 180829 195101 236469 388357 139727 218133 -13090 -73906 -111482
13052 -111482 398241 -114666 71503 46656 97416 215301 237019 241323 -204323 49488 132213
13041 132213 -25731 207975 35935 415053 506914 37502 217971 264281 -184035 202678
13030 160426 -72355 88726 295027 -159899 451892 -62869 231847 -69679 167134 26014
13019 169206 -168443 185850 73111 48329 20106 -85557 646206 -11118 25365 225110 -10910
13007B1617K86695n2173j02837K8777b5508B84480L5467b0638B73565r9974a4620
12995D1492c6957B25891o6388G4360l2153J94107d2915G7909O8756J93635D1250
12983A19525a4243j0171p8260B3025Q0247E0615b55907A40951l3758N8580a58259
12971I0728b56620i4849C39997J16379A19521J24594c06374A05116M5156d8139
12960A53544J56519j17973r3019g0317K8089j00379H7060c37451C76753C1094
12949A95768k4058J85919J769F6079b0160C97291j41128K58384b14246A07076
12938A87937b3973A25317m5777h6607F7841K1761b22204B7973J40393F2082b0969
12926a22711e4086j55760i5336Q503F6849j836P3635f9371D04807C9861K05510
$$ plain form
13007 21617 308312 256139 153302 182079 -25508 284480 319947 -20638 273565 173591 -14620
12995 41492 -36957 225891 159503 74360 42207 236314 -42915 77909 146665 340300 41250
12983 119525 -14243 -24414 -102674 23025 103272 50615 -255907 140951 107193 165773 -158259
12971 90728 -256620 -94849 339997 456376 119521 244115 -306374 105116 150272 -48139
12960 153544 310063 192090 99071 -70317 -42228 -142607 87060 -337451 376753 31094
12949 195768 171710 357629 359398 66079 -20160 397291 256163 514547 -214246 107076
12938 187937 -23973 125317 79540 -86607 67841 89602 -222204 27973 168366 62082 -20969
12926 -122711 -54086 -209846 -95336 -86833 66849 65013 138648 -69371 404807 39861 245371
12915B45371a09422e4465A4581a8783H5448a96476i1583j6876B24623b43880D2297
12903b97606A25887J36578e0888e973j59737b299q0318B48541a58311N8103E5335
12891B9027a18012e3827j83409c3361E0630Q4728L264B6637L6432N659f1806k7203
12879h9009A02853N1678R3158A9350L31767H4905a36585O4343n7178D03077a83032
12867A39622I889a05352A21179P4167H1578a11574H3936K17942A49677b6836D7800
12855A48466M8098e0630B45863b85671B01228m7969d4771D44027C9869J30814
12845A70683Q0048R0514q6705a24731a0964A93842D8401b06970O8633C5525O5595
12834A01120r596b00040B22393a24665N3228k7373G3412i3521G1299d8818l3373
$$ plain form
12915 245371 -109422 -54465 14581 -18783 85448 -196476 -91583 -108459 224623 -243880 42297
12903 -297606 125887 262465 -50888 -5973 -165710 -2299 -82617 248541 -158311 -100208 55335
12891 29027 -118012 -53827 -237236 -33361 50630 135358 138622 26637 63069 68728 -61806 -89009
12879 -89009 102853 154531 247689 19350 351117 84905 -136585 -72242 -129420 403077 -183032
12867 139622 9889 -105352 121179 195346 81578 -111574 83936 301878 149677 -26836 47800
12855 148466 196564 -50630 245863 -285671 201228 153259 -44771 444027 39869 170683
12845 170683 250731 341245 254540 -124731 -10964 193842 48401 -206970 -138337 35525 101120
12834 101120 91524 -200040 222393 -124665 -71437 -98810 73412 -93521 71299 -48818 -82191
12823h2191A55729c13270J42195g6454A35211e6819K2900j89209e1244j70124
12813b21368k38965D35520b42446O4353j66022D8418c3246G5287e0313A65125
12802A75653F2725c4467j49315c1026j9414E9176e2518B19330G8444K6630h7200
12790a30675B16626a53746E0783a53598J5259b0274r9903e0706C9324J45696N5788
12779B40808e947B01674B8124a30490P737M1972B02841k0512p0389d6280B99359
12767d03867A61520L8870f5583l5623A49277N4461p1565l8182K5492a33600B27663
12755c7763H4997M3515K94652A01422A9556M00184j75169d2440D4518b03532A09975
12743A70118J27745n3299L9615C5819a45713C51156a99490A25893n1177a30299
$$ plain form
12823 -82191 155729 -313270 -171075 -76454 135211 -56819 -33919 -223128 -51244 -221368
12813 -221368 -460333 435520 -242446 -178093 -344115 48418 -33246 75287 -50313 165125
12802 175653 62725 -34467 -183782 -31026 -50440 59176 -52518 219330 78444 105074 -87200
12790 -130675 216626 -153746 50783 -153598 -138339 -20274 -120177 -50706 39324 185020 240808
12779 240808 -5947 201674 28124 -130490 -122753 -80781 202841 182329 111940 -46280 299359
12767 -403867 161520 200390 -65583 -101206 149277 203738 132173 93991 119483 -133600 227663
12755 -37763 84997 128512 423164 101422 19556 419740 244571 -42440 44518 -203532 109975
12743 170118 297863 244564 284179 35819 -145713 351156 -199490 125893 74716 -130299
12732b0175m8824A05177b57516A65277K20382j63854a13749E5772R2983J25691
12722B74446A13805a14421A37489a13450D21010I0523J25006C255J03734J69531
12712B76520p878I5184c76287C60354b3680A08693j8605a72411a5793A0368K6010
12701C6378R2653o074Q1269a54590f9825C27743A61294F6590b9178B58405R4735
12690C53140h8909B53514f6942K4898A41810e5645C53963D0311J55730O1218j7861
12679B39398b03685A05558a15551a0534F3249g5556p2188A85648b85810A27498
12668B30727a33282b7059j18023B2232c4444B3443J02690M0127J08299K5976G8534
12656A45323p76M154B8186J97148h0986j02515f7779B90896c31373A98754K53392
$$ plain form
12732 -20175 -68999 105177 -257516 165277 385659 221805 -113749 55772 148755 274446
12722 274446 113805 -114421 137489 -113450 421010 90523 215529 3255 106989 276520
12712 276520 268642 95184 -376287 360354 -23680 108693 90088 -172411 -15793 10368 36378
12701 36378 129031 122957 204226 -154590 -69825 327743 161294 66590 -29178 258405 353140
12690 353140 -88909 253514 -66942 -42044 141810 -55645 353963 40311 196041 257259 239398
12679 239398 -203685 105558 -115551 -10534 63249 -75556 -147744 185648 -285810 127498
12668 230727 -133282 -27059 -145082 22232 -34444 23443 126133 166260 274559 300535 78534
12656 145323 144547 148701 28186 225334 -80986 -183501 -67779 290896 -331373 198754 452146
12645D52146g0648A84811J56332k2368H9205J59040i8201B96587R8308A17787
12634B56876C332P1254K1872b378j81050j68776A56024a1966F9475b27260B96900
12622A53150C582J36487a84785f4042C94315B162K45357J867E7706J33503L61287
12611E52496j34479A98582b6320H8986M44302B53622i46H8330J53155q9428a2023
12599C14569r3144e6626r9395A82022a91888A9178a84514C57343b27425B29670
12588i5566A76704D7622f7056C7443a99693B63679O0560D6113a61081C15637D1403
12576a0206A67487a60876A33720d4972D8634f0733E7171J81630a11133a9434B0831
12564c5869l192h801A5852a26922A72233b0150B71096A4607L96429b26609D3659
$$ plain form
12645 452146 -70648 184811 341143 318775 89205 248245 -98201 296587 394895 117787
12634 256876 3332 74586 96458 -2378 -183428 -352204 156024 -11966 69475 -227260 296900
12622 153150 3582 140069 -184785 -64042 394315 2162 247519 249386 57706 191209 552496
12611 552496 418017 198582 -26320 88986 533288 253622 -946 88330 241485 152057 -12023
12599 314569 221425 -56626 -156021 182022 -191888 19178 -184514 357343 -227425 229670
12588 -95566 176704 47622 -67056 37443 -199693 263679 324239 46113 -161081 315637 41403
12576 -10206 167487 -160876 133720 -44972 48634 -60733 57171 238801 -111133 -19434 20831
12564 -35869 -39061 -8801 15852 -126922 172233 -20150 271096 14607 411036 -226609 43659
12552A94987i9305a7449r6859C9510R478b3257A19776K5989J9855f699D3322P7431
12540A20753a08813j87838B6040R7709a52654A6166M1558K35693c0383A22457
12529c8157E8127J97856a09872E6531J50219i3641A10019P6224l5403h5397A43007
12517b41303A59668a43342A11754E364R029e7106j84764A23708a55753A18015
12506B10721d3157A0008a94162c5414D217i2907j02955R2967A0102a50929H6855
12494f4519A74971J8414c48051C35226A18082a36179O989A11600f9321A83959
12483E8233b8617m8069B6742a84690k02725J82280e919q3878A55648Q5303a3904
12471a39356p697B63650C5858f4078p9028D461J73339b078I8463e6572A4398e6823
$$ plain form
12552 194987 -99305 -17449 -114308 39510 48988 -23257 119776 145765 165620 -6699 43322 120753
12540 120753 -108813 -296651 26040 123749 -152654 16166 57724 293417 -30383 122457
12529 -38157 58127 255983 -109872 56531 206750 -93641 110019 186243 150840 -85397 143007
12517 -241303 159668 -143342 111754 5364 14393 -57106 -241870 123708 -155753 118015
12506 210721 -43157 10008 -194162 -35414 4217 -92907 -195862 -102895 10102 -150929 86855
12494 -64519 174971 193385 -348051 335226 118082 -136179 -129190 111600 -69321 183959
12483 58233 -28617 -76686 26742 -184690 -387415 -205135 -5919 -89797 155648 240951 -13904
12471 -139356 -147053 263650 35858 -64078 -143106 4461 177800 -2078 98463 -56572 14398 -56823
12458a00459j92419G3116M0039n6418d4025B19044g466m7043j5393F7664J07909
12447A75573b6804E0217n172J80504I6806g6710B37604o8153N1061C7109d9160
12435a45806A91902l8946c7561A5211a53969A06195a74040j75331F9078a40792
12424g7781j21396G3801M6050J30719A13485d0767j36635P3924a2389A25685b93734
12412a69672J6792A39639F0510Q100B5808J70215B8966c35925f8820l02097A18558
12400a21814j85006f6652A08297i8878j95432A30361f8753B25458P0715H1903
12389A42608a11789j08764A78639C9420L1668a29991A47617C5620b05815C11207
12378f190B49143B3546K15905J45612b29369D29588b82293h4548k3931B2338K78182
$$ plain form
12458 -100459 -292878 73116 113155 56737 -44025 219044 -7466 -54509 -69902 67664 175573
12447 175573 -26804 50217 45045 225549 96806 -76710 237604 169451 220512 37109 -49160
12435 -145806 191902 152956 -37561 15211 -153969 106195 -174040 -349371 69078 -140792
12424 -77781 -199177 73801 119851 250570 113485 -40767 -177402 -103478 -12389 125685 -293734
12412 -169672 -152880 139639 60510 68610 25808 196023 28966 -335925 -68820 -370917 118558
12400 -121814 -306820 -66652 108297 -98878 -294310 130361 -68753 225458 296173 81903
12389 142608 -111789 -220553 178639 39420 71088 -129991 147617 35620 -205815 311207
12378 -6190 249143 23546 239451 385063 -229369 429588 -282293 -84548 -108479 22338 300520
12367C00520a60256A14335k4996B7974f5662p0603k39816B4950a33393a6771j01311
12356a18082k40609D3037d2751j33484J5438G2361d65757B7325J91974a39287
12345a92635M7461m2175E3834i9196j90542D60163A6533J95379I0774N7610g5757
12333B21353B4279J04278P0151p8428h219A53878J443g8414C7979i804m5633A27195
12320b8685n1774B3366M013K61363D3707R1665b72800a02769p3167j51934A00701
12308d0416j22670g4979k55186B17271b74835B97199E5533a37949O4633C14925
12297b37112B2000a51045B04817K20861b3564B951K95462a70117B16728r7417
12287A19311f4316D0122a17418F2145b41347A14472K17951k7983d1656C64919
$$ plain form
12367 300520 -160256 114335 89339 27974 -65662 -136265 -376081 24950 -133393 -16771 -118082
12356 -118082 -358691 43037 -42751 -176235 -160797 72361 -465757 27325 219299 -139287
12345 -192635 -145174 -187349 53834 -99196 -289738 460163 16533 211912 90774 148384 -75757
12333 221353 24279 128557 198708 120280 -8219 153878 155321 -78414 37979 -9804 -55437 127195
12320 -28685 -80459 23366 27379 288742 43707 135372 -272800 -102769 -175936 -327870 100701
12308 -40416 -163086 -74979 -330165 217271 -274835 297199 55533 -137949 -73316 314925
12297 -237112 22000 -151045 204817 425678 -23564 2951 298413 -170117 216728 119311
12287 119311 -64316 40122 -117418 62145 -241347 114472 332423 304440 -41656 364919
12276b27139q9316a5038m9528A92123O5816c06890A91764l4868B8843l320K16312
12265B41835o1037A1929b9402G2878b5124m3725C5158J19134b11580Q2297A37522
12253D23177E432J5313Q6069h0616k357B39750B8742J63427c5550C86059a83015
12241D2880L81999A60575a17885A66425H532K67646j32485M994o9338a6662n7035
12230g3697j1840q873B03878I8898D6154a257A85109q6789D6452O0178a6453A30319
12217B32358K7788q6706n2226j5070J21731f7439D79079b2142q450A67365a0140
12205C9350b42739B76690r5778a35813A32942n4728K6424M11745k31880m4822
12195B39681K12215A22103l3451J98380j35667c83445A55382g8809E2298J65362
$$ plain form
12276 -227139 -316455 -15038 -64566 192123 257939 -306890 191764 156896 28843 25523 241835
12265 241835 180798 11929 -29402 72878 -25124 -68849 35158 154292 -211580 -129283 137522
12253 423177 5432 20745 106814 -80616 -82973 239750 28742 192169 -35550 386059 -183015
12241 42880 424879 160575 -117885 166425 8532 276178 143693 148687 79349 -16662 -73697
12230 -73697 -85537 -94410 203878 98898 46154 -1257 185109 98320 46452 106630 -16453 130319
12217 232358 260146 173440 121214 106144 227875 -67439 479079 -22142 -30592 167365 -10140
12205 39350 -242739 276690 180912 -135813 132942 78214 104638 516383 284503 239681
12195 239681 451896 122103 88652 287032 151365 -383445 155382 -78809 52298 217660
12185B17660h0891C95759j45937p3205A353P9233f2204B22113j8741P01e4266
12173F199R1005J40155q3704J89969a25765A57059k2144R0498a54991I5882B0160
12161A98848n9246B2943K89957K6295J43727A61928A8274a66187F37670h9955
12150I8178d4941C339K31147J61274F6902B3515N0283b29287B68751o2537a06354
12138e5059A25493A2768d0165a6137G2438N7463j9464J35362f5902j50718k0745
12127b37365A02553L45199H4227b9814k59992C22548C5163A0358J2701f889D1050
12115b90553C0847h1597A26388J52945o2306a07002A67400J588a03863k22952
12105c26815C70929I9981b41789A99302F6373b55787I1571c19342a30372I9684
$$ plain form
12185 217660 -80891 395759 249822 176617 1353 80586 -62204 222113 203372 204073 -54266
12173 6199 97204 237359 153655 343624 -125765 157059 134915 225413 -154991 95882 20160
12161 198848 139602 22943 312900 339195 482922 161928 18274 -166187 637670 -89955
12150 98178 -44941 3339 234486 395760 66902 23515 73798 -229287 268751 206214 -106354
12138 -55059 125493 12768 -40165 -16137 72438 129901 110437 245799 -65902 -216620 -237365
12127 -237365 102553 447752 84227 -29814 -289806 322548 35163 10358 23059 -6889 41050
12115 -290553 30847 -81597 126388 279333 217027 -107002 167400 168988 -103863 -326815
12105 -326815 370929 99981 -241789 199302 66373 -255787 91571 -319342 -130372 99684
12094F8594a42132b376j62400A15994J0674l3076a58869j53940M7466A7519K51702
12083B69221G171J14079n1357J039d8840A48110R6292a63741b3571j41300r2593
12072b57464A18649a01936N755A19234c58681a26364f024j605B71620l2441B4644
12060B32199L00944N3648K85653L84592C44308B9553K09205j16832e3981k30835
12050b84816A52895N0677a5702B30064A0449K32802a65088A73973D7076b11400
12039F9424K24537a72208F0326L6607J08636J23861b0797A05186C5283h5016A90233
12027D9903a77328F3814g5392B51322a03868j34916c4239A05901d28952a24069
12016D2054c1511k36101J973J27162M3756J255r990m456B60323e4463A8733K06575
$$ plain form
12094 68594 -142132 -2376 -164776 115994 126668 93592 -158869 -312809 -265343 17519 269221
12083 269221 7171 121250 69893 70932 -48840 148110 244402 -163741 -23571 -164871 -257464
12072 -257464 118649 -101936 -96181 119234 -358681 -126364 -6024 -7629 271620 239179 24644
12060 232199 533143 586791 872444 1257036 344308 29553 238758 121926 -53981 -284816
12050 -284816 152895 203572 -15702 230064 10449 243251 -165088 173973 47076 -211400
12039 69424 293961 -172208 60326 96933 205569 329430 -20797 105186 35283 -85016 190233
12027 49903 -177328 63814 -75392 251322 -103868 -238784 -34239 105901 -428952 -124069
12016 42054 -31511 -267612 -265639 -138477 -94721 -93466 -103456 -107912 260323 -54463 18733 225308
12004B25308A9152K20090c00097e7067m964l8434E3833K85259b65688G1804h5059
11992D7375K56687a06199C22013j14091a45142n7300B05044D1450N40L5700f9963
11980b14515c4790B4906f6179R235j10384B27538F1765J51092d9506o5828A04135
11968h1156p2215k8107A1568b5996k99470E3145J61249e0089k72079A49509C7250
11956A7573K85945q7728b0695j39808I4860a342F3708J8390i825B18989c84827
11944c6034q5698E0565a43260B594h3209r5224A34629b1912n5292B9242a60232
11932a43554E9873c5375l36051I3517k5550M9373e1165j189C5511a09720j2596
11921a22316A76939b87341a27316J0718K8873M0649I0244i090H0667a51527A09744
$$ plain form
12004 225308 19152 239242 -300097 -57067 -62031 -100465 53833 339092 -265688 71804 -85059
11992 47375 304062 -106199 322013 207922 -145142 -202442 205044 41450 41990 77690 -69963
11980 -214515 -34790 24906 -66179 -56944 -167328 227538 61765 212857 -49506 -115334 104135
11968 -81156 -153371 -181478 11568 -25996 -325466 53145 214394 -50089 -322168 149509 37250
11956 17573 303518 215790 -20695 -160503 94860 -1342 63708 82098 -9825 218989 -384827
11944 -36034 -121732 50565 -143260 2594 -83209 -178433 134629 -21912 -77204 29242 -160232
11932 -143554 59873 -35375 -371426 93517 67967 117340 -51165 -52354 35511 -109720 -122316
11921 -122316 176939 -287341 -127316 -116598 -87725 -47076 90244 -9090 80667 -151527 109744
11909a63494N6328j38295d160r3063B942a4095e06j57301j21556f5341k52672
11898c18013h2651k0701n923q8051d4991k10503J26478e3558B17746a83683I6027
11886B57594j0302d0725B87956g3645B04949G8630J54814i6034J4966H2770M9086
11875A31856c44270a34929B8261b167A28515c48100F4622b2398k32409C8054c07999
11863a48233O3935p4751o7459B7638M6538a02523A63522c15507j2720C7568O30
11852C8198j6840e7098j29191C2453K200M38427a98727J9391m7746a07021H1963
11840i0284K5309b0992D9946b08889l9790c1417r038a4501C0205a08562K549I2274
11827C6134e7301D5493b71276R9186l838j28913C79718a41475B70978A7087r90
$$ plain form
11909 -163494 -107166 -245461 -4160 -97223 2942 -14095 -506 -157807 -279363 -65341 -318013
11898 -318013 -82651 -103352 -109275 -197326 -44991 -255494 -129016 -53558 217746 -183683 96027
11886 257594 247292 -40725 287956 -73645 204949 78630 233444 -96034 -81068 82770 131856
11875 131856 -344270 -134929 28261 -2167 128515 -348100 64622 -22398 -254807 38054 -307999
11863 -148233 -84298 -159049 -226508 27638 74176 -102523 163522 -315507 -328227 37568 38198
11852 38198 21358 -57098 -186289 32453 34653 473080 -198727 -179336 -227082 -107021 81963
11840 -90284 -64975 -20992 49946 -208889 -248679 -31417 -40455 -14501 30205 -108562 -106013 92274
11827 36134 -57301 45493 -271276 -172090 -175928 -304841 379718 -141475 270978 17087 16097
11816A6097N2812C3323A4966M6496J287i8968D1824J111E909g0186A81072n6052
11804A25020g4820k41397J36554j46457N4629h9609A44648g8042A47654K08992
11794C56646I066Q1172a31721B14484f6596j45699A154b8459j36607L741C64119
11782c004B2227g1715j75766C9076N3581d6592o0771k00237A32689F3706K89654
11771C53360a73330j15084f5690j83674a14l7250A2318c9472q8413I7020c74180
11759A13726J37581E3248a5124m17820B604b9731o3440B3630a69858M6087j24821
11748b48592C3052b79712h7451C24377G1132L0558a27998C83K4576a38079B3537
11736a58225f2461A82470b80291B89453i1827L2894G3507J94283a83083o9310
$$ plain form
11816 16097 68909 33323 14966 61462 62749 -98968 41824 42935 5909 -70186 181072 125020
11804 125020 -74820 -316217 -179663 -326120 -271491 -89609 144648 -78042 147654 356646
11794 356646 9066 90238 -131721 214484 -66596 -212295 1154 -28459 -165066 -161325 364119
11782 -3004 22227 -71715 -247481 39076 92657 -46592 -107363 -307600 132689 63706 353360
11771 353360 -173330 -288414 -65690 -249364 -114 -37364 12318 -39472 -127885 97020 -374180
11759 113726 251307 53248 -15124 -432944 2604 -29731 -93171 23630 -169858 -123771 -248592
11748 -248592 33052 -279712 -87451 324377 71132 101690 -127998 383 24959 -138079 23537
11736 -158225 -62461 182470 -280291 289453 -91827 -58933 73507 267790 -183083 -252393
11726b52393O173c9043A21783j9510g7663A28360a43357A80058q6147P5680D4947
11714B58257D7340J50177r0950j6939f1155r239B86176b26043F2616e2642P75
11703e1867A1036a71023G4365c068j47068C7884g934j40502O8301B27252m5678
11692A81574c9061n3428j78902L1336A89739Q2885A09050K49705a43171L2176
11682a10995e1729A62702h2789F1860I950f9917a9950B09034a62612k83945B2246
11670F6076M8997J83265A37721j8416l0828P1997o7607J52340a72607d6121G0737
11658A17106a38521A22910h7236B0620b9181C0452g885H9421L9325K66502b63619
11646f1016A79283O743H0939D0160h9525A19495h0448j36971G5996a51644A18174
$$ plain form
11726 -252393 -246220 -39043 121783 102273 -77663 128360 -143357 180058 93911 169591 44947
11714 258257 47340 197517 106567 89628 -61155 -70394 286176 -226043 62616 -52642 -51867
11703 -51867 11036 -171023 74365 -3068 -150136 37884 -7934 -148436 -80135 227252 181574
11692 181574 -39061 -92489 -271391 -240055 189739 272624 109050 358755 -143171 -110995
11682 -110995 -51729 162702 -82789 61860 9950 -69917 -19950 209034 -162612 -446557 22246
11670 66076 115073 298338 137721 119305 88477 160474 92867 245207 -172607 -46121 70737
11658 117106 -138521 122910 -87236 20620 -29181 30452 -7885 89421 128746 395248 -263619
11646 -61016 179283 186026 80939 40160 -89525 119495 -80448 -217419 75996 -151644 118174
11634e888j49646l3568P1815j25939B83707F4124e49371C62584j59188A00341
11623e5400H460J90302l8949O2702a1553j65489B40133j02664g6049a0032C05729
11611a80822B84895m6880b12986C9655K68g5395A75639M3949a02052A51423b71283
11599f4598n7964B57548l4744B4451K25105j8354a70970g0017k35839A34596A7914
11587A32806D1849R7055o8354J36540h8000A44481B3931K97550b15941C0009a57802
11575A596M40031K3229C6305J09843J24641h2256D55487A61840D7437R907B3402
11563a09070p55A08924l6671i2099o7055a2801B640L9934N7714f2657l2032B65805
11550A25356K48911a98189B19210b77966F693b77775e5252B92460C9530J56496
$$ plain form
11634 -5888 -155534 -189102 -117287 -243226 283707 64124 -549371 362584 203396 100341
11623 -55400 8460 198762 159813 222515 -11553 -177042 240133 137469 -76049 -10032 305729
11611 -180822 284895 238015 -212986 39655 39923 -75395 175639 219588 -102052 151423 -271283
11599 -64598 -122562 257548 222804 24451 249556 231202 -170970 -70017 -305856 134596 17914
11587 132806 41849 138904 70550 207090 -88000 144481 23931 321481 -215941 30009 -157802
11575 1596 441627 464856 36305 146148 270789 -82256 455487 161840 47437 57344 23402
11563 -109070 -109825 108924 72253 -92099 -159154 -12801 2640 42574 100288 -62657 -94689 265805
11550 125356 374267 -198189 219210 -277966 6693 -277775 -55252 292460 39530 196026
11540A96026b55906P2637M6676C0439i9441A52226a0085n4990A43804J23671H8415
11528A09166a22376A6032K83678b1306B67415A17204J8879b8477l695C17126j06731
11517B10395n0971K9061k446K4532G3206P9858b5973j21251C35884I7060a04108
11505B38469A4006J81006N8061f0649A8202J08957e3579K0202B28273K3126L52699
11494F04098F2704K00283a28469A16097n7480L25367D1324J29609a8644B92237
11483a5396B08851k3759G7580J40422R3186r1568K13093k7123i4997K2820B47280
11471B67312C2876d7979n4081d8931n1112B44599c7439C55288a44146A63769m2105
11460A21664j6601A8400P6399N5195K9917J62726c4240A21609J6159F028Q1004
$$ plain form
11540 196026 -255906 -183269 -136593 30439 -99441 152226 -10085 -65075 143804 267475 88415
11528 109166 -122376 16032 299710 -21306 267415 117204 136083 -28477 -32172 317126 210395
11517 210395 159424 188485 186039 210571 73206 153064 -25973 -147224 335884 97060 -104108
11505 238469 14006 195012 253073 -60649 18202 127159 -53579 -33377 228273 251399 604098
11494 604098 62704 262987 -128469 116097 58617 383984 41324 170933 -18644 292237
11483 -15396 208851 185092 77580 218002 311188 219620 432713 405590 -94997 -72177 247280
11471 267312 32876 -47979 -102060 -48931 -100043 244599 -37439 355288 -144146 163769 121664
11460 121664 105063 18400 94799 149994 179911 342637 -34240 121609 137768 6028 87032
11449H7032L3410D6474J91723r8212E2691J1058K54799A08615b15793B58002b24073
11437B35359c3254J0217B02702k2655H3040k9709K92644d2956l7883C08286a36831
11425B34350h1041l0237k4293d2278j85885H9471a02237b3814A42120a63425K8755
11414a34670I0944K3880Q7808K5935M9289a5554D3070d3866I9652m4108a06160
11402B2431a01002F7988b91218G1901P0420L3728a99052P9475A95087p2626l9042
11391H3419a04010c8056m5337D0981a13629C9364a1184D79437j53635d5320B5956
11379G0995P7615m6279i13p4889D4520b05497j06677J33181A3199j728K68660
11368B80131D0253a61911D4506i8771k494i115E0269J38322b68016a3583l51345
$$ plain form
11449 87032 120442 46474 238197 139985 52691 63749 318548 108615 -215793 258002 -224073
11437 235359 -33254 -23037 202702 180047 83040 53331 345975 -42956 -80839 308286 -136831
11425 234350 -81041 -111278 -135571 -42278 -228163 89471 -102237 -23814 142120 -163425 -134670
11414 -134670 90944 114824 202632 228567 277856 -15554 43070 -43866 99652 55544 -106160
11402 22431 -101002 67988 -291218 71901 142321 176049 -199052 -119577 195087 122461 83419
11391 83419 -104010 -38056 -83393 40981 -113629 39364 -11184 479437 325802 -45320 25956
11379 70995 148610 102331 -913 -75802 44520 -205497 -312174 -178993 13199 11471 280131
11368 280131 40253 -161911 44506 -98771 -101265 -9115 50269 188591 -268016 -13583 -364928
11357c64928G9756b24739A47383m4010a15189K8057A73898B0815J22343R7637
11347B40795P2751a53412c2904m2649j63539A17644d1008A73594a53815D8874
11336a60649n7468M6329A24700J38402D2981j3405d5939a6426j25073A62352b6027
11324A61451b35775G4989a75532a7128A07132d18857A43759F1949b13892i5568
11313b5597C0890K50811a11653j4922E671a6828H8175B3391a18753k1241B18399
11301d83430a67369p070k27421a39105d9015k05488N2568k5546L423e051p5217
11290h0268L3493J1564A29027b9236j2536m3104D6309a75647C30651b60701L580
11279b57121H1357c58148a46310H7594a79183C30898a48163k83305g3234A61614
$$ plain form
11357 -364928 79756 -224739 147383 103373 -115189 -87132 173898 20815 143158 240795
11347 240795 313546 -153412 -32904 -75553 -239092 117644 -41008 173594 -153815 48874
11336 -160649 -218117 -171788 124700 263102 42981 29576 -45939 -16426 -141499 162352 -26027
11324 161451 -235775 74989 -175532 -17128 107132 -418857 143759 61949 -213892 -95568
11313 -25597 30890 281701 -111653 -126575 5671 -16828 88175 23391 -118753 -139994 218399
11301 -483430 -167369 -174439 -401860 -139105 -49015 -254503 -201935 -227481 -224058 -5051 -80268
11290 -80268 -46775 -35211 129027 -29236 -41772 -84876 46309 -175647 330651 -260701 -257121
11279 -257121 81357 -358148 -146310 87594 -179183 330898 -148163 -431468 -73234 161614
11268A69336m6954P7949a24473a2135B05174I9962D1964K19167i2807j29282i9681
11256b86392g4541n8705B57394A01219b32554e4836O620D0410a06676F4678a9240
11244b38703o8966A71610R9394A11855J3791a47620j47661b8209k3992l73464
11234d25665g0005C0645g60m6761p8385B34853a43909C62460D929a34763B89323
11222f4456q9692j42213C54587j72368b95060f39A75484n450b24663A01441b22682
11210g9236C52018A75106e9953A4576A731e5871A22129n6466J2442A4155N1728
11199F5883i688C580b14390j64816G7802a72097H4980k3313Q8696P5879d12718
11187c448A21106C5399J04061C0698L65282h4858f05A47803J3677b8194g812j46854
$$ plain form
11268 169336 122382 200331 -124473 -12135 205174 99962 41964 261131 -92807 -222089 -99681
11256 -286392 -74541 -133246 257394 101219 -232554 -54836 -48216 40410 -106676 64678 -19240
11244 -238703 -307669 171610 271004 111855 125646 -147620 -295281 -28209 -52201 -425665
11234 -425665 -70005 30645 -760 -47521 -125906 234853 -143909 362460 4929 -134763 289323
11222 -64456 -154148 -296361 354587 182219 -295060 -639 175484 170034 -224663 101441 -222682
11210 -79236 352018 175106 -59953 14576 1731 -55871 122129 65663 78105 14155 65883
11199 65883 -9688 3580 -214390 -379206 77802 -172097 84980 61667 150363 226242 -412718
11187 -3448 121106 35399 139460 30698 395980 -84858 -605 147803 161480 -28194 -7812 -154666
11175a54666e3917j91746B3604P5088C5260P3877L792R6861n4180B3229P117K11592
11163B41938j07615m6987J15062K50231a42186L890A02536b13503B77435B9047
11152d67878B9159e3532j16104c5338a3118A2267d50340c8341k10274H2845b49328
11140a28680N1477b5696C6039J08524B6061I285c14302H5844a61649O1484M2040
11129e8125k5815A19988J48368a51097B92688a53924j48076G0904h0991E9358
11118b37953R5594A88951e1001l5815p2018n5227g3377A5876g55l8533F2624f3218
11105A588J98292g380k22598C17559I918J09757K4663J82404a1992j80823E0802
11093B3974K98791j53829L7789h9816A03030e4785G624J75344P672q0246R8719
$$ plain form
11175 -154666 -53917 -245663 23604 98692 35260 109137 112929 209790 155610 23229 30346 241938
11163 241938 134323 87336 202398 452629 -142186 -138296 102536 -213503 277435 29047
11152 -467878 29159 -53532 -169636 -35338 -13118 12267 -450340 -38341 -248615 82845 -249328
11140 -128680 -77203 -25696 36039 144563 26061 9285 -314302 85844 -161649 -100165 -58125
11129 -58125 -83940 119988 268356 -151097 292688 -153924 -302000 70904 -80991 59358
11118 -237953 -142359 188951 -51001 -86816 -158834 -214061 -73377 15876 -755 -39288 62624 -63218
11105 1588 199880 -7380 -229978 317559 9918 119675 144338 326742 -11992 -192815 50802
11093 23974 322765 168936 206725 -89816 103030 -54785 7624 182968 190640 110394 209113
11082B09113r7915b42632A96900N2266F8189K49734G3236J39875q6003l6240J36114
11071B26982J13687q6120A20596Q8919C2268Q9876N8824n7371k5660b3007C39554
11059B56948G2930J54610J514J52542J7987j04399k7421K10950j44998j65600
11049A68115K62772j9721L73660l81746j30131K69334j37644J62134K01894j45445
11039F23222J18424J64149C11457L82162J12996j78666K60933l97075K78571m7742
11029G22636J24605R3963l12375r2232J37635n6865k41522M15340l77181K73902
11019F87906J59494l00852K61107C46192J39212n3019J27509j14901K19089J19941
11009G84023M4599J23705r6069D18874J6602k33K66469j24998j52506K89315k14586
$$ plain form
11082 209113 111198 -242632 196900 249166 68189 317923 73236 213111 127108 90868 226982
11071 226982 340669 254549 120596 209515 32268 122144 180968 123597 97937 -23007 339554
11059 256948 72930 227540 229054 381596 399583 295184 267763 478713 333715 168115
11049 168115 430887 411166 784826 403080 272949 542283 404639 566773 768667 623222
11039 623222 741646 905795 311457 693619 806615 627949 888882 491807 770378 722636
11029 722636 847241 941204 628829 536597 674232 617367 375845 791185 414004 687906
11019 687906 847400 546548 807655 346192 485404 432385 559894 444993 664082 784023
11009 784023 828622 952327 856258 418874 435476 435243 701712 576714 424208 713523 498937
10998D98937J85203R8486R5127l03777k74132K19991R9935j47125P2305B45908
10987F13375j31149M32114j46431K9859j73580L436p8324J39719K71186C01124
10976H13173j64740k00655J73878P3360K50839j05471J16406J0683K06023k30295
10966I43201l8957M83924J5643M7850K43576J52121L28358J34130q7810m8153
10956B173883J25180K42000k21689j07284k45745j16641L4539j83134k09219l05376
10946A186514L40092P2465l41332M4104k93137K53304k08815M33845k06763j93940
10936A086337j56381j64617j91797j10138j10970L44180l26187r7144J6249k7709
10926B61823J05952K33619F4145J76191K12812j03290g3107G9237a22535C9263
$$ plain form
10998 498937 684140 782626 877753 573976 299844 519835 619770 472645 544950 245908
10987 613375 482226 914340 767909 797768 624188 627624 549300 689019 960205 301124
10976 813173 648433 447778 621656 695016 945855 840384 956790 967473 1173496 943201
10966 943201 904244 1388168 1403811 1451661 1695237 1847358 2175716 2309846 2222036 2173883
10956 2173883 2299063 2541063 2319374 2212090 1966345 1849704 1884243 1701109 1491890 1186514
10946 1186514 1526606 1599071 1257739 1301843 1008706 1262010 1053195 1487040 1280277 1086337
10936 1086337 929956 765339 573542 463404 352434 696614 370427 273283 289532 261823
10926 261823 367775 601394 64145 240336 453148 349858 -73107 79237 -122535 39263
10915A10008k9334a04898C18120n2383a58091A79037D5241J11213c7631A51995
10904a46416b9942k2280C53012f4593a0266m50596b13890c2445a4327E4483B4299
10892h4654d795n0932q5841F8009c14009C5860J96640B4019h260l4011j76728
10881b18999A45216Q2430b45272J14697G5595J96658b60876e3842j67886B89219
10870b27306Q3627c3154A8898J21929a79021C36659a19069j95000B37488e7586
10859B59805a65340A66404J9294a1913o5373l0472k41602A15704a28386j01351
10849b29737J7483A54362h6721G340J00508c85281g5704C72128G94d5071j98759
10838b43830f1122k41406A9285Q0466a67855O8035k7818B39579c53886a13459
$$ plain form
10915 110008 80674 -104898 318120 265737 -158091 179037 45241 156454 -37631 151995
10904 -146416 -29942 -52222 353012 -64593 -10266 -460862 -213890 -32445 -14327 54483 24299
10892 -84654 -4795 -55727 -141568 68009 -314009 35860 232500 24019 -8260 -42271 -218999
10881 -218999 145216 227646 -245272 -130575 75595 272253 -260876 -53842 -221728 289219
10870 -227306 -143679 -33154 18898 140827 -179021 336659 -119069 -314069 237488 -57586
10859 259805 -165340 166404 185698 -11913 -77286 -107758 -349360 115704 -128386 -229737
10849 -229737 -212254 154362 -86721 7340 107848 -385281 -75704 372128 794 -45071 -243830
10838 -243830 -61122 -302528 19285 99751 -167855 -99820 -127638 239579 -353886 -113459
10827A50966E0368a65789A89010A1831O8767J82470C2832K2929d7068A56867d6736
10815a86733A86427b81340j9875N0100D03088a83289I5155j3101A6372c50867
10804b1469A28107R6518b7111H8820b47906B8316b6389R727C0423a40413J3127
10793a27286B00409c08767A24010b46257A37658a74331m4877B21004a93492A3471
10782I3061e8742A9968h0547N027n8835j60788I8104B0028R9422A5539b17011
10770C96738A34092a77002f6860B1482c17905G9496d56835D8861J64161n9871
10760A53151b28811f8450r7966D0440h3426I9680a18216Q203H212a31189B48414
10748B95741D0896e00321C8380e7689b2483H8151b62279N2205J6502A048K27435
$$ plain form
10827 150966 50368 -165789 189010 11831 80598 263068 32832 55761 -47068 156867 -46736
10815 -186733 186427 -281340 -301215 -251115 403088 -183289 95155 82054 16372 -350867
10804 -21469 128107 224625 -27111 88820 -247906 28316 -26389 -16662 30423 -140413 -127286
10793 -127286 200409 -308767 124010 -246257 137658 -174331 -219208 221004 -193492 13471
10782 93061 -58742 19968 -80547 -75520 -134355 -295143 98104 20028 119450 15539 -217011
10770 396738 134092 -177002 -66860 21482 -317905 79496 -456835 48861 213022 153151
10760 153151 -228811 -68450 -166416 40440 -83426 99680 -118216 -110013 8212 -131189 248414
10748 295741 40896 -500321 38380 -57689 -22483 88151 -262279 -210074 -193572 1048 228483
10737B28483f3108j07502A20533A3935J4078a44479D7093c37207b1105A44412
10726a85229O4470j84689A47603A7507L48626a63726A6438b1981C211b179o0915
10715f3094I4284m1907h0604p7639d1520j90095Q4953l8833G2513a90273a2743
10703f4958E3812b09703J5181J2996c374F1405a51017n1056j6313b3721A57382
10691e7455b0675m0972B02204h0142o7924I8208b90415d6635F3515b28896D63596
10679A14753K63718a32893f1j10436A17042g4957k23554h8589F1864c03560E5145
10667e4915j57185R3800b9188k63749g4581k6125j00006d6367E6209c6468M443
10656c2025D9977b9025l3617l7439A56286N1961c28949e3008J6097A01796a29476
$$ plain form
10737 228483 -63108 -170610 120533 13935 28013 -144479 47093 -337207 -21105 144412
10726 -185229 -120759 -305448 147603 17507 366133 -163726 16438 -21981 3211 -2179 -63094
10715 -63094 94284 52377 -80604 -158243 -41520 -231615 -146662 -185495 72513 -190273 -12743
10703 -64958 53812 -209703 -194522 -181526 -3374 61405 -151017 -202073 -218386 -23721 157382
10691 -57455 -20675 -61647 202204 -80142 -148066 98208 -290415 -46635 63515 -228896 463596
10679 114753 378471 -132893 -61 -110497 117042 -74957 -298511 -88589 61864 -303560 55145
10667 -54915 -212100 -118300 -29188 -292937 -74581 -100706 -200712 -46367 56209 -36468 -32025
10656 -32025 49977 -29025 -62642 -100081 156286 208247 -328949 -53008 -36911 101796 -129476
10644b61557R8753A9073b15886Q4086A79046G4357J8232f7916a745j48442o6083
10633b16270C4021K1654a86702H5980i0470B05001A7706c3320j76901I7732a33052
10621D8632J3659B7419a21256J9806J1836n8597C34501h9361p3312k35327Q3198
10610c14802A41767o0688L12678a4260j6754G8015K46589A13857a91019O153e6561
10598A78294b63513j10459Q9480E3019a55422o8068J01631k0580j3531A44761
10587b67513A09350i8790L6394H7323b77629C41556a22544G0039j5464a99652
10576b32876A0934a88976K5607N0882H0492L3426g0570p4812f4691j951j08046
10565a74688b053C3450b204j51455a3183D8914a42156q9739B27395c9411j30053
$$ plain form
10644 -261557 -162804 19073 -215886 -131800 179046 74357 92589 -67916 -1745 -150187 -216270
10633 -216270 34021 55675 -186702 85980 -90470 205001 17706 -33320 -210221 97732 -133052
10621 48632 62291 27419 -121256 -101450 -89614 -148211 334501 -89361 -162673 -398000 -314802
10610 -314802 141767 81079 393757 -14260 -31014 78015 324604 113857 -191019 -184866 -56561
10598 178294 -263513 -373972 -284492 53019 -155422 -223490 -121859 -142439 -155970 144761
10587 -267513 109350 -98790 -62396 87323 -277629 341556 -122544 70039 54575 -199652
10576 -232876 10934 -188976 -163369 -112487 80492 113918 -70570 -145382 -64691 -66642 -174688
10565 -174688 -2053 33450 -2204 -153659 -13183 48914 -142156 -231895 227395 -39411 -169464
10554a69464o730A47597n5658a173j51516k5172A49432i6193G1345a67871b6336
10542A18766h0699A49738N141b05595D9212L8037c48347b9863k68390a2807p9201
10531i2008j16620B7696a33297C8065J21965k7083D8150J7372b62629a29492k2868
10520a52360A77511a47894e8917A26800E55b21068O3309l3826O6502A8558J0476
10509B9034a16704p0368B03640H2376C2021k968b27618A0130a86351A4390b47519
10497b341j35967A45205N2855b22864A6546J48934c02742J27342B06083q0520
10487A25563c19900B18227d8850j07798K0061k93305B20755B4866a5782B69192
10476a42604F4033e1477B7768M2023b8893H9928B2876Q3753K79461j03087R1371
$$ plain form
10554 -169464 -176194 147597 91939 -1173 -152689 -177861 149432 -96193 71345 -167871 -26336
10542 118766 -80699 149738 154879 -205595 49212 87249 -348347 -29863 -298253 -12807 -92008
10531 -92008 -208628 27696 -133297 38065 160030 132947 48150 65522 -262629 -129492 -152360
10520 -152360 177511 -147894 -58917 126800 555 -221068 -157759 -191585 -125083 18558 29034
10509 29034 -116704 -187072 203640 82376 32021 29053 -227618 10130 -186351 14390 -247519
10497 -2341 -138308 145205 198060 -222864 16546 165480 -302742 -175400 206083 125563
10487 125563 -319900 218227 -48850 -156648 -136587 -429892 220755 24866 -15782 269192
10476 -142604 64033 -51477 27768 69791 -28893 89928 22876 106629 386090 283003 374374
10465C74374l2943a96773D11980A62613k0489j4251g6119C5468a6301m27131a56750
10453C5833a43373A23415O9995A0783M8979a14448l47702b24806O9533k9671e52
10441b21107R8798A58388f3407M238A07128J76709a50016k03574d4317B04023
10430d09212a19207B1708b17954A87944o0514j1351K83721j48442b60270m3613
10420c03883i9157B05355b3478A62442n0416b8039k22442D6476A2943d9552k19928
10409b69480J28298B51517H7483A2424O9410a39955C9886Q5599D2844a93001B61235
10397a04680e1010J3018b937B19748i504l8514p8466E8525a19302r2577a3990
10385D9100b35903b7244A70427b20997N8167A61290a6601j94887B41176K79410
$$ plain form
10465 374374 341431 -196773 411980 162613 142124 127873 -76119 35468 -16301 -443432 -156750
10453 35833 -143373 123415 193410 10783 59762 -114448 -462150 -224806 -155273 -184944 -552
10441 -221107 -122309 158388 -63407 -59169 107128 283837 -150016 -353590 -44317 204023
10430 -409212 -119207 21708 -217954 187944 127430 116079 399800 251358 -260270 -303883
10420 -303883 -99157 205355 -23478 162442 112026 -28039 -250481 46476 12943 -49552 -269480
10409 -269480 -141182 251517 87483 12424 81834 -139955 39886 125485 42844 -193001 261235
10397 -104680 -51010 -37992 -2937 219748 -9504 -48018 -126484 58525 -119302 -211879 -13990
10385 49100 -235903 -27244 170427 -220997 -162830 161290 -16601 -211488 241176 520586
10375E20586b28292O7520e682j22084B38763p3120A7976Q0766e0085C88797A63820
10363A57005P4708k4774H4767l616J05635g655A70469L67500J62625C31484j6486
10352C14998R9900q5068J23376A53091M41579F6566K09610j21240L3819J61774
10342C50529A15643J26907O9013j255J25113A71432o6585K88774O9099H4095K34354
10331C18449q6051K78187k45138C4555J23028K05342D3439K16595K3031l7006
10321B46059Q5986C5477K14649n8807I06J48640B1193J04154J9342a41240A59991
10309A0866K77003R7896G2009K96391a99407D25119a48648j24712C22754A06009
10298D629k115d54371I3701J7589K15293K3857a27532j2974A77006e0417q7601
$$ plain form
10375 520586 -228292 -160772 -5682 -127766 238763 165643 17976 98742 -50085 388797 163820
10363 157005 231713 206939 84767 81151 186786 -7655 170469 537969 700594 331484 314998
10352 314998 414898 329830 453206 153091 594670 66566 276176 154936 188755 350529
10342 350529 115643 242550 311563 310308 435421 171432 104847 393621 462720 84095 318449
10331 318449 232398 510585 265447 34555 157583 362925 43439 260034 283065 246059
10321 246059 332045 35477 250126 191319 906 149546 21193 125347 144689 -141240 159991
10309 10866 287869 385765 72009 368400 -199407 425119 -148648 -273360 322754 106009
10298 4629 2514 -454371 93701 111290 326583 350440 -127532 -140506 177006 -50417 -138018
10287a38018O1132K0471n6671j03003g1513l51310F3593J76986e2996E0735d2434
10275b56568K5675b7687A92248a60143a1868l22266f9570C02395j39518F790a65487
10263b70988L6937L4241E0945i4718H3737g9062B28612e6188G433a00611B79656
10251b5800C30374q4535a67485f1113A00023D6441L40238l5473Q1977j40196j20803
10240A72184h4033R62A46504D837J68536D3488J30419C6664J20389a1430C7463
10228b09328q7300j5019H789K41887d37100i8761j24977j18612F1574b13152Q028
10217b05124A88059c26733H5128a12911k2117A44733O8888g9329o6048F6506K9818
10206I6324M716h2725b8968q4436A23272a41705J6931C4548L0240i2825k12669
$$ plain form
10287 -138018 -76886 -56415 -113086 -216089 -71513 -422823 63593 240579 -52996 50735 -42434
10275 -256568 -230893 -27687 192248 -160143 -11868 -334134 -69570 302395 162877 6790 -165487
10263 -270988 -234051 -199810 50945 -94718 83737 -79062 228612 -56188 7433 -100611 279656
10251 -25800 330374 245839 -167485 -61113 100023 46441 386679 351206 433183 292987 172184
10240 172184 -84033 -83071 146504 4837 173373 43488 173907 36664 157053 -11430 37463
10228 -209328 -296628 -311647 8789 250676 -437100 -98761 -223738 -342350 61574 -213152 -205124
10217 -205124 188059 -326733 85128 -112911 -135028 144733 213621 -79329 -145377 66506 96324
10206 96324 101040 -82725 -28968 -113404 123272 -141705 -124774 34548 64788 -92825 -305494
10195c05494O636N3787j51265B18175n3664b28374O5932O6801b7913Q754A32243
10183c32860E986J09980a13331F1125L0678a86153F1452j7092h7302B04845I8609
10171a0707j41390D9143J82114D2074c97257i0377c4897A47342a84077p5185B70976
10159c32710A97270i6910d6105k85165a09998r7873B97410c72467a46421j16206
10149b62627O0751i6035j55748A19526a41885C23037f9518l48633a57926j86647
10139c44573i1628B12916a67507d4407k49041f1670B60308a16171a8627q5264
10129a03891o1073d5761A96397b42237j72948a85177N2810k72794J81815M7975
10119a75371j8988D6188b68786H1050b78589N853k8169f1208k2917C8269k039
$$ plain form
10195 -305494 -298858 -245071 -396336 218175 164511 -228374 -162442 -95641 -27913 -19159 132243
10183 -332860 5986 115966 -113331 61125 91803 -186153 61452 44360 -87302 204845 98609
10171 -10707 -152097 49143 231257 42074 -397257 -90377 -34897 147342 -184077 -259262 270976
10159 -332710 197270 -96910 -46105 -331270 -109998 -207871 297410 -372467 -146421 -262627
10149 -262627 -201876 -96035 -251783 119526 -141885 323037 -69518 -418151 -157926 -344573
10139 -344573 -91628 212916 -167507 -44407 -293448 -61670 260308 -116171 -18627 -103891
10129 -103891 -164964 -45761 196397 -242237 -415185 -185177 -132367 -405161 -223346 -175371
10119 -175371 -194359 46188 -268786 81050 -278589 -272736 -300905 -61208 -84125 38269 36230
10108C6230c32993a47895j8225O1542A43368b26508E3479L33949a34035c4688
10097a08106p2358A52877a2992E3031J05416F6643f0654d39k02408e0855j1191
10086f2046A10339e310l75006J51503j7867j10953J13208B84138O250a31881k2711
10075a54592j5342A64030d1768p3083K1419c3947D9268p438N5091c4601A18364
10063e4556j01202A3480L14672b84765j14011g1635C6622K0435a17302C1221C50
10051e0027j20909k3331M5303A66062e2889o5086e5850n2958C1058e0878k20937
10040b71815f3180b2390k18006J14860B05173F877a48410N8729a156C39789F9544
10028A05214f6252F8212a27124F6976c9259C00537d6923I7663J17624a92815B13897
$$ plain form
10108 36230 -332993 -147895 -166120 -104578 143368 -226508 53479 387428 -134035 -34688
10097 -108106 -180464 152877 -12992 53031 158447 66643 -60654 -439 -202847 -50855 -62046
10086 -62046 110339 -5310 -380316 -228813 -246680 -357633 -244425 284138 290388 -131881 -154592
10075 -154592 -169934 164030 -41768 -114851 -93432 -33947 49268 41830 96921 -34601 118364
10063 -54556 -155758 13480 328152 -284765 -398776 -71635 36622 57057 -117302 31221 350
10051 -50027 -170936 -194267 -148964 166062 -52889 -117975 -55850 -108808 31058 -50878 -271815
10040 -271815 -63180 -22390 -240396 -125536 205173 6877 -148410 -89681 -1156 339789 69544
10028 105214 -66252 68212 -127124 66976 -39259 300537 -46923 97663 215287 -192815 213897
10016c7958B36591n3200B4949L20503D846J41384c20673O7124G1876b94211D7972
10004a80380M5083r3643n0010I5631a51866g3479R595j0909A9630J93507g5599
9992b0737q0391F481a1345k55209j6050Q1730I7862J41192c6533I6914j827b46823
9979A11780b68347J18625n4858k9898Q7429K8565d562p1481A7727J0670a31987
9967a68155B53266i6206A11144a56500L1439A01891a43408k3847k39951a06165
9956b29004A28213a5037B79546f7203j84151G2011c5156F2327d52199C5144K5544
9945F0688a02243c1429k08734F166g0032c131j16248b1067l7770j8747B92685
9933C3087J80628i9746B19471E0804b00423D9888K27599b13167d3850o4753n8996
$$ plain form
10016 -37958 236591 183391 24949 345452 4846 146230 -320673 -253549 71876 -294211 47972
10004 -180380 -135297 -228940 -278950 95631 -151866 -73479 -63884 -74793 19630 213137 -75599
9992 -20737 -101128 6481 -11345 -266554 -282604 -200874 97862 239054 -36533 96914 95087 -246823
9979 111780 -268347 -149722 -204580 -234478 -147049 -118484 -4562 -76043 17727 28397 -131987
9967 -168155 253266 -96206 111144 -156500 -125061 101891 -143408 -167255 -407206 -106165
9956 -229004 128213 -15037 279546 -67203 -251354 72011 -35156 62327 -452199 35144 60688
9945 60688 -102243 -31429 -240163 6166 -70032 -3131 -119379 -21067 -58837 -77584 292685
9933 33087 213715 -99746 219471 50804 -200423 49888 277487 -213167 -43850 -108603 -167599
9922a67599I9038N0233a25013Q954a4302k0685j55528B8407o748b02689g8506
9910a06970D0291c26708a202q7724k35573J3237F1342B7668N0039c5933j02116
9899a38049j03018h0600l119A89757b87465f6197k2845b5937r6399A07750D6642
9887C6155j7872b48811A9936b02260B67893f550G4078a05938E8571K02516h4847
9875e0739k9555j11254B4783e3374H2948a54423l6079C8579a37705A57459a90147
9863A82284B2149b58556J27083a7543A61819C0698K14348G2161a5531m4580l37515
9852c97626J92230j42150i2657i835l20413f0058A13152J30952b1365B70446c34982
9840f4378G6465Q3540d0067k0442A68030a83004C6230a30890d0793A60572a52009
$$ plain form
9922 -167599 99038 149271 -125013 -116059 -14302 -34987 -190515 28407 21659 -202689 -78506
9910 -106970 40291 -326708 -1202 -88926 -324499 -311262 61342 27668 77707 -35933 -138049
9899 -138049 -241067 -80600 -83719 189757 -287465 -66197 -89042 -25937 -122336 107750 46642
9887 36155 18283 -248811 19936 -202260 267893 -6550 74078 -105938 58571 261087 -84847
9875 -50739 -80294 -191548 24783 -53374 82948 -154423 -190502 38579 -137705 157459 -190147
9863 182284 22149 -258556 -131473 -17543 161819 30698 245046 72161 -15531 -60111 -397626
9852 -397626 -205396 -347546 -92657 -9835 -330248 -60058 113152 244104 -21365 270446 -334982
9840 -64378 76465 160005 -40067 -60509 168030 -183004 36230 -130890 -40793 160572 -152009
9828h0963A35816f1371j72552a6176B89134c22967c2296n7803j58263j50001a76827
9816A83058M3488a05415j83880j15154j56390a12141j80820K0185F0172b18247
9805f7991I2422b51467G7751h0279j41843G2609J64762c80927a72207H730b79049
9793h5833K246j8673L2252b9050p062A74515B8289f2534a519H4746J11822a15282
9780E6289a52495D5443J4977g2582H3337b36125L7365l324c5210a6328m2967F1586
9767b3783C9100g7721p0235B54784c9856H3617b22530a0930j19709l6566g7977
9755b2565j41417N5635A7754J31470j7554J31288a47279M3264C03954f2366k585
9744f4951K1588D1929c23892J05295o9845r3602J27682b3289F7697a60033j68347
$$ plain form
9828 -80963 135816 -61371 -233923 -16176 289134 -322967 -32296 -90099 -248362 -398363 -176827
9816 183058 226546 -105415 -289295 -404449 -560839 -112141 -292961 -272776 60172 -218247
9805 -67991 92422 -251467 77751 -80279 -222122 72609 237371 -380927 -172207 8730 -279049
9793 -85833 -83587 -102260 -70008 -29050 -36112 174515 28289 -62534 -1519 84746 196568 -115282
9780 56289 -152495 45443 60420 -72582 83337 -236125 -198760 -202084 -35210 -16328 -59295 61586
9767 -23783 39100 -77721 -147956 254784 -39856 83617 -222530 -10930 -130639 -167205 -77977
9755 -22565 -163982 -108347 17754 149224 131670 262958 -147279 -104015 303954 -62366 -64951
9744 -64951 -43363 41929 -323892 -218597 -288442 -382044 -254362 -23289 67697 -160033 -328380
9733c28380L9390B7437a62173H9834a69363A45725B8507a09055A316J50964F6072
9721b95909J39999A06114K52563a48141A92929b30701r1000n5477g6768k6499
9711a03267K1566c9706k18463e6414j00866k30714f1820j47694q3936E5132Q919
9700F4051d29695D4681a76145A68399a89271K0679L4044A25685K20991e4963B54221
9688B3897f0571H0976d19184g2920P372C2284a09886C3538c76939h7746k05285
9677b93031A82681b87068J0583j21075J97690O5315k438O6173l67030H2013B761
9665a6884A6475J50160R68d1555k3506j90077C06273j11786c79924B30276a92012
9653f3654q9287q8918C7198J56292a14083F0734a92663k20913c7594F9457J02096
$$ plain form
9733 -328380 -288990 27437 -162173 89834 -169363 145725 28507 -109055 1316 152280 66072
9721 -295909 -155910 106114 358677 -148141 192929 -230701 -321701 -377178 -76768 -103267
9711 -103267 -81701 -39706 -258169 -56414 -157280 -387994 -61820 -209514 -293450 55132 64051
9700 64051 -429695 44681 -176145 168399 -189271 -168592 -134548 125685 346676 -54963 254221
9688 23897 -60571 80976 -419184 -72920 -65548 32284 -109886 33538 -376939 -87746 -293031
9677 -293031 182681 -287068 -276485 -397560 -199870 -134555 -136993 -70820 -437850 82013 2761
9665 -16884 16475 166635 167603 -41555 -65061 -255138 306273 194487 -379924 230276 -192012
9653 -63654 -152941 -241859 37198 193490 -114083 60734 -192663 -413576 -37594 69457 171553
9642A71553b21413J9375R6468c8861j87503F506a24333N3451c5388j26752G460
9630H5423B0128b41835b9496k71816A28003b24934A02464a88732g2218p3061A67473
9618D9405P3776M946P7952B9105h908m3518p520B00869a79678m0783c5642D8144
9605c20316G20b13547a5000B4745e6038A46478E1742a51672A25176C6092A3234
9593h3273B26656r1110o988d29731a44290A16119a04967c0733b671l6955r981
9582d9607j9676m739j12188j2620A34370b7857B47322g8257j21558M1541n1902
9571b10176A70516b85867e0283j62141e3544C9994K57757a38467a781k38507A19469
9559a19603f1C0130O5433K69240h4528j96183E1179k2150b51675c5256j08015
$$ plain form
9642 171553 -221413 -202038 -105570 -38861 -226364 6506 -124333 -70882 -35388 -162140 7460
9630 85423 20128 -241835 -29496 -301312 128003 -224934 102464 -188732 -72218 -145279 167473
9618 49405 123181 128127 206079 29105 -8908 -52426 -59946 200869 -179678 -220461 -35642 48144
9605 -320316 720 -213547 -15000 24745 -56038 146478 51742 -151672 125176 36092 13234
9593 -83273 226656 135546 128558 -429731 -144290 116119 -104967 -30733 -2671 -39626 -49607
9582 -49607 -69283 -74022 -186210 -198830 134370 -27857 247322 -78257 -199815 -158274 -210176
9571 -210176 170516 -285867 -50283 -212424 -53544 39994 297751 -138467 -1781 -240288 119469
9559 -119603 -61 30130 95563 364803 -84528 -280711 51179 29029 -251675 -35256 -143271
9548a43271B68231a41412A38947A896J90165B3500Q6883J4401d9156I0150a11493
9536A605b37544k5271H7952A7187L957g9800A37424b75750a32003A21890a908
9524A10951b44876b433A06063b32696L3664b156j86840g0835p8133l44594K09647
9513b83915i6121j90520a0214D2478b4246n0560o8250c2560l91278C9851c27194
9501a23239k7010A8221a80458B58648C8706b0113R381k72548A03019a08296b0463
9489H7697K1573e345o0210a3799j56012A96111c4809J3511m11712d3565A99037
9477b17285E5048O7028k9000h0075K0701B55046g9335j9000B51c21273k1558A34802
9464B54745c03976A73672a12319b6528j33790q8960M5907L4092f905r0236j18940
$$ plain form
9548 -143271 268231 -141412 138947 1896 192061 23500 110383 124784 -49156 90150 -111493
9536 1605 -237544 -262815 87952 17187 21144 -79800 137424 -275750 -132003 121890 -1908
9524 110951 -244876 -2433 106063 -232696 -199032 -2156 -188996 -70835 -148968 -493562 -283915
9513 -283915 -96121 -286641 -10214 42478 -24246 -74806 -143056 -32560 -423838 39851 -327194
9501 -123239 -150249 18221 -180458 258648 38706 -20113 -10732 -283280 103019 -108296 -20463
9489 87697 109270 -5345 -65555 -13799 -169811 196111 -34809 -21298 -433010 -43565 199037
9477 -217285 55048 122076 93076 -80075 -59374 255046 -79335 -98335 251 -321273 -342831 134802
9464 254745 -303976 173672 -112319 -26528 -160318 -249278 -203371 -169279 -6905 -97141 -216081
9453b16081n2848J15464A14240c20459d8070H5862b68946b4511k11305a00309
9442c01823a48106P2527j49999c0038j47912M4865A28905c72532i1693B42403
9431A26691a95507M4861I9184d8060j19824j39699J19177Q5996M8808g439A2548
9419g3470k5779B7569a84345I0648c45408h1342m31184G5462d782k27749m2422
9408b74953a02625n2605C8481N7868r885J0179g4263d472k29827M1001M2064m3444
9396a94678e6224A98949f9695j78286P7420I2487M14367A4199b35946a08126E7192
9384c01287a43891d7087D1548a34520G6352L5653K5218c6608A55822h5489p0500
9373a55989o2626p5954C6564b4613k4862A63490D4161f3944A21993a66081g4913
$$ plain form
9453 -216081 -268929 -153465 114240 -320459 -48070 85862 -268946 -24511 -235816 -100309
9442 -301823 -148106 -75579 -225578 -30038 -177950 -133085 128905 -372532 -91693 242403
9431 126691 -195507 -150646 99184 -48060 -167884 -307583 -188406 -102410 -53602 -7439 12548
9419 -73470 -99249 27569 -184345 90648 -345408 -81342 -512526 75462 -4782 -232531 -274953
9408 -274953 -102625 -155230 38481 96349 86464 96643 -74263 -4472 -234299 -193298 -151234 -194678
9396 -194678 -56224 198949 -69695 -247981 -170561 92487 506854 14199 -235946 -108126 57192
9384 -301287 -143891 -47087 41548 -134520 76352 112005 137223 -36608 155822 -85489 -155989
9373 -155989 -218615 -294569 36564 -24613 -49475 163490 44161 -63944 121993 -166081 -74913
9361d7657k11842A48992O0706b5893D5002h2512q2612B4897a34019B11412c01669
9349A6736b39419A57602b88675c9590J0459j62192E3942e5368a4689D663f2506
9337C6720d00427a15692H7502b02563P7071L512L8990k2865c1066c19r9277j03990
9325b03586e4898j77067p2161A42371F5141c93076J12361a19364K2778k23159
9315c19745a37718A0255a342p9108b6596j95071B21839j01695b28530M3251G8554
9303d3269A2596a69511h2604C3076d5508A11954C4022d3147E27758b91498c5070
9291D0287b62632I3757f2846A16805c4989n4265A09830A0756J01139K8216l9445
9280A00666a32436A73523q2727R457d2335r9089o5638P9014l4090A10098a83568
$$ plain form
9361 -47657 -259499 148992 209698 -25893 45002 -82512 -165124 24897 -134019 211412 -301669
9349 16736 -239419 157602 -288675 -39590 -29131 -191323 53942 -55368 -14689 4663 -62506
9337 36720 -400427 -115692 87502 -202563 -125492 -121980 -82990 -105855 -31066 -319 -99596 -203586
9325 -203586 -54898 -231965 -304126 142371 65141 -393076 -280715 -119364 -96586 -319745
9315 -319745 -137718 10255 -1342 -80450 -26596 -221667 221839 120144 -228530 -185279 78554
9303 -43269 12596 -169511 -82604 33076 -45508 111954 34022 -43147 527758 -291498 -35070
9291 40287 -262632 93757 -62846 116805 -34989 -89254 109830 10756 111895 140111 100666
9280 100666 -132436 173523 90796 100253 -42335 -141424 -207062 -128048 -162138 110098 -183568
9268A99007b47105b4060B2337a73770e0008A90663b67727E8521b9385A41029b93421
9256a50980B1185a85555r2046a4903k2020d799k82316o5360A31093b03654R2411
9245a11243K0687j42817R7209d4229J5907H3732A8750K32537C7141K79144H208
9233e1504H4839b36334B1629a33032n740A10759a01304l2414J432D5532a15252
9221h9347B40515a37564A33813J33103c20838H1691a40821K0619L3258J4694j79070
9210b51320a11563n3122n9143a04561p5528h6116I4580h6279F7013B0607K8129
9199D8736b83278A01707k8960A2647a02095l9739A22648b8860b258m4941D8352
9187b33163M6896Q3204j37832e4551j16993A3052d0564B04777i6185A89044c4881
$$ plain form
9268 199007 -247105 -24060 22337 -173770 -50008 190663 -267727 58521 -29385 141029 -293421
9256 -150980 21185 -185555 -277601 -14903 -36923 -4799 -287115 -352475 131093 -203654 -111243
9245 -111243 -90556 -233373 -136164 -44229 -28322 83732 18750 251287 37141 316285 8208
9233 -51504 84839 -236334 21629 -133032 -138772 110759 -101304 -133718 -132286 45532 -115252
9221 -89347 240515 -137564 133813 266916 -320838 81691 -140821 -120202 -86944 -72250 -251320
9210 -251320 -111563 -164685 -223828 -104561 -180089 -86116 94580 -86279 67013 20607 48736
9199 48736 -283278 101707 72747 12647 -102095 -141834 122648 -28860 -2258 -47199 48352
9187 -233163 -186267 -103063 -240895 -54551 -171544 13052 -40564 204777 -96185 189044 -34881
9175A99683a08140k41429a20886A14260b82244a05190j54816C02189e7405p138
9165f4543F1863a17614C8876d9511A7113d1528k7497J8249C7792a31566n7749
9154a89315b3344H6222d7996B59199g8952a480j22749j57021F7855Q678B5972
9142b71948a3487k7230A37187a20161n9088A04939l7947N5357b28216f4804A95674
9130A6999c21402a35677A38752a92337l9712c6266A94062C2612I066b5025A78247
9118a59332k966r1713L0158j03263c6996j31935A26988M194A6803d3245k25270
9107b68515j97451D0619d6012p015H7961K61569a7420k1226n6708k98691J46898
9096b47147L7206g3221l31553Q6242P4423p417Q8236o7649g3389I7662l1485l2101
$$ plain form
9175 199683 -108140 -349569 -120886 114260 -282244 -105190 -260006 302189 -57405 -64543
9165 -64543 61863 -117614 38876 -49511 17113 -41528 -69025 -50776 37792 -131566 -189315
9154 -189315 -23344 86222 -47996 259199 -78952 -1480 -124229 -281250 67855 76533 25972
9142 -271948 -13487 -40717 137187 -120161 -179249 104939 66992 122349 -228216 -64804 195674
9130 16999 -321402 -135677 138752 -192337 -232049 -36266 194062 32612 9066 -25025 178247
9118 -159332 -162298 -254011 -223853 -327116 -36996 -168931 126988 131182 16803 -43245 -268515
9107 -268515 -465966 40619 -46012 -53027 87961 349530 -17420 -38646 -95354 -394045 -247147
9096 -247147 -209941 -73221 -404774 -318532 -244109 -251526 -163290 -230939 -73389 97662 66177 34076
9084C4076a44308A36739M8471B2495J27938a36938A94748H8115a02686b6269C8304
9072b8911A24632a51553d6314G1310i5141I008b81177A8188a86674H4828c35324
9060d2268A80513p3984a155l814l2212j82255D05101a55119D13449a22291o8628
9049a90919i2611a1845j17152j8505f5054j99891k5159f5729k48582Q4242h9339
9037b7968A85217j9785b9787F9224k3592A1565b81038A09154e7716k4295j7447
9026i9458j03187M7777j025E1325J8104a40691A15014a95629C69141c3657k00867
9015b34524B62981a79707A38317b32498F0483a35211j16767A01029h5896j58359
9005b44255c7148l50939a16488J6107Q374c9817q3868e0570j84243f1847j34950
$$ plain form
9084 34076 -144308 136739 185210 22495 150433 -136938 194748 88115 -102686 -26269 38304
9072 -28911 124632 -151553 -46314 71310 -95141 9008 -281177 18188 -186674 84828 -335324
9060 -42268 180513 106529 -1155 -4969 -37181 -219436 405101 -155119 413449 -122291 -190919
9049 -190919 -92611 -11845 -128997 -147502 -65054 -264945 -290104 -65729 -314311 -230069 -89339
9037 -27968 185217 165432 -29787 69224 45632 11565 -281038 109154 -57716 -82011 -99458
9026 -99458 -202645 -154868 -155893 51325 69429 -140691 115014 -195629 369141 -33657 -234524
9015 -234524 262981 -179707 138317 -232498 60483 -135211 -251978 101029 -85896 -244255
9005 -244255 -37148 -388087 -116488 -100381 -92007 -39817 -123685 -50570 -234813 -61847 -196797
8994a96797A190M5533J63024r0336b8326j49499k1201A77708a68213A26003E9702
8982c19812b0575R82o6721H0442b6516F3072J83942F6048k5940e7828H0541c81908
8969a98815c2001p9285A78701b4282A06733M0952c2144A15660e5611k42357G6057
8957a35342l4818E5200i7754r0040j04831c1701B05396a18328A30245a44774K4776
8946a19998k08580A80490p2358a74320B3438J19689C8836h1221B41878I8822h4068
8934G834L9409N6431j1631d47520a68678D07056a40263A36821L0408a60710l8306
8923a99016k02076F4704P7235f6790B38395O0421D2988K41928a39413D47229R7982
8912E45211n4237K87289N507O46160J273719J946962N785558l648144l239043
$$ plain form
8994 -196797 1190 46723 209747 119411 -28326 -177825 -199026 177708 -168213 126003 59702
8982 -319812 -20575 -19593 -86314 80442 -26516 63072 247014 66048 40108 -57828 80541 -381908
8969 -198815 -32001 -111286 178701 -24282 106733 147685 -32144 115660 -55611 -297968 76057
8957 -135342 -170160 55200 -97754 -187794 -292625 -31701 205396 -118328 130245 -144774 -119998
8946 -119998 -328578 180490 108132 -174320 23438 143127 38836 -81221 241878 98822 -84068
8934 7834 47243 103674 92043 -447520 -168678 407056 -140263 136821 167229 -160710 -199016
8923 -199016 -401092 64704 141939 -66790 238395 298816 42988 284916 -139413 447229 545211
8912 545211 490974 778263 783770 1429930 2703649 4650611 10436169 6788025 3548982
8903C548982j695722q64053l79187j57686j86108L4859j14392C9321c19263B45325
8892A41482K14683j38786a91138A1111L80538A63567k5321J69944b07559r3707
8882c01266B0918b09366a049C1526b38884l9795h1748K453K9520q0911d2641p3530
8870a16171B86772j38973a57064P0358m5283e0958n7469m8669A30995a5610j9785
8859c5395C7955M5245b0033k76030B55206b71850e5053r7148G6547a48246a5762
$$ plain form
8903 3548982 1853260 989207 610020 452334 266226 301085 186693 39321 -319263 245325
8892 141482 356165 217379 -191138 11111 391649 163567 138246 308190 -207559 -301266
8882 -301266 20918 -209366 -1049 31526 -238884 -278679 -81748 -79295 -49775 -130686 -42641 -116171
8870 -116171 286772 147799 -157064 -86706 -131989 -50958 -108427 -157096 130995 -15610 -35395
8859 -35395 37955 83200 -20033 -296063 255206 -271850 -55053 -152201 76547 -148246 -15762
$$ [...]
##END NTUPLES=NMR SPECTRUM
##END=
