
##TITLE=AC1222_Punto_6074794_1Xs9jaGfa0
##JCAMPDX= 6.0         $$ Bruker NMR JCAMP-DX V2.0
##DATA TYPE= NMR SPECTRUM
##DATA CLASS= NTUPLES
##ORIGIN= BRUKER
##OWNER= Administrator
$$ 1.72 TOPSPIN		Version 2.1
$$ 2012-05-09 01:07:18.390 -0500  Administrator@TOPSPIN
$$ Compression mode = diff/dup
##.OBSERVE FREQUENCY= 400.13188235
##.OBSERVE NUCLEUS= ^1H
##.ACQUISITION MODE= SIMULTANEOUS (DQD)
##.ACQUISITION SCHEME= undefined
##.AVERAGES= 8
##.DIGITISER RES= 22
##SPECTROMETER/DATA SYSTEM= spect
##.PULSE SEQUENCE= zg30
##.SOLVENT NAME= COFFEE_meoh
##.SHIFT REFERENCE= INTERNAL, COFFEE_meoh, 1, 14.98061
##AUDIT TRAIL= $$ (NUMBER, WHEN, WHO, WHERE, PROCESS, VERSION, WHAT)
$$ ##TITLE= Audit trail, TOPSPIN		Version 2.1
$$ ##JCAMPDX= 5.01
$$ ##ORIGIN= Bruker BioSpin GmbH
$$ ##OWNER= Administrator
$$ $$ C:\Bruker\TOPSPIN/data/COFFEE/nmr/AC1222_Punto_6074794_1Xs9jaGfa0/100/pdata/1/auditp.txt
$$ ##AUDIT TRAIL=  $$ (NUMBER, WHEN, WHO, WHERE, PROCESS, VERSION, WHAT)
(   1,<2012-05-09 01:07:11.750 -0500>,<Administrator>,<TOPSPIN>,<go>,<TOPSPIN 2.1>,
      <created by zg
	started at 2012-05-09 01:06:04.968 -0500,
	POWCHK enabled, PULCHK disabled,
       configuration hash MD5:
       AF F2 23 6B 01 CD 40 DD E5 A1 38 A0 06 EA F7 77
       data hash MD5: 64K
       8A CA A5 9F 96 4C DA 0E D9 A0 08 CA A7 95 BF D2>)
(   2,<2012-05-09 01:07:14.312 -0500>,<Administrator>,<TOPSPIN>,<proc1d>,<TOPSPIN 2.1>,
      <Start of raw data processing
       efp LB = 0 FT_mod = 6 PKNL = 1 PHC0 = 0 PHC1 = 0 SI = 32K 
       data hash MD5: 32K
       50 BC 3B 1E A9 0D 47 BA 3E AD 0B FB 39 FF BE 86>)
(   3,<2012-05-09 01:07:14.703 -0500>,<Administrator>,<TOPSPIN>,<proc1d>,<TOPSPIN 2.1>,
      <pk PHC0 = 213.5138 PHC1 = 0 
       data hash MD5: 32K
       B3 C1 C7 DB 12 72 BC 7F 85 4F 0F 22 41 37 C5 FB>)
(   4,<2012-05-09 01:07:14.812 -0500>,<Administrator>,<TOPSPIN>,<proc1d>,<TOPSPIN 2.1>,
      <abs ABSG = 1 
       data hash MD5: 32K
       D2 87 E0 FB A7 DA DF E6 65 55 3B 81 F3 89 B3 D0>)
(   5,<2012-05-09 01:07:14.859 -0500>,<Administrator>,<TOPSPIN>,<proc1d>,<TOPSPIN 2.1>,
      <abs ABSG = 2 
       data hash MD5: 32K
       52 2B A1 3F C1 7D 37 11 DC 7E 3B 17 4E 03 C0 42>)
(   6,<2012-05-09 01:07:14.890 -0500>,<Administrator>,<TOPSPIN>,<proc1d>,<TOPSPIN 2.1>,
      <abs ABSG = 3 
       data hash MD5: 32K
       10 70 65 30 44 D6 17 6F A5 0E 43 B3 3A 06 E4 2D>)
(   7,<2012-05-09 01:07:14.921 -0500>,<Administrator>,<TOPSPIN>,<proc1d>,<TOPSPIN 2.1>,
      <abs ABSG = 4 
       data hash MD5: 32K
       73 B9 D9 CD 37 7C E1 DD 78 D8 14 82 BB 62 52 75>)
(   8,<2012-05-09 01:07:14.937 -0500>,<Administrator>,<TOPSPIN>,<proc1d>,<TOPSPIN 2.1>,
      <abs ABSG = 5 
       data hash MD5: 32K
       7D 44 94 A9 5B 76 8A 15 26 2B FE 3F 95 5B AB 29>)
$$ ##END=
$$ 
$$ $$ hash MD5
$$ $$ F4 24 C7 02 32 B6 14 11 31 62 27 A3 6B 37 D8 51
##$RELAX= 
##$RELAX= 
##$RELAX= 
##$RELAX= 
##$RELAX= 
##$RELAX= 
##$RELAX= 
$$ Bruker specific parameters
$$ --------------------------
$$ [...]
##$TP= (0..7)
150 150 150 150 150 150 150 150
##$TP07= 0
##$TPNAME0= <>
##$TPNAME1= <>
##$TPNAME2= <>
##$TPNAME3= <>
##$TPNAME4= <>
##$TPNAME5= <>
##$TPNAME6= <>
##$TPNAME7= <>
##$TPOAL= (0..7)
0.5 0.5 0.5 0.5 0.5 0.5 0.5 0.5
##$TPOFFS= (0..7)
0 0 0 0 0 0 0 0
##$TUNHIN= 0
##$TUNHOUT= 0
##$TUNXOUT= 0
##$USERA1= <user>
##$USERA2= <user>
##$USERA3= <user>
##$USERA4= <user>
##$USERA5= <user>
##$V9= 5
##$VALIST= <valist>
##$VCLIST= <CCCCCCCCCCCCCCC>
##$VD= 0
##$VDLIST= <DDDDDDDDDDDDDDD>
##$VPLIST= <PPPPPPPPPPPPPPP>
##$VTLIST= <TTTTTTTTTTTTTTT>
##$WBST= 1024
##$WBSW= 4
##$XGAIN= (0..3)
0 0 0 0
##$XL= 0
##$YL= 0
##$YMAX_a= 542437
##$YMIN_a= -645355
##$ZGOPTNS= <>
##$ZL1= 120
##$ZL2= 120
##$ZL3= 120
##$ZL4= 120
##$ABSF1= 14.98061
##$ABSF2= -5.57192
##$ABSG= 5
##$ABSL= 3
##$ALPHA= 0
##$AQORDER= 0
##$ASSFAC= 0
##$ASSFACI= 0
##$ASSFACX= 0
##$ASSWID= 0
##$AUNMP= <proc_prof1d_extract_pilot.lims>
##$AXLEFT= 0
##$AXNAME= <>
##$AXNUC= <1H>
##$AXRIGHT= 0
##$AXTYPE= 0
##$AXUNIT= <>
##$AZFE= 0.1
##$AZFW= 0.1
##$BCFW= 0
##$BC_mod= 0
##$BYTORDP= 0
##$COROFFS= 0
##$CY= 15
##$DATMOD= 1
##$DC= 0
##$DFILT= <>
##$DTYPP= 0
##$F1P= 0
##$F2P= 0
##$FCOR= 0.5
##$FTSIZE= 32768
##$FT_mod= 6
##$GAMMA= 0
##$GB= 0
##$INTBC= 1
##$INTSCL= 1
##$ISEN= 128
##$LB= 0
##$LEV0= 0
##$LPBIN= 0
##$MAXI= 10000
##$MC2= 0
##$MEAN= 0
##$ME_mod= 0
##$MI= 0
##$NCOEF= 0
##$NC_proc= -8
##$NLEV= 6
##$NOISF1= 0
##$NOISF2= 0
##$NSP= 0
##$NTH_PI= 0
##$NZP= 0
##$OFFSET= 14.98061
##$PC= 1
##$PHC0= 213.5138
##$PHC1= 0
##$PH_mod= 1
##$PKNL= yes
##$PPARMOD= 0
##$PPDIAG= 0
##$PPIPTYP= 0
##$PPMPNUM= 2147483647
##$PPRESOL= 1
##$PSCAL= 4
##$PSIGN= 0
##$PYNMP= <proc.py>
##$REVERSE= no
##$SF= 400.13
##$SI= 32768
##$SIGF1= 0
##$SIGF2= 0
##$SINO= 400
##$SIOLD= 32768
##$SPECTYP= <>
##$SREGLST= <1H.CDCl3>
##$SSB= 0
##$STSI= 32768
##$STSR= 0
##$SW_p= 8223.68421052632
##$SYMM= 0
##$S_DEV= 0
##$TDeff= 65536
##$TDoff= 0
##$TI= <>
##$TILT= no
##$TM1= 0
##$TM2= 0
##$TOPLEV= 0
##$USERP1= <user>
##$USERP2= <user>
##$USERP3= <user>
##$USERP4= <user>
##$USERP5= <user>
##$WDW= 1
##$XDIM= 32768
##$YMAX_p= 463506117
##$YMIN_p= -701092
##$CURPLOT= <Network HP LaserJet P1505>
##$CURPRIN= <$Network HP LaserJet P1505>
##$DFORMAT= <normdp>
##$LAYOUT= <+/1D_H.xwp>
##$LFORMAT= <normlp>
##$PFORMAT= <normpl>
##$SURQMSG= 1
$$ End of Bruker specific parameters
$$ ---------------------------------
##NTUPLES= NMR SPECTRUM
##VAR_NAME=  FREQUENCY,     SPECTRUM/REAL,   SPECTRUM/IMAG
##SYMBOL=    X,             R,               I
##VAR_TYPE=  INDEPENDENT,   DEPENDENT,       DEPENDENT
##VAR_FORM=  AFFN,          ASDF,            ASDF
##VAR_DIM=   32768,         32768,           32768
##UNITS=     HZ,            ARBITRARY UNITS, ARBITRARY UNITS
##FACTOR=    0.250966925370066, 1,           1
##FIRST=     8223.43324360095, 124963,       -106219
##LAST=      0,             -24723,          80972
##MIN=       0,             -701092,         0
##MAX=       8223.43324360095, 463506117,    0
$$ Real data points
##PAGE= N=1
##DATA TABLE= (X++(R..R)), XYDATA
$$ [...]
19535h3251C27244d7151k11517d5049j19820P7979G8824c06388F447a06996B02817
19523a40742N8364B8061J84096a71015A77083b00486J6973O7342M4496B38167
19512i375j57089j01251a10789j49257A29626a57636A72752D8966c71318h3953
19501f6624A06335b85576I3302A8998c55538b6132p1406I0651K7977b95821c4715
19489d4115o3848B36134o5474b86933I3070e95761i0821K6333A87760a36515j05711
19478b42226D0339J06016D1108a97240M8143r4456A21364b72121A6106b86735
19467c0061A42778i4833j5616D4553G329b3201m3951E3783f7189j25309A31284
19455B24675m8338a58129j653E809a5040r6267d987j26112B06679b70041J33061
$$ y = [-83251, 327244, -47151, -258668, -45049, -164869, -86890, 78824, -306388, 6447, -106996, 202817, -140742, -82378, 28061, 212157, -171015, 177083, -200486, -183513, -116171, -71675, 238167, -9375, -166464, -267715, -110789, -260046, 129626, -157636, 172752, 48966, -371318, -83953, -66624, 106335, -285576, 93302, 18998, -355538, -26132, -97538, 90651, 118628, -295821, -34715, -44115, -107963, 236134, 170660, -286933, 93070, -595761, -90821, -64488, 187760, -136515, -242226, 40339, 146355, 41108, -197240, -149097, -243553, 121364, -272121, 16106, -286735, -30061, 142778, -94833, -110449, 44553, 7329, -23201, -67152, 53783, -67189, -192498, 131284, 224675, 176337, -158129, -159782, 5809, -15040, -111307, -4987, -131099, 206679, -270041, -136980]
19444a36980I7820E578a68707j98491D0666L8446f1725p6144j70090A98419J81744
19433C80163b55379E6100B858K54509c00607a49909c8797j69519l38343i6229
19422B6353M36K77692b02477P5865j61511K7096j04588d670j48250A83620a15155
19410b24261F770M121b1128A57808c8326j13363A97954h4363D74006d00010a40935
19398a65606j6035B00560a50247J11j2201o9222j76347L6674n3386b6231n819
19387c2050k93383I2541n267a80125J690n4495i6275k19177J50811O1589A68609
19375B3647f7769a3285k61366B07801a41804D3808f6078b8342j24264M8005J6183
19364h8418q4692l15003b3740C8627J29104o8776a38633F1062i5892a9138F122
$$ y = [-136980, 97820, 5578, -168707, -367198, 40666, 79112, -61725, -137869, -307959, 198419, 380163, -255379, 56100, 2858, 257367, -300607, -149909, -38797, -208316, -546659, -96229, 26353, 26789, 304481, -202477, -126612, -288123, -261027, -365615, -4670, -152920, 183620, -115155, -224261, 6770, 10891, -21128, 157808, -38326, -151689, 197954, -84363, 474006, -400010, -140935, -165606, -181641, 200560, -150247, -150136, -162337, -231559, -407906, -371232, -424618, -26231, -32050, -325433, 92541, 87274, -180125, -178435, -232930, -96275, -315452, -164641, -103052, 168609, 23647, -67769, -13285, -274651, 207801, -141804, 43808, -66078, -28342, -152606, -104601, -88418, -173110, -488113, -23740, 38627, 167731, 98955, -138633, 61062, -95892, -19138, 6122]
19352F8831b41920a2985B8667c20625B54393b45856C6800R0673O531P927a03748
19340a40734c1638I8403a39596j85069F8636a19989B12431a9113j92018A04711
19329A54192g9926A00883G837K5748J6953e9205j40936h9387j18787c2245M693
19318b7552p4680k89829n8233a90860A61968c4901k32828g2396a6633k43390R6902
19307a63121O3722J6536B97546j40335b12273j79601a35867A9886C307a54311
19296b75471o3420D3763K48L37909a60227A93651e6566H5026a87803j50475j1902
19285c50180g1636I1304J0875h2483b1116R636l14745C89702a47190O6208A48335
19273c32853A44189K1292g5577j85030R0047n081j32912Q8430A73928M9083b64975
$$ y = [68831, -241920, -12985, 28667, -320625, 254393, -245856, 36800, 127473, 134004, 141931, -103748, -140734, -31638, 98403, -139596, -324665, 68636, -119989, 212431, -19113, -211131, 104711, 154192, -79926, 100883, 7837, 33585, 50538, -59205, -200141, -89387, -208174, -32245, -27552, -102232, -392061, -450294, -190860, 161968, -34901, -267729, -72396, -16633, -260023, -163121, -99399, -82863, 297546, 157211, -212273, -391874, -135867, 19886, 3307, -154311, -275471, -338891, 43763, 44011, 381920, -160227, 193651, -56566, 85026, -187803, -338278, -350180, -71636, 91304, 102179, -82483, -21116, -11480, -326225, 389702, -147190, -80982, 148335, -332853, 144189, 165481, -75577, -260607, -170560, -175641, -308553, -220123, 173928, 223011, -264975]
19261A9831a47061e9660C751J24820A2490l871f3037A57815G0020J23356r0155
19250A03221D8937J42960i1076N031j10885A76590D6737a07494j31596B8336a80545
19238d0704G7310a47705k91090B22245b04592A6505N1668K0829d187j51067e3662
19226H2598a2415j12883N4438j1936k67035D152K92695b21298H5432a41203H8
19214A69514K5100H78J28736e13036a17175B4015a07385o2796A09906a66617K2127
19203a44490D9792A786b2847j1982j20456L5813G3029K31533a00641B00320a94368
19191E17644a01331p5222Q4556j22893Q5194F0612b0679o967n0701j67917H7094
19179B82152a33515O3381F1587h9930c125r1741D58167F5835g3579k35866A31719
$$ y = [19831, -147061, -59660, 3751, 128571, 12490, 8619, -63037, 157815, 70020, 193376, 103221, 48937, 191897, -91076, -86045, -196930, 176590, 46737, -107494, -239090, 28336, -180545, -40704, 77310, -147705, -438795, 222245, -204592, 16505, 68173, 89002, -4187, -155254, -53662, 82598, -12415, -125298, -70860, -82796, -349831, 4152, 296847, -221298, 85432, -141203, 88, 169514, 194614, 878, 129614, -513036, -117175, 24015, -107385, -170181, 109906, -166617, -144490, 49792, 1786, -22847, -34829, -155285, -119472, 73029, 304562, -100641, 200320, -194368, 517644, -101331, -176553, -91997, -214890, -129696, 60612, -20679, -27646, -78347, -246264, 87094, 282152, -133515, -70134, 61587, -89930, -3125, -94866, 458167, 65835, -73579, -309445, 131719]
19167i4736e016q6205d4500D8321a88592b5860j67814h8149J637a3854j43601
19156a57455K7471L6269B11263b01731P1171C75851A64085l2016b1219q9609p8660
19145a89488H5838c06323J41356g2349P21j5646p4570r5141m2436D2353a43245
19133B14403b22943g5675n5578m083A86350C3323Q6166b84798G7952Q3669J4665
19122A76286b00235P7451b0335k41328Q5625L9044j39668B7791b33181i5792F5973
19110C66593b14687j11019d2392j90224j29236A5755a44485o0445a00861A4019
19099i5556l6459c8398k7059k52288C22949c03415a12554A9547a25805A0210c28281
19087B61b94629a21078r9789P5574j35109m8985D2319P2J56150b08358A69504
$$ y = [-94736, -5016, -91221, -44500, 48321, -188592, -25860, -193674, -88149, -86512, -13854, -157455, -129984, -93715, 211263, -201731, -130560, 375851, 164085, 132069, -21219, -110828, -189488, 85838, -306323, -164967, -72349, -71628, -87274, -161844, -256985, -299421, 42353, -143245, 214403, -222943, -75675, -131253, -135336, 186350, 33323, 119489, -284798, 77952, 161621, 176286, -200235, -122784, -20335, -261663, -176038, -136994, -276662, 27791, -233181, -95792, 65973, 366593, -214687, -325706, -42392, -232616, -361852, 15755, -144485, -204930, -100861, 14019, -95556, -132015, -38398, -65457, -317745, 322949, -303415, -112554, 19547, -125805, 10210, -328281, 261, -294629, -121078, -220867, -145293, -280402, -329387, 42319, 42391, 198541, -208358, 169504]
19075b08429H7400a82460L7281N3344A20995b62124R7753D5468E677J17091a4258
19063G3912a39367K9005c6872j75900B33492a87485d4882p7349j94394M4364B62423
19051I8452C2973c4933k12499g1294A53927o7146J11434a97967B07986c34647
19040a64625K8034F2343J02788a22832n4400A94647i4037j06562l4241i5015b1601
19028A25878c43466D0260K4915a64508C64365j76078c80174A39003D9648c5229
19017C69373J28208B30465a22742A90657C8737J18858O0964b30612j0955R9122
19007a42445G6147a75297h1947l2221n0212A43659c48749A04563g7605a8338k24565
18996b42903A21838c0161A77720n7545d15652e1601a699k53535E875J98890n2728
$$ y = [-208429, 87400, -182460, -145179, -91835, 120995, -262124, -164371, 45468, 5677, 122768, -14258, 73912, -139367, -110362, -36872, -212772, 233492, -187485, -44882, -122231, -316625, -272261, 262423, 98452, 32973, -34933, -247432, -71294, 153927, 86781, 198215, -197967, 207986, -334647, -164625, -136591, 62343, 165131, -122832, -177232, 194647, -94037, -200599, -234840, -95015, -21601, 125878, -343466, 40260, 65175, -164508, 364365, 188287, -380174, 139003, 49648, -35229, 369373, 497581, 230465, -122742, 190657, 38737, 157595, 218559, -230612, -241567, -142445, 76147, -175297, -81947, -114168, -164380, 143659, -348749, 104563, -77605, -18338, -242903, 121838, -30161, 177720, 120175, -415652, -51601, -1699, -255234, 5875, 204765, 152037]
18985A52037p5708a07367k65168I2061a21338j19912A79414b91647A9208d50042
18974C96218a34451A6656a79548Q5006C62801A12693h782j82490c9081m6179M2015
18963d3245i852q3878j21240B82453A12944c45642G7707c4588C2484c5691f291
18951A39482c19615B51750r0044f9848g342o5860B18796a97327E4838a21326A08182
18939a16270A16230a06543n4260m24693I8951J11703A6202N5953M6405Q2376e21480
18927i5948B99638c16453b9486F8282C41J4325b21955b9212m23223B25791c15425
18915B01918M8688P0266A10680c13155h605j06928B1927a7853j1699B74853m7754
18904B27099a34168O4264j9170A86946M6147a53604e3700k08540n5748a42720
$$ y = [152037, 76329, -107367, -372535, 92061, -121338, -241250, 179414, -291647, 19208, -450042, 396218, -134451, 16656, -179548, -94542, 362801, 112693, -8782, -191272, -39081, -85260, -43245, -9852, -93730, -214970, 282453, 112944, -345642, 77707, -34588, 32484, -35691, -6291, 139482, -319615, 251750, 161706, -69848, -7342, -73202, 218796, -197327, 54838, -121326, 108182, -116270, 116230, -106543, -160803, -585496, 98951, 210654, 16202, 72155, 118560, 200936, -521480, -95948, 299638, -316453, -29486, 68282, 341, 14666, -221955, -29212, -452435, 225791, -315425, 201918, 250606, 320872, 110680, -313155, -8605, -115533, 21927, -17853, -29552, 274853, 227099, -134168, -69904, -89074, 186946, 233093, -153604, -53700, -262240, -317988, -142720]
18893A1305a45098f7334b4606k4865j53679d7592p5447o0847o7597c2995j8565
18882e1560A8203a13545A63683b96538H1984a17646b7550r0958N869C6253K053
18871C8306d21844H5177g2923p7260D30303i1376m8126b2755k7054l59429M6275
18860c62963A5257O1368k5496c21764C46776A62784e3705H311h4140l8419B30149
18848A31065k2134i0224F0656i1318A69984a88172A1425b86408f2059K9489l281
18837c5851B31758b58294B77090b29276e3891r4459F5610J06404g4166B3183g109
18825h0955L4471o309j03198F5319b08592R0444k14826d7158A54069a78370j57267
18814c35637A65469f9249A6867J11145n6205J85654a62118E9897N7978d6077j99458
$$ y = [11305, -145098, -67334, -24606, -49471, -203150, -47592, -123039, -183886, -251483, -32995, -51560, 18203, -113545, 163683, -296538, 81984, -117646, -27550, -118508, -112639, 36253, 38306, -421844, 85177, -72923, -150183, 430303, -91376, -139502, -22755, -49809, -409238, -362963, 15257, 76625, 51129, -321764, 346776, 162784, -53705, 8311, -84140, -122559, 230149, 131065, 108931, -90224, 60656, -91318, 169984, -188172, 11425, -286408, -62059, -32570, -35851, 231758, -258294, 277090, -229276, -53891, -148350, 65610, 172014, -74166, 23183, -7109, -80955, -46484, -52793, -155991, 65319, -208592, -118148, -332974, -47158, 154069, -178370, -335637, 165469, -69249, 16867, 128012, 71807, 257461, -162118, 59897, 117875, -46077, -245535]
18803b45535A48358h4206B72788c547D58872n6301b19156r4145c7984A18871c33984
18791B24562q2376a95247b1233m54152C21056b13629J1116E2202c01909f8468
18780d9117j54762F3952c75212a35204B72552A7482a94477A17052m6495g6534
18769d322l90832i5404k45748J68476D2747c4621q3491d0980A11894b44114p4593
18758c18707A19512l9331c01433F17701F5404K49829c66381C0618L6600c83738
18747a55458E4621c39885B98611A27627d8929j16195A99666H2451N2665l2699
18737A02417b45327C57873d5827A6928b59081B3062L58226A47151f6393C5822
18726g6981j83092b5184l2178j96743a15931k18734N2825a26685o2771N3512k84923
$$ y = [-245535, 148358, -84206, 272788, -3547, 458872, 402571, -219156, -313301, -37984, 118871, -333984, 224562, 142186, -195247, -21233, -475385, 321056, -213629, -202513, 52202, -301909, -68468, -49117, -203879, 63952, -375212, -135204, 272552, 17482, -194477, 117052, 70557, -76534, -4322, -395154, -95404, -341152, -172676, 42747, -34621, -118112, -40980, 111894, -244114, -318707, 119512, 80181, -301433, 617701, 65404, 315233, -366381, 30618, 67218, -383738, -155458, 54621, -339885, 298611, 127627, -48929, -165124, 199666, 82451, 135116, 102417, -245327, 357873, -45827, 16928, -259081, 23062, 381288, 147151, -66393, 35822, -76981, -260073, -25184, -57362, -254105, -115931, -334665, -281840, -126685, -189456, -135944, -420867]
18715d20867d0742e736j59986B12123j05549a74468j62189e191q3878c5850a1634
18703b50119A25437l7353f6586b5911o4757L3673R206D2202i8017a6210A85211
18691a14400j29377K4235d1456l93731B9564i6059b6378A46337a33549A92939
18680c60491N6534B67888a80254B14181a40529l03039a25341q5969b2427A24117
18669a59765m6156a8698n2457A99334r302F2449J07546D5808D389J85416g1309
18657c0731F1641a46167N6254D5813a51859P5077I6938b70246i6265k1155k75022
18646c92442a13247k81988e5189j00274G456c15698B64028n2696L5560b30974
18635b68033a31035A42196P0234E1134a68036l25595B07255G4484d3558j0413
$$ y = [-420867, -40742, -5736, -165722, 212123, 106574, -174468, -336657, -5191, -89069, -35850, -11634, -250119, 125437, 88084, -66586, -25911, -90668, -56995, -47789, 42202, -98017, -16210, 185211, -114400, -243777, -219542, -41456, -435187, 29564, -96059, -26378, 146337, -133549, 192939, -360491, -303957, 267888, -180254, 214181, -140529, -443568, -125341, -211310, -22427, 124117, -159765, -205921, -18698, -71155, 199334, 190032, 62449, 169995, 45808, 4389, 189805, -71309, -30731, 61641, -146167, -89913, 45813, -151859, -76782, 96938, -270246, -96265, -117420, -392442, -113247, -395235, -55189, -155463, 7456, -315698, 264028, 211332, 246892, -230974, -268033, -131035, 142196, 212430, 51134, -168036, -493631, 207255, 74484, -43558, -53971]
18625e3971l59459g5307E9600h354r0251L3455B53652A6961O4734b30280g5383
18613b6395k51863B9658c39265J13470a3982B08628M2031C9380a75858G4494a27906
18601B53895d03798a46949F2124b21056F3152b84580a09727g671B33097D4957
18590a91307o544n5961J08387C02407e1934J3489D95115f3246K5596r8468A56937
18578G7087L2253l8417J39952b53961d8205j69372A08622K38489c07596F6723
18567a33663E8010f6760B1053N2964d35561g4846L39j32373C2459b37279k9374
18556b66653O7224e6q9108h112j2010k33334O0092a5490A24070a22133L468j04510
18544b23175F9013c1686I6324b36009H0856P7277g8731L7513k17592f6586j04487
$$ y = [-53971, -413430, -75307, 59600, -8354, -98605, -65150, 253652, 16961, 81695, -230280, -75383, -26395, -278258, 29658, -339265, -225795, -13982, 208628, 250659, 39380, -175858, 74494, -127906, 253895, -403798, -146949, 62124, -221056, 63152, -284580, -109727, -7671, 233097, 44957, -191307, -197851, -253812, -145425, 302407, -51934, -38445, 495115, -63246, -37650, -136118, 156937, 77087, 109340, 70923, 210875, -253961, -48205, -217577, 108622, 347111, -307596, 66723, -133663, 58010, -66760, 21053, 74017, -435561, -74846, -74507, -206880, 32459, -237279, -266653, -199429, -56, -89164, -8112, -20122, -253456, -193364, -15490, 124070, -122133, -118665, -223175, 69013, -31686, 96324, -236009, 80856, 158133, -78731, -41218, -258810, -66586, -171073]
18533a71073A31968m6755b51302d6594p4829C3212M3433l114e2471g172D2227
18521H4802Q5550b52944H5794J00149D7075J05364b5277k00575a02300A77663
18510c3492l04291d6953k32996h243j44036A13738a18508B82267F9704b1435p9519
18499a00954p3785A51675b46586P8905A19345d04362E6734J33500a85360A17420
18488c02352D8745J23357m1880J5143b03274R3229a3712A20040C5732d1994j05946
18477a47940q8305A30710a99514j54973h0908A52940j7399b38478n2970B01285
18466A06632h6648j01192k9505q80A06828p14L8853M7161A9016a12445A40675
18454A70308J63128a9631A33891f7510k29311J47694j7175B6214K92337D1521
$$ y = [-171073, 131968, 85213, -251302, -46594, -121423, 33212, 76645, 73531, -52471, -7172, 42227, 84802, 170352, -252944, 85794, 185943, 47075, 152439, -25277, -225852, -102300, 177663, -33492, -337783, -46953, -279949, -8243, -152279, 113738, -118508, 282267, 69704, -21435, -100954, -174739, 151675, -246586, -167681, 119345, -404362, 56734, 190234, -185360, 117420, -302352, 48745, 172102, 130222, 145365, -203274, -110045, -13712, 120040, 35732, -41994, -147940, -236245, 130710, -199514, -354487, -80908, 152940, 135541, -238478, -291448, 201285, 106632, -86648, -187840, -217345, -218225, 106828, 106114, 144967, 192128, 19016, -112445, 140675, 170308, 333436, -19631, 133891, -67510, -296821, -149127, -166302, 26214, 318551, 41521]
18443b23447f6106K9158a7406j54743N9811B00330c56865h5823k63862O8778A3135
18431B26577G1541M0976a79473j1894c1175B8980J59637B9070M49531a42711E3912
18419a0014k61015A29370l1246f6744j35069b0418I7684i8445o3591M7908j9396
18408a33524j04170O5269D0703f56024C9799J2876c50657a30214r1258r0365a17842
18396b3893j07644A10530c04379B76800a96929A38698g9300j18858I0882a12251
18385b19164B6248Q2661I370Q2083c61873i7893j77045A11975d3010H159J85806
18374A93965k6092B0500b0191q9655B01156b09511a3898l08807b1891k90327c8299
18362a32994k4955C1294f2957k49650H2880J10278M8270r8125f5941j44810I1464
$$ y = [-223447, -66106, -36948, -17406, -172149, -112338, 200330, -356865, -85823, -349685, -280907, 13135, 226577, 71541, 112517, -179473, -191367, -31175, 28980, 188617, 29070, 478601, -142711, 53912, -10014, -271029, 129370, 98124, -66744, -201813, -20418, 97684, -98445, -162036, -114128, -133524, -237694, -172425, 40703, -656024, 39799, 52675, -350657, -130214, -221472, -311837, -117842, -23893, -131537, 110530, -304379, 276800, -196929, 138698, -79300, -198158, 90882, -112251, -219164, 26248, 108909, 9370, 91453, -361873, -97893, -274938, 111975, -43010, 8159, 193965, 167873, 20500, -20191, -109846, 201156, -209511, -13898, -322705, -21891, -312218, -38299, -132994, -157949, 31294, -62957, -312607, 82880, 193158, 241428, 143303, -65941, -210751, 91464]
18350g2261b1486n7456i937k2621B34941C2170d7261I431K41452f6074j12878
18339a78952d5424k63602B11925l234e6795j97811a7822A09452e9811m9535D6772
18327H7688b20723E777e23749A43930b11258N837M3781p9924A55710a89878D3321
18315A34137l5527a55963E6957R0521R366B1882b12103j82140D198b964k19941
18304b22905P5800l5083l4910e3768B5102c84253A46508o3874C7182b95133d9590
18292F537R6249g7732j7223j19356K9366B32013b41951j63913B29457a44235A0196
18280a17242k49634J73276b1971A45426E8892c78708d3856B62887e599j89433
18270a95032I3431l1269a41959C5999j0654b77054C5131i0029o1949d4868k31070
$$ y = [-72261, -21486, -78942, -9937, -32558, 234941, 32170, -47261, 9431, 250883, -66074, -178952, -45424, -309026, 211925, 208691, -56795, -254606, -17822, 109452, -59811, -109346, 46772, 87688, -220723, 5777, -523749, 143930, -211258, -205421, -161640, -241564, 155710, -189878, 43321, 134137, 98610, -155963, 56957, 147478, 156844, 21882, -212103, -394243, 4198, -2964, -222905, -147105, -182188, -217098, -53768, 25102, -384253, 146508, 82634, 37182, -295133, -49590, 6537, 102786, -77732, -94955, -214311, -184945, 232013, -241951, -405864, 229457, -144235, 10196, -117242, -366876, -193600, -21971, 145426, 58892, -378708, -43856, 262887, -5599, -195032, 93431, 62162, -141959, 35999, 25345, -277054, 35131, -90029, -151978, -44868, -275938]
18259b75938a16662d1758D09616b43795c9456E8397M877K42178b73917d9659C8464
18247f6847H568M9279J58060b18538j2105D4173a7248D1425J27840b50244B8467
18235C00518i7870r9716N9960A56422a05145I5758a57525F4757b26196l8090F7689
18223a35178A30959b21952M6449A04058m8941J80835a50171m0344A00573B1931
18212B2968g0241k83868B9308b9207B3019N6190K9019a78342l642A65582b74053
18200c32301c118j00459k7622l6915c2087j32313A02852J9944J07854A14055b38010
18188a74988l0581k2298h8762b8670m9401j02822C2519a56440n893B25505a64099
18176c64742D25951H2049b4982H5520l987C2874a11495A18013a17871j93388e6912
$$ y = [-275938, -116662, -41758, 409616, -243795, -39456, 58397, 63274, 305452, -273917, -49659, 38464, -66847, 8568, 57847, 215907, -218538, -230643, 44173, -17248, 41425, 169265, -250244, 28467, 300518, -97870, -197586, -137626, 156422, -105145, 95758, -157525, 64757, -226196, -264286, 67689, -135178, 130959, -221952, -175503, 104058, 55117, 235952, -150171, -190515, 100573, 21931, 22968, -70241, -354109, 29308, -29207, 23019, 79209, 108228, -178342, -181984, 165582, -274053, -332301, -3118, -103577, -131199, -168114, -32087, -164400, 102852, 122796, 230650, 114055, -238010, -174988, -205569, -227867, -88762, -28670, -78071, -180893, 32519, -156440, -162333, 225505, -164099, -364742, 425951, 82049, -24982, 85520, 81533, 32874, -111495, 118013, -117871, -311259, -56912]
18164a81640K2635A00866c28280H2736a33468B83238e9548k66473g1691C528a19715
18152a28522B7811K29092F7815A9377b8427j72565e2089H9915a12545l9788k9188
18141a81521j02922A4233c8348H037a4976A53244b02124A064K60225G1245K7555
18130I8800B5642a6441A25789a83041C94600a10931A75356n3119M298O6400D6939
18118a30076A00307a0897B58595A12056a57225A45418a00078H9074d6782j02594
18108a49376E1039c25673A15585l1673J20126G2614J06146q8032f7028l93705
18098d60733D1594J03633b21005a4993I7593K6829C2117o496j122a12264q6299
18087a98563A68001J7329E1331a45102P373A69450g3007L3066j37255g9040j4613
$$ y = [-181640, -159005, 100866, -328280, 82736, -133468, 283238, -59548, -326021, -71691, 3528, -119715, -128522, 27811, 256903, 67815, 19377, -28427, -200992, -52089, 89915, -112545, -152333, -181521, -284443, 14233, -38348, 8037, -14976, 153244, -202124, 1064, 261289, 71245, 98800, 25642, -16441, 125789, -183041, 394600, -110931, 175356, 122237, 126535, 192935, 46939, -130076, 100307, -10897, 258595, 112056, -157225, 145418, -100078, 89074, -46782, -149376, 51039, -325673, 115585, 83912, 204038, 72614, 178760, 90728, -67028, -460733, 41594, 145227, -221005, -14993, 97593, 124422, 32117, 25621, 24499, -112264, -198563, 168001, 185330, 51331, -145102, -137729, 169450, -73007, -39941, -177196, -79040, -93653]
18076i3653G6867a89460a6055j6070B71001A34487n6255a48980d8018B00861G0932
18064i185j57460A9964J60604e8276j71828H4063B0524J22942a78048e1185C5452
18052d6032r5928C4459d6730C2735h4118H5342e4646j86314E2483R8447b12543
18040a2540j35970B38326c79881a16602o1915A4036J26369A9897a4373B63929
18029B20459l2958a72993O352C3582L24396E3594f0088j89902h8223n1082e7166
18017a615k69359m0905d2375H3875k3069b31509r2528A09506b35058A15333c28055
18005E6211a03941b8805k8527c233A19040k0721m2633J19125D599Q0546M4647
17994A29792a32871k4006E8781a19018A42551a71026k56422K10536m1140h1173
$$ y = [-93653, 76867, -189460, -16055, -32125, 271001, 134487, 78232, -148980, -48018, 200861, 70932, -9185, -166645, 19964, 180568, -58276, -230104, 84063, 20524, 143466, -178048, -51185, 35452, -46032, -141960, 34459, -46730, 32735, -84118, 85342, -54646, -240960, 52483, 150930, -212543, -12540, -148510, 238326, -379881, -116602, -178517, 14036, 140405, 19897, -14373, 263929, 220459, 187501, -172993, -166641, 33582, 357978, 53594, -60088, -249990, -88223, -139305, -57166, -1615, -270974, -311879, -42375, 83875, 60806, -231509, -324037, 109506, -235058, 115333, -328055, 56211, -103941, -28805, -57332, -3233, 119040, 98319, 55686, 174811, 4599, 85145, 129792, -132871, -156877, 58781, -119018, 142551, -171026, -427448, -216912, -258052, -81173]
17983a18316A90296K00591D052e795j90968m81017a03893r1466a6618l8128o5396
17972a20142A31442n6700M1370c2008C25391i3926c4824p6972l7815l0470b9474
17960b94873i8780L8912b5289G1455a31225F9016K8052c1598a2449l31245i1226
17948B39730C9289a12479a9762B52340E0608M0296C9608e6304A8813B903a8063
17936e8235j21067L578a8291m0013K6155C00455b9475I8751M3481A0231K70209
17925B80440b372k32888K4152O6608O8558B656K34930m0279J41675a34093q8930
17914b23023B5470J45526a33499F0365b36971G8152c6078B10465a89183Q8402
17904a00781A00990b48547G6125g4055j6396A61697g4389j57662F3450c52426
$$ y = [-118316, 190296, 390887, 4052, -5795, -196763, -677780, -103893, -195359, -16618, -54746, -120142, 131442, 74742, 116112, -32008, 325391, -93926, -34824, -111796, -149611, -180081, -29474, -294873, -98780, -59868, -25289, 71455, -131225, 69016, 97068, -31598, -12449, -343694, -91226, 239730, 39289, -112479, -19762, 252340, 50608, 90904, 39608, -56304, 18813, 2903, -18063, -58235, -179302, -175724, -18291, -58304, -32149, 300455, -29475, 98751, 142232, 10231, 280440, -2372, -235260, -211108, -144500, -75942, 2656, 237586, 197307, 338982, -134093, -223023, 25470, 170996, -133499, 60365, -236971, 78152, -36078, 210465, -189183, -100781, 100990, -248547, 76125, -74055, -90451, 161697, -74389, -232051, 63450, -352426]
17893c53586E4387M98974B37700a89985f2207A35775a32513k92198A3553c00179
17882D9141c17995a49760D3639g9476D939J68145n2372J90276h0832a3521B9606
17870B99738F9753d06773A48997F885f093H9300h3777o3655J5073d1575K680B0035
17857A31976e5295j58934B9223K2247Q6663e0140C3682N1887R245a37853F2553
17845g906B03794b48745F9297e2183A59646K53582q7318a79855n7824h6265C61234
17833C1115e2559A31051g931k59187b0594A18148e4945k10288a22006l3060l722
17822a58788N9071A96357I6194a59036j79938A17818a73973d123A03001a04510
17811b38935e3107C59611f6766r1849A79854b53307B50871f7728l04240B42873
$$ y = [-353586, 54387, 553361, 237700, -189985, -62207, 135775, -132513, -424711, 13553, -300179, 49141, -317995, -149760, 43639, -79476, 4939, 173084, 120712, 310988, -80832, -13521, 29606, 299738, 69753, -406773, 148997, 6885, -6093, 89300, -83777, -147432, -132359, -41575, -38895, 20035, 131976, -55295, -214229, 29223, 51470, 138133, -50140, 33682, 85569, 94814, -137853, 62553, -7906, 203794, -248745, 69297, -52183, 159646, 413228, 325910, -179855, -237679, -86265, 361234, 31115, -52559, 131051, -7931, -267118, -20594, 118148, -54945, -265233, -122006, -155066, -158788, -99717, 196357, 96194, -159036, -338974, 117818, -173973, -4123, 103001, -104510, -238935, -53107, 359611, -66766, -158615, 179854, -253307, 250871, -67728, -371968, 242873]
17800g4721F4247b14163A95239q2674R2216f9724r2200B06986a05215N135H0873
17788a1435A28914f133l41269B30358p4296g7578C3994b66082a22835N815p0591
17777a87611E5159e913D60905a7368k49549F5476R540e6421K6531l13600B60155
17765d00080g5717A67905Q321d5932E977N2516c31474J45258F2353b66978B52913
17753A1376b56530H7223K500J0425c19600A16668R5919l4090i4396c1887n7585
17742h9472A18615f4976B46034D6001c42023J15856I9635b14451G9358K44020
17732C23378D0087e9161k6894A75454k1013F1261N7842a95150A51131a0341B78407
17720e6570A55559a87489A03871m1788J28299p9063N812J50816D2528Q5836f2924
$$ y = [-74721, 64247, -214163, 195239, 112565, 204781, -69724, -161924, 206986, -105215, -100080, 80873, -11435, 128914, -6133, -347402, 230358, 156062, -77578, 33994, -266082, -122835, -117020, -187611, 55159, -5913, 460905, -17368, -266917, 65476, 75016, -56421, -29890, -343490, 260155, -400080, -75717, 167905, 176226, -45932, 5977, 58493, -331474, -186216, 62353, -266978, 252913, 11376, -256530, 87223, 89723, 100148, -319600, 116668, 212587, 178497, -94396, -31887, -89472, 118615, -64976, 246034, 46001, -342023, -226167, 99635, -214451, 79358, 323378, 40087, -59161, -86055, 175454, 154441, 61261, 119103, -195150, 151131, -10341, 278407, -56570, 155559, -187489, 103871, 62083, 190382, 111319, 117131, 267947, 42528, 128364, -62924]
17708A30844a77647A42836J32203e0191j15015r8824G096O2291d2049A12999J65945
17697B78944b99138A30279E4872d49195c8651A16631R5271E7691O1452f2535D7271
17685b7920A99979H975J6067d4964J8192B50085C4152h9922A5028b17880A24229
17673d5619A51976F0492J67064a17992A02832a58785o9621e2221j92159b5385
17662b35195C7244a8484A10255b77677e8201j0079B10751f0933j15939C8087c69613
17650a86922k9659D0067c15003C24041a7282l1137k46861I356D632a612j66760
17639a68372O6621A70K46319a99775e0999A38414b69555J32787f6954q5953K0611
17628a32296a6828A860J53577N7446c4967p0160j7781G6877N96M9008c30017F964
$$ y = [130844, -177647, 142836, 275039, -50191, -165206, -264030, 7096, 69387, -42049, 112999, 278944, -299138, 130279, 54872, -449195, -38651, 116631, 211902, 57691, 119143, -62535, 47271, -27920, 199979, 8975, 25042, -44964, -26772, 250085, 34152, -89922, 15028, -217880, 124229, -45619, 151976, 60492, 227556, -117992, 102832, -158785, -228406, -52221, -244380, -25385, -235195, 37244, -18484, 110255, -277677, -58201, -68280, 210751, -60933, -176872, 38087, -369613, -186922, -216581, 40067, -315003, 324041, -17282, -48419, -295280, 9356, 4632, -1612, -168372, -101751, 170, 246489, -199775, -50999, 138414, -269555, -136768, -66954, -152907, -132296, -16828, 1860, 155437, 212883, -34967, -105127, -122908, 76877, 77473, 126481, -330017, 6964]
17615a58765B59087I2138l1810J96407a23164A24555a24472A17784C3682K96097
17605C29779a36853k0457A28000a58701A50213J43242G0659K94972B2395a57433
17594A40983K71615d8401A22895N8202p6342a31733B32280L2329G4764a44392
17583A59086h9599A56150a41946B27657A4544J74919d1084B0061c14097A03786
17572c665E606h9809C6837a19964E0775b18663B61Q7198K05881H7971O582a36181
17559a11184B85807p5459b472j89058C46731h4935B06027e9201C29839r6788j05013
17548A28038Q043d0180I5678b85174A29261b17391a4039m7932o2451A11778b3345
17536a4532A69185p0808A6478a74222A75921l8022a82536M1680B53531k5327A06051
$$ y = [-158765, 259087, 92138, 60328, 256735, -123164, 124555, -124472, 117784, 33682, 329779, -136853, -157310, 128000, -158701, 150213, 293455, 70659, 365631, 22395, -157433, 140983, 412598, -48401, 122895, 181097, 104755, -131733, 232280, 264609, 74764, -144392, 159086, -89599, 156150, -141946, 227657, 14544, 189463, -41084, 20061, -314097, 103786, -3665, 5606, -89809, 36837, -119964, 50775, -218663, 261, 87459, 293340, 87971, 94553, -136181, -111184, 285807, 210348, -2472, -191530, 346731, -84935, 206027, -59201, 329839, 233051, 128038, 136081, -40180, 95678, -285174, 129261, -217391, -14039, -61971, -124422, 111778, -23345, -14532, 169185, 98377, 16478, -174222, 175921, 137899, -182536, -140856, 253531, 228204, 106051]
17524A57345a41675j55961a39233D6829J55243j2057R5832a6961k39187A35702
17513A79929J44217p9038a46815b2244n4792E4681d6448A0610b67664c6260B88025
17501C6514J57724I6528g4851B63914E7286a34876E4805J68276d5605A1814a97052
17489A75080a91322B63644I6094L3694J3514j9455k694L7555J3826H0969P6785
17478A57754a74378F0119M9819J63862A33610c6235C95809F7804K31339B7405
17467B26642j12876b2946B87383j33842a1036G5722K73692e7835D1067K34648
17457B75715e2141C6350K01933m2079N1072R8606a18099b2372p3389C26273B0220
17445C6793a97541B08331J73057A69829b26036D2191K76566A27708M14420B21330
$$ y = [157345, -141675, -297636, -139233, 46829, 202072, 190015, 285847, -16961, -256148, 135702, 179929, 324146, 245108, -146815, -22244, -77036, 54681, -46448, 10610, -267664, -36260, 288025, 36514, 194238, 96528, -74851, 263914, 57286, -134876, 54805, 223081, -45605, 11814, -197052, 175080, -191322, 263644, 96094, 129788, 143302, 123847, 121153, 158708, 172534, 80969, 157754, -174378, 60119, 109938, 273800, 133610, -36235, 395809, 67804, 299143, 27405, 226642, 113766, -22946, 287383, 153541, -11036, 75722, 349414, -57835, 41067, 275715, -52141, 36350, 238283, 196204, 247276, 345882, -118099, -22372, -95761, 326273, 20220, 36793, -197541, 208331, 381388, 169829, -226036, 42191, 318757, 127708, 542128, 221330]
17434D66433j53467k5622r3994n6467E7372K70470c3848A61421a17978D6330N9483
17423A05813J21283c986B65563j11208P8781K35655B275L76213D0576K20260N2037
17412C12873G9368O884P7732J82659i5626D27042A68171K80841A69629O8852P9921
17401C18402l3431a2985B68677I5148l620J13374r8586P5221a84639D8805c2907
17389E23414b116j51444G7736i9235j6500M024C15197A05431K7632F86O9962a78652
17376e6733D1173J89056J22771k0526l8003k716a6384A31482J72763J19564k09994
17365B13815L3198a63814A30506K39430K13396j08145A02864b91737A27538i5560
17354a04355A22504A0986Q8176K69060d3349A26956A4897K14949o4264a50307
$$ y = [466433, 312966, 287344, 193350, 136883, 57372, 327842, -33848, 161421, -117978, 46330, 105813, 227096, -3986, 265563, 154355, 233136, 468791, 2275, 378488, 40576, 260836, 312873, 79368, 86252, 163984, 346643, -95626, 427042, 168171, 449012, 169629, 238481, 318402, 284971, -12985, 268677, 95148, 91528, 204902, 106316, 181537, -184639, 48805, -32907, 523414, -2116, -153560, 77736, -99235, -115735, -111711, 315197, 105431, 133063, 686, 70648, -178652, -56733, 41173, 230229, 353000, 332474, 294471, 291755, -16384, 131482, 304245, 423809, 213815, 247013, -163814, 130506, 369936, 583332, 475187, 102864, -291737, 127538, -95560, -104355, 122504, 10986, 99162, 368222, -43349, 126956, 14897, 229846, 165582, -150307]
17343b56652A43504C6721O3583c898A64061J40983c106k1003B77576A19473g5241
17331A26007N5186J26955A03345C9146L3364B3911K35837j08999L5660N3625j09657
17320A30377f9556E1154L181K78264E0389L2928L87b7636B81187K65176B15621
17308B94307j30564a01974C26403A57531Q3011A15773L8531a68931B66036A14583
17297e1130A15151M61373B68975L9732A18774K10950A51819n9317K3539f1462
17286A43786m8408K01729I8008N3955Q0296p0278R9042P381J18331A50246L1446
17275A81692J7494H4461L55385I1721K62122q1771Q9213a65605B01315L0460K2499
17264B54274j10677F812a12557F6892M65303k59869r1428p7356p902M2754Q8178
$$ y = [-256652, 143504, 36721, 100304, -3898, 164061, 305044, -3106, -24109, 277576, 119473, -75241, 126007, 181193, 308148, 103345, 39146, 72510, 23911, 259748, 150749, 186409, 240034, 130377, -69556, 51154, 54335, 332599, 50389, 83317, 83704, -27636, 281187, 546363, 215621, 294307, 163743, -101974, 326403, 157531, 240542, 115773, 154304, -168931, 266036, 114583, -51130, 115151, 576524, 268975, 308707, 118774, 329724, 151819, 92502, 116041, -61462, 143786, 95378, 297107, 98008, 151963, 232259, 161981, 261023, 268404, 386735, 150246, 181692, 199186, 84461, 439846, 91721, 353843, 272072, 361285, -165605, 201315, 231775, 254274, 143597, 6812, -112557, 66892, 532195, 272326, 180898, 103542, 95640, 138394, 226572]
17253B26572n3612a14584B57534m1105a48567D05003N8779l2825k4883e1565A66038
17241C03407J56994D489J24047J92511A05468M105J19287j03867J06678o6557
17231A65114p0713K3478k3460J59832n7197F9713K30976L2843b08492C59328M4458
17220D03786A58829J59417j12283J07680n9879Q9246e6825P452D6870b06543A75598
17208A83118C961J44008J87603c52657a10643B32579I3257J92345E1997A5946
17197B6885K9867L14501J7529r8813A15773J44131k5504H7866k6598J83529B2356
17185C28374Q433c3494B56788E4959J09348J1628J72382A72850o9441L26341a40689
17173H5464L64212J13758A83995p5624J81071l7944c017H4726J24347O7278a97939
$$ y = [226572, 172960, -114584, 257534, 216429, -148567, 405003, 463782, 430957, 406074, -51565, 166038, 303407, 460401, 4489, 128536, 321047, 105468, 109573, 228860, 124993, 231671, 165114, 94401, 117879, 94419, 254251, 197054, 69713, 300689, 333532, -208492, 359328, 403786, 158829, 318246, 205963, 313643, 253764, 343010, -56825, -49373, 46870, -206543, 175598, 183118, 3961, 147969, 335572, -352657, -110643, 232579, 93257, 285602, 51997, 15946, 26885, 56752, 371253, 388782, 289969, 115773, 259904, 234400, 87866, 61268, 244797, 22356, 328374, 336807, -33494, 256788, 54959, 164307, 175935, 348317, 172850, 103409, 429750, -140689, 85464, 449676, 563434, 183995, 108371, 289442, 251498, -3017, 84726, 209073, 276351, -197939]
17161A31408P131N8378K60608B14076m9601n7506A8109J45883G3409Q3532Q7336
17150B44277q8395J25266k8092J24460k9310J20530a55896A62671J87659j17873
17140B32457J93277J64596B00190J55154j70412G6499L2100J13041Q9040r336
17130C01344E7481J56059J2042J36281j40232A03854K39793J61302o6651j10399
17120C27899N1234j30542n6369I4717N14385k97705I3340M48803B55780j06216
17110A49564R1747J51648m4385l6865J48277K8099j64583K9216r0700m2764R4177
17099C13431K4484A41734K11745N2625h719E92854O363k93375J01605j22518J3239
17088B98168q4270m8196K16136J21977j35176r6607j8206j07125M12653j37442
$$ y = [131408, 138539, 196917, 457525, 214076, 164475, 106969, 18109, 163992, 73409, 156941, 244277, 155882, 281148, 253056, 377516, 348206, 468736, -155896, 162671, 350330, 232457, 425734, 590330, 200190, 355344, 184932, 76499, 108599, 221640, 310680, 301344, 57481, 213540, 225582, 361863, 221631, 103854, 343647, 504949, 438298, 327899, 379133, 248591, 192222, 94717, 609102, 311397, 93340, 542143, 255780, 149564, 241311, 392959, 348574, 311709, 459986, 488085, 323502, 352718, 262018, 219254, 313431, 337915, 141734, 353479, 406104, -8719, 592854, 599217, 305842, 407447, 284929, 298168, 213898, 165702, 381838, 503815, 368639, 272032, 253826, 146701, 559354, 421912]
17078D21912J14459A69698L18469K3782A64357k1877J11558K49296k3319n0745
17068D29270j98428J60610j26312J88287j33464j14472K51646P3540j45189j74692
17058B10796L34404k11086K06029j03627j34041M58749J55708D23381J34885J00025
17048F58291B62166K00888L3896j28672j52005L84969k45686O0539M9649j21173
17038C44571j50417K88313M0016L91647D15663L41806C58534j19156L8449J19349
17028C97176J60113A78132Q3048J28421Q3626j26896L62603j6860l20464K60329
17018F31939j33901q286k4885L38738k61507k1330j58706P4114L3493K32351j86950
17007E15070K48966l13137o760K40425N4008j22352k41665J68690l3920O0796
$$ y = [421912, 536371, 169698, 488167, 511949, 164357, 142480, 254038, 503334, 480015, 429270, 230842, 391452, 265140, 453427, 319963, 205491, 457137, 530677, 385488, 210796, 545200, 334114, 540143, 436516, 302475, 761224, 916932, 423381, 558266, 658291, 262166, 463054, 496950, 368278, 216273, 601242, 355556, 416095, 465744, 344571, 194154, 482467, 522483, 914130, 415663, 757469, 358534, 239378, 277827, 397176, 557289, 178132, 261180, 389601, 473227, 346331, 708934, 692074, 371610, 631939, 498038, 489752, 464867, 803605, 542098, 520768, 362062, 436176, 469669, 702020, 515070, 764036, 450899, 444139, 684564, 738572, 616220, 374555, 543245, 509325, 570121]
16997E70121L619K0385k47333K68302Q8903J61671k08418j32817L03795k76083
16987E52145J51856K11639j29792j30974k8000J09433j39243N0014p2892M8383
16977F22569J18369r0006m8063O4888J68577p0136l7510K34301j83939j9160j25163
16966F34727K92806k37734Q7404J41529J13241k36283k65688K77158K18308j9964
16956A005504J78354k72750l12504J37474J273L3007O0925L22362j89454J09742
16946A073933j00722r7521l1803K50036k28537L5944J58858n9807L59403n72740
16936G87044j40046M13745p382Q1452l03995K61272j94446P7920J71059k26451
16926I20172l3680R8455J10639K60818j57370j52449o9803M68894k72821M77547
$$ y = [570121, 573740, 594125, 346792, 615094, 703997, 865668, 657250, 524433, 828228, 552145, 704001, 915640, 785848, 654874, 626874, 736307, 597064, 647078, 574186, 622569, 740938, 650932, 602869, 667757, 836334, 766198, 728688, 962989, 779050, 759890, 634727, 927533, 689799, 777203, 918732, 1031973, 795690, 530002, 807160, 1025468, 1005504, 1183858, 911108, 598604, 736078, 737351, 770358, 831283, 1153645, 964191, 1073933, 973211, 875690, 843887, 1093923, 865386, 901330, 1060188, 1000381, 1359784, 787044, 646998, 1060743, 1053361, 1134813, 830818, 1092090, 897644, 975564, 1146623, 920172, 886492, 984947, 1095586, 1356404, 1199034, 1046585, 976782, 1445676, 1172855, 1650402]
16916A650402n37572K55971k29988K246M18432l69516m8953N0764J07103r3789
16906A205100L82004k16361m03198M41599J46164l43892L65651l38460R336j98933
16896A049010L54531L34077j62361O8751k38022J85700r7040R0732Q6093j12902
16886A558569p0573J58679k01313L71775R6223p5660o5094J03986p5956M9141
16876A849777j54438L20773r3418J55360k21698J57976j46499m0298M19654k83643
16866A963546j96641K80621L12589n13034K78821O8679L75555m55228K47905J23831
16856B486644k19554M0774J23933J65115m1200K43337n39329K92290P6586q8952
16846B539644J01154K80205l43056K06672p0879M363N10622k78548J16160j38475
$$ y = [1650402, 1112830, 1368801, 1138813, 1141059, 1559491, 1189975, 1141022, 1191786, 1298889, 1205100, 1587104, 1370743, 967545, 1409144, 1555308, 1211416, 1577067, 1238607, 1247943, 1049010, 1403541, 1737618, 1575257, 1644008, 1405986, 1591686, 1494646, 1585378, 1671471, 1558569, 1487996, 1646675, 1445362, 1817137, 1913360, 1837700, 1772606, 1876592, 1800636, 1849777, 1695339, 2016112, 1922694, 2078054, 1856356, 2014332, 1867833, 1827535, 2247189, 1963546, 1766905, 2047526, 2360115, 1847081, 2125902, 2194581, 2570136, 2114908, 2362813, 2486644, 2267090, 2307864, 2431797, 2596912, 2555712, 2799049, 2259720, 2552010, 2628596, 2539644, 2640798, 2921003, 2577947, 2784619, 2713740, 2718103, 3228725, 2950177, 3066337, 2927862]
16836B927862K38297K623Q2247J05880J34989n8155N6465l341J37282j37883L54505
16825C840771k75560M50068n1026j30327n7332J61617J49737K57838q7179R868
16815D268475K29177j60914K31715P3822K42272p0584j75725L32336J30783P2018
16805E173375J96341L79197J80314m50561L55766j64180M61825m19566L31751
16796F044262J94343N20281k13872K00671J43432L33019M948L09574J90334q147
16786G718845J54146m7279P48337j06244M50769j43171K62198L69286K41016K60328
16776I908231M70535l301L26581K33820N25088M0314M88042L84428N63659J44961
16766A3082358N49291O10382J82305M40044N22780K95026O27236K22128J102353
$$ y = [2927862, 3166159, 3168782, 3251029, 3356909, 3491898, 3433743, 3490208, 3486867, 3624149, 3486266, 3840771, 3565211, 4015279, 3964253, 3833926, 3776594, 3938211, 4087948, 4345786, 4258607, 4268475, 4497652, 4336738, 4568453, 4642275, 4884547, 4813963, 4638238, 4970574, 5101357, 5173375, 5369716, 5748913, 5929227, 5478666, 5834432, 5670252, 6132077, 5712511, 6044262, 6238605, 6758886, 6545014, 6745685, 6889117, 7222136, 7227084, 7536658, 7726992, 7718845, 7872991, 7825712, 8574049, 8467805, 8918574, 8775403, 9037601, 9406887, 9647903, 9908231, 10378766, 10375465, 10702046, 10935866, 11460954, 11501268, 11989310, 12373738, 12937397, 13082358, 13631649, 14242031, 14424336, 14864380, 15387160, 15682186, 16309422, 16531550, 17633903]
16757A7633903L43189P69224P69551N78527O52722O89144Q42307Q75263R80660
16748B4134490J118264R43511J440255J029798J391774J079088J588085J537941
16740C4263206J456318J552762J873828K056265J758040K537181K286820K408298
16732E0192718K212907L365315L178917L064502L744788L577158M236465L944321
16724G7517091N164304M636993N850376N275051N980991O193073O996940O807922
16716A24422741P349923P742603P517165P739876P612226P440540P515668O552656
16708A83893398O549009N055899M562620K987095J793222M36880m01260k461966
16700B02414897l660789m875125n767939o609055o957943p754011p739064p994230
$$ y = [17633903, 17977092, 18746316, 19515867, 20094394, 20747116, 21436260, 22278567, 23153830, 24134490, 25252754, 26196265, 27636520, 28666318, 30058092, 31137180, 32725265, 34263206, 35719524, 37272286, 39146114, 41202379, 42960419, 45497600, 47784420, 50192718, 52405625, 55770940, 58949857, 62014359, 65759147, 69336305, 73572770, 77517091, 82681395, 87318388, 93168764, 98443815, 104424806, 110617879, 117614819, 124422741, 131772664, 139515267, 147032432, 154772308, 162384534, 169825074, 177340742, 183893398, 190442407, 195498306, 200060926, 203048021, 204841243, 205278123, 204876863, 202414897, 198754108, 193878983, 188111044, 181501989, 174544046, 166790035, 159050971, 151056741]
16692A51056741p887572q047049p333047p963301o841716o830345o470411n896453
16684I3786847n761208n402659m769182m809304m031701m336293m013092k925209
16676E7738199l336372k850609k747575k677161k577525k083355k003310j996064
16668C7466228j832412j902251j182129j606672j450737j165555j155991j216758
16660B5953723q59132j066759j467041o80006n10610j143710j078660l85228p06791
16651A8055786n14710n78961p06170k57312q62629l33162r19037m93276l85871
16642A3004658l10668k69856m94593k90668n52497L3503m69160j02277l22477
16633A0225965l55667o02949K8551k87865q7987l74401l45689k93274J52211l53532
$$ y = [151056741, 143169169, 135122120, 127789073, 119825772, 112984056, 106153711, 99683300, 93786847, 88025639, 82622980, 77853798, 73044494, 69012793, 64676500, 60663408, 57738199, 54401827, 51551218, 48803643, 46126482, 43548957, 41465602, 39462292, 37466228, 35633816, 33731565, 32549436, 30942764, 29492027, 28326472, 27170481, 25953723, 25094591, 24027832, 22560791, 21880785, 21370175, 20226465, 19147805, 18762577, 18055786, 17541076, 16962115, 16255945, 15998633, 15136004, 14802842, 13883805, 13390529, 13004658, 12693990, 12424134, 11929541, 11638873, 11086376, 11119879, 10650719, 10548442, 10225965, 9870298, 9267349, 9295900, 9008035, 8920048, 8545647, 8199958, 7906684, 8058895, 7705363]
16623G705363o92473J56445j67946j85103o6856k57480m61989J81663j24722o2357
16613F024545o3700l93900j01185j51956L66774p23564M37283m12116k9235l43755
16603D609191j94367K43489R8278k66531m89752R3871J09397J80602k75315j05344
16593D003519k87518M02103n13863M54380m68700j3994p6916k24031L3530j0548
16583C297962k9655m2600q1386O4067j84830k04432L39886k36731p4036n9492
16573B788753P3481l18480r7819m4063K3728q2254J69197k02306j41267L7527
16563B206497J0392o3231M07805l95152M2184m606R4219J40026k84142m988l61163
16552A787841L35809j18149k6521m2501l28131j84904M15020P2539k55919M63128
$$ y = [7705363, 7012890, 7169335, 7001389, 6816286, 6749430, 6491950, 6029961, 6211624, 6086902, 6024545, 5960845, 5566945, 5465760, 5313804, 5680578, 4957014, 5394297, 4982181, 4952946, 4609191, 4414824, 4658313, 4756591, 4490060, 4000308, 4094179, 4203576, 4384178, 4108863, 4003519, 3716001, 4118104, 3604241, 4058621, 3589921, 3575927, 3499011, 3274980, 3308510, 3297962, 3268307, 3225707, 3144321, 3208388, 3023558, 2819126, 3159012, 2922281, 2848245, 2788753, 2862234, 2543754, 2445935, 2401872, 2425600, 2343346, 2512543, 2310237, 2168970, 2206497, 2216889, 2153658, 2561463, 2166311, 2208495, 2203889, 2298108, 2438134, 2153992, 2149004, 1787841, 2123650, 2005501, 1978980, 1936479, 1608348, 1423444, 1838464, 1911003, 1655084, 2118212]
16542B118212m80137K09765p8591k67405J12337j69465j58885N36L33131k36807
16532A382691j53435K02347k6063K63343l02542j34628l2481J41139J88970o1587
16522A467754j29655K11419o63293L21919k0957n8407J54113N5904l56322K967
16512I85442L71701m74698K97952j29081K42750q321l44086O3148L9583q2846
16502I61544L17652Q7691k24538l4769j39921J45187L3833j16593j06984J28383
16492A051485o2431m303k3867J71126m1655k87841j74026J79283J87961j72207
16482H23525K09296l60412K02496R1531j68070Q2734o8673l52711R5340Q8340
16472F43396L52480l31311L33545l19464L09670j10523l42469K7671K32036k83619
$$ y = [2118212, 1638075, 1847840, 1769249, 1501844, 1614181, 1444716, 1285831, 1286367, 1619498, 1382691, 1229256, 1431603, 1405540, 1668883, 1366341, 1231713, 1199232, 1340371, 1529341, 1467754, 1338099, 1549518, 886225, 1208144, 1187187, 1128780, 1282893, 1338797, 982475, 985442, 1357143, 882445, 1180397, 1051316, 1294066, 1285745, 941659, 1004807, 1044390, 961544, 1279196, 1366887, 1142349, 1107580, 967659, 1112846, 1146679, 1030086, 923102, 1051485, 989054, 984751, 960884, 1132010, 1090355, 802514, 628488, 807771, 995732, 823525, 1032821, 672409, 874905, 966436, 798366, 881100, 812427, 459716, 555056, 643396, 995876, 664565, 998110, 678646, 988316, 877793, 535324, 562995, 795031, 511412]
16462E11412Q6035n8407L63274k37740j49730K74817J46844l98649K19569k74815
16452D82610K28796J17181j83526O2848l27422O4024Q801J87290N8775K02731
16442I02108j19128l16171j44882N51994B26009L57380j33793L06770j39278j28832
16432D88256L3058A67668M94523p6200j42089q9500J36744N835j16886Q348K55425
16421F43868R3742K8381j29404j09744r4361j1275o0007j53543J29704L64995
16411G02356B44924L12528j48600J44775j42393H9918N66007n9170k0508B56266
16400E06290k20114K70614B31502K99412k08210J4390J79627L8041B12711J03027
16390C15738A55774K58266J09619A92019K02441A58384L19715N6768K5084o8892
$$ y = [511412, 597447, 539040, 902314, 664574, 514844, 789661, 936505, 537856, 757425, 482610, 711406, 828587, 645061, 707909, 380487, 444511, 453312, 640602, 699377, 902108, 782980, 466809, 321927, 873921, 226009, 583389, 449596, 756366, 617088, 488256, 521314, 167668, 662191, 585991, 443902, 354402, 491146, 496981, 380095, 388443, 643868, 737610, 765991, 636587, 526843, 432482, 421207, 361200, 207657, 337361, 702356, 244924, 557452, 408852, 553627, 411234, 89918, 655925, 596755, 576247, 256266, 506290, 286176, 556790, 231502, 530914, 322704, 337094, 516721, 554762, 212711, 315738, 155774, 414040, 523659, 192019, 394460, 158384, 478099, 534867, 559951, 491059]
16380D91059m8092B4795L87595l1596l7023J15300j94992j16813J66848J25398
16370D39512J47470j20240m9982J0036H415K72086N8236a5870B76790m7989L87239
16359F16040B36393m511K97981B45928l7693J00321J34559A77067p1407k5082
16349H0578m795L26609K01634A51191K23044j17253D1690O4320R3834G2204L6395
16338A08599K24279r7993J70156A47021O029J72648j52979J19848K6144G2273
16327D7366K87390E8665J04857K21848A68514N0822n0785o9380e2769D81532k04270
16316B77262H2432i4143A14770N8275a03195C33960c6351I1254f4291B91365R8518
16305C89883c2299C89651c6035A05420J6946L4650b6A90929p5119D1902J12691
$$ y = [491059, 442967, 24795, 412390, 380794, 343771, 459071, 264079, 147266, 314114, 439512, 586982, 466742, 416760, 426796, 8415, 280501, 338737, -15870, 276790, 228801, 616040, 236393, 231882, 529863, 245928, 208235, 308556, 443115, 177067, 105660, 80578, 75783, 402392, 604026, 151191, 374235, 256982, 41690, 106010, 199844, 72204, 108599, 332878, 234885, 405041, 147021, 153050, 325698, 172719, 292567, 318711, 72273, 47366, 334756, 58665, 163522, 385370, 168514, 219336, 168551, 99171, -52769, 481532, 277262, 82432, -94143, 114770, 173045, -103195, 333960, -36351, 91254, -64291, 291365, 389883, -32299, 389651, -36035, 105420, 122366, 157016, -26, 190929, 115810, 41902, 154593]
16294A54593K06359n3088a89344i3585A92480n373o1114J22030c7037B16441j04392
16283A12049N1380p1923J19362k7358N2715h4155A12157h1653A4170O3417P7573
16272A55160F6661L7773a2707D12046I3229a85792E0883P0698J57097C4824K08972
16261B43796J90122B13802i7977B52570D1314P0249J61618M64744A16917J79698
16251B96615j04395H6363J71284G0485J0493a65541l6521A53765J62480B8795
16240a42213A31631O978J84863b3821A88000a93178f0704A42447R4653j11055
16230A26045J66120i2543A20017K6749e5023J4707C42868p4533d4107A66467a4412
16218A96147M4447i3519E3312a6489A06397m5113B4966f6609j11135A45741e5109
$$ y = [154593, 360952, 307864, -189344, -93585, 192480, 187107, 125993, 248023, -37037, 216441, 112049, 163429, 91506, 210868, 183510, 236225, -84155, 112157, -81653, 14170, 77587, 155160, 66661, 104434, -12707, 412046, 93229, -185792, 50883, 121581, 278678, 34824, 243796, 433918, 213802, -97977, 252570, 41314, 111563, 273181, 737925, 116917, 296615, 192220, 86363, 257647, 70485, 80978, -165541, -202062, 153765, 316245, 28795, -142213, 131631, 138609, 323472, -23821, 188000, -193178, -60704, 142447, 237100, 126045, 292165, -92543, 120017, 146766, -55023, -40316, 342868, 268335, -44107, 166467, -14412, 196147, 240594, -93519, 53312, -16489, 106397, 61284, 24966, -66609, -177744, 145741, -55109]
16206A36778b0825A55187b0293A54893b1545D9159O8882m720J55592C4376a95355
16194B65548m1851A10642Q5560a8276I9804Q8666F1151e3733C76009c48432B12726
16182E03445a74331A60267c2977k93336A52304B6648a6150F5558R9364n3017J31643
16171B43548K7218i055A50924A7873k595P0567L01603A54313D7101O6631N5087
16160A68819g0508A0853J90287h6842q8437B26560a10889b4755B43526J21722
16150C65248d24692D41930b2570A9735J3471c0660B11649f4522F6504L77685m7937
16139C96252a79511B37561a75478A1462J39008b3565D8276a50194B16909H4949
16128a888A5649a03881M9597b375A83183e3026B31744A01297b17783f0490o187
$$ y = [136778, -20825, 155187, -20293, 154893, -21545, 49159, 118041, 113321, 268913, 34376, -195355, 265548, 223697, 110642, 196202, -18276, 99804, 188470, 61151, -53733, 376009, -348432, 212726, 503445, -174331, 160267, -32977, -326313, 152304, 26648, -16150, 65558, 164922, 111905, 243548, 270766, -9055, 150924, 17873, 15278, 85845, 387448, 154313, 47101, 113732, 168819, -70508, 10853, 201140, -86842, -175279, 226560, -110889, -24755, 243526, 365248, -424692, 441930, -22570, 19735, 33206, -30660, 211649, -64522, 66504, 444189, 396252, -179511, 237561, -175478, 11462, 150470, -23565, 48276, -150194, 216909, 84949, -1888, 15649, -103881, -54284, -2375, 183183, -53026, 231744, 101297, -217783, -60490, -66677]
16117f6677B50472a3682p6964A02241b3434n4881A42146e0593q2718m24A81292
16105C89253a62909C52597C4962d4519A45799b30786e2983A939Q6093K99738a00864
16093A8679Q9164E3275B303L6647a03821B95300c1924B0177J98507I5837a62053
16081A81482a55607A81266q6094O4465c3243F8084e13312D6524c87973a1281B4621
16069i8819d5892k09113b5611j38680P9747B67486j22072a13834p6960R3745j84744
16058b81793h834k82615B47009b9479j25994G9219C4051d4157o2053A83094q2483
16047A00611b41824i7767c3888j7402m07882E3039A9983J5046J4615c2443p6787
16036a09230A28275B2017a8906A80075E2095a55332C4288b05601i0107k7092j4741
$$ y = [-66677, 250472, -13682, -90646, 102241, -23434, -78315, 142146, -50593, -133311, -133735, 181292, 389253, -162909, 352597, 34962, -44519, 145799, -230786, -52983, 1939, 88032, 387770, -100864, 18679, 107843, 53275, 2303, 38950, -103821, 295300, -31924, 20177, 218684, 95837, -162053, 181482, -155607, 181266, 95172, 159637, -33243, 68084, -513312, 46524, -387973, -11281, 24621, -98819, -45892, -255005, -25611, -164291, -84544, 267486, 145414, -113834, -190794, -97049, -281793, -8834, -291449, 247009, -29479, -155473, 79219, 34051, -44157, -106210, 183094, 100611, -241824, -97767, -33888, -51290, -459172, 53039, 19983, 35029, 49644, -32443, -109230, 128275, 22017, -18906, 180075, 52095, -155332, 34288, -205601, -90107, -117199, -131940]
16025a31940j8496A71546e2993k3970n8800A75979b65144D170K9270O4633b0178
16013A07863m3858J26365A467f8423j20213M4957g774p1951k5092l8006C38057
16001h9912l2364e4981k11269J28339m3657O5500l3911j66179e6841A9726Q4578
15990A04304e5344K3782B4596J9349J14203a62962c6439l6620m0644e2979j43100
15979a96079j38617a40175r9233R9662J7084J8489M0444n7468A93046A7716L51475
15968C69191a20879C06215a26057I4909A9530J01133b13780L0419a1801A14970
15957A43296c51642a73327k6280K8139r3524B0467a4932l1895j49011B43660b48504
15945I3374i587H7343d7393k36364j72481a673I1763B981a50288j01406B36539
$$ y = [-131940, -150436, 171546, -52993, -76963, -135763, 175979, -265144, 4170, 33440, 98073, -20178, 107863, 64005, 190370, 1467, -68423, -188636, -143679, -7774, -79725, -104817, -142823, 338057, -89912, -122276, -54981, -266250, -137911, -181568, -116068, -149979, -316158, -56841, 19726, 104304, -55344, -31562, 24596, 43945, 158148, -162962, -36439, -73059, -113703, -52979, -196079, -334696, -140175, -239408, -139746, -122662, -104173, -63729, -121197, 193046, 17716, 369191, -120879, 306215, -126057, 94909, 19530, 120663, -213780, -183361, -11801, 114970, 143296, -351642, -173327, -199607, -171468, -264992, 20467, -14932, -46827, -195838, 243660, -248504, 93374, -9587, 87343, -47393, -283757, -456238, -1673, 91763, 2981, -150288, -251694, 236539]
15933g3217b8489k70823A24376b40948I5272a08405H9387b55928A07696g0528
15922B5933c63316J09756b7386k8413A22328a92761C7466c35258a809j68587j71389
15911c41785f6616B04510a66446D0095K2617b67753q2080i6929f628n504j87224
15900a99356c1112o186B79916o5658a12178M826m4194f1975L912j07825L3405
15889a32483K9954j18942F5511A20J9504K27037a06982i811j77644B2877b49801
15877b16777C3650c17846L9659b483B43403r2772E6755a5574A5437J69037J77104
15866C61578h3986o9990M2401D9412N23718A83140D6471i0322d4689k25253D4986
15854a36389a1210r1616d063a525A627h938j28417m6306N3463C8724i9126G5374
$$ y = [-73217, -28489, -299312, 124376, -240948, 95272, -108405, 89387, -255928, 107696, -70528, 25933, -363316, -253560, -27386, -55799, 122328, -192761, 37466, -335258, -1809, -170396, -341785, -66616, 204510, -166446, 40095, 62712, -267753, -349833, -96929, -6628, -12132, -199356, -31112, -37298, 279916, 214258, -112178, -107352, -151546, -61975, -58063, -165888, -132483, -102529, -221471, 65511, 120, 19624, 246661, -106982, -9811, -187455, 22877, -249801, -216777, 33650, -317846, -278187, -2483, 243403, 150631, 56755, -15574, 15437, 184474, 361578, -83986, -153976, -111575, 49412, 573130, 183140, 46471, -90322, -44689, -269942, 44986, -136389, -11210, -102826, -4063, -1525, 1627, -8938, -137355, -183661, -130198, 38724, -99126, 75374]
15841A37477O7098h090k61450a14167A23598f15791f0844a9161A34916a59448
15830I740a08969B3366b28562N6427E0602a39154N9686j3335A29216b4135C7926
15818b4964B31399a77749F4192c9925k29435i5163j95818A33552b91102J04494
15808a86608A40315n0965c18619a40699N3850J7902o9663d5172j06864H0697b36841
15796b29506c8262C6727b55628K8285A17225J10677d95901b5487k52133d3009
15785d0740D439J74474H2971J464N5285C121b51477J22653K7263L8784j16152
15774a78929b5268B63764b53070J15587A25748d73454A30318j5356a51521c1957
15763a10323j86552B20472e7438C99102A17885f5219l4018k31884R6950A97113
$$ y = [137477, 204575, -8090, -269540, -114167, 123598, -615791, -60844, -19161, 134916, -159448, 9740, -108969, 23366, -228562, -172135, 50602, -139154, -79468, -92803, 129216, -24135, 37926, -24964, 231399, -177749, 64192, -39925, -269360, -95163, -290981, 133552, -291102, -186608, 140315, 89350, -318619, -140699, -86849, -68947, -138610, -45172, -152036, 80697, -236841, -229506, -38262, 36727, -255628, -227343, 117225, 227902, -495901, -25487, -277620, -43009, -40740, 4439, 178913, 82971, 84435, 139720, 3121, -251477, -128824, -101561, -62777, -178929, -25268, 263764, -253070, -137483, 125748, -473454, 130318, 114962, -151521, -31957, -110323, -296875, 220472, -57438, 399102, 117885, -65219, -99237, -331121, -234171, 197113]
15752C01891A44594b51675i6590C03948G7452a7190C1100J5392N337c5697F073
15740A93960H337h3593J5629F6478d8268k28453b8952B64656h8354A94806F1935
15728b25112a00157k83509C1317K12719a09938A01504h8011M59h926A82476a38415
15716b22706A50746a25465m2007j26085N8151R9268j07692D40379a55071O722
15706a48349O1921l8080d5738k13143B38683c01334k49237a54665C4197J35089
15696A69286F7415b32922J05386A48675a2369H3191a90957j6642O6307r5646o6872
15685c03810G5505J52072c95592g4781A12724d602A45646J25456e6304I3050C4789
15673g6710a8217j27715J3580A82715a18944j79348H6457R8783H1167b73188O0884
$$ y = [301891, 144594, -251675, -96590, 303948, 77452, -17190, 31100, 46492, 51829, -35697, 6073, 193960, 8337, -83593, -67964, 66478, -48268, -276721, -28952, 264656, -88354, 194806, 61935, -225112, -100157, -383666, 31317, 244036, -109938, 101504, -88011, -87552, -8926, 182476, -138415, -222706, 150746, -125465, -167472, -293557, -235406, -136138, -243830, 440379, -155071, -148349, -86428, -124508, -45738, -258881, 238683, -301334, -550571, -154665, 34197, 169286, 67415, -232922, -127536, 148675, -12369, 83191, -190957, -207599, -141292, -236938, -303810, 75505, 227577, -395592, -74781, 112724, -4602, 145646, 271102, -56304, 93050, 34789, -76710, -18217, -145932, -132352, 182715, -118944, -298292, 86457, 185240, 81167, -273188, -212304]
15662b12304A3811G84f977A3373O1307B0783J1914K05397b08094C7064b6803j80763
15650b07566E9044b06716d2183A27580C1234K6790c06771P3462K552A61375h3655
15638c1655F3097a95306B39275b57830L8430d9375G4536J75746a13500j6230e2651
15626g656A54297o6510a46336N3325n8306J1996A1585d3837b0762p0955H4518
15614e7324l74191K02694H0224P5699b55805g7236o9762E7552a46338A64344G192
15602f4659j8919E5255M8591K8961C2081K5063a25388C39359a6287p7098K6392
15591f6993K2503j75194e6356l9753m6581d997F7055b6052D9286b38561a09234
15579B57585H565K43171D9698a18742K808A87983b28679D9313A9870Q4957c8030
$$ y = [-212304, 13811, 784, -6977, 13373, 74680, 20783, 32697, 238094, -208094, 37064, -26803, -207566, 59044, -206716, -42183, 127580, 31234, 58024, -306771, -233309, -230757, 161375, -83655, -31655, 63097, -195306, 239275, -257830, -219400, -49375, 74536, 250282, -113500, -129730, -52651, -7656, 154297, 87787, -146336, -93011, -151317, -139321, 11585, -43837, -20762, -91717, 84518, -57324, -431515, -228821, 80224, 155923, -255805, -77236, -146998, 57552, -146338, 164344, 7192, -64659, -83578, 55255, 103846, 132807, 32081, 57144, -125388, 339359, -16287, -93385, -66993, -44490, -219684, -56356, -96109, -142690, -4997, 67055, -26052, 49286, -238561, -109234, 257585, 8565, 251736, 49698, -118742, -115934, 187983, -228679, 49313, 19870, 104827, -38030]
15567c1461k37476B16250D0774J79280a24715A71546K30003b44978A19897B7355
15556b45246P2226E01205A3919L32828f4727k09370g8988B22315q7567n5779K06556
15545B85525G8243b38836i522C03034a29119i243B3922a47332B22280j1737h699
15533F420c78663J60892A3613b75641a03157F2658K0749J38784K9152E6426a61505
15521B36886d7083j81424E2603h3980K1766K4693C51161j49419a21495p1118O1749
15510a30864j88038A53392a40466d9914A70181b26939c7371A38983o3554b4920
15499F8412M2763J59266f9280k34741B00473L6353A2575J09100a59250K637B03578
15487d3664k00373L868r7240H1319A8403Q8750d4803A32485A7129b38748A36047
$$ y = [-31461, -268937, 216250, 40774, 220054, -124715, 171546, 401549, -244978, 119897, 27355, -245246, -173020, 501205, 13919, 346747, -64727, -274097, -78988, 222315, 134748, 78969, 285525, 78243, -238836, -9522, 303034, -129119, -9243, 23922, -147332, 222280, 210543, -8699, 6420, -378663, -217771, 13613, -275641, -103157, 62658, 83407, 222191, 251343, 56426, -161505, 236886, -47083, -228507, 52603, -83980, -62214, -37521, 351161, 201742, -121495, -192613, -130864, -318902, 153392, -140466, -49914, 170181, -226939, -37371, 138983, 75429, -24920, 68412, 111175, 270441, -69280, -304021, 200473, 236826, 12575, 121675, -159250, -156613, 203578, -43664, -244037, -240169, -337409, 81319, 18403, 107153, -44803, 132485, 17129, -238748, 136047]
15475C8706K9732j1156c91230F7966L0955b14777F8872i710A14727b65359a4633
15463B79646c28395B27443a39913B13701B9870g795l10785a35089A36832N7473
15453A94305c96619c6265B4292j156b13963m23a05554A5497e890D9559F432c23272
15440E0947a25067j08493a06063e0535A02208h1003A77449P6225a0343j3936E3077
15428d6606k71703A71116i387A09238i6067p4515P7082A9183b35398H0957g1417
15416E6001I480a85651g6222A88505i2987j53150K4502D0572o363a51842j5632
15405a67474m3437j28955C4798a62132E6945i9587C0976M3006a08221D6488f5251
15393d814A25442R979J52679i1198j82223A91838e9410a9455j00825c558A2976
$$ y = [38706, 68438, 57282, -391230, 67966, 98921, -214777, 68872, -9710, 114727, -265359, -14633, 279646, -328395, 227443, -139913, 213701, 29870, -7795, -318580, -135089, 136832, 194305, -396619, -36265, 24292, 23136, -213963, -214386, -105554, 15497, -5890, 49559, 6432, -323272, 50947, -125067, -233560, -106063, -50535, 102208, -81003, 177449, 253674, -10343, -24279, 53077, -46606, -318309, 171116, -9387, 109238, -96067, -170582, -93500, 19183, -235398, 80957, -71417, 56001, 9480, -185651, -76222, 188505, -92987, -246137, -221635, 40572, 34209, -151842, -167474, -210911, -339866, 34798, -162132, 56945, -99587, 30976, 73982, -108221, 46488, -65251, -4814, 125442, 135421, 288100, -91198, -273421, 191838, -59410, -19455, -120280, -3558, 12976]
15381a79682G0203C048a07892A59829a71181A33329F2003J80160J32275m7634
15371C26804E6802b01244c3693A52825a45594L7640A24040a87278H6352K36465
15361C22817F673P7536b09033g0630I1797K17341l2624b33262I5851a0021A0636
15349b54660Q7979N311O8427r6053B8730d6276F9912a72740e2382n1488m685A22305
15336B35746a58651j32067h5218j62961b4448K552I9553J42702N1411A01921B8273
15324B1738R6748J3373F5869b2491j3027D2565e0680J2909B7643a30313B6437
15312A46005l9232O0932R5520R6611C4539i116p9483d1381j1627A05981P3700
15301A79681a69497a6702F5090a36954l0779I7177D7477L03081C8636e1880r153
$$ y = [-179682, 70203, 3048, -107892, 159829, -171181, 133329, 62003, 242163, 374438, 326804, 56802, -201244, -33693, 152825, -145594, -107954, 124040, -187278, 86352, 322817, 6673, 84209, -209033, -70630, 91797, 309138, 276514, -233262, 95851, -10021, 10636, -254660, -166681, -161370, -92943, -188996, 28730, -46276, 69912, -172740, -52382, -103870, -108555, 122305, 235746, -158651, -290718, -85218, -248179, -24448, -21896, 99553, 242255, 293666, 101921, 28273, 21738, 118486, 131859, 65869, -22491, -35518, 42565, -50680, -37771, 27643, -130313, 26437, 146005, 106773, 167705, 263225, 359836, 34539, -9116, -88599, -41381, -53008, 105981, 179681, -169497, -16702, 65090, -136954, -167733, 97177, 47477, 350558, 38636, -51880, -61033]
15290f1033L0365F4790b82730C96539a7673f020B56555F2739a74641D8008K37373
15279B85381B7524J6484h6187D3625f7026j18696A77678b94714J39220g2287B2650
15267B01867f3412r3011A33334c551G6012a3019q9286A08616C1270e9602E6007
15255A50163b28748D2610K24084b40370A8920O4665k6887a56904O4875H7375N2723
15244A40098J12596K0178c8114C21732J31711k10500O9089P8297j71759O23691
15234H42261R4218K5665J61084m22983k20942j32676A03070M0576J54536m85L4261
15223C31958i7748A47574f1965C59219a03321L9260A81724c74421h647j26369
15213a35016B08729p1752b4247E8472P5775n8718g7754a3059o1091C65576n3186
$$ y = [-61033, -30668, 64790, -282730, 396539, -17673, -6020, 256555, 62739, -174641, 48008, 285381, 27524, 44008, -86187, 43625, -67026, -185722, 177678, -294714, -155494, -72287, 22650, 201867, -63412, -156423, 133334, -3551, 76012, -13019, -102305, 108616, 31270, -59602, 56007, 150163, -228748, 42610, 266694, -240370, 18920, 83585, 56698, -156904, -92029, 87375, 140098, 252694, 272872, -38114, 321732, 453443, 242943, 312032, 390329, 218570, 842261, 936479, 962144, 1123228, 700245, 479303, 346627, 103070, 143646, 298182, 297697, 331958, -97748, 147574, -61965, 359219, -103321, -64061, 181724, -374421, -8647, -135016, 208729, 136977, -24247, 58472, 134247, 75529, -77754, -13059, -74150, 365576, 312390]
15202C12390P2720a03697E1953a62599B46071q1656a87896A52268a34354A17716
15191A74790b49675H7649K44446A37580l4868A5195g1529A74515K41148H1361
15180a22874a8562q777D3272a39962L7635c8661l7269B18180a3467B02000d4298
15168A93779G6617k9929c62165a54541K7595A19413b401A23452g3925m3961A54890
15156C72590c4558B08722h7589j34064e8255F7777J75806b5231D2671B0430P2283
15145I2713M1944P9456M005Q245b81789c3975j01269B301L50076I1927M8987a23729
15132g6615A65961a25904O1351C35916A42088g7287E9230e1305A23529b3811A39966
15120a51905I3938m0120a8134I4603A9797J55902q553D5161a13046G86K17116
$$ y = [312390, 385110, -103697, 51953, -162599, 246071, 164415, -187896, 152268, -134354, 117716, 174790, -249675, 87649, 332095, 137580, 102712, 15195, -71529, 174515, 415663, 81361, -122874, -18562, -27339, 43272, -139962, -102327, -38661, -75930, 218180, -13467, 202000, -44298, 193779, 76617, 46688, -362165, -154541, -126946, 119413, -2401, 123452, -73925, -117886, 154890, 372590, -34558, 208722, -87589, -221653, -58255, 67777, 243583, -25231, 42671, 20430, 92713, 134657, 214113, 218118, 226363, -281789, -33975, -135244, 2301, 352377, 91927, 140914, -123729, -76615, 165961, -125904, -64553, 335916, 142088, -77287, 59230, -51305, 123529, -23811, 139966, -151905, 93938, 53818, -18134, 94603, 19797, 175699, 167146, 45161, -113046, 786, 217902]
15109B17902r6870i5656c0719a0763B02900j6367J53118g1116A73780E6106L1039
15098H7145K66297A44417L5921K09065A36327a8502E3122a23405A14019m2428
15088G1591H086K27167A13201J86876G2502J0084f5031A15540b50394B46807n5715
15077A91092J00473F5671J05964J33297j28166m7985a22112D31687j82270L0876
15067B80293j08770k5493d6910b2900q8836a2952C03858j18965J60771e4660A33849
15055A85312a10844H5993a2487l4049B95536a9168B38365m0184L40987B9171i2244
15043E60570E4252J91884I6983J11998C6258J20501C0260K8544b01795b3078C11438
15031i3075A4112J03690j1782Q5616L4025J80935H6716K30726Q3305j61505q4224
$$ y = [217902, 121032, -95656, -30719, -10763, 202900, 186533, 339651, -71116, 173780, 56106, 87145, 353442, 144417, 180338, 389403, 136327, -18502, 53122, -123405, 114019, 71591, 8086, 235253, 113201, 300077, 72502, 82586, -65031, 115540, -250394, 246807, 191092, 291565, 65671, 171635, 304932, 176766, 128781, -122112, 431687, 249417, 280293, 171523, 146030, -46910, -22900, -111736, -12952, 303858, 184893, 345664, -54660, 133849, 185312, -110844, 85993, -12487, -46536, 295536, -19168, 238365, 198181, 539168, 29171, -92244, 560570, 54252, 246136, 96983, 208981, 36258, 156759, 30260, 58804, -201795, -23078, 311438, -93075, 14112, 117802, 106020, 191636, 225661, 406596, 86716, 317442, 400747, 239242, 155018]
15020A55018A6492J51897L3285n9974L8545n6273O872J12195M429R2519A18306
15008C07073o6877q5885k8660K019a25313F5209J64559c1810A49045Q3135m1053
14997A91127J27815a8399E9225J92306j4402M7109i7878H4725a19948A76719J50759
14986C27478m8035I5449C6932d1502A16185J77308d1527F4044L24448A16999R3542
14975B10541n8416J98865p6389A02947K61309n5587b5749B08386o6478J07704
14965B49612J72680A64138J38101a8416D9035M35147j29605Q2141A85148A5126
14954C31426C8553M25210A78788M9818q4859J60766j31653O9933K69621B31263
14943D36728n7927l5765k6310b71670K4445B92432A8966J67365l0104n5101K10500
$$ y = [155018, 16492, 168389, 201674, 141700, 180245, 123972, 130844, 243039, 247468, 339987, 118306, 307073, 240196, 154311, 125651, 127670, -125313, 65209, 229768, -31810, 149045, 232180, 191127, 318942, -18399, 59225, 251531, 237129, 284238, -97878, 84725, -119948, 176719, 327478, 279443, 95449, 36932, -41502, 116185, 293493, -41527, 64044, 388492, 116999, 210541, 152125, 350990, 274601, 102947, 364256, 308669, -25749, 208386, 141908, 249612, 422292, 164138, 302239, -18416, 49035, 484182, 354577, 436718, 185148, 15126, 331426, 38553, 463763, 178788, 228606, 143747, 304513, 172860, 242793, 512414, 231263, 436728, 378801, 343036, 316726, -271670, -247225, 292432, 18966, 186331, 156227, 101126, 311626]
14932C11626J72461A46026L58086j68841K118N1742A58431J35123m9374L51199
14922E95379r5915F4158J87314g1122C17560j26644K29596j30092i3461D37692
14911A70385L35985j63332m6406K8340R3752n9365a1927n3812C13818J08182a81060
14899A76626J27025m0097J79495j55854J18808B959L95819k9096N4709L541p2977
14888C54955J56754C5372J5569J62222d4815C06494J02378A38460J45954j29678
14878A54736J18723O6014l4390N0304r290j27113K83588k10072n6557K6873K14815
14867D77631q760J96241r1279j46721j79862C6582K91892J8684p7046A25568J95808
14856C21376K06404j7772O5544B10999o7862m109L02280K14577j72798j19156
$$ y = [311626, 484087, 146026, 504112, 335271, 337389, 389131, 158431, 293554, 244180, 595379, 499464, 64158, 251472, -71122, 317560, 190916, 420512, 290420, -93461, 437692, 170385, 506370, 343038, 296632, 324972, 418724, 359359, -11927, -65739, 313818, 422000, -181060, 176626, 303651, 263554, 443049, 287195, 406003, 2959, 398778, 369682, 424391, 427932, 354955, 511709, 35372, 50941, 213163, -44815, 306494, 408872, 138460, 284414, 154736, 273459, 339473, 305083, 355387, 346097, 218984, 502572, 292500, 235943, 262816, 477631, 468871, 665112, 573833, 427112, 247250, 36582, 328474, 347158, 270112, 125568, 321376, 527780, 510008, 575552, 210999, 143137, 139028, 441308, 655885, 483087, 363931]
14846C63931n0802K12387k12869j7267J81122J4915i87F86058A14822J03345K66580
14835D84747I5427L98055k12477J10966J25955q4875j90099J86643P8549J05249
14825F13393A89023J13660K59830B31042J06300p2605D8676N36258j83767J90010
14815E91177Q0496N9008B77687K19864k02024o4118J72236J82514B34905K8008
14805B62913K10835j22207L58535k21112J69184j51911J01981j18389o2929K038
14795D28938L32513M0999B95207K2429J24994J34482J16348k06946K2122A13361
14784D72631K50743B91966L74026o8516m7780j51495R7296j26906M1948E3983
14773C57071J1259K57153B98278J97329p1574j6499Q5197m9740j52035K46103
$$ y = [363931, 313129, 525516, 312647, 295380, 476502, 491417, -987, 686058, 114822, 218167, 484747, 95427, 493482, 281005, 391971, 517926, 433051, 242952, 429595, 508144, 613393, 189023, 302683, 562513, 231042, 337342, 264737, 48676, 584934, 401167, 591177, 671673, 730681, 277687, 497551, 295527, 231409, 403645, 586159, 234905, 262913, 473748, 351541, 710076, 488964, 658148, 506237, 608218, 489829, 426900, 428938, 761451, 802450, 295207, 317636, 442630, 577112, 693460, 486514, 508636, 113361, 472631, 723374, 291966, 665992, 597476, 549696, 398201, 495497, 368591, 410539, 53983, 357071, 368330, 625483, 298278, 495607, 424033, 407534, 492731, 442991, 290956, 537059]
14763E37059L0903k68845P8893K14095K06800j74850J9122r325j42014K71189
14753G63027j3784r5971n865K10770k90573j69927Q3081K55222j92682L74712
14743I18010k94409j69236L40235k26994k76215R0007L08771K22665m33977O1604
14733E40461J17191m5698J2223K07896l26241J00372R8685j42199o8704J93911
14723F87897K21093P2165k57332j56725L02803j23474k6590K34625k26484K1462
14713G49440j74274R0925Q1536k63734J43338q1388N25000l57774K9091N2403
14703G94563J40231k26773M9590J43450k59456K4971J2811k8869M79872m50761
14693F79629K15064m5790k64152M95129l8816j67203l0846J64344j06067l46935
$$ y = [537059, 567962, 299117, 378010, 592105, 798905, 624055, 643177, 633852, 491838, 763027, 749243, 653272, 647407, 858177, 567604, 397677, 480758, 735980, 543298, 918010, 623601, 454365, 794600, 567606, 291391, 381398, 690169, 912834, 478857, 540461, 657652, 611954, 624177, 832073, 505832, 606204, 704889, 562690, 493986, 687897, 908990, 981155, 723823, 567098, 869901, 746427, 719837, 954462, 727978, 749440, 575166, 666091, 747627, 483893, 627231, 545843, 1070843, 713069, 742160, 794563, 934794, 708021, 757611, 901061, 641605, 666576, 679387, 650518, 1130390, 679629, 894693, 848903, 584751, 1079880, 1041064, 873861, 843015, 1007359, 901292, 554357]
14683E54357M98580n016k33500K42481l12419K60605o275j79084M47230o20910
14673F46049K14150N0903Q411j6276L16698m33340J33634O3927k0764K7616J17015
14662A108023j03966K15603m31378J62953J26408R6549m16898M34746j64333k62594
14652G65113L77284P6487K49185l22927j13640J33458L6022r9847J28711l90761
14642H39085L85278j47580k5074K35381L1145o6080P8501k01267K03611k38148
14632A094852p5192J39016j17856M5958K76559l14009M45597m12432k8900J31433
14622A185026J7350p1036K86397j65594n7258R8447R3359k236Q1749j44639j72388
14611A149177L03014k67511K28265o9022o9787p0690N1006J87179L46458k37468
$$ y = [554357, 1052937, 1047921, 814421, 1056902, 744483, 1005088, 998813, 819729, 1266959, 646049, 860199, 911102, 919513, 903237, 1219935, 786595, 920229, 984156, 963392, 991008, 1108023, 1004057, 1219660, 788282, 951235, 1077643, 1174192, 757294, 1192040, 1027707, 765113, 1142397, 1218884, 1468069, 1145142, 1031502, 1164960, 1200982, 1101135, 1229846, 839085, 1224363, 1076783, 1051709, 1287090, 1318235, 1252155, 1330656, 1129389, 1333000, 1094852, 1019660, 1158676, 1040820, 1086778, 1363337, 1049328, 1494925, 1082493, 1053593, 1185026, 1202376, 1131340, 1417737, 1252143, 1194885, 1293332, 1386691, 1384455, 1466204, 1321565, 1149177, 1452191, 1184680, 1412945, 1343923, 1274136, 1203446, 1254452, 1441631, 1788089, 1550621]
14601A550621j23613K72751k62798R7837R8043j3735j92465J31234m4520k08037
14591A305318L01536k5070K48779j31938q8521L39020j57681k33812j01109M82233
14581A938755R7530k57067l01024M43591j31086J34525K8222o9018j46011K28123
14571A966540j72753L91968m5121n33357O28248K15309k51154o5573q9364K89235
14561B333978j79771k02614K58201R2942k35582j7533J83016K71782J42889k89468
14551B357840M67259j78240j68410j49375M98714J48509r1625J94098N09076J09505
14541C697351j5439K04680K26576R55352O16687R93278J519580K175422M312074
14532A4685561O978373J0467121k858569j1894650o349139l569287k165094r97232
$$ y = [1550621, 1427008, 1699759, 1436961, 1534798, 1632841, 1619106, 1426641, 1557875, 1513355, 1305318, 1606854, 1581784, 1830563, 1698625, 1610104, 1949124, 1791443, 1557631, 1456522, 1938755, 2036285, 1779218, 1478194, 1921785, 1790699, 1925224, 1953446, 1884428, 1738417, 1966540, 1793787, 2185755, 2140634, 1607277, 2235525, 2450834, 2199680, 2134107, 2044743, 2333978, 2154207, 1951593, 2209794, 2302736, 2067154, 2049621, 2232637, 2504419, 2647308, 2357840, 2825099, 2646859, 2478449, 2329074, 2827788, 2976297, 2884672, 3078770, 3587846, 3697351, 3681912, 3886592, 4113168, 5068520, 5685207, 6678485, 8198065, 10373487, 14685561, 21663934, 32131055, 29272486, 17377836, 11028697, 7459410, 5294316, 4297084]
14524D297084k79708p33067n32176j01323j89359k68794L85329k26310j5434L3061
14514B369303J84412r9956J63109j46447O1360j99860J22836k35832K71534l22600
14504B167859O14209n7346k35073J04813K63543K56135m18441L58477L3487N4322
14494C141985J7694j04142j3006J36523k25592N6906K86128l80284M09492j56583
14484C169121K65285l27770K33603J2182K913J3997j16522L00331K53581m7437
14474C759284m9531L4554P1264J45604K8243J04386m06525R8975M50602j96647
14464D040209J57736Q5991K5799j08678J09420k14169J66349j36011O17245m20813
14454D323078M65707l30603J50489j30820K56945k04755j6893L45230j5936M28455
$$ y = [4297084, 4017376, 3284309, 2752133, 2650810, 2461451, 2192657, 2577986, 2351676, 2336242, 2369303, 2553715, 2453759, 2616868, 2470421, 2531781, 2331921, 2454757, 2218925, 2490459, 2167859, 2782068, 2724722, 2489649, 2594462, 2858005, 3114140, 2695699, 3054176, 3087663, 3141985, 3159679, 3055537, 3042531, 3179054, 2953462, 3010368, 3296496, 2916212, 3325704, 3169121, 3434406, 3106636, 3340239, 3352421, 3355334, 3369331, 3252809, 3553140, 3806721, 3759284, 3709753, 3744307, 3815571, 3961175, 3989418, 4093804, 3687279, 3786254, 4236856, 4040209, 4197945, 4283936, 4309735, 4201057, 4310477, 4096308, 4262657, 4126646, 4743891, 4323078, 4788785, 4458182, 4608671, 4477851, 4734796, 4530041, 4513148, 4858378, 4842442, 5270897]
14444E270897n58378M49306P1864J90759l7651j0383k14047M00932j2316K8858
14434E579841J57247l86M04298j62626K36861J06800k01893J26218L004K28327
14424F477691k64736N76236O8357j31894N9393M18767R0021N9835k13784O24990
14414G764876l62765J21954R8038Q2001P9705N4315L25911k32849N75741k89981
14404H216946K36058N34721k76746j08528M16482J01761K23073L28533j81793
14395I490507K95339J43639J24043K173J59509K43441J07427J85044K89080J04955
14385A1145157K19780J36559K32658N18478k60469K09248R4549M07129j1109L76822
14375A3068802J08122P64896j77605M68483J64351M63024p2720M28921L03357
$$ y = [5270897, 4712519, 5161825, 5233689, 5424448, 5386797, 5376414, 5162367, 5563299, 5550983, 5579841, 5737088, 5736702, 6141000, 5978374, 6215235, 6322035, 6120142, 6246360, 6249364, 6477691, 6212955, 6789191, 6857548, 6725654, 6785047, 7203814, 7293835, 7353670, 7139886, 7764876, 7402111, 7524065, 7622103, 7704104, 7783809, 7838124, 8164035, 7931186, 8506927, 8216946, 8453004, 8987725, 8710979, 8602451, 9018933, 9120694, 9343767, 9672300, 9490507, 9785846, 9929485, 10053528, 10055701, 10215210, 10458651, 10566078, 10751122, 11040202, 11145157, 11364937, 11501496, 11734154, 12252632, 11992163, 12201411, 12295960, 12703089, 12691980, 13068802, 13176924, 13941820, 13764215, 14232698, 14397049, 14860073, 14787353, 15216274, 15519631]
14366A5519631N64M17813M21993J41692O10364p2911N18208j8255Q87713j19937
14356A8306875P00155J93022O10573N07999M32921m5818P17751O27750M88183
14347B2539411J04363O74222J91263Q91108R23334L20296M49331N32796R75287
14338B7601411J98205R51778P44808N11237J014417P25450P55645Q90423P95951
14329C4189325O21899J099874J080134J002755R59902R00951J463142J155734
14321D2473716J298464J208456R42666J527667J454872J749736J882831J226989
14313E3765397J404685K375481J779012J960963K211625J783339K434491K536825
14305G0251818K427533K867099K687955K940857K977860L362120L314164L695768
$$ y = [15519631, 15520195, 15938008, 16360001, 16501693, 17112057, 17039146, 17557354, 17539099, 18426812, 18306875, 19007030, 19200052, 19810625, 20318624, 20751545, 20705727, 21423478, 22051228, 22539411, 22643774, 23317996, 23509259, 24400367, 25323701, 25643997, 26093328, 26626124, 27601411, 27799616, 28751394, 29496202, 30007439, 31021856, 31747306, 32502951, 33393374, 34189325, 34811224, 35911098, 36991232, 37993987, 38953889, 39854840, 41317982, 42473716, 43772180, 44980636, 45923302, 47450969, 48905841, 50655577, 52538408, 53765397, 55170082, 57545563, 59324575, 61285538, 63497163, 65280502, 67714993, 70251818, 72679351, 75546450, 78234405, 81175262, 84153122, 87515242, 90829406, 94525174]
14297I4525174L851607L878174M562526M271504M640900N208048M894254N375117
14289A31207304O113007O340597O536306O583042P342895P979705Q093779Q530853
14281A88727488R060717R473223R843507J0656795J1145583J1541876J2206455
14274B62655644J2791738J3343832J3416725J3901843J3968104J3585595J3393995
14267C57057476J2626204J2799308J1966688J1606700J0243913R447621R059955
14260D34807865Q324796P243998N670878L398414J982831K077335l231717q241052
14252D52033348o815083p505879r290603q793801j0021809j1867795j3095508
14245C84642870j2910441j2905235j3950061j4032812j3426620j3590975j3680757
$$ y = [94525174, 98376781, 102254955, 106817481, 111088985, 115729885, 120937933, 125832187, 131207304, 137320311, 143660908, 150197214, 156780256, 164123151, 172102856, 180196635, 188727488, 197788205, 207261428, 217104935, 227761730, 238907313, 250449189, 262655644, 275447382, 288791214, 302207939, 316109782, 330077886, 343663481, 357057476, 369683680, 382482988, 394449676, 406056376, 416300289, 425747910, 434807865, 443132661, 450376659, 456047537, 459445951, 461428782, 463506117, 460274400, 452033348, 445218265, 437712386, 428421783, 419627982, 409606173, 397738378, 384642870, 371732429, 358827194, 344877133, 330844321, 317417701, 303826726, 290145969]
14238B90145969j2914221j3647351j2309473j2328474j1885810j1715114j0697013
14231B04648513j0177580r624474q436797q353811q136229p128054p266019o648439
14223A38877110o022386n598199n596612n071920m890852m347957m384682l868500
14215I9096002l917521l948211l297055l327921l325311k937815k750975k637505
14207G2953688k596284k339714k316354j978453k272760k049065j748775j663611
14199E5988672j480413k008444j852848j245330j302786j423265j481683r01709
14191D4292194j120003j594392r54613j352072p77946j038478p72768j164205
14183C5517717r45668j213359n13054j016511m00193j145456o48394l97407q40313
$$ y = [290145969, 277231748, 263584397, 251274924, 238946450, 227060640, 215345526, 204648513, 194470933, 184846459, 176409662, 168055851, 159919622, 152791568, 145525549, 138877110, 132854724, 127256525, 121659913, 116587993, 111697141, 107349184, 102964502, 99096002, 95178481, 91230270, 87933215, 84605294, 81279983, 78342168, 75591193, 72953688, 70357404, 68017690, 65701336, 63722883, 61450123, 59401058, 57652283, 55988672, 54508259, 52499815, 50646967, 49401637, 48098851, 46675586, 45193903, 44292194, 43172191, 41577799, 40623186, 39271114, 38493168, 37454690, 36681922, 35517717, 34572049, 33358690, 32845636, 31829125, 31428932, 30283476, 29635082, 29237675, 28397362]
14174B8397362q01099o79961p38634k40460r31924k69910q95609n16217m55091
14165B2868457j55826o96706n66015l1930p50688j90070o07267K8570o46702o45406
14155A8606417k34180j72315m03611m04523k28954o26429j59691m57435r6428
14146A5822851j06052j26222n33425P9656l50410l63317p2889m42663r4164n02509
14136A3310856j27750k80506J88038o33157k2976j14705l58225j96144j55828
14127A1609603J68551K3676o04433k57559l28794o3867k47900O2867J1113l01363
14117A0071894k62820K6173q9939j17389j77849m13590K7695M1399m11260K61428
14107H955742l96608j37953K280r5475m96424M01842k63788p9365j37136k0152
$$ y = [28397362, 27596263, 26916302, 26177668, 25937208, 25005284, 24735374, 23839765, 23323548, 22868457, 22712631, 22015925, 21449910, 21417980, 20667292, 20477222, 19869955, 19898525, 19251823, 18606417, 18372237, 18199922, 17796311, 17391788, 17162834, 16536405, 16376714, 15919279, 15822851, 15716799, 15590577, 15057152, 15136808, 14786398, 14423081, 14350192, 13907529, 13813365, 13310856, 13183106, 12902600, 13090638, 12457481, 12434505, 12319800, 11961575, 11765431, 11609603, 11778154, 11801830, 11197397, 10939838, 10611044, 10547177, 10299277, 10362144, 10373257, 10071894, 9809074, 9835247, 9745308, 9627919, 9450070, 9036480, 9064175, 9105574, 8694314, 8955742, 8559134, 8421181, 8423461, 8327986, 7831562, 8233404, 7969616, 7890251, 7753115, 7732963]
14097G732963j80567k08983j40406K2756n2229k60138j96716L13260r8168k42305
14087F689467K34798k57142l43876L36687l24506p1517o597L337j51938J02228
14077F210941j91429o9991n6427j34637J93334l76551j28993o7371J83959k36547
14067E326288j3830j23404m06115O31509j78614j20018j28910J21939j28613p7458
14057D902774o0063K96053m04423j4561k44264M3515J38566L715j58386J58755
14047D661681m64931K21966p8272J19352j86723p159K4239J49990m3106m50584
14037C946453O05323m01050m456j87856K9533k28854k04079L4259L16802k99595
14027C606480Q6324l26819k0233N267L53775m68736J99733J52414K9327k78991
$$ y = [7732963, 7552396, 7343413, 7203007, 7225763, 7173534, 6913396, 6716680, 7029940, 6931772, 6689467, 6924265, 6667123, 6323247, 6659934, 6335428, 6263911, 6257314, 6260651, 6108713, 6210941, 6019512, 5949521, 5893094, 5758457, 5951791, 5575240, 5446247, 5378876, 5562835, 5326288, 5312458, 5189054, 4782939, 5414448, 5235834, 5115816, 4986906, 5108845, 4980232, 4902774, 4842711, 5138764, 4734341, 4719780, 4475516, 4519031, 4657597, 4661312, 4502926, 4661681, 4196750, 4418716, 4340444, 4459796, 4273073, 4265914, 4290153, 4440143, 4397037, 3946453, 4551776, 4150726, 4146270, 3958414, 3987947, 3759093, 3555014, 3589273, 3906075, 3606480, 3692804, 3365985, 3345752, 3351019, 3704794, 3236058, 3435791, 3588205, 3617532, 3338541]
14017C338541K33638m9306J00965n39953K68973m6612K06762l75804J36361n95104
14007B678461O48347o5809o39743K37663j24430P1092J26057Q5653k58301J68137
13997B927127J94056l15323L6733j53751J06650p9616j62999j19421n406Q6902
13987B514952K38019p7225j29310R7431L70364p38723O46069j79184N85821J89031
13977C517245K35057M92351J554965Q79843L406210O180059J0875067L312877
13969C0453674r829599o260996m001226k179889j658863j000845m61135r60511
13961D100610j5705l83005p2006J433m40330k33337J51682k56628r515l08990
13951B534209o831O1825N2279j98593r034j33875J43536j46611j46540m46601
$$ y = [3338541, 3572179, 3522873, 3623838, 3083885, 3352858, 3306246, 3513008, 3137204, 3273565, 2678461, 3326808, 3260999, 2621256, 2858919, 2734489, 2805581, 2931638, 3017291, 2758990, 2927127, 3121183, 2805860, 2842593, 2688842, 2795492, 2715876, 2552877, 2433456, 2428050, 2514952, 2752971, 2675746, 2546436, 2643867, 3014231, 2275508, 2921577, 2742393, 3328214, 3517245, 3752302, 4244653, 5799618, 6679461, 10085671, 16265730, 27140797, 30453674, 20624075, 14363079, 10361853, 8181964, 6523101, 5522256, 5061121, 4100610, 4084905, 3701900, 3629894, 3631327, 3190997, 2957660, 3109342, 2852714, 2843199, 2534209, 2527378, 2589203, 2641482, 2442889, 2433855, 2299980, 2443516, 2296905, 2150365, 1703764]
13941A703764Q05509m31934K92942q5380l533n861l55135N66316l07375r1782
13931B087531J44703m08325k65465K04276K45515Q2392M7128o9088k26797N342
13921A847212j20291L4801L38547m32646R7276K6478k4655K352J39756l04490
13911A604340M76277l54320J04884O5463N8279m43508N6603J26656K26422k87908
13901A633188r2387J70886j52218n9954q234J1428J97882K4613j22619l43374
13891A259211p6283O39788k00200K67486l50922P3885j72409M14943k05523P1725
13881A721701k52232j14464j76995J52627L3260L16174l15360K40765o5176P2855
13871A613155j22964N8376j11527J38373k02935J56852l94461L9517J02998J42219
$$ y = [1703764, 2509273, 2077339, 2370281, 2284901, 2281368, 2275507, 1920372, 2486688, 2179313, 2087531, 2232234, 1823909, 1558444, 1762720, 2008235, 2090627, 2137755, 2068667, 1841870, 1847212, 1726921, 1761722, 2100269, 1667623, 1764899, 1791377, 1766722, 1769074, 1908830, 1604340, 2080617, 1726297, 1831181, 1896644, 1954923, 1511415, 1568018, 1694674, 1921096, 1633188, 1540801, 1711687, 1559469, 1499515, 1491281, 1502709, 1700591, 1725204, 1602585, 1259211, 1182928, 1822716, 1622516, 1890002, 1539080, 1612965, 1440556, 1855499, 1649976, 1721701, 1469469, 1355005, 1178010, 1330637, 1363897, 1680071, 1364711, 1605476, 1540300, 1613155, 1490191, 1548567, 1437040, 1575413, 1372478, 1529330, 1134869, 1174386, 1277384, 1419603]
13861A419603l7440j35732J29613k34257L24625Q9231l89641J25694n02700L66116
13851A155112n7180O12304n66673J26367K66476j22908q3965o1981j20198l16306
13841H31048L75086R5964q4353j7657L1620J76816j41308J14158m08866n5969
13831I16539J62025j91379j11376J94387K60915l3370m33208P78735o43012J17461
13821A017717p881j63382J84843n0369r7463K76089j91129k03411L81907q9046
13811A057875j00045l13137N56046j01575K88240m31259o7893r1361J70613j17561
13801H49943J20483J70065k79399k34164L38879N5432j63478r334K47396k78032
13791H17791K79042k30652L85623n94970K82003k72622J76138L99018k71465m2498
$$ y = [1419603, 1382163, 1246431, 1376044, 1141787, 1466412, 1555643, 1166002, 1291696, 788996, 1155112, 1097932, 1710236, 1143563, 1269930, 1536406, 1413498, 1329533, 1267552, 1147354, 831048, 1206134, 1302098, 1217745, 1200088, 1231708, 1408524, 1267216, 1381374, 972508, 916539, 1078564, 887185, 775809, 970196, 1231111, 1197741, 764533, 1543268, 900256, 1017717, 1009836, 846454, 1031297, 980928, 883465, 1159554, 968425, 765014, 1146921, 1057875, 957830, 644693, 1200739, 1099164, 1387404, 956145, 888252, 796891, 967504, 849943, 970426, 1140491, 861092, 626928, 965807, 1021239, 857761, 848427, 1095823, 817791, 1096833, 866181, 1251804, 656834, 938837, 666215, 842353, 1241371, 969906, 927408]
13781I27408N0371k78458J65825j38282Q9931p3048k39810J94054K56823j28107
13771H26707j26867J78227J21717k39067J13151J62899l80135K55536j5984j10779
13761G85405J50857l53364M16978P5841j61419l09768P9707J6015O6744j56337
13751F10659N80138l23752k23108N53476k91787k26839K07854J30373k62503K3268
13741G77779k992k47467L54370k83446J5911J41598N1024l9896k0523j97513L92242
13730I41087l02468J23387R4468C96687K32472K4793J92205l37320K53802J37990
13720I00629k20223l34225K88157J40978n2732j81664J42653N824j9339k09928
13710D60130J24639J57941k46495m0767K74813j23972p8747J1129J18418K43537
$$ y = [927408, 977779, 699321, 865146, 726864, 816795, 743747, 503937, 697991, 954814, 826707, 699840, 878067, 999784, 760717, 873868, 1036767, 656632, 912168, 896184, 785405, 936262, 582898, 999876, 1075717, 914298, 604530, 684237, 700252, 766996, 610659, 1190797, 867045, 643937, 1197413, 905626, 678787, 886641, 1017014, 754511, 777779, 774787, 527320, 881690, 598244, 614155, 755753, 806777, 766881, 746358, 548845, 941087, 638619, 762006, 856474, 396687, 629159, 653952, 846157, 508837, 762639, 900629, 680406, 346181, 634338, 775316, 722584, 540920, 683573, 689397, 670058, 460130, 584769, 742710, 496215, 455448, 730261, 606289, 527542, 538671, 657089, 900626]
13700I00626K9282B96563L01695J34122P755r4765B16903L46086O2475m0402K7553
13689F12615j59896J5294J46758m7508Q5218L5431l17152N53271k87888j65655
13679D70488J09863J84319n6636j50929J12263k45040n8297J30345R0550J8555
13669F05481n3441J52951j64723J26842k02722J16921K0018A40693P22498l56008
13659E07183M1340j35779J41039K52039B34804J34221K60856J62252j42086O9906
13649G19953l7608l27954R5087l3830L04095B79793J00432K15946k6599J75981
13639G45553j96222J8759q1684K98802j31186K177l23342O9547K64074B48215
13628F53938j26500J34221A64293J63812L29491P4239n6844l03601l7385N6846
$$ y = [900626, 929908, 296563, 598258, 732380, 740135, 645370, 216903, 562989, 625464, 585062, 612615, 452719, 468013, 614771, 567263, 652481, 687912, 370760, 924031, 636143, 470488, 580351, 764670, 708034, 557105, 669368, 424328, 366031, 496376, 586926, 605481, 552040, 704991, 540268, 667110, 464388, 581309, 601327, 140693, 863191, 507183, 548523, 412744, 553783, 805822, 234804, 369025, 629881, 792133, 650047, 719953, 682345, 354391, 449478, 415648, 719743, 279793, 380225, 596171, 569572, 745553, 549331, 568090, 486406, 785208, 654022, 656199, 332857, 402404, 666478, 248215, 653938, 527438, 661659, 164293, 328105, 657596, 731835, 674991, 371390, 334005, 390851]
13618C90851N5812j89156K47985l1365R3123j66733K9682J7580K7315K3027L171
13607E01292K0498p2093r687r1050A66307M01529k71023M46846C61484L02089
13597F63573k42559K4771L32775l48877r062j3102Q8410j80430M9937k3684j2090
13586C29662J60134J72089r7354k7586j72958j27564J56480J75692j35899O2457
13576D95153K25101A75807J31542J18452L282J4335K5993J59577B01136L36708
13566E37844k41929J58826J52836N7711A97522l14N0664L13428j42270C0640M72020
13555E02660j06802A68152M7946J11813K83453B09946J96330j82271J37810K22010
13545E83825k77436A50190O94587l61951k9994n1494j29512l8010p6193K38762
$$ y = [390851, 446663, 257507, 505492, 474127, 567250, 400517, 430199, 447779, 475094, 498121, 501292, 521790, 449697, 440010, 348960, 166307, 567836, 296813, 743659, 361484, 663573, 421014, 445785, 778560, 429683, 420621, 407519, 495929, 315499, 365436, 341752, 329662, 489796, 661885, 564531, 536945, 363987, 236423, 392903, 568595, 432696, 495153, 720254, 175807, 307349, 425801, 429083, 443418, 469411, 628988, 201136, 537844, 295915, 454741, 607577, 665288, 197522, 197208, 247872, 561300, 419030, 30640, 502660, 395858, 168152, 216098, 327911, 611364, 209946, 406276, 224005, 361815, 583825, 306389, 150190, 844777, 482826, 452832, 401338, 271826, 233816, 157623, 396385]
13535C96385J11231A89315K27527L4119J33274k06249P7253H8168g6608D76004
13524C07152M85r1704O6896p8633p6234J50198K73479k67150J92524j60275P4166
13513C90904j71131N148J78127R3701J38881l04265j31131p0181L59403J28671
13503F18127k07364p0493m8866M4065o2291m6454J50209e3160D25047A56906p0019
13492H6887K19165K7153J75148B40430K84930J29559p7937b1439B2239K7786e2151
13480D7291a6611B15604L16756J1422n5741j24469G7415b07443C85559m5751l8985
13469C00823J64740j55610j49438K92835q5369p1130j37656P4987A05434B9373
13458D9105N8300L94625j09760g4199D00430j18552a1005k29476C08823P0570
$$ y = [396385, 507616, 189315, 416842, 450961, 584235, 377986, 455239, 88168, -76608, 476004, 307152, 307637, 215933, 282829, 204196, 127962, 278160, 551639, 284489, 477013, 316738, 390904, 219773, 224921, 403048, 496749, 635630, 331365, 200234, 130053, 489456, 618127, 410763, 340270, 291404, 335469, 273178, 226724, 376933, -53160, 425047, 156906, 86887, 306052, 333205, 508353, 240430, 525360, 654919, 576982, -21439, 22239, 50025, -52151, 47291, -16611, 215604, 532360, 543782, 488041, 363572, 77415, -207443, 385559, 339808, 300823, 465563, 309953, 160515, 453350, 367981, 296851, 159195, 234182, 105434, 29373, 49105, 107405, 502030, 392270, -74199, 400430, 281878, -11005, -240481, 308823, 379393]
13448C79393A89162J6048Q0135J70037C3617K14619q9871J16509K49856B29087
13437C3634j701J0357J15425k3648L21090a83758B58420B4731L33748j25052A04456
13425H028M88785j9822j36643A34578K33158A36802J32855K78113j01503A31255
13414A02750J69340J28902j72203f1215F70830b17087C62141j66421q1661a07442
13403D19577R6755k51508K9015J72584N1852k07262A21671O2352L14589o38A0587
13391C50548J31896j40443j37683l316B7143K00200P1667B5588J08696l4624J85363
13380B85023O8998r8352G4210M61126I4493g5647A65555L82346k42447c6315B38481
13368C99761g9595E4013L25217j16695R2078J32383A18860A7965K95593J35924
$$ y = [379393, 189162, 205210, 285345, 455382, 33617, 248236, 158365, 274874, 524730, 229087, 33634, 31933, 42290, 157715, 134067, 455157, -183758, 258420, 24731, 358479, 233427, 104456, 8028, 496813, 476991, 340348, 134578, 367736, 136802, 269657, 547770, 446267, 131255, 102750, 272090, 400992, 228789, -61215, 670830, -217087, 362141, 195720, 114059, -107442, 419577, 516332, 264824, 293839, 466423, 518275, 311013, 121671, 184023, 498612, 497974, 10587, 350548, 482444, 342001, 204318, 201002, 27143, 227343, 299010, 25588, 134284, 99660, 285023, 354021, 255669, 74210, 535336, 94493, -75647, 165555, 547901, 305454, -36315, 238481, 399761, -79595, 54013, 379230, 262535, 354613, 486996, 118860, 17965, 313558, 449482]
13358D49482K49072j94947A51597M39041k71888b7870A14950C7533R4913F4184
13347A63567a4117G5855J60102F5244h3297B59363J01676N1235p2031j24884K1597
13336B36956n9729K64804p5529A68846M09427r7806A49802K97795A71371f0438
13325I5028f5986C05903k3273j28419R7553J06851k8180J39878c0438D18936j57046
13314B61890D4853J32507b0353B37041Q6792B2618J76431K52641A90433J99037
13304C89470A60677J28767A36558l5312i5765A86169L01272k08939j31184P2573
13294B19891m011J12606p6624G5289J26676N9355A04541J52503K26806B14434
13283b7838I8019K4854L2193K12113D0302K16361n4659J54189J54013j82899O1226
$$ y = [449482, 698554, 503607, 151597, 590638, 318750, -27870, 114950, 37533, 132446, 64184, 163567, -14117, 75855, 235957, 65244, -83297, 259363, 361039, 412274, 340243, 215359, 236956, 177227, 442031, 366502, 168846, 578273, 480467, 149802, 447597, 171371, -60438, 95028, -65986, 305903, 282630, 154211, 251764, 358615, 330435, 470313, -30438, 418936, 261890, 44853, 177360, -20353, 237041, 323833, 22618, 199049, 451690, 190433, 389470, 160677, 289444, 136558, 101246, -95765, 186169, 487441, 278502, 147318, 219891, 215880, 328486, 251862, 75289, 201965, 261320, 104541, 257044, 483850, 214434, -27838, 98019, 122873, 155066, 367179, 40302, 256663, 202004, 356193, 510206, 327307, 388533]
13272C88533b3999p7390A12248J51905Q7718A32761J71481A16858R4279H6467
13261E2217J59044l4268J18356m6805H272K76969j2616J33739A96333J54829b13111
13249A46000J04892b887D12777A65330K61294j70037G01O851J86631M10833j75534
13238D29482A41618i514D77686j4603i283p2148B7393d2064A58599e4083C11681
13226A4863f3987C10075A37592J53041l8989B2438Q5936k9105A2346d0854q7316
13215a28170B81338m8161H7028J96949A3446N45487j70707J8117r5422L42775
13205F53696A71975J80486E7616J05842K75850B17977j8256G3992a18066j25542
13195b43608A79436P5678j8251A3791a51919G7547B6675P6444L0372K60863h5853
$$ y = [388533, -23999, -101389, 112248, 264153, 351871, 132761, 304242, 116858, 211137, 86467, 52217, 211261, 176993, 295349, 248544, 8272, 285241, 272625, 406364, 196333, 351162, -213111, 146000, 250892, -2887, 412777, 165330, 426624, 256587, 701, 7552, 194183, 605016, 429482, 141618, -9514, 477686, 463083, -9283, -81431, 27393, -42064, 158599, -54083, 311681, 14863, -63987, 310075, 137592, 290633, 251644, 22438, 108374, 79269, 12346, -40854, -128170, 281338, 233177, 87028, 283977, 13446, 558933, 388226, 406343, 310921, 653696, 171975, 352461, 57616, 163458, 439308, 217977, 199721, 73992, -118066, -243608, 179436, 255114, 236863, 13791, -151919, 77547, 26675, 103119, 133491, 394354, -85853]
13183B00605I1784J27565H1852J59708j19739J52699e7059j14043B6800M7862
13173G4662O5776K11323a01993I1300a73319G1808K6655b79218A78042j5775a36928
13161b8476F2167a34411A64738o6289F908J18896a9865B43566J41611A14356R3586
13150B07942B7802e255j50132A85103l8472F9969Q0518M0777K75547A94680E6721
13138D5851J22639A323O40911k75676j72221L342c0490m9251B3344J10839J20903
13127B55086j01079a18917A75866J35199j514A39578m5777K8759J2685b23136
13116H5069C8650J23898k0587o1598N8148n8636C2025c29651B71297A28396J40458
13105B68854I6479J64142a89142B36220J8827j05558J69984G6067J77929f9170
$$ y = [200605, 91784, 219349, 81852, 241560, 121821, 274520, -57059, -171102, 26800, 74662, 140438, 351761, -101993, 91300, -173319, 71808, 98463, -279218, 178042, 162267, -136928, -28476, 62167, -134411, 164738, 98449, 6908, 125804, -19865, 243566, 385177, 114356, 207942, 27802, -5255, -155387, 185103, 146631, 69969, 150487, 191264, 466811, 194680, 56721, 45851, 168490, 1323, 642234, 366558, 194337, 197679, -30490, -79741, 23344, 134183, 255086, 154007, -118917, 175866, 311065, 309551, 139578, 93801, 122560, 135245, -223136, 85069, 38650, 162548, 141961, 80363, 138511, 79875, 32025, -329651, 271297, 128396, 268854, 96479, 260621, -189142, 236220, 255047, 149489, 319473, 76067, 253996, -69170]
13094a87358E12285H5785K25313K10571M6976I0507N5626n6913J09766a05987
13083A36906L64830a27737G6883L10006B0318f6102B02430a06998D32243a8877
13072a0019A49143F5556d9055B01863n2561k7803J27695a11376F1293j8571j257
13061D1465f2234E19567G6920M7339n6705a21311b1870p1295B2913e3465j13308
13050a66773C82773d3389A74975J57532c6883o6534A70145E0080a44812C07456
13039B50884q8084J08344b591n9507j14449F608Q2403K42171a200B34371O224
13028B40595F7699K56220M8034d1910B77886n3378J36031j20514B6131a02580
13017c48774C62917j52263q7906A2252h1296b16H8759k0374B770J4413J45765
$$ y = [-187358, 512285, 85785, 311098, 521669, 568645, 90507, 146133, 89220, 198986, -105987, 136906, 501736, -127737, 76883, 386889, 20318, -66102, 202430, -106998, 432243, -18877, -10019, 149143, 65556, -49055, 201863, 149302, 121499, 249194, -111376, 61293, 42722, 41465, -62234, 519567, 76920, 124259, 67554, -121311, -21870, -93165, 22913, -53465, -166773, 382773, -43389, 174975, 332507, -36883, -103417, 170145, 50080, -144812, 307456, 250884, 162800, 271144, -2591, -62098, -176547, 6608, 89011, 331182, -1200, 234371, 240595, 67699, 323919, 371953, -41910, 277886, 224508, 360539, 240025, 26131, -102580, -348774, 362917, 210654, 122748, 12252, -81296, -216, 88759, 68385, 2770, 17183, 162948]
13006A62948L2706B7254L17193g7027C9215K16916A02565B3528c1974A66259K2800
12995A89059o7648J84136b8357B35781C8046M0306b36014d2665B27938D6746d3015
12983b70592D76595B22926a8457A25487P6706e087r2837F3871A9470e1325A12592
12971b56054B70359L6833D1449Q5881C8196f9972A55322b0178B13063N8523E5714
12959B45708a93188k0794i3551n4188I2602L8065n431A9923L29051F1328j693
12948E9635J71962J44608G4083J24088A7840Q5054J18870D6669J50953q3658J05955
12937B19919d0592D8435N1244J80231A25203b0193A27291B0829L46891g7591A6314
12925d385H7199C3846J06876l2731k8014a7981k34068b7099m1846G4685Q2704
$$ y = [162948, 195654, 27254, 344447, -77027, 39215, 256131, 102565, 23528, -31974, 166259, 189059, 121411, 305547, -28357, 235781, 38046, 78352, -236014, -42665, 227938, 46746, -43015, -270592, 476595, 222926, -18457, 125487, 202193, -5087, -97924, 63871, 19470, -51325, 112592, -256054, 270359, 307192, 41449, 127330, 38196, -69972, 155322, -20178, 213063, 271586, 55714, 245708, -193188, -213982, -93551, -147739, 92602, 130667, 125236, 19923, 348974, 61328, 59635, 231597, 376205, 74083, 198171, 17840, 102894, 221764, 46669, 197622, 113964, 219919, -40592, 48435, 99679, 279910, 125203, -20193, 127291, 20829, 367720, -77591, 16314, -4385, 87199, 33846, 140722, 107991, 79977, -17981, -252049, -27099, -68945, 74685, 157389]
12914A57389J96431j60301o0595E5356J30575M4811K06896I8197P13D5621a56674
12902A66175R0337a17808A52981J2929c7138A78185K99944F6529K05488i565A63629
12890c1884o6380P708A30883e8951a7265A43723J66665d3164m6178p0333b3651
12878b23138A02436m1249b201B41097D8846d7077A09706K89281j99363J36558
12868C36182C4830J02325k5051O8861h7732C65414j07093B7871h6560m9746M5740
12857i0566A29152f1864A00885b9184F6079M52161I9247j8357a18426B27525N6755
12846B84280G2213A2919a15481N1882j66118B88443F5439J82575A10443A0308
12835H4617K72256b87912e1461A00186i961H4710J15493h6701l54668B68858r4387
$$ y = [157389, 353820, 193519, 132924, 55356, 185931, 230742, 437638, 98197, 98910, 45621, -156674, 166175, 256512, -117808, 152981, 165910, -37138, 178185, 478129, 66529, 272017, -9565, 163629, -31884, -98264, -90556, 130883, -58951, -17265, 143723, 310388, -43164, -89342, -159675, -23651, -223138, 102436, 61187, -2201, 241097, 48846, -47077, 109706, 398987, 199624, 336182, 34830, 137155, 112104, 180965, -87732, 365414, 258321, 27871, -86560, -136306, -90566, 129152, -61864, 100885, -29184, 66079, 518240, 99247, 80890, -118426, 227525, 284280, 72213, 12919, -115481, -63599, -229717, 288443, 65439, 248014, 110443, 10308, 84617, 356873, -287912, -51461, 100186, -9961, 84710, 200203, -86701, -441369, 268858, 174471]
12824A74471a7594j79611q6587C93168b47752A81244B0974J2610Q8807c3439A70463
12812a36643C34657G6332J1515f9055G9385f2441C5917L59994j50749p4522L960
12801A74600b47910R6920D59159b06058D37168B02082r5686a89216K036B8771
12790E8045d1151H2859K31958j51818f6866B45625n8668f3055H5936a47750j54928
12779c02678A01701e583k2948l10451a05277j44877J13240B21827c0723k35666
12769b66389e4034C86508j83100P700e9384J0722D782d62209C7596f675B80571
12757A37747a28526h633A56120m6250n0651b73973d3471C3102b1386A53210i7715
12745C29096I7908B0957A0084N4533e5697A8371i1586C9332i904C1675b43047
$$ y = [174471, -17594, -197205, -283792, 393168, -247752, 181244, 20974, 33584, 122391, -33439, 170463, -136643, 334657, 76332, 87847, -69055, 79385, -62441, 35917, 395911, 245162, 170640, 174600, -247910, -150990, 459159, -206058, 437168, 202082, 106396, -189216, -187180, 28771, 58045, -41151, 82859, 314817, 162999, -66866, 245625, 186957, -63055, 85936, -147750, -302678, 101701, -5583, -28531, -338982, -105277, -250154, -136914, 221827, -30723, -266389, -54034, 386508, 203408, 211108, -59384, -48662, 4782, -462209, 37596, -6675, 280571, 137747, -128526, -8633, 156120, 109870, 59219, -273973, -43471, 33102, -21386, 153210, -97715, 329096, 97908, 20957, 10084, 64617, -55697, 18371, -91586, 39332, -9904, 31675, -243047]
12733a16553a9290A73786h1119n7178f252A26349i5419M6479B27597N8835B5659
12721C69973A53007e8714A22597k5897e0199H3109A9236K83684j19720B8715J98366
12710B27081J7455r2717a20411H1949A948a26628D3783e2648a4238C22147K6189
12699C48336l6220o7871A3915L14593j23274G0971a20745C53996n2949l064n0651
12688B47332j16502J32493b00510A65129n512J7463d8626B3553J22800a98310
12677e2049e10j43773O6481a0209A54945a99859d2783B92627a15358B13440a20861
12665B3574J55360P8431G5690i4668D03096A53811G5152K6844O782m8987d4654
12653a38707B1468b3507A69394J77307e233j16357N5866K3871B75658C5087H489
$$ y = [-116553, -19290, 173786, -81119, -138297, -6252, 126349, -95419, -48940, 227597, 286432, 25659, 369973, 153007, -58714, 122597, 96700, -50199, 83109, 19236, 302920, 183200, 28715, 227081, 244536, 151819, -120411, 81949, 1948, -126628, 43783, -52648, -14238, 322147, 348336, 312116, 244245, 13915, 328508, 205234, 70971, -120745, 353996, 301047, 297983, 247332, 130830, 263323, -200510, 165129, 159617, 177080, -48626, 23553, 146353, -198310, -52049, -510, -144283, -77802, -10209, 154945, -199859, -42783, 292627, -115358, 213440, -120861, 23574, 178934, 257365, 75690, -94668, 403096, 153811, 75152, 101996, 108778, 59791, -44654, -138707, 21468, -23507, 169394, 346701, -5233, -121590, -65724, -41853, 275658, 35087, 8489]
12641A69097F1416L89484c9366A5150f137C89808q3235f2723A49972m4010O642
12630A12604R9438J70509j66538a34738C28967d32702G2236J63737j11589J86463
12620C10847J4291g0070p0453D4443A7256R8045L3781J71750J95298G4466J65625
12609B40091r5075n1901J29558b0330B09754J28531g9373m3693B4357Q2235f9920
12597b93761a3656A79073o6402a20934j12951B42413j20412i9999L6117A4823
12586A3590a6546p5774D13668A16281Q0400j5190f6518B55603h5203C74564j23733
12575B50831A09952K5270a33273n2596A6808J23783A8169g9150B12890l1191a53478
12563A25689c5034B69042o3707H531b98785H3097J44432a46007D3727L05725C308
$$ y = [169097, 61416, 450900, -39366, 15150, -6137, 389808, 306573, -62723, 149972, 105962, 112604, 212042, 382551, 216013, -134738, 328967, -432702, 72236, 235973, 124384, 310847, 325138, -70070, -140523, 44443, 17256, 115301, 149082, 320832, 516130, 74466, 240091, 145016, 93115, 222673, -20330, 209754, 338285, -79373, -123066, 24357, 106592, -69920, -293761, -13656, 179073, 112671, -120934, -233885, 242413, 122001, -99999, -63882, 14823, 13590, -16546, -92320, 413668, 116281, 196681, 181491, -66518, 255603, -85203, 374564, 250831, 109952, 135222, -133273, -185869, 16808, 140591, 18169, -79150, 212890, 181699, -153478, 125689, -35034, 269042, 205335, 8531, -298785, 83097, 227529, -146007, 43727, 349452, 3308]
12551A35476C2713O0440c8809j11360A28491J76999A7071b16563j6542J06565
12541a26540J8823C65476a68598P6280D6507d09253D8681f3278j30375A46654
12530H8965c728A25772J98640j62086e2708j24312b8082p113n4118A26352k3555
12519A02797A4441K08606f3930D81034a56904e5519A61440a84398C36058a40530
12508g7811l03972c9577C33243j48746a771j40722A39436J6438a6530H849J87634
12497A96483a04465n2415c9704A20492J66105h8955a509j51100j49528a02729
12486c7663D12260j53195a87096o1448C67324J65489j96520a32015b824l90301
12476c93125A98083a80454B93065i0319A55635b8264I033P6355a048H6881J2979
$$ y = [135476, 32713, 93153, -38809, -150169, 128491, 305490, 17071, -216563, -233105, -126540, -107717, 365476, -168598, -92318, 46507, -409253, 48681, -63278, -193653, 146654, 88965, -3728, 125772, 324412, 162326, -52708, -177020, -28082, -35195, -89313, 126352, 102797, 14441, 223047, -63930, 481034, -156904, -55519, 161440, -184398, 336058, -140530, -77811, -381783, -39577, 333243, 184497, -1771, -142493, 139436, 155874, -16530, 8849, 196483, -104465, -156880, -39704, 120492, 286597, -88955, -1509, -152609, -302137, -102729, -37663, 412260, 259065, -187096, -248544, 367324, 532813, 336293, -132015, -2824, -393125, 198083, -180454, 293065, -90319, 155635, -28264, 9033, 85388, -1048, 86881, 99860]
12465I9860K01539C5782K83714c09103F518a513B48518b46667D837e868k00111
12454b05979B38427D2735h951j59071B93128G666J33247i4643C30873c6732l4986
12443g1718G400L98567c25077a29379c1479D13867I680a17164A75352a25721c1069
12431a05878A76450i442B23589a3159B99903h052l9955C4465c72391Q0691J03006
12420a88694a0218j35113j02614B28942A705b40917a0746j30177L2630L9389r7706
12409a66610m9326J7728I6249K13160L3956A51674O8287a91531f489B64048r6278
12398A67770Q0144L4418q5037r5043h9588A7632c71730A0060J32876J44555A13416
12386a84219D4396M741h0997k0345C31641a72145F3986G914K52811q3637Q5903
$$ y = [99860, 301399, 35782, 319496, -309103, 6518, -1513, 248518, -246667, 4837, -5868, -205979, 238427, 42735, -8951, -168022, 293128, 7666, 140913, -94643, 330873, -36732, -71718, 7400, 405967, -325077, -129379, -31479, 413867, 9680, -117164, 175352, -125721, -31069, -105878, 176450, -9442, 223589, -13159, 299903, -8052, -48007, 34465, -372391, -291700, -188694, -10218, -145331, -247945, 228942, 1705, -240917, -10746, -140923, -108293, -68904, -166610, -215936, -198208, 96249, 309409, 343365, 151674, 219961, -191531, -6489, 264048, 167770, 247914, 282332, 197295, 102252, -89588, 17632, -371730, 10060, 142936, 287491, 113416, -184219, 44396, 49137, -80997, -101342, 331641, -172145, 63986, 7914, 260725, 177088, 262991]
12375B62991a44714B9312a90877A54191f8114B75394H8128i9882A45984J524M0818
12364A88326a28870c0005j00064A39797E2589J98599b4806k90080B1786e9528
12353a9004k6624A97263f8301b0029B79883b7947k23105L0332I3519g7487J1551
12342f5936D3350a11434l96105E9871a51844M6948B78780r5519a64959c3825j11072
12331a44897d9929j31126j46171e4763A23303j7594K38454I6541Q2576a25641
12320h6550B8013J24468c74040A80258e18282D69330b6284A05909h877j16095
12310a24972A84617f9439A97049f7987r3062d2424A69087P1936A09050a40337
12299D6367J67840E6098K21022A22991J40084a03344C52310a08480B98902H6455
$$ y = [262991, -144714, 29312, -190877, 154191, -68114, 275394, 88128, -99882, 145984, 147508, 188326, -128870, -30005, -130069, 139797, 52589, 251188, -24806, -314886, 21786, -59528, -19004, -45628, 197263, -68301, -20029, 279883, -27947, -251052, -220720, 93519, -77487, -65936, 43350, -111434, -507539, 59871, -151844, -104896, 278780, 183261, -164959, -33825, -144897, -49929, -181055, -327226, -54763, 123303, 105709, 344163, 96541, 179117, -125641, -86550, 28013, 152481, -374040, 180258, -518282, 469330, -26284, 105909, -8877, -124972, 184617, -69439, 197049, -67987, -161049, -42424, 169087, 241023, 109050, -140337, 46367, 214207, 56098, 277120, 122991, 263075, -103344, 352310, -108480, 298902, 86455]
12288B52993e6097B58748a13434C06628b31960c7056D0979J7360Q656N7027B6149
12276A59178K16579I849J01780b65121D1326O5559j3969J9215B5913a05193A65054
12264G5473a55706a9164E0697O6950B3704M3167J71539A10605b53165A53014n7377
12253I5637J34566E68J01233j3892a73265A55901o1825Q4611c26733A30961A8653
12241A52844b23898C27455C111J67660a2105B17825p5687l3815Q6867J5653B8456
12229a39626H6039J87767K5671g8131A82747G0723M4253A8927J75376F7782J69362
12218B37144a41995A73965B8502a01672B30373j10453J53235G2632K15249Q024
12208B95905j33346d7271j1176A41465J66221G9574K01160H3427Q8423a5334C16943
$$ y = [252993, -56097, 258748, -113434, 306628, -231960, -37056, 40979, 58339, 66995, 124022, 26149, 159178, 375757, 9849, 111629, -265121, 41326, 106885, 92916, 112131, 25913, -105193, 165054, 75473, -155706, -19164, 50697, 117647, 23704, 66871, 238410, 110605, -253165, 153014, 95637, 230203, 568, 101801, 87909, -173265, 155901, 94076, 178687, -326733, 130961, 18653, 152844, -223898, 327455, 3111, 170771, -12105, 217825, 142138, 108323, 195190, 210843, 28456, -139626, 86039, 273806, 299477, -78131, 182747, 70723, 114976, 18927, 194303, 67782, 237144, -141995, 173965, 28502, -101672, 230373, 119920, 273155, 72632, 287881, 295905, 162559, -47271, -58447, 141465, 307686, 79574, 280734, 83427, 171850, -15334, 316943]
12196i4026j34382H2762M4791K1442J81145m9049G4376J7862P2262D0688b6419
12184A59752a0882E66859A21498g3481B0628K60720N2122a26364I3936K2049K35478
12173C51463a19175C64761M1598j75490a35646a9552B85322D1682K15885n9981
12163A97586I0662m0852O4824N4503J35177l6064l232A22873D8438a76810A19821
12151D7078a1747B09577B458g3165H8465A4377N3243J19916o7581h4058B12085
12139C54915b400G2878h1358D12193j76414a08637C0740O8366J87124a22118c0865
12127b40680D9125r29P8489E8080L4039J43989c07030a13635D5541K1394g2047
12115A3120L1140M5307L5404L1767a01454A59627k0429m4110Q7188K01677I2051
$$ y = [-94026, -228408, 82762, 127553, 148995, 330140, 281091, 74376, 92238, 164500, 40688, -26419, 159752, -10882, 566859, 121498, -73481, 20628, 281348, 333470, -126364, 93936, 115985, 351463, -119175, 364761, 406359, 230869, -135646, -19552, 285322, 41682, 257567, 197586, 90662, 49810, 114634, 169137, 304314, 268250, 265018, 122873, 48438, -176810, 119821, 47078, -11747, 209577, 2458, -73165, 88465, 14377, 67620, 187536, 119955, -84058, 212085, 354915, -2400, 72878, -81358, 412193, 235779, -108637, 30740, 99106, 286230, -122118, -30865, -240680, 49125, 48196, 126685, 58080, 92119, 236108, -307030, -113635, 45541, 66935, -72047, 13120, 44260, 89567, 124971, 156738, -101454, 159627, 139198, 95088, 182276, 383953, 92051]
12103b848A36933J00255b70393B56755l3434j10004N9429R6282B9088i2626C2542
12091A34992a40935n5190M6612B80076G4489d0525c305r726j89659R9929B26730
12079D7099N9566J84234B992h5140A99476C0052r133a75766I0817a3584B84853
12067A9710K06824l7520g9530C87391j12159j15559N4253j04158M41104N54973
12057A105845j83570j46095k46495A62704a6738N220E9533O2802l8947b91364
12046b13049j49360A23611j8155L98487H8839M633l998a07377I2965J20426a75267
12034a06432k04962A00054l7801J5790a26492l14940J71505g9914B64350h2252
12023B45709b11470N3454A80851a56266N6787C90878A18886n037a32882r7096
$$ y = [-2848, 136933, 237188, -270393, 256755, 223321, 113317, 172746, 269028, 29088, -92626, 32542, 134992, -140935, -196125, -149513, 280076, 74489, -40525, -3305, -13031, -202690, -102761, 226730, 47099, 106665, 290899, 2992, -85140, 199476, 30052, 20919, -175766, 90817, -13584, 284853, 19710, 226534, 189014, -79530, 387391, 275232, 159673, 213926, 109768, 550872, 1105845, 922275, 776180, 529685, 162704, -16738, -11518, 59533, 122335, 83388, -291364, -213049, -362409, 123611, 105456, 503943, 88839, 93472, 89474, -107377, 92965, 213391, -175267, -106432, -311394, 100054, 62253, 78043, -126492, -441432, -269927, -79914, 264350, -82252, 245709, -211470, -158016, 180851, -156266, -99479, 390878, 118886, 113849, -132882, -229978]
12013b29978m5555B1443b56658B71206M9800A3352O4167M690k5079J45675r2284
12002A10521K15934j56221a02195j3813D08656c7727o3537d0409j68097e4111
11991E1695J05869d27773F584e2780q9176j5504K7487A8205b30757A69208m0880
11980A28328e4986J1230j34536b0779l1007j3466b6277j47013A16860a93874O0992
11969a32882K2581F1454a95806E821f5741A6221b75826a7478A58149b7512A76033
11957G5695L007a49543A02759j3738N1127e9216A4618M55246c1344B39868B5944
11945E9597J48477l223b34103A07841h423q7520K3097m147j63423j38310a46004
11933a17465G099J81135N4280b14448h597j40253A12416a08584F1470a83989k56279
$$ y = [-229978, -275533, 21443, -256658, 271206, 321006, 13352, 77519, 82209, 57130, 202805, 110521, 326455, 170234, -102195, -116008, 408656, -37727, -101264, -40409, -208506, -54111, 51695, 157564, -427773, 6584, -52780, -141956, -157460, -129973, 18205, -230757, 169208, 128328, -54986, -43756, -178292, -20779, -51786, -65252, -26277, -173290, 116860, -193874, -132882, -110301, 61454, -195806, 5821, -65741, 16221, -275826, -17478, 158149, -27512, 176033, 75695, 78702, -149543, 102759, 89021, 140148, -59216, 14618, 469864, -31344, 239868, 25944, 59597, 208074, 204851, -234103, 107841, -8423, -95943, -72846, -76993, -240416, -378726, -146004, -117465, 7099, 188234, 242514, -214448, -8597, -148850, 112416, -108584, 61470, -183989, -440268]
11922d40268B3463M77661I4345a7501C35319c97816J04835D1418A8366M0223h7044
11910b50923G6249J30376g4379l8557d9951F1209f6501j6078a0157H3115A3956
11898A797P4381k706J8773J49575A17238b07191A48150h5883j16237F35L5922
11887C6557L07088j65590a92684R1928m9625L0803J901A82657i2174M5736E7910
11875b46439A91893Q257g1225j50701Q5847p8187E8826g4491m6099M6455n1148
11864a25283B6900f7438J7904p6034j67029N74a18843A10077J2661M0189a42078
11852a24093G6988a97183C79230A7663b80203a09207c068l68861J17405B48413
11841h5005C55511a25295k19175A96916D86K0734e5098m6646b2549o6I1588a63407
$$ y = [-440268, 23463, 501124, 94345, -17501, 335319, -397816, -292981, 41418, 18366, 58589, -87044, -250923, 76249, 206625, -74379, -112936, -49951, 61209, -66501, -82579, -10157, 83115, 13956, 1797, 76178, 73472, 92245, 241820, 117238, -207191, 148150, -85883, -202120, 635, 36557, 343645, 178055, -192684, -100756, -150381, -119578, -117677, 182657, -92174, -46438, 57910, -246439, 191893, 200150, -71225, -221926, -136079, -214266, 58826, -74491, -120590, -74135, -125283, 26900, -67438, -49534, -125568, -292597, -292023, -118843, 110077, 122738, 162927, -142078, -124093, 76988, -197183, 379230, 17663, -280203, -109207, -3068, -371929, -254524, 248413, -85005, 355511, -125295, -344470, 196916, 486, 21220, -55098, -101744, -22549, -22615, 91588, -163407]
11828A48664F1902J18588b54224j03224d2004k24314c9531B67151e3888C31147
11817b18013h4735l26419a56001l6846A94304f2808m8290k40416H2702a47240
11806a15611n5289j8277a3753C8600O6358K8168a03139o093m6643B35924i0691
11794a15032C56361n3685H8250b06369B37777b35686a3224j34328G6837b57032
11783A23276c28001A17130q699a39411A77207h9292A99459l0154l7881b4808A62294
11771H8473m750R8444b63429P4825j55245A35180d5418I0177f1362H8261L8831
11760A27092K2082F7152K06918h0869B43785B6825R856d7792A14765k04b8682
11748A13171a66041g6491A82158D6085J0344d492l92888B21115d9805A36528M0877
$$ y = [148664, 61902, 180490, -254224, -357448, -42004, -266318, -39531, 267151, -53888, 331147, -218013, -84735, -411154, -156001, -192847, 194304, -62808, -111098, -351514, 82702, -147240, -115611, -170900, -189177, -13753, 38600, 104958, 133126, -103139, -109232, -155875, 235924, -90691, -115032, 356361, 302676, 88250, -206369, 237777, -235686, -13224, -147552, 76837, -257032, 123276, -328001, 117130, 108431, -139411, 177207, -89292, 199459, 169305, 131424, -24808, 162294, 88473, 83723, 182167, -263429, -188604, -343849, 135180, -45418, 90177, -61362, 88261, 127092, 149174, 67152, 274070, -80869, 243785, 26825, 36681, -47792, 114765, 114561, -28682, 113171, -166041, -76491, 182158, 46085, 56429, -4492, -397380, 221115, -49805, 136528, 177405]
11737A77405F0805b5609B08379a87818P9649l6208F1596J67453i2044J8408A85151
11725C58864A3344J12463a7438B09699a37434C08645A08212K7554c684C51525
11714h8324F0270b09033A06755a7005j7256l57383A1371a50981E9660D818J5427
11703B0245N8157i4611j74724h5299B3249d480j5106B13378n0836L7275e2455
11691a56213j07009Q1915P6875A27498e48369f9554j82165H7797k6817f8881A53667
11679B68249l7810l2563B797M757K60235c3652k20425A64977a58832O3580B14661
11667A86523B0302L9317a41249F5590O204Q1303a3270j32383A32227i4333q0886
11656a75219B54355D4063a59528j17021d0435D9872f8141B59646A4739a43192
$$ y = [177405, 60805, -25609, 208379, -187818, -108169, -144377, 61596, 229049, -92044, -73636, 185151, 358864, 13344, 125807, -17438, 209699, -137434, 308645, 108212, 135766, -3684, 351525, -88324, 60270, -209033, 106755, -17005, -34261, -391644, 11371, -150981, 59660, 4818, 20245, 78402, -94611, -269335, -85299, 23249, -4480, -19586, 213378, 162542, 199817, -52455, -156213, -263222, -181307, -104432, 127498, -548369, -69554, -251719, 87797, 60980, -68881, 153667, 268249, 230439, 197876, 2797, 7554, 267789, -33652, -254077, 164977, -158832, -95252, 214661, 186523, 20302, 59619, -141249, 65590, 71794, 153097, -13270, -145653, 132227, -94333, -175219, 254355, 44063, -159528, -276549, -40435, 49872, -68141, 259646, 14739, -143192]
11645i5304B95204A08552a44522L4381D1971A002J85491P1880a78799f7214F2587
11633A13512L41153G9433J78272A8391b77313J19934A19432b53025e953j3441
11623a9394j54973B17998j05897b79414h9795B19760I5273R580K51490G0732N7563
11612A28295i8673L5856A81537a28371B8125c0051j88381C09391C9524K01129
11602B40653d7978G896K66002b01260H6584M6050c1806l11313D3255J64491H111
11590e1554j60285B4655c728H2408a90199A93725J16098A14248a2268H3899a85271
11578a83331G7918L48946B00310a00881A12677m0367L40143G6522K27507c8267
11567c9027A57993R0310i2578q4614f9234B37342J03266D2407a9895A32783g3480
$$ y = [-95304, 295204, 108552, -144522, -110141, 41971, 1002, 186493, 258373, -178799, -67214, 62587, 113512, 454665, 79433, 257705, 18391, -277313, -157379, 119432, -253025, -5953, -19394, -174367, 217998, 112101, -279414, -89795, 219760, 95273, 104853, 356343, 70732, 128295, -98673, -62817, 181537, -128371, 28125, -30051, -218432, 309391, 39524, 240653, -47978, 7896, 273898, -201260, 86584, 132634, -31806, -343119, 43255, 207746, 8111, -51554, -211839, 24655, -3728, 82408, -190199, 193725, 309823, 114248, -12268, 83899, -185271, -183331, 77918, 426864, 200310, -100881, 112677, 72310, 412453, 76522, 304029, -38267, -39027, 157993, 248303, -92578, -177192, -69234, 237342, 340608, 42407, -19895, 132783, -73480]
11555A3964b3868Q213A3556b74784g2793A40568b51190E28021A85821A2882J98324
11544B11206F3040N7440a77343m7850B09915b38598C44915c7588B73608c01394
11533A52260a26765a3233k8898F5707c34618f227D087K62941F4528a34892j45639
11522b80531F4414L20933i2415A71634F0188K3068a37984d1687A82206H2436b42118
11510D34O9673L7904e7852C9997J75125N14D774L40834A25578E5561j7005A5469
11497A60380C3673J56729A0009J50579F4133a26951d3272H6721j1982b07245G4496
11485B72667J33321A33124a15499B06686E594M11036j58174A10177D4206M25609
11475D69815j85128b2530A00628J04785Q7462a74222O1946E10931H1333g2921
$$ y = [13964, -23868, -15655, 13556, -274784, -72793, 140568, -251190, 528021, 185821, 12882, 211206, 63040, 120480, -177343, -225193, 209915, -238598, 344915, -37588, 273608, -301394, 152260, -126765, -13233, -42131, 65707, -334618, -6227, 4087, 267028, 64528, -134892, -280531, 64414, 385347, -92415, 171634, 60188, 83256, -137984, -41687, 182206, 82436, -242118, 434, 70107, 108011, -57852, 39997, 215122, 215636, 4774, 345608, 125578, 55561, 38556, 15469, 160380, 33673, 190402, 10009, 160588, 64133, -126951, -43272, 86721, 74739, -207245, 74496, 272667, 405988, 133124, -115499, 206686, 5594, 416630, 258456, 110177, 44206, 469815, 284687, -22530, 100628, 205413, 292875, -174222, -112276, 510931, 81333, -72921]
11464B42642P3968a9338B12989k3446c08090A75517F3805J92337H6644L67992
11454D54636j95156h7780A95836J66312j65855J69805J1447C4407A2068L9759
11444E1827b02100B63169L4078J08599l233f3684G3915J01580m0444d9245A67244
11432a9135k56583b3094B91667j0910b42402E0839d3485D7455c2051o9524A11968
11420a09155A84359e4400C09658a44768O0334j80698a26774A32310C3905J14214
11410A48119h2012j16983B09134I7211Q2564a04157n6544D0261K14434b14931
11399B80385c49635a71279b5315A90549d93267A72202d11873e8610D3653b02415
11388a36436c0739A30561b74403b908k896A27400a14428G5407a56704A05161C7244
$$ y = [242642, 316610, -19338, 212989, 189543, -308090, 175517, 63805, 256142, 86644, 454636, 259480, -87780, 195836, 362148, 196293, 366098, 377545, 34407, 12068, 51827, -202100, 263169, 297247, 405846, 402613, -63684, 73915, 175495, 135051, -49245, 167244, -19135, -275718, -23094, 291667, 280757, -242402, 50839, -43485, 47455, -32051, -101575, 111968, -109155, 184359, -54400, 309658, -144768, -84434, -265132, -126774, 132310, 33905, 148119, -82012, -198995, 209134, 97211, 179775, -104157, -160701, 40261, 254695, -214931, 280385, -349635, -171279, -25315, 190549, -493267, 172202, -411873, -58610, 43653, -202415, -136436, -30739, 130561, -274403, -2908, -5804, 127400, -114428, 75407, -156704, 105161, 37244]
11376H3599L00307j66347a96983j60425E4463J05188c4521k27919b4159n2754
11366g6913l9171B33606d42229f1181p0871A52704d5358j73333B09612h892B1551
11354C00754f8319a6395E8361O913a56344d1121j69438B4136b03759e1281B73921
11342a47293b5152j61235h2203b9029J014F0829A1495b4870a184A26497b8771
11330a32721A5978a97209D526a98125b2231n750l14739a07025K2302m7718A60059
11318B57921F5052b45024C5880J02004a08212i401c943A1112K91782p7402a36475
11306a86620a9804A23220Q8171I9855m9778c67322d5067J0116l43376h0480F2171
11294A16748E2402J14764M9058a94432g8293A51764a48618A5099h2249G3154B1574
$$ y = [83599, 383906, 217559, -196983, -357408, 54463, 159651, -34521, -262440, -24159, -76913, -116084, 233606, -442229, -61181, -132052, 152704, -45358, -218691, 209612, -8892, 21551, 300754, -68319, -16395, 58361, 65274, -156344, -41121, -210559, 24136, -203759, -51281, 273921, -147293, -25152, -186387, -82203, -29029, -28015, 60829, 11495, -24870, -1184, 126497, -28771, -132721, 15978, -197209, 4526, -198125, -22231, -27981, -342720, -107025, -84723, -132441, 160059, 257921, 65052, -245024, 35880, 137884, -108212, -9401, -3943, 11112, 302894, 225492, -136475, -186620, -19804, 123220, 211391, 99855, 50077, -367322, -45067, -34951, -378327, -80480, 62171, 116748, 52402, 167166, 216224, -194432, -78293, 151764, -148618, 15099, -82249, 73154, 21574]
11282B8912a46558J8060B30117k6779I0505a33529b3623j00660j2397A98720I0000
11270C09252f8559G5556g8927k4035A25024d995j15906B4976c9313j16558F33
11258B25803g5885b5809q450j53820E7340i0918M1023B52577c8999G3399a1322
11246F2748b2664A24850e8199C10410F530Q4802J50558g4314A07576a02131q6386
11235a88517D4427a73283L4650c2200k35649a7037H4058P443J18927b10287g6235
11223h2856b1920L055A69410o069N0028C4517a97239h5187p3241j4200b5193F0686
11210E7672h2333j88209J6325p0696B03495c55379C426J50409c3398j67176c9164
11198A5245b71141B6287M3976J57705I8599a27571L0406J2230A78673k9124j3733
$$ y = [28912, -146558, -128498, 230117, 203338, 90505, -133529, -23623, -124283, -136680, 198720, 90000, 309252, -68559, 75556, -78927, -102962, 125024, -4995, -120901, 24976, -39313, -155871, 633, 225803, -75885, -25809, -34259, -188079, 57340, -90918, -49895, 252577, -38999, 73399, -11322, 62748, -22664, 124850, -58199, 310410, 6530, 91332, 241890, -74314, 107576, -102131, -188517, 44427, -173283, -138633, -32200, -267849, -17037, 84058, 91501, 210428, -210287, -76235, -82856, -21920, -18865, 169410, 163341, 213369, 34517, -197239, -85187, -158428, -172628, -25193, 60686, 57672, -82333, -270542, -254217, -324913, 203495, -355379, 3426, 153835, -33398, -200574, -39164, 15245, -271141, 26287, 70263, 227968, 98599, -127571, -97165, -84935, 178673, 149549, 135816]
11187A35816c79797a51636o6102b617B18303q6499c4743m9413A26460b11742E6481
11175c1638q4017H4461J48600j09186K6557B77K31916f3530r9152I8238b65028
11163b4476o4568F8948A7199L8806K25308G061a90144b8722k99119D327a64371
11151d4227B9601b1116j67551b8583k43889l9498C985a29668j15243l9732a708
11139c41791J49482j1878g206k3477B01204c78278g3418b9645A21708J86421l7315
11128B70814G5886J3023k0520e3488k59051G1103N2917i9968j95744J07127H3688
11116a57495D7165J30277L4985a39473F1936M04427A01847b42494A28397j6112
11106A12285b66012O2499B60777I872K01707J3244A01729b6664k3580k15320F6515
$$ y = [135816, -379797, -151636, -217738, -2617, 218303, 131804, -34743, -84156, 126460, -211742, 56481, -31638, -115655, 84461, 233061, 123875, 150432, 277, 232193, -63530, -162682, 98238, -265028, -24476, -89044, 68948, 17199, 56005, 281313, 7061, -190144, -28722, -327841, 4327, -164371, -44227, 29601, -21116, -188667, -28583, -272472, -311970, 3985, -129668, -244911, -284643, -1708, -341791, -192309, -204187, -7206, -30683, 201204, -378278, -73418, -29645, 121708, 308129, 270814, 75886, 88909, 68389, -53488, -312539, 71103, 124020, -99968, -295712, -188585, 83688, -157495, 47165, 177442, 212427, -139473, 61936, 466363, 101847, -242494, 128397, 112285, -266012, -203513, 260777, 9872, 211579, 224823, 101729, -26664, -50244, -265564, 66515]
11094a10164C46483Q3164j20068d2588A81377M6053B6149K00759j02095O22680
11084G47493A73974L1394a28752f176A91341J18418L1789A49697h2750A26215
11073C0434J61664b5726B11924J20699A27161L5486J66908K8465n640b2327A7295
11061D33527j19497n6128K97658A07536L15363j61423J70846r2687k7680R4548
11051D06503H3017O47109k76433J71644B02264L24946k1534K07858l15031J07228
11041E05731j38373K18088j17251L89212k77920M484O4791Q2919k75831J12102
11031E67952K72732K9823k92888j9150J08670M6283n3353J45434J70796k73335
11021G02964k23534O91802l90400B01728N95980k11680N7581k7317M4145j02764
$$ y = [-110164, 346483, 429647, 309579, -42588, 181377, 227430, 26149, 226908, 124813, 747493, 173974, 205368, -128752, -6176, 191341, 309759, 341548, 149697, -82750, 126215, 30434, 192098, -25726, 211924, 332623, 127161, 162647, 329555, 358020, 352380, -22327, 17295, 433527, 314030, 257902, 555560, 107536, 422899, 261476, 432322, 339635, 311955, 406503, 83017, 730126, 453693, 625337, 202264, 527210, 505676, 713534, 398503, 505731, 367358, 585446, 468195, 857407, 579487, 583971, 648762, 731681, 455850, 567952, 840684, 870507, 577619, 558469, 667139, 713422, 660069, 805503, 976299, 702964, 479430, 1171232, 780832, 201728, 797708, 586028, 643609, 616292, 660437, 557673]
11011E57673K50665j98548M98357E42971j87182L53571q497l1150j27415j92838
11001C49460K47374j22800K08434n05C00440K50586N6933n3046A85901N73591
10991G59492k83044L68876p3858k11008N9376J74153J01081j96246K64347l01638
10981F61531J43103j12100L57883l67743J75608J5914k01602K06663N5814j18416
10971H16655J67407M3171J63996j14298j29628K96568K2930L49288j81005J72779
10961A607863Q2912J28362N70888J80019n9433K49483l38005k18385J62348l07328
10951B058724k16058q2588k6580k01740j74803M26775k09610l38854J72972K97631
10941A705869l24922j3946j10552m09986l75037M06058j20778j60940j24705R1606
$$ y = [557673, 808338, 609790, 1108147, 542971, 355789, 709360, 700863, 669713, 542298, 349460, 596834, 474034, 682468, 681963, 300440, 551026, 607959, 554913, 185901, 759492, 476448, 845324, 771466, 560458, 619834, 793987, 895068, 698822, 963169, 661531, 804634, 692534, 1050417, 682674, 858282, 874196, 672594, 879257, 935071, 816655, 984062, 1027233, 1191229, 1076931, 947303, 1243871, 1266801, 1616089, 1435084, 1607863, 1690775, 1819137, 2390025, 2570044, 2510611, 2760094, 2422089, 2203704, 2366052, 2058724, 1842666, 1760078, 1733498, 1531758, 1356955, 1783730, 1574120, 1235266, 1408238, 1705869, 1380947, 1367001, 1256449, 846463, 471426, 877484, 756706, 595766, 471061, 562667]
10931E62667B26107K82548b0260B24621n9797o110E2062K49696L9865n6558J83245
10920D68310A3145a9682A58247a25372A61e892j87239A76756o8446J82393a18630
10908B82154A20833D8233a35996j008a7234C9108J67944b32534g9005L6192a5684
10896a74872A39051d3333F406K6930C880h1725l08308a42452G5952l1548g4613
10884c29908D1226P5107m3079M8693e2548B54860b65194i1699n0563k5092D5291
10872A96187a28001M151H2432e4598H5476A5172J28767Q3754e5069k3377k47553
10861c25999c5787A04648a74309O5627B4293b30840G2072c36205b1926B67751
10850h5531j11737o5343d1346j21703a3532I3068L839f7206B71023o8828J13551
$$ y = [562667, 226107, 508655, -20260, 224621, 164824, 158714, 52062, 301758, 341623, 285065, 468310, 13145, -19682, 158247, -125372, 161, -5892, -193131, 176756, 108310, 290703, -118630, 282154, 120833, 48233, -135996, -137004, -17234, 39108, 207052, -232534, -79005, -42813, -15684, -174872, 139051, -43333, 6406, 33336, 3880, -81725, -390033, -142452, 75952, 44404, -74613, -329908, 41226, 116333, 73254, 121947, -52548, 254860, -265194, -91699, -142262, -167354, 45291, 196187, -128001, -123850, 82432, -54598, 85476, 15172, 143939, 227693, -55069, -78446, -325999, -35787, 104648, -174309, -108682, 24293, -230840, 72072, -336205, -21926, 267751, -85531, -197268, -262611, -41346, -163049, -13532, 93068, 96907, -67206, 271023, 202195, 315746]
10839C15746A26758c50642a4241B00949b08891B76792G2208F420J82915a33379
10828g5944B33463B1797K58759Q8952j06376a02k42050h1428A80314G0245a84238
10816C72630a06682A75046b51432h037H063a5064j77216p6235d6541l332C06178
10804C0070c8397b795j66886j8783D3858a84014h8614j33440c0755r0744o3831
10793a85330L6316I2239k2900J1707c3522A10708c7647j11078k2948f4828B4975
10781a88481o3799a10108M549F1172c0654j71297q2969e0416b4288j76610E7793
10769c40550a36099G0304b24114G2836J15696a92751j37545f0285j3609C4819
10758a42342C32447A47553a86916d6143A07085b17525B3228J31733e34799d3260
$$ y = [315746, 126758, -350642, -14241, 200949, -208891, 276792, 72208, 6420, 189335, -133379, -75944, 233463, 21797, 280556, 369508, 263132, -102, -242152, -81428, 180314, 70245, -184238, 372630, -106682, 175046, -251432, -8037, 8063, -15064, -192280, -268515, -46541, -49873, 306178, 30070, -38397, -2795, -169681, -188464, 43858, -184014, -88614, -222054, -30755, -121499, -185330, -149014, 92239, 69339, 81046, -33522, 110708, -37647, -148725, -171673, -64828, 24975, -188481, -252280, -110108, -105559, 61172, -30654, -201951, -284920, -50416, -24288, -200898, 57793, -340550, -136099, 70304, -224114, 72836, 188532, -192751, -330296, -60285, -73894, 34819, -142342, 332447, 147553, -186916, -46143, 107085, -217525, 23228, 154961, -534799, -43260]
10747b2375p9743E7940b37281k10074B28079j078p7685K9765b14511O8051B7473
10735D3070b29430c4720H7588b6265o7825k86484g7984b899k60376B7527J45833
10724A73360b46306A2644b82192h7046I0164a7448l193k87264a06291j95208E5806
10712a09267c3907k37819g7594i533l63089h6137G0985k9603b24731B48345f872
10700b16256Q4829B23778H2126C1894f4697o0924A58667f1589B52118O4156c4623
10688A01240b93190N8532A20377C1580b31835Q6272A30302J20561f4391B94972
10677f7275o2740d2982F0357m089R683o864h8965H5164M8658a06901j8101B5472
10664F2598L4434b15088F9413a55255J8571A71119a32915C18245j13467a0049
$$ y = [-22375, -102118, 57940, -237281, -447355, 228079, 227001, 149316, 179081, -214511, -146460, 27473, 43070, -229430, -34720, 87588, -26265, -94090, -380574, -77984, -2899, -263275, 27527, 173360, -246306, 12644, -282192, -87046, 90164, -17448, -20641, -307905, -106291, -301499, 55806, -109267, -33907, -271726, -77594, -9533, -372622, -86137, 70985, 41382, -224731, 248345, -6872, -216256, -131427, 223778, 82126, 31894, -64697, -125621, 158667, -61589, 252118, 316274, -34623, 101240, -293190, -234658, 120377, 31580, -231835, -145563, 130302, 250863, -64391, 294972, -67275, -130015, -42982, 60357, 56268, 65951, 59087, -88965, 85164, 133822, -106901, -125002, 25472, 62598, 97032, -215088, 69413, -155255, -136684, 171119, -132915, 318245, 204778, -10049]
10653d04081c5805A65781K0172a62660j4722J4280j65368B5548d9720l4880A95948
10641a18396j5154C5791a49334n2229J7693C5358R7751k8243b77280c8944j15896
10630a54840B55642E0870c78972a39582A00761b16004J8263O0193G6428a68265
10619C5265N5735b85012b1665k71103D3813N2120a28152O1424D44415C7027c90522
10607E5346f8231E4860a87715j22196p857c6661G735b19351A27134a36218A43066
10595b5691i824C2383c91387G9199Q0677a47513C73252E8629a63565a7338k6142
10584d3480j61896m0612f8089K5792k38442j21070H8456a7066j49284I230b8023
10572e7802j80750E2352a81246g8986A18811L6973a39298e0438n1686I1528j7420
$$ y = [-404081, -35805, 165781, 185953, -162660, -177382, -163102, -328470, 25548, -49720, -84600, 195948, -118396, -133550, 35791, -149334, -201563, -183870, 35358, 133109, 104866, -277280, -38944, -154840, 255642, 50870, -378972, -139582, 100761, -216004, -197741, -137548, 76428, -168265, 35265, 91000, -285012, -21665, -292768, 43813, 95933, -128152, -66728, 444415, 37027, -390522, 55346, -68231, 54860, -187715, -309911, -317768, -36661, 7735, -219351, 127134, -136218, 143066, -25691, -9824, 32383, -391387, 79199, 159876, -147513, 373252, 58629, -163565, -17338, -43480, -205376, -245988, -68089, -42297, -280739, -401809, 88456, -17066, -166350, 9230, -28023, -57802, -238552, 52352, -181246, -78986, 118811, 155784, -139298, -50438, -102124, 91528, 74108]
10561G4108B8422c8750a1643j86316m1036F595Q4410J16321f0001A18364c08905
10549b45471B14082J03243a4783A90317a802j03773K1988p3342F2885b44129C4367
10537A66299i7550C62003A57775G8344a42983A63623a37493B8621a42203A23921
10526A11048h3368a0107E7871a37942j20125i5893A34551k9607m3507c26621J4380
10515c12241C1556b57751B29835a29553A23951j4763d320k4855G7374K7930c966
10503D67517a04648J0059J3261C18339c13352a13271D0111K46251j40735b67761
10492B82662b19340A46908K2095d2643l3691B4089J92844a53381A8243d64310
10481A41827f0351q6421m0980K5103G9348l2662a44684B444b46339C37236c2907
$$ y = [74108, 28422, -38750, -11643, -197959, -238995, 6595, 91005, 207326, -60001, 118364, -308905, -245471, 214082, 317325, -14783, 190317, -1802, -105575, -83587, -156929, 62885, -244129, 34367, 166299, -97550, 362003, 157775, 78344, -142983, 163623, -137493, 28621, -142203, 123921, 111048, -83368, -10107, 57871, -137942, -258067, -95893, 134551, 104944, 61437, -326621, -312241, 31556, -257751, 229835, -129553, 123951, 109188, -4320, -29175, 77374, 105304, -3966, 467517, -104648, -94589, -81328, 318339, -313352, -113271, 40111, 286362, 145627, -267761, 282662, -219340, 146908, 169003, -42643, -76334, 24089, 216933, -153381, 18243, -464310, 141827, -60351, -146772, -187752, -162649, 79348, 46686, -144684, 2444, -246339, 337236, -32907]
10469b17662B85188n6152r5576J13236o0190J30120j17721F6655K67227a09188
10458f7132D0477M000b90457A72974L26505c03504A45182A7204b2A27524a36248
10446G6265a18754k51289B16082a19299C7144a62783C0034c0055G2673A1505d6046
10434B09827a55175O0758j61194A6726b13777D58766a82532I9810a08546l16234
10424d24780A95227E158a4897A56679J07314C420M3984a49831e6531k80519N298
10413c31752G8969J734Q9659L6071a3455C05861d9086A63469b25676I1762b01117
10401I8158l8700B9496O183J05519d19134a15660j69048A5881a00872B3199b9844
10389B45614c70173I0088B3545d21698I6797a05580o7508A02791K34347g1091
$$ y = [-217662, 285188, 229036, 133460, 246696, 186506, 316626, 198905, 66655, 333882, -109188, -67132, 40477, 44477, -290457, 172974, 499479, -303504, 145182, 17204, -22, 127524, -136248, 76265, -118754, -370043, 216082, -119299, 37144, -162783, 30034, -30055, 72673, 11505, -46046, 209827, -155175, -94417, -255611, 16726, -213777, 458766, -182532, 99810, -108546, -424780, 195227, 5158, -14897, 156679, 263993, 3420, 47404, -149831, -56531, -337050, -331752, 78969, 80703, 170362, 206433, -13455, 305861, -49086, 163469, -225676, 91762, -201117, 98158, 59458, 29496, 35679, 141198, -419134, -115660, -284708, 15881, -100872, 23199, -29844, 245614, -370173, 90088, 23545, -421698, 96797, -105580, -173088, 102791, 337138, -71091]
10378D82650j96740c5426A05882R652a18741F9372J4851B5594a6688H1454f1049
10366B2355J54370E5862b3543F1625L4385L21633o1301D0217M44471I4459k0J87963
10354B82402J98515A79373J53901k9393m1820J72281k4585j72966q1499a37673
10343A55878b03838C65602I3396M06935j91670L5584m0115e7237C69148A83902
10332G04840C46846A19105K67172O3047B01656J40501J98920E1384L28324k9855
10322C49853R2562e070C60680c22647A17740d47016A96971A1156K59465H5987
10311B92718a31961A04998K94258A50789K86095B03875N0511c05040B16265a20749
10300B902J85562e8343F4406P196g872l0402A7615b42302j68389J50539b8511
$$ y = [482650, 285910, -35426, 105882, 115534, -118741, 69372, 84223, 25594, -16688, 81454, -61049, 22355, 176725, 55862, -23543, 61625, 96010, 417643, 356342, 40217, 484688, 94459, 94439, 282402, 480917, 179373, 333274, 303881, 262061, 434342, 409757, 236791, 155292, -137673, 155878, -203838, 365602, 93396, 500331, 308661, 344245, 304130, -57237, 369148, 183902, 704840, 346846, 119105, 386277, 449324, 201656, 342157, 541077, 51384, 379708, 349853, 442415, -5070, 360680, -322647, 117740, -447016, 196971, 11156, 270621, 85987, 292718, -131961, 104998, 399256, 150789, 436884, 203875, 254386, -305040, 216265, -120749, 2902, 188464, -58343, 64406, 71602, -7872, -38274, 17615, -242302, -410691, -260152, -28511]
10288D42043d29590c221A39890j5552e2455q5124A4271b58669A49823B6333K2541
10277D8874a0822j0144l11855B4518n459d4097D58346H907d6161j24956I0727
10265B70787F8167a69446d5689k14454J25485H9283b08819f5998A09235h3662
10254a31092N9931j5260A07545b9319j06327H6512K84002j21214o8710R7738b5703
10242F2661L25099h319C5573K23930p9417A7387P1541K57890c6649k36643F0377
10230B44979a23094e3254j73402H7799a72548A1376K7403b08356N5531B14630
10219a17980A35964B3424c06734O9577N5532A45385G2078R4006a32733l1851j15789
10208b80373c5409j63119O1212h891j04519C9437c04640G3735C5338c07709A24854
$$ y = [442043, -429590, -3221, 139890, 124338, -52455, -137579, 14271, -258669, 149823, 26333, 48874, -10822, -20966, -332821, 24518, 19059, -44097, 458346, 8907, -46161, -171117, 90727, 270787, 68167, -169446, -45689, -260143, -134658, 89283, -208819, -65998, 109235, -83662, -131092, -71161, -86421, 107545, -29319, -135646, 86512, 370514, 249300, 180590, 278328, -25703, 62661, 387760, -8319, 35573, 259503, 180086, 17387, 88928, 346818, -36649, -273292, 60377, 244979, -123094, -53254, -226656, 87799, -172548, 11376, 38779, -208356, -152825, 214630, -117980, 135964, 23424, -306734, -237157, -181625, 145385, 72078, 166084, -132733, -164584, -280373, -35409, -198528, -137316, -8891, -113410, 39437, -304640, 73735, 35338, -307709, 124854]
10196b47833e1363j13497M8612J6409B2894a79255f8939M543r9711A21374Q7047
10185B08421c327G2733J23958H8337b62912B12506o4782F0681a41600c1114j20038
10174a51152B62823G3210a36404j7525j7432A59312F487J24653b25574c2499j9962
10163e2461q0325D3164b16627L6819L283A56902b6302B58980D6373D974N6407
10152F1381N1110a29440f753m4661M280j98691D7233a48969g0296j90774b7596
10140G6524e17651C4322J62070a31423a0936C91227j19536b72441e0268j43874
10130a94142D50434h5941B5754c63041Q0532f4501j35939h3104j41953A02599
10119g3700b5050r8210r8380l6422B18489G4692k7350g0074d488H3445b63523
$$ y = [-247833, -51363, -164860, -116248, -99839, 22894, -179255, -68939, -64396, -164107, 121374, 208421, -3327, 72733, 196691, 88337, -262912, 212506, 147724, 60681, -141600, -31114, -151152, 262823, 73210, -136404, -153929, -171361, 159312, 6487, 131140, -225574, -32499, -52461, -132786, 43164, -216627, -179808, -176525, 156902, -26302, 258980, 46373, 4974, 61381, 112491, -129440, -6753, -51414, -47134, -245825, 47233, -148969, -70296, -261070, -27596, 76524, -517651, 34322, 196392, -131423, -10936, 391227, 271691, -272441, -50268, -194142, 450434, -85941, 25754, -363041, -282509, -64501, -200440, -83104, -225057, 102599, -73700, -25050, -123260, -221640, -258062, 218489, 74692, 47342, -70074, -4488, 83445, -263523]
10107c21632a08551l54441i6010K9102J4099H3007a5189j11668L0899r6221g8184
10095A48779i9000J8756c2447l03249C4572M2274a47375H0203i7978E9052J5079
10084G4131b8823j70944E2190a97410A39722J44738b68431f0782j8283k79421
10074c58486A57046J2320b3047B61469b02065C576b82443R8709l5720E3059a91230
10062C60525A60430a45881J3232B71837j18086C5958a04563p3626M8422J2913
10052a16854b3479B16841B0864k475i1150A41984c9286A74052p7620c7755l9087
10041g6842F4823a20497j2397H1460a10250j40730c7867B11424F8846a66527h0172
10029H991J1685K38311c26608a26270d8146G9217N134J43293e906C2394F531a89248
$$ y = [-321632, -108551, -462992, -96010, -66908, -52809, 83007, -15189, -126857, -95958, -192179, -78184, 148779, -99000, -80244, -32447, -335696, 34572, 76846, -147375, 80203, -97978, 59052, 74131, -28823, -199767, 52190, -197410, 139722, 284460, -268431, -60782, -79065, -358486, 157046, 169366, -23047, 261469, -202065, 3576, -282443, -183734, -219454, 53059, -191230, 360525, 160430, -145881, -132649, 271837, 153751, 35958, -104563, -178189, -129767, -116854, -23479, 216841, 20864, 18389, -91150, 141984, -39286, 174052, 96432, -37755, -76842, 64823, -120497, -132894, 81460, -110250, -250980, -37867, 211424, 68846, -166527, -80172, 8991, 20676, 258987, -326608, -126270, -48146, 79217, 84351, 227644, -5906, 32394, 6531, -189248]
10016g8898B69082n9078D7643c31443J30960F7385b63646B9199b8167j28355B23929
10004b13744a9956H9511a73517G6311d1856E4535K01868G8110E141a58860A86711
9992a46547A78845d72322c8197j94615o9846a1608l3689j09819b476j64518A77290
9980A37250E6066a34450j3985j69649H1763B4541J55608b06556a157o0231H5253
9968A24677M6081p3909a79282H1472g1944K8032J4083k12946O9637H1941a59408
9956A01907a23663I6654a48030j30438a4929A15224E2157b63746a02120l0826
9946a32946j29562k27200J95287A27326e1153C91483A20607a36192A57822B4478
9935b01916M0392q6126a02851j27249D8387i3396j50569B25658a08229r7255A06229
$$ y = [-78898, 269082, 210004, 47643, -331443, -200483, 67385, -263646, 29199, -28167, -156522, 223929, -213744, -19956, 89511, -173517, 76311, -41856, 54535, 256403, 78110, 5141, -158860, 186711, -146547, 178845, -472322, -38197, -232812, -302658, -11608, -45297, -155116, -2476, -166994, 177290, 137250, 56066, -134450, -148435, -318084, 81763, 24541, 180149, -206556, -1157, -61388, 85253, 124677, 170758, 96849, -179282, 81472, -71944, -43912, -29829, -242775, -173138, 81941, -159408, 101907, -123663, 96654, -148030, -278468, -14929, 115224, 52157, -263746, -102120, -132946, -262508, -489708, -294421, 127326, -51153, 391483, 120607, -136192, 157822, 24478, -201916, -161524, -247650, -102851, -230100, 48387, -93396, -243965, 225658, -108229, -205484, 106229]
9923g8425A18626a36002l4337b3094o1233m9573L7031A47946a10045H6603b23636
9911b40949i6275d7821k34340i5927j90049n6874B2199c43028J40341a8649k8083
9900d6732B08582a50636f404j50455e0312G926b85938D6313b38022B47980b73331
9888D56674f7240j94337q001C9901J5361a50741G240a18022D8048c4733A55115
9876e6986k12843a29083J6586k8496M8907E13705A31895b24781B1986a20720e9328
9864A24915a23120j6113f6142K7194A288J82087b40464M0532C8221J5596c67270
9852b62489G3971a71325c094A46246b50093b7497B93281d69955b30274J05499
9842a24775A248a36812K3721p0761B23640D0940R6988g713j59109B3479c81l18339
$$ y = [-78425, 118626, -136002, -170339, -23094, -84327, -133900, -96869, 147946, -110045, 86603, -223636, -240949, -96275, -47821, -282161, -95927, -285976, -342850, 22199, -343028, -202687, -18649, -46732, 208582, -150636, -6404, -156859, -50312, 7926, -285938, 46313, -238022, 247980, -273331, 456674, -67240, -261577, -269578, 39901, 55262, -150741, 7240, -118022, 48048, -34733, 155115, -56986, -269829, -129083, -112497, -140993, -92086, 513705, 131895, -224781, 21986, -120720, -59328, 124915, -123120, -139233, -66142, -38948, 1288, 183375, -240464, -199932, 38221, 53817, -367270, -262489, 73971, -171325, -3094, 146246, -250093, -27497, 293281, -469955, -230274, -124775, 1248, -136812, -113091, -183852, 223640, 40940, 137928, -7713, -166822, 23479, -381, -318720]
9830c18720b6974I1290P2222b47387j48188L6824L0025i6807H0526b98302o7019
9819c65321c9347k87630d5978k06812E7099b2758j07530A5375J19622e0379j63079
9808b13458e1736k86812F3163b61663a6710A01870D551f8541c1039k40564O9687
9797b01916A68732a5581j0750B92713C391a42947f0064B18580e0499j15160N1830
9786a13829A40720J8110Q3286d07034d9532j14393k01402A47762H883a07403q275
9775a15678F3102a07522n43875A35752a44750M7805H96K33550q1127B0445M0965
9764F1410a23588A77866c60670A11735Q3487b02264e2346K3507l49688A09238
9753c0715F1390a63703m6816A12815a8741j06274B1666M2517n948a41402O7159
$$ y = [-318720, -26974, 91290, 163512, -247387, -395575, -358751, -328726, -96807, 80526, -298302, -365321, -39347, -326977, -45978, -252790, 57099, -22758, -130288, 15375, 134997, -50379, -213458, -51736, -338548, 63163, -261663, -16710, 101870, 4551, -68541, -31039, -271603, -201916, 168732, -15581, -26331, 292713, 3391, -142947, -60064, 218580, -50499, -165659, -113829, 140720, 158830, 242116, -407034, -49532, -163925, -365327, 147762, 8883, -107403, -115678, 63102, -107522, -651397, 135752, -144750, -96945, 896, 234446, 153319, 20445, 61410, -123588, 177866, -360670, 111735, 195222, -202264, -52346, -28839, -378527, 109238, -30715, 61390, -163703, -210519, 112815, -18741, -125015, 21666, 64183, 58235, -141402, -74243]
9742g4243k19963e5424j00957r9887J27599D3401a9123k48363a28840k45046H9125
9730b10925c2276l4887J8432A82369a52266l1640P5885j60151C19729c19224B6011
9718i2055B0555a00574A58437a75135h244D99862b07002c9796q3976M6198k8195
9707a05769C171K54270l5074b28811A25599C9946a93668I0376h7212G5617J75332
9696B50949i7179A7921a32255B66226I316b10461p1652H3460K4756d36875A56772
9684a00141j19263j91997G7759j2145d6204D9095M2071B6912c753A09193J43906
9673B53099a67306A27968a36908r4704k25349a83751p6395a26968a8801j05810
9663a24611B7728A080g4183j78933M6670C1164a66413c0300B81277I1219e9315
$$ y = [-74243, -294206, -55424, -156381, -256268, -128669, 43401, -19123, -267486, -128840, -373886, 89125, -210925, -32276, -67163, -48731, 182369, -152266, -183906, -108021, -268172, 319729, -319224, 26011, -92055, 20555, -100574, 158437, -175135, -8244, 499862, -207002, -39796, -123772, -77574, -105769, 3171, 257441, 222367, -228811, 125599, 39946, -193668, 90376, -87212, 75617, 250949, -97179, 17921, -132255, 266226, 9316, -210461, -282113, 83460, 108216, -436875, 156772, -100141, -219404, -411401, 77759, 65614, -46204, 49095, 91166, 26912, -3753, 109193, 253099, -167306, 127968, -136908, -231612, -456961, -183751, -260146, -126968, -18801, -124611, 27728, 1080, -74183, -253116, -206446, 31164, -166413, -30300, 281277, 91219, -59315]
9651b66057Q2653n174r2387G189a19513k16539h2751o1802E5301a84747K8406
9640a56341g4752C38218a99877c9712c736A27635o903a49889l4952h7586A07958
9628A05895L6950D4912E08K4708K59867D7616e6909A77262E6539K21606b67235
9616H5211b0481r4084a0446j5820H9017c42402Q2517B73019b29973i4225D514
9604a33025A19171Q8858a8233j30616d6716j13896A45806M6481a97556j57575
9594c55131e1814l9629A28344a89258j60791J37061n635r2292D3958I272b0444
9582C081a93887h8244A95543h4595k6495j7874B9928a57490O9207n0836A40551
9570b05276I5883a05501i931A38073K18600b14092G6518a7700n8955k6544A14895
$$ y = [-266057, -183404, -188578, -280965, 7189, -119513, -336052, -82751, -144553, 55301, -184747, -156341, -74752, 338218, -199877, -39712, -3736, 127635, 120732, -149889, -184841, -87586, 107958, 105895, 142845, 44912, 508, 25216, 285083, 47616, -56909, 177262, 56539, 278145, -267235, 85211, -20481, -114565, -10446, -26266, 89017, -342402, -259885, 273019, -229973, -94225, 4514, -133025, 119171, 208029, -18233, -148849, -46716, -160612, 145806, 192287, -197556, -355131, -51814, -91443, 128344, -189258, -350049, -212988, -218623, -310915, 43958, 9272, -20444, 3081, -193887, -88244, 195543, -84595, -111090, -128964, 29928, -157490, -88283, -139119, 140551, -205276, 95883, -105501, -9931, 138073, 356673, -214092, 76518, -17700, -76655, -103199, 114895]
9558a3768n953D36840d0018C337K83247b22054C5481c3935D665P7491f6284B62180
9545A7580d20382a29932A9432b97513k6772A65704k3947b85952a24658l8137a9454
9533b6662j86690k1645C38055a52726C4963a30401B48931a66341f7346J7688k92888
9522c42546f4370k14259c2912J5416n1704k11472e3869B57841G9311f959n6824
9511f3783A86637a13666o9651A69631b43154A19185B6882d05806a43739B35636
9500b27968O0973M5584H2202d3892k09323g4386q0980C4749e5374K1293j33855
9489a67936H5785k4771R4102a7624r1717J6785q24A73994d04520a3605A89675
9477B2045a06477l04309J8947J84047h761k24616i1536l6749E8721a72477O3514
$$ y = [-13768, -19721, 436840, -40018, 3337, 286584, -222054, 35481, -33935, 4665, 82156, -66284, 262180, 17580, -420382, -129932, 19432, -297513, -324285, 165704, 141757, -285952, -124658, -162795, -19454, -26662, -213352, -234997, 338055, -152726, 34963, -130401, 248931, -166341, -67346, -49658, -342546, -64370, -278629, -32912, -17496, -69200, -280672, -53869, 257841, 79311, -6959, -63783, 186637, -113666, -183317, 169631, -243154, 119185, 26882, -405806, -143739, 235636, -227968, -166995, -121411, 82202, -43892, -253215, -74386, -155366, 34749, -55374, -34081, -167936, 85785, 61014, 155116, -17624, -109341, -92556, -93380, 173994, -404520, -13605, 189675, 22045, -106477, -410786, -391839, -207792, -8761, -233377, -91536, -128285, 58721, -172477, -108963]
9466a08963A23813b06090A39002h1948B93872d3657B41240a94561n8339A67683
9455i3497I1929K091C4932b00474O3453J8079g130l9516m827j56925I2861A8343
9442b34223B128a57848j30428G5812c3543m9390l9863N5567k78165I5351m2756
9431E2595e7659n788a7766j637A15292C494K80743a3198p3878A30828b05458A7184
9418a80773j2586A46042g0087L3016A43545a16096j72724G9851i3818B44927l0604
9407B14323b0172r7601B3303c2320B86881b09659A34443c20184A07544k6040c71402
9395D9895g4j14415M4566a4588A05501b58116J14161k11110f496I5139J88999
9384B84138H5274B7216b35765j76248g6246f572A25207c6288G9028J81666b20725
$$ y = [-108963, 123813, -206090, 139002, -81948, 293872, -43657, 241240, -194561, -252900, 167683, -93497, 91929, 94020, 34932, -200474, -137021, -118942, -7130, -46646, -51473, -208398, 92861, 18343, -234223, 2128, -157848, -288276, 75812, -33543, -82933, -122796, -67229, -345394, 95351, 52595, -57659, -63447, -17766, -19403, 115292, 3494, 284237, -13198, -87076, 130828, -205458, 17184, -180773, -193359, 146042, -70087, -37071, 143545, -116096, -288820, 79851, -93818, 244927, 214323, -20172, -117773, 23303, -32320, 286881, -209659, 134443, -320184, 107544, 81504, -371402, 49895, -74, -114489, -69923, -14588, 105501, -258116, -143955, -355065, -6496, 95139, 284138, 85274, 27216, -235765, -412013, -76246, -6572, 125207, -36288, 79028, 260694, -220725]
9372A41976c3384q3314e84j59846e4763l86746a26575B8931i8409k35914a24978
9360A57228f8791j51087d7729j76724Q9567Q164B9335j0408J3110r907J50359
9349A72489b72323C64474h6474d1615A04462a37468k16195b7261l0045k16875
9339b74181a7876C6245d8093j23235J940e5490r0461q9028M2166A91102J46702
9328C37804j16012b15709m5355J00912A51142J15164a58627m0893B92741e09105
9317d1516k80220O2129a17084j07466a803E3487f4225j64212M5160L2566P2421
9306g8290k5337A2490L00298f7079n545Q089n268j07793A67744Q9761a63027d7768
9293A65774c07770a09354q8398c3263A51181a22970A36477k5753m7247j8317L3671
$$ y = [141976, -33384, -116698, -584, -160430, -54763, -441509, -126575, 28931, -98409, -334323, -124978, 157228, -68791, -219878, -47729, -224453, -134886, -126722, 29335, 18927, 32037, 22130, 172489, -272323, 364474, -86474, -41615, 104462, -137468, -353663, -27261, -57306, -274181, -17876, 36245, -48093, -171328, -169388, -55490, -145951, -234979, -192813, 191102, 337804, 221792, -215709, -261064, -160152, 151142, 266306, -158627, -199520, 292741, -509105, -41516, -321736, -259607, -117084, -224550, -1803, 53487, -64225, -228437, -183277, -150711, -78290, -103627, 12490, 312788, -67079, -72624, -64535, -69803, -177596, 167744, 257505, -163027, -47768, 165774, -307770, -109354, -197752, -33263, 151181, -122970, 136477, 110724, 63477, 45160, 78831]
9282G8831a27588A39240L3632G2082g8630I5928a36254J6785A68976b11828A05408
9270f9140J3119l2756A45352e0431D6953i299A69180b73978j44677c5176o2893
9259i8069j57471a06581C2344L2091g8357j04809h3549L7577j08948D5063a73773
9247B38653H8182b6459j85905b3956j40759H5955e9148A01478d9970m98165A04810
9235a74023n892N6621A1570b71562g0575b2017E4401a66963C659a99696G4911
9223c90031E9334a51302M6227E8504c10431G3409N7123c57017A72015l4154c9636
9211b60722e5095l707J0854A41665K8872h4409k51163A02221a25900k8858b626
9199c52919E7756d7669C34469h5839D3793K88933c8601A17110J98029b37308D1073
$$ y = [78831, -127588, 139240, 172872, 72082, -78630, 95928, -136254, -119469, 168976, -211828, 105408, -69140, -56021, -88777, 145352, -50431, 46953, -9299, 169180, -273978, -418655, -35176, -98069, -255540, -106581, 32344, 64435, -78357, -183166, -83549, -45972, -154920, 45063, -173773, 238653, 88182, -26459, -212364, -23956, -164715, 85955, -59148, 101478, -49970, -548135, 104810, -174023, -179915, -123294, 11570, -271562, -70575, -22017, 54401, -166963, 3659, -199696, 74911, -390031, 59334, -151302, -105075, 58504, -310431, 73409, 130532, -357017, 172015, 137861, -39636, -260722, -55095, -58802, -47948, 141665, 170537, -84409, -335572, 102221, -125900, -154758, -2626, -352919, 57756, -47669, 334469, -85839, 43793, 332726, -38601, 117110, 315139, -237308, 41073]
9187b36717o142b9084n5180c1010n2782E5427a78344C350a72461M9566l2789A62454
9174G875k027i7129k49228a23223A88126m8183b55964j99327a33125f090j58467
9163a64557j6958A61372i414n2211K7054j07996D4879J32129b49984m6459a9102
9151C2889a17441p1160j63346h2436l1945k77175h0363a1236j34893D7717J18933
9140A66650b918m1992A0751M491K16872a12319J3859k15358K1429h2859j36561
9129b19420j9091c0091C5102Q4277l0296J98135A10913c98086B8184b19183d9407
9117a67899k16250D2723a23816j08297j09612b7907B02592b28770Q3726J6849
9107a28195A86266b5600A25507C121b64592C32954d6350o6700n2933N1945o5089
$$ y = [-236717, -242859, -29084, -84264, -31010, -83792, 55427, -178344, 3350, -172461, -122895, -155684, 162454, 7875, 5848, -97129, -346357, -123223, 188126, 139943, -255964, -455291, -133125, -6090, -164557, -181515, 161372, -9414, -61625, -34571, -142567, 44879, 177008, -249984, -296443, -19102, 32889, -117441, -188601, -351947, -82436, -114381, -391556, -80363, -11236, -146129, 47717, 166650, -2918, -44910, 10751, 15242, 232114, -112319, -98460, -313818, -292389, -82859, -219420, -238511, -30091, 35102, 119379, 89083, 287218, 110913, -398086, 28184, -219183, -49407, -167899, -384149, 42723, -123816, -232113, -341725, -27907, 202592, -228770, -145044, -128195, 186266, -25600, 125507, 3121, -264592, 332954, -46350, -113050, -165983, -114038, -179127]
9096a79127c7304k83546e7649J0367k61784h7812A96342b49902A85492d9993j20524
9085a70517a8374k67571a05296k2573A89880i5640C12575D889a65194j57507E8031
9073b37534D9030J662c66414a70195R73h1885A07141p523c38781e0600J0702j4658
9061e4556l4647k06464r578J26761b9003k89398B94059G7070i3083J8033j49666
9050b24716J01451j37324M5359I3491C1920J20081D4573Q5193A9796f8504l23188
9039c91692A13763B0521a22985H4413b11661p3592I2250J41421a06939B73073
9028a89758C562c11734e1924A05461g475m11771B8065e1030B10823J04196d6993
9016a79695B4810q178c26440d6126l82988M5989c7721A05077A2385a01622m09800
$$ y = [-179127, -37304, -320850, -57649, -47282, -309066, -87812, 196342, -249902, 185492, -49993, -170517, -18374, -285945, -105296, -127869, 189880, -95640, 312575, 4889, -165194, -322701, 58031, -237534, 49030, 50692, -366414, -170195, -169222, -81885, 107141, 99618, -338781, -50600, -39898, -54556, -89203, -295667, -305245, -178484, -29003, -318401, 294059, 77070, -93083, -75050, -224716, -123265, -260589, -215230, 93491, 31920, 152001, 44573, 129766, 19796, -68504, -391692, 113763, 20521, -122985, 84413, -211661, -285253, 92250, 233671, -106939, 273073, -189758, 3562, -311734, -51924, 105461, -7475, -419246, 28065, -51030, 210823, 315019, -46993, -179695, 24810, 16632, -326440, -46126, -429114, -383125, -37721, 105077, 12385, -101622, -511422]
9005e11422C5514a52397K7273O2237a8425p3593A03862f9030j32374B2012L41612
8994C63624a7480r8030k52962a67079j4680Q3704H0799A1085b06671g4504C1047
8982g6878o6742L6695A71916j7408a38051q9105c8832B39076g0015A52270G1670
8970a06423o8725E27739b2485l75700J43021a20700B03615B3987J32377l1643
8960A24721C0372i0486j121P126K7613j07323b8202k8333l5203n9542B34632q4869
8948A49763L5942c4071j22216p041C24011a71820B4126P3793b26853A9518j890
8937A7628a6737l03142C6196J23532e9782I4790J32594b22092a08218A27709k6748
8926A00961D9432a54465A05123R7810q0711J98418j50765L26629j79635A39906
$$ y = [-511422, 35514, -152397, -125124, -62887, -18425, -92018, 103862, -69030, -201404, 22012, 363624, -17480, -115510, -368472, -167079, -181759, -98055, 80799, 11085, -206671, -74504, 31047, -76878, -143620, -106925, 171916, 154508, -138051, -227156, -38832, 239076, -70015, 152270, 71670, -106423, -175148, 527739, -22485, -398185, -255164, -120700, 203615, 23987, 156364, 124721, 30372, -90486, -91607, -84481, -56868, -164191, -28202, -56535, -91738, -151280, 234632, 149763, 185705, -34071, -156287, -163328, 324011, -171820, 24126, 97919, -226853, 19518, 17628, -16737, -319879, 36196, 159728, -59782, 94790, 227384, -222092, -108218, 127709, 100961, 49432, -154465, 105123, 202933, 122222, 320640, 169875, 496504, 316869, 139906]
8915B66719K37035N9530j92578K53865K319L65133L07208J434559K441744P022401
8905A2197935n611367C144263j166930o79053m15994n5131C23948Q2159j38165
8896B67942A18150a8959B80869J48028j70809H1873f7574B221a57711B16527f8892
8884a80521q861A9551g5611A87558b28B9595K9275P8869R9838e9204k90126J088
8872c48242A6111e1461B71824c08501G6630a78904H645b92815B0242c15194A41287
8860E4597J30691d3789k89636C3968J30046K1435H7945b22092k7936M5651A77841
$$ y = [266719, 503754, 563284, 370706, 624571, 626890, 992023, 1299231, 2733790, 5175534, 12197935, 6586568, 3144263, 1977333, 1298280, 882286, 827155, 323948, 406107, 267942, 118150, -18959, 280869, 428897, 258088, 81873, -67574, 2221, -157711, 216527, -68892, -180521, -189382, 19551, -75611, 187558, -228, 29595, 58870, 137739, 237577, -59204, -349330, -348242, 16111, -51461, 271824, -308501, 76630, -178904, 8645, -292815, 20242, -315194, 141287, 54597, 185288, -43789, -333425, 33968, 164014, 185449, 87945, -222092, -250028, -204377, 177841]
$$ [...]
##END NTUPLES=NMR SPECTRUM
##END=
