
##TITLE=AC1222_Punto_6074794_1Xs9jaGfa0
##JCAMPDX= 6.0         $$ Bruker NMR JCAMP-DX V2.0
##DATA TYPE= NMR SPECTRUM
##DATA CLASS= NTUPLES
##ORIGIN= BRUKER
##OWNER= Administrator
$$ 1.72 TOPSPIN		Version 2.1
$$ 2012-05-09 01:26:01.140 -0500  Administrator@TOPSPIN
$$ Compression mode = diff/dup
##.OBSERVE FREQUENCY= 400.13188235
##.OBSERVE NUCLEUS= ^1H
##.ACQUISITION MODE= SIMULTANEOUS (DQD)
##.ACQUISITION SCHEME= undefined
##.AVERAGES= 8
##.DIGITISER RES= 22
##SPECTROMETER/DATA SYSTEM= spect
##.PULSE SEQUENCE= zg30
##.SOLVENT NAME= COFFEE_meoh
##.SHIFT REFERENCE= INTERNAL, COFFEE_meoh, 1, 14.98061
##AUDIT TRAIL= $$ (NUMBER, WHEN, WHO, WHERE, PROCESS, VERSION, WHAT)
$$ ##TITLE= Audit trail, TOPSPIN		Version 2.1
$$ ##JCAMPDX= 5.01
$$ ##ORIGIN= Bruker BioSpin GmbH
$$ ##OWNER= Administrator
$$ $$ C:\Bruker\TOPSPIN/data/COFFEE/nmr/AC1222_Punto_6074794_1Xs9jaGfa0/110/pdata/1/auditp.txt
$$ ##AUDIT TRAIL=  $$ (NUMBER, WHEN, WHO, WHERE, PROCESS, VERSION, WHAT)
(   1,<2012-05-09 01:25:54.484 -0500>,<Administrator>,<TOPSPIN>,<go>,<TOPSPIN 2.1>,
      <created by zg
	started at 2012-05-09 01:24:48.000 -0500,
	POWCHK enabled, PULCHK disabled,
       configuration hash MD5:
       AF F2 23 6B 01 CD 40 DD E5 A1 38 A0 06 EA F7 77
       data hash MD5: 64K
       7B 7E 6B EC D3 01 81 6B 57 CC EB 2B A1 25 6B 57>)
(   2,<2012-05-09 01:25:57.062 -0500>,<Administrator>,<TOPSPIN>,<proc1d>,<TOPSPIN 2.1>,
      <Start of raw data processing
       efp LB = 0 FT_mod = 6 PKNL = 1 PHC0 = 0 PHC1 = 0 SI = 32K 
       data hash MD5: 32K
       C0 DB A4 34 EF 50 65 9F 4B A0 C7 A7 A4 DD AD F4>)
(   3,<2012-05-09 01:25:57.484 -0500>,<Administrator>,<TOPSPIN>,<proc1d>,<TOPSPIN 2.1>,
      <pk PHC0 = 212.8326 PHC1 = 0 
       data hash MD5: 32K
       E2 67 11 4B B6 E8 35 6C 41 FC 32 5E B6 97 F1 54>)
(   4,<2012-05-09 01:25:57.578 -0500>,<Administrator>,<TOPSPIN>,<proc1d>,<TOPSPIN 2.1>,
      <abs ABSG = 1 
       data hash MD5: 32K
       31 5C FA D1 B7 04 80 F8 80 1C D3 96 B7 BD 7C 9A>)
(   5,<2012-05-09 01:25:57.609 -0500>,<Administrator>,<TOPSPIN>,<proc1d>,<TOPSPIN 2.1>,
      <abs ABSG = 2 
       data hash MD5: 32K
       6A 4F 77 0C 8C 29 9C 16 07 7A AA 3D A8 89 2E 29>)
(   6,<2012-05-09 01:25:57.640 -0500>,<Administrator>,<TOPSPIN>,<proc1d>,<TOPSPIN 2.1>,
      <abs ABSG = 3 
       data hash MD5: 32K
       E3 FA 22 57 5F 68 31 31 F8 3E 04 EB 2E 4A 76 F7>)
(   7,<2012-05-09 01:25:57.671 -0500>,<Administrator>,<TOPSPIN>,<proc1d>,<TOPSPIN 2.1>,
      <abs ABSG = 4 
       data hash MD5: 32K
       20 E2 20 51 78 73 CE 2F 89 67 C9 45 B5 B7 93 91>)
(   8,<2012-05-09 01:25:57.703 -0500>,<Administrator>,<TOPSPIN>,<proc1d>,<TOPSPIN 2.1>,
      <abs ABSG = 5 
       data hash MD5: 32K
       C4 BE 56 87 04 01 1E 0C 28 FB B9 7D 84 26 59 43>)
$$ ##END=
$$ 
$$ $$ hash MD5
$$ $$ 86 E7 06 A5 55 88 68 4A 55 DF E9 44 6B 2B BB DA
##$RELAX= 
##$RELAX= 
##$RELAX= 
##$RELAX= 
##$RELAX= 
##$RELAX= 
##$RELAX= 
$$ Bruker specific parameters
$$ --------------------------
$$ [...]
##$TP= (0..7)
150 150 150 150 150 150 150 150
##$TP07= 0
##$TPNAME0= <>
##$TPNAME1= <>
##$TPNAME2= <>
##$TPNAME3= <>
##$TPNAME4= <>
##$TPNAME5= <>
##$TPNAME6= <>
##$TPNAME7= <>
##$TPOAL= (0..7)
0.5 0.5 0.5 0.5 0.5 0.5 0.5 0.5
##$TPOFFS= (0..7)
0 0 0 0 0 0 0 0
##$TUNHIN= 0
##$TUNHOUT= 0
##$TUNXOUT= 0
##$USERA1= <user>
##$USERA2= <user>
##$USERA3= <user>
##$USERA4= <user>
##$USERA5= <user>
##$V9= 5
##$VALIST= <valist>
##$VCLIST= <CCCCCCCCCCCCCCC>
##$VD= 0
##$VDLIST= <DDDDDDDDDDDDDDD>
##$VPLIST= <PPPPPPPPPPPPPPP>
##$VTLIST= <TTTTTTTTTTTTTTT>
##$WBST= 1024
##$WBSW= 4
##$XGAIN= (0..3)
0 0 0 0
##$XL= 0
##$YL= 0
##$YMAX_a= 539632
##$YMIN_a= -644200
##$ZGOPTNS= <>
##$ZL1= 120
##$ZL2= 120
##$ZL3= 120
##$ZL4= 120
##$ABSF1= 14.98061
##$ABSF2= -5.57192
##$ABSG= 5
##$ABSL= 3
##$ALPHA= 0
##$AQORDER= 0
##$ASSFAC= 0
##$ASSFACI= 0
##$ASSFACX= 0
##$ASSWID= 0
##$AUNMP= <proc_prof1d_extract_pilot.lims>
##$AXLEFT= 0
##$AXNAME= <>
##$AXNUC= <1H>
##$AXRIGHT= 0
##$AXTYPE= 0
##$AXUNIT= <>
##$AZFE= 0.1
##$AZFW= 0.1
##$BCFW= 0
##$BC_mod= 0
##$BYTORDP= 0
##$COROFFS= 0
##$CY= 15
##$DATMOD= 1
##$DC= 0
##$DFILT= <>
##$DTYPP= 0
##$F1P= 0
##$F2P= 0
##$FCOR= 0.5
##$FTSIZE= 32768
##$FT_mod= 6
##$GAMMA= 0
##$GB= 0
##$INTBC= 1
##$INTSCL= 1
##$ISEN= 128
##$LB= 0
##$LEV0= 0
##$LPBIN= 0
##$MAXI= 10000
##$MC2= 0
##$MEAN= 0
##$ME_mod= 0
##$MI= 0
##$NCOEF= 0
##$NC_proc= -8
##$NLEV= 6
##$NOISF1= 0
##$NOISF2= 0
##$NSP= 0
##$NTH_PI= 0
##$NZP= 0
##$OFFSET= 14.98061
##$PC= 1
##$PHC0= 212.8326
##$PHC1= 0
##$PH_mod= 1
##$PKNL= yes
##$PPARMOD= 0
##$PPDIAG= 0
##$PPIPTYP= 0
##$PPMPNUM= 2147483647
##$PPRESOL= 1
##$PSCAL= 4
##$PSIGN= 0
##$PYNMP= <proc.py>
##$REVERSE= no
##$SF= 400.13
##$SI= 32768
##$SIGF1= 0
##$SIGF2= 0
##$SINO= 400
##$SIOLD= 32768
##$SPECTYP= <>
##$SREGLST= <1H.CDCl3>
##$SSB= 0
##$STSI= 32768
##$STSR= 0
##$SW_p= 8223.68421052632
##$SYMM= 0
##$S_DEV= 0
##$TDeff= 65536
##$TDoff= 0
##$TI= <>
##$TILT= no
##$TM1= 0
##$TM2= 0
##$TOPLEV= 0
##$USERP1= <user>
##$USERP2= <user>
##$USERP3= <user>
##$USERP4= <user>
##$USERP5= <user>
##$WDW= 1
##$XDIM= 32768
##$YMAX_p= 460136810
##$YMIN_p= -748493
##$CURPLOT= <Network HP LaserJet P1505>
##$CURPRIN= <$Network HP LaserJet P1505>
##$DFORMAT= <normdp>
##$LAYOUT= <+/1D_H.xwp>
##$LFORMAT= <normlp>
##$PFORMAT= <normpl>
##$SURQMSG= 1
$$ End of Bruker specific parameters
$$ ---------------------------------
##NTUPLES= NMR SPECTRUM
##VAR_NAME=  FREQUENCY,     SPECTRUM/REAL,   SPECTRUM/IMAG
##SYMBOL=    X,             R,               I
##VAR_TYPE=  INDEPENDENT,   DEPENDENT,       DEPENDENT
##VAR_FORM=  AFFN,          ASDF,            ASDF
##VAR_DIM=   32768,         32768,           32768
##UNITS=     HZ,            ARBITRARY UNITS, ARBITRARY UNITS
##FACTOR=    0.250966925370066, 1,           1
##FIRST=     8223.43324360095, -105221,      -99822
##LAST=      0,             -120590,         86643
##MIN=       0,             -748493,         0
##MAX=       8223.43324360095, 460136810,    0
$$ Real data points
##PAGE= N=1
##DATA TABLE= (X++(R..R)), XYDATA
$$ [...]
19530B77160i5772j33044B1639a56745a4649B01642M2519b8303k66714J28521
$$ 277160 -95772 -228816 21639 -156745 -14649 201642 244161 -28303 -295017 -166496
19520a66496j53118J57677B40633a1312l17950B88618b2543A45668a27757A39878
$$ -166496 -319614 -161937 240633 -11312 -329262 288618 -22543 145668 -127757 139878
19509g1434o0516A7733a28400B4157J44748G482L6003a88728k87327M4861a78938
$$ -71434 -131950 17733 -128400 24157 168905 7482 43485 -188728 -476055 -431194 -178938
19497A02761D4528c5337A69b08997f3015F1397J6795a50090r1357J00513M5515
$$ 102761 44528 -35337 169 -208997 -63015 61397 78192 -150090 -241447 -140934 -95419
19486i5419b3478A85676B0842d7963o9359A9079J92047m5390d17551D8420J7724
$$ -95419 -23478 185676 20842 -47963 -117322 19079 211126 165736 -417551 48420 66144
19475F6144b78303a13349B92543f5059A7767a12233L9233m2843F4376c18425b280
$$ 66144 -278303 -113349 292543 -65059 17767 -112233 -73000 -115843 64376 -318425 -2280
19463A8961J95215p6007c84683e5640D7882M5746a34354M2057I3068a80291A59731
$$ 18961 214176 138169 -384683 -55640 47882 93628 -134354 -92297 93068 -180291 159731
19451A0917a02636j99948A32427c9983F563d65205e8721B9826c26115f4686k4339
$$ 10917 -102636 -302584 132427 -39983 6563 -465205 -58721 29826 -326115 -64686 -89025
19440h9025l1928p2670b6980j32037q4021J03023A15964K262a51715A14796a34999
$$ -89025 -120953 -193623 -26980 -159017 -243038 -140015 115964 118226 -151715 114796 -134999
19428E8637R5340h3629K6413A62303D2648J71177A3465b25954i9406j25666G7964
$$ 58637 153977 -83629 -57216 162303 42648 213825 13465 -225954 -99406 -225072 77964
19416F7783d56100g6216r9692F9558a97473A59935f527k39657A01127a27742A4023
$$ 67783 -456100 -76216 -175908 69558 -197473 159935 -6527 -246184 101127 -127742 14023
19404G6472N1919b7464l73676a40296A49839d1341m6327A31J29735b69157J18937
$$ 76472 128391 -27464 -401140 -140296 149839 -41341 -87668 131 129866 -269157 -150220
19393a50220A3878d6068C8899c58796g7529l4710M9301j9355A76349b05552A21682
$$ -150220 13878 -46068 38899 -358796 -77529 -112239 -62938 -82293 176349 -205552 121682
19381a76319k6461D1060h0496k12968B82536i2076A44607a40140A38463a11621
$$ -176319 -202780 41060 -80496 -293464 282536 -92076 144607 -140140 138463 -111621
19370h1349e827A96605d50209b12602H2553c79110D1103a9902j31914j0216k89422
$$ -81349 -5827 196605 -450209 -212602 82553 -379110 41103 -19902 -151816 -162032 -451454
19359d51454A66473a14675j14069j28439a69424C53490I8357c6976G219b1842
$$ -451454 166473 -114675 -228744 -357183 -169424 353490 98357 -36976 7219 -21842
19348a55881d471j76177P9661C9918e5654E3957d5844A871a22282G9677c66057
$$ -155881 -4471 -180648 -100987 39918 -55654 53957 -45844 1871 -122282 79677 -366057
19336d5488A60044C7746a31182B78200c84384d4315F3340R2902f374k27124a7788
$$ -45488 160044 37746 -131182 278200 -384384 -44315 63340 156242 -6374 -233498 -17788
19324a02178J6570g678j33387n2239p524F003c0608k77257C20127d09935B45809
$$ -102178 -85608 -7678 -141065 -193304 -200828 6003 -30608 -307865 320127 -409935 245809
19312a68149c3320A88507b7134m1165k61013J51931A78244L1318c4601j6126A32754
$$ -168149 -33320 188507 -27134 -68299 -329312 -177381 178244 209562 -34601 -50727 132754
19300B7657J13111b4386H9076B9954J82088p8521O1215c01307a05888j65620A62403
$$ 27657 140768 -24386 89076 29954 212042 133521 194736 -301307 -105888 -271508 162403
19288a26041j8632O7682j43877m6808A14851d546j45216J4511L5490B33129r6825
$$ -126041 -144673 -76991 -220868 -267676 114851 -4546 -149762 -135251 -99761 233129 136304
19277A36304O0007g1741j8127G9392a44119D0596b22152d678j03928C51191b42178
$$ 136304 196311 -71741 -89868 79392 -144119 40596 -222152 -4678 -108606 351191 -242178
19265A12225a43345A42275a27577j70476B77095n3427k3191c32928c2782l29980
$$ 112225 -143345 142275 -127577 -298053 277095 223668 200477 -332928 -32782 -362762
19255c62762A40234C8397a18202A52074b28848D35155C4227c35412A5337J87057
$$ -362762 140234 38397 -118202 152074 -228848 435155 34227 -335412 15337 202394
19245B02394B9734L3379K36941c9845j54335N3714M6930r2986L8738J9786C9056
$$ 202394 29734 63113 300054 -39845 -194180 -140466 -93536 -186522 -147784 -127998 39056
19233A09277e7639C1786J73174h3385n8475C2989h1907m8227G1630B3797b00463
$$ 109277 -57639 31786 204960 -83385 -141860 32989 -81907 -130134 71630 23797 -200463
19221c71318a22318r3592P4959b7857l3209j49354J7826k0284e4858H6621a4769
$$ -371318 -122318 -215910 -140951 -27857 -61066 -210420 -192594 -212878 -54858 86621 -14769
19209a03591A60972b7423n1517l83155a39931C7527L5186A4162P5998P2156g10980
$$ -103591 160972 -27423 -78940 -462095 -139931 37527 72713 14162 90160 162316 -710980
19197D7463K8206K81450j61211a99710l361o6798a31210C3912b15237C2056J73817
$$ 47463 75669 357119 195908 -199710 -203071 -269869 -131210 33912 -215237 32056 205873
19186B05873o6853g08E1569R2486b95323F428J05665b20791R9930j28160B40073
$$ 205873 139020 -708 51569 144055 -295323 6428 112093 -220791 -120861 -249021 240073
19174a50978C2536c28328a53885B13324b50515A91516a54647A57795p4936a08264
$$ -150978 32536 -328328 -153885 213324 -250515 191516 -154647 157795 82859 -108264
19163G1135c21408a10263l4448a5749o3168A71485a84445I5807a56464B37943
$$ 71135 -321408 -110263 -144711 -15749 -78917 171485 -184445 95807 -156464 237943
19152A00351i7432K6879G5963N1212b37648B32468a93370C4870a40803O5094D7428
$$ 100351 -97432 -70553 75963 127175 -237648 232468 -193370 34870 -140803 -75709 47428
19140f0788r3258a2747j47416k5972A41737o4058H553a24852j60567B27606c1667
$$ -60788 -154046 -12747 -160163 -186135 141737 77679 8553 -124852 -285419 227606 -31667
19128a44169c8256g436j22722c5455k36794C9007a93429i0473j71149b6872o7404
$$ -144169 -38256 -7436 -130158 -35455 -272249 39007 -193429 -90473 -261622 -26872 -94276
19117i4276k12450O5272I8144l8152K8601c24940A57480b12134j05721B13267
$$ -94276 -306726 -241454 98144 59992 88593 -324940 157480 -212134 -317855 213267
19106A82438b5354l5646B354a73249A9050L25702a33852L0127N1253a0292k866
$$ 182438 -25354 -61000 2354 -173249 19050 344752 -133852 -103725 -52472 -10292 -13158
19095a3158A85027b11349G2070C5877b30426B57528D6158a33907m4055j9825P351
$$ -13158 185027 -211349 72070 35877 -230426 257528 46158 -133907 -177962 -197787 -190436
19084a90436C44604a56683O6743A43980I221b95169C128b33610A75613a40474
$$ -190436 344604 -156683 -89940 143980 9221 -295169 3128 -233610 175613 -140474
19073a91881g933l52298O2978j04252g4290l4589A04598a66506C8904a85594g8728
$$ -191881 -7933 -360231 -297253 -401505 -74290 -108879 104598 -166506 38904 -185594 -78728
19061A11606b24069C5701c16543B17905k0171a64299M0253j21373C6525R6985
$$ 111606 -224069 35701 -316543 217905 197734 -164299 -124046 -245419 36525 133510
19051A33510C0703e1261b4403l3363j42441a5761r6862d8875A43435R9651i4219
$$ 133510 30703 -51261 -24403 -57766 -200207 -15761 -112623 -48875 143435 243086 -94219
19039e7895F7339a26772G4466N8948b7652B6590a40210k3754A68431q3982c42757
$$ -57895 67339 -126772 74466 133414 -27652 26590 -140210 -163964 168431 84449 -342757
19027a12350A75561g2808G3939O3314i9176a08k91587A75259J9280n1413a87079
$$ -112350 175561 -72808 73939 137253 -99176 -108 -291695 175259 194539 143126 -187079
19015B35750H4900b756H7343a39915k41407a8686B7814a09213C68862i9249a097
$$ 235750 84900 -2756 87343 -139915 -381322 -18686 27814 -109213 368862 -99249 -1097
19003h7074I0027b7485k30463k3260i9073B81345C5518b81320g2281q4726D8072
$$ -87074 90027 -27485 -257948 -281208 -99073 281345 35518 -281320 -72281 -157007 48072
18991G0039k269b65241A82979c02381a27299A46881g0969r3392E5961K4174j3227
$$ 70039 67770 -265241 182979 -302381 -127299 146881 -70969 -164361 55961 80135 66908
18980F6908a16088D4039a1970m7319J3145k0897E4187d5216l1087E3867j4135
$$ 66908 -116088 44039 -11970 -59289 -46144 -67041 54187 -45216 -76303 53867 39732
18969C9732a60898E690b15211A08969e1046a9057j27467a1824r7759K3511A892
$$ 39732 -160898 5690 -215211 108969 -51046 -19057 -146524 -11824 -109583 -86072 1892
18957a95863o6521B3588J84545i7127d3532D42837a12457C21765b1795B67476
$$ -195863 -262384 23588 208133 -97127 -43532 442837 -112457 321765 -21795 267476
18946A41448c5030k75506B0858b01693i136j31086M5180n5272A68722a07894b8853
$$ 141448 -35030 -310536 20858 -201693 -9136 -140222 -95042 -150314 168722 -107894 -28853
18934a55138r7224C4325a27798l68008g8340I2490Q1435b14684A94752a53295
$$ -155138 -252362 34325 -127798 -495806 -78340 92490 173925 -214684 194752 -153295
18923C00995d9026I9497b64193m6593K0950a08567M4450H3766J03899p943a8081
$$ 300995 -49026 99497 -264193 -310786 -289836 -108567 -64117 83766 187665 179722 -18081
18911A01246b4349j25711N98g2858k01306N5175a02487k66715A87585c4656o9105
$$ 101246 -24349 -150060 -149462 -72858 -274164 -218989 -102487 -369202 187585 -34656 -103761
18900a03761A54373i0694E6968J27840b31224B7689a84882j32548A50783a88861
$$ -103761 154373 -90694 56968 184808 -231224 27689 -184882 -317430 150783 -188861
18889B3406A0164a43342k83219B74327k4797a21033N5423A52049c18065d7005
$$ 23406 10164 -143342 -426561 274327 249530 -121033 -65610 152049 -318065 -47005
18878E3325h3241k35158Q8364C2365c43568E6078a84699A77880b50262a21359
$$ 53325 -83241 -318399 -230035 32365 -343568 56078 -184699 177880 -250262 -121359
18867G0304f0869j21973B08162e5358k2355A38374a76845P9884f128I9144q58
$$ 70304 -60869 -182842 208162 -55358 -77713 138374 -176845 -96961 -6128 99144 98286
18856I8286a44742K4131B44944a10531b7153D4634P9138a34372d5639n7327D36304
$$ 98286 -144742 -120611 244944 -110531 -27153 44634 123772 -134372 -45639 -102966 436304
18844c95083f9805L516j04723A14102b38195L8625A50670E570M8833k1613Q2654
$$ -395083 -69805 -66289 -171012 114102 -238195 -199570 150670 5570 54403 32790 115444
18833A15444D6040a55953d0518C1719j2937c49169f5157A16412Q6992d0406k02852
$$ 115444 46040 -155953 -40518 31719 18782 -349169 -65157 116412 203404 -40406 -243258
18822b43258A23529J368b08374A14375e5275k2136j66923n3359D0116h1375a0440
$$ -243258 123529 124897 -208374 114375 -55275 -77411 -244334 -297693 40116 -81375 -10440
18810A68672l4228f7088L1675B49691e78393B29161b7017k5612p2549C05589A0953
$$ 168672 134444 -67088 -35413 249691 -578393 229161 -27017 -52629 -125178 305589 10953
18798H7498K59042E5338K6175J41140p8741J82946B5869f3859F4990d23738J19236
$$ 87498 346540 55338 81513 222653 143912 326858 25869 -63859 64990 -423738 -304502
18787c04502R3174E5417h2679l04386A18475b6572L702m8189b3772G327c34623
$$ -304502 -211328 55417 -82679 -387065 118475 -26572 -22870 -71059 -23772 7327 -334623
18775a64368l1752H5404d16638A37018D8399N5659J11135b79955J07890n3422
$$ -164368 -196120 85404 -416638 137018 48399 104058 215193 -279955 -172065 -225487
18765b25487B9715b35326J988N1133e7927A27328a21061A909a08309K0111A01795
$$ -225487 29715 -235326 -233338 -182205 -57927 127328 -121061 1909 -108309 -88198 101795
18753b24329a8499k36806o7303g0664k4972l3916q5781d9052c297H7292N1387
$$ -224329 -18499 -255305 -322608 -70664 -95636 -129552 -215333 -49052 -3297 87292 138679
18742A38679g5502n6409j28144N0373I3370e9274j29465O0044A35480b60945h0994
$$ 138679 -75502 -131911 -260055 -209682 93370 -59274 -188739 -128695 135480 -260945 -80994
18730h966q7354l7149c3957j81199B48852c102A54103M8279H8569C3897P2191
$$ -8966 -96320 -133469 -33957 -215156 248852 -3102 154103 202382 88569 33897 106088
18719A06088a2392k7145G7654a29938i111j70175k9455j48813J43878N2075a0821
$$ 106088 -12392 -39537 77654 -129938 -9111 -179286 -208741 -357554 -213676 -161601 -10821
18707b01490a5050j8090r1897M2413j0908j00002e3120k96512A5089a8484j2559
$$ -201490 -15050 -33140 -125037 -82624 -93532 -193534 -53120 -349632 15089 -18484 -31043
18696c1043A23435c21867A44611G623b16831j96073A63321a14096K9258a6337
$$ -31043 123435 -321867 144611 7623 -216831 -412904 163321 -114096 -84838 -16337
18685A94812c14667A334h1170l00244J84972j97005a59532b8989m19370a237k26944
$$ 194812 -314667 1334 -81170 -381414 -196442 -393447 -159532 -28989 -448359 -1237 -228181
18674b28181A92135B7813d29464I1821A986c62403j56322c2336B36744c50202
$$ -228181 192135 27813 -429464 91821 1986 -362403 -518725 -32336 236744 -350202
18663A36429i0408o1561L5070k26639F8392a53281k3464B79484a10956A81301
$$ 136429 -90408 -151969 -116899 -343538 68392 -153281 -176745 279484 -110956 181301
18652h620j88303h6786k16175C0679P4444l9269f7047j194j58251o9768C3834
$$ -8620 -196923 -86786 -302961 30679 105123 65854 -67047 -68241 -226492 -296260 33834
18640A15858a92714R4161G4459B7974J70598e3188C7288J06230b34933R3261a4976
$$ 115858 -192714 -98553 74459 27974 198572 -53188 37288 143518 -234933 -141672 -14976
18628F1663J4157J82914G8275j7174h5483j44652D9602O3363b11965A17456c03740
$$ 61663 75820 258734 78275 61101 -85483 -230135 49602 112965 -211965 117456 -303740
18616a6710A47491F4902P9867f99192b2683D38284c20394J52619C79444a09412
$$ -16710 147491 64902 144769 -699192 -22683 438284 -320394 -167775 379444 -109412
18605d32675b07453g4032k82160a48411E5199a46266B40762i3768j01383M6590
$$ -432675 -207453 -74032 -356192 -148411 55199 -146266 240762 -93768 -195151 -148561
18595a48561H8932O0073n6393g7705j64544C5887P2293b18046p7717g7565L8129
$$ -148561 88932 149005 92612 -77705 -242249 35887 108180 -218046 -295763 -77565 -39436
18584c9436A41717n1541J14959b0473l58373a2306F3410Q8129P6544b3703C57584
$$ -39436 141717 90176 205135 -20473 -378846 -12306 63410 151539 228083 -23703 357584
18572I7118m3419g8011J1785l21534J10349a09007A56657i7180C04535d3929j89652
$$ 97118 53699 -78011 -66226 -387760 -277411 -109007 156657 -97180 304535 -43929 -233581
18561b33581J11526K0264C0392b67709A7353b45522J21433q5026A43323d9917
$$ -233581 -122055 -101791 30392 -267709 17353 -245522 -124089 -209115 143323 -49917
18550B56701b06991l5330f5473B3794K2872b64878h2766G9717a94254B20749f8370
$$ 256701 -206991 -242321 -65473 23794 46666 -264878 -82766 79717 -194254 220749 -68370
18538f3598A37730i7519G5364K55957b7071j69132D2853b05834D9481c40094A03766
$$ -63598 137730 -97519 75364 331321 -27071 -196203 42853 -205834 49481 -340094 103766
18526B0699a93990a9602D2435a23378N2165m246C0124g8446B2694c7511m23610
$$ 20699 -193990 -19602 42435 -123378 -71213 -75459 30124 -78446 22694 -37511 -461121
18515d61121A05473J2275a79132D83423A00103J04649a31390F3544M1461d2502
$$ -461121 105473 117748 -179132 483423 100103 204752 -131390 63544 105005 -42502
18504a30630c4965A57254f0260j08961o3444i9923j89136J28978k20753B90921
$$ -130630 -34965 157254 -60260 -169221 -232665 -99923 -289059 -160081 -380834 290921
18493e8236A68791G3397b92788A80181a13575N4925j87504D5922J06642a53492
$$ -58236 168791 73397 -292788 180181 -113575 -58650 -246154 45922 152564 -153492
18482C13107a3561k14241c2153j09982C9652J32619b30056A2499c0441F0073b77129
$$ 313107 -13561 -227802 -32153 -142135 39652 172271 -230056 12499 -30441 60073 -277129
18470c9112A2281c04464A95856q7613m3629e1540A76367C6217b64907C106R9234
$$ -39112 12281 -304464 195856 108243 64614 -51540 176367 36217 -264907 3106 102340
18459A02340a10455F942a28886k23519p5277R0623J06876A16565e4068J9987C0878
$$ 102340 -110455 6942 -128886 -352405 -427682 -337059 -230183 116565 -54068 -34081 30878
18447D0647i9894q5193C0966h2798q5180Q0465b6154j91101A38316a55881M8396
$$ 40647 -99894 -185087 30966 -82798 -167978 -87513 -26154 -217255 138316 -155881 -107485
18436a07485a9081l93341A84281f4410A57213A6460c05285J34143B20393h5930
$$ -107485 -19081 -412422 184281 -64410 157213 16460 -305285 -171142 220393 -85930
18425c04675J29470h1218j53821C26031H0937O2779h9083k2083J1765a9783E962
$$ -304675 -175205 -81218 -235039 326031 80937 143716 -89083 -111166 -99401 -19783 5962
18413g8046G6100a28831C03216a3686A18688A979c12770B9753a15349k35062J38526
$$ -78046 76100 -128831 303216 -13686 118688 1979 -312770 29753 -115349 -350411 -211885
18402b11885f9701H3026a31116L4081d1586A625g8616n9533A74954M5768a03970
$$ -211885 -69701 83026 -131116 -97035 -41586 1625 -78616 -138149 174954 220722 -103970
18390c97292a7430B4913R4951a24958j06887i751k39467a03622B18906b09886
$$ -397292 -17430 24913 119864 -124958 -231845 -9751 -249218 -103622 218906 -209886
18379A67659b6263q1316b2548B64256D6056c75484c55q5276k08143B02123f2891
$$ 167659 -26263 -107579 -22548 264256 46056 -375484 -355 -85631 -293774 202123 -62891
18367b01351D37925G5294a69359B59382G3348K40657b51676f6760L1264j27145
$$ -201351 437925 75294 -169359 259382 73348 314005 -251676 -66760 -35496 -162641
18357a62641K9134c3482D0903b97293a11822j80224I7026g6563j26235P2183A27413
$$ -162641 -133507 -33482 40903 -297293 -111822 -292046 97026 -76563 -202798 -130615 127413
18345h7148j15689g6379A29007m2276i1572A10955K2485b288k0819j26604a1999
$$ -87148 -202837 -76379 129007 86731 -91572 110955 133440 -2288 -23107 -149711 -11999
18333G6547j1033c62938a62752J9627k5703M2160d1264j49393B91191h178j33609
$$ 76547 65514 -362938 -162752 -143125 -168828 -126668 -41264 -190657 291191 -8178 -141787
18322a41787M78O161A23913K5093b25784E711b6364A08838j7739F905c5297j81213
$$ -141787 -141309 -135148 123913 149006 -225784 5711 -26364 108838 91099 6905 -35297 -216510
18310b16510A86978I2941d81114a37189A5194Q6353b80204k8171A949a47428d3410
$$ -216510 186978 92941 -481114 -137189 15194 101547 -280204 -308375 1949 -147428 -43410
18298F3451b19311D6630c7869F5556J00080C4470J24062b01674N7117B47431A6519
$$ 63451 -219311 46630 -37869 65556 165636 34470 158532 -201674 -144557 247431 16519
18286c813m86611b03793j23702J7151B6093b01122j39151f0638a368B1677o340
$$ -3813 -490424 -203793 -327495 -310344 26093 -201122 -340273 -60638 -1368 21677 15337
18275A5337a40901m3506M0484C584J75764J48425m4527C0847a24259m999B10589
$$ 15337 -140901 -184407 -143923 3584 179348 327773 283246 30847 -124259 -129258 210589
18263b78476B34780i9165B62566m4791h8290j76555g3669A30350a07306j80745
$$ -278476 234780 -99165 262566 217775 -88290 -264845 -73669 130350 -107306 -288051
18253b88051A02351a33713d6118j8512C67032a49235d7774n0861A93511a21356
$$ -288051 102351 -133713 -46118 -64630 367032 -149235 -47774 -98635 193511 -121356
18242i3539j82555G8927R0437c64103f2170F7887O7458A8839J1698a80404B3380
$$ -93539 -276094 78927 169364 -364103 -62170 67887 135345 18839 30537 -180404 23380
18230A67362a15200l09216E5412a47103E6251b40371C1759c25355F9156a44753
$$ 167362 -115200 -424416 55412 -147103 56251 -240371 31759 -325355 69156 -144753
18219c7282B25825m0058i6828l98081a07691D5038f5600k1415B29365d11462d5172
$$ -37282 225825 185767 -96828 -494909 -107691 45038 -65600 -87015 229365 -411462 -45172
18207a38874B12853e1703j97250A50694J8653d61720B34140n2616j4094g8170
$$ -138874 212853 -51703 -248953 150694 169347 -461720 234140 181524 167430 -78170
18196b99269I6170j3593a04380B88527F8351J6277b46350c8056a115I9485b03
$$ -299269 96170 82577 -104380 288527 68351 84628 -246350 -38056 -1115 99485 -203
18184a31701j21985a01285B97837H0104f6596A7995b37812e9399m41794H9474
$$ -131701 -253686 -101285 297837 80104 -66596 17995 -237812 -59399 -501193 89474
18173E4994h605l21935Q1229B67053b5419A85859q2910k459I792i7135A63279
$$ 54994 -8605 -330540 -249311 267053 -25419 185859 102949 100490 9792 -97135 163279
18161a51629n6576A81531a80866j1893J7561j9060e306q9394B54987b77330J38210
$$ -151629 -208205 181531 -180866 -192759 -175198 -194258 -5306 -94700 254987 -277330 -139120
18150a39120j67329a2551j009A23954a50089C7696c01352k6638a17352B52236
$$ -139120 -306449 -12551 -13560 123954 -150089 37696 -301352 -327990 -117352 252236
18139A58066A4222L9128j0352d35473J79903F2650J59304a48387B44292i7144
$$ 158066 14222 53350 42998 -435473 -255570 62650 221954 -148387 244292 -97144
18128C2403H561M29028A04449A7566J05655b93252J12711C42951j28821G1190
$$ 32403 8561 437589 104449 17566 123221 -293252 -180541 342951 214130 71190
18117c21473a14772F6962J4695h1328k5594E4369a42772L3821q8471n044j10571
$$ -321473 -114772 66962 81657 -81328 -106922 54369 -142772 -108951 -197422 -202466 -313037
18106c13037N905j3084A14644N7913n9026O5055a74436A46819b61346G4497a50138
$$ -313037 -307132 -320216 114644 172557 113531 178586 -174436 146819 -261346 74497 -150138
18094c6165B45612H1992a36519k44068A06625i8941j68756D5496b35976D5782
$$ -36165 245612 81992 -136519 -380587 106625 -98941 -267697 45496 -235976 45782
18083a89317I9234m0017J23929C4504K2146O375K52361a04803K0445d0507A11217
$$ -189317 99234 59217 183146 34504 56650 63025 315386 -104803 -84358 -40507 111217
18071a08549b6412n7842a8402p2323A26503J0991J06651e7086p2321b0425k37036
$$ -108549 -26412 -84254 -18402 -90725 126503 137494 244145 -57086 -129407 -20425 -257461
18060b57461A87418a60838g098j47104C1797A1296b40801k02362B6544L79902
$$ -257461 187418 -160838 -7098 -154202 31797 11296 -240801 -443163 26544 406446
18050D06446A79745c7396m1397c165k0344D6662a84907b159k07915P6650B92520
$$ 406446 179745 -37396 -78793 -3165 -23509 46662 -184907 -2159 -210074 -133424 292520
18038A8483g0264k2434F708L18993c8292p6597d596A08322A4871L92505A4509
$$ 18483 -70264 -92698 6708 325701 -38292 -114889 -4596 108322 14871 407376 14509
18026A27869N8702b34771h3718C2363J32119m6651J09470n2606c03123J16597
$$ 127869 186571 -234771 -83718 32363 164482 117831 227301 174695 -303123 -186526
18016a86526C66736d65653A7449a81341M3706E907b9550j06783o7162b7664C34753
$$ -186526 366736 -465653 17449 -181341 -137635 5907 -29550 -136333 -203495 -27664 334753
18004A45197a79172A38353A8396d6795A94651c15829D0533b46962a07040j78686
$$ 145197 -179172 138353 18396 -46795 194651 -315829 40533 -246962 -107040 -285726
17994b85726A44944A5557c4127p2285n5999A16995C6450J8327O1471L8081c32785
$$ -285726 144944 15557 -34127 -106412 -162411 116995 36450 54777 116248 154329 -332785
17982B52447a41614j5077B94513h3351C499O2218K48980b72499J08419d5155B09767
$$ 252447 -141614 -156691 294513 -83351 3499 65717 314697 -272499 -164080 -45155 209767
17970D1701D327M5079f0881A13832O8362f7005o7703K2019C6152L05655B6632
$$ 41701 4327 49406 -60881 113832 182194 -67005 -134708 -112689 36152 341807 26632
17958B03001q1964b04837i5394j17517D1540a01209A71627a45306H4731l4683
$$ 203001 121037 -204837 -95394 -212911 41540 -101209 171627 -145306 84731 50048
17948E0048d05004b457A74561e0768A06057E427a56848b1273l33193A38221n7187
$$ 50048 -405004 -2457 174561 -50768 106057 5427 -156848 -21273 -354466 138221 81034
17937H1034c42228B28070i4847E0330J37106a72420R434b3938j04791N009A79483
$$ 81034 -342228 228070 -94847 50330 187436 -172420 -162986 -23938 -128729 -123720 179483
17925C06422c63259J12655F0452f728D8229M5097j1006j7337L3593h8449A49314
$$ 306422 -363259 -250604 60452 -6728 48229 93326 82320 64983 98576 -88449 149314
17913b18539B05934R4226b1416I6073P0790f4693j46934b6222j11179q8786G3426
$$ -218539 205934 300160 -21416 96073 166863 -64693 -211627 -26222 -137401 -226187 73426
17901E2890k4338e5744A50162a34151A16720a07061a5413H8953a50080P3491A21601
$$ 52890 28552 -55744 150162 -134151 116720 -107061 -15413 88953 -150080 -76589 121601
17889I4011a77858A20835J98926I5586i3186A72797a38120k7634C6164q696a65521
$$ 94011 -177858 120835 319761 95586 -93186 172797 -138120 -165754 36164 27468 -165521
17877b81240A58208a48217l5938C2515a9720B15658J23436A0061e2175D6607K65504
$$ -281240 158208 -148217 -184155 32515 -19720 215658 339094 10061 -52175 46607 312111
17866C12111A39248c053j02332j12806i159C16825b62500A95019a85877A15528
$$ 312111 139248 -3053 -105385 -218191 -9159 316825 -262500 195019 -185877 115528
17855E9465b44737c5439j61464B4759L77107C4579a51456B02530a0298B7487J44595
$$ 59465 -244737 -35439 -196903 24759 401866 34579 -151456 202530 -10298 27487 172082
17844A72082a87196A40667d4818k4441B1141c26873a11290J597A89915b92598
$$ 172082 -187196 140667 -44818 -69259 21141 -326873 -111290 -109693 189915 -292598
17833a89142k7801R2441c1253k08723J07676b7301j24974C7277K64866a17074
$$ -189142 -216943 -124502 -31253 -239976 -132300 -27301 -152275 37277 302143 -117074
17822a06202n346q8518f47m3617O882j3413a2578j42099K5278I8128l4491a61229
$$ -106202 -111548 -200066 -647 -44264 -37382 -50795 -12578 -154677 -129399 98128 63637 -161229
17809E3755J31674d84F7247k0217J21932b68547A84467A1587a51099A4807d4284
$$ 53755 185429 -484 67247 47030 168962 -268547 184467 11587 -151099 14807 -44284
17797b22740f0751o6669n6809H4701e580j39669j13046B16230a68368j56346f135
$$ -222740 -60751 -127420 -184229 84701 -5580 -145249 -258295 216230 -168368 -324714 -6135
17785B0938K95896j37411C5797M3897i523A0193J00604c59211k1938a01647a3389
$$ 20938 316834 179423 35797 79694 -9523 10193 110797 -359211 -381149 -101647 -13389
17773a40010f6393b6789Q276k31013J15965N445k85364A33925a31786D90197B09417
$$ -140010 -66393 -26789 -18513 -249526 -133561 -128116 -413480 133925 -131786 490197 209417
17761a75168F9966E554b34561B19544M9468c10434i035A21793E8116J0971R0908
$$ -175168 69966 5554 -234561 219544 269012 -310434 -9035 121793 58116 69087 159995
17750A59995m8626b43866H6696a40964c8216j44841B27925a65712A78028J76643
$$ 159995 111369 -243866 86696 -140964 -38216 -183057 227925 -165712 178028 354671
17740C54671n4302b11898b6134l48711c7399C68515j47215A0642a31860n373j13800
$$ 354671 300369 -211898 -26134 -374845 -37399 368515 221300 10642 -131860 -137233 -251033
17729b51033A07105f5551L1297I9551o898D398b95819a9335A26561h8444G7980
$$ -251033 107105 -65551 -34254 99551 92653 4398 -295819 -19335 126561 -88444 77980
17717C27421A5777B043J10609a15314q4910O4424A34989j7861L8903n5164M75096
$$ 327421 15777 2043 112652 -115314 -200224 -135800 134989 117128 156031 100867 575963
17706E75963A4517J25498R6746F7578A2030N7065a43688A92874c2311p987A26820
$$ 575963 14517 140015 236761 67578 12030 69095 -143688 192874 -32311 -40298 126820
17694H1254L40312d6688B26143d443E124a11385d3191J7061o4312A09430k4758
$$ 81254 421566 -46688 226143 -4443 5124 -111385 -43191 -26130 -90442 109430 84672
17683H4672b97699J35808H9022b8324k60444A16063l476a26576b0093A87532Q1855
$$ 84672 -297699 -161891 89022 -28324 -288768 116063 112587 -126576 -20093 187532 269387
17672B69387b13593F1096J10577J05149P649E1395J41543a62414G4132i6479G0528
$$ 269387 -213593 61096 171673 276822 284471 51395 192938 -162414 74132 -96479 70528
17660A5118J07612O1415e9479B68669L9485a78374d6134k81590a24806L4397b1069
$$ 15118 122730 184145 -59479 268669 308154 -178374 -46134 -327724 -124806 -90409 -21069
17648B80102c3211I9826K26321A31960D3277R9620o7538a11880B53445a26461
$$ 280102 -33211 99826 326147 131960 43277 142897 75359 -111880 253445 -126461
17637c26588E241J04720J26860a26557k6459j79383e6268k25992M4288A97519
$$ -326588 5241 109961 236821 -126557 -153016 -332399 -56268 -282260 -237972 197519
17626a03328k6503L9858A56211p6406P164J84816D2206g4031A20240Q8923d1364
$$ -103328 -129831 -89973 156211 79805 86969 271785 42206 -74031 120240 209163 -41364
17614b44618G4608A7455K9748M3195a30161A0342P962K44011d8855l06513B93292
$$ -244618 74608 17455 47203 90398 -130161 10342 18304 262315 -48855 -355368 293292
17602D29c18595a01451J3200A73842A6609M3786P0167g8797C37926j51489a28851
$$ 429 -318595 -101451 -88251 173842 16609 60395 130562 -78797 337926 186437 -128851
17590B48033r5179J93866f6950j10983D6206Q6111o5157a90970H091a77840C0193
$$ 248033 152854 346720 -66950 -177933 46206 132317 67160 -190970 8091 -177840 30193
17578b24547C69073j81778a50041A51270j5271e0270B11855c01340B4622c9958
$$ -224547 369073 187295 -150041 151270 135999 -50270 211855 -301340 24622 -39958
17567I9429K7020F1094f278j812I0544j90K12131D9760a54517C0484e5183j85244
$$ 99429 126449 61094 -6278 -8090 90544 90354 302485 49760 -154517 30484 -55183 -240427
17555b40427B71047H2269J44313a03971j0293A06516i7267E7584K43408C5938
$$ -240427 271047 82269 226582 -103971 -114264 106516 -97267 57584 300992 35938
17544A41502j9858g9540C3882L78971b1069H8516C3618p440m0M67380a14959E5052
$$ 141502 121644 -79540 33882 412853 -21069 88516 33618 26178 26138 493518 -114959 55052
17531A12042M7700P3073N0136a42717k3471B69832a8143G2823L02683a32001D3420
$$ 112042 159742 232815 282951 -142717 -166188 269832 -18143 72823 375506 -132001 43420
17519A12448m3586P7036a25955H5164j600g7703c4741E1047i5454D3088J0660
$$ 112448 68862 145898 -125955 85164 83564 -77703 -34741 51047 -95454 43088 53748
17508E3748b64202B05074l1403a85103A85709l7826b41797J03690A23439E23J1687
$$ 53748 -264202 205074 173671 -185103 185709 147883 -241797 -138107 123439 523 12210
17497A2210L61644j70272D9987a11355B75003b119G8950A9814M4895j1523k290
$$ 12210 373854 203582 49987 -111355 275003 -2119 78950 19814 64709 53186 50896
17486E0896a06193F8194B4752J77698F7501K3887b01621i6875b7541B9267K76750
$$ 50896 -106193 68194 24752 202450 67501 91388 -201621 -96875 -27541 29267 306017
17475C06017A50719j5476g0412A7052J11158l5940d95A32556a02712A67668a8192
$$ 306017 150719 135243 -70412 17052 128210 92270 -495 132556 -102712 167668 -18192
17463g3359B83553a83890A07870j1490K37143F3299J7407d6150A84500a39847
$$ -73359 283553 -183890 107870 96380 333523 63299 80706 -46150 184500 -139847
17452B21343j5204L1279j04322n4970J70594a06845F4856J58605i8200B41297
$$ 221343 206139 237418 133096 78126 248720 -106845 64856 223461 -98200 241297
17441B41438P9897b1035C3223J43729q7852N7742k0858K86654Q224A64330K20005
$$ 241438 321335 -21035 33223 176952 89100 146842 125984 412638 420862 164330 384335
17430C84335F1692K36466b3561C59261A15364l5657N06591A29376L29917r7650
$$ 384335 61692 298158 -23561 359261 115364 79707 586298 129376 459293 361643
17420C61643A80620n2977J28527j5838M2878j01430K13735K8193e96B86878K078
$$ 361643 180620 127643 256170 240332 283210 181780 395515 423708 -596 286878 288956
17409B88956R9385j33570I5577K78417p2395P851O9455j27279e40302A36472O9994
$$ 288956 388341 254771 95577 373994 301599 309450 378905 251626 -540302 136472 206466
17398B06466E9159J71086K40929k23479r3104b42942h0142B42133b25492A32059
$$ 206466 59159 230245 471174 247695 154591 -242942 -80142 242133 -225492 132059
17387F27047j71358A68867b1969E1188N299b1128A79231J82412K3734F9207d1923
$$ 627047 455689 168867 -21969 51188 56487 -21128 179231 361643 385377 69207 -41923
17375B51137p8181a25641H7658k8355M5949J08051R6948j36622G3920A072J60119
$$ 251137 172956 -125641 87658 59303 105252 213303 310251 173629 73920 1072 161191
17364A61191J3670a42591B24447j02166a0977A92169K70058A06407d262A81080
$$ 161191 174861 -142591 224447 122281 -10977 192169 462227 106407 -4262 181080
17353F5679j9928K1501K69705J7041c07219B6949K0206L01762c05771a44769k7803
$$ 65679 45751 67252 336957 353998 -307219 26949 47155 348917 -305771 -144769 -172572
17342a72572E19748f2863B34633Q8318F1130a05344A01183N41793E9533i6707
$$ -172572 519748 -62863 234633 322951 61130 -105344 101183 642976 59533 -96707
17331E4673b52104f4846C22457J13860b78230F6703J76193a45878B95352j46433
$$ 54673 -252104 -64846 322457 436317 -278230 66703 242896 -145878 295352 148919
17321A48919a37173e754B49665J75722A92357B0409P517J51270J9032i096C33941
$$ 148919 -137173 -5754 249665 425387 192357 20409 27926 179196 198228 -9096 333941
17309F3331f853j1565B0085J3776N60199A51766K05724i0435D21945j81303A10049
$$ 63331 -6853 -18418 20085 33861 594060 151766 357490 -90435 421945 240642 110049
17297I4361L68618k26690J45632I0073Q6252D1871q676K86622a33322D23583a53902
$$ 94361 462979 236289 381921 90073 176325 41871 33195 319817 -133322 423583 -153902
17285A36130o572A7526J45042d7476C56085j54063L64058G4028a63017A9334Q5984
$$ 136130 129558 17526 162568 -47476 356085 202022 566080 74028 -163017 19334 105318
17274A05318K73544b6508o1447B32323a5849A00360J87764E4878K73903a13745
$$ 105318 378862 -26508 -87955 232323 -15849 100360 288124 54878 328781 -113745
17263b66112A55679l464J26279O5006a51070C44376c4727A9262P6134k785f7172
$$ -266112 155679 152215 278494 343500 -151070 344376 -34727 19262 95396 92611 -67172
17251B33003m0116e8503F13995q5684B51393P9919J68185k02981i4003C76982
$$ 233003 192887 -58503 613995 528311 251393 331312 499497 296516 -94003 376982
17240f8181H8615C7489J77673a62342D20198q4071a33051E21788g9438A11198
$$ -68181 88615 37489 215162 -162342 420198 336127 -133051 521788 -79438 111198
17229B4424M54814A44012J61191J02151A32408K19449J2649H3518C0540K9439
$$ 24424 479238 144012 305203 407354 132408 351857 364506 83518 30540 59979
17219E9979K61410J98832B47748j12110K9408F3369K21178C7701f192I555K92579
$$ 59979 321389 520221 247748 135638 165046 63369 284547 37701 -6192 9555 302134
17208C02134K8386n9683i2022A69204D9425K41416E7550J22066d2204C04075J33291
$$ 302134 330520 270837 -92022 169204 49425 290841 57550 179616 -42204 304075 437366
17197D37366i8431a3334n8010A36062L23094b11836D79027A19517J9435B9216
$$ 437366 -98431 -13334 -71344 136062 459156 -211836 479027 119517 138952 29216
17186b2112C4402L55256o0336E9072J64720R0094I6708L12870A77126a59567A92292
$$ -22112 34402 389658 329322 59072 223792 313886 96708 409578 177126 -159567 192292
17174B68204I6043J39888D8611O0240o108L20778j14563j26679m8501J01223J94685
$$ 268204 96043 235931 48611 108851 102743 423521 308958 182279 133778 235001 429686
17163D29686g815B18307K14362j68878H1597N3704L02556j41094o1026L49319
$$ 429686 -7815 218307 432669 263791 81597 135301 437857 296763 235737 585056
17153E85056B55164J95722j48504A34921E3335L46499p4174l9511J6368R3160
$$ 585056 255164 450886 302382 134921 53335 399834 325660 286149 302517 395677
17143C95677C4023J84907R1775r7583K62793q4727p8264K9271b0350k876D4581
$$ 395677 34023 218930 310705 213122 475915 391188 312924 342195 -20350 -23226 44581
17131C00627j22277B8143N7906L49910e3482B09464J17981A36922N8156L9271
$$ 300627 178350 28143 86049 435959 -53482 209464 327445 136922 195078 234349
17121B34349P4498K0520l6047K70512B23893Q8619A31819J25171K10019j49441
$$ 234349 308847 329367 293320 563832 223893 312512 131819 256990 467009 317568
17111C17568E1788M01827R4591k40208J64314j8342K3563j43178A07239M88169
$$ 317568 51788 453615 548206 307998 472312 453970 477533 334355 107239 595408
17101E95408k21645K4723A68552M37011k80037J9793j00776K42964j83265J36415
$$ 595408 373763 398486 168552 605563 325526 345319 244543 487507 304242 440657
17091D40657m3722j4148K60657j19038B51127K27656J67154j89067o076C3530
$$ 440657 396935 382787 643444 524406 251127 478783 645937 456870 450794 33530
17080B31619Q5879M2227A41273N89067C04014L79964l34337O8444L8605L1467
$$ 231619 317498 359725 141273 730340 304014 683978 349641 418085 456690 488157
17070D88157q7197J33038j92018M8101N4577A59863M51896k73248J41664A92075
$$ 488157 400960 533998 341980 390081 444658 159863 611759 338511 480175 192075
17059E88797B25561L88363A28698J87056J08915A26523J7211J97118K54849j84914
$$ 588797 225561 613924 128698 315754 424669 126523 143734 340852 595701 410787
17049D10787P8145E3157M15635j77883N6560L31314C01238A28322L87446l3363
$$ 410787 488932 53157 468792 290909 347469 678783 301238 128322 515768 482405
17039D82405A22058M62380B82693J07750K45662j36058K37440j3673B97917M40478
$$ 482405 122058 584438 282693 390443 636105 500047 737487 723814 297917 738395
17029G38395j51065N7250K3001k46163J22546j3343R809Q9576j69811L1172K93062
$$ 738395 587330 644580 667581 421418 543964 530621 540430 630006 460195 491367 784429
17018G84429k39541L9772L84670k73166n0447B23365J97668j75626L34514j6610
$$ 784429 544888 584660 969330 696164 645717 223365 421033 245407 579921 563311
17008E63311L21023D21434j51952L32059j88887P3262J80033j47376r9405L2900
$$ 563311 884334 421434 269482 601541 412654 485916 665949 518573 419168 452068
16998D52068J54310L34785k73706j05757p3376L78314k25978k07429K24341j58758
$$ 452068 606378 941163 667457 561700 488324 866638 640660 433231 657572 498814
16988D98814L15820l35761N6364K86253l23810r3946L76340m5046q5327J34891
$$ 498814 814634 478873 535237 821490 497680 403734 780074 735028 649701 784592
16978G84592j43368K10063k48851J52259O3020l71318L90065J07640J8309k23561
$$ 784592 641224 851287 602436 754695 817715 446397 836462 944102 962411 738850
16968G38850M4719Q5847O7637k46311P2455J01721k66285J44022N65452F41283
$$ 738850 783569 869416 937053 690742 763197 864918 598633 742655 1308107 641283
16957F65238L40374j30268r2179J41783J04121k10242J04365k30983M43597l92256
$$ 665238 1005612 875344 783165 924948 1029069 818827 923192 692209 1135806 743550
16947G43550K32840k16834K72022J92594k44922k53397j22410K43087q3702J58951
$$ 743550 976390 759556 1031578 1224172 979250 725853 603443 846530 762828 921779
16937I21779K1057K45412n6253j66377j33711J97360K7647l9745Q1258r2124L15240
$$ 921779 942836 1188248 1131995 965618 831907 1029267 1056914 1017169 1098427 1006303 1321543
16926A321543j44934p4260J06489o8909N0488L2083M9865m47086J76782J42997
$$ 1321543 1176609 1102349 1208838 1139929 1190417 1222500 1272365 825279 1002061 1145058
16916A145058N7848Q5172j1688L7995M5506j85010m4230j54140M50158l22865
$$ 1145058 1202906 1288078 1276390 1314385 1359891 1174881 1130651 976511 1426669 1103804
16906A103804L59776l32655L18168j45447m0445p4122M69597l15096j41638P9416
$$ 1103804 1463580 1130925 1449093 1303646 1263201 1189079 1658676 1343580 1201942 1281358
16896A281358J56845L18J77994q8988J46939r3990J88522l63834J16107j94111
$$ 1281358 1438203 1438521 1616515 1527527 1674466 1580476 1768998 1405164 1521271 1327160
16886A327160L63514j28979L53138l15853L22760O1096m71998l8599J75024L89339
$$ 1327160 1690674 1561695 1914833 1598980 1921740 1982836 1510838 1472239 1647263 2036602
16876B036602k46128j75273K85806r958P6031j09773J38659j02498J6955m6842
$$ 2036602 1790474 1615201 1901007 1891049 1967080 1857307 1995966 1893468 1910423 1863581
16866A863581L60942k39480L60928m30156k66181L90873j17655K76140k37227
$$ 1863581 2224523 1985043 2345971 1915815 1649634 2040507 1922852 2198992 1961765
16857A961765J60781J33143L84181n80047N23713k41696j03239O74348o62933
$$ 1961765 2122546 2255689 2639870 2059823 2583536 2341840 2238601 2912949 2250016
16848B250016K23890K68451k53127O8445M11822j55844N6038k11200J22947K932
$$ 2250016 2473906 2742357 2489230 2557675 2969497 2813653 2869691 2658491 2781438 2784370
16838B784370J43561J96673q0630P5077p6942L04632k4590n3803K24161l55882
$$ 2784370 2927931 3124604 3043974 3119051 3042109 3346741 3322151 3268348 3492509 3136627
16828C136627N12813j28608j36920K56398O4407J08823j00926j85114L95377q6098
$$ 3136627 3649440 3520832 3383912 3640310 3704717 3813540 3712614 3527500 3922877 3836779
16818C836779O3412M02727k99598M40396k08130Q2048M3608J63384M14423l33314
$$ 3836779 3900191 4302918 4003320 4443716 4235586 4317634 4361242 4524626 4939049 4605735
16808D605735M39528l64999K45165M55683m26659N24401P5571m137J81904q8759
$$ 4605735 5045263 4680264 4925429 5381112 4954453 5478854 5554425 5550288 5732192 5643433
16798E643433N64435k34951K45215J50179J07473J77215K7185j8178N98900k40
$$ 5643433 6207868 5972917 6218132 6368311 6475784 6652999 6680184 6662006 7260906 7260666
16788G260666K03933J54924k16207M15640M35273J16350j97589O34520l65231
$$ 7260666 7464599 7619523 7403316 7818956 8254229 8370579 8172990 8807510 8442279
16779H442279M85104L57777L37102N1569M58627J87314R3275O05662M40012j11721
$$ 8442279 8927383 9285160 9622262 9673831 10132458 10319772 10413047 11018709 11458721 11347000
16769A1347000O10534K00856L79738J68648N21516K82700O67636L36233N45470
$$ 11347000 11957534 12158390 12538128 12706776 13228292 13510992 14178628 14514861 15060331
16760A5060331L98065P27332K46604P84989O31627N12195P59630O48742Q03574
$$ 15060331 15458396 16185728 16432332 17217321 17848948 18361143 19120773 19769515 20573089
16751B0573089Q49966O10624J104452O18860P65290J549417P97835R81174J423145
$$ 20573089 21423055 22033679 23138131 23756991 24522281 26071698 26869533 27850707 29273852
16742B9273852J423905J352445J591878J150518K166600J738367J686258K121311
$$ 29273852 30697757 32050202 33642080 34792598 36959198 38697565 40383823 42505134
16734D2505134K343762K027221K354443L053422K577477L415368L149251L863923
$$ 42505134 44848896 46876117 49230560 52283982 54861459 58276827 61426078 65290001
16726F5290001L905783M082981M467575N046467M871957N680494O109487N935261
$$ 65290001 69195784 73278765 77746340 82792807 87664764 93345258 99454745 105390006
16718A05390006O707855P271162P430577P527943Q150230P920100Q143880Q160468
$$ 105390006 112097861 119369023 126799600 134327543 142477773 150397873 158541753 166702221
16710A66702221P623012P330087P040552O038025M632764L967314K567112J376426
$$ 166702221 174325233 181655320 188695872 194733897 199366661 203333975 205901087 207277513
16702B07277513q93967j134968l032039m290394n046083o328977o888729p360074
$$ 207277513 206383546 205248578 202216539 197926145 192880062 186551085 179662356 172302282
16694A72302282p929431p978340p945013q121988p732068p472530p600970o580304
$$ 172302282 164372851 156394511 148449498 140327510 132595442 125122912 117521942 110941638
16686A10941638o769343o238311n692094n775283n150209m515659m560981m409299
$$ 110941638 104172295 97933984 92241890 86466607 81316398 76800739 72239758 67830459
16678F7830459l890681l859224l804413k619032k752128l247999k204118k588040
$$ 67830459 63939778 60080554 56276141 53657109 50904981 47656982 45452864 42864824
16670D2864824k188746k058192k052308j623196j882218j406632j405802j576132
$$ 42864824 40676078 38617886 36565578 34942382 33060164 31653532 30247730 28671598
16662B8671598j222015q61110j372260q79108j305439q45516j076640m67985q64694
$$ 28671598 27449583 26588473 25216213 24337105 23031666 22186150 21109510 20641525 19776831
16653A9776831o40619o45070q97673o88911p87306m46422n97216k62465m87508
$$ 19776831 19136212 18491142 17593469 16904558 16117252 15670830 15073614 14811149 14323641
16644A4323641o48855k85153o56249l25490m10466k22961m18087m42071n46671
$$ 14323641 13674786 13389633 12733384 12407894 11997428 11774467 11356380 10914309 10367638
16635A0367638j94584k49340j39518k81292j27586m88869n38726j69042J77342
$$ 10367638 10173054 9923714 9784196 9502904 9375318 8886449 8347723 8178681 8356023
16626H356023m67489l33242N3826p2262k11387l57141o2553k70709k06369j19804
$$ 8356023 7888534 7555292 7609118 7536856 7325469 6968328 6905775 6635066 6428697 6308893
16616F308893j86502O6568j50964k5097l96022n2145Q7848k11696l70089j64513
$$ 6308893 6122391 6188959 6037995 6012898 5616876 5564731 5652579 5440883 5070794 4906281
16606D906281O2398J40388l36072M1793o22290P6216R7279k6806P1674m83382
$$ 4906281 4968679 5109067 4772995 4814788 4192498 4268714 4365993 4339187 4410861 3927479
16596C927479K75234o2211l53329j21261J14755m70257K64737M8478k57144k02906
$$ 3927479 4202713 4140502 3787173 3665912 3780667 3310410 3575147 3623625 3366481 3163575
16586C163575L43009j21571k29100M8273k40250j28111L68169l15358k27406m7545
$$ 3163575 3506584 3385013 3155913 3204186 2963936 2835825 3203994 2888636 2661230 2613685
16576B613685L58263q5684n42790N59550j08995m24787J84283k18805j0778j69337
$$ 2613685 2971948 2886264 2343474 2903024 2794029 2369242 2553525 2334720 2323942 2154605
16566B154605K17990K9969j93901L3297k9991M8567k12175K63571j28593j59084
$$ 2154605 2372595 2402564 2208663 2241960 2211969 2260536 2048361 2311932 2183339 2024255
16556B024255k4622J5201k30952J41734j54268N04P7448l31294M46506m29209
$$ 2024255 1999633 2014834 1783882 1925616 1771348 1771852 1849300 1518006 1964512 1535303
16546A535303M70301j98423r1405K00104l38635M97707p41321L89421p0120M3127
$$ 1535303 2005604 1807181 1715776 1915880 1577245 2074952 1333631 1723052 1652932 1696059
16536A696059J12860l58315o3019L83487K15510o32378k95975L07361L2986P9529
$$ 1696059 1808919 1450604 1387585 1771072 1986582 1354204 1058229 1365590 1398576 1478105
16526A478105k7486L8865j9887l01429M11889j79517j71661k49167K81557l7121
$$ 1478105 1450619 1489484 1469597 1168168 1580057 1400540 1228879 979712 1261269 1224148
16516A224148m17477K47821m3258K97182j49381m5697J08901j42196j00958P4764
$$ 1224148 806671 1054492 1011234 1308416 1159035 1113338 1222239 1080043 979085 1053849
16506A053849j085l4614Q7731j3954k4732K44872k34952o6846K42661j19452k98536
$$ 1053849 1052764 1018150 1105881 1091927 1067195 1312067 1077115 1010269 1252930 1133478 834942
16495H34942Q5399q4350L94240j67259j83056m6070P6961j47968L72563m01816
$$ 834942 920341 835991 1230231 1062972 879916 833846 910807 762839 1135402 733586
16485G33586L14147n13817M22667j83612J25215m35917M24931P3680l554k32547
$$ 733586 1047733 533916 956583 772971 898186 462269 887200 960880 957326 724779
16475G24779M682K35414j90291J30997k51813L55805m55469L54025q7890r2437
$$ 724779 729461 964875 774584 905581 653768 1009573 554104 908129 820239 727802
16465G27802J53306j38312j48744q2942K8232L22397O011k72685M2373j42498
$$ 727802 881108 742796 594052 511110 539342 861739 867750 595065 637438 494940
16455D94940J66961j50221p8328j12946K73351J18159j23490L7381L7262J67032
$$ 494940 661901 511680 433352 320406 593757 711916 588426 625807 663069 830101
16445H30101C78951J91482N2472J33557j69367J58871r6597j32623j33383O1595
$$ 830101 378951 570433 622905 756462 587095 745966 649369 516746 383363 444958
16435D44958R818K27223Q7585C60728j04990K51721N4402m5240A46577J78496
$$ 444958 454776 681999 769584 360728 255738 507459 561861 516621 146577 325073
16425C25073J74435M31J71028k34283l4660j49672K70174j63153N9685m7427K68968
$$ 325073 499508 499939 670967 436684 402024 252352 522526 359373 419058 371631 640599
16414F40599j21551q7274A31403J79721P0589K03239j24371H5475C4006J43673
$$ 640599 519048 431774 131403 311124 381713 584952 460581 85475 34006 177679
16404A77679M2903K04519B06425J22150J70568j51101N1323A24935J40823J73731
$$ 177679 220582 425101 206425 328575 499143 348042 399365 124935 265758 439489
16394D39489J7670r1905I6962N1245R6355j01008J48526J39299A04515J50554
$$ 439489 457159 365254 96962 148207 244562 143554 292080 431379 104515 255069
16384B55069J56946m9999J7122J51550j38789J21195k34476J82199j69620J8789
$$ 255069 412015 362016 379138 530688 391899 513094 278618 460817 291197 309986
16374C09986N8985A12956K43029o7552c0367E5692K99400A62719a65430C87905
$$ 309986 368971 112956 355985 288433 -30367 55692 355092 162719 -165430 387905
16363B89986R6332j82821K18202F0677L57236a6446C21132n0607k5016H9110K86416
$$ 289986 386318 203497 421699 60677 417913 -16446 321132 270525 245509 89110 375526
16352C75526j82564b6496C25319n2522k4037P6532R7701j90544R0775j36125J88744
$$ 375526 192962 -26496 325319 272797 248760 325292 422993 232449 323224 187099 375843
16341C75843K1388g8786C67067j46774l933I7082R7632n7424J34754D2702K89531
$$ 375843 397231 -78786 367067 220293 216360 97082 194714 137290 272044 42702 332233
16330C32233A12002R7472J87298b7638C62494F5268Q3447J16236l3412j02595
$$ 332233 112002 209474 396772 -27638 362494 65268 148715 264951 231539 128944
16320A28944J00355B641J99123d5297D26144j52404N0380D5978L41524A90449
$$ 128944 229299 2641 201764 -45297 426144 273740 324120 45978 387502 190449
16309C53123l6533D0469b5018j14129A46262k5879d7541B46451b64782A1528K61397
$$ 353123 316590 40469 -25018 -139147 146262 120383 -47541 246451 -264782 11528 272925
16298B72925q5846L3660J66433b0481A12345e4476A45656o0026L90985j53327
$$ 272925 187079 220739 387172 -20481 112345 -54476 145656 85630 476615 323288
16288C23288A51209j5392K66879B2492R0710L69978k34140J48615A30075M2955
$$ 323288 151209 135817 402696 22492 113202 483180 249040 397655 130075 173030
16278A73030d243A18887R6761D9294b15319D4264K41687j20044o3059P8157K69578
$$ 173030 -4243 118887 215648 49294 -215319 44264 285951 165907 102848 181005 450583
16267D50583A62003b05791A1251K02003J57467j23541H8040h149B60637J70323
$$ 450583 162003 -205791 11251 213254 370721 247180 88040 -8149 260637 430960
16257D30960H8233J18250c8696C92596A70345c8988B6276J26579o2509K04828
$$ 430960 88233 206483 -38696 392596 170345 -38988 26276 152855 90346 295174
16247B95174p1297B1476g5898p0036N2983B40458p7637e953j02582C4562A4507
$$ 295174 223877 21476 -75898 -145934 -92951 240458 162821 -5953 -108535 34562 14507
16235A15937j0556J52544b96083A11103a7816C62675a85001A78412f5436D07718
$$ 115937 105381 257925 -296083 111103 -17816 362675 -185001 178412 -65436 407718
16224C03627j23447a2170m3830l63352F8403e7923C81375G0700J5159L08607A40251
$$ 303627 180180 -12170 -56000 -419352 68403 -57923 381375 70700 85859 394466 140251
16212C60268A28035d315A33072K56058A9206J99850i5161A25976d4000A43401
$$ 360268 128035 -4315 133072 389130 19206 219056 -95161 125976 -44000 143401
16201I9090i8814B19965p5290a56077j41938A33019R2911c95633P9623Q6920I5186
$$ 99090 -98814 219965 144675 -156077 -298015 133019 225930 -395633 -316010 -229090 95186
16189b78122B04386J92391A91698i5184A64843a28294O1636E20258a90346A77750
$$ -278122 204386 396777 191698 -95184 164843 -128294 -66658 520258 -190346 177750
16178A00227J65776n7489p9021l1934K15296o8297i886B72965g307j56051C0662
$$ 100227 266003 208514 129493 97559 312855 244558 -9886 272965 -7307 -163358 30662
16166A0317K2703O2032R3165D7401r943K24344j05258d4238k06827a13233A58576
$$ 10317 33020 95052 188217 47401 37458 261802 156544 -44238 -251065 -113233 158576
16154E6232b65727F297J68094K0418a16589K6504b7317B21768A262a25272j21710
$$ 56232 -265727 6297 174391 194809 -116589 -90085 -27317 221768 1262 -125272 -246982
16143b46982j1149A26212N9940J2400i5029B78819b9710E6546j4725L2948a60960
$$ -246982 -258131 126212 186152 198552 -95029 278819 -29710 56546 41821 74769 -160960
16131a82563h827D6562J71640E4153J13690H120J09308k4932b41275A33602d0132
$$ -182563 -8827 46562 218202 54153 167843 8120 117428 92496 -241275 133602 -40132
16119a30175C6335f751k0004j72705k77232A28716l3985a83176P5232q76k89640
$$ -130175 36335 -6751 -26755 -199460 -476692 128716 94731 -183176 -107944 -108820 -398460
16108c98460P7897I2702N1204L88101B63272a15018D2404g0616A69442c9483A8791
$$ -398460 -320563 92702 143906 532007 263272 -115018 42404 -70616 169442 -39483 18791
16096A66346b22668B3058P9456J44943a35563j07140e19E04861A93060o4122a42491
$$ 166346 -222668 23058 102514 247457 -135563 -242703 -519 504861 193060 128938 -142491
16084b6156A62087L5008g0027A32841a64813A65540f8022I2045J03333F2999a8939
$$ -26156 162087 197095 -70027 132841 -164813 165540 -68022 92045 195378 62999 -18939
16072b89082i6851d8076G8514K3272J14376f116J324l7212a5517C22164h2775
$$ -289082 -96851 -48076 78514 101786 216162 -6116 -4792 -42004 -15517 322164 -82775
16060a36343B66849n4263f4313A24313c10355c044k71752A75389E2260J17618
$$ -136343 266849 212586 -64313 124313 -310355 -3044 -274796 175389 52260 169878
16050A69878j1786j9576c13735a08160j42706A57972G118K54732G1808a71083
$$ 169878 158092 138516 -313735 -108160 -250866 157972 7118 261850 71808 -171083
16039D0818h4228c6087j05653A99947H4277l9616a69819c2014B36878A5488a30495
$$ 40818 -84228 -36087 -141740 199947 84277 44661 -169819 -32014 236878 15488 -130495
16027a92587F0407a45774p265K1824n2527M5801f3303j01397e0760r5036n8745
$$ -192587 60407 -145774 -153039 -131215 -183742 -137941 -63303 -164700 -50760 -145796 -204541
16016b04541i271j59046B36852b88834a09879C67309b75536D84354c4415l6793
$$ -204541 -9271 -168317 236852 -288834 -109879 367309 -275536 484354 -34415 -71208
16006g1208k9125A9087i8188A38474g1368B7146a27132d7605o5515j14992H7588
$$ -71208 -100333 19087 -98188 138474 -71368 27146 -127132 -47605 -113120 -228112 87588
15994A34546J01375g0019G3564J77168c5782l22281B49857b6908C71184a007m17873
$$ 134546 235921 -70019 73564 250732 -35782 -358063 249857 -26908 371184 -1007 -418880
15983d18880A45200a14427d6666p114j41422F2921J12087b53638B36553b01800
$$ -418880 145200 -114427 -46666 -53780 -195202 62921 175008 -253638 236553 -201800
15972I1141J51098a32114A10479a64318A18310R8834m0788m2819B9228b1725j78620
$$ 91141 242239 -132114 110479 -164318 118310 217144 176356 133537 29228 -21725 -200345
15961b00345A78878b80258c9627B9613d3978j46337B1343b47100a11306A90048
$$ -200345 178878 -280258 -39627 29613 -43978 -190315 21343 -247100 -111306 190048
15950a56875b6541A46286J0523h2815l10753i5484o6725A26155n2269l6359c89240
$$ -156875 -26541 146286 156809 -82815 -393568 -95484 -162209 126155 73886 37527 -389240
15938c0516A48874K26698j76779F6391b39608e071l6703p2999M9867c0479A9286
$$ -30516 148874 375572 198793 66391 -239608 -5071 -41774 -114773 -64906 -30479 19286
15926C8550a3321A88262E3942b7344j28336B26991b85906C4664a28354B11462
$$ 38550 -13321 188262 53942 -27344 -155680 226991 -285906 34664 -128354 211462
15915e1874j39491b1661B82576f5030k43228f7190j0835j87814M7358R3705I1490
$$ -51874 -191365 -21661 282576 -65030 -308258 -67190 -78025 -265839 -218481 -124776 91490
15903A8827a41350O5172a004n5551C4662b66400Q7988f397B905J16400C9519b87015
$$ 18827 -141350 -76178 -1004 -56555 34662 -266400 -178412 -6397 2905 119305 39519 -287015
15890C26103a74856A38616c7939A66970a32618G5882B9128C918J63603n1326a13934
$$ 326103 -174856 138616 -37939 166970 -132618 75882 29128 3918 167521 116195 -113934
15878e4093E3166j7048a35629j80322p1415A09963A5998c1180a569I2532k2286
$$ -54093 53166 36118 -135629 -315951 -387366 109963 15998 -31180 -1569 92532 70246
15867G0246g8710j000A59397c2216j39938P6382j24226N5354j72185A21480D6931
$$ 70246 -78710 -79710 159397 -32216 -172154 -95772 -219998 -164644 -336829 121480 46931
15855b18040J01278r8614A46214b10417p9330E5961c13314C5949K6747A6637J8789
$$ -218040 -116762 -215376 146214 -210417 -289747 55961 -313314 35949 62696 16637 35426
15844C5426R7130c47696c5971p8972r950l9007j05529J23924d597G5847f4951
$$ 35426 132556 -347696 -35971 -114943 -124893 -163900 -269429 -145505 -4597 75847 -64951
15832A77674A5315h0223a3864k32354P0772e4309H5582B948J58233b82160l6637
$$ 177674 15315 -80223 -13864 -246218 -175446 -54309 85582 2948 161181 -282160 -318797
15821c18797o950R2064O319l950F2593b76924A08470b5095j03055g716C6469N5254
$$ -318797 -325747 -233683 -227364 -231314 62593 -276924 108470 -25095 -128150 -7716 36469 91723
15809I1723f4436J5781j442m7557D5862a35830e3921a0008j55039r819j51805
$$ 91723 -64436 -48655 -50097 -97654 45862 -135830 -53921 -10008 -165047 -174866 -326671
15798c26671B59219a37416A06991c66397J60020f1066d853B37686c3823m6543
$$ -326671 259219 -137416 106991 -366397 -206377 -61066 -4853 237686 -33823 -80366
15788h0366B56197g1179j96716c5425a4713H1383C4337a52616C523a88553j44007
$$ -80366 256197 -71179 -267895 -35425 -14713 81383 34337 -152616 3523 -188553 -332560
15777c32560c2611j56947C1569b62169A10043A0662K66647a91550Q6629G7950
$$ -332560 -32611 -189558 31569 -262169 110043 10662 277309 -191550 -104921 77950
15766b50884f669m68408d8474A61051o3584A3144N2119a66607J2086C173K29837
$$ -250884 -6669 -475077 -48474 161051 97467 13144 65263 -166607 -154521 3173 233010
15755B33010j03359f4798k22882C33242a93488j92533c0990A18058h080j70849
$$ 233010 129651 -64798 -287680 333242 -193488 -386021 -30990 118058 -8080 -178929
15745a78929e6494p6910B57125D7369f402E3425J00916F1657R5486k7464a18261
$$ -178929 -56494 -133404 257125 47369 -6402 53425 154341 61657 157143 129679 -118261
15733I1817l4820g434B5649g6439A75428b82396D3200O4774a94597j5066k8893
$$ 91817 56997 -7434 25649 -76439 175428 -282396 43200 107974 -194597 -209663 -238556
15722b38556d6733H4420b55769Q9788D770R5469c19848K3156o276A40723J9286
$$ -238556 -46733 84420 -255769 -165981 4770 100239 -319848 -296692 -302968 140723 160009
15711A60009E3637A1516a11190a7827k69194c5114H344a83541M6967K8233E7630
$$ 160009 53637 11516 -111190 -17827 -287021 -35114 8344 -183541 -136574 -108341 57630
15699B72172r394h2105G6037g1213D1253c7904l18771A96759a31600E2506b14887
$$ 272172 262778 -82105 76037 -71213 41253 -37904 -356675 196759 -131600 52506 -214887
15687b48025A15377b93962A55603b6302p2339b9132A53835B963a87543b4320p7713
$$ -248025 115377 -293962 155603 -26302 -98641 -29132 153835 2963 -187543 -24320 -102033
15676a02033C55479H2660K2984q908g4375H38J23117b28486D056M4082e8151K4399
$$ -102033 355479 82660 105644 96736 -74375 838 123955 -228486 4056 48138 -58151 -33752
15664c3752j70259F046b0511j00432L2166j9186N059d821D2164b04224B67472
$$ -33752 -204011 6046 -20511 -120943 -88777 -107963 -102904 -4821 42164 -204224 267472
15652A13461h2466F1149j01a49809k43446a38411p4073f716j8598A22882m52b08653
$$ 113461 -82466 61149 61048 -149809 -393255 -138411 -212484 -6716 -25314 122882 122430 -208653
15639B88579b49238J16777B31998L2327A30077g1451n2130e0411r1898k7396E3845
$$ 288579 -249238 -132461 231998 264325 130077 -71451 -123581 -50411 -142309 -169705 53845
15627d44278e4956o36j65233A84906b36512a5362H8091C310h7645G3541a80012
$$ -444278 -54956 -55592 -220825 184906 -236512 -15362 88091 3310 -87645 73541 -180012
15615g1074A18558C8139J9113g953D3701b7638C19769a01083G0068k5421a07711
$$ -71074 118558 38139 57252 -7953 43701 -27638 319769 -101083 70068 44647 -107711
15603f0608A63360K2528h7695j77830C04905a45722I5956f2323n7640A40254N0008
$$ -60608 163360 185888 -87695 -265525 304905 -145722 95956 -62323 -119963 140254 190262
15592A90262e343m9171k18232M2149f7117j28212B29756f8816j07630B31177a05465
$$ 190262 -5343 -54514 -272746 -230597 -67117 -195329 229756 -68816 -176446 231177 -105465
15580C0731E364a18256G3320b66462C2232g9005l5641c3317I5886a70067B16386
$$ 30731 5364 -118256 73320 -266462 32232 -79005 -114646 -33317 95886 -170067 216386
15568d6937B30237i2323J9999B634a21500E0480a82990j3849j9285B82498a56758
$$ -46937 230237 -92323 -72324 2634 -121500 50480 -182990 -196839 -216124 282498 -156758
15556A10861g6241I9000K9335J20616j14862K6813a29662m1601h3913B59729a40541
$$ 110861 -76241 99000 128335 248951 134089 160902 -129662 -171263 -83913 259729 -140541
15544b7526m7909A01298L6769A6166j95a22351d4780A33410L8723M98m946F3352
$$ -27526 -75435 101298 138067 16166 15971 -122351 -44780 133410 172133 172631 167685 63352
15531A47714n5061P8494G4262a62611G9487b78482a12048L7380A36134J43941
$$ 147714 92653 171147 74262 -162611 79487 -278482 -112048 -74668 136134 280075
15521B80075A23643a79877d6519A41289c63800a65796D4951a25828a6228j75139
$$ 280075 123643 -179877 -46519 141289 -363800 -165796 44951 -125828 -16228 -191367
15511a91367P7923L4863F9375J84952i2707d6263O158l62088A0089B003L06773
$$ -191367 -113444 -78581 69375 254327 -92707 -46263 -40105 -402193 10089 2003 308776
15500C08776a22569B80539j14830h1243k1302o1856j64528i9167l2886d164B26907
$$ 308776 -122569 280539 165709 -81243 -102545 -164401 -328929 -99167 -132053 -4164 226907
15488a91034M6986A29392a56443O9613A93070e0838k9870j69652A82178N206H827
$$ -191034 -144048 129392 -156443 -86830 193070 -50838 -80708 -250360 182178 187384 8827
15476i7305q6057P4484n4143A03330e1743k04901n2665a21574L7376j99059e8387
$$ -97305 -183362 -108878 -163021 103330 -51743 -256644 -309309 -121574 -84198 -283257 -58387
15464b85742A65076b85783f7828D0170a06384E0319d607B07449q4399c0978j76039
$$ -285742 165076 -285783 -67828 40170 -106384 50319 -4607 207449 123050 -30978 -207017
15453b07017M6179F6740J77756b09282A81717M6471G2161g8839B68599D1012R948
$$ -207017 -160838 66740 244496 -209282 181717 228188 72161 -78839 268599 41012 50960
15442E0960K6252J23351O61b17275Q1719J038D6340a12641m0468L4220m5105A44497
$$ 50960 77212 200563 201224 -217275 -135556 -134518 46340 -112641 -153109 -118889 -163994 144497
15429G7837b9297A62448a79247g3688n269k32592a07617j81369H4299A1305b45932
$$ 77837 -29297 162448 -179247 -73688 -78957 -311549 -107617 -288986 84299 11305 -245932
15417D6511P9608h4596M1672p3165B82088A36229g1850K440o3459q065j5054p4087
$$ 46511 126119 -84596 -42924 -116089 282088 136229 -71850 -69410 -132869 -140934 -155988 -230075
15405b30075a2168m0492J2319r6164B7638L0525b07612A63533g3297k49735a45668
$$ -230075 -12168 -52660 -40341 -136505 27638 58163 -207612 163533 -73297 -323032 -145668
15393b0206k15806Q0845g3752K4281E05376i4436N561B71606c923A20666e68838
$$ -20206 -236012 -155167 -73752 -49471 505376 -94436 -88875 271606 -3923 120666 -568838
15381A29756L1030c84739B61762h7583A9226b64093B28628b61825H373b3353C59753
$$ 129756 160786 -384739 261762 -87583 19226 -264093 228628 -261825 8373 -23353 359753
15369A00588c10085b0174D3828a13518B53562I0237f4676A85109a07678H3711
$$ 100588 -310085 -20174 43828 -113518 253562 90237 -64676 185109 -107678 83711
15358B03511d6705F823a8758j59328A849a44197L6483j2867G2582a97100R3816
$$ 203511 -46705 6823 -18758 -178086 1849 -144197 -107714 -120581 72582 -197100 -103284
15347a03284J6399B33900a19734A85905m8901P3361J8446a3530B11687b30275
$$ -103284 -86885 233900 -119734 185905 137004 210365 228811 -13530 211687 -230275
15336B70471M6761b27860A43464D5003E852K48876b98970a37893A6577f431C66725
$$ 270471 317232 -227860 143464 45003 5852 254728 -298970 -137893 16577 -6431 366725
15324A06250c26485c9286B65206c35457A29049R0148l5939i6766l8134B50530
$$ 106250 -326485 -39286 265206 -335457 129049 219197 183258 -96766 -134900 250530
15313B3516J98510a71553D6653B1293g7007E8488J19230j1074a0533o7573D8580
$$ 23516 222026 -171553 46653 21293 -77007 58488 177718 166644 -10533 -78106 48580
15301A36142j1775J7083B5071J3930d8532n6519A87565O4123a09850j59503A183
$$ 136142 124367 141450 25071 39001 -48532 -105051 187565 251688 -109850 -269353 1183
15289H53J8688B544h9824K835B37702C9543d6215B82431b258A79722L8910c40392
$$ 853 19541 2544 -89824 -86989 237702 39543 -46215 282431 -2258 179722 218632 -340392
15276A23518l0275C4204a4593D0823e0400B90693o5594c58419b4059B21564A09411
$$ 123518 93243 34204 -14593 40823 -50400 290693 225099 -358419 -24059 221564 109411
15264A47237b0165H4452c17173i1268n2683A0770L44131A72095a41369d2321A7595
$$ 147237 -20165 84452 -317173 -91268 -143951 10770 354901 172095 -141369 -42321 17595
15252D0207K19828b62740J9272B33869q4001m8380a35441K4742B66424J10307
$$ 40207 260035 -262740 -243468 233869 149868 101488 -135441 -110699 266424 376731
15242C76731a82195A94129o6098C6152a9286D26883o5711L72176K92743R3505
$$ 376731 -182195 194129 128031 36152 -19286 426883 361172 733348 1026091 1119596
15232A119596R795j88271l19462B68463L31374c645J448A67251J09991H0607J00386
$$ 1119596 1129391 941120 621658 268463 599837 -3645 -2197 167251 277242 80607 180993
15221A80993m1973j5357b52070a6672A59353Q8844e6528I2759J28327c13930A53567
$$ 180993 139020 123663 -252070 -16672 159353 248197 -56528 92759 221086 -313930 153567
15209G5535a02383m1464I8304l6169M2518a22935M7922j50693i4608A38813K9764
$$ 75535 -102383 -143847 98304 62135 104653 -122935 -75013 -225706 -94608 138813 168577
15198A68577a37684e0343B72019J0061i8324E8325c6262j04807A42259c31950
$$ 168577 -137684 -50343 272019 282080 -98324 58325 -36262 -141069 142259 -331950
15187D1052J99828E2474J55097D8382K41317J21247A1792K48716H6342a37986
$$ 41052 240880 52474 207571 48382 289699 410946 11792 260508 86342 -137986
15176B25593D0889m861d4282B61907A06289C7855K26520K5254E6473J31785J6276
$$ 225593 40889 36028 -44282 261907 106289 37855 264375 289629 56473 188258 204534
15165B04534g3202A22529M10066B4362a7924q7452j15002A77492A2223J29807
$$ 204534 -73202 122529 532595 24362 -17924 -105376 -220378 177492 12223 142030
15155A42030K37370E0123J95223E5370J30802o6006R9729F8208j5807L9207b9348
$$ 142030 379400 50123 245346 55370 186172 120166 219895 68208 52401 91608 -29348
15143e743j17497A82902D0625P6032a14332a5277A31977c7747G156g4794C64419
$$ -5743 -123240 182902 40625 116657 -114332 -15277 131977 -37747 7156 -74794 364419
15131D1200L2538a6193m9570A78727E8644e0046p2864F7798i0667C99840j02470
$$ 41200 73738 -16193 -65763 178727 58644 -50046 -122910 67798 -90667 399840 297370
15120B97370a36053D5241j9552J2342M2223L75146k25599F1972L59742A77846
$$ 297370 -136053 45241 25689 38031 80254 455400 229801 61972 421714 177846
15109G5709J51949a8477A3481O5815I473K450d7667I1895B1231L44612G7885J57196
$$ 75709 227658 -18477 13481 79296 9473 11923 -47667 91895 21231 365843 77885 235081
15097B35081k5602J71222C8147M13081j97341l5878c6475C11314j01117k9352
$$ 235081 209479 380701 38147 451228 253887 218009 -36475 311314 210197 180845
15087A80845C3179R0888J77910D6290K07195o4927b0720B44827D4906J55905e5187
$$ 180845 33179 124067 301977 46290 253485 188558 -20720 244827 44906 200811 -55187
15075H2512i9483C81554a24759I6048P1567C8284a40596c4196B48710K44649a10046
$$ 82512 -99483 381554 -124759 96048 167615 38284 -140596 -34196 248710 493359 -110046
15063E9220a90310B60481f8660B52742K89159C8927j0053j1918K99838N3000A40010
$$ 59220 -190310 260481 -68660 252742 541901 38927 28874 16956 316794 369794 140010
15051a45085B96376F9357J00541a60385I42K72295F2369Q483L4454J31742k1724
$$ -145085 296376 69357 169898 -160385 942 273237 62369 70852 105306 237048 215324
15040B15324J25714k3482h1413c3817g958A96929Q8514B9692j0760L36847L2901
$$ 215324 341038 317556 -81413 -33817 -7958 196929 285443 29692 18932 355779 388680
15029C88680j47669p7618c8054C00384E6137b7702I4658J92120n1905j06535K74022
$$ 388680 241011 163393 -38054 300384 56137 -27702 94658 286778 234873 128338 402360
15018D02360A51539l4416K4831J408J42044a4625D02212B4120b856B74582j11301
$$ 402360 151539 117123 141954 143362 285406 -14625 402212 24120 -2856 274582 163281
15007A63281A2606J75820l6066a75121E52962a3951C51819j02565o4446e4060
$$ 163281 12606 188426 152360 -175121 552962 -13951 351819 249254 184808 -54060
14996A62975n8318R1001b7898A0550R7842a1690A01990j9198b61893a10015C39163
$$ 162975 104657 195658 -27898 10550 108392 -11690 101990 82792 -261893 -110015 339163
14984D46199A49280p3899a00312L9358B92750A23951K87780J28744A72233R0593
$$ 446199 149280 75381 -100312 -60954 292750 123951 411731 540475 172233 262826
14974B62826l5522b08316B2503K77096A34598K75915j54262b8855C14464A4446
$$ 262826 227304 -208316 22503 299599 134598 410513 256251 -28855 314464 14446
14963C26222A17272K7982J39866A09213O0216n6083J21562B9444P1585K23077
$$ 326222 117272 145254 285120 109213 169429 113346 234908 29444 101029 324106
14953C24106D0570K68317m745m029n7805p3618P7083c4918B72744A21048j9281
$$ 324106 40570 308887 304142 300113 242308 168690 245773 -34918 272744 121048 101767
14942A01767Q6080m335N57272C11743M0015L49453B07024J67923J00035B01728
$$ 101767 187847 183512 740784 311743 351758 701211 207024 374947 474982 201728
14931E66375A79096n4257h8099A79078M4240J00446D8106K02666d3634E29856
$$ 566375 179096 124839 -88099 179078 223318 323764 48106 250772 -43634 529856
14920B93571L21104k63622a9648C23372r1965j0178J71734J8986L0604K0421k00616
$$ 293571 614675 351053 -19648 323372 231407 221229 392963 411949 442553 462974 262358
14909B62358L0375m4738l877j20942Q6840J35731q0384r9974k8358K47656l3090
$$ 262358 292733 247995 244118 123176 210016 345747 265363 165389 137031 384687 351597
14898C51597O2883M781p1239R5206N9178j17584J21462A6890b0070F07728A01865
$$ 351597 414480 419261 348022 443228 502406 384822 506284 16890 -20070 607728 101865
14886B35652L44628A69590K79860j56205M5387r1894j10261J93534J85687p8953
$$ 235652 580280 169590 449450 293245 338632 246738 136477 330011 515698 436745
14876D36745Q333k0215J4464j29973o2846n7777A1435M92761J58563k23157k00218
$$ 436745 445078 424863 439327 309354 246508 188731 11435 504196 662759 439602 239384
14865B39384H3576P1925K99276k03364L72627k71269K22258A47217K93581A18884
$$ 239384 83576 155501 454777 251413 624040 352771 575029 147217 440798 118884
14854F53736j62565j96871N2427M8384q233j0686n2807j35002M70920k87535A09656
$$ 653736 491171 294300 346727 395111 386878 376192 323385 188383 659303 371768 109656
14842A23284M13321B61832C0971K29958M38640B18549K52082J33550B03339L60393
$$ 123284 536605 261832 30971 260929 699569 218549 470631 604181 203339 563732
14832E63732k74804J71352p8207J22284K03154C05038J90105J55317q9366L01187
$$ 563732 288928 460280 382073 504357 707511 305038 495143 650460 561094 862281
14822H62281l96762j33976L02035k25800J64182B20801K88403J29075J8171l5691
$$ 862281 465519 331543 633578 407778 571960 220801 509204 638279 656450 620759
14812F20759B24412L1350K02257n6622L06527j83256K05512H1028L00670j59982
$$ 620759 224412 255762 458019 401397 707924 524668 730180 81028 381698 221716
14802B21716K85606K34093j91101k26616J00524o8005j1988L23618M2644r9453
$$ 221716 507322 741415 550314 323698 424222 356217 344229 667847 710491 611038
14792F11038A93413J0485N22806C11477R3583J03234K11171j24270k78763J76868
$$ 611038 193413 203898 726704 311477 405060 508294 719465 595195 316432 493300
14782D93300k31326K50238J08088k09441K93941o818j65146J35621k80086L10945
$$ 493300 261974 512212 620300 410859 704800 697982 532836 668457 388371 699316
14772F99316k63428L30604p1636m8620J25168k00455n5732o1785L07647o8209
$$ 699316 435888 766492 694856 646236 771404 570949 515217 453432 761079 692870
14762F92870j32968p5591Q2976M20122m16959J60823l50526M80713j68994k16427
$$ 692870 559902 484311 567287 987409 570450 731273 380747 861460 692466 476039
14752D76039J82620J89517j39590C08858L11373J43378l81616J28821L37076k8965
$$ 476039 658659 848176 708586 308858 620231 763609 381993 510814 847890 818925
14742H18925j52661O7017l14678J09914J49436J49913L6554k61930j98005K86649
$$ 818925 666264 733281 418603 528517 677953 827866 864420 602490 404485 691134
14732F91134J11877N3203l70534K07050K9403K63000j55939l9980n1131m0626
$$ 691134 803011 856214 485680 692730 722133 985133 829194 789214 738083 697457
14722F97457R7114l58205L58612B08158N80316j90929Q3165J92822k54456K50891
$$ 697457 794571 436366 794978 208158 788474 597545 680710 873532 619076 869967
14712H69967l93161l4252M53365K26380k68757J14128k29144J78418m38114O64930
$$ 869967 476806 442554 895919 1122299 853542 967670 738526 916944 478830 1143760
14702A143760B73421K83097O4320J96639L47557n23995M52656n21796K92585l58930
$$ 1143760 273421 556518 620838 817477 1165034 641039 1093695 571899 864484 505554
14692E05554J81860K40703j86535j43134L42038l80479L81778O427L9795k99213
$$ 505554 687414 928117 741582 598448 940486 560007 941785 948212 988007 688794
14682F88794r1121K59602K6701J79311m31393L46404j08365M54555k58991o0479
$$ 688794 597673 857275 883976 1063287 631894 978298 869933 1324488 1065497 1005018
14672A005018j05550J20032j12603j03239M7044k4119l2277K18679O1335l136
$$ 1005018 899468 1019500 906897 803658 850702 826583 794306 1012985 1074320 1071184
14662A071184o84n1029R6880m34513K17950L21484j23156R852j1575L1532q5390
$$ 1071184 1070500 1019471 1116351 681838 899788 1221272 1098116 1107968 1096393 1127925 1042535
14651A042535K39147k23331k16221J80579K0393L21899l89798L07688K3228r6876
$$ 1042535 1281682 1058351 842130 1022709 1043102 1365001 975203 1282891 1306119 1209243
14641A209243N8565n31608M31740K49869k83272j166j09724j04274O31997k04208
$$ 1209243 1267808 736200 1167940 1417809 1134537 1133371 1023647 919373 1551370 1347162
14631A347162k96238J27963k08821M74686K469l87146L98137k29606L7669J0500
$$ 1347162 1050924 1178887 970066 1444752 1447221 1060075 1458212 1228606 1266275 1276775
14621A276775j77049K07387Q831J69824j46054j2702j90181K75102J66689j71036
$$ 1276775 1099726 1307113 1315944 1485768 1339714 1327012 1136831 1411933 1578622 1407586
14611A407586j75715K12693j86672K80187R8490J24649m07196l4003J74719K45090
$$ 1407586 1231871 1444564 1257892 1538079 1636569 1761218 1354022 1320019 1494738 1739828
14601A739828j80956P8919J62672J2954j87036j99393J89735j15316K8407J57083
$$ 1739828 1558872 1637791 1800463 1813417 1626381 1426988 1616723 1501407 1529814 1686897
14591A686897J01784P8010k31323J15950j41719K20359j51203p5900j0373L55320
$$ 1686897 1788681 1866691 1635368 1751318 1609599 1829958 1678755 1602855 1592482 1947802
14581A947802k28777J20984K703M5709l5810Q8821j22403L46340m38223K66534
$$ 1947802 1719025 1840009 1842712 1888421 1852611 1941432 1819029 2165369 1727146 1993680
14571A993680k25416L24630k28831j15613j00519K64598J35061L93128l46484
$$ 1993680 1768264 2092894 1864063 1748450 1647931 1912529 2047590 2440718 2094234
14562B094234n5191k84644L52085L89383k50006j65892K20452j07485K07342p1375
$$ 2094234 2039043 1754399 2106484 2495867 2245861 2079969 2300421 2192936 2400278 2328903
14552B328903K81735k13576j90679L62801K65334M9292J00864J4691K4987K27675
$$ 2328903 2610638 2397062 2206383 2569184 2834518 2883810 2984674 2999365 3024352 3252027
14542C252027O1344K8212N46010N09067J56829K28137J128589J254793K118613
$$ 3252027 3313371 3341583 3887593 4396660 4553489 4781626 5910215 7165008 9283621
14533I283621L102137N799164R940497K918356q678590p436463m927187k803109
$$ 9283621 12385758 18184922 28125419 31043775 22365185 14928722 10001535 7198426
14525G198426j937859r54710q09723p17001m7909J72025m43170K10097q4042P3147
$$ 7198426 5260567 4305857 3496134 2779133 2731224 2903249 2460079 2670176 2586134 2659281
14515B659281j84634P3010J92200o19169J71548L02748J77055l76601L70527k40088
$$ 2659281 2474647 2547657 2739857 2120688 2292236 2594984 2772039 2395438 2765965 2525877
14505B525877k869j47661R389M92936j03930o6304M5192J31737j80688L17732
$$ 2525877 2523008 2375347 2384736 2877672 2773742 2707438 2752630 2884367 2703679 3021411
14495C021411K04956m26376k07074M90967o2102O2936j33878K42201N7037r3198
$$ 3021411 3226367 2799991 2592917 3083884 3021782 3084718 2950840 3193041 3250078 3156880
14485C156880p3201J83143p2899j48915N69654m85519L32780J76389m27748K30846
$$ 3156880 3083679 3266822 3193923 3045008 3614662 3129143 3461923 3638312 3210564 3441410
14475C441410L38590j83889k9799L09682j66005l936K83650n1977m9804J55892
$$ 3441410 3780000 3596111 3566312 3875994 3709989 3706053 3989703 3937726 3887922 4043814
14465D043814j31845J50527j16709K74664j15109J57498O7641L19287n99268M02566
$$ 4043814 3911969 4062496 3945787 4220451 4105342 4262840 4330481 4649768 4050500 4453066
14455D453066R8185j13652K68540l16980O29274m58407O80198l86516o9521R0255
$$ 4453066 4551251 4437599 4706139 4389159 5018433 4560026 5240224 4853708 4784187 4874442
14445D874442m9019k93178M11601L85137l8416l37560O31700o44630P73745l66664
$$ 4874442 4825423 4532245 4943846 5328983 5290567 4953007 5584707 4940077 5713822 5347158
14435E347158K44241N7393R7648k0160L23230j30183J21147k80937O54549k71506
$$ 5347158 5591399 5648792 5746440 5726280 6049510 5919327 6040474 5759537 6414086 6142580
14425F142580J99492K81222j13330J68359j08753J46265O1235M3423K73701m22322
$$ 6142580 6342072 6623294 6509964 6678323 6569570 6715835 6777070 6820493 7094194 6671872
14415F671872K33845K61961M85746l2985k52018p4170N85998k17560L16429K0515
$$ 6671872 6905717 7167678 7653424 7620439 7368421 7294251 7880249 7662689 7979118 7999633
14405G999633K64163J84878o9815M96884p60107O85216O967L39606K70670j62295
$$ 7999633 8263796 8448674 8378859 8875743 8115636 8800852 8807819 9147425 9418095 9255800
14395I255800J20597l4622O65674j76698M88794K629n5412K04225J66643K63845
$$ 9255800 9376397 9341775 10007449 9830751 10319545 10322174 10266762 10470987 10637630 10901475
14385A0901475l2626N22095J93634m3644P436L73478Q7945M17455J66982L06771
$$ 10901475 10868849 11390944 11584578 11540934 11548370 11921848 12009793 12427248 12594230 12901001
14375A2901001q7659L91463M67667N5257J57842J50485N01559M0652K92804J97428
$$ 12901001 12813342 13204805 13672472 13727729 13885571 14036056 14537615 14578267 14871071 15068499
14365A5068499J78000M05746N20027M39240K89397L30335n4955K70133O13680
$$ 15068499 15246499 15652245 16172272 16611512 16900909 17231244 17176289 17446422 18060102
14356A8060102L45676L39633N21204L56585O87006L20043K28448M13856J35648
$$ 18060102 18405778 18745411 19266615 19623200 20310206 20630249 20858697 21272553 21408201
14347B1408201N74079N83457J95460P63625K68375R42936P54777L80390R46084
$$ 21408201 21982280 22565737 22761197 23524822 23793197 24736133 25490910 25871300 26817384
14338B6817384N66972M5539J110772N24649O37511Q14299R49563N81492J135427
$$ 26817384 27384356 27429895 28540667 29065316 29702827 30517126 31466689 32048181 33183608
14329C3183608N03834J213164J036637M47044J230887Q58144J146763J149893
$$ 33183608 33687442 34900606 35937243 36384287 37615174 38473318 39620081 40769974
14321D0769974J380951Q26577J672795P41495J803208J518002J337508J680688
$$ 40769974 42150925 42977502 44650297 45391792 47195000 48713002 50050510 51731198
14313E1731198J594843J642726J679905J772698K046977K594217J524949K648356
$$ 51731198 53326041 54968767 56648672 58421370 60468347 63062564 64587513 67235869
14305F7235869K398547K275042K828601K656857K943780L348890L181940L503248
$$ 67235869 69634416 71909458 74738059 77394916 80338696 83687586 86869526 90372774
14297I0372774L256200M099464M115498M295400M420984M499426N144241N464461
$$ 90372774 93628974 97728438 101843936 106139336 110560320 115059746 120203987 125668448
14289A25668448N842931N672119O303222O821354O898954P746323P889032Q266154
$$ 125668448 131511379 137183498 143486720 150308074 157207028 164953351 172842383 181108537
14281A81108537Q675922R324294R761975J0415271J1057791J1897610J2083868
$$ 181108537 189784459 199108753 208870728 219285999 230343790 242241400 254325268
14274B54325268J2286201J3520111J3836290J4589486J4568262J4519064J4348560
$$ 254325268 266611469 280131580 293967870 308557356 323125618 337644682 351993242
14267C51993242J4226804J3879917J3095617J2245751J1205304J0476375R319341
$$ 351993242 366220046 380099963 393195580 405441331 416646635 427123010 436442351
14260D36442351P803826P080188M854563K404106J548488L288m916300o022359
$$ 436442351 444246177 451326365 456180928 458585034 460133522 460136810 455220510 449198151
14252D49198151n087799n424991p020772q932743j0809481j1937778j2483040
$$ 449198151 444110352 438685361 431664589 422731846 411922365 399984587 387501547
14245C87501547j2729488j3235399j3516308j3522806j3018832j3656248j2794830
$$ 387501547 374772059 361536660 348020352 334497546 321478714 307822466 295027636
14238B95027636j2658750j2349751j1836290j1840092j0752088j1047647j0340063
$$ 295027636 282368886 270019135 258182845 246342753 235590665 224543018 214202955
14231B14202955j0699797r931204r674237r379293q505909p545210p691988p075280
$$ 214202955 203503158 193571954 183897717 174518424 166012515 158467305 150775317 143700037
14223A43700037o684582n720802n869276n518328n050993n254394l552976m571478
$$ 143700037 137015455 131294653 125425377 119907049 114856056 109601662 106048686 101477208
14215A01477208m219484l844893l852321l052332l603094l158064k847204k909062
$$ 101477208 97257724 93412831 89560510 86508178 82905084 79747020 76899816 73990754
14207G3990754k621644k515668j976045k735122k048079j837718k028379j612418
$$ 73990754 71369110 68853442 66877397 64142275 62094196 60256478 58228099 56615681
14199E6615681j873230j752956j739364j255552j697354j240980j521956j159825
$$ 56615681 54742451 52989495 51250131 49994579 48297225 47056245 45534289 44374464
14191D4374464j139267j233249q97020j594329q44189j122361o70313j060319
$$ 44374464 43235197 42001948 41104928 39510599 38666410 37544049 36873736 35813417
14183C5813417j146962p70313r63464r49318l98389q03908q81508o30779j078905
$$ 35813417 34666455 33896142 32932678 31983360 31584971 30781063 29899555 29268776 28189871
14174B8189871k51372q10863l72910p82344q01836q23431l32166n39339l05892
$$ 28189871 27938499 27127636 26754726 25972382 25170546 24347115 24014949 23475610 23169718
14165B3169718n10830m42312l96175j055809j65983l27803k79331o96863o3580
$$ 23169718 22658888 22216576 21820401 20764592 20598609 20270806 19991475 19294612 19231032
14156A9231032l63669p29756k79432J6990n93417J3367m49893n58507J0326m10775
$$ 19231032 18867363 18137607 17858175 17875165 17281748 17295115 16845222 16286715 16297041 15886266
14146A5886266l40469o1051l59129n06587j20490l56140k98295l18264R6798l98722
$$ 15886266 15545797 15484746 15125617 14619030 14498540 14142400 13844105 13525841 13622639 13223917
14136A3223917R2862m31649j93686j94843k3198m98819j76104J62663o37987K89483
$$ 13223917 13316779 12885130 12691444 12496601 12473403 11974584 11798480 11961143 11323156 11612639
14126A1612639k76752l68337o199j23586j30121l76716k14686l8069P9917k95363
$$ 11612639 11335887 10967550 10961351 10837765 10707644 10330928 10116242 10078173 10158090 9862727
14116I862727l74099J82343j51141l03659L0810k25007r2714j30810J46189m34428
$$ 9862727 9488628 9670971 9519830 9216171 9246981 9021974 8929260 8798450 8944639 8510211
14106H510211l6942j00769n8157M9565n94844j84522K09544K06705l61516j64619
$$ 8510211 8473269 8372500 8314343 8363908 7769064 7584542 7794086 8000791 7639275 7474656
14096G474656j67011K51103o006k50463j42383J68833m59815J32456n1486j63473
$$ 7474656 7307645 7558748 7552742 7302279 7159896 7328729 6868914 7001370 6949884 6786411
14086F786411k02636k0099Q5135n58131K3457N3664j15843K811k06284j1610q7166
$$ 6786411 6583775 6563676 6648811 6090680 6114137 6167801 6051958 6054769 5848485 5836875 5749709
14075E749709K83108l09800j22l2745l18831L651K12651k65303Q6469k48572j46349
$$ 5749709 6032817 5723017 5722895 5690150 5371319 5374970 5587621 5322318 5408787 5160215 5013866
14064E013866r8132J86987k87587K83734k27977J39192l2269k20429j65384P5926
$$ 5013866 4915734 5102721 4815134 5098868 4870891 5010083 4977814 4757385 4592001 4667927
14054D667927l17080J90610j40468J00846o3786j80495J47822j19036j29965K55467
$$ 4667927 4350847 4541457 4400989 4501835 4438049 4257554 4405376 4286340 4156375 4411842
14044D411842k39051L41736m538l01905J17296q1145o3721k58694m8260J29416
$$ 4411842 4172791 4514527 4509989 4208084 4325380 4244235 4180514 3921820 3873560 4002976
14034D002976O0814K05069k77906m52119K66134j06994r5827K0163j20757k0674
$$ 4002976 4063790 4268859 3990953 3538834 3804968 3697974 3602147 3622310 3501553 3480879
14024C480879j36220J03375j20025J71724j01026Q5839p182k56374J30563j92267
$$ 3480879 3344659 3448034 3328009 3499733 3398707 3484546 3477364 3220990 3351553 3159286
14014C159286P1530K86937k58554j30614p7043j5309J24524j81915M4656O7128
$$ 3159286 3230816 3517753 3259199 3128585 3051542 3036233 3160757 2978842 3023498 3090626
14004C090626L1889l08581j79304M53599j64853k75430J70763l41452k1466J15242
$$ 3090626 3122515 2813934 2634630 3088229 2923376 2647946 2818709 2477257 2455791 2571033
13994B571033K1333j47976J09542J80216p3415o10612J62952M82000l28702p0580
$$ 2571033 2592366 2444390 2553932 2734148 2660733 2050121 2213073 2695073 2366371 2295791
13984B295791K68356j3783M5400P2114k39267M802O42584J78550L31580O49459
$$ 2295791 2564147 2550364 2595764 2667878 2428611 2433413 3075997 3254547 3586127 4235586
13974D235586J437211L041010M379245R408483P344832o117106o178603m664178
$$ 4235586 5672797 8713807 13093052 22501535 29846367 23729261 17550658 12886480
13966A2886480l158410j965502j765843r35937o17741k44969k74636o22263K8176
$$ 12886480 9728070 7762568 5996725 5060788 4443047 4198078 3923442 3301179 3329355
13957C329355k28825j14559P7809j9617m33826K27175n5946l04656J43591l35939
$$ 3329355 3100530 2985971 3063780 3044163 2610337 2837512 2781566 2476910 2620501 2284562
13947B284562n7540K76175n7225j20783N8706k63826L7731k08914J41844j4663
$$ 2284562 2227022 2503197 2445972 2325189 2383895 2120069 2157800 1948886 2090730 2076067
13937B076067J55087m45474R0577q7731L3449K47718k03617j0286o5136J48496
$$ 2076067 2231154 1785680 1876257 1788526 1821975 2069693 1866076 1855790 1790654 1939150
13927A939150k68716L10208l71176K63191k72573L57580K1985l21205K88772l28388
$$ 1939150 1670434 1980642 1609466 1872657 1600084 1957664 1979649 1658444 1947216 1618828
13917A618828O7601J25715K29423l04609r8279j8945m2427j40816K79329K54050
$$ 1618828 1686429 1812144 2041567 1736958 1638679 1619734 1577307 1436491 1715820 1969870
13907A969870m84746k27375M31787L08769k43833j37031J49389l90338J96547
$$ 1969870 1485124 1257749 1689536 1998305 1754472 1617441 1766830 1376492 1573039
13898A573039j00485j03911O08175l67946J8527j5748l1852K59220l91186k1212
$$ 1573039 1472554 1368643 1976818 1608872 1627399 1611651 1579799 1839019 1447833 1426621
13888A426621J02735n42828L60573L7780J07971j68419k18358L55008j60858L02401
$$ 1426621 1529356 986528 1347101 1384881 1492852 1324433 1106075 1461083 1300225 1602626
13878A602626J00011j15666l47812J61296J82925l27362N23923o12459K61410
$$ 1602626 1702637 1586971 1239159 1400455 1583380 1256018 1779941 1167482 1428892
13869A428892p4799P0821l148r3452L5512m59233L44755J36307r9281l1079L99317
$$ 1428892 1354093 1424914 1421766 1328314 1363826 904593 1249348 1385655 1286374 1255295 1654612
13858A654612n56278K73102k00396r7409K68906J68970l30003Q6783m4845J70651
$$ 1654612 1098334 1371436 1171040 1073631 1342537 1511507 1181504 1268287 1223442 1394093
13848A394093k04070r8044K5873J69362r0320j41023N89677p18471K87662k30344
$$ 1394093 1190023 1091979 1117852 1287214 1196894 1055871 1645548 927077 1214739 984395
13838I84395J53157M2553n53617O45894k87174L17954K7445j77146k35313K20900
$$ 984395 1137552 1180105 626488 1272382 985208 1303162 1330607 1153461 918148 1139048
13828A139048K23758l54265J92145r9809K1753p7762J1923K91444l38553J13022
$$ 1139048 1362806 1008541 1200686 1100877 1122630 1044868 1056791 1348235 1009682 1122704
13818A122704j65351L59212j32183K21541l18026K59918k96934l7189j96397K0948
$$ 1122704 957353 1316565 1184382 1405923 1087897 1347815 1050881 1013692 817295 838243
13808H38243L9951N3755l00561M30115j70086n7934J71352L7479k44574L45446
$$ 838243 878194 931949 631388 1061503 891417 833483 1004835 1042314 797740 1143186
13798A143186j16454j646J0233k34283k4878K37689m16741M25654k84643J28039
$$ 1143186 1026732 1025086 1035319 801036 776158 1013847 597106 1022760 738117 866156
13788H66156j66618J83835p9999j38000J6066k50853J85860K10359P8075k44458
$$ 866156 699538 883373 803374 665374 681440 430587 616447 826806 904881 660423
13778F60423K41701j83715J87782m5366C82816N69608l61164P2985J98084j23919
$$ 660423 902124 718409 906191 860825 382816 952424 591260 664245 862329 738410
13768G38410K54883k7798k63196K23953l20063j96381N26320k75076q7489K05769
$$ 738410 993293 965495 702299 926252 606189 409808 936128 661052 573563 779332
13758G79332j56611L29964l73869j41670M72979l01430J35121q4645j44354L68559
$$ 779332 622721 952685 578816 437146 910125 608695 743816 659171 514817 883376
13748H83376l83514J78273J19178n9792n8375j26266j0458K85471Q9453k00635
$$ 883376 499862 678135 797313 737521 679146 552880 542422 827893 917346 716711
13738G16711l17997M85157k67968L61591O177l46829K30179j76150J21721P352
$$ 716711 398714 883871 615903 977494 983671 636842 867021 690871 812592 819944
13728H19944J35347n6447l41033K71991k99674K07854m3723k26233L8313m7251
$$ 819944 955291 898844 557811 829802 530128 737982 694259 468026 506339 459088
13718D59088k13140L10482k2517M0617K48341k97986K51930j55320L28175l88688
$$ 459088 245948 556430 533913 574530 822871 524885 776815 621495 949670 560982
13708E60982J16155J30414j66992L06324B93253K15761j373J21644j85513R2953
$$ 560982 677137 807551 640559 946883 293253 509014 507641 629285 443772 536725
13698E36725P3934r0030J01280R5913o7439q0643j90444J65048m5178K07818j72018
$$ 536725 610659 520629 621909 717822 650383 569740 379296 544344 499166 706984 534966
13687E34966L7967B48230K92244J67954K7430k94983j99422J41401O4537J48973
$$ 534966 572933 248230 540474 708428 735858 440875 241453 382854 447391 596364
13677E96364k57882K70307R8137k52524O1323J15274l03556M03198O446k06795
$$ 596364 338482 608789 706926 454402 515725 630999 327443 730641 737087 530292
13667E30292K73105k37713o9072k08827P8499k1685L52636j9517o8330B73238
$$ 530292 803397 565684 496612 287785 366284 344599 697235 677718 609388 273238
13656B22466K16980M30939C80291M20551l87030j85307J75672j01460K19983k4314
$$ 222466 439446 870385 380291 800842 413812 228505 404177 302717 522700 498386
13646D98386J05235O9863j29624Q5835Q1214o0544C23169m9285K90540B73507
$$ 498386 603621 673484 543860 629695 710909 650365 323169 273884 564424 273507
13635B13798M41811j56569o0920K18997j85043k16740L39697n5419k23996J90014
$$ 213798 655609 499040 438120 657117 472074 255334 595031 539612 315616 505630
13625E05630j33805J66867j53123p8351O80770m73325l4021K24758C14496K83434
$$ 505630 371825 538692 385569 307218 987988 514663 480642 705400 314496 597930
13615E97930B85665L24311k54243o1850J45570r1656M41660H6386J23567L41729
$$ 597930 285665 609976 355733 293883 439453 347797 789457 86386 209953 551682
13605E51682A76823m9106N075L64206j63243J9725Q4281j44625K14656j82935
$$ 551682 176823 127717 132792 496998 333755 353480 437761 293136 507792 324857
13595C24857J48422H1042L59737j06119j28625P6817K75787k64562O3184A54682
$$ 324857 473279 81042 440779 334660 206035 282852 558639 294077 357261 154682
13584B93017L17217j09763L692K9467k07935L4563o982j42772P1536l158J84939
$$ 293017 610234 500471 504163 533630 325695 360258 353276 210504 282040 278882 463821
13573D63821j63429J44980j08465m9707r4560N70544l20122A87424J49857J42190
$$ 463821 300392 445372 336907 287200 192640 763184 443062 187424 337281 479471
13563D79471A00020K13004J18923j71198K25010P2430B67406L04190l7385G3322
$$ 479471 100020 313024 431947 260749 485759 558189 267406 571596 534211 73322
13552D32040L40758B31754k7779J00907N7666k9977m7831e0562F9236M24715j78624
$$ 432040 772798 231754 203975 304882 362548 332571 284740 -50562 69236 493951 315327
13541C15327J33683M1286j95195q6163J81345J49616A21300L46260G0149J83741
$$ 315327 449010 490296 295101 208938 390283 539899 121300 467560 70149 253890
13531B53890L6450L61887B43814o4172L82339B56256J41113r1402J7481M95967
$$ 253890 290340 652227 243814 179642 561981 256256 397369 305967 323448 819415
13521H19415l02402M74k12953p7577j04952L34993B25905K15305j28194J38223
$$ 819415 517013 517487 304534 226957 122005 456998 225905 441210 313016 451239
13511D51239p9336j07580R4424j67939K9540M0525K88468B69740j9205K10799
$$ 451239 371903 264323 358747 190808 220348 260873 549341 269740 250535 461334
13501D61334A56806O0943J41807p1293r4351o4192L8646J16554P0128j55105E7351
$$ 461334 156806 217749 359556 288263 193912 129720 168366 284920 355048 199943 57351
13489C13931o9948H0709N08630j42330k21576J71234A54091r115L18656a34829
$$ 313931 243983 80709 589339 447009 225433 396667 154091 144976 463632 -134829
13478B07538J83299m3416j20263K29042Q3124k67689A05126K51633K93677H1441
$$ 207538 390837 347421 227158 456200 539324 271635 105126 356759 650436 81441
13467B76354J11407P9208O0086j10991A77229G7041J06993K72627r6567J60874
$$ 276354 387761 466969 527055 416064 177229 77041 184034 456661 360094 520968
13457E20968I1471K19779L98957B5110L82080A56043J25819E8993M2237l720J95129
$$ 520968 91471 311250 710207 25110 407190 156043 281862 58993 101230 97510 292639
13446B92639f9504C94782r3790K37593N9155j90113j74465J25019j06330q8174
$$ 292639 -69504 394782 300992 538585 597740 407627 233162 358181 251851 163677
13436A63677F7859J50384J14750j40147J61807j8522j47583j3671J80982A17573
$$ 163677 67859 218243 332993 192846 354653 336131 188548 174877 355859 117573
13425B33567N3734K25985k8794B39116L08681j98327E8723O5807a13196D2732
$$ 233567 287301 513286 484492 239116 547797 349470 58723 124530 -113196 42732
13414C05557j01850L3317g0325c3853A4746N2047f6381G0061a40996B68596K9195
$$ 305557 203707 237024 -70325 -33853 14746 66793 -66381 70061 -140996 268596 297791
13403B97791A26355K41540o5775j6520J91824j91288B6498M68883E5166K46453
$$ 297791 126355 367895 302120 285600 477424 286136 26498 495381 55166 301619
13393C01619R5875l5820J07914E628P4519K68638j2053d8884B98262J25841j49848
$$ 301619 397494 361674 469588 5628 80147 348785 336732 -48884 298262 424103 274255
13382B74255M6136j1804h302D64652d5356r1912D68604A44167P2617L80581B49279
$$ 274255 320391 308587 -8302 464652 -45356 -137268 468604 144167 216784 597365 249279
13370B60021J23419A6943L04181j15073J18188a4780A87147m9755J09609J1633
$$ 260021 383440 16943 321124 206051 324239 -14780 187147 137392 247001 258634
13360B58634A24313P6593g5638D37453g7094A76362K04917j53525l580K51606
$$ 258634 124313 200906 -75638 437453 -77094 176362 381279 227754 224174 475780
13350D75780L5362j58245F2057B1737J4082M7165J67674F2540J14929K42980j36052
$$ 475780 511142 352897 62057 21737 35819 82984 250658 62540 177469 420449 284397
13339B84397j21782G4916J42519M0265O7030J93984h9146C45566j55899Q2306
$$ 284397 162615 74916 217435 257700 324730 518714 -89146 345566 189667 271973
13329B71973M2481o1654J71382j24120p1263K22366j56205L8067j59906L3766
$$ 271973 314454 252800 424182 300062 228799 451165 294960 333027 173121 206887
13319B06887J20272r901A16825Q6007a0595B97687J1794J41285E6595K56407m1531
$$ 206887 327159 317258 116825 202832 -10595 297687 309481 450766 56595 313002 271471
13308B71471K4769A30985k0176J72515j993j6355N1079A40129J83589P890p9912
$$ 271471 296240 130985 110809 283324 281331 264976 316055 140129 323718 331608 251696
13297B51696L33003E4305J13290J95841p7203A26539E6878J04662N8052J0237
$$ 251696 584699 54305 167595 363436 286233 126539 56878 161540 219592 229829
13287B29829q7407a28628D51415G5311J4824C9918Q8024J94272i1674A49270F0676
$$ 229829 142422 -128628 451415 75311 90135 39918 127942 322214 -91674 149270 60676
13275a1660C8229f385j08174d0719B55815F8653H076a183B62563A20000A0884
$$ -11660 38229 -6385 -114559 -40719 255815 68653 8076 -1183 262563 120000 10884
13263G7684i6331C11021j13404j2440K83318F5298M3767a42783J4237A08319c28486
$$ 77684 -96331 311021 197617 185177 468495 65298 109065 -142783 -128546 108319 -328486
13251I7347K38891b42808B55632M3979A24130J09971j08238J24351d3555E3220
$$ 97347 336238 -242808 255632 299611 124130 234101 125863 250214 -43555 53220
13240B41946M0791a7464I3676B3355Q8025C8387Q1694Q9792K01228A93510J53128
$$ 241946 282737 -17464 93676 23355 111380 38387 120081 209873 411101 193510 346638
13229C46638j68019a49687D5453L9119L1993a47294C87893J39799A82923D6890
$$ 346638 178619 -149687 45453 84572 116565 -147294 387893 527692 182923 46890
13218B02444B4147H083b54472E33282G6394M9177d0309E6298Q1986B6304J07030
$$ 202444 24147 8083 -254472 533282 76394 125571 -40309 56298 138284 26304 133334
13207A33334F6236H687a94301B07196d1033j60634B5491J96596a09807A60304
$$ 133334 66236 8687 -194301 207196 -41033 -201667 25491 222087 -109807 160304
13196A2323f8913C31569A02660c8077B98966E3735J10599J14916j24713K11864
$$ 12323 -68913 331569 102660 -38077 298966 53735 164334 279250 154537 366401
13186C66401P4199I7986B8947K79474C2123b55451A18316J59734A38075K31363
$$ 366401 440600 97986 28947 308421 32123 -255451 118316 278050 138075 369438
13176C69438A25494A7449f193l8977B50353i4287B46984k3003e7809A75357B6089
$$ 369438 125494 17449 -6193 -45170 250353 -94287 246984 223981 -57809 175357 26089
13164C17067j08536b1959A74480m7744a18295C66375O9912G7889j5007M25250
$$ 317067 208531 -21959 174480 126736 -118295 366375 436287 77889 62882 488132
13154D88132A10351J39837A09543A0065L51814j19903a87276A54290b4747B62687
$$ 488132 110351 250188 109543 10065 361879 241976 -187276 154290 -24747 262687
13143f8122E7652c0668a440o7115H5489i9748b3572A77241q3698K66607A35267
$$ -68122 57652 -30668 -1440 -68555 85489 -99748 -23572 177241 93543 360150 135267
13131A37777n4440b8574B09999b2173C3481e0964A98996b7476B68978G9990P3094
$$ 137777 83337 -28574 209999 -22173 33481 -50964 198996 -27476 268978 79990 153084
13120A53084a08356B66012j29841B447J21602D0616K00032F122J3153J28176J45383
$$ 153084 -108356 266012 136171 2447 124049 40616 240648 6122 19275 147451 292834
13109B92834j34573A6224J44667a87879j13369P1618A73418E5373M4014a45728
$$ 292834 158261 16224 160891 -187879 -301248 -229630 173418 55373 99387 -145728
13098i0910A87990f31B63559D3779E809f8095H7817k2830a09181M7648n9840A02154
$$ -90910 187990 -631 263559 43779 5809 -68095 87817 64987 -109181 -61533 -121373 102154
13085a95953A01341O9439F6617a59954A79699g4074A5820J29596k9989N008J68602
$$ -195953 101341 170780 66617 -159954 179699 -74074 15820 145416 115427 120435 289037
13074B89037m6873A21029Q15J00235p8431D4595L55845c82288d2625D7396J1209
$$ 289037 242164 121029 121844 222079 143648 44595 400440 -382288 -42625 47396 58605
13063E8605A7581Q9481l7662a9857B281J68583a00425A14490J06441B4621M39308
$$ 58605 17581 107062 69400 -19857 2281 170864 -100425 114490 220931 24621 463929
13052D63929A87845a73358G1115A4806L3954M11206B16091g6529D6735L100L16153
$$ 463929 187845 -173358 71115 14806 48760 459966 216091 -76529 46735 49835 365988
13041C65988r8124n3444J04113P07p3431j17423A7333J96730f8156F9947A691
$$ 365988 267864 214420 318533 319240 245809 128386 17333 214063 -68156 69947 1691
13029F3328e3484B66000a42984A9205J44918n949l2365l4690J05512e5955b1364
$$ 63328 -53484 266000 -142984 19205 164123 158174 125809 91119 196631 -55955 -21364
13017a00447m6402l646C64520a63934C16101I8371J11609r0115J28370G6852a78621
$$ -100447 -146849 -150495 364520 -163934 316101 98371 209980 119865 248235 76852 -178621
13005h9495A36000K0916G3921J9842J9068f3194A59105P3374J18214a1264A19256
$$ -89495 136000 156916 73921 93763 112831 -63194 159105 232479 350693 -11264 119256
12993B64033c5013j59431A13715Q6662G3035K0753o074J83799b13034A5136h49
$$ 264033 -35013 -194444 113715 200377 73035 93788 87714 271513 -213034 15136 -849
12981E24535c05851A6172a12829B2913J00227R6578q5905b28009A54365G3756
$$ 524535 -305851 16172 -112829 22913 123140 219718 133813 -228009 154365 73756
12970A76428D0744c025E9475Q8470b2030G229J35112m6914d8269B55732j03093
$$ 176428 40744 -3025 59475 147945 -22030 7229 142341 95427 -48269 255732 152639
12959A52639E5534J5368J43709f0872j72722F921R5955J28855P8883j1649j19496
$$ 152639 55534 70902 214611 -60872 -233594 6921 102876 231731 310614 298965 179469
12948A79469j5085f3708a8271j57898B39000p3370a12052B63976b25580m4994
$$ 179469 164384 -63708 -18271 -176169 239000 165630 -112052 263976 -225580 -270574
12938b70574I1399K3795C0142J42670B5099d7606E3989J56807q3408q556J96025
$$ -270574 91399 115194 30142 172812 25099 -47606 53989 210796 127388 118832 314857
12927C14857g2121A24578e0110J7141C53619A17357K92985c1690C52912A1814
$$ 314857 -72121 124578 -50110 -32969 353619 117357 410342 -31690 352912 11814
12916I5756J73566q5789a25663A68438M7065b1513j75426p9926C01014A13066
$$ 95756 269322 183533 -125663 168438 215503 -21513 -196939 -276865 301014 113066
12905a4206l08913A12115a05698M9315C07593A41009a94772A55134c4294k30520
$$ -14206 -323119 112115 -105698 -56383 307593 141009 -194772 155134 -34294 -264814
12895b64814A01627a04750B27366k5209n5181C0649f5753E5640a40246K4648F4750
$$ -264814 101627 -104750 227366 202157 146976 30649 -65753 55640 -140246 -115598 64750
12883a91976f4587j45269A52584F2735N7058i0388k65591A50573o5828O9743R0010
$$ -191976 -64587 -209856 152584 62735 119793 -90388 -355979 150573 84745 154488 244498
12872B44498H4563a76178D8081j2580a60579N9399a9197B22409m7169n2175E2333
$$ 244498 84563 -176178 48081 35501 -160579 -101180 -19197 222409 175240 123065 52333
12860A68434J31184j12309g0562k41615a36615D1613r87a74067C2558L10902A35631
$$ 168434 299618 187309 -70562 -312177 -136615 41613 40626 -174067 32558 343460 135631
12848F0889a03577A48446a90868c8452l4133A43862M1651k5621F3100j2820K2574
$$ 60889 -103577 148446 -190868 -38452 -72585 143862 185513 159892 63100 50280 72854
12837G2854J1450h0159j83476I6678J082J37812a26893H1225K07194a81520A71763
$$ 72854 84304 -80159 -263635 96678 97760 235572 -126893 81225 288419 -181520 171763
12825F8531g2837D95891c851j78442d2213a7172A41926a53568J6423l05482C13753
$$ 68531 -72837 495891 -3851 -182293 -42213 -17172 141926 -153568 -137145 -442627 313753
12813b9546o5691L5268A36773C8536M0663k5709B4697J5896K31319e4571B50412
$$ -29546 -95237 -59969 136773 38536 79199 53490 24697 40593 271912 -54571 250412
12801f8217H4311L30307A62184A9689N2323C0698j485a42792E6897J99972p7985
$$ -68217 84311 414618 162184 19689 72012 30698 29213 -142792 56897 256869 178884
12790A78884c04239A30332R5841A03680a12775H3173D0886a41779A9470O4334
$$ 178884 -304239 130332 226173 103680 -112775 83173 40886 -141779 19470 83804
12780H3804K90096A9498R3900E201M18408k00701F9475A6034J25766F8907a45663
$$ 83804 373900 19498 113398 5201 423609 222908 69475 16034 141800 68907 -145663
12768a57124j56304a42038j38605a14783j53488A29763G734a47012A19484a27465
$$ -157124 -313428 -142038 -280643 -114783 -268271 129763 7734 -147012 119484 -127465
12757B47513k1486a06343L3011j30354B89990C6699a78664g1438K2340B69372
$$ 247513 226027 -106343 -73332 -203686 289990 36699 -178664 -71438 -49098 269372
12746A29586K3672a02036a2682A33871D9724R2276m3730c6889j41045L1818l1580
$$ 129586 153258 -102036 -12682 133871 49724 142000 98270 -36889 -177934 -146116 -177696
12735a77696A39827e0498A19179l8695Q9565k5869i1191B84841I7849C8982e7847
$$ -177696 139827 -50498 119179 80484 170049 144180 -91191 284841 97849 38982 -57847
12723C35728A51082a053k74695C15153a54054H9253f7771C78135e9131j72221
$$ 335728 151082 -1053 -275748 315153 -154054 89253 -67771 378135 -59131 -231352
12713b31352h1048m6810A92668H7891b08388e6314B03035F5821a77615N6414D6871
$$ -231352 -81048 -127858 192668 87891 -208388 -56314 203035 65821 -177615 -121201 46871
12701h1368P895B31116b16859B32621K54948A56755F994K11568h2335A36622J01802
$$ -81368 -73473 231116 -216859 232621 487569 156755 6994 218562 -82335 136622 238424
12690B38424F3681a6331B52016e8740A46485K469J29171J16197A3842K48669a36613
$$ 238424 63681 -16331 252016 -58740 146485 148954 278125 394322 13842 262511 -136613
12678I59J23699c3027A14620J23275a71620N6165H0347K06788a1678C6180J46130
$$ 959 124658 -33027 114620 237895 -171620 -115455 80347 287135 -11678 36180 182310
12667A82310p6754m280a16050l5894B34090l9367a18127G7665J06701c23228B60564
$$ 182310 105556 101276 -116050 -151944 234090 194723 -118127 77665 184366 -323228 260564
12655c0012k4315k621q471A9932g8821B7820R0979R9057J20750b14319b7875A29809
$$ -30012 -54327 -56948 -65419 19932 -78821 27820 118799 217856 338606 -214319 -27875 129809
12642a33149B56041G397b68274E8809J68418j08007k2136J16173f3016C41616
$$ -133149 256041 7397 -268274 58809 227227 119220 97084 213257 -63016 341616
12631D2093J1834b49756C7132a9550B5786K9370J80704J17359H5799A8610L14161
$$ 42093 53927 -249756 37132 -19550 25786 55156 235860 353219 85799 18610 332771
12620C32771H9335L4546J39551m1300e5068b2345B47968g378C60217B8945c8018
$$ 332771 89335 123881 263432 222132 -55068 -22345 247968 -7378 360217 28945 -38018
12608C67340k1374A18074J87597l5797N3299B9503c42763f0303A38160J61263
$$ 367340 345966 118074 305671 269874 323173 29503 -342763 -60303 138160 299423
12598B99423p4341c4421k17937d0715D3597J5152a08283L3207C08625P9308A07992
$$ 299423 225082 -34421 -252358 -40715 43597 58749 -108283 -75076 308625 387933 107992
12586a12225j67264A14873B9948Q6075K90285b3510p2052A34937a12166D3681
$$ -112225 -279489 114873 29948 116023 406308 -23510 -95562 134937 -112166 43681
12575A4320b26806C1174a731D54336a41337G9510k4374P9317K0695Q5195G3512
$$ 14320 -226806 31174 -1731 454336 -141337 79510 55136 134453 155148 240343 73512
12563a0129F4520d9920r0786O9961O127O469a2634C02227Q3737A92695b8311j2902
$$ -10129 64520 -49920 -140706 -70745 -64618 -58149 -12634 302227 385964 192695 -28311 -41213
12551d1213K113a6074H4848P4287N7290d1141B03812A1869b143H6609a21117o0070
$$ -41213 -39100 -16074 84848 159135 216425 -41141 203812 11869 -2143 86609 -121117 -181187
12539a81187m7036f2093A25582f1117B65405d68825e3099k36401A808J96963p6350
$$ -181187 -228223 -62093 125582 -61117 265405 -468825 -53099 -289500 1808 198771 122421
12528A22421J4057a61307D0805J9001a95453L6098c728j01196A14522a73534J4751
$$ 122421 136478 -161307 40805 59806 -195453 -159355 -3728 -104924 114522 -173534 -158783
12517a58783G5728C698J47371K9721D4216J00122c1335F7092h7780A58700J0565
$$ -158783 75728 3698 151069 180790 44216 144338 -31335 67092 -87780 158700 169265
12506A69265i7737B8386M4970p116A6583J11084a43790A99944C2517K86864r2656
$$ 169265 -97737 28386 73356 66240 16583 127667 -143790 199944 32517 319381 226725
12495B26725R3428D3601b8408k36707J15444C70177a42403B63411J03103a09117
$$ 226725 320153 43601 -28408 -265115 -149671 370177 -142403 263411 366514 -109117
12484A95890J79938j11972d406j85663q5587d8750A1649i3670A5466d07459A16741
$$ 195890 375828 263856 -4406 -190069 -275656 -48750 11649 -93670 15466 -407459 116741
12472i8754k9677C0830f8125K805D291a85053A40911K1243B5398M01585d8090
$$ -98754 -128431 30830 -68125 -65320 4291 -185053 140911 162154 25398 426983 -48090
12460i4771D894h0815B73455d8033H6101a26059K3339A6237a86064A11201J65649
$$ -94771 4894 -80815 273455 -48033 86101 -126059 -102720 16237 -186064 111201 276850
12449B76850c29886a5841H4200a31732K0736A61888b9314l80842b6854m219E0932
$$ 276850 -329886 -15841 84200 -131732 -110996 161888 -29314 -410156 -26854 -31073 50932
12437A2206a37360I1026P3613g3116o4324A83a43655J6304m4279L8373B62208
$$ 12206 -137360 91026 164639 -73116 -137440 183 -143655 -127351 -171630 -133257 262208
12425A42077a5473A51067d3551l64160e1263a6503H8587l444b66001A98069a55663
$$ 142077 -15473 151067 -43551 -407711 -51263 -16503 88587 85143 -266001 198069 -155663
12413a01411c7103A52392D524e8994D6828b4366j08588B10997b4150j57182B26273
$$ -101411 -37103 152392 4524 -58994 46828 -24366 -132954 210997 -24150 -181332 226273
12401a63384j2900c0269I1460A2764a7141j5226k470A46728M9156C3192a2491
$$ -163384 -176284 -30269 91460 12764 -17141 -32367 -34837 146728 195884 33192 -12491
12389C22110c7746C0812A5165K54573b37833e0271J2183A76936n7797a6143k47298
$$ 322110 -37746 30812 15165 269738 -237833 -50271 -38088 176936 119139 -16143 -263441
12378b63441c5728B72355C0753a00624c3895m7680B49239a2383A12919a30495
$$ -263441 -35728 272355 30753 -100624 -33895 -81575 249239 -12383 112919 -130495
12367A74205a44480B15058a01725A30076E8621a30850C59620h2150H5098g6117
$$ 174205 -144480 215058 -101725 130076 58621 -130850 359620 -82150 85098 -76117
12356d63477A26849O0882C9470O6608D2794L8537i7259A86835E196J56870p0565
$$ -463477 126849 187731 39470 106078 42794 81331 -97259 186835 5196 162066 91501
12345I1501a33163B03509q193a5003B19786a85864D9316a26378G8353J07990K3544
$$ 91501 -133163 203509 195316 -15003 219786 -185864 49316 -126378 78353 186343 209887
12334B09887J27236d9229G4837f3526C8275b3349B1193a18343E5698R0225M9373
$$ 209887 337123 -49229 74837 -63526 38275 -23349 21193 -118343 55698 145923 195296
12323A95296f6609a744B326Q0853a2884C16736j46612E2469c6133C21072a19864
$$ 195296 -66609 -1744 2326 83179 -12884 316736 170124 52469 -36133 321072 -119864
12311G7835J11825a80639d6225J3955B31330E031i2799b2582B28767J0417B7868
$$ 77835 189660 -180639 -46225 -32270 231330 5031 -92799 -22582 228767 239184 27868
12299F1590K30551a57000A1803e4814H9048i6486M0786l02731A07040D6100a16693
$$ 61590 292141 -157000 11803 -54814 89048 -96486 -55700 -358431 107040 46100 -116693
12287A18761K68714h1387K8186B35788g1665A07342a75316M149K3651n0703h4720
$$ 118761 387475 -81387 -53201 235788 -71665 107342 -175316 -171167 -147516 -198219 -84720
12275B68706R06E5537L5493a47831A76057l4035K66001h6025I617c9526A35776
$$ 268706 269612 55537 91030 -147831 176057 142022 408023 -86025 9617 -39526 135776
12263A97512H7948C0508K20089l2235C3794a19186A54843J35684C5995a27410
$$ 197512 87948 30508 250597 218362 33794 -119186 154843 290527 35995 -127410
12252f6310m0060A28112J24351b79189A89184I853a74430a9326D5620d2390r9612
$$ -66310 -106370 128112 252463 -279189 189184 9853 -174430 -19326 45620 -42390 -142002
12241a42002H890J27701L47473H9148K03657I5443k1525a2570c611E0359J47761
$$ -142002 8890 136591 484064 89148 292805 95443 73918 -12570 -3611 50359 198120
12230A98120l8345n3165A9987K42983K653D9267K68837A33366B2909J22573C6316
$$ 198120 159775 106610 19987 262970 265623 49267 318104 133366 22909 145482 36316
12218B40296n1795J1278d973C5621J03599j9027K6959K09904j61832E191J86173
$$ 240296 188501 199779 -4973 35621 139220 120193 147152 357056 195224 5191 191364
12207A91364E9470B271J17961f7415E30110g1462B25659h54A16613K51578j75603
$$ 191364 59470 2271 120232 -67415 530110 -71462 225659 -854 116613 368191 192588
12196A92588R8435l6616G8197e9760E9276k4164J54034J26746A39657L6030K00598
$$ 192588 291023 254407 78197 -59760 59276 35112 189146 315892 139657 175687 376285
12185C76285Q9897B09170F2951M62717I2925P2898L95461B34534l6515b64924
$$ 376285 466182 209170 62951 525668 92925 165823 561284 234534 198019 -264924
12174C28646b1319l9201B83285F2658f957B91891F5836a25023B22162A013R358
$$ 328646 -21319 -60520 283285 62658 -6957 291891 65836 -125023 222162 1013 10371
12163A0371K20108a35643C54981j38539J53404A29002n7437O28203C21197q0321
$$ 10371 230479 -135643 354981 216442 369846 129002 71565 699768 321197 240876
12153B40876k2650J32047A38043b6479D3940a50535B19087O2516M976j23255b48851
$$ 240876 218226 350273 138043 -26479 43940 -150535 219087 281603 286579 163324 -248851
12141B00678a92476j2429B65693A518J80335C3610J52209H1094c5844A72166b8210
$$ 200678 -192476 -204905 265693 1518 181853 33610 185819 81094 -35844 172166 -28210
12129A16194g4657B67751E9832N0092e358A2429L4931K73775E3982J18002c78212
$$ 116194 -74657 267751 59832 109924 -5358 12429 47360 321135 53982 171984 -378212
12117E8854K29461p6579J7110a51315q6105f3242o1383j55212I9774a60282D8248
$$ 58854 288315 211736 228846 -151315 -237420 -63242 -124625 -279837 99774 -160282 48248
12105b45873b8676I112f4416j09979J3994J9017A93415D3198a33591H3245B2834
$$ -245873 -28676 9112 -64416 -174395 -160401 -141384 193415 43198 -133591 83245 22834
12093A3243J87662b86769B02672p3154b26500J0764B4352p844f7418D1993J14973
$$ 13243 200905 -286769 202672 129518 -226500 -215736 24352 16508 -67418 41993 156966
12082A56966Q8565f6855j6460r0320D8828Q5868b19516P0020A2014b18826N256
$$ 156966 245531 -66855 -83315 -173635 48828 134696 -219516 -149496 12014 -218826 -213570
12071b13570N0024A51998a53954C3186J00409D0895N3704a02143m2785B123b7239
$$ -213570 -163546 151998 -153954 33186 133595 40895 94599 -102143 -144928 2123 -27239
12059b49460I3193O79368K12001j10092C88829A85068n3256Q5543A01199e7612
$$ -249460 93193 772561 984562 874470 388829 185068 131812 217355 101199 -57612
12048C3917J83595b95502A9943h9415H9969g839C9997c69199a17456C14476a02207
$$ 33917 217512 -295502 19943 -89415 89969 -7839 39997 -369199 -117456 314476 -102207
12036A22185A9496L98316h8265I309a23908K3499J0262B12348L0441C9509a40085
$$ 122185 19496 417812 -88265 9309 -123908 -100409 -90147 212348 242789 39509 -140085
12024b23165i8759k91899g1025j33528i8847G2354J35355R3729A20664E9877b18428
$$ -223165 -98759 -390658 -71025 -204553 -98847 72354 207709 301438 120664 59877 -218428
12012I798K8324b72272h4961a1155B28854a16925C3257J84971E3662R9504F0430
$$ 9798 38122 -272272 -84961 -11155 228854 -116925 33257 218228 53662 153166 60430
12000G8831B5212J9041a81424e3621C61852a79417j15213R6874F2036A0462m605
$$ 78831 25212 44253 -181424 -53621 361852 -179417 -294630 -197756 62036 10462 5857
11989E857O7447B7590g2730A93014o8421D0932a79290j29539m6583J23343H1105
$$ 5857 73304 27590 -72730 193014 124593 40932 -179290 -308829 -355412 -232069 81105
11977A11436K54985f7983I1076i909m09174m8556C4638G154N7906a7762j43153
$$ 111436 366421 -67983 91076 -9909 -419083 -467639 34638 7154 65060 -17762 -160915
11966a60915a0546B33137j09333A1277J36365f3122r1702b3958o4944J3275B8368
$$ -160915 -10546 233137 123804 11277 147642 -63122 -154824 -23958 -88902 -75627 28368
11954C29500H2028a0293D13667a1013k07830n2592j12056a42948E9358f2871A87139
$$ 329500 82028 -10293 413667 -11013 -218843 -271435 -383491 -142948 59358 -62871 187139
11942C8807K03671I2137a02053J9303j6977E7444a47077A57183e2249B80176A10819
$$ 38807 242478 92137 -102053 -82750 -99727 57444 -147077 157183 -52249 280176 110819
11930A65812h0329K3919j4067A12887a37360i475A19662K6509J59403H6578l7086
$$ 165812 -80329 -56410 -70477 112887 -137360 -9475 119662 146171 305574 86578 49492
11919D9492N6248j8624J71096b7391A3351b2148j56208C0716L2712K63982a2547
$$ 49492 105740 87116 258212 -27391 13351 -22148 -178356 30716 63428 327410 -12547
11907b77992a30002H2384J35548a37938k3409A2342a12450N2471A47874J3593
$$ -277992 -130002 82384 217932 -137938 -161347 12342 -112450 -59979 147874 161467
11897A61467a93620L850B22440b53737E2039o960b13418J00379C4693a41559O16
$$ 161467 -193620 -189770 222440 -253737 52039 45079 -213418 -113039 34693 -141559 -140943
11886a40943A9135J82377a29197j92436B73636o5188R6015a63716O6772b0305
$$ -140943 19135 201512 -129197 -321633 273636 208448 304463 -163716 -96944 -20305
11875b54710A46901K10652A34094b52732d4413p4849A07548l6503a64629c6443
$$ -254710 146901 357553 134094 -252732 -44413 -119262 107548 71045 -164629 -36443
11864a85021B45914b8554n4112A59699L4069l1205b0757A46533k2766d0277B14907
$$ -185021 245914 -28554 -82666 159699 193768 162563 -20757 146533 123767 -40277 214907
11852b5015a282B5a32011E198a06025B02353G034h0863G8879h9909A77805c6235
$$ -25015 -1282 25 -132011 5198 -106025 202353 7034 -80863 78879 -89909 177805 -36235
11839e6833A4771b68676C3552d18674A71642b3852q9526l78766a23962H2912d4940
$$ -56833 14771 -268676 33552 -418674 171642 -23852 -113378 -492144 -123962 82912 -44940
11827h0089k1105D6877c97689a46253I7475J12233a83175D2234f9930J6935j42068
$$ -80089 -101194 46877 -397689 -146253 97475 209708 -183175 42234 -69930 -52995 -195063
11816a95063P5517o2417b0848l72427J96579R6982E6431Q5255a70754M3912f0499
$$ -195063 -119546 -181963 -20848 -393275 -196696 -99714 56431 141686 -170754 -126842 -60499
11804C49747j26344a07870g545H181K28071d4687k41446k84179A35625D600a69076
$$ 349747 223403 -107870 -7545 8181 236252 -44687 -286133 -570312 135625 4600 -169076
11792B5073L6678a80029G2695D360P2471a24077A83487a4839O540A65641D278
$$ 25073 61751 -180029 72695 4360 76831 -124077 183487 -14839 -8299 165641 4278
11780a41385g546k58329C6179P9725M8413d422l0306l5745D9619K97728F3938
$$ -141385 -7546 -265875 36179 115904 164317 -4422 -34728 -70473 49619 347347 63938
11768a22472a6255r6097G9800A1129K91342b17758b1206j9461H3556f6745K7304
$$ -122472 -16255 -112352 79800 11129 302471 -217758 -21206 -40667 83556 -66745 -39441
11757c9441A6749L03111c79093f5090k0834j62932J7534a07019B77831a20464
$$ -39441 16749 319860 -379093 -65090 -85924 -248856 -231322 -107019 277831 -120464
11746b50600H6798D2474a19239m8813C5088D709J22919i7635G5771f7688A4127
$$ -250600 86798 42474 -119239 -168052 35088 4709 127628 -97635 75771 -67688 14127
11734e3986I5039f4836A61490A0672a9785j35669a9945l10199B72873F0483L2686
$$ -53986 95039 -64836 161490 10672 -19785 -155454 -19945 -330144 272873 60483 93169
11723I3169C5070f8338A1075a24889D19758E4153f1907F775c06526Q0552O7515
$$ 93169 35070 -68338 11075 -124889 419758 54153 -61907 6775 -306526 -225974 -158459
11712a58459O6515m3705B2314J17798c72965C8129b8841A46818b21375q079C07087
$$ -158459 -91944 -135649 22314 140112 -372965 38129 -28841 146818 -221375 -229454 307087
11700A26797R7367c17063f1176i336C04127g9039B392J04235n193N3421j2044
$$ 126797 224164 -317063 -61176 -9336 304127 -79039 2392 106627 101434 154855 142811
11689A42811D6398J29585O8251j4164h6585D37279a29140H4051a32110B42355
$$ 142811 46398 175983 244234 230070 -86585 437279 -129140 84051 -132110 242355
11678D22220E6301d300B41373m6019A9966R320J73014b32259e3381J0923f6C69609
$$ 422220 56301 -4300 241373 195354 19966 29286 202300 -232259 -53381 -42458 -66 369609
11665G8667a16951A07130a71044B25839I2374i7461k25758B46774F8494M2871
$$ 78667 -116951 107130 -171044 225839 92374 -97461 -323219 246774 68494 111365
11655A11365a3059j49748g982B18483e7820j62319B94915C3019K66264A20818
$$ 111365 -13059 -162807 -7982 218483 -57820 -220139 294915 33019 299283 120818
11644d3542k5928b742i34j09452A09211A2656d9513A31524R042k8173B9102J07051
$$ -43542 -69470 -2742 -934 -110386 109211 12656 -49513 131524 140566 112393 29102 136153
11632A36153G959L1181O790J54488h3978K5873D43089a68156p3939J5577Q023
$$ 136153 7959 39140 45930 200418 -83978 -58105 443089 -168156 -242095 -226518 -218495
11621b18495A42318a00398B20637i8278F396d80612a57185j0036A03370h1380
$$ -218495 142318 -100398 220637 -98278 6396 -480612 -157185 -167221 103370 -81380
11610B28115F3244a32236A11015m5425a8480B17180e5351H7867a06640K6204B1499
$$ 228115 63244 -132236 111015 65590 -18480 217180 -55351 87867 -106640 -80436 21499
11598A9243a43000C64875a9375j06959j95452J4388f4848r406C58641G1524a83430
$$ 19243 -143000 364875 -19375 -126334 -321786 -307398 -64848 -74254 358641 71524 -183430
11586A46664b21397a03702B01075I7025C2916b37766A13461b247A40567k0009
$$ 146664 -221397 -103702 201075 97025 32916 -237766 113461 -2247 140567 120558
11576A20558i9193E8249R6307P0859J82706a01231A85233p8526N8678C6096b13500
$$ 120558 -99193 58249 154556 225415 408121 -101231 185233 106707 165385 36096 -213500
11564a92447B58231C7055K03305D3810L14549c63501A03048g640A06002l2816
$$ -192447 258231 37055 240360 43810 358359 -363501 103048 -7640 106002 73186
11554G3186K68546R9191A29665L6323O4489k5840L2792d9855C5559d8335B5551
$$ 73186 341732 440923 129665 165988 230477 204637 237429 -49855 35559 -48335 25551
11542A15797j6874b696m2258J4396d627B50367a72190a4287m3293B36896k1619
$$ 115797 98923 -2696 -44954 -30558 -4627 250367 -172190 -14287 -57580 236896 215277
11531B15277o9289O3883a01763l27461A30499a58189a0273D2035a76360A79155
$$ 215277 145988 209871 -101763 -429224 130499 -158189 -10273 42035 -176360 179155
11520A30976P114i4469A34706N1014J8447l6823b62015R6388A23453F0027Q622
$$ 130976 138090 -94469 134706 185720 204167 167344 -262015 -165627 123453 60027 68649
11509F8649K43481F8350c0128k02798A94560g995A94545L4221g3132q0797A22756
$$ 68649 312130 68350 -30128 -232926 194560 -7995 194545 228766 -73132 -153929 122756
11497a97038B22960P4173K1784P607e3550C12135H8842j0745M64949B8383J60050
$$ -197038 222960 297133 318917 326524 -53550 312135 88842 78097 543046 28383 188433
11486A88433l8237c6380m6782A65664r374e3958A54863K7811O5458e2921I4529
$$ 188433 150196 -36380 -83162 165664 156290 -53958 154863 182674 248132 -52921 94529
11474C72982p6097C3077N8128M8729J5162a84096E96773A2930Q5681J20882M5379
$$ 372982 296885 33077 91205 139934 155096 -184096 596773 12930 98611 219493 264872
11463B64872A23729k6707M8975k0835b14406b7321B89535b49603a3375j09657
$$ 264872 123729 97022 145997 125162 -214406 -27321 289535 -249603 -13375 -123032
11453a23032l1579E7415O8529a64328I7763m8514J52811E9681f0553B15745C9159
$$ -123032 -154611 57415 125944 -164328 97763 49249 202060 59681 -60553 215745 39159
11441e2215D41286i2458j12091B48375j09185J18212n2434J16252b83947N6599
$$ -52215 441286 -92458 -204549 248375 139190 257402 204968 321220 -283947 -227348
11431b27348c6776A09850c2177A60255m4990A2106K21471j0481i687B2003K79710
$$ -227348 -36776 109850 -32177 160255 115265 12106 233577 223096 -9687 22003 301713
11420C01713A44871J74313B6646N1160h5181L152D0198b18759c9009D2288a95257
$$ 301713 144871 319184 26646 77806 -85181 -82029 40198 -218759 -39009 42288 -195257
11408c7233G1213J51456E024a12895E2453r419a07247A1624g2591j81361a11924
$$ -37233 71213 222669 5024 -112895 52453 43034 -107247 11624 -72591 -253952 -111924
11396c28288i4167C73894a21510l922C5643K10350d35847B84820A2355b22850
$$ -328288 -94167 373894 -121510 -125432 35643 245993 -435847 284820 12355 -222850
11385a14423C8071J57001b68448K302b6855A7911J47623a81134A8744J39755G3087
$$ -114423 38071 195072 -268448 -266146 -26855 17911 165534 -181134 18744 158499 73087
11373e288G1364h7417G6554K714b0026B88327o0595L08788h4070B96867A29288
$$ -5288 71364 -87417 76554 79268 -20026 288327 227732 536520 -84070 296867 129288
11361E1750h7350A3205i8855q5709B2012J74926M353H6779a46815D382a68515
$$ 51750 -87350 13205 -98855 -184564 22012 196938 201291 86779 -146815 4382 -168515
11349A1035a12274c4321C6278a67335G1574a978B6542j2986b62191C19890h497
$$ 11035 -112274 -34321 36278 -167335 71574 -1978 26542 13556 -262191 319890 -8497
11337B27391B0447a08937A51896P915E8993J75385a20738A57602h7926A5726b61296
$$ 227391 20447 -108937 151896 159811 58993 234378 -120738 157602 -87926 15726 -261296
11325d38001K04414d6889j44281D7304i2107j25480O1183A25789J62809c4869
$$ -438001 -233587 -46889 -191170 47304 -92107 -217587 -156404 125789 288598 -34869
11314a10116A31156g0019N985G4535e4811k63413F3869d7720n6965H8743F223
$$ -110116 131156 -70019 -64034 74535 -54811 -318224 63869 -47720 -104685 88743 6223
11302f0104a621A39719a43375a929k24532A00687a06339I2589a31600F2191a84737
$$ -60104 -1621 139719 -143375 -1929 -226461 100687 -106339 92589 -131600 62191 -184737
11290A06364J37778a318B6028J49701H4503a86j34699F9502c93255a93331h8665
$$ 106364 244142 -1318 26028 175729 84503 -186 -134885 69502 -393255 -193331 -88665
11278G3201M8355k9747a63338e695j84937C9914f0326k460A41207B7185J58386
$$ 73201 121556 91809 -163338 -5695 -190632 39914 -60326 -62786 141207 27185 185571
11267A85571c99803F4221e7236l7273a2854A13200b24580e355j42417B2338O2996
$$ 185571 -399803 64221 -57236 -94509 -12854 113200 -224580 -5355 -147772 22338 85334
11256H5334c82262a54387f5668A68194c8431r3865A8987E922J69768p4220c34210
$$ 85334 -382262 -154387 -65668 168194 -38431 -132296 18987 5922 175690 101470 -334210
11244A8602a66683f8433A41867J16739I4720Q4988i040q0457I4474c9865m604
$$ 18602 -166683 -68433 141867 258606 94720 179708 -9040 -89497 94474 -39865 -44469
11233d4469A0535K02620b19536a09401A2722j395a04747A42113F6795h522j89510
$$ -44469 10535 213155 -219536 -109401 12722 11327 -104747 142113 66795 -8522 -198032
11222a98032C2467K6501h4726A54177a44841B7271L14304c12497a4693n1495A94908
$$ -198032 32467 58968 -84726 154177 -144841 27271 341575 -312497 -14693 -66188 194908
11210C6510O6349b01278R9987E2424r752Q5100J09513J05398a39000H7258J0654
$$ 36510 102859 -201278 -101291 52424 42672 127772 237285 342683 -139000 87258 97912
11199I7912e1951j050m08979J60357G1135C2749O9524a74290L0058C04642d4937
$$ 97912 -51951 -53001 -461980 -301623 71135 32749 102273 -174290 -144232 304642 -44937
11187B97J8389a52965p2855m908J57F9255b03491c8145B00101a28271B01822b81495
$$ 297 18686 -152965 -225820 -230728 -230571 69255 -203491 -38145 200101 -128271 201822 -281495
11174C27168i8281I993c27196f3735q6830e9943l7117j78111g4839j99915A29970
$$ 327168 -98281 9993 -327196 -63735 -150565 -59943 -97060 -275171 -74839 -274754 129970
11162a63036A3713b26348n6082N8493a03874A21808C3032a33414k66064h6733
$$ -163036 13713 -226348 -282430 -223937 -103874 121808 33032 -133414 -399478 -86733
11151A5267g7292j27831N0848M204B7000b05538e3736B64217F8304a28916j98295
$$ 15267 -77292 -205123 -154275 -150071 27000 -205538 -53736 264217 68304 -128916 -327211
11140c27211m6124b2844A77287h3789q4732P7561e669A59366m9127c9467q0110
$$ -327211 -373335 -22844 177287 -83789 -168521 -90960 -5669 159366 110239 -39467 -119577
11129a19577H2348b91369J36122A65039F5056d0891j28549b0895B94747b3836
$$ -119577 82348 -291369 -155247 165039 65056 -40891 -169440 -20895 294747 -23836
11118a76117J5093F7509P7610P6544n4741c69769R3251j2145A2467a917k38928
$$ -176117 -161024 67509 145119 221663 166922 -369769 -276518 -288663 12467 -1917 -240845
11107b40845A48532m185M9463J01697b56681B08831a89023F8012B1003Q0585J35357
$$ -240845 148532 144347 193810 295507 -256681 208831 -189023 68012 21003 101588 236945
11096B36945a08716c941j62406B21101b7439B8229a44739N2346D17567q5188R3119
$$ 236945 -108716 -3941 -166347 221101 -27439 28229 -144739 -92393 417567 332379 425498
11085D25498A32252O3183R9768j2446j32796e5013J2662J5458E6331K45105K5104
$$ 425498 132252 195435 295203 282757 149961 -55013 -42351 -26893 56331 301436 326540
11074C26540d5763A59586r392K89196j20410j16038j0465o0461a16903A30798
$$ 326540 -45763 159586 150194 439390 318980 202942 192477 132016 -116903 130798
11063A75108G9830J40408j03963l2293Q8538L57885B54025K36443k20996J64310
$$ 175108 79830 220238 116275 83982 172520 530405 254025 490468 269472 433782
11053D33782A96691L48457k53017O2932k0241J5846G7005N62332k96207j13231
$$ 433782 196691 545148 292131 355063 334822 350668 77005 639337 343130 229899
11043B29899N15011j71695k42873A62371L83446l8771K87320k131J8835k3164
$$ 229899 744910 573215 330342 162371 545817 507046 794366 792235 811070 787906
11033G87906j47732Q8816J8339j74866J63801K08181k59853j14423J27240J51689
$$ 787906 640174 728990 747329 572463 736264 944445 684592 570169 697409 849098
11023H49098l56546N12580l957l61943k58671N4934J61135K24650j74083j66765
$$ 849098 492552 1005132 1001175 639232 380561 435495 596630 821280 647197 480432
11013D80432j67357L56031J40998m3907l15615L54340m2069k8512J01141p3801
$$ 480432 313075 669106 810104 766197 450582 804922 762853 734341 835482 761681
11003G61681K05802C47210M9368q0818K63011J93922k19449j37458j10100Q9041
$$ 761681 967483 347210 396578 315760 578771 772693 553244 415786 305686 394727
10993C94727N07375l11422j70077J01358L97722m04915j11268K11410j301j61963
$$ 394727 902102 590680 420603 521961 919683 514768 403500 614910 613609 451646
10983D51646m5658K15096R1064J33339k48188o8473M6632J83137j6342l0923L8649
$$ 451646 405988 621084 712148 845487 597299 528826 575458 758595 742253 711330 749979
10972G49979J2103m1888K99143K8750n7268M36292m33190L46104J80451n307M9812
$$ 749979 762082 720194 1019337 1048087 990819 1427111 993921 1340025 1520476 1515169 1564981
10961A564981P8555M92664K93651n7131p0766L94626k86395j8158k04092l93381
$$ 1564981 1643536 2136200 2429851 2372720 2301954 2696580 2410185 2392027 2187935 1794554
10951A794554J72244l3320m60771L19009n11377J38414M1741K26737l38608J19208
$$ 1794554 1966798 1933478 1472707 1791716 1280339 1418753 1460494 1687231 1348623 1467831
10941A467831Q1501l94804K28582k02358m6292j79565K9321k11274k57647O3985
$$ 1467831 1549332 1154528 1383110 1180752 1134460 954895 984216 772942 515295 579280
10931E79280j59909j90954n2380J88611j61581o8619J03977f810B32061q0507
$$ 579280 419371 228417 176037 364648 203067 134448 238425 -6810 232061 151554
10921A51554b16048C4080R8629K5475c9494A32652L6727q296P8532a14181A84997
$$ 151554 -216048 34080 132709 158184 -39494 132652 169379 161083 239615 -114181 184997
10909b4438I9369b40545E4847K4929h6236j18099j15304C0764A4228b08918M9162
$$ -24438 99369 -240545 54847 79776 -86236 -204335 -319639 30764 14228 -208918 -159756
10898a59756A89089a33057b0133k1203B4764a35523j17076d0779n873k13757d5571
$$ -159756 189089 -133057 -20133 -41336 24764 -135523 -252599 -40779 -46652 -260409 -45571
10886b95827g5866A3525e5118I9500h0776b5943A70431k8484J5215O0471a49158
$$ -295827 -75866 13525 -55118 99500 -80776 -25943 170431 141947 157162 217633 -149158
10874A24710N6222c7267m0175A25733c68185J62159A70678J16649A9677d67620
$$ 124710 180932 -37267 -77442 125733 -368185 -206026 170678 287327 19677 -467620
10863b08436m6931J25354c7039F3249l0602b06522e9792r0941q2837D32343A0615
$$ -208436 -255367 -130013 -37039 63249 32647 -206522 -59792 -150733 -233570 432343 10615
10851A09483Q0310F0232a73657H0987a58828g7901F5614N4104F635i9542q2135
$$ 109483 189793 60232 -173657 80987 -158828 -77901 65614 119718 6635 -99542 -181677
10840a81677E583J15691e2827A9027J68189a30290e8213J2123o3094A57112a8641
$$ -181677 5583 121274 -52827 19027 187216 -130290 -58213 -46090 -109184 157112 -18641
10828b2713n608A66269h0947A71949C3728q933M4435K46115G7583J44421b91307
$$ -22713 -28321 166269 -80947 171949 33728 24795 69230 315345 77583 222004 -291307
10816B04055b92150A05207b08638b7556A64941J80719D7920P1530B265h5806k09093
$$ 204055 -292150 105207 -208638 -27556 164941 345660 47920 119450 2265 -85806 -294899
10805b94899B11011i5885A5237f6338H6473c57643Q2262h1680A0492e6861j46629
$$ -294899 211011 -95885 15237 -66338 86473 -357643 -275381 -81680 10492 -56861 -203490
10794b03490B26910j79b53260A66311a78826A26394a37737j81007J38086D5346
$$ -203490 226910 226731 -253260 166311 -178826 126394 -137737 -318744 -180658 45346
10783B93589D3419a66678o9961c2688F3119a29278M0375j21822M7115G1730a1616
$$ 293589 43419 -166678 -236639 -32688 63119 -129278 -88903 -210725 -163610 71730 -11616
10771G799a25755a3862G6026a00247j26391H2126M74754C2574d07402a71722a0027
$$ 7799 -125755 -13862 76026 -100247 -226638 82126 556880 32574 -407402 -171722 -10027
10759e7285B02906J41692q8415J994j24513f5393J5145A12828i1815b448A2699
$$ -57285 202906 344598 256183 258177 133664 -65393 -50248 112828 -91815 -2448 12699
10747c867E2797c0693E1240G371c50884F536J67233h5202k90957C5575a67391
$$ -3867 52797 -30693 51240 7371 -350884 6536 173769 -85202 -376159 35575 -167391
10735i3465B26672a29718E448b16847a2672j38474N8900j03934f3644j25828O0458
$$ -93465 226672 -129718 5448 -216847 -12672 -151146 -92246 -196180 -63644 -189472 -129014
10724a29014J2885j97729e996k91613i7946K8966B3273K13508n4021A0536K33584
$$ -129014 -116129 -313858 -5996 -297609 -97946 -68980 23273 236781 182760 10536 244120
10713B44120A7504a27904c2098G4801f3302n9554k94477a39645E5012a75733I5218
$$ 244120 17504 -127904 -32098 74801 -63302 -122856 -417333 -139645 55012 -175733 95218
10701a73805j83375j00438f5872j72998r2605B0176O5881d0201B26868d08652
$$ -173805 -357180 -457618 -65872 -238870 -331475 20176 86057 -40201 226868 -408652
10690b59338N5813r2561A45117d8243n219A34139c04389J43015A52038j3571h4549
$$ -259338 -203525 -296086 145117 -48243 -53462 134139 -304389 -161374 152038 138467 -84549
10678c58028C16221a15336j44555C965J22844b05048i7053a6181j72991A005e2939
$$ -358028 316221 -115336 -259891 3965 126809 -205048 -97053 -16181 -189172 1005 -52939
10666i3773k56341J28723b7878J0744b149r404r1746A05512b87529R8959H6272
$$ -93773 -350114 -221391 -27878 -17134 -2149 -11553 -103299 105512 -287529 -188570 86272
10654B46626a7813F24903B55186f6632C2107c79127i9997j3403b4667j73602k02604
$$ 246626 -17813 624903 255186 -66632 32107 -379127 -99997 -113400 -24667 -198269 -400873
10643d00873d3105q3688l8262o1996A94036p5118b5761q6207B44198i936o8272
$$ -400873 -43105 -126793 -165055 -227051 194036 118918 -25761 -111968 244198 -9936 -78208
10632g8208p9632E4094a27956e9579j77564q0749a21795B41978o6360a90338Q3941
$$ -78208 -157840 54094 -127956 -59579 -237143 -317892 -121795 241978 175618 -190338 -106397
10621a06397C7867e03810C6202A7389a78244A34271a88016d9294k36857E9835
$$ -106397 37867 -503810 36202 17389 -178244 134271 -188016 -49294 -286151 59835
10610A49225k0867J39778A06483f3258j18670A94830b92794J36927B36145l7318
$$ 149225 128358 268136 106483 -63258 -181928 194830 -292794 -155867 236145 198827
10600A98827q2373K29902D6905c46745J65896j36802A54087K4304b3916k17972
$$ 198827 116454 346356 46905 -346745 -180849 -317651 154087 178391 -23916 -241888
10590b41888d2756j93683J02539B54985D7952e87771I7548M6842h6296B05547
$$ -241888 -42756 -236439 -133900 254985 47952 -587771 97548 144390 -86296 205547
10579i7446A6041c53571C772i5366p3633d1202j05103c1059C9489a93303C1544
$$ -97446 16041 -353571 3772 -95366 -168999 -41202 -146305 -31059 39489 -193303 31544
10567E7906a29494B84561g5747j58153H4290A4903e8839l0068G7392a16438C35247
$$ 57906 -129494 284561 -75747 -233900 84290 14903 -58839 -88907 77392 -116438 335247
10555c4282j33037k0860E3173b34398C27204a24859G2315h7695A29023c40152
$$ -34282 -167319 -188179 53173 -234398 327204 -124859 72315 -87695 129023 -340152
10544a34402j81437d5028B71090J01859j61572M4661A18611h4710C7748a58875
$$ -134402 -315839 -45028 271090 372949 211377 256038 118611 -84710 37748 -158875
10533g616r7814c0364j2898j30900E2050N0250B0855r853J6008c8011B5797Q5
$$ -7616 -105430 -30364 -43262 -174162 52050 102300 20855 11002 27010 -38011 25797 25882
10521B5882b34434b7456F2200c5737Q325j43970b0124G1085B7691J44968a28803
$$ 25882 -234434 -27456 62200 -35737 -27412 -171382 -20124 71085 27691 172659 -128803
10509G0417J20478g708j17029A59261O9241a45338P1943D0128e1427j10259C51553
$$ 70417 190895 -7708 -124737 159261 228502 -145338 -73395 40128 -51427 -161686 351553
10497h1502A72972f2716r2376I7106C3446a82236B53949a83078e1506j00071H9594
$$ -81502 172972 -62716 -155092 97106 33446 -182236 253949 -183078 -51506 -151577 89594
10485A31100a87561A5390J77494B0305r377R0062a18739B66263b12618A34826
$$ 131100 -187561 15390 192884 20305 10928 100990 -118739 266263 -212618 134826
10474C1508K31217B9741a03635C4619a57241B35784K3057n1809n4400m2794L39265
$$ 31508 262725 29741 -103635 34619 -157241 235784 258841 207032 152632 109838 449103
10463D49103f3026A37123J41739P5354A26045h1108k8251F9727b418j29018A34224
$$ 449103 -63026 137123 278862 354216 126045 -81108 -109359 69727 -2418 -131436 134224
10451b4446k40728M8001a01097K8126B63024c13897b2543l79753R7790C1005a19898
$$ -24446 -265174 -217173 -101097 -72971 263024 -313897 -22543 -402296 -304506 31005 -119898
10439a59153E9857K26587g5813l29463a06257e2114j14378n1579A48314b17831
$$ -159153 59857 286444 -75813 -405276 -106257 -52114 -166492 -218071 148314 -217831
10428i8309j72263e0384A9790a18892M0715C41981b54630A84602a60379g8621
$$ -98309 -270572 -50384 19790 -118892 -78177 341981 -254630 184602 -160379 -78621
10417B98511d18505F8024a13427L2608I8751d63331a48314j3917B7501a17271
$$ 298511 -418505 68024 -113427 -80819 98751 -463331 -148314 -162231 27501 -117271
10406h2547k9688B3489d8641m1276A25835K17769H893L1372Q9350O283b43107
$$ -82547 -112235 23489 -48641 -89917 125835 343604 8893 40265 129615 135898 -243107
10394b26750q6297J39704e3914A451e3574m8491C08875I5689J26819d4813Q173
$$ -226750 -313047 -173343 -53914 1451 -53574 -102065 308875 95689 222508 -44813 -36640
10383c6640j75408A33105F4042J9678j7793a46662B54337J6732a41819k10617
$$ -36640 -212048 133105 64042 83720 65927 -146662 254337 271069 -141819 -352436
10373c52436A26406E2780c1405k37971b7072B2715K18514a39095M8521B91963
$$ -352436 126406 52780 -31405 -269376 -27072 22715 241229 -139095 -90574 291963
10362D5799J67488R8733F7701J99501L0765p3674K36426G9648L13739A88389J43572
$$ 45799 213287 312020 67701 267202 297967 224293 460719 79648 393387 188389 331961
10351C31961K48701k40191k84L18597B90140k4859J8251j9773K86464D6187M90544
$$ 331961 580662 340471 340187 658784 290140 265281 283532 263759 550223 46187 536731
10340E36731c642A4935K01081J16437g35C69345j34189M4773j01839E3156J61371
$$ 536731 -3642 14935 216016 332453 -735 369345 235156 279929 178090 53156 214527
10329B14527M0803c8588C95568A88580R7041F4460a27389B49927m3374N5155J76652
$$ 214527 255330 -38588 395568 188580 285621 64460 -127389 249927 206553 261708 438360
10318D38360j11598A30799J05729r8298B363J8160R1932L58340A17747K62515
$$ 438360 326762 130799 236528 138230 2363 20523 112455 470795 117747 380262
10308C80262J3075A59820F1068k9582a40236A03006O510K06211A42462L4913f6474
$$ 380262 393337 159820 61068 31486 -140236 103006 109516 315727 142462 177375 -66474
10296a16608B37400A2640Q6474c16973D8019Q1771i1506m8247n2246K6060A4235
$$ -116608 237400 12640 99114 -316973 48019 129790 -91506 -139753 -191999 -165939 14235
10284b00736A06853a86869B76356e4213A75437b00588C04732e9849k16757J02786
$$ -200736 106853 -186869 276356 -54213 175437 -200588 304732 -59849 -276606 -173820
10274a73820q037r3938c089j19798r1663L5868K5186j49986a29937B94896c28710
$$ -173820 -181857 -275795 -3089 -122887 -214550 -178682 -153496 -303482 -129937 294896 -328710
10262D2309J59474D7315K25120a41769j7332A21165B7605R6200h8455M2756B80139
$$ 42309 201783 47315 272435 -141769 -159101 121165 27605 123805 -88455 -45699 280139
10250B28974L0555P5277j3852H4135J43558r280L1816p7643K42141A0001R6666
$$ 228974 259529 334806 320954 84135 227693 218413 250229 172586 414727 10001 106667
10239A06667K68355a04732l31572a9313F292c8467B8954J19750b05541A31438
$$ 106667 375022 -104732 -436304 -19313 6292 -38467 28954 148704 -205541 131438
10228b73254Q6700o3796A54386d49142J43716B14896j5937e2592C26851c69380
$$ -273254 -186554 -250350 154386 -449142 -305426 214896 198959 -52592 326851 -369380
10217F4675h4703j16882A32459b44626A62776e4915l9547m499n8809r134l9603
$$ 64675 -84703 -201585 132459 -244626 162776 -54915 -94462 -98961 -157770 -166904 -206507
10206b06507j02785j06222A04469J2923b89297c3898O540j60687H8103f8917H3182
$$ -206507 -309292 -415514 104469 117392 -289297 -33898 -27358 -188045 88103 -68917 83182
10194c45177a67506D524d2541l12923i3832C70859d6357l0117L1741l8607j52502
$$ -345177 -167506 4524 -42541 -355464 -93832 370859 -46357 -76474 -44733 -83340 -235842
10183b35842A31803a06348j2157a0626j33992C9387a84573p8203B80116a85186
$$ -235842 131803 -106348 -118505 -10626 -144618 39387 -184573 -262776 280116 -185186
10172A00708b07533N2575g4530k10499C5472b39695p6115J25460e6043k6090B02023
$$ 100708 -207533 -154958 -74530 -285029 35472 -239695 -315810 -190350 -56043 -82133 202023
10160G3424e7546j02886D7818l951K88543I7749a76260a6549A32686h7092f760
$$ 73424 -57546 -160432 47818 43867 332410 97749 -176260 -16549 132686 -87092 -6760
10148a02180e0663l6678j31246C90189a15622j27865r2983C4612b12535G2739
$$ -102180 -50663 -87341 -218587 390189 -115622 -243487 -336470 34612 -212535 72739
10137a05632p9970b1063m7770l9432q7078C0136a59711q596g7442A37934d3892
$$ -105632 -185602 -21063 -68833 -108265 -195343 30136 -159711 -168307 -77442 137934 -43892
10125a9048j37924N0442A42632k2611a3567G04d5623A16512b06007i3817B19910
$$ -19048 -156972 -106530 142632 120021 -13567 704 -45623 116512 -206007 -93817 219910
10113F3207a84425O5586M3213j16083e2539k06637e7106B33229c05199a12983
$$ 63207 -184425 -118839 -75626 -191709 -52539 -259176 -57106 233229 -305199 -112983
10102a48648o1342A33761n0494d50728g2813H7859P6675a00745j00586A40746
$$ -148648 -209990 133761 83267 -450728 -72813 87859 164534 -100745 -201331 140746
10091A1474a65429m9132I0213b74902a8462o7796o1407f5154A46906a85071j60962
$$ 11474 -165429 -214561 90213 -274902 -18462 -86258 -147665 -65154 146906 -185071 -346033
10080c46033I3037d29014a13837A30300g7203C3732O2109a71945A46150C6520
$$ -346033 93037 -429014 -113837 130300 -77203 33732 95841 -171945 146150 36520
10069F5392n124R9222B8336J7687b13571a04397q3554j11602A71030l046D1716
$$ 65392 60268 159490 28336 46023 -213571 -104397 -187951 -299553 171030 167984 41716
10057A364c20413H2379h7788D2221a90931c1949o954n5075l1221A3735a51306
$$ 1364 -320413 82379 -87788 42221 -190931 -31949 -38903 -93978 -125199 13735 -151306
10045A59582b06713C21416c10676i7436D7452b83975B4961b56382a08259j20717
$$ 159582 -206713 321416 -310676 -97436 47452 -283975 24961 -256382 -108259 -228976
10035b28976Q8846D4264h8773k9988L14k7105n6123A45506b79008a30748j08112
$$ -228976 -140130 44264 -88773 -118761 -118447 -145552 -201675 145506 -279008 -130748 -238860
10024b38860e3971j31622k2995r5189A20167f1834k21200j0072A88642a9391B09787
$$ -238860 -53971 -185593 -208588 -303777 120167 -61834 -283034 -293106 188642 -19391 209787
10012B2392N6944j1968K6198f8567A9206b88613b29k25417K6976R8864n3351G9242
$$ 22392 79336 67368 93566 -68567 19206 -288613 -229 -225646 -198670 -99806 -153157 79242
9999F1495J11969n0885C6240d00558A95959h0888C69778f777A58970a17165b3775
$$ 61495 173464 122579 36240 -400558 195959 -80888 369778 -6777 158970 -117165 -23775
9987C4460c51659a35444A28840D0141J31864n3516J49438j14038g8814j96717
$$ 34460 -351659 -135444 128840 40141 172005 118489 267927 153889 -78814 -275531
9977b75531k01498h8971A35916a4191j05469C5432K07666c12329H668i4778l802
$$ -275531 -477029 -88971 135916 -14191 -119660 35432 243098 -312329 8668 -94778 -98580
9966i8580J3388A574J83762a14065m8018J9862m8336j17374E7067a19058A72445
$$ -98580 -85192 1574 185336 -114065 -162083 -142221 -190557 -307931 57067 -119058 172445
9954a73103l37101i6064J7037A2530J00229J4016A7585F942b74805B53286i0096
$$ -173103 -510204 -96064 -79027 12530 112759 126775 17585 6942 -274805 253286 -90096
9942d1375j01033b9036C2688L2217c0541l41611J77098R559A60445a68179H1597
$$ -41375 -142408 -29036 32688 64905 -30541 -372152 -195054 -185495 160445 -168179 81597
9930B90349j22547a11495n064p9804I3093b52162f2659p7012c1008A35178g4117
$$ 290349 167802 -111495 -116559 -196363 93093 -252162 -62659 -139671 -31008 135178 -74117
9918e4406D7840b32026J7546j31090J44598l3337C09263c677D413b532j03678
$$ -54406 47840 -232026 -214480 -345570 -200972 -234309 309263 -3677 4413 -2532 -106210
9907a06210j80922a33189e588j73710l1673k6185e8347j90824O4020K0317c3063
$$ -106210 -287132 -133189 -5588 -179298 -210971 -237156 -58347 -249171 -185151 -164834 -33063
9895b94436a24325q4464b8146l76919d7860A7071c16543B88499c20514E8894a67968
$$ -294436 -124325 -208789 -28146 -405065 -47860 17071 -316543 288499 -320514 58894 -167968
9883A70512A0148J47983J27822a00306C3333a60279g2983A00896a31947B333k98
$$ 170512 10148 158131 285953 -100306 33333 -160279 -72983 100896 -131947 2333 2035
9872B035a40225p2398L3894A9704a57155k39732I2902d7115A22579a80885N8461
$$ 2035 -140225 -212623 -178729 19704 -157155 -396887 92902 -47115 122579 -180885 -122424
9861a22424n4257Q0669c0696m8273A38834b81113A98253H8978k0738b17095H1166
$$ -122424 -176681 -96012 -30696 -78969 138834 -281113 198253 88978 68240 -217095 81166
9849A01998a57375A8467p961J2614a1106A03286c16460O7514j56160B16889c91208
$$ 101998 -157375 18467 10506 23120 -11106 103286 -316460 -248946 -405106 216889 -391208
9837C52693m1421b68574a15380l7465g3340j68380n6114f6209j07083m8547N6109
$$ 352693 311272 -268574 -115380 -152845 -73340 -241720 -297834 -66209 -173292 -221839 -165730
9826a65730j492G920B911e8612k02665d0112A97926b61114B29762A08161N123
$$ -165730 -167222 7920 2911 -58612 -261277 -40112 197926 -261114 229762 108161 113284
9815A13284J24167a55506b6589j31707L6404b1276B38020K1249c559j23007J7254
$$ 113284 237451 -155506 -26589 -158296 -121892 -21276 238020 259269 -3559 -126566 -109312
9804a09312c3269D8782K83389b41123E994h4239A43817b23525b6069A63763E2781
$$ -109312 -33269 48782 332171 -241123 5994 -84239 143817 -223525 -26069 163763 52781
9792a12199K33F3602a15420k85123E0403f4711M180B73605d6134j10407A13551
$$ -112199 -111966 63602 -115420 -400543 50403 -64711 -60531 273605 -46134 -156541 113551
9780a5589q1914l05730b2527G8082a95120C0714a4963N804j75316k8739A33612
$$ -15589 -97503 -403233 -22527 78082 -195120 30714 -14963 -9159 -184475 -213214 133612
9768A14733E677d8690k26148A51579J11844b07662C8644e6906j84742I3423g83
$$ 114733 5677 -48690 -274838 151579 263423 -207662 38644 -56906 -241648 93423 -783
9756D3024a09993k50086D23203e1983A11564d3296E2576N9428b40743c8937n5168
$$ 43024 -109993 -360079 423203 -51983 111564 -43296 52576 112004 -240743 -38937 -94105
9745i4105B0618a55089l8169c3798k49610i0295G5680K49a54303C94972H4198
$$ -94105 20618 -155089 -193258 -33798 -283408 -90295 75680 75929 -154303 394972 84198
9733A28151i780B11777D4028K32666E8124c31744e0815j96453g9311A18900f6265
$$ 128151 -9780 211777 44028 276694 58124 -331744 -50815 -247268 -79311 118900 -66265
9721B78430b34194d8861j84457A2310a81845H0566K9303b04097D8135a72949A44892
$$ 278430 -234194 -48861 -233318 12310 -181845 80566 109869 -204097 48135 -172949 144892
9709F0085a44351E8510J15773F0687c7211j68447A00964a63599C6187a26010A56709
$$ 60085 -144351 58510 174283 60687 -37211 -205658 100964 -163599 36187 -126010 156709
9697D5735R86c3022D1521K17561a28927k6249O4484k5722a766C65911A36689K94487
$$ 45735 46721 -33022 41521 259082 -128927 -155176 -90692 -116414 -1766 365911 136689 431176
9685D31176b42108j2652O5642G3972a67999A83706i4796q7415L7939j67917a27114
$$ 431176 -242108 -254760 -189118 73972 -167999 183706 -94796 -182211 -144272 -312189 -127114
9673c353k76273j39801h327k90032g8064C9781b44331l4578K6983a4815j07497
$$ -3353 -279626 -419427 -8327 -298359 -78064 39781 -244331 -278909 -251926 -14815 -122312
9662a22312J5015j57937E9361b3495k01977a278j84700n0081A11894c27468a59929
$$ -122312 -107297 -265234 59361 -23495 -225472 -1278 -185978 -236059 111894 -327468 -159929
9650A23130a30252l05656a70125g5588l39571A69653P3501f2191B3749c03847
$$ 123130 -130252 -435908 -170125 -75588 -415159 169653 243154 -62191 23749 -303847
9639A57519L6353B5800J44060R376F9505A717J81210G3301b99015j3115I2528
$$ 157519 193872 25800 169860 179236 69505 1717 182927 73301 -299015 -312130 92528
9627C3165a51475j71687B20631c9800A78021A0837J3456a06837m54407a51264
$$ 33165 -151475 -323162 220631 -39800 178021 10837 24293 -106837 -561244 -151264
9616f4693j52967C0737i5875k28698a54088A51332c6031C9830Q2891e9192k19858
$$ -64693 -217660 30737 -95875 -324573 -154088 151332 -36031 39830 122721 -59192 -279050
9605b79050a9818G872J26098b02271M6405E6614K42078b98662i4929j23785J57
$$ -279050 -19818 7872 133970 -202271 -155866 56614 298692 -298662 -94929 -218714 -218557
9594b18557f9581A08007a81745o391g2752J3204q807B01148a16419I8936a5353
$$ -218557 -69581 108007 -181745 -188136 -72752 -59548 -68355 201148 -116419 98936 -15353
9582e1749Q004j00131l6597H6535a62642B11688h7050j29262J1508R7741P966
$$ -51749 -43745 -143876 -180473 86535 -162642 211688 -87050 -216312 -204804 -107063 -99097
9571i9097j39651D9427a37579O002B1513b69133C12303c93045B68048a99529A2514
$$ -99097 -238748 49427 -137579 -131577 21513 -269133 312303 -393045 268048 -199529 12514
9559a16908k76950i9156A67482H1806b03128A34880R8429a48187j5439B64505
$$ -116908 -393858 -99156 167482 81806 -203128 134880 233309 -148187 -163626 264505
9548a11994r7959B92874B546b60038A73648c82735g5003O419k03060C5373O2198
$$ -111994 -209953 292874 2546 -260038 173648 -382735 -75003 -68584 -271644 35373 97571
9537I7571J43858a12055I0500c63033A97942a53169c746k16603G1606d1180j95558
$$ 97571 241429 -112055 90500 -363033 197942 -153169 -3746 -220349 71606 -41180 -236738
9526b36738f4394p3411O7904j15846A99821c4683D4958g0786j65739j5544J5432
$$ -236738 -64394 -137805 -69901 -185747 199821 -34683 44958 -70786 -236525 -252069 -236637
9515b36637a9020E6601a40807j4091i199l9985k03402o4787J56288A66551a91104
$$ -236637 -19020 56601 -140807 -154898 -9199 -49184 -252586 -317373 -161085 166551 -191104
9503c985B28318d0507q6147j01472F213k134b55455b657j54208k4997B68304d7535
$$ -3985 228318 -40507 -126654 -228126 6213 4079 -255455 -2657 -156865 -181862 268304 -47535
9490c57203A82403b79383a24902N9513j68715e2712k51600a36270A10321e9477
$$ -357203 182403 -279383 -124902 -65389 -234104 -52712 -304312 -136270 110321 -59477
9479A01333D9436c33762C22131b5477k94962I9526b76243A74208b31949F4309
$$ 101333 49436 -333762 322131 -25477 -320439 99526 -276243 174208 -231949 64309
9468G894b02801j00334N4620d8247A58182m3233A3536m63a3007j07936k2993O7074
$$ 7894 -202801 -303135 -248515 -48247 158182 114949 13536 13073 -13007 -120943 -143936 -76862
9456g6862A29704c3037j39858B22098a25331J1278j11635P6512A4806K55643a23868
$$ -76862 129704 -33037 -172895 222098 -125331 -114053 -225688 -149176 14806 270449 -123868
9444b96541l9437J34478c6936F745a68830k6526j10317g8309F0412a5907B5715
$$ -296541 -335978 -201500 -36936 6745 -168830 -195356 -305673 -78309 60412 -15907 25715
9432a33517O5709k35510O7145A21977B8182P7230F923a65633C0687J1519a26236
$$ -133517 -67808 -303318 -236173 121977 28182 105412 6923 -165633 30687 42206 -126236
9420b06049E9906f7513A01112a45406e4425j67651p7426J11125A04271a4201j09375
$$ -206049 59906 -67513 101112 -145406 -54425 -222076 -299502 -188377 104271 -14201 -123576
9409a23576H2206N204b75710G9087g9583j8838d3291j59787b8276m7019k72478
$$ -123576 82206 87410 -275710 79087 -79583 -98421 -43291 -203078 -28276 -75295 -347773
9398c47773a42167i508G9419J86224a1646A2930b0901k6342A7961j51a53787A1299
$$ -347773 -142167 -9508 79419 265643 -11646 12930 -20901 -47243 17961 17810 -153787 11299
9385A10317K37252a39086C6767P1587a11252F0991j4957c2113j45756K3212j72130
$$ 110317 347569 -139086 36767 108354 -111252 60991 46034 -32113 -177869 -154657 -326787
9374c26787i0816k12478J47689m9038p4549A37448b75500B0876J41740a66942
$$ -326787 -90816 -303294 -155605 -204643 -279192 137448 -275500 20876 162616 -166942
9363b63459L7398i1662C33345b57757e1438D9151a39067M6520j31295P1750P2235
$$ -263459 -226061 -91662 333345 -257757 -51438 49151 -139067 -92547 -223842 -152092 -79857
9352g9857j81649A27817d4394n6663M7040r6869l83321a06573B4016b03212A9917
$$ -79857 -261506 127817 -44394 -101057 -54017 -150886 -534207 -106573 24016 -203212 19917
9340f9046H0043L17082f3769J8307B4403J0620A5782b51191A39696f1297j17506
$$ -69046 80043 397125 -63769 -45462 24403 35023 15782 -251191 139696 -61297 -178803
9329a78803M7833c5755A78652J17672b53968h5689E6413h2150J7343b3395q1935
$$ -178803 -130970 -35755 178652 296324 -253968 -85689 56413 -82150 -64807 -23395 -105330
9318a05330e2629k60537c710l55278I2030d7834A31609a52068B04630d4153A86213
$$ -105330 -52629 -313166 -3710 -358988 92030 -47834 131609 -152068 204630 -44153 186213
9306a11816B54711C1223O8191b26436B4802K1798a30310a8116A00386j038g0363
$$ -111816 254711 31223 99414 -226436 24802 46600 -130310 -18116 100386 99348 -70363
9294a50405J3448I571k04J30627b30833E943R9638d1841I5450K04128d80246i2270
$$ -150405 -136957 9571 9367 139994 -230833 5943 105581 -41841 95450 299578 -480246 -92270
9281a83901h8108I1780e7061A7647R6290a85655g7411j3794n1343f5632k35975
$$ -183901 -88108 91780 -57061 17647 113937 -185655 -77411 -91205 -142548 -65632 -301607
9270c01607B96904I3191k5797b07027d9663A26544a0754j2993J636j27964L2901
$$ -301607 296904 93191 67394 -207027 -49663 126544 -10754 -23747 -22111 -150075 -117174
9259a17174j9959a7173A42720c6604A06011a24188A48384a52527D1635N2524J28054
$$ -117174 -137133 -17173 142720 -36604 106011 -124188 148384 -152527 41635 94159 222213
9248B22213a15912N629A51390b95794f8326k83055C4479b64137B69914d53118
$$ 222213 -115912 -110283 151390 -295794 -68326 -351381 34479 -264137 269914 -453118
9237C5610b2026j72890A42525a46212A09249a20162j90646A0785P834K08349a17554
$$ 35610 -22026 -194916 142525 -146212 109249 -120162 -310808 10785 18619 226968 -117554
9225a08810j87003i710E212a01624A3989K31138I9207a56478g4449o1855j14455
$$ -108810 -295813 -9710 5212 -101624 13989 245127 99207 -156478 -74449 -136304 -250759
9214b50759J03309a5844A33940a37207e3489r0282F6595c87657i5245a4739o5631
$$ -250759 -147450 -15844 133940 -137207 -53489 -143771 66595 -387657 -95245 -14739 -80370
9203h0370j81245F6506c51807M9111b3564q4334A8996J7380f2453A49930a81233
$$ -80370 -261615 66506 -351807 -302696 -23564 -107898 18996 36376 -62453 149930 -181233
9191i1026a3131k84006a5538j00559j99109a27731B0677I118L47174a09927a5526
$$ -91026 -13131 -297137 -15538 -116097 -315206 -127731 20677 9118 356292 -109927 -15526
9179b2626E4714K02565a52232A8211e9333k23407A95165f8743p8962A07524g1585
$$ -22626 54714 257279 -152232 18211 -59333 -282740 195165 -68743 -147705 107524 -71585
9167b54121e597k43018A17163h6100B0542a65416A13417Q6199a91037q1445b0409
$$ -254121 -5597 -248615 117163 -86100 20542 -165416 113417 199616 -191037 -272482 -20409
9155f2153p1107C01721A39015e4976A691b97475E4030J41103a52888K37r77f5826
$$ -62153 -133260 301721 139015 -54976 1691 -297475 54030 195133 -152888 -152651 -153628 -65826
9142b98010E0823b44751g775D2528i3900K5208q1230d0669j35159A36109E2342
$$ -298010 50823 -244751 -7775 42528 -93900 -68692 -149922 -40669 -175828 136109 52342
9130H5960J3380c32008e3841j93446N0454R1701o0533g9893q1882k2496k19308
$$ 85960 99340 -332008 -53841 -247287 -196833 -105132 -165665 -79893 -161775 -184271 -403579
9119d03579J06724F6427L27954b25448D1185h7236B679d8641f352p103A10551
$$ -403579 -296855 66427 394381 -225448 41185 -87236 2679 -48641 -6352 -13455 110551
9107b29994m8762R1548k07441B30751a17713K9959H6440J54190A9055a04079F7280
$$ -229994 -278756 -187208 -394649 230751 -117713 -87754 86440 240630 19055 -104079 67280
9095a55408I3245J68832D9056a06646m742C478b13464A71881B9098c30595J56822
$$ -155408 93245 262077 49056 -106646 -111388 3478 -213464 171881 29098 -330595 -173773
9084a73773a7198k02790j46751A55231K671L5468e4996C7782a00431j83372a27468
$$ -173773 -17198 -219988 -366739 155231 157902 193370 -54996 37782 -100431 -283803 -127468
9072b14431B43742E9107d1228G3321c8389j06786f5284k6329a4527j07249k9712
$$ -214431 243742 59107 -41228 73321 -38389 -145175 -65284 -91613 -14527 -121776 -151488
9061a51488j15876d3703j33646P0723A64719b0337q2589A44907a07279M8438G8181
$$ -151488 -267364 -43703 -177349 -106626 164719 -20337 -102926 144907 -107279 -58841 78181
9049a08820d4796g676B37005f2588j009Q125j09090C6516J27443a7381n580N958
$$ -108820 -44796 -7676 237005 -62588 -63597 -55472 -164562 36516 163959 -17381 -22961 -17003
9037a7003A68235a59853j34041e7843k42451D876d8999E5736M5839A3907a22974
$$ -17003 168235 -159853 -293894 -57843 -300294 4876 -48999 55736 101575 13907 -122974
9025h4F8503b71331e4277I4041e9223k0948j73010M9143N8463A25015k6258J34562
$$ -84 68503 -271331 -54277 94041 -59223 -80171 -253181 -204038 -145575 125015 98757 233319
9013B33319H3245K9529E5894b21816B19969N3471b42059E2864P7688h388k14592
$$ 233319 83245 112774 55894 -221816 219969 273440 -242059 52864 130552 -8388 -222980
9002b22980a01285n7280e7394J7654j71416l8522b1349k696o9205j03238e1146
$$ -222980 -101285 -158565 -57394 -39740 -211156 -249678 -21349 -24045 -93250 -196488 -51146
8990I4044b28854d7295p9554n1793e2634a507H1462b95298O4129A65426c54101
$$ 94044 -228854 -47295 -126849 -178642 -52634 -1507 81462 -295298 -231169 165426 -354101
8978A65649a93781Q4063J8131j56288b1646A3711J93226b23571j84674a29136
$$ 165649 -193781 -109718 -91587 -247875 -21646 13711 206937 -223571 -408245 -129136
8967B2006b78688I6631m4836g4620j71390G5682k5613J59540b16168h1154L6450
$$ 22006 -278688 96631 51795 -74620 -246010 75682 50069 209609 -216168 -81154 -44704
8956d4704k21299A9275a39969n11J0451j28789O9742p2904I7040f0572B2101M0603
$$ -44704 -266003 19275 -139969 -140480 -130029 -258818 -189076 -261980 97040 -60572 22101 62704
8944F2704J7533e0770A04132e46086K60190i8913l9115f1976F127b63993C46337
$$ 62704 80237 -50770 104132 -546086 -285896 -98913 -138028 -61976 6127 -263993 346337
8932A60740n4153a56528K1345H7137b07209h7314B07117i6247K7011j80896c7230
$$ 160740 106587 -156528 -135183 87137 -207209 -87314 207117 -96247 -69236 -250132 -37230
8920B56649h2068A57187L907Q1969j11181B9814J73900M0547K36214m0932J51818
$$ 256649 -82068 157187 161094 243063 131882 29814 203714 244261 480475 439543 591361
8909E91361N23406Q30771J655314N646553m55333m250552j535197j120370p34953
$$ 591361 1114767 1945538 3600852 9247405 8792072 4541520 3006323 1885953 1151000
8900A151000l22062k45550q3397j44251r9448I6724J30785n4903P2093o6525b911
$$ 1151000 828938 583388 499991 355740 256292 96724 227509 172606 244699 178174 -2911
8888B07204K02501A3215b0219H243K79360G5905l6619J4788a77108A89701D7365
$$ 207204 409705 13215 -20219 8243 287603 75905 39286 54074 -177108 189701 47365
8876E5792L08736E501g5724a4387j59477j9010M5662j27396f4145a1712j19836
$$ 55792 364528 5501 -75724 -14387 -173864 -192874 -147212 -274608 -64145 -11712 -131548
8865a31548J1505H9486l5028P932c23962a02081j71296c9417j75002A94078q9709
$$ -131548 -120043 89486 54458 62390 -323962 -102081 -273377 -39417 -214419 194078 104369
8854A04369b92024q0151B21271a08960p6934A66545c7859k10492l0418a15031
$$ 104369 -292024 -372175 221271 -108960 -185894 166545 -37859 -248351 -278769 -115031
8843a73836g6529K8766p0755j47624J22702g35l69471h9488p9628L2007j56604
$$ -173836 -76529 -47763 -118518 -266142 -143440 -735 -370206 -89488 -169116 -137109 -293713
$$ [...]
##END NTUPLES=NMR SPECTRUM
##END=
