
##TITLE=AC1222_Punto_6074794_1Xs9jaGfa0
##JCAMPDX= 6.0         $$ Bruker NMR JCAMP-DX V2.0
##DATA TYPE= NMR SPECTRUM
##DATA CLASS= NTUPLES
##ORIGIN= BRUKER
##OWNER= Administrator
$$ 1.72 TOPSPIN		Version 2.1
$$ 2012-05-09 01:45:12.093 -0500  Administrator@TOPSPIN
$$ Compression mode = diff/dup
##.OBSERVE FREQUENCY= 400.13188235
##.OBSERVE NUCLEUS= ^1H
##.ACQUISITION MODE= SIMULTANEOUS (DQD)
##.ACQUISITION SCHEME= undefined
##.AVERAGES= 8
##.DIGITISER RES= 22
##SPECTROMETER/DATA SYSTEM= spect
##.PULSE SEQUENCE= zg30
##.SOLVENT NAME= COFFEE_meoh
##.SHIFT REFERENCE= INTERNAL, COFFEE_meoh, 1, 14.98061
##AUDIT TRAIL= $$ (NUMBER, WHEN, WHO, WHERE, PROCESS, VERSION, WHAT)
$$ ##TITLE= Audit trail, TOPSPIN		Version 2.1
$$ ##JCAMPDX= 5.01
$$ ##ORIGIN= Bruker BioSpin GmbH
$$ ##OWNER= Administrator
$$ $$ C:\Bruker\TOPSPIN/data/COFFEE/nmr/AC1222_Punto_6074794_1Xs9jaGfa0/120/pdata/1/auditp.txt
$$ ##AUDIT TRAIL=  $$ (NUMBER, WHEN, WHO, WHERE, PROCESS, VERSION, WHAT)
(   1,<2012-05-09 01:45:05.140 -0500>,<Administrator>,<TOPSPIN>,<go>,<TOPSPIN 2.1>,
      <created by zg
	started at 2012-05-09 01:43:58.531 -0500,
	POWCHK enabled, PULCHK disabled,
       configuration hash MD5:
       AF F2 23 6B 01 CD 40 DD E5 A1 38 A0 06 EA F7 77
       data hash MD5: 64K
       CF 9B 79 E4 B8 93 E6 3A 2A 82 A0 9E 1F BC 6F E2>)
(   2,<2012-05-09 01:45:07.734 -0500>,<Administrator>,<TOPSPIN>,<proc1d>,<TOPSPIN 2.1>,
      <Start of raw data processing
       efp LB = 0 FT_mod = 6 PKNL = 1 PHC0 = 0 PHC1 = 0 SI = 32K 
       data hash MD5: 32K
       74 C7 00 27 37 71 98 6D 61 44 52 D0 B0 7D 55 D3>)
(   3,<2012-05-09 01:45:08.109 -0500>,<Administrator>,<TOPSPIN>,<proc1d>,<TOPSPIN 2.1>,
      <pk PHC0 = 208.5754 PHC1 = 0 
       data hash MD5: 32K
       A0 6C 89 3F 8A EE 0F 68 1C B7 75 FD F5 1F 51 34>)
(   4,<2012-05-09 01:45:08.234 -0500>,<Administrator>,<TOPSPIN>,<proc1d>,<TOPSPIN 2.1>,
      <abs ABSG = 1 
       data hash MD5: 32K
       03 17 49 DF 3D 5B 5E FD 56 62 52 D6 C3 DD 73 9A>)
(   5,<2012-05-09 01:45:08.281 -0500>,<Administrator>,<TOPSPIN>,<proc1d>,<TOPSPIN 2.1>,
      <abs ABSG = 2 
       data hash MD5: 32K
       6B C0 D0 EB D6 9D DA 9A 9B 83 2A C7 F2 7C 96 7C>)
(   6,<2012-05-09 01:45:08.312 -0500>,<Administrator>,<TOPSPIN>,<proc1d>,<TOPSPIN 2.1>,
      <abs ABSG = 3 
       data hash MD5: 32K
       D1 F1 87 96 30 85 39 E9 15 E4 27 3C 58 4A 61 77>)
(   7,<2012-05-09 01:45:08.343 -0500>,<Administrator>,<TOPSPIN>,<proc1d>,<TOPSPIN 2.1>,
      <abs ABSG = 4 
       data hash MD5: 32K
       E8 2F E5 FB 48 BF A8 C4 D5 3C FA 4A 5A DB 73 66>)
(   8,<2012-05-09 01:45:08.359 -0500>,<Administrator>,<TOPSPIN>,<proc1d>,<TOPSPIN 2.1>,
      <abs ABSG = 5 
       data hash MD5: 32K
       6B FD 27 65 F2 08 65 7C CD 93 BB 41 74 BC B3 8E>)
$$ ##END=
$$ 
$$ $$ hash MD5
$$ $$ D3 C5 E6 13 52 C1 A3 FB E5 E5 C9 99 4F 25 AB 43
##$RELAX= 
##$RELAX= 
##$RELAX= 
##$RELAX= 
##$RELAX= 
##$RELAX= 
##$RELAX= 
$$ Bruker specific parameters
$$ --------------------------
$$ [...]
##$TP= (0..7)
150 150 150 150 150 150 150 150
##$TP07= 0
##$TPNAME0= <>
##$TPNAME1= <>
##$TPNAME2= <>
##$TPNAME3= <>
##$TPNAME4= <>
##$TPNAME5= <>
##$TPNAME6= <>
##$TPNAME7= <>
##$TPOAL= (0..7)
0.5 0.5 0.5 0.5 0.5 0.5 0.5 0.5
##$TPOFFS= (0..7)
0 0 0 0 0 0 0 0
##$TUNHIN= 0
##$TUNHOUT= 0
##$TUNXOUT= 0
##$USERA1= <user>
##$USERA2= <user>
##$USERA3= <user>
##$USERA4= <user>
##$USERA5= <user>
##$V9= 5
##$VALIST= <valist>
##$VCLIST= <CCCCCCCCCCCCCCC>
##$VD= 0
##$VDLIST= <DDDDDDDDDDDDDDD>
##$VPLIST= <PPPPPPPPPPPPPPP>
##$VTLIST= <TTTTTTTTTTTTTTT>
##$WBST= 1024
##$WBSW= 4
##$XGAIN= (0..3)
0 0 0 0
##$XL= 0
##$YL= 0
##$YMAX_a= 493833
##$YMIN_a= -607157
##$ZGOPTNS= <>
##$ZL1= 120
##$ZL2= 120
##$ZL3= 120
##$ZL4= 120
##$ABSF1= 14.98061
##$ABSF2= -5.57192
##$ABSG= 5
##$ABSL= 3
##$ALPHA= 0
##$AQORDER= 0
##$ASSFAC= 0
##$ASSFACI= 0
##$ASSFACX= 0
##$ASSWID= 0
##$AUNMP= <proc_prof1d_extract_pilot.lims>
##$AXLEFT= 0
##$AXNAME= <>
##$AXNUC= <1H>
##$AXRIGHT= 0
##$AXTYPE= 0
##$AXUNIT= <>
##$AZFE= 0.1
##$AZFW= 0.1
##$BCFW= 0
##$BC_mod= 0
##$BYTORDP= 0
##$COROFFS= 0
##$CY= 15
##$DATMOD= 1
##$DC= 0
##$DFILT= <>
##$DTYPP= 0
##$F1P= 0
##$F2P= 0
##$FCOR= 0.5
##$FTSIZE= 32768
##$FT_mod= 6
##$GAMMA= 0
##$GB= 0
##$INTBC= 1
##$INTSCL= 1
##$ISEN= 128
##$LB= 0
##$LEV0= 0
##$LPBIN= 0
##$MAXI= 10000
##$MC2= 0
##$MEAN= 0
##$ME_mod= 0
##$MI= 0
##$NCOEF= 0
##$NC_proc= -8
##$NLEV= 6
##$NOISF1= 0
##$NOISF2= 0
##$NSP= 0
##$NTH_PI= 0
##$NZP= 0
##$OFFSET= 14.98061
##$PC= 1
##$PHC0= 208.5754
##$PHC1= 0
##$PH_mod= 1
##$PKNL= yes
##$PPARMOD= 0
##$PPDIAG= 0
##$PPIPTYP= 0
##$PPMPNUM= 2147483647
##$PPRESOL= 1
##$PSCAL= 4
##$PSIGN= 0
##$PYNMP= <proc.py>
##$REVERSE= no
##$SF= 400.13
##$SI= 32768
##$SIGF1= 0
##$SIGF2= 0
##$SINO= 400
##$SIOLD= 32768
##$SPECTYP= <>
##$SREGLST= <1H.CDCl3>
##$SSB= 0
##$STSI= 32768
##$STSR= 0
##$SW_p= 8223.68421052632
##$SYMM= 0
##$S_DEV= 0
##$TDeff= 65536
##$TDoff= 0
##$TI= <>
##$TILT= no
##$TM1= 0
##$TM2= 0
##$TOPLEV= 0
##$USERP1= <user>
##$USERP2= <user>
##$USERP3= <user>
##$USERP4= <user>
##$USERP5= <user>
##$WDW= 1
##$XDIM= 32768
##$YMAX_p= 424999348
##$YMIN_p= -724650
##$CURPLOT= <Network HP LaserJet P1505>
##$CURPRIN= <$Network HP LaserJet P1505>
##$DFORMAT= <normdp>
##$LAYOUT= <+/1D_H.xwp>
##$LFORMAT= <normlp>
##$PFORMAT= <normpl>
##$SURQMSG= 1
$$ End of Bruker specific parameters
$$ ---------------------------------
##NTUPLES= NMR SPECTRUM
##VAR_NAME=  FREQUENCY,     SPECTRUM/REAL,   SPECTRUM/IMAG
##SYMBOL=    X,             R,               I
##VAR_TYPE=  INDEPENDENT,   DEPENDENT,       DEPENDENT
##VAR_FORM=  AFFN,          ASDF,            ASDF
##VAR_DIM=   32768,         32768,           32768
##UNITS=     HZ,            ARBITRARY UNITS, ARBITRARY UNITS
##FACTOR=    0.250966925370066, 1,           1
##FIRST=     8223.43324360095, 109783,       -24142
##LAST=      0,             -86026,          -27597
##MIN=       0,             -724650,         0
##MAX=       8223.43324360095, 424999348,    0
$$ Real data points
##PAGE= N=1
##DATA TABLE= (X++(R..R)), XYDATA
$$ [...]
$$ plain form
19548 -129983 370009 -27940 -78121 -85586 60439 4333 -215247 152444 47680 -123700 -75154
19537 -75154 -101103 53626 248288 -157422 138818 -267909 83527 267282 -104689 -9233 -82771
19526 -82771 -241180 250461 113559 -19722 -277166 36629 -110554 153103 13129 55089
19516 55089 -270511 -119814 -299296 -164986 -175272 -365566 -353039 -83076 122827 -64855
19505 -17956 -106655 -139901 -251131 89669 -152903 93659 -263319 -16209 -245065 -222644 -61459
19493 -127490 50673 8065 98604 -226158 -4415 98847 19490 -339454 -97098 -130587 147354
19481 -131432 -253036 -76529 -76989 311722 39749 37413 -21505 -25458 -164186 -186770 -17581 993
19468 -347154 -124347 -228876 -147540 -342209 -25225 -11803 -6219 445803 -150163 -74514 40581
$$ packed form
19548a29983C70009b7940n0181p465F0439D333b15247A52444D7680a23700M8546
19537g5154k5949E3626J94662a57422A38818b67909H3527J83755a04689i233p3538
19526h2771j58409B50461A13559a9722k57444C6629a10554A53103A3129M1960
19516E5089b70511a19814j79482J34310j0286j90294J2527h3076A22827f4855
19505a7956q8699l3246j11230H9669a52903I3659b63319a6209k28856K2421f1459
19493a27490E0673H065R0539b26158d415I8847A9490c39454i7098l3489A47354
19481a31432j21604g6529m60C11722C9749k336b1505l953j38728k2584a7581I93
19468c47154a24347j04529Q1336j94669b5225a1803N584D45803a50163g4514D0581
$$ plain form
19456 -15863 -209625 92490 141950 -230546 -124950 7078 -226389 -76659 92692 -246791 176698
19444 -13922 -388983 -165321 232007 153426 -38600 -45811 -175090 -283223 -418623 158373
19433 -297403 -140811 -114572 -251720 104305 -121449 105290 149340 313654 61836 335938
19423 335938 -443084 -86480 16467 -129653 -27965 96944 138757 -121220 68189 -40619 174285
19411 89274 78677 -246740 126653 -83736 -273069 -309905 -76167 -131720 -101114 -77119 -133413
19400 -133413 -83282 -246745 -33728 -147462 -404407 -217530 -23449 -264306 80160 -74194
19389 29783 160955 96558 -102351 91050 -53846 53544 320767 -14657 -213025 169812 -11923
19377 -69781 67915 -41752 -378982 -91251 69149 -32129 -337806 -220973 -149398 -345219 -124706
$$ packed form
19456a5863j93762I2490M9460b30546J05596G078b26389g6659I2692b46791A76698
19444a3922l75061a65321B32007p8581c8600p211j29279j08133j35400A58373
19433b97403a40811K6239j37148A04305a21449A05290M4050J64314F1836K74102
19423C35938d43084h6480A6467a29653b7965I6944M1813a21220F8189d0619A74285
19411H9274j0597b46740A26653h3736j89333l6836g6167n5553L0606K3995n6294
19400a33413N0131j63463c3728j13734k56945J86877b3449k40857H0160g4194
19389B9783J31172o4397a02351I1050e3846E3544K67223a4657j98368A69812a1923
19377f9781F7915d1752l37230i1251F9149c2129l05677J16833P1575j95821a24706
$$ plain form
19365 -24278 -225357 -356881 50097 -13821 78931 172169 -111333 14307 -352241 -16951 -132135
19354 -132135 182362 -44423 -7022 196531 96754 -67290 72481 -258098 -467871 17651 -118004
19342 -271421 -282307 -166194 -123316 -69021 -237819 112768 322194 -209632 -326897 -194009
19332 -194009 51535 -152340 199 -13366 -153064 -250914 -27551 -108364 13463 35262 -242222
19320 164361 -135473 246468 -152019 -214131 -45753 -98794 -26327 -141032 -130028 17904 361212
19309 361212 -211945 -106206 -183852 -322955 -196459 -61474 -177535 191671 -38509 -118266
19299 -118266 203168 119479 -121883 231662 -138941 3640 -111302 234496 -11625 -17109 42812
19287 8190 -98407 -69609 -204818 -152926 -240121 26169 -619070 -174057 -137879 212914 250211
$$ packed form
19365b4278k01079j31524E0097a3821G8931R3238a11333A4307c52241a6951j15184
19354a32135A82362d4423g022A96531I6754f7290G2481b58098k09773A7651a18004
19342b71421j0886J16113M2878N4295j68798A12768K09426b09632j17265J32888
19332a94009E1535a52340A99a3366j39698r7850b7551q0813A3463K1799b42222
19320A64361a35473B46468a52019o2112d5753n3041b6327j14705J1004A7904L43308
19309C61212b11945J05739p7646j39103J26496f1474j16061A91671c8509p9757
19299a18266B03168q3689a21883B31662a38941C640a11302B34496a1625n484D2812
19287H190i8407K8798j35209N1892q7195B6169f19070a74057L6178B12914L7297
$$ plain form
19276 250211 208153 87659 65108 81633 25934 -65276 231908 -359939 37623 -82862 100008
19264 -8134 -243647 196992 -221410 14909 16494 239488 -51081 -296315 81378 13928 -14186
19252 -278952 -139594 -167471 67871 212040 -103993 -37441 -35145 -170591 172031 -376795
19241 -334120 -3794 90623 -108326 166724 -149573 -58251 4014 206545 -450671 -249246 -132015
19230 -132015 117292 81050 -57503 -218005 -157401 -116476 -108234 31847 -70253 -55986 -92162
19219 -92162 -200353 131733 -28877 238591 130928 67540 110767 106307 -553209 -189456 101261
19207 -16416 -478844 -208391 63988 -21321 231278 -69318 -41777 -120959 -196194 -138984 -58597
19195 9700 -184817 -363866 -169459 -118732 75636 72620 363843 97535 -44902 -147488 42306
$$ packed form
19276B50211m2058H7659k2551J6525B5934f5276B31908c59939C7623h2862A00008
19264h134k35513A96992b21410A4909J585K22994e1081k45234H1378A3928a4186
19252b78952J39358k7877F7871J44169a03993c7441K296j35446A72031c76795
19241c34120c794I0623a08326A66724a49573e8251D014K02531d50671K01425J17231
19230a32015A17292l6242e7503j60502O0604M0925Q242C1847g0253J4267l6176
19219i2162j08191A31733b8877B38591j07663o3388M3227m460e53209a89456A01261
19207a6416m62428b08391F3988b1321B31278f9318K7541p9182p5235N7210e8597
19195I700a84817j79049a69459N0727G5636l016K91223I7535d4902j02586D2306
$$ plain form
19183 -190697 39683 93359 16702 50093 -69243 224088 -5238 146534 45390 -53571 -77713
19172 -77713 -154587 -266565 -8367 150682 -258643 180781 173193 104587 -155678 -187176 149809
19160 -164944 -136047 -291044 163286 28036 -159150 -313618 42317 -118486 -282873 -143553
19150 -143553 -47740 42482 51017 -386671 64558 -17055 -25076 -20236 -248242 -143171 40579
19138 228977 -145067 -101867 -24792 -233352 -191081 -135258 -151673 149456 -224223 208429
19127 191334 101856 1540 -386930 -268343 66114 41313 -171008 -107240 206751 31069 -175424
19115 272071 -132602 88389 -103346 -135157 307485 229114 128918 61611 -217301 -105064
19104 40186 245387 -164490 -329920 -190574 -48825 40164 158810 174640 -107574 -33070
$$ packed form
19183a90697C9683N3676A6702L3391f9243B24088e238A46534D5390e3571k4142
19172g7713p6874j11978h367A50682b58643A80781p588o8606a55678l1498A49809
19160a64944K8897j54997A63286B8036a59150j54468D2317a18486j64387J39320
19150a43553d7740D2482Q535c86671F4558a7055q021M840k28006J05071D0579
19138B28977a45067M3200b4792k08560M2271N5823j6415A49456b24223B08429
19127A91334q9478A540c86930J18587F6114k4801a71008O3768B06751C1069a75424
19115B72071a32602H8389a03346l1811C07485p8371j00196F1611b17301a05064
19104D0186K05201a64490j65430J39346d8825D0164J18646J5830a07574c3070
$$ plain form
19093 176885 -340842 377526 -16259 -140483 106126 -129376 -274394 156960 -48231 53845
19082 335608 -62025 -32314 -23420 81170 7618 -78526 -118353 -17214 -85760 -269584 49923 -108825
19069 -220367 343519 -236215 82832 -204047 67749 -42031 61099 11621 -269993 -350486 -79774
19057 7726 -218563 50028 1956 -164864 107974 -370698 96232 -381620 -66601 -223740 -123732
19046 -123732 -26879 70787 -39062 223101 -189602 -264569 211259 90259 -79276 367284 -52530
19034 -240947 42161 -229969 -47230 -148695 220117 -20191 -22246 169169 -116230 -172831 -157738
19023 -157738 -369084 -281191 -126610 -85344 229218 -7578 145811 78739 85583 -59522 332610
19011 80441 532632 -99845 8576 -30512 -150742 154777 -107708 -44528 80152 179262 -20071
$$ packed form
19093A76885c40842C77526a6259j24224A06126a29376j45018A56960d8231E3845
19082C35608f2025K9711Q894H1170G618g8526l9827a7214o8546j83824D9923a08825
19069b20367C43519b36215H2832b04047F7749d2031F1099A1621b69993q0493g9774
19057G726b18563E0028A956a64864A07974c70698I6232c81620f6601j57139J00008
19046a23732b6879G0787c9062B23101a89602p4967B11259I0259g9276C67284e2530
19034b40947D2161b29969d7230j01465B20117b0191k055A69169a16230n6601J5093
19023a57738k11346Q7893a26610M1266B29218g578A45811o7072O844e9522C32610
19011H0441M52191i9845H576c0512j20230A54777a07708d4528H0152R9110b0071
$$ plain form
18999 358870 -154159 -277711 -71921 63871 -73386 -148638 -197894 -42903 -51360 -287864 122075
18987 2704 -29346 122446 86634 -331932 -356953 -157563 28749 112900 -40383 77275 -198899
18975 -194570 22922 -165873 -56091 208988 124682 -34931 -194136 -87428 83536 165479 -146000
18963 -253303 186556 271381 148591 91300 -59350 126629 81037 -206424 -331996 123357
18952 289370 -179663 -90013 -225186 -4663 38814 -8759 -124749 7180 84128 -332638 12952
18940 115919 -101205 -155579 -122266 -131287 -125502 10479 -64773 -10832 45324 -155159 -76038
18928 -258745 49344 -59776 298639 206885 114250 -498004 56507 -9529 -30903 -250200 67315
18916 -113075 205933 -376692 -2278 -291470 -21096 -89119 154235 -293702 -82529 61055 -298752
$$ packed form
18999C58870a54159j23552g1921F3871g3386p5252m9256d2903q457k36504A22075
18987B704b9346A22446l5812c31932k5021a57563B8749Q4151d0383G7275a98899
18975a94570B2922a65873e6091B08988q4306c4931j59205h7428H3536Q1943a46000
18963b53303A86556Q4825j22790n7291e9350A26629m5592b06424j25572A23357
18952B89370a79663Q9650j35173d663C8814h759j15990G180P6948c32638A2952
18940A15919a01205n4374L3313r021N785A0479f4773a0832D5324a55159g6038
18928b58745D9344e9776B98639r1754r2635d98004E6507i529k1374k19297F7315
18916a13075B05933c76692b278k89192b1096o8023A54235b93702h2529F1055b98752
$$ plain form
18904 -261151 54629 142431 -88915 364259 21431 -39483 114961 -450345 -134463 48808 -82540
18892 -93969 67393 79597 32344 -191569 -201129 -171570 -195388 11489 -268709 -76672 247059
18880 -175404 149397 -83973 -44782 -138809 -61058 -172088 92920 -125882 -69112 -55909 -152993
18869 -152993 259305 -208396 -151547 -403517 -36298 -289877 -181385 -123775 -128946 -222614 -14498
18857 -137525 22279 206833 39388 32310 -39990 125293 -169462 37336 -212933 -77936 -163818
18846 -163818 -100561 -63421 98306 -268786 -39811 -352125 -156028 -93049 252356 -72766 -48766
18835 -48766 80129 -53769 223042 -46275 -124699 -403466 154999 -166689 -26569 -278929 -177220
18824 -177220 97202 104568 -2475 -346299 -78191 -307831 -119152 -376206 61918 20797 -414255
$$ packed form
18904b61151E4629Q7802h8915C64259B1431c9483A14961d50345a34463D8808h2540
18892i3969F7393J2204C2344a91569r560K9559k3818A1489b68709g6672B47059
18880a75404A49397h3973L9191r4027f1058j11030I2920a25882N6770J3203r7084
18869a52993B59305b08396N6849k51970c6298k53579J08492N7610n171r3668a4498
18857a37525B2279J84554C9388p078c9990A25293a69462C7336b12933g7936q5882
18846a63818O3257L7140I8306b68786c9811l12314a56028O2979B52356g2766K4000
18835d8766H0129e3769B23042d6275p8424k78767A54999a66689b6569k52360J01709
18824a77220I7202P366b475l43824g8191k29640a19152k57054F1918B0797d14255
$$ plain form
18812 70967 265504 38551 125270 88595 -37617 370031 154745 -409148 34588 19445 236813
18801 236813 200348 178804 252887 134717 -159223 91208 -63844 -192420 -183295 -92708 -42152
18789 129729 185488 -261593 -53573 134388 -109966 -36624 -151105 -155090 -227815 28037 40742
18778 40742 131043 21499 6240 -51711 -79605 -281199 -182307 -67917 181866 -224721 -130043
18767 -130043 66826 -214855 -58840 187925 43893 20425 210362 -36187 98384 89860 -140610
18755 -29514 -143826 -179921 -15603 -311049 -168820 -167679 193282 5261 -249545 72320 -134134
18743 -425280 198641 337766 24182 -57913 50585 209761 -172661 -51295 -263204 -112537
18732 235642 -305000 -173176 -265593 -140938 -48092 121601 8253 -87933 -80877 89344 -286099
$$ packed form
18812G0967J94537C8551Q6719l6675c7617C70031A54745d09148C4588j5143K17368
18801B36813l6465k1544P4083j18170a59223I1208f3844j28576R125R0587d2152
18789A29729N5759b61593e3573A34388a09966c6624j14481l985p2725B8037J2705
18778D0742R0301B1499F240e1711k7894k01594R8892f7917A81866b24721R4678
18767a30043F6826b14855e8840A87925D3893B0425J89937c6187I8384q524a40610
18755b9514j14312l6095a5603k95446J42229J141A93282E261b49545G2320a34134
18743d25280A98641J39125B4182e7913E0585J59176a72661e1295k11909a12537
18732B35642c05000J31824r2417J24655d8092A21601H253h7933P056H9344b86099
$$ plain form
18720 -91636 -225608 214158 214221 -289287 215978 -244029 135233 31709 -126720 86768 -44616
18708 -20196 -367818 96398 -374358 -226114 -7177 225096 90394 259567 -140845 -102326 -289424
18697 -289424 30934 -138248 -84357 -132475 115124 211129 -31137 -140180 -116702 -125637 -218859
18686 -218859 -167346 -406875 -434009 -126409 -191919 -90204 -9601 176013 76081 -402157 -65976
18674 -9097 -17438 164696 12849 -240281 -140406 5245 84156 1879 185043 -292556 216502
18662 -88514 -90971 233226 -279798 -64917 258662 -159567 256680 -107738 86587 -27802 -128199
18651 -128199 94181 249314 22865 -129923 -64507 -56885 -227892 8835 -110863 -139974 145187
18639 -701548 -78439 257818 165024 193500 97480 212228 33467 34960 -338645 203871 -105435
$$ packed form
18720i1636j33972B14158O3b89287B15978b44029A35233C1709a26720H6768d4616
18708b0196l47622I6398c74358J48244g177B25096I0394J69173a40845L8519j87098
18697b89424C0934a38248N3891m8118A15124R6005c1137j09043K3478q935r3222
18686b18859N1513k39529k7134a26409o5510i0204i601A76013G6081d02157f5976
18674i097q341A64696A2849b40281R9875E245P8911A879J83164b92556B16502
18662h8514k457B33226b79798f4917B58662a59567B56680a07738H6587b7802j00397
18651a28199I4181J55133B2865a29923f4507P622j71007H835a10863k9111A45187
18639g01548g8439B57818r2794K8476r6020J14748C3467J493c38645B03871a05435
$$ plain form
18627 -66136 -262239 1579 245820 -157835 -68244 -46345 -181247 97153 -107289 -199826 -159739
18616 -159739 57193 -51286 -140027 124803 91984 -226069 94391 157614 64330 -1265 41088
18604 -242190 56330 -271419 -144790 101477 80983 -254355 -23761 92988 -43594 -5235 -130100
18593 -130100 138733 -39029 81649 -230229 -110775 -143215 -180965 -73820 -85706 -177943 109743
18581 -31410 109914 223950 -21044 39891 -154462 103671 -13405 54045 -124197 -184297 58690
18569 106524 22659 -120962 -143113 -174013 -137511 216331 148350 272147 -51972 -357542 -74695
18557 -41900 -325726 -239616 -125119 -123978 -334024 -243643 224630 108966 -67508 -265793 -115519
18545 -414027 172207 45832 -43715 145607 -125835 -146394 -65236 -82227 -171321 -19095 61274
$$ packed form
18627f6136j96103A579K44241a57835f8244K1899j34902I7153a07289r2537M0087
18616a59739E7193e1286q8741A24803l2819b26069I4391O3223F4330a265D1088
18604b42190E6330b71419J26629A01477k0494b54355b3761I2988d3594e235j24865
18593a30100A38733c9029H1649b30229a10775l2440l7750g3820j1886r2237A09743
18581c1410A09914J14036b1044C9891a54462A03671a3405E4045a24197o0100E8690
18569A06524B2659a20962k2151l0900L6502B16331o7981J23797e1972l05570g4695
18557d1900k83826Q6110J14497J141k10046R0381B24630A08966f7508j98285a15519
18545d14027A72207D5832d3715A45607a25835k0559f5236j6991q9094a9095F1274
$$ plain form
18533 -216894 -73420 107308 -26160 -232604 67324 -121483 -52867 39297 -20393 -34743 63050
18521 52425 -298632 114074 -156600 -199303 251837 106103 -105910 -115223 -116997 -166090 102325
18509 -44728 145824 36955 -15239 211872 245680 134351 -127656 -157268 169084 68977 -405353
18497 124629 85533 -69883 83240 238128 -149576 76226 -66100 -193541 -239280 49971 -509230
18485 -386077 -40215 -98066 68796 -42061 -248559 73914 172969 -125231 -40682 -69150 -283831
18474 -283831 -42812 121260 310335 -46616 2392 -175953 -44282 -148855 -170034 -404824 -142951
18462 77201 150414 -23502 -140466 82785 -315238 57222 -301390 -18522 -179174 96295 -45983
18450 145304 81884 -8829 237279 80614 -148353 8016 -18863 80374 37967 -293027 -153755
$$ packed form
18533b16894g3420A07308b6160k06444F7324a21483e2867C9297b0393j4350F3050
18521E2425b98632A14074a56600m2703B51837A06103a05910r313j774m9093A02325
18509d4728A45824C6955a5239B11872L3808j11329a27656k9612A69084F8977d05353
18497A24629l9096f9883H3240J54888a49576G6226f6100j27441m5739D9971e09230
18485c86077d0215n7851F8796d2061k06498G3914R9055a25231d0682k8468k14681
18474b83831d2812A21260J89075d6616B392a75953d4282j04573k1179k34790a42951
18462G7201P3213b3502j16964H2785c15238E7222c01390a8522j60652I6295d5983
18450A45304o3420h829B37279H0614a48353H016a8863H0374C7967b93027J39272
$$ plain form
18439 -153755 -11233 72456 -113117 55646 -108551 -163562 -166807 -181093 16519 -4045 -497343
18428 -497343 66262 -197174 309228 292678 39339 -2523 -420251 33236 13072 -146901 -152839
18417 -152839 -290463 -90545 268214 -295821 -87168 -61641 -47757 -142136 -20665 214892 -182914
18405 290618 181721 -96107 74196 -190795 -418151 -268701 -25009 27715 75701 14554 78854
18394 78854 232533 59557 -61938 -10580 -52234 -47993 -126346 189903 126345 -172491 204456
18382 17992 382352 -254002 107815 -303422 -330308 288737 154064 107992 -127968 -583758
18372 -583758 169801 -34510 -426179 -87629 -320696 140215 8387 -147038 68676 28452 -388794
18360 -45773 62929 -308042 75843 84335 93094 67839 -135968 80264 -183871 -95652 38989
$$ packed form
18439a53755a1233G2456a13117E5646a08551n5011l245j4286A6519d045m93298
18428d97343F6262a97174C09228j6550C9339b523m17728C3236A3072a46901n938
18417a52839j37624i0545B68214b95821h7168K5527J3884r4379b0665B14892a82914
18405B90618j08897i6107G4196a90795k27356J49450b5009B7715M7986A4554O4300
18394G8854J53679E9557f1938a0580m1654M241p8353A89903o3558a72491B04456
18382A7992L64360b54002A07815c03422k6886B88737j34673m6072a27968m55790
18372e83758A69801c4510l91669h7629k33067A40215H387a47038F8676B8452c88794
18360d5773F2929c08042G5843Q492Q759k5255a35968H0264a83871Q8219C8989
$$ plain form
18348 147249 -184743 -114141 17398 34529 -92105 -187971 -219261 62660 190308 42993 80879
18337 80879 195801 153292 -68822 -180041 -20772 67419 -161900 -77933 139292 82189 -273783
18325 179306 -134833 -295270 87419 -355765 -81430 -157842 57095 79248 -155684 201627
18314 -127920 -328427 -64360 -1384 -134708 3526 118531 -268580 -224350 -243879 204128 -205753
18302 91433 92142 159918 -281834 -49613 -16959 -210360 -447373 229336 320066 -240410 -626
18290 -291318 23629 80750 -127450 224835 -225824 105688 -45047 -84194 -26138 174196
18279 -103865 -112568 -197542 -106254 139700 -61188 171038 -91704 -52393 370068 -197754 217600
18267 91977 3659 102769 134773 -8233 -33078 172737 90644 -263443 163237 -496186 -397020
$$ packed form
18348A47249a84743P0602A7398J7131i2105r5866l1290F2660J27648D2993L7886
18337H0879J14922m2509f8822j11219b0772F7419a61900g7933A39292n7103b73783
18325A79306a34833j60437H7419c55765h1430p6412E7095K2153a55684B01627
18314a27920k00507f4360a384j33324C526J15005b68580M4230j9529B04128b05753
18302I1433P09O7776b81834d9613a6959j93401k37013B29336R0730b40410f26
18290b91318B3629N7121a27450B24835b25824A05688d5047l9147b6138A74196
18279a03865q703q4974R1288A39700f1188A71038i1704L9311C70068a97754B17600
18267I1977C659R9110L2004h233k4845A72737q2093b63443A63237d96186R9166
$$ plain form
18256 -397020 -14571 -248257 -64946 -5921 26207 -35348 -292699 97233 189350 -43888 62835
18244 195233 68324 -215360 132690 -141867 17184 -174371 124714 85880 -32646 11423
18233 -18235 -8608 -180037 138626 232669 -266467 -57801 -86370 13497 -24425 79109 -57871
18221 -236647 -61154 -48963 -35462 132396 141091 -58574 -51691 -142446 -372547 -152231 92407
18209 -236595 -16160 -80905 320760 203907 -114382 -147395 132355 -276633 80555 102603
18199 102603 -128577 204183 37488 -273346 -124300 -146470 -390868 6780 -14933 -26425 -209176
18188 -209176 122547 -159366 -308218 -80292 55975 -132673 4054 -225028 16795 -142795
18177 -69704 -302226 -132338 -147597 16407 -298987 140066 -168309 -131772 -194422 -251566 -142056
$$ packed form
18256c97020a4571k33686f4946e921B6207c5348k57351I7233R2117d3888F2835
18244A95233F8324b15360A32690a41867A7184a74371A24714l8834c2646A1423
18233a8235h608j71429A38626R4043b66467e7801k8569A3497b4425G9109e7871
18221b36647f1154J2191J3501A32396Q695e8574O883r0755k30101a52231I2407
18209b36595a6160o4745C20760j16853a14382l3013A32355b76633H0555K2048
18199A02603a28577B04183C7488b73346a24300k2170k44398F780a4933j1492j82751
18188b09176A22547a59366j48852h0292E5975a32673D054b25028A6795a42795
18177f9704k32522a32338j5259A6407b98987A40066a68309L6537o2650n7144J09510
$$ plain form
18166 -142056 -12115 287871 -67883 404850 81147 -32177 35059 -170725 -63418 -48514 -246771
18155 -246771 -192344 138441 53446 -265291 -112919 -87765 -95704 -200755 -48470 -95015 -132725
18144 -132725 15894 23940 18632 351112 159656 -30063 133399 -159901 59360 -218215 -9766
18132 -148154 361421 136227 -95022 -104213 -160315 -79150 -286749 -209856 -122411 -155896 113659
18120 -191172 -100817 -195795 82183 -30725 -328315 -260835 87953 -258173 -113288 13342 63108
18109 63108 -4410 48523 -480 -352595 171186 -238183 13654 -87414 -86843 -336088 -179253 -5193
18096 -351421 -70335 -101512 -162109 4224 -352215 120756 -7095 -77251 -183617 128645 -19381
18084 171775 -104358 -364410 -371418 250419 -224753 96886 12930 54640 140188 411227 -296245
$$ packed form
18166a42056a2115B87871f7883D04850H1147c2177C5059a70725f3418J4904j98257
18155b46771N4427A38441E3446b65291a12919K5154p939j05051d8470m6545l7710
18144a32725A5894Q046n308L32480A59656c0063A33399a59901E9360b18215i766
18132a48154C61421A36227i5022r191n6102g9150k07599P6893Q7445l3485A13659
18120a91172R0355r4978H2183c0725k97590O7480H7953b58173a13288A3342M9766
18109F3108d410D8523d80l52115A71186b38183A3654h7414N71k49245J56835e193
18096c51421g0335l1177o0597D224c52215A20756g095p0156j06366A28645a9381
18084A71775a04358k60052p008B50419b24753I6886A2930M1710Q5548K71039b96245
$$ plain form
18072 80327 30010 -115517 -13896 -395055 -44580 154281 99425 181502 161636 -103267 -59925
18061 -59925 57926 186359 126365 -12999 -227838 341 186215 4787 109794 -6649 29497 -121605
18048 -205306 -18310 -148067 92620 5123 -136341 104265 -235486 89159 -368055 29893 175281
18037 175281 -37995 -317117 62312 8795 -26626 20076 -60301 -333790 -87522 -82893 -113108
18026 -113108 134494 -125900 -72816 203418 57962 -268044 92599 106956 -171761 -29820
18015 120177 51833 -119219 -187716 52312 220634 -58389 139911 -112930 137142 41459
18004 -261294 41248 -376082 -98147 42703 -18317 -365857 -107624 112458 -16464 35800 -227519
17992 -256976 -23441 -162029 -101980 223466 -53726 -154178 -100265 177163 16789 -212071
$$ packed form
18072H0327C0010a15517a3896l81159d4580A54281n4856Q2077j9866a03267M3342
18061e9925E7926J28433n9994a2999k14839C41J85874D787J05007f649B9497a21605
18048b05306a8310j29757I2620E123a36341A04265b35486H9159c68055B9893J45388
18037A75281c7995k79122F2312H795b6626B0076f0301k73489h7522M629l0215
18026a13108A34494a25900N3084B03418E7962b68044I2599J4357a71761b9820
18015A20177E1833a19219o8497E2312J68322e8389A39911a12930A37142D1459
18004b61294D1248c76082i8147D2703a8317l47540a07624A12458a6464C5800b27519
17992b56976b3441j38588O0049B23466e3726j00452N3913A77163A6789b12071
$$ plain form
17981 345109 -209092 45075 14281 -321644 -29428 -6265 -29570 308871 -80505 54792 -21043
17969 -28090 27795 -28060 -192292 425534 -99309 165094 -253171 -208790 32113 70782 290411
17958 290411 -23471 7112 -130336 3162 -507649 49617 -2686 -14923 450400 129565 24084
17946 -23884 -76386 -158452 227784 -85004 -40562 8908 -73115 -199106 -16263 173955 123208
17935 123208 126286 124548 -16371 -235993 45862 -95046 21136 46189 -213182 -87504 -63058
17924 -63058 -83869 239447 -248782 32162 42467 -83020 79729 120826 -29314 -280360 62029
17912 7444 100620 252162 -113951 -89117 171737 25850 -73760 38443 -105980 -538515 -355361
17901 -355361 -93295 -51872 114635 -137906 127444 -248438 14112 -363290 82323 211693
$$ packed form
17981C45109b09092D5075A4281c21644b9428f265k3305C08871h0505E4792b1043
17969b8090B7795b8060j64232D25534i9309A65094b53171M4381C2113L8669K19629
17958B90411b3471G112a30336C162e07649D9617b686j2237D50400A29565B4084
17946b3884n2502q2066B27784h5004d0562H908g3115j25991a6263A73955n0747
17935A23208L078j738a6371k19622D5862i5046B1136K5053b13182h7504K4446
17924f3058k0811B39447b48782C2162J0305h3020G9729M1097b9314k51046F2029
17912G444R3176J51542a13951K4834A71737B5850g3760C8443a05980m32535J83154
17901c55361i3295M1423A14635a37906A27444b48438A4112c63290H2323J29370
$$ plain form
17891 211693 -194574 -117944 -135228 -40603 -76077 -223017 105802 -189338 49891 -127757
17880 -68402 -135190 241898 252545 165885 65232 119019 325141 -352584 30705 188037 -129426
17868 -131573 191070 28415 -11508 -382558 -288918 -81754 191928 250059 -251697 -201356 199746
17856 -151307 38406 58454 -34452 -119733 -2669 145298 -174659 137115 248199 -36807 133553
17844 128889 -222702 232608 -142196 160132 9406 57135 -62412 89405 397551 -143071
17833 39457 -167613 110307 -167727 -70479 92910 175432 -59738 -71455 -341667 -311522 63174
17821 -129436 136105 -331599 240455 -228786 226930 -238020 244120 36628 -70836 4297
17810 -55490 -38593 -83223 -226982 -235357 13310 42394 272607 37896 152992 126952 -142450
$$ packed form
17891B11693a94574P6630j7284d0603l5474j46940A05802a89338D9891a27757
17880f8402o6788B41898J0647q6660F5232N3787K06122c52584C0705J57332a29426
17868a31573A91070B8415a1508l71050R3640h1754A91928N8131b51697N0341A99746
17856a51307C8406K0048c4452q5281b669A45298a74659A37115J11084c6807A33553
17844A28889b22702B32608a42196A60132I406M7729f2412H9405L08146a43071
17833C9457a67613A10307a67727g0479I2910Q2522e9738j1717k70212L0145F3174
17821a29436A36105c31599B40455b28786B26930b38020B44120C6628g0836D297
17810e5490J6897m4630j43759q375A3310K9084K30213C7896J15096k6040a42450
$$ plain form
17798 -13907 -13582 123436 69771 -222091 -337840 195311 -159222 -85876 51311 61271 -37475
17786 -103526 36660 21416 -155387 199764 326380 -128493 405321 120864 35666 290178
17776 290178 -335381 24810 261122 -154621 -204513 -198101 6804 -117632 92740 99202 -51268
17764 33553 27220 192350 156996 -112765 -214818 140902 137251 108227 75504 -182173 95670
17752 -33791 -87072 -60664 -118952 -4608 80752 -31983 271035 -278823 -59335 236423 -169119
17740 218838 90402 -61427 -305357 232876 5460 237624 27452 276544 -6582 -165592 -218231
17729 -218231 136320 268796 37173 -121406 -286927 70222 -53618 313706 -10759 317547
17718 -105620 30709 -138836 -16604 88969 -3552 295850 -185006 -30405 60650 -427285 -146137
$$ packed form
17798a3907L25A23436n3665b22091j15749A95311a59222P3346E1311R960c7475
17786a03526C6660j5244a55387A99764J26616a28493D05321A20864C5666K54512
17776B90178c35381B4810K36312a54621m9892O412F804a17632I2740O462e1268
17764C3553o333J65130l5354a12765j02053A40902l651k9024l2723a82173I5670
17752c3791n3281K6408n8288d608H0752c1983B71035b78823e9335B36423a69119
17740B18838I0402f1427k43930B32876E460K32164B7452K49092f582j59010n2639
17729b18231A36320J32476C7173a21406j65521G0222e3618C13706a0759C17547
17718a05620C0709a38836a6604H8969c552B95850a85006c0405F0650d27285a46137
$$ plain form
17706 75320 -203022 271973 -115959 -113335 -66572 -90269 -77063 -73457 -48626 -138352 -70128
17695 -70128 396404 95081 1110 208126 1069 -161885 187311 -319387 264613 325113 30680
17683 -384531 -45648 99056 -196749 10934 -87888 135949 176508 304612 -255289 4512 228227
17672 228227 -76852 96787 -383154 -6545 -316228 -181670 -36809 -252725 -36943 -92403 188307
17660 42044 136649 54840 17962 -33846 168842 -8077 -176140 -286050 60773 -10310 195463
17648 8445 266553 -92404 -78070 -6995 31807 -217758 120193 -216193 -159418 188402 2657
17636 87924 5284 20512 211808 -114785 -211201 -66784 -124109 -22180 221849 11329 -230313
17624 18380 21318 87172 440171 -2116 178131 478388 -95725 66490 -48314 -25763 112988
$$ packed form
17706G5320b03022B71973a15959K624M6763k3697J3206L606K4831q9726O8224
17695g0128C96404I5081A110K07016A069a61885A87311c19387B64613O0500C0680
17683c84531d5648I9056a96749A0934h7888A35949M0559J28104b55289D512K23715
17672B28227g6852I6787c83154f545l09683J34558c6809k15916c6943n5460A88307
17660D2044R4605E4840A7962c3846A68842h077j68063j09910F0773a0310A95463
17648H445K58108i2404J4334f995C1807b17758A20193b16193N6775A88402B657
17636H7924E284J5228J91296a14785r6416f6784n7325b2180B21849A1329b30313
17624A8380K938O5854L52999b116A78131L00257i5725F6490d8314K2551A12988
$$ plain form
17612 23362 340330 83830 152789 -272636 11487 112342 111962 92942 -237703 -20577 -50745
17601 -50745 -183832 -311059 -123728 62164 -91945 135411 125659 12604 -210483 193486 363113
17590 363113 -438879 13963 -79210 -63452 61177 259275 -1212 132735 -38743 -336901 -144586
17578 53196 -112082 56091 197027 60613 343987 -479363 38297 350119 -67829 87989 -63958
17566 151072 39955 158413 308947 127632 368690 -39490 91103 -113629 5970 119801
17556 119801 242706 151989 300733 -127768 -85074 139596 -244135 98156 -25419 17035
17545 -123919 -98694 62539 126103 257107 -38410 -144261 -186166 146318 -94264 -31193 65081
17533 -44296 -99763 190512 -250635 204446 103475 -158681 261364 9671 106794 118943 296132
$$ packed form
17612B3362L16968H3830O8959b72636A1487J00855l80j9020b37703b0577l0168
17601e0745j33087j27227a23728F2164i1945A35411r752A2604b10483A93486J69627
17590C63113d38879A3963g9210J5758F1177J98098a212A32735c8743k98158a44586
17578E3196a12082E6091J40936F0613K83374d79363C8297L11822f7829H7989f3958
17566A51072C9955J18458J50534A27632K41058c9490I1103a13629E970J13831
17556A19801J22905r0717J48744a27768M2694A39596b44135I8156b5419A7035
17545a23919K5225F2539O3564J31004c8410j05851m1905A46318i4264c1193F5081
17533d4296n5467A90512b50635B04446j00971a58681B61364I671R7123J2149J77189
$$ plain form
17522 296132 9807 171308 349566 -114319 -53998 3723 150027 -123511 135722 198859 -441253
17510 7636 -27589 -22544 111994 227068 52878 44585 118040 143483 12101 385985 -244651
17498 364645 -80857 305890 267531 252807 -109828 -274463 68165 -103463 52400 -31886 -34877
17487 -34877 233828 205699 -294588 98297 70645 -121727 302166 194220 -79011 -184301
17477 -184301 -124641 153732 241827 126999 220362 172968 347746 816 349871 115545 117525
17466 117525 268883 -182530 277649 -214064 249130 187738 -268293 133903 -114579 -259149
17456 -259149 165596 284060 -86955 209335 387645 218915 145184 208748 47283 137458
17446 137458 111383 -108607 164654 157543 60857 119832 34591 187960 435463 7024 223739
$$ packed form
17522B96132I807J61501J78258a14319e3998C723J46304a23511A35722O3137d41253
17510G636b7589N045A11994J15074E2878q293P3455K5443A2101L73884b44651
17498C64645h0857C05890l8359j4724a09828j64635F8165a03463E2400c1886k991
17487c4877B33828k8129b94588I8297k7652a21727C02166j07946g9011j05290
17477a84301N9660A53732Q8095j14828R3363m7394J74778H16L49055A15545J980
17466A17525J51358a82530B77649b14064B49130o1392b68293A33903a14579j44570
17456b59149A65596J18464h6955B09335J78310j68730p3731O3564D7283R0175
17446A37458k6075a08607A64654p111F0857N8975C4591J53369K47503G024K16715
$$ plain form
17435 223739 9529 234499 210265 249860 -26212 558663 43050 352357 -124974 78558 46017
17424 46017 515520 108052 285954 231358 247827 157169 157743 50382 16615 25235 170915
17413 170915 109562 -90416 382487 19953 36642 170508 23371 37012 176587 120892 366932
17402 366932 50664 -155087 450932 452974 -44470 49440 174226 -13848 57765 107650 144371
17391 144371 155522 -12353 170100 -284318 8435 61990 -245227 15665 75508 289435 117372
17379 447764 227659 -84294 192256 104800 4828 155214 -18692 45902 515223 233136 149894
17368 149894 -124033 55047 83911 215963 268097 236814 -49603 12162 479066 343810 183
17356 -3498 191895 -20581 194515 274528 -293108 149169 32266 141162 75760 737 100437
$$ packed form
17435B23739I529K24970k4234L9595b6212E58663D3050L09307a24974G8558l2541
17424D6017M69503A08052J77902n4596J6469r0658N74E0382A6615Q620J45680
17413A70915o1353i0416C82487A9953J6689J33866B3371J3641J39575n5695K46040
17402C66932E0664a55087D50932K042d4470D9440J24786a3848E7765M9885L6721
17391A44371J1151a2353A70100b84318H435N3555b45227A5665N9843K13927A17372
17379D47764k20105h4294A92256q7456D828J50386a8692D5902M69321B33136q3242
17368A49894a24033E5047K8864J32052N2134l1283d9603A2162M66904j35256A83
17356c498A91895b0581A94515Q0013b93108A49169C2266J08896o5402G37R9700
$$ plain form
17345 100437 248972 -260834 209073 180669 348926 204770 -87350 46882 82262 -293766
17334 -90850 -5983 313462 20401 349341 167858 166190 49451 78414 499232 318764 171180
17323 171180 452280 82088 157169 194204 475419 337734 157402 184661 190080 80309 180926
17312 180926 225366 -196044 256266 -2669 35604 209756 186353 452572 260644 -73201 146460
17300 42360 271449 330250 183606 202102 67819 108712 155443 221923 271432 -10638 220681
17288 342183 296919 -33231 14967 -46950 260745 344262 175988 -1120 101288 74783 146431
17277 146431 -136880 -47782 -105233 81317 294599 64820 151335 155655 379129 186126 30141
17265 -155949 361941 -117865 -41563 111851 -5495 491498 54635 261533 -48343 -271630
$$ packed form
17345A00437J48535b60834B09073k8404J68257j44156h7350D6882L5380b93766
17334i0850e983C13462B0401L28940A67858j668D9451K8963M20818j80468j47584
17323A71180K81100H2088P5081L7035K81215j37685A57402K7259N419H0309J00617
17312A80926M4440a96044B56266b669C5604J74152k3403K66219j91928g3201A46460
17300D2360K29089N8801j46644J8496F7819M0893M6731O6480M9509a0638B20681
17288C42183m5264c3231A4967d6950B60745Q3517j68274a120A01288k6505P1648
17277A46431a36880d7782n7451H1317K13282F4820Q6515M320K23474A86126C0141
17265a55949C61941a17865d1563A11851e495D91498E4635K06898d8343k23287
$$ plain form
17255 -271630 94958 -120907 141282 248909 198861 25513 -79 244330 49980 25395 77150
17244 77150 212789 -56003 108156 -200394 53111 276047 8733 40853 158514 403640 -108720
17232 412589 278215 -151237 150846 261007 441954 52809 154987 189711 435479 50239
17221 124552 13397 239342 381637 265678 121962 192555 142510 81691 127311 -126388
17210 -182301 196504 345679 21138 114248 10171 249291 285518 106190 -194025 201476
17199 287169 153012 386544 79562 -143088 131878 110550 182896 338701 364708 105206
17188 -58786 245917 393741 -15911 283243 29516 380167 283093 57582 352924 92483 349595
17177 349595 246697 182780 224564 -198887 317311 -69685 213936 86531 348644 393540
$$ packed form
17255b71630I4958a20907A41282J07627n0048B5513g9B44330D9980k4585N1755
17244G7150J35639e6003A08156b00394E3111K22936H733L2120J17661K45126a08720
17232D12589j34374a51237A50846J10161J80947E2809J02178L4724K45768E0239
17221A24552A3397K25945J42295j15959A21962P0593n0045o0819M5620a26388
17210a82301A96504J49175B1138R3110A0171K39120L6227A06190a94025B01476
17199B87169j34157K33532G9562a43088A31878k1328P2346J55805K6007A05206
17188e8786B45917J47824a5911B83243B9516L50651r7074E7582K95342I2483K57112
17177C49595j02898o3917M1784a98887C17311f9685B13936H6531K62113M4896
$$ plain form
17167 393540 268876 321139 139433 94212 208475 149987 143100 355988 324265 -56729 35547
17155 408426 192625 224687 474195 75530 266722 213094 510147 335875 48444 288802
17145 288802 15402 103895 66328 171837 36569 -523 -52733 346213 321265 -161239 202364
17133 192880 509472 355142 322238 440325 290906 708952 345153 257474 211460 418198
17123 418198 474030 21950 314754 264504 275995 388556 458436 454561 420751 132480 163708
17112 163708 352122 313782 457304 649484 280193 193360 319746 310735 198208 301667
17102 301667 169398 104644 341784 362086 -47015 606814 547633 468680 240576 426283
17092 426283 256529 470004 245168 484251 101993 106072 400357 247365 518838 600984
$$ packed form
17167C93540j24664N2263A39433m5221J14263n8488o887K12888l1723e6729C5547
17155D08426A92625L2062K49508G5530J91192n3628K97053j74272D8444K40358
17145B88802A5402Q8493l7567J05509C6569e23n2210C46213k4948a61239B02364
17133A92880L16592j54330l2904J18087j49419M18046C45153q7679m6014K06738
17123D18198N5832B1950K92804n0250J1491J12561O9880l875l3810A32480L1228
17112A63708J88414l8340J43522J92180B80193q6833J26386r011j12527J03459
17102C01667j32269o4754K37140K0302d7015F06814n9181p8953k28104J85707
17092D26283j69754K13475k24836K39083A01993M079K94285j52992K71473Q2146
$$ plain form
17082 600984 230271 83228 415857 361404 319549 595369 471862 247219 75369 145863
17072 145863 286135 339771 480061 517524 559375 737090 607210 731590 339669 307770
17062 307770 251478 578922 109607 308104 276222 349742 170017 216148 279508 490329
17052 490329 314343 590943 204047 326132 568846 337508 574131 447215 573671 296266
17042 296266 316568 488458 508275 505115 891505 805826 379738 268076 318215 503320 395935
17031 395935 353128 480675 342841 546848 303413 504944 245893 546671 361560 479663
17021 479663 483478 658924 267990 647228 268752 874360 515648 544157 389131 524538
17011 524538 198698 487597 354637 408239 174137 376945 75637 525156 425128 604227
$$ packed form
17082F00984B30271H3228L32629n4453m1855K75820j23507k24643G5369P0494
17072A45863J40272N3636J40290L7463M1851J77715j29880J24380C39669l1899
17062C07770n6292L27444A09607J98497l1882P3520A70017M6131O3360K10821
17052D90329j75986K76600B04047J22085K42714k31338K36623j26916J26456k77405
17042B96266K0302J71890J9817l160L86390q5679C79738j11662N0139J85105j07385
17031C95935m2807J27547j37834K04007k43435K01531B45893L00778j85111J18103
17021D79663L815J75446B67990L79238B68752O05608l58712K8509j55026J35407
17011E24538A98698K88899j32960N3602A74137K02808G5637M49519j00028J79099
$$ plain form
17001 604227 807289 578335 405742 683334 779095 473968 630559 411175 667844 814145
16991 814145 664187 433402 720413 624759 913409 714919 968821 1046547 710001 670268
16981 670268 759020 873771 696497 680457 813397 616291 611757 661206 578426 768224 655623
16970 655623 726070 782613 569294 590664 488325 618635 702483 894948 747754 719333
16960 719333 968102 743624 539614 953668 773924 694278 878530 766583 641165 823239
16950 823239 1157153 939221 959394 882969 854433 686743 1075960 1332844 1278521 892460
16940 892460 966690 948001 870815 1185095 684292 906405 757039 719919 986821 1002832
16930 1002832 954856 901904 1252118 872662 1297570 1563002 1376873 1036824 984601 1020798
$$ packed form
17001F04227K03062k28954j72593K77592R5761l05127J56591k19384K56669J46301
16991H14145j49958k30785K87011r5654K88650j98490K53902P7726l36546l9733
16981F70268Q8752J14751j77274j6040J32940j97106m534M9449q2780J89798j12601
16970F55623P0447N6543k13319K1370j02339J30310Q3848J92465j47194k8421
16960G19333K48769k24478k04010M14054j79744p9646J84252j11947j25418J82074
16950H23239L33914k17932K0173p6425k8536j67690L89217K56884n4323l86061
16940H92460P4230j8689p7186L14280n00803K22113j49366l7120K66902J6011
16930A002832m7976n2952L50214l79456M24908K65432j86129l40049n2223L6197
$$ plain form
16920 1020798 1192319 964381 862129 856694 1189728 1208245 780175 1204813 945636 1210992
16910 1210992 1334394 947668 988045 1303701 1059564 1317569 1486121 1413001 1411421 1107818
16900 1107818 1268810 1089557 1277548 1360630 1336352 1554128 1580149 1104345 1363950 1279843
16890 1279843 1138735 1268704 1450837 1591177 1386646 1678830 1436751 1995193 1653843
16881 1653843 1745478 1495508 1791288 1801589 1645062 1807334 1548295 1668946 1725060 2023663
16871 2023663 1830937 2024785 1721916 1650074 2020641 1764575 1704042 1922508 1849526 1916122
16861 1916122 2453716 2077194 2290227 1940222 2016934 1930224 2289922 2457228 2532159 2213046
16851 2213046 2406451 2290486 2073892 2352422 2866520 2410071 2538949 2941164 2633968
$$ packed form
16920A020798J71521k27938j02252n435L33034J8517m28070M24638k59177K65356
16910A210992J23402l86726M0377L15656k44137K58005J68552p3120j580l03603
16900A107818J60992j79253J87991Q3082k4278K17776K6021m75804K59605q4107
16890A279843j41108J29969J82133J40340k04531K92184k42079N58442l41350
16881A653843R1635k49970K95780J0301j56527J62272k59039J20651N6114K98603
16871B023663j92726J93848l02869p1842L70567k56066o0533K18466p2982O6596
16861A916122N37594l76522K13033l50005P6712q6710L59698J67306P4931l19113
16851B213046J93405j15965k16594K78530N14098m56449J28878M02215l07196
$$ plain form
16842 2633968 3001118 2895322 2545424 2778075 2972579 2908973 3045262 3064958 3109083 2953384
16832 2953384 3025512 3133517 3277118 3420441 3037725 3408872 3448070 3575901 3665985 3625582
16822 3625582 3621255 3692354 3859382 3888481 3830728 3870010 4040220 4419361 3993392 4049663 4449172
16811 4449172 4522442 4333321 4196084 4810732 4549026 4951998 5024018 4942654 4906291 5216194
16801 5216194 5449567 5653934 5523163 5905627 5715571 6031445 6046699 6237063 6323125 6487014
16791 6487014 6641219 6808254 6961321 6993590 7532211 7645090 7464036 7797712 8011913 8048809
16781 8048809 8296953 8597714 8776744 8647303 9180091 9534714 9856207 9736538 10166053
16772 10166053 10385214 10845606 11287022 11577700 11876443 12025062 12684103 13178586 13246476
$$ packed form
16842B633968L67150j05796l49898K32651J94504o3606J36289J9696M4125j55699
16832B953384P2128J08005J43601J43323l82716L71147L9198J27831R0084m0403
16822C625582m327P1099J67028K9099n7753L9282J70210L79141m25969N6271L99509
16811D449172P3270j89121j37237O14648k61706M02972P2020q1364l6363L09903
16801E216194K33373K04367j30771L82464j90056L15874J5254J90364Q6062J63889
16791F487014J54205J67035J53067L2269N38621J12879j81054L33676K14201L6896
16781H048809K48144L00761J79030j29441N32788L54623L21493j19669M29515
16772A0166053K19161M60392M41416K90678K98743J48619O59041M94483O7890
$$ plain form
16763 13246476 13714313 14126685 15021283 14890609 15724965 16162589 16811165 17323105 17773554
16754 17773554 18603355 19432248 20145680 20870967 21652519 22382379 23149263 24057979 25272222
16745 25272222 26225888 27309940 28574822 30120705 31335796 32663678 33988673 35887368
16737 35887368 37587848 39003025 41320851 43286231 45914247 48153933 50810383 53393266
16729 53393266 56808926 59934610 63210619 67160400 70954999 75649918 80053214 85007698
16721 85007698 90434482 96228495 102269093 108548659 115260181 121982478 128941255 136258048
16713 136258048 143709668 151061573 157902799 164496317 170477932 176152241 180468378 184097432
16705 184097432 186604503 187741662 187906080 186246205 183836863 180212233 175296106 170004928
$$ packed form
16763A3246476M67837M12372Q94598j30674Q34356M37624O48576N11940M50449
16754A7773554Q29801Q28893P13432P25287P81552P29860P66884R08716J214243
16745B5272222R53666J084052J264882J545883J215091J327882J324995J898695
16737C5887368J700480J415177K317826J965380K628016K239686K656450K582883
16729E3393266L415660L125684L276009L949781L794599M694919M403296M954484
16721H5007698N426784N794013O040598O279566O711522O722297O958777P316793
16713A36258048P451620P351905O841226O593518N981615N674309M316137L629054
16705A84097432K507071J137159J64418j659875k409342l624630m916127n291178
$$ plain form
16697 170004928 164148048 157105490 150341400 142754570 136106249 128709960 121663305 114991481
16689 114991481 108447874 102178297 95822679 90880266 85556022 80144575 75669872 71321096
16681 71321096 67210016 63600970 60069267 56792433 53381765 50528159 47723584 45418436
16673 45418436 43084588 40879921 38720410 36628275 34841802 33242695 31553839 30122979
16665 30122979 28516189 27781877 25952033 25160104 24018514 22854007 21627963 21030546
16657 21030546 20550938 19450623 18791835 17708542 17337751 16507758 15814168 15583829 15132945
16648 15132945 14409934 14040920 13759483 13046957 12480394 12025988 11700094 11260630 10909719
16639 10909719 10498889 10079925 10196747 9862022 9617526 9208431 9055398 8998438 8506447
$$ packed form
16697A70004928n856880p042558o764090p586830o648321p396289p046655o671824
16689A14991481o543607o269577o355618m942413n324244n411447m474703m348776
16681G1321096m111080l609046l531703l276834l410668k853606k804575k305148
16673D5418436k333848k204667k159511k092135j786473j599107j688856j430860
16665C0122979j606790p34312j829844p91929j141590j164507j226044n97417
16657B1030546m79608j100315o58788j083293l70791q29993o93590k30339m50884
16648A5132945p23011l69014k81437p12526n66563m54406l25894m39464l50911
16639A0909719m10830m18964J16822l34725k44496m09095j53033n6960m91991
$$ plain form
16630 8506447 8159585 8097823 7672586 7764635 7500298 7384877 7172248 7047864 6871446 6546097
16620 6546097 6280896 6493311 6183907 5624638 5680702 5549919 5708785 5416399 5245580 5521764
16610 5521764 5177474 5003997 4973193 4782713 4498579 4772404 4376057 4723021 4190306 4209694
16600 4209694 3912031 4095644 4017995 3590090 3729618 3426502 3643638 3468758 3327103 3110082
16590 3110082 3404332 3127315 3602000 3179621 2986494 3150793 2887964 3368529 2937960
16581 2937960 2920038 2997420 2787468 2523693 2632778 2483097 2779942 2445210 2285616 2202108
16571 2202108 2469885 2646639 2502114 2116421 2272824 2194225 2223401 2284128 1971746 1888171
16561 1888171 2014022 1609046 1938511 2174070 1893080 1753722 1702843 1576299 1696344 1932968
$$ packed form
16630H506447l46862o1762m25237R2049k64337j15421k12629j24384j76418l25349
16620F546097k65201K12415l09404n59269N6064j30783J58866k92386j70819K76184
16610E521764l44290j73477l0804j90480k84134K73825l96347L46964n32715J9388
16600D209694k97663J83613p7649m27905J39528l03116K17136j74880j41655k17021
16590C110082K94250k77017M74685m22379j93127J64299k62829M80565m30569
16581B937960j7922P7382k09952k63775J09085j49681K96845l34732j59594q3508
16571B202108K67777J76754j44525l85693J56403p8599K9176O0727l12382q3575
16561A888171J25851m04976L29465K35559k80990j39358n0879j26544J20045K36624
$$ plain form
16551 1932968 2057913 1667514 1436922 1707524 1638874 1598226 1609227 1703988 1490594 1502586
16541 1502586 1257693 1326192 1489288 1368734 1681324 1533592 1183799 1548178 1744905 1689995
16531 1689995 1201696 1332570 1327186 1089884 1078400 1506607 1125038 1467332 1282031 1139123
16521 1139123 1028516 1230034 1122357 1197580 1288766 1076765 1304994 1238825 1171919 965467
16511 965467 819257 1104811 1059677 1155156 1174371 996412 988396 1324484 975917 946594 972917
16500 972917 934862 923955 808424 997761 1163541 741836 900218 868749 931385 912862
16490 912862 846197 649448 601270 904495 867804 518090 475058 638844 1074652 542835
16480 542835 708264 948432 1070482 760811 879460 718534 709561 730915 763000 601018
$$ packed form
16551A932968J24945l90399k30592K70602o8650m0648J1001R4761k13394J1992
16541A502586k44893O8499J63096j20554L12590j47732l49793L64379J96727n4910
16531A689995m88299J30874n384k37302j1484M28207l81569L42294j85301j42908
16521A139123j10607K01518j07677P5223R1186k12001K28229o6169o6906k06452
16511I65467j46210K85554m5134R5479J9215j77959q016L36088l48567k9323K6323
16500I72917l8055j0907j15531J89337J65780m21705J58382l1469O2636j8523
16490I12862o6665j96749m8178L03225l6691l49714m3032J63786M35808n31817
16480E42835J65429K40168J22050l09671J18649j60926q973K1354L2085j61982
$$ plain form
16470 601018 834713 940843 460520 596944 601230 388592 557261 434593 664684 576321
16460 576321 504122 752446 712967 557804 553808 930794 739786 497965 666231 821269
16450 821269 848116 630510 302154 579809 652836 897123 381219 488361 718732 392976
16440 392976 601094 652976 424372 367070 322577 291479 352492 574439 593530 429503 352739
16429 352739 204917 272784 632039 624624 403275 306081 499750 165767 46873 869048
16419 869048 399738 400983 463454 666976 255286 501588 386018 569109 221819 -31071
16408 381014 481174 521097 431384 300294 328415 181270 657145 305342 318891 229761
16398 229761 590555 410628 137722 500233 447639 96341 231166 611397 625683 200531
$$ packed form
16470F01018K33695J06130D60520J36424M286k12638J68669j22668K30091q8363
16460E76321p2199K48324l9479j55163l996L76986j91008k41821J68266J55038
16450H21269K6847k17606C02154K77655P3027K44287C81219J07142K30371l25756
16440C92976K08118N1882k28604n7302m4493l1098O1013K21947J9091j64027p6764
16429C52739j47822O7867L59255p415k21349r7194J93669A65767D6873Q22175
16419H69048C99738J245O2471K03522B55286K46302j15570J83091B21819c1071
16408C81014J00160L9923q9713j31090K8121j47145M75875C05342J3549q9130
16398B29761L60794j79927A37722L62511n2594I6341J34825L80231J4286B00531
$$ plain form
16387 268393 291964 355986 463702 411051 619058 364035 314681 312058 368819 69497 139059
16376 139059 279279 331736 446330 253038 237348 294132 -13375 467333 270138 377725
16366 377725 356548 -22749 384318 345106 270341 163634 409186 183524 155980 310708
16356 310708 72591 288938 204878 288193 347391 450827 -39972 361424 376275 294548 244494
16345 244494 304742 248185 -10197 375351 303557 348852 314394 133509 211614 584732 222659
16333 469172 627894 41732 244352 108629 364165 -17944 387743 538390 87191 -81490
16322 133518 414747 375314 -46665 326609 379182 412261 173234 269342 515734 134024
16311 184497 -127696 331338 80944 102948 432733 -147642 2090 38664 73127 29929 128843
$$ packed form
16387B68393K3571O4022J07716n2651K08007k55023m9354k623N6761F9497O9562
16376A39059J40220N2457J14594j93292j5690N6784a3375D67333j97195J07587
16366C77725k1177b2749C84318l9212p4765j06707K45552A83524k7544J54728
16356C10708G2591K16347q4060Q3315N9198J03436c9972C61424J4851q1727n0054
16345B44494O0248n6557a0197C75351p1794M5295l4458A33509P8105L73118B22659
16333D69172J58722D1732K02620A08629K55536a7944C87743J50647H7191h1490
16322A33518K81229l9433d6665C26609N2573L3079A73234R6108K46392A34024
16311A84497a27696C31338H0944K2004L29785a47642B090L6574L4463B9929R8914
$$ plain form
16300 128843 -15102 178810 308313 256534 314886 357624 276399 54289 5369 51667 -10476
16288 197218 -197676 139286 10617 280255 330534 15873 -126633 243969 346643 150046
16277 541844 189234 449026 -104389 60129 36720 215745 92014 472983 440726 212560
16266 461816 39826 227851 205371 179475 176833 268473 -93104 49297 33785 -47340 56715
16254 -77520 197806 -10616 222364 436393 -99773 -51800 -280454 -9501 -5397 284070 -209070
16242 134842 -82232 122114 -89176 -57656 283951 -40830 -20903 -128286 11288 124634 78057
16231 78057 -152243 76500 174504 2346 68867 -7827 200884 190578 54276 -98988 344654
16219 186207 251687 -120427 106682 -145697 34293 55235 -237076 -369971 -170722 -44401
$$ packed form
16300A28843a5102A78810J29503n1779N8352M2738q1225E4289E369M6298a0476
16288A97218a97676A39286A0617K69638N0279A5873a26633B43969J02674A50046
16277E41844A89234K59792a04389F0129k3409J79025I2014L80969l2257B12560
16266D61816C9826J88025k2480k5896k642R1640i3104D9297j5512d7340E6715
16254g7520A97806a0616B22364K14029i9773M7973k28654i501M104B84070b09070
16242A34842h2232A22114h9176L1520B83951d0830J9927j07383A1288J13346m6577
16231G8057a52243G6500R8004B346O6521g827B00884j0306E4276i8988C44654
16219A86207O5480a20427A06682a45697C4293K0942b37076j32895a70722d4401
$$ plain form
16208 99851 -220142 199525 354211 -16912 294221 23420 -69959 248045 -65311 -258360
16198 -258360 171522 -147395 171419 -21014 107652 -22156 -251241 -13136 134730 290275
16188 290275 20082 -58841 132018 -22696 -176540 -7844 -17722 136433 376421 -369238 21389
16176 -9956 178352 -93703 -59091 33269 -207906 135451 57889 -85733 260672 66197 157117
16165 157117 -119356 303353 -100869 -223976 -54731 -366739 249733 387593 89509 -76189
16154 7534 32862 118661 255968 299592 -110435 311081 167056 153366 47021 235038 7572
16142 -50587 230975 -75700 -380483 103228 211361 175879 -91586 -175707 -80415 -63068 -20909
16130 278298 20864 147773 203205 29557 -24558 -140224 40378 -121649 -8417 259337 95335
$$ packed form
16208I9851b20142A99525J54686a6912B94221B3420f9959B48045f5311j93049
16198b58360A71522a47395A71419b1014A07652b2156k29085a3136A34730J55545
16188B90275B0082e8841A32018b2696j53844g844r878A36433K39988c69238B1389
16176i956A78352i3703L4612C3269b07906A35451E7889h5733B60672F6197R0920
16165A57117a19356C03353a00869j23107e4731l12008B49733J37860H9509g6189
16154G534K5328Q5799J37307M3624a10435C11081j44025j3690D7021J88017G572
16142e0587B30975g5700l04783A03228J08133l5482i1586q4121h0415J7347b0909
16130B78298B0864J26909N5432B9557b4558j15666D0378a21649h417B59337I5335
$$ plain form
16118 194504 8143 195627 152530 92131 -227906 36975 -249626 -199475 -129294 10676 386315
16107 386315 818 -302538 176014 -133815 -132542 -79503 -148747 -73664 -89656 226932 172774
16096 172774 -28561 237541 -223662 97115 6939 -69001 221976 28321 139902 124709 10612
16084 1580 -12117 128337 -181819 -117546 146670 235674 128820 -133542 -201516 -400833 76084
16072 -86467 108772 -16421 -7513 -77252 -170220 -110281 227588 -105864 77968 148641 299649
16061 299649 96355 91996 -219771 59405 -87860 19482 -31272 34291 -271459 -140906 183003
16049 123485 -27367 60378 185196 159388 -254237 -158831 194713 146346 188497 95365 -72249
16037 215606 -73251 -310300 180789 -334483 20595 -201785 51778 -295905 253756 374210
$$ packed form
16118A94504H143J87484m3097o0399b27906C6975b49626N0151P0181A0676L75639
16107C86315H18c02538A76014a33815J273N3039o9244g3664j5992B26932n4158
16096A72774b8561B37541b23662I7115F939f9001B21976B8321J11581j5193A0612
16084A580a2117A28337a81819O4273A46670Q9004j06854a33542o7974j99317G6084
16072h6467A08772a6421g513o9739r2968N9939B27588a05864G7968P0673J51008
16061B99649I6355m359b19771E9405h7860A9482c1272C4291b71459J30553A83003
16049A23485b7367F0378J24818k5808b54237R5406A94713m8367M2151r3132g2249
16037B15606g3251k37049A80789c34483B0595b01785E1778b95905B53756J20454
$$ plain form
16027 374210 151571 -79878 -349654 76597 100604 -8413 -100294 9861 168040 -297965 -2767
16015 -68989 -39313 77054 -165124 -61738 90973 -146086 -233840 139581 94221 -225047 52638
16003 -191587 360753 33235 -267676 16083 -57317 -53635 -25304 -468017 -147865 334891 76020
15991 56094 41051 101596 -131228 72810 97072 -174265 -196837 89558 -102361 25610 -184301
15979 121878 104764 -67963 102948 63055 -91522 -148400 48262 144564 17762 269904 180021
15968 180021 195740 41191 191204 -36311 81021 293126 130521 -248698 -209707 -28179 -273863
15957 -273863 -488500 -139274 -129410 57171 347121 15950 36902 -77865 56881 -313660 -179605
15946 -179605 326121 192145 -191144 -298441 -29547 -75592 212060 -331001 -102982 -250324
$$ packed form
16027C74210A51571g9878k69776G6597K4007h413r1881I861J58179b97965b767
16015f8989K9676G7054a65124f1738I0973a46086q7754A39581m5360b25047E2638
16003a91587C60753C3235b67676A6083e7317L682b5304m42713a47865C34891G6020
15991E6094j5043O0545a31228G2810K4262a74265k2572H9558a02361B5610a84301
15979A21878j7114f7963A02948l9893i1522n6878D8262R6302A7762K52142q9883
15968A80021J5719D1191J50013c6311H1021K12105A30521b48698L8991b8179k45684
15957b73863k14637a39274R864E7171K89950A5950K0952g7865E6881c13660J34055
15946a79605C26121j33976a91144j07297b9547m6045B12060c31001a02982j47342
$$ plain form
15936 -250324 218861 -445914 -224216 117760 106484 -70346 -141747 10503 -276985 8278 98650
15925 98650 -293471 51452 -43140 16049 -139837 -32251 85201 -205448 -233638 250803 -227758
15913 -156994 25578 12855 217509 -158934 -109885 50210 -89795 -238936 294250 -190306
15902 -90306 -126057 -131638 138092 203595 -18761 -108619 -9796 -227475 -199441 -8707 33874 72137
15890 72137 -167332 49355 76518 -156967 54771 -336528 61743 -257613 -281289 -323907 -35823
15878 -543721 40829 -116757 -101733 -288075 -119745 -149638 85773 6561 -273635 518066 96494
15866 -340881 197787 1703 -105577 -390819 -320190 55942 77728 -289371 -109245 245759
15855 -230639 -262408 -258486 -9246 263177 -39260 -25627 -27510 -343821 125751 -4425 -197701
$$ packed form
15936b50324B18861d45914K21698A17760j1276g0346p1401A0503b76985H278R0372
15925I8650b93471E1452d3140A6049a39837c2251H5201b05448k8190B50803b27758
15913a56994B5578j2723K04654a58934M9049E0210h9795j49141B94250a90306
15902i0306l5751n581A38092O5503a8761q9858i796k17679K8034h707C3874L8263
15890G2137a67332D9355K7163a56967E4771c36528F1743b57613k3676m2618c5823
15878e43721D0829a16757J5024j86342a19745k9893H5773F561b73635E18066I6494
15866c40881A97787A703a05577k85242P0629E5942K1786b89371a09245B45759
15855b30639l1769L922i246B63177c9260J3633j883l16311A25751d425j93276
$$ plain form
15844 -197701 -155142 -143273 184649 41655 -3943 -316826 200238 363532 -20993 174644 -27993
15832 164980 -141328 -58647 -170715 -182316 355588 235684 -85025 141333 108821 48941
15821 -3403 -136119 137563 -246505 187156 -62346 -364992 8704 -160635 -137758 124202 10010
15809 111917 132535 -53368 -41215 -118778 57852 -96419 -207798 145631 -202957 -105049 283122
15797 34536 -417043 381815 -305161 -268761 -75470 -75438 128631 -114820 27283 -86875 8896
15785 -127363 -196692 -98647 57203 70476 14184 -5613 178884 75396 146568 80048 262501
15774 262501 -114829 -52099 19214 -33025 261404 45300 -290069 10005 -252375 -24319 111799
15762 -79293 -158489 -60553 -142244 -100078 -183502 -151670 70794 -124165 -318907 -5614 -194234
$$ packed form
15844a97701M2559J1869A84649D1655c943l12883B00238J63294b0993A74644b7993
15832A64980a41328e8647j12068j1601C55588j19904h5025A41333l2512D8941
15821c403j32716A37563b46505A87156f2346l02646H704a60635K2877A24202A0010
15809A11917K0618e3368J2153p7563E7852i6419j11379A45631b02957R7908B83122
15797C4536d17043C81815c05161L6400g5470L2A28631a14820B7283h6875H896
15785a27363o9329R8045E7203J3273A4184e613A78884G5396P1172o6520J82453
15774B62501a14829e2099A9214c3025B61404D5300b90069A0005b52375b4319A11799
15762g9293p9196f0553q1691M2166q3424L1832G0794a24165j94742e614j88620
$$ plain form
15751 -194234 -3228 -161415 43599 -96029 -20619 -12071 -70958 -3403 408242 93727 125920 79432
15739 79432 -49946 241846 -247397 31037 72760 180565 329013 -199659 -180062 -264222 -373576
15728 -373576 95944 -235124 -25716 -89184 -51190 -108285 -141700 24141 -119205 -200233 -98770
15716 182614 -362416 -44390 -100650 -327850 -139720 -66303 37477 204497 -117395 -3646 238665
15704 -270265 -287290 2579 231683 -212900 270680 115258 359629 -268848 -182767 -103737
15694 -103737 -63087 -60364 -16674 390794 -167623 -160250 12524 -125660 -264431 -102039 -190519
15683 -190519 -121416 -8677 -222385 188407 -217695 65707 150192 -48884 372446 -220409 -28292
15671 111219 -108416 324808 177087 26251 289841 11211 217823 -99437 232429 -39021
$$ packed form
15751a94234c228j58187D3599i6029b0619Q548n8887c403D08242I3727L2193m6488
15739G9432d9946B41846b47397C1037M1723J07805J48448a99659J9597q4160j09354
15728c73576I5944b35124b5716o3468L7994n7095l3415B4141a19205q1028i8770
15716A82614c62416d4390n6260k27200a39720f6303C7477J67020a17395c646B38665
15704b70265j7025B579K29104b12900B70680A15258K44371b68848Q6081P9030
15694a03737M0650K723a6674C90794a67623P373A2524a25660j38771a02039q8480
15683a90519O9103h677k13708A88407b17695F5707Q4485d8884C72446b20409b8292
15671A11219a08416C24808j47721B6251K63590A1211K06612i9437B32429c9021
$$ plain form
15660 174376 -348867 -19426 217775 -227508 322288 -159034 -206645 -40497 142977 89808
15650 89808 228534 -111203 211731 78156 -83582 127600 269720 48173 -70456 -158003 121541
15638 -218361 -60247 78139 204655 66678 -113211 -32110 163855 -22328 -216621 -184911 -285509
15627 -285509 -44550 -61265 -175307 173998 -101688 -60163 -38774 -64075 -223202 -67282 -269979
15616 -269979 -237355 -66894 114385 76902 -97638 43234 -303797 19734 -101846 192219 19918
15604 -78029 106142 -296987 48420 248725 -65371 -92932 -154369 388577 -227083 -18341 41636
15592 330424 -10933 -205592 -278596 -251657 -32244 114107 376825 -124430 186153 140250
15582 140250 -204130 74472 129102 -9214 -80215 -85470 -76384 242783 177035 -263341 -31368
$$ packed form
15660A74376c48867a9426B17775b27508C22288a59034m7611d0497A42977n3169
15650H9808J38726a11203B11731G8156h3582A27600J42120D8173g0456q7547A21541
15638b18361f0247G8139J26516F6678a13211c2110A63855b2328j94293L1710j00598
15627b85509d4550j6715j14042A73998a01688M1525K1389k5301j59127f7282k02697
15616b69979L2624f6894A14385l7483i7638D3234c03797A9734a01846A92219A9918
15604g8029A06142b96987D8420K00305f5371k7561o1437C88577b27083a8341D1636
15592C30424a0933j94659p3004K6939c2244A14107K62718a24430A86153m5903
15582A40250b04130G4472N4630i214p1001n255R086B42783o5748b63341c1368
$$ plain form
15570 -167744 -111952 176602 147955 314457 -119575 10447 206716 -375277 -77184 -158518
15560 -158518 348 -240626 -220705 183711 -164363 250446 -317795 164127 103640 -25915 -104061
15549 -104061 -44227 -190137 338220 -8774 160008 170810 -122766 113080 -122647 -252481
15539 -252481 94031 222290 -460842 28604 -40109 -25343 -46450 -53638 137335 166329 81528
15527 260054 73887 75082 185810 50601 73209 196838 -148300 -118997 -15349 -86800 -141356
15516 -141356 -56127 -307910 -238352 -183264 42926 -48051 -19074 -12882 129452 -155279 -226580
15505 -226580 -138264 -42890 -36061 -166216 170542 350855 128240 -12363 -85194 65338 -33598
15493 -154965 -214059 -12836 31301 119805 -81707 -203080 474 -176538 -40831 86569 114593
$$ packed form
15570a67744N5792A76602k8647J66502a19575A0447J96269c75277g7184q1334
15560a58518C48b40626J9921A83711a64363B50446c17795A64127o0487b5915p8146
15549a04061d4227j45910C38220h774A60008J0802a22766A13080a22647j29834
15539b52481I4031J28259d60842B8604d0109J4766k1107p188A37335K8994H1528
15527B60054G3887J195J10728E0601K2608J23629a48300K9303a5349p1451n4556
15516a41356e6127k51783O9558N5088D2926d8051a9074O192A29452a55279p1301
15505b26580Q8316d2890O829j30155A70542J80313A28240a2363p2831F5338c3598
15493a54965n9094a2836C1301Q8504h1707j21373D74a76538d0831H6569K8024
$$ plain form
15482 114593 158032 -263667 279297 -322528 243027 -128829 184355 -140206 -45796 97583
15471 -82208 -217400 -110865 -105462 30626 -368155 322793 -24068 -5579 196834 -224055 -28299
15459 -182281 4299 103323 -11672 -194424 -297052 -102333 41456 2823 387664 128074 -56121
15447 142014 -193400 -145138 75354 32801 19427 1356 240178 146182 221543 178472 -144750
15435 -166952 -40185 -22413 -29239 -60853 -58751 -21942 155135 8062 -56907 -127027 -204122 243572
15422 -34816 -6922 -48886 -98353 -106957 -187718 446599 11165 14179 -17834 -64479 -250754 113289
15409 292499 5300 -79523 -115014 48276 128317 -212971 428862 173271 55318 29358 225489
15398 225489 7066 -26815 42453 -293052 -45424 -246752 119310 158731 -352065 -22719 -39392
$$ packed form
15482A14593M3439b63667B79297c22528B43027a28829A84355a40206d5796I7583
15471h2208j35192J06535N403C0626c68155C22793b4068e579A96834b24055b8299
15459a82281D299R9024a1672j82752j02628a02333D1456B823L84841A28074e6121
15447A42014a93400M8262G5354C2801j3374A356K38822r3996P5361m3071a44750
15435a66952d0185J7772o826l1614K102b1942A55135H062e6907p0120p7095B43572
15422c4816f922m1964m9467q604q0761D46599A1165L014a7834m6645j86275A13289
15409B92499E300g9523l5491D8276Q0041b12971D28862A73271E5318k5960J96131
15398B25489G066b6815D2453b93052d5424k01328A19310L9421c52065b2719j6673
$$ plain form
15387 -39392 -27875 91118 150494 143888 -69754 -249817 -125028 67611 -55819 36094 -57495
15375 164182 -156727 113196 -118349 190458 -131639 131541 178452 -114934 -172416 211163
15364 10878 -221656 -226563 -240768 -207279 -1181 -142481 137791 73227 163225 -29997 11566
15352 -42580 -36912 9777 109129 35838 183784 -59859 -248994 -42701 132556 316158 139457
15340 168723 3454 175686 -377412 160026 -101577 99443 252333 131979 -175539 139070
15329 201540 -39479 349100 220447 135145 -101961 134004 -21001 160942 -421213 388522
15318 136278 -399476 290976 -93205 -285271 -151486 -157245 197089 64240 174934 70253
15307 131390 222131 80195 -129602 196657 -46349 88108 -159785 82660 -69021 187700 160138
$$ packed form
15387c9392J1517I1118N9376o606f9754j80063J24789F7611e5819C6094e7495
15375A64182a56727A13196a18349A90458a31639A31541M6911a14934n7482B11163
15364A0878b21656m907j4205L3489a181j41300A37791o4564Q9998b9997A1566
15352d2580N668I777R9352C5838J47946e9859j89135d2701A32556J83602A39457
15340A68723C454J72232c77412A60026a01577I9443J52890j20354a75539A39070
15329B01540c9479C49100j28653q5302a01961A34004b1001A60942d21213C88522
15318A36278c99476B90976i3205j92066J33785n759A97089F4240J10694G0253
15307A31390R0741H0195a29602A96657d6349H8108a59785H2660f9021A87700k7562
$$ plain form
15296 160138 -88265 234917 334175 87067 98177 -82093 -243708 -126836 -209121 105755 91739
15285 91739 77548 -324165 258477 362149 204529 211399 -201521 -32551 89763 -16956 -321504
15274 -321504 -49121 -24871 10765 340151 328537 -82204 90063 -77660 -153249 57482 150911
15263 150911 186524 5022 -255552 97224 141481 -329337 481194 -171134 46175 287064 -155106
15251 -271422 230897 -115245 -64067 95802 194967 -448844 280516 -97218 272524 11317
15240 -16297 152450 487581 56306 388258 161735 1008080 1081250 869277 547529 641186
15230 641186 289472 396489 380862 73188 261238 -74823 215287 74702 89039 -61334 72392
15218 136473 59911 56469 -5814 204865 332793 183635 -20686 -378896 46086 364925 148610
$$ packed form
15296A60138h8265B34917R9258H7067J1110h2093j61615J16872q2285A05755j4016
15285I1739j4191c24165B58477J03672j57620O870b01521c2551H9763a6956l04548
15274c21504d9121K4250A0765L29386j1614h2204I0063g7660p5589E7482R3429
15263A50911L5613E022b55552I7224M4257c29337D81194a71134D6175K40889a55106
15251b71422B30897a15245N1178I5802R9165d48844B80516i7218B72524A1317
15240a6297A52450L35131E6306L31952A61735Q46345P3170k11973l21748R3657
15230F41186B89472J07017j5627G3188J88050g4823B15287G4702J4337f1334G2392
15218A36473E9911l442e814B04865J27928j49158b0686l58210D6086L18839A48610
$$ plain form
15206 168677 -284896 131960 196494 41277 96851 87493 2778 -108308 -235486 122098 -12779
15194 -101049 184202 -120428 -1929 237604 -113336 -296705 -168181 52983 -35200 105286
15183 -119621 250521 -235452 -238594 256930 50022 227430 -31480 -127074 111767 -185764
15172 -18983 391101 -74373 -10392 54654 -53361 -39908 -162457 73254 204639 -230702 -136825
15161 -136825 253696 165940 -149468 -36165 -170813 76001 127353 62179 -31664 38995 -26772
15149 16639 302003 10861 49458 -54175 174804 143506 -31108 19510 -119498 -237961 20384
15137 97157 -94834 -37707 276854 250259 120539 -227797 212557 -21219 -95898 -157412 130043
15125 134356 -49000 199191 209787 122969 3010 -38352 198670 154839 64717 157896 118655
$$ packed form
15206A68677b84896A31960O4534D1277N5574r358B778a08308j27178A22098a2779
15194a01049A84202a20428a929B37604a13336j83369J28524E2983c5200A05286
15183a19621B50521b35452l142B56930E0022J77408c1480r5594A11767a85764
15172a8983C91101g4373a0392E4654e3361J3453j22549G3254J31385b30702R3877
15161a36825B53696q7756a49468c6165j34648G6001N1352F2179c1664C8995b6772
15149A6639K85364A0861L8597e4175A74804l1298c1108A9510a19498j18463B0384
15137I7157i4834c7707B76854k6595A20539b27797B12557b1219p4679o1514A30043
15125A34356d9000A99191J0596q6818C010c8352A98670m3831F4717R3179l9241
$$ plain form
15114 118655 -168499 288696 231605 309226 109197 -193967 255842 174991 182127 253151 103540
15102 -22323 -76552 -4948 10337 -80458 -95505 232843 -2506 43533 -70272 150188 357449
15091 357449 89820 -179267 327723 299242 -334624 -10125 314673 174626 444761 59681
15080 188162 417406 259140 -277842 -159568 84810 -263345 397022 124540 92548 175565
15070 175565 137862 215339 129644 83639 5687 142502 -69353 -155917 192368 438951 333996
15059 333996 301174 8571 83309 60218 -64675 200285 318403 471808 -14562 70191 -164171
15047 -40412 244282 277512 82959 121503 175771 312363 43636 314789 266517 223654 111151
15035 188828 223478 52669 6217 227067 201380 21331 105502 226709 74797 51213 -131768
$$ packed form
15114A18655a68499B88696n7091P7621A09197a93967B55842q0851P136P1024A03540
15102b2323n4229d948A0337h0458j5047B32843b506D3533g0272A50188K07261
15091C57449H9820a79267C27723k8481c34624a0125C14673j40047K70135E9681
15080A88162K29244j58266b77842J18274H4810b63345C97022A24540l1992Q3017
15070A75565l7703P7477q5695m6005E687J36815f9353q6564A92368K46583j04955
15059C33996l2822H571P4738k3091f4675B00285J18118J53405a4562G0191a64171
15047d0412B44282L3230H2959L8544N4268J36592D3636K71153m8272m2863A11151
15035A88828L4650E2669F217K20850k5687B1331Q4171J21207G4797k3584a31768
$$ plain form
15023 329285 87387 128710 160121 446264 213775 -25505 100164 106391 166984 276365 481559
15012 481559 305501 83925 330056 -21513 236639 260288 207029 231385 225081 418475 -166834
15000 296962 42281 30421 274449 172571 -64533 365453 173379 191837 409226 393313
14990 393313 83306 -230284 157586 242855 -60863 -171478 207982 149884 170747 -36531 343468
14978 391170 216985 80474 425497 84171 189661 334640 261874 230460 -65059 116927
14967 358899 196000 162256 296036 302020 370109 354524 135605 442817 372824 282983 146551
14956 146551 400218 465056 14865 279186 363370 -10924 244791 448829 -133409 -86393
14946 -86393 196968 268455 345068 207899 661634 113575 128882 196163 384462 274080
$$ packed form
15023C29285H7387M1323L1411K86143B13775b5505A00164O227O0593J09381K05194
15012D81559j76058H3925K46131b1513B36639K3649n3259K4356o304J93394a66834
15000B96962D2281j1860K44028j01878f4533C65453A73379J8458K17389j5913
14990C93313H3306b30284A57586Q5269f0863j10615B07982n8098K0863c6531C43468
14978C91170j74185H0474L45023H4171J05490J44979p2766l1414f5059A16927
14967C58899j62899l3744J33780N984O8089j5585A35605L07212o9993q9841j36432
14956A46551K53667O4838A4865K64321Q4184a0924B44791K04038a33409M7016
14946h6393A96968P1487P6613j37169M53735A13575J5307O7281J88299j10382
$$ plain form
14936 274080 35824 333257 26747 253909 -27403 -204706 313541 441248 458890 315386
14926 315386 300894 424146 328834 497244 156512 381362 260014 267686 370090 239821
14916 239821 293849 481133 165081 494404 170202 193319 131273 227709 342076 304479
14906 304479 515519 217185 24514 87375 193402 25678 846882 253783 172462 359230
14896 359230 172512 106331 33568 230739 280297 434309 271350 432749 -207774 137189
14885 260874 199220 170263 315753 278877 365966 350354 101468 300656 179912 396756
14875 396756 342449 55331 342076 277386 446255 463939 502662 307577 524554 207808
14864 507003 246356 459213 163203 607154 449730 551565 328269 -4545 359184 357870
$$ packed form
14936B74080C5824K97433B6747K27162b7403j77303C13541J27707J7642j43504
14926C15386j4492J23252r5312J68410A56512K24850j21348P672J02404j30269
14916B39821N4028J87284A65081L29323A70202K3117o2046R6436J14367l7597
14906C04479K11040B17185B4514O2861J06027B5678Q21204B53783q1321J86768
14896C59230A72512o6181C3568J97171M9558J54012j62959J61399b07774A37189
14885B60874o1654k8957J45490l6876Q7089j5612A01468J99188j20744K16844
14875C96756n4307E5331K86745o4690J68869J7684L8723j95085K16977B07808
14864E07003B46356K12857A63203M43951j57424J01835k23296d545C59184j314
$$ plain form
14854 357870 104577 532444 321409 732335 272595 857892 453463 332542 209274 326395
14844 326395 358296 492496 336855 573335 378141 571203 296590 584075 393441 71597
14833 481914 217687 536354 470279 248939 306059 240986 522112 469516 592326 507165
14823 507165 412106 323882 242677 704049 330084 431045 287264 321475 519439 548781
14813 548781 9585 422729 746160 336926 295976 394551 336534 198835 347854 148279
14802 755449 384185 417118 335566 362921 298880 642430 491812 240491 536322 347698
14792 347698 578419 605343 580338 380155 596354 312742 510107 778929 409214 586599
14782 586599 625080 220423 875796 497258 587152 380606 833124 579396 509238 360629
$$ packed form
14854C57870A04577M27867k11035M10926B72595N85297m04429j20921j23268J17121
14844C26395L1901J34200j55641K36480j95194J93062k74613K87485j90634G1597
14833D81914B17687L18667o6075k21340N7120o5073K81126n2596J22810q5161
14823E07165r5059q8224q1205M61372C30084J00961j43781L4211J97964K9342
14813E48781I585M13144L23431C36926m0950R8575n8017j37699J49019A48279
14802G55449l71264L2933q1552K7355o4041L43550j50618B40491K95831j88624
14792C47698K30721K6924k5005k00183K16199k83612J97365K68822l69715J77385
14782E86599L8481B20423O55373l78538Q9894k06546M52518k53728p0158j48609
$$ plain form
14772 360629 364920 845536 647665 582466 812376 517820 580670 829176 528860 339802
14762 339802 264015 286689 420339 761975 546903 551737 628065 587560 475789 608281 605130
14751 605130 737982 575962 646995 902082 445369 591882 656028 804855 623239 766650
14741 766650 560661 337798 682985 474795 756900 930587 810860 663868 819298 830062
14731 830062 722502 654152 667709 509321 1043722 947348 946817 804397 914745 632868 373317
14720 373317 692090 911867 560368 588273 577299 959418 749683 433549 625891 488860
14710 488860 767505 746116 1062997 699744 897288 801058 797754 593250 697378 887884
14700 887884 728663 1098624 737584 435427 716228 626445 856509 999173 968644 756888
$$ packed form
14772C60629M291M80616j97871o5199K29910k94556O2850K48506l00316j89058
14762C39802p5787K2674J33650L41636k15072M834P6328m0505j11771J32492l151
14751F05130J32852j62020P1033K55087D45369J46513O4146J48827j81616J43411
14741G66650k05989k22863L45187k08190K82105J73687j19727j46992J55430J0764
14731H30062j07560o8350J3557j58388N34401r6374n31j42420J10348k81877k59551
14720C73317L18773K19777l51499K7905j0974L82119k09735l16134J92342j37031
14710D88860K78645k1389L16881l63253J97544r6230l304k04504J04128J90506
14700H87884j59221L69961l61040l02157K80801q9783K30064J42664l0529k11756
$$ plain form
14690 756888 689109 763349 611372 821477 887981 875295 782442 905452 609849 881284
14680 881284 1028299 1051399 806062 1046172 918868 826473 853402 971274 1020440 984680
14670 984680 939751 915066 1037677 1036862 1005021 1143928 856517 1061348 975872 860642 899154
14659 899154 773516 737111 1339426 1104981 787984 1012422 882507 1071696 813974 1148571
14649 1148571 1088982 1107239 905914 977629 1197792 1117396 1048438 826324 995552 842755
14639 842755 1001311 1106579 1353784 1155297 1059468 1177419 980747 950955 1217865 1092608
14629 1092608 1135932 1310647 1482193 1174217 1246509 1064798 1253678 1107305 1325074 1187267
14619 1187267 1323700 1232295 1139754 1359158 1262815 1321014 1534820 1181949 1244073 1408800
$$ packed form
14690G56888o7779P4240j51977K10105O6504j2686r2853J23010k95603K71435
14680H81284J47015K3100k45337K40110j27304r2395K6929J17872M9166l5760
14670I84680m4929k4685J22611q15l1841J38907k87411K04831q5476j15230L8512
14659H99154j25638l6405O02315k34445l16997K24438j29915J89189k57722L34597
14649A148571n9589J8257k01325P1715K20163q0396o8958k22114J69228j52797
14639H42755J58556J05268K47205j98487r5829J17951j96672k9792K66910j25257
14629A092608M3324J74715J71546l07976P2292j81711J88880j46373K17769j37807
14619A187267J36433r1405r2541K19404r6343N8199K13806l52871O2124J64727
$$ plain form
14609 1408800 1443876 1168772 1124096 1404569 1665916 1194756 1516867 1303226 1125077 1534074
14599 1534074 1432160 1462484 1575551 1372880 1864903 1261679 1225144 1851877 1342790 1627713
14589 1627713 1321877 1478389 1802471 1654841 1416690 1601009 1529892 1641158 1444374 1731804
14579 1731804 1592335 1633845 1989323 1643489 1700863 1597614 1911320 1752475 1857658 1820285
14569 1820285 1959086 1657774 2022794 1844012 1753145 2149565 1985248 2008248 1984680 2191574
14559 2191574 2050669 2188785 2015539 1782866 1944682 2141203 2460060 2476880 2327911 2165711
14549 2165711 2552556 2440542 2485898 2992225 2991942 3044890 3015805 3396523 3542912 3822938
14539 3822938 4307274 5103387 5688677 6507421 7706393 9557069 13464105 20103672 28343496
$$ packed form
14609A408800L5076k75104m4676K80473K61347m71160L22111k13641j78149M08997
14599A534074j01914L0324J13067k02671M92023o03224l6535O26733n09087K84923
14589A627713l05836J56512L24082j47630k38151J84319p1117J11266j96784K87430
14579A731804j39469M1510L55478l45834N7374j03249L13706j58845J05183l7373
14569A820285J38801l01312L65020j78782r0867L96420j64317K3000k3568K06894
14559B191574j40905J38116j73246k32673J61816J96521L18857J6820j48969j62200
14549B165711L86845j12014M5356N06327k83N2948k9085L80718J46389K80026
14539C822938M84336P96113N85290Q18744J198972J850676L907036O639567Q239824
$$ plain form
14530 28343496 26159866 15531251 10191530 7145958 5410311 4380487 3645345 3433022
14522 3433022 2652020 2802112 2695800 2562813 2593258 2502996 2511402 2558409 2437431 2167229
14512 2167229 2691185 2482746 2181390 2555085 2698375 2899545 2656750 2469221 2705171
14503 2705171 2458698 2397138 2864286 2606248 2545910 2628293 3061516 2869156 2573263 2778810
14493 2778810 2937681 2960362 3183465 2993474 2958060 3005388 2949814 3414766 3319990 2897435
14483 2897435 3154155 3104709 3365906 3268733 3547008 3283055 3413090 3531402 3487924 3683371
14473 3683371 3658217 3579207 3715949 3891023 3465435 3755698 3788290 3733444 4088244 4041735
14463 4041735 3896757 3954541 3971746 4217498 4164018 4245929 3897792 4179253 4259176 4454822
$$ packed form
14530B8343496k183630j0628615n339721l045572j735647j029824p35142k12323
14522C433022p81002J50092j06312j32987L0445r0262Q406M7007j20978k70202
14512B167229N23956k08439l01356L73695J43290K01170k42795j87529K35950
14503B705171k46473o1560M67148k58038o0338Q2383M33223j92360k95893K05547
14493B778810J58871K2681K23103j89991l5414M7328n5574M64952r4776m22555
14483B897435K56720m9446K61197r7173K78275k63953J30035J18312m3478J95447
14473C683371k5154p9010J36742J75074m25588K90263L2592n4846L54800m6509
14463D041735j44978N7784J7205K45752n3480Q1911l48137K81461P9923J95646
$$ plain form
14453 4454822 4630519 4540682 4725720 4557999 4936515 4743980 4596834 4972085 4686075 4886743
14443 4886743 4854582 5193802 4877743 5085023 5082234 5332325 5461420 5665567 5363514 5772249
14433 5772249 5659719 5580161 5721525 5799241 5685108 5754920 6092091 6311488 6188359 6316438
14423 6316438 6585560 6563455 6764004 6389931 6685085 6777869 6814104 6753064 7116526 7381218
14413 7381218 6714178 7598010 7479926 7613644 7710671 8126832 7565305 8048059 7763503 8155312
14403 8155312 8204675 8053257 8418136 8711525 8779652 8728458 9185641 9018505 9077150 9556070
14393 9556070 9571272 9381164 9980977 10038268 10278864 10243125 10216003 10429226 10794146 11090235
14383 11090235 11102806 11140050 11713054 11874337 11761944 12370894 12042792 12378179 12761745 12847653
$$ packed form
14453D454822J75697q9837J85038j67721L78516j92535j47146L75251k86010K00668
14443D886743l2161L39220l16059K07280k789K50091J29095K04147l02053M08735
14433E772249j12530p9558J41364P7716j14133O9812L37171K19397j23129J28079
14423F316438K69122k2105K00549l74073K95154R2784L6235o1040L63462K64692
14413G381218o67040Q83832j18084J33718R7027M16161n61527M82754k84556L91809
14403H155312M9363j51418L64879K93389O8127n1194M57183j67136N8645M78920
14393I556070J5202j90108N99813N7291K40596l5739k7122K13223L64920K96089
14383A1090235J2571L7244N73004J61283j12393O08950l28102L35387L83566Q5908
$$ plain form
14373 12847653 13114504 13296385 13560992 13816665 14041947 14167683 14553189 15160259 14767046
14364 14767046 15125809 15654809 16103113 15983111 16413429 16904916 17142583 17829751 17975891
14355 17975891 18292697 18593676 18970976 19518037 19728480 20369188 20483005 21123414 21547111
14346 21547111 22027354 22507795 23110962 23611713 24075793 24745851 25191535 25648389 26590817
14337 26590817 27175871 27628658 28457895 29160742 29896071 30335672 31256144 31970496 32882526
14328 32882526 33960595 34899293 35800806 36475918 37788103 39066263 39903549 40810478 42395496
14319 42395496 44050097 44657552 46159831 47368443 48974922 50686749 52411247 53882431
14311 53882431 55919005 57981437 59555820 61627795 63513457 66004003 68566942 70999792
$$ packed form
14373A2847653K66851J81881K64607K55673K25282J25736L85506O07070l93213
14364A4767046L58763N29000M48304j20002M30318M91487K37667O87168J46140
14355A7975891L16806L00979L77300N47061K10443O40708J13817O40409M23697
14346B1547111M80243M80441O03167N00751M64080O70058M45684M56854R42428
14337B6590817N85054M52787Q29237P02847P35329M39601R20472P14352R12030
14328C2882526J078069R38698R01513O75112J312185J278160Q37286R06929J585018
14319D2395496J654601O07455J502279J208612J606479J711827J724498J471184
14311E3882431K036574K062432J574383K071975J885662K490546K562939K432850
$$ plain form
14303 70999792 73331671 76370746 79186425 81883977 85504999 88673403 92017942 96241743
14295 96241743 100234654 103952988 108398993 113344759 117809551 123281856 129036501 134610221
14287 134610221 140892467 147080268 154350402 161763226 169601307 177893408 186162646 195794787
14279 195794787 205267512 215378737 226361182 237461136 249416315 261793125 274720708
14272 274720708 288192385 301774369 316025288 329957443 343998414 357582515 370035846
14265 370035846 381177716 390131394 397358141 402950220 408513070 413956270 418251447 422362856
14257 422362856 424999348 424160126 422494710 417497590 406038048 396232748 387957194 379319659
14249 379319659 369937600 360234444 347962721 335556974 322637012 310063999 297752153
$$ packed form
14303G0999792K331879L039075K815679K697552L621022L168404L344539M223801
14295I6241743L992911L718334M446005M945766M464792N472305N754645N573720
14287A34610221O282246O187801P270134P412824P838081Q292101Q269238R632141
14279A95794787R472725J0111225J0982445J1099954J1955179J2376810J2927583
14272B74720708J3471677J3581984J4250919J3932155J4040971J3584101J2453331
14265C70035846J1141870Q953678P226747N592079N562850N443200M295177M111409
14257D22362856K636492q39222j665416m997120j1459542r805300q275554q637535
14249C79319659r382059r703156j2271723j2405747j2919962j2573013j2311846
$$ plain form
14242 297752153 285512524 273954708 262650306 251594538 240474159 229849933 219672830
14235 219672830 209912014 200591107 191194824 182378128 173864732 165770619 158158166 150686957
14227 150686957 144458016 137723790 131834159 126299657 121015937 115632914 110514082 105902753
14219 105902753 100719025 97058965 93013280 88894345 85119125 82116761 78763559 75656248
14211 75656248 72794203 70118120 67998131 65490111 62820256 60960734 58641431 56844175
14203 56844175 55017563 53094971 51250543 49816997 48497093 46767103 45379541 44151937
14195 44151937 42730919 41513907 40580582 39644745 38202020 37306375 36224808 35159181
14187 35159181 34575153 33414275 33031113 32107943 30999936 30173925 29186530 28752208 28122337
$$ packed form
14242B97752153j2239629j1557816j1304402j1055768j1120379j0624226j0177103
14235B19672830r760816r320907r396283q816696q513396q094113p612453p471209
14227A50686957o228941o734226n889631n534502n283720n383023n118832m611329
14219A05902753n183728l660060m045685m118935l775220l002364l353202l107311
14211G5656248k862045k676083k119989k508020k669855j859522k319303j797256
14203E6844175j826612j922592j844428j433546j319904j729990j387562j227604
14195D4151937j421018j217012r33325r35837j442725q95645j081567j065627
14187C5159181n84028j160878l83162r23170j108007q26011r87395m34322o29871
$$ plain form
14178 28122337 27196974 26570324 26248641 25791434 24853492 24368799 23751252 23172674 22711717
14169 22711717 22389234 21709030 21141187 20751239 20602901 19740959 19654966 19101293 18791680
14160 18791680 18355421 18129695 17563907 17581262 16800929 16389565 15939559 15936272 15806271 15343955
14150 15343955 15138626 14877330 14484179 14455162 13836073 13501444 13670214 13228859 13164786 12899394
14140 12899394 12823796 12145099 12190893 12280566 12160503 11522376 11658613 11236115 11298947 10949279
14130 10949279 10770173 10700713 10453171 10155731 10014756 10190550 9987157 9847982 9636581
14121 9636581 9380125 9175512 9341712 9145915 8897354 8777575 8767506 8559910 8230038 8441361
14111 8441361 8027076 7927790 8376508 8004288 7893293 7575054 7588236 7726674 7276957 7274679
$$ packed form
14178B8122337r25363o26650l21683m57207r37942m84693o17547n78578m60957
14169B2711717l22483o80204n67843l89948j48338q61942q5993n53673l09613
14160A8791680m36259k25726n65788J7355p80333m11364m50006l287j30001m62316
14150A5343955k05329k61296l93151k9017o19089l34629J68770m41355o4073k65392
14140A2899394p5598o78697M5794Q9673j20063o38127J36237m22498O2832l49668
14130A0949279j79106o9460k47542k97440j40975J75794k03393j39175k11401
14121I636581k56456k04613J66200j95797k48561j19779j0069k07596l29872K11323
14111H441361m14285r9286M48718l72220j10995l18239J3182J38438m49717k278
$$ plain form
14101 7274679 7089367 6926903 7022151 7019237 6716316 7200986 6749820 6586355 6483226 6424818
14091 6424818 6447533 6346233 6129796 6059852 5978851 5902943 5736204 5719737 5663892 5766293
14081 5766293 5529204 5286205 5384460 5667367 5368690 5159229 5424756 5260166 5381426 5202306
14071 5202306 4927752 4773615 4741480 4959639 5124158 4750713 4801140 4705040 4621542 4592274
14061 4592274 4477623 4331852 4370328 4467711 4476592 4326273 4405399 4117260 4074175 4283367
14051 4283367 3844899 3974924 4199237 4075030 4129331 3982152 3949386 3692712 4186936 3596578
14041 3596578 4120429 3898685 3451269 3563341 3641102 3361901 3217561 3854508 3554814 3404246
14031 3404246 3183645 3308695 3216263 2990257 3296506 3178557 3139126 3434276 2945535 2858121
$$ packed form
14101G274679j85312j62464R5248k914l02921M84670m51166j63465j03129n8408
14091F424818K2715j01300k16437o9944q1001p5908j66739j6467n5845J02401
14081E766293k37089k42999R8255K82907k98677k09461K65527j64590J21260j79120
14071E202306k74554j54137l2135K18159J64519l73445N0427r6100q3498k9268
14061D592274j14651j45771L8476R7383Q881j50319P9126k88139m3085K09192
14051D283367m38468J30025K24313j24207N4301j47179l2766k56674M94224n90358
14041C596578N23851k21744m47416J12072P7761k79201j44340O36947k99694j50568
14031C404246k20601J25050r2432k26006L06249j17949l9431K95150m88741q7414
$$ plain form
14021 2858121 3226770 3243791 3177150 2914238 2764574 3184581 3042919 3254332 2993775 2921930
14011 2921930 2835113 2702900 2804884 2885412 2944791 2683970 2842841 2631874 2416647 2600322
14001 2600322 2379057 2520008 2326191 2684870 2639159 2490868 2211633 2447546 2444345 2416792
13991 2416792 2214828 2512687 2215695 2081422 2177908 2317190 1864950 2357126 2473825 2603056
13981 2603056 2548751 2376171 2888751 3048979 3723112 4162929 5098296 6304584 9157320
13972 9157320 15488290 24201221 25753751 17777736 12416244 9861287 7493662 5821687
13964 5821687 5026735 4639604 4096963 3899502 3486981 3071202 3008443 3259907 2908103 2938521
13954 2938521 2595317 2751691 2611581 2377986 2365417 2560942 2266278 2526506 2180568 2102146
$$ packed form
14021B858121L68649J7021o6641k62912j49664M20007j41662K11413k60557p1845
14011B921930q6817j32213J01984Q0528N9379k60821J58871k10967k15227J83675
14001B600322k21265J40951j93817L58679m5711j48291k79235K35913l201k7553
13991B416792k01964K97859k96992j34273R6486J39282m52240M92176J16699J29231
13981B603056n4305j72580N12580J60228O74133M39817R35367J206288K852736
13972I157320O330970Q712931J552530p976015n361492k554957k367625j671975
13964E821687p94952l87131n42641j97461m12521m15779o2759K51464l51804L0418
13954B938521l43204J56374j40110k33595j2569J95525k94664K60228l45938p8422
$$ plain form
13944 2102146 2266334 2038514 2269847 2198648 2102558 1768954 1682491 1782821 1679596 1945884
13934 1945884 1556758 1966701 2096296 1829574 1612374 1684143 1941147 2055143 1849051 1893121
13924 1893121 1763379 1922329 1788779 1477746 1675751 1756333 1907024 1684151 1564939 1503594
13914 1503594 1703154 1626495 1530113 1726806 1518561 1359156 1321821 1480266 1421552 1339765
13904 1339765 1535340 1534074 1480278 1521761 1761197 1471876 1403159 1539819 1594253 1580087 1271833
13893 1271833 1365571 1177204 1377132 1412051 1515078 1349679 1208400 1548514 1653878 1445855
13883 1445855 1365100 1319082 1059491 1546600 1127322 1349119 1303912 1332788 1190349 1082793
13873 1082793 1213217 1398033 1404183 952457 963565 1102415 1217718 1101298 1104377 811140
$$ packed form
13944B102146J64188k27820K31333p1199r6090l33604q6463J00330j03225K66288
13934A945884l89126M09943J29595k66722k17200P1769K57004J13996k06092M4070
13924A893121j29742J58950j33550l11033J98005Q0582J50691k22873j19212o1345
13914A503594J99560p6659r6382J96693k08245j59405l7335J58445n8714q1787
13904A339765J95575j266n3796M1483K39436k89321o8717J36660N4434j4166l08254
13893A271833R3738j88367J99928L4919J03027j65399j41279L40114J05364k08023
13883A445855q0755m6018k59591M87109m19278K21797m5207K8876j42439j07556
13873A082793J30424J84816O150m51726J1108J38850J15303j16420L079k93237
$$ plain form
13863 811140 1073546 1132672 1435140 1097019 1085998 1017427 942357 1281069 1254215 1055735
13853 1055735 918277 1113140 1404012 1121611 1224452 984401 1339920 1135465 915383
13844 915383 1129551 1148050 1244530 1055185 1156488 905900 1023427 1177771 930495 1170667
13834 1170667 1008305 1151264 842424 1049025 1224431 656535 1369118 966358 1186633
13825 1186633 1213776 1090656 985174 939389 918178 1137439 1102359 1298181 1126717 864196
13815 864196 873771 903444 1007819 804974 870502 863604 1128718 1144595 1022619 658837 866196
13804 866196 1187804 659922 913803 841834 896479 1160705 903277 781174 941792 739269
13794 739269 861425 767193 460819 755811 1204312 595943 759354 1100523 454619 526345
$$ packed form
13863H11140K62406N9126L02468l38121j1021o8571p5070L38712k6854j98480
13853A055735j37458J94863K90872k82401J02841k40051L55519k04455k20082
13844I15383K14168J8499R6480j89345J01303k50588J17527J54344k47276K40172
13834A170667j62362J42959l08840K06601J75406n67896P12583m02760K20275
13825A186633K7143j23120j05482m5785k1211K19261l5080J95822j71464k62521
13815H64196R575K9673J04375k02845O5528o898K65114J5877j21976l63782K07359
13804H66196L21608n27882K53881p1969N4645K64226k57428j22103J60618k02523
13794G39269J22156r4232l06374K94992M48501E95943J63411L41169D54619P1726
$$ plain form
13784 526345 618614 1026075 705108 863745 878116 595861 963210 234088 1008142 870764
13774 870764 742585 851850 856056 792437 865156 791349 702030 484741 923442 617993 650379
13763 650379 933755 747292 595356 898189 759015 627914 437085 665660 816542 576053
13753 576053 828193 908083 693850 1000549 809464 631239 491560 553861 689797 652707
13743 652707 751232 685943 451039 536437 599022 916333 706855 706501 774453 488730 627318
13732 627318 576477 737699 449075 689614 625636 443240 1101554 736186 580400 796165
13722 796165 768497 664266 599598 650391 522229 454325 492370 767515 467359 775992
13712 775992 717526 702590 411446 676280 427183 767945 535709 517099 515597 271578
$$ packed form
13784E26345R2269M07461l20967J58637J4371k82255L67349B34088P74054j37378
13774H70764j28179J09265M206o3619P2719p3807q9319k17289M38701l05449L2386
13763F50379K83376j86463j51936L02833j39174j31101j90829K28575J50882k40489
13753E76053K52140P9890k14233L06699j91085j78225j39679O2301J35936l7090
13743F52707R8525o5289k34904Q5398O2585L17311k09478l54O7952k85723J38588
13732F27318n0841J61222k88624K40539o3978j82396O58314l65368j55786K15765
13722G96165k7668j04231o4668N0793j28162o7904L8045K75145l00156L08633
13712G75992n8466j4936k91144K64834k49097L40762k32236j8610j502k44019
$$ plain form
13702 271578 746025 832002 584934 675179 513179 600258 518404 760965 1126260 634275
13692 634275 618530 495471 665248 544123 525627 450279 491152 830394 803402 587668
13682 587668 428469 633157 494353 365014 289459 415952 721249 712614 606163 491685
13672 491685 559904 514550 485874 653059 692969 364319 279022 388755 318827 141090 416429
13661 416429 414275 694412 542522 434198 491746 561493 529725 683028 586511 439060 286801
13650 286801 296916 219371 360248 80623 656380 217149 398036 429648 111607 444399
13640 444399 231262 136115 643251 376944 362280 401503 136229 450418 599500 214086
13629 393481 341856 347702 473879 726527 394478 478904 678989 416341 173721 378904
$$ packed form
13702B71578M74447Q5977k47068R0245j62000Q7079q1854K42561L65295m91985
13692F34275j5745j23059J69777j21125j8496p5348M0873L39242k6992k15734
13682E87668j59199K04688j38804j29339p5555J26493L05297q635j06451j14478
13672D91685O8219m5354k8676J67185L9910l28650q5297J09733o9928A41090K75339
13661D16429k154K80137j51890j08324N7548O9747l1768J53303r6517j47451j52259
13650B86801J0115p7545J40877H0623N75757B17149J80887L1612A11607L32792
13640D44399k13137r5147N07136k66307j4664L9223A36229L14189J49082B14086
13629C93481n1625N846J26177K52648l32049Q4426K00085k62648A73721K05183
$$ plain form
13619 378904 302926 398695 299887 575929 333529 431241 620296 424400 370968 501837
13609 501837 218979 463916 319794 158327 456188 244531 41174 253897 586842 273425
13598 236899 538758 399805 483315 182749 590858 276105 459792 485345 239410 191640
13588 191640 341922 572945 434537 163611 330235 187033 548757 608714 501186 476327
13578 476327 236361 250576 467319 179059 379450 323448 485608 242047 402711 475357
13568 475357 479377 400899 414040 278377 388121 259585 326494 520307 508888 409422 596717
13557 596717 243215 176893 388851 396049 452679 568572 379423 267123 154726 254944
13547 254944 704139 179536 132486 412255 178389 503031 -52405 187988 428536 297639
$$ packed form
13619C78904p5978R5769r8808K76042k42400R7712J89055j95896n3432J30869
13609E01837B18979K44937j44122A58327K97861k11657D1174K12723L32945B73425
13598B36899L01859j38953Q3510A82749M08109B76105J83687K5553B39410m7770
13588A91640J50282K31023j38408A63611J66624j43202L61724N9957j07528k4859
13578D76327B36361J4215K16743A79059K00391n6002J62160B42047J60664P2646
13568D75357M020p8478J3141j35663J09744j28536O6909J93813j1419r9466J87295
13557E96717B43215o6322K11958P198N6630J15893j89149j12300j12397J00218
13547B54944M49195A79536m7050K79769A78389L24642e2405A87988K40548j30897
$$ plain form
13537 297639 418772 98310 653712 737966 40831 221007 289540 470134 18282 410925
13527 410925 592940 486900 224634 250666 470199 316102 168798 303930 651109 284266
13516 548761 257224 -52439 32667 252353 257764 442148 435595 473456 -47345 572278 249362
13504 72210 469323 106075 148642 189864 6211 210634 403572 210343 578540 368303
13494 368303 74602 19022 69831 88591 252360 269481 515286 309591 369555 682337 92399
13482 522058 280692 77865 301214 358060 69087 536396 117938 227976 -100588 -67717
13472 -67717 -72371 176324 350052 230997 427575 235984 318452 152276 265355 513323
13462 513323 444793 201053 80475 232927 126378 83060 131626 -1157 373170 74778 273574
$$ packed form
13537B97639J21133I8310N55402Q4254D0831J80176O8533J80594A8282L92643
13527D10925J82015j06040B24634K6032K19533j54097j47304J35132L47179B84266
13516E48761B57224e2439C2667K19686N411J84384o553L7861d7345E72278B49362
13504G2210L97113A06075M2567M1222F211K04423J92938j93229L68197k10237
13494C68303G4602A9022N0809J8760J63769J7121K45805k05695N9964L12782I2399
13482E22058k41366G7865K23349N6846F9087M67309A17938J10038a00588L2871
13472f7717m654A76324J73728j19055J96578j91591Q2468A52276J13079K47968
13462E13323o8530B01053H0475J52452j06549m3318M8566a157C73170G4778J98796
$$ plain form
13451 273574 255778 198470 325255 -21300 283572 402259 358828 404787 391539 288377 96884
13439 238452 113186 417930 39284 354601 394433 333763 292546 121199 124241 71525 291335
13428 291335 28847 -97994 259191 370014 223668 352905 105433 280455 286007 -44842
13417 569069 53806 266817 255699 90382 191535 -58234 417991 277521 234015 231017 59258
13405 484935 258060 150001 236844 -85710 145665 189636 159550 368162 45929 330941
13395 330941 183416 114194 -163655 281164 382988 183443 141458 351136 47841 277712
13385 277712 243976 682562 96050 -141032 -74766 440421 403640 660104 59665 123863 55974
13373 8589 113406 455262 423015 228434 401588 80752 51348 329047 340806 42434 285299
$$ packed form
13451B73574j7796n7308J26785b1300B83572J18687m3431M5959j3248j03162I6884
13439B38452A13186L04744C9284L15317L9832o0670m1217A21199L042n2716K19810
13428B91335B8847i7994B59191J10823j46346J29237A05433J75022N552d4842
13417E69069E3806K13011j1118I0382J01153e8234D17991j40470m3506k998E9258
13405D84935k26875j08059Q6843h5710A45665M3971l0086K08612D5929K85012
13395C30941j47525o9222a63655B81164J01824A83443m1985K09678D7841K29871
13385B77712l3736M38586I6050a41032O6266D40421l6781K56464E9665O4198E5974
13373H589J04817L41856l2247j94581J73154H0752k9404K77699J1759D2434K42865
$$ plain form
13362 285299 146609 432920 517038 415916 343722 156857 51476 476781 484738 229673
13351 397031 148986 104327 117148 392530 197546 243721 64376 217155 433813 140606
13340 -56338 -145808 156514 239008 169790 245240 316639 158617 155227 485938 320982 426963
13329 426963 67778 642226 384230 401379 451747 192633 -33765 -100605 89569 31098 152435
13318 152435 425486 80227 153760 -33670 29862 -321478 -26088 278682 24712 198727 315849
13307 315849 14797 495491 25556 625214 -260533 163116 251129 295406 52937 -14139 543943
13295 461933 295186 450731 42826 266629 246655 48180 -83705 281926 450884 75176
13284 78613 322586 185278 345425 168137 488470 -125787 49861 457884 56979 108410
$$ packed form
13362B85299j38690K86311Q4118j01122p2194A56857E1476M25305P957B29673
13351C97031A48986m4659J2821K75382j94984M6175F4376J52779K16658A40606
13340e6338q9470A56514Q2494o9218P5450P1399j58022l390L30711j64956J05981
13329D26963F7778N74448k57996J7149N0368A92633c3765o6840H9569C1098J21337
13318A52435K73051H0227P3533c3670B9862c21478b6088B78682B4712J74015J17122
13307C15849A4797M80694B5556N99658b60533A63116Q8013M4277E2937a4139E43943
13295D61933j66747J55545D2826K23803j9974D8180h3705B81926J68958G5176
13284G8613K43973j37308J60147A68137L20333a25787D9861M08023E6979N1431
$$ plain form
13274 108410 341026 69823 31298 479724 203917 7152 -155214 39962 34138 -25261 -163053
13263 -163053 -113123 247567 44782 183281 141784 186299 282034 308225 12601 66782 -226695
13251 243581 224394 172962 -88257 -20826 235733 4379 378748 128227 214339 276201 22026
13239 -153983 -107202 -14076 84657 203036 355152 138337 158773 -82755 16388 -23253 170405
13227 47668 9945 -70371 223783 -121104 250574 176435 -103639 232383 364029 126478
13216 475796 75316 -235963 -90539 -30405 26333 375666 395800 356604 44556 306599 167267
13205 167267 -259758 361013 140933 419605 259131 -59291 131054 72601 322380 -13440
13194 5527 427120 -86468 776 337890 -144875 150181 5163 236084 -253678 306709 -116136
$$ packed form
13274A08410K32616F9823C1298M48426B03917G152a55214C9962n824b5261j37792
13263a63053M9930B47567D4782J38499m1497M4515R5735K6191A2601N4181b26695
13251B43581j9187n1432h8257b0826B35733D379L74369A28227Q6112O1862B2026
13239a53983M6781a4076H4657J18379J52116A38337K0436h2755A6388b3253A70405
13227D7668I945g0371B23783a21104B50574p4139a03639B32383J31646A26478
13216D75796G5316b35963i0539c0405B6333L49333K0134l9196D4556K62043j39332
13205A67267b59758C61013A40933K78672j60474e9291A31054n8453K49779a3440
13194E527M21593h6468G76L37114a44875A50181E163K30921b53678C06709a16136
$$ plain form
13182 -265516 304644 -33896 197483 -91959 215352 -58537 110097 225952 -127879 89004
13171 78701 -60974 201020 -67221 -7303 526849 -56038 -107612 -51256 185306 254661 -105916
13159 152805 58168 -32564 259496 213999 110779 51098 39569 -297457 -34161 -94513 245532
13147 187011 257463 79769 314469 289320 -106297 106402 365554 125762 371725 -127000
13136 17337 119201 -57765 55733 24591 173367 72872 42239 -10339 281409 269705 157849
13125 157849 -1022 156022 66534 167182 56255 203700 64901 -187527 150391 -247824
13114 123619 -141831 -90729 -49387 75777 -147794 24078 97926 369220 108640 300564
13104 300564 -58376 290574 -220046 206902 -73511 -214814 148905 33890 330216 30064
$$ packed form
13182b65516C04644c3896A97483i1959B15352e8537A10097J15855a27879H9004
13171G8701f0974B01020f7221g303E26849e6038n1574e1256A85306O9355a05916
13159A52805E8168c2564B59496m5497j03220E1098j1529b97457c4161o0352B45532
13147A87011P0452G9769K34700k5149a06297A06402K59152A25762K45963a27000
13136A7337J01864e7765E5733B4591J48776G2872l0633a0339B81409j1704j11856
13125A57849a022A56022F6534J00648E6255J47445F4901a87527A50391b47824
13114A23619a41831N1102M1342G5777a47794B4078P3848K71294A08640J91924
13104C00564e8376B90574b20046B06902g3511j41303A48905C3890K96326C0064
$$ plain form
13093 -91313 -116333 153067 144916 221115 -252144 -127059 140096 191435 240659 83470 95867
13082 95867 354093 282293 279647 142196 -36738 308611 187591 -77788 333644 97169 -17835
13070 -50724 105591 -51317 -24226 -231666 53514 105786 -189198 -40299 342860 151547 311188
13059 311188 571417 -189468 103130 30700 -102945 160584 -45450 -214253 78297 5749
13048 -38585 420032 28717 -43698 118427 -164484 -27352 97200 193215 188587 27809 -113748
13036 109363 -37393 113155 248614 298275 411338 13920 298870 356594 -146071 322992
13025 178091 -89120 6030 23927 77943 178896 139673 -193973 230724 3724 43860 110834
13014 110834 100703 174565 178918 184490 164567 309633 -116582 213824 349276 -138053 135755
$$ packed form
13093i1313k5020A53067q151P6199b52144J25085A40096N1339M9224H3470J2397
13082I5867K58226p1800k646j37451c6738C08611j21020g7788C33644I7169a7835
13070e0724A05591e1317b4226k07440E3514N2272a89198d0299C42860A51547J59641
13059C11188K60229a89468A03130C0700a02945A60584d5450j68803G8297E749
13048c8585D20032B8717d3698A18427a64484b7352I7200R6015m628B7809a13748
13036A09363c7393A13155J35459M9661J13063A3920K84950N7724a46071C22992
13025A78091h9120F030J7897N4016J00953l9223a93973B30724C724M0136O6974
13014A10834j0131P3862M353N572j9923J45066a16582B13824J35452a38053A35755
$$ plain form
13002 141977 120061 324066 24648 229308 352768 120637 253810 187777 -72539 331537
12991 25297 105022 -475545 9341 -123725 39207 -191207 108923 390501 -4419 352684 75059
12979 -156897 236808 -29185 -17647 76 -357123 -56984 141935 111765 78439 -270567 97861
12967 447303 -196170 135236 75378 9152 284046 -60625 162865 12766 121230 249074
12957 249074 -50724 83254 176224 225683 88148 -74218 225570 -305829 160898 71012 -52830
12945 71399 149592 82810 189535 73957 166971 -59230 47337 -113705 -129014 -119305 29648
12933 113084 -296622 306562 48985 87039 23941 -79188 275363 -95227 -58519 -24855 130792
12921 -78620 100630 -226078 229654 437909 245195 -194265 -308035 142956 104592 145581
$$ packed form
13002A41977k1916K04005B4648K04660J23460A20637J33173o6033g2539C31537
12991B5297P9725d75545I341a23725C9207a91207A08923K81578d419C52684G5059
12979a56897B36808b9185J1538G6c57123e6984A41935l0170l3326b70567I7861
12967D47303a96170A35236n9858I152K74894f0625A62865A2766J08464J27844
12957B49074e0724H3254R2970M9459H8148g4218B25570c05829A60898G1012e2830
12945G1399P8193o6782J06725G3957R3014e9230D7337a13705j5309R709B9648
12933A13084b96622C06562D8985L8054B3941g9188B75363i5227L6708b4855A30792
12921g8620A00630b26078B29654K08255j92714a94265j13770A42956l8364M0989
$$ plain form
12911 145581 215400 -360832 -87983 -141543 375084 -73295 -50713 46694 -13090 -125506 343350
12899 423669 -52484 116038 -60735 145878 75769 -176343 87699 -72885 191669 -57759 209680
12887 97152 -31113 -147730 -3027 71575 353231 126609 390425 -31967 213005 148852 230901
12876 230901 -257485 244187 -107393 6822 276605 -277526 -210083 -132639 248597 43909
12865 -154557 -198471 -99844 74131 -73025 218042 82941 -279791 -78090 -112227 -34134 -315807
12854 -315807 -101168 -57015 -8476 -195117 360333 166768 112628 115578 -17323 -24246 38670
12842 -218979 -15368 -42387 285259 83660 309748 -71727 2100 158443 69032 6548 105248
12831 105248 152923 -132923 246732 11180 320791 156423 -89440 370428 165355 16758
$$ packed form
12911A45581O9819c60832h7983n3560C75084g3295K2582D6694a3090j12416C43350
12899D23669e2484A16038f0735A45878p0109a76343H7699g2885A91669e7759B09680
12887I7152c1113j16617c027G1575K81656A26609K63816c1967B13005o4153Q2049
12876B30901b57485B44187a07393F822K69783b77526O7443P7444B48597D3909
12865a54557m3914R8627G4131g3025B18042H2941b79791g8090l4137c4134k81673
12854c15807a01168M4153h476j86641C60333A66768n4140K950a7323o923C8670
12842b18979a5368k7019B85259H3660K26088g1727B100J56343F9032F548R8700
12831A05248M7675a32923B46732A1180L09611A56423h9440C70428A65355A6758
$$ plain form
12820 8392 -243621 -370720 207971 143553 -150244 -98699 -8023 91419 -257397 253222 6427
12808 105514 159984 209123 278088 -171040 -147308 -196524 53614 -26193 -27505 -110017 161672
12796 18093 -347519 -99099 -975 440795 71028 227021 54360 350875 -178774 346740 110129
12784 -5961 185178 1042 115221 172943 248926 186638 -63729 -185420 192005 45825 -140320
12772 78612 -13272 36975 -450237 265372 119443 3210 32978 -95974 258442 -33395 118872
12760 142800 -69791 -203570 271880 -75494 244227 -163907 166434 -359505 464956 159979
12749 -87911 -18550 -147436 -125345 170268 -76617 -172212 -1691 117394 49873 -67244 -57276
12738 -57276 13583 -112602 -37114 -103590 -536869 146579 -52346 351749 -250916 6783 16337
$$ packed form
12820H392b43621j27099B07971o4418a50244N1545h023I1419b57397B53222F427
12808A05514N4470M9139O8965a71040K3732m9216E3614b6193j312q2512A61672
12796A8093c47519i9099i75D40795G1028J55993E4360K96515a78774C46740A10129
12784e961A85178A042J14179N7722P5983o2288f3729j21691A92005D5825a40320
12772G8612a3272C6975d50237B65372A19443C210K9768i5974B58442c3395A18872
12760A42800f9791j33779B71880g5494B44227a63907A66434c59505D64956A59979
12749h7911a8550j28886K2091A70268g6617r5595a691A17394D9873f7244R968
12738e7276A3583a12602c7114o6476m33279A46579e2346C51749b50916F783R554
$$ plain form
12727 16337 -10392 219810 -44431 297271 251174 207428 48231 -13775 87424 172060 -5943
12715 -31917 -46807 -69604 195692 288223 231230 329867 7117 -51901 119762 257172 201067
12704 201067 -98934 -135467 144640 125915 441430 117337 168984 -20989 84671 -83386 248021
12692 195117 308713 318644 249152 241864 92900 186249 447613 14480 -100682 24586 -23103
12680 19531 205284 92822 150569 2969 111036 -120941 407853 -44268 -227288 286143 158664
12669 158664 -199842 19000 -42555 -45404 -89604 -104383 267064 214057 64611 62883 26483
12657 172527 259288 16126 39299 -21855 76607 -195657 -183847 79546 85611 159758 96349
12646 96349 134285 -24913 57395 238835 85561 79917 222389 89118 -188212 -64156 270830
$$ packed form
12727A6337a0392B19810d4431B97271m6097m3746D8231a3775H7424Q4636e943
12715c1917j4890k2797A95692R2531n6993R8637G117e1901A19762J37410n6105
12704B01067i8934l6533A44640j8725L15515A17337N1647b0989H4671h3386B48021
12692A95117J13596R931o9492p288I2900R3349K61364A4480a00682B4586b3103
12680A9531J85753I2822N7747B969J08067a20941D07853d4268j83020B86143j27479
12669A58664a99842A9000d2555k849m4200j4779B67064n3007F4611j728B6483
12657A72527Q6761A6126K3173b1855G6607a95657J1810G9546O065P4147o3409
12646I6349L7936b4913E7395J81440H5561n644J42472H9118a88212f4156B70830
$$ plain form
12634 -14052 32753 542801 -263282 303044 297682 12584 170207 -100117 -216217 -184804 154500
12622 240897 -1754 98181 -133995 -137521 -745 40301 40122 -13276 329034 372524 161359 448940
12610 448940 -54034 282983 204875 73724 77256 99582 325485 238953 252575 -105427 478982
12598 299400 -16779 -14126 141968 -119507 -39480 -60939 192306 -87784 -178752 -238225 -53433
12586 -135090 246338 -80872 -125465 90670 111795 -14881 -33235 128676 201909 319569 18871
12574 -189688 472493 -22292 -197410 27298 -53905 -7371 -49684 -229583 49837 -101718 141834
12562 82352 -22697 46776 -305569 -74242 50224 64676 -75736 -126212 -18816 -152528 -27207
12550 113814 290958 -189552 167736 209745 101343 104796 -216528 -74583 307047 360602
$$ packed form
12634a4052C2753N10048b63282C03044n362A2584J57623a00117j16100L1413A54500
12622B40897a754I8181a33995l526g45D0301j79a3276C29034M3490A61359K87581
12610D48940e4034B82983p8108G3724L532K2326K25903q6532J3622a05427D78982
12598B99400a6779K653A41968a19507c9480k1459A92306h7784r0968n9473e3433
12586a35090B46338h0872m4593I0670K1125a4881j8354A28676P3233J17660A8871
12574a89688D72493b2292j75118B7298e3905g371m2313j79899D9837a01718A41834
12562H2352b2697D6776c05569g4242E0224J4452g5736n0476a8816j33712b7207
12550A13814J77144a89552A67736M2009A01343L453b16528g4583C07047N3555
$$ plain form
12540 360602 13946 189203 -226972 222152 -153851 41765 236991 144078 232887 254464
12530 254464 -310427 -59220 108459 -151205 32355 113670 47273 136332 223735 -121787 -43263
12518 153793 -108961 -191323 285135 332038 7094 -15687 34006 317512 -18564 -140150 -166744
12507 -166744 -15068 -239244 -262665 -35119 129502 110357 2114 34854 73096 209922 -32235
12495 64577 194951 59608 19541 -163942 65352 -101684 -90590 95685 -148348 100070 89066
12484 89066 -145316 162048 239918 -196369 110167 64730 -218954 -78857 -100018 -44960 1824
12472 237756 -191123 74030 55814 -239428 -42115 133271 -73344 223000 -184201 83273
12461 -32059 -216326 245751 428759 170698 -93515 -236825 382367 27948 -12339 -32711
$$ packed form
12540C60602A3946J75257b26972B22152a53851D1765J95226r2913Q8809K1577
12530B54464c10427e9220A08459a51205C2355Q1315D7273Q9059Q7403a21787d3263
12518A53793a08961q2362B85135M6903G094a5687C4006K83506a8564j21586k6594
12507a66744a5068k24176k3421c5119A29502j9145B114L2740L8242J36826c2235
12495F4577J30374E9608A9541a63942F5352a01684J1094I5685a48348A00070j1004
12484H9066a45316A62048P7870a96369A10167m5437b18954g8857k1161d4960A824
12472B37756a91123G4030j8216b39428d2115A33271g3344B23000a84201H3273
12461c2059j84267B45751J83008A70698i3515j43310C82367B7948a2339k0372
$$ plain form
12451 -32711 64882 -193473 191337 -38212 103864 16434 -7657 146196 -304746 -84930 315663
12439 84818 202394 428358 180630 -21919 -310953 -20482 276746 -77584 148220 93065
12429 93065 111716 -167149 172485 108483 -57616 28908 148740 206542 112956 -71339 -5622
12417 86293 -176312 -33608 -104916 -47812 162838 -43221 -120545 332128 -88663 358307 12461
12405 169350 -49431 -43 32385 313785 -66725 -337751 208672 -239169 135721 64899 -60733
12393 23709 184861 14431 30946 -230124 194069 -111634 -331244 87372 -159130 208394
12382 274165 314304 -7305 9674 -66196 -25458 25608 -146985 -171814 -4386 69282 56230 83037
12370 83037 -124644 -140889 -201482 127871 -39262 -15863 24063 103734 -35243 -14143 137728
$$ packed form
12451c2711F4882a93473A91337c8212A03864A6434g657A46196c04746h4930C15663
12439H4818J17576K25964A80630b1919k89034b0482B76746g7584A48220n5155
12429I3065J8651a67149A72485o4002e7616B8908J19832N7802r3586g1339e622
12417H6293a76312c3608p1308d7812A62838d3221p7324C32128h8663C58307A2461
12405A69350d9431d3C2385K81400f6725k71026B08672b39169A35721F4899f0733
12393B3709J61152A4431J6515b30124A94069a11634k19610H7372a59130B08394
12382B74165M0139g305I674f6196b5458B5608a46985k4829d386F9282j3052K6807
12370H3037a24644j6245o0593A27871c9262a5863B4063P9671c5243a4143A37728
$$ plain form
12358 48306 -118570 215150 -129742 -116083 -154947 200498 52477 70820 130063 249661 -2591
12346 38762 -335318 147101 271805 -184388 -59173 307923 -188174 384812 -150345 239133
12335 -209526 -106212 -164538 -147279 102522 -90529 -125417 21488 -60015 29569 -20030 29956
12323 124711 133263 235018 190488 116690 -106995 413158 6487 -159737 -114997 232154 137887
12312 137887 428832 218907 -212640 -190360 -139829 20726 38565 -14163 -220313 -75541 55577
12300 294507 -176626 -208888 -324117 -37076 -159345 -16300 -13911 134552 -257816 -127417
12289 -228591 139465 86003 -63369 -250332 -27388 -62127 -154784 -5406 48329 310229 -19170
12277 252113 -14746 -104431 -111585 -36642 -91112 207329 161121 204431 152603 195774 388658
$$ packed form
12358D8306a18570B15150a29742J3659l8864B00498E2477J8343N9243J19598b591
12346C8762c35318A47101J24704a84388e9173C07923a88174C84812a50345B39133
12335b09526J03314n8326J7259A02522i0529l4888B1488f0015B9569b0030B9956
12323A24711Q552J01755m4530p3798a06995D13158F487a59737M4740B32154r4267
12312A37887K90945k09925b12640K2280N0531B0726J7839a4163k06150g5541E5577
12300B94507a76626l2262j15229c7076j22269a6300K389A34552b57816a27417
12289b28591A39465n3462f3369j86963b7388l4739r2657e406D8329K61900a9170
12277B52113a4746q9685p154c6642n4470B07329m6208M3310n1828M3171J92884
$$ plain form
12266 388658 -171352 176214 126972 -423222 -59909 68346 -81427 -104120 41539 191873 138563
12255 138563 -178432 109966 57300 19179 157710 36172 114264 59630 -109136 137487
12244 -95635 -142519 128413 159627 156602 -14736 -272846 45412 54970 -23975 -61529 58491 83544
12232 83544 131761 289624 191621 179768 252420 22641 156139 -44713 47300 -10354 -19010
12221 -19010 244623 68180 230023 127386 406997 89483 121255 14476 104665 130570 407142
12210 407142 298565 54578 173515 261447 303967 400031 -16225 266297 116259 159111 -139109
12198 11926 291270 170193 202385 108103 -84193 244988 120041 321691 138436 -78622
12187 141118 203489 292106 -26213 257307 240992 -105006 26425 94116 280093 -144779 64337
$$ packed form
12266C88658a71352A76214m9242d23222e9909F8346h1427k2693D1539J50334n3310
12255A38563a78432A09966n2666A9179J38531C6172P8092n4634a09136A37487
12244i5635m6884A28413L1214l025a4736k58110D5412R558b3975l7554E8491K5053
12232H3544M8217J57863r8003j1853P2652B2641J33498d4713D7300a0354q656
12221a9010B44623F8180J61843j02637K79611H9483L1772A4476R0189K5905K76572
12210D07142j08577E4578J18937Q7932M2520R6064a6225B66297A16259M2852a39109
12198A1926K79344j21077L2192r4282h4193B44988A20041K01650A38436g8622
12187A41118O2371Q8617b6213B57307j6315a05006B6425O7691J85977a44779F4337
$$ plain form
12175 205059 228853 -245971 44326 -69154 198742 343237 359762 293372 4486 104396 73742
12164 73742 166637 -65945 -172913 158945 274949 188610 315624 -24530 -133383 234623
12153 -245441 342989 30410 181318 70394 314962 -203211 -266529 188488 192701 -5695 -88469
12142 -88469 65179 282207 126786 194662 -312692 122231 160687 -135646 -86991 409357
12131 207286 -147478 690 -3151 -132496 -254947 -234652 -63283 256712 -146851 -20374 111546
12119 24628 125244 391024 -149504 205322 -107786 -11793 136811 -55618 142913 147859
12109 147859 269281 -288538 -122066 154090 -102646 65909 71323 7740 -301758 5565 53180
12098 53180 86258 -307251 115011 164144 -18509 -150008 -256161 114322 61103 88580 -33232
$$ packed form
12175B05059K3794b45971D4326f9154A98742J44495J6525o6390D486R9910l0654
12164G3742R2895f5945j06968A58945J16004q6339J27014b4530j08853B34623
12153b45441C42989C0410J50908G0394K44568b03211o3318A88488M213e695q2774
12142h8469F5179K17028A26786O7876c12692A22231L8456a35646M8655D09357
12131B07286a47478F90c151j29345j22451K0295f3283B56712a46851b0374A11546
12119B4628J00616K65780a49504B05322a07786a1793A36811e5618A42913M946
12109A47859J21422b88538a22066A54090a02646F5909N414G740c01758E565M7615
12098E3180L3078c07251A15011M9133a8509j31499j06153A14322n3219K7477c3232
$$ plain form
12086 -13936 -311642 15690 -69987 95550 -55121 -229075 26724 -138122 -172558 2180 57495
12075 57495 84477 50445 -11767 128343 -66397 -160686 150452 14596 -83552 63340 -76212
12063 -53307 -110340 -32822 105702 140248 345243 893088 1167196 415591 386383 392339 226293
12052 226293 -38947 319084 -67304 -17483 163505 -32584 -125231 201103 -104131 -351850
12042 -351850 -216734 -7404 -179574 -48545 -19955 -219579 131231 201971 -193714 -14421 -19771
12031 -19771 -44706 325120 -255736 -68624 97357 -89361 104494 -114933 296973 -152787
12020 460638 -30751 -31741 -98596 1178 59902 232672 233543 126380 49133 -9032 74722 96403
12008 96403 -222637 40996 108799 119317 122596 41906 82703 250192 329867 271261 -112346
$$ packed form
12086a3936k97706A5690f9987I5550e5121j73954B6724a38122l4436B180N5315
12075E7495K6982l4032a1767A28343f6397r4289A50452A4596h3552F3340g6212
12063e3307n7033c2822A05702L4546K04995N47845K74108D15591k9208N956j66046
12052B26293c8947C19084f7304a7483A63505c2584r2647B01103a04131k47719
12042c51850J35116g404j72170d8545a9955j99624A31231P0740a93714a4421n350
12031a9771k4935C25120b55736f8624I7357h9361A04494a14933B96973a52787
12020D60638c0751r90o6855A178N8724J72770Q71j07163D9133i032G4722K1681
12008I6403b22637D0996O7803J0518L279D1906M0797J67489P9675n8606a12346
$$ plain form
11996 -501451 -83305 204104 -105891 255331 -33760 -218572 31043 97676 151076 -19555 87324
11984 -29539 84693 -146640 -232680 -167768 -24969 52584 273096 -77861 293862 59010 -301965
11972 -156407 -29068 -49671 -7541 -22875 87022 -100017 25364 -41878 -338380 -131234 67555
11960 367906 -160216 21074 -93691 45745 78501 59902 -329540 -195433 122886 -34637 -167947
11949 -167947 -55231 99653 192959 130790 143278 174379 44412 7224 -44138 -131182 -160594 -194707
11937 -194707 25754 -3563 104088 275595 -145987 -89029 -42566 158163 242912 -270222 -71991
11925 -262396 15672 47515 162544 -341332 47056 86096 129640 -109791 413959 56145 93641
11914 93641 60029 -187011 65154 -187612 35811 85096 -81958 -52841 55193 -326259 -114562
$$ packed form
11996e01451h3305B04104a05891B55331c3760j84812C1043O6633N3400a9555H7324
11984b9539H4693a46640q6040O4912b4969E2584K20512g7861B93862E9010c01965
11972a56407b9068k0603g541j5334H7022a00017B5364d1878k96502a31234F7555
11960C67906a60216B1074i3691D5745L2756j8599c29540J34107A22886c4637j33310
11949a67947e5231I9653R3306o2169J2488L1101D4412G224d4138q7044k9412l4113
11937a94707B5754c563A04088J71507a45987N6958d2566A58163Q4749b70222g1991
11925b62396A5672L1843J15029c41332D7056L9040M3544a09791D13959E6145L7496
11914I3641l3612a87011F5154a87612C5811M9285h1958K9117E5193c26259a14562
$$ plain form
11902 -341419 -2162 -171697 16383 -103776 88904 -278146 -24635 -41287 -173943 203222 -125191
11890 -141651 150776 -26291 2744 -78518 -169227 102994 18854 -281753 69860 205869 -118606
11878 -52049 13667 -44012 144640 144399 117231 -474955 283172 -130350 -177124 -149503 267734
11866 -146347 -404649 -37797 -122848 -46707 177726 -109067 82556 -44537 -100876 23145 -96825
11854 -112467 -235954 -72651 -19211 -155622 -113202 -91840 -101260 -87215 -64018 141134 214335
11843 214335 255869 -88311 -144081 -261515 -89547 144097 320008 -157933 95307 -383552
11832 -34411 116245 -310786 273370 -211538 -373348 -55558 143503 160916 131674 -118073
11821 75307 -75837 261 31715 72513 -424604 60345 -178607 115102 235542 100171 27221
$$ packed form
11902c41419b162j69535A6383a03776H8904b78146b4635j6652j32656B03222a25191
11890a41651A50776b6291B744g8518r0709A02994A8854b81753F9860J36009a18606
11878e2049A3667d4012A44640k41k7168d74955B83172a30350m6774K7621B67734
11866a46347k58302c7797q5051d6707A77726a09067H2556d4537n6339B3145i6825
11854a12467j23487g2651a9211j36411M2420K1362r420J4045K3197A41134P3201
11843B14335M1534h8311n5770j17434h9547A44097J75911a57933I5307c83552
11832c4411A16245c10786B73370b11538j61810e5558A43503J7413k9242a18073
11821G5307g5837B61L1454M0798d24604F0345a78607A15102J20440A00171B7221
$$ plain form
11809 -176062 92083 156952 -136152 -311981 178828 503923 120703 -53346 -149804 -198108
11799 -198108 -466086 266290 -105839 -62376 -162653 -66252 72515 192241 -349662 189589
11788 -146337 98632 91068 -98823 -375606 36041 38592 -160797 -205858 150191 35860 -145982
11776 -112404 360815 -122912 121823 -197008 -86425 188346 170471 127604 -345836 60044
11765 -323306 -19303 -165335 153998 -29887 -58415 298642 122275 -155413 -134546 -191632
11755 -191632 299838 147647 276735 -397919 -155691 -13723 17400 -292643 -171272 114504
11744 136284 -187208 171341 -149364 193362 45779 217556 20384 -112929 389075 166117
11733 -318639 -63310 -215935 22745 -17353 -205368 145022 -42032 37124 -149173 65845 105314
$$ packed form
11809a76062I2083O4869a36152j75829A78828L25095A20703e3346r6458m8304
11799a98108k67978B66290a05839M3463j00277f6252G2515J19726c49662A89589
11788a46337I8632p564i8823k76783C6041K551a60797m5061A50191C5860a45982
11776a12404C60815a22912A21823a97008h6425A88346j7875m2867c45836F0044
11765c23306a9303j46032A53998b9887k8528B98642A22275a55413K0867n7086
11755a91632B99838A47647J29088c97919a55691a3723A7400b92643J21371A14504
11744A36284a87208A71341a49364A93362D5779J71777B0384a12929C89075A66117
11733c18639f3310j52625B2745a7353j88015A45022d2032C7124a49173F5845L9469
$$ plain form
11722 105314 185345 218316 42579 -62362 81729 116449 155045 20389 252372 -5401 109156
11710 -188902 146801 -101483 205296 36466 -212801 33388 25276 -42593 172250 343633
11700 343633 -482822 -223115 279441 53892 -9325 157600 -189232 174950 88499 186677
11690 186677 -146069 -47377 55944 127111 -56085 -175028 -55231 206073 180402 297286 182772
11679 182772 -281005 -232183 -291706 188941 -127535 -372733 85430 28027 238996 256917
11669 256917 232265 113260 98193 -63483 214159 98651 16643 21568 39081 143086 40370
11657 108529 234385 54701 -418637 96236 253704 161488 154868 5779 17518 131918 -21395
11645 -17952 -197128 200408 229423 46486 162157 -245667 305262 166375 -74054 146260
$$ packed form
11722A05314Q0031L2971D2579f2362H1729L4720L8596B0389K31983e401A09156
11710a88902A46801a01483B05296C6466b12801C3388q112d2593A72250J71383
11700C43633d82822b23115B79441E3892i325A57600a89232A74950q6451R8178
11690A86677a46069d7377E5944P1167e6085j18943e5231B06073k5671J16884j14514
11679A82772b81005M8822n9523A88941a27535k45198H5430B8027K10969J7921
11669B56917k4652A13260j5067f3483B14159I8651A6643M925J7513J04005D0370
11657A08529J25856E4701d18637I6236J57468r2216o620E779J1739J14400b1395
11645a7952j79176B00408K9015D6486J15671b45667C05262j38887g4054A46260
$$ plain form
11634 82271 -288882 47207 94310 297408 -96641 100348 -7616 -284629 -47362 -94665 -128414
11623 -128414 200255 -43693 -32374 162343 199393 -159565 -37055 -139749 351611 -13259
11612 -72801 -26745 244539 112202 -11021 -50378 124562 -213469 -107899 179126 -133348
11601 142446 -282467 95584 33053 -110447 75132 115588 -115712 55084 -42250 105822 19186
11589 196360 130866 50732 148734 205114 27168 262755 -54240 -103878 166569 178773 348753
11578 348753 19399 71678 -187562 -242132 289012 38112 55850 342156 118668 168347 280042
11567 280042 173058 104669 -42270 133923 193155 -352377 -69215 -58399 135772 189001 12879
11555 139615 -37326 353158 46919 285104 216177 -21374 -135718 72701 136049 134340 -76187
$$ packed form
11634H2271b88882D7207M7103K03098i6641A00348g616k77013d7362m7303l3749
11623a28414B00255d3693J1319A62343L7050a59565c7055j02694C51611a3259
11612g2801b6745B44539A12202a1021l9357A24562b13469J05570A79126a33348
11601A42446b82467I5584C3053a10447G5132M0456a15712E5084d2250A05822A9186
11589A96360o5494E0732R8002N6380B7168K35587e4240m9638A66569J2204J69980
11578C48753A9399N2279a87562n4570B89012C8112J7738K86306A18668M9679J11695
11567B80042j06984o8389d2270A33923N9232c52377f9215J0816A35772N3229A2879
11555A39615c7326C53158D6919K38185o8927b1374j14344G2701O3348j709g6187
$$ plain form
11543 89068 133182 20620 32218 162595 7329 12833 -22696 142826 214114 -281938 -35958
11531 -252836 -110957 47036 202155 212961 37993 -141980 201606 -163146 107603 -45610
11520 8436 319029 30206 -56582 222438 -423665 70086 -83160 -178721 116391 248647 79252
11508 215196 122490 206629 154279 -161594 158528 372017 152132 -131637 -250537 190854
11497 -31514 -42871 397187 339815 15961 -294602 -51760 334920 441969 138641 -71486 205600
11485 76023 184431 243487 99281 -26675 198484 -120505 272718 120291 126369 188574 482048
11474 482048 137870 66422 460037 265748 -178556 -37122 104112 103224 106678 153310 209401
11463 209401 98997 214474 -51099 28292 -218494 43224 -11819 46752 -117267 240217 -41930
$$ packed form
11543H9068M4114B0620J1598J30377G329N504b2696A42826P1288b81938c5958
11531b52836a10957D7036J55119J0806C7993a41980B01606a63146A07603d5610
11520H436L10593C0206e6582B22438d23665G0086h3160r5561A16391J32256G9252
11508B15196r2706Q4139n2350a61594A58528K13489A52132a31637j18900A90854
11497c1514j1357C97187n7372A5961b94602e1760C34920J07049A38641g1486B05600
11485G6023J08408N9056I9281b6675A98484a20505B72718A20291O078O2205K93474
11474D82048A37870F6422L93615j94289a78556c7122A04112q88L454M6632N6091
11463B09401I8997J15477e1099B8292b18494D3224a1819D6752a17267B40217d1930
$$ plain form
11451 225178 -26629 70883 137279 78895 185540 152533 234246 157757 155823 274925 153637
11440 153637 -47086 206297 133205 527586 -133941 84939 119289 127661 132146 96245 410265
11429 410265 210286 -42505 111094 248709 214905 -180670 52815 -302188 71178 -253295
11418 27928 100460 503854 136913 125734 94581 -245825 27045 -247145 173713 -129595
11407 -174182 227196 75360 -41807 175108 -58250 39919 216534 243798 -177413 -195805 85126
11395 22687 -33636 54953 213384 -46389 -72501 -106968 -16352 58949 24173 -60007 39357
11383 -103515 121979 -222405 -139851 -145809 -228929 99518 -152598 -190378 -59345 53340 81027
11372 81027 -22567 -255440 169304 -212388 552842 -213484 136 117953 -184660 -91806 -9980
$$ packed form
11451B25178b6629G0883O6396n8384J06645l3007Q1713p6489j934J19102j21288
11440A53637d7086B06297p3092L94381a33941H4939L4350Q372M485l5901L14020
11429D10265j99979d2505A11094J37615l3804a80670E2815c02188G1178b53295
11418B7928P2532M03394A36913j1179l1153b45825B7045b47145A73713a29595
11407a74182B27196G5360d1807A75108e8250C9919J76615K7264a77413j8392H5126
11395B2687c3636E4953J58431d6389k6112l4467a6352E8949B4173f0007C9357
11383a03515A21979b22405Q2554n958q3120I9518a52598l7780e9345E3340K7687
11372H1027b2567k32873A69304b12388E52842b13484A36J17817a84660i1806i980
$$ plain form
11360 -66794 -132568 28536 32247 88035 21609 -151887 18826 -180686 -28621 368 -253050 101411
11347 -55477 -24556 -266912 74918 -282931 242720 11083 43739 -281133 -58520 25216 -114745
11335 -13156 -48561 67816 130436 -203510 46719 -198259 -190491 -66426 249678 -157213 278276
11323 -279879 53330 -44858 -29887 -208275 -136577 162583 158938 -128369 112947 -215712 250260
11311 190698 441019 -79246 -87960 -2181 102478 -78222 -144302 221742 114314 -310314 -53664
11299 -23710 -61973 291869 288414 -302049 39442 37739 -7352 -239516 53888 61851 -18837 -160396
11287 -160396 124678 -27673 27397 -97431 108820 -101190 -177215 176487 57570 334909
11277 334909 216628 -193863 296298 217459 -94437 112954 65 28397 -39522 -95775 94972
$$ packed form
11360f6794o5774B8536L711N5788B1609a51887A8826a80686b8621C68b53050A01411
11347e5477b4556k42356G4918b82931B42720A1083L2656b81133e8520B5216a14745
11335a3156l5405F7816O2620b03510D6719a98259P768f6426B49678a57213B78276
11323b79879E3330d4858J4971j78388P1698A62583l645a28369A12947b15712B50260
11311A90698K50321g9246q714b181A02478g8222o6080B21742j07428c10314e3664
11299b3710l8263B91869l455c02049C9442j703g352k32164E3888P963a8837j41559
11287a60396A24678b7673B7397i7431A08820a01190p6025A76487E7570K77339
11277C34909j18281a93863B96298p8839i4437A12954F5K8332c9522n6253I4972
$$ plain form
11265 -115493 -164233 -270055 -18123 -180631 -107377 272715 -114706 127803 -86290 -196764
11255 -196764 95208 -182145 -144021 -564313 -68634 -143638 -221525 69488 159030 -134589 100512
11243 -25349 -30589 50445 -143394 -493744 129625 -93587 192049 -205186 97602 -293688 102870
11231 137836 65496 404537 -267245 104790 -384939 -72079 -186141 -163053 -240246 220459
11220 90838 -138928 -262543 175896 39041 296088 170 102906 19252 -207331 94494 -109005
11208 -16913 55342 -342899 9314 -294518 85818 -317671 -246567 -136686 -18676 -257550 250689
11196 155856 19528 115694 96452 -72341 -122731 -128722 -43746 -180947 68487 107760 -104238
11184 -9351 209476 -202125 79854 -195096 -215737 29829 111094 152544 222001 -143735 -58684
$$ packed form
11265a15493m8740j05822a8123j62508P3254B72715a14706A27803h6290j10474
11255a96764I5208a82145L8124m20292f8634p5004p7887F9488Q9542a34589A00512
11243b5349n240E0445a43394l50350A29625i3587A92049b05186I7602b93688A02870
11231A37836F5496L39041b67245A04790c84939g2079j14062K3088p7193B20459
11220I0838a38928j23615A75896C9041K57047A70J02736A9252b07331I4494a09005
11208a6913E5342c42899I314b94518H5818c17671P1104J09881a8676k38874B50689
11196A55856A9528R6166j9242g2341n0390n991d3746j37201F8487L9273a04238
11184i351B09476b02125G9854a95096k0641B9829Q1265M1450O9457a43735e8684
$$ plain form
11172 149537 108697 -147393 -122723 39020 114004 224985 -171937 178029 -491445 -219567
11161 207432 -166699 20552 -162412 38521 17493 -74151 -92979 -186836 339722 28858 -86924
11149 427692 -35533 182982 -138263 -273784 -355206 -326396 -75572 77608 -121247 91121 -27897
11137 -169831 -108083 167053 -159884 -81756 -279530 111942 36097 59773 330651 284832
11127 284832 61372 75729 388867 41018 -90642 -40572 205668 -215667 120521 5153 95528
11116 95528 153848 -182185 -208385 -147292 205087 -47357 -77147 82140 50249 -110459 -239704
11105 -239704 215479 -43888 -321948 270350 -75525 -585454 108638 -24112 332429 69843
11094 -170760 51260 -80975 32564 40924 157043 251723 157534 71319 183068 152320 234539
$$ packed form
11172A49537m0840a47393K4670C9020P4984J10981a71937A78029d91445b19567
11161B07432a66699B0552a62412C8521A7493g4151j8828r3857C39722B8858h6924
11149D27692c5533A82982a38263j35521q1422K8810g5572G7608a21247I1121b7897
11137a69831O1748A67053a59884P8128j97774A11942C6097K3676K70878m5819
11127B84832F1372J4357L13138D1018i0642d0572B05668b15667A20521E153R0375
11116I5528N8320a82185k6200O1093B05087d7357k9790H2140l1891a10459j29245
11105b39704B15479d3888k78060B70350g5525n09929A08638b4112C32429F9843
11094a70760E1260h0975C2564Q360J16119R4680r4189G1319J11749l0748Q2219
$$ plain form
11083 234539 156340 10421 317901 -16803 105556 142448 142949 171794 -16139 -75645 -155033
11072 -155033 203071 229899 288640 409060 124893 121172 323317 300696 163712 -30242 281634
11060 -100854 110782 351453 321876 253790 625855 210396 118643 29776 115621 355768
11050 355768 450308 463093 458567 534953 493093 450686 289555 628970 778924 460979 690339
11039 690339 701068 699197 672144 708451 308183 731072 738713 545614 1084445 614135 512430
11028 512430 553851 636266 215537 660688 804036 645649 500889 629666 679305 849591
11018 849591 566702 717666 627383 579457 501766 537156 795063 600482 670480 787055
11008 787055 325122 664620 415672 454385 889213 491608 621716 744773 409174 565597
$$ packed form
11083B34539p8199A0421L07480a6803A05556L6892N01K8845a6139n9506p9388
11072a55033B03071K6828N8741J20420A24893l721K02145k2621j36984c0242B81634
11060a00854A10782K40671k9577o8086L72065B10396r1753B9776Q5845K40147
11050C55768R4540J2785m526P6386m1860m2407j61131L39415J49954l17945K29360
11039F90339J0729j871k7053L6307C08183M22889P641j93099N38831m70310j01705
11028E12430M1421Q2415B15537M45151J43348j58387j44760J28777M9639J70286
11018H49591k82889J50964r0283m7926p7691L5390K57907j94581O9998J16575
11008G87055C25122L39498k48948L8713M34828l97605J30108J23057l35599J56423
$$ plain form
10998 565597 663759 350629 688335 328859 820669 462425 463264 520389 35350 737371 623042
10987 623042 419678 710837 741166 752827 439906 435425 710188 687473 326611 489732
10977 489732 427501 727448 883145 814214 649558 773469 874166 751754 804655 715650
10967 715650 888455 748731 994947 1172008 1153825 967472 1811294 2168978 2021909 1896148
10957 1896148 2265300 2308048 2292966 2404414 1767258 1765465 1583798 1812715 1602719 1221855
10947 1221855 1380138 1384338 1180735 1203068 1380701 1473142 1093543 1209392 997658 1032735
10937 1032735 855169 738057 782787 766289 725282 346685 129841 429519 302125 262458
10927 262458 -143530 421075 178149 -16019 96605 -11033 303041 235082 42139 67127 262642
$$ packed form
10998E65597R8162l13130L37706C28859M91810l58244Q39N7125C5350P02021j14329
10987F23042k03364K91159L0329J1661l12921m481K74763k2715C26611J63121
10977D89732o2231K99947J55697o8931j64656J23911J00697j22412N2901q9005
10967G15650J72805j39724K46216J77061j8183j86353Q43822L57684j47069j25761
10957A896148L69152M2748j5082J11448o37156j793j81667K28917k09996l80864
10947A221855J58283M200k03603K2333J77633R2441l79599J15849k11734L5077
10937A032735j77566j17112M4730j6498m1007C46685A29841K99678j27394l9667
10927B62458a43530D21075A78149a6019I6605a1033C03041o7959D2139K4988J95515
$$ plain form
10916 262642 -115340 207080 -38132 253503 189786 -19442 335747 -74190 280417 -207856
10905 353172 -299787 -90087 89685 -281968 84827 -12474 -334724 255370 147558 51870
10894 119037 145980 -124100 -35597 90366 60497 -209338 319797 -130457 69961 -235544
10883 -264939 30360 -206929 -120086 128907 123714 42909 284362 -380809 -4224 -126447 -38668
10871 257675 48419 -259239 -270364 82974 168655 126294 -287348 -93469 182026 298863 -81980
10859 397669 32933 -101775 183228 22825 -28807 606 3565 245513 145966 151210 -133242
10847 17130 182321 94006 53591 1989 340814 -317495 -118622 326213 -252822 -14580 -266682
10836 -266682 -194491 -56001 -160134 -26076 -129031 118250 136150 -101338 14212 -77174 -47796
$$ packed form
10916B62642a15340B07080c8132B53503o3717a9442C35747g4190B80417b07856
10905C53172b99787i0087H9685b81968H4827a2474l22250B55370j07812E1870
10894A19037K6943a24100c5597I0366k9869b09338C19797a30457F9961b35544
10883b64939C0360b06929Q6843A28907n193D2909K41453c80809d224j22223c8668
10871B57675D8419b59239j1125H2974Q5681m2361b87348i3469A82026J16837h1980
10859C97669C2933a01775A83228B2825b8807F06K959K41948r9547N244a33242
10847A7130J65191q8315m0415A989L38825c17495a18622C26213b52822a4580k52102
10836b66682P2191e6001j04133b6076j02955A18250J7900a01338A4212g7174K9378
$$ plain form
10825 -47796 -71417 148100 -260902 337009 134340 -86578 -72448 53632 105601 77529 -148990
10813 -163622 75206 157253 -38118 21466 -70869 -268195 80425 -227072 -290788 -64337 -165523
10802 -165523 491891 -269700 -206143 -194953 -329158 65872 17154 -77814 -10128 52685 151168
10791 151168 -104167 43757 151923 -26867 -335236 89293 102759 241142 299223 -170742
10780 -61579 243508 -78922 239342 106775 -321016 -74907 -75982 -207902 4773 -36586 -54739
10769 -54739 -74159 -48402 -59996 412532 -16447 -119424 100935 156998 50148 251960 185067
10758 185067 3197 102672 -252653 295170 40533 -30386 -106784 -270640 -238673 140991 -166425
10746 91584 -216841 53905 36926 72474 105877 215440 73839 -45277 104711 -127518 -83168
$$ packed form
10825d7796k3621A48100b60902C37009A34340h6578J4130E3632N1969k8072a48990
10813a63622G5206Q2047c8118B1466g0869j97326H0425b27072o3716f4337j01186
10802a65523D91891b69700O3557J1190j34205F5872A7154g7814a0128E2685R8483
10791A51168a04167D3757J08166b6867l08369H9293J3466J38383N8081a70742
10780f1579B43508g8922B39342A06775c21016g4907j075j31920D773c6586j8153
10769e4739j9420K5757j1594D12532a6447j02977A00935N6063E0148K01812o6893
10758A85067C197R9475b52653B95170D0533c0386p6398j63856L1967A40991a66425
10746I1584b16841E3905j6979L5548L3403J09563G3839d5277A04711a27518M4350
$$ plain form
10735 -83168 -158320 -77863 -52890 34817 71653 -11564 -67275 -15351 141163 -142059 261225
10723 -258433 16145 165106 -7791 -77950 -53160 166839 10846 17836 -159197 11027 -28997
10711 -74554 61894 -43360 -187651 210995 -175524 -363435 -92890 -27282 -63508 -441948 -153551
10699 30136 362034 -116220 36531 -239498 -257522 -196309 -141655 -86586 233057 -85431 -260201
10688 -260201 -355322 45621 -46491 48034 217553 -63970 -126934 -440755 -109538 413964 117809
10676 294783 -44608 210750 141683 -291166 5009 -215426 22028 -327055 -182850 -166165 201509
10664 -20621 116357 -40954 6519 101144 58906 -76830 -196714 192790 -197719 -164584 69798
10652 -190953 -73636 -15734 -233418 206711 39333 -260478 -147363 64187 -205607 -203935 79995
$$ packed form
10735h3168p5152g7863K4973C4817L6836a1564n5711a5351A41163a42059B61225
10723b58433A6145J48961g791p0159K4790A66839A0846O990a59197A1027b8997
10711g4554F1894d3360j44291B10995a75524j87911i2890b7282l6226l78440a53551
10699C0136L31898a16220C6531b39498j8024O1213N4654N5069B33057h5431j74770
10688b60201r5121D5621d6491D8034J69519f3970o2964l13821a09538D13964A17809
10676B94783d4608B10750o9067b91166E009b15426B2028c27055J44205J6685B01509
10664b0621A16357d0954F519R4625m2238g6830j19884A92790a97719L3135F9798
10652a90953g3636a5734k17684B06711C9333b60478J13115F4187b05607J672G9995
$$ plain form
10640 257986 -139364 286092 35198 -79353 -182608 372223 222137 -97188 -378747 -108998
10629 154941 -181073 98608 -67111 -490829 200174 -49358 -335382 -202238 -235128 -5159 160617
10617 -296459 53230 -61268 -93965 99163 -11337 -119632 -277390 -185016 -7923 -231538 -212160
10606 -212160 45728 85222 39283 -15911 199616 -236782 100583 -318220 -107656 -157902
10596 -157902 -40881 -355943 -283505 -81118 -159912 -148151 -4079 240297 190525 101649 26182
10584 -219697 -184944 9720 -284942 324977 -219516 -16447 215556 69540 -196869 202372
10573 -64749 25048 29462 -254971 -77873 -166339 108939 -405001 -68615 -179781 94706 263755
10562 263755 10791 -25147 -167753 -286261 -87015 -150478 -31110 4474 343084 36060 -318148
$$ packed form
10640B57986a39364B86092C5198g9353j03255C72223j50086i7188k81559a08998
10629A54941a81073I8608f7111m23718B00174d9358k86024J33144l2890e159A60617
10617b96459E3230f1268l2697I9163a1337j08295j57758R2374g923k23615J9378
10606b12160D5728L9494C9283a5911A99616b36782A00583c18220a07656n0246
10596a57902d0881l15062P2438h1118p8794J1761d079B40297m9772q8876B6182
10584b19697L4753I720b84942C24977b19516a6447B15556F9540a96869B02372
10573f4749B5048M414b54971g7873q8466A08939d05001f8615j11166I4706J69049
10562B63755A0791b5147j42606j18508h7015o3463c1110D474L38610C6060c18148
$$ plain form
10550 -68143 -33919 -398645 -219807 -16075 103659 157461 136729 -227220 -147362 132253 -149691
10538 58634 -79274 -169216 7376 -273086 -18954 -277848 222359 67722 -158870 -101278 -222782
10527 -222782 300353 -27557 -175501 7887 73268 414629 227709 -173674 2785 -447564 112313
10515 -128532 -109121 -102486 -64886 116315 -43190 -226824 -3390 236993 -112992 285935 147183
10504 147183 -325546 -202896 -290896 -97957 169640 182956 -137105 -221940 160879 74734
10493 75488 93789 -223742 -193408 -5972 207440 -20579 -22470 -250237 108085 -41451 -49107
10482 -49107 9630 -10531 -92762 93455 -82962 170902 -223238 32677 -117652 41069 -62481
10470 200357 132921 84438 81460 159800 178944 169368 73847 117592 132388 -68258 -186403 215300
$$ packed form
10550f8143c3919l64726J78838a6075A03659N3802k0732b27220P9858A32253a49691
10538E8634g9274q9942G376b73086a8954k58894B22359F7722a58870N7592j21504
10527b22782C00353b7557j47944G887O5381L41361j86920a73674B785d47564A12313
10515a28532J9411O635L7600A16315d3190j83634c390B36993a12992B85935j38752
10504A47183c25546J22650q8000i7957A69640J3316a37105q4835A60879G4734
10493G5488J8301b23742L0334e972B07440b0579j891k27767A08085d1451p656
10482d9107I630a0531q2231I3455h2962A70902b23238C2677a17652D1069f2481
10470B00357o7436m8483k978P8340J9144r576G3847M3745J4796f8258j18145B15300
$$ plain form
10457 54263 143599 -49457 42120 -5728 268913 10682 84075 -325315 98639 -44810 212004
10445 -419354 45602 -105734 -235490 -92547 78396 11851 146028 206272 -567873 -21001 -4915
10433 -71600 -62930 191732 -87023 -393194 284828 79541 -22879 -65175 161473 3528 -1307
10421 -31372 -6009 204958 -331566 -182811 -5560 -124972 -170657 -136965 -297123 65157 183073
10410 183073 -137354 -189779 -48873 33296 -102980 202371 110751 -228631 -16352 -122259
10400 -122259 -195344 32495 -236757 147562 143414 161298 -59221 70176 222694 -130121 22075
10388 -66858 42877 16434 -32937 -39 97341 -233302 79090 -11877 419109 53843 253570 145084
10376 145084 122387 -18040 -103355 115034 306070 390180 135858 119178 487289 -416168
$$ packed form
10457E4263Q9336d9457D2120e728B68913A0682P3393c25315I8639d4810B12004
10445d19354D5602a05734j29756i2547G8396A1851J34177O0244e67873b1001d915
10433g1600Q670A91732h7023l06171B84828G9541b2879m2296A61473C528a307
10421c1372f009B04958c31566J48755e560j19412m5685L3692j60158F5157J17916
10410A83073a37354n2425d8873C3296a02980B02371r1620b28631a6352j05907
10400a22259p3085C2495b36757A47562m148J7884e9221G0176J52518a30121B2075
10388f6858D2877A6434c2937c9I7341b33302G9090a1877D19109E3843J99727j08486
10376A45084k2697a8040q5315A15034J91036Q4110A35858j6680L68111d16168
$$ plain form
10365 178455 209978 369654 358714 242896 178718 -6690 323801 203106 254104 174614 43436
10353 349072 316754 150126 424713 316699 -31917 357552 -89639 217645 41933 -108089
10342 421595 159482 212208 -114223 402660 539982 14464 469121 602244 248619 228473
10332 228473 413756 216974 295446 405243 104712 218891 27979 243752 299122 -161877
10321 493865 272696 226872 321308 172120 -20298 -84562 -21542 97861 174835 204156 242228
10310 242228 -114964 10464 239436 513964 257518 18098 31852 124383 -112690 135000
10299 -57984 -96738 360865 -50415 126097 87993 -21692 148392 115593 -123558 287762 -292694
10287 41243 234470 -109396 399481 119661 152248 41589 126823 37974 -289925 65435 -166927
$$ packed form
10365A78455L1523J59676j0940j15818o4178f690C23801j20695N0998p9490D3436
10353C49072l2318A50126K74587j08014c1917C57552h9639B17645D1933a08089
10342D21595A59482N2726a14223D02660J37322A4464M54657J33123B48619k0146
10332B28473J85283j96782P8472J09797A04712J14179B7979K15773N5370a61877
10321D93865k21169m5824R4436j49188b0298o4264b1542I7861P6974K9321L8072
10310B42228a14964A0464K28972K74528k56446A8098J3754R2531a12690A35000
10299e7984l8754C60865e0415A26097l8104b1692A48392l2799a23558B87762b92694
10287D1243J93227a09396C99481A19661L2587D1589Q5234C7974b89925F5435a66927
$$ plain form
10275 64003 -12805 -202334 -81987 -236175 -229204 116659 203831 128590 145434 -85360 -68163
10264 -68163 -262834 -37001 -339985 60319 -116194 -144644 -166108 214941 203830 -19856 -118519
10253 -118519 -90157 260749 168976 128185 -1852 126305 198460 -65012 137606 328590 322385
10242 322385 378305 -160223 172340 321159 -91812 -91196 -288121 -231653 -169544 -115374 -175326
10231 -175326 48079 52431 86248 287123 -186568 -467161 13811 -214928 -160209 -307071 -118792
10219 -35015 152141 73755 -97913 -43292 -24689 -230073 -188230 125422 8967 144463 -125395
10207 -91312 348678 -61154 -328884 180759 -111991 -92045 -277046 64199 -110402 179228
10196 193634 -77453 57571 -144973 19289 -343629 -66841 -198575 84029 -54028 -35089 -83763
$$ packed form
10275F4003a2805j89529h1987j54188O971A16659Q7172p5241J6844h5360J7197
10264f8163j94671c7001l02984F0319a16194k8450k1464B14941j1111a9856r8663
10253a18519K8362B60749r1773m0791a852A26305P2155f5012A37606J90984o205
10242C22385N5920a60223A72340J48819i1812O16j96925N6468O2109N4170n9952
10231a75326D8079M352L3817K00875a86568k80593A3811b14928N4719j46862a18792
10219c5015A52141G3755i7913d3292J8603k05384M1843A25422H967J35496a25395
10207i1312C48678f1154k67730A80759a11991J9946j85001F4199a10402A79228
10196A93634g7453E7571a44973A9289c43629f6841j31734H4029e4028J8939m8674
$$ plain form
10185 -83763 137972 -383418 -65794 -81440 -220798 -37357 127407 -308731 -50168 112020
10174 174778 -229115 -198569 105150 94129 -24581 84025 -188069 -113382 41105 -281198 -114024
10162 -206194 -380096 -217226 -5186 -189023 -59575 -103490 300146 -206451 -126418 -169783 6886
10150 -82898 47808 137735 -109731 81935 -677049 -169009 21987 149533 -10925 -22800 91112
10138 -48813 237917 277232 -156048 69460 167446 -169343 -144520 -447 100625 60551 -115113
10126 -17902 -237323 9954 -86638 177653 -28943 -55841 220879 67912 -52343 -210999 -96388
10114 -186531 126031 -113430 342471 197352 274299 -120783 50988 -170531 134101 231977
10104 231977 -83597 -160151 -55350 -394484 44774 -204604 118707 -262614 110483 -120838
$$ packed form
10185h3763A37972c83418f5794j5646j39358c7357A27407c08731e0168A12020
10174A74778b29115L0546A05150j1021b4581H4025a88069P4687D1105b81198a14024
10162b06194j73902J62870e186j83837e9575m3915C00146b06451Q0033m3365F886
10150h2898D7808Q9927a09731H1935f77049a69009B1987J27546a0925j1875I1112
10138d8813B37917L9315a56048F9460R7986a69343K4823d47A00625m0074a15113
10126a7902k19421I954h6638A77653b8943k6898B20879F7912e2343j58656i6388
10114a86531A26031a13430C42471j45119P6947a20783E0988a70531A34101R7876
10104B31977h3597p6554e5350l39134D4774b04604A18707b62614A10483a20838
$$ plain form
10093 -27118 404193 -100911 391032 246055 -76584 -18261 -166058 323069 132356 25309
10082 -302668 -183185 -143878 -166963 -178193 -240813 312627 27913 65996 202618 -396532 130848
10070 -14084 -81693 -353592 -300396 92047 -325728 -325170 96319 -82699 229490 353540 331800
10059 331800 111271 -46504 105276 -243677 -272436 23829 -133742 90376 518648 -141522
10048 -246240 7569 349091 183043 -168432 140773 -169156 44353 -201828 -280318 -340054
10038 -340054 -240237 128085 -374570 -158850 107305 -255433 -237781 24315 -140866 -72954
10028 -72954 -90029 -112316 -22734 -426370 -76489 -22599 -194347 -259402 -258901 139020 -121127
10016 141064 30125 -36752 170886 282912 -297145 -326230 -223352 312 4927 -22655 136278
$$ packed form
10093b7118D04193a00911C91032j44977g6584a8261j47797C23069A32356B5309
10082c02668J19483L9307k3085j1230o2620C12627B7913L8083J36622c96532A30848
10070a4084o7609k71899N3196I2047c25728N58I6319h2699B29490J24050k1740
10059C31800A11271d6504A05276b43677k8759B3829a33742I0376M28272a41522
10048b46240G569L41522j66048a68432A40773a69156D4353b01828p8490n9736
10038c40054R9817A28085c74570a58850A07305b55433J7652B4315a40866O7912
10028g2954j7075k2287b2734m03636g6489b2599j71748o5055N01A39020a21127
10016A41064C0125c6752A70886J12026b97145k9085J02878C12M615b2655A36278
$$ plain form
10004 -160814 367659 -327748 -255340 -28004 -155221 -85291 222581 -100155 20449 -17516
9993 -17200 -451074 10593 -89354 -147436 155238 -217366 188888 57183 -83826 97317 166453
9982 166453 -142084 -78981 -216955 -239847 -87325 166937 -124070 158485 -136879 60216
9971 -73055 -398600 368637 -134573 43081 -168044 -2569 19182 267640 183054 -1843 -87970
9960 -87970 9445 -440424 -185312 -53842 -242284 -129766 32336 -86867 79041 -133177 -238817
9949 -238817 -248068 -89928 200437 -178407 -307684 -33827 12722 253718 85556 -31011 -160002
9938 -160002 79791 -109707 -202808 174554 184638 -310532 111961 -86168 119737 -115309
9927 -45678 -35762 86759 -413552 -25261 -153433 -69671 -128345 296156 -97167 -113195 -20995
$$ packed form
10004a60814C67659c27748P2408b8004j27217O9930B22581a00155B0449a7516
9993a7200m33874A0593h9354n8082A55238b17366A88888E7183h3826I7317O9136
9982A66453a42084O3103j37974k2892h7325A66937a24070A58485a36879F0216
9971g3055l25545C68637a34573D3081a68044b569A9182K48458q4586a843q6127
9960h7970I445d40424a85312e3842j88442J12518C2336h6867G9041a33177j05640
9949b38817r251h9928B00437a78407j29277c3827A2722K40996H5556c1011j28991
9938a60002G9791a09707r3101A74554J0084c10532A11961h6168A19737a15309
9927d5678R916H6759d13552b5261j28172f9671n8674B96156i7167j6028b0995
$$ plain form
9915 -345070 -201841 -133548 -276524 -71041 -6229 1794 -100065 160912 -229879 -24576 116617
9903 -62176 -124390 -360674 -173339 -569188 76689 -200560 -78182 26243 -167678 -216006 347222
9891 -258636 -41353 164733 -454640 132247 -68550 -40320 -64128 5077 -242718 -230653 -195015
9880 -195015 -85145 103118 3959 -150319 268643 15832 -54884 -164022 -332342 -254693 204555
9868 -243975 28132 45299 -280742 -68759 -7323 23380 28090 -124699 298683 -104135 -74036
9857 -74036 42159 66056 12597 106913 -427471 -309635 45156 45227 -347071 -316682 50796 22146
9844 -372290 -22880 78453 -96397 -100078 47847 -20747 -138001 3861 -99536 -225066 -86682 -37588
9831 59383 171356 -2715 -41233 -62861 -111451 243313 32317 131512 -225127 -99830 -137962
$$ packed form
9915c45070J43229O8293j42976g1041f229A794a00065A60912b29879b4576A16617
9903f2176o2214k36284a73339l95849G6689b00560g8182B6243a67678m8328C47222
9891b58636d1353A64733d54640A32247f8550K8230k3808E077b42718J2065L5638
9880a95015h5145A03118C959a50319B68643A5832e4884j09138j68320P7649B04555
9868b43975B8132J7167b80742f8759g323B3380M710a24699B98683a04135L0099
9857g4036D2159K3897A2597R4316d27471J17836D5156P1c47071L0389E0796B2146
9844c72290b2880G8453i6397l681D7847b0747j17254C861i9536j25530h6682c7588
9831E9383J11973b715l8518k1628m8590B43313C2317R9195b25127i9830l8132
$$ plain form
9820 -137962 26924 -344645 63070 -232181 16020 190385 -369959 -12569 -260713 -82644 -331190
9809 -331190 21988 -334899 73229 -19913 167460 142051 -91239 70227 -172428 -396121 73049
9797 -193967 30507 147714 -193563 38178 -50727 -452967 -297734 -219510 10909 -203567 -217191
9786 -217191 -216420 -112061 -309418 -252199 125234 -217726 29461 -18876 -128649 52595 -172740
9774 -105416 12057 -55213 15939 -273675 114806 31865 -289337 -218222 203643 50110 87540
9763 87540 -133935 -1288 8540 58974 273961 107267 9327 225699 269235 -63610 220742
9751 48765 150632 -136633 5730 -53462 -43762 -66632 -103756 48784 -210463 38970 15114 223774
9739 223774 -159212 -5043 42342 -68995 3480 176626 -152515 12756 124534 -178259 21006
$$ packed form
9820a37962B6924c44645F3070b32181A6020J74365c69959a2569k48144h2644k48546
9809c31190B1988c34899G3229a9913A67460k5409i1239G0227a72428k23693G3049
9797a93967C0507J17207a93563C8178e0727m02240J55233P8224A0909b03567j3624
9786b17191P71J04359j97357N7219A25234b17726B9461a8876j09773E2595a72740
9774a05416A2057e5213A5939b73675A14806C1865b89337P1115B03643E0110L7430
9763H7540a33935a288H540N0434K14987A07267I327K16372M3536f3610B20742
9751D8765J01867a36633E730e3462R700k2870l7124D8784b10463C8970A5114K08660
9739B23774a59212e043D2342f8995C480J73146a52515A2756J11778a78259B1006
$$ plain form
9727 139156 -278886 -197376 -27841 253158 -20127 311482 183170 -22346 -200794 -101024 -81756
9716 -81756 -98672 -189816 -288011 -127896 6443 132314 -144392 -176217 -318088 -8449 -252918
9705 -252918 -320726 -203735 -43630 4894 -121672 39287 75527 43885 -273221 -101781 -51920
9694 -51920 121007 -149040 9079 -4330 -100659 -181557 -325429 -251559 -107005 -49111 20006
9682 98731 44599 934 -226801 106917 -50367 237739 61604 -67809 -192681 -194214 -141473 -134571
9670 -134571 -88165 380242 -461244 -171841 144851 177989 -44349 -209556 -73202 367115
9659 -100884 -13896 -125443 -1367 -1518 -120631 -77834 -125110 -33115 61256 -254078 -306356 198847
9646 116346 -428226 23875 -686933 -54087 30956 50928 -42933 223273 185943 -88368 68706
$$ packed form
9727A39156b78886Q1510b7841B53158b0127C11482j28312b2346j78448R9770J9268
9716h1756j6916r1144r8195a27896F443J25871a44392l1825j41871h449k44469
9705b52918o7808J16991d3630D894a21672C9287L6240l1642b73221a01781M9861
9694e1920A21007a49040I079d330r6329q0898j43872P3870a07005d9111B0006
9682I8731D4599I34b26801A06917e0367B37739F1604f7809j24872j533N2741O902
9670a34571M6406C80242d61244a71841A44851L3138d4349j65207g3202C67115
9659a00884a3896j11547a367j51j19113M2797m7276c3115F1256b54078n2278A98847
9646A16346d28226B3875f86933e4087C0956J9972d2933B23273l7330h8368F8706
$$ plain form
9634 -133284 -72103 179209 -24904 -207233 -368331 380638 7925 -176026 61263 -9823 83198
9622 -124539 -122391 -11857 133285 61599 -162486 89291 -35015 -98030 -71389 30830 -366124
9610 57390 5674 -92727 -162858 -63669 -73178 129859 -306024 -186659 -458345 -46203 -72442
9599 -72442 -222539 -114460 36406 -57286 -225517 -478335 -242638 178130 -129890 -40682
9588 43934 97363 -130794 79679 -16722 -30208 26710 -64822 29746 -127482 38289 67318
9577 67318 76125 -377709 -220469 -28378 46988 59815 -123245 34153 -86400 -171523 -81386
9565 97674 78349 -220056 -172907 -53028 -239716 -68075 -56532 -10792 -165862 79126 -33087
9553 -35743 -25998 -110822 -48263 -58092 156364 111331 -7499 51238 -223649 -67828 -137125 142920
$$ packed form
9634a33284O1181A79209b4904j82329j61098C80638G925a76026F1263i823H3198
9622a24539K148a1857A33285F1599a62486H9291c5015o3015K6641C0830c66124
9610E7390E674i2727p0131f3669r509A29859c06024J19365k71686d6203k6239
9599g2442j50097J08079C6406e7286j68231k52818K35697A78130a29890d0682
9588D3934N3429a30794G9679a6722j3486B6710f4822B9746a27482C8289K9029
9577F7318Q807c77709J57240b8378D6988J2827a23245C4153h6400q5123h1386
9565I7674j9325b20056M7149e3028j86688f8075J1543a0792j55070G9126c3087
9553c5743R745q4824d8263r829A56364m5033g499E1238b23649f7828o9297A42920
$$ plain form
9540 96252 -73435 -193573 108357 -192536 -58571 185655 -98338 -14360 465523 -315238 43233
9528 -119314 -130362 -147170 100754 -179940 55355 -3775 132218 406050 112612 67654 185543
9517 185543 -243370 -462799 2378 -267802 -38647 -82726 -119043 -162824 -352091 -150575 -52269
9505 90315 290118 76106 -77646 87511 -24828 -299268 93516 146570 53245 147124 -220632
9493 146378 -171935 246065 -307846 63148 153052 414216 -78747 -9995 -289039 92906 44522
9481 255206 435501 8797 131319 39385 -125005 -47223 33579 -453739 37367 -46406 -275090
9470 -275090 124990 -324226 -5871 162383 -50612 32142 -123362 -262956 -95697 78417 246788
9459 246788 28707 -307782 -83047 -238530 -7361 -186349 -50047 109707 -377666 -230295 -163992
$$ packed form
9540I6252g3435j20138A08357a92536e8571A85655i8338a4360D65523c15238D3233
9528a19314j1048j6808A00754a79940E5355c775A32218K73832A12612m4958J17889
9517A85543b43370k19429B378b67802c8647m4079l6317m3781j89267a50575e2269
9505I0315J99803G6106g7646H7511b4828k74440I3516N3054E3245R3879b20632
9493A46378a71935B46065c07846F3148Q9904K61164g8747i995k79044I2906D4522
9481B55206J80295H797J22522C9385a25005d7223C3579d53739C7367d6406k28684
9470b75090A24990c24226e871A62383e0612C2142a23362j39594i5697G8417J68371
9459B46788B8707c07782h3047j55483g361j78988e0047A09707c77666J47371O6303
$$ plain form
9448 -163992 -135167 -235643 99008 192302 -32735 -321597 -202659 -178986 -506973 159278 -237449
9436 152144 -100574 185346 -44642 -455437 -354639 -208285 202797 -389408 31154 -258515
9425 -181838 -90389 -72743 -54776 -112456 -60356 -29167 2424 7269 157637 88653 -262435 146126
9412 137556 -128758 -30545 -692 -247456 62157 -245457 -117438 -589040 -80915 -387122 -70864
9400 -105034 -145523 -16653 128675 -224468 -96640 -138429 -30069 -114950 -24363 -49110 51639
9388 -72537 47348 -175908 -164838 -92659 -122056 217605 -57766 83164 119495 -253810 47138
9376 94183 -197318 -79557 -82444 -167224 254597 -416655 -210688 -357906 127188 -297279 -183970
9365 -183970 -396713 -4761 -82280 148719 -105675 -211309 -98506 -77737 47271 -5036 191630
$$ packed form
9448a63992K8825j00476I9008R3294c2735k88862J18938K3673l27987A59278b37449
9436A52144a00574A85346d4642m10795J00798J46354B02797c89408C1154b58515
9425a81838i0389J7646J7967n7680N2100b9167B424M845J50368o8984b62435A46126
9412A37556a28758c0545f92k46764F2157b45457a17438m71602h0915l06207g0864
9400a05034m0489a6653A28675b24468i6640m1789c0069q4881b4363k4747E1639
9388g2537D7348a75908J1070P2179k9397B17605e7766H3164L6331b53810D7138
9376I4183a97318g9557k887q4780B54597d16655K05967j47218A27188b97279J13309
9365a83970k12743d761p7519A48719a05675j05634i8506K0769D7271e036A91630
$$ plain form
9353 -6806 -89796 -136304 -358658 -218793 463 56794 -111056 -125317 -63764 -284528 -194449 -24908
9340 -159376 186757 75730 -45902 -196458 -77029 95550 -70424 237437 -69478 -202513 -105123
9329 -105123 -86147 134445 124509 105595 64959 -193249 62155 -65343 60695 -227503 -78997
9317 135991 -171495 136291 148283 -205540 -120498 -174461 -196376 117869 181686 -266376 -65667
9305 -304612 -99756 63121 40193 134778 52077 -98724 -125013 -122386 137726 -302925 296716
9293 -122832 -63536 -167107 -184367 3837 -46074 10548 -37285 -72462 127253 -37784 -203636
9282 -203636 -201889 -140941 -171027 42089 164246 -352543 -158831 50092 228320 -269698 -310054
9271 -310054 -5487 -132185 86071 -353380 -22756 -185847 -181852 79754 116694 -66692 89149
$$ packed form
9353f806q2990m6508k22354J39865D63N6331a11056j4261O1553k20764R0079b4908
9340a59376A86757G5730d5902j50556g7029I5550g0424B37437f9478j33035R7390
9329a05123J8976A34445r936j8914m0636a93249F2155f5343F0695b27503g8997
9317A35991a71495A36291J1992b05540Q5042n3963k1915A17869O3817b66376f5667
9305c04612i9756F3121k2928R4585E2077i8724k6289K627A37726c02925B96716
9293a22832N9296j03571j7260C837d6074A0548c7285l5177A27253c7784j65852
9282b03636J747O0948l0086D2089J22157c52543a58831E0092J78228b69698m0356
9271c10054e487j26698H6071c53380b2756j63091L995G9754L6940f6692H9149
$$ plain form
9259 -105334 80664 2262 -180514 -46753 143012 30979 -381499 -243969 202054 54926 100547
9248 100547 -179094 -177360 62006 214239 -115212 -63827 -269761 204209 -184752 14994 327822
9237 327822 125384 -210982 -228132 -30516 36345 -20467 120305 40377 117973 -265042 -137302
9226 -137302 -189115 -54757 -73553 -300726 220021 -163323 -28685 -97174 199961 -271050 564724
9214 -5306 -327041 40889 -112680 -227175 -186871 240243 -265629 75967 -154265 -182535 93618
9202 122576 -259551 -207801 18623 -167171 -21085 -137526 74805 -143989 107069 -90546 -215563
9191 -215563 230394 68990 -89053 -92551 187243 -192707 33083 -105149 52563 -149074 -347512
9180 -347512 -251391 137239 -147001 104557 -176769 -26250 41331 -378524 -400599 408 -106403
$$ packed form
9259a05334H0664B262a80514d6753A43012C0979c81499J37530B02054E4926M5621
9248A00547a79094J734F2006J52233a15212N1385k05934B04209a84752A4994L12828
9237C27822A25384b10982j7150c0516C6345b0467A20305D0377P7596b65042J27740
9226a37302n1813e4757j8796k27173B20021a63323b8685o8489A99961b71050E64724
9214e306l21735D0889a12680j14495M0304B40243b65629G5967a54265k8270I3618
9202A22576b59551N1750A8623a67171b1085j16441G4805a43989A07069i0546j25017
9191b15563B30394F8990h9053l498A87243a92707C3083a05149E2563a49074j98438
9180c47512R6121A37239a47001A04557a76769b6250D1331c78524k2075D08a06403
$$ plain form
9168 20438 -29092 18002 -150394 230894 288863 71755 96205 196137 -164294 -5500 -157780
9157 -157780 -141646 8947 -172344 146593 -87503 -79158 -391827 -271431 -37001 -26435 -299006
9146 -299006 23312 -169850 46425 -261412 14802 -236301 21601 193331 -165281 -200707 5521
9134 48721 -80115 -87606 80745 150487 41240 213921 -381547 140714 88782 66042 246065
9123 246065 -31128 -712 -199857 -284650 -173617 -53002 194926 -724650 -37344 -4072 -252580
9112 -252580 173696 -258165 -69620 -165475 235264 -165874 -81483 -34804 -72777 -35412 -52131
9101 -52131 -205659 -306426 211964 -295042 -69984 159875 207887 -75987 -124234 -13992 23861
9089 -186247 343901 150028 7490 -130007 -231363 160658 -156780 246325 65033 -240979
$$ packed form
9168B0438b9092A8002a50394B30894N7969G1755K4450R9932a64294e500j52280
9157a57780J6134H947a72344A46593h7503Q345l12669J20396c7001J0566k72571
9146b99006B3312a69850D6425b61412A4802b36301B1601J71730a65281l5426E521
9134D8721h0115p491H0745O9742D1240J72681c81547A40714n1932k2740J80023
9123B46065c1128g12j99145q4793J11033e3002A94926g24650c7344d072k48508
9112b52580A73696b58165f9620r5855B35264a65874h1483c4804l7973c5412j6719
9101e2131j53528j00767B11964b95042f9984A59875M8012g5987m8247a3992B3861
9089a86247C43901A50028G490a30007j01356A60658a56780B46325F5033b40979
$$ plain form
9078 -100847 -35690 182508 228231 -300754 -65534 31271 -134151 65953 123162 229909 41307
9066 -7569 -203012 65884 -233602 256118 -460188 -143769 -224930 -442661 -11104 -250266 -257217
9055 -257217 28568 160205 97570 -102263 140678 349912 -25195 179747 -275971 -69944
9044 -27817 -92712 -57104 116164 367730 -110708 -179061 7591 244392 -138009 -12766 -72169
9033 -72169 109840 -43393 -225689 142174 -212844 7616 -85354 -226070 -364293 68022 91983
9022 91983 65283 -194709 99644 -141159 11301 -35192 399404 70363 -117847 248673 -147018
9010 63946 -119381 60369 -152534 -273629 -263579 177473 -239791 -305119 38601 -27987 10109
8998 73567 53832 -66814 -158711 -105364 -33789 23016 140664 -386136 -446468 310098 204818
$$ packed form
9078a00847c5690A82508M5723c00754f5534C1271a34151F5953N7209J06747D1307
9066g569j95443F5884b33602B56118d60188a43769q1161k17731a1104k39162o951
9055b57217B8568J31637o2635a02263A40678K09234b5195A79747b75971f9944
9044b7817o4895L5608A16164K51566a10708o8353G591K36801a38009a2766n9403
9033g2169A09840d3393j82296A42174b12844G616h5354j40716j38223F8022K3961
9022I1983k6700a94709I9644a41159A1301c5192C99404G0363a17847B48673a47018
9010F3946a19381F0369a52534j21095J0050A77473b39791o5328C8601b7987A0109
8998G3567j9735f6814r1897N3347c3789B3016J17648c86136o0332C10098j05280
$$ plain form
8987 204818 -62769 -229931 -207851 -90024 -157112 38243 146498 -37111 -223836 147346 429606
8976 429606 67371 41419 -45448 -126212 -100864 -24788 -214872 -341563 125266 24859 -29372
8964 -120495 -55271 -331839 134867 80112 6943 113625 87150 225102 -154988 -483115 -43073
8952 302807 -186893 208914 44437 127517 374644 -267824 -86666 -329526 -309142 74509 -81032
8940 -203783 187325 289760 -184400 -73097 -245866 281557 -230854 49829 -195724 -25229
8929 -125066 66266 -173111 -169082 -32977 -174255 -210842 178956 251146 159566 291467 138201
8917 45139 117730 247584 366687 131617 184886 184908 536040 717654 1454736 1740685 4302379
8906 4302379 8447356 6999801 3309227 1794489 1174631 1000359 610647 573068 199227
$$ packed form
8987B04818f2769j67162K2080i0024o7088C8243J08255c7111j86725A47346K82260
8976D29606F7371k5952d5448q0764K5348b4788j90084j26691A25266B4859b9372
8964a20495e5271k76568A34867n4755F943J06682k6475J37952a54988l28127d3073
8952C02807a86893B08914D4437Q3080K47127b67824h6666k42860K0384G4509h1032
8940b03783A87325J02435a84400g3097j72769B81557b30854D9829a95724b5229
8929a25066F6266a73111M029c2977j41278l6587A78956P2190r1580J31901A38201
8917D5139P2591J29854J19103A31617N3269K2L51132J81614P37082K85949K561694
8906D302379M144977j447555C309227j514738o19858j74272l89712l7579A99227
$$ plain form
8896 391461 281427 327723 299914 408540 233280 -81610 189694 49912 249618 -10760 104212
8884 259473 -49500 171056 -16836 -120706 117952 187387 139782 245474 153802 -101583 -25754
8872 -266443 219163 -182111 -234499 -73162 140934 97581 -222573 -49144 29843 -301626 39114
8860 74259 -220974 -139532 56437 -270187 -143424 124674 -212050 13815 -225893 -230884 -103002
8848 -77702 -161904 -137555 160684 124685 45456 71099 -389440 -221371 40456 -58409 -42800
$$ packed form
8896C91461j10034M6296k7809J08626j75260h1610A89694D9912J99706a0760A04212
8884B59473d9500A71056a6836j03870A17952O9435m7605J05692r1672a01583b5754
8872b66443B19163a82111n2388g3162A40934m3353b22573d9144B9843c01626C9114
8860G4259b20974Q1442E6437b70187J26763A24674b12050A3815b25893m991a03002
8848g7702q4202K4349A60684l5999D5456K5643c89440J68069D0456e8409J5609
$$ [...]
##END NTUPLES=NMR SPECTRUM
##END=
