
##TITLE=AC1222_Punto_6074794_1Xs9jaGfa0
##JCAMPDX= 6.0         $$ Bruker NMR JCAMP-DX V2.0
##DATA TYPE= NMR SPECTRUM
##DATA CLASS= NTUPLES
##ORIGIN= BRUKER
##OWNER= Administrator
$$ 1.72 TOPSPIN		Version 2.1
$$ 2012-05-09 01:58:16.609 -0500  Administrator@TOPSPIN
$$ Compression mode = diff/dup
##.OBSERVE FREQUENCY= 400.13188235
##.OBSERVE NUCLEUS= ^1H
##.ACQUISITION MODE= SIMULTANEOUS (DQD)
##.ACQUISITION SCHEME= undefined
##.AVERAGES= 64
##.DIGITISER RES= 22
##SPECTROMETER/DATA SYSTEM= spect
##.PULSE SEQUENCE= noesygpps1d.comp
##.SOLVENT NAME= COFFEE_meoh
##.SHIFT REFERENCE= INTERNAL, COFFEE_meoh, 1, 14.96678
##AUDIT TRAIL= $$ (NUMBER, WHEN, WHO, WHERE, PROCESS, VERSION, WHAT)
$$ ##TITLE= Audit trail, TOPSPIN		Version 2.1
$$ ##JCAMPDX= 5.01
$$ ##ORIGIN= Bruker BioSpin GmbH
$$ ##OWNER= Administrator
$$ $$ C:\Bruker\TOPSPIN/data/COFFEE/nmr/AC1222_Punto_6074794_1Xs9jaGfa0/122/pdata/1/auditp.txt
$$ ##AUDIT TRAIL=  $$ (NUMBER, WHEN, WHO, WHERE, PROCESS, VERSION, WHAT)
(   1,<2012-05-09 01:58:11.921 -0500>,<Administrator>,<TOPSPIN>,<go>,<TOPSPIN 2.1>,
      <created by zg
	started at 2012-05-09 01:46:41.359 -0500,
	POWCHK enabled, PULCHK disabled,
       configuration hash MD5:
       AF F2 23 6B 01 CD 40 DD E5 A1 38 A0 06 EA F7 77
       data hash MD5: 64K
       9F 20 5B C8 2F 65 70 CF 02 0F AB FC 03 FF 3D F6>)
(   2,<2012-05-09 01:58:14.718 -0500>,<Administrator>,<TOPSPIN>,<proc1d>,<TOPSPIN 2.1>,
      <Start of raw data processing
       efp LB = 0.3 FT_mod = 6 PKNL = 1 PHC0 = 0 PHC1 = 0 SI = 128K 
       data hash MD5: 128K
       54 2C 7E C7 4B A2 4A 89 3B 39 CC FC 28 C0 9D A5>)
(   3,<2012-05-09 01:58:15.890 -0500>,<Administrator>,<TOPSPIN>,<proc1d>,<TOPSPIN 2.1>,
      <pk PHC0 = 30.05859 PHC1 = 0 
       data hash MD5: 128K
       1D C3 35 C3 A9 C2 61 CD D2 D7 E2 54 21 C6 F4 89>)
(   4,<2012-05-09 01:58:16.109 -0500>,<Administrator>,<TOPSPIN>,<proc1d>,<TOPSPIN 2.1>,
      <abs ABSG = 1 
       data hash MD5: 128K
       63 A1 21 FB 75 3D 3E B4 70 6E DC 10 55 AC 16 90>)
(   5,<2012-05-09 01:58:16.218 -0500>,<Administrator>,<TOPSPIN>,<proc1d>,<TOPSPIN 2.1>,
      <abs ABSG = 2 
       data hash MD5: 128K
       20 4A E6 15 6E 71 7D 7A 09 E8 7E 80 9E 92 4A B8>)
(   6,<2012-05-09 01:58:16.406 -0500>,<Administrator>,<TOPSPIN>,<proc1d>,<TOPSPIN 2.1>,
      <abs ABSG = 3 
       data hash MD5: 128K
       D8 7C 10 FF BD 6E 81 71 98 11 7D FE 8D F4 B9 20>)
(   7,<2012-05-09 01:58:16.468 -0500>,<Administrator>,<TOPSPIN>,<proc1d>,<TOPSPIN 2.1>,
      <abs ABSG = 4 
       data hash MD5: 128K
       5A 98 98 FB 1D D6 66 60 81 CE 85 2E F3 3F 8E E6>)
(   8,<2012-05-09 01:58:16.531 -0500>,<Administrator>,<TOPSPIN>,<proc1d>,<TOPSPIN 2.1>,
      <abs ABSG = 5 
       data hash MD5: 128K
       6E 34 95 B6 5A 56 1D DD B9 4C 10 D7 23 4A 8C 99>)
$$ ##END=
$$ 
$$ $$ hash MD5
$$ $$ 02 FD 21 C8 A2 F0 63 05 A7 40 D7 65 77 66 4F 68
##$RELAX= 
##$RELAX= 
##$RELAX= 
##$RELAX= 
##$RELAX= 
##$RELAX= 
##$RELAX= 
##$RELAX= 
$$ Bruker specific parameters
$$ [...]
##$TP07= 0
##$TPNAME0= <>
##$TPNAME1= <>
##$TPNAME2= <>
##$TPNAME3= <>
##$TPNAME4= <>
##$TPNAME5= <>
##$TPNAME6= <>
##$TPNAME7= <>
##$TPOAL= (0..7)
0.5 0.5 0.5 0.5 0.5 0.5 0.5 0.5
##$TPOFFS= (0..7)
0 0 0 0 0 0 0 0
##$TUNHIN= 0
##$TUNHOUT= 0
##$TUNXOUT= 0
##$USERA1= <user>
##$USERA2= <user>
##$USERA3= <user>
##$USERA4= <user>
##$USERA5= <user>
##$V9= 5
##$VALIST= <valist>
##$VCLIST= <CCCCCCCCCCCCCCC>
##$VD= 0
##$VDLIST= <DDDDDDDDDDDDDDD>
##$VPLIST= <PPPPPPPPPPPPPPP>
##$VTLIST= <TTTTTTTTTTTTTTT>
##$WBST= 1024
##$WBSW= 4
##$XGAIN= (0..3)
0 0 0 0
##$XL= 0
##$YL= 0
##$YMAX_a= 11345957
##$YMIN_a= -6333156
##$ZGOPTNS= <>
##$ZL1= 120
##$ZL2= 120
##$ZL3= 120
##$ZL4= 120
##$ABSF1= 14.96678
##$ABSF2= -5.585751
##$ABSG= 5
##$ABSL= 3
##$ALPHA= 0
##$AQORDER= 0
##$ASSFAC= 0
##$ASSFACI= 0
##$ASSFACX= 0
##$ASSWID= 0
##$AUNMP= <proc_prof1d_extract.lims>
##$AXLEFT= 0
##$AXNAME= <>
##$AXNUC= <1H>
##$AXRIGHT= 0
##$AXTYPE= 0
##$AXUNIT= <>
##$AZFE= 0.1
##$AZFW= 0.1
##$BCFW= 0
##$BC_mod= 0
##$BYTORDP= 0
##$COROFFS= 0
##$CY= 15
##$DATMOD= 1
##$DC= 0
##$DFILT= <>
##$DTYPP= 0
##$F1P= 0
##$F2P= 0
##$FCOR= 0.5
##$FTSIZE= 131072
##$FT_mod= 6
##$GAMMA= 0
##$GB= 0
##$INTBC= 1
##$INTSCL= 1
##$ISEN= 128
##$LB= 0.3
##$LEV0= 0
##$LPBIN= 0
##$MAXI= 10000
##$MC2= 0
##$MEAN= 0
##$ME_mod= 0
##$MI= 0
##$NCOEF= 0
##$NC_proc= -3
##$NLEV= 6
##$NOISF1= 0
##$NOISF2= 0
##$NSP= 0
##$NTH_PI= 0
##$NZP= 0
##$OFFSET= 14.96678
##$PC= 1
##$PHC0= 30.05859
##$PHC1= 0
##$PH_mod= 1
##$PKNL= yes
##$PPARMOD= 0
##$PPDIAG= 0
##$PPIPTYP= 0
##$PPMPNUM= 2147483647
##$PPRESOL= 1
##$PSCAL= 4
##$PSIGN= 0
##$PYNMP= <proc.py>
##$REVERSE= no
##$SF= 400.130005533647
##$SI= 131072
##$SIGF1= 0
##$SIGF2= 0
##$SINO= 400
##$SIOLD= 131072
##$SPECTYP= <>
##$SREGLST= <1H.CDCl3>
##$SSB= 0
##$STSI= 131072
##$STSR= 0
##$SW_p= 8223.68421052632
##$SYMM= 0
##$S_DEV= 0
##$TDeff= 65536
##$TDoff= 0
##$TI= <>
##$TILT= no
##$TM1= 0
##$TM2= 0
##$TOPLEV= 0
##$USERP1= <user>
##$USERP2= <user>
##$USERP3= <user>
##$USERP4= <user>
##$USERP5= <user>
##$WDW= 1
##$XDIM= 131072
##$YMAX_p= 401460228
##$YMIN_p= -51911427
##$CURPLOT= <Network HP LaserJet P1505>
##$CURPRIN= <$Network HP LaserJet P1505>
##$DFORMAT= <normdp>
##$LAYOUT= <+/1D_H.xwp>
##$LFORMAT= <normlp>
##$PFORMAT= <normpl>
##$SURQMSG= 1
$$ End of Bruker specific parameters
$$ ---------------------------------
##NTUPLES= NMR SPECTRUM
##VAR_NAME=  FREQUENCY,     SPECTRUM/REAL,   SPECTRUM/IMAG
##SYMBOL=    X,             R,               I
##VAR_TYPE=  INDEPENDENT,   DEPENDENT,       DEPENDENT
##VAR_FORM=  AFFN,          ASDF,            ASDF
##VAR_DIM=   131072,        131072,          131072
##UNITS=     HZ,            ARBITRARY UNITS, ARBITRARY UNITS
##FACTOR=    0.0627417313425165, 1,          1
##FIRST=     8223.62146879498, 2649,         -109376
##LAST=      0,             7197,            -108666
##MIN=       0,             -51911427,       0
##MAX=       8223.62146879498, 401460228,    0
$$ Real data points
##PAGE= N=1
##DATA TABLE= (X++(R..R)), XYDATA
$$ [...]
63664D33786L896M553M730M961N517N805M978L089J312Q04J426J971J582N69m16
63649D78563j375k614l788m102l444k594k099j599n93O06J201R21L25K37J035
63634D60680K377L432L592L092K716K711K478J617Q92J430L179M825N485N612
63620E04118N869N799M524K432R45M82j82j864l375l138j658q07r19l66J645L575
63604E17080L718K433J037l20k113l654l664k340j299j427k183k984l808m273
63590D96203l691k335j240l74J470M321O298O183N280N338O037O182O231P546
63576E43449R676J0669J0092R712J0637J1723J1725J1496J2660J5193J7703J9483
63564F94218K0964K2365K3270K3681K4412K6001K8011K9820L1496L3440L5629
$$ y = [433786, 437682, 442235, 446965, 451926, 457443, 463248, 468226, 471315, 472627, 473431, 474857, 476828, 478410, 478979, 478563, 477188, 474574, 470786, 466684, 463240, 460646, 458547, 456948, 456355, 456961, 458162, 459083, 459408, 459645, 460680, 463057, 466489, 470081, 473173, 475889, 478600, 481078, 482695, 483587, 485017, 488196, 493021, 498506, 504118, 509987, 515786, 520310, 522742, 523687, 524169, 523987, 522123, 518748, 515610, 513952, 513145, 512226, 511860, 513505, 517080, 520798, 523231, 524268, 523948, 521835, 518181, 514517, 512177, 510878, 509451, 507268, 504284, 500476, 496203, 492512, 490177, 488937, 488563, 490033, 494354, 500652, 506835, 512115, 517453, 523490, 529672, 535903, 543449, 553125, 563794, 573886, 583598, 594235, 605958, 617683, 629179, 641839, 657032, 674735, 694218, 715182, 737547, 760817, 784498, 808910, 834911, 862922, 892742, 924238, 957678, 993307]
63553I93307L7762L9868M2210M4674M6687M7734M7731M6959M5821M4501M2477
63542A479731L8552L1852K2917J3515N387p54n200q732j2001j4942j6951j8037
63530A515337j9380k2013k5319k7965l0111l3144l7057l9778l9848l8197l6303
63519A166222l3989l0531k6581k3276k0420j7329j4620j3078j1422p565k077K078
63507I67412L599M462O810J0250J3238J5378J7226J9146K1415K4175K6650K7686
63495A157447K7859K9425L3145L6944L9019M0649M4129M9112N3071N4563N4117
63484A619480N2312M8787M3162L5590K6466J6532O904j938j0499j8515k3813k4604
63472A769864k2366k0596k1023k2791k5242k9269l5350m1979m7055m9937n1483
$$ y = [993307, 1031069, 1070937, 1113147, 1157821, 1204508, 1252242, 1299973, 1346932, 1392753, 1437254, 1479731, 1518283, 1550135, 1573052, 1586567, 1591954, 1591200, 1586000, 1577268, 1565267, 1550325, 1533374, 1515337, 1495957, 1473944, 1448625, 1420660, 1390549, 1357405, 1320348, 1280570, 1240722, 1202525, 1166222, 1132233, 1101702, 1075121, 1051845, 1031425, 1014096, 999476, 986398, 974976, 967411, 965334, 967412, 971011, 975473, 982283, 992533, 1005771, 1021149, 1038375, 1057521, 1078936, 1103111, 1129761, 1157447, 1185306, 1214731, 1247876, 1284820, 1323839, 1364488, 1408617, 1457729, 1510800, 1565363, 1619480, 1671792, 1720579, 1763741, 1799331, 1825797, 1842329, 1849233, 1847295, 1836796, 1818281, 1794468, 1769864, 1747498, 1726902, 1705879, 1683088, 1657846, 1628577, 1593227, 1551248, 1504193, 1454256, 1402773]
63461A402773n2706n3781n3829n1752m7822m4060m2039m0775l8042l3558k9264
63450I15145k6578k4967k3541k2254k0980j9029j6546j5065j5512j6589j6188
63439F97896j3861j0971q917p948p421o611n399m384m026l776k728j114j62k42
63425F20336k07R46K645L600L432K767K342K501L132L682L662L318L320L565L074
63410F62115J289j252l745n749o730o048m001j991r79m84L70J563K541L139L520
63395F43558L852M524N928P471P765O581N786P370J1132J5147J7923J9316J9978
63382G76331K0904K3029K6300K9483L1639L3374L5794L8822M1553M3740M5595
63371A146564M6319M4364L9562L4037L0371K9301K9572K9767K9921L1300L4614
$$ y = [1402773, 1350067, 1296286, 1242457, 1190705, 1142883, 1098823, 1056784, 1016009, 977967, 944409, 915145, 888567, 863600, 840059, 817805, 796825, 777796, 761250, 746185, 730673, 714084, 697896, 684035, 673064, 664147, 656199, 648778, 642167, 636768, 632384, 628358, 624582, 621854, 620740, 620578, 620336, 620129, 621075, 623720, 627320, 630752, 633519, 635861, 638362, 641494, 645176, 648838, 652156, 655476, 659041, 662115, 663404, 662152, 658407, 652658, 645928, 639880, 635879, 633888, 632909, 632425, 632795, 634358, 636899, 640038, 643558, 647410, 651934, 657862, 665333, 673098, 679679, 685465, 692835, 703967, 719114, 737037, 756353, 776331, 797235, 820264, 846564, 876047, 907686, 941060, 976854, 1015676, 1057229, 1100969, 1146564, 1192883, 1237247, 1276809, 1310846, 1341217, 1370518, 1400090, 1429857, 1459778, 1491078, 1525692]
63360A525692L8820M2228M4747M7982N2685N7050N8468N6209N1368M4663L5731
63349B055643K4661J3003K569o130j3622j9885k3722k4228k2649k2017k4344k8810
63337A910469l3493l8124m3693m9719n4073n5835n6278n6192n4406n0375m6137
63326A372144m3606m1443l7102l0960k5793k2645j9795j5871j1522p583l711L55
63314A112468M006O965R899J3131J6050J8429K1063K4359K7529K9905L2139L5312
63302A351255L9566M4173M8329N1529N3833N5896N8012N9160N7975N4512M9915
63291A924155M4374L6900K7384J7362Q245J49p079j3238j8628k3972k8711l1050
63279A935891l0728l0243l2014l5644l9310m2614m6415n0641n3994n5480n5049
$$ y = [1525692, 1564512, 1606740, 1651487, 1699469, 1752154, 1809204, 1867672, 1923881, 1975249, 2019912, 2055643, 2080304, 2093307, 2095876, 2089746, 2076124, 2056239, 2032517, 2008289, 1985640, 1963623, 1939279, 1910469, 1876976, 1838852, 1795159, 1745440, 1691367, 1635532, 1579254, 1523062, 1468656, 1418281, 1372144, 1328538, 1287095, 1249993, 1219033, 1193240, 1170595, 1150800, 1134929, 1123407, 1115824, 1112113, 1112468, 1116474, 1123439, 1133338, 1146469, 1162519, 1180948, 1202011, 1226370, 1253899, 1283804, 1315943, 1351255, 1390821, 1434994, 1483323, 1534852, 1588685, 1644581, 1702593, 1761753, 1819728, 1874240, 1924155, 1968529, 2005429, 2032813, 2050175, 2058420, 2058569, 2051490, 2038252, 2019624, 1995652, 1966941, 1935891, 1905163, 1874920, 1842906, 1807262, 1767952, 1725338, 1678923, 1628282, 1574288, 1518808, 1463759]
63268A463759n2998m9804m6196m2537l8473l3943k9769k6551k3736k0869j8903
63257A079980j9118k1309k4095k6440k7841k7869k6741k5684k5357k4630k2331
63246H08565j9486j8042j7899j7142j5069j2996j1836j0818r226p696o978o748
63234F54629o511o626p502q512q613p638o435n884o097o244n234l054j304j635
63220E73340l590m847l825j329O29R62K05m03k18J86k39j419j844m63J728L027
63204E61900L397M147N511O186N509M584M794O324Q597J0912J2226J1664R967
63191F55718R282J0660J2742J3713J3709J4192J5727J7434J8488J9239K0779K3669
63179H45352K7045K9188K9335K8640K8529K8694K8036K7288K8680L2556L6189
$$ y = [1463759, 1410761, 1360957, 1314761, 1272224, 1233751, 1199808, 1170039, 1143488, 1119752, 1098883, 1079980, 1060862, 1039553, 1015458, 989018, 961177, 933308, 906567, 880883, 855526, 830896, 808565, 789079, 771037, 753138, 735996, 720927, 707931, 696095, 685277, 676051, 668355, 661377, 654629, 648118, 641492, 633990, 625478, 616865, 609227, 602792, 596908, 590811, 584567, 579333, 576279, 574975, 573340, 569750, 564903, 561078, 559749, 560378, 561340, 561545, 561142, 560924, 561110, 560871, 559452, 557608, 557145, 558873, 561900, 565297, 569444, 574955, 581141, 586650, 591234, 596028, 602352, 610949, 621861, 634087, 645751, 655718, 665000, 675660, 688402, 702115, 715824, 730016, 745743, 763177, 781665, 800904, 821683, 845352, 872397, 901585, 930920, 959560, 988089, 1016783, 1044819, 1072107, 1100787, 1133343, 1169532]
63168A169532L6963L5255L3162L1891L1482L1705L1735L0157K6816K3759K2841
63157A505298K3258K2758K0452J6875J2151N992q78p034j1968j6199k0095k3758
63145A526852k7510l1101l3052l2366l0337k9030k8327k6387k2675j8625j5291
63134A232151j2284r158o093k898Q52M507O866Q300J0540J4008J7147J8933K0016
63121A302887K0803K0388J8513J6677J6163J6405J6502J6664J6918J5912J2688
63110A490520Q524N372L274P16l182q153j3720j9289k3957k7387l0326l3285l5453
63097A313654l5978l5572l5509l5799l5500l4282l2353k9571k5945k2514k0408
63086I70223j9340j8294j7118j6225j5220j3375j1075r339q127o513m393k697
$$ y = [1169532, 1206495, 1241750, 1274912, 1306803, 1338285, 1369990, 1401725, 1431882, 1458698, 1482457, 1505298, 1528556, 1551314, 1571766, 1588641, 1600792, 1606784, 1605906, 1598872, 1586904, 1570705, 1550610, 1526852, 1499342, 1468241, 1435189, 1402823, 1372486, 1343456, 1315129, 1288742, 1266067, 1247442, 1232151, 1219867, 1210709, 1204616, 1201718, 1202570, 1207077, 1213943, 1222243, 1232783, 1246791, 1263938, 1282871, 1302887, 1323690, 1344078, 1362591, 1379268, 1395431, 1411836, 1428338, 1445002, 1461920, 1477832, 1490520, 1499044, 1504416, 1507690, 1508406, 1505224, 1497071, 1483351, 1464062, 1440105, 1412718, 1382392, 1349107, 1313654, 1277676, 1242104, 1206595, 1170796, 1135296, 1101014, 1068661, 1039090, 1013145, 990631, 970223, 950883, 932589, 915471, 899246, 884026, 870651, 859576, 850237, 842110, 835597, 831204, 828507]
63074H28507k075k467l606m638l849m86L477N183M372L279L175L197K788K930
63060H39787M027M616L577K147K265L885N290N370M520L716L590M049M298L628
63046H94765K597K695M448O518P205O256M680L504L124L279L212K353J184Q37
63032I46657J635K742L400L706L954M118M328M932N774O294O642P651R344J0671
63018A021848J1186J1802J3283J5177J6900J8627K0366K1449K1838K2701K4697
63007A219874K6907K8552L0460L3494L6801L9229M1377M4541M8468N1971N5098
62996A656772N8763O2720O5806O8048P0602P3589P5840P7033P8364Q0544Q2585
62985B450666Q3092Q1749P9043P5573P2093O9517O8386O8609O9471O9446O6692
$$ y = [828507, 826432, 823965, 820359, 815721, 811872, 811386, 814863, 820046, 824418, 827697, 830872, 834069, 836857, 839787, 843814, 848430, 852007, 854154, 856419, 860304, 865594, 870964, 875484, 879200, 882790, 886839, 891137, 894765, 897362, 900057, 904505, 911023, 918228, 924484, 929164, 932668, 935792, 939071, 942283, 944636, 945820, 946657, 948292, 951034, 954434, 958140, 962094, 966212, 970540, 975472, 981246, 987540, 994182, 1001833, 1011177, 1021848, 1033034, 1044836, 1058119, 1073296, 1090196, 1108823, 1129189, 1150638, 1172476, 1195177, 1219874, 1246781, 1275333, 1305793, 1339287, 1376088, 1415317, 1456694, 1501235, 1549703, 1601674, 1656772, 1715535, 1778255, 1844061, 1912109, 1982711, 2056300, 2132140, 2209173, 2287537, 2368081, 2450666, 2533758, 2615507, 2694550, 2770123, 2842216, 2911733, 2980119, 3048728, 3118199, 3187645, 3254337]
62974C254337O0745N3155M5301L6327K4828J1818j88j0843k2256l5287m7958n8316
62962C311663o6615p3479p8135q0065q0561q0618p8669p2621o3347n4040m6432
62951B537081l9576l2299k4918j8068j1406m417K337P679J1288J4167J7606K1816
62939B481290K5732K8199K9213K9581K9611K8873K7350K5836K4817K3718K1819
62928B776039J9021J5147R438J685o878j4832k2182k9704l7378m4612n1575n8796
62916B555373o5709p0947p4212p6472p8018p7710p4798p0399o6264o2757n8866
62905A779221n3865m8342m3674m0850l9555l8267l5681l2208k9570k8645k8510
62894A360054k8032k7507k7777k8240k7258k4591k2109k1424k1892k1889k1289
$$ y = [3254337, 3315082, 3368237, 3413538, 3449865, 3474693, 3486511, 3486323, 3475480, 3453224, 3417937, 3369979, 3311663, 3245048, 3171569, 3093434, 3013369, 2932808, 2852190, 2773521, 2700900, 2637553, 2583513, 2537081, 2497505, 2465206, 2440288, 2422220, 2410814, 2406397, 2408734, 2416413, 2427701, 2441868, 2459474, 2481290, 2507022, 2535221, 2564434, 2594015, 2623626, 2652499, 2679849, 2705685, 2730502, 2754220, 2776039, 2795060, 2810207, 2819645, 2821330, 2814452, 2799620, 2777438, 2747734, 2710356, 2665744, 2614169, 2555373, 2489664, 2418717, 2344505, 2268033, 2190015, 2112305, 2037507, 1967108, 1900844, 1838087, 1779221, 1725356, 1677014, 1633340, 1592490, 1552935, 1514668, 1478987, 1446779, 1417209, 1388564, 1360054, 1332022, 1304515, 1276738, 1248498, 1221240, 1196649, 1174540, 1153116, 1131224, 1109335, 1088046]
62883A088046k1235k1759k1252j8762j5595j3687j3297j3273j2908j2329j1539
62872I12410j0405r443r208q936p321m908m020n461o947o086l668k306k725l306
62858H27670l014k692l168l804l744l352l424l828l794l195k795l424n194p260
62844G74982q121o756l802j231m95j369k762l954m578m215k878j469q16n33L10
62829G32313J566K093J515Q45R47J411J457J169R34M17q15k035k005q93k07n09
62813G38203m60J046K930L332K219J171Q27J41j539l090l055j558J16J095J288
62798G42666P93o9l95O07K480L845L908L125K271J607J144J056J318J394Q57K03
62782G66810M50J807L132L097J737M13J40M17J31p91j296p32L80J306K096L061
$$ y = [1088046, 1066811, 1045052, 1023800, 1005038, 989443, 975756, 962459, 949186, 936278, 923949, 912410, 902005, 892562, 883354, 874418, 867097, 862189, 858169, 852708, 845761, 839675, 836007, 833701, 830976, 827670, 824656, 821964, 818796, 814992, 811248, 807896, 804472, 800644, 796850, 793655, 790860, 787436, 782242, 774982, 766861, 760105, 756303, 755072, 754577, 753208, 750446, 746492, 741914, 737699, 734821, 733352, 732536, 732003, 732313, 733879, 735972, 737487, 738332, 739279, 740690, 742147, 743316, 744250, 744667, 743852, 741817, 739812, 738919, 738712, 738203, 737743, 738789, 741719, 745051, 747270, 748441, 749268, 749409, 747870, 744780, 741725, 740167, 740283, 741378, 742666, 743459, 743390, 742995, 743602, 746082, 749927, 753835, 756960, 759231, 760838, 761982, 763038, 764356, 765750, 766607, 766810, 767260, 769067, 772199, 775296, 777033, 777446, 777586, 778003, 778134, 777343, 776047, 775315, 775695, 777001, 779097, 782158]
62766G82158L890M039L654L380L409L414L414L965N378P177Q578R210R282R388
62752H60336J0085J1406J2786J3714J4276J4708J4843J4559J4501J5536J7517
62741A014267J9544K1460K4032K7337L0102L1399L2202L4188L7576M1130M4062
62730A357299M6775M9813N3232N7297O2737O9603P6624Q2492Q7391R2413R7699
62719B133375J02030J04498J05678J06591J06956J05082R9547R0500P9245O6835
62709C100337N3308L8105K1104L072j4816l1791m7688o2440p5630q6593r4724
62698B802244r9746j02018j02643j02691j02059r9730r5626r1427q8602q6176
62688A831526q1804p4996o7969o2915n9627n6425n2325m7505m2470l7780l4018
$$ y = [782158, 786048, 790087, 793741, 797121, 800530, 803944, 807358, 811323, 816701, 823878, 832456, 841666, 850948, 860336, 870421, 881827, 894613, 908327, 922603, 937311, 952154, 966713, 981214, 996750, 1014267, 1033811, 1055271, 1079303, 1106640, 1136742, 1168141, 1200343, 1234531, 1272107, 1313237, 1357299, 1404074, 1453887, 1507119, 1564416, 1627153, 1696756, 1773380, 1855872, 1943263, 2035676, 2133375, 2235405, 2339903, 2445581, 2552172, 2659128, 2764210, 2863757, 2954257, 3033502, 3100337, 3153645, 3191750, 3212854, 3215926, 3201110, 3169319, 3121631, 3059191, 2983561, 2896968, 2802244, 2702498, 2600480, 2497837, 2395146, 2293087, 2193357, 2097731, 2006304, 1917702, 1831526, 1749722, 1674726, 1606757, 1543842, 1484215, 1427790, 1375465, 1327960, 1285490, 1247710, 1213692]
62677A213692l1150k8286k4843k1507j9241j7827j6300j4379j2463j0487p952
62666A009257m956k157L29K925N424O992P601Q380J0131J2502J5003J7814K0902
62653A110147K3362K4653K5802K8291L2107L5891L8879M1759M5510N0194N5163
62642A511758N9880O4217O8318P2412P6536Q0146Q2273Q2221Q0014P6037P0453
62631B324265O3323N5061M6244L6784K5833J2942j037j4719k7511l9542n0535
62620B431108n9827o7588p4693q0851q4083q3238q0058p7450p6186p4741p1938
62609A600455o8169o3998n9260n4119m9627m6545m4475m2739m1122l9203l6039
62598A055159l1383k6479k2866k0874j9827j8979j7689j5545j3185j2146j2850
$$ y = [1213692, 1182542, 1154256, 1129413, 1107906, 1088665, 1070838, 1054538, 1040159, 1027696, 1017209, 1009257, 1004301, 1002144, 1002473, 1005398, 1010822, 1017814, 1025415, 1033795, 1043926, 1056428, 1071431, 1089245, 1110147, 1133509, 1158162, 1183964, 1212255, 1244362, 1280253, 1319132, 1360891, 1406401, 1456595, 1511758, 1571638, 1635855, 1704173, 1776585, 1853121, 1933267, 2015540, 2097761, 2177775, 2253812, 2324265, 2387588, 2442649, 2488893, 2525677, 2551510, 2564452, 2563415, 2548696, 2521185, 2481643, 2431108, 2371281, 2303693, 2229000, 2148149, 2064066, 1980828, 1900770, 1823320, 1747134, 1672393, 1600455, 1532286, 1468288, 1409028, 1354909, 1305282, 1258737, 1214262, 1171523, 1130401, 1091198, 1055159, 1023776, 997297, 974431, 953557, 933730, 914751, 897062, 881517, 868332, 856186, 843336]
62587H43336j3471j2031r091o985o658o795o188n341n106m911l530r90J270K032
62573G65541J383J88q78j536j610j062k49K49K15M0K52J067K508M549O760Q213
62557G85630Q439Q251Q824J0056J0824J0949J1706J3961J6833J9066K0798K2959
62545I48296K5508K7530K8783L0014L1743L3743L5878L8539M1904M5389M8218
62534A335545N0074N0947N0717M9212M6468M2727L8210L2986K6932J9903J1966
62523A755687L373n610j4559k2603k8875l3501l7643m2097m6297m9077n0012m9511
62511A379275m8035m5927m3647m1531l9439l7260l5382l4078l2697l0280k6891
62500I64108k3596k1175j9474j8000j6472j4809j3100j1630j0420q938o814m685
$$ y = [843336, 829865, 817834, 808743, 801758, 795100, 788305, 782117, 776776, 771670, 766759, 763229, 762239, 763509, 765541, 766924, 767112, 766234, 764698, 763088, 762026, 761777, 762026, 762241, 762281, 762533, 763600, 766108, 770657, 777417, 785630, 794069, 802320, 811144, 821200, 832024, 842973, 854679, 868640, 885473, 904539, 925337, 948296, 973804, 1001334, 1030117, 1060131, 1091874, 1125617, 1161495, 1200034, 1241938, 1287327, 1335545, 1385619, 1436566, 1487283, 1536495, 1582963, 1625690, 1663900, 1696886, 1723818, 1743721, 1755687, 1759060, 1753450, 1738891, 1716288, 1687413, 1653912, 1616269, 1574172, 1527875, 1478798, 1428786, 1379275, 1331240, 1285313, 1241666, 1200135, 1160696, 1123436, 1088054, 1053976, 1021279, 990999, 964108, 940512, 919337, 899863, 881863, 865391, 850582, 837482, 825852, 815432, 806494, 799680, 794995]
62488G94995l564l434l209k140n41Q83J828K311K517K787L325L863M089M319N128
62473H13157O398P438P984Q420Q988R553J0154J1209J3058J5829J9515K3597K6975
62460I82275K9248L1628L5344L9516M2166M3214M4583M7020M8766M8341M6768
62449A438869M5796M5293M3840M0804L6378L0577K3746J7240J2034P199J372m737
62437A738411r086j1153j2224j2782j1655q355m475j647O92M251R382J4786J9365
62424A715510K3319K7391L1846L6412M0765M4711M7919M9769M9694M7738M4503
62413B159577M0263L4436K6382J6607O540k967j2390k2541l3218m3159n1181n7130
62401B061219o1862o6329p0528p3282p3228p0167o5414o0782n7227n4329n0907
$$ y = [794995, 791431, 787997, 784788, 782648, 782107, 782990, 784818, 787129, 789646, 792433, 795758, 799621, 803710, 808029, 813157, 819555, 826993, 834977, 843397, 852385, 861938, 872092, 883301, 896359, 912188, 931703, 955300, 982275, 1011523, 1043151, 1078495, 1118011, 1160177, 1203391, 1247974, 1294994, 1343760, 1392101, 1438869, 1484665, 1529958, 1573798, 1614602, 1650980, 1681557, 1705303, 1722543, 1734577, 1741776, 1743148, 1738411, 1729325, 1718172, 1705948, 1693166, 1681511, 1673156, 1668681, 1667034, 1667726, 1671977, 1681359, 1696145, 1715510, 1738829, 1766220, 1798066, 1834478, 1875243, 1919954, 1967873, 2017642, 2067336, 2115074, 2159577, 2199840, 2234276, 2260658, 2277265, 2283805, 2280838, 2268448, 2245907, 2212689, 2169530, 2118349, 2061219, 1999357, 1933028, 1862500, 1789218, 1715990, 1645823, 1580409, 1519627, 1462400, 1408071, 1357164]
62390A357164m6176m0503l5170l1259k8761k6739k4285k1336j8584j6629j5204
62379A052518j3412j0854q305o796o270n718m583l356k697k846m035o522r611
62366I67513j1603j1565j0543j0246j1093j2369j3595j4646j4961j3966j2165
62355H30761j0777j0241r933r227p943o016l792k465k926m198m392l277k440k611
62341G50523k590j488l16j40j25J034K770L466K991K734L369M188M666N241O171
62326G82494O924P222P657Q751J0132J1191J1935J2641J3316J4011J5159J7053
62314I18486J9337K1575K3994K6986L0166L2603L4067L5350L7225L9628M2202
62303A261619M5124M8838N3229N7741O2262O7362P3343P9591Q5066Q9014R0788
$$ y = [1357164, 1310988, 1270485, 1235315, 1204056, 1175295, 1148556, 1124271, 1102935, 1084351, 1067722, 1052518, 1039106, 1028252, 1019947, 1013151, 1006881, 1001163, 996580, 993224, 990527, 987681, 983646, 977124, 967513, 955910, 944345, 933802, 923556, 912463, 900094, 886499, 871853, 856892, 842926, 830761, 819984, 809743, 799810, 790583, 782640, 776624, 772832, 770367, 767441, 763243, 758851, 755574, 753134, 750523, 747933, 746445, 746129, 745989, 745864, 746898, 749668, 753134, 756125, 758859, 762228, 766416, 771082, 776323, 782494, 789418, 796640, 804297, 813048, 823180, 834371, 846306, 858947, 872263, 886274, 901433, 918486, 937823, 959398, 983392, 1010378, 1040544, 1073147, 1107214, 1142564, 1179789, 1219417, 1261619, 1306743, 1355581, 1408810, 1466551, 1528813, 1596175, 1669518, 1749109, 1834175, 1923189, 2013977]
62292B013977Q9523Q4836P7617O9258N9918M8474L4544J9812O558m674j5150k5872
62280B458821l6203m4781n1191n6379o1534o6757p0781p2003p0037o6218o2382
62269A800555n9113n5449n0418m4500l9319l6059l4564l3923l3502l3133l2681
62258A347894l2037l1399l1045l0721k9840k8426k7169k6131k4284k1210j8510
62247A047122j8195j9776k0428j8333j4610j1405r396q040p133o749o303n056
62235I01698l438k658l036l633l574k797j404O62K999M630N197N685P372J0293
62221I17996J3108J4510J4458J4121J4642J5989J7154J7575J7896J8961K0608
62210A097018K2141K3664K5910K8862L1687L4302L7914M3236M9143N3920N7478
$$ y = [2013977, 2103500, 2188336, 2265953, 2335211, 2395129, 2443603, 2478147, 2497959, 2504517, 2499843, 2484693, 2458821, 2422618, 2377837, 2326646, 2270267, 2208733, 2141976, 2071195, 1999192, 1929155, 1862937, 1800555, 1741442, 1685993, 1635575, 1591075, 1551756, 1515697, 1481133, 1447210, 1413708, 1380575, 1347894, 1315857, 1284458, 1253413, 1222692, 1192852, 1164426, 1137257, 1111126, 1086842, 1065632, 1047122, 1028927, 1009151, 988723, 970390, 955780, 944375, 934979, 926939, 919806, 913057, 906754, 901698, 898260, 895602, 892566, 888933, 885359, 882562, 881158, 881820, 884819, 889449, 894646, 900331, 907703, 917996, 931104, 945614, 960072, 974193, 988835, 1004824, 1021978, 1039553, 1057449, 1076410, 1097018, 1119159, 1142823, 1168733, 1197595, 1229282, 1263584, 1301498, 1344734, 1393877, 1447797, 1505275]
62199A505275O1367O6738P3104P9095Q3771Q6940Q8691Q9020Q7795Q4821P9682
62188B386299P1688O0347M6286L1488J8002O314m666j5966k7420l8286m8266n7373
62176B428447o5203p0937p4096p5000p4565p3732p2865p1505o8990o5422o1722
62165A654410n8548n5568n2015m7590m2660l7983l4482l2681l2000l1078k9233
62154A200572k7025k5071k3084k0787j8914j8155j7617j5695j2312r059p042n771
62142A000040m513l468l008k641j577K93K524M740O559P483P604Q049R909J2779
62128A044773J5011J5580J5239J5707J7872K0900K3053K3362K2458K1675K1560
62117A257190K1662K1637K1816K2548K3642K4973K7066L0434L4678L8861M2677
$$ y = [1505275, 1566642, 1633380, 1706484, 1785579, 1869350, 1956290, 2044981, 2134001, 2221796, 2306617, 2386299, 2457987, 2518334, 2564620, 2596108, 2614110, 2620424, 2615758, 2599792, 2572372, 2534086, 2485820, 2428447, 2363244, 2292307, 2218211, 2143211, 2068646, 1994914, 1922049, 1850544, 1781554, 1716132, 1654410, 1595862, 1540294, 1488279, 1440689, 1398029, 1360046, 1325564, 1292883, 1260883, 1229805, 1200572, 1173547, 1148476, 1125392, 1104605, 1085691, 1067536, 1049919, 1034224, 1021912, 1012853, 1005811, 1000040, 995527, 992059, 989051, 986410, 984833, 985126, 987650, 992390, 998949, 1006432, 1014036, 1022085, 1031994, 1044773, 1059784, 1075364, 1090603, 1106310, 1124182, 1145082, 1168135, 1191497, 1213955, 1235630, 1257190, 1278852, 1300489, 1322305, 1344853, 1368495, 1393468, 1420534, 1450968, 1485646, 1524507, 1567184]
62106A567184M6733N1710N7573O3419O7717O8949O6621O1721N5720M9083M1079
62095B197509L0986J9072O473n367j5175k2471k8044l3431l9443m5371m9835n2168
62083A962735n2717n2183n1081m9709m8027m5495m1513l6279l0845k6034k1705
62072A507147j7487j3827j1524j0318q979o944n053m016l157j576J82R40Q39R97
62058A427224J228m9l172o076o860o186n921o452o814o848p515r257j1384j3076
62044A338842j3773j2749r773o344m763n408o131m951k200O60L093N250O687O733
62030A295173N802N139N350O166P551R865J2802J5131J6116J6597J7995K0535
62018A434222K3033K4453K5140K6274K8416L0978L3087L4462L5311L5907L6762
$$ y = [1567184, 1613917, 1665627, 1723200, 1786619, 1854336, 1923285, 1989906, 2051627, 2107347, 2156430, 2197509, 2228495, 2247567, 2254040, 2248673, 2233498, 2211027, 2182983, 2149552, 2110109, 2064738, 2014903, 1962735, 1910018, 1857835, 1806754, 1757045, 1709018, 1663523, 1622010, 1585731, 1554886, 1528852, 1507147, 1489660, 1475833, 1464309, 1453991, 1445012, 1438068, 1433015, 1428999, 1425842, 1424266, 1424448, 1425388, 1426227, 1427224, 1428452, 1428403, 1425231, 1419155, 1412295, 1406109, 1400188, 1393736, 1386922, 1380074, 1372559, 1363302, 1351918, 1338842, 1325069, 1312320, 1302547, 1296203, 1291440, 1286032, 1279901, 1274950, 1272750, 1273410, 1276503, 1281753, 1288440, 1295173, 1300975, 1306114, 1311464, 1317630, 1325181, 1335046, 1347848, 1362979, 1379095, 1395692, 1413687, 1434222, 1457255, 1481708, 1506848, 1533122, 1561538, 1592516, 1625603, 1660065, 1695376, 1731283, 1768045]
62007A768045L8749M2186M5969M8451M9326M9742N0333N0073M7618M2978L7073
61996B270543L0269K2200J2707K256q360j8142k6104l2126l7346m2997m9077n4719
61984B069104n9490o3308o5459o4944o2118n8955n7199n6811n6491n5000n1743
61973A417586m6856m1372l6688l3310l0359k6778k2768j9699j8752j9762k1087
61962A100155k0673j7798j4040j1878j2119j3261j3609j3168j2867j2869j2710
61951I45163j2579j3132j4030j3791j1506p919m502k128r24p00r67r88m49J54
61937H61702K79J87M67R22O26q23k744m327n516o504o947o394n321m860n446o524
61921H08777p751r477j1436j1972r832o221l766l481m087m408m864n928o606n844
$$ y = [1768045, 1806794, 1848980, 1894949, 1943400, 1992726, 2042468, 2092801, 2142874, 2190492, 2233470, 2270543, 2300812, 2323012, 2335719, 2337975, 2329615, 2311473, 2285369, 2253243, 2215897, 2172900, 2123823, 2069104, 2009614, 1946306, 1880847, 1815903, 1753785, 1694830, 1637631, 1580820, 1524329, 1469329, 1417586, 1370730, 1329358, 1292670, 1259360, 1229001, 1202223, 1179455, 1159756, 1141004, 1121242, 1100155, 1079482, 1061684, 1047644, 1035766, 1023647, 1010386, 996777, 983609, 970742, 957873, 945163, 932584, 919452, 905422, 891631, 880125, 872206, 867704, 865576, 864652, 863952, 862985, 861997, 861548, 861702, 861981, 862168, 862635, 863557, 864183, 863360, 860616, 856289, 850773, 844269, 837322, 830928, 825607, 820747, 815301, 808777, 801026, 791549, 780113, 768141, 758309, 752088, 748322, 744841, 740754, 736346, 731482, 725554, 718948, 713104]
61907G13104m430l919m198l744k272j419k355m092m873m154k424j13K302L772
61893F81185L573K562K436L693N164N713N580N838P170R526J2327J4590J5380
61880G74737J4694J3718J3750J4992J6635J7845J8255J7818J6753J5655J5110
61869I49962J5054J4810J3871J2352J0581Q634O463M231K256P32m29j506k660
61856A034351l479l081j134J266K520K488K743M398O568P790Q195R086J0705J1809
61842A094225J1516J0250Q488N839K156j433l628m538n243o233p133p763q478
61829A088025r466j0503j1505j2715j4054j4777j4100j2101r905q885r408j0359
61817I50247j0306r355r129j0514j2164j2164j0485q701p655o699n268l736k401
$$ y = [713104, 708674, 704755, 700557, 696813, 694541, 693122, 690767, 686675, 681802, 677648, 675224, 675111, 677413, 681185, 684758, 687320, 689756, 693449, 698613, 704326, 709906, 715744, 722914, 732440, 744767, 759357, 774737, 789431, 803149, 816899, 831891, 848526, 866371, 884626, 902444, 919197, 934852, 949962, 965016, 979826, 993697, 1006049, 1016630, 1025264, 1031727, 1035958, 1038214, 1038946, 1038517, 1037011, 1034351, 1030872, 1027791, 1026657, 1027923, 1030443, 1032931, 1035674, 1040072, 1046640, 1054430, 1062625, 1071711, 1082416, 1094225, 1105741, 1115991, 1124479, 1130318, 1132474, 1131041, 1127413, 1122875, 1117632, 1111399, 1104266, 1096503, 1088025, 1078559, 1068056, 1056551, 1043836, 1029782, 1015005, 1000905, 988804, 978899, 970014, 960606, 950247, 939941, 930586, 921457, 910943, 898779, 886615, 876130, 867429, 859774, 853075, 847807, 844071, 841670]
61804H41670p55J562L960N653O608P235P777Q463R697J1634J4003J6584J9284
61791I53375K1642K3101K4059K5557K7506K8338K7186K5179K3636K2176J9875
61780A221630J7120J4686J1811P213J568k899n235o351o908o606n738n327n026
61767A229938k957J298N371P072P096P301P720P091N300L311J182j942o041j0029
61753A261711j3375j6464j9384k1690k3418k5035k6226k6052k4525k2802k1558
61742A021182k0388j9142j8482j8554j8333j7116j5659j4975j4779j3979j2084
61731H37691r499p009n539n655o701p141o417n685n951o451n938m737m147m328
61717G52493m225l411k580k174j853j505j694k577l384l327k437j210j08N47Q20
$$ y = [841670, 840915, 842477, 846437, 852090, 858698, 865933, 873710, 882173, 891870, 903504, 917507, 934091, 953375, 975017, 998118, 1022177, 1047734, 1075240, 1103578, 1130764, 1155943, 1179579, 1201755, 1221630, 1238750, 1253436, 1265247, 1272460, 1274028, 1271129, 1265894, 1259543, 1252635, 1246029, 1240291, 1234964, 1229938, 1226981, 1228279, 1233650, 1240722, 1247818, 1255119, 1262839, 1269930, 1275230, 1278541, 1279723, 1277781, 1271740, 1261711, 1248336, 1231872, 1212488, 1190798, 1167380, 1142345, 1116119, 1090067, 1065542, 1042740, 1021182, 1000794, 981652, 963170, 944616, 926283, 909167, 893508, 878533, 863754, 849775, 837691, 828192, 821183, 815644, 809989, 803288, 796147, 789730, 784045, 778094, 771643, 765705, 760968, 756821, 752493, 748268, 744857, 742277, 740103, 738250, 736745, 735051, 732474, 729090, 725763, 723326, 722116, 722008, 722555, 723375]
61702G23375J381K652L834L802K958K887L882M310L114J568J497K855M292N046
61688G67453M923L275j70l853n506m926m122m489n318n440m866l966k353J89K456
61673G33287K733P94j854l550l642k387n34R39J361R58O83J391L264N680P349
61658G46472P015M705K148J203J796K163J247J8n8Q61J262L15j359k976m614o422
61642G53776p554o866m634k690k567l964n379n804n410m845m514m566n013n590
61628F84380n739n073l793k477j568j195j326j857k512k847k536j701r39r27j852
61613F48038l143l826l267j680k7O66P0j213k174k211j461l96N77J076O51p49
61597F30931k328k829j637O89K981M325M378L247J438j69o94O1J228J523O05k79
$$ y = [723375, 724756, 727408, 731242, 735044, 738002, 740889, 744771, 749081, 752195, 753763, 755260, 758115, 762407, 767453, 772376, 775651, 775481, 771628, 766122, 761196, 757074, 752585, 747267, 741827, 736961, 732995, 730642, 730831, 733287, 736020, 736814, 734960, 731410, 727768, 725381, 724847, 725786, 727147, 728105, 728788, 730179, 733443, 739123, 746472, 753487, 758192, 760340, 761543, 763339, 765502, 766749, 766767, 766709, 767570, 768832, 769147, 767788, 764812, 760198, 753776, 746222, 739356, 734722, 732032, 729465, 725501, 720122, 714318, 708908, 704063, 699549, 694983, 689970, 684380, 678641, 673568, 669775, 667298, 665730, 664535, 663209, 661352, 658840, 655993, 653457, 651756, 650817, 649890, 648038, 644895, 641069, 637802, 636122, 636095, 636761, 636831, 635618, 633444, 631233, 629772, 629376, 629953, 631029, 631680, 630931, 628603, 625774, 624137, 624826, 627807, 632132, 636510, 639757, 641195, 641026, 640332, 640393, 641621, 643144, 643749, 643470]
61581F43470M52K618M103L360J496R47K289L608L128J245o30k066l484m781n367
61566F50388n189m664l736k073k03O86K33p12j476k280l227l720l567l705m833
61551F11922o047n962m774l997m330n001n269n352n559n617n445n617o317o602
61537E36033n692m361m034m790n285m599l216k120j792k200k981l403k918k009
61523D86633j786k489l194l255l102l160k977k158j300j036r13k32O00P12J92
61508D62535l17q97j819k195r04J197J880O80m36q0P37O92K80M90Q51N16J08P17
61490D64035J827K036J375J169J827K427K389K029J508P33K94Q05J320K57j816
61475D82215k272p6K570L344K732K378K134Q11j105j833j174q19j524j859o24
$$ y = [643470, 643922, 646540, 650643, 654003, 655499, 656446, 658735, 662343, 665471, 666716, 666086, 664020, 660536, 655755, 650388, 645199, 640535, 636799, 634726, 634523, 635209, 635442, 634730, 633254, 630974, 627747, 624027, 620460, 616755, 611922, 605875, 599913, 595139, 591142, 586812, 581811, 576542, 571190, 565631, 560014, 554569, 548952, 542635, 536033, 530341, 525980, 521946, 517156, 511871, 507272, 504056, 501936, 500144, 497944, 494963, 491560, 488642, 486633, 484847, 482358, 479164, 475909, 472807, 469647, 466670, 464512, 463212, 462176, 461263, 461031, 461631, 462343, 462535, 462218, 461321, 459502, 457307, 456403, 457600, 459480, 460160, 459724, 459644, 460381, 461073, 461353, 461843, 462694, 463210, 463318, 464035, 465862, 467898, 469273, 470442, 472269, 474696, 477085, 479114, 480622, 481355, 481649, 482454, 483774, 484031, 482215, 479943, 479867, 482437, 485781, 488513, 490891, 493025, 493836, 492731, 490898, 489724, 488905, 487381, 485522, 484898]
61460D84898J010J060m77j664j233o6J46j071k619l181k457j192l22j64k69O9
61444D72468J078K157K357J355j97j415k088k516k604j688M60K816L701K347k16
61429D78015j916j453N77K466L170K963K379J310l01j585j511k57J007J633J973
61414D88470K479L220M196N188N235L414M06j766j984j122m52o5M92R42O27m25
61398E08855j447j689p87R07K107J537l02j238J9K266L503L387L002L007L160
61383E26287L146K779J811M89j52M71J568K225K793L792M281L046J011N42K245
61368E56334M125M301L092J923J439J314J012K81m77l05J012K031J196q12j765
61353E74701q59N25J219J556J828J334p9j262j591k047l226l833k661p95o4l38
$$ y = [484898, 485908, 486968, 486491, 484827, 483594, 483528, 483674, 482603, 479984, 476803, 474346, 473154, 472832, 472668, 472399, 472468, 473546, 475703, 478060, 479415, 479218, 477803, 475715, 473199, 470595, 468907, 469367, 472183, 475884, 478231, 478015, 476099, 474646, 475223, 477689, 480859, 483822, 486201, 487511, 487210, 485625, 484114, 483857, 484864, 486497, 488470, 490949, 494169, 498365, 503553, 508788, 512202, 512608, 510842, 508858, 507736, 507284, 507219, 507711, 508653, 509280, 508855, 507408, 505719, 504932, 505839, 507946, 509483, 509181, 507943, 507962, 510228, 513731, 517118, 520120, 523127, 526287, 529433, 532212, 534023, 534512, 534360, 534831, 536399, 538624, 541417, 545209, 549490, 552536, 553547, 554089, 556334, 560459, 564760, 567852, 569775, 571214, 572528, 573540, 573821, 573344, 573039, 574051, 576082, 577278, 576466, 574701, 573842, 574367, 575586, 577142, 578970, 580304, 580225, 578963, 577372, 575325, 572099, 568266, 565605, 564810, 564746, 564408]
61337E64408k13L70K25o84r83j11Q70R95M93j38q28j249p22O55J736J743J062
61320E67629K33q24j903j878jK744M643N281N592O064N960M625K658J253Q46J098
61304F04020J779K916M035M175L055J755J599K573L463L462L120L579N339P886
61290F52756J0161J1203J0767R532Q458P816P047N718M226L388L564M352N042
61277G44030N229N144N315N845O134N573M244K710J390N73N96J264J497N07q86
61262G89165j126q4P84N97P6J24O14J225K348M259O236P371P726Q048Q871J0351
61246H46585J2284J3768J3683J2084J0303R129P860N856L860K738J897J54k472
61233I37729m958o649p465p535p580q699j0540j0812q166m604l200m126m952m371
$$ y = [564408, 564195, 564565, 564790, 564106, 563123, 563012, 563882, 564877, 565370, 565232, 564404, 563155, 562433, 563088, 564824, 566567, 567629, 567862, 567038, 565135, 563257, 563256, 566000, 570643, 575924, 581516, 587580, 593540, 598165, 600823, 602076, 602922, 604020, 605799, 608715, 612750, 616925, 619980, 621735, 623334, 625907, 629370, 632832, 635952, 639531, 644870, 652756, 662917, 674120, 684887, 694419, 702877, 710693, 717740, 723458, 727684, 731072, 734636, 738988, 744030, 749259, 754403, 759718, 765563, 771697, 777270, 781514, 784224, 785614, 786187, 786783, 788047, 789544, 790051, 789165, 788039, 787955, 788739, 789336, 789412, 789536, 790150, 791375, 793723, 797982, 804218, 811589, 819315, 827363, 836234, 846585, 858869, 872637, 886320, 898404, 908707, 917836, 925696, 931552, 935412, 938150, 940047, 940201, 937729, 932771, 926122, 918657, 911122, 903542, 894843, 884303, 873491, 865325, 860721, 857521, 853395, 848443, 844072]
61219H44072l355k742k025r43j22L89J440K929L451K522J581J867K845L673M701
61204H60283O375P834Q009P249O769P144Q137R211R413P681M338J416M96R19J139
61189I46413R30R97J179O30n38j230r60k99K76Q26J190Q64m7p57j008j463k461
61172I44542l141k490q05O61J343J972L373N157O124N796N028M880N308N445M940
61157I88133M423M638N573O601P164P217P170P322P235O090M066K742L339M951
61143A066664N682N289N464P299R859J1650J2357J2561J2792J3442J4578J5235
61131A192872J3997J1037Q376P148N906K967o06k194j277k3k96j682k826l307
61117A230092l641m265n156n906n972n302m701m864n195m501k880j901k534l991
$$ y = [844072, 840717, 837975, 835950, 835007, 834885, 835274, 836714, 839643, 843094, 845616, 847197, 849064, 851909, 855582, 860283, 866658, 874492, 882501, 889750, 896519, 903663, 911800, 921011, 930424, 938105, 942443, 943859, 944355, 945274, 946413, 947343, 948340, 949519, 950149, 949611, 948381, 947421, 947122, 947398, 948224, 949414, 950278, 950231, 949474, 948466, 947003, 944542, 941401, 938911, 938106, 938767, 940110, 942082, 945455, 950612, 956736, 962532, 967560, 972440, 977748, 983193, 988133, 992556, 997194, 1002767, 1009368, 1016532, 1023749, 1030919, 1038241, 1045476, 1051566, 1055632, 1058374, 1061713, 1066664, 1072346, 1077635, 1083099, 1090398, 1100257, 1111907, 1124264, 1136825, 1149617, 1163059, 1177637, 1192872, 1206869, 1217906, 1226282, 1233430, 1239336, 1242303, 1241697, 1239503, 1238226, 1238203, 1237907, 1236225, 1233399, 1230092, 1226451, 1222186, 1217030, 1211124, 1205152, 1199850, 1195149, 1190285, 1185090, 1180589, 1177709, 1175808, 1173274, 1169283]
61103A169283n152o255q216j0846j2808j3218j2439j1198r709q135p217p616q693
61090A047781q788p107m807l664m042m872n358n813o695p686q168p948p109n721
61076I60003m141l028k519j916o53Q27J759K126K562L618N691R034J2968J5614
61062A001945J5577J3828J3000J4664J8041K1370K3624K4635K4560K3987K4027
61051A219258K5370K7210K7728K6072K3630K2750K4077K5737K5576K3590K1178
61040A492176J8468J3992P423J116k281k855l017m640p687j1246j4512j6847j7923
61027A452167j8103j8058j8027j7930j7970j8326j8486j7754j6346j5172j4551
61016A261444j3913j2749j1061q906o406m353l839m869n948n448l042L89L764
$$ y = [1169283, 1164131, 1157876, 1149660, 1138814, 1126006, 1112788, 1100349, 1089151, 1079442, 1071307, 1064090, 1056474, 1047781, 1038993, 1031886, 1027079, 1023415, 1019373, 1014501, 1009143, 1003330, 996635, 988949, 980781, 972833, 965724, 960003, 955862, 952834, 950315, 948399, 947746, 948573, 950332, 952458, 955020, 958638, 964329, 973363, 986331, 1001945, 1017522, 1031350, 1044350, 1059014, 1077055, 1098425, 1122049, 1146684, 1171244, 1195231, 1219258, 1244628, 1271838, 1299566, 1325638, 1349268, 1372018, 1396095, 1421832, 1447408, 1470998, 1492176, 1510644, 1524636, 1532059, 1533175, 1530894, 1528039, 1525022, 1520382, 1512695, 1501449, 1486937, 1470090, 1452167, 1434064, 1416006, 1397979, 1380049, 1362079, 1343753, 1325267, 1307513, 1291167, 1275995, 1261444, 1247531, 1234782, 1223721, 1214815, 1208409, 1204056, 1200217, 1195348, 1189400, 1183952, 1180910, 1181299, 1185063]
61003A185063O546Q888J1234J3660J5667J6990J8272K0381K3148K5458K6622K7164
60991A399093K8226L0616L4426L9121M3960M8669N3594N8995O4555O9935P5386
60980A946576Q1245Q7423R3975J01544J10354J19357J27476J35238J43915J53367
60970C100470J62136J69667J77138J86015J97008K10513K26725K44853K63507
60961D938032K82337L02426L24885L50344L80622M19751M72295N40452O22670
60952H633814P14476Q11161R10942J015812J128845J251861J387292J539346J705575
60943A9099124J862229J961275J949726J797428J509799J121248O86050K76105
60935C0262984k8564j71611j59053o7197l800n2168k42226n58576r58084j375697
$$ y = [1185063, 1191609, 1200497, 1211731, 1225391, 1241058, 1258048, 1276320, 1296701, 1319849, 1345307, 1371929, 1399093, 1427319, 1457935, 1492361, 1531482, 1575442, 1624111, 1677705, 1736700, 1801255, 1871190, 1946576, 2027821, 2115244, 2209219, 2310763, 2421117, 2540474, 2667950, 2803188, 2947103, 3100470, 3262606, 3432273, 3609411, 3795426, 3992434, 4202947, 4429672, 4674525, 4938032, 5220369, 5522795, 5847680, 6198024, 6578646, 6998397, 7470692, 8011144, 8633814, 9348290, 10159451, 11070393, 12086205, 13215050, 14466911, 15854203, 17393549, 19099124, 20961353, 22922628, 24872354, 26669782, 28179581, 29300829, 29986879, 30262984, 30234420, 30062809, 29903756, 29836559, 29832759, 29780591, 29538365, 28979789, 28021705, 26646008]
60925B6646008j730424j950692k008131j927996j765699j573444j383913j212640
60917A3093069j064739r38919q30981p37312o55762n84687n22998m70497m26616
60908F860558l89437l57207l29835l07275k87316k66890k45117k23415k03108
60899D250958j84536j68143j54544j43525j34315j26740j20792j15420j09224
60890B993719j02267r5814r0378q5410q0746p6855p3620p0255o6526o2787n8938
60879B130123n4794n1387n0150n0434m9657m6611m3151m1633m1894m1853m0276
60868A618283l7855l5808l4422l2968l0804k8298k6497k5797k5406k4628k3901
60857A291899k3801k3609k2228k0045j8423j7507j6123j3920j1934j0628r100
$$ y = [26646008, 24915584, 22964892, 20956761, 19028765, 17263066, 15689622, 14305709, 13093069, 12028330, 11089411, 10258430, 9521118, 8865356, 8280669, 7757671, 7287174, 6860558, 6471121, 6113914, 5784079, 5476804, 5189488, 4922598, 4677481, 4454066, 4250958, 4066422, 3898279, 3743735, 3600210, 3465895, 3339155, 3218363, 3102943, 2993719, 2891452, 2795638, 2705260, 2619850, 2539104, 2462249, 2388629, 2318374, 2251848, 2189061, 2130123, 2075329, 2023942, 1973792, 1923358, 1873701, 1827090, 1783939, 1742306, 1700412, 1658559, 1618283, 1580428, 1544620, 1510198, 1477230, 1446426, 1418128, 1391631, 1365834, 1340428, 1315800, 1291899, 1268098, 1244489, 1222261, 1202216, 1183793, 1166286, 1150163, 1136243, 1124309, 1113681, 1104581]
60846A104581p012n695o229p610q003p057n858n147m698m079l236k487k399l347
60832A031724m764n389m745l862m025n337o973q361r527j0689j1867j2646j2182
60819I31357j0196q055p815r689j1539j1522j0197r083q314p134n843n511n990
60806H20469n912m821l858l926m492m829n371o790q378q404o075k516L59J525
60792G56981J256K86j015k492l718m152l784l115k355j252N4O65O4q85r40k44
60776G35354j92j551l563n105n811n684m507k444o03j06o91j077o36L5K29j5m46
60759G03187j097j669j261L24J595Q52j491l338l708l752m505n190m796m097m527
60744F66527n656n563l706j889k022m030o379p571o846m526k205j635k777l859
$$ y = [1104581, 1097569, 1091874, 1085645, 1078035, 1070032, 1062975, 1057117, 1051970, 1047272, 1043193, 1039957, 1037470, 1035071, 1031724, 1026960, 1021571, 1016826, 1012964, 1008939, 1003602, 996629, 988268, 978741, 968052, 956185, 943539, 931357, 921161, 913106, 905291, 895602, 884063, 872541, 862344, 853261, 844947, 837813, 831970, 826459, 820469, 814557, 809736, 805878, 801952, 797460, 792631, 787260, 780470, 772092, 763688, 757613, 755097, 755456, 756981, 758237, 758523, 757508, 755016, 751298, 747146, 743362, 740247, 737892, 736640, 736694, 737359, 737423, 736538, 735598, 735354, 735162, 733611, 730048, 724943, 719132, 713448, 708941, 706497, 705894, 705788, 705097, 704020, 703384, 703419, 703648, 703633, 703187, 702090, 700421, 699160, 699484, 701079, 701931, 700440, 697102, 693394, 689642, 685137, 679947, 675151, 671054, 666527, 660871, 655308, 651602, 649713, 647691, 643661, 637282, 629711, 622865, 618339, 616134, 614499, 611722, 607863]
60730F07863l804l524m073m694m034k415j366j315j345j147j602k965l874k943
60716E68762m86K035L514L552K174K76k67J698M746N972M368K121J887L626N069
60701F09047M777L441K295J505O82o0k50K36J165K199K641J671m57k038j739l66
60685F24749J93n66j531k013k529l429m123m323m856o403q235r002q156o025l204
60670E60547n50Q27N05p74k126l427m597m779l353j233qLk91n16j276k682l686
60653E32584l401k292j410j045p26j76L50N43N30Q21J808L262M345M365L528K718
60637E45804K563K914L184K906J998Q82K58M81J142J645K074K999M374N244M901
60622E83369L861L277L580M141M170L595K956K719K836K875K432J473L97k76m58
$$ y = [607863, 604059, 600535, 596462, 591768, 587734, 585319, 583953, 582638, 581293, 580146, 578544, 575579, 571705, 568762, 568276, 570311, 573825, 577377, 579551, 579827, 579560, 581258, 586004, 591976, 596344, 598465, 600352, 603978, 609047, 613824, 617265, 619560, 621065, 621747, 621687, 621437, 621673, 622838, 625037, 627678, 629349, 628892, 626854, 625115, 624749, 624942, 624376, 622845, 620832, 618303, 614874, 610751, 606428, 601572, 595169, 586934, 577932, 569776, 563751, 560547, 559997, 560824, 561329, 560555, 558429, 555002, 550405, 545626, 542273, 541040, 541032, 541035, 540744, 540228, 538952, 536270, 532584, 529183, 526891, 525481, 524436, 523710, 523534, 523884, 524427, 524957, 525778, 527586, 530848, 535193, 539558, 543086, 545804, 548367, 551281, 554465, 557371, 559369, 560251, 560509, 560990, 562132, 563777, 565851, 568850, 573224, 578468, 583369, 587230, 590507, 594087, 598228, 602398, 605993, 608949, 611668, 614504, 617379, 619811, 621284, 621681, 621405, 620947]
60607F20947p04j688l273m453m452l700l267l536l925l887l520l050k355j344
60593E77793k65P11J733K661K711J375n64j518o32J431L125L286K070P88M80N36
60577E95721n68k987m913m892l798l491m226m677m115l141k373j720j149r58r92
60562E51721o54J8L13J89N00J465K056J602R29J058J688J876J542J323J416J475
60546E68517J260P43J6k96P44K885M288L705K299J958K478K210J117R64K161K723
60530E97772J320m83n77O16J180R10J421L355N377O145N831N200M590M353N115
60515F42125O771Q066Q089P603Q042R622J1331J2448J3115J3444J2972J1374R115
60502G74117O944N074L190J080j079l022m647n835o117m873k074J304L977N520
$$ y = [620947, 620243, 618555, 615282, 610829, 606377, 602677, 599410, 595874, 591949, 588062, 584542, 581492, 579137, 577793, 577528, 578239, 579972, 582633, 585344, 586719, 586155, 584637, 584005, 585436, 588561, 591847, 593917, 594705, 595185, 595721, 595153, 592166, 587253, 582361, 578563, 575072, 570846, 566169, 562054, 558913, 556540, 554820, 553671, 552713, 551721, 551067, 551085, 551398, 551587, 552087, 553552, 555608, 557210, 558139, 559197, 560885, 562761, 564303, 565626, 567042, 568517, 569777, 570520, 570536, 570240, 570984, 573869, 578157, 581862, 584161, 586119, 588597, 590807, 591924, 592888, 595049, 597772, 599092, 598609, 598032, 598648, 599828, 600738, 602159, 605514, 610891, 617036, 622867, 628067, 632657, 637010, 642125, 648896, 656962, 665051, 672654, 680696, 690318, 701649, 714097, 727212, 740656, 753628, 765002, 774117, 781061, 786135, 789325, 790405, 789326, 786304, 781657, 775822, 769705, 764832, 762758, 764062, 768039, 773559]
60488G73559O564P816R349J0980J2756J4605J5998J6613J7045J8106J9605K0505
60476I43501K0269J9203J7358J4100R322M417J184o7p44k254m518o345o936o653
60462A001837o265n816m715k929j331m65L74K086M216N571O186P421R872J2354
60448A028396J3706J4547J6431J9916K4435K9470L4810L9813M3555M5888M7589
60437A358556M9294N0679N0894M9398M6360M2465L8276L3397K6436J6279L515
60426A765549r727k1440l1049l9112m6042n1357n4331n5324n5907n7102n7794
60415A286364n5962n1527m6723m3182m0001l5774l1209k8150k6699k5164k2701
60404H79272k0153j8188j6281j4165j2751j2670j3015j2406j0615q421o597n690
$$ y = [773559, 780123, 787939, 797288, 808268, 821024, 835629, 851627, 868240, 885285, 903391, 922996, 943501, 963770, 982973, 1000331, 1014431, 1023753, 1028170, 1029354, 1029287, 1028543, 1026289, 1021771, 1015426, 1008490, 1001837, 995572, 989756, 985041, 982112, 980781, 980316, 980690, 982776, 986992, 992563, 998749, 1006170, 1016042, 1028396, 1042102, 1056649, 1073080, 1092996, 1117431, 1146901, 1181711, 1221524, 1265079, 1310967, 1358556, 1407850, 1458529, 1509423, 1558821, 1605181, 1647646, 1685922, 1719319, 1745755, 1762034, 1765549, 1755822, 1734382, 1703333, 1664221, 1618179, 1566822, 1512491, 1457167, 1401260, 1344158, 1286364, 1230402, 1178875, 1132152, 1088970, 1048969, 1013195, 981986, 953836, 927137, 901973, 879272, 859119, 840931, 824650, 810485, 797734, 785064, 772049, 759643, 749028, 740607, 734010, 728320]
60392G28320n985o955p413o972o652p250p845o945m570k162p91n47j349l096m936
60377F54852n588m742l383k446j925j522j272j230j227j355j920k486j823M18
60363F24351K583K614O07j133o85J474L146K651K34k266k992j542Q72K760L598
60348F36272L602K792J182l59m99R03K383K586J750R63P49J048J829K804L061
60333F61066K135J132J587L429N136N818N846N432M184K474J692K366L282L441
60319G09020L655M973O607O865N514L850K876K708L328M469N028M081K530K281
60305G67785L687N111N253M542L925L643L761M629O069P213P850Q854J0503J1439
60291H54264J0535Q796Q006Q017O923L875K53k295l763n119o531p232o839o106
$$ y = [728320, 722335, 715380, 707967, 700995, 694343, 687093, 679248, 672303, 667733, 665571, 664780, 664233, 662884, 659788, 654852, 649264, 644522, 641139, 638693, 636768, 635246, 633974, 632744, 631517, 630162, 628242, 625756, 623933, 624351, 626934, 629548, 630155, 629022, 628337, 629811, 632957, 635608, 635842, 633576, 630584, 629042, 629914, 632674, 636272, 639874, 642666, 643848, 643489, 642990, 643893, 646276, 648862, 650612, 651575, 652324, 653372, 655201, 658005, 661066, 663201, 664333, 665920, 669349, 674485, 680303, 686149, 691581, 695765, 698239, 699931, 702297, 705579, 709020, 712675, 717648, 724255, 731120, 736634, 740484, 743360, 746068, 749396, 753865, 758893, 762974, 765504, 767785, 771472, 776583, 781836, 786378, 790303, 793946, 797707, 802336, 808405, 815618, 823468, 832322, 842825, 854264, 864799, 873595, 881601, 889618, 896541, 900416, 900669, 898374, 894611, 889492, 882961, 875729, 868890, 862784]
60277H62784o086o923p678p365n945m283l209k788k537k203k183l032m562n575
60263G98415m889k710n60M03O45J513L607O340Q801J0414J1011J0980J1184J2128
60249H67282J3288J3865J4044J4672J5843J6691J6604J5587J3389R415L993j313
60237A013360n336q619j2439j7087k1405k3631k2572j8749j4585j2462j2209j1533
60225H32733r347p339p348q456q178n864l354k376k708l097k953k721k956l461
60211G62575l405k455j606k225m128n478m938l006q70R23J929J296r31l067l673
60196G30941l369l354l118j455R07J811P66m67m90L25J244K105K425J485Ko9J603
60179G31292K763J705j55l37J238K566K528J842J362J118J134J780K878L457K962
$$ y = [862784, 856698, 849775, 842097, 834732, 828787, 824504, 821295, 818507, 815970, 813767, 811584, 808552, 803990, 798415, 793526, 790816, 790256, 790659, 791304, 792817, 796424, 802764, 811565, 821979, 832990, 843970, 855154, 867282, 880570, 894435, 908479, 923151, 938994, 955685, 972289, 987876, 1001265, 1010680, 1014673, 1013360, 1008024, 999405, 986966, 969879, 948474, 924843, 902271, 883522, 868937, 856475, 844266, 832733, 823386, 816047, 808699, 800243, 792065, 786201, 782847, 780471, 777763, 774666, 771713, 768992, 766036, 762575, 759170, 756715, 755109, 752884, 748756, 743278, 738340, 735334, 734464, 735387, 737316, 738612, 737681, 734614, 730941, 727572, 724218, 721100, 719645, 720552, 722363, 723129, 722662, 722172, 722497, 723741, 725846, 728271, 729756, 729758, 729689, 731292, 734055, 735760, 735605, 735268, 736506, 739072, 741600, 743442, 744804, 745922, 747056, 748836, 751714, 755171, 758133]
60164G58133K086J891K439K777K219J350J468L026N014O244O910Q032R555J0046
60150H21190Q770O998O447P094P550P194O869P489Q751R583R328Q214O918N940
60136I28335N361N057M984N165N462N616N426M763L571K226J403J172N41j214
60122I77868l197m014m039m973p036q289p476n852n124n030m386l355k996l410
60108I08691l941m512n140m861k989j021j115k882l814l023k237k598k793j514
60094H66251K52Q37K87k66m29l58J74J121J530R18M33J200K400K598K233K904
60078H82085M676O001O246O356O833O843N879M708M024L543L081L283M448N718
60064I53724O194N975N364M081K180P51P10J529K119K329K595K768K404J777J556
$$ y = [758133, 760219, 762110, 764549, 767326, 769545, 770895, 772363, 775389, 780403, 786647, 793557, 801589, 811144, 821190, 829960, 836958, 843405, 850499, 858049, 865243, 872112, 879601, 888352, 897935, 907263, 915477, 922395, 928335, 933696, 938753, 943737, 948902, 954364, 959980, 965406, 970169, 973740, 975966, 977369, 978541, 979082, 977868, 974671, 970657, 966618, 961645, 954609, 946320, 938844, 932992, 927868, 922838, 918452, 915097, 912101, 908691, 904750, 900238, 895098, 890237, 887248, 886227, 885112, 882230, 878416, 875393, 873156, 870558, 867765, 866251, 866503, 867340, 867627, 867361, 866932, 866574, 866748, 867869, 869399, 870317, 870750, 871950, 874350, 876948, 879181, 882085, 886761, 892762, 899008, 905364, 912197, 919040, 924919, 929627, 933651, 937194, 940275, 943558, 948006, 953724, 959918, 965893, 971257, 975338, 977518, 978269, 978979, 980508, 982627, 984956, 987551, 990319, 992723, 994500, 996056]
60049I96056J754J976K323K989L331K524R64j76p64j764l372m432m135l148k397
60034I91729j810j078p26j444k797l607l442l006l058l565m000m043l798l498
60020I51857l104k368j417j062k047l989n549n809n018m037l622m317o244q569
60006H94705r864r546q428p491o751n927n485o128p598q749q690p293m897k187
59992G95671l9J163J847K420K591K256K260L109L522J935o47j185J486M975O455
59977H27819N942N174M575L232J281K11O06J239R75K42j59n76j787l463m512m601
59961H36198m341m178m122m518n982q249j0063j0635j0385r833q690o790n073
59948G43339m544m853m978m793m811m783m087l212l188l512k570m54O97O9k65
$$ y = [996056, 997810, 999786, 1002109, 1005098, 1008429, 1010953, 1011917, 1011741, 1010977, 1009213, 1005841, 1001409, 997274, 994126, 991729, 989919, 988841, 988115, 986671, 983874, 980267, 976825, 973819, 970761, 967196, 963196, 959153, 955355, 951857, 948753, 946385, 944968, 943906, 941859, 937870, 932321, 926512, 921494, 917457, 913835, 909518, 903274, 894705, 884841, 875295, 866867, 859376, 852625, 846698, 841213, 835085, 827487, 818738, 810048, 802755, 797858, 795671, 795632, 796795, 798642, 801062, 803653, 805909, 808169, 811278, 814800, 816735, 816088, 814903, 816389, 821364, 827819, 833761, 838935, 843510, 846742, 848023, 848234, 848840, 850079, 851054, 851296, 851137, 850561, 848774, 845311, 840799, 836198, 831857, 827679, 823557, 819039, 813057, 804808, 794745, 784110, 773725, 763892, 755202, 748412, 743339, 738795, 733942, 728964, 724171, 719360, 714577, 710490, 707278, 704090, 700578, 698008, 697554, 698251, 698320, 698055]
59933F98055J355L305L207J787J581K683K726R08p62p92j06K68J101L095N017
59918G23428N440M946M860M800L342N86j752k681k937l466m091m002k924j389
59904G24160k12K19K42L44L23k65q26n8J821K561P31j909k454n53J586K445K482
59887G30637K249J358j20r71o11j23m79r05k02J238K064J923J566J394J206J159
59871G41383J693K389K186J029K63Q81K281L370M141N261O548P009O431N942O469
59856G97276P287O821M727K442J492J896K517K527J940J089L38K86J411L180M163
59841H39392L600K349J809K260K993L675M669N918O498N783M360L300K960L060
59827H92626L529M510N690O314O028N167M161L110K125J561J649K178K760L148
$$ y = [698055, 699410, 702715, 705922, 707709, 709290, 711973, 714699, 715607, 714845, 714053, 713947, 714215, 715316, 718411, 723428, 728868, 733814, 738674, 743474, 746816, 747402, 745650, 742969, 740032, 736566, 732475, 728473, 725549, 724160, 723948, 724167, 724409, 724753, 725076, 724811, 723985, 723927, 725748, 728309, 729040, 727131, 724677, 724124, 725710, 728155, 730637, 732886, 734244, 734124, 733153, 732542, 732419, 731940, 731035, 730833, 732071, 734135, 736058, 737624, 739018, 740224, 741383, 743076, 745465, 747651, 748680, 748943, 749824, 752105, 755475, 759616, 764877, 771425, 778434, 784865, 790807, 797276, 804563, 811384, 816111, 818553, 820045, 821941, 824458, 826985, 828925, 830014, 830352, 830638, 832049, 835229, 839392, 842992, 845341, 847150, 849410, 852403, 856078, 860747, 866665, 873163, 878946, 883306, 886606, 889566, 892626, 896155, 900665, 906355, 912669, 918697, 923864, 928025, 931135, 933260, 934821, 936470, 938648, 941408, 944556]
59813I44556L082K318J060l0o46j249k229l030k768j455Q7J401K656L706L889
59798I51348L154K649L471N291O821P334P175O908O559N675L848J187j446k928
59784A007046k944k326k034k189k567l461n223p248q509r020r654j0389j0028
59771I31454q308o869p088p902p202m855k817k350k701k786k747l177l842m128
59757H64682l982l657l114k400k048k331k597k227j783k185l069l084j837m03
59743H29965K27K02j7n27j472k423k878k909k721k174j172j77L12L69K71j04q54
59726H13918j350p52P59J836J283o38k288k083r9J789J769J26j135p59N12J468
59710H14356K012K499K518J711J080J962L791M481L318K073K673M795O534O737
$$ y = [944556, 947638, 949956, 951016, 950986, 950340, 949091, 946862, 943832, 941064, 939609, 939696, 941097, 943753, 947459, 951348, 954502, 957151, 960622, 965913, 972734, 980068, 987243, 994151, 1000710, 1006385, 1010233, 1011420, 1009974, 1007046, 1004102, 1001776, 999742, 997553, 994986, 991525, 986302, 979054, 970545, 961525, 951871, 941482, 931454, 923146, 916277, 909189, 901287, 894085, 889230, 886413, 884063, 881362, 878576, 875829, 872652, 868810, 864682, 860700, 857043, 853929, 851529, 849481, 847150, 844553, 842326, 840543, 838358, 835289, 832205, 830368, 829965, 830192, 830394, 830377, 829850, 828378, 825955, 823077, 820168, 817447, 815273, 814101, 813924, 814236, 814605, 814876, 814772, 813918, 812568, 811816, 812575, 814411, 815694, 815056, 812768, 810685, 810586, 812375, 814144, 814270, 813135, 812376, 812888, 814356, 816368, 818867, 821385, 823096, 824176, 826138, 829929, 834410, 837728, 839801, 842474, 847269, 853803, 860540]
59696H60540N907N217N354O168P042P580P993Q649R437R999J0424J1044J1558
59683I66912J1182R851Q519P931P678O885N282L315J691J044J483K169J929N70
59669A036441r45j886k593l560m396m381l507k375j513j267j875l053m019m404
59655I96667m658n051m975l890k343j196m07L87O96q4j071o24J201K305J389q1
59639I78265K59K599M815N100L747K207J344J126J552K900M800N731M250P84k506
59624A016973l880l552k797k194j501q34r46k217m057n589o398o411n551m047
59610I66999k802k859m342o157o880n913l840j875j129k072m113n646n138k666
59596I11567j3J317J734K582M011M952M924M477L674J743j141l202l236k293j991
$$ y = [860540, 866447, 871664, 877018, 883186, 890228, 897808, 905801, 914450, 923887, 933886, 944310, 955354, 966912, 978094, 987945, 996464, 1004395, 1012073, 1018958, 1024240, 1027555, 1029246, 1030290, 1031773, 1033942, 1035871, 1036441, 1035496, 1033610, 1031017, 1027457, 1023061, 1018680, 1015173, 1012798, 1011285, 1010018, 1008143, 1005090, 1001071, 996667, 992009, 986958, 981983, 978093, 975750, 974554, 974147, 974534, 975230, 975146, 974075, 973451, 974652, 976957, 978346, 978265, 978524, 981123, 985938, 991038, 994785, 996992, 998336, 999462, 1001014, 1003914, 1008714, 1014445, 1018695, 1019479, 1016973, 1013093, 1009541, 1006744, 1004550, 1003049, 1002215, 1001269, 999052, 994995, 989406, 983008, 976597, 971046, 966999, 964197, 961338, 956996, 950839, 943959, 938046, 934206, 932331, 931202, 929130, 925017, 919371, 914233, 911567, 911554, 912871, 914605, 917187, 921198, 926150, 931074, 935551, 939225, 940968, 939827, 936625, 933389, 931096, 929105]
59581I29105k215j951j465j840k775k791j727j260k504m487n559n193l818k143
59567H89377j292k457n389q006q484p221n951n424m977m091l252l108l505l838
59553H22382l978m332n047n514m968l472j885q08j17L19J69m62m79P87K138J868
59537G96601L24m39K50O46o18k304k370p54J082K481L780M678M116K014l67k078
59521H07042l330m326m480l511k410k331l030l281k552j562j207j532j859j524
59507G70107m79O31R38K17q08j300j295j479j986k018q43J233L242M413M372L013
59491G77958R15l74N57L375O074O954O153N097N062O524R231J2327J4737J5992
59477H70582J6470J6559J5991J4348J1681Q051L206k345o584p641o175m752m625
$$ y = [929105, 926890, 924939, 923474, 921634, 918859, 916068, 914341, 913081, 910577, 906090, 900531, 895338, 891520, 889377, 888085, 885628, 880239, 872233, 863749, 856528, 850577, 845153, 840176, 836085, 832833, 829725, 826220, 822382, 818404, 814072, 809025, 803511, 798543, 795071, 793186, 792378, 792261, 792580, 792749, 792287, 791808, 792595, 794733, 796601, 796925, 796486, 796736, 797382, 796764, 794460, 792090, 791336, 792418, 794899, 798679, 803357, 807473, 809487, 809120, 807042, 803712, 799386, 794906, 791395, 788985, 786654, 783624, 780343, 777791, 776229, 775022, 773490, 771631, 770107, 769628, 770259, 771197, 771414, 770606, 769306, 768011, 766532, 764546, 762528, 761685, 762918, 766160, 770573, 774945, 777958, 778873, 778499, 779056, 782431, 788505, 795459, 801612, 806709, 811771, 818295, 827526, 839853, 854590, 870582, 887052, 903611, 919602, 933950, 945631, 953682, 956888, 954543, 947959, 940318, 934143, 929391, 924766]
59464I24766m470k892q20k43j355k352j885n00N51Q80Q46O09l4j141k516l990
59448I05454n382o289o435o256o562p421p927p505o824o686o514n036k364j89
59434H24064L73m5n04j139k206k786j757N10K592L791M358M349L595K673K673
59419H40541L754M967N643O067O671P434Q165Q489P633N286K686J593K058K395
59405I13382J646P21P09J391K037K462K582K137J562J901L034L356K260J669L638
59390I44487P497J0803J2323J2459J1541R598P407N905M521J895j580l620l002
59377A020234j231n59j490l002m251n098n559n581n116l998k155j97Q08O43O04
59362I84052K188N375Q760J1221J2992J5024J7678K0347K2379K4054K6297K9253
$$ y = [924766, 920296, 917404, 916584, 916341, 914986, 912634, 910749, 910249, 910800, 911680, 912526, 913135, 913101, 911960, 909444, 905454, 900072, 893783, 887348, 881092, 874530, 867109, 859182, 851677, 844853, 838167, 831653, 826617, 824253, 824064, 824437, 824392, 823888, 822749, 820543, 817757, 816000, 816510, 819102, 822893, 827251, 831600, 835195, 837868, 840541, 844295, 849262, 854905, 860972, 867643, 875077, 883242, 891731, 899364, 904650, 907336, 908929, 910987, 913382, 915028, 915749, 916458, 917849, 919886, 922348, 924930, 927067, 928629, 930530, 933564, 936920, 939180, 940849, 944487, 951984, 962787, 975110, 987569, 999110, 1008708, 1016115, 1022020, 1026541, 1028436, 1026856, 1023236, 1020234, 1019003, 1018444, 1016954, 1013952, 1009701, 1004603, 999044, 993463, 988347, 984349, 982194, 981997, 982805, 983448, 984052, 986240, 991615, 1000375, 1011596, 1024588, 1039612, 1057290, 1077637, 1100016, 1124070, 1150367, 1179620]
59350A179620L1521L1172K7325K0438J1477J501p903j4708j7443j6040j1584n580
59338A229796N71N754R048R443N907j638j1417k0471k6559k9262k9293k7401k4114
59325A090364j9922j5220j0383o143l516k709k499j320R50K892L324K586J834
59312A040238J585J525J480J855K903M105M690M580M465M992O114P154P412O819
59298A099917O203O583Q058R611J0268J0120R833R619R262Q826Q621Q720R211
59285A214852J0486J2403J3573J2874J1421J1342J2423J2016R063O139N884P041
59273A339517O244K805p21k485l557n645q528j0763j1701j1755j1381j0737r997
59260A261296r367q856q327p529o128m095k163j389j990k963l038j778J86J775
$$ y = [1179620, 1211141, 1242313, 1269638, 1290076, 1301553, 1303054, 1295151, 1280443, 1263000, 1246960, 1235376, 1229796, 1230367, 1236121, 1245169, 1254612, 1260519, 1258881, 1247464, 1226993, 1200434, 1171172, 1141879, 1114478, 1090364, 1070442, 1055222, 1044839, 1038696, 1035180, 1032471, 1029972, 1028652, 1029602, 1032494, 1035818, 1038404, 1040238, 1041823, 1043348, 1044828, 1046683, 1049586, 1053691, 1058381, 1062961, 1067426, 1072418, 1078532, 1085686, 1093098, 1099917, 1106120, 1112703, 1120761, 1130372, 1140640, 1150760, 1160593, 1170212, 1179474, 1188300, 1196921, 1205641, 1214852, 1225338, 1237741, 1251314, 1264188, 1275609, 1286951, 1299374, 1311390, 1320453, 1326592, 1332476, 1339517, 1345761, 1348566, 1347845, 1345360, 1341803, 1336158, 1327630, 1316867, 1305166, 1293411, 1282030, 1271293, 1261296, 1251929, 1243073, 1234746, 1227217, 1221089, 1216994, 1214831, 1213442, 1211452, 1208489, 1205451, 1203673, 1203859, 1205634]
59246A205634K352K324K752M034N073M176O06m969j1119j6208j8818j8638j6868
59233A140331j5153j4223j3994j4350j4863j4225j1408p463m845m673n585n579
59221A013970m021j617N07J444J130P62J675L635N240O182P606R798J1091J0118
59207A067520Q012P174Q605J1419J4041J4765J2209O749R96k534l857m585n200
59194A135314m942l974l606m204m649m475m774o029o642n110k679j971l348m327
59180A074584k907OK277L415M602O294P386O969N799N152M836L436N31k322l165
59165A116893j666P76K404K260M15k266m658o087o596o519o078n577n511n996
59151A071794o323n661m191l040k931l322l129k075r42m97n49m66m07j201k736
$$ y = [1205634, 1207986, 1210310, 1213062, 1217096, 1222169, 1226345, 1226951, 1221982, 1210863, 1194655, 1175837, 1157199, 1140331, 1125178, 1110955, 1096961, 1082611, 1067748, 1053523, 1042115, 1034652, 1029807, 1025134, 1019549, 1013970, 1009949, 1008332, 1008839, 1010283, 1011413, 1012175, 1013850, 1017485, 1022725, 1028907, 1036513, 1046311, 1057402, 1067520, 1075532, 1082706, 1091311, 1102730, 1116771, 1131536, 1143745, 1150494, 1151490, 1148956, 1145099, 1140514, 1135314, 1130372, 1126398, 1122792, 1118588, 1113939, 1109464, 1104690, 1098661, 1092019, 1086909, 1084230, 1082259, 1078911, 1074584, 1071677, 1071683, 1073960, 1077375, 1081977, 1088271, 1095657, 1102626, 1108425, 1113577, 1118413, 1121849, 1122380, 1120058, 1116893, 1115227, 1116003, 1118407, 1120667, 1121082, 1118816, 1114158, 1108071, 1101475, 1094956, 1088878, 1083301, 1077790, 1071794, 1065471, 1059810, 1055619, 1052579, 1049648, 1046326, 1043197, 1041122, 1040180, 1039683, 1039134, 1038668, 1038261, 1037060, 1034324]
59136A034324l283j481J483K936K093R24J184J994J600M06M68K307M038M048L055
59121A056096K673L017K960K259K118L399N166N721M728L597L635M506N051N120
59107A110046N680P038Q144Q128P582P359O904N089K425R77J740L239L314J447
59093A179112j335m093o596q741j0188j0721j0548j0183j0105j0377j0494r998
59081A075733r248r030r239q765p262o140o807q475q997p692o021n293n031m287
59067I73446l310k812k304n35K506N172O055N510M977N343O483P993R696J1319
59053A029539J2201J1694R904P808O438O087O376O862P241P151O394N469N206
59040A128370N653N841N057L656K176L42k128m293m729l401j745q22m78l65o70
$$ y = [1034324, 1031041, 1029560, 1031043, 1033979, 1036072, 1036996, 1038180, 1040174, 1041774, 1042180, 1042648, 1044955, 1048993, 1053041, 1056096, 1058769, 1061786, 1064746, 1067005, 1069123, 1072522, 1077688, 1083409, 1088137, 1091734, 1095369, 1099875, 1104926, 1110046, 1115726, 1122764, 1130908, 1139036, 1146618, 1153977, 1160881, 1165970, 1168395, 1169372, 1171112, 1174351, 1177665, 1179112, 1177777, 1173684, 1167088, 1158347, 1148159, 1137438, 1126890, 1116707, 1106602, 1096225, 1085731, 1075733, 1066485, 1057455, 1048216, 1039451, 1032189, 1026049, 1019242, 1010767, 1001770, 994078, 988057, 982764, 977733, 973446, 970136, 967324, 965020, 964485, 966991, 972163, 978218, 983728, 988705, 994048, 1000531, 1008524, 1018220, 1029539, 1041740, 1053434, 1063338, 1071146, 1077584, 1083671, 1090047, 1096909, 1104150, 1111301, 1117695, 1123164, 1128370, 1134023, 1139864, 1144921, 1148577, 1150753, 1151095, 1148967, 1144674, 1139945, 1136544, 1134799, 1133977, 1133499, 1133134, 1132464]
59025A132464j334j611j256j346l073o045q552r328q593p462o858o925p260p604
59011A055217q158q924r077p744n500m067m295n215n542n261n105n258n284m916
58997I70871m265l578l154l065k776j786p74r63k019j998j88J503J173m33j398
58982I47150j490j658j701o62R75J629J106Q04J457K446L413M637N785O196O542
58967I76629Q233J0749J1781J0660R550J0325J2141J3227J3304J2996J2409J1696
58955A113700J1638J2265J2159J0438Q204O665N179K785M59k22J93k82j986l109
58941A178086k263N1K644M790N994N887M827L795L380L436L684L935L890L345
58927A225481K573J957J490J237J717L061M211L992K781K208L213N262P325Q933
$$ y = [1132464, 1131130, 1129519, 1128263, 1126917, 1123844, 1117799, 1109247, 1099919, 1091326, 1083864, 1077006, 1070081, 1062821, 1055217, 1047059, 1038135, 1029058, 1021314, 1015814, 1011747, 1007452, 1002237, 996695, 991434, 986329, 981071, 975787, 970871, 966606, 963028, 959874, 956809, 954033, 952247, 951473, 950510, 948491, 946493, 946305, 947808, 948981, 948548, 947150, 945660, 944002, 942301, 941639, 942614, 944243, 945349, 946153, 947610, 950056, 953469, 958106, 963891, 970087, 976629, 984862, 995611, 1007392, 1018052, 1027602, 1037927, 1050068, 1063295, 1076599, 1089595, 1102004, 1113700, 1125338, 1137603, 1149762, 1160200, 1168404, 1175069, 1180248, 1183033, 1183492, 1183270, 1183463, 1183181, 1181195, 1178086, 1175823, 1175874, 1178518, 1183308, 1189302, 1195189, 1200016, 1203811, 1207191, 1210627, 1214311, 1218246, 1222136, 1225481, 1228054, 1230011, 1231501, 1232738, 1234455, 1237516, 1241727, 1245719, 1248500, 1250708, 1253921, 1259183, 1266508, 1275441]
58913A275441J0280J1865J3980J6113J7165J6776J5935J5675J5707J5123J3842
58902A437902J2486J1265R961Q582P145N344L356K353K916L502J969j668n461
58889A499652q213j0207j1455j1262j0112j0018j1839j3586j2744r470o304n099
58877A379343n413n756n489n042m918n133n674o858q491r099p227l802j830k821
58863A301790m716m636k702j385j796k587k404j442l03R26J916J971J329J305
58849A287266K641M803P212R739J1670J1845J0672J0301J1769J3381J3211J1900
58837A406410J1425J2083J2480J1895J1037J0604J0534J0674J1000J1116J0519
58826A529777R545R146R608J0180J0034Q945P011M490J978J05j196k561m192n654
$$ y = [1275441, 1285721, 1297586, 1311566, 1327679, 1344844, 1361620, 1377555, 1393230, 1408937, 1424060, 1437902, 1450388, 1461653, 1471614, 1480196, 1487341, 1492685, 1496041, 1498394, 1501310, 1504812, 1506781, 1505113, 1499652, 1491439, 1481232, 1469777, 1458515, 1448403, 1438385, 1426546, 1412960, 1400216, 1390746, 1384442, 1379343, 1373930, 1368174, 1362685, 1357643, 1352725, 1347592, 1341918, 1335060, 1326569, 1317470, 1310243, 1306441, 1304611, 1301790, 1297074, 1292438, 1289736, 1288351, 1286555, 1283968, 1281564, 1280122, 1279819, 1280745, 1282661, 1284632, 1285961, 1287266, 1289907, 1294710, 1301922, 1311661, 1323331, 1335176, 1345848, 1356149, 1367918, 1381299, 1394510, 1406410, 1417835, 1429918, 1442398, 1454293, 1465330, 1475934, 1486468, 1497142, 1508142, 1519258, 1529777, 1539322, 1548468, 1558076, 1568256, 1578290, 1587235, 1594246, 1598736, 1600714, 1600819, 1599623, 1597062, 1592870, 1587216]
58812A587216o826q362j0610j2601j2944j1699j0598j0955j1940j1612r471p207
58800A462391o698q027r916j1412j2397j2907j2995j3145j3934j5101j5636j4957
58788A315266j3462j1915j0881j0672j1208j1822j1877j1559j1428j1283j0447
58777A188712r162q663r386j0106r419p449n578m885n199n302m053j743k40r01
58763A106626k532k578m49J786K339J781J443J306P90L81R28J964K203J420O07
58748A118015N11J051J910K633K348M49k421m878o226o756o939p072p483q117
58734A077025q173p068n571m995n280m960l199r98j9q81k837m518m792l414j162
58719A019158J007K849M497N542N254L799K298J417N25j242l640n513n992n131
$$ y = [1587216, 1580390, 1572028, 1561418, 1548817, 1535873, 1524174, 1513576, 1502621, 1490681, 1479069, 1469598, 1462391, 1455693, 1447666, 1437750, 1426338, 1413941, 1401034, 1388039, 1374894, 1360960, 1345859, 1330223, 1315266, 1301804, 1289889, 1279008, 1268336, 1257128, 1245306, 1233429, 1221870, 1210442, 1199159, 1188712, 1179550, 1170887, 1161501, 1151395, 1141976, 1134527, 1128949, 1124064, 1118865, 1113563, 1109510, 1107767, 1107527, 1106626, 1104094, 1101516, 1101067, 1102853, 1105192, 1106973, 1108416, 1109722, 1110512, 1110893, 1111821, 1113785, 1115988, 1117408, 1118015, 1118526, 1119577, 1121487, 1124120, 1126468, 1126917, 1124496, 1119618, 1113392, 1106636, 1099697, 1092625, 1085142, 1077025, 1068852, 1061784, 1056213, 1051218, 1045938, 1040978, 1037779, 1036781, 1036762, 1035881, 1033044, 1028526, 1023734, 1020320, 1019158, 1020165, 1023014, 1027511, 1033053, 1038307, 1042106, 1044404, 1045821, 1046346, 1045104, 1041464, 1035951, 1029959, 1024828]
58705A024828l678k636k842m355o181o938o147m775m208m600m593k972l65J439
58691I71977J777J956L341N353O179N037K990J526J095J233J591K301L426M290
58677A014072L861K074N24J140L968O990Q410Q287P586O585N300M621N570P498
58663A086486Q404P321N375M144L974M366N120O184O912O384M560K550J632K104
58649A155516L113L420K516J091K57J22n52k985o793j0160j1749j1970j2214j3149
58635A096463j4323j5201j5725j5742j4682j2546j0572j0088j0881j1543j1215
58624I53945j0168q860p478o364n715m806k814p25p53l123m998l955j213L20J89
58609H93482N12K384M324M724M030L721M306N265O092O607O713O401N702M395
$$ y = [1024828, 1021150, 1018514, 1015672, 1011317, 1005136, 998198, 992051, 987276, 983068, 978468, 973875, 970903, 970538, 971977, 973754, 975710, 979051, 984404, 990583, 995620, 998610, 1000136, 1001231, 1002464, 1004055, 1006356, 1009782, 1014072, 1017933, 1020007, 1020531, 1021671, 1025639, 1032629, 1041039, 1049326, 1056912, 1063497, 1068797, 1073418, 1078988, 1086486, 1094890, 1102211, 1107586, 1111730, 1115704, 1120070, 1125190, 1131374, 1138286, 1144670, 1149230, 1151780, 1153412, 1155516, 1158629, 1162049, 1164565, 1165656, 1165913, 1166035, 1165483, 1162498, 1155705, 1145545, 1133796, 1121826, 1109612, 1096463, 1082140, 1066939, 1051214, 1035472, 1020790, 1008244, 997672, 987584, 976703, 965160, 953945, 943777, 934917, 927439, 921075, 915360, 910554, 907740, 907015, 906262, 903139, 898141, 894186, 892973, 893293, 893482, 893994, 896378, 900702, 905426, 909456, 913177, 917483, 922748, 928840, 935447, 942160, 948561, 954263, 958658]
58595I58658K236l45k388l500m255n120n665n290m282l529l430l563l335k709
58581I13483k220k466l379m059l585k084o76k65o99j240j431j239o93J57J071
58566H90675J726K056K182K120J843J731K551M530O632P303O172M522L711L616
58552I41370L290K772L110M493N536N029L546K529K486K898L461M303N170N295
58538I95288M376L030K159K127K552K536J421k21o88J104M147O420P307P985R327
58523A048870J0495J0339R371R343J1007J3147J4030J3253J1790J0722J0391J0645
58511A183403J1148J1338J0887J0567J1901J5204J8593K0006J9773J9964K1398
58500A354182K2896K3577K4208K5550K6774K6522K4543K1342J7294J3011R558
$$ y = [958658, 960894, 960549, 958161, 954661, 950406, 945286, 939621, 934331, 930049, 926520, 923090, 919527, 916192, 913483, 911263, 908797, 905418, 901359, 897774, 895690, 895014, 894749, 894050, 892810, 891379, 890140, 889447, 889604, 890675, 892401, 894457, 896639, 898759, 900602, 902333, 904884, 909414, 916046, 923349, 929521, 934043, 937754, 941370, 944660, 947432, 950542, 955035, 960571, 965600, 969146, 971675, 974161, 977059, 980520, 984823, 989993, 995288, 999664, 1002694, 1004853, 1006980, 1009532, 1012068, 1013489, 1013268, 1012580, 1013684, 1017831, 1024251, 1031558, 1039543, 1048870, 1059365, 1069704, 1079075, 1088418, 1099425, 1112572, 1126602, 1139855, 1151645, 1162367, 1172758, 1183403, 1194551, 1205889, 1216776, 1227343, 1239244, 1254448, 1273041, 1293047, 1312820, 1332784, 1354182, 1377078, 1400655, 1424863, 1450413, 1477187, 1503709, 1528252, 1549594, 1566888, 1579899, 1589457]
58489A589457P154M487N01l859o839q037q296q255q291r197j1400j4022j6066
58476A507337j7922k0346k2645k3556k3306k2902k1866j8984j5113j2918j3201
58465A294578j3687j2274r663p783p182p118o971o377m959k996j653j704k645
58452A209566l590m327m872m779l745k412j866k388k991k220L30K947K980nl009
58437A179619k864j01K198K856L507M987N734M830M076N290P428Q429Q412Q948
58423A243349J0150J0715J0419J0643J2298J4604J6191J6409J5630J4852J4884
58412A390144J5361J5047J3465J1446R499O772K663j576m202n226n808o047m995
58399A436543k636k58J256K259L350M690O365Q293R617R314P697O252N707N215
$$ y = [1589457, 1596611, 1601098, 1601599, 1597740, 1590901, 1582864, 1574568, 1566313, 1558022, 1548825, 1537425, 1523403, 1507337, 1489415, 1469069, 1446424, 1422868, 1399562, 1376660, 1354794, 1335810, 1320697, 1307779, 1294578, 1280891, 1268617, 1258954, 1251171, 1243989, 1236871, 1229900, 1223523, 1218564, 1215568, 1213915, 1212211, 1209566, 1205976, 1201649, 1196777, 1191998, 1188253, 1185841, 1183975, 1181587, 1178596, 1176376, 1176706, 1179653, 1182633, 1182628, 1179619, 1176755, 1176654, 1178852, 1181708, 1185215, 1190202, 1195936, 1200766, 1204842, 1210132, 1217560, 1225989, 1234401, 1243349, 1253499, 1264214, 1274633, 1285276, 1297574, 1312178, 1328369, 1344778, 1360408, 1375260, 1390144, 1405505, 1420552, 1434017, 1445463, 1454962, 1461734, 1464397, 1462821, 1458619, 1453393, 1447585, 1441538, 1436543, 1433907, 1433649, 1434905, 1437164, 1440514, 1445204, 1451569, 1459862, 1469479, 1478793, 1486490, 1492742, 1498449, 1503664]
58385A503664L871K024M47r59k733m589n492m993l860l183l207l311k906k103
58371A472670j445j193r74j01J793M262O266P196P681Q661R617Q799N867L208
58357A532307L244N180N982M244J360r88k573l591l868l833m504n652n649m046
58343A517613k612k543k432o51J742K630K156K285L570M606M629M566N229O166
58329A546954O735P023P255P359P501Q051Q656Q316O821N387N321O599Q187R359
58315A649524J0262J1275J2173J2198J1051R620R223J0166J1619J2901J4163J5605
58303A789780J6891J7699J8069J7930J7171J6518J7181J9024K0226J9530J7790
58292A987809J6452J5702J4980J4146J3024J1045Q756Q351J1003J4579J5961J4953
$$ y = [1503664, 1507535, 1509559, 1510006, 1509047, 1506314, 1501725, 1496233, 1491240, 1487380, 1484197, 1480990, 1477679, 1474773, 1472670, 1471225, 1470032, 1469058, 1468957, 1470750, 1475012, 1481278, 1488474, 1496155, 1504816, 1514433, 1523232, 1529099, 1532307, 1535551, 1540731, 1546713, 1550957, 1552317, 1551329, 1548756, 1545165, 1541297, 1537464, 1532960, 1527308, 1521659, 1517613, 1515001, 1512458, 1510026, 1509375, 1511117, 1513747, 1515903, 1518188, 1521758, 1526364, 1530993, 1535559, 1540788, 1546954, 1553689, 1560712, 1567967, 1575326, 1582827, 1590878, 1599534, 1607850, 1614671, 1620058, 1625379, 1631978, 1640165, 1649524, 1659786, 1671061, 1683234, 1695432, 1706483, 1716103, 1725326, 1735492, 1747111, 1760012, 1774175, 1789780, 1806671, 1824370, 1842439, 1860369, 1877540, 1894058, 1911239, 1930263, 1950489, 1970019, 1987809, 2004261, 2019963, 2034943, 2049089, 2062113, 2073158, 2081914, 2090265, 2101268, 2115847, 2131808, 2146761]
58280B146761J4020J4736J6496J8455K0580K2546K3476K3306K3069K3431K4131
58269B371007K5037K6481K8177K8936K7952K5597K2833K0582J9540J9744K0182
58258B636068J9701J8326J7092J6782J7530J9177K1217K2826K3831K5123K7177
58247B864850K9014K9700L0026L1223L2890L3936L4743L6361L8146L8585L8183
58236C237657L9011M1173M2372M1735M1489M3540M6545M8086M8107M8354M9457
58225C727526N0606N1674N3711N6936N9717O0512O0172O1153O4352O7861O9613
58214D383833P0359P2523P6592Q0703Q3874Q7455R2496R7991J02958J08003J13220
58203E370007J16959J18901J22119J29105J37626J43803J47809J52863J59740
$$ y = [2146761, 2160781, 2175517, 2192013, 2210468, 2231048, 2253594, 2277070, 2300376, 2323445, 2346876, 2371007, 2396044, 2422525, 2450702, 2479638, 2507590, 2533187, 2556020, 2576602, 2596142, 2615886, 2636068, 2655769, 2674095, 2691187, 2707969, 2725499, 2744676, 2765893, 2788719, 2812550, 2837673, 2864850, 2893864, 2923564, 2953590, 2984813, 3017703, 3051639, 3086382, 3122743, 3160889, 3199474, 3237657, 3276668, 3317841, 3360213, 3401948, 3443437, 3486977, 3533522, 3581608, 3629715, 3678069, 3727526, 3778132, 3829806, 3883517, 3940453, 4000170, 4060682, 4120854, 4182007, 4246359, 4314220, 4383833, 4454192, 4526715, 4603307, 4684010, 4767884, 4855339, 4947835, 5045826, 5148784, 5256787, 5370007, 5486966, 5605867, 5727986, 5857091, 5994717, 6138520, 6286329, 6439192, 6598932]
58194F598932J66394J72519J80171J89350J97190K02778K09287K19716K33336
58185H369673K47956K63275K80412K99942L21747L45445L70337L96212M24341
58176A1319340M56032M90591N26740N65520O09266O58257P11445P70125Q37357
58167A6944673R13541R96097J083782J177805J278162J382663J490505J603099
58159B6870327J720241J838933J957271K076722K199953K329480K468687K621058
58151D4082672K788709K975534L190795L444357L738318M068272M432624M836456
58143G3557737N290175N814528O446872P230852Q193894R337713J0646405J2090733
58135A38608909J3623943J5188047J6732149J8225344J9671198K1133800K2712242
$$ y = [6598932, 6765326, 6937845, 7118016, 7307366, 7504556, 7707334, 7916621, 8136337, 8369673, 8617629, 8880904, 9161316, 9461258, 9783005, 10128450, 10498787, 10894999, 11319340, 11775372, 12265963, 12792703, 13358223, 13967489, 14625746, 15337191, 16107316, 16944673, 17858214, 18854311, 19938093, 21115898, 22394060, 23776723, 25267228, 26870327, 28590568, 30429501, 32386772, 34463494, 36663447, 38992927, 41461614, 44082672, 46871381, 49846915, 53037710, 56482067, 60220385, 64288657, 68721281, 73557737, 78847912, 84662440, 91109312, 98340164, 106534058, 115871771, 126518176, 138608909, 152232852, 167420899, 184153048, 202378392, 222049590, 243183390, 265895632]
58128B65895632K4375051K5722705K5933566K4062930J9528533J2427243L514568
58121D01460228o030839j4893127k1924733k6449381k8419338k8300233k6768907
58114B48673670k4449923k1813970j9183943j6758309j4633074j2834060j1346384
58107A27654007j0128491r124025q280347p558563o927428o358093n830490n337628
58099F8108942m877660m446409m041042l664804l322332l013678k736367k489550
58091C9517100k272202k080377j909685j758110j623851j503157j392895j292919
58083B5683904j203633j123522j050980r86089r28494q75725q25607p78404p34923
58074A7176527o94475o56242o20555n87397n55655n25307m98103m74563m52493
$$ y = [265895632, 290270683, 315993388, 341926954, 365989884, 385518417, 397945660, 401460228, 395429389, 380536262, 358611529, 332162148, 303742810, 275442577, 248673670, 224223747, 202409777, 183225834, 166467525, 151834451, 139000391, 127654007, 117525516, 108401491, 100121144, 92562581, 85635153, 79277060, 73446570, 68108942, 63231282, 58784873, 54743831, 51079027, 47756695, 44743017, 42006650, 39517100, 37244898, 35164521, 33254836, 31496726, 29872875, 28369718, 26976823, 25683904, 24480271, 23356749, 22305769, 21319680, 20391186, 19515461, 18689854, 17911450, 17176527, 16482052, 15825810, 15205255, 14617858, 14062203, 13536896, 13038793, 12564230, 12111737]
58065A2111737m30138m08714l89914l72867l55542l37682l20451l04511k90141
58056H901777k77868k67409k57118k45957k34940k25396k17084k09242k02126
58047F764637j96026j90049j83357j76506j70337j64685j59394j55208j52217
58038E216858j48686j43011j35804j28719j22274j16249j10994j06738j02745
58029D101638r8672r5744r4799r4285r2017q8077q4053q0268p5936p1384o7865
58018C158538o5273o2292n8891n6569n5759n4905n2715m9736m7131m5288m4351
58007B565628m4711m6030m6817m5949m3980m2175m0900l9723l8643l8300l8857
57996B099543l9307l8295l5687l3036l2095l2874l3647l2977l1113k9083k7389
$$ y = [12111737, 11681599, 11272885, 10882971, 10510104, 10154562, 9816880, 9496429, 9191918, 8901777, 8623909, 8356500, 8099382, 7853425, 7618485, 7393089, 7176005, 6966763, 6764637, 6568611, 6378562, 6195205, 6018699, 5848362, 5683677, 5524283, 5369075, 5216858, 5068172, 4925161, 4789357, 4660638, 4538364, 4422115, 4311121, 4204383, 4101638, 4002966, 3907222, 3812423, 3718138, 3626121, 3538044, 3453991, 3373723, 3297787, 3226403, 3158538, 3093265, 3030973, 2972082, 2915513, 2859754, 2804849, 2752134, 2702398, 2655267, 2609979, 2565628, 2520917, 2474887, 2428070, 2382121, 2338141, 2295966, 2255066, 2215343, 2176700, 2138400, 2099543, 2060236, 2021941, 1986254, 1953218, 1921123, 1888249, 1854602, 1821625, 1790512, 1761429, 1734040]
57985A734040k6292k6406k7804k9010k8303k5932k3777k2820k2123k0543j8349
57974A462681j6681j6224j6753j7306j6703j4652j2532j2117j3317j4135j3257
57963A299004j1672j1047j1458j1679j1066j0166r632r429r082q172o512m325
57951A184764k321j320j674k974m217m378l254j768j034j116j277j351j942l024
57937A153114l436k596j626j770k346j727O2J243Q51k9n4N96R21M83p41k920n620
57920A134405p182o305m041k821l359l796k537n96j02j226k032j187M68J319R23
57905A101931q5j172k079k306j414J71J434J919J987J867J284K91l59k78j50n40
57889A102501p09L78K143K826J902P77O93J159J258J350K314L741M386M152M256
$$ y = [1734040, 1707748, 1681342, 1653538, 1624528, 1596225, 1570293, 1546516, 1523696, 1501573, 1481030, 1462681, 1446000, 1429776, 1413023, 1395717, 1379014, 1364362, 1351830, 1339713, 1326396, 1312261, 1299004, 1287332, 1276285, 1264827, 1253148, 1242082, 1231916, 1222284, 1212855, 1203773, 1195601, 1189089, 1184764, 1182443, 1181123, 1179449, 1176475, 1172258, 1167880, 1164626, 1162858, 1161824, 1160708, 1159431, 1158080, 1156138, 1153114, 1149678, 1147082, 1145456, 1143686, 1141340, 1139613, 1139675, 1140918, 1141769, 1141740, 1141686, 1142282, 1143203, 1143686, 1142945, 1140025, 1134405, 1127223, 1120918, 1116877, 1114056, 1110697, 1106901, 1104364, 1103768, 1103666, 1102440, 1100408, 1099221, 1099689, 1101008, 1101931, 1101846, 1100674, 1098595, 1096289, 1094875, 1095046, 1096480, 1098399, 1100386, 1102253, 1103537, 1103828, 1103469, 1103191, 1103041, 1102501, 1101792, 1102170, 1104313, 1107139, 1109041, 1109818, 1110511, 1111670, 1112928, 1114278, 1116592, 1120333, 1124719, 1128871, 1133127]
57874A133127N228N995N507M253L464L477L638L356K542J302o9r62j019q14j293
57859A167732k496l372l131k282j884k034j669j0K172L180K239L90o20k8J652
57844A159839L470M676M697L430J749R76J451K219K498K738L604M576M519L319
57830A203761K024J438J514K110L288M584M950M031K811K377K517K233J299N33
57816A239470N55R07P14k61j478k302k573k460k094j519r34n95k55Q69L135N587
57800A236766O686O075N051M989N853O699P201P862Q905R644R249P650N462L464
57786A331556K254K015K195J828O09o50j022o83n37q62j128j128j368j914j868
57771A329297p14O02R31O59J018J993K392J974J909K662L015K177J449K384M171
$$ y = [1133127, 1138355, 1144350, 1149857, 1154110, 1157574, 1161051, 1164689, 1168045, 1170587, 1171889, 1171820, 1170858, 1169839, 1169025, 1167732, 1165236, 1161864, 1158733, 1156451, 1154567, 1152533, 1150864, 1150854, 1153026, 1156206, 1158445, 1158835, 1158215, 1158187, 1159839, 1163309, 1167985, 1172682, 1176112, 1177861, 1178837, 1180288, 1182507, 1185005, 1187743, 1191347, 1195923, 1200442, 1203761, 1205785, 1207223, 1208737, 1210847, 1214135, 1218719, 1223669, 1227700, 1230511, 1232888, 1235405, 1237638, 1238937, 1239470, 1240025, 1240932, 1241646, 1241385, 1239907, 1237605, 1235032, 1232572, 1230478, 1228959, 1228025, 1227430, 1227175, 1228044, 1231179, 1236766, 1243452, 1249527, 1254578, 1259567, 1265420, 1272119, 1279320, 1287182, 1296087, 1305731, 1314980, 1322630, 1328092, 1331556, 1333810, 1335825, 1338020, 1339848, 1340457, 1339807, 1338785, 1338102, 1337565, 1336703, 1335575, 1334447, 1333079, 1331165, 1329297, 1328583, 1329185, 1330116, 1330775, 1331793, 1333786, 1336178, 1338152, 1340061, 1342723, 1345738, 1347915, 1349364, 1351748, 1355919]
57756A355919M451K372o34k912m022m110l312k240j798j980j754p70j94j105k682
57741A335229k912r03K113L944L357J037j041j313J67K239M089N669O985P798
57727A366458Q058P895P108N657M679N770Q750J1268J1458R965Q700Q586R433
57714A473785J0786J1607J0231O409K780K345M676O455N740L869K798K526K015
57701A546022J079J65n46p95Q5K025L570L495K407J818K199L082M281N724O522
57686A581133N824M496M433O023P609P798O971N993M802L263K349L185N305O983
57672A656167P180O370N623N601O378P450P940P367O281N632N641N917O464P539
57658A747550Q558Q258O467M659M064M043L317K114J804K676L312K602J327J197
$$ y = [1355919, 1360370, 1362742, 1362108, 1359196, 1355174, 1351064, 1347752, 1345512, 1343714, 1341734, 1339980, 1339210, 1339016, 1337911, 1335229, 1332317, 1331414, 1333527, 1337471, 1340828, 1341865, 1340824, 1339511, 1339678, 1341917, 1346006, 1351675, 1358660, 1366458, 1374516, 1382411, 1389519, 1395176, 1399855, 1405625, 1414375, 1425643, 1437101, 1447066, 1455766, 1464352, 1473785, 1484571, 1496178, 1506409, 1512818, 1515598, 1517943, 1522619, 1529074, 1534814, 1538683, 1541481, 1544007, 1546022, 1547101, 1547266, 1546720, 1545925, 1546010, 1548035, 1551605, 1555100, 1557507, 1559325, 1561524, 1564606, 1568887, 1574611, 1581133, 1586957, 1591453, 1595886, 1601909, 1609518, 1617316, 1624287, 1630280, 1635082, 1638345, 1640694, 1643879, 1649184, 1656167, 1663347, 1669717, 1675340, 1680941, 1687319, 1694769, 1702709, 1710076, 1716357, 1721989, 1727630, 1733547, 1740011, 1747550, 1756108, 1764366, 1770833, 1775492, 1779556, 1783599, 1786916, 1789030, 1790834, 1793510, 1796822, 1799424, 1800751, 1801948]
57644A801948K773M835N619M455K474J747L348O221Q247Q430P517O671O217N921
57630A876423N626N133M138K754J648J190J032R95J682L538N874P739R250J1142
57616A938164J3388J5380J7202J9566K2458K5097K7330K9812L2433L3906L3524
57605B208260L2052K9984K6052J8761Q718j909j1651k0086k6252k8510k6445k1843
57593B187131j7062j3261j0541q763p549o060l761j219M18O24r7o46Q5K580N938
57578B127817Q141P866O072N097O064P715P948O063L250J341J410L217N494O808
57564B204303O562N381M525M818N994O934O597N088L825M261O217P779P319N338
57550B284941L917M398O184P812Q525Q518Q150P624P165O843O295N197M074L951
$$ y = [1801948, 1804721, 1809556, 1815175, 1819630, 1822104, 1823851, 1827199, 1833420, 1841667, 1850097, 1857614, 1864285, 1870502, 1876423, 1882049, 1887182, 1891320, 1894074, 1895722, 1896912, 1897944, 1898939, 1900621, 1904159, 1910033, 1917772, 1927022, 1938164, 1951552, 1966932, 1984134, 2003700, 2026158, 2051255, 2078585, 2108397, 2140830, 2174736, 2208260, 2240312, 2270296, 2296348, 2315109, 2323827, 2321918, 2310267, 2290181, 2263929, 2235419, 2208974, 2187131, 2170069, 2156808, 2146267, 2137504, 2129955, 2123895, 2120134, 2118915, 2119333, 2119957, 2119860, 2119214, 2119299, 2121879, 2127817, 2135958, 2143824, 2149896, 2154993, 2161057, 2168772, 2176720, 2182783, 2186033, 2187374, 2188784, 2192001, 2197495, 2204303, 2210865, 2216246, 2220771, 2225589, 2231583, 2238517, 2245114, 2250202, 2254027, 2258288, 2264505, 2272284, 2279603, 2284941, 2288858, 2293256, 2299440, 2307252, 2315777, 2324295, 2332445, 2340069, 2347234, 2354077, 2360372, 2365569, 2369643, 2373594]
57536B373594M860N365M267K392J845L530O145P762P738O739N682N223N792P306
57522B448240Q940R764R606Q901P931O796N929N840O324O692O938P838R516J0765
57508B560020J0441Q988P921Q121R186J0129J0189R166P649O659O743P555Q570
57495B671337R694J0720J0926J0060R158R384J0417J1038J0993J0997J1139J0758
57483B796621R999R918J0653J0998J0456J0210J1132J2182J1975J0788R759R109
57471B923800Q518Q381R069R591Q805P477P395Q573R314R054R083R969J0329R234
57457C048592Q093Q670J0462J1546J1240J0390R614Q787Q171Q557R899J0869J0385
57444C175275R103Q834J0530J3030J4039J2430R502P514P257P812Q572J0139J2650
$$ y = [2373594, 2378454, 2383819, 2388086, 2390478, 2392323, 2395853, 2401998, 2409760, 2417498, 2424237, 2429919, 2435142, 2440934, 2448240, 2457180, 2466944, 2476550, 2485451, 2493382, 2500178, 2506107, 2511947, 2518271, 2524963, 2531901, 2539739, 2549255, 2560020, 2570461, 2579449, 2587370, 2595491, 2604677, 2614806, 2624995, 2634161, 2641810, 2648469, 2655212, 2662767, 2671337, 2681031, 2691751, 2702677, 2712737, 2721895, 2731279, 2741696, 2752734, 2763727, 2774724, 2785863, 2796621, 2806620, 2816538, 2827191, 2838189, 2848645, 2858855, 2869987, 2882169, 2894144, 2904932, 2914691, 2923800, 2932318, 2940699, 2949768, 2959359, 2968164, 2975641, 2983036, 2991609, 3000923, 3009977, 3019060, 3029029, 3039358, 3048592, 3056685, 3065355, 3075817, 3087363, 3098603, 3108993, 3118607, 3127394, 3135565, 3144122, 3154021, 3164890, 3175275, 3184378, 3193212, 3203742, 3216772, 3230811, 3243241, 3252743, 3260257, 3267514, 3275326, 3283898, 3294037, 3306687]
57431C306687J4661J4864J3949J3352J2951J1729J0326J0803J3462J5800J5550
57420C454134J3401J1709J1505J2000J2211J1870J0987R676Q472Q084Q746J0124
57408C582919J1667J2699J2686J1964J1792J2872J4184J4198J3022J2342J3108
57397C723453J4321J4505J3507J2263J1460J1088J0955J0958J1027J1285J2138
57386C856960J3723J5268J5540J4144J2122J1062J1571J2742J3226J2702J2102
57375D001162J2296J3044J3532J3584J3586J3413J2456J0926J0133J0796J1906
57364D136834J2126J1638J1653J2441J3084J3064J2895J2990J2994J2672J2444
57353D274835J2510J2341J1709J1455J2275J3425J3519J2340J0903J0050R856
$$ y = [3306687, 3321348, 3336212, 3350161, 3363513, 3376464, 3388193, 3398519, 3409322, 3422784, 3438584, 3454134, 3467535, 3479244, 3490749, 3502749, 3514960, 3526830, 3537817, 3547493, 3555965, 3564049, 3572795, 3582919, 3594586, 3607285, 3619971, 3631935, 3643727, 3656599, 3670783, 3684981, 3698003, 3710345, 3723453, 3737774, 3752279, 3765786, 3778049, 3789509, 3800597, 3811552, 3822510, 3833537, 3844822, 3856960, 3870683, 3885951, 3901491, 3915635, 3927757, 3938819, 3950390, 3963132, 3976358, 3989060, 4001162, 4013458, 4026502, 4040034, 4053618, 4067204, 4080617, 4093073, 4103999, 4114132, 4124928, 4136834, 4148960, 4160598, 4172251, 4184692, 4197776, 4210840, 4223735, 4236725, 4249719, 4262391, 4274835, 4287345, 4299686, 4311395, 4322850, 4335125, 4348550, 4362069, 4374409, 4385312, 4395362, 4405218]
57342D405218J0241J1100J1798J1615J0932J1041J2302J3392J3050J1848J1360
57331D533897J2035J2862J2999J2783J2886J3203J3115J2484J1814J1481J1269
57320D670828J0844J0401J0497J1177J1643J1072R639Q487Q603R939J1561J2393
57308D797084J1797R918P787O787P592R499J1003J1055R753P968O627O281P072
57295D910223Q741J0602J1799J1935J1459J1209J1367J1236J0304R184Q878R292
57283E036229R288Q353P406P497Q392R094R219R101Q865Q302P578P265P576Q323
57269E152488R616J1781J4327J5906J5871J5194J5195J5860J6192J5831J5378
57258E313639J5162J4648J3428J2079J1495J1639J1623J0927J0061R850J0273
$$ y = [4405218, 4415459, 4426559, 4438357, 4449972, 4460904, 4471945, 4484247, 4497639, 4510689, 4522537, 4533897, 4545932, 4558794, 4571793, 4584576, 4597462, 4610665, 4623780, 4636264, 4648078, 4659559, 4670828, 4681672, 4692073, 4702570, 4713747, 4725390, 4736462, 4746101, 4754588, 4763191, 4773130, 4784691, 4797084, 4808881, 4818799, 4826586, 4833373, 4840965, 4850464, 4861467, 4872522, 4882275, 4890243, 4896870, 4903151, 4910223, 4918964, 4929566, 4941365, 4953300, 4964759, 4975968, 4987335, 4998571, 5008875, 5018059, 5026937, 5036229, 5045517, 5053870, 5061276, 5068773, 5077165, 5086259, 5095478, 5104579, 5113444, 5121746, 5129324, 5136589, 5144165, 5152488, 5162104, 5173885, 5188212, 5204118, 5219989, 5235183, 5250378, 5266238, 5282430, 5298261, 5313639, 5328801, 5343449, 5356877, 5368956, 5380451, 5392090, 5403713, 5414640, 5424701, 5434551, 5444824]
57247E444824J0382R389P612O080N341N018M632M348M580N159N493N441N462N800
57233E529561O073N965N889O510P944R774J1775J3986J6131J7527J7897J7980
57221E667012J8924K1012K3249K4313K3862K2762K2120K2123K2051K1210J9631
57210E908269J7639J5058J1307O387J383k329m320n232n774n858n023l441k235
57197E925831k614m744p437q961q336o160m159l671m473n215m973m047l165k537
57183E855339k040j776j739j249L28K376L368K714J456Q03P37O19M31P14J653
57168E863734K962M320N313N339M241K801J951J732J650J650J955K311K332K345
57154E904636K895L526L210J934P80K28l46j363k427l434m987p119q788r262q923
$$ y = [5444824, 5455206, 5464595, 5472207, 5478287, 5483628, 5488646, 5493278, 5497626, 5502206, 5507365, 5512858, 5518299, 5523761, 5529561, 5535634, 5541599, 5547488, 5553998, 5561942, 5571716, 5583491, 5597477, 5613608, 5631135, 5649032, 5667012, 5685936, 5706948, 5730197, 5754510, 5778372, 5801134, 5823254, 5845377, 5867428, 5888638, 5908269, 5925908, 5940966, 5952273, 5958660, 5960043, 5957714, 5953394, 5948162, 5942388, 5936530, 5931507, 5928066, 5925831, 5923217, 5918473, 5911036, 5902075, 5893739, 5887579, 5883420, 5879749, 5875276, 5870061, 5865088, 5861041, 5857876, 5855339, 5853299, 5851523, 5849784, 5848535, 5848863, 5851239, 5854607, 5857321, 5858777, 5859580, 5860317, 5860936, 5861367, 5862081, 5863734, 5866696, 5871016, 5876329, 5881668, 5885909, 5888710, 5890661, 5892393, 5894043, 5895693, 5897648, 5899959, 5902291, 5904636, 5907531, 5911057, 5914267, 5916201, 5916981, 5917209, 5916863, 5915500, 5913073, 5909639, 5904652, 5897533, 5888745, 5879483, 5870560]
57139E870560q042o179l823l157n598r489j1884j2118j1961j2649j3541j3716
57127E758403j3200j2304j1118j0210j0554j2138j3583j3867j3633j4102j5338
57116E618356j6406j6915j7632j9372k1883k4242k6122k8150l0553l2137l1506
57105E353438k9250k7764k8570l0751l2586l3627l4570l6195l9310m4534n0996
57094D965285n6282n9082o0957o4180o8828p3574p8233q3436q8731r3319r8234
57083D140429j05271j13938j21833j27949j33239j37977j41233j43080j44536
57074B971373j44768j41545j35455j30783j30553j33235j35887j38122j41228
57065A739797j45701j51859j60960j73529j88161k03898k22194k44559b1084k97227
$$ y = [5870560, 5862518, 5856339, 5852516, 5849359, 5843761, 5834272, 5822388, 5810270, 5798309, 5785660, 5772119, 5758403, 5745203, 5732899, 5721781, 5711571, 5701017, 5688879, 5675296, 5661429, 5647796, 5633694, 5618356, 5601950, 5585035, 5567403, 5548031, 5526148, 5501906, 5475784, 5447634, 5417081, 5384944, 5353438, 5324188, 5296424, 5267854, 5237103, 5204517, 5170890, 5136320, 5100125, 5060815, 5016281, 4965285, 4909003, 4849921, 4788964, 4724784, 4655956, 4582382, 4504149, 4420713, 4331982, 4238663, 4140429, 4035158, 3921220, 3799387, 3671438, 3538199, 3400222, 3258989, 3115909, 2971373, 2826605, 2685060, 2549605, 2418822, 2288269, 2155034, 2019147, 1881025, 1739797, 1594096, 1442237, 1281277, 1107748, 919587, 715689, 493495, 248936, -21084, -318311]
57055c18311l27817l65628m13348m71626n40167o17593p01036p87553q75382r63058
57045f381519j048886j132366j214476j295650j375654j456282j541032j630660
57037a7076525j722078j813232j905344j998963k092660k187126k282728k367802
57029c3446458k416884k408408k338457k210037k018959j765907j477046j192988
57021d9275144r35440p02204m95801l27964j74874N3307M63333J087041J845351
57012d8462395K601841L242784L713799M008246M142085M136798M011823L784857
57004a8820162L476408L110769K711413K298179J889631J504384J158149Q61727
56996a809502O22618M45337L28636a47823I6947K57359K90618L31227L69499M01548
$$ y = [-318311, -646128, -1011756, -1425104, -1896730, -2436897, -3054490, -3755526, -4543079, -5418461, -6381519, -7430405, -8562771, -9777247, -11072897, -12448551, -13904833, -15445865, -17076525, -18798603, -20611835, -22517179, -24516142, -26608802, -28795928, -31078656, -33446458, -35863342, -38271750, -40610207, -42820244, -44839203, -46605110, -48082156, -49275144, -50210584, -50912788, -51408589, -51736553, -51911427, -51858120, -51394787, -50307746, -48462395, -45860554, -42617770, -38903971, -34895725, -30753640, -26616842, -22605019, -18820162, -15343754, -12232985, -9521572, -7223393, -5333762, -3829378, -2671229, -1809502, -1186884, -741547, -412911, -147823, 96947, 354306, 644924, 976151, 1345650, 1747198]
56986A747198M25827M40270M44080M39380M28907M13925L95715L76966L59971
56977E472239L45160L32505L22539L14960L08463L02914K98980K94104K81651
56968H273515K56618K20507J78740J35539R3734N7332L0317J2973J889o182j2165
56957I242817j5943j7950j9094k0135k1353k2437k3193k4579k8029l3429l9099
56946H977576m4310n0170n7135o3563o8097p1729p5862p9943q2925q5555q8957
56935H209330r2047r2703r0777q7757q4149p9459p4417p0758o8742o6960o4850
56924G336711o3589o4204o6426o9608p3320p6683p8553p8672p7624p5645p2634
56913F539753o9270o6802o5729o5787o6922o8923p0446p0240o9240o9617p1598
$$ y = [1747198, 2173025, 2613295, 3057375, 3496755, 3925662, 4339587, 4735302, 5112268, 5472239, 5817399, 6149904, 6472443, 6787403, 7095866, 7398780, 7697760, 7991864, 8273515, 8530133, 8750640, 8929380, 9064919, 9158653, 9215985, 9246302, 9259275, 9261164, 9254982, 9242817, 9226874, 9208924, 9189830, 9169695, 9148342, 9125905, 9102712, 9078133, 9050104, 9016675, 8977576, 8933266, 8883096, 8825961, 8762398, 8694301, 8622572, 8546710, 8466767, 8383842, 8298287, 8209330, 8117283, 8024580, 7933803, 7846046, 7761897, 7682438, 7608021, 7537263, 7468521, 7401561, 7336711, 7273122, 7208918, 7142492, 7072884, 6999564, 6922881, 6844328, 6765656, 6688032, 6612387, 6539753, 6470483, 6403681, 6337952, 6272165, 6205243, 6136320, 6065874, 5995634, 5926394, 5856777, 5785179]
56902E785179p3272p3886p5097p7998q1048q2558q3640q6904r3032j00344j07358
56891D850042j14180j21273j28084j33359j36365j37515j37847j37870j37123
56882C666426j35202j32936j31673j31285j29843j25733j19388j12464j05996
56873B541906r9878r3585q6765p9621p3210o8927o7163o6838o6707o6526o6329
56862A706357o5229o1986n6770n1280m6889m3344l9677l5762l2345k9670k6873
56851A216532k3091j8783j5366j3620j3022j2691j2407j2352j2414j2304j2040
56840A058442j1746j1256j0394r271p794n392k010J017K122J437O30Q84J989L404
56826A012062M923O044N894M377K436O32j552m267o139n680l292p84P34J600K530
$$ y = [5785179, 5711907, 5638021, 5562924, 5484926, 5403878, 5321320, 5237680, 5150776, 5057744, 4957400, 4850042, 4735862, 4614589, 4486505, 4353146, 4216781, 4079266, 3941419, 3803549, 3666426, 3531224, 3398288, 3266615, 3135330, 3005487, 2879754, 2760366, 2647902, 2541906, 2442028, 2348443, 2261678, 2182057, 2108847, 2039920, 1972757, 1905919, 1839212, 1772686, 1706357, 1641128, 1579142, 1522372, 1471092, 1424203, 1380859, 1341182, 1305420, 1273075, 1243405, 1216532, 1193441, 1174658, 1159292, 1145672, 1132650, 1119959, 1107552, 1095200, 1082786, 1070482, 1058442, 1046696, 1035440, 1025046, 1015775, 1007981, 1002589, 1000579, 1001596, 1003718, 1005155, 1005785, 1006669, 1008658, 1012062, 1016985, 1023029, 1028923, 1033300, 1035736, 1036368, 1034816, 1030549, 1024410, 1018730, 1015438, 1014654, 1015388, 1016988, 1019518]
56811A019518L837N674Q189J1177J4115J6751J9195K1508K3663K5857K8234L0078
56799A227796L0011K7316K2665J7161J1107M319k651q422j2054j3836j4453j3865
56787A275094j1663q225m679j575J765O196J1536J6802K1283K4933K8091L1289
56775A390847L4924L8474M0224L8586L3626K6590J7867O490p814k2597l3770l8851
56763A524596l8929l7166l5463l2920k7776k0425j3617r445p047l992O47N664
56751A304127R740J2961J6132J9459K2181K2939K0547J5025P766N5q261j7624
56739A425047k6587l2347l3811l2705l1104k9197k6376k3134k0458j8112j5011
56728A136205j0982o956l499l02K880N656P611Q721Q974Q059N633J656l475q874
$$ y = [1019518, 1023355, 1029029, 1037218, 1048395, 1062510, 1079261, 1098456, 1119964, 1143627, 1169484, 1197718, 1227796, 1257807, 1285123, 1307788, 1324949, 1336056, 1340375, 1337724, 1329302, 1317248, 1303412, 1288959, 1275094, 1263431, 1255206, 1250527, 1248952, 1250717, 1256913, 1268449, 1285251, 1306534, 1331467, 1359558, 1390847, 1425771, 1464245, 1504469, 1543055, 1576681, 1603271, 1621138, 1627628, 1619814, 1597217, 1563447, 1524596, 1485667, 1448501, 1413038, 1380118, 1352342, 1331917, 1318300, 1308855, 1301808, 1297816, 1298463, 1304127, 1313867, 1326828, 1342960, 1362419, 1384600, 1407539, 1428086, 1443111, 1450877, 1450932, 1442671, 1425047, 1398460, 1366113, 1332302, 1299597, 1268493, 1239296, 1212920, 1189786, 1169328, 1151216, 1136205, 1125223, 1118267, 1114768, 1114466, 1117346, 1123002, 1130613, 1139334, 1148308, 1156367, 1162000, 1163656, 1160181, 1151307]
56714A151307j3505j6934j9522k1531k2460k1719j9615j7148j5194j4354j4962
56703I54363j6424j7081j5831j3581j2011j1176r675p195n298n173n979o307o115
56690H22517o048n785m489k490j176j095j362j197j045j683k965m045m380l941
56676G80816k858j423l23k00r01j550j502q99l06j23m21r88j391j295r37r74j699
56659G63026k658l240l284k823j738j97Q59L99j442l410m436m467l923k957j572
56644G28137n1J055J315P18k15o92m70k83r03j794j531K36K130K765K293J588
56628G34298P81l69j227p58Q20K077K234J923J782J396L62n65m26L37L27q47k010
56611G40135j985r72J3L49k8j145k962m844n724m962k967r32l5o05j727j978r72
$$ y = [1151307, 1137802, 1120868, 1101346, 1079815, 1057355, 1035636, 1016021, 998873, 983679, 969325, 954363, 937939, 920858, 905027, 891446, 879435, 868259, 858584, 851389, 846091, 840918, 834939, 828632, 822517, 816469, 810684, 806195, 803705, 802529, 801434, 800072, 798875, 797830, 796147, 793182, 789137, 784757, 780816, 777958, 776535, 776212, 776012, 775111, 773561, 772059, 771160, 770854, 770731, 770310, 769322, 767931, 766636, 765699, 764725, 763026, 760368, 757128, 753844, 751021, 749283, 749086, 749945, 750344, 748902, 745492, 741056, 736589, 732666, 729709, 728137, 728086, 729141, 730456, 731174, 730959, 730267, 729797, 729514, 728611, 726817, 725286, 725522, 727652, 730417, 732710, 734298, 735079, 734710, 733483, 732725, 733545, 735622, 737856, 739779, 741561, 742957, 743319, 742754, 742328, 742665, 742992, 742145, 740135, 738150, 737178, 737191, 737540, 737512, 736367, 733405, 728561, 722837, 717875, 714908, 713976, 713941, 713336, 711609, 709631, 708659]
56594G08659j6n55k218l171k491j206o87j023j537j955k247k141j773k123l628
56579F81888m944m442k556j123o15K12J756K620J936R38J041J706J591Q60Q27
56564F81695J848K918L111K213K42k416m425m355k512r55j265k958m457n039n151
56549F58494n092m131j463K079M008K659n71k435j464N57J234M90o8K98R22J205
56533F56722J139N29p96j904j351P03K168J572j48j104p70M0P78J435J654Q64
56517F61531m74p89P65L000L952L121J807J195J003M17k22L50K478M895O184O269
56501F95482N999N884N913O172O753P159O542M641K037n05k428l278k983k300
56487G35088k355l337m244m187l443k842k560k185j687j548j858j962j454j026
$$ y = [708659, 708643, 708088, 705870, 702699, 700208, 699002, 698315, 697292, 695755, 693800, 691553, 689412, 687639, 685516, 681888, 676944, 672502, 669946, 668823, 668208, 668420, 670176, 672796, 674732, 675670, 676711, 678417, 680008, 680868, 681695, 683543, 686461, 689572, 691785, 692027, 689611, 685186, 680831, 678319, 677364, 676099, 673141, 668684, 663645, 658494, 653402, 649271, 647808, 649887, 653895, 656554, 655983, 653548, 652084, 652641, 653875, 654365, 654297, 654595, 655517, 656722, 657861, 658390, 657594, 655690, 654339, 655042, 657210, 658782, 658634, 657530, 656760, 656800, 657578, 659013, 660667, 661531, 661057, 660268, 661033, 664033, 667985, 671106, 672913, 674108, 675111, 675528, 675306, 675656, 678134, 683029, 689213, 695482, 701481, 707365, 713278, 719450, 726203, 733362, 739904, 744545, 746582, 746077, 743649, 740371, 737388, 735088, 732733, 729396, 725152, 720965, 717522, 714680, 712120, 709935, 708248, 706700, 704842, 702880, 701426, 700400]
56473G00400j703l215m031l242j876j595k526l215k729j786j485j682j348j13
56459F69854J232J642Q37n63j564j590j000p24j262k225k815k512j337R0Q16M60
56443F59339j79j27K21l93j925k693j759l80j15o45p80n93j048k022k372j776
56427F42753j122r71q47k74M58P86M42m35j230j130j85M14j22r19q19l11o07j381
56409F34500j188k6M76l21j104p76P9O04J024J684K030J537P19L71O21J272K122
56392F43624K403J097j439l226k890j193M02J591K648L073K233P19j69j4N73J064
56376F50496J452J764J838J434K24j815l747m265l325k295j899j218N04K297K879
56361F44324K544K244J642j75k598l848l295j917n46Q23J873J647o4k031k843
$$ y = [700400, 698697, 695482, 691451, 688209, 686333, 684738, 682212, 678997, 676268, 674482, 672997, 671315, 669967, 669854, 671086, 672728, 673565, 673002, 671438, 669848, 668848, 668124, 666862, 664637, 661822, 659310, 657973, 658063, 658879, 659339, 659160, 659033, 659254, 658861, 656936, 654243, 652484, 652104, 651989, 651344, 650564, 649971, 648923, 646901, 644529, 642753, 641631, 640660, 639813, 639539, 639997, 640783, 641225, 640790, 639560, 638430, 638245, 638659, 638537, 637618, 636799, 636488, 635881, 634500, 633312, 633286, 633762, 633441, 632337, 631561, 631640, 632244, 633268, 634952, 636982, 638519, 639238, 639609, 640230, 641502, 643624, 646027, 647124, 645685, 642459, 639569, 638376, 638778, 640369, 643017, 646090, 648323, 649042, 648873, 648859, 649432, 650496, 651948, 653712, 655550, 656984, 657208, 655393, 651646, 647381, 644056, 641761, 639862, 638644, 639148, 641445, 644324, 646868, 649112, 650754, 650579, 647981, 644133, 640838, 638921, 638375, 639198, 641071, 642718, 642654, 640623, 637780]
56346F37780k162n84J044K113K586K920L138K485P87m66K25J950K277N92j069
56331F53616r34M47J691K551L195K987J529J30N62K539L937L472J950O99j3m29
56315F77929l11N80J527J441M09j88O00K134L189L555L892M261L846K366Q18K66
56299G06314N37P87Q32R93R99J71j269k036j280N13K378L879M854M956M144L200
56283G29972K965L285L347K959K699K820K673J678L85K1J051K601L434L237K735
56268G65862K676L031L314L432L768M394M719M343L911M388N471N460L236j37
56254H17868k408k444r42Q87K455L519L707K868J466L26J89J440L677N603O234
56239H44445O293P359R420J0621R948Q627P836O775M689L284M741Q070J0041R580
$$ y = [637780, 635618, 635034, 636078, 638191, 640777, 643697, 646835, 649320, 650107, 649641, 649866, 651816, 654093, 654685, 653616, 652682, 653129, 654820, 657371, 660566, 663553, 665082, 665212, 665774, 668313, 672250, 675722, 677672, 678371, 678358, 677929, 677618, 678198, 679725, 681166, 681575, 681387, 681987, 684121, 687310, 690865, 694757, 699018, 702864, 705230, 706048, 706314, 706851, 707638, 708470, 709463, 710462, 710633, 709364, 707328, 706048, 706561, 708939, 712818, 717672, 722628, 726772, 729972, 732937, 736222, 739569, 742528, 745227, 748047, 750720, 752398, 752783, 752804, 753855, 756456, 759890, 763127, 765862, 768538, 771569, 774883, 778315, 782083, 786477, 791196, 795539, 799450, 803838, 809309, 814769, 818005, 817868, 815460, 813016, 812074, 812961, 815416, 818935, 822642, 825510, 826976, 827302, 827491, 828931, 832608, 838211, 844445, 850738, 858097, 867517, 878138, 888086, 896713, 904549, 911324, 916013, 919297, 924038, 932108, 942149, 951729]
56225I51729Q831R673J1568J3329J4740J5643J5561J5203J6243J8546J9726J8899
56213A129691J8634K1295K5339K7721K8487L0246L3822L7157L8584L8877L9674
56202A469527M1670M4830M8895N3234N7319O1608O7024P3503Q0014Q6013R1777
56191B175414R7496J03230J09683J17653J26437J34070J39489J43334J46197J47290
56181C440293J45509J40920J34309J25790J14692J00626Q4059O5657M5440K3098
56171D420393o12k3312m2744n9094p4476q9813j03391j13217j19532j23848j26631
56160C543723j27415j26408j24334j21164j16578j11382j06842j02838r8210r2726
56150B415826q7150q1599p5604o9772o5482o2628n9442n5037n0408m6434m2664
$$ y = [951729, 960560, 970233, 981801, 995130, 1009870, 1025513, 1041074, 1056277, 1072520, 1091066, 1110792, 1129691, 1148325, 1169620, 1194959, 1222680, 1251167, 1281413, 1315235, 1352392, 1390976, 1429853, 1469527, 1511197, 1556027, 1604922, 1658156, 1715475, 1777083, 1844107, 1917610, 1997624, 2083637, 2175414, 2272910, 2376140, 2485823, 2603476, 2729913, 2863983, 3003472, 3146806, 3293003, 3440293, 3585802, 3726722, 3861031, 3986821, 4101513, 4202139, 4286198, 4351855, 4397295, 4420393, 4419781, 4396469, 4353725, 4294631, 4220155, 4130342, 4026951, 3913734, 3794202, 3670354, 3543723, 3416308, 3289900, 3165566, 3044402, 2927824, 2816442, 2709600, 2606762, 2508552, 2415826, 2328676, 2247077, 2171473, 2101701, 2036219, 1973591, 1914149, 1859112, 1808704, 1762270, 1719606]
56139A719606l8767l5457l2990l0290k6788k3744k2397k1881k0446j7960j5760
56128A433126j4468j3370j1807j0005q337o669m786k966j817j550j572r77L95
56115A355197J699K280K688L798N177N537M881M937O910R729J1398J1435J1260
56102A436926J2286J4420J6423J7443J7950J9118K1400K4137K6589K8697L0545
56091A665934L1944L3238L5703M0084M5415N0398N5270O0989O7244P2957P8329
56080B237505Q4416R0667R4717R4942R1672Q5706P7473O8157N9874N3890M9787
56069C088806M6810M4605M2380L8953L4225K9107K3582J6485P754r84q884j7166
56057C345673k7013l7951m9328o1407p3592q3245q8004q8097q5009p9324p1466
$$ y = [1719606, 1680839, 1645382, 1612392, 1582102, 1555314, 1531570, 1509173, 1487292, 1466846, 1448886, 1433126, 1418658, 1405288, 1393481, 1383476, 1375139, 1368470, 1363684, 1360718, 1358901, 1357351, 1355779, 1354802, 1355197, 1356896, 1359176, 1361864, 1365662, 1370839, 1376376, 1381257, 1386194, 1393104, 1402833, 1414231, 1425666, 1436926, 1449212, 1463632, 1480055, 1497498, 1515448, 1534566, 1555966, 1580103, 1606692, 1635389, 1665934, 1697878, 1731116, 1766819, 1806903, 1852318, 1902716, 1957986, 2018975, 2086219, 2159176, 2237505, 2321921, 2412588, 2507305, 2602247, 2693919, 2779625, 2857098, 2925255, 2985129, 3039019, 3088806, 3135616, 3180221, 3222601, 3261554, 3295779, 3324886, 3348468, 3364953, 3372707, 3371723, 3362839, 3345673, 3318660, 3280709, 3231381, 3169974, 3096382, 3013137, 2925133, 2837036, 2752027, 2672703, 2601237]
56046B601237o3055n5531m8387m0633l3263k8257k5636k3261j9461j4433r253
56035B240067m862j910m80J09O55J399K429L914N450O124O110P047R842J3148
56021B289042J5243J6406J7968J9896K0923K0618J9843J9436J9675K0739K2607
56010B502396K4763K6761K8609L0057L0537L0670L2439L6564M0793M2398M1430
55999B867417L9981L9245L9233M0320M2873M5594M6492M5572M4823M5466M6861
55988C343877M8134M9215M9998N0011M9451M9345N0329N2084N4080N6161N8354
55977C911039O0877O3963O7131O9250P0332P2401P7192Q3557Q8723R1750R4134
55966D750349R7232J00840J04504J08578J13401J18606J23873J29597J36297J43730
$$ y = [2601237, 2538182, 2482651, 2434264, 2393631, 2360368, 2332111, 2306475, 2283214, 2263753, 2249320, 2240067, 2235205, 2233295, 2232815, 2232924, 2233579, 2234978, 2237407, 2241321, 2246771, 2252895, 2259005, 2266052, 2275894, 2289042, 2304285, 2320691, 2338659, 2358555, 2379478, 2400096, 2419939, 2439375, 2459050, 2479789, 2502396, 2527159, 2553920, 2582529, 2612586, 2643123, 2673793, 2706232, 2742796, 2783589, 2825987, 2867417, 2907398, 2946643, 2985876, 3026196, 3069069, 3114663, 3161155, 3206727, 3251550, 3297016, 3343877, 3392011, 3441226, 3491224, 3541235, 3590686, 3640031, 3690360, 3742444, 3796524, 3852685, 3911039, 3971916, 4035879, 4103010, 4172260, 4242592, 4314993, 4392185, 4475742, 4564465, 4656215, 4750349, 4847581, 4948421, 5052925, 5161503, 5274904, 5393510, 5517383, 5646980, 5783277, 5927007]
55956E927007J50936J57112J62636J69037J77416J86892J95658K03671K13012
55947G543377K25184K39557K55044K71613K89225L07162L25665L46470L70335
55938A0173632L95740M21657M49676M81545N16571N53624N93944O39404O89718
55929A4915511P44142Q04639Q74283R53280J039177J130391J227026J328955J435469
55920B4452873J546145J659876J774042J887072K001269K121156K250070K389907
55912D0082410K542523K709719K894430L104334L351265L643647L981798M363598
55904F6673724M792370N277777N835696O493318P288277Q251502R387616J0674168
55896A24674448J2076784J3562876J5110017J6712660J8378597K0109021K1875470
$$ y = [5927007, 6077943, 6235055, 6397691, 6566728, 6744144, 6931036, 7126694, 7330365, 7543377, 7768561, 8008118, 8263162, 8534775, 8824000, 9131162, 9456827, 9803297, 10173632, 10569372, 10991029, 11440705, 11922250, 12438821, 12992445, 13586389, 14225793, 14915511, 15659653, 16464292, 17338575, 18291855, 19331032, 20461423, 21688449, 23017404, 24452873, 25999018, 27658894, 29432936, 31320008, 33321277, 35442433, 37692503, 40082410, 42624933, 45334652, 48229082, 51333416, 54684681, 58328328, 62310126, 66673724, 71466094, 76743871, 82579567, 89072885, 96361162, 104612664, 114000280, 124674448, 136751232, 150314108, 165424125, 182136785, 200515382, 220624403, 242499873]
55889B42499873K3595156K5074067K5920890K5530361K3242551J8634940J1763621
55882C96261459L219248n982898j4611968k1516836k5964604k7855876k7654324
55875B75894201k6079636k3797636k1281749j8822865j6577927j4608493j2918527
55868A41807368j1487848j0285168r269757q400822p649100o994883o418516n899744
55860G5401530n423685m981200m565223m171722l801992l459070l143163k853728
55852D3001747k592858k362183k158531j976717j814572j671602j544782j429734
55844B7450768j324755j230311j145741j069259r99954r37312q80114q27852p81260
55835A8254210p39646p00103o61529o26544n96805n69326n40688n12138m86958
$$ y = [242499873, 266095029, 291169096, 317089986, 342620347, 365862898, 384497838, 396261459, 399480707, 393497809, 378885841, 357369005, 331404401, 303548525, 275894201, 249814565, 226016929, 204735180, 185912315, 169334388, 154725895, 141807368, 130319520, 120034352, 110764595, 102363773, 94714673, 87719790, 81301274, 75401530, 69977845, 64996645, 60431422, 56259700, 52457708, 48998638, 45855475, 43001747, 40408889, 38046706, 35888175, 33911458, 32096886, 30425284, 28880502, 27450768, 26126013, 24895702, 23749961, 22680702, 21680748, 20743436, 19863322, 19035470, 18254210, 17514564, 16814461, 16152932, 15526388, 14929583, 14360257, 13819569, 13307431, 12820473]
55826A2820473m65079m44255m24616m07903l93432l78638l62948l47661l32784
55817I263157l17232l01504k87097k73957k61285k49902k40876k32779k23511
55808F875014k13975k06584k00862j94065j85865j78818j74100j69997j64971
55799E185777j59288j53303j46961j41155j36839j32690j26532j19279j14367
55790C955363j12782j11737j08970j05349j02082r8440r3708q8946q5131q1554
55780B966664p7504p3722p0826o8080o4992o2448o0932n9330n6832n4492n3395
55769B264111n2686n0956m8360m5967m4041m2377m1307m1059m0911m0331m0120
55758A775996m1172m2733m3234m2199m0226l7703l4920l2863l2455l3024l2799
$$ y = [12820473, 12355394, 11911139, 11486523, 11078620, 10685188, 10306550, 9943602, 9595941, 9263157, 8945925, 8644421, 8357324, 8083367, 7822082, 7572180, 7331304, 7098525, 6875014, 6661039, 6454455, 6253593, 6059528, 5873663, 5694845, 5520745, 5350748, 5185777, 5026489, 4873186, 4726225, 4585070, 4448231, 4315541, 4189009, 4069730, 3955363, 3842581, 3730844, 3621874, 3516525, 3414443, 3316003, 3222295, 3133349, 3048218, 2966664, 2889160, 2815438, 2744612, 2676532, 2611540, 2549092, 2488160, 2428830, 2371998, 2317506, 2264111, 2211425, 2160469, 2112109, 2066142, 2022101, 1979724, 1938417, 1897358, 1856447, 1816116, 1775996, 1734824, 1692091, 1648857, 1606658, 1566432, 1528729, 1493809, 1460946, 1428491, 1395467, 1362668]
55747A362668l0992k8421k6116k4278k2840k2062k2024k2010k1059j8939j6291
55736A107636j3819j1684r844q675q576r059q952p871o753o327n977n004m225
55723A000870m911o673p964q618j0053j2708j4853j4846j3208j1647j0959j0624
55711H73806r702p520m301j550r87k568m582o012p715j0616j4026j6592j7816
55698G69819j7681j5966j3058j0514r475r367r238r513j0913j2480j2439j0686
55686F28489q796p745p126o544o197n925n105l816k867k513k457l156n438q308
55672E52496r023o612l885m334p843j1050j1427r425o850m847l970m618o314p337
55658D54961o212l334m86J220K112K890L564L784L569L184K582J525J52j041j860
$$ y = [1362668, 1331676, 1303255, 1277139, 1252861, 1230021, 1207959, 1185935, 1163925, 1142866, 1123927, 1107636, 1093817, 1082133, 1072289, 1063614, 1055038, 1045979, 1037027, 1029156, 1022403, 1016076, 1010099, 1005095, 1000870, 995959, 989286, 981322, 972704, 962651, 949943, 935090, 920244, 907036, 895389, 884430, 873806, 864104, 856584, 852283, 850733, 849746, 847178, 842596, 836584, 828869, 818253, 804227, 787635, 769819, 752138, 736172, 723114, 712600, 703125, 693758, 684520, 675007, 664094, 651614, 639175, 628489, 619693, 611948, 604822, 598278, 592081, 586156, 581051, 577235, 574368, 571855, 569398, 566242, 560804, 552496, 543473, 536861, 532976, 528642, 520799, 509749, 498322, 488897, 482047, 477200, 473230, 468612, 462298, 454961, 448749, 445415, 444929, 446149, 448261, 451151, 454715, 458499, 462068, 465252, 467834, 469359, 469511, 468470, 466610]
55643D66610k697l968n511o659o896o375n831n881o343o439n746m665l723k925
55629C92951k196k004k672l374k818r80P67J503J669J755J261k02j674j870r50
55614C81166k39l40n89k93L26N95J75p55j681k084j969j889k072j856o30R50J510
55597C70325O97l70n12L27J369J861J528P14K27N20J052R29J41m59m24k25l71
55580C77329p74j180j628k212k912l825n047o246o960p300p658p701o671m800
55566C12415l449l404l974m197l891l146j878n88l66j265j816j208q20k132m175
55551B76106m688l319j842j478j754k075k568l080k843j740o85k63p4J33m9o15
55535B49166p92m10l87j131j711j538j536k359k652q29K134L615K888J875K101
$$ y = [466610, 463913, 459945, 454434, 447775, 440879, 434504, 428673, 422792, 416449, 410010, 404264, 399599, 395876, 392951, 390755, 388751, 386079, 382705, 379887, 378907, 379674, 381177, 382846, 384601, 385862, 385660, 383986, 382116, 381166, 380927, 380587, 379998, 379705, 380031, 380626, 380801, 380046, 378365, 376281, 374312, 372423, 370351, 368495, 367865, 368815, 370325, 371022, 370652, 370140, 370467, 371836, 373697, 375225, 375939, 376166, 376686, 377738, 378667, 378808, 378349, 377925, 377700, 377329, 376555, 375375, 373747, 371535, 368623, 364798, 359751, 353505, 346545, 339245, 331587, 323886, 317215, 312415, 308966, 305562, 301588, 297391, 293500, 290354, 288476, 287888, 287522, 286257, 284441, 283233, 282413, 280281, 276106, 271418, 268099, 266257, 264779, 263025, 260950, 258382, 255302, 252459, 250719, 250034, 249771, 249697, 249830, 249781, 249166, 248374, 247964, 247577, 246446, 244735, 243197, 241661, 239302, 236650, 235821, 237955, 241570, 244458, 246333, 248434]
55520B48434K754K598K295L328N458O835O581N863N994O587O478N753N645O518
55506C21121P164O517M959L232J033k137n306o822o765p095q928j1039j1764j1243
55492B72927j0722j0391r298p093m744l246k417j315L66J700J505j09j639k010
55478B23514k030l050m568m611k646n11K79M99J438K574K615J799J296J048R2
55463B17738j250j494n00m3j309l211l966l236j983j078o81n52l99k43m31j025
55447A96337j403j177j091j984l195l213j841l76L21M98J48j240l066l545k162
55432A73011p20q56j866k179j638r10J66J847K979K114j90j879k101j838j854
55417A64086j685r58k36P9N22J493K332K238J490R12N45l55j989l400l408j883
$$ y = [248434, 251188, 253786, 256081, 259409, 264867, 271702, 278283, 284146, 290140, 296727, 303205, 308958, 314603, 321121, 328285, 334802, 339761, 342993, 344026, 341889, 336583, 329761, 322996, 315901, 306973, 295934, 284170, 272927, 262205, 251814, 242516, 235423, 230679, 227433, 225016, 223701, 224067, 225767, 227272, 227163, 225524, 223514, 221484, 218434, 213866, 209255, 206609, 206098, 206377, 206876, 208314, 210888, 213503, 215302, 216598, 217646, 217738, 216488, 214994, 214494, 214451, 213142, 209931, 205965, 202729, 200746, 199668, 198987, 198435, 198036, 197793, 197362, 196337, 194934, 193757, 192666, 190682, 187487, 184274, 182433, 182057, 182378, 182876, 183024, 181784, 178718, 175173, 173011, 172291, 171435, 169569, 167390, 165752, 164842, 165008, 166855, 169834, 171948, 171758, 169879, 167778, 165940, 164086, 162401, 161443, 161207, 161286, 161808, 163301, 165633, 167871, 169361, 170273, 170818, 170463, 168474, 165074, 161666, 159783]
55401A59783J70J693K342K092O88j834m248m821l194q90M92Q31P35K45p62j628
55385A51694j628j203j231j407p80K55J14j442k536j743m9Q31Q06P52M42r84k811
55368A39080k933p33J748K321J183k6o30j111j473r98L51J606K239K765L435L416
55352A50240K111L93n20q15j553k801l450k878j702q01m93p17j165j131k33O29
55336A35114J09j556k441j337P94K288K669K439J982J573J634K018J675O4j688
55321A45337k025j005j26l88j434k441k904k560j394P9J056J065J65j188k188
55306A30049k014o85P07J133O72O2l71p44j040j101r97r25r97j336j847j722k10
55289A18634J715J846k27j947j118R06J289N8j25J665L023J720j275l385l532
$$ y = [159783, 159953, 161646, 163988, 166080, 166768, 164934, 160686, 155865, 152671, 151781, 152273, 153104, 153839, 154084, 153322, 151694, 150066, 148863, 147632, 146225, 145445, 145700, 145814, 144372, 141836, 140093, 140044, 140875, 141681, 142433, 142875, 141891, 139080, 136147, 135414, 137162, 139483, 140666, 140640, 140010, 138899, 137426, 136428, 136779, 138385, 140624, 143389, 146824, 150240, 152351, 152744, 152224, 151409, 149856, 147055, 143605, 140727, 139025, 138224, 137731, 137014, 135849, 134718, 134485, 135114, 135223, 133667, 131226, 129889, 130683, 132971, 135640, 138079, 140061, 141634, 143268, 145286, 146961, 147025, 145337, 143312, 142307, 142181, 141793, 140359, 137918, 135014, 132454, 131060, 131139, 132195, 133260, 133425, 132237, 130049, 128035, 127350, 128057, 129190, 129862, 129924, 129553, 128809, 127769, 126668, 125671, 124746, 123749, 122413, 120566, 118844, 118634, 120349, 122195, 121968, 120021, 118903, 119809, 121098, 121156, 121031, 122696, 125719, 127439, 126164, 122779, 119247]
55274A19247k447r77N94J965K642K374J398K62n29r31j343j888k005j245m0J001
55258A18078K026L225L672K285k00j674j238j15K26l36j068j307o06R34K223K011
55242A28136N19q17j194r75m74L58J008Q09M62J354K978L059R61j098j327q71
55226A32888j518k674k590j344n55p82j019l89R57K350K923J987L3j387j650j851
55210A25379k649k739j080P51O54n79l97J430K466J448o8m22M0M10Q11J290P57
55193A27502j456l903m365k572m68J92k12J67K274M725N139K948J86j053j057
55178A28047j378k102j911o68L5p08j750j800j251j107j229q14M6N55N70O93J126
55161A16354J365J084N95K58M5q3J80J007J870J974J303P56Q56R17J31q15m01
$$ y = [119247, 116800, 115823, 116417, 118382, 121024, 123398, 124796, 125058, 124529, 123598, 122255, 120367, 118362, 117117, 117077, 118078, 120104, 123329, 127001, 129286, 129086, 127412, 126174, 126059, 126285, 125949, 124881, 123574, 122968, 123902, 126125, 128136, 128655, 127838, 126644, 125669, 125195, 125553, 126561, 127370, 127832, 129186, 132164, 135223, 136184, 135086, 133759, 132888, 131370, 128696, 126106, 124762, 124207, 123425, 122406, 122017, 122974, 125324, 128247, 130234, 130267, 128880, 127230, 125379, 122730, 119991, 118911, 119662, 120316, 119737, 119340, 120770, 123236, 124684, 124616, 124194, 124234, 124644, 125455, 126745, 127502, 126046, 122143, 117778, 115206, 114738, 114930, 114718, 114885, 117159, 121884, 127023, 129971, 130157, 129104, 128047, 126669, 124567, 122656, 121988, 122023, 121315, 119565, 117765, 116514, 115407, 114178, 113364, 113410, 113965, 114535, 115228, 116354, 117719, 118803, 119398, 119656, 119701, 119618, 119798, 120805, 122675, 124649, 125952, 126708, 127564, 128481, 128612, 127797, 127396]
55144A27396J285K117O70j705k669j927j114j176j440j164n47K6N74J007J041
55129A22374R67J490K440K605J348m07j276r68k81j1k18k94L13J174J009o73k435
55112A27157k482j039K6j58o59o75o72r10m79J225L115L670K815J626Q39M73K83
55095A34155j27r75j491l29K298L956K675m03k372k120j054o22o54m21OJ67P8
55078A32767K6m1l23n52m8J451L115L503K041j30j307j177q43q61l61J229K650
55061A41139K258L88j012r47l57m94j308j863j575o06N13J341J824K260K721K704
55045A46986J699m8j746k916l563l691l167k033n03J237K768L220K067J69q18
55030A39661k88O41O19k29n45M91J986K176M42j734k180m54J726K585K169J611
$$ y = [127396, 128681, 130798, 131468, 129763, 127094, 125167, 124053, 122877, 121437, 120273, 119726, 119752, 120326, 121333, 122374, 123341, 124831, 127271, 129876, 131224, 130817, 129541, 128573, 128292, 128281, 128063, 127769, 128082, 129256, 130265, 129592, 127157, 124675, 123636, 123662, 123504, 122845, 122170, 121498, 120588, 120109, 121334, 124449, 128119, 130934, 132560, 133399, 133872, 134155, 134028, 133053, 131562, 131233, 133531, 137487, 140162, 139759, 137387, 135267, 134213, 133591, 132937, 132516, 132522, 132689, 132767, 132793, 132752, 132429, 131877, 131829, 133280, 136395, 139898, 141939, 141809, 140502, 139325, 138482, 137621, 137260, 138489, 141139, 143397, 143785, 142773, 141826, 141469, 140975, 139667, 137804, 136229, 135623, 136136, 137477, 139301, 141561, 144282, 146986, 148685, 148637, 146891, 143975, 140412, 136721, 133554, 131521, 131018, 132255, 135023, 138243, 140310, 140479, 139661, 139373, 140014, 140633, 140404, 139859, 140350, 142336, 144512, 144954, 143220, 141040, 140586, 142312, 144897, 147066, 148677]
55014A48677J263N79n31j320j330j087j338k106k611j932J49K552L558K509N80
54999A47612p29j370k128k822k400p76Q51J631J823J668Q79l02p61p0O94M51m22
54982A43829r09p95n06k98m13j140j880j130J434L768L704J729jp53j499k400
54966A42740k277r75j90r34j779r78Q86J803J175K74J70N01M20k10p82o01N11
54949A39754J841K221J220k62j088j174j141j034l19R81K080K405K052J280L94
54934A49210M2N84J063Q0j938k693j061J168J708P59Q9Q7l20j202j299k99M97
54917A46475N12R73K657M128L813K494J973K068R36j720l772l467j648l62l35
54902A54725p24o96k92P0K12K49L29M01L02J15K67R46J569J372M99j46k70o55
$$ y = [148677, 149940, 150519, 149988, 148668, 147338, 146251, 144913, 142807, 140196, 138264, 138413, 140965, 144523, 147032, 147612, 146883, 145513, 143385, 140563, 138163, 137387, 138238, 139869, 141692, 143360, 144239, 143937, 143176, 143106, 143800, 144251, 143829, 142920, 142125, 141619, 141321, 140908, 139768, 137888, 136758, 138192, 141960, 145664, 147393, 147392, 146639, 145140, 142740, 140463, 139488, 139298, 138364, 136585, 135607, 136493, 138296, 139471, 139745, 139915, 140416, 140836, 140626, 139844, 139243, 139754, 141595, 143816, 145036, 144774, 143686, 142512, 141371, 140337, 140018, 140999, 143079, 145484, 147536, 148816, 149210, 149252, 149836, 150899, 150979, 149041, 146348, 145287, 146455, 148163, 148922, 149011, 149098, 148778, 147576, 146277, 145978, 146475, 146987, 147960, 150617, 154745, 158558, 161052, 163025, 165093, 166029, 164309, 160537, 157070, 155422, 155060, 154725, 154001, 153305, 153013, 153083, 153295, 153544, 153873, 154274, 154576, 154691, 154958, 155904, 157473, 158845, 159344, 159198, 158928, 158273]
54884A58273j857l030k813j098O88J177M45k99j30P09J300J165N83n5p83j554
54868A52721j632k52K157M054M373L536K711K595L163M062M793M815L975K807
54854A93878K156K626M265O428P928P832O356M505K736O01j966l822l838k533
54840B27152j755k718m862o529o495n056l723l612m106l693k196j052j065j107
54826A79183j01J026P73l69o35K57R30P94P86J441K107K529L401M598M627K966
54810B04313J434J902L809N227N393M794L781K586J998K344K278J78l479o543
54796B30015p788p729p130o270n568n492n553m891l860l648m090l606j792l70
54782A62228p41j979k348j554m53M78J180J353R06M86N91P71N66M63Q32Q01m59
$$ y = [158273, 156416, 153386, 150573, 149475, 150163, 151340, 151785, 151486, 151356, 152065, 153365, 154530, 155113, 155058, 154275, 152721, 151089, 150837, 152994, 157048, 161421, 164957, 167668, 170263, 173426, 177488, 182281, 187096, 191071, 193878, 196034, 198660, 202925, 209353, 217281, 225113, 231469, 235974, 238710, 239311, 237345, 233523, 229685, 227152, 225397, 222679, 217817, 211288, 204793, 199737, 196014, 192402, 188296, 184603, 182407, 181355, 180290, 179183, 179082, 180108, 180881, 180512, 179877, 180134, 181064, 181858, 182644, 184085, 186192, 188721, 192122, 196720, 201347, 204313, 205747, 207649, 211458, 216685, 222078, 226872, 230653, 233239, 235237, 237581, 239859, 240037, 236558, 230015, 222227, 214498, 207368, 201098, 195530, 190038, 184485, 179594, 175734, 172086, 167996, 164390, 162598, 162228, 161487, 159508, 157160, 155606, 155153, 155631, 156811, 158164, 159070, 159556, 160147, 160918, 161484, 161947, 162779, 163580, 163121]
54765A63121j900j709l9J006K28j295k076k052j858j430l53J021J758J577J261
54750A57260J722K813L267J993m54k097j677k16K26r10k231k368j369L3J461K595
54734A60048K700J460j19n03N89J827J754L06j293j861j263k05P35J585K472L091
54718A71323K922J970Q88M29Q97J926K628K326J509J557K939M225L838K487K502
54703B04366M681P085P541O250N038M899N300N312M435K507m9j965k020n74M55
54688B53261m29k738m691n221m847m589m612m314l548l055l453m319m762m491
54674A98192l736k498p40Q61J309N52m67j088j346j096Q7J762K601K153J597J954
54658B00097K673K930L259M578O266O740N531L554J656J80l40L96J253M25k235
$$ y = [163121, 161221, 159512, 159473, 160479, 160707, 159412, 157336, 155284, 153426, 151996, 151643, 152664, 154422, 155999, 157260, 158982, 161795, 165062, 167055, 166601, 164504, 162827, 162611, 162837, 161927, 159696, 157328, 155959, 155992, 157453, 160048, 162748, 164208, 164089, 163586, 164175, 166002, 167756, 168062, 166769, 164908, 163645, 163440, 164175, 165760, 168232, 171323, 174245, 176215, 177103, 177532, 178429, 180355, 182983, 185309, 186818, 188375, 191314, 195539, 199377, 201864, 204366, 209047, 216132, 223673, 229923, 234961, 239860, 245160, 250472, 254907, 257414, 257365, 255400, 253380, 252806, 253261, 252832, 250094, 245403, 240182, 235335, 230746, 226134, 221820, 218272, 215217, 211764, 207445, 202683, 198192, 194456, 191958, 191218, 192079, 193388, 193940, 193473, 192385, 191039, 189943, 190030, 191792, 194393, 196546, 198143, 200097, 202770, 205700, 208959, 213537, 219803, 226543, 232074, 235628, 237284, 237464, 237124, 237520, 238773, 239198, 236963]
54643B36963m830n792n495n098m927m720m557m617m575l945k705j220Q3O34k9
54628A85170j532k705k838k379j966j426m02N62M91n93j494j224r5P48N82j78
54612A70721m79J87J123J243L83o35j286j965k942l389k264M9J795J700L31o36
54596A63936k14R41J352L00j527k962l547l417k341J02L202M976M134J760K16
54581A66911N58J689J987J050k77j046j082q81q38p69l70p6p21k073k508j029
54565A60525J043J506K61n44M65K022K147Q41k60l70l69j113k036j975p97L80
54549A61726M71m78j487j811j603j381j115l55O88J011K53l93L93K072K821K088
54533A62900J303J625K188J568N9p59k75N81Q17L13p39k107k959k276k95J338
$$ y = [236963, 232133, 226341, 220846, 215748, 210821, 206101, 201544, 196927, 192352, 188407, 185702, 184482, 184565, 185199, 185170, 183638, 180933, 178095, 175716, 173750, 172324, 171922, 172484, 172975, 172382, 170888, 169664, 169569, 170317, 170899, 170721, 170242, 170429, 171552, 172795, 173178, 172543, 171257, 169292, 166350, 162961, 160697, 160746, 162541, 164241, 164572, 163936, 163722, 164663, 166015, 166315, 164788, 161826, 158279, 154862, 152521, 152623, 155825, 160801, 164935, 166695, 166911, 167469, 169158, 171145, 172195, 171918, 170872, 169790, 168909, 168071, 167302, 166932, 166856, 166135, 164062, 161554, 160525, 161568, 163074, 163335, 162791, 163256, 165278, 167425, 168266, 168006, 167636, 167267, 166154, 164118, 162143, 161346, 161726, 162197, 161719, 160232, 158421, 156818, 155437, 154322, 153967, 154655, 155666, 155919, 155526, 155919, 157991, 160812, 162900, 164203, 165828, 168016, 169584, 169643, 168884, 168609, 169190, 170007, 170320, 169581, 167474, 164515, 162239, 161944, 163282]
54517A63282J414L76o67j183r31L53K115K865J999Q97R16J234K76j380j587j6
54501A69963J257R16K19P12J838K041R82n97k106l027k505n02J327J354J67k70
54485A71769O84J816K093J747J341J008R32J411K075K095J530J405K028K334J566
54470A95834N52L78O31R5j297k418k682k616k547j827J1K028K698J704L08k86
54454A90566l76j135k704l637k597j13J985K715K713K729K389J055p45j793j772
54439A89280j438j220o65M20J173P06o51j777k078j809j333q00l50OP32K197L783
54422A86176M190K948R94m33r49p94k46K73J94l61k98J079K864L540K860J828
54406B03865J058K78n20o88KQ73J384J770K189K161J477P93N66K36p05j579j559
$$ y = [163282, 164696, 165072, 164405, 163222, 162291, 162644, 164759, 167624, 169623, 170520, 171436, 172670, 172946, 171566, 169979, 169963, 171220, 172136, 172355, 173067, 174905, 176946, 177928, 177331, 175225, 172198, 169693, 169191, 170518, 171872, 172039, 171769, 172453, 174269, 176362, 178109, 179450, 180458, 181390, 182801, 184876, 186971, 188501, 189906, 191934, 194268, 195834, 196386, 196764, 197395, 197490, 196193, 193775, 191093, 188477, 185930, 184103, 184114, 186142, 188840, 190544, 190852, 190566, 190190, 189055, 186351, 182714, 180117, 180004, 181989, 184704, 187417, 190146, 192535, 193590, 192845, 191052, 189280, 187842, 186622, 185957, 186377, 187550, 188256, 187605, 185828, 183750, 181941, 180608, 179808, 179458, 179464, 180196, 182393, 186176, 190366, 193314, 194308, 193875, 192926, 192132, 191886, 192159, 192353, 191992, 191694, 192773, 195637, 199177, 202037, 203865, 204923, 205201, 204681, 203993, 203995, 204868, 206252, 208022, 210211, 212372, 213849, 214642, 215208, 215444, 214739, 213160, 211601]
54389B11601j210j655k541k276m04J505J870R50P0k28m53r19j055j70J430K413
54373B08928J770P5j044q61l83p77j636j702p49L41J195K172K938K357M39r76
54357B12087n23O50M47j239k404j703k3Q30K73p39j004l22M49M56j03k03P42K267
54339B09938L619M570N056M722L457J958R70L59l42q52o20o1j85r39j078J2J422
54322B32006K002J637Q59M1m48k13M43N69j9j90Q54K173K392J653J026N67n17
54305B44835j900k033l53J726K674K607K494K550K389K057J851J452K33j534k577
54290B56471k051n49N36M86k02o94r48j615k800l577l228k454k426k913k609j354
54274B30073n89j114j824j640j344j989k637j574P39J989J302K11q0l99j674k878
$$ y = [211601, 210391, 208736, 206195, 203919, 203515, 205020, 206890, 207840, 207910, 207682, 207229, 206310, 205255, 205085, 206515, 208928, 210698, 210773, 209729, 208868, 208485, 207708, 206072, 204370, 203621, 203962, 205157, 207329, 210267, 212624, 213063, 212087, 211564, 212214, 212661, 211422, 209018, 207315, 207292, 208122, 208395, 207656, 206652, 206330, 206779, 207235, 207132, 206929, 207671, 209938, 213557, 218127, 223183, 227905, 231362, 233320, 234290, 234649, 234307, 233455, 232835, 232774, 232589, 231650, 230572, 230584, 232006, 234008, 235645, 236504, 236545, 236097, 235884, 236327, 236896, 236877, 236687, 237541, 239714, 242106, 243759, 244785, 245352, 244835, 242935, 240902, 240549, 242275, 244949, 247556, 250050, 252600, 254989, 257046, 258897, 260349, 260582, 259048, 256471, 254420, 253871, 254407, 254893, 254691, 253997, 253049, 251434, 248634, 245057, 241829, 239375, 236949, 234036, 231427, 230073, 229484, 228370, 226546, 224906, 223562, 221573, 218936, 217362, 218101, 220090, 221392, 221603, 221523, 221124, 219450, 216572]
54258B16572k433o35P16O51k73j195j782j903j521j016q62r16n84K28R06R99Q21
54241B07773R09J245J287P21J6M8J083K284K545J762P88J63m81j527k541k733
54225B13342j829j34J757L025K993J943J026Q26O33l16j460j637o66N51J207J060
54209B22321J45j098j752j364o30l59j73O62J672J793J350J730L037L725K984
54194B34043J866J337P52o82k190k517j780j019m93K57J091J222M66n02j106j367
54178B29378j470j504j550j454p03R20K680L468K890J392l34j597j844j310j105
54163B27857j723j889j16K823M239K761o1j798j796j128p56p23p52p91j053j871
54147B23223l231m250l669j492N51R80N69J204K965L677J896r32k292j689p10
$$ y = [216572, 214139, 213504, 214220, 214871, 214598, 213403, 211621, 209718, 208197, 207181, 206319, 205403, 204819, 205047, 205953, 206952, 207773, 208682, 209927, 211214, 211935, 211951, 211999, 213082, 215366, 217911, 219673, 220461, 220624, 220143, 218616, 216075, 213342, 211513, 211379, 213136, 216161, 219154, 221097, 222123, 222949, 223582, 223266, 221806, 220169, 219503, 220054, 221261, 222321, 222466, 221368, 219616, 218252, 217622, 217263, 217090, 217752, 219424, 221217, 222567, 224297, 227334, 231059, 234043, 235909, 237246, 237998, 237316, 235126, 232609, 230829, 229810, 229317, 229574, 230665, 231887, 232353, 231851, 230745, 229378, 227908, 226404, 224854, 223400, 222697, 223617, 226297, 229765, 232655, 234047, 233713, 232116, 230272, 228962, 227857, 226134, 224245, 224129, 226952, 231191, 233952, 233891, 232093, 230297, 229169, 228413, 227690, 226938, 226147, 225094, 223223, 219992, 215742, 212073, 210581, 211132, 212112, 212681, 213885, 216850, 220527, 222423, 221491, 219199, 217510, 216800]
54132B16800l81n1R24J819J682Q87M63M85K66k00j97L38O19L21K9k9n04j518j879
54113B19874o64J267K436K713K844K651J249j016k455k207j246p78r30j498k711
54098B19529m277m742l121n45J007J300J870L458M723M093J955K23M7O54N27o72
54082B26029j673j135O28J857J381j57j368j824j965j743n82J229K240J556J33
54067B24606l85K78R16M91p17j579j221K86J826J970L40j640j923R0K921M595
54051B30854M402L085J728Q76M55K35L19J092K499L541L140J556K65J33M07k4
54035B54563j042j739j881j943j901j106M40J626J568P65M78J277K647L734M117
54020B61603M058M173M683M962M181K495J080P71J127J144M01q23k016k543j891
$$ y = [216800, 216419, 216368, 217292, 219111, 220793, 221680, 222143, 222628, 222894, 222694, 222497, 222835, 223454, 223775, 223804, 223775, 223271, 221753, 219874, 219210, 220477, 222913, 225626, 228470, 231121, 232370, 231354, 228899, 226692, 225446, 224668, 223738, 222240, 219529, 215252, 210510, 207389, 206844, 207851, 209151, 211021, 214479, 219202, 223295, 225250, 225473, 225520, 226174, 226701, 226029, 224356, 223221, 223849, 225706, 227087, 226930, 225562, 223738, 221773, 220030, 219448, 220677, 222917, 224473, 224606, 224221, 224499, 225415, 225906, 225189, 223610, 222389, 222675, 224501, 226471, 226811, 225171, 223248, 223338, 226259, 230854, 235256, 238341, 240069, 240945, 241400, 241635, 241954, 243046, 245545, 249086, 252226, 253782, 254047, 254180, 254587, 254563, 253521, 251782, 249901, 247958, 246057, 244951, 245391, 247017, 248585, 249350, 249828, 251105, 253752, 257486, 261603, 265661, 269834, 274517, 279479, 283660, 286155, 287235, 288006, 289133, 290277, 290678, 289855, 287839, 285296, 283405]
54005B83405m70L36l97j872k600k255j632j006J77J853K887K647J957J807J989
53990B86826J982K253L442M801M924L912L330L811M262L991M049N300O489N920
53976C45292M342M108N567O396N181L760M601P123Q365O858M193K742L165M438
53962D16131N245M875L470J901R50M90q9p02p17l68j036l498o733q979r473q580
53946C92887o977n481n013n742o481n865m070k606k425k940l044k478j888j961
53932C35916k660l177k686j362n60j500l814n622n112k128J503L086J257k409
53918C10732m529l308l24J667J987J928K101J666L60n42r6P94Q13K49L87J544
53902C15429K841L648M089M181L446J777j8q99n47N64J812K956M044M991N444
$$ y = [283405, 282935, 283271, 282874, 281002, 278402, 276147, 274515, 273509, 273686, 275539, 278426, 281073, 283030, 284837, 286826, 288808, 291061, 294503, 299304, 304228, 308140, 311470, 315281, 319543, 323534, 327583, 332883, 339372, 345292, 349634, 353742, 359309, 365705, 370886, 374646, 379247, 386370, 394735, 401593, 405786, 408528, 411693, 416131, 421376, 426251, 429721, 431622, 432572, 433062, 432973, 432271, 431554, 431186, 430150, 426652, 419919, 410940, 401467, 392887, 385910, 380429, 375416, 369674, 363193, 357328, 353258, 350652, 348227, 345287, 342243, 339765, 337877, 335916, 333256, 330079, 327393, 326031, 325471, 323971, 320157, 314535, 309423, 307295, 308798, 311884, 313141, 310732, 306203, 302895, 302571, 304238, 306225, 308153, 310254, 311920, 312280, 311738, 311642, 312436, 313249, 313498, 313885, 315429, 318270, 321918, 326007, 330188, 333634, 335411, 335393, 334494, 333947, 334511, 336323, 339279, 343323, 348314, 353758]
53887C53758N280N056N477O497P547Q722J0870J3947J6203J5935J3598J1057R057
53874D83004O600K923j109m106n664o118n487l596r62J391L028M388N805O807
53860D86904O743N757M703M171L916L332K341J586J820L094M580N268M861M027
53846E43103L613L652L361K171N27o76j274k033l625n755p480q174q022p798q174
53831E03416r052r458q480o445m852m807n806o402n933n166n307o614q045q129
53817D08920o421m133l075l709m674m562l612l061l207l225k678k109j878j456
53803C61120o17l62j706l873m815l544j297j11q25k574l930m198l821l655l900
53788C21892l885l042j818j189j341j369m89Q96J679J382O46L21M84O02N09P13
$$ y = [353758, 359038, 364094, 369571, 376068, 383615, 392337, 403207, 417154, 433357, 449292, 462890, 473947, 483004, 489604, 492527, 491418, 487312, 481648, 475530, 470043, 466447, 465485, 466876, 469904, 474292, 480097, 486904, 493647, 499404, 504107, 508278, 512194, 515526, 517867, 519453, 521273, 524367, 528947, 534215, 539076, 543103, 546716, 550368, 553729, 555900, 556427, 555751, 554477, 552444, 548819, 543064, 535584, 527410, 519388, 511590, 503416, 494364, 484906, 476426, 469981, 465129, 460322, 454516, 448114, 442181, 437015, 431708, 425094, 417049, 408920, 402499, 398366, 395291, 391582, 386908, 382346, 378734, 375673, 372466, 369241, 366563, 364454, 362576, 361120, 360503, 360141, 358435, 354562, 349747, 346203, 344906, 344795, 343970, 341396, 337466, 333268, 329447, 325792, 321892, 318007, 314965, 313147, 311958, 310617, 309248, 308759, 309655, 311334, 312716, 313362, 313683, 314167, 314769, 315278, 315991]
53772C15991J365J468n8k477l484j904N84J466N06l13L29J717K686L058K863J655
53756C25452l26j370j70K243L777M011M148M665M707M059L910M971O126O014M998
53741C77215M584N462O949P930P676O125L995K281J247L79l87l09P10J317M43
53726D25617q59o60J217L057L529K700R67j544m155n622n548m848m320l685k625
53711D03221j754j793k464l067l585m385n247n469m832l827l112l161m092n386
53697C51047n991n232l484j561K01J811K976L167K234M63j703l592m334l611k165
53682C30226r86j75P24J593J770J245Q63J161J710J964K044K272K504K487K478
53667C51880K825L123K431N28j442j972p31J144K409L104M253O267Q150Q610P484
$$ y = [315991, 317356, 318824, 318766, 316289, 312805, 310901, 311485, 312951, 313457, 313144, 313473, 315190, 317876, 320934, 323797, 325452, 325126, 323756, 323586, 325829, 329606, 333617, 337765, 342430, 347137, 351196, 355106, 360077, 366203, 372217, 377215, 381799, 387261, 394210, 402140, 409816, 415941, 419936, 422217, 423464, 423843, 423456, 423147, 423857, 425174, 425617, 424758, 424098, 425315, 428372, 431901, 434601, 435568, 434024, 429869, 424247, 418699, 413851, 409531, 405846, 403221, 401467, 399674, 397210, 394143, 390558, 386173, 380926, 375457, 370625, 366798, 363686, 360525, 356433, 351047, 345056, 339824, 336340, 334779, 334980, 336791, 339767, 342934, 345168, 345631, 343928, 340336, 336002, 332391, 330226, 329240, 329065, 329789, 331382, 333152, 334397, 335260, 336421, 338131, 340095, 342139, 344411, 346915, 349402, 351880, 354705, 357828, 360259, 360787, 359345, 357373, 356642, 357786, 360195, 363299, 367552, 373819, 381969, 390579, 398063]
53652C98063N711M181L191K742K748K846K607K114J942K424L243L827L885L572
53638D43096L422L959M951N254M013K021J061J835L254L981L807L220K459J649
53624D87982J119Q32J41j186k199j932r13n26j126j749j570p43K11Q77Q29k3q51
53607D79173p13q3m97k285l789l509k100j290j620k198k172j488n21J95K14j11
53591D57206L69J956L082K155J00m95J247L501M440M335M264M246L864L558L962
53576D97790M541M314L472K982K821K029O79L56K105M847O574O609N989N971O734
53561E57813P429P178O029N060N382O921Q325Q245O636M786M140N054O589P407
53547F46994O918N531L918K436J331R67J437K250K845L136L261L143K803K597
$$ y = [398063, 403774, 407955, 411146, 413888, 416636, 419482, 422089, 424203, 426145, 428569, 431812, 435639, 439524, 443096, 446518, 450477, 455428, 460682, 464695, 466716, 467777, 469612, 472866, 476847, 480654, 483874, 486333, 487982, 489101, 489933, 490074, 488888, 486689, 484757, 483844, 483318, 482192, 480443, 478873, 478130, 478341, 479218, 480047, 480024, 479173, 478460, 478377, 477880, 475595, 471806, 468297, 466197, 464907, 463287, 461089, 458917, 457429, 456908, 457103, 457317, 457206, 457575, 459531, 462613, 464768, 464868, 464373, 465620, 469121, 473561, 477896, 482160, 486406, 490270, 493828, 497790, 502331, 506645, 510117, 513099, 515920, 517949, 518628, 518984, 521089, 525936, 532510, 539119, 545108, 551079, 557813, 565242, 572420, 578449, 583509, 588891, 595812, 604137, 612382, 619018, 623804, 627944, 632998, 639587, 646994, 653912, 659443, 663361, 665797, 667128, 668095, 669532, 671782, 674627, 677763, 681024, 684167, 686970, 689567]
53533F89567K556K008O42o28q69p46j555k899l035j641n29j013k206k827l183
53518F73642m055m943m876m113l485k767j265L93P95j00q39o18r0J81O11J470
53502F49941K059J742J043J140K659N119P057O942M803K757K788M146M390L041
53488F99627K389M037O545P682P409P116P240P433Q267J0558J3336J4455J3336
53475H09430J1573J0601J0476J1217J3554J7448K1225K3265K3740K3818K4000
53464A000347K4160K4511K5415K6619K7508K7943K8348K9244L1136L4216L7560
53453A317007L9414L9181L8497L9215M0918M1709M1123M0561M0762M0588L8961
53442A757936L6613L4959L4322L4212L4445L4847L4612L3262L1822L1703L2511
$$ y = [689567, 692123, 694131, 694773, 694145, 693276, 692530, 690975, 688076, 685041, 683400, 682871, 681858, 679652, 676825, 673642, 669587, 664644, 659768, 655655, 652170, 649403, 648138, 648531, 649326, 649226, 648387, 647769, 647679, 647860, 648471, 649941, 652000, 653742, 654785, 655925, 658584, 663703, 670760, 677702, 682505, 685262, 688050, 692196, 696586, 699627, 702016, 706053, 712598, 720280, 727689, 734805, 742045, 749478, 757745, 768303, 781639, 796094, 809430, 821003, 831604, 842080, 853297, 866851, 884299, 905524, 928789, 952529, 976347, 1000347, 1024507, 1049018, 1074433, 1101052, 1128560, 1156503, 1184851, 1214095, 1245231, 1279447, 1317007, 1356421, 1395602, 1434099, 1473314, 1514232, 1555941, 1597064, 1637625, 1678387, 1718975, 1757936, 1794549, 1829508, 1863830, 1898042, 1932487, 1967334, 2001946, 2035208, 2067030, 2098733, 2131244]
53431B131244L2293L0248K7992K7555K8927L0364L0506K9307K7136K4035K0301
53420B439908J7068J5406J4885J3802J1126P638M681K325l61l736p344j1003j4778
53407B489617j7871j9076j8934j9772k2637k5533k6160k5115k4785k5970k7586
53396B236178k8940l0219l0927l0169k8642k8199k8944k8887k7157k5427k4992
53385A923675k4430k1780j7508j3559j0616q016n615l882k656j297J68J514L443
53372A819441O783J0703J3300J4077J4579J6398J9622K3368K6700K8818K9443
53361B023232K9557L0913L4321L8761M2466M4588M5752M7382N0350N4075N7123
53350B498520N9004O0719O3077O5375O6761O8101P0922P4915P8167P9989Q1825
$$ y = [2131244, 2163537, 2193785, 2221777, 2249332, 2278259, 2308623, 2339129, 2368436, 2395572, 2419607, 2439908, 2456976, 2472382, 2487267, 2501069, 2512195, 2519833, 2524514, 2526839, 2526478, 2522742, 2515398, 2504395, 2489617, 2471746, 2452670, 2433736, 2413964, 2391327, 2365794, 2339634, 2314519, 2289734, 2263764, 2236178, 2207238, 2177019, 2146092, 2115923, 2087281, 2059082, 2030138, 2001251, 1974094, 1948667, 1923675, 1899245, 1877465, 1859957, 1846398, 1835782, 1827766, 1822151, 1818269, 1815613, 1814316, 1814484, 1815998, 1819441, 1826224, 1836927, 1850227, 1864304, 1878883, 1895281, 1914903, 1938271, 1964971, 1993789, 2023232, 2052789, 2083702, 2118023, 2156784, 2199250, 2243838, 2289590, 2336972, 2387322, 2441397, 2498520, 2557524, 2618243, 2681320, 2746695, 2813456, 2881557, 2952479, 3027394, 3105561, 3185550, 3267375]
53339C267375Q4811Q7912Q9352Q8874Q7664Q6671Q5864Q4759Q3044Q0730P8122
53328D205178P5570P3181P0860O8396O5281O0794N4836M8282M1916L5337K7799
53317D827430J9660J1991M976j960q719j4640k0246k7385l7001m7746n7344o4436
53305D584580o9027p2220p5822q0866q5945q8193q6635q3510q1601q1247q0801
53294C698713p9054p6236p3334p1313p0501p0265o9644o8484o7158o5266o1936
53283B925522n7680n4192n1778m8821m4725m1341m0008l9026l6140l1999k8865
53272B450947k7093k5461k4039k3944k4474k3512k1016j9351j9465j9340j7412
53261B205840j5154j4546j4846j3803j0867p371m234j246J773M588P133R315J0501
$$ y = [3267375, 3352186, 3440098, 3529450, 3618324, 3705988, 3792659, 3878523, 3963282, 4046326, 4127056, 4205178, 4280748, 4353929, 4424789, 4493185, 4558466, 4619260, 4674096, 4722378, 4764294, 4799631, 4827430, 4847090, 4859081, 4864057, 4862097, 4853378, 4838738, 4818492, 4791107, 4754106, 4706360, 4649016, 4584580, 4515553, 4443333, 4367511, 4286645, 4200700, 4112507, 4025872, 3942362, 3860761, 3779514, 3698713, 3619659, 3543423, 3470089, 3398776, 3328275, 3258010, 3188366, 3119882, 3052724, 2987458, 2925522, 2867842, 2813650, 2761872, 2713051, 2668326, 2626985, 2586977, 2547951, 2511811, 2479812, 2450947, 2423854, 2398393, 2374354, 2350410, 2325936, 2302424, 2281408, 2262057, 2242592, 2223252, 2205840, 2190686, 2176140, 2161294, 2147491, 2136624, 2129253, 2125019, 2123773, 2125546, 2130134, 2137267, 2146582, 2157083]
53248B157083J0403J0271J1821J4944J7705J8993J9961K2221K5658K8845L1018
53237B368923L2560L3781L4323L4011L3495L3607L4442L5382L5729L4942L2753
53226B743948K9456K5791K2144J8146J3522Q912N014J297l341q681j3101j5803
53214B827304j8003k1325k5868l0656l5119l9036m1642m2179m1325m1014m2491
53203B448646m5169m7632m9085m9568m9270m8288m7029m6342m6770m7752m8056
53192A923685m7279m6370m6161m5954m4538m2159m0188l8972l7532l5675l4648
53181A464209l4962l5166l3887l1701k9709k7612k4770k2093k0988k1021k0412
53170A161888j8537j6389j4913j4483j5502j7856j9988k0335j9583j9774k1189
$$ y = [2157083, 2167486, 2177757, 2189578, 2204522, 2222227, 2241220, 2261181, 2283402, 2309060, 2337905, 2368923, 2401483, 2435264, 2469587, 2503598, 2537093, 2570700, 2605142, 2640524, 2676253, 2711195, 2743948, 2773404, 2799195, 2821339, 2839485, 2853007, 2861919, 2866933, 2868230, 2864889, 2856208, 2843107, 2827304, 2809301, 2787976, 2762108, 2731452, 2696333, 2657297, 2615655, 2573476, 2532151, 2491137, 2448646, 2403477, 2355845, 2306760, 2257192, 2207922, 2159634, 2112605, 2066263, 2019493, 1971741, 1923685, 1876406, 1830036, 1783875, 1737921, 1693383, 1651224, 1611036, 1572064, 1534532, 1498857, 1464209, 1429247, 1394081, 1360194, 1328493, 1298784, 1271172, 1246402, 1224309, 1203321, 1182300, 1161888, 1143351, 1126962, 1112049, 1097566, 1082064, 1064208, 1044220, 1023885, 1004302, 984528, 963339]
53159I63339k2150k1911k1674k2100k1943k0093j7366j5191j3851j3034j2817
53148G61209j3120j3271j3023j3048j3565j3660j2825j2066j2396j3208j3273
53137F17754j2486j1561j0842j0447j0689j1233j0629q079m995l528l983n058
53125E14224n988o966p695p276n783m549m369m557m264l773l811m239m109k833
53111D44012q62O30O25r99l326m976m941l131m84J492J796Q36j76p16j291k103
53095D26386k363j588p07q95j810k101j415p44q02j039n72O51J943K546J959J79
53079D19628k075l656l980l567l410l803l903k654k62J650J772Q10O05J630K483
53064D01268K152J456J386J333L95n36J05J677J657p82l338l580j937n46k11L4
$$ y = [963339, 941189, 919278, 897604, 875504, 853561, 833468, 816102, 800911, 787060, 774026, 761209, 748089, 734818, 721795, 708747, 695182, 681522, 668697, 656631, 644235, 631027, 617754, 605268, 593707, 582865, 572418, 561729, 550496, 539867, 531788, 526793, 523265, 519282, 514224, 508236, 501270, 493575, 486299, 480516, 475967, 471598, 467041, 462777, 459004, 455193, 450954, 446845, 444012, 443150, 443780, 444405, 443406, 440080, 435104, 430163, 427032, 426548, 428040, 429836, 430672, 430496, 429780, 428489, 426386, 424023, 422435, 421728, 420833, 419023, 416922, 415507, 414763, 413961, 412922, 412350, 413001, 414944, 417490, 419449, 419628, 417553, 413897, 409917, 406350, 402940, 399137, 395234, 392580, 392318, 393968, 395740, 396550, 397155, 398785, 401268, 403420, 404876, 406262, 407595, 407990, 407454, 407559, 409236, 410893, 410111, 406773, 403193, 401256, 400710, 400499, 400533]
53048D00533Q15J323O60o77j258l79J145J910J350R8j021j820k322k154j145k40
53032C96818p43k359l107j709O38J673P28q73j700j509p87j9L14j72j095j343
53016C84755l68Q88J038j1j069j305j134j239j496j396r33m73p4L00K37o09j543
52999C75568j393k56L45m16j327p25J142K401K010R09N74J213J809J459J95j321
52983C82187k503l233l668l777l223j811J9J326J446N74l64n34ML12l69j642k251
52966C62493j467J25J368J655J181M41n3J31R81J709J343j66j601j627k25J184
52950C67472J293L69j29N01J278R60j47o46o0N78L90j40j46K71L61n6l71KJ107
52931C72887K517L571L803L346K570J428k21j469q44J476L117K396P55O84K003
$$ y = [400533, 401348, 402671, 403331, 402654, 401396, 401017, 402162, 404072, 405422, 405520, 404499, 402679, 400357, 398203, 397058, 396818, 396075, 393716, 390609, 388900, 389538, 391211, 391939, 391066, 389366, 387857, 387070, 387051, 387365, 387193, 386098, 384755, 384387, 385275, 386313, 386302, 385233, 383928, 382794, 381555, 380059, 378663, 377730, 377257, 377183, 377483, 377720, 377111, 375568, 374175, 373919, 374264, 373848, 372521, 371796, 372938, 375339, 377349, 378258, 378832, 380045, 381854, 383313, 383508, 382187, 379684, 376451, 372783, 369006, 365783, 363972, 363991, 365317, 366763, 367337, 366973, 366439, 366443, 366755, 366386, 364744, 362493, 361026, 361151, 362519, 364174, 365355, 365796, 365743, 365874, 366855, 368564, 369907, 369741, 368140, 366513, 366288, 367472, 368765, 369134, 369005, 369506, 370784, 371744, 371597, 370951, 370891, 371469, 371859, 371719, 371573, 371844, 372205, 372149, 371778, 371780, 372887, 375404, 378975, 382778, 386124, 388694, 390122, 389901, 388432, 387588, 389064, 392181, 394577, 395332, 396016, 398019]
52916C98019K194M28j001PK375L507K702J398P48N97O66J246K270K851K453J718
52900D22178J417J127j14k053l222k879j972j654j646r98N0K13q62j983k121j720
52884D03761j751k323k943l430l789l645k700j381l74L02R62J346R22l5n25j62
52868C84235L12N1q51j582j536q99n43j186k350k418l96K580M181L405J471J34
52852C84608j66j16j64k8N83J299J402O27n55j511k110k539k560j552M13K050
52836C79681K017M13j357k098j826j369j414j925k175j339O87K911L931L028Q55
52821C80020r01p98Q78K061J063j281k451j343N33J399J502K125L190L263J703
52806C90963k56p73N97K280K092k73k396j760Q51K192J023l93j39M12n13j496
$$ y = [398019, 400213, 400641, 399640, 399647, 402022, 405529, 408231, 409629, 410377, 410974, 411640, 412886, 415156, 418007, 420460, 422178, 423595, 424722, 424608, 422555, 419333, 416454, 414482, 412828, 411182, 410184, 410234, 410447, 409585, 407602, 405481, 403761, 402010, 399687, 396744, 393314, 389525, 385880, 383180, 381799, 381425, 381727, 382689, 384035, 384957, 384922, 384397, 384235, 384547, 384598, 383747, 382165, 380629, 379730, 379187, 378001, 375651, 373233, 372837, 375417, 379598, 383003, 384474, 384608, 384442, 384326, 384162, 384134, 384717, 386016, 387418, 388045, 387490, 385979, 383869, 381330, 378770, 377218, 377631, 379681, 381698, 382111, 380754, 378656, 376830, 375461, 374047, 372122, 369947, 368608, 369295, 372206, 376137, 379165, 380020, 379119, 378321, 379199, 381260, 382323, 381042, 378591, 377248, 377781, 379180, 380682, 382807, 385997, 389260, 390963, 390707, 389934, 390531, 392811, 394903, 394630, 392234, 390474, 391325, 393517, 394540, 394147, 394008, 394420, 393907, 392411]
52790C92411k24K077J886j232l988m405m183n023n619m218j903j086k036k873
52776C59584k321q43N25J208J096M47k65p75j046r38m44k10p77j422r67J41J48
52759C53141j190j815k90J960K595J401J79K60J266J842R33j216k871k392l02
52744C53501J230J184N42Pj276l586n052l891j028J196K015K269K296J600K54
52729C51261r48j569j628j027LM16l80j374j320o68o59j080o81N01J080O33L55
52712C42915R99J707J458M77m13q79j004q44n00j60J29L69L01j96o36m64Q3L60
52694C43702L43N22J059J752K524L093K658R99n09l37J018J715J346J389K646
52679C63920L925L983L300K998L079K807K077J364Q51N34Q02J933L201L327K017
$$ y = [392411, 392187, 394264, 396150, 394918, 390930, 386525, 382342, 377319, 371700, 367482, 365579, 364493, 362457, 359584, 357263, 356420, 356945, 358153, 359249, 359696, 359431, 358656, 357610, 356672, 356228, 356018, 355241, 353819, 352852, 352993, 353141, 351951, 350136, 349846, 351806, 354401, 355802, 355981, 356241, 357507, 359349, 360282, 359066, 356195, 353803, 353501, 354731, 355915, 356457, 356464, 355188, 351602, 346550, 342659, 341631, 342827, 344842, 347111, 349407, 351007, 351261, 350313, 348744, 347116, 346089, 346092, 346508, 346128, 344754, 343434, 342766, 342107, 341027, 340346, 340847, 341927, 342560, 342915, 343914, 345621, 347079, 347556, 347143, 346264, 345260, 344416, 343916, 343756, 343885, 344254, 344555, 344359, 343723, 343259, 343342, 343702, 344045, 344567, 345626, 347378, 349902, 352995, 355653, 356652, 356143, 355806, 356824, 358539, 359885, 361274, 363920, 367845, 371828, 375128, 378126, 381205, 384012, 386089, 387453, 388304, 388838, 389640, 391573, 394774, 398101, 400118]
52664D00118L55n01o71j237k731m270m408k769m88R95J273Q89K95o63k191l819
52648C80177m477l534j795r72j693k482j606M85J780J651J556K471L394L272K733
52633C80960K710K751K155J488J392J082j77j171m77Q28M98j320k301j537m86
52618C86395k45k81k56p70j633j495p8J052Q79K98K58K74k58q69j156j584k130
52601C78401j694qJ455J680J687K626L752L875L374L135K689J363K68J050L170
52586D06823M347L425J219j100k773k906j106J252J985O36j189k038j777n97J468
52571D07669L562M106K677P89J18Q73K388M183N612N493L249j7k573l854m438
52556D29837m537l745k293j479k196l647m265l607k580j864j009N06K049K479
$$ y = [400118, 400473, 399972, 399301, 398064, 395333, 391063, 386655, 383886, 383398, 384393, 385666, 386555, 386850, 386187, 383996, 380177, 375700, 372166, 370371, 369399, 367706, 365224, 363618, 364103, 365883, 367534, 369090, 371561, 374955, 378227, 380960, 383670, 386421, 388576, 390064, 391456, 392538, 392361, 391190, 390713, 391541, 392039, 390719, 388418, 386881, 386395, 386150, 385869, 385613, 384843, 383210, 381715, 381637, 382689, 383568, 383866, 384124, 384398, 384140, 383271, 382115, 380531, 378401, 376707, 376699, 378154, 379834, 381521, 384147, 387899, 391774, 395148, 398283, 400972, 402335, 402603, 403653, 406823, 411170, 414595, 415814, 414714, 411941, 409035, 407929, 409181, 411166, 411802, 410613, 408575, 406798, 406201, 407669, 411231, 415337, 418014, 418803, 418921, 419794, 422182, 426365, 431977, 437470, 440719, 440702, 438129, 434275, 429837, 425300, 421555, 419262, 417783, 415587, 411940, 407675, 404068, 401488, 399624, 398615, 399121, 401170, 403649]
52542D03649J700P72M72N03L54J51K94P23J039J020O69j7r42j813k325k354j837
52525D02058p71M76J256J328J220J564K214K319J341j68q69M5J792K647J878N45
52509D18875j30m88j587l099l481k222p03l72j180k106k244j058J193K875K142
52494D06415n63k499k045q10j190k940l826k854j133J16P30Q74O16N13J299K632
52478C95335L181K317R43K51L78P07R03J225J918K597K304N17j850k943j899J84
52462D06068J680K192K198J707L95j183j837j325o33l98M6J601L973N786N801
52447D26071L986J621L52P67J916K470K019R12o17k279l183k530r01K10J77l66
52431D30625r45j890l182l785k964j534r16j312j587q99K76Q67N17j06j65N15
$$ y = [403649, 405349, 406121, 406593, 407096, 407450, 407601, 407895, 408618, 409657, 410677, 411346, 411329, 410387, 408574, 406249, 403895, 402058, 401287, 401763, 403019, 404347, 405567, 407131, 409345, 411664, 413005, 412837, 411968, 412013, 413805, 416452, 418330, 418875, 418745, 418257, 416670, 413571, 410090, 407868, 407165, 406793, 405613, 403507, 401263, 400205, 401398, 404273, 406415, 405852, 403353, 401308, 400498, 399308, 396368, 392542, 389688, 388555, 388671, 389401, 390275, 390891, 391404, 392703, 395335, 398516, 400833, 401776, 402027, 402405, 403112, 404015, 405240, 407158, 409755, 412059, 412576, 410726, 407783, 405884, 406068, 407748, 409940, 412138, 413845, 414240, 413057, 411220, 409895, 409262, 408864, 408910, 410511, 414484, 420270, 426071, 430057, 431678, 432030, 432797, 434713, 437183, 439202, 440114, 439497, 437218, 434035, 431505, 430604, 430814, 430991, 430625, 429680, 427790, 424608, 420823, 417859, 416325, 415409, 414097, 412510, 411611, 411887, 412754, 413271, 413165, 413000, 413515]
52415D13515J569K646L471L458K140J83q37k56Q11J166J255K174L547L921L094
52400D41857K461K732K771J307j229l314l920l023j357k62q00k329k833j510j39
52385D30412p07k476k960j462P7J6p74n57O00J027q6j627k112j446p10o93j106
$$ y = [413515, 415084, 417730, 421201, 424659, 426799, 426982, 426145, 425889, 426700, 427866, 429121, 431295, 434842, 438763, 441857, 444318, 447050, 449821, 451128, 449899, 446585, 442665, 439642, 438285, 438023, 437223, 434894, 432061, 430551, 430412, 429705, 427229, 424269, 422807, 422884, 422900, 422126, 421569, 422169, 423196, 423110, 421483, 419371, 417925, 417215, 416522, 415416]
$$ [...]
##END NTUPLES=NMR SPECTRUM
##END=
