##TITLE=AC1224_CRIAH12234_7765488_1VBMXALYjL
##JCAMPDX= 6.0         $$ Bruker NMR JCAMP-DX V2.0
##DATA TYPE= NMR SPECTRUM
##DATA CLASS= NTUPLES
##ORIGIN= BRUKER
##OWNER= Administrator
$$ 1.72 TOPSPIN		Version 2.1
$$ 2013-04-11 21:16:53.450 -0700  Administrator@X
$$ Compression mode = diff/dup
##.OBSERVE FREQUENCY= 400.02188249412
##.OBSERVE NUCLEUS= ^1H
##.ACQUISITION MODE= SIMULTANEOUS (DQD)
##.ACQUISITION SCHEME= undefined
##.AVERAGES= 64
##.DIGITISER RES= 22
##SPECTROMETER/DATA SYSTEM= spect
##.PULSE SEQUENCE= noesygpps1d.comp
##.SOLVENT NAME= COFFEE_meoh
##.SHIFT REFERENCE= INTERNAL, COFFEE_meoh, 1, 14.96087
##AUDIT TRAIL= $$ (NUMBER, WHEN, WHO, WHERE, PROCESS, VERSION, WHAT)
$$ ##TITLE= Audit trail, TOPSPIN		Version 2.1
$$ ##JCAMPDX= 5.01
$$ ##ORIGIN= Bruker BioSpin GmbH
$$ ##OWNER= Administrator
$$ $$ E:\/data/COFFEE/nmr/AC1224_CRIAH12234_7765488_1VBMXALYjL/12/pdata/1/auditp.txt
$$ ##AUDIT TRAIL=  $$ (NUMBER, WHEN, WHO, WHERE, PROCESS, VERSION, WHAT)
(   1,<2013-04-11 21:16:47.575 -0700>,<Administrator>,<X>,<go>,<TOPSPIN 2.1>,
      <created by zg
	started at 2013-04-11 21:05:18.019 -0700,
	POWCHK enabled, PULCHK disabled,
       configuration hash MD5:
       33 CF 6A 21 5C D3 B9 40 6C 15 AA 8D 27 A2 4F 13
       data hash MD5: 64K
       D8 70 81 99 63 90 12 35 F6 2B 84 97 73 9A 00 D7>)
(   2,<2013-04-11 21:16:50.654 -0700>,<Administrator>,<X>,<proc1d>,<TOPSPIN 2.1>,
      <Start of raw data processing
       efp LB = 0.3 FT_mod = 6 PKNL = 1 PHC0 = 0 PHC1 = 0 SI = 128K 
       data hash MD5: 128K
       EA C5 CB 06 F8 C0 EC 7C E3 F2 57 1C A5 91 CC 1D>)
(   3,<2013-04-11 21:16:51.669 -0700>,<Administrator>,<X>,<proc1d>,<TOPSPIN 2.1>,
      <pk PHC0 = -79.38171 PHC1 = 0 
       data hash MD5: 128K
       99 4C 87 3C 97 B1 F6 49 69 98 30 7A 71 18 94 B5>)
(   4,<2013-04-11 21:16:52.388 -0700>,<Administrator>,<X>,<proc1d>,<TOPSPIN 2.1>,
      <abs ABSG = 1 
       data hash MD5: 128K
       01 D4 31 31 92 D6 C4 1E 75 C5 16 65 3A 38 AD C9>)
(   5,<2013-04-11 21:16:52.575 -0700>,<Administrator>,<X>,<proc1d>,<TOPSPIN 2.1>,
      <abs ABSG = 2 
       data hash MD5: 128K
       F4 BA BF 0B AE 94 2E FF 41 2A 73 7B F1 22 D8 15>)
(   6,<2013-04-11 21:16:52.747 -0700>,<Administrator>,<X>,<proc1d>,<TOPSPIN 2.1>,
      <abs ABSG = 3 
       data hash MD5: 128K
       DA CF 9A F7 79 06 9C F0 05 13 C8 C5 F7 EA D7 5D>)
(   7,<2013-04-11 21:16:52.950 -0700>,<Administrator>,<X>,<proc1d>,<TOPSPIN 2.1>,
      <abs ABSG = 4 
       data hash MD5: 128K
       DA D8 06 44 6B 0F 77 47 13 BB 78 10 C9 C4 CF B6>)
(   8,<2013-04-11 21:16:53.122 -0700>,<Administrator>,<X>,<proc1d>,<TOPSPIN 2.1>,
      <abs ABSG = 5 
       data hash MD5: 128K
       D5 81 28 06 69 D4 DC 7E 9C 09 4E 04 78 5E 8F 23>)
$$ ##END=
$$ 
$$ $$ hash MD5
$$ $$ 81 1B F9 8F 9B 9F 79 8B 3B 86 82 1B CA B3 8A F0
##$RELAX= 
##$RELAX= 
##$RELAX= 
##$RELAX= 
##$RELAX= 
##$RELAX= 
##$RELAX= 
##$RELAX= 
$$ Bruker specific parameters
$$ --------------------------
##$DU= <E:\>
##$EXPNO= 12
$$ [...]
##$TP07= 0
##$TPNAME0= <>
##$TPNAME1= <>
##$TPNAME2= <>
##$TPNAME3= <>
##$TPNAME4= <>
##$TPNAME5= <>
##$TPNAME6= <>
##$TPNAME7= <>
##$TPOAL= (0..7)
0.5 0.5 0.5 0.5 0.5 0.5 0.5 0.5
##$TPOFFS= (0..7)
0 0 0 0 0 0 0 0
##$TUNHIN= 0
##$TUNHOUT= 0
##$TUNXOUT= 0
##$USERA1= <user>
##$USERA2= <user>
##$USERA3= <user>
##$USERA4= <user>
##$USERA5= <user>
##$V9= 5
##$VALIST= <valist>
##$VCLIST= <CCCCCCCCCCCCCCC>
##$VD= 0
##$VDLIST= <DDDDDDDDDDDDDDD>
##$VPLIST= <PPPPPPPPPPPPPPP>
##$VTLIST= <TTTTTTTTTTTTTTT>
##$WBST= 2048
##$WBSW= 25
##$XGAIN= (0..3)
0 0 0 0
##$XL= 0
##$YL= 0
##$YMAX_a= 5877120
##$YMIN_a= -13261286
##$ZGOPTNS= <>
##$ZL1= 120
##$ZL2= 120
##$ZL3= 120
##$ZL4= 120
##$ABSF1= 14.96087
##$ABSF2= -5.597312
##$ABSG= 5
##$ABSL= 3
##$ALPHA= 0
##$AQORDER= 0
##$ASSFAC= 0
##$ASSFACI= 0
##$ASSFACX= 0
##$ASSWID= 0
##$AUNMP= <proc_prof1d_extract.lims>
##$AXLEFT= 0
##$AXNAME= <>
##$AXNUC= <1H>
##$AXRIGHT= 0
##$AXTYPE= 0
##$AXUNIT= <>
##$AZFE= 0.1
##$AZFW= 0.1
##$BCFW= 0
##$BC_mod= 0
##$BYTORDP= 0
##$COROFFS= 0
##$CY= 15
##$DATMOD= 1
##$DC= 0
##$DFILT= <>
##$DTYPP= 0
##$F1P= 0
##$F2P= 0
##$FCOR= 0.5
##$FTSIZE= 131072
##$FT_mod= 6
##$GAMMA= 0
##$GB= 0
##$INTBC= 1
##$INTSCL= 1
##$ISEN= 128
##$LB= 0.3
##$LEV0= 0
##$LPBIN= 0
##$MAXI= 10000
##$MC2= 0
##$MEAN= 0
##$ME_mod= 0
##$MI= 0
##$NCOEF= 0
##$NC_proc= -2
##$NLEV= 6
##$NOISF1= 0
##$NOISF2= 0
##$NSP= 0
##$NTH_PI= 0
##$NZP= 0
##$OFFSET= 14.96087
##$PC= 1
##$PHC0= -79.38171
##$PHC1= 0
##$PH_mod= 1
##$PKNL= yes
##$PPARMOD= 0
##$PPDIAG= 0
##$PPIPTYP= 0
##$PPMPNUM= 2147483647
##$PPRESOL= 1
##$PSCAL= 4
##$PSIGN= 0
##$PYNMP= <proc.py>
##$REVERSE= no
##$SF= 400.020009690653
##$SI= 131072
##$SIGF1= 0
##$SIGF2= 0
##$SINO= 400
##$SIOLD= 131072
##$SPECTYP= <>
##$SREGLST= <1H.CDCl3>
##$SSB= 0
##$STSI= 131072
##$STSR= 0
##$SW_p= 8223.68421052631
##$SYMM= 0
##$S_DEV= 0
##$TDeff= 65536
##$TDoff= 0
##$TI= <>
##$TILT= no
##$TM1= 0
##$TM2= 0
##$TOPLEV= 0
##$USERP1= <user>
##$USERP2= <user>
##$USERP3= <user>
##$USERP4= <user>
##$USERP5= <user>
##$WDW= 1
##$XDIM= 131072
##$YMAX_p= 412393756
##$YMIN_p= -10480
##$CURPLOT= <Network HP LaserJet P1505>
##$CURPRIN= <$Network HP LaserJet P1505>
##$DFORMAT= <normdp>
##$LAYOUT= <+/1D_H.xwp>
##$LFORMAT= <normlp>
##$PFORMAT= <normpl>
##$SURQMSG= 1
$$ End of Bruker specific parameters
$$ ---------------------------------
##NTUPLES= NMR SPECTRUM
##VAR_NAME=  FREQUENCY,     SPECTRUM/REAL,   SPECTRUM/IMAG
##SYMBOL=    X,             R,               I
##VAR_TYPE=  INDEPENDENT,   DEPENDENT,       DEPENDENT
##VAR_FORM=  AFFN,          ASDF,            ASDF
##VAR_DIM=   131072,        131072,          131072
##UNITS=     HZ,            ARBITRARY UNITS, ARBITRARY UNITS
##FACTOR=    0.0627417313425164, 1,          1
##FIRST=     8223.62146879497, -2181,        -59905
##LAST=      0,             -811,            -61044
##MIN=       0,             -10480,          0
##MAX=       8223.62146879497, 412393756,    0
$$ Real data points
##PAGE= N=1
##DATA TABLE= (X++(R..R)), XYDATA
$$ [...]
63888G90247k1461k0609j9977j9301j7992j5833j3498j1834j0715r313p418n661
63876F16635m338k830n09K457N549Q523J1186J3113J4131J4786J5887J7785K0223
63863G32598K2642K4473K5432K5743K5766K5372K4109K2091K0087J8507J6809
63852I83629J4265J0903P274L753M63k534n409q670j2585j6715k0398k3421k5890
63839I04665k7725k8760k9214k9551k9884k9916k9481k8841k8383k8137k7666
63828E87107k6409k4274k1878k0059j9008j8085j6566j4398j2077j0126q793q029
63816C87405p569p233p204p678q225p923o454m651l575l363l302k850k135j616
63802C13627j565j876k151k078j778j624j648j538j330j562k406l150l069k485
$$ plain form
63888 790247 768786 748177 728200 708899 690907 675074 661576 649742 639027 629714 622296 616635
63876 616635 612297 609467 608958 611415 616964 625487 636673 649786 663917 678703 694590 712375 732598
63863 732598 755240 779713 805145 830888 856654 882026 906135 928226 948313 966820 983629
63852 983629 997894 1008797 1016071 1019824 1020287 1017753 1012344 1003674 991089 974374 953976 930555 904665
63839 904665 876940 848180 818966 789415 759531 729615 700134 671293 642910 614773 587107
63828 587107 560698 536424 514546 494487 475479 457394 440828 426430 414353 404227 395434 387405
63816 387405 379836 372603 365399 357721 349496 341573 335119 330468 326893 323530 320228 317378 315243 313627
63802 313627 312062 310186 308035 305957 304179 302555 300907 299369 298039 296477 294071 290921 287852 285367
63788B85367k298k762l309l471l386l285l086k617j903j105m43j05l9J19N72R47
63772B59196P53J29k70j46J48K00Nk49m67o01o32p36j079j421j251m85K72M20
63754B53786M9k46n0N10R71R36L92k82o83p32n62j96M30J170J760K210K752L318
63736B65533L482L086K575K438K574K562K308K110K140K273K457K933L817M687
63722C04975M872M272L664L969N199O326O294N019L330K080J453J049L82o03j462
63707C50819j724j574j769k661l558l486k417j255n81KJ068K358L067K894K396
63692C43579K240K450K525K163J686J644K152K749K935K607J874Q22l38j115j203
63677C66770r40r25j218j326r20q6J048K330L225L107K193J547J783K236J991
$$ plain form
63788 285367 283069 280307 276998 273527 270141 266856 263770 261153 259250 258145 257702 257597 257558 257677 258249 259196
63772 259196 259949 260078 259808 259662 259810 260010 260015 259766 259299 258698 258066 257330 256251 254830 253579 253094 253366 253786
63754 253786 253835 253589 253539 254049 255020 255956 256348 256066 255383 254651 254089 253893 254323 255493 257253 259463 262215 265533
63736 265533 269015 272101 274676 277114 279688 282250 284558 286668 288808 291081 293538 296471 300288 304975
63722 304975 309847 314119 317783 321752 326951 333277 339571 344590 347920 350000 351453 352502 352884 352281 350819
63707 350819 349095 347521 345752 343091 339533 336047 333630 332375 331794 331796 332864 335222 338289 341183 343579
63692 343579 345819 348269 350794 352957 354643 356287 358439 361188 364123 366730 368604 369426 369088 367973 366770
63677 366770 365830 364905 363687 362361 361441 361355 362403 364733 367958 371065 373258 374805 376588 378824 380815
63662C80815J172N68L16k45j427k647l228l259l352l846m525m988n047m778m313
63647C41216l718k996k195j336m20L50N32M7k91N66K453L887L824K963K735L477
63631C51094M403M960N311N558N443N109N244O174P314P969Q108Q108Q218Q635
63617D41648R626J1175J2850J4385J6022J7958J9919K1701K3620K5951K8273L0093
63605F73221L1719L3776L5938L6942L5878L2815K8075K1664J3829N662j343o162
63593I42014q606r153q644p867p254p079p885j0263j4015j8035k1376k4030k6311
63580G71496k7877k8007k6665k4663k2670k0597j8151j5527j3116j0874q405n620
63568E49324k927o74J215K951M438N391N740N727N634N670O024O761P681Q460
$$ plain form
63662 380815 381987 382555 382871 382626 381199 378552 375324 372065 368713 364867 360342 355354 350307 345529 341216
63647 341216 337498 334502 332307 330971 330551 330901 331433 331480 331189 331755 334208 338095 341919 344882 347617 351094
63631 351094 355497 360457 365768 371326 376769 381878 387122 393296 400610 408579 416687 424795 433013 441648
63617 441648 451274 462449 475299 489684 505706 523664 543583 565284 588904 614855 643128 673221
63605 673221 704940 738716 774654 811596 847474 880289 908364 930028 943857 949519 948176 942014
63593 942014 933408 924255 915611 907744 900490 893411 885526 875263 861248 843213 821837 797807 771496
63580 771496 743619 715612 688947 664284 641614 621017 602866 587339 574223 563349 554944 549324
63568 549324 546397 545723 546938 549889 554327 559718 565458 571185 576819 582489 588513 595274 602955 611415
63554F11415R037R646J0523J1807J3744J6599K0248K4252K8440L3080L8263M3489
63542H70543M8022N1032N1099M6307L5903K1702P154m958j3535j8414j9746j8282
63530A056827j5278j1740q269n749n356p547j1676j6893k2684k8301l2589l5080
63518H55665l6528l7609l7759l6152l3321l0751k9039k7407k5015k1911j8607
63507E21566j5528j3081j1582j0804j0008q716p161n863n082m733m560m260l688
63494D16500k917k072j273q97j419k603l248k406o31P27J235J577K166K543K392
63479D09674K214K523L043L230L069K911K887K906K841K439J387j44j445k100
63465D35435k529l308m316m983n094m846m386l792l302l086k838k100r82j36O2
$$ plain form
63554 611415 620452 630098 640621 652428 666172 682771 703019 727271 755711 788791 827054 870543
63542 870543 918565 969597 1020696 1067003 1102906 1124608 1131762 1126804 1113269 1094855 1075109 1056827
63530 1056827 1041549 1029809 1021540 1015791 1010435 1002888 991212 974319 951635 923334 890745 855665
63518 855665 819137 781528 743769 707617 674296 643545 614506 587099 562084 540173 521566
63507 521566 506038 492957 481375 470571 460563 451847 444686 438823 433741 429008 424448 420188 416500
63494 416500 413583 411511 410238 409341 407922 405319 402071 399665 399034 399761 400996 402573 404739 407282 409674
63479 409674 411888 414411 417454 420684 423753 426664 429551 432457 435298 437737 439124 438980 437535 435435
63465 435435 432906 429598 425282 420299 415205 410359 405973 402181 398879 395793 392955 390855 389873 389737 389799
63450C89799K6M75J660L134M253M846N389O392P693Q617Q866Q955R544J0683J2028
63435D82360J3557J5710J8931K3361K8843L4679L9356M0908L8127L1497K2938
63424G90267J4629Q017L713J942K725N681J0018J5008K0315K5697L0734L5112
63412I63858L8870M1738M2490L9669L3151K4440J5265O495j432p763j1736j3323
63400A171722j3214j2298j1406j1277j2326j4575j7958k2431k7569l2461l6306
63389I59901l8818l9927l9419l7334l4254l0885k7577k4566k2155k0214j7981
63378F26771j4917j1530q717o553m426k136j45J275K472L878N506P168Q821J0569
63364F18036J2496J4545J6427J7891J9216K1174K4160K7602L0680L3263L5660
$$ plain form
63450 389799 389825 390300 391960 395094 399347 404193 409582 415974 423667 432284 441150 450105 459649 470332 482360
63435 482360 495917 511627 530558 553919 582762 617441 656797 697705 735832 767329 790267
63424 790267 804896 812913 816626 818568 821293 826974 836992 852000 872315 898012 928746 963858
63412 963858 1002728 1044466 1086956 1126625 1159776 1184216 1199481 1205976 1204544 1196781 1185045 1171722
63400 1171722 1158508 1146210 1134804 1123527 1111201 1096626 1078668 1056237 1028668 996207 959901
63389 959901 921083 881156 841737 804403 770149 739264 711687 687121 664966 644752 626771
63378 626771 611854 600324 591607 585054 580628 578492 578347 579622 582094 585972 591478 598646 607467 618036
63364 618036 630532 645077 661504 679395 698611 719785 743945 771547 802227 835490 871150
63353H71150L7834L9492M0653M1335M0755L7741L2010K4373J5736O691j785q247
63341A177738j1937j3417j3614j2937j1761j1132j2169j5037j9039k3485k7896
63330A005314l1693l4394l6102l7188l7456l6206l3317k9685k6230k2833j8754
63319F61456j3838q740l997K58L318L401q33q301j5874k0994k3334k3748k2657
63306E26117k0206j7157j4500j2305r995p702o360o246o382n776m621l764l509
63293D07594l478l314l014k749k684k885l202l336l180k941k822k772k635k308
63279C66274j761j118p31q63j293j565j613j712j866j719j198o09l4Q19J860K412
63263C55283K095J415J000Q67Q57J224K122K978L140K832K732K880K806K567K746
$$ plain form
63353 871150 908984 948476 989129 1030464 1071219 1108960 1140970 1165343 1181079 1187770 1185985 1177738
63341 1177738 1165801 1152384 1138770 1125833 1114072 1102940 1090771 1075734 1056695 1033210 1005314
63330 1005314 973621 939227 903125 865937 828481 792275 758958 729273 703043 680210 661456
63319 661456 647618 638878 634881 635139 638457 641858 641025 632724 616850 595856 572522 548774 526117
63306 526117 505911 488754 474254 461949 451954 444252 437892 431646 425264 419488 414867 411103 407594
63293 407594 404116 400802 397788 395039 392355 389470 386268 382932 379752 376811 373989 371217 368582 366274
63279 366274 364513 363395 362664 361801 360508 358943 357330 355618 353752 352033 350835 350226 350192 351011 352871 355283
63263 355283 357378 358793 359793 360660 361517 362741 364863 367841 370981 373813 376545 379425 382231 384798 387544
63248C87544L364L692L390L096L467M286N000N637O596P842Q902R586J0263J1337
63234D74002J2778J4211J5254J5748J5873J6131J6957J8296J9605K0335K0328
63223F59518J9703J8585J7133J5781J5164J5589J6663J7612J8031J8152J8301
63212H50232J8279J7490J5630J2954R770N990J472l454q139j2311j6117j9391
63200H72405k1433k1838k1176k0362j9594j8464j6865j5102j3122j0439o993l436
63188F83581k82K599N305P446Q906J0368J2418J4621J6279J7568J9065K0525K1142
63175H39541K0888K0517K0274J9643J8552J7690J7291J6597J5118J3470J2248
63164A031829J0810Q047L903o88n066r372j3908j8639k3301k7495l0767l2843
$$ plain form
63248 387544 390908 394600 397990 401086 404553 408839 413839 419476 426072 433914 442816 452402 462665 474002
63234 474002 486780 500991 516245 531993 547866 563997 580954 599250 618855 639190 659518
63223 659518 679221 697806 714939 730720 745884 761473 778136 795748 813779 831931 850232
63212 850232 868511 886001 901631 914585 924355 930345 931817 928363 920224 907913 891796 872405
63200 872405 850972 829134 807958 787596 768002 749538 732673 717571 704449 694010 687017 683581
63188 683581 683299 685898 691203 698649 707555 717923 730341 744962 761241 778809 797874 818399 839541
63175 839541 860429 880946 901220 920863 939415 957105 974396 990993 1006111 1019581 1031829
63164 1031829 1042639 1050686 1054589 1053901 1048835 1039463 1025555 1006916 983615 956120 925353 892510
63152H92510l3751l3547l2211l0126k8162k6806k5501k3400k0534j7692j5350
63141F05430j3306j1345r555p991o540n247m354l931l787l775l772l393k301q87
63127E25246m9m5M6J204L207M866N397N031M426L974L865M327N299O086N845M561
63111E83286L188K585K620K603K332K172K228K088J539J017R65J151J030N16K0
63096F09340j83j69q1M1J35J65K55M96O75N44L09M36Q83J041O30K33M34Q46O38
63077F16668k3P7J509L178L648L060K837L640M621M946N068N915P449Q909R993
63062F81495J1026J2177J3317J4527J6051J7767J9477K1522K4401K7776L0750
63051H90286L3135L5621L8441M0893M2453M3511M4534M5340M5727M6039M6465
$$ plain form
63152 892510 858759 825212 793001 762875 734713 707907 682406 659006 638472 620780 605430
63141 605430 592124 580779 571224 563233 556693 551446 547092 543161 539374 535599 531827 528434 526133 525246
63127 525246 525197 525152 525198 526402 529609 534475 539872 544903 549329 553303 557168 561495 566794 572880 578725 583286
63111 583286 586474 589059 591679 594282 596614 598786 601014 603102 604641 605658 606623 607774 608804 609320 609340
63096 609340 609157 608988 608907 608948 609083 609248 609503 609999 610674 611218 611527 611963 612846 613887 614517 614750 615184 616030 616668
63077 616668 616645 616722 618231 621409 625057 628117 630954 634594 639215 644161 649229 655144 662593 671502 681495
63062 681495 692521 704698 718015 732542 748593 766360 785837 807359 831760 859536 890286
63051 890286 923421 959042 997483 1038376 1080829 1124340 1168874 1214214 1259941 1305980 1352445
63040A352445M6511M5765M4619M3573M2492M1235M0370M0385M0699M0337L9119
63029A817550L7319L4540K9960K3508J5828P209k443j2672k2478l1428l9814m7547
63017A809532n3672n7298n8344n7191n4285n0289m5972m1557l6638l0960k4831
63006A298495j8568j2137n560Q44O914J2777J8305K2891K6239K8857L1356L3590
62994A444003L5017L5612L5881L6066L5861L5028L3939L3255L3110L2839L1528
62983A822139K8762K4717J9659J3594O511j455j0168j9526k9059l7853m5303n1607
62971A720411n7123o1482o3919o4284o3144o1048n8211n4863n1319m7651m3849
62960A093518m0254l7266l4637l1750k8650k6115k4537k3425k2248k1127k0307
$$ plain form
63040 1352445 1398956 1444721 1489340 1532913 1575405 1616640 1657010 1697395 1738094 1778431 1817550
63029 1817550 1854869 1889409 1919369 1942877 1958705 1965914 1963471 1950799 1928321 1896893 1857079 1809532
63017 1809532 1755860 1698562 1640218 1583027 1528742 1478453 1432481 1390924 1354286 1323326 1298495
63006 1298495 1279927 1267790 1262230 1263074 1269988 1282765 1301070 1323961 1350200 1379057 1410413 1444003
62994 1444003 1479020 1514632 1550513 1586579 1622440 1657468 1691407 1724662 1757772 1790611 1822139
62983 1822139 1850901 1875618 1895277 1908871 1915382 1913927 1903759 1884233 1855174 1817321 1772018 1720411
62971 1720411 1663288 1601806 1537887 1473603 1410459 1349411 1291200 1236337 1185018 1137367 1093518
62960 1093518 1053264 1015998 981361 949611 920961 894846 870309 846884 824636 803509 783202
62949G83202j9563j8647j7828j7487j7391j6898j5752j4310j3091j2263j1628
62938F08344j0904j0114r553r253q736p613o300n522n291m943m236l608l257k737
62924E16277j861j265j499k133k342j958j473j277j421j820k190k057j303n31
62910D93147m50j042j663j814j518j168j295k145l187l377k363j136r17j611j943
62895D67518j059N50J768K013J561J002O26K79k18o28n56j49o3n11q51m73K85
62878D71094P09P76R76J345J416J085P30M20k35j186j643j105j88J03l57p93o06
62861D72541j9L34J39m10q81r43m91L97J461K188K007Q62m51r01l07M30L86l61
62843D75981r26o71K52J185J514J001m8q88r22l43N6j78o51p19k48M65J224J995
$$ plain form
62949 783202 763639 744992 727164 709677 692286 675388 659636 645326 632235 619972 608344
62938 608344 597440 587326 577773 568520 559784 552171 545871 540349 535058 530115 525879 522271 519014 516277
62924 516277 514416 513151 511652 509519 507177 505219 503746 502469 501048 499228 497038 494981 493678 493147
62910 493147 492697 491655 489992 488178 486660 485492 484197 482052 478865 475488 473125 471989 471072 469461 467518
62895 467518 466459 467009 468777 470790 472351 473353 473979 474258 474040 473412 472856 472707 472644 472133 471282 470809 471094
62878 471094 471803 472579 473555 474900 476316 477401 478131 478551 478316 477130 475487 474382 474194 474297 473940 473147 472541
62861 472541 472522 472856 472995 472585 471704 470761 470270 470667 472128 474316 476323 477185 476734 475833 475526 475956 476342 475981
62843 475981 475055 474384 474636 475821 477335 478336 478288 477400 476478 476135 476191 476013 475362 474643 474395 474860 476084 478079
62825D78079K542K584K267K023J892J516R84J041K048L166L196J996N83o1K03
62810E04059R35J670K165K471K812L230L453L316L108L135L294L540M401O245
62796E47834Q303R317R164Q956R372R961J0362J1230J3211J5808J8092K0067K2466
62783G14143K5559K8972L2568L6690M1422M6216N0454N4107N7688O1684O5949
62772A215452O9520P1233P0713O8605O5589O1426N5242M6478L5409K2967J0384
62761A793018j524j2973k4810l6931m7623n5126n9515o2341o4599o6007o6140
62750A295429o5294o3797o1400n7925n3979n0384m7133m3508l9179l4723l0937
62739G47170k7936k5159k2240j9582j7814j6737j5284j2810j0028q113p168o227
$$ plain form
62825 478079 480621 483205 485472 487495 489387 490903 491887 492928 494976 498142 501338 503334 503917 503856 504059
62810 504059 504994 506664 508829 511300 514112 517342 520795 524111 527219 530354 533648 537188 541589 547834
62796 547834 556137 565454 574618 583574 592946 602907 613269 624499 637710 653518 671610 691677 714143
62783 714143 739702 768674 801242 837932 879354 925570 976024 1030131 1087819 1149503 1215452
62772 1215452 1284972 1356205 1426918 1495523 1561112 1622538 1677780 1724258 1759667 1782634 1793018
62761 1793018 1791494 1778521 1753711 1716780 1669157 1614031 1554516 1492175 1427576 1361569 1295429
62750 1295429 1230135 1166338 1104938 1047013 993034 942650 895517 852009 812830 778107 747170
62739 747170 719234 694075 671835 652253 634439 617702 602418 589608 579580 571467 564299 558072
62727E58072m820l598l138k864j873l06Q70J293J581K248K983L419L981N397P556
62712E70801R507J0597J1221J2298J4305J7044K0045K2932K5537K7944L0531L3748
62700H06510L7733M2189M6626N0742N4566N8303O2052O5731O9252P2504P5050
62689A441258P6027P4708P1104O5675N8540M9387L8182K5358J1275l809j8991
62678A888714l2721m4192n3985o2751o9838p4192p5993p6353p5686p3579p0148
62667A179276o6278o2423n8233n3583m8955m4542m0000l5445l1636k8748k5991
62656F83442k2907k0115j8139j6545j4830j3263j2089j0802r131p829p598p896
62644E22298p854p574p517p255o081m372l122k445j697p60l3O05J570K433K202
$$ plain form
62727 558072 553252 549654 546516 543652 541779 541473 542343 543636 545217 547465 550448 553867 557848 563245 570801
62712 570801 580308 590905 602126 614424 628729 645773 665818 688750 714287 742231 772762 806510
62700 806510 844243 886432 933058 983800 1038366 1096669 1158721 1224452 1293704 1366208 1441258
62689 1441258 1517285 1591993 1663097 1728772 1787312 1836699 1874881 1900239 1911514 1907705 1888714
62678 1888714 1855993 1811801 1757816 1695065 1625227 1551035 1475042 1398689 1323003 1249424 1179276
62667 1179276 1112998 1050575 992342 938759 889804 845262 805262 769817 738181 709433 683442
62656 683442 660535 640420 622281 605736 590906 577643 565554 554752 545621 537792 530194 522298
62644 522298 514444 506870 499353 492098 486017 481645 478523 476078 474381 473621 473588 474193 475763 478196 480398
62629D80398Q35o16j422j705j628j176q48j342k290k486j631q30q75j128o65M44
62613D63035J626K751L873M713N047N138N243N218N060N308O345P769Q952R830
62599E39908J0724J1805J3171J4990J7141J9172K1008K3246K6216K9304L1795
62588G58480L3882L6006L7531L7046L4029K9488K4646J9683J4010P417M06o396
62576A026228j2706j8329k2793k5648k7174k8350k9857l1307l1784l1009k9606
62565G37665k8248k7018k5576k3684k1484j9440j7924j6573j4415j1033p426n058
62553E19786m229m059l957m163m751n059m595l741l044k441j641q30l81k14P3
62538D76754O59J374J903J943J484J045J198J674J602Q18L12R74K511M106N519
$$ plain form
62629 480398 481233 480617 479195 477490 475862 474686 473838 472496 470206 467720 466089 465259 464384 463256 462591 463035
62613 463035 464661 467412 471285 475998 481045 486183 491426 496644 501704 507012 513357 521126 530078 539908
62599 539908 550632 562437 575608 590598 607739 626911 647919 671165 697381 726685 758480
62588 758480 792362 828368 865899 902945 936974 966462 991108 1010791 1024801 1032218 1032624 1026228
62576 1026228 1013522 995193 972400 946752 919578 891228 861371 830064 798280 767271 737665
62565 737665 709417 682399 656823 633139 611655 592215 574291 557718 543303 532270 524844 519786
62553 519786 515557 511498 507541 503378 498627 493568 488973 485232 482188 479747 478106 477276 476895 476681 476754
62538 476754 477413 478787 480690 482633 484117 485162 486360 488034 489636 490454 490766 491740 494251 498357 503876
62523E03876O978Q477R851J1241J2922J4900J7104J9602K2290K4769K7049K9837
62511G08896L3554L7490M0642M2916M4803M6209M6447M5259M2983L9839L5715
62500A164753L0644K4870J8472J1509M470k074q043j3471j7622j9369j8427j5526
62488A160186j1392o311p12M806J0338J6709K4120L1464L7492M2143M6210N0092
62476A405145N3316N4826N3174M7023L6369K3407J1313J735o494j6011k8303m2284
62464A593216n5193o4754p0528p3458p4556p4313p2998p0810o7570o2838n6657
62453H49541m9831m3194l6947l1113k6131k2420j9544j6588j3393j0762r170p916
62441E62532n987l384j103N4K11P1L05J253K741M027M307L488K149O94j048l146
$$ plain form
62523 503876 510854 519331 529182 540423 553345 568245 585349 604951 627241 652010 679059 708896
62511 708896 742450 779940 820582 863498 908301 954510 1000957 1046216 1089199 1129038 1164753
62500 1164753 1195397 1220267 1238739 1250248 1254718 1252644 1244601 1231130 1213508 1194139 1175712 1160186
62488 1160186 1148794 1142483 1141771 1146577 1156915 1173624 1197744 1229208 1266700 1308843 1355053 1405145
62476 1405145 1458461 1513287 1566461 1613484 1649853 1673260 1684573 1686308 1679814 1663803 1635500 1593216
62464 1593216 1538023 1473269 1402741 1329283 1254727 1180414 1107416 1036606 969036 906198 849541
62453 849541 799710 756516 719569 688456 662325 639905 620361 603773 590380 579618 570448 562532
62441 562532 556545 553161 552058 552112 552323 552394 552699 553952 556693 560720 565027 568515 570664 571358 570310 567164
62425E67164m965n779n694n507n712o161o580o913p052o767o034n086m096l140
62411D87678k567k798l606m089l752l142l050l412l533l107k499k062j708j197
62397D47156n48J3L56O55J291K412L557L968L379K386J767J734K037K535L312
62382D76010M331N303N908O000N712N493N754O379O809O867P126Q096R376J0162
62368E69326J0455J1069J2483J4259J5830J7302J9128K1398K3941K6931L0900
62357G73022L5945M1341M6282N0812N5626O0766O5020O6910O5988O2661N7080
62346A381453M9017L8978K8482J8751R705P69p801j5209k1385k7156l3038l8529
62334A384037m2747m5404m6825m7302m6670m4551m1050l7084l3756l1301k9019
$$ plain form
62425 567164 562199 556420 550726 545219 539507 533346 526766 519853 512801 506034 500000 494914 490818 487678
62411 487678 485111 482313 478707 474618 470866 467724 464674 461262 457729 454622 452123 450061 448353 447156
62397 447156 446608 446621 446977 447632 448923 451335 454892 458860 462239 464625 466392 468126 470163 472698 476010
62382 476010 480341 485644 491552 497552 503264 508757 514511 520890 527699 534566 541692 549788 559164 569326
62368 569326 579781 590850 603333 617592 633422 650724 669852 691250 715191 742122 773022
62357 773022 808967 850308 896590 947402 1003028 1063794 1128814 1195724 1261712 1324373 1381453
62346 1381453 1430470 1469448 1497930 1516681 1526386 1527155 1519354 1504145 1482760 1455604 1422566 1384037
62334 1384037 1341290 1295886 1249061 1201759 1155089 1110538 1069488 1032404 998648 967347 938328
62323I38328k6420k3957k2319k1434k0766k0245k0217k0671k1143k1301k1027
62312F98828k0079j8312j6264j4797j3999j3103j1614r921q527p326o050m869
62300E53967m088l552k852j950j257j079j215j051p7J520K791K884J985J076P82
62285E47884R29J332K243L652M675M428L279K533K858L543L538K781K200K595
62271E88470L834N145O039O738P745R186J0804J2464J4348J6554J8882K1236K4025
62258G45470K7802L2601L7935M3434M9140N5028O0582O5065O8131O9745O9557
62247A324490O6693O0533N1510M0909K9896J9070Q836l32q320j5721k3318l1184
62235A523062l8539m4493m8764n1692n3687n4692n4198n1897m8310m4448m0835
$$ plain form
62323 938328 911908 887951 865632 844198 823432 803187 782970 762299 741156 719855 698828
62312 698828 678749 660437 644173 629376 615377 602274 590660 580739 572212 564886 558836 553967
62300 553967 549879 546327 543475 541525 540268 539189 537974 536923 536846 538366 541157 544041 546026 547102 547884
62285 547884 548813 550145 552388 556040 560715 565143 568422 570955 573813 577356 580894 583675 585875 588470
62271 588470 592304 597449 603488 610226 617971 627157 637961 650425 664773 681327 700209 721445 745470
62258 745470 773272 805873 843808 887242 936382 991410 1051992 1117057 1185188 1254933 1324490
62247 1324490 1391183 1451716 1503226 1544135 1574031 1593101 1601937 1601605 1593285 1577564 1554246 1523062
62235 1523062 1484523 1440030 1391266 1339574 1285887 1231195 1176997 1125100 1076790 1032342 991507
62224I91507l7216l3431l0027k7556k5712k3781k1724k0089j8979j7882j6622
62213G18488j5709j5481j5471j5050j4133j2901j1290r250p198n653m564l498
62201E88290k357j433p85n2R73J941K412K519K861L834N204O471P365P929Q229
62186F33401Q318Q467R109J0329J1683J2729J3556J4330J4581J3453J0872P955
62174G68783O022N417N584N936O416P360R253J2473J6984K2182K7318L2136L6897
62161I62761M1765M6311M9719N1211N0214M6330L9630L1004K1864J3301N621j243
62149A358488p250j2477j7459k2681k7771l1916l5079l8124m1231m3022m1940
62138A039538l8212l3624k9607k6274k3286k0664j8358j5849j2831r946q181p600
$$ plain form
62224 991507 954291 920860 890833 863277 837565 813784 792060 771971 752992 735110 718488
62213 718488 702779 687298 671827 656777 642644 629743 618453 609203 602005 596352 591788 588290
62201 588290 585933 584500 583715 583663 584636 586577 588989 591508 594369 598203 603407 609878 617243 625172 633401
62186 633401 641719 650186 659295 669624 681307 694036 707592 721922 736503 749956 760828 768783
62174 768783 774805 780222 785806 791742 798158 805518 814771 827244 844228 866410 893728 925864 962761
62161 962761 1004526 1050837 1100556 1151767 1201981 1248311 1287941 1318945 1340809 1354110 1359731 1358488
62149 1358488 1351238 1338761 1321302 1298621 1270850 1238934 1203855 1165731 1124500 1081478 1039538
62138 1039538 1001326 967702 938095 911821 888535 867871 849513 833664 820833 810887 802706 795106
62126G95106p203o106m495l168k477k007j272k82P65K073M049O616R104J0981
62112H01684J2192J2647J1840R465O068K630k55k382l409l003j504J45J155J275
62098H48548M51j276l380m862m955l687j763j14N74M04L63J421L412N181N983
62083H46300O250O848Q025R416J0722J1972J3249J4546J5855J7207J8585J9825
62071I98800K0691K1163K1650K2606K3762K4131K3297K2314K2729K4700K6911
62060A252754K8340K9300L0303L0691K9097K4991J9147J2709O330L00m986r201
62048A449775j2682j6489k1427k7106l2353l6642m0479m4111m6604m6998m5914
62037A078970m4964m4684m4041m2020l8759l4941l0989k7288k4327k2119k0071
$$ plain form
62126 795106 787903 781797 777302 774134 771657 769650 768378 768096 768861 770934 774983 781599 790703 801684
62112 801684 813876 826523 838363 847828 853896 856526 856271 853889 850480 847477 845973 846118 847273 848548
62098 848548 848999 847723 844343 839481 834526 830839 829076 828962 829536 829940 830303 831724 835136 840317 846300
62083 846300 852550 859398 867423 876839 887561 899533 912782 927328 943183 960390 978975 998800
62071 998800 1019491 1040654 1062304 1084910 1108672 1132803 1156100 1178414 1201143 1225843 1252754
62060 1252754 1281094 1310394 1340697 1371388 1400485 1425476 1444623 1457332 1463662 1463962 1458976 1449775
62048 1449775 1437093 1420604 1399177 1372071 1339718 1303076 1262597 1218486 1171882 1124884 1078970
62037 1078970 1034006 989322 945281 903261 864502 829561 798572 771284 746957 724838 704767
62026G04767j7839j5749j4022j2336j0611r443r148r041q332p230o421o004n686
62013E72905n544n707n576m342k234m29L25M19O59J458K775M276N447N985O200
61998E76617O667P456Q016P795O654M752K484N47m56p02j141k593m962p381r000
61983E94753r639r800j0054j0413j0431r930r315q980q775q341p723p259o969
61970D77124o506n592m310k995k076j775j773j385l85O28J003R14J071J766K702
61955D58411L507L966L817K952J870J399J880K887L889M771N696O702P618Q237
61941E17602Q574R001J0015J1621J3250J4381J5124J5792J6276J6276J5924J5619
61929F79455J5296J4462J3045J1590J0455R198P128M156Q66k039m202n659o732
$$ plain form
62026 704767 686928 671179 657157 644821 634210 624767 615619 606578 598246 591016 584595 578591 572905
62013 572905 567361 561654 556078 551736 549502 549073 549398 549817 550476 551934 554709 558985 564432 570417 576617
61998 576617 583284 590740 598756 606551 613205 617957 620441 620988 620532 619830 618689 616096 611134 603753 594753
61983 594753 585114 575314 565260 554847 544416 534486 525171 516191 507416 499075 491352 484093 477124
61970 477124 470618 465026 460716 457721 455645 453870 452097 450712 450327 450955 451958 452872 453943 455709 458411
61955 458411 461918 465884 469701 472653 474523 475922 477802 480689 484578 489349 495045 501747 509365 517602
61941 517602 526176 535177 545192 556813 570063 584444 599568 615360 631636 647912 663836 679455
61929 679455 694751 709213 722258 733848 744303 753501 760629 764785 765651 763612 759410 753751 747019
61916G47019p780q870r621r418p907n376k494L42L368O847J0358J3063J4698J5708
61902G59937J6308J6024J4477J2051R314O292K898m03l048n233p549r960j1837
61889G99271j2896j3376j3297j2364j0766r372q817q840q844q649q459q413q512
61876F66666q783r269r907j0470j0580r844q270o415m904l804k733j473j95Q48
61862E80867J600K214L037M434O378Q387J0086J1552J2882J3899J4759J6304J9059
61849G05458K2182K4387K5670K7077K8806K9681K8878K7086K5334K3502K0720
61838I88781J6719J1988O915J544l890q738j2393j4682j5760j5749j4523j1889
61826I28323q039l616Q59N391R861J3309J4621J3910J2365J0510P499K627l320
$$ plain form
61916 747019 739239 730369 720748 711330 703423 698047 695553 695895 699263 706110 716468 729531 744229 759937
61902 759937 776245 792269 806746 818797 828111 834403 837301 836898 833850 828617 821068 811108 799271
61889 799271 786375 772999 759702 747338 736572 727200 718383 709543 700699 692050 683591 675178 666666
61876 666666 657883 648614 638707 628237 617657 607813 599543 593128 588224 584420 581687 580214 580019 580867
61862 580867 582467 584681 587718 592152 598530 606917 617003 628555 641437 655336 670095 686399 705458
61849 705458 727640 752027 777697 804774 833580 863261 892139 919225 944559 968061 988781
61838 988781 1005500 1017488 1024403 1025947 1022057 1013319 1000926 986244 970484 954735 940212 928323
61826 928323 920284 916668 917527 922918 932779 946088 960709 974619 986984 997494 1004993 1007620 1004300
61813A004300q921j3766j8403k2971k6752k9026k9742k9235k7885k6123k4374
61802G47102k2749k1060j9186j7232j5381j3784j2608j1941j1545j0943r801q193
61790E72679o486n045m061l499l143k775k301j781j352j151j177j284j329j372
61776E35923j527j745j853j842j852j839j520p65J28P32R35J011J261J683J945
61761E30675J781J388J321J855K601L020L127L428M113M705M570L587K200R02
61747E69273j97j322k527l398l603l605m219n259n438m156k659k458l206l323
61733E23903k396j559j391j012K00J395J643J454J805K469K531J987J643J698
61719E34370J619J379J584K248K530K094J740K171K817K652J594M10m85j373k422
$$ plain form
61813 1004300 995379 981613 963210 940239 913487 884461 854719 825484 797599 771476 747102
61802 747102 724353 703293 684107 666875 651494 637710 625102 613161 601616 590673 580872 572679
61790 572679 566193 561148 557087 553588 550445 547670 545369 543588 542236 541085 539908 538624 537295 535923
61776 535923 534396 532651 530798 528956 527104 525265 523745 522980 523108 523840 524775 525786 527047 528730 530675
61761 530675 532456 533844 535165 537020 539621 542641 545768 549196 553309 558014 562584 566171 568371 569273
61747 569273 569076 567754 565227 561829 558226 554621 550402 545143 539705 535549 532890 530432 527226 523903
61733 523903 521507 519948 518557 517545 517745 519140 520783 522237 524042 526511 529042 531029 532672 534370
61719 534370 535989 537368 538952 541200 543730 545824 547564 549735 552552 555204 556798 557208 556723 555350 552928
61704E52928l266l589l631l785m017m017l740l454l293l113k808k557k622l064
61690E05972l610l772l217k291j953k746l839l788k337q04m20r64j542j930k349
61675D70410k578k291j974k334l020k953j992j180j151j372j291j198j478j778
61661D43820j629j190q10m09J63O96J047J562K536L592M132L976L325K461J776
61646D65048J561J473Q60MJ39J688L303L537K743K275K445K405J733Q95K03n82
61630D89730j513k243k665k941k896k218j418j545k697l720l754l299l148l088
61616D52585k400j234n64r00j699k171k221k399l086m038m684m846m928n318n790
61601D06307n754n043m082l337k863k521k267k167k312k837l720m455m322l198
$$ plain form
61704 552928 549662 546073 542442 538657 534640 530623 526883 523429 520136 517023 514215 511658 509036 505972
61690 505972 502362 498590 495373 493082 491129 488383 484544 480756 478419 477615 477195 476231 474689 472759 470410
61675 470410 467832 465541 463567 461233 458213 455260 453268 452088 450937 449565 448274 447076 445598 443820
61661 443820 442191 441001 440191 439782 439945 440641 441688 443250 445786 449378 453510 457486 460811 463272 465048
61646 465048 466609 468082 468942 468946 469085 470773 474076 477613 480356 482631 485076 487481 489214 490109 490312 489730
61630 489730 488217 485974 483309 480368 477472 475254 473836 472291 469594 465874 462120 458821 455673 452585
61616 452585 450185 448951 448387 447487 445788 443617 441396 438997 435911 431873 427189 422343 417415 412097 406307
61601 406307 400553 395510 391428 388091 385228 382707 380440 378273 375961 373124 369404 364949 360627 357429
61587C57429j902j379j706k164k211k024k008k101j892j280o59l77l32l02m20
61572C36672r71j806k289j929q56L37J067J067N44L1r6j2j09l50l34M5M20M89
61554C31920L65K44J99L52Q53J501J844J787J688J659J354O73J12J06M75Q89J316
61537C47337J703J775J614J849K760L703M022L981M100M145L536K387J245R2j468
61522C82781l187m208m131l406k666k231k140k069j447k81M58j2j049j418j090
61507C53904j086j662j864j150k30R8j9j75m16p15m98N00J577J937J755J712J875
61490C55543J728J078L19j20j42R5L09K58jj53q8oK5K39O94J075J261J578K104
61471C65796K235J498M42K9K87K89n22j561j854j124P1R88J266R96N04Q8p6Q6
$$ plain form
61587 357429 355527 354148 352442 350278 348067 346043 344035 341934 340042 338762 338103 337726 337394 337092 336672
61572 336672 335701 333895 331606 329677 328821 329158 330225 331292 331836 331867 331771 331759 331650 331300 330966 331011 331431 331920
61554 331920 332285 332529 332728 333080 333933 335434 337278 339065 340753 342412 343766 344439 344551 344657 345132 346021 347337
61537 347337 349040 350815 352429 354278 357038 360741 364763 368744 372844 376989 380525 382912 384157 384249 382781
61522 382781 379594 375386 371255 367849 365183 362952 360812 358743 357296 357015 357473 357461 356412 354994 353904
61507 353904 352818 351156 349292 348142 347912 348010 347991 347816 347400 346685 346187 346687 348264 350201 351956 353668 355543
61490 355543 357271 358349 358668 358548 358406 358501 358810 359068 359067 358914 358826 358820 358845 359084 359778 360853 362114 363692 365796
61471 365796 368031 369529 369971 370000 370287 370576 370054 368493 366639 365515 365586 366574 367840 368836 369340 369428 369352 369438
61453C69438N87J273J809J859J397P78M21M05L99J57k8L60J221J770J552J133
61437C84531J349K157K864L218L555L863L615K750K091K269K785K693J871J038
61423D20649P36Q42R81J053J240J737K480L064L051K415J595R44L79k79q87j203
61407D38797j323j617k206k780k918k497j784j262j259j659k031k086j932j793
61393D11650j665j390r78o96q13j304j799j856j350n70J18O45J124J480J454J046
61377D05096P17R54J721K428K539K181K027K448K956K780J947J282J201J154O52
61362D32083J94N48J525K225K315K272K448K718L022L568M341N101N986P367R041
61347D84754J0238J0675J0854J1012J0601R190P234N428L914K663K005K129K525
$$ plain form
61453 369438 370025 371298 373107 374966 376363 377141 377562 377967 378366 378523 378495 378855 380076 381846 383398 384531
61437 384531 385880 388037 390901 394119 397674 401537 405152 407902 409993 412262 415047 417740 419611 420649
61423 420649 421385 422227 423208 424261 425501 427238 429718 432782 435833 438248 439843 440787 441166 440887 440000 438797
61407 438797 437474 435857 433651 430871 427953 425456 423672 422410 421151 419492 417461 415375 413443 411650
61393 411650 409985 408595 407617 406921 406108 404804 403005 401149 399799 399229 399347 399992 401116 402596 404050 405096
61377 405096 405813 406767 408488 410916 413455 415636 417663 420111 423067 425847 427794 429076 430277 431431 432083
61362 432083 432277 432825 434350 436575 438890 441162 443610 446328 449350 452918 457259 462360 468346 475713 484754
61347 484754 494992 505667 516521 527533 538134 547324 554558 559986 563900 566563 568568 570697 573222
61334E73222K599K470K568K759K520J715N52j044l183n181n794m592k654j495
61320E64462j561j989j710n19R28J968K527K863L066L088L157L668M670N870P090
61305E97578Q324R300R610R453R656J0565J1408J1100R301O381K794j023m565
61292F89882p503r834j1467j2089j1738j1063j0543r905q788p519o629o003n214
61279E71587m338l647k814j291O42K092K860L668M935O132O650O625O503O405
61265F06009O281O236O286O148N713N415N766O772Q124R715J1510J3022J3402
61252G10399J2229R977P580N617L984K293M71j136k253l101m097n205n891n867
61238G25000n529n466n749n981n978n934n896n480m403k987j766p04O45K267L482
$$ plain form
61334 573222 575821 578291 580859 583618 586138 587853 588405 587361 584178 578997 573203 568611 565957 564462
61320 564462 562901 560912 559202 558683 559611 561579 564106 566969 570035 573123 576280 579948 584618 590488 597578
61305 597578 605902 615202 624812 634265 643921 654486 665894 676994 686295 692676 695470 694447 689882
61292 689882 682379 672545 661078 648989 637251 626188 615645 605740 596952 589433 582804 576801 571587
61279 571587 567249 563602 560788 559497 560139 562231 565091 568759 573694 579826 586476 593101 599604 606009
61265 606009 612290 618526 624812 630960 636673 642088 647854 654626 662750 672465 683975 696997 710399
61252 710399 722628 732605 740185 745802 749786 752079 752550 751414 749161 746060 741963 736758 730867 725000
61238 725000 719471 714005 708256 702275 696297 690363 684467 678987 674584 671597 669831 669127 669772 672039 675521
61223F75521L846L735L730L844L825L818M112M426M150L285K530K373K623K918
61209G24736L101K949K216J170M75K33k82j474k551k391q93J140L123N076P116
61194G43744R220J1508J4193J7081J9428K0475J9962J8194J5780J3241J0685P894
61182I21405M898K238N42q2m0J38J2p35k116l717n058o034o913p915q936r635
61166H78052r771r530r460r956j0834j1640j2214j2653j2850j2585j2040j1652
61154G42867j1333j0479q878p007n237l363j272O56K191L645N058N627M597K281
61140G19353m76l421o701r805j1573j1327r505p193n338m322l786k966j417O30
61126F42153K714M596O105P062P740Q876J0799J2992J4930J6825J8980K1000K2275
$$ plain form
61223 675521 679367 683102 686832 690676 694501 698319 702431 706857 711007 714292 716822 719195 721818 724736
61209 724736 727837 730786 733002 734172 734647 734880 734598 733124 730573 728182 727289 728429 731552 736628 743744
61194 743744 752964 764472 778665 795746 815174 835649 855611 873805 889585 902826 913511 921405
61182 921405 926303 928541 929083 929001 928961 929099 929111 928376 926260 922543 917485 911451 904538 896623 887687 878052
61166 878052 868281 858751 849291 839335 828501 816861 804647 791994 779144 766559 754519 742867
61154 742867 731534 721055 712177 705170 699933 696570 695298 695954 698145 701790 706848 712475 717072 719353
61140 719353 718877 715456 708755 698950 687377 676050 666545 659352 654014 649692 645906 642940 641523 642153
61126 642153 644867 649463 655568 662630 670370 679246 690045 703037 717967 734792 753772 774772 797047
61113G97047K2832K3067K3068K2874K2914K3428K3842K3545K2872K2485K2199
61102A050173K1355K0006J8643J6917J3828R211M024r95n971j0969j5326j8312
61090A102584j9918k0714k1370k2332k3469k4047k3595k2697k2315k2412k1994
61079H57721k0546j8678j7254j6454j5817j4761j2957j0667q620p209o055m735
61067G03968l503k655j725j66J606K827L656M736N827O078N537N172N487O228
61053G43073P318Q866J0369J1255J2096J3853J5997J7065J7155J8011K0253K2450
61041I17761K3647K4870K7062K9291L0363L0877L2165L4186L5817L6557L6774
61030A259370L6924L7479L8980M1301M3523M5255M7203M9707N1817N2717N3033
$$ plain form
61113 797047 819879 842946 866014 888888 911802 935230 959072 982617 1005489 1027974 1050173
61102 1050173 1071528 1091534 1110177 1127094 1140922 1150133 1154157 1153162 1147191 1136222 1120896 1102584
61090 1102584 1082666 1061952 1040582 1018250 994781 970734 947139 924442 902127 879715 857721
61079 857721 837175 818497 801243 784789 768972 754211 741254 730587 721967 714758 708703 703968
61067 703968 700465 697810 696085 695919 697525 700352 704008 708744 714571 720649 726186 731358 736845 743073
61053 743073 750391 759257 769626 780881 792977 806830 822827 839892 857047 875058 895311 917761
61041 917761 941408 966278 993340 1022631 1052994 1083871 1116036 1150222 1186039 1222596 1259370
61030 1259370 1296294 1333773 1372753 1414054 1457577 1502832 1550035 1599742 1651559 1704276 1757309
61019A757309N3624N4264N4748N6372O0856O8423P8069Q8962J00461J11660J22380
61008B607128J33908J47733J64615J86168K15980K57247L10562L76006M56204
60999D855551N55217O76382Q24763J010035J241604J519368J830049K144536K403233
60990A7060738K502432K323483J817034J079010L30523k03503m15695l37375p2434
60981B4084213K59318N20981N56146K51916l67995j126135j790282k205438k348095
60972A7834629k283614k095904j850778j592919j349393j131381r40360p76114
60964E814166o38458n24586m29957l52044k90383k43091k06117j76157j52039
60955B801334j32859j16773j02248q9021p7156o6245n5999m6736l8838l2480k8083
$$ plain form
61019 1757309 1810933 1865197 1919945 1976317 2037173 2105596 2183665 2272627 2373088 2484748 2607128
61008 2607128 2741036 2888769 3053384 3239552 3455532 3712779 4023341 4399347 4855551
60999 4855551 5410768 6087150 6911913 7921948 9163552 10682920 12512969 14657505 17060738
60990 17060738 19563170 21886653 23703687 24782697 25113220 24909717 24494022 24156647 24084213
60981 24084213 24343531 24864512 25420658 25672574 25304579 24178444 22388162 20182724 17834629
60972 17834629 15551015 13455111 11604333 10011414 8662021 7530640 6590280 5814166
60964 5814166 5175708 4651122 4221165 3869121 3578738 3335647 3129530 2953373 2801334
60955 2801334 2668475 2551702 2449454 2360433 2283277 2217032 2161033 2114297 2075459 2042979 2014896
60944B014896k6259k6920k9043l1543l3919l5999l7683l9175m0888m2794m4229
60933A626444m4651m4322m3982m4045m4290m4218m3505m2158m0361l8269l6038
60922A160605l3914l2071l0411k8722k7065k5698k4597k3433k2071k0744j9546
60911H72333j8154j6278j4046j1797r762q156p189o772o457n883n025l999l075
60898G55740k796l464m364m296l177k349k830m038m838n099n341n553n389n146
60884F97060n448o093o293o040o217p156q039q079p610p511q038q622q572p685
60870E95657o454n725n917o516o617n938m917l950l069k375k128k179j918j064
60856E36890p8N29Q04R16O09l28j385j707j153m43k10l29l40j61j84p20j626k504
$$ plain form
60944 2014896 1988637 1961717 1932674 1901131 1867212 1831213 1793530 1754355 1713467 1670673 1626444
60933 1626444 1581793 1537471 1493489 1449444 1405154 1360936 1317431 1275273 1234912 1196643 1160605
60922 1160605 1126691 1094620 1064209 1035487 1008422 982724 958127 934694 912623 891879 872333
60911 872333 854179 837901 823855 812058 802296 794140 786951 780179 773722 767839 762814 758815 755740
60898 755740 752944 749480 745116 740820 737643 735294 732464 728426 723588 718489 713148 707595 702206 697060
60884 697060 691612 685519 679226 673186 666969 659813 651774 643695 636085 628574 620536 611914 603342 595657
60870 595657 589203 583478 577561 571045 564428 558490 553573 549623 546554 544179 542051 539872 537954 536890
60856 536890 536812 537341 538145 539061 539670 539342 537957 536250 535097 534654 534444 534115 533775 533614 533430 532710 531084 528580
60838E28580l160l778m640n717o579o696n906m596l420k683k077j186j43M56M20
60823D78875L15P43J542K045J930J444R67O88O14N32R9p11j371j399j030q66j019
60806D83398j171j312j738k265k266j691j349j755k398k582k448k535k831k906
60792D54151k757k768l035l223l122k855k571k383k477k867l168l059k901l283
60778D13682m006m130l266k176j767j974k003j418n38J39M84O99R50J241J593
60763C97510K203L207M222M463L681K722K663L451L988L621K884K463K126J311
60749D40515L14N0P49J591J793J448J115R89Q22L24o50k058l571m694n272n736
60733D27729o522p348p475o704n692n073m637l749k374j196o73n30l71l99j004
$$ plain form
60838 528580 525420 521642 517002 511285 504706 498010 492104 487508 484088 481405 479328 478142 477999 478455 478875
60823 478875 479190 479933 481475 483520 485450 486894 487861 488549 489163 489695 489794 489083 487712 486313 485283 484417 483398
60806 483398 482227 480915 479177 476912 474646 472955 471606 469851 467453 464871 462423 459888 457057 454151
60792 454151 451394 448626 445591 442368 439246 436391 433820 431437 428960 426093 422925 419866 416965 413682
60778 413682 409676 405546 402280 400104 398337 396363 394360 392942 392404 392543 393027 393726 394676 395917 397510
60763 397510 399713 402920 407142 411605 415286 418008 420671 424122 428110 431731 434615 437078 439204 440515
60749 440515 440829 440879 441628 443219 445012 446460 447575 448564 449386 449710 449060 447002 443431 438737 433465 427729
60733 427729 421207 413859 406384 399680 393988 388915 384278 380529 378155 376959 376286 375756 375385 374986 373982
60718C73982j944k426k033j172m93k87n29j154j932k419k308j761j105m19L57
60703C54357J028J265J084Q94J041J528K234L048L704L708K809J470O18P79J569
60688C81136K211K430K630L142L676L817L758M035M623M871M468L948L886M108
60674D32739M135L986L979L998L671L068K622K304J553J46j440k764l897m878
60660D49222n315m997m557m803n537n605m282k188o24k63o83j039q65k27O14J420
60644D10271J914J844J254N09j23q12j845l110m102m441m147l463k619j770j003
60629C88357l81qN0L2L42R21J110N66q0K9O96R40L82l20m90j25N42J341J768J184
60609C96856q4p18p0Q20P01m0RJ204K448K766K300J614R23L09q2l29o85r71o11
$$ plain form
60718 373982 372038 369612 367579 366407 365914 365627 365098 363944 362012 359593 357285 355524 354419 354000 354357
60703 354357 355385 356650 357734 358628 359669 361197 363431 366479 370183 373891 376700 378170 378788 379567 381136
60688 381136 383347 385777 388407 391549 395225 399042 402800 406835 411458 416329 420797 424745 428631 432739
60674 432739 436874 440860 444839 448837 452508 455576 458198 460502 462055 462201 460761 457997 454100 449222
60660 449222 443907 438910 434353 429550 424013 418408 414126 411938 411314 411051 410368 409329 408464 408237 408851 410271
60644 410271 412185 414029 415283 415792 415669 414857 413012 409902 405800 401359 397212 393749 391130 389360 388357
60629 388357 387976 387968 388018 388050 388392 389313 390423 390989 390909 390938 391634 392574 392956 392636 392146 392021 392563 393904 395672 396856
60609 396856 396772 396054 395984 396804 397505 397465 397474 398678 401126 403892 406192 407806 408729 409038 408956 408627 407942 406971 406360
60590D06360M78J542J926J851J845J843J378M67k79l74O8N46O23K15k50r7Q93
60573D19035K106K734K804L170M378N977P165P818Q466R400J0294J0748J0852
60560E04947J0951J1078J0805R598P169L742O5k917m732n648o142o250n686m428
60546E22552k843j202M58K048L309M197N069O355Q179J0344J2486J4273J5697
60533F00922J7164J8878K0210K0058J7998J4575J0495O054J571k336n321p583
60521G12685r199r763r226q515q545q978q752p535n919m329k671j073o9J90K21
60506F28522M79R34J618K960N183P873J0540J3258J6373J9924K3687K7603L1747
60493G90701L6015M0110M3741M6627M8366M8533M6873M3355L8172L1654K4076
$$ plain form
60590 406360 406838 408380 410306 412157 414002 415845 417223 417690 417411 417037 417105 417651 418274 418489 418239 418142 419035
60573 419035 421141 423875 426679 429849 434227 440204 447369 455187 463653 473053 483347 494095 504947
60560 504947 515898 526976 537781 547379 554548 558290 558355 555438 550706 545058 538916 532666 526980 522552
60546 522552 519709 518507 518965 521013 524322 528519 533588 539943 548122 558466 570952 585225 600922
60533 600922 618086 636964 657174 677232 695230 709805 720300 726354 727925 725589 720268 712685
60521 712685 703486 693723 684497 675982 667437 658459 649707 642172 636253 631924 629253 628180 628111 628301 628522
60506 628522 629001 629935 631553 634513 639696 647569 658109 671367 687740 707664 731351 758954 790701
60493 790701 826716 866826 910567 957194 1005560 1054093 1100966 1144321 1182493 1214147 1238223
60482A238223J5479N914m194j4232k3907l3167m1511m7892n1614n2931n2458n0404
60470H87306m6842m2445l8232l4587l1062k7265k3474k0221j7716j5925j4851
60459E74686j4267j3500j1957r897q209p370o993o526n903n284m531l479k450
60446D74320j993k135k340k271k105k049j981j757j459j150p27k60p5k45l29K6
60430D53470N27O41L07j16m69q85j404j824j907j577r90n67o59r92p71L16J532
60413D44632J973J670J359J404J567J632J652J595J336J049J091J385J470J199
60399D65014R65J069J352J564J735J956K150K305K660L433M457N210N172M245
60385E03287K959K153K195K637K822K668K558K696K942L138L165K845K172J534
$$ plain form
60482 1238223 1253702 1259616 1255422 1241190 1217283 1184116 1142605 1094713 1043099 990168 937710 887306
60470 887306 840464 798019 759787 725200 694138 666873 643399 623178 605462 589537 574686
60459 574686 560419 546919 534962 525065 516856 509486 502493 495967 490064 484780 480249 476770 474320
60446 474320 472327 470192 467852 465581 463476 461427 459446 457689 456230 455080 454353 454093 454018 453773 453444 453470
60430 453470 453997 454638 454945 454829 454360 453475 452071 450247 448340 446763 445773 445206 444547 443555 442784 443100 444632
60413 444632 446605 448275 449634 451038 452605 454237 455889 457484 458820 459869 460960 462345 463815 465014
60399 465014 465979 467048 468400 469964 471699 473655 475805 478110 480770 484203 488660 493870 499042 503287
60385 503287 506246 508399 510594 513231 516053 518721 521279 523975 526917 530055 533220 536065 538237 539771
60371E39771J304J385J542J903K512K787K116R35L68Q05J586K074K247K109J478
60356E64922P02P15J867L318M052M112M359N462P403R557J1052J1388J0930J0370
60342F50209R649Q014N196J864j327m328p049q953r797j0071j0131r593q175o469
60328E99039n197m286l402k799k782k841k310j586j749l024m494n233n054m144
60314E50138k766j348k08Q49K180L624M817O029P894J0372J2804J5135J8093K1815
60300F49428K5083K6548K6087K4326K1284J6363R476J447o730j4394k0891k5309
60288G32718k7033k6270k3791k0365j6643j3228j0385p799n195l104k437l118
60276E73350l883l786l365l663m606n134m768m142l988m294m605m530l825k566
$$ plain form
60371 539771 541075 542460 544002 545905 548417 551204 553320 554255 554623 555428 557014 559088 561335 563444 564922
60356 564922 565624 566339 568206 571524 575576 579688 584047 589509 596912 606469 617521 628909 639839 650209
60342 650209 659858 667872 673068 674932 673605 669277 662228 653275 643478 633407 623276 613683 605508 599039
60328 599039 593842 589556 586154 583355 580573 577732 575422 573836 572087 569063 564569 559336 554282 550138
60314 550138 547372 546024 545816 546665 548845 552469 557286 563315 571209 581581 594385 609520 627613 649428
60300 649428 674511 701059 727146 751472 772756 789119 798595 800042 793312 778918 758027 732718
60288 732718 705685 679415 655624 635259 618616 605388 595003 587204 582009 578905 576468 573350
60276 573350 569467 565681 562316 558653 554047 548913 544145 540003 536015 531721 527116 522586 518761 516195
60262E16195j362q63r57j010r15j194j925k393k074j248l11P63J819K206J677
60247E08408R49Q11J140J356J276J001M57l00q28q93q47r13p74l57k34m82j5J802
60229E11557L630L647K151J249K028L406M020L866L604L325K797K249K191K778
60215E52498L703M509M872M877N027N708O703P655Q714J0122J1317J1317J0059
60202F47081Q607P881P836P982P955P433O217M693L565K902K138J146N25M44R6
60187G16501j094k466l056l036l399m509n682o191o045n773n793o065o173n747
60173F51472m941m312m143m133l918l503k963k129r68oJ75k91p01p30p19j011
60157F17179j378j330p95k04J5j13k03L3N50J136J643J987K059J839J524J370
$$ plain form
60262 516195 514833 513970 513013 512003 511088 509894 507969 505576 503502 502254 501943 502706 504525 506731 508408
60247 508408 509357 510168 511308 512664 513940 514941 515398 515098 514270 513377 512530 511617 510843 510486 510252 509770 509755 511557
60229 511557 515187 518834 520985 522234 524262 527668 531688 535554 539158 542483 545280 547529 549720 552498
60215 552498 556201 560710 565582 570459 575486 581194 587897 595552 604266 614388 625705 637022 647081
60202 647081 655688 663569 671405 679387 687342 694775 700992 705685 709250 712152 714290 715436 715961 716405 716501
60187 716501 715407 712941 709885 706849 703450 698941 693259 687068 681023 675250 669457 663392 657219 651472
60173 651472 646531 642219 638076 633943 630025 626522 623559 621430 620462 620456 620631 620340 619639 618909 618190 617179
60157 617179 615801 614471 613676 613472 613487 613374 613171 613204 613754 614890 616533 618520 620579 622418 623942 625312
60141F25312J455J721K188K931L853M789N741O834P984Q832R096Q845Q341P824
60127G05746P385O963O280N009L121J089k88m58K97R71P78O2r0P59J877K445K642
60110G44588L156L914M022K851P67j337k805l567m051m797n848o655o775o521
60096G16942o539o928p169o840n945m694l351k248j568j107n83j9M60R11J310
60081F72632J354R74P49J162J768J832J425J034L96j169l369n047n847o588p683
60066F53623q377q136p681p773p847o880n123l908l935m632n202n469n569n373
60052E67718m587l215j668m25L72R47J499K027K626L689N320O839P403P056O623
60037F02224O552O567O410O151N710M818L682K826K082N68j871m136n303n771
$$ plain form
60141 625312 626767 628488 630676 633607 637460 642249 647990 654824 662808 671640 680736 689581 697922 705746
60127 705746 713131 720094 726374 731383 734504 735593 735305 734847 735144 736115 736893 736955 736865 737624 739501 741946 744588
60110 744588 747744 751658 755680 758531 759298 757961 755156 751589 747538 742741 736893 730238 723463 716942
60096 716942 710403 703475 696306 689466 683521 678827 675476 673228 671660 670553 669970 669951 670411 671322 672632
60081 672632 673986 674960 675709 676871 678639 680471 681896 682930 683326 682157 678788 673741 667894 661306 653623
60066 653623 645246 637110 629429 621656 613809 606929 601806 597898 593963 589331 584129 578660 573091 567718
60052 567718 563131 559916 558248 557823 558195 559142 560641 562668 565294 568983 574303 581142 588545 595601 602224
60037 602224 608776 615343 621753 627904 633614 638432 642114 644940 647022 647590 645719 641583 636280 630509
60023F30509o327o926p199p429p991q372p849o797o263o433o509o098n694n673
60009E34949n737n646n680n934n880n066l796k659j732p39K71Q45Q03N19M90P57
59993D95765R54Q20N59O25J259K335L512M431M860M872M870N172N588N650N132
59978E46404M044K284r3k310l344l249l270m120m886m305k594j167q44j145j302
59963E20103j045l63P66K054K895L014K777K571K310J773J170R26J070J170Q30
59948E42021M4q73j515j532q22L04J258J569J134J18j238k556l326l259k681k235
59932E26411k087j750q06M92J567K190K519K780L239M126N257O055O403P075Q597
59917E72068J0111J0323R378Q720Q935Q854P285M683K461J293Q37O15L98l8q92
$$ plain form
60023 630509 624182 617256 610057 602628 594637 586265 578416 571619 565356 558923 552414 546316 540622 534949
60009 534949 529212 523566 517886 511952 506072 501006 497210 494551 492819 492080 492351 493196 493999 494518 495008 495765
59993 495765 496719 497539 498098 498723 499982 502317 505829 510260 515120 519992 524862 530034 535622 541272 546404
59978 546404 550448 552732 552639 550329 546985 543736 540466 536346 531460 527155 524561 523394 522550 521405 520103
59963 520103 519058 518695 519461 521515 524410 527424 530201 532772 535082 536855 538025 538951 540021 541191 542021
59948 542021 542065 541192 539677 538145 537323 537627 538885 540454 541588 541706 540468 537912 534586 531327 528646 526411
59932 526411 524324 522574 521768 522260 523827 526017 528536 531316 534555 538681 543938 549993 556396 563471 572068
59917 572068 582179 592502 601880 610600 619535 628389 635674 640357 642818 644111 644948 645563 645961 645923 645031
59902F45031k060l171l794l575k531j381j083j763k516k495j802r84k51M60J095
59887F19180J677K447L473M459N281O159O974P059O269N553N764O411O372N500
59873F92578M580M028L512K742J786O14q84k375l290l633l910m224m051l215k374
59858F81884k314l066m050m705m810m432l840l338k992k503j437M30K801M944
59844F52572O310P132Q094R261R772Q796O425L381L72j888k612j562N43K687M321
59829G13604N050M187J499j956m620n977o589o828o567n999n732n736n193l834
59815F65309k577k242k263j441L23J813J922P22j013k800m551n984o540o104n442
59800F29132n371n638n199l679k046j465k021k911l477l574l283k776k367k197
$$ plain form
59902 645031 642971 639800 636006 632431 629900 628519 627436 625673 623157 620662 618860 617876 617625 618085 619180
59887 619180 620857 623304 626777 631236 636517 642676 649650 656709 662978 668531 674295 680706 687078 692578
59873 692578 697158 701186 704698 707440 709226 709840 708956 706581 703291 699658 695748 691524 687473 684258 681884
59858 681884 679570 676504 672454 667749 662939 658507 654667 651329 648337 645834 644397 644827 647628 652572
59844 652572 658882 666014 674108 683369 693141 701937 708362 711743 712115 710227 707615 706053 706596 709283 713604
59829 713604 718654 722841 724340 722384 717764 711787 705198 698370 691803 685804 680072 674336 669143 665309
59815 665309 662732 660490 658227 656786 657109 658922 660844 661566 660553 657753 653202 647218 640678 634574 629132
59800 629132 623761 618123 612924 609245 607199 605734 603713 600802 597325 593751 590468 587692 585325 583128
59786E83128k051j705j297r95p13l76j91k01j19J9l99j555k415j838p6J594K448
59769E73258K674K449J802J299J812L275M543M775M249L644L236L104L394L951
59755F17465M247M036L703L665L917M358N075N985O653O792O641O520O326N791
59741F91174M961M162L596L137K480J519O27L38N46L86o14j668j673q18l90r46
59725G06817j615j499r08o90r82j174p90O8Q95J072L51p05j107o12q4l57j135
59708F97545j512j218p73n24k37K87P89R97J153J668K566L633M894O512Q177R263
59692G33220R720J0205J0815J0313P535L215n47k645l738m568m780m023l104l029
59678G58589l609l990m108m644n846p264q491r401r844r788r531r172q260o610
$$ plain form
59786 583128 581077 579372 578075 577080 576367 575991 575800 575599 575480 575499 575100 573545 571130 569292 569216 570810 573258
59769 573258 575932 578381 580183 581482 583294 586569 591112 595887 600136 603780 607016 610120 613514 617465
59755 617465 621712 625748 629451 633116 637033 641391 646466 652451 659104 665896 672537 679057 685383 691174
59741 691174 696135 700297 703893 707030 709510 711029 711656 711994 712540 712926 712312 710644 708971 708153 707763 706817
59725 706817 705202 703703 702795 702105 701123 699949 699159 699227 700122 701194 701545 700840 699733 699121 699037 698680 697545
59708 697545 696033 694815 694042 693518 693281 693568 694357 695354 696507 698175 700741 704374 709268 715780 723957 733220
59692 733220 742940 753145 763960 774273 781808 785023 784476 781831 778093 773525 768745 764722 761618 758589
59678 758589 754980 750990 746882 742238 736392 729128 720637 711236 701392 691604 682073 672901 664641 658031
59664F58031n050m469m509m074k899j697r00k56M35J081J720K428K956L226L844
59649F49867N167O244N880M427L241K469R01j828m463n931o573p016p110o662
59635F38613o175o010n652m518k880j451n80k45k48j89R8m4j362l288m270l810
59619E97989l074l098l543l763l907m242m397m104l824l870l689k716j256J62
59605E52668J470K514K740K172J856K388K891K374J302Q18J059J335J474J833
59591E78894K356K620K562K357J848R43J78Q8K99K7q05j723k566l413l960l870
59575E75835l519l611m190m739m988n009m684l841k755j901j355r23n71k42L31
59560E33838J061J249N48l12m77j70l3K00J274K923L944L732K826J904J175Q10
$$ plain form
59664 658031 652981 648512 644003 639929 637030 635333 634433 634177 634612 635693 637413 639841 642797 646023 649867
59649 649867 655034 661278 667158 671585 674826 677295 678196 676368 671905 665974 659401 652385 645275 638613
59635 638613 632438 626428 620776 616258 613378 611927 611347 611102 610854 610665 610763 610719 609357 606069 601799 597989
59619 597989 594915 591817 588274 584511 580604 576362 571965 567861 564037 560167 556478 553762 552506 552668
59605 552668 554138 556652 559392 561564 563420 565808 568699 571073 572375 573193 574252 575587 577061 578894
59591 578894 581250 583870 586432 588789 590637 591580 591758 591846 592145 592172 591367 589644 587078 583665 579705 575835
59575 575835 572316 568705 564515 559776 554788 549779 545095 541254 538499 536598 535243 534320 533749 533507 533838
59560 533838 534899 536148 536696 536384 535907 535737 535704 535904 537178 540101 544045 547777 550603 552507 553682 554492
59544E54492J098J947K857L629M552N872P532R449J1637J4112J6930J9907K1784
59531F75798K0279J4079M801l874r085j0417r081o523l821j440Q14L110M880N370
59517F84890M810M172L706K604M03k125l953n078o288q030r923j1191j1290j0306
59503F32401q922p886p339o829n874m414k770j423p59p53q96o40P9R27J568J823
59487E88293J692J511J853K974M484N855O964P924Q719R331R999J0990J2388J4237
59473F87214J6472J8398J8815J7120J3847R696M694j003o093q990r510q874q139
59460G43647p292n805l365j08L362O284Q461J0442J2509J4020J4447J4600J5835
59447H27037J8252K0632K1944K2037K0794J7666J2355N348k388r765j5643j9169
$$ plain form
59544 554492 555590 557537 560394 564023 568575 574447 581979 591428 603065 617177 634107 654014 675798
59531 675798 696077 710156 714957 711083 701998 691581 682500 675977 672156 670716 671530 674640 679520 684890
59517 684890 689700 693872 697578 700182 700585 698460 694507 689429 683141 675111 665188 653997 642707 632401
59503 632401 623479 615593 608254 601425 595551 591137 588367 586944 586185 585432 584536 583896 583975 584902 586470 588293
59487 588293 589985 591496 593349 596323 600807 606662 613626 621550 630269 639600 649599 660589 672977 687214
59473 687214 703686 722084 740899 758019 771866 781562 786256 785253 779160 770170 760660 751786 743647
59460 743647 736355 730550 727185 727077 730439 736723 745184 755626 768135 782155 796602 811202 827037
59447 827037 845289 865921 887865 909902 930696 948362 960717 966065 963677 953912 938269 919100
59435I19100k0217j9225j6776j3732j1381j0739j1781j3752j5889j7299j6934
59424G51375j4624j1637r159o647k865J841N823Q565J1318J5100J9479K3672K7508
59411H19749L0924L3711L6050L7739L6336K8039J1999p124k2350k9755l0034k5809
59399I19475j9035j0658j145Q922J7753K1711J7144L908j3272k7762l5535l6902
59387H44604l4424l0090k4678j8964j4162j0909q622o422m258k559j284j01P79
59374F88910R55Q44J447K938M374M976M967M826M579M223M135M520M954N042N032
59359G46722N308N656N607N236N074N347N784O159O636P516Q842J0303J1477J2188
59345H47855J2696J3491J4820J6403J7538J7577J6477J4934J3649J2406J0215
$$ plain form
59435 919100 898883 879658 862882 849150 837769 827030 815249 801497 785608 768309 751375
59424 751375 736751 725114 715955 709308 706443 708284 714107 722672 733990 749090 768569 792241 819749
59411 819749 850673 884384 920434 958173 994509 1022548 1034547 1027423 1005073 975318 945284 919475
59399 919475 900440 889782 888637 897559 915312 937023 954167 958075 944803 917041 881506 844604
59387 844604 810180 780090 755412 736448 722286 711377 702755 696333 692075 689516 688232 688131 688910
59374 688910 689865 690709 692156 695094 699468 704444 709411 714237 718816 723039 727174 731694 736648 741690 746722
59359 746722 752030 757686 763293 768529 773603 778950 784734 790893 797529 805045 813887 824190 835667 847855
59345 847855 860551 874042 888862 905265 922803 940380 956857 971791 985440 997846 1008061
59334A008061O577K113k233o141r542j2012j3253j3879j4847j6216j7168j7177
59322H94283j6488j5454j4143j2666j1309j0171r018p605n912m259l387l915n348
59309G74608o117n322l861l114l086k844k231j846j623q50M63J569K448L954O300
59294G58448Q678J0620J2428J3724J2895Q793K052n723j3121j8734k1097j9935
59282G49028j6821j3698j1179q911o829n081l250o77K499N430P639R491J1515
59269G19156J3642J5236J5731J5205J4244J3180J1761R814P820O186M346J488
59257H47809k026m933o807q468j0430j2043j2488j1806j0514r041p848p301p026
59244G37078o151m532k970j944j008J76J225J888K629L714M634M970N074N226
$$ plain form
59334 1008061 1014638 1016751 1014518 1008377 998835 986823 973570 959691 944844 928628 911460 894283
59322 894283 877795 862341 848198 835532 824223 814052 805034 797429 791517 787258 783871 779956 774608
59309 774608 768491 763169 759308 756194 753108 750264 748033 746187 744564 743714 744177 745746 748194 752148 758448
59294 758448 767126 777746 790174 803898 816793 825586 827638 821915 808794 790060 768963 749028
59282 749028 732207 718509 707330 698419 691590 686509 683259 682582 685081 690511 698150 707641 719156
59269 719156 732798 748034 763765 778970 793214 806394 818155 827969 835789 841975 846321 847809
59257 847809 845783 840850 834043 825575 815145 803102 790614 778808 768294 759253 751405 744104 737078
59244 737078 730927 726395 723425 721481 720473 720649 721874 723762 726391 730105 734739 739709 744783 750009
59230G50009M974M014L018K758K962K819K051Q85n51k118l336l877l991m096m305
59215G51216m629n038n029l895j960p27j114k282k868k731k644k829k808k396
59201G10266k002j982k238k432k319k020j973k379k721k405j767j544j491o61
59187F82332P57J300M81j70P51K562L698L832L626L244K469J759J918K943M077
59172G15579M789M947M549M038M343N758P352Q243Q847R910J0996J1109J0281
59159H10741R321Q341O791M712K722Q24j611m569p154q849j0063j1265j2286j2769
59145G74886j2719j2330j1767j1235j0963j0942j0935j0758j0384r839r129q097
59133F45788o491m474k953k717l227l121j975p09kN55J343K000K438L398N154
$$ plain form
59230 750009 754983 758997 762015 764773 767735 770554 772605 773490 772939 770821 767485 763608 759617 755521 751216
59215 751216 746587 741549 736520 732625 730665 729938 728824 726542 723674 720943 718299 715470 712662 710266
59201 710266 708264 706282 704044 701612 699293 697273 695300 692921 690200 687795 686028 684484 682993 682332
59187 682332 683089 684389 684870 684700 685451 688013 691711 695543 699169 702413 704882 706641 708559 711502 715579
59172 715579 720368 725315 729864 733902 738245 744003 751355 759598 768445 778355 789351 800460 810741
59159 810741 820062 828403 835194 839906 842628 843452 841841 837272 830118 821269 811206 799941 787655 774886
59145 774886 762167 749837 738070 726835 715872 704930 693995 683237 672853 663014 653885 645788
59133 645788 639297 634823 631870 629153 625926 622805 620830 620121 620119 620674 622017 624017 626455 629853 635007
59118F35007O732P406P935R205J0681J1412J1656J2186J2664J2224J1124J0364
59106G58596J0029R351Q202P233O656O010N050L920K641J259K06l61j118k535
59092H15139l835m040l444k946k477j481l77j40o13p89o06j082k696m849o882
59077G78882q486r231q935q355q362q638q314p573p234p106o347n283n116n764
59063F74138n712m333k759k050j944j918k095k491k594k235j892j739j427j064
59049F39885j233j758j754j228j287k219k835k315j438j203j408j517j744k266
59035F15680k282j019R15K239K598K625K857L344M111N190O353P287Q031Q973
59021F66902J0504J2668J4945J6413J6580J5928J5149J4025J1796Q509N104K094
$$ plain form
59118 635007 641739 649145 657080 666285 676966 688378 700034 712220 724884 737108 748232 758596
59106 758596 768625 777976 786178 793411 800067 806077 811127 815047 817688 818947 819153 818792 817674 815139
59092 815139 811304 807264 803820 800874 798397 796916 796539 796399 795786 794997 794391 793309 790613 785764 778882
59077 778882 770396 761165 752230 743875 735513 726875 718561 710988 703754 696648 690301 685018 679902 674138
59063 674138 668426 664093 661334 659284 657340 655422 653327 650836 648242 646007 644115 642376 640949 639885
59049 639885 638652 636894 635140 633912 632625 630406 627571 625256 623818 622615 621207 619690 617946 615680
59035 615680 613398 612379 613294 615533 618131 620756 623613 626957 631068 636258 642611 649898 657929 666902
59021 666902 677406 690074 705019 721432 738012 753940 769089 783114 794910 803419 808523 810617
59009H10617q52l773n849o424n859m932l916k659j079P14K457L769M564N316O339
58994G98433P008O413M712L033K047J437P52r7j192k526l589l935m131n053o250
58979G97062o242m681k879j847r76O77K951N063O715Q015Q980R703J0460J1232
58965H44233J1638J1620J1589J1736J1814J1730J1504J0649Q498N378K412k4k684
58952I50093o071r736j3239j6587j9317k0358j9547j8143j7215j6475j5339j4009
58940G64057j2692j0776p882m942l207k690k450j979j524j401j697k336k910k796
58926G04775j884q44l08k70n56j227k133k673k556k255k262k339j957j042Q2J110
58910F83661J872K372K919L770M647N130N527O559Q245R896J1342J3186J5616
$$ plain form
59009 810617 809765 805992 800143 793719 787860 782928 779012 776353 775274 775988 778445 782214 786778 792094 798433
58994 798433 805441 811854 816566 819599 821646 823083 823835 823738 822546 820020 816431 812496 808365 803312 797062
58979 797062 790820 786139 783260 781413 780437 781114 784065 789128 795843 803858 812838 822541 833001 844233
58965 844233 855871 867491 879080 890816 902630 914360 925864 936513 945011 950389 952801 952777 950093
58952 950093 944022 934286 921047 904460 885143 864785 845238 827095 809880 793405 778066 764057
58940 764057 751365 740589 732707 727765 724558 721868 719418 717439 715915 714514 712817 710481 707571 704775
58926 704775 702891 702047 701739 701469 700913 699686 697553 694880 692324 690069 687807 685468 683511 682469 682551 683661
58910 683661 685533 687905 690824 694594 699241 704371 709898 716457 724702 734598 745940 759126 774742
58897G74742J7767J8684J8195J6699J4819J3291J2460J1841J1068J1008J2817
58886I33391J6021J8891K0665K1860K2407K1301J8557J5627J3175J0159N933J543
58874A119530k067n500r405j2997j5390j6988j8338j8893j8311j7676j7845j7781
58862I48339j6170j3738j2178j1592j0821r754r430j0107j0897j1344j1837j2399
58850H08072j2370j1470j0142q700p073n527m726m902n624o426p181p800q137
58837G07994q106p721p098o622o678o998o895o302n870n748n209l978k893k478
58823F25398j907l40J557K516K470K338K546K812K995L234L441L408L212K920
58809F56600K314J375N46P0l70q63r30n27m57j126j789j886k115l197m466m810
$$ plain form
58897 774742 792509 811193 829388 846087 860906 874197 886657 898498 909566 920574 933391
58886 933391 949412 968303 988968 1010828 1033235 1054536 1073093 1088720 1101895 1112054 1117987 1119530
58874 1119530 1117463 1111963 1102558 1089561 1074171 1057183 1038845 1019952 1001641 983965 966120 948339
58862 948339 932169 918431 906253 894661 883840 874086 864656 854549 843652 832308 820471 808072
58850 808072 795702 784232 774090 765390 758317 752790 748064 743162 737538 731112 723931 716131 707994
58837 707994 699888 692167 685069 678447 671769 664771 657876 651574 645704 639956 634747 630769 627876 625398
58823 625398 623491 623151 624708 627224 629694 632032 634578 637390 640385 643619 647060 650468 653680 656600
58809 656600 658914 660289 660835 660905 660535 659672 658742 658215 657758 656632 654843 652957 650842 647645 643179 638369
58793F38369m414m321m810n235n173m731m056l247k420j295O56L144M911N349
58779F12727N388N976O683O704O281O003N513M160K254N44r44k546m019n017n773
58764F43934o395o213m953l707l634m349m725m474l846k671r75L22O54R42K093
58749F02003L235K985J723R32R84J207J603K726M214N143N572O211O899O994O835
58734F59266P192P604P048N985N916O924P481O795N691M996M602M391M592M860
58720G43343M345L084K123K034K410K930L849N150O304O965P092O436M875L086
58706H04026J855Q81p07k885m923o743q914j1455j3898j6284j8794k0708k1061
58693F80390k0178j9176j8104j6075j3152j0544q907p824p013o646o390n621m739
$$ plain form
58793 638369 633955 629634 624824 619589 614416 609685 605629 602382 599962 598667 599323 602467 607378 612727
58779 612727 618115 624091 630774 637478 643759 649762 655275 659435 661689 662233 661289 658743 654724 649707 643934
58764 643934 637539 631326 626373 622666 619032 614683 609958 605484 601638 598967 597992 598314 598968 599910 602003
58749 602003 605238 608223 609946 610878 611862 613069 614672 617398 621612 626755 632327 638538 645437 652431 659266
58734 659266 666458 674062 681110 687095 693011 699935 707416 714211 719902 724898 729500 733891 738483 743343
58720 743343 747688 750772 752895 754929 757339 760269 764118 769268 775572 782537 789629 796065 800940 804026
58706 804026 805881 806762 806055 803170 798247 791504 782590 771135 757237 740953 722159 701451 680390
58693 680390 660212 641036 622932 606857 593705 583161 574254 566430 559417 552771 546381 540760 536021
58680E36021m819n757o118n199l898l184k892k463j802r79P2J179K014K706L731
58665E08612N226P042R170J1356J2772J2909J2277J1244R022N097Q98j654k705
58652F01266l808n247n949n835o102p009p396o751n952n573n095m283l738l594
58638E24934l099j968q57j25O21J482K057K487L368M377M350L137J985J733J771
58623E46253J218L4j285k189k159j298o79j023j335j45K226M199N424O971R057
58608E65269J0478J0408R234P397N077L065K290K272J648L17n54o90j021j774
58594F13416k065j684j445j573j543j559k237k609p76L022O261P688Q803J0893
58580F34592J2829J3030J1903J0938J0668J0602J0156Q904O958N419N376O321
$$ plain form
58680 536021 531202 525445 519327 514128 510230 507046 504154 501691 499889 498910 498982 500161 502175 504881 508612
58665 508612 513838 520880 530050 541406 554178 567087 579364 590608 599630 604727 605625 603971 601266
58652 601266 597458 592211 586262 580427 574325 567316 559920 553169 547217 541644 536549 532266 528528 524934
58638 524934 521835 519867 519010 518885 519506 520988 523045 525532 528900 533277 537627 540764 542749 544482 546253
58623 546253 547471 547505 546220 544031 541872 540574 539895 538872 537537 537392 539618 543817 549241 556212 565269
58608 565269 575747 586155 595389 602786 607863 610928 613218 615490 617138 617455 616901 616211 615190 613416
58594 613416 611351 609667 608222 606649 605106 603547 601310 598701 597925 600947 607208 614896 623699 634592
58580 634592 647421 660451 672354 683292 693960 704562 714718 723622 730580 735999 741375 747696
58568G47696O947P428R156J2218J5210J7750K0965K4924K7949K9194K9816L0613
58556I79866L0531K8532K5073K0797J5496R352L534j348n763r525j1426j1266
58544A073853j0480r868q710o995o488q450j1988j5685j9195k2352k4553k5851
58532I03238k6973k7407k5529k1433j7545j5375j3821j1676r624q367p054n040
58520G13394l301k568j920o73J38l19j097j258j504k442l028k314j209r36j214
58505F89749j333j528j928j805j056q29j427j377O1J382J247N42N37P82M91K01
58489F83709M79O56M85J191L326N264N636N525O631Q898J1555J4729J8301K0916
58475G87301K1822K2055K2238K1134J7965J4074J0467N861o93p288j1539j3676
$$ plain form
58568 747696 754643 762071 771227 783445 798655 816405 837370 862294 890243 919437 949253 979866
58556 979866 1010397 1038929 1064002 1084799 1100295 1109647 1113181 1111833 1106070 1096545 1085119 1073853
58544 1073853 1063373 1053505 1044795 1037800 1031312 1022862 1010874 995189 975994 953642 929089 903238
58532 903238 876265 848858 823329 801896 784351 768976 755155 743479 733855 725488 718434 713394
58520 713394 710093 707525 705605 704932 705070 704751 703654 702396 700892 698450 695422 693108 691899 690963 689749
58505 689749 688416 686888 684960 683155 682099 681270 679843 678466 678527 679909 681156 681698 682235 683017 683508 683709
58489 683709 684188 684844 685329 686520 689846 695110 700746 706271 712902 721800 733355 748084 766385 787301
58475 787301 809123 831178 853416 874550 892515 906589 917056 922917 922224 914936 903397 889721
58463H89721j5002j5159j3341j0627q524o594l792p98J262L064N768Q702J0573
58450H45253J1730J3066J3899J3019J0613P228K295m207j0190j3737j5532j6941
58438H56496j7247j5184j1687q601o025l278j232j003j496q10Q76K205L351N500
58424H01865Q435J0968J2952J4828J6048J5836J4573J2620R074L573k002n631
58412I13139p695r543j1024j1423j1289j1319j0843r473q597r180r816r016p598
58399G86323o717n553l319j439j116p67J302L699M324M001M675N773N494M129
58385H00809L060K051M60n20J99J129O45R8J331L123L406L210M696P000P715P053
58369H45465O985P506P367P139Q103R346R397R330J0914J3213J4314J4810J6053
$$ plain form
58463 889721 874719 859560 846219 835592 827068 820474 816682 815884 817146 820210 825978 834680 845253
58450 845253 856983 870049 883948 896967 907580 914808 917103 912896 902706 888969 873437 856496
58438 856496 839249 824065 812378 803777 797752 794474 793242 792239 790743 789933 790809 793014 796365 801865
58424 801865 810300 821268 834220 849048 865096 880932 895505 908125 917199 920772 918770 913139
58412 913139 905444 895901 884877 873454 862165 850846 840003 830530 821933 812753 802937 793921 786323
58399 786323 779606 774053 770734 769295 768179 767412 768714 772413 776737 780738 785413 791186 796680 800809
58385 800809 803869 805920 806380 805860 806059 807188 807833 807931 809262 812385 815791 819001 823697 830697 838412 845465
58369 845465 852450 859956 867323 874462 882565 891911 901308 910638 921552 934765 949079 963889 979942
58356I79942J6819J5408J3195J2288J1506Q643M910K906K016P6k052k043n29M44
58342A063529J655M756P871Q049O597P042R220J0421J0945J3150J6220J7293J6845
58329A193593J7628J9153J8596J6310J5061J4557J2172Q421O206N249K907j06
58317A329747n23J417K329J839K658M795N482M762N558Q076R681J0228J2045J4801
58303A412895J5830J5396J6112J7560J7162J5802J6662J8959J8993J6988J6605
58292A598964J8067J8247J7195J7915J9922J9869J8473J9795K3651K5809K5765
58281A823672K7109K9977L0660K9115K9405L2009L3115L2171L2765L5331L6442
58270B171771L5999L7683M1634M4186M5306M8617N3751N6581N7267O0001O4662
$$ plain form
58356 979942 996761 1012169 1025364 1037652 1049158 1057801 1062711 1065617 1067633 1067709 1065657 1063614 1063085 1063529
58342 1063529 1065184 1069940 1077811 1085860 1092457 1099499 1108719 1119140 1130085 1143235 1159455 1176748 1193593
58329 1193593 1211221 1230374 1248970 1265280 1280341 1294898 1307070 1315491 1321697 1326946 1329853 1329747
58317 1329747 1329224 1330641 1332970 1334809 1337467 1342262 1347744 1352506 1358064 1366140 1375821 1386049 1398094 1412895
58303 1412895 1428725 1444121 1460233 1477793 1494955 1510757 1527419 1546378 1565371 1582359 1598964
58292 1598964 1617031 1635278 1652473 1670388 1690310 1710179 1728652 1748447 1772098 1797907 1823672
58281 1823672 1850781 1880758 1911418 1940533 1969938 2001947 2035062 2067233 2099998 2135329 2171771
58270 2171771 2207770 2245453 2287087 2331273 2376579 2425196 2478947 2535528 2592795 2652796 2717458
58259B717458O7129O7764P0721P4920P5189P2321P2126P4428P3496O9734O9888
58248C505174P4785P8210P9014Q2824R0346R5778R8578J04796J14858J22236J26183
58237D572782J33309J44522J53260J58753J67749J81007J91849K00076K12911
58228F116218K30154K43812K54500K71884K96412L17945L35316L58972L90882
58219H816095M21326M49435M86475N34149N81066O25961O82016P52672Q26928
58210A4176123R04593J000823J119010J246556J385056J555494J765712K004957
58202B5158324K279850K620929L043788L543169M138342M882717N817013O963405
58194E8447537Q382781J0182942J2453564J5258607J8705647K2916234K7848597
$$ plain form
58259 2717458 2784587 2852351 2923072 2997992 3073181 3145502 3217628 3292056 3365552 3435286 3505174
58248 3505174 3579959 3658169 3737183 3820007 3910353 4006131 4104709 4209505 4324363 4446599 4572782
58237 4572782 4706091 4850613 5003873 5162626 5330375 5511382 5703231 5903307 6116218
58228 6116218 6346372 6590184 6844684 7116568 7412980 7730925 8066241 8425213 8816095
58219 8816095 9237421 9686856 10173331 10707480 11288546 11914507 12596523 13349195 14176123
58210 14176123 15080716 16081539 17200549 18447105 19832161 21387655 23153367 25158324
58202 25158324 27438174 30059103 33102891 36646060 40784402 45667119 51484132 58447537
58194 58447537 66830318 77013260 89466824 104725431 123431078 146347312 174195909
58187A74195909L3161986L8158994M1590617M1474618L5658999K3374457O567206
58180C94182786j0609487k4074491l1889508l4471312l3375534l0209875k6341104
58173B03211475k2855036k0317074j8625040j7287938j5887306j4289736j2564427
58166H1384918j0842274r240597p825353o603956n560667m687582l972358l383502
58158B9268629k890658k482524k150014j871686j630790j428078j264015j125884
58150A4424980j004040r02891q24021p55695o89884o32784n87825n44860m96904
58141G986076m51722m16007l83058l46614l12607k86703k63544k38575k17957
58132E069289k06759j99100j89325j81510j78857j74921j64553j53043j45663
$$ plain form
58187 174195909 207357895 245516889 287107506 328582124 364241123 387615580 394182786
58180 394182786 383573299 359498808 327609300 293137988 259762454 229552579 203211475
58173 203211475 180356439 160039365 141414325 124126387 108239081 93949345 81384918
58166 81384918 70542644 61302047 53476694 46872738 41312071 36624489 32652131 29268629
58158 29268629 26377971 23895447 21745433 19873747 18242957 16814879 15550864 14424980
58150 14424980 13420940 12518049 11694028 10938333 10248449 9615665 9027840 8482980 7986076
58141 7986076 7534354 7118347 6735289 6388675 6076068 5789365 5525821 5287246 5069289
58132 5069289 4862530 4663430 4474105 4292595 4113738 3938817 3774264 3621221 3475558
58123C475558j38161j26292j14889j08837j04164r6450q9384q6774q4493p8365
58113B447749p2180p0075o8527o3398n7726n5306n3519m9440m6215m6587m6810
58102A817966m3591m0454m0820m1285l8319l5206l5729l7057l5373l2805l2419
58091A404908l1949k8770k5696k5693k6012k3498k0622k0446k0659j8453j6371
58080A146739j7450j9291j8652j7453j8503j9794j8579j6895j7478j8363j6948
58069I47333j5357j6306j7621j6199j3681j2936j2667j0641q656r022r703q084
58057G96460o208p128r294r692r322j0533j1927j1072r439r672j0500r268p047
58044F75358o456o699n469l659l698n072n580n267n386n440m704m529n881o929
$$ plain form
58123 3475558 3337397 3211105 3096216 2987379 2883215 2786765 2697381 2610607 2526114 2447749
58113 2447749 2375569 2305494 2236967 2173569 2115843 2060537 2007018 1957578 1911363 1864776 1817966
58102 1817966 1774375 1733921 1693101 1651816 1613497 1578291 1542562 1505505 1470132 1437327 1404908
58091 1404908 1372959 1344189 1318493 1292800 1266788 1243290 1222668 1202222 1181563 1163110 1146739
58080 1146739 1129289 1109998 1091346 1073893 1055390 1035596 1017017 1000122 982644 964281 947333
58069 947333 931976 915670 898049 881850 868169 855233 842566 831925 823269 814247 804544 796460
58057 796460 790252 783124 773830 764138 754816 744283 732356 721284 711845 702173 691673 682405 675358
58044 675358 668902 662203 656734 653075 649377 644305 638725 633458 628072 622632 617928 613399 607518 600589
58030F00589o278n828p237q586p961p189q338r626q839p594q111q711o923m324
58016D95044l827m601m157l116l493m313l397j649j404k228k261j896k358k518
58002D53826j012N06m5j285q26M63M54j11N39J352N14o50j6J036o6k275k777j917
57984D47710j960k505j673m86j429l673m214k981k551l378l509k547j987j969
57970D12848j407p88j362k127j149P49J139J24j92L08o4j095q49O72J425P46j66
57953D08812r37k187l374l337k622k595k801j851j73P89J294K407L463L300K962
57938D03150M113N857O291O129P438R767J1006J1201J1969J2889J2091R855Q080
57925E19836O651L873J10k502l743n276p185p978p818q400r645r753q504p359
$$ plain form
58030 600589 594311 588483 581246 572660 564699 557510 549172 539546 530707 523113 515002 506291 499368 495044
58016 495044 491217 486616 482459 479343 475850 471537 468140 466491 465087 462859 460598 458702 456344 453826
58002 453826 452814 453320 453275 451990 451164 451627 452081 451970 452509 453861 454375 453725 453709 454745 454679 452404 449627 447710
57984 447710 445750 443245 441572 441086 439657 435984 431770 428789 426238 422860 419351 416804 414817 412848
57970 412848 411441 410653 409291 407164 406015 406764 407903 408027 407835 408143 408079 406984 406135 406807 408232 408978 408812
57953 408812 407875 405688 402314 398977 396355 393760 390959 389108 388935 389724 391018 393425 396888 400188 403150
57938 403150 407263 413120 419411 425540 432978 442745 453751 464952 476921 489810 501901 511756 519836
57925 519836 526487 530360 530470 527968 524225 518949 511764 503786 495968 487568 477923 468170 459666 452307
57911D52307o450m634k354j258j107k11J244J518P13N55R29M7j952k991k764l064
57895D30528m272m765m120l686l681k918j680j630k512k179k68J256J556J803
57881D03432K241J670L28K2P87N74j080k253k147k242l179l645l242l308l962
57866C83996l446j446l7j36L5J627L201L506L531M298N101N387O105P640Q577
57851D27939P912O583N581M379K431L60j289k853m208m451l630l055l349l944
57837D28406m797o500q343q598p304o346o311n715m058k953l229l421k294n56
57823C57981Q89K202L110K560R50M08J695K996K915K372K361K171J255O79J174
57808C85718J549N18j580l982o617q940r564q265o640n698m654k997j746j518
$$ plain form
57911 452307 445857 441223 438869 437611 436504 436293 437537 439055 439768 440323 441252 441299 439347 436356 433592 430528
57895 430528 426256 421491 417371 413685 410004 407086 405406 403776 401264 399085 398817 400073 401629 403432
57881 403432 405673 407343 407671 407693 408480 409054 407974 405721 403574 401332 398153 394508 391266 387958 383996
57866 383996 380550 379104 379067 378931 378966 380593 383794 387300 390831 395129 400230 405617 411722 419362 427939
57851 427939 435851 442434 448015 452394 454825 455185 453896 451043 446835 442384 438754 435699 432350 428406
57837 428406 423609 417109 408766 400168 392864 386518 380207 374492 370434 367481 364252 360831 358537 357981
57823 357981 358870 361072 364182 366742 367692 368100 369795 372791 375706 378078 380439 382610 383865 384544 385718
57808 385718 387267 387785 386205 382223 375606 366666 357102 348837 342197 336499 331845 328848 327102 325584
57794C25584j374o91k67m12l3J233K092K006K340L709M511L833L506N279P792
57779C59108Q627P797P062P003O864O462O327O461O359N784M624K653K18j840
57765D33509l452n387p549q736q627q370q547q320p398o837o939o384m586k968
57751C39409k593k488j716j086j223r36P50K568K976K546K618K970K698K173K226
57736C50892K479K181J726J809K081K041K172K799K985K003P63L19J76n16j336
57721C72574j568j606j896j767r37p75k328m257m659l837l437l676l512k857k612
57706C32850k945l173l185l473l947l934l122j594N14K619L663L383K842K872
57692C23370K954K428J575N50j358m146o110n899m393l206k505j706j056p66K08
$$ plain form
57794 325584 324210 323519 323252 322840 322807 324040 326132 328138 330478 334187 338698 342531 346037 351316 359108
57779 359108 367735 375532 382594 389597 396461 402923 409250 415711 422070 427854 432478 435131 435349 433509
57765 433509 430057 424670 417121 408385 399758 391388 382841 374521 367123 360286 353347 346963 342377 339409
57751 339409 336816 334328 332612 331526 330303 329367 330117 332685 335661 338207 340825 343795 346493 348666 350892
57736 350892 353371 355552 357278 359087 361168 363209 365381 368180 371165 373168 373931 374250 374426 373910 372574
57721 372574 371006 369400 367504 365737 364800 364025 361697 357440 352781 348944 345507 341831 338319 335462 332850
57706 332850 329905 326732 323547 320074 316127 312193 309071 307477 307991 310610 314273 317656 320498 323370
57692 323370 326324 328752 330327 330877 329519 325373 319263 313364 308971 305765 303260 301554 300498 299732 299940
57677B99940K732N782P963R883J3179J7921K2885K7877L3928M1546N0285N9693
57665E93614O8886P5043P3733O1370L7575O237k5176m8993o1937o6212o5589o1652
57653E86899n4718m6349l8696l2251k6276k0797j6485j3184j0336q292p588p356
57641C04571o226m355l023k534k096j412q38k96N40J187Q91K2l54p0J24q8l26
57624B85717l75k97r6l2p62k253l256k845j729j055q15n08m59j082j690j409o54
57607B66400m11p45j154j632k208k316j835j824k923l979l617k210r75j64L40
57592B40747o9j544k607k051r47r46j662j733j384j646k010j284p4K8p16p26l3
57575B21343j82j341k046j871j987k760l027k192j066l06L21P12K44r15j822k230
$$ plain form
57677 299940 302672 308454 316417 326300 339479 357400 380285 408162 442090 483636 533921 593614
57665 593614 662500 737543 811276 872646 910221 916458 891282 842289 780352 714140 648551 586899
57653 586899 532181 485832 447136 414885 388609 367812 351327 338143 327807 319515 311927 304571
57641 304571 298345 293990 290967 288433 286337 284925 284087 283791 284331 285518 286409 286431 286077 286007 286131 286043 285717
57624 285717 285342 285045 284949 284917 284155 281902 278646 275801 274072 273017 272202 271694 271235 270153 268463 267054 266400
57607 266400 265989 265244 264090 262458 260250 257934 256099 254275 251352 247373 243756 241546 240571 240407 240747
57592 240747 240678 239134 236527 234476 233529 232583 230921 229188 227804 226158 224148 222864 222790 222818 222102 221376 221343
57575 221343 221161 219820 217774 215903 213916 211156 208129 205937 204871 204565 204886 205598 205842 204927 203105 200875
57559B00875k590k679j808l85M41N79Q15J000K63j001j254o2J501K696L670M164
57543B06225L573K394J834J892J595J118J698L302M416M325L684K614M56k182
57529B36944l312k310r04o37j059j183j036r04n28J52O24Q03J164J569J241K85
57513B30909k60j26q3k35K41J301J658Q62J11L60J150J844K514K973K518J361
57497B47098Q06J289J628R32q3m38k10J56O18J010Q92M08J32j92j327k741k812
57480B47166j336k4Q5n2N37J281J462J469J619J280L22q5P23J595J311L59j47
57463B57565j46j7N35J711K646K492J699J205J123J131J304J649J635J111R26
57448B76569J703K732K977K508K085K035K212K474K552K095J314R39J123J277
$$ plain form
57559 200875 198285 195606 193798 193413 193854 194433 195248 196248 196511 195510 194256 194194 195695 198391 202061 206225
57543 206225 209798 212192 214026 215918 217513 218631 220329 223631 228047 232372 236056 238670 239126 236944
57529 236944 233632 231322 230418 229781 228722 227539 226503 225599 225071 225223 225847 226650 227814 229383 230624 230909
57513 230909 230649 230523 230440 230205 230446 231747 233405 234267 234378 234738 235888 237732 240246 243219 245737 247098
57497 247098 247904 249193 250821 251753 251670 251232 251022 251178 251796 252806 253698 254106 254238 254046 252719 249978 247166
57480 247166 245830 245806 245891 245839 246376 247657 249119 250588 252207 253487 253809 253724 254447 256042 257353 257712 257565
57463 257565 257419 257402 257937 259648 262294 264786 266485 267690 268813 269944 271248 272897 274532 275643 276569
57448 276569 278272 281004 283981 286489 288574 290609 292821 295295 297847 299942 301256 302195 303318 304595
57434C04595J257J584K180K217J693J756K747L359K679J699J661K192K274K041
57420C33934K216K628K613K207J853J448P57K38M81J281K065K777L539M064M098
57405C66199L938L850L531K756J906J320Q68O35J138K283L022K796K419K714L196
57390D02571K998K313J962K237K943L989N095N585N252M839M953N167M851M251
57376D59006L987M091M254M385M349L810K923K466K695K896K623K504L058L648
57362E06695L505L002K988L502M026M472N077N730O167O450O700O753O515O209
57348E77791N947N588N230N187N318N172M928N149N560N269M438M379N501O622
57334F52079O819O638O709O608O002N598N965O508O534O295O172N903N443N424
$$ plain form
57434 304595 305852 307436 309616 311833 313526 315282 318029 321388 324067 325766 327427 329619 331893 333934
57420 333934 336150 338778 341391 343598 345451 346899 347656 347894 348375 349656 351721 354498 358037 362101 366199
57405 366199 370137 373987 377518 380274 382180 383500 384368 385003 386141 388424 391446 394242 396661 399375 402571
57390 402571 405569 407882 409844 412081 415024 419013 424108 429693 434945 439784 444737 449904 454755 459006
57376 459006 462993 467084 471338 475723 480072 483882 486805 489271 491966 494862 497485 499989 503047 506695
57362 506695 510200 513202 516190 519692 523718 528190 533267 538997 545164 551614 558314 565067 571582 577791
57348 577791 583738 589326 594556 599743 605061 610233 615161 620310 625870 631139 635577 639956 645457 652079
57334 652079 658898 665536 672245 678853 684855 690453 696418 702926 709460 715755 721927 727830 733273 738697
57320G38697O021O506O644P184Q269Q828Q442Q229Q840R216Q522P720P825Q166
57306H49109P909P761Q538R395R241Q654Q644Q751Q271Q103R308J0915J1311J0949
57292I76859J1414J2469J2362J0767R250Q851R113R490R962J0227R854R303R443
57279A109364J0118J0492J0542J0922J1620J2060J2276J2725J3266J3560J4035
57268A240980J5121J6152J6350J6331J7070J7947J7590J6235J5483J5922J6672
57257A421853J7141J7567J7945J7920J7776J8049J8389J8204J8070J8903K0006
57246A621823J9827J8479J7706J8276J9191J9667K0103K0797K1323K1531K1776
57235A840499K1857K1165K0161K0200K1582K3127K3934K4254K4326K3824K2812
$$ plain form
57320 738697 744718 751224 757868 765052 773321 782149 790591 798820 807660 816876 825398 833118 840943 849109
57306 849109 857018 864779 873317 882712 891953 900607 909251 918002 926273 934376 943684 954599 965910 976859
57292 976859 988273 1000742 1013104 1023871 1033121 1041972 1051085 1060575 1070537 1080764 1090618 1099921 1109364
57279 1109364 1119482 1129974 1140516 1151438 1163058 1175118 1187394 1200119 1213385 1226945 1240980
57268 1240980 1256101 1272253 1288603 1304934 1322004 1339951 1357541 1373776 1389259 1405181 1421853
57257 1421853 1438994 1456561 1474506 1492426 1510202 1528251 1546640 1564844 1582914 1601817 1621823
57246 1621823 1641650 1660129 1677835 1696111 1715302 1734969 1755072 1775869 1797192 1818723 1840499
57235 1840499 1862356 1883521 1903682 1923882 1945464 1968591 1992525 2016779 2041105 2064929 2087741
57224B087741K1961K1439K0789K0146K0318K1329K2261K2842K3871K5648K7233
57213B335578K7907K8195K8881K9920L0851L1447L1575L1134L0420K9833K9203
57202B664944K8256K7566K7974K9079K9604K9352K9458L0465L1443L1506L1028
57191B990675L0752L0617L0122K9052K7492K5731K4458K4320K5098K5863K6031
57180C290211K5717K5157K4579K4442K5024K5890K6542K7296K8552K9703K9839
57169C582952K9201K8578K7808K6306K4771K4565K5407K5460K3951K2006K0653
57158C861658J9588J8446J7632J7204J6346J4699J3114J2371J2127J1682J0938
57147D025805J0143R636J0054J1884J4465J6404J7154J7320J7479J7798J8771
$$ plain form
57224 2087741 2109702 2131141 2151930 2172076 2192394 2213723 2235984 2258826 2282697 2308345 2335578
57213 2335578 2363485 2391680 2420561 2450481 2481332 2512779 2544354 2575488 2605908 2635741 2664944
57202 2664944 2693200 2720766 2748740 2777819 2807423 2836775 2866233 2896698 2928141 2959647 2990675
57191 2990675 3021427 3052044 3082166 3111218 3138710 3164441 3188899 3213219 3238317 3264180 3290211
57180 3290211 3315928 3341085 3365664 3390106 3415130 3441020 3467562 3494858 3523410 3553113 3582952
57169 3582952 3612153 3640731 3668539 3694845 3719616 3744181 3769588 3795048 3818999 3841005 3861658
57158 3861658 3881246 3899692 3917324 3934528 3950874 3965573 3978687 3991058 4003185 4014867 4025805
57147 4025805 4035948 4045584 4055638 4067522 4081987 4098391 4115545 4132865 4150344 4168142 4186913
57136D186913K0930K3708K5921K7531K9517L1881L3343L3351L2801L2297L1189
57125D509382K9072K6742K5092K4248K4425K6353L0312L5894M3195N2952O4925
57114D892592P7513Q9549J01317J13394J25918J39562J55823J75760J99784K29143
57104F300355K66088L12031L67212M32852N12156O08769P26174Q69628J046738
57095A1442003J265005J530233J847760K222535K655917L143526L676422M241190
57087C2024591M816808N374051N881011O308820O633178O836041O907366O834234
57079H1616100O574885O046937N162717L896510K323050N88554j155231k792406
57071A02261116m238830n425241o300619o849052p093489p080020o859950o483134
$$ plain form
57136 4186913 4207843 4231551 4257472 4285003 4314520 4346401 4379744 4413095 4445896 4478193 4509382
57125 4509382 4538454 4565196 4590288 4614536 4638961 4665314 4695626 4731520 4774715 4827667 4892592
57114 4892592 4970105 5059654 5160971 5274365 5400283 5539845 5695668 5871428 6071212 6300355
57104 6300355 6566443 6878474 7245686 7678538 8190694 8799463 9525637 10395265 11442003
57095 11442003 12707008 14237241 16085001 18307536 20963453 24106979 27783401 32024591
57087 32024591 36841399 42215450 48096461 54405281 61038459 67874500 74781866 81616100
57079 81616100 88190985 94237922 99400639 103297149 105620199 106208753 105053522 102261116
57071 102261116 98022286 92597045 86296426 79447374 72353885 65273865 58413915 51930781
57063E1930781n998026n449605m875558m305342l761535l259984k809279k412158
57055A9059294k068072j774260j525722j316366j140672r93741q70407p65793
57047H604261o76700o01280n37486m82874m35598l94384l57677l24091k93449
57038D500722k66064k41230k17851j96237j77482j61142j45421j29868j15841
57029B849586j03820r2160p9264o5195n0264l3696j4655O726K9927N3367P1645
57018B572197P5421N7110J7510l3585q2897j19979j40585j46578j43013j34364
57008A921237j22965j10202r7595q6115p5666o6087n7784n0764m4263l8023l2937
56997A138836k9574k7137k4673k2309k0514j9137j8021j7398j6843j4947j1107
$$ plain form
57063 51930781 45932755 40483150 35607592 31302250 27540715 24280731 21471452 19059294
57055 19059294 16991222 15216962 13691240 12374874 11234202 10240461 9370054 8604261
57047 8604261 7927561 7326281 6788795 6305921 5870323 5475939 5118262 4794171 4500722
57038 4500722 4234658 3993428 3775577 3579340 3401858 3240716 3095295 2965427 2849586
57029 2849586 2745766 2653606 2574342 2509147 2458883 2425187 2410532 2417258 2447185 2500552 2572197
57018 2572197 2647618 2704728 2722238 2688653 2605756 2485777 2345192 2198614 2055601 1921237
57008 1921237 1798272 1688070 1590475 1504360 1428694 1362607 1304823 1254059 1209796 1171773 1138836
56997 1138836 1109262 1082125 1057452 1035143 1014629 995492 977471 960073 943230 928283 917176
56986I17176o642l048j35L060O326Q269P503L187m557j3838k1652k6365k8697
56973H40587k9612k8689k5692k2139j9640j7769j5190j1976r101o513l387K82
56961F51161M011Q107J3020J7971K1810K4656K6787K6367K0451Q694n541j8128
56949G99366k6930l1647l2655l0919k7905k4638k1180j7331j3376r794o617l390
56937E52984L01M370Q299J1905J5932K1332K7864L3894L7636L7706L2577K1082
56925H05882M455j3082k7031l5558l9458m0091l8329l4833l0293k5464k1277j8350
56913D86571j6170j3675j0907r099q622q262p090n659m530l144j261L8J29K63
56899C98582J641L361M017M179N301P099Q057Q062Q502J0040J2104J4508J7884
$$ plain form
56986 917176 910534 907486 907351 910411 916737 925006 932509 935696 931139 917301 895649 869284 840587
56973 840587 810975 782286 756594 734455 714815 697046 681856 669880 660779 654266 650879 651161
56961 651161 655172 663279 676299 694270 716080 740736 767523 793890 814341 823035 817494 799366
56949 799366 772436 740789 708134 677215 649310 624672 603492 586161 572785 562991 556374 552984
56937 552984 553285 557655 565954 577859 593791 615123 642987 676881 714517 752223 784800 805882
56925 805882 810337 797255 770224 734666 695208 655117 616788 581955 551662 526198 504921 486571
56913 486571 470401 456726 445819 436720 428098 419836 412746 407087 402557 399413 398152 398190 398319 398582
56899 398582 400223 403584 407601 411780 417081 424180 432237 440299 448801 458841 470945 485453 503337
56886E03337K2302K6707K9627K9543K4990J5782L953p613j7259k4435k8366k8444
56874E50124k5552k1463j7086j2427p831l823L8M715J0268J6053K2030K8713L6154
56861E79913M4202N3295O3314P1775P4465O8104N1835K7186j747k8671m7860n7306
56849H98505n8687n4738m7722l9546l1369k3029j4116n309K635J0614K0253L1585
56837F89076M3472N5998P0425Q6724J02768J15699J21896J15818R2102N1017Q17
56826A545812m6570q2108j02607j09558j06702r7860q5680p1832n7898m5277l4288
56815G05432k4195j4242m061O645J8031K9882M2182N5530O9894Q2971R0528Q8171
56803A146768P2816M4185O665l1152o1007p9512q7749q7719q1197p1019o0558
$$ plain form
56886 503337 525639 552346 581973 611516 636506 652288 656241 648628 631369 606934 578568 550124
56874 550124 524572 503109 486023 473596 465765 461942 461980 466695 476963 493016 515046 543759 579913
56861 579913 624115 677410 740724 812499 886964 955068 1006903 1034089 1032342 1003671 955811 898505
56849 898505 839818 785080 737358 697812 666443 643414 629298 623989 626624 637238 657491 689076
56837 689076 732548 788546 858971 945695 1048463 1164162 1286058 1401876 1493978 1544995 1545812
56826 1545812 1499242 1417134 1314527 1204969 1098267 1000407 914727 842895 784997 739720 705432
56815 705432 681237 666995 662934 669579 687610 717492 759674 815204 885098 968069 1058597 1146768
56803 1146768 1219584 1263769 1270434 1239282 1178275 1098763 1011014 923295 842098 771079 710521
56792G10521n1260m2458l3752k5817j8775j1757m536K177Q480J5643K4159L2884
56780F05509M0433M5743M6805M0753K6495O450j4898l3350m6015n1854n2121m9390
56768E64560m5457m0749l5570l0601k5992k1338j6880j3556j1582j0233r186q792
56756B94624q750q017o443n212n054n231m838m027l392l061k857k578j927q76
56742B32361j30l76j223j818k188k814l232k554j130j80J28N84J142R50J20l21
56726B19319l11p36j445j309l87qk97K26J937L231L107K644K874L066K314J161
56710B35386M82J08k88k21O15J474J643J414J301J247J173J260J269O55k64n58
56694B46696k93m46j003q25K39Q63M46m9k6k47j067j555j217q45q00k47Q96J142
$$ plain form
56792 710521 659261 616803 583051 557234 538459 526702 522166 524343 532823 548466 572625 605509
56780 605509 645942 691685 738490 779243 805738 812188 797290 763940 717925 666071 613950 564560
56768 564560 519103 478354 442784 412183 386191 364853 347973 334417 322835 312602 303416 294624
56756 294624 285874 277857 271414 266202 261148 255917 251079 247052 243660 240599 237742 235164 233237 232361
56742 232361 232231 231855 230632 228814 226626 223812 220580 218026 216896 216716 216844 217428 218570 219520 219640 219319
56726 219319 219008 218272 216827 215518 215131 215123 214826 215052 216989 220220 223327 225971 228845 231911 234225 235386
56710 235386 235868 235976 235688 235467 236082 237556 239199 240613 241914 243161 244334 245594 246863 247518 247254 246696
56694 246696 246403 245957 244954 244129 244368 245231 245677 245628 245602 245355 244288 242733 241516 240671 239871 239624 240520 241662
56676B41662k40j822k196j951k143k354j728o68o1J15K37K07J10N91J577J901
56660B33237J152N69J013J534J023J4l98j54L69J325K641L443L359L195L444L451
56644B59217K967K934L688L961K956J857J819K081J529O94N22N05k24j156j397
56629B81953j383j961k762l048l189l817m458m456m269m378m053k758j660j986
56615B37775k883k755j819j541k189k797l047l361l506k783j450n33l34k98m1
56600B08438N05J508K811L562L202K323J692J199N97L71Q24J197Q22L12M98J036
56584B30897J181J033R49O34n5l25L47J160J251J065J253J301N82k53k35L67P79
56567B41931J050J545K001K316L257N172P025P935Q581R874J1374J2198J2198
$$ plain form
56676 241662 241422 239600 237404 235453 233310 230956 229228 228560 228499 228614 228851 229058 229168 229759 231336 233237
56660 233237 234389 234958 235971 237505 238528 238542 238144 237990 238359 239684 242325 245768 249127 252322 255766 259217
56644 259217 262184 265118 268806 272767 275723 277580 279399 281480 283009 283703 284225 284730 284506 283350 281953
56629 281953 280570 278609 275847 272799 269610 265793 261335 256879 252610 248232 244179 241421 239761 237775
56615 237775 234892 232137 230318 228777 226588 223791 220744 217383 213877 211094 209644 209111 208777 208479 208438
56600 208438 208943 210451 213262 216824 220026 222349 224041 225240 225837 226208 227032 228229 229051 229363 229861 230897
56584 230897 232078 233111 234060 234694 234639 234314 234661 235821 237072 238137 239390 240691 241273 241020 240785 241152 241931
56567 241931 242981 244526 246527 248843 252100 257272 264297 272232 280813 290687 302061 314259 326457
56554C26457J1013P550K046k827m723m326l617k992j987j373k159l515l973l773
56540C11801l981m168l264j894j532j970j910j481j850k746k750j789j195j353
56526B79918j326q27o12r41j270j406j461r75L42J392Q81n68j218p07j57j80m23
56509B70462p50j234j357p67l46r93j890j663o10k3jK54N49J56m52l43p9q48k047
56490B58018k008p73Rk26n38o15j077j602r91O31J595J122K17j02N9L47P12Q58
56472B55636M60p1j22N8m1l6N86J197R53L30K31L50O7M2J011J883J204k12l84
56453B63142O82J298R66O41M62k90j179r43K69J123J369J735J922J033k52m10
56437B71568K57J51o05l62Q51J140o3j224j545j960k786k873j841q68n61j44N86
$$ plain form
56554 326457 337470 345020 347066 344239 339516 335190 331573 328581 326594 325221 323062 319547 315574 311801
56540 311801 307820 303652 300388 298494 296962 294992 293082 291601 289751 287005 284255 282466 281271 279918
56526 279918 278592 277765 277153 276212 274942 273536 272075 271100 271442 272834 273715 273147 271929 271222 271065 270885 270462
56509 270462 269712 268478 267121 266354 266008 265015 263125 261462 260852 260829 260828 261082 261631 261787 261335 260992 260913 260065 258018
56490 258018 256010 255237 255246 255020 254482 253867 252790 251188 250197 250828 252423 253545 253762 253660 253719 254066 254778 255636
56472 255636 256096 256025 255903 255961 255920 255884 256470 257667 258620 258950 259181 259531 259598 259640 260651 262534 263738 263526 263142
56453 263142 263824 265122 266088 266729 267191 266901 265722 264779 265048 266171 267540 269275 271197 272230 271978 271568
56437 271568 271825 271976 271371 271009 271860 273000 272937 271713 270168 268208 265422 262549 260708 259840 259279 259135 259721
56420B59721O62n6k28Q35K114K618K543K274J752J217J112J045L03o56q13m25
56404B74018n84j172j109m15l5M6N10R14L59m59j75O79M83m82m93M88R33P72J391
56385B75669K615K746J758J431K046J960Q40K21L82k26j796k478j665r52r70k53
56369B81328J744L374L658L670L996L577K182J369J803K113J572J340J994K339
56355C16059J777J365J438P66p50j226Q8J360J159M78M56M84m6l51N4L57K10M77
56337C24155J256J378O88N56J318J610J041R47J688J945J539K087L821M719L997
56322C52745L483M206M654L874L284L792L980K849J668J381R52r8k93R68J965
56307C89410J764J930L391M525M275M272N797P449P963Q566J0163J0909R059N834
$$ plain form
56420 259721 260383 260327 260099 260934 263048 265666 268209 270483 272235 273452 274564 275609 275912 275256 274443 274018
56404 274018 273434 272262 271153 270738 270703 270749 271259 272173 272532 272073 271898 272577 273060 272578 272085 272573 273506 274278 275669
56385 275669 278284 281030 282788 284219 286265 288225 289065 289286 289668 289442 287646 285168 283503 282551 281581 281328
56369 281328 283072 286446 290104 293774 297770 301347 303529 304898 306701 308814 310386 311726 313720 316059
56355 316059 317836 319201 320639 321405 320655 319429 319517 320877 322036 322514 322970 323454 323408 323057 323111 323468 323678 324155
56337 324155 325411 326789 327477 328033 329351 330961 332002 332949 334637 336582 338121 340208 344029 348748 352745
56322 352745 356228 360434 365088 368962 372246 376038 380018 382867 384535 385916 386868 386770 386477 387445 389410
56307 389410 391174 393104 396495 401020 405295 409567 415364 422813 430776 439342 449505 460414 469473 475307
56293D75307L176R55j296k352j399PL97P14K025L261L356L425M542N599N521N413
56277E08651O275O841O017N217N943P254P805Q337R847J1453J2283J3325J5206
56264F24454J6443J6145J6136J8097K0876K2900K4847K7643L0265L2092L4949
56253H84847M0236M6352N1537N6816O3489P0261P5809Q1673Q9462R7404J02967
56242A660853J06800J10725J13664J13017J08624J02159R3843Q2667O8755N2913
56232B614020L5067J5504l738k0899l6404n0856o3064p2142p9398q5885r0344
56221B161861r1799r1838r1853r0551q6759q2130p8376p4359o8892o3717o0584
56210A281003n7878n3457m8454m4916m2094l8453l5095l3554l2370k9382k5541
$$ plain form
56293 475307 478483 479438 478142 475790 474391 474398 474795 475509 477534 480795 484151 487576 492118 497717 503238 508651
56277 508651 514926 521767 527784 533001 538944 546198 554003 562340 572187 583640 595923 609248 624454
56264 624454 640897 657042 673178 691275 712151 735051 759898 787541 817806 849898 884847
56253 884847 925083 971435 1022972 1079788 1143277 1213538 1289347 1371020 1460482 1557886 1660853
56242 1660853 1767653 1878378 1992042 2105059 2213683 2315842 2409685 2492352 2561107 2614020
56232 2614020 2649087 2664591 2660853 2639954 2603550 2552694 2489630 2417488 2338090 2252205 2161861
56221 2161861 2070062 1978224 1886371 1795820 1709061 1626931 1548555 1474196 1405304 1341587 1281003
56210 1281003 1223125 1169668 1121214 1076298 1034204 995751 960656 927102 894732 865350 839809
56199H39809k2932k0983j8047j4839j2963j1804j0139q829q782q477o683n325
56187F90006o176p183n756l239k314k281r66Q26Q88k78p94r39j637j518P05L061
56171F62405L348L041M289N518M397K659L416N781O802O756P791R310R425R226
56157G44164J0913J3341J3991J3633J4544J6004J6201J6590J9562K3670K6123
56146I28736K8096L2578L8933M4741N1060O0480P1752Q1869R1845J04811J19767
56135A654668J32627J41881J47734J47440J37728J20915J03003Q6822P2353O1842
56125B807013N7973N7811N4859M6751L5505K1676M595j2496k4278l0431l5419
56114B983559m1953n0271o2501q1062j02945j21729j34942j43841j47164j41880
$$ plain form
56199 839809 816877 795894 777847 763008 750045 738241 728102 719273 710491 702014 695331 690006
56187 690006 683830 676647 670891 667652 665338 663057 662091 662917 663805 663527 662733 661794 660157 658639 659344 662405
56171 662405 665753 668794 673083 678601 682998 685657 689073 694854 701656 708412 716203 725513 734938 744164
56157 744164 755077 768418 782409 796042 810586 826590 842791 859381 878943 902613 928736
56146 928736 956832 989410 1028343 1073084 1124144 1184624 1256376 1338245 1430090 1534901 1654668
56135 1654668 1787295 1929176 2076910 2224350 2362078 2482993 2585996 2672818 2745171 2807013
56125 2807013 2864986 2922797 2977656 3024407 3059912 3081588 3086183 3073687 3049409 3018978 2983559
56114 2983559 2941606 2891335 2828834 2747772 2644827 2523098 2388156 2244315 2097151 1955271
56104A955271j29676j16027j02835q8156p2786o0422n1392m2571l3684k7394k3343
56093A206985j8369j2538q823p002m163q06o3j181l55K373L580L268M446O568
56079A173920O421M970O087Q918Q983O576O463R308J1015J0638J1357J3454J3933
56066A292043J3228J4756J7782J8291J6769J7390J9920K0380J9192K0231K2427
56055A492409K1168J7569J7153J9584J9308J6212J5668J7955J7909J5545J6449
56044A686929K0804K2616K1003K1565K5305K6988K5932K7449L1855L3134L0538
56033A974118L0457L4646L7599L7725L9893M4706M6664M5318M6733N1583N3441
56022B442883N1241N1451N5578N7696N6831N9108O5048O7699O6139O7621P3612
$$ plain form
56104 1955271 1825595 1709568 1606733 1518577 1445791 1385369 1333977 1291406 1257722 1230328 1206985
56093 1206985 1188616 1176078 1167255 1160253 1156090 1155284 1155221 1154040 1153685 1156058 1159638 1162906 1167352 1173920
56079 1173920 1180341 1185311 1191398 1200316 1209299 1215875 1222338 1231646 1242661 1253299 1264656 1278110 1292043
56066 1292043 1305271 1320027 1337809 1356100 1372869 1390259 1410179 1430559 1449751 1469982 1492409
56055 1492409 1513577 1531146 1548299 1567883 1587191 1603403 1619071 1637026 1654935 1670480 1686929
56044 1686929 1707733 1730349 1751352 1772917 1798222 1825210 1851142 1878591 1910446 1943580 1974118
56033 1974118 2004575 2039221 2076820 2114545 2154438 2199144 2245808 2291126 2337859 2389442 2442883
56022 2442883 2494124 2545575 2601153 2658849 2715680 2774788 2839836 2907535 2973674 3041295 3114907
56011C114907P7228P7246Q0587Q8049R2170R2259R6298J04941J09512J09287J13996
56000D156480J25360J33472J35824J41928J54255J63238J66587J74354J88938
55991E540436J99773K04332K14021K32360K48322K58582K74589K99750L22316
55982G794481L39207L63219L97767M29388M54885M89609N38427N86104O27968
55973A2021055O81082P52572Q27594R02349R96428J117491J248239J384926J552172
55964B1483908J762240J999766K266728K599411L019242L515127M100487M836931
55956D5583840N774804O930200Q354253J0160246J2447211J5276341J8762328
55949A23289223K3070859K8216726L3889471L9417046M3597497M4417592L9439921
$$ plain form
56011 3114907 3192135 3269381 3349968 3438017 3530187 3622446 3718744 3823685 3933197 4042484 4156480
56000 4156480 4281840 4415312 4551136 4693064 4847319 5010557 5177144 5351498 5540436
55991 5540436 5740209 5944541 6158562 6390922 6639244 6897826 7172415 7472165 7794481
55982 7794481 8133688 8496907 8894674 9324062 9778947 10268556 10806983 11393087 12021055
55973 12021055 12702137 13454709 14282303 15184652 16181080 17298571 18546810 19931736 21483908
55964 21483908 23246148 25245914 27512642 30112053 33131295 36646422 40746909 45583840
55956 45583840 51358644 58288844 66643097 76803343 89250554 104526895 123289223
55949 123289223 146360082 174576808 208466279 247883325 291480822 335898414 375338335
55942C75338335K7365163R690258r419006k5364871l5542653l9951764m0063005
55935B62052457l7505607l3551282k9116401k4777742k0798477j7277693j4276768
55928H4748487j1801439r773054q100012o739292n656451m783673m059620l466642
55920C0368304k993969k603799k263793j975949j744459j547546j366126j208997
55912A4663666j085221r79499q77048p86381p16400o55342n92254n36287m95898
55903G939336m60425m19910l82892l57647l35264l07305k81738k65755k50593
55894D877807k28531k07986j97075j88158j73053j58184j50735j44394j32490
55885C297201j21230j16683j11921j00072q7452q1161p5783o4755n3465m9002
$$ plain form
55942 375338335 402703498 412393756 402974750 377609879 342067226 302115462 262052457
55935 262052457 224546850 190995568 161879167 137101425 116302948 99025255 84748487
55928 84748487 72947048 63173994 55073982 48334690 42678239 37894566 33834946 30368304
55920 30368304 27374335 24770536 22506743 20530794 18786335 17238789 15872663 14663666
55912 14663666 13578445 12598946 11721898 10935517 10219117 9563775 8971521 8435234 7939336
55903 7939336 7478911 7059001 6676109 6318462 5983198 5675893 5394155 5128400 4877807
55894 4877807 4649276 4441290 4244215 4056057 3883004 3724820 3574085 3429691 3297201
55885 3297201 3175971 3059288 2947367 2847295 2759843 2678682 2602899 2538144 2484679 2435677
55875B435677m7871m5328m6118n4473o3662o6588o7112p0437p2155o7423o1424
55864A773086n9967n8680n1994m4171m1103l9504l4564l0317l2107l6071l6033
55853A308575l3960l4242l4411l0882k7312k8140k9964k8006k5028k5372k6419
55842I84839k4251k1717k2530k3372k0170j6399j6847j8718j7193j4380j4526
55831G74736j5489j3271j0120j0071j1025r064o233o349p537o418n402q178j2074
55818F53505j2420j0667j0875j1897j0324p647p302p944o463m416m781n655l790
55805E49324j016o34p56K075N940O937O401Q007J0541J0250P805O372N250J879
55791F18375k196l718l952o366j0046j1421j0564j0047r463o821l606k820l754
$$ plain form
55875 2435677 2387806 2342478 2296360 2241887 2178225 2111637 2044525 1974088 1901933 1834510 1773086
55864 1773086 1713119 1654439 1602445 1558274 1517171 1477667 1443103 1412786 1380679 1344608 1308575
55853 1308575 1274615 1240373 1205962 1175080 1147768 1119628 1089664 1061658 1036630 1011258 984839
55842 984839 960588 938871 916341 892969 872799 856400 839553 820835 803642 789262 774736
55831 774736 759247 745976 735856 725785 714760 705696 699463 693114 685577 679159 673757 665579 653505
55818 653505 641085 630418 619543 607646 597322 589675 582373 574429 567966 563550 558769 553114 549324
55805 549324 548308 547674 546918 548993 554933 561870 568271 576278 586819 597069 604874 611246 616496 618375
55791 618375 616179 612461 608509 602143 592097 580676 570112 560065 550602 543781 540175 537355 533601
55778E33601l847l743n224o210l316K517Q214J4340K3234L3254M0174M2585M0682
55765G16261L1943J4146q416k7378l8480m2985m2573l8092l2162k7776k4638k0885
55753D58965j7292j5707j4885j2387r196q017q413p960o823o725o809n015k183
55740C37553n17N61K773M777M132J898P36lk652o151p416o571o168o418n767n020
55724C05747o101p829p581o106n981o465m765j467L10N05J842M529O214O868Q759
55709B88479J1641J2708J1457J0006Q604N315L83l537n853q458j1421j2483j1306
55696B95535j0267j0424j0421r739r320q692o304l146k224l767m515k517N74K694
55682B17467L707M001L691L744N205O961O869N114L795L399K528R85j2n10j762
$$ plain form
55778 533601 529754 526011 520787 514577 511261 513778 521992 536332 559566 592820 632994 675579 716261
55765 716261 748204 762350 753934 726556 688076 645091 602518 564426 532264 504488 479850 458965
55753 458965 441673 425966 411081 398694 389498 381481 373068 365108 358285 351560 344751 339736 337553
55740 337553 337036 337597 340370 345147 349279 351177 351913 351910 349258 343107 335691 329120 322952 316534 310767 305747
55724 305747 299646 291817 284236 278130 272149 265684 260919 259452 259762 260267 262109 266638 272852 279720 288479
55709 288479 300120 312828 324285 334291 342895 348210 348593 345056 339203 330745 319324 306841 295535
55696 295535 285268 274844 264423 254684 245364 236672 230368 227222 224998 221231 216716 214199 214773 217467
55682 217467 221174 225175 228866 232610 237815 244776 251645 256759 260554 263953 266481 267466 267454 266944 265182
55667B65182l454l925l088k340j790m74R77R20j82k91P82J415J400K026L112L158
55651B63428K346K337L114K996J791R84Q71L83m32o34p66k062l674l817l240m287
55635B59338o826q466q553q541q564p285n133m151m380l863k418j873k367j964
55621A84954l73M46r7l46K61K96o07j010o66j105k561l333k853k451k528j935
55605A66092p15m43j285j658j262j421k004j258P20J565N13n23m40m01j000j129
55589A55351n56o21j454j370l3Q10N32O72J798K370J784J595K652L711L970M257
55573A75468M811M695M262N315P835R541R609R798J0824J0828Q776O280M515K328
55559B74885r11l542m491n245p081q849r284r203r610r765q947q004p563o590
$$ plain form
55667 265182 261728 257803 254715 252375 250585 250111 251088 252008 251826 251535 252317 253732 255132 257158 260270 263428
55651 263428 265774 268111 271225 274221 276012 276996 277867 278250 277818 277184 276418 274356 270682 266865 263625 259338
55635 259338 252512 244046 235493 226952 218388 211103 205970 201819 197439 193576 191158 189285 186918 184954
55621 184954 184581 185027 184930 184584 184845 185141 184534 183524 182858 181753 179192 175859 173006 170555 168027 166092
55605 166092 165377 164934 163649 161991 160729 159308 157304 156046 156766 158331 158844 158321 157881 157480 156480 155351
55589 155351 154795 154174 152720 151350 151317 152127 152659 153331 155129 157499 159283 160878 163530 167241 171211 175468
55573 175468 180279 184974 189236 194551 202386 211927 221536 231334 242158 252986 261762 268042 272557 274885
55559 274885 273974 270432 265941 260696 253615 244766 235482 226279 216669 206904 197957 189953 182390 175800
55545A75800m391k144j088q93r46j385j865j280K00R18M75M31J423J980J297O39
55529A69171Q41Q32j2n86m05p38j976k506j673j284k452l529k987j924j751j715
55513A47306q23r5p22j911k516l034m020m383l292k031j966k252j468n4P89J180
55497A20708J764K168J966J864K395K689J962Q88K77k49r78j218q05q64j780k192
55481A28595j344n22q23j381j252j135j576j444R5J809K319K049J767J009l97
55466A27769j158o68l77j273j892q49O37Q35L33N32R74N24k62k24J80p9n56l71
55448A24075q5n09r15l62L43J3p77q00k61O1M75J299J503M13n99j45Q25P61J72
55429A25487K72M89k63j052l47J036J077o8m26N53J588K011K313K498J974R92
$$ plain form
55545 175800 171409 169265 168177 167284 166338 164953 163088 161808 162008 162926 163401 163832 165255 167235 168532 169171
55529 169171 170012 170844 170832 170246 169841 169103 167127 164621 162948 161664 159212 155683 152696 150772 149021 147306
55513 147306 146483 146388 145666 143755 141239 138205 134185 129802 126510 124479 122513 120261 118793 118739 119528 120708
55497 120708 122472 124640 126606 128470 130865 133554 135516 136404 136681 136432 135454 134236 133431 132567 130787 128595
55481 128595 127251 126729 125906 124525 123273 122138 120562 119118 119213 121022 123341 125390 127157 128166 127769
55466 127769 126611 125943 125566 124293 122401 121552 122189 123024 123357 123889 124863 125387 125125 124901 125081 125002 124446 124075
55448 124075 123990 123481 122566 122204 122547 122560 121783 120983 120722 120783 121258 122557 124060 124473 123874 123729 124554 125315 125487
55429 125487 125759 126248 125985 124933 124586 125622 126699 126631 126205 126758 128346 130357 132670 135168 137142 138134
55413A38134L94J83j03j63M27R75P19K93N14P17K0q16p57o39j773l315l459k415
55395A28936j842j892j290l4M64j28o79p05q43j154q93o9M56M60M51M69K47K04
55377A22158P21J010L02m31J52J328J253p4r44p74o06r07j060j045j537k201j873
55360A15472o91j00m97p33k71R0oK09R05R77j49j394j539q10k90m95j074j339
55342A08265q68N4O53O93Q07J309J508R44M15O65R89M84k08M6Q18P99p9q28j186
55323A15280j559j664r56JK50J67P51J629J580P16K43L85L62K08O69J370J076
55306A20508j86j079j070q17m56N21J639J608M74k40J10N17K50j07KK54M53J000
55288A23381J865K319K054J465P53j08o14k79J91l05j382j642r44n15q35j157
$$ plain form
55413 138134 138528 138711 138608 138445 138872 139847 140566 140859 141373 142090 142110 141294 140537 139898 138125 134810 131351 128936
55395 128936 127094 125202 123912 123878 124342 124214 123535 122830 121987 120833 119940 119871 120327 120787 121238 121707 121954 122158
55377 122158 122879 123889 124191 123760 123912 125240 126493 126419 125475 124701 124095 123188 122128 121083 119546 117345 115472
55360 115472 114781 114681 114184 113451 113180 113270 113264 113473 114378 115355 115206 113812 112273 111463 111173 110678 109604 108265
55342 108265 107397 107451 108104 108797 109604 110913 112421 113365 113780 114445 115434 115918 115710 115756 116574 117373 117294 116466 115280
55323 115280 113721 112057 111101 111102 111352 111519 112270 113899 115479 116195 116438 116823 117185 117393 118062 119432 120508
55306 120508 120322 119243 118173 117356 116900 117421 119060 120668 121142 120902 121012 121529 121779 121672 121674 121928 122381 123381
55288 123381 125246 127565 129619 131084 131837 131729 131115 130836 131027 130722 129340 127698 126754 126239 125404 124247
55272A24247j205j525j942j497k87L91J07j41J82M03J88J21K57k12j219j542q41
55255A15485l64q53j381j109o10m90j83P62J493J110J32l52k21n4p5j29j95k89
55237A12677l03k74l07j30N25J126Q50m4m15N9M81K26k55l84j59K84P81P87K3
55218A15548n46J83J464J366k96j465q00N25Q40K66o7J26L37L67M17N64Q10J212
55200A20851J566J488J044O63L81j61q46j121q33l10L24R37Q25m88k086k616k168
55183A17450j835j639o60R19J746J507J296J521J282L12l35j09K63L84P88J297
55167A24187P94o11j118k2R73M10p30q81k65J31M54J232J890J607P73K38m8m09
55149A28605m13K17O33O2q08r24n30m40m68L7P19O79O3j65K15M41Op42j116o81
$$ plain form
55272 124247 123042 121517 119575 118078 117791 118182 118289 118148 118330 118733 118921 119042 119299 119087 117868 116326 115485
55255 115485 115121 114268 112887 111778 111168 110678 110495 111257 112750 113860 113992 113640 113419 113365 113290 113161 112966 112677
55237 112677 112374 112100 111793 111663 112188 113314 114164 114120 113705 113764 114245 114471 114216 113832 113673 113957 114738 115525 115548
55218 115548 115002 115185 116649 118015 117719 116254 115454 115979 116819 117085 117018 117144 117481 117848 118265 118829 119639 120851
55200 120851 122417 123905 124949 125612 125993 125832 124986 123865 123032 122722 123046 123983 124808 124320 122234 119618 117450
55183 117450 115615 113976 113316 114235 115981 117488 118784 120305 121587 121899 121564 121455 121718 122102 122890 124187
55167 124187 124981 124370 123252 123230 124203 124613 123883 123002 122737 122868 123322 124554 126444 128051 128824 129062 129014 128605
55149 128605 128192 128409 129042 129104 128296 127372 126842 126402 125934 125971 126690 127369 127432 127267 127482 127923 127929 127187 126071 125390
55129A25390M41J434J405N08j57j03Pk86l91J92Q87R95P28N17K08l00n40l84m81
55110A30070r84r66K2R30Q39N19J014J785J671Q96N34N79J44p42j044l77N31J015
55092A36436J058P60J43m79p31p32q03q33m95J52Q21J386J632J165J12o91q34
55075A38067r50j498j697o33J131K162J937J081J82n77r60p90m44m43p02q39r26
55058A34101j204j364q54K33J215J664J634J292P56J82l75r19j189r00m30n12
55042A33330r79p41M66J378J020K22K88R57Q94k77j617k239k045j285k59O14J034
55025A30761J066Q36L12k63l54P0L48J96J46M48M59j65o84m73j24l30o09j83N95
55006A32052Q93P71P85Q37O17N28J028J489J032N0l05J78P46J004J146J142Q33
$$ plain form
55129 125390 125831 127265 128670 129178 129021 128918 128925 128639 128248 128440 129327 130322 131050 131567 131775 131475 130935 130551 130070
55110 130070 129086 128120 128142 129072 129911 130430 131444 133229 134900 135796 136330 136909 137053 136311 135267 134890 135421 136436
55092 136436 137494 138254 138397 137918 137187 136455 135652 134819 134324 134476 135297 136683 138315 139480 139592 138901 138067
55075 138067 137117 135619 133922 133289 134420 136582 138519 139600 139782 139205 138245 137455 137011 136568 135866 135027 134101
55058 134101 132897 131533 130679 130912 132127 133791 135425 136717 137473 137655 137280 136361 135172 134272 133842 133330
55042 133330 132351 131610 132076 133454 134474 134696 134984 135941 136835 136558 134941 132702 130657 129372 129113 129727 130761
55025 130761 131827 132663 132975 132712 132358 132428 132776 132972 133118 133566 134025 133860 133176 132703 132579 132249 131640 131457 132052
55006 132052 132945 133716 134501 135338 135955 136483 137511 139000 140032 140082 139777 139955 140701 141705 142851 143993 144826
54989A44826N80P38Q36L00l93m44j36k98p47o19M2M32N16R10J310O50r60j932
54971A45611j325n7N51L35o7k56k38j41j93m48m36K95J332J782J548J382J637
54954A51312J813J493R15L78j53n99o71m75n82j189j736j654j052m06k5O3m3k15
54936A47174l94n61m77K05J301K013J891J498J516J701J455R92J100J922K874
54921A64210L677M601N699O530O820O783O716O680O527N871M291J923m27k207
54907B27694l739n418o822p312p056o611n987m911l714k999k705k387k075k024
54893A63934j963j528j098j190j330o66N71J339J405J458J706J624J175J079J639
54878A68155K360L013M010N451O714P336P422P008N858M172K643J484J70j570
$$ plain form
54989 144826 145406 146144 146980 147280 146887 146443 146307 146009 145262 144643 144685 145117 145633 146543 147853 148503 147543 145611
54971 145611 144286 144229 144780 145115 145048 144792 144554 144413 144220 143772 143336 143631 144963 146745 148293 149675 151312
54954 151312 153125 154618 155533 155911 155758 155159 154488 154013 153431 152242 150506 148852 147800 147394 147369 147432 147389 147174
54936 147174 146780 146219 145742 145947 147248 149261 151152 152650 154166 155867 157322 158314 159414 161336 164210
54921 164210 167887 172488 178187 184717 191537 198320 205036 211716 218243 224114 228405 230328 229901 227694
54907 227694 223955 218537 211715 204403 197347 190736 184749 179838 176124 173125 170420 168033 165958 163934
54893 163934 161971 160443 159345 158155 156825 156159 156730 158069 159474 160932 162638 164262 165437 166516 168155
54878 168155 170515 173528 177538 182989 189703 197039 204461 211469 217327 221499 224142 225626 225796 224226
54864B24226l325m754n977o885o890n765m150k842k077j760j799j964j927j716
54850A72395j711k054k445k601k502k201j827j681j897k099j908j544j366j171
54836A45388o38j55k85o77m86K68P74P56P15Q20O49J75p9J7J0k17l08l38p45j216
54816A44428p79N83J549J293O92R71J933K306J437Mo96N5J649K515J692Oq54l79
54798A58405M67Q49Q95Q50M62k96q52q42o14m96l85l27p04j351j322j38J397K188
54780A58186K073J557Q97J22n55q60p06j6J311K901L953M174M216M748N592O203
54764A93796O618P302Q351R312R725R470Q633P264N292K631n09l536n878p375
54750B51096q134q282q110q073q216p959o958n755m990m369l332k174j571j332
$$ plain form
54864 224226 220901 216147 210170 203285 196395 190630 186480 183638 181561 179801 178002 176038 174111 172395
54850 172395 170684 168630 166185 163584 161082 158881 157054 155373 153476 151377 149469 147925 146559 145388
54836 145388 144750 144595 144310 143633 143147 143415 144189 144945 145660 146480 147129 147304 147225 147242 147252 147035 146727 146389 145644 144428
54816 144428 143649 144232 145781 147074 147766 148737 150670 152976 154413 154417 153721 153776 155425 157940 159632 159638 158784 158405
54798 158405 158872 159721 160616 161466 161928 161632 160780 159938 159324 158828 158443 158116 157412 156061 154739 154601 155998 158186
54780 158186 160259 161816 162713 162835 162280 161420 160714 160698 162009 164910 168863 173037 177253 182001 187593 193796
54764 193796 200414 207716 216067 225379 235104 244574 253207 260471 265763 268394 267885 264349 258471 251096
54750 251096 242962 234680 226570 218497 210281 202322 195364 189609 184619 180250 176918 174744 173173 171841
54736A71841q17k81n32j304j362m24M15M62L86Q94J664K175K617L250L823M165
54720A86972M634N355N827N728N451N303M936M023K781J358n46k983n294o867
54706B16678p679p769o954n511m363m037m047l740l101k368j545p20k14m4P7N5
54690A64718n13j351j579j157j054j544j538m10P20M91p87j760j913j692j328
54675A49303n98M12J182J305P15l08j120j159o60l33j82M35J321J258p4j227r18
54658A49352K38R79J279J704J828Q45p01j398r28k58K5L37R69J445J276N80k42
54641A57330q57r69n29N6L31L21K80K25J61L16O32N08k94r18m78N50Q77J65o46
54622A57061p19j42N90J156J272P23k18q52p29n4O17Q71P06M91N41O53L46l26
$$ plain form
54736 171841 171024 170743 170211 168907 167545 167121 167536 167998 168384 169278 170942 173117 175734 178984 182807 186972
54720 186972 191606 196961 202788 208516 213967 219270 224206 228229 231010 232368 231822 228839 223545 216678
54706 216678 208999 201230 194276 188765 184402 180365 176318 172578 169477 167109 165564 164844 164630 164586 164663 164718
54690 164718 164205 162854 161275 160118 159064 157520 155982 155572 156292 156783 155996 154236 152323 150631 149303
54675 149303 148705 149117 150299 151604 152319 152011 150891 149732 149072 148739 148557 148992 150313 151571 151497 150270 149352
54658 149352 149590 150569 151848 153552 155380 156225 155524 154126 153198 152940 152965 153302 154271 155716 156992 157572 157330
54641 157330 156473 155504 154975 155031 155362 155683 155963 156188 156349 156665 157297 157805 157511 156593 156115 156665 157542 157707 157061
54622 157061 156342 156200 156790 157946 159218 159941 159723 158871 158142 158088 158705 159576 160282 160773 161314 161967 162313 161987
54604A61987o96m57j35k54o06p91q75r42n69M87J515J576P62K8n9K34M16K28m06
54585A61443j294j921j852j229n34p7J28J94L76Q36J254J066L38j67m8K18J54
54568A58885n4j53l72q13r91o21j88j00%M64Q78Q51Q43J306J728J445P78M26K87
54549A64599o2l06J08Q00R78P62Q88J376J592J433J402J592J629J495J428J216
54533A80930M67n27j103j200j136p77L2N82J3j222j895j831j869k035j343L09
54517A67395J512J213Q9n94n35j50L24P94R15M86j40m41l12k7N4l43j100j589
54499A67551j300n89k33k75q8M82P72L17m71r08p51j47O29J226J459J576J774
54482A71024J626O15p71j330o56M06R66J082J214J435J544J496J377J257J287
$$ plain form
54604 161987 161291 160834 160699 160445 159839 159048 158173 157231 156662 157149 158664 160240 161002 161030 160971 161205 161621 161849 161443
54585 161443 160149 158228 156376 155147 154613 154536 154664 154858 155234 156070 157324 158390 158728 158561 158513 158731 158885
54568 158885 158831 158678 158306 157493 156502 155881 155693 155593 155593 156057 156935 157786 158629 159935 161663 163108 163886 164312 164599
54549 164599 164537 164231 164339 165139 166117 166879 167767 169143 170735 172168 173570 175162 176791 178286 179714 180930
54533 180930 181397 180870 179767 178567 177431 176654 176686 177268 177281 176059 174164 172333 170464 168429 167086 167395
54517 167395 168907 170120 170209 169615 169080 168930 169254 170048 170963 171449 171309 170868 170556 170529 170583 170240 169140 167551
54499 167551 166251 165662 165429 165154 165066 165548 166320 166637 166166 165258 164507 164360 164989 166215 167674 169250 171024
54482 171024 172650 173265 172494 171164 170508 170914 171880 172962 174176 175611 177155 178651 180028 181285 182572
54467A82572J514J613J209N47K94O40J098J243J103P94L30q3j23J06J06l41r21
54450A91701j232j121o33o5Q0l56q06p36m55n17p20n33k24n31j364j966k259k703
54432A75560k866j662N67J822J090j13P5J268J761J186P56J138J589J320O31K35
54416A84357K26K25J03P6K55M21L54K10M09J061J660J552O89k75o36k77L51O78
54398A91439N17K05J81L74L31M0J01P66J332J078L75J57N42P67L42m94j366k054
54380A94633k201j475j27J161J979K258J847P67l14o29l12p5l4K64P08O37J31
54363A99218J33R76J780J807J471J445J637J658J646J912K240K156J592Q07jp12
54347B19765j121j167j053j022j229j839k809l600l648l140k813k876k764k019
$$ plain form
54467 182572 184086 185699 186908 187455 187749 188389 189487 190730 191833 192627 192957 192874 192751 192857 192963 192622 191701
54450 191701 190469 189348 188715 188650 188730 188374 187568 186832 186377 185860 185140 184607 184383 183852 182488 180522 178263 175560
54432 175560 172694 171032 171599 173421 174511 174398 174473 175741 177502 178688 179444 180582 182171 183491 184122 184357
54416 184357 184583 184808 184911 184987 185242 185663 186017 186227 186636 187697 189357 190909 191598 191323 190687 190410 190761 191439
54398 191439 191956 192161 192342 192716 193047 193087 193188 193954 195286 196364 196739 196896 197438 198205 198547 198053 196687 194633
54380 194633 192432 190957 190830 191991 193970 196228 198075 198842 198528 197899 197587 197512 197478 197742 198450 199087 199218
54363 199218 199351 200327 202107 203914 205385 206830 208467 210125 211771 213683 215923 218079 219671 220478 220477 219765
54347 219765 218644 217477 216424 215402 214173 212334 209525 205925 202277 199137 196324 193448 190684 188665
54333A88665q33L11J014R32J07o92o81r4J68n8j06K18L06p6l07k4L40M72P02J094
54313A91458R97O8j011j459j342j085q45p70j161j801j936j373q09o37l44L44
54297A78294P53M11m6N4L32K49K28Q30J529J432P33L61N53P61O85M17j01q78j379
54278A85218j076l47Rj32k72j93k5L16R64J539J495R47M84L08J60n5j74j49M2
54259A89059N64J334J756J461R60R09J147J092Q17Q39J123J153Q08L99o2p90j544
54242B01025j772j482j207j166j080q41o57n31k76KL1K3M33J043J038J38r60j497
54224A92264j417j018m23K69P75Q96P83O82O31N12K30k34p51j038q67k93M25J045
54206A92471J306R45L4q93j318j258j094j002q52m23M06J464K095J595J06j302
$$ plain form
54333 188665 187832 188143 189157 190089 190196 189504 188823 188729 188897 188839 188733 188951 189257 189181 188874 188850 189190 189662 190364 191458
54313 191458 192455 192523 191512 190053 188711 187626 186781 186011 184850 183049 181113 179740 178931 178294 177950 178294
54297 178294 179047 179458 179412 179466 179798 180047 180275 181105 182634 184066 184799 185160 185713 186474 187159 187576 187475 186597 185218
54278 185218 184142 183795 183804 183672 183400 183207 183182 183498 184462 186001 187496 188443 188927 189235 189395 189340 189166 189017 189059
54259 189059 189623 190957 192713 194174 195134 196043 197190 198282 199099 199938 201061 202214 203022 203421 203359 202569 201025
54242 201025 199253 197771 196564 195398 194318 193477 192820 192289 192013 192015 192046 192069 192502 193545 194583 194721 193761 192264
54224 192264 190847 189829 189406 189675 190450 191346 192129 192811 193442 193954 194184 193950 193199 192161 191294 191001 191426 192471
54206 192471 193777 194722 194756 193863 192545 191287 190193 189191 188339 187916 188322 189786 191881 193476 193582 192280
54190A92280j792j606j380j172o80k8L52L67K47J07j6M5K44J38l59n53R2J002
54172A87288J253R83R92J244Q50l79j446j516r59o04o53p33n47j04L95O73N82
54155A87319L11J35l6m61r89j071m40N16J136R86J38p74r30k08N48N15l6k24J86
54136A86621O58Q58R64J009P28J72j84j45m8j53l29n13p97r23l36Q42J574J060
54118A91058j79q45k79J007J994K074J457Q95R13J315J507J267Q84O06L99K68
54102B04341M24R06J369J385P58n07k088l191k924j261O59J540J145L39NK45O41
54085B03786J017J664K761L891M502M700N111N845O255O012N879O676P879P989
54071B73967O229L267K05k453m645o138o589o022m994m182l844l635l090k311
$$ plain form
54190 192280 190488 188882 187502 186330 185650 185622 185974 186341 186588 186695 186679 186724 186968 187106 186747 186194 186286 187288
54172 187288 188541 189524 190516 191760 192610 192231 190785 189269 188310 187706 187053 186320 185773 185669 186064 186737 187319
54155 187319 187630 187765 187729 187268 186279 185208 184768 185284 186420 187406 187544 186770 185840 185632 186180 186695 186659 186435 186621
54136 186621 187279 188137 189101 190110 190838 191010 190826 190681 190633 190480 190151 189638 188841 187918 187582 188424 189998 191058
54118 191058 190879 190034 189755 190762 192756 194830 196287 197182 198095 199410 200917 202184 203068 203674 204073 204341
54102 204341 204765 205671 207040 208425 209183 208676 206588 203397 200473 199212 199871 201411 202556 202895 202900 203145 203786
54085 203786 204803 206467 209228 213119 217621 222321 227432 233277 239532 245544 251423 258099 265978 273967
54071 273967 280196 283463 283668 281215 276570 270432 263843 257821 252827 248645 244801 241166 238076 235765
54057B35765j873j967j966j215M4R79J158Q76N85M78N44O64P06Q07J356K390L278
54040B42609L437L144L172L781M604N332N947O404O642O875P340P775P611O667
54026C21340N273L873K918K913L842M731M545L506K807K959L215K836K148J892
54012C68798K042J749L13k068m450n967o625p161p988q618q451p679o889o120
53998C00886n050l860l073k689k320k082k427l055k990j976r24o43j013j686k647
53983B64451l607l723k684j385q52r72j014q97j116j609j623q27P3J83m55q88
53967B43055l99O82J381J218O52K61J4l63o36k84O69J642K195K360K255J976J773
53950B58451J829J901J696J485J812K655L567M468N526O365O337N685N449N953
$$ plain form
54057 235765 233892 231925 229959 228744 228788 229767 230925 231801 232386 232864 233408 234072 234778 235585 236941 239331 242609
54040 242609 246046 249190 252362 256143 260747 266079 272026 278430 285072 291947 299287 307062 314673 321340
54026 321340 326613 330486 333404 336317 340159 344890 349435 352941 355748 358707 361922 364758 366906 368798
54012 368798 370840 372589 372902 370834 366384 360417 353792 346631 338643 330025 321574 313895 307006 300886
53998 300886 295836 291976 288903 286214 283894 281812 279385 276330 273340 271364 270440 269797 268784 267098 264451
53983 264451 260844 257121 254437 253052 252200 251228 250214 249317 248201 246592 244969 244142 244215 244398 243943 243055
53967 243055 242656 243338 244719 245937 246589 246850 246864 246501 245865 245581 246250 247892 250087 252447 254702 256678 258451
53950 258451 260280 262181 263877 265362 267174 269829 273396 277864 283390 289755 296092 301777 307226 313179
53936C13179O367O129N847O248P025P416P307P188P467Q391J0084J2111J3348
53923D18107J2754J0048N632M63l837n660m926l266k172j558o06P15J951L212
53909D30857M859O388O718N696M400L758L458K570P85j239k560k814k428k045
53895D58403j930k029k485l531m918n973o476o873p437p770p539p112o968o968
53881C80394o801o677o941p241o781n360l718k829l064l920m442m127l529l546
53867C11418m069m012k949j916k005k876l425l359l206l148k807k085j402j087
53853B73072j159j624k381k861k447j247k7O28N73j69j253j764j050J65L38r24
53837B57870k271k324j319m74l05k93L1M05L59r7n52p14n84k27L23Q35R07M74
$$ plain form
53936 313179 319546 325675 331522 337770 344795 352211 359518 366706 374173 382564 392648 404759 418107
53923 418107 430861 440909 446541 447004 443167 437507 432581 429315 427143 425585 424979 425694 427645 430857
53909 430857 435716 442104 448822 454518 458918 462676 466134 468704 469489 468250 465690 462876 460448 458403
53895 458403 456473 454444 451959 448428 443510 437537 431061 424188 416751 408981 401442 394330 387362 380394
53881 380394 373593 366916 359975 352734 345953 340593 336875 334046 330982 327062 322620 318493 314964 311418
53867 311418 307349 303337 300388 298472 296467 293591 290166 286807 283601 280453 277646 275561 274159 273072
53853 273072 271913 270289 267908 265047 262600 261353 261326 261954 262527 262358 261105 259341 258291 258456 258794 257870
53837 257870 255599 253275 251956 251482 251177 250884 250915 251320 251679 251582 251030 250316 249732 249505 249828 250663 251570 252044
53819B52044M3J15M41L58j83m90j51M06O94R36J589K550L355L905M430M950N271
53802B80263N359N366N382N548O051O673O641N559M172L566L776L901L485L016
53788C48758K956L058K907K485J940J293P19N69P85P01j85j530k655l403m054
53773C54344m632m853m716m621m796m955m846m800n333o280o733o030m532l221
53759B83996k732k957l421l606l061j705j61O46M11k69p13q82j082j287j173o65
53743B61339q9K07J39j25l43m06m24n27n94m04r3p2l79n39k45J58K40J80M65J140
53723B59628J680J648J116N52M58J004J849K393K394K135J903J620J190Q78J045
53708B81493J667K428L035L272K982K324J833J887K319K769L156L519L729L687
$$ plain form
53819 252044 252087 252202 252643 253001 252818 252328 252177 252583 253277 254213 255802 258352 261707 265612 270042 274992 280263
53802 280263 285622 290988 296370 301918 307969 314642 321283 326842 331014 334580 338356 342257 345742 348758
53788 348758 351714 354772 357679 360164 362104 363397 364116 364685 365470 366171 365986 364456 361801 358398 354344
53773 354344 349712 344859 340143 335522 330726 325771 320925 316125 310792 304512 297779 291749 287217 283996
53759 283996 281264 278307 274886 271280 268219 266514 266353 266999 267410 267141 266428 265546 264464 263177 262004 261339
53743 261339 261250 261457 261596 261471 261128 260722 260298 259771 259177 258773 258680 258608 258229 257690 257445 257603 257843 258023 258488 259628
53723 259628 261308 262956 264072 264624 265082 266086 267935 270328 272722 274857 276760 278380 279570 280448 281493
53708 281493 283160 285588 288623 291895 294877 297201 299034 300921 303240 306009 309165 312684 316413 320100
53694C20100L580L606L634L459L111K615J801P10j62n09p48j380k024j821o69
53679C35303N74J085Q04J27o15j186j443j430j313j157r72q95j015j122r24m33
53663C25388J03N11O82L68m86j320j326m08N35M88o17j804j982j059n7L4n61p75
53645C17714k04M26N54P18J585K683K960K372J953K369L100L239K486J218R8k81
53629C42990K74J335K218K577K514K288K203K551L250L730L622L336L504M062
53615C80454M364M117L591L112K877L189M172N295N795N632N405N376N252N018
53601D43649N183N891O421N966M508K631Q53n44j406j832k195k762l388l655l251
53586D56069k209j015m17p77j643k235k336k312k360k265j955j799k013k245k015
$$ plain form
53694 320100 323680 327286 330920 334379 337490 340105 341906 342616 342454 341945 341197 339817 337793 335972 335303
53679 335303 335877 336962 337766 337893 337278 336092 334649 333219 331906 330749 329777 328882 327867 326745 325821 325388
53663 325388 325491 326002 326684 327052 326566 325246 323920 323512 324047 324535 323918 322114 320132 319073 319016 319050 318489 317714
53645 317714 317510 317936 318490 319208 320793 323476 326436 328808 330761 333130 336230 339469 341955 343173 343271 342990
53629 342990 343264 344599 346817 349394 351908 354196 356399 358950 362200 365930 369552 372888 376392 380454
53615 380454 384818 388935 392526 395638 398515 401704 405876 411171 416966 422598 428003 433379 438631 443649
53601 443649 448832 454723 461144 467110 471618 474249 475102 474558 473152 471320 469125 466363 462975 459320 456069
53586 456069 453860 452845 452428 451651 450008 447773 445437 443125 440765 438500 436545 434746 432733 430488 428473
53571D28473j386q47o97p77p99p71r40j333j517j074k12M35O49Q47J283J584J353
53554D24271P77K75k4K2P63K042K867K548J715J400J566J495J268J692K817L749
53538D49243M061M326M993N706O130O521P086P558P904Q672J0113J1520J2059
53525E45892J1870J1817J2410J3380J4148J4466J4642J5162J6013J6683J7018
53514G03501J7671J9138K0817K1892K2680K4051K5734K6618K6642K6938K7822
53503I63504K8153K7281K6214K5956K5933K5159K3953K3237K2910K2188K1073
53492A235561K0290K0022J9788J9400J9171J9183J9153J8953J8667J8279J7861
53481A446328J7834J8454J9172J9173J8247J6703J4709J2323R824P390M754J871
$$ plain form
53571 428473 427087 426240 425543 424766 423967 423196 422256 420923 419406 418332 418120 418555 419204 420051 421334 422918 424271
53554 424271 425048 425323 425299 425321 426084 428126 430993 433541 435256 436656 438222 439717 440985 442677 445494 449243
53538 449243 453304 457630 462623 468329 474459 480980 488066 495624 503528 512200 522313 533833 545892
53525 545892 557762 569579 581989 595369 609517 623983 638625 653787 669800 686483 703501
53514 703501 721172 740310 761127 783019 805699 829750 855484 882102 908744 935682 963504
53503 963504 991657 1018938 1045152 1071108 1097041 1122200 1146153 1169390 1192300 1214488 1235561
53492 1235561 1255851 1275873 1295661 1315061 1334232 1353415 1372568 1391521 1410188 1428467 1446328
53481 1446328 1464162 1482616 1501788 1520961 1539208 1555911 1570620 1582943 1592767 1600157 1604911 1606782
53469A606782n13j810k838n112q917j2951j5879j7429j7896j7552j6862j6587
53457A472436j7208j8551k0130k1525k2417k2792k3096k3694k4131k3605k2248
53446A233039k1189k1096k1344k0993j9942j8568j6803j4289j1288q708p220o586
53434A045013n997m768k795o01J093K035K718L842N564P443R098J0633J2288J3926
53420A099492J5104J5680J6084J6911J8340K0130K2047K4077K6226K8360L0343
53409A332794L2206L4023L5770L7389L8884M0295M1683M3213M5074M7242M9446
53398A778019N1551N3737N6041N7929N8674N8264N7644N7824N8887O0021O0492
53387B409083O0256N9570N8374N6401N3833N1299M9090M6753M3736M0093L6169
$$ plain form
53469 1606782 1606269 1604459 1601621 1596509 1587592 1574641 1558762 1541333 1523437 1505885 1489023 1472436
53457 1472436 1455228 1436677 1416547 1395022 1372605 1349813 1326717 1303023 1278892 1255287 1233039
53446 1233039 1211850 1190754 1169410 1148417 1128475 1109907 1093104 1078815 1067527 1058819 1051599 1045013
53434 1045013 1039016 1034248 1031453 1030852 1031945 1033980 1036698 1040540 1046104 1053547 1062645 1073278 1085566 1099492
53420 1099492 1114596 1130276 1146360 1163271 1181611 1201741 1223788 1247865 1274091 1302451 1332794
53409 1332794 1365000 1399023 1434793 1472182 1511066 1551361 1593044 1636257 1681331 1728573 1778019
53398 1778019 1829570 1883307 1939348 1997277 2055951 2114215 2171859 2229683 2288570 2348591 2409083
53387 2409083 2469339 2528909 2587283 2643684 2697517 2748816 2797906 2844659 2888395 2928488 2964657
53376B964657L1909K7021K1679J6564J2100Q001L615j587p786j4755k1951k9022
53364C010445l6139m3512n0599n6301n9926o1659o2107o1859o1446o1192o0978
53353B394727o0464n9528n8118n5921n2832m9643m7524m6714m6478m6400m6756
53342A824349m7391m7241m5546m2767l9792l6905l4158l1942l0389k8728k6138
53331A413352k2878j9894j7589j5701j4130j3162j2934j3237j3776j4166j3917
53320A241968j2843j1369j0037q952q029p330o699n598l859k158j013J79K261
53307A166521M880O898Q053R155J0643J1996J2825J3636J5080J7104J9254K1283
53295A317328K3107K4597K5793K7015K8470K9914L0885L1076L0447K9214K7730
$$ plain form
53376 2964657 2996566 3023587 3045266 3061830 3073930 3081931 3085546 3083959 3076173 3061418 3039467 3010445
53364 3010445 2974306 2930794 2880195 2823894 2763968 2702309 2640202 2578343 2516897 2455705 2394727
53353 2394727 2334263 2274735 2216617 2160696 2107864 2058221 2010697 1963983 1917505 1871105 1824349
53342 1824349 1776958 1729717 1684171 1641404 1601612 1564707 1530549 1498607 1468218 1439490 1413352
53331 1413352 1390474 1370580 1352991 1337290 1323160 1309998 1297064 1283827 1270051 1255885 1241968
53320 1241968 1229125 1217756 1207719 1198767 1190738 1183408 1176709 1171111 1167252 1165094 1164081 1164260 1166521
53307 1166521 1171401 1178299 1186352 1195507 1206150 1218146 1230971 1244607 1259687 1276791 1296045 1317328
53295 1317328 1340435 1365032 1390825 1417840 1446310 1476224 1507109 1538185 1568632 1597846 1625576
53284A625576K6180K4406K2313K0248J8559J6911J4583J1446Q011M507O25l629
53272A789736p507j0385j2571j4796j7215j9481k1493k3528k5626k7452k8849
53261A580833l0155l1648l2948l3412l3074l2768l3135l3878l4195l3755l2725
53250A219140l1242k9386k7723k7039k7338k7714k7547k7240k7411k7927k8229
53239I10344k8056k7319k5809k3727k1979k1134k0428j8709j6078j3691j2120
53228F81294j0910r727q878q483q189q064q748j0252j1471j1597j1288j1649j2575
53215E49463j3045j2762j2470j2625j2594j1532r513p395n876n092m959n385o016
53202D30199o175n535m681m629n639o867p325o886o076n260m512m005m007m434
$$ plain form
53284 1625576 1651756 1676162 1698475 1718723 1737282 1754193 1768776 1780222 1788233 1792740 1793365 1789736
53272 1789736 1782229 1771844 1759273 1744477 1727262 1707781 1686288 1662760 1637134 1609682 1580833
53261 1580833 1550678 1519030 1486082 1452670 1419596 1386828 1353693 1319815 1285620 1251865 1219140
53250 1219140 1187898 1158512 1130789 1103750 1076412 1048698 1021151 993911 966500 938573 910344
53239 910344 882288 854969 829160 805433 783454 762320 741892 723183 707105 693414 681294
53228 681294 670384 660657 651779 643296 635107 627043 618295 608043 596572 584975 573687 562038 549463
53215 549463 536418 523656 511186 498561 485967 474435 464922 457527 451651 446559 441600 436215 430199
53202 430199 424024 418489 413808 409179 403540 396673 389348 382462 376386 371126 366614 362609 358602 354168
53188C54168m810m727m129l169k201j770k177l012l466l205k598k120j857j745
53174C13182j807j973k000j812j650j722j858j736j281o93j93J41L13K76p6p10
53158B96401j275j312p91k11j9j30k46l82o94j070j279j410j615j598r42M2N03
53141B83972J85k11o9L52N25N36P31R43P54L63M79J222J762J407N22oL0Q9j24
53122B93462k46L5M34N54M65M02L42L65R79K283L165K370L12j199j261q12r24
53105C00726j276j128p92j081j903k445k426k160j684p96J44M12n8n95q23r60
53089B83155j158j194j026r23r38q18n64m84o30o32k80K31O57R18R17O26L35M15
53071B78607Q04J129J240J188Q68K08m43p10p70j002j255j248j352k053k819k569
$$ plain form
53188 354168 349358 344631 340502 337333 335132 333362 331185 328173 324707 321502 318904 316784 314927 313182
53174 313182 311375 309402 307402 305590 303940 302218 300360 298624 297343 296650 296457 296598 296911 297187 297111 296401
53158 296401 295126 293814 293023 292812 292793 292663 292417 292035 291341 290271 288992 287582 285967 284369 283427 283469 283972
53141 283972 284157 283946 283877 284229 284754 285290 286021 286964 287718 288081 288560 289782 291544 292951 293473 293467 293497 293586 293462
53122 293462 293216 293251 293685 294239 294704 295106 295448 295813 296792 299075 302240 304610 304922 303723 302462 301650 300726
53105 300726 299450 298322 297530 296449 294546 292101 289675 287515 285831 285035 285179 285591 285533 284938 284115 283155
53089 283155 281997 280803 279777 278854 277916 277098 276534 276050 275420 274788 274508 274739 275396 276314 277231 277857 278192 278607
53071 278607 279411 280540 281780 282968 283836 284044 283601 282891 282121 281119 279864 278616 277264 275211 272392 269823
53055B69823j354m33m55o25j21O77R64P47O30R21J499K100K260J540J87q42r72
53038B76546o98q35j476k074k094j322lJ105J287P84N72R88J224N83m81j061r01
53021B72144k59O99J665J876R19m35q99j51R27J374R99K63k14o5N11Q46N06j88
53003B80518n77m58j79o5p4K6L29O31N84P0n81r03p66l53J82O82Q09M33J34O65
52983B81107J876K778K773K179J514R88Q39J323K067K228J662J181J264J341Q59
52968C05979K06r7k93p28r40l53O15J082R68Q82J057J162J048Q32M28l22j107
52951C10419j377j131r32j169j744k370k760k680k231j884j903j913j475p21p9
52936B86050L29M69J27o78j329j368j154j152j014k42O25N75k73o65L7J069J443
$$ plain form
53055 269823 268469 268036 267581 266956 266835 267512 268476 269223 269853 270774 272273 274373 276633 278173 278360 277518 276546
53038 276546 275848 275013 273537 271463 269369 268047 268044 269149 270436 271220 271792 272780 274004 274587 274106 273045 272144
53021 272144 271885 272584 274249 276125 277044 276609 275710 275559 276486 277860 278859 279122 278908 278843 279354 280200 280706 280518
53003 280518 279941 279483 279304 279239 279165 279191 279520 280151 280735 280805 280224 279321 278555 278202 278384 279066 279875 280308 280442 281107
52983 281107 282983 285761 288534 290713 292227 293215 294054 295377 297444 299672 301334 302515 303779 305120 305979
52968 305979 306185 306088 305795 305067 304127 303774 304389 305471 306439 307321 308378 309540 310588 311420 311848 311526 310419
52951 310419 309042 307911 306979 305810 304066 301696 298936 296256 294025 292141 290238 288325 286850 286129 286050
52936 286050 286379 286848 286975 286297 284968 283600 282446 281294 280280 280038 280663 281238 280965 280300 280337 281406 282849
52919B82849J086M56k33q98j192p96J02Q49Q54L6r85j343p90j7K26O9P9K34L3
52900B80619m74n95j05L37J94j91k39J5J72J59J27k9m90r27p34R0P17M49l65o99
52880B78031q6Q53J239R37M59J15k44o87q59m28M17J121J288J009Q08J162J887
52863B87022K150J490N51K93O70R07R08J317K044J970O30r12j586j738k145k573
52847B90998k393j901j803j969j886j914k712l644l231j329M15O80r0o89p45o85
52831B67102q12r83r21n49j55j78n49m88N12J694J802P13m88r82r49p70m26N6
52813B63629L62M34O36J084J432J572J893K518K872K400J277O6q82j434j570j507
52797B74782j626j966k168k039j788j528j054l86k6l40r35j071n02L14P50O35
$$ plain form
52919 282849 283935 284391 284158 283260 282068 281272 281374 282223 283077 283113 282128 280785 279995 279978 280204 280273 280352 280586 280619
52900 280619 280145 279550 279445 279782 279976 279785 279546 279561 279733 279892 280019 279990 279500 278573 277839 277929 278646 279095 278730 278031
52880 278031 277945 278798 280037 280974 281433 281548 281304 280617 279758 279330 279747 280868 282156 283165 283973 285135 287022
52863 287022 289172 290662 291213 291506 292176 293083 293991 295308 297352 299322 299952 299040 297454 295716 293571 290998
52847 290998 288605 286704 284901 282932 281046 279132 276420 272776 269545 268216 268631 269311 269221 268532 267787 267102
52831 267102 266290 265307 264386 263837 263682 263504 262955 262467 262979 264673 266475 267188 266700 265718 264769 263999 263573 263629
52813 263629 263991 264425 265061 266145 267577 269149 271042 273560 276432 278832 280109 280175 279293 277859 276289 274782
52797 274782 273156 271190 269022 266983 265195 263667 262613 262227 262201 261861 260926 259855 259353 259667 260417 261052
52781B61052L49L16M09K41J1N20J830K687K000M66l69k50k41p46r21l36J41k36
52763B66923r19r88m92p3N5M6j12m01m61k1O87J306J726J799J262L60j28N3K20
52744B70842l9rJ008K353K803K294J861K020K227J923J293P71M55K83L11O37J255
52727B92288K089K879L119K459J207J49k45k12l51r87j900k538k558k147j710
52712B91542j310p32j32q6p37j399j346p46l98q04j795k739k844j615M77K070
52696B77406K176J281P07J020J601J698J293Q40O05N88P54J016J148R15L72j26
52680B93294k73j34k2j20l03l95m13m26m50n91j033j555j428l18J007J444Q94
52663B89178J38l76q26j153r35l26n7j92J44J233K069J824J197J365K317L152
$$ plain form
52781 261052 261401 261717 262126 262367 262378 262898 264728 267415 269415 269881 269512 269262 269021 268275 267354 267018 267159 266923
52763 266923 266004 265016 264524 264451 264506 264552 264440 264039 263578 263557 264244 265550 267276 269075 270337 270697 270569 270622 270842
52744 270842 270803 270794 271802 274155 276958 279252 281113 283133 285360 287283 288576 289347 289802 290085 290396 291033 292288
52727 292288 294377 297256 300375 302834 304041 304190 303945 303733 303382 302395 300495 297957 295399 293252 291542
52712 291542 290232 289500 289368 289282 288545 287146 285800 285054 284656 283852 282057 279318 276474 274859 275336 277406
52696 277406 279582 280863 281570 282590 284191 285889 287182 288022 288627 289215 289969 290985 292133 293048 293420 293294
52680 293294 293021 292887 292865 292745 292442 292047 291634 291208 290758 290167 289134 287579 286151 285833 286840 288284 289178
52663 289178 289316 288940 288114 286961 286026 285700 285643 285451 285595 286828 288897 290721 291918 293283 295600 298752
52647B98752L360K933J792J68r54q89m11p35j707k187j975j852j863j118L50J053
52631B94717J79j083j210k80O59J328K125K885K901J989O40p77k088k838k615
52616B96532j872j533j692j499m84P51J515J860K016J706P24k13r2J025J950J772
52600C02466Q29Q9j2J47j6o15j187j178n64R3L00J87J77K74J70j15j81M0J56M
52580C01064q8P2K31L33P78J547J765Q41m26q23m14k57o97j003p58m85n48m73
52562C00659R3N85L61k74n23k22J06Q8j83m89p03p51o95p27q63q32n01j63j99
52543B94767n84r77j100q36k15N44J160J563J799J668Q80l05j071r33k53L49O54
52526B97110O93M55J20J10M84O99M60L27Q89J736J950J442J032J254J753K004
$$ plain form
52647 298752 302112 305045 306837 307005 306051 305162 304751 304016 302309 300122 298147 296295 294432 293314 293664 294717
52631 294717 294896 293813 292603 292323 292982 294310 296435 299320 302221 304210 304850 304073 301985 299147 296532
52616 296532 294660 293127 291435 289936 289452 290203 291718 293578 295594 297300 298024 297811 297719 298744 300694 302466
52600 302466 303295 303384 303372 303519 303503 302888 301701 300523 299959 300052 300352 300539 300716 300990 301160 301045 300864 300904 301060 301064
52580 301064 300976 301048 301279 301612 302390 303937 305702 306543 306117 305294 304880 304623 303926 302923 302165 301680 301132 300659
52562 300659 300752 301337 301698 301424 300901 300679 300785 300873 300690 300201 299498 298747 298052 297325 296462 295630 295129 294966 294767
52543 294767 294183 293206 292106 291270 291055 291599 292759 294322 296121 297789 298669 298364 297293 296360 296107 296456 297110
52526 297110 297803 298258 298378 298488 298972 299671 300131 300458 301347 303083 305033 306475 307507 308761 310514 312518
52510C12518K081K433L249M246M965N090M606L635K198K73j826l469m262m408
52496C31329m276l906l200k372j805j570j375j005n80l68m62o50n88k28J8k00
52480C08762o18o85m15k84k84J64J149J830J618J107J214J850K240K152K044K167
52464C24011K301K383K697L324L887M031L803L423K887J903K04j992l899m801
52450C44162m873m880n057m815l822k719k256k346k464k480k452k045r49M00J175
52435C04579J083M44l60j008j134o84j06K96P59J355J473P43q7j03M29O08L62
52418C08649K67L17P5j38M65J658K335K215K178K662L026K913L082M252O142Q237
52402C48335J0519J2774J3962J3103J0236O060J234l447o988q942r749r853r116
$$ plain form
52510 312518 314599 317032 320281 324527 329492 334582 339188 342823 345021 345294 343468 339999 335737 331329
52496 331329 327053 323147 319947 317575 315770 314200 312825 311820 311240 310872 310410 309760 309172 308944 308962 308762
52480 308762 308144 307459 307044 306760 306476 306640 307789 309619 311237 312344 313558 315408 317648 319800 321844 324011
52464 324011 326312 328695 331392 334716 338603 342634 346437 349860 352747 354650 354854 352862 348963 344162
52450 344162 339289 334409 329352 324537 320715 317996 315740 313394 310930 308450 305998 303953 303004 303404 304579
52435 304579 305662 306106 305746 304738 303604 302920 302814 303110 303869 305224 306697 307440 307353 307250 307679 308287 308649
52418 308649 308916 309233 309308 309170 309635 311293 313628 315843 318021 320683 323709 326622 329704 333956 340098 348335
52402 348335 358854 371628 385590 398693 408929 414989 416223 412776 405788 396846 387097 377244 368128
52389C68128p571n968m895m043l016k175j900j635o54O99J500J699K005K568K783
52374C47525K462K270K779L808M926N937O645O699O050N093M117K859R72j263
52360D00879k970l412k661j562r29p63m08M31J191J268R42R57J373J541J194Q26
52344C97897P92O83J16m38k17P60J787K557L439M655N785O372O506O499O437O457
52328D50087P021Q332R780J0639J1163J2210J3858J5194J5654J5623J5402J4551
52316E99514J2957J1682J1732J2556J2839J2505J2740J3998J5169J5053J3888
52305G44633J2906J2962J3983J5280J5996J5669J4654J3813J3557J3470J2899
52294H99822J1622R802P683N434L047L82k388m529n480n626n777n919n345m066
$$ plain form
52389 368128 360557 354589 349694 345651 342635 340460 338560 336925 336271 336970 338470 340169 342174 344742 347525
52374 347525 349987 352257 355036 358844 363770 369707 376352 383051 389101 394194 398311 401170 402142 400879
52360 400879 397909 394497 391836 390274 389345 388582 388174 388605 389796 391064 392006 392963 394336 395877 397071 397897
52344 397897 398689 399372 399488 399050 398833 399593 401380 403937 407376 412031 417816 424188 430694 437193 443630 450087
52328 450087 457108 465440 475220 485859 497022 509232 523090 538284 553938 569561 584963 599514
52316 599514 612471 624153 635885 648441 661280 673785 686525 700523 715692 730745 744633
52305 744633 757539 770501 784484 799764 815760 831429 846083 859896 873453 886923 899822
52294 899822 911444 921246 928929 934363 937410 937792 935404 930875 925395 919769 913992 908073 902728 898662
52280H98662l151l310l947m113l681l037k227j065L49J762L108M312N169N799
52266H94630O733Q077R098R205Q840Q801R114R333R549J0301J1648J3065J4147
52253A022541J4810J5024J4965J5155J5720J5618J3590R831N925K996Q31j045
52241A145961k426l087l485m110m684m750m708n359o657p596p510o840o417o485
52227A071847o632o442n832m964m107l549l437l634l776l585l008k202j378o65
52213A018636J0Q64J969L060L758M028M231M693N343N862O071O025N812N405M735
52198A080502L896L265L291L983M740M957M814N033N783O327O060N406N195N476
52184A148728N568N049M078K729O71k298n711q678j0453j0873j0463j0006r720
$$ plain form
52280 898662 895511 892201 888254 884141 880460 877423 875196 874131 874480 876242 879350 883662 888831 894630
52266 894630 901363 909440 918538 927743 936583 945384 954498 963831 973380 983681 995329 1008394 1022541
52253 1022541 1037351 1052375 1067340 1082495 1098215 1113833 1127423 1137254 1143179 1146175 1147006 1145961
52241 1145961 1143535 1140448 1136963 1132853 1128169 1123419 1118711 1113352 1106695 1099099 1091589 1084749 1078332 1071847
52227 1071847 1065215 1058773 1052941 1047977 1043870 1040321 1036884 1033250 1029474 1025889 1022881 1020679 1019301 1018636
52213 1018636 1018646 1019510 1021479 1024539 1028297 1032325 1036556 1041249 1046592 1052454 1058525 1064550 1070362 1075767 1080502
52198 1080502 1084398 1087663 1090954 1094937 1099677 1104634 1109448 1114481 1120264 1126591 1132651 1138057 1143252 1148728
52184 1148728 1154296 1159345 1163423 1166152 1166823 1164525 1158814 1150136 1139683 1128810 1118347 1108341 1098621
52171A098621r055p692o321n806n825n213l651k105j335q62J04J442K461K988
52157A057751L455M103M641M589L706K141M18r04j647j952j830j153j42O58J020
52142A074854J250J594J842J716J215M11o15j464j633j245r82j049p45N21K472
$$ plain form
52171 1098621 1089566 1081874 1075553 1069747 1063922 1058709 1055058 1052953 1051618 1050756 1050860 1052302 1054763 1057751
52157 1057751 1061206 1065309 1069950 1074539 1078245 1080386 1080804 1079900 1078253 1076301 1074471 1073318 1073176 1073834 1074854
52142 1074854 1076104 1077698 1079540 1081256 1082471 1082882 1082267 1080803 1079170 1077925 1076943 1075894 1075149 1075670 1078142
$$ [...]
##END NTUPLES=NMR SPECTRUM
##END=
