
##TITLE=AC1225_PUEHDE098_6075357_c2Lw6cslGK
##JCAMPDX= 6.0         $$ Bruker NMR JCAMP-DX V2.0
##DATA TYPE= NMR SPECTRUM
##DATA CLASS= NTUPLES
##ORIGIN= BRUKER
##OWNER= Administrator
$$ 1.72 TOPSPIN		Version 2.1
$$ 2012-05-07 22:14:09.984 -0500  Administrator@TOPSPIN
$$ Compression mode = diff/dup
##.OBSERVE FREQUENCY= 400.13188235
##.OBSERVE NUCLEUS= ^1H
##.ACQUISITION MODE= SIMULTANEOUS (DQD)
##.ACQUISITION SCHEME= undefined
##.AVERAGES= 8
##.DIGITISER RES= 22
##SPECTROMETER/DATA SYSTEM= spect
##.PULSE SEQUENCE= zg30
##.SOLVENT NAME= COFFEE_meoh
##.SHIFT REFERENCE= INTERNAL, COFFEE_meoh, 1, 14.98061
##AUDIT TRAIL= $$ (NUMBER, WHEN, WHO, WHERE, PROCESS, VERSION, WHAT)
$$ ##TITLE= Audit trail, TOPSPIN		Version 2.1
$$ ##JCAMPDX= 5.01
$$ ##ORIGIN= Bruker BioSpin GmbH
$$ ##OWNER= Administrator
$$ $$ C:\Bruker\TOPSPIN/data/COFFEE/nmr/AC1225_PUEHDE098_6075357_c2Lw6cslGK/10/pdata/1/auditp.txt
$$ ##AUDIT TRAIL=  $$ (NUMBER, WHEN, WHO, WHERE, PROCESS, VERSION, WHAT)
(   1,<2012-05-07 22:14:03.062 -0500>,<Administrator>,<TOPSPIN>,<go>,<TOPSPIN 2.1>,
      <created by zg
	started at 2012-05-07 22:12:56.375 -0500,
	POWCHK enabled, PULCHK disabled,
       configuration hash MD5:
       AF F2 23 6B 01 CD 40 DD E5 A1 38 A0 06 EA F7 77
       data hash MD5: 64K
       54 9A 03 8A 7F 21 01 2B 44 3D 89 99 4B 9A 29 BC>)
(   2,<2012-05-07 22:14:05.812 -0500>,<Administrator>,<TOPSPIN>,<proc1d>,<TOPSPIN 2.1>,
      <Start of raw data processing
       efp LB = 0 FT_mod = 6 PKNL = 1 PHC0 = 0 PHC1 = 0 SI = 32K 
       data hash MD5: 32K
       2D 9B 53 82 EC 8D 0B 5D D2 63 AB BD E5 23 3C 03>)
(   3,<2012-05-07 22:14:06.187 -0500>,<Administrator>,<TOPSPIN>,<proc1d>,<TOPSPIN 2.1>,
      <pk PHC0 = 212.7942 PHC1 = 0 
       data hash MD5: 32K
       1A F9 35 59 D7 42 E4 FE 43 43 6F 55 86 07 F4 9A>)
(   4,<2012-05-07 22:14:06.250 -0500>,<Administrator>,<TOPSPIN>,<proc1d>,<TOPSPIN 2.1>,
      <abs ABSG = 1 
       data hash MD5: 32K
       95 67 84 36 6E 33 2B CD 14 CD 45 F8 1B B8 CA C5>)
(   5,<2012-05-07 22:14:06.281 -0500>,<Administrator>,<TOPSPIN>,<proc1d>,<TOPSPIN 2.1>,
      <abs ABSG = 2 
       data hash MD5: 32K
       74 69 F7 66 8D F0 A2 EA D5 BD B1 5F E2 36 B5 F4>)
(   6,<2012-05-07 22:14:06.296 -0500>,<Administrator>,<TOPSPIN>,<proc1d>,<TOPSPIN 2.1>,
      <abs ABSG = 3 
       data hash MD5: 32K
       03 D6 86 66 E0 2E 2A DC 32 D6 FF 03 9B 10 7E 94>)
(   7,<2012-05-07 22:14:06.343 -0500>,<Administrator>,<TOPSPIN>,<proc1d>,<TOPSPIN 2.1>,
      <abs ABSG = 4 
       data hash MD5: 32K
       F0 17 5C 50 0F 3B 00 45 F7 E0 EF 49 8A C1 AA B9>)
(   8,<2012-05-07 22:14:06.375 -0500>,<Administrator>,<TOPSPIN>,<proc1d>,<TOPSPIN 2.1>,
      <abs ABSG = 5 
       data hash MD5: 32K
       AE 71 FE D5 34 3B 52 F1 3F 40 8D 9D 69 E9 EA D4>)
$$ ##END=
$$ 
$$ $$ hash MD5
$$ $$ C8 56 A8 2D B5 62 05 AE E6 18 EC 26 74 0F B4 0C
##$RELAX= 
##$RELAX= 
##$RELAX= 
##$RELAX= 
##$RELAX= 
##$RELAX= 
##$RELAX= 
$$ Bruker specific parameters
$$ --------------------------
$$ [...]
##$TP= (0..7)
150 150 150 150 150 150 150 150
##$TP07= 0
##$TPNAME0= <>
##$TPNAME1= <>
##$TPNAME2= <>
##$TPNAME3= <>
##$TPNAME4= <>
##$TPNAME5= <>
##$TPNAME6= <>
##$TPNAME7= <>
##$TPOAL= (0..7)
0.5 0.5 0.5 0.5 0.5 0.5 0.5 0.5
##$TPOFFS= (0..7)
0 0 0 0 0 0 0 0
##$TUNHIN= 0
##$TUNHOUT= 0
##$TUNXOUT= 0
##$USERA1= <user>
##$USERA2= <user>
##$USERA3= <user>
##$USERA4= <user>
##$USERA5= <user>
##$V9= 5
##$VALIST= <valist>
##$VCLIST= <CCCCCCCCCCCCCCC>
##$VD= 0
##$VDLIST= <DDDDDDDDDDDDDDD>
##$VPLIST= <PPPPPPPPPPPPPPP>
##$VTLIST= <TTTTTTTTTTTTTTT>
##$WBST= 1024
##$WBSW= 4
##$XGAIN= (0..3)
0 0 0 0
##$XL= 0
##$YL= 0
##$YMAX_a= 527536
##$YMIN_a= -625851
##$ZGOPTNS= <>
##$ZL1= 120
##$ZL2= 120
##$ZL3= 120
##$ZL4= 120
##$ABSF1= 14.98061
##$ABSF2= -5.57192
##$ABSG= 5
##$ABSL= 3
##$ALPHA= 0
##$AQORDER= 0
##$ASSFAC= 0
##$ASSFACI= 0
##$ASSFACX= 0
##$ASSWID= 0
##$AUNMP= <proc_prof1d_extract_pilot.lims>
##$AXLEFT= 0
##$AXNAME= <>
##$AXNUC= <1H>
##$AXRIGHT= 0
##$AXTYPE= 0
##$AXUNIT= <>
##$AZFE= 0.1
##$AZFW= 0.1
##$BCFW= 0
##$BC_mod= 0
##$BYTORDP= 0
##$COROFFS= 0
##$CY= 15
##$DATMOD= 1
##$DC= 0
##$DFILT= <>
##$DTYPP= 0
##$F1P= 0
##$F2P= 0
##$FCOR= 0.5
##$FTSIZE= 32768
##$FT_mod= 6
##$GAMMA= 0
##$GB= 0
##$INTBC= 1
##$INTSCL= 1
##$ISEN= 128
##$LB= 0
##$LEV0= 0
##$LPBIN= 0
##$MAXI= 10000
##$MC2= 0
##$MEAN= 0
##$ME_mod= 0
##$MI= 0
##$NCOEF= 0
##$NC_proc= -8
##$NLEV= 6
##$NOISF1= 0
##$NOISF2= 0
##$NSP= 0
##$NTH_PI= 0
##$NZP= 0
##$OFFSET= 14.98061
##$PC= 1
##$PHC0= 212.7942
##$PHC1= 0
##$PH_mod= 1
##$PKNL= yes
##$PPARMOD= 0
##$PPDIAG= 0
##$PPIPTYP= 0
##$PPMPNUM= 2147483647
##$PPRESOL= 1
##$PSCAL= 4
##$PSIGN= 0
##$PYNMP= <proc.py>
##$REVERSE= no
##$SF= 400.13
##$SI= 32768
##$SIGF1= 0
##$SIGF2= 0
##$SINO= 400
##$SIOLD= 32768
##$SPECTYP= <>
##$SREGLST= <1H.CDCl3>
##$SSB= 0
##$STSI= 32768
##$STSR= 0
##$SW_p= 8223.68421052632
##$SYMM= 0
##$S_DEV= 0
##$TDeff= 65536
##$TDoff= 0
##$TI= <>
##$TILT= no
##$TM1= 0
##$TM2= 0
##$TOPLEV= 0
##$USERP1= <user>
##$USERP2= <user>
##$USERP3= <user>
##$USERP4= <user>
##$USERP5= <user>
##$WDW= 1
##$XDIM= 32768
##$YMAX_p= 462759990
##$YMIN_p= -742652
##$CURPLOT= <Network HP LaserJet P1505>
##$CURPRIN= <$Network HP LaserJet P1505>
##$DFORMAT= <normdp>
##$LAYOUT= <+/1D_H.xwp>
##$LFORMAT= <normlp>
##$PFORMAT= <normpl>
##$SURQMSG= 1
$$ End of Bruker specific parameters
$$ ---------------------------------
##NTUPLES= NMR SPECTRUM
##VAR_NAME=  FREQUENCY,     SPECTRUM/REAL,   SPECTRUM/IMAG
##SYMBOL=    X,             R,               I
##VAR_TYPE=  INDEPENDENT,   DEPENDENT,       DEPENDENT
##VAR_FORM=  AFFN,          ASDF,            ASDF
##VAR_DIM=   32768,         32768,           32768
##UNITS=     HZ,            ARBITRARY UNITS, ARBITRARY UNITS
##FACTOR=    0.250966925370066, 1,           1
##FIRST=     8223.43324360095, -181368,      -105247
##LAST=      0,             -246730,         -25370
##MIN=       0,             -742652,         0
##MAX=       8223.43324360095, 462759990,    0
$$ Real data points
##PAGE= N=1
##DATA TABLE= (X++(R..R)), XYDATA
$$ [...]
23853 -56756 93212 913 121728 -114512 -59224 -51627 -205216 189551 -24632 123881 245929
23842 245929 120036 111947 -32080 -150106 202175 214302 -132621 67674 152800 -182930 43048
23830 45245 96495 68294 12281 -14486 -143832 51750 -186813 -25508 -216693 -106762 -227511
23819 -227511 -133809 98944 -122122 144119 -28643 -179503 438751 207657 14206 27580
23809 27580 7212 140289 157095 -153471 139662 -173755 -117435 -225222 -103416 106861
23798 -146290 103905 -24860 269415 -134073 -83629 27771 -168668 -12765 51130 112476 -271134
23786 -115096 -382701 294163 17650 197202 -209891 29321 -113899 -109905 -38963 77122 -124985
23774 50847 -197147 -401813 4984 -4000 32174 95479 -237599 -284749 -174582 170499 -187097
23762 -291936 -108404 170658 -31473 -224315 103892 -77985 77087 -131888 62057 -143620
23751 34136 -217230 121747 194782 -147419 -110631 -316099 -110305 -81326 251796 -243427
23740 154452 -154556 74074 -115143 -8663 356840 47158 375963 99400 -55077 86641 -328060
23728 -217100 66571 -274887 -75967 -131 -25059 259140 33770 -14208 8605 103964 -60821 -263830
23716 -263830 -39705 -331686 -205402 70965 -64939 -193658 81234 13613 70436 -187434 101368
23704 194170 182623 -71368 -124475 -176634 -253377 46250 -9947 -67400 -114155 179095 -20754
23692 127396 124301 25790 -278404 -114767 89443 133250 -102207 234 134419 87479 106566
23681 106566 15936 230080 -528265 9598 -241613 225524 34967 97831 33618 -14649 37280
23669 -12397 -142546 123264 68917 149943 158924 -119566 -118767 -55644 91477 10910 77308 219324
23657 219324 91671 -182986 -144174 -84123 6734 -178636 387434 -117361 -165722 -101958 -163313
23646 -163313 -49387 110876 150750 -90212 215638 -275831 -101876 240326 -19409 -203653
23636 -203653 -169567 420375 206932 129008 23082 135678 107000 -67663 -342981 -104812
23625 55473 21491 294361 57841 100703 -35475 343086 78913 80884 -293567 -13416 99776
23613 -13527 53237 -269695 52526 -154155 118506 133758 112414 149313 -173290 -295934 39053
23601 -43418 71697 -194690 43704 -277083 50472 -109142 65662 58858 -206025 319374 -32237
23589 -25323 75754 -81545 -14933 188893 -57420 -247937 -14527 -103948 205011 146885 39133
23577 -46225 314884 216126 23560 26343 -331294 -165712 61365 178792 394373 180470 -101660
23565 -18244 24994 25116 114742 -17422 -169123 75892 -34647 108398 -65061 -170400 333305
23553 6286 119447 -19095 -103326 206745 68408 5237 -96981 -405063 -70551 -49716 -72799
23542 -72799 -65573 -26337 -130469 333190 46372 -220587 -260137 30505 118159 -135031 245927
23530 53333 -156317 -8789 221776 462811 -55916 285356 -41119 -32624 98865 83405 50808
23519 50808 -325593 -183452 -103248 120173 8647 -214125 -371962 119627 -71749 93316 -163052
23507 -192744 -121010 -238587 -167023 -216017 -40599 89651 -250783 243066 242981 99377 -365950
23495 55280 -117200 300005 -24904 -202811 -111121 -167948 -223339 -168113 -237660 46439 -156516
23483 7443 133201 -136122 -239981 -266084 -130653 290202 42445 -118798 147385 -262165
23472 71196 -213715 16465 331869 -81513 -43991 -257576 -175200 269123 -54383 -379397 -98425
23460 187157 -35300 -45362 4410 -236429 204617 -302449 -4882 -242617 142688 261668 -87360
23448 52701 250834 -86233 76752 -132536 197180 -123019 19504 90312 2471 -83440 -136476
23437 -136476 201218 -82389 85887 -130834 -29863 158654 180128 102031 -92039 36614 -312642
23425 12531 356051 8823 -42544 16250 12924 -135058 201970 -75809 -196840 84017 -190311
23413 263088 -437704 -206021 28583 -159031 -39360 -105027 -470419 -218427 257520 31301
23402 -517947 -163937 -5615 -36516 33659 -28202 208437 -183225 -3514 281296 -63841 -138427
23391 -138427 411130 139754 -262318 -200442 -93993 -178868 -152369 111548 52105 -226680
23380 -110229 168797 42659 -3618 -155486 250365 122759 33898 96369 -137430 8421 -324500
23368 -214937 -147733 141176 -8392 115963 126878 157451 -321442 -82140 -395144 -287731 80661
23356 37331 166605 -222615 250968 92791 -82335 -129378 180655 -51344 -97706 215540 -142831
23344 173291 63954 -37574 32967 172073 -76202 -151898 -100394 35633 33731 -48689 142053
23332 -15140 -217809 241658 79398 52874 93418 -58840 -63116 -265488 41232 59578 -57216
23320 248206 208946 164630 144729 -41542 -117115 327337 -298526 -46735 33797 106558 -119329
23308 239684 -88189 -274771 -28554 -167608 -119 50823 186179 -90025 -16949 -43053 -22696
23297 -22696 353490 -24454 -203707 -256376 -75660 -125472 -289 -129097 -57023 106149 -49199
23285 138664 -201093 -243923 85871 134831 1185 98385 -262935 208388 66343 167344 81919
23273 -88560 -39615 -4506 175077 -181039 103954 -160906 -158628 -82432 -23546 285896 -171813
23261 70906 -170061 51006 -7411 -145515 243198 -141282 39572 137717 -82657 -254026 17955
23249 69217 -309782 243777 131334 -35179 43202 169337 -128230 64187 -46316 -73261 84459
23237 -21736 7234 65156 25817 -175171 -96756 277133 -52769 -78385 267670 -80026 184850
23225 -365636 -41535 234717 -223399 51018 240414 77128 -420385 -77699 38901 155450
23215 155450 -290679 11525 -208915 -172068 163544 -25989 -90922 -80710 -95153 71714 141748
23204 141748 -38355 65199 -269062 -214418 -6212 28263 -113938 277160 236185 -38323 161785
23192 -258611 23664 -84804 -15400 -400274 139874 187038 -174995 143873 -190803 20314
23181 -116403 -177479 256418 179154 -17968 -174102 95200 -53882 80347 116625 -157528 14779
23169 74872 -243569 -223125 -73189 180242 229915 66508 -207643 49056 -420886 -330936 254180
23157 -348102 -8809 -18839 -76893 -340286 162449 -230464 -20195 -61536 106872 -327289 82199
23145 240628 -611308 -420657 74632 -89256 -330086 -81828 5911 -78616 196716 -21297 288746
23133 -113057 116193 184086 -362127 212452 -64803 76527 -253579 -174373 178130 88487
23122 9538 113124 45762 -241569 -93709 117148 -118357 -130129 -137625 198999 -86608 -148482
23111 -148482 -231334 -148397 157537 42438 -140309 -4793 -62721 -117211 84252 -3877 -165823
23100 -165823 235287 40707 -71025 -140876 269387 174049 115453 49330 -33792 -118 -192171
23089 -192171 197107 105462 -105754 90695 188761 -326579 -172408 -90936 -186553 21782 92131
23078 92131 -169302 59821 -230167 -63423 272944 94902 116132 131362 -22138 -109374 203692
23066 -231535 -227170 -149350 -55219 -57113 89568 -135034 189699 45019 32712 -322707 -94096
23054 76610 -134196 190041 20734 -15621 -185503 93972 -79133 85587 61771 -332784 -147236
23042 95346 78518 -166614 259292 91819 -40407 -302250 -13537 -75125 90545 52750 -68492
23030 204655 122207 -98646 -193473 -396285 210313 -219378 -200247 -398283 -58568 -84878 154441
23018 280673 -59608 182932 -317 -59925 100463 68094 -22341 -180045 -155970 293916 -294855
23006 71729 -190674 214858 245428 -190830 83750 -51658 162626 -137673 190688 164192
22996 164192 85560 -69277 105724 -39897 -139414 259106 41518 -59769 -354013 -107523 -80613
22985 -80613 -43497 -79506 -193758 36674 -10554 73222 81244 -153944 -101664 65359 141255
22974 141255 -115830 220333 -8280 40776 -18614 -109257 22434 -149722 -96290 -192566 186495
22962 39245 -189136 45347 -207430 14148 -141505 20412 -43319 -48937 267437 -93178 -269795
22951 -269795 -237926 15020 -92592 194903 11284 238038 97891 232074 -285011 -12620 -335016
22940 -335016 -59246 -148305 21589 -100309 -126200 147561 162467 282199 -321203 -361656 48384
22928 -335181 14957 6229 -19252 49924 -286444 -357345 -5784 313440 259587 103389 55837
22917 55837 -192575 -21683 -160095 226679 201277 -62770 -187044 124951 -160271 250244
22906 -65485 -554684 133450 -105128 -108601 -166787 245616 -191456 102135 191786 -36466 -166253
22895 -166253 -151505 -110954 -103848 15548 -108420 334390 -239241 149291 142403 -127563 -39511
22883 -63166 179683 -107053 55954 142879 -125212 -228751 -211973 -36793 -139680 -44192 238541
22871 -95046 209333 80766 -82491 -268016 -6241 -90299 -283031 -270657 -51399 90706 -49722
22859 -31971 104271 -69656 -326345 -151558 201182 -141575 -140535 -180060 -38379 -210575 173425
22847 98649 -54368 200847 205118 -127986 -225904 49278 -200969 3096 22261 -154501 8603
22835 -51763 -195749 -125933 -57628 160369 -279828 173238 -170558 -29487 100149 71903
22825 71903 -132653 -22779 75416 -60970 310747 -170265 111277 -72397 79893 5853 -154521
22813 -280864 -7885 -258207 70523 380421 41872 -95021 -51566 -235998 -11954 -189069 -138793
22802 -138793 74200 -58942 316474 -159275 -11634 -124730 -230850 -21069 -93958 -458468
22792 -458468 -123333 -62337 -78860 -83775 -252979 -267400 -72678 56339 10945 -88887 -355197
22781 -355197 -318687 -107620 -361026 67186 -298428 119360 185827 -63644 160441 -99779
22770 -83515 283751 -557832 94648 118558 298632 123986 261559 -131468 -74157 -208013
22760 -208013 56581 128327 3686 -94189 179895 79053 -186084 -163724 -19913 -58509 73996
22748 5628 -137486 71913 -137791 -124357 225056 66440 -257934 139792 117970 171718 125714
22737 125714 23608 -260546 -161498 157506 -180249 -156569 201513 14802 -208635 7448 -66538
22725 308849 -57601 -24048 -81474 16626 794 -71636 59981 -178252 -27560 -261858 -89252
22713 -42752 274668 -106818 -111093 57680 132259 -235903 -181257 -44880 -108815 -266212 -76247
22701 -83595 -126319 -39702 265566 98550 209798 263887 176851 11681 172691 116450 -69083
22689 176350 290655 -190725 11955 -87548 -310685 -274363 254354 -87416 -219782 -194878
22679 -194878 86228 106594 -49073 106730 -746 -176402 1587 222479 -77503 -55972 -386473
22668 -386473 -116593 163916 187783 219226 -141785 72157 126449 131953 227293 -228703 -370640
22657 -370640 -244118 136026 57001 132461 -351321 38744 341608 5377 -287687 -259637 -121428
22645 224781 -63033 -306350 -296302 -122376 -81024 66711 -101139 -40476 73131 161042 299184
22634 299184 -183167 110338 -72940 151920 270333 16020 -326788 -57996 -27001 -28912 -85893
22623 -85893 168711 -248741 -24121 -143711 -25344 -17025 -293923 166710 -7373 73669 -28348
22611 288699 -325475 -235923 -297446 -53133 37043 -203535 -92013 -200791 180487 45340 -136354
22599 -7597 -19766 -63878 134292 11802 73482 -281651 -176855 -70633 242252 16244 -81768
22587 -206737 51647 245244 -77068 121201 -235189 -224608 118141 -41690 -67078 -344330
22577 -344330 -141005 -158033 -181504 91349 -199042 -114820 -232136 -9579 264005 -123857 427158
22565 -165711 -57667 -330262 -167764 15514 319044 -53157 284957 217884 133311 20598 214601
22554 214601 -103614 34726 -235541 -205578 359794 24030 -148237 243362 -233241 -186129
22544 -186129 105139 222677 -250034 272591 425934 76801 -130362 -61231 -72734 -127777
22534 -127777 -8545 248485 -4496 -147709 -153639 -321118 -11690 93830 -237390 -122708 -130211
22523 -130211 -145446 257473 -341941 161804 -108230 223878 17789 158373 -326259 -217293
22513 -217293 -90890 -44644 94182 104228 163965 -151237 41958 -127647 87354 29145 -53541
22501 6257 199911 322315 230097 -13384 247847 -90503 -180492 -157653 191440 -111781 181736
22489 235552 -40126 -142219 193848 -346809 120170 -178391 -60708 -147013 182412 -190424
22478 -284866 178184 -94632 13638 -95439 161632 109727 73300 -69696 -387510 -134817 375965
22466 179441 18466 26043 -281485 -22098 -116825 -306311 -8300 45675 -140559 -161271 -34586
22454 -95473 -111487 200778 -21525 -67383 68894 116142 -102884 -153756 -124453 -22190 -140611
22443 -140611 -8259 -319761 63019 -135299 -200164 11730 217730 -53166 236859 151189 -111164
22431 -1488 409688 -399922 -55077 -234671 171501 -302594 40206 156766 118185 203828 -9600
22419 61914 174555 -402285 -150372 237827 386790 41325 -190523 -116956 -121081 -137759 168002
22407 147456 -62681 -238073 158091 224096 351873 89767 -122144 69955 -97935 -68784 -263006
22396 -263006 -309073 110260 -213130 241033 -197079 189159 -129831 -146632 -53693 -227360
22386 -227360 -224022 -188203 54226 67911 -235365 84915 191324 39075 -253004 -73874 43574
22374 -105425 -246127 108962 -90425 386262 -69648 -17084 12734 6308 172455 5761 -140210
22362 -83454 69952 -274074 39515 -52581 150115 -61496 276376 -268641 -98680 -186870 21242
22350 372193 -172589 69270 -51211 295480 -101387 -262803 102472 -144621 -42050 -228960
22340 -228960 8974 122268 244322 13571 -235214 -265168 426494 76425 287300 -52624 -2239
22328 -29503 -150489 -172784 61829 288044 -89768 -40965 50750 -208741 60847 76875 -12364
22316 -194730 -158255 4038 56768 -126061 -331956 -202942 -512120 -48621 -14497 199659 387057
22305 387057 -282749 -180416 17705 141062 45995 -219739 68912 -190811 -209942 89218
22294 -183671 21789 18688 -114568 -84407 117984 132281 11108 56660 -40236 -17955 -2966
22282 -186726 13954 154174 -126635 -26082 249699 50119 -85941 -189107 -107898 -125568 -81774
22271 -81774 -87260 -333214 193959 -323675 -55606 -140025 -121241 -59244 -41632 85159 -182150
22259 -14297 -76988 -11536 253730 336722 72981 310041 -264759 18976 -270711 -263071 50467
22247 -262167 -63866 106730 -18198 65885 39905 87643 188492 329758 -417878 18659 -323982
22235 -3538 154068 164247 298991 -158936 -171077 -64919 160865 61699 -179717 -71612 -97096
22224 -97096 145981 -137174 212211 188810 75412 152113 -58230 -16854 144629 -161724 -252788
22213 -252788 -328512 88353 220947 -8854 -66847 -255039 -298890 52136 -246438 -272818 -121733
22201 -334773 136869 200468 317691 -33058 -7850 -125252 -44410 -73561 85173 -133251 -73850
22190 -73850 -44946 232014 103865 -10847 -50204 67811 -171715 40743 -41136 -60844 148943
22178 -36130 87606 -275907 -31394 73811 60340 45887 -97414 -86136 -24566 -53075 -22963
22166 -142116 79546 -95283 1748 256719 96208 -82957 -201193 -5107 285977 -391615 -155302
22154 -233966 -31969 -137482 -52671 -16644 -2618 -11157 42191 -67286 -420376 27786 31776 -25972
22141 124717 -314158 224090 40529 -139117 179643 -307831 -101305 -245430 -161364 -297287
22131 -297287 139818 -101774 -126579 -72140 208760 -253842 -128998 61742 -58209 -56961 -245927
22120 -245927 -235309 -80933 68252 -78574 255968 188501 -86618 -90326 -40035 18119 -121040
22108 -164172 222718 -25279 -33704 -86619 227111 -136830 -94435 -103249 -98483 -101875 164800
22096 22821 -116734 33205 -240869 -138034 32761 -418013 -155756 43468 -291275 3470 -123984
22084 -378555 -111080 -87612 33934 -228391 -26446 214633 75049 19380 -86868 -96232 -83833
22073 -83833 -118274 110632 137540 81454 -112411 51433 45584 45183 221569 -42363 288289
22061 -123035 77922 -189608 -191097 90105 -14172 -298879 -44221 182282 -159603 225676 185492
22050 185492 133295 -76714 -133352 61767 -145019 411695 -234779 46688 -127741 133806
22039 202030 165327 -302171 -161795 128432 241918 306895 -182328 -87919 -185255 -78942
22028 -237271 -45738 80694 -129244 10411 48328 -12121 -184452 -285960 35550 72765 -89159
22016 121243 -382110 -17406 -83756 119453 -64794 -291609 -195572 -216600 -50138 -254382 152617
22004 62520 202283 -21344 -164819 -18103 114053 83468 -113923 -91264 -158936 -313862 113492
21992 -272529 -166106 -217432 -385643 66790 -433460 -156340 -140132 -16133 -8174 -292142 125099
21980 70820 12816 158292 173081 -91477 -331576 122126 -290970 -192745 218834 -138746
21969 -227299 4920 15197 20507 -156976 -182185 -184032 -27460 -139664 39308 159685 147424
21958 147424 251795 -19473 -169363 -144617 -14679 220822 201365 -265886 -252889 -138008
21948 -138008 -85687 68117 111645 -245709 -108464 273784 -95915 -85411 291566 65925 235230
21937 235230 -87589 -90311 -168829 -103441 178201 99017 14150 -103974 60401 -123039 -327133
21926 -327133 -128121 -182462 81658 -57185 -88608 100716 -94283 158009 -247125 152407
21915 -247203 75864 319773 -136872 -84652 174869 141992 -146885 138770 -38033 135115
21904 176903 64898 21503 205644 -89224 -372762 55255 -322015 -55699 -257088 31939 -84833
21892 -2347 106764 133586 -2815 -119695 -44046 170543 -148549 -199036 -137153 170739 171658
21881 171658 -125669 245135 -240357 -63400 -116398 -107434 -165081 40509 -35439 -86849 190065
21869 -64172 -284749 193281 40296 -639559 -301717 -168126 226764 -100112 -200767 64065
21858 -195083 -150134 21725 10817 -351678 -121422 -32245 -47215 -248138 146929 -28541 -202545
21847 -202545 72157 -59001 -286148 -276340 115370 277333 43083 -86931 276348 273002 -170075
21835 116038 -52171 -76120 -7816 -141054 29433 -238912 -129205 -213840 -85507 14643 -130206
21823 89825 77845 -168891 -38656 91372 108766 53747 -260860 55324 -310592 145550 199959
21812 199959 -329813 -22031 163712 -38824 -65405 -46918 124105 119432 284116 125358 -162946
21800 137131 21781 293408 -309388 -137913 -77509 -87954 33876 -108130 -101061 -471361 -30895
21788 -256038 150050 -109148 -57283 -14985 113160 -323260 -228035 -52304 -136927 77485 -23928
21776 161483 -478475 101388 -222882 -173926 -16420 206735 -554435 -331435 41050 -28987
21765 -388459 152366 258075 -416791 -101540 -34143 -108564 164361 -100526 -59422 -106029
21755 -106029 -105851 403907 244672 -362343 -164715 -363767 -175234 -366362 37426 -8142 -27390
21744 -27390 35974 -198619 -92925 254050 272885 -47228 -125101 -194298 -209631 33834 83381
21733 83381 -158543 -37874 38338 1402 -28566 109586 -8864 149820 -109049 4188 42917
21722 42917 8608 -200627 40137 -24235 -287197 -44577 135501 271962 194924 77443 -324935
21710 -295678 19501 -155348 -207722 -170157 139413 -262542 -37909 59381 -92787 36690 -28201
21698 -89720 58761 -80152 27900 -36115 -373 -33557 249187 -140066 -25865 43474 -179720
21686 -49014 345973 -135704 81415 9370 -170116 -102493 104962 -34793 -11448 -145411 13006
21674 -130876 219712 -292673 -69431 1458 -18969 -97469 -34312 57235 -541252 -368046 124141
21662 435725 -94414 -44644 -55143 -181487 75357 -26877 -195713 -53051 62186 151831 66098
21650 316439 -239528 -127961 -171321 52456 138532 -149447 162459 -354078 111399 20411
21639 -204434 -256467 136838 -178775 -13703 -190071 -330369 2986 -226842 73500 -254778
21628 47463 41724 -294971 -108420 -24970 207166 102219 73058 -125739 24887 320912 -180549
21616 -75057 -131483 122693 -97200 -117005 208852 21245 -330832 -45788 -107745 -16041 -40654
21605 -40654 156472 108370 -178891 -308261 -21236 32374 -74828 231675 56551 154846 -195487
21593 -96908 -117775 -276757 -339594 127246 163794 288296 -15867 -529311 -178669 -62149 31597
21581 95210 -70849 -95919 -487597 -413445 98451 149318 -201176 171589 73759 -153163 -101842
21570 -101842 -113904 -64740 249908 211356 77818 -340601 44356 -184176 -21118 -206968 -45269
21558 -58943 -71645 -128296 -71029 -10611 144067 -163785 32345 -75905 -176025 -173102 65587
21546 -47258 -54243 60990 92859 49753 -122109 -142470 -197845 23505 -207373 -48812 204558
21534 -259832 117116 444166 28370 -10929 240086 58169 22326 -126748 -327889 321756
21523 2787 -46721 -183933 -123369 71355 181397 -97316 -25292 -173097 95520 74358 25066
21511 16173 140216 -375444 -172969 -88426 -120935 -300616 26467 -335191 -127037 87098
21500 -146163 -253345 -421113 -150538 -114887 127722 -197704 -15398 289076 -170502 74132
21489 -52705 3723 -177371 67162 155916 97903 -202609 -41846 121991 213121 -146104 -24985
21477 -48940 -335515 54118 177117 -227284 62849 -254925 -71494 -92049 -66495 -138123 -69463
21466 -69463 150370 -67651 -74235 -124622 -194766 31664 -217747 -88692 169897 167666 64731
21454 -345591 -28912 176079 -141168 -114516 -30767 -69446 -89409 -26452 129988 -100592 20712
21442 82433 25429 -38804 -32690 -147854 -110275 25371 -1145 29111 -91896 56202 88711 181242
21430 181242 177818 -132842 -84043 -109153 -84273 353375 -166596 166559 -130333 -65405 51887
21418 -678 90312 270320 -98849 116256 -63702 234201 45194 -50128 -203632 57245 68138
21407 68138 189834 249008 -40491 -362563 -187758 -144884 -203659 -160619 74127 -227 -256659
21396 -256659 -203995 -162329 -126656 191261 102333 91212 -212661 -514720 30775 -144937 91261
21384 120795 -250423 212727 -56694 -154572 10441 181939 -41515 -136244 -184680 -153085 8430
21372 -26894 -27254 31894 43497 -75266 -230298 -44169 55660 95090 125004 144617 -259110 236818
21359 -56989 368158 85113 261693 244620 -166852 -13729 -166252 269929 161077 -232487
21348 41161 -22265 -105095 -609734 -107888 -266826 163530 -351955 -55468 -45811 28675 -107007
21336 158650 -214605 81220 -48652 192866 -246942 55598 -47795 222899 150768 211350 -1231
21324 -411186 150106 -288117 -94020 -308410 -252545 -257487 59723 -55880 -102823 -421560 111219
21312 -295884 -139774 -35070 -222716 -176322 -24403 -194969 -78717 141591 110490 -48163 57156
21300 -232790 4088 171695 145199 -49722 40780 -89518 -95471 -231528 -104798 -463144 -424061
21289 -424061 138910 138757 -253321 -83308 320520 -137529 -186779 -85641 284636 -401007 -276528
21278 -276528 -213833 -108024 -2359 19908 -70088 -44974 -133556 -56314 -105065 6644 -8802 166300
21265 35086 116594 -228120 9684 -4991 -128384 -224311 -50289 247856 -81107 45369 4718 4269
21253 4269 -31300 24567 -58676 -139890 -135465 -121662 103776 54208 -75239 -4639 111984 -120207
21240 176382 -1334 -61453 138945 -64444 -165957 -320541 -60574 6546 -197789 -109779 -78193
21229 -78193 39317 -90030 -25694 148812 -473523 -54044 118832 95504 93417 92490 -81908 95157
21216 -219456 -65591 -13440 53289 -137782 -147013 51509 173167 -146867 60831 70155 -90573
21204 -415451 -258104 223224 78738 -174411 191307 -242403 -264853 318409 -147650 41142
21193 236387 -41873 203774 -117779 -186909 -32547 88053 -2708 -28898 -141412 -119008 -315470
21182 -315470 -300161 -83019 69771 170619 13069 -151126 58620 -92766 -58063 -162757 -29414
21170 282325 168389 151500 -283406 -53982 153302 68374 144404 182416 93244 -13733 -96592
21159 -96592 244187 89886 -148855 237371 -197841 128682 -160082 -8788 -180970 -26260
21148 -21264 88870 -44633 6869 203951 94217 74610 191872 34068 -606 -213105 -11536 -6356
21136 -6356 37227 44665 -79933 73448 -76245 -274799 79551 -306357 -139925 -158815 -81006
21125 -81006 136604 116169 -63985 -11866 -122090 131057 -258234 -79600 -284575 24885 68330
21114 68330 -113658 -193553 -178386 -168065 -141217 -324664 164877 8938 84581 -100599 162285
21102 -230879 -209601 5152 -278263 -222196 -219972 -60613 -345534 -183629 124342 177339 184883
21091 184883 -105094 -213659 69745 -18339 122151 73202 318097 -352930 -19699 -117646
21081 -117646 -92788 51372 -49292 -120484 -121936 -28440 63334 -76345 106891 -75124 -19319
21069 -247441 -160906 18218 254744 -213417 -19580 -353385 181237 -65671 -188616 -230653
21059 -230653 316400 -80952 99300 24855 193534 -44419 18170 201683 347654 139232
21048 65048 294103 151146 14225 1049 210265 87648 190082 65562 -200066 -195913 -278018
21037 -278018 5280 -31696 -244274 -285889 -267231 -145574 -120918 89447 -82876 -232622 43705
21025 -331503 -234713 32140 -76438 -114383 46137 -186086 -72182 32095 -76412 71634 153634
21014 153634 -335143 -218338 9425 -271562 3179 219595 1776 -99810 112921 -220469 -28021
21002 -381001 -64081 170192 -204323 -303077 -133415 -104847 -93032 98060 -164165 -103485 -51359
20990 -102021 44741 -127613 -288414 -277543 132216 253510 -383407 -266840 148097 -216992
20979 -177186 -200890 -75652 -125545 -163618 -131439 235164 -152202 129778 -297248 -95869 177497
20967 1264 -18989 -31153 86529 95948 290488 116492 -35727 169287 172711 -177998 181946
20955 -320530 234282 48509 -79200 -203486 -92273 116712 44731 -154748 -211904 -329158
20945 -329158 197524 62126 -340488 15239 166637 50138 88805 -233577 -436336 199289
20934 -220306 -20212 117389 5495 -100999 22809 142205 -273769 -90405 -42450 42294 290117
20923 290117 3694 -29100 -295819 -229442 -192061 -95913 34444 -216291 -116861 -130060 -94389
20912 -94389 26379 -350010 58556 -91169 -187573 -187362 -293945 135714 141392 -61390 -324162
20901 -324162 -129887 -124068 -37722 -104356 202510 -337771 -340598 -163195 -52093 80682 214067
20890 214067 36020 -36972 75853 -42437 105930 75803 171221 238399 -99785 69476 -104143
20878 54395 -88903 61575 -16843 -77582 2116 -291679 -142338 -233307 -193497 42555 130097
20867 130097 31932 -12015 103216 -48172 89520 -356071 123084 -125129 -357697 -23308
20856 222257 -715 -47515 -143493 19942 221598 -111308 107781 -208478 -23366 -75687 69389
20844 19273 125236 -160126 102304 257855 -109193 79114 65275 128591 108879 115053 -136833
20832 -163936 -117261 138157 -200003 220590 128323 89070 -172771 36112 -109445 139330
20821 155459 46216 68480 180964 -131306 113865 56150 -94716 91488 -34496 -73983 -34276
20809 -105959 152363 13226 -59622 -185353 43125 -12268 -112925 -53499 104549 -197941
20798 -1271 -130770 242732 341660 -455401 -265210 -70674 -197857 51066 -12236 -93906 -231200
20787 -231200 11118 -123223 -202095 -76464 -124846 -15939 -194208 18968 -188743 -107010 -128449
20776 -128449 -3253 35501 196489 -139721 -222543 884 -380487 -317735 242325 -109781 45003
20764 10223 1678 155810 -66150 169416 -104167 46606 -283989 -284759 -201485 -44826 49695
20752 -290387 -2018 162092 -226947 -384494 -285219 68773 -113278 88869 372111 -115045
20741 -146836 265501 -279544 290449 -512817 32599 -160136 19257 -152814 -126040 181854
20730 255194 108519 -95090 -370839 100245 -161351 -116107 15972 -455438 42861 20509
20719 -58987 -129022 86861 40874 -232376 -167408 -63041 -95106 181807 -260665 -194828 288228
20707 -289583 -583765 123866 -305380 71571 109121 -146749 -174470 74657 303528 42712
20696 -57802 134215 -94444 -249587 -273100 -170167 -332410 27301 -120155 76054 129620 -197048
20684 100130 -55840 -101957 435841 -103589 241102 -21158 -72873 -112569 175396 -84031 4082
20672 51179 -44466 -110760 152845 -67170 86089 14976 -252232 -195801 -44164 146412 -57158
20660 -289947 -115525 4267 -155313 107772 -582584 -146017 25068 -97236 -166126 -96956 37787
20648 172949 -208032 -148350 -249027 64257 -306840 32462 -22509 49649 177266 31417 -36207
20636 -105194 106149 -21208 -187159 99374 83691 -222110 -55109 -410801 -169606 20931
20625 -452838 -75048 -38703 24897 -259895 -31280 -49224 -40458 24752 -79026 -198137 159657
20613 -11008 -49429 103613 -174033 -206441 205959 -13535 73090 -28075 -141819 72861 -37279
20601 -110908 -9440 -160591 222670 -208413 -43480 85610 11893 53905 45278 -47573 -5290
20589 -260793 -274623 -332066 -235763 -212252 -243135 362831 259063 -295519 -472098 -157320
20578 161694 -206262 -76589 169005 -229631 225329 213211 -122095 -123988 45124 -170546
20567 15579 165374 -50645 230843 -187990 -72889 -4554 -144900 -209260 121227 83509 61290
20556 61290 -169496 -37853 43854 -69085 25502 192077 -71077 218511 -252546 -57375 55215
20544 180231 156046 -88948 -27446 -208884 237880 86707 38943 -344926 -158163 -65882 -63553
20533 -63553 -202465 101681 -202518 -95729 -303261 -180670 469514 -81437 -244795 -6694
20522 195651 -161477 87736 24016 133309 359067 -392832 -174737 15480 64611 -173048
20511 47560 -292748 -8469 -110413 -303739 98834 -222661 -14392 39360 -176293 7518 -228389
20499 134023 85066 -247264 -259119 169790 -181076 -123800 -200314 84363 -114064 -170953 -226040
20488 -226040 -301367 134932 51472 -231916 -320558 -166112 -118204 -70183 294934 -217476
20477 -256990 45387 -162043 286576 -108954 192267 -90197 211677 131147 -218804 -175189
20467 -175189 -226622 -328773 20293 -40832 -28545 -113097 -250386 122293 -81053 148503 144173
20456 144173 -20779 459229 -111309 185242 203252 -131337 -224433 -49393 37269 154058
20446 154058 326060 169369 -352740 -96502 29999 153313 -55168 -114586 -177329 -76043 -111117
20435 -111117 -220081 -49008 -18597 214596 115251 20738 -180567 -361983 172720 -47707
20424 24625 -234641 -282054 -74430 -253630 117248 -120548 -312312 -264163 169494 -141091
20413 67736 -170359 -366735 58509 246387 23680 183314 -86172 264974 -190494 -62661
20402 -247630 -49972 -235499 92274 40350 35048 -39155 -153585 97057 -294858 83239 30537
20390 90662 -11734 107497 142803 -205741 -220325 -59619 -64974 65060 -17683 -17377 120877 -23044
20377 -137811 -165220 -270399 -169433 -179927 58475 48848 -116438 -149058 -14097 15157 6235
20365 -198400 -201953 -113402 147944 -218027 310191 -162488 -9211 -36203 -194618 148298 -124328
20353 -168550 238693 127377 -30900 -132837 -45265 -28846 5094 -119004 -197739 64393 -27607
20341 -103702 -185172 124240 -80576 -290463 -72869 -362934 -309402 22434 -182155 -334017
20331 -334017 73719 119554 -406128 -154517 -74104 91395 32033 105023 -79707 64975 -160897
20319 -10288 -81385 -181645 11327 1290 -161194 -425136 -199720 115926 -150829 -216181 18006
20307 -82263 -553740 -126783 -155210 -291226 -297905 -85928 -30788 -212145 47245 65897 -414573
20295 332646 202990 156872 -616921 47442 -15346 15903 186474 -133057 -16390 -285212
20285 -285212 169889 -126295 -30943 48166 -164320 -31291 -221343 -36435 -110636 -247665
20275 -247665 68394 -210333 146501 104388 -209228 -126110 -225327 -50390 -18279 -246766 -83113
20263 57237 107689 -106537 -279584 185568 -124758 -146470 -148090 -24652 -32265 -211956 -179935
20252 -179935 -144039 128427 -147605 498 -136089 -153749 -165614 -67446 43192 137056 87697
20241 87697 52344 1636 -69693 -92904 -126568 -157259 237599 201479 72067 -270819 35498
20229 -40738 -51986 73582 68746 76829 120281 -139839 -50192 -89198 -3447 -111108 -204048 -190469
20217 -190469 -211517 10602 -420537 -236479 -99687 27154 -18766 -110296 90918 -139358 -61603
20205 -149640 -42699 404779 -518097 -81166 116707 215511 -24370 -62110 -222190 -331599
20195 -331599 130344 29717 298885 218208 -119117 9266 83167 -111245 -75188 -23193 -336005
20184 -336005 117075 -227041 36605 -257104 73066 42967 -248316 -168903 -60952 -34891 -56309
20173 -56309 -129087 -319460 -174242 -388874 -467120 -241038 38191 -120324 -294611 72937
20162 5480 -337762 125491 -175175 -35331 8997 192307 104483 -149996 52048 29527 444835
20151 444835 -216977 178791 -62479 -35015 -5176 122451 241284 -119291 90700 -90316 155175
20139 -110002 -207884 103126 -439707 -149484 -63081 38403 160717 330869 77342 -519980
20128 -129640 -23696 262961 -190134 -96538 -207055 -181576 131313 97136 -200217 115977
20117 86752 -267552 -58001 -239766 -196335 -76175 39191 13917 120306 -11109 13141 -273683
20105 -108723 96902 -100226 150230 -128267 -93001 -519452 -32290 -295915 -366015 298392
20094 88355 -20043 -83359 107914 -91832 -200981 121474 -280182 42817 -84446 61430 7768
20082 -124835 -96370 -129411 -216492 -132081 274910 95341 -23857 95303 283281 141304 -216002
20070 -282985 84734 -113401 146950 -239262 -129983 -140083 -26453 -51630 93378 -60104 -160528
20059 -160528 17236 -5700 -201092 -240582 29893 -73619 -486214 -186883 -127097 -140894 -46729
20047 55134 -157345 -113056 -119416 -164868 -61661 -137039 -165029 40259 -131726 32631 -358 138410
20034 -23818 121287 -79657 -202712 187732 -183395 97192 121828 -28988 -33335 -450228 89125
20022 159928 -72762 411991 97684 -313229 -105474 90391 -231381 -120978 -71043 69307
20011 -97729 -294865 -4821 -300642 -307694 -252301 -131688 -9339 -242410 133845 6015 -51450
19999 138780 -44734 29574 -14303 54610 52558 -181600 -62227 48222 -231594 285275 123497
19987 -142745 -104299 -245624 -138788 228806 268915 146960 -325059 -70728 -215141 148454
19976 -106413 180535 -18488 -151827 -485033 146778 110178 -73987 -245274 51515 60971 177871
19965 177871 177859 14867 99710 -106156 -380912 -111560 -120525 50355 6625 -165476 -104282 -87035
19953 -87035 -123482 -69782 120367 172198 26833 -134536 -124807 -100401 19750 -36581 -406872
19942 -406872 225068 278147 -117139 46478 -138311 -342087 97773 58257 -7355 -144630 -179312
19931 -179312 -157391 -37015 180142 -122585 63721 195284 106716 -110985 160220 -151594
19920 33169 -90061 -93879 86900 -49753 -94466 -169121 50972 -37980 -198294 266786 -90748
19908 19946 -122552 652 -91169 -36674 -277240 249446 -168669 -127902 30445 123991 140280
19897 140280 -93196 -6495 -102405 181603 80536 71574 -73216 -61311 -89410 -70021 1743 59093
19885 59093 -89385 -275632 27181 177400 -68543 -11477 46168 9408 164501 -193138 -142240
19874 -142240 -267737 76617 -64199 -349988 19316 -110609 119589 38110 -251583 122988
19863 -206872 -103091 -108256 47502 14677 8336 -400069 115888 -170891 143414 159950 -34404
19851 -3385 -296652 203682 -256762 332801 214257 70351 -166527 -40580 13194 39855 -83514
19839 51796 -385939 -245596 52989 -206494 -179588 -54349 -198066 -48062 397347 92767 -122106
19827 -394460 28517 43185 -61446 165502 178214 160654 220816 -44590 271104 99029 -379367
19815 -105407 40580 38226 10838 -219315 -147661 -199796 34360 -64024 -55419 -54151 -83031 -154948
19803 -154948 66793 -156323 -124846 119529 -108253 -139932 -3478 150243 -244662 -66383 1040
19791 -138023 -284059 -77294 -6094 -188322 94598 -112246 -223922 -311503 433285 238058
19781 238058 -3695 25359 -83619 -233197 -17423 -175741 -139221 -229216 47863 -300403 286519
19769 -105223 -319411 50689 -87120 -129199 -173291 -25752 -206985 287993 43319 -167610 -99441
19758 -99441 -246776 -29274 -134511 -339898 125384 149690 -51828 -99924 -225719 -241920 -297584
19747 -297584 -82505 -143941 75498 320488 -14751 -42235 -34189 -91563 127520 304 36432 2829
19734 214693 -162711 100715 189260 -110033 -125125 -159091 184410 30558 -262998 -169391
19724 -169391 -201589 -6539 -38580 -166682 -10148 5573 -319440 167280 -160053 -12900 134628
19712 -53860 25458 28297 134507 -192830 2579 299469 -263359 -252992 111803 132909 -77324
19700 154974 -402293 -53952 48630 55856 134749 -211199 -198760 128265 406194 -280089 -239014
19689 -239014 -431224 74972 256230 6626 27405 -150045 -127762 -175357 86378 -141320 158532
19677 75982 70634 -39142 -5769 -134656 -70347 -404715 61099 -16154 5024 -116643 -61879 -241258
19665 -241258 -42262 240173 -366986 -200367 27430 -92347 75118 -65017 -273732 -92531 15852
19653 -57328 140184 146274 155128 -80289 73202 -113335 -342050 -249409 -49964 -26830 222418
19641 -138125 -74797 16023 55316 -51917 -94589 -32784 -267627 1857 22896 -314621 -54267
19629 -157994 -172081 89406 -36160 -7156 -11421 74395 -277577 132253 -17025 -123480 -138464
19618 -138464 52017 -17238 141944 -4861 -66642 -3839 77533 -35431 229736 133525 -99830
19606 -7418 -18595 -175589 189112 -100904 -492665 -98942 -201588 -135460 64521 -250427 89279
19594 -34333 207716 92437 -186271 8358 -109473 -371242 119772 236521 -45465 -106937 -117793
19583 -117793 -240972 121378 -2664 -25635 -49639 210948 -255385 -324919 -140472 -19610 -260702
19572 -260702 -25420 -36865 -113643 143502 237474 52311 -217784 -355060 -168535 -150936 -187723
19561 -187723 -76633 2995 35560 -2257 25996 -201331 133189 -169990 -16235 -82331 -5019
19549 -290540 139222 -154378 -107287 -25937 -40645 -281123 135505 32575 -62532 108434
19538 -224729 -109167 -143211 227098 9139 142097 -23515 -214811 101353 98311 -314255 -325621
19527 -325621 106117 96155 -307402 179 -125352 -166015 -113728 -114401 14314 -21236 254729 -291762
19514 79763 -362872 -29328 -38779 377861 -136866 216113 -149480 -19554 91051 -76322 -159919
19503 -159919 242346 220630 -451389 -66590 -115748 110049 -57756 -264363 -26243 -36372 -28521
19492 -28521 -281286 76300 248481 -115815 378023 -206605 26836 -260204 -86284 -239590
19482 -239590 301519 24105 6538 -139852 3513 159539 6 -15744 -80852 133770 40724 -4180
19469 163440 -170982 -249327 127835 -137564 -54181 233816 -23825 -485354 -74750 116054
19458 -198788 91947 53471 -260251 -50328 -2818 -93457 -161822 -191147 26198 -39267 114586
19446 -171849 -101484 -196577 -180681 -188143 -77150 -258827 -462255 -201769 -58274 -78782 -182602
19435 -182602 -74626 -124383 -150852 -150486 -191263 -234734 9252 -278618 -218423 -134720 -162885 -204114
19423 -204114 -65917 -148616 -346571 -95896 268389 -20148 181227 -171942 -60570 -172828
19413 -172828 -363169 -588570 -171811 122404 -82743 -418266 -20564 21718 -240702 -162889
19403 -162889 -515640 -168294 -205276 -131547 -197870 25132 -66882 271349 -16545 -253196 260176
19391 -61058 -131554 131819 -363072 199816 -285311 -229177 -115215 -55813 -83821 -477045
19381 -477045 78720 277042 -341168 -38297 -119253 -118559 171538 -55556 -20574 148965 -17474
19369 60487 -59220 -58804 -447331 96666 -186865 -50285 237500 141152 -155357 124748 -242900
19357 -425114 -48399 110785 314218 50921 72958 66416 -114476 -97717 -108695 198418 42897
19345 -522291 -138028 166718 -48460 -46035 7520 242565 -54169 -103000 31195 -76889 -198068
19334 -198068 -14843 -309841 9352 76816 -29272 -399062 -15121 -143314 18539 -204302 85415
19322 -82320 259596 -203858 323727 141917 -172360 -76122 -124953 1183 -32183 -114018 -46325
19310 102673 129318 -164867 200105 283016 174069 14559 -16331 67594 206991 163936 -272305
19298 -289472 -47737 -40826 83444 213378 229796 -158032 -198362 -150885 -8151 -121279 -160076
19287 -160076 -80476 103258 -268955 -315486 12747 50764 9571 -185936 -176944 -137658 34012
19275 274613 91214 53085 -423071 30012 -105263 -22412 -136446 2412 -30229 33876 -144079
19263 106361 -65517 -41988 -70197 -381736 113938 -152383 141133 -174122 -70631 -2772 -85043
19252 -85043 -36160 347891 211217 -238806 9726 -354432 38825 -446882 336859 10322 -3436
19240 -185139 -130692 77757 62298 -104857 -160061 42144 219942 278879 75110 -15987 -177539
19229 -177539 -83213 146700 210605 -210039 -19681 -197476 -2865 -213757 104988 -119911
19218 -234917 -330479 179287 -341049 -60601 -229158 173527 4290 152568 4544 -98393 -570367
19207 -570367 31873 -34052 11464 56440 114878 -400048 -254822 82450 50360 262697 10265
19195 -100575 82904 -78884 -63502 -90507 -59114 -137557 -26737 -28006 -219673 -242182 -102799
19183 2332 328059 -599834 -21912 -324824 -182761 -5356 -272893 -219204 -313668 -221579 217014
19171 -252597 51891 302851 -292805 -148316 -5214 -52526 78226 -8541 106138 148116 -126458
19159 -330426 -24432 159695 211755 -107003 397662 167592 154993 7109 -227448 -27738 9133
19147 141513 304264 89893 254555 -188008 333472 -293325 -76785 79432 99635 -346537
19136 256437 124507 -37291 -142831 -134659 84149 -25788 -127049 32314 -385455 -14377 -39243
19125 -39243 -52649 -104127 -154239 -107115 20445 -10770 -353039 -215783 -71150 -779 118968
19113 119800 -251434 -123666 -40510 -68355 -123090 -223746 10166 271637 -131004 -107931
19103 -107931 38728 33208 35262 -185031 94206 106403 -109327 -185555 -102733 -255374 -232931
19092 -232931 -133076 249519 81338 -223043 25097 -7835 63313 -24948 222163 260831 -188990
19080 -95678 79315 -289302 326095 -82340 216800 -159260 -170801 -44325 131102 -39053 -275517
19069 -275517 -277778 -280484 153032 -177048 118041 -174521 106838 -321001 -66653 -125803 77582
19057 22751 -74330 -59057 64838 -88051 -141593 -46677 -135789 260803 24128 -146688 -256025
19046 -256025 56285 99013 221551 -149035 -47825 -329385 130411 -41908 -348531 -243120
19036 -243120 186642 62277 -37099 383968 -192 100996 -56196 -98450 -112939 -100096 -362896
19025 -362896 274271 -175146 122395 447977 -52514 200152 154353 -180306 274384 26185
19014 362639 76048 -238344 143213 66719 128003 -13369 -217175 -296523 76933 -135991 -273194
19003 -273194 -188155 154657 -96242 24442 73278 19151 95499 -246735 -52354 149811 162901
18992 162901 117602 -22828 -108969 255181 -164596 -174091 140968 253602 -151276 -160499 54787
18980 74483 -241310 -241460 -70785 -183088 -348046 143473 127412 -237014 -87817 -81590 -338305
18969 -338305 -279546 -42819 -45465 63689 456442 -302258 -209258 222033 231717 -94146 186009
18957 -162448 -57036 -218481 -108240 102783 -65574 51446 193111 -66172 140778 -134823
18946 -51644 305958 -354053 227082 -198132 39808 -24124 -111158 -439799 97332 -179818
18935 152851 -148008 -63517 36490 -208483 -70403 -29293 37477 294811 -185407 150111
18924 -238274 -49317 235302 444646 82315 -144454 -277600 -145942 -157601 -66845 226307
18913 -130634 -217764 8082 -238865 153344 376271 -3777 240760 -199661 11871 390291 242166
18902 242166 107910 -57442 -93420 223732 36009 -17567 30832 -71353 -200300 -14788 -141825
18891 -141825 124591 -44507 -103579 -80712 -372503 -5655 -413968 70091 106225 -166006 106692
18879 -203466 -191268 241396 121998 -309466 -19863 -115211 47534 -51117 -158661 -87209 -68732
18868 -68732 -121318 -21260 -280158 -216279 -163766 -249220 -227674 -511046 33023 -21362 70665
18856 -167920 -282477 105809 -357110 -161625 -87900 146084 51414 -48548 176653 115936
18846 115936 -165862 -63900 235268 -60597 -14439 -207711 -143033 -228175 59930 103727 109529
18835 109529 108051 210636 68736 -358248 -134356 102907 44369 -398644 -195706 522345
18824 -307445 73209 39582 41777 -22577 -12267 97277 15405 -253985 23445 -79790 -247518
18813 -247518 -3759 -204152 60982 -52559 -214599 76304 30612 -38890 116671 181772 -84037
18801 240942 -109604 249385 105015 -99195 -41244 143170 -67579 -46643 -132987 -67457 45404
18789 -129676 43365 -199019 -302957 -156111 -106550 173118 -39616 -66685 260469 -31465
18778 -211573 135314 -130019 -118487 88721 -124899 121618 -46679 -29390 -314878 28668
18767 113102 107461 -33119 29073 -189799 -100852 -200437 -63684 -274537 -362374 -386430 -107147
18755 -104219 -98591 -126400 68418 43836 -526410 -5573 112030 -345407 -28878 -382419 -220309
18744 -220309 -521845 -59387 -163783 21622 114754 169988 -109333 -177079 75217 -269500 -430317
18733 -430317 -44081 -183100 -252203 -41756 5070 -147308 15515 -205809 42658 -100685 -323385
18722 -323385 -221620 -131703 -247956 -300351 -61879 -190723 -75029 303339 233995 258155 360060
18711 360060 -231793 -17964 -214703 -319200 -105840 -13164 -89463 109684 -6384 -80013 -288986
18700 -288986 112978 -309306 -10853 -62302 11141 -86969 29912 -164770 73420 68671 -129886
18688 297891 -20618 -238103 89151 -116609 26173 -18486 227913 -143135 79273 183042
18678 183042 -21882 -181891 50739 -159475 -44912 -142929 1639 -282631 -67052 163605 -253857
18666 -130314 -175866 1489 129701 181310 -13874 27268 -237200 -144225 152366 -32217 -263533
18655 -263533 -132815 48555 -262135 -102358 118983 -2182 -72949 43085 151681 -9345 -150166
18644 -150166 185540 -369394 -152120 -334911 422182 41820 83442 334 -48286 88781 -29065
18632 80103 -320591 -365864 -1844 -44406 29331 74829 47718 135108 116217 -207489 -365892
18621 -365892 -47237 -180574 19892 131402 -349900 -250997 -331452 -59886 -215632 -224097 333868
18609 40063 -26877 54337 151232 -110334 145170 140168 15409 552337 -74276 23183 -208063
18597 -76634 -85433 -461703 114111 94981 -20558 95393 -141048 -12305 168744 436 141289
18586 141289 -15941 72427 4166 76467 -84095 -16678 63967 27035 -72637 323510 293577
18575 293577 -165565 -133750 -144227 -4877 107905 161370 -33205 -191746 -11477 -41527 -168468
18564 -168468 -43264 -101489 -7461 99080 -260855 -192035 -90256 -51940 -296169 -276687 -412762
18553 -412762 -152784 311088 108481 346522 16566 4883 -79316 83437 7504 -33508 -15503
18541 -44311 51363 14950 9897 -262434 -194592 -107521 -363631 -397814 -111743 -113621 29990
18529 88519 -110193 2289 181549 128495 -116030 40554 -205406 -44519 212588 87355 -15713
18517 259768 7300 -22013 -40020 148238 16534 -94754 -73348 -276930 -428019 -67491 -160420
18506 -160420 -32501 -311388 168337 -46403 -46593 -11542 -8427 -319779 42355 104306 -311427
18494 180511 -21207 280422 -283779 -247373 -156724 24670 19282 167005 -422833 -210820 -31395
18482 -257023 126988 -381836 -118054 -291669 -65624 -344593 -218128 143281 157825 -122307
18471 -132424 -381838 -221405 219618 65957 -384670 -141175 -118699 -175247 48005 -374304
18460 144784 -103694 -195364 -250512 -79274 -40043 -24558 -207870 137874 -230481 -82731 -285056
18449 -285056 -309066 -167833 -17031 -126087 -51400 -97417 -246904 -63912 -109948 61658 120215
18438 120215 -230002 71751 105289 -160626 140947 -391973 -103598 -262433 -6148 256639
18427 -159569 -73789 -187046 -253927 279722 -144557 -141345 34399 7422 44265 106826 -206445
18415 11064 -203207 88459 -53754 255949 -75060 -4602 -93829 346728 -154683 61972 -240087
18403 138832 -194380 -129577 85693 -77373 -55568 -116307 284188 -44313 -40518 -10509 56740
18391 47504 201420 -184916 -40564 298903 -160264 -408991 -162779 -74273 120068 10976
18380 44114 -547 31957 66243 -354395 162597 58525 -295960 93753 -213783 282035 265318
18369 265318 -506972 77355 -360268 -381655 -136760 -130873 -18053 -300681 85582 305653 179377
18358 179377 349065 -200633 -133125 79828 -68264 -147113 121122 184127 317790 -97568 -199298
18347 -199298 176224 23019 -266801 -63186 39538 -227982 159506 208777 96733 -128825
18336 39894 190297 44961 -231761 -235936 170146 -129405 -411644 -112922 -17181 -140728
18326 -140728 10198 2848 -172788 -4293 35041 199076 38268 -54626 141316 241006 -9466
18314 181458 -331731 -73280 -24793 113010 -146538 -348530 -4766 -13509 -378323 175525 -8898
18302 -215950 26106 -290128 -219995 -117307 -44947 -158337 128849 -1122 -276788 80309 -213618
18290 -51193 311780 -115270 -35556 251452 153326 136785 269945 -221785 -138524 -143633 -91974
18279 -91974 -130621 -194759 102554 262670 155652 288941 -28846 2592 289980 5383 167585
18268 167585 -249983 182238 -132435 -170535 -12607 -86846 -412732 -317533 650 -179738 127522
18256 136051 -30126 37172 -242043 -47266 -85068 -135729 276245 -266917 115439 186217 -160879
18244 66817 -316136 -87506 -73510 -450567 325884 -239923 -79418 74806 150607 -246950 27898
18232 -45135 -45417 68981 72484 -235826 -93407 99832 -110450 -67274 -71972 -23436 215136 -329009
18219 -230497 32509 -263944 -4593 65937 -396077 68322 -46665 -244906 205144 -34325 57341
18207 -91348 -23265 361494 170092 94569 71980 -170401 131534 -268370 -65213 47673 -268349
18195 107546 -375404 -381865 173013 -116030 -108916 -176548 -116098 -95511 -110312 -40885 -11222
18183 -98353 229381 38952 116462 -244144 -201300 29360 13434 135901 -222283 -16954 39691
18171 82627 -162211 106272 -242051 8540 -114673 146909 -3615 -264165 230007 161518 184304
18160 184304 -11326 168616 -76860 23896 149363 -88700 -273537 -363736 23697 158936 -162457
18148 291220 -297542 -152449 -32395 262180 -91468 -127082 169405 229880 -155645 -224003
18138 -224003 113396 208465 176528 -285614 -18390 -93237 144491 -5583 -44985 -461749 302155
18126 51519 -181587 102927 296678 1103 -117117 187394 -80356 -94655 201838 -212406
18115 -138346 114783 19364 -86548 27297 -366837 -106777 -117093 348578 90658 285593
18105 285593 94878 -86329 -237956 -22973 398440 -217148 -79324 -92463 67144 580 266863
18094 266863 -36558 24655 241285 263024 -65635 -109251 131744 -130135 -426548 262497
18083 69811 -66271 -72463 -345767 103130 104682 44846 -119317 -193513 -3245 23397 -31368 -76401
18071 -76401 102139 -82879 216427 187625 -68458 -459917 173291 115772 -112963 155179
18060 114263 -91906 -230088 102375 -20519 24314 166458 14932 9207 323119 -43852 -62828
18049 -62828 3947 282368 223816 -204478 -166089 -36810 181337 -136554 -206276 -293821 232402
18037 -104434 -280682 -204698 12640 71767 141535 -21863 47328 158942 139663 -23768 -42885
18026 -42885 -172370 -54550 -9037 405211 -84408 -98769 -58524 -300723 -141460 19847 -39708
18014 -158187 -45443 250545 136158 254168 372872 221877 -43397 57465 30893 18313
18004 18313 103075 -177714 -213720 -344427 -237124 140877 249714 -142823 417584 -122868
17993 266408 -117329 -16173 96807 -205115 -74577 -166334 -2810 -5 -36597 180084 -186102 189141
17980 -293761 -119570 24147 27411 33415 -47016 1204 -104163 -163502 -232947 -303668 -150867
17968 144949 -215212 55178 93488 117901 133494 -231373 -23656 53890 -29371 -214648 -250191
17957 -250191 72571 -91304 161668 -180612 -405246 -2701 -18743 341276 133940 62296 140169
17946 140169 -24785 210439 213800 -174067 -7055 233331 -307907 132105 -396790 -112689
17935 71342 117587 -82111 -293354 -325366 93982 -429556 -233704 -76603 -213922 -10031 -102946
17924 -102946 204065 -157743 165740 180423 159990 38468 205876 -157632 -18517 8230 -133713
17912 279626 170412 82618 -20425 214017 202390 -29118 19116 21218 56153 -80934 -174190
17901 -174190 136021 108647 -17902 -221227 112438 -39448 -2252 -290416 254063 -174077
17890 -195681 70924 -101741 -200931 94904 -273725 119176 -370171 -409657 117502 -157856
17879 -46530 -150187 -87094 -41948 -172913 -199538 -144665 -108153 -77587 -115519 -136574 21996
17867 68852 -124534 -210357 67636 -263318 -64490 -88433 -214318 -158596 -170783 156740 30201
17855 75541 -18092 -86900 -283006 -83910 168114 25732 -102657 330263 -49586 -129944 147082
17843 -148020 -143892 -3253 -22194 -8944 89214 202898 238972 -115806 262725 -42055 170333
17831 301977 154962 -190079 -97669 -206838 16193 -250221 219724 -353627 -37425 -121546
17821 -121546 115635 -56648 141725 23296 183771 375979 -226685 54283 -94060 -165645
17811 -165645 66729 50470 -175620 -84453 -31596 268839 122440 76421 -153148 -28243 -152354
17800 -152354 256237 21297 -135647 13298 343862 99069 -210364 -29008 221491 -62729
17789 3742 -92130 -266829 64091 -260354 -160595 -259513 1567 395967 -149390 -37736 323242
17777 342811 -15124 163539 95387 74604 -113556 -66595 -149067 39454 247034 -188163 257274
17765 -225110 152767 14476 -169276 -110405 82711 -166977 228820 90820 -101573 213715
17754 64391 -38432 280165 64398 -83945 -49751 -114164 194942 535783 113444 -65493 -78842
17743 -78842 111644 76901 -332152 69746 20681 282311 35373 -17217 274002 29313 -137984
17731 -14490 143521 48343 -191695 -121676 262919 -105487 120470 -22067 180411 -59579
17720 121726 287019 46750 -122142 279885 219082 122400 -265492 -239690 -299311 252938
17709 -195603 -118248 -86052 -110130 79880 -123257 3339 -267369 -431499 -121728 -308482 20743
17697 206926 -34305 19932 10898 -1005 145710 -21113 211516 -104938 135461 156134 22495
17685 88613 -32247 -76029 166047 74235 -58187 1940 -202979 168359 -260405 35485 -83584
17673 300036 -292279 255902 -110236 207535 38637 -6268 -125355 90929 -50894 123658
17662 -197474 -26058 -255786 -214396 -146185 304262 187207 -60366 333794 -192887 157319
17651 -290550 -74551 -113617 -24195 351165 207471 -39255 -346091 131408 54224 -444003
17640 -48148 41742 73892 -81300 362205 55094 131347 59295 25126 213974 -121787 147325
17628 -34549 -365140 -120018 94222 -162097 -72279 115262 -304031 -118054 132000 -53251
17617 193320 -263399 14568 137446 208212 139239 -151603 124831 152800 -63994 116954
17606 -2379 -52840 -26218 -33457 -117665 38447 97251 52942 18382 78085 317390 -216778 72385
17593 -299254 -91863 34870 223497 -399181 52920 -243579 6078 232326 -99437 253036 140046
17582 140046 100917 64418 281529 -253680 66434 302834 114925 254501 -132609 -82900
17572 -82900 -47698 -33908 -82020 122674 -342984 85932 -111007 -56661 36321 98097 -92066
17560 241082 -128759 -132780 144184 -32764 -43934 -10147 -193018 -176371 160618 124482 -16637
17548 -272001 -170043 -37720 189441 85407 204603 -25847 300922 -74020 78015 -96767 177063
17536 192014 -186654 165074 16960 -71767 -290737 52792 -109288 31642 -110286 -121963
17526 -121963 -26197 179643 232439 -95032 4422 -65016 256965 186799 164763 -78646 50160
17514 399786 362884 6836 456700 197241 -207157 -286615 -27472 65648 64349 175543 -33266
17502 -996 -23465 230415 36083 -87833 -76408 182710 362294 -348402 97931 -111216 9874
17490 120071 -16484 289494 165899 166675 370041 10081 91541 350757 174772 243077 59252
17478 161560 -159345 396156 -147821 53554 92389 247649 -325285 328160 -18760 110020
17467 -31270 174862 219624 -132001 113023 58103 6071 -157002 191840 135654 -3363 233836
17455 -11055 73634 273918 90151 -102546 170007 414852 235775 -169448 -198611 358301
17444 99095 -4438 146652 2924 168608 272067 457580 257033 305174 163976 133781 268451
17433 268451 223771 199913 66548 80782 210652 78629 125031 119820 316986 308733 343643
17422 343643 287726 86636 578533 259132 61884 296032 186176 260167 369626 132412
17411 290387 45958 -262154 369746 431980 277000 298550 361732 241428 365192 8990 212742
17400 212742 110619 -76194 242273 286314 67733 232721 305808 168057 300743 -13238
17389 179884 246384 207804 423980 -289843 284064 90804 102750 -39245 -197614 330472
17378 7949 -19436 6937 49740 147687 -41551 121795 115556 310540 114394 89944 267873
17367 267873 21854 154123 194605 55961 26255 103702 -119660 -11353 152248 -976 260824
17355 116862 -286427 102276 290699 -177907 81131 25306 93693 87175 -95045 123650 64986
17344 64986 172412 49349 -672 261027 -15767 289268 217420 320420 212178 74644 290167
17333 290167 -114728 40351 331288 218675 105179 33661 41178 136967 98766 -457040 -144551
17321 151101 217320 -55564 249524 -61616 45775 197631 66729 197466 4355 -165357 83845
17309 381682 186488 -44846 64883 313821 5120 -122298 -76115 287891 -59502 -37260 27473
17297 225270 34628 108484 -106064 144494 259932 308673 200319 133023 155378 138867 -5816
17285 67382 251439 123722 264865 309623 284895 230013 262573 217950 -200608 238749 108713
17273 116646 281604 21605 -93686 169249 316303 339559 238309 -36417 130733 267141
17263 267141 250734 154429 41243 -42723 178583 -194508 189495 284299 -7386 118896 218870
17252 218870 144771 107594 478645 -335226 405818 -151969 311465 265394 -297731 238157
17241 -380817 269780 87668 80865 270452 128591 108515 200784 171397 230111 482939 -173029
17229 -201657 355647 52740 -181840 150101 94744 180141 -11396 151888 -5010 53387 183382
17218 183382 16705 499963 206864 61389 112128 83298 344409 274118 203195 44950 158240
17207 158240 41756 -88351 -24153 -35084 294847 91442 95943 268979 69156 265339 136693
17196 136693 278233 30520 275062 -161716 -81069 125543 324667 173688 138281 -179952
17185 12734 117461 283052 307071 247510 98555 -96977 -15413 171466 6374 -42599 167910
17173 76561 118161 268703 196819 305234 162513 48924 241768 22545 117716 -68156 394233
17161 119858 494365 -148699 92844 241574 506062 245023 166687 375650 251508 -43937
17150 169513 135527 287410 353217 -76705 326491 47305 450555 175968 -39703 329984
17139 580339 190534 281474 155845 -47896 231344 294118 74132 490697 357355 293177
17129 293177 471537 309051 116767 83025 327806 69314 342344 509300 101217 -33493
17118 333477 400859 368914 513213 -70777 -28327 147182 371526 531298 514522 404168
17108 404168 299266 50377 327990 -75168 268698 384963 481632 336272 305572 124793
17097 485446 281700 164887 270419 460858 506405 247688 341940 237853 450750 144129
17086 479478 510229 335912 347133 467735 56936 151493 116969 432078 440264 366194 383460
17075 383460 436315 326721 290908 297481 308450 480222 642023 318162 344389 405020 191763
17063 372220 377028 449521 330317 409146 478245 437110 413955 544415 295963 58688 303810
17052 303810 525187 493680 329594 751671 391959 269830 610298 84868 235965 271622
17042 271622 266401 408194 504171 165728 345871 694810 391993 587827 755669 477872
17032 477872 444632 584520 340117 691339 781859 325840 376076 396765 408555 410630 581519
17021 581519 299523 647258 162824 751449 459777 467714 436614 421353 434793 554087
17011 554087 652638 468548 576572 278072 380042 700812 590862 456004 878356 618818
17001 618818 124643 593471 508907 458705 691501 676865 648867 569318 472077 670067 763163
16990 763163 649745 492273 360456 442649 983294 551415 474305 417699 362823 761863
16980 761863 790371 545864 560355 760665 618001 744896 765714 634537 586711 689767
16970 689767 366798 771691 304023 801426 680477 843975 782436 740937 718552 829514
16960 829514 907019 749762 695053 864479 863001 548276 771592 823590 679392 1006712
16950 1006712 655130 584598 638574 1031971 1070074 810354 714457 611272 782791 1184126
16940 1184126 950530 610723 861710 932938 950875 854932 622035 959325 1083694 911163
16930 911163 1036627 1185369 993037 840575 1074120 901369 889397 1226168 1108694 1291282
16920 1291282 983634 1002950 1228273 1131827 1149978 1343649 1050166 989637 1271525 1030989
16910 1030989 1004716 1164684 1087984 1517135 1178558 1185333 1298232 1206948 1008878 1251242
16900 1251242 1272674 1484707 1432603 1230522 1473750 1711893 1459427 1344169 1413854 1357114
16890 1357114 1390053 1584332 1273805 1633075 1732167 1399559 1300169 1775452 1430267 1837010
16880 1837010 1916866 1787039 1522572 1516241 1815859 1318366 1892114 2118200 1662617 1423991
16870 1423991 1684690 1749585 2004944 1742970 1907463 1961034 2118940 1702975 1884583 1752673
16860 1752673 1903855 2037886 2255161 1991019 2086333 1982624 1921101 2093492 2322087 2321566
16850 2321566 2201029 2555627 2080698 2629881 2360792 2412755 2443996 2680185 2590597 2385907
16840 2385907 2477352 2841037 3119430 2941315 2641113 2737301 2857472 3118142 2914847 3244496
16830 3244496 3303402 3288793 2999552 3181391 3525809 3292888 3256283 3567891 3725693 3637372
16820 3637372 3647425 3850717 3818353 3923332 3973461 4067890 3956464 4138132 4309558 4402026
16810 4402026 4552177 4273247 4640318 4923386 4971128 5061115 4879495 5113080 5197001 5153367
16800 5153367 5295612 5467818 5655901 5726333 5700937 6235038 6129287 5916331 6469902 6453704
16790 6453704 6936170 6653892 7183932 7229618 7424189 7313008 7493405 8037235 8049136 8429840
16780 8429840 8711428 8685099 8770498 9158878 9543042 9687319 10118785 10170568 10573043 10780897
16770 10780897 11231052 11511171 11631361 12308515 12420540 12850004 13119718 13891304 14082613
16761 14082613 14467973 14836349 15558273 16039288 16877730 16855754 17652265 18301202 19293307
16752 19293307 19946825 20619598 21287066 22203360 23006065 24053044 24905111 26112064 27140432
16743 27140432 28306222 29673119 30645452 32101520 33782214 35444999 36954000 39063489
16735 39063489 40905623 42685265 44889677 47553736 49507925 52806171 55824201 59004993
16727 59004993 62351843 66033779 70435853 74904040 79446878 84213532 89214638 94604254
16719 94604254 101067562 107612282 114189930 121070474 128854132 136546115 144010156 152110038
16711 152110038 159909971 167864738 175302722 182020786 188448399 193616918 197649062 200683328
16703 200683328 202412417 202684293 201597016 199072548 195152795 190182440 184081854 177599306
16695 177599306 170176712 162573096 154581764 146312137 138360941 130543268 123282067 116056900
16687 116056900 109166032 102316140 96552298 90792246 84834513 79929934 74996899 70674418
16679 70674418 66083159 62425205 58448925 55212864 52274202 49501683 46615564 44156436
16671 44156436 41895165 39611540 37751560 35787279 34016497 32430549 30518778 29103022
16663 29103022 27841337 26894847 25480920 24227502 23339743 22673540 21727104 20700150 19570773
16654 19570773 19063569 18203709 17328505 16810077 16286232 15813961 15206246 14344485 14623123
16645 14623123 13805443 12933730 12804360 12310660 11985783 11698487 11276715 11307523 10458953
16636 10458953 10418891 10257055 9760875 9419896 9217314 8711268 8716913 8538598 8056696 8180162
16626 8180162 7814423 7728567 7035600 6899180 7018046 6753823 6623977 6575691 6295146 5932415
16616 5932415 5863586 6174257 5764639 5882839 5755971 5208924 5160179 5110400 5028455 5267625
16606 5267625 5144927 4934774 4482804 4574252 4057713 4303974 4279823 4143679 4121005 3686719
16596 3686719 4070867 4047337 4248986 3542854 3608867 3499556 3320591 3847540 3508361 3532735
16586 3532735 3074986 3601213 3083539 3215805 3044077 3076220 2821666 2927081 2741563 2947372
16576 2947372 2475220 2769091 2463991 2840982 2009970 2537588 2606903 2560345 2528909 2279521
16566 2279521 2585613 2328117 2489589 2382628 2419851 2214893 2099781 2108930 1651936 1989939
16556 1989939 1866925 1866939 2005535 1988215 1759681 1952248 1839656 1916506 1845592 1596746 1835667
16545 1835667 1676320 2169516 1308601 1790194 1529822 1480198 1442008 1379561 1239802 1674968
16535 1674968 1611763 1376110 1478752 1205902 1577710 1531417 1370618 1282449 1465851 1551555
16525 1551555 1380497 1553471 1402325 1191842 1360361 1305614 1145604 999193 1222120 1186131
16515 1186131 938531 1204304 942259 1340131 1197350 1137454 1123103 964454 1090670 1079974
16505 1079974 900326 1237118 1121476 904005 684348 1037778 940508 1099744 773915 801045
16495 801045 829346 348842 991639 918987 857510 909734 940089 748541 831043 723907 817538
16484 817538 633313 749042 693758 1046659 713191 474690 891602 679641 1059543 964403
16474 964403 1024654 609000 721903 593595 982824 725409 628295 576030 667360 930646
16464 930646 738401 833943 875645 770560 431758 609454 581799 484260 551999 610783 555350
16453 555350 668661 426513 506318 348399 593192 515776 520122 692549 428003 275440
16443 275440 622863 -377 513962 432934 480197 521704 690065 457649 567477 650160 646872
16432 646872 488073 598198 689013 598352 321438 457259 319249 585007 471119 576562
16422 576562 603091 222942 388055 698636 470414 373603 687041 408873 255973 305597
16412 305597 573264 379816 519965 173069 192159 87049 228063 376458 556447 150376
16401 234412 209765 444629 640686 361688 375768 512407 332310 379406 196767 425735
16391 425735 209436 614819 687146 264761 158349 232143 467144 316084 898035 192828
16380 444142 77957 190853 334450 164922 447661 446754 467638 362897 118558 95966 675852
16369 675852 343613 422986 554194 456716 45660 198646 360521 162715 250166 414678
16359 414678 274637 5021 323175 220701 126200 -11453 147180 368460 619681 372007
16349 372007 125351 409571 307601 53599 181898 358886 295233 201616 347890 167728
16338 263126 258410 339397 -25134 -89137 266580 238994 317075 295468 761255 100843 43355
16326 246479 35785 521298 -76379 -114460 178200 339954 165788 163977 130646 132768 250240
16315 250240 285375 338425 493766 254994 73516 126104 358854 -20426 104841 269380
16305 269380 313651 376138 178198 -289425 74194 272302 394460 239132 243001 173492 306965
16294 306965 201492 229274 174512 55539 225097 207139 276310 101187 15984 103818 96665
16283 96665 -57014 -185876 118834 347279 -102419 149859 -59766 230498 -99841 113617
16272 76483 241130 36231 274317 62634 102720 328224 -19706 26581 86386 -54447 425963
16260 234289 -34590 269316 232566 109787 -291899 287238 448622 200603 120252 78293
16250 78293 38473 -116181 247197 67588 -15789 66647 -54054 41240 213640 -27853 249056
16238 -90255 110223 195733 151780 164147 296337 -199829 -60661 318716 176320 40861 208626
16227 208626 -19633 258352 7538 176440 296663 115368 348074 149620 96417 163067
16217 163067 59225 -53298 365688 18371 278043 370549 -94374 174018 -243246 -155486 -32858
16205 -91422 -27535 -59585 -40976 -48565 99505 -18621 54421 191695 213741 -116400 -249718
16194 -249718 163474 -12563 -65986 -104374 138076 -124659 -84762 7907 -142671 -77549 82378
16182 -66271 224394 -309032 81266 -29676 24042 199326 -66422 38506 87954 65323 194223
16171 194223 -25071 145464 190651 -256840 -376150 -29702 -79628 -104360 340143 246636 16545
16159 -165604 -85488 134185 -83092 -49575 -65950 163533 -94257 54814 -225546 207522 -27501
16147 -274377 -234934 34610 94821 245090 -50705 106909 9120 -45200 -138989 98191 107154
16136 107154 -204094 -33604 257193 375618 281986 296292 -35963 229952 260286 163847 -757
16124 -50127 17432 137126 70126 252351 94104 -153757 -110997 377633 306171 162872 126387
16113 126387 90205 -164106 91268 -26910 89453 46607 -95027 -98726 -34536 -47637 -91481
16102 -91481 -204043 -26077 -68906 391134 236617 108100 72573 165766 -356457 75187 -87362
16090 -41395 308462 346138 352885 518722 -230660 254593 -72811 153656 34207 29388 -169943
16078 11821 126322 175015 336419 -148633 -30868 41512 156546 -161918 -61604 140380
16067 -28128 18917 57262 -163291 75972 -170071 -115620 184526 228838 -125377 102199 -107976
16055 -159725 -100503 121788 -196693 11916 -205339 -156455 1619 -385382 105966 -14230 -115647
16044 -115647 -20893 61157 -12808 295426 253291 -19840 -225708 -178116 19866 -130856 -107777
16033 -107777 41285 7370 136158 44718 28927 96493 -138679 -167293 3435 69397 223149
16022 223149 290700 102243 3624 70645 -106239 -138638 -26630 11555 86523 89780 288960
16011 288960 7923 99836 18163 56638 -195343 268339 -197123 -83017 -109164 -97140 -274325
16000 -274325 256374 130859 204589 -75778 162632 -144858 58356 -111325 104197 -183198
15989 14990 127815 56685 153988 -221902 112507 151777 -197471 -355 -131383 41016 95312
15978 95312 118556 238567 42100 -300527 93921 -313009 25250 197154 -65015 -110860 261859
15966 288573 218677 -93642 83518 -9652 90839 -14028 -126616 -29983 -62261 -162035 231200
15954 401337 -314060 -228375 -140669 89842 -43119 131355 -40728 -72803 -243493 -128702 247795
15942 -206662 16360 20493 -214390 -302162 -133823 -122716 108995 -195155 64765 -36612 -212806
15931 -212806 -24474 -240264 -35517 95431 80676 -49977 -130813 -53881 -185873 144625 114246
15920 114246 162604 -289045 54111 183676 -56397 -160057 -66658 161743 -41305 -197021
15910 -197021 51099 64526 205900 -137972 -320732 -273298 41122 -213233 -123462 -344833
15900 -344833 -369022 -217559 154088 -178994 10661 -309305 138022 -117646 -295448 12127
15889 -130178 -23523 -324605 -75856 146159 -218386 -39513 13054 98616 -301907 219138
15878 42906 128387 -43530 124893 -120334 -170631 -258610 -358527 -262879 -77841 -240642 -106631
15866 79455 -266232 -70335 -199324 94874 226701 -91476 56874 -178813 -302308 -30328 330286
15854 -290733 -188210 -73469 -464290 -182078 -69910 -278974 -43117 35429 184516 -75581
15843 69644 -262929 -230327 -104656 -11227 148772 -156259 -284136 58665 -183600 -95952
15833 -95952 -497082 -49807 82074 351642 -138060 -207176 77372 68508 -164426 -292874 -133895
15821 5699 187240 -47073 126284 -269446 -109594 -204705 -304464 -301110 296810 -115547 71392
15809 -278174 164684 -59680 41919 173908 165855 32103 -220660 196483 -108014 -142185 -64807
15797 39954 -245526 -154537 -214125 25410 114528 75688 -116610 -155972 -70199 -163941 72942
15785 -79810 275408 -330682 -282266 -27855 227381 -109705 12496 4748 -156625 -98151 -174296
15774 -174296 27449 -479975 -238953 -285504 -80244 -53393 199166 -183101 35154 -256267
15763 231524 -416735 130264 -190383 -93474 33249 -66459 -194444 -179960 -198153 -434628
15753 -434628 -69755 -103268 -25320 176481 -84728 -40120 17422 87096 -153609 -76700 225
15741 157706 -62161 258532 44981 468345 -35788 76820 174715 -268052 66168 154003 91315
15730 91315 -121007 -76984 -38856 -88834 -483845 -50319 -213609 286399 -222815 -25066 -9091
15718 -221101 -38126 -88259 16811 -138171 -265704 -225393 56160 -49027 -127879 163625 8815
15706 -273974 195080 118077 -140605 234194 29082 178972 33843 191279 -63416 91871
15695 -444309 -81989 99622 15960 -276950 -235505 168304 -335009 66011 -82784 -77513 175550
15683 -49052 -50853 105285 -113601 -159571 -229433 -56802 -102991 -111576 -53783 -59524 -41334 -85643
15671 -85643 -95409 74180 -167190 -91615 201212 -65955 57591 155309 178826 -232543 -125402
15660 -125402 -22669 143404 191403 -299739 124048 -348749 27900 -322580 71195 -128829
15649 -179394 60895 -90985 -59949 -13147 -63470 -409061 -146480 -229191 -201799 -31445 -252810
15638 -252810 65301 -215913 -87371 -156382 -47764 19496 26935 -63323 -33193 -187424 -288744
15627 -288744 78646 3318 -169900 -44858 -102837 -31971 140179 126608 -244651 212089 -187153
15615 339552 -80692 -44579 -287248 -508837 -5248 -38419 109507 27030 117988 35905 170994
15604 170994 55380 448134 -155066 -257052 72576 -42096 -342871 -167126 69936 -158849
15593 -155067 -224496 169365 -293593 87890 25982 -54783 -37432 -126963 4469 -120720 -23637
15581 -451227 -98971 -82806 -81308 -178703 -38551 -11749 -240831 -462367 -187684 75909 78720
15570 78720 15839 -4055 -204368 84332 -273277 160024 83907 13721 -93621 -96503 232757
15558 -179486 309710 105597 -127326 45168 -106951 -300918 1577 -65318 -251586 -89840
15547 -93784 42108 224421 12612 -258210 329383 69105 57239 -209289 -212392 -163578 -8860
15535 -66609 -219296 186278 79101 -77028 -49247 192009 -61970 33237 -81069 72123 53159
15524 53159 341477 -249468 52070 -45287 -135957 -109162 -136590 -80527 95554 -39708 -34826
15513 -34826 -158674 -129814 -258693 271336 -94394 -170412 -164038 -63958 -97402 141105 -40323
15501 -150573 -81225 266937 -446736 -131156 -57964 -214867 -158722 73752 -214223 -118478
15491 -118478 -96008 -35166 -686 -37116 -156498 -187634 58085 -59791 78670 -201316 49710
15479 70989 40378 76035 73551 -63530 -63650 78649 262893 699 243654 11932 -180506 -130452
15467 -130452 -245875 -401965 533832 -236954 -22059 -252001 391794 -254321 -215738 152603
15456 317427 227086 97457 98896 89603 -171235 -271973 237739 46368 20092 -206999 -31217
15444 -130637 233983 -11637 -212743 -108664 -174160 45098 -38118 -70839 132149 -95436 -119910
15433 -119910 39415 -132427 -132502 -61836 311598 15943 -200914 -99828 174100 -185992 206947
15421 -184052 194912 -92514 -236895 -123692 -51459 150300 28909 11945 175134 167067 -185618
15409 171569 -191023 19073 -59007 -97893 -42584 52755 -57354 165864 56489 -203141 -123447
15398 -123447 113430 -189739 49276 123593 -200139 -237122 -166435 -62787 203736 104537 -22634
15386 174999 -305413 198122 -195948 70698 91825 -353155 -158748 289414 27728 -16939
15375 -30372 -69861 -34178 -225268 65913 -24466 51662 192292 -92633 156333 36888 388
15363 107263 46724 91811 -289853 175496 172248 -258 31856 -6814 78356 -33883 -59575 390633
15350 -126116 -115003 -59297 21594 -100873 72928 -51590 -443350 183300 168725 54446 111502
15339 111502 52211 -136011 -150459 -45385 -208264 30527 231484 167744 95639 41502 69839
15328 69839 29566 -54228 118514 57962 -144417 -122393 -44106 -231822 65520 336104 -157931
15316 154315 -360784 38626 157821 -44459 370950 137307 214789 20455 -104406 289101
15305 -210562 -14957 -340599 64916 -130541 -33549 7114 395402 146310 -46315 303866 -63199
15293 89975 100083 65412 199671 164018 22170 70390 -160260 92882 61514 53208 -264212
15281 76088 190117 -19313 80837 24476 15817 109721 -156348 115219 277131 168768 281847
15270 281847 -208063 -7982 263474 37553 -420832 -51924 266223 331706 311044 -28601 -37379
15259 -37379 -18845 -117330 -60455 -307103 -5938 107922 37999 -435372 -57278 214278 -29630
15247 -147847 -246909 -10146 478808 136728 101693 56303 402265 -17888 126237 -82996 -74442
15236 -74442 191611 76979 403915 128130 -40869 -207900 -29734 -166159 145760 68766
15225 109473 172867 -110602 -56496 152796 112087 -130949 239734 -41650 17073 177123
15215 177123 -119497 -30116 177803 60746 83637 -231804 130811 103029 50469 309368
15205 309368 -80330 138066 326160 -150900 16608 83165 146229 180848 235901 -3567 168357
15193 21424 171189 315967 167463 152762 -57957 62990 -4179 145201 24647 -207953 232473
15181 101404 46135 143618 54355 14660 249796 33569 282468 223818 107377 1249 268405
15170 268405 214644 46570 -241034 72277 -83321 -57841 -16905 88302 -110454 186211 93592
15159 93592 -230656 179457 -2498 -48082 -101247 -281188 72253 -41899 47864 25970 -107149
15147 -64958 -261101 197630 30765 -108916 275569 243451 -7483 -66034 174091 118291 111236
15136 111236 -192096 -166677 -229083 128677 239698 332132 77366 355096 129331 401373
15126 401373 48664 239420 282362 75719 -67833 38487 -149192 226606 52149 112976 56404
15114 103670 142003 68770 196304 138404 73686 -233154 333145 -135922 182284 -110382
15103 292618 123161 -54051 11324 135750 15344 228846 382236 97763 2330 235430 40294
15091 -11676 -33383 -246795 -60559 263017 196039 170017 190333 -50603 292941 345039 14709
15079 296949 -137144 451310 240745 -212175 367222 125857 242047 -181595 45241 181779
15069 181779 226675 162844 64362 -76021 145733 15421 205112 63748 -281905 343613 198595
15058 198595 -99741 -156739 -17193 173982 96142 438929 61337 107027 25612 -136373 116837
15046 374288 131817 370823 -12074 406975 85014 181268 327497 375293 44752 188012
15036 188012 -119949 -42125 27055 -91701 132262 -11610 206744 441420 -86049 352377
15025 96394 -27763 -19676 -8950 -34741 145687 374137 229716 265645 146564 100522 -31089
15013 331034 268418 346868 111899 -17899 -8292 9865 28202 466316 82249 -60185 -57381 432153
15000 399835 180362 7864 69594 -187734 393861 102269 -121447 525804 376554 155479
14989 -65683 213253 48777 331609 246612 28182 -212 66082 -45882 275909 213179 302681
14978 302681 452234 11893 239905 90711 190646 314176 166597 -114428 101634 -150546
14967 200394 223992 540209 269444 370632 339395 286953 320730 173359 437064 117652
14956 283271 88997 339973 148473 133766 272316 326945 306895 78118 301036 352081 220314
14945 220314 495740 -32419 186343 369590 319671 275552 328534 126501 250013 79833
14934 288920 143371 157030 95594 172840 429962 172140 765499 381903 175897 311270
14924 311270 258008 395733 35167 492202 762590 411671 271568 684761 569625 226834
14913 400910 492857 498962 225079 -14602 223917 -82976 -94772 203663 286975 500127 99664
14901 496147 173382 247255 114447 72471 -120941 57390 287661 139741 -4797 169912
14890 200636 349966 -10400 99291 447096 192781 284491 -89207 319687 27247 53615 831119
14879 831119 363455 245678 175382 324389 172743 446322 296490 391185 527163 340148
14869 340148 331647 -3660 55000 209464 547748 131811 275647 -5024 473962 -27395 292766
14857 456375 334204 262931 353922 407792 734537 178131 350985 424078 656739 299670
14846 607072 327115 375305 325845 299193 227725 250731 155677 506643 320509 189593 232409
14835 232409 274424 206313 -13826 359341 369186 337304 344873 649118 436047 69744 479682
14824 479682 655951 20173 395977 305872 182173 535142 501529 249622 367031 437109
14814 437109 525863 284242 396515 577356 200806 474920 553020 366842 290701 609384
14804 609384 321926 372011 169299 96203 416268 235108 98951 607241 629792 137294
14793 446954 554502 192616 498108 654588 627037 577945 419397 337460 473457 333747
14783 333747 471943 322461 298396 696035 638893 758057 482706 527223 566665 254408
14772 414055 420409 557460 369177 327884 508153 509201 734431 560247 408125 596824
14762 596824 966097 367303 453993 112285 518549 371119 689392 791761 314997 576496
14752 576496 540910 705376 475956 580952 444633 392170 494544 415215 402062 396232 522542
14741 522542 473542 473633 715719 491053 464814 487047 908129 710508 760584 716687 668420
14730 668420 620454 697587 615059 812733 992954 325624 974948 590588 327293 522054
14720 522054 646890 773804 653676 492620 548286 810393 179673 711451 498297 731323
14710 731323 612370 725482 781084 971515 399398 619455 835650 777019 899930 756430
14700 756430 691831 932545 314565 685816 484396 806469 939454 585503 909718 802127
14690 802127 730264 711131 1233052 841601 930900 705138 638101 1145402 1039829 754186
14680 754186 1199998 1077421 1084649 863314 787366 706236 992044 896106 796127 638061 971370
14669 971370 990197 666479 974089 1190248 646236 848623 1130768 722344 1389794 1089119
14659 1089119 1130632 1178850 980153 904025 1206582 1324812 679964 634787 905230 1015823
14649 1015823 1165904 1021319 1080733 746508 1025960 960335 1040168 831018 1401113 1024602
14639 1024602 625608 930877 1000018 873106 1086271 755816 776628 999499 1129334 992163
14629 992163 1042178 1168806 1408765 966075 1112252 1224440 1094964 917474 1525313 1137490
14619 1137490 1389440 1413322 1178012 1176042 1394624 1598934 1383155 1347231 1323467 1447479
14609 1447479 1124391 1444201 1525489 1461751 1245230 1098875 1437416 1425867 1115622 997425
14599 997425 1526519 1582998 1640601 1800228 1572505 1582296 1631004 1483550 1310310 1434853
14589 1434853 1905429 1670462 1624780 1571641 1766436 1553380 1800651 2012001 1565044 1853724
14579 1853724 1948930 1910818 1633443 1877922 1567311 1798680 1962525 1447117 1955944 1623838
14569 1623838 1680120 1953209 2108404 2372236 2031602 1914183 2266214 1872021 1986104 2135361
14559 2135361 1890412 2173448 2291356 2258895 2172881 2465611 2382411 2157457 2242272 2625854
14549 2625854 2645312 2569723 2497886 2799610 2794346 2633190 3127836 3386954 3604639 3957232
14539 3957232 4548685 4648201 5016295 6058458 7237167 9428206 12971041 18591500 26482422
14530 26482422 28024757 19077945 12173942 7851386 5235482 4072446 3729713 3389182
14522 3389182 2665261 2597929 2424970 2338704 2313167 2417276 2268580 2354369 2779495 2603569
14512 2603569 2472697 2511926 1969212 2587659 2251239 2506733 2640628 2533841 2295314 2393583
14502 2393583 2675688 2765260 2348822 2623586 2270612 2852142 2666106 2565582 2905782 2718314
14492 2718314 2762312 2786708 3000723 2843940 3148773 3035750 2916402 2855697 2939755 3175343
14482 3175343 3149465 3268225 3224919 3232797 3252579 3463167 3710872 3451402 3550514 3527169 3669650
14471 3669650 3538888 3486034 3786097 3691562 3913852 4070896 3493512 3877386 4067728 3839177
14461 3839177 3782864 3973196 4206998 4090587 4287159 4408589 4097564 4569747 4222129 4241820
14451 4241820 4243513 4842349 4399785 4684681 4822796 4400101 4594558 4466861 4733583 4954863
14441 4954863 5026288 4843943 4892919 5413487 5172731 5373875 5371873 5323169 5221937 5516400
14431 5516400 5506610 5638393 5695344 5789829 5738593 5535081 6177712 6152143 6040098 6225579
14421 6225579 6345590 6577919 6843575 6507663 6635349 7217925 6864393 6873751 6915537 7000547
14411 7000547 7241498 7216044 7625583 7603668 7687971 7756337 7555899 7965717 8011734 8045213
14401 8045213 8413613 8490644 8675727 9140558 8332654 8996728 9278350 9325432 9191862 9389710
14391 9389710 9607489 9917854 9931001 10059438 10165618 10674467 10703140 11091719 10867041 11208937
14381 11208937 11243478 11291430 11702130 11734486 12088133 12249122 12514697 12482803 12825619 13613848
14371 13613848 13120927 13549885 13838477 13800688 14372314 14624363 14992082 14988313 15456989 15735375
14361 15735375 16012668 16143189 16610957 17115898 17550732 17916493 17994703 18302337 18807411
14352 18807411 19365074 19622585 20208099 20636017 20985372 21565540 21863763 22283246 22977888
14343 22977888 23380933 24288174 24576400 25232080 25619999 26531813 26938137 27375753 28257389
14334 28257389 28753561 29800543 30384805 31386804 31856008 32981272 34019673 34703893 35351570
14325 35351570 36505069 37593261 38338176 40096210 40916276 42070747 43273483 44594145
14317 44594145 46034601 47514178 48947357 50295718 51930382 53774908 55685422 57585957
14309 57585957 59072357 61419810 63291634 65665697 68229017 70510296 73197816 75756854
14301 75756854 78900475 82029566 84990399 88473885 91848879 95488009 99132320 103724447
14293 103724447 108145726 112592012 117729186 122820637 128707565 134468989 140477351 147109859
14285 147109859 154203236 161663574 169831978 178166619 187092496 196086586 206314388 216861089
14277 216861089 227820521 239911744 252032208 265131505 278595705 292741840 307988970
14270 307988970 323335500 339046222 354867997 369293641 382549054 395159898 406291907
14263 406291907 417274701 427251143 436584177 444490540 451630724 457697588 461301007 461990448
14255 461990448 462759990 459567289 452878217 446943266 440210241 430237864 418617496 405923569
14247 405923569 393719595 380241846 366100602 351779773 337824452 323896935 310203033
14240 310203033 296473071 283116593 270396191 257554457 245284464 233180700 221747682
14233 221747682 210651388 200555439 190864206 181270194 172360026 163874162 155834761 147830373
14225 147830373 140705774 133863705 127906613 121950791 116881530 111400658 106728172 101701197
14217 101701197 97661348 93803799 90043133 86589116 83123089 79780126 77018639 73908793
14209 73908793 71102143 68599067 66138713 63725603 61876114 59664129 57445317 55964105
14201 55964105 54014854 52073939 50847410 49106920 47899139 46041860 44964095 43584409
14193 43584409 42273996 41491953 40320932 39336150 37571185 36667988 35569286 35142952 34199129
14184 34199129 33371275 32182098 31040610 30687873 29965230 29205304 28266506 27812231 26905051
14175 26905051 26046391 25764156 25095411 24540162 24080841 23294772 22829611 22617686 22390213
14166 22390213 21707851 20936743 20514117 20397021 19981925 19095051 18689019 18529274 18369657
14157 18369657 18105266 17451882 16912464 16796726 16732378 16321887 16212993 15768718 15086114
14148 15086114 15184664 14919800 14594932 14425954 14510560 13819340 13864269 13345513 13543887 13212957
14138 13212957 12672151 12602187 12240560 12067159 11861179 11641054 11128762 11496757 11428174 10738249
14128 10738249 11181186 11000755 10338449 9892065 10180596 10233698 10088388 9492209 9439278 9553502
14118 9553502 9436730 9150601 9323313 8902935 8779758 8935436 8487334 8494813 8391285 7875068
14108 7875068 8353938 8081235 7757894 7616064 7729071 7914289 7560249 7088998 7270311
14099 7270311 6756302 7137526 6874221 6644546 6976540 6559480 6809787 6334201 6369777 6467109
14089 6467109 6132974 6319900 5879590 6211318 6124663 6031991 6069199 5981088 5629857 5706758
14079 5706758 5672990 5906993 5308280 5617458 5419619 5534945 5012572 5189668 5622527 5010067
14069 5010067 4847496 5174884 4905594 4939067 4536775 4860998 4656856 4991898 4701732 4613663
14059 4613663 4333975 4368679 4259520 4372215 4457117 4446456 4268670 4246175 4332687 4230325
14049 4230325 3947476 4363757 3951251 4086323 3889016 3905063 3904064 3895929 3916323 3708017 3764546
14038 3764546 3756629 3709986 3669372 3603123 3313828 3563665 3497532 3982717 3526682 3423228
14028 3423228 3238492 3470107 3102633 3426596 3274750 3513116 3093718 2944763 3119177
14019 3119177 3054412 3232997 3180658 3015445 3030067 2901824 3161128 2742239 2680433 2513790
14009 2513790 2812340 3024603 2962865 2863118 2750220 2440606 2265736 2783036 2443084 2411822
13999 2411822 2335075 2774952 2742723 2455429 2628619 2570123 2373054 2301602 2306295 2517992
13989 2517992 2390695 2401971 2440038 2298586 2201582 1996786 2689184 2330813 2767922 2667040
13979 2667040 2690428 2960459 3535034 3995957 5031805 6607055 9226920 14865957 23273859
13970 23273859 28332829 21689937 15091738 10705799 7813619 6218847 5141899 4590712
13962 4590712 4321851 3697551 3464370 3316249 3227518 3014059 2899188 2859500 2646580 2497981
13952 2497981 2443613 2584989 2087174 2280246 2312752 2404502 2359784 2271582 2080018 2342835
13942 2342835 1925023 1833192 2002085 2090282 2206341 1832565 1868205 1705223 2209075 1996643
13932 1996643 1785732 2038132 1875242 1817897 1784302 1675052 1809919 1808465 1935571 1829335
13922 1829335 1676217 1931923 1542569 1733136 1385718 1959125 1731253 1539478 1517767 1763155
13912 1763155 1760686 1445864 1645877 1527132 1385968 1315343 1531818 1564378 1487838 1468320
13902 1468320 1846844 1489087 1667565 1329678 1440541 1733873 1589088 1350236 1665348
13893 1665348 1247976 1698030 1187017 1174500 1837538 1656579 1310731 1123751 1352926 1592782
13883 1592782 1301390 1093796 1429032 1314371 1435068 1437741 1637840 1609461 1362745 1459992
13873 1459992 1063899 1313567 1135794 1228156 1562125 947748 1241222 1463706 1166524 1399627
13863 1399627 1334518 1082795 1255092 1189579 1437663 1122922 971432 1204129 1086007 1191292
13853 1191292 1119234 1197664 977129 936516 1541725 1295527 1055377 1073975 1184217 891476
13843 891476 1074687 1247679 1145293 1283350 914651 1328450 894848 901077 1170443 933539
13833 933539 1029249 940038 925074 687830 993681 873309 906241 1085779 1016337 695664
13823 695664 1021544 1056124 860264 1316750 1031984 1030667 925031 1160025 762550 807082
13813 807082 1241478 1003089 1232147 802937 1050512 759887 1069085 819782 1007498 821204
13803 821204 1270656 999372 1027441 629377 796473 817970 966948 873705 841575 1038609
13793 1038609 693732 856534 787632 662572 576178 930745 675140 894822 765047 1105823
13783 1105823 1001420 519858 687996 983726 944052 778820 892411 677392 550859 519467
13773 519467 661336 726135 1080794 1405470 632807 753642 954297 607318 621845 798274
13763 798274 491183 665042 463666 871944 710177 693405 886304 636353 721800 530091
13753 530091 802102 566489 718455 468734 839525 876620 615012 565541 860835 433716
13743 433716 588543 792421 516424 761449 544613 382107 718025 664726 712922 656783
13733 656783 438659 654795 226950 653819 1032437 565988 792479 713614 558747 799358
13723 799358 605558 595013 527407 563544 563465 312714 426513 774497 589603 481257 297983
13712 297983 732427 660661 627137 521094 325123 534014 658469 541711 424684 800800
13702 800800 437541 715557 536165 774719 588707 571722 1014288 784482 732140 469151
13692 469151 439377 733788 566098 670953 524123 233488 682229 585134 265845 101921
13681 805525 342921 477363 378311 688953 140549 627995 311397 391808 727383 761550
13671 761550 560966 819247 564974 636115 597114 372804 543463 381932 262584 250806
13661 250806 277227 417737 480057 288304 643693 408053 413606 709789 798903 343240
13650 665832 346660 570946 549413 -59339 601405 289924 121655 350304 522857 443593
13640 443593 427402 324568 129579 529087 515433 337257 702718 568728 261636 511215
13630 511215 310627 470343 440671 320148 509283 38094 660437 278627 306486 406332
13620 406332 678597 446307 530077 604505 308292 238113 383606 426263 272187 468877
13610 468877 544834 351832 379846 412316 453708 299058 547065 18792 269739 594396
13600 594396 406200 283997 416381 336396 812193 496326 344630 322587 387139 405097
13590 405097 545729 413439 423762 357924 82855 564930 447710 506679 934 359592 294390
13579 294390 294608 473078 409826 565137 292109 492315 526469 259449 198752 255414 464610
13568 464610 431584 378505 508876 540456 441330 206822 432845 266768 613191 322958
13558 322958 143775 94164 506207 1953 328865 611884 136977 126456 441735 130213
13547 214829 444105 537567 390620 457472 368508 354922 420509 398121 341432 125663 491579
13536 491579 393738 136451 472494 18519 291580 185905 15760 426215 625866 201420
13525 169549 389643 261657 493797 377394 157670 143119 643974 362263 291300 522541
13515 522541 296461 177513 603800 223567 237866 263123 305802 384106 221339 -121015
13504 282798 240175 231517 417860 246839 353063 292702 188860 590944 383348 593493
13494 593493 167604 279423 176402 443513 362655 316555 462032 -82968 74590 297402
13484 297402 566884 339931 401219 288611 717632 248803 270874 364415 505173 153371
13473 432401 366135 497068 530012 107008 378257 146636 -5102 571902 312702 507233
13463 507233 188152 378786 247837 396221 71982 463292 181344 61543 8701 375562
13453 375562 441473 145481 32786 243817 407252 348862 286171 394495 419845 212575
13443 212575 -31182 325031 109852 93550 286055 752346 91313 298921 -102660 274424
13432 253219 -171655 198638 122466 84690 280195 99072 143919 311067 543479 347255
13422 347255 258998 324384 449743 498860 297992 399349 208076 67323 129839 132993 13491
13410 299891 251561 346958 237198 -4139 598817 -37639 327801 208118 341612 103696
13399 158047 312635 166982 -272455 447340 -130629 108115 -67343 -71800 288399 579840
13389 579840 264998 223516 106530 191554 37687 35638 159341 307556 192427 334998
13379 334998 -18969 32876 332293 59538 5597 -12413 243809 -53523 254572 188169 211864
13368 211864 194335 645253 30846 465199 110093 66218 397487 234623 388183 337941
13358 337941 197930 398681 87798 179657 309561 245550 150939 65575 204939 212159 55428
13346 13156 -54731 110978 590290 154607 254884 236845 359648 309334 338182 -142914
13335 560218 349666 222596 367489 267263 418427 347682 188831 268993 143788 169030
13325 169030 -2286 223896 -35048 445195 104055 507614 -35227 233713 305326 74485 90214
13314 90214 192205 116492 41968 324851 115107 432765 -14353 49710 560075 491820 50359
13302 -12858 383338 168975 -177038 59723 242530 -14972 27080 425875 154568 564054
13292 564054 135134 -36300 112292 -201909 137682 459948 -184646 -56996 162480 170257
13282 170257 24613 -23765 327971 120072 102568 145419 194216 401907 190222 29719 59234
13271 59234 323109 15644 -53039 -22278 45944 278545 79047 -70619 11631 94846 41416
13259 59255 146904 -11776 242373 204120 74132 339584 26007 342221 136288 146627 346117
13248 346117 35029 -167795 510989 409465 21941 471845 208738 -201589 51874 267227
13238 267227 12968 230244 505843 -16069 -77754 178937 187585 -62054 -267861 15411 44138
13227 44138 253526 -259725 76154 117783 295175 319531 483911 141025 82592 10045 50489
13216 50489 108474 41311 347025 277255 205191 -102932 -29188 222334 60127 137891 224058
13205 224058 288192 75064 -244959 104558 -24891 61029 156062 -17531 389875 90591 423462
13194 423462 249704 125941 388545 319467 -345846 -68073 250570 -31500 61653 365054
13184 365054 87908 310370 113589 101144 181116 -51616 -167848 150055 250445 -79783
13173 205035 82294 257157 199573 279965 88782 -101330 -170110 -245726 53988 148096 106073
13162 106073 430690 -516152 640915 55850 161911 450829 380130 370802 99289 286 261311
13151 261311 181903 410631 -46932 8362 -11693 -7511 -12607 130332 -31809 39086 193700
13140 193700 190813 79461 165678 178926 189361 80767 273732 -15148 187090 -124878 180189
13128 31836 111685 75898 134622 7403 29920 207514 -224097 441275 444991 -67979 241956
13116 114815 25448 376247 -358058 163635 464706 68953 150725 76062 -189803 -16807
13105 46223 147664 190998 -33123 166573 169990 60461 56073 56062 -25939 69815 -109099 -62220
13093 -62220 -250 87055 58321 213694 67469 -38412 34463 110411 105665 692068 176761 20000
13080 98601 257195 102492 -195942 -28519 208709 14139 -200043 27523 -105157 70223
13069 171194 -88512 190426 -349193 -4263 151556 270646 204843 250409 -21331 -18902 92776
13057 -70682 52586 342087 -32600 52204 -92908 93342 -124632 333733 40510 -292174 79449
13045 235189 -278336 305751 -112925 262550 260592 -10713 19808 105907 135720 -64082 334214
13033 98927 113714 584407 415852 118669 -12079 75053 223678 320447 55539 39623 -78185
13021 132426 -11034 196594 -147173 163629 -4595 -128733 262430 276488 134415 301525
13011 301525 241578 134374 155647 227381 209439 -310891 413998 49182 487349 103083
13000 163554 249559 -161504 46465 -32829 -78727 490157 254668 -93590 45818 90730 -199204
12988 164663 -25573 17503 -41253 43439 96732 61896 79750 161592 114820 161049 -153344
12976 -36937 -23872 -166795 66727 -270286 1329 -100536 -3049 -98415 81825 -41571 182003
12964 319785 201023 -307783 347247 168522 233546 196313 92070 190623 123856 224310
12954 224310 79178 -134463 297310 102713 -28581 -33819 -84586 112292 -198050 156608
12943 -162390 -59253 -288629 93652 346483 202043 -15639 -173775 -81670 184263 -71009
12932 4697 -192508 240059 160982 87491 234569 -24367 86610 -71451 7387 78480 -204188
12920 254106 308657 16929 176202 41239 110936 -85785 123132 -10552 220359 191852 174126
12909 174126 -154447 -197343 -353767 -161810 -238067 42069 -16937 149287 178735 -114142
12898 -173633 189566 -5861 -128394 33369 148209 125101 14918 -137791 15085 387146 -142453
12886 74665 -156082 -90354 77514 1674 -84480 -178797 31743 -163666 50597 145928 -104484
12874 283443 -39573 193549 102767 -279670 5903 92451 218188 -48596 267328 81204 362958
12863 362958 299649 -119386 -18023 143024 48935 172843 72965 -42162 122332 -36193 -195306
12852 -195306 -81846 481318 -143113 192588 -295703 76701 67910 -138041 -129284 354708 228176
12841 228176 -31686 36974 47072 -57117 433029 537550 -1563 337908 -79167 96653 230372
12830 230372 -220952 184876 -212393 87987 -335168 205090 -45472 -80113 298915 -137125
12819 143967 -32896 146298 342696 -18358 218092 -152169 220686 -192300 97563 83202
12809 83202 -249852 -27360 238799 -4921 -68273 -85132 -59172 -236999 247001 58616 -111287
12797 -67016 -68310 189057 239671 -15116 14263 60328 320599 247335 71690 -92758 42316
12785 -102622 -238825 561134 -250451 31227 -118911 104985 14898 -53374 155264 -401903
12774 270399 97735 176347 140320 -112922 -153575 -28350 67089 -227703 -140240 112538 32770
12762 103966 14192 172444 -386916 162921 8772 -79131 137850 167258 22654 -4175 54695
12750 -58992 42022 -13410 165665 -366851 186204 159050 -94536 -2046 113512 -41601 -490566
12739 -490566 98416 -409153 -26677 -85327 380918 67828 -102065 55605 139201 137235 39398
12727 48978 -159350 35118 35770 -40056 -81238 109610 49526 261364 45472 253424 204455
12716 204455 -105084 118105 1484 25743 -390348 102845 -77806 -111032 -23471 295637 246462
12705 246462 -252439 -122668 -374358 57152 193563 -38728 -219972 428137 -35517 350738
12694 390591 36640 359693 203355 403446 183230 219309 92427 361983 284827 -133931
12683 135943 -66903 -129441 72818 -400156 70066 209167 93162 -95617 146839 211695 -242274
12671 58851 168248 -3364 -40860 249853 247270 190365 -18203 188298 33814 54533 -73571
12659 334516 -389517 140737 46504 391621 84857 296353 293753 -120708 150546 -215318
12648 -40235 354268 346451 33486 -22566 602748 -185589 449980 191053 -133331 222879
12637 124285 40124 356136 118969 197397 -53545 -159122 13757 -64986 268013 93975 199855
12626 199855 -76822 -66620 136324 435036 82076 -4203 320139 -8301 -111612 176974 137110
12615 137110 239038 540467 -313900 -130043 371436 37666 118839 232460 253277 30481
12604 83241 168143 276171 -58678 177225 296702 85220 -21897 -98020 -109217 -9041 -194703
12593 -194703 105730 14975 277174 -30312 120483 -273554 59756 131066 150611 -153159
12582 130471 223037 317870 254498 388775 143768 -211197 96351 421203 -23883 -59870 67716
12570 -320643 -135960 2493 511664 120636 167968 -272078 -28905 -198999 -139159 -240949
12560 -240949 -92423 32092 112118 -14480 -380337 -14497 234582 -146633 87874 126949 -28733
12548 91466 87267 -194354 -80766 102146 204108 174493 -82483 368485 -67104 -4749 78892
12536 -58495 -170237 269758 161406 165491 -192131 109747 112401 -112148 90058 200205 -185196
12524 -92710 383314 68631 -90273 -144497 104110 14452 -129771 34737 -137296 16148 150772
12513 150772 197335 203309 77775 78106 153900 12458 144121 157179 31000 -80985 148932 113283
12501 113283 -32913 2742 -79777 196355 203494 59103 172190 -57560 -68867 -124167 -67223
12490 -67223 77510 127721 101771 -225051 313580 175811 42459 47731 72949 -72006 83538
12478 -152113 219273 -106048 116421 48228 32471 -253155 -136487 -44594 328800 -140387
12467 -299948 -254805 67112 -115264 -1755 259002 141193 119174 88827 -52339 75597 119106
12456 119106 138844 228796 -32266 159960 -208116 295594 -15923 66274 -164 -8478 -259880
12445 -259880 70441 -42119 328763 38075 -3319 -64942 351114 440350 50311 84184 236035
12434 236035 -288041 148530 -314620 -123933 150094 56375 407501 -30576 -22496 57605
12423 226955 13918 -178410 50920 71989 44702 68240 194450 -297977 234885 137261 35124
12411 -187306 87569 97806 226910 -203557 -110493 -168140 218783 -138264 216055 -239842
12400 76020 127055 -175447 -74021 61041 126889 -51187 18873 87946 136335 -15200 14149
12388 -3218 -270894 67688 219543 -135237 -138612 -67475 -198200 -19492 -225832 68340 128578
12377 128578 23266 -159348 -142553 5727 41558 264801 66837 -4170 172415 6860 161257
12366 161257 173081 27276 -142236 369073 241964 -11732 4659 -118548 -122723 -91338 31353
12354 132341 -261207 -146495 54571 -181 -5388 252509 -321494 11905 72597 -96480 -47266
12342 -124056 -15116 -147228 118346 26315 425246 22276 85024 -166223 25170 -274783
12331 119624 24855 -68382 -214900 -163993 -4231 162959 125663 -20319 29182 3585 -191986
12319 258396 -7486 59992 -31067 -235933 153565 -91461 -57815 242699 9555 241469 -187697
12307 -35973 87529 38691 -2671 128996 -16783 203043 93390 12608 -153519 251707 46077
12295 -44167 -54390 40578 -69616 -210462 51700 72931 -189515 -145694 -183171 -87578 -39682
12283 -138173 316978 387976 71833 217181 143065 69873 73636 -82373 153036 399445 -290162
12271 91637 -25848 73022 29111 132686 299478 -99142 291858 85993 60525 -24753 126359
12259 323055 201901 197282 74072 137368 276461 475357 33657 103610 236491 127126 337512
12248 337512 254090 295741 -7565 -62510 -49576 -136172 -213813 51016 148378 121720 10001 177359
12236 177359 101725 -148977 347577 103715 57480 86693 -138564 -76989 15281 242378
12226 242378 117894 -1355 93831 267850 199787 312683 244745 83765 193283 206473 -136261
12214 59207 162248 125507 57455 160075 56735 96132 387984 643834 240769 61174 167938
12203 167938 307703 201890 237272 190807 109445 -46987 146362 341500 150202 34008
12192 216629 155282 60517 199089 47323 57267 208498 512265 203876 329860 82759 107836
12181 107836 104992 -264401 282658 196584 312550 -10278 412328 27932 -19287 163200 43453
12169 51972 24205 29902 315111 -88081 487477 -249138 22859 -82914 81714 82433 200026
12158 200026 82069 -117871 225876 257112 209845 -83508 78438 318251 -25564 267014 -159813
12146 330117 12718 158649 47438 -204815 221463 222270 159236 132178 304483 -7882 -208377
12135 -208377 72376 -171713 105295 -229824 -245403 399886 -93872 193078 -111443 180178
12124 -157835 -134461 -82625 -83609 39366 -30766 -139042 83626 5747 46020 -231194 16390 110780
12112 110780 20222 26309 -225806 -78864 -101861 243697 117783 142614 68584 53286 -114202
12100 -3372 24027 449599 421269 -167431 -42061 18777 131068 177816 103317 -126429 205586
12088 -252634 293086 194866 167097 228790 -228856 263017 331079 -140795 -166542 234124
12077 148552 -94471 -146543 -92095 -97803 -28157 -136515 -104144 -75000 -196919 -433983 -69307
12065 -45999 -278592 -105548 -69498 231774 -393496 32293 -100722 97174 -253473 255597
12054 102538 300845 626829 1245002 631193 375308 368061 356886 149461 -61386 -3503 -98234
12043 -98234 -135808 -136046 152225 186283 133862 -33022 -505911 447435 58695 52655 -166987
12031 -244434 -117560 155172 -103203 -202307 215124 351247 -140019 228575 -16427 -149451
12021 -149451 -94927 -19328 -47460 -44614 124239 -95405 -81607 342492 -83559 -284763 297571
12009 57172 313035 -7729 97008 -322120 51893 195593 183155 152314 220940 300865 -196841
11997 -14573 175148 390536 -93755 126389 -8855 -226141 29456 -553 -217144 -84330 86129
11985 233086 -179388 101116 -185218 35037 -82179 27858 296526 41279 178471 117691
11975 117691 16025 122515 -261244 -86875 112382 -207255 75256 -263898 188972 250652
11965 250652 -44761 106656 -51334 55798 -62524 -151624 -132829 137602 236004 30547 -105842
11953 39025 203476 -128015 -212777 -79102 84335 140506 -169586 196287 114679 68415 -58047
11941 25035 100180 -46420 162502 -57249 66807 -96502 -50971 -61612 12041 -132797 -370944
11930 -370944 -117880 -5097 -125053 240399 224800 -322326 -154887 -356871 -179599 -142944
11920 -142944 -2328 47519 -266685 -138230 -359653 -114530 -126472 -130443 126914 -142052 114004
11908 133871 -149433 180289 -298431 184512 -45077 87649 52599 68021 -195608 -139681
11898 -139681 373054 -226351 -233242 -61637 138453 108898 -182824 43112 16074 -250691 -123843
11886 153873 -189289 -65765 154248 156024 170638 -111240 -112199 -42556 -169336 9893 -121635
11874 82471 -305728 -83898 137294 2548 -187062 -285329 -61525 107339 -94336 -126363 -98784
11863 -98784 -75542 34458 49151 -155515 87319 -82844 -120809 -125681 -52273 91461 -389577
11851 208246 -5269 -51030 54 -82284 -9005 150686 -67135 15575 29986 -54987 -116771 -30803
11838 170058 47553 -294960 -96705 160244 -203237 422635 -66437 -84190 130909 108311
11828 108311 -4742 -25625 129684 -64072 -141064 -58020 94459 125183 -106188 13339 -594077
11816 -112545 -74701 -7076 81741 -56499 110523 14975 405244 63155 257793 95577 336050
11805 336050 -201584 270258 183572 -229835 -341229 -297834 233268 484963 -16227 -194225
11795 -194225 -100568 -226187 -124131 -116024 -185484 77741 -414423 -201394 -355825 -436630 26740
11783 114449 204335 153809 -212942 -129812 -359191 362715 -57377 -137569 -367825 -107222
11772 -200181 -248703 146682 234042 455670 147125 23681 17545 83170 188456 -146038 29196
11760 -43978 -231870 -43736 -315848 102605 -92657 68796 188172 20358 -87546 110129 132169
11749 132169 -3639 172755 207192 77624 239305 350923 -111245 -251686 104939 19529
11738 -50149 -175473 -328647 -129055 44044 -18734 -109167 49704 198059 135841 -29879 -152074
11727 -152074 -6962 348194 208635 244966 192164 -105425 108339 147298 -32172 -190956 123640
11715 249075 59126 -24899 112478 4018 -128124 164765 -102544 241508 464938 -199925
11704 233897 -259223 -7813 204637 -126760 43282 2877 -65523 63814 -127361 -164481 226939
11692 89275 -102188 108946 -148829 62927 -27782 -49547 32074 41830 16282 48242 -13205
11680 45712 -72658 67646 -112602 29986 220332 -54152 -4151 107823 52139 -192787 -98314
11669 -98314 173737 -52222 113965 56564 -60646 -17996 3362 82456 -126045 159495 -75991
11657 136216 -74768 142231 -233715 -117540 171798 21805 -20974 100811 -18389 1078 -91032
11645 -284851 -26070 307176 88382 37674 241137 -96955 -173567 -224060 215284 -50967 69715
11633 -137255 -73460 124164 -175985 132677 287666 -121157 9459 -125692 -7 149446 -101661
11621 200112 40892 203183 93042 -44317 256999 69831 -458618 212726 -179249 167945
11610 132379 419462 230872 297369 159329 173834 390368 66974 65805 -108761 15236 29403
11599 29403 81079 -78945 86274 175869 -100506 -442409 255943 -168738 41081 -171965 118730
11587 -168286 -21845 69226 -9142 -152828 375712 487225 -171022 -143190 125893 262448
11577 262448 151591 -85227 212300 41050 -416 139057 -109977 172302 17596 24176 -67815
11565 340430 8229 -333339 171629 50932 330060 123323 239024 -115625 50907 -192189
11554 234995 232886 -138279 -216451 -9431 -75430 140563 -155204 -145900 267873 -57225 141089
11542 46419 12291 145270 -7342 35861 272686 -105339 -73466 -5054 140378 152219 100207
11531 100207 78598 -184326 -158767 164630 107418 -62021 330661 223943 203416 68764 389001
11520 389001 37928 -183083 -179273 234557 156528 -143619 -223683 40634 30710 141777 328140
11509 328140 227219 -129647 230324 -153728 187422 77925 323198 317219 -26520 -42758
11499 -42758 570241 -141654 131914 188810 -3597 -32172 258768 193534 264235 -111482 22166
11487 11231 510537 258592 -125104 55441 -65522 -105744 58464 106091 86047 -14755 -5001
11475 -179630 192403 223056 -198548 -55318 241014 333978 202643 14198 69470 409188
11465 409188 259515 317 -53006 57963 453314 -133563 92275 10531 455670 -201837 307559
11453 277869 14038 34511 257497 64505 -160489 249646 111570 8581 256345 254487 373305
11442 373305 12617 242724 -55639 -50362 10207 237392 170314 -107179 -70045 396010 119563
11430 -43075 122180 159991 176707 -47598 -15107 434657 158748 -216230 558201 -286450
11419 -20773 45624 138435 21996 118848 270844 270101 164802 -182723 -235978 276146 -63211
11407 -451842 -395362 -189638 284092 109839 -256611 -135183 -335663 -158666 170868 -55859
11396 140908 -209343 -170949 -231342 20986 215094 445039 -89263 176591 105033 125458 229872
11385 229872 410642 94972 -162302 317773 -171256 14312 -11420 36636 -16351 23796 -74843
11373 -119928 247144 -237814 228314 114412 -151925 149604 73435 -145799 -22247 215036
11362 116278 128860 10828 172722 110038 -16636 -506317 126596 122094 299392 -78279 -135618
11351 -135618 -107703 136850 -384419 -178607 -307565 336458 175478 -177966 -89050 -141182
11341 -141182 -62270 -32140 1185 -2777 -121292 202322 188333 390819 239781 93281 36653
11329 -137105 246963 -178747 44934 -205278 -166285 -72279 206542 64608 200241 278289
11319 278289 -85645 21808 -196882 21267 -348666 -223487 226648 -61702 134591 -149322
11308 13566 60467 305345 239577 -21560 88861 -24938 -372715 -42662 113599 -37345 -67978
11297 -67978 42342 -110950 -342268 81542 -222450 -307273 321529 -22458 30761 226396 -139868
11285 -65060 48810 148159 248352 -298216 13463 -199170 -60882 992 -32706 -24692 -98014 -184136
11273 -184136 -86479 -214218 -257923 32405 -320697 -44308 -94725 122200 -111258 175961
11262 -182622 -265616 -143887 -145715 -126008 -166937 -33278 62385 142201 -25881 139244 -96655
11250 -63523 57747 223874 139925 -378714 23263 -424793 -527278 -13981 161478 168583 -164431
11238 120645 109022 6759 -180381 150641 -89167 -45351 -130231 -125667 -282169 -313134 -308393
11227 -308393 -95418 -287197 -100546 -81377 -111233 -181305 112031 190473 -230897 164467
11216 -407572 23951 82123 -201522 11942 -121893 21551 -299260 263895 138038 157793
11206 157793 -432269 -24252 -108389 44386 -100908 21806 -29399 37999 -28150 115215 -3692
11194 230203 10027 -323876 1649 326033 41811 64842 -132926 -182979 -47100 -221394 386469
11182 -106935 -503735 -214848 -92769 160098 -22891 66394 55181 51591 55723 -56207 154665
11170 419382 -24449 -152479 253161 29076 -236847 -158959 98925 -93969 -157868 66495 131859
11159 131859 248294 -344650 -115200 -58201 77368 -131750 40261 152800 66576 122904
11149 122904 -76714 109945 195199 349991 29133 -159248 275563 191206 -322581 426331
11138 297353 -190514 74568 70112 32131 181769 326380 -131422 67422 -98121 152802 67589
11126 -12206 98017 136536 -108447 162699 -7220 322504 244510 -218965 -44293 143346 109730
11115 109730 -81962 -262196 -176328 51805 250979 -81483 -8201 190534 96341 -102493 262800
11103 193287 273132 25637 146446 68599 240640 -145564 30949 278350 132257 92644
11093 92644 167256 94760 68598 -17280 266527 -840 406319 173137 143556 220252 154541
11082 154541 -146583 14444 94565 243255 99332 273775 230340 294028 298670 -234380 291560
11070 -246091 96507 69807 267830 63576 458644 212588 35114 395242 508386 447351
11060 447351 294380 138464 371706 -15490 480264 272124 266729 412227 469519 458595
11050 458595 263000 312627 471863 540201 313735 363284 538077 698763 814277 163534
11039 518870 770653 802632 678456 617284 1087365 656543 852166 783808 946534 859202
11029 859202 964437 663239 878506 444585 564184 790630 864335 854031 716654 796979
11019 796979 730116 733576 472840 820714 799550 747852 854715 693112 949696 519407
11009 519407 433551 1059898 645018 788661 847910 601843 672558 842148 617698 465566
10999 465566 791222 583406 741845 966918 722956 276236 827987 732365 782366 710504
10989 710504 580826 459416 842806 626858 687994 977819 792316 816143 549420 352633
10979 352633 600450 618859 774364 851614 894945 882294 610900 1212383 1066740 1193728
10969 1193728 1220064 1002476 1559569 1618265 1505228 1703933 1731929 2298250 2122826 2431897
10959 2431897 2357633 2931153 2717992 2573290 2915662 2574332 2173861 1983779 1726447 1972829
10949 1972829 1480556 1565017 1308575 1387316 1461696 1287494 1628899 1192192 1236205 1031206
10939 1031206 1026936 1124073 903469 683994 652626 682060 571530 225426 1031785 390659
10928 257440 172974 381638 140762 139554 37255 180947 -92003 -21187 77176 229501 315877
10917 315877 -32164 179106 97077 -77068 -140511 113259 201683 -273158 199902 -162079
10906 338160 28957 147860 167772 105975 226669 -108689 -65684 -238210 -373881 -3763 397459
10894 232302 -152025 170001 40871 -243432 60668 -174487 -266461 117534 -140992 61535
10883 -113946 -8193 44273 -152068 99351 -98891 -32160 85377 -44031 -15428 -78671 204518
10871 73949 41779 17374 -88305 4097 140047 183989 -263188 233587 -123458 174632 150119
10860 150119 42481 21883 31626 -13474 -38038 -70725 91146 324257 -91873 -92419 179873 132111
10848 132111 51264 105599 49738 -205014 -159517 -61084 -396818 211961 -68938 106723 174052
10837 174052 11248 2043 144262 -152722 -151396 -54468 165524 81052 49181 -235789 -109133
10825 132951 -86576 -214198 229491 -112471 -219826 -170655 -13071 117942 -44186 56465
10814 -448974 -271277 -40107 -28240 84324 71074 -287230 276 132309 -227227 29546 -144670
10802 12280 -124793 -312606 -39186 398453 -61915 63709 -7427 -298075 50418 -6847 -298112
10791 -298112 -247077 26491 95717 141627 60338 81966 -61917 -2402 295585 -47870 2482 -158020
10778 112831 -59805 398 -195761 142122 -134277 152098 -350404 -51860 -183707 65029 -2206
10766 -106304 84379 287905 197327 45922 167661 102097 51198 186520 113761 -330702 128398
10754 268420 -69355 -78955 -8814 -506550 156773 4711 -173258 218927 59974 -22926 459 262870
10742 262870 -253862 -93579 40754 -6154 54251 36746 122275 -3898 92625 -53336 -6309 -199518
10730 -199518 -88652 128454 3771 -114440 -84562 -42422 76394 -40769 -324157 146919 139607
10719 139607 -188679 162565 -87532 -258069 179417 -11959 167863 13908 475944 -7023
10708 -213120 -90436 65409 -30928 -136461 171107 17266 -117805 291311 -112144 56921
10697 -165240 -68497 -143666 -89668 -97195 -75802 -104242 -107391 -99858 2354 -45362 -246633 -118948
10684 -217292 -51918 248181 -160431 47510 205252 -92830 -53767 29116 277589 -44416 -242660
10673 -242660 -120037 -10769 -182798 -20170 40403 129097 130685 49619 262710 -504432 168822
10661 -17129 -432124 -32280 -19708 -220289 -80265 63340 -182211 -160561 -265425 -304789 -38400
10649 -301659 103823 251796 374098 29841 139322 -171378 -23780 -91230 40961 -142260
10638 -270347 20577 112922 96332 -270112 -22656 -35164 88260 -158020 -2248 139363 -266642
10626 -108283 -197251 423152 -233794 -178460 -56417 79525 -19049 -29624 -7251 129396 -49317
10614 287888 -327228 -319392 255955 101059 3455 -229746 -189712 -232619 40010 -65917 -45572
10603 -45572 -124315 20030 86011 26246 -79816 -63278 -28447 5397 -250711 -21968 -60110 190576
10590 -214774 -241532 -294520 331109 -144599 -92265 -140798 -125282 319564 17701 -13913 22333
10578 188126 -105305 -286951 76991 -113895 -306082 -72043 -109515 -40978 37800 -71716 -36000
10567 -36000 -247593 -26778 -398382 124397 13802 -13989 -95214 -30937 -258176 -48498 19368
10555 -42924 -13069 -76880 106052 -103208 -22801 -298719 -56292 247879 72275 -169541 -2108
10543 110654 -144305 -56081 129557 250566 93080 -493134 -263692 31217 366637 -207832
10532 -184505 -89546 55138 107471 46051 53829 -161179 26226 -98764 -73913 75471 36383
10520 -81708 -308254 14496 -39492 -419620 315746 -59661 -174164 -18222 46500 -105700 -267956
10509 -267956 -298908 558988 255798 197805 419474 98287 -30764 -209655 38141 -28201 -138865
10498 -138865 55680 202521 211652 -63507 229126 -48188 -183016 133857 -26995 -15141 395559
10486 84702 94494 94478 216588 20547 47585 -46548 -4643 -310763 260104 -102690 -39778 204786
10473 175284 154635 109790 12612 410170 377313 213604 -3982 311635 135459 394495 90275
10461 -1711 -170730 -155207 -15262 249293 -19075 -120423 34289 -163992 -97722 -14309 92329
10449 41731 -198473 -16335 -40259 -76409 78413 -137135 -174584 -158492 -245814 93527 -46613
10437 -282777 8958 -311805 16396 30237 37225 -69343 -325938 -174275 -46326 340470 184705
10426 184705 184619 90710 -26261 -89191 -203571 211965 116421 108177 36446 -19687 -329194 382276
10413 250259 -197394 146712 32203 -269724 -72463 -295800 -39346 -174002 -217299 -66509
10402 195605 201066 -78569 -120242 -69957 -97172 -77759 -60604 76733 -46225 -161789 -331043
10391 -331043 -93689 209916 137935 -112616 -40064 39799 -263452 -2971 -195361 -108469 -44807
10379 68712 23978 173147 30069 184231 230634 -32301 -72931 251959 104821 35446 -51099
10367 -224797 -1891 475512 64706 260090 -92198 276106 226131 -87139 482245 102856 258031
10356 258031 167991 195977 26665 285863 456672 377168 402661 172731 366694 326430 436733
10345 436733 -8181 617705 338696 -90841 169775 273718 108336 63510 424103 515084
10335 515084 532783 11592 321682 -106592 399919 -145231 115378 459396 370353 26540
10324 247217 -50674 252768 -78331 310224 395379 259921 98628 -291495 247072 126827
10314 126827 -4984 -103053 63010 261103 29273 -295158 299115 255344 470322 391479 190783
10302 107634 400931 143712 119887 -12494 57149 -146716 120657 252605 94670 373085
10292 373085 31579 50712 -118174 -86407 88342 112828 -239890 395852 -109353 174693
10281 31612 -256722 39539 -330313 71571 -104017 -100370 -49716 -70644 191805 47267 97845
10270 97845 -97753 -120244 -241000 169118 -16738 -44267 -63140 -195139 188997 -123631 2316
10258 -141158 11790 -256347 -47866 25746 151768 234249 83961 -58394 174110 171168 247830
10247 247830 414074 315403 219703 240470 139717 90168 293593 -54009 86546 196531 33353
10235 27269 -100873 34721 -388750 180 -171730 -119780 55877 -1658 48469 -178577 104159
10223 200289 -50195 -195187 -185344 52221 77942 -14442 160835 121407 -196128 -258165 -256533
10212 -256533 -61900 -210351 -197582 -468244 -209131 170250 197507 -246368 -29939 -162236
10202 -162236 233683 -190172 -166179 182256 -52117 50574 89030 -92158 132872 -42046 -49202
10191 -49202 190810 -24895 -5348 -174692 1058 -121263 -122310 227178 47562 -240505 -240884 -303484
10179 -303484 -248234 157871 -103962 -64419 77933 126389 -165031 -273055 -254066 29941 -206398
10167 -50384 186035 370951 -108710 123564 -157913 8006 -133191 -244013 -408664 -237236
10157 -237236 66744 -255124 -27332 -273257 -128499 -31230 263632 -18617 26836 -485 -232681
10146 -232681 151869 60179 -47150 332917 -547718 -304198 212560 -58909 -254385 175051
10135 -56573 154252 -106792 97139 180602 248872 -226594 -119476 -26593 252952 263511 -324997
10123 -191517 132979 18816 -49979 -245804 -172855 -72744 144648 19622 -242610 -194916 95946
10111 -154485 7662 -742652 122539 -4839 -288104 294013 -59166 244880 -114362 -27398 -28170
10100 -28170 -134659 -239685 -146591 81875 -151734 -208012 -73190 -48732 -66719 -90599 -172512
10089 -172512 -69251 -116121 -315895 -205831 -216397 170307 222544 -362124 -379008 174034
10078 -260799 -51705 239716 -66325 192687 -117510 -214303 -53585 -23496 165650 -125723
10067 -141682 -114912 15346 -162060 21623 -27972 -280064 34738 -238658 143696 -193042
10056 -200429 175778 23168 122817 -353790 29702 -43907 243343 32470 88374 62733 171813
10045 171813 184 -78291 -213434 28110 -413573 -87959 -7950 -16479 846 97326 84082 75905
10033 75905 -188522 -301391 -27750 -186921 -133665 -166989 -67920 -75491 18848 157380 -99754
10021 -67922 -92795 -275480 -26539 -256851 -366303 -103978 -80218 -203173 -202441 -393990 34406
10009 -43698 -255185 -48138 173971 -208975 3271 141786 -79188 -172843 -120057 118961 -276934
9997 21148 -150395 333267 -36706 -232349 136287 -51205 -6754 42210 -252996 -3615 -318931
9986 -318931 -343552 -110117 12268 -68882 25794 -313666 -271535 79894 -142055 -359739 531
9974 233883 -279696 122654 46701 -682 -200476 -84654 -131297 -25181 -78279 -251242 4101
9962 -313366 100303 -180921 -26778 -7066 -167099 21913 -165057 -129230 -1169 -405006 -56903
9950 -11525 -140619 -213837 -236776 -93236 -58067 -129067 248489 -116541 -40847 -7716 -193750
9939 -193750 162186 10547 -195569 125459 -73572 -69601 -354917 140719 198124 -193369 -139828
9928 -139828 73517 -302856 13658 -92702 97553 -368532 186882 131130 -118528 310815 -261109
9916 -18742 -304281 -72950 123289 77325 -213539 -111608 -136515 -188446 398741 -283337 -189759
9905 -189759 57783 -225322 17264 -173962 28096 -371027 -280431 -111733 -232568 -13598 -120455
9894 -120455 228525 -202216 -3827 -159252 -349694 -94021 -130335 -109144 -3206 117890 212405
9883 212405 -228742 163121 -70804 57912 47994 -224445 -19947 -193868 -38592 -70990 -53511
9872 -53511 -378713 73755 52433 -407 321366 -167327 52151 171440 251276 7230 -26674 -16749
9860 -16749 -53974 -117442 -200071 -77551 -134358 -159094 100955 -51139 -72739 -276427 159135
9848 75235 -39355 -23176 -238351 93377 91257 79530 12091 -98186 135951 -150598 -21569
9836 93456 140017 31605 -58645 117989 -259980 -133648 316965 46263 -238474 9258 11782
9825 11782 127524 -193216 338262 -129669 -106705 -112225 281471 159029 -231123 -189044 -345638
9814 -345638 148094 46155 175172 -6134 -225170 127879 -435519 -343927 -93194 321745 -327284
9802 -300028 -319988 -202363 171253 75848 -20273 -274785 -124573 203992 -116918 -323925
9792 -323925 -509944 206337 -141916 -62403 -13195 8373 34349 -209081 -21478 -46065 -107468
9781 -107468 33922 -148796 -267686 -9650 -58811 -135001 -128526 198904 90096 335764 -148253
9769 -51854 140472 -57440 -173494 130511 -24760 -71675 -35662 -324898 -2255 302217 39383
9757 -212954 95181 33012 9163 304492 -67158 -94042 69525 -44514 65100 60759 -207091 -155592
9745 -155592 -96594 -165965 48104 46197 55725 -366371 36995 -244070 135798 -115372 124768
9733 -478401 -196184 -275052 -279528 -50205 248259 -74710 -243762 -29500 -112464 -4938 -307523
9722 -307523 -80627 282108 30561 -121654 -293315 11809 1462 -45869 -179957 137350 10495
9710 143705 213932 -192806 -329556 -101122 -4215 -480338 41499 -259082 -39167 -107915 167105
9698 -27688 158642 3666 -174243 191112 -170033 -28993 262434 -112394 -22956 14145 186683
9687 186683 -196641 -38880 -15391 -125072 -275961 -80147 -27154 -184316 -29890 -323023 -363915
9676 -363915 -45240 4627 -146265 155466 79288 63904 103508 162708 -109441 65454 -181121
9664 -44831 -108039 140704 37420 91668 218205 153561 -117539 -308548 171204 -132515 -123655
9653 -123655 -169687 -29775 56483 -47776 -129838 -175366 -60994 -26523 -152444 91197 -35373
9641 -284109 -253237 63275 154562 68189 166835 186412 -86051 64649 29846 -263641 -154157
9630 -154157 -194925 -12859 28177 -211897 -184885 655 -285886 -104463 -253074 31206 -57162
9618 -167394 -197968 244611 142124 -188908 -142691 145811 -120200 -185001 14655 -197656
9607 162789 80223 -275167 -120201 -337745 35058 150128 -65039 -304403 344341 -46433
9596 -12001 46856 177152 41815 120335 149723 1870 -314460 -164946 -109037 -146801 146598
9584 -26663 115762 -124815 -245941 -33082 -363883 -196748 237309 -496191 -63007 -241950
9574 -241950 -149097 -81408 -4624 -310199 -69350 24527 89511 -210378 28234 -10063 -331334
9563 -331334 3472 -163959 -200609 157797 232734 -5733 132404 -377593 -79602 80710 -101292
9551 42630 7764 -222182 -138090 -121378 -255477 -341074 -2468 65161 98908 -253019 -135898
9540 -135898 163254 74522 15163 -446279 -194240 -154781 -221687 -48917 -207279 -368583 -339960
9529 -339960 -180016 122224 -35218 56813 275558 -150251 117632 90373 15210 219860
9519 219860 15762 92459 65764 42332 -102474 10446 52208 -46821 -384762 245892 138864
9508 138864 -219840 62564 88477 -222370 -38715 -227168 61818 -233423 -94973 -85928 -15873
9496 -108807 -1163 -221112 -64924 52866 -78587 -124765 88406 -304027 86961 -95872 -430859
9485 -430859 109430 116306 103727 -181843 118347 19050 190365 -98631 45903 7815 -142980
9473 135090 12813 -277561 -122126 -29251 -128499 -103791 -57632 -33059 -470955 -79789 -106635
9462 -106635 -54848 145427 198233 -1624 -89305 -176733 195367 -271409 -56521 -129207 -232511
9451 -232511 -92514 -45085 -201475 -305445 -89777 198617 -74841 91253 -254745 7811 221194
9440 221194 35129 -54212 -119652 -146308 123609 -129489 51941 -199234 -25586 19566 -154659
9428 15884 -2290 -151073 -371064 -367826 183721 -200963 -34942 42171 126957 38344 3723 138623
9416 138623 -290678 -125546 -201318 -219089 -86300 -266107 -308200 -33004 -362826 72319 -2986
9404 -122021 78546 -324351 72427 -103171 118124 151237 252277 -304218 153367 -207531
9393 -64434 -6141 81871 -143330 -145603 -46555 127808 -129637 8725 -158406 -96600 290064
9381 -138741 83337 -92865 71761 371171 200828 176800 -15115 -100776 -184102 -186228 120379
9369 62350 -67284 74404 -70274 -120807 -193955 153826 -238578 -182190 120217 -125538 -164023
9358 -164023 -158369 -125674 -320817 63996 -93986 222355 -306266 -126578 181010 77607 -139330
9346 -105235 -358267 -101584 -73782 -199859 80901 -434259 -25608 50143 -517493 -131683
9335 -90847 54916 -67285 -197292 -40951 64915 -98469 59247 267509 10116 16232 31858 -362562
9322 24105 164377 -65442 26112 280727 100163 -208208 27366 42923 -52172 57171 -157598
9310 -314896 171687 43502 -35366 182027 101452 -139819 -69947 238512 -1367 53910 -39504
9298 235780 -223849 -190086 132994 -47946 -281567 -131898 -141802 -472478 -67311 104035 -86175
9286 -262545 -12555 -131983 -86102 74242 274316 7141 -291324 76041 -43812 -354955 -12002
9274 7565 -554907 -1980 123925 -7270 184569 -217002 -200745 31674 -31517 -139988 97846
9262 -102012 -375255 -35157 -339498 -115187 2576 -290247 14916 108737 -16467 155226 47867
9250 -248605 96570 -14472 -194157 -136404 -93150 -113148 -90032 79356 -36993 -74057 -131445
9239 -131445 -109474 -42248 -67808 -405746 30591 -30667 76980 -322907 242806 20539 -111057
9227 -176615 -110600 -417172 -59825 361351 110365 -233573 -61414 -172633 -116341 -203519 -79412
9215 3113 -151595 -114316 10761 -175634 -103387 -315926 346667 -346672 -8889 -23165 -299580
9204 -299580 -159423 64835 -91711 216002 44632 -28219 -226390 49395 4099 65188 -245943
9192 147307 -109033 36318 -156788 -347260 -298075 -535896 250480 -177275 -265095 125138
9181 -110258 -155264 -32193 177390 191045 99545 129942 64063 -615 98397 129421 -77181 -57050
9169 -57050 91737 274041 72207 -33676 221626 -206839 -150052 -6736 98125 -205574 -395011
9158 -395011 -417969 28793 85435 182512 -7906 113677 63546 296158 31040 -70072 -237320
9147 -237320 48685 -134210 215197 -262299 303274 -182991 -250568 -144804 -96899 -289511
9137 -289511 20744 -263471 -253341 164481 -71497 -144781 -364340 -82625 -153791 -283269 -181624
9126 -181624 6465 -103794 94382 -297757 -134266 110163 -104360 132175 98346 82015 37508
9114 -160487 -46166 -78472 19527 -94080 471 128498 130452 52994 -49918 -92404 -303760 -232528
9102 -232528 -57171 129391 -102974 71125 22483 -88356 -178961 -85500 -113159 66070 -183379
9090 -25475 -233878 28375 -131705 -41804 -1491 182080 -192552 -173570 245949 -47337 -25542
9079 -25542 177674 95215 -192021 -257318 39001 218745 -189120 -70926 -62508 240847 -268143
9067 -198221 -63813 -130221 -124520 -52871 -302501 423826 100575 -50144 -73202 -273899 -203150
9056 -203150 -167459 -178890 -317927 -33308 254734 -69989 273182 336852 -51592 -90753 -103769
9045 -103769 33514 -222402 -135324 -298277 189357 9051 88354 177963 -68569 330715 -207028
9033 -249329 -299327 -136042 153115 -212436 -115070 -58636 -168044 -79223 288738 -28313 -221277
9022 -221277 -178514 104006 51678 -338696 -156148 -246159 -146564 -137079 -104204 -109365 76450
9010 151409 -233874 -48203 -104198 -73088 215722 -114374 32690 -207051 -93663 89694 -117779
8998 -241998 -295161 -131771 163064 90010 60028 131422 -90809 471816 40486 -279188 -15895
8986 28381 306463 -323006 1579 -119032 -130285 -114404 204499 -209478 139364 42348 -194703
8974 -25836 131603 -262260 -38456 -113098 156743 -89679 -18645 -41162 -282523 42334 -117792
8962 134845 40876 71964 -78296 23956 -157372 -78110 1120 -101866 25277 -83547 7462 74415
8950 74415 29057 117778 54762 -243028 62787 -21573 100402 -201288 8963 -325926 -55837
8938 -222294 66312 -342805 -206196 165581 -35926 -155159 -29627 62276 -53479 -206797 -129019
8927 -129019 65218 -58883 -74450 -24754 154503 12924 115383 -5978 27883 75447 -306282
8915 -64358 -31410 25628 32079 485481 70053 138174 262401 490873 1875730 2294349 1174518
8904 1174518 493234 462155 150178 -143668 267927 -37089 35866 -166825 145053 -102258
8893 175919 -102308 234433 141843 60156 -306257 168593 129826 -167749 -69068 -115576 -20140
8881 -159262 -25718 -121568 -188061 -343392 74613 -136021 -277073 329840 -379959 208085
8870 -91070 214618 -16558 -15312 -19464 -21159 -233030 -93569 28571 -90226 -105220 60711 -168210
8857 303369 -233187 -32157 -228279 -230621 279777 -125457 -6884 -396557 253581 201265 -173616
8845 -229196 -39402 81032 -492655 135615 -25601 -361259 -18280 -111144 -24762 203419 -12739
8833 -77780 -54939 -181205 93822 -25825 -158206 217129 -61518 254796 286583 109344 -98773
8821 219915 70051 90038 41469 -194490 -24706 107397 -43847 -53017 47267 -408478 -101153
8809 95231 201771 234859 113434 2981 -150855 -104046 380734 65224 -105113 -150143 69434
8797 75497 -350697 -225394 87151 299918 -231818 -343429 -435272 -154002 22692 -96563 31833
8785 -292908 123946 26454 -26725 -276540 -206174 -180641 65735 -123397 19161 -44571 -44436
8774 -44436 19728 -41456 -116972 -132862 -332650 200065 42002 83671 67178 134857 -46149
8762 -336640 -40747 139396 -200403 32210 -369521 50933 179682 -130784 -180672 -515066
8752 -515066 337553 62995 -213032 52276 -237432 -130381 -61363 18679 -77010 -8862 -183611
8741 -183611 -79214 -221321 188878 -120134 -268749 -337149 10911 -479949 105009 -215101
8730 23150 45206 31213 102664 97022 142460 -106717 -178617 -116760 -217703 -161094 -98858 -231639
8718 -231639 187062 -332559 76936 -71835 176064 -81272 200227 220733 90469 -61092 -18329
8706 -243878 -287212 -124041 -91414 -339013 -24623 -10312 -238921 -49093 48178 -146557 71828
8694 -143581 -154507 20975 -436774 54311 30232 -171056 -136363 -413571 -367031 113699 -250831
8682 -77568 -198779 36291 -79942 -42886 -18807 155874 -102711 -210258 -120666 9031 216662
8671 216662 61676 189408 -76864 486208 -3837 -15175 239838 -132086 -172714 55509 -120153
8659 66082 -270473 93298 246381 42046 -307383 119294 -182696 -32563 -65170 -110138 -43454
8647 135566 -320945 -231484 -8288 345036 147490 140048 38982 102737 97089 -201393 -97588
8635 -268627 -23016 37952 -322628 17322 -171163 110948 -17319 -33867 201830 -187782 -418959
8624 -418959 101382 -123309 111979 -56758 -249980 -19531 113038 -27871 319551 -309163
8613 16931 -130831 107618 78480 287610 -223431 87260 101266 -189354 -116698 -206789 121202
8601 -43405 -125331 -56061 -2140 288896 -29579 -205903 -181601 -215854 1363 195761 -228127
8589 -469618 -123850 -238562 -96258 -206375 -67755 137409 -28495 -183684 81661 -106209
8578 -334952 -77383 -43038 32033 -255006 -127424 192341 -108026 -219706 -75499 -124093 271992
8566 68021 207492 -103171 -28564 19481 -205814 972 -40211 -221098 -216472 -115002 -210786
8555 -210786 63057 85968 -29253 -581595 -96650 13643 -347995 -27695 6555 63208 -195904
8543 -109669 129330 407028 29844 54856 -74175 -404710 -374088 -20780 -172227 79974 43884
8532 43884 -27153 471324 293467 -16181 201560 -43302 -267046 -82562 -355961 42391 -182889
8520 -12461 112369 -74125 73723 -70244 -282326 394431 -300218 -44736 -80915 -61400 -71575
8509 -71575 -185940 -76763 54342 -96430 180449 -167500 207727 -64560 249281 193625 -66468
8497 -199470 -79931 338563 -465850 -68120 -17212 -84718 95077 -72372 -124507 152536 391474
8486 391474 -404355 -150362 145002 65643 89882 244233 -452719 -12198 -337358 -76286
8475 123590 -188804 9535 247106 -115896 -128216 -76950 -230188 -159240 22603 -421803 -305115
8464 -305115 -150684 -61877 -105069 28928 34169 -67034 -142043 -25243 -10314 -226050 -221130 -236896
8452 -236896 -166575 159269 -247781 -66461 -179155 70982 264656 159436 -232581 63532
8441 187293 5649 -342618 -102995 -8592 15974 -54142 4249 -214594 71360 -93184 -177877 177112
8428 -116793 -18362 -76918 7797 -253479 -289238 -158192 -302597 -53054 -195636 -25486 -209220
8417 -209220 75396 -20444 -56479 -271901 -126648 -136414 -59232 -305879 -201515 53511 -1277
8405 -194109 265229 -260287 -69070 -94838 97254 -124841 120689 103199 107008 -78582 102362
8393 -86016 247629 231478 -38107 -361729 -269162 -135086 -30174 34844 172147 97513 -209056
8381 99704 250073 66373 371024 -10774 179486 381712 53788 -123173 207044 132976 57730
8369 84211 -124951 196644 95314 241718 -105430 -283756 245507 -577145 -129106 -242898
8359 -242898 -427727 -145142 157967 261385 -331389 -164488 66263 124460 23407 -66206
8348 -95131 -250123 128423 -161916 -91437 -352246 -112416 -302686 -221424 236176 -138638
8337 -69153 73638 -68832 281903 103214 -347705 87463 -163419 65825 -280503 -90227 19023
8325 -281440 -186225 -139966 63921 83383 -14520 -70418 -211506 2756 162012 -442420 -89859
8313 -114100 -50462 287041 -88650 -86373 -44102 171227 172244 137457 93535 -19183 -422796
8302 -422796 -38985 -15516 72253 16838 -192537 140106 39331 -105419 17548 -79601 -114418
8291 -114418 -127575 23727 -252690 73067 25607 411067 39867 96436 -22906 89107 -182071
8279 80169 -17982 -118028 101873 -316964 -33971 -84199 -99385 -270767 72469 -218745 69448
8267 -185642 63504 -69359 76547 -33742 44751 -33251 95535 -130250 -24136 -28810 174134
8255 107453 -287035 8848 -26419 -71432 -159213 130034 -352620 -24310 81527 29876 84595
8244 84595 -294321 -265522 -144953 -122178 -65174 -198421 -216764 142889 -336654 234 -133632
8232 -72733 -203457 107333 17371 110723 -53757 -239569 -25246 272896 381555 -93766 75933
8220 -159379 -9894 -19879 201769 -154626 -106484 182419 -15961 -297868 -102006 -15836 111996
8208 -107018 18993 -20896 -19034 -78857 -191572 -93728 -71491 -32151 -258432 65370 206118
8197 206118 -175176 146448 -161519 -703815 -43964 -298708 192512 -198891 52923 -311629
8186 -364588 132497 -165874 -22832 222798 209260 197785 -156452 181380 -240118 -55829
8175 -90485 80814 -50540 -224500 59682 -217350 -100435 -33432 167735 -51442 -57261 -212358
8164 -212358 -152562 -100779 -114126 -97511 -423119 94942 -258353 191888 64878 297711 60921
8152 -15927 -182397 317781 378880 16006 -127797 9743 144012 299697 -133086 -357717 251273
8140 3316 -6815 229413 97076 208506 -177502 -181548 2094 186558 -126279 -184502 36427 -224686
8127 11039 225976 -250054 353912 -40756 -78615 -398442 -71848 268125 39920 -98399 -45490
8115 -154486 162535 113999 -175319 84479 187108 -315223 -270798 -69547 91735 52800 -108859
8103 -5767 -210882 -30890 -121464 -84022 -353401 53422 69440 110207 65823 3136 85638 17740
8090 139427 77622 93570 84764 35265 70346 -392443 328315 -141914 -17160 -302443 -236177
8079 -236177 -57735 -93176 -95892 26471 3872 22608 -8125 -2833 52822 23032 -85948 -142535
8067 -142535 364823 13382 -179677 -140639 38034 80353 30990 -161915 -49220 -122006 -290151
8056 -290151 -295620 -29748 -363584 107579 17743 -391824 -194994 123936 24095 -97504 -258034
8045 -258034 -136964 73299 -151124 127149 -397257 -175972 158195 -102201 431076 -36578
8034 86927 -208916 60521 -134749 -50795 -248283 -377185 -90031 253552 -802 73053 -117839
8022 162636 19224 -340182 123698 -132503 -163620 -99414 -103751 37051 146995 254528 -92668
8010 117887 66373 -99388 -178442 -130511 -11402 -310401 58940 135814 -288259 34666 -23583
7998 -61416 -34165 -151654 116220 74433 -27799 -184025 -120548 87925 68014 -538 35883 183749
7986 183749 -244242 54027 56471 -111859 168413 -137381 -192927 -135136 125472 -239624 -10933
7974 29055 -27174 -70771 -224273 120353 -249984 -247010 -88733 -366041 -482569 -37693 -234592
7963 -234592 160106 -11596 27302 -18700 88671 99401 -167834 -121548 156931 -239573 221305
7951 -403038 122557 48603 315470 -252459 97239 -119751 124466 -65634 118254 -47253
7940 70113 151785 247981 44138 -132774 77261 19826 -76826 256632 30548 -196721 7143
7928 -65045 144385 -277885 -41426 -32784 41133 -169216 245515 -137025 628 -19634 -150435
7917 -150435 -114597 -177335 49837 -40548 -145800 -27229 -112067 -48609 193393 77847 20811
7905 -27087 -181744 172817 -57666 -207060 -46742 163741 -56794 -12657 -82399 61170 -119200
7893 75300 74458 144201 -197345 -81693 -88137 -338594 -80445 32546 -36122 -308285 -17830 310198
7880 149290 -385276 -225285 -41707 137591 -319535 101595 -91849 -60476 33749 316821
7870 316821 -49681 371476 -76313 -29745 -138050 72946 -224018 218994 -22723 230131 -163133
7858 58933 -139904 -325250 -283930 -123981 -64568 66655 -176379 -43862 138361 -14061 117364
7846 282444 -142666 -171994 61390 -335240 -7320 -33082 -54881 -74964 -65776 -188294 13539
7834 -135823 45119 28169 -42265 -88031 -142172 49523 -12190 -30699 385466 -191702 -223348
7823 -223348 -4774 -73024 -240806 -141931 11523 -30188 -27550 -210508 58475 218251 112432
7812 112432 -456645 199615 174881 186265 -131614 -204979 235503 149563 -82145 -125948 -46076
7800 -373145 249837 62196 -160800 -96301 181251 -34958 235474 -219434 188729 -319286
7789 -94458 13287 -249376 103727 -15103 4880 232800 -154054 -78377 -396626 59482 -108263
7777 344426 218146 94449 -143169 -1429 -102504 -236263 269773 -205575 -361086 185297
7766 119933 113042 -92817 46242 -155786 -37102 44203 43916 120470 -77785 -3156 -299910 263561
7753 -33828 60563 -198971 -196703 96546 239851 -73504 -46735 115662 35549 92837 -165317
7741 -181256 286897 71761 -110298 135656 -240222 59222 -45246 -365902 -210835 -29361
7730 -167213 -77306 -195812 56873 218597 -33217 46401 73802 40978 -160453 -12338 -145439
7719 -145439 33545 -10317 180151 -293301 47794 -66552 46356 -96766 190993 50936 -243368
7707 16996 517362 -225671 -242253 -25325 -353061 256081 469014 42588 144572 -34285 -45414
7696 -45414 -168823 -59326 -131138 93557 -161075 296704 110294 9802 -294971 192337 -345358
7684 -188875 -41523 -1885 -163915 258514 -86498 -192264 69326 -150860 -137524 115214 -41144
7672 -139919 -45846 217041 -204389 146689 135074 -145720 -72428 -75044 -281804 31991 112927
7661 112927 -171544 275160 -163005 -212236 438968 356655 120239 -129199 -117485 -169323
7651 -169323 -179280 -327823 190545 -251613 -243445 -31045 98793 36243 -75952 2635 168576
7640 168576 74336 -317185 -393267 -8393 -139515 209104 -261877 -214596 -94131 52852 196440
7629 196440 275694 412793 -166631 -76752 1361 -52214 54933 -137431 33571 90987 -299579
7617 -179316 94110 -89892 102953 81406 106646 47942 249512 41252 88670 -115485 -209750
7606 -209750 16582 -146554 -116903 -65315 -77967 103189 -52421 -191470 -324602 150102 52483
7594 71990 53832 -38369 -14023 -307836 -266526 -259118 -124231 -33361 -272645 -42515 36195
7582 -599002 -159366 -148626 69508 -126232 -111290 -307944 -83968 -137514 -450576 162693 -37868
7570 -6647 -172903 36041 281216 841 -161505 -226322 -355442 37284 -87190 -194140 -23170
7558 272135 77378 117098 -116585 20934 83856 -39375 -77428 11407 -190926 138254 -200407
7546 -22321 95147 -134723 245200 -46752 -174815 -132591 131684 -160477 110135 -162056
7535 -220565 149634 -22558 -169414 97458 -49408 24529 -290419 -137553 -150837 -138652 35091
7523 104805 -217357 -425114 -129081 145639 89087 -185806 -181609 -87173 -71391 93764 -81786
7511 100885 -18549 -77138 -217736 -41847 308696 -48878 -120851 -383132 -66091 137386 219868
7500 219868 348212 -13958 115064 -87175 -214301 147047 -238762 -24389 -94472 -181953 49991
7488 354063 -315697 287162 -19609 1904 178716 -143468 111158 -253701 25994 -106304
7477 -42641 -70805 26262 226681 -22124 -50176 -174987 378505 251705 145128 105607 -368528
7465 -381993 -120242 88932 -78308 87360 50682 -193988 -274395 -6378 -190827 -21730 200878
7453 95265 -11981 -308738 149165 -144289 224808 79973 -188714 -94294 97482 103085 -190929
7441 -286879 -89941 -73666 -374654 -135901 -19612 -82612 -13405 -207518 122358 -20492 -70353
7430 -70353 125979 -229638 -172292 -43020 -273240 -51129 -92346 -304380 -115759 -129390 76453
7418 113681 -205038 -236472 -239115 -69065 -229786 -51235 -9354 -3659 5064 336320 -165048 212755
7405 -42609 294532 -310806 105083 -304254 63740 71892 -76267 -192067 221595 161613 -81594
7393 -89894 131534 -163249 143985 306179 15054 -247995 344102 47617 -130296 309857
7382 -22238 -121228 -44470 4539 -257404 -443789 139358 -141128 -19114 116957 -27383 -174310
7371 -174310 -348251 -40749 -83413 234983 -374909 259827 -118736 -91380 58365 -59308 -34918
7360 -34918 -410670 -31383 -23666 -590092 213931 141227 -284040 -124572 126751 -200336 -139108
7349 -139108 -147341 104052 -195911 -79103 90792 -162506 -122236 -102547 -63220 -134535 -530718
7338 -530718 -468486 166263 98527 -28486 226910 -106317 -2587 172515 -197302 -95118 124894
7326 54337 -172406 98895 196556 106869 68171 -503280 -92340 -48032 -229924 185355 -1034
7314 157934 -86037 -71600 -295027 -375887 -20948 296538 -397147 30847 31717 32456 -218046 327026
7301 34390 -173672 -21621 222052 -153452 -107008 -208555 160859 411871 22317 -331436
7290 -13709 -88544 175302 -273614 -73907 6016 42233 15272 -536707 228420 21253 528 -189753
7277 -375489 152942 32478 -96709 212005 51484 -138669 224654 174187 69012 74974 140153
7266 140153 -23042 139957 -58709 68591 -67464 -6881 72819 169605 -36267 52729 237517
7255 237517 141969 27967 258100 -379344 -60026 60382 -62088 31600 13473 20237 -212968
7243 113152 216983 28029 41371 98320 -61934 104403 235344 364625 63779 -71579 -69524
7232 -69524 -179470 -125699 -17079 -24948 -19347 415248 5161 59625 32278 35832 166232 58781
7219 -360331 -83767 -52111 -117715 326915 -53010 215493 -29705 -211637 44006 -4180 19053
7207 -38118 144448 25721 -92564 17949 -331885 28127 -64939 -241975 -233324 62674 89548
7196 89548 -96384 217307 54721 -27699 158322 -27124 -49752 244577 -9158 -110518 21229
7184 -44904 -58622 -197302 -173973 -190505 -205649 138537 -244416 11105 139465 26120 118243
7173 118243 50333 -167820 221145 -94312 328677 -5948 -26545 -17517 -206118 -262813 -79266
7161 -69262 -7184 25662 22440 -162792 10020 -71688 -233642 -358054 139022 104674 106648 -99182
7148 420376 210562 -637473 -180036 69690 -117145 -340679 -12255 2094 208034 238367 66850
7136 -124124 20217 218768 -64799 -241114 -442968 -6226 13089 -140347 282487 -77603 158368
7124 -13106 47122 26800 -150845 -83248 -120049 -74170 -220548 -142200 52573 -45428 67320
7112 -8875 -177574 -170137 403808 -209229 54260 203943 -74164 224105 -295992 -153611 -129138
7101 -129138 -172747 67871 -44617 -76110 33940 93497 -66797 -195667 -61491 -257641 123323
7089 -109830 106428 -140625 -76626 -20563 222947 70924 -25632 -195278 -230770 144377 392326
7078 392326 143632 -20716 -192316 129084 -44504 -165246 -106549 -146125 -78016 -199351 325572
7066 -275809 61084 -27259 -161724 123093 -61393 77831 129029 404627 -172949 389164 -67048
7054 -338864 -89147 36014 -71014 -178732 68037 -61620 -8509 -100244 -65775 76419 61745 -6355
7041 -81104 -160514 -239131 27464 -18401 -17428 45479 70072 50452 -502465 -8620 -104416 185450
7028 -43945 124405 -153340 56541 -219057 -35356 -349816 -44707 -169474 -3563 29843 -291804
7016 -290716 228374 10462 -117555 88332 199542 307966 168092 140819 144239 -3245 -100193
7005 -100193 297999 -236079 225634 -4464 38506 -199378 -39056 53386 19125 65211 136986
6994 136986 -106659 -150924 196125 -270843 3025 -232346 -70196 -137154 -74476 -191563 -250185
6983 -250185 -294408 -180163 -99070 -12347 113130 -114147 -73038 -157116 -408859 -77694 173440
6971 226399 80501 43686 23057 332300 -119445 -1473 162017 -174141 7440 -263428 -382954
6960 -382954 -113145 -258790 131707 112737 -28556 124164 -415368 -104880 -75477 -18134
6949 25400 14992 -260302 38980 13894 394172 434010 41651 -105673 -346737 -119292 -121028
6938 -121028 108169 171019 -328628 -61294 205229 57872 -3609 446704 62834 119597 -238428
6926 -141440 51420 112767 -8906 89167 -55892 -54703 -401425 -336593 -113410 -67276 -149192 252648
6913 152421 -114388 -117930 -241709 6824 55109 -33474 182776 -287019 20366 445586 -267024
6901 71711 -84552 -18903 192378 283411 246690 -326150 -59833 -344677 97512 -332670 4741
6889 -84366 -250097 127186 157060 -228533 -297903 -269415 -79614 84082 -198012 560 4231 225811
6877 225811 -61596 -225536 71962 81844 -132373 -30361 94525 -41366 -26214 -253495 9967
6865 -71136 -218743 -100543 66617 67954 37468 94073 95821 186218 -143926 -98079 41114 59315
6853 59315 -44638 -43274 -109613 70194 -188911 335205 93193 -160127 -200490 -31816 -173856
6842 -173856 -123036 -131366 229036 30289 166903 -27465 -105675 -9952 74759 -91103 -90308 122728
6829 70574 -39442 -146379 1484 153466 142427 301900 -91178 -221841 -93388 -81401 -120073
6818 -120073 -18425 -84826 78114 -403444 -493907 -98472 129226 43378 -315385 115288 15423
6806 80032 174916 244527 -201918 194969 -48737 98483 -156979 -62857 -373986 -232314 -318439
6795 -318439 -122876 -22182 -36643 -221436 130203 260983 -7954 54139 208192 15445 316718
6784 316718 167382 32490 -57959 -114252 -228072 94114 3510 -267837 299270 376536 -138708
6772 156968 -33237 -196844 295407 -260287 161517 22506 -143243 -26547 107312 233239
6762 233239 -28435 -254866 173586 92652 129143 161671 188676 99997 -155191 263105 39899
6750 228564 27518 22541 -60208 -71650 227349 -67845 -233709 -289654 20006 -249564 -243094
6739 -243094 -161594 94537 39753 -281803 130638 -218659 129296 -44855 41374 257283 151225
6728 151225 -185404 343323 -208014 34980 -245996 231897 46047 49867 287071 -22976 280602
6716 95032 157570 164204 -85749 -122515 62627 245590 -183762 -19616 104668 9135 197122
6705 197122 -47441 -63567 -67385 151204 -271217 -9765 7870 -210071 -176871 33107 136613
6694 136613 227767 1413 -34988 -312987 232479 -136174 -280126 106924 177982 -381325 140676
6682 -25004 108197 -168477 -4857 -166556 -173429 80250 -201184 -99301 -11929 32547 -236089
6670 20254 347819 -136089 64758 129284 -56121 -34306 -40713 -201240 24625 204032 72338
6658 -298820 -98385 59624 353091 -30504 -48507 163609 -35485 -63216 -221730 176327 -55651
6646 42313 19675 93950 20580 -194304 -96496 -187673 -23282 158984 -48761 -116622 -150702
6635 -150702 155915 -39707 30499 -27051 -77530 134022 -254327 28024 243912 297987 -94406
6623 -154082 75453 -244930 -100054 -131803 -60537 96971 78729 -254807 159283 33323 7440
6611 -143115 64714 -483415 -19812 117534 -50217 -181098 -170868 -53200 -205838 -323076 -181969
6600 -181969 -131446 -128122 -170213 18032 -151790 22657 -121410 246506 110119 232224 117932
6589 117932 59629 -135195 -195302 -49668 -139660 -175455 91989 -309942 75499 71552 -573238
6577 -133170 -7529 54608 220434 111078 31655 -470164 133506 -38750 23520 -266403 -220555
6566 -220555 -215102 -107823 18407 147546 -149176 -208327 -242930 -332346 -26489 -99961 295887
6554 11535 292363 -103088 -146922 -91974 21188 168044 -27362 216713 360646 41093 -129801
6542 -144680 -15915 188578 156470 147937 15133 169931 -159092 210574 109582 -16083 -35031
6531 -35031 -193480 -81499 -230334 -204689 -32276 -65222 155236 5288 -71002 -223979 -52366
6519 78136 -299405 188974 -21012 -113531 -500560 -12476 -3707 191669 -122160 61192 -184434
6507 -196948 466999 -501442 -17269 19204 68517 -279901 186180 -244333 6664 59366 -41265
6495 -76083 -515659 247813 -165114 188051 -159824 -131149 -14765 52757 -199426 52459 8556
6483 49512 -75816 -150609 -94671 54973 195382 60987 125163 85464 24127 -312053 -187940
6472 -187940 -170059 -436663 -212544 381657 -2687 -186711 74842 -245959 103175 -349351
6461 -298548 19549 -139952 1266 -58435 66859 203556 421518 -105626 -40035 40858 62911
6450 62911 102602 64449 -56512 128023 -389565 155349 11633 315008 104492 81656 -142985
6438 -9699 -91416 17961 90449 260955 -52881 -130645 85985 213365 146536 -58732 149310
6426 169718 -9894 264011 -110666 91525 -26050 50019 134378 174246 -103845 -140977 121047
6414 28875 130215 -443418 -55036 -111454 -112569 -143692 -49864 -14996 199366 23782 -188952
6402 73532 -179309 -35614 256984 -189307 69393 -184593 54836 -52444 -49188 -12772 -156360
6391 -156360 -76587 -206970 158986 -56214 170362 106229 155958 120864 -124701 197064 112084
6380 112084 267361 30928 330432 220255 -114511 -230252 -25327 228493 -65677 -32853
6370 -32853 -202492 76483 70771 -30757 25220 35652 1311 -130171 86677 136767 204275 65269
6357 -114037 107351 29682 303735 229819 -258674 -131757 -516164 22829 -98837 89676 -119425
6345 2775 -7933 267409 -265580 306121 -1131 25921 -163899 -210494 -183116 -209955 -169611 144695
6332 -117328 183926 -107327 85662 -84871 208021 -62400 94226 -136350 -1709 85310 191821
6321 191821 -40272 -100434 -46990 243 -23651 162114 155166 -20907 -30418 66925 172405 103184
6309 103184 -102924 -38438 72831 -203493 -104807 215656 -445935 -33386 -7504 -281298 23532
6297 -287768 77420 -190500 -157346 -189901 -45487 -170180 138372 148885 194526 315929 -98277
6285 13901 -37573 75086 -88854 223617 -217690 -113544 -242100 334024 148169 -103502
6274 137384 -134933 -111356 -48104 197835 42371 -14958 -217364 208168 -108596 -246395
6264 -246395 -107721 1181 -192550 -210138 104081 -165467 -209312 221233 -44203 -264799 90797
6252 357421 -160068 147871 111809 -49374 102840 11347 265595 -256569 168868 -291469
6241 101298 -78741 206075 337312 -15736 -233815 -13747 26895 335381 -102673 451048
6230 -380373 190547 -50815 -119814 -341308 -90357 -72266 125788 168412 98040 -200641 110274
6218 193873 98067 -383981 -126413 40685 -58068 169812 -172822 -378934 31379 224220
6208 224220 -111733 -7644 -128837 -73386 -112926 -91341 -214704 -227424 -26898 70112 106625
6197 106625 -201416 287144 -175931 48402 -104328 26394 12545 -154716 -68225 -88402 -54372
6186 -54372 129635 125684 -37941 -268527 -40401 98619 -7884 168761 77191 -173627 -36837
6174 -81118 109146 -193292 28712 -60724 -35851 -60147 -277533 -154972 -103152 58527 -126360
6162 -64390 139862 -57101 146132 -34429 301339 -306122 61389 25038 262778 -284645 12202
6150 -58746 119746 77336 -42552 268844 -204742 -20853 -464027 -234910 -120892 200192
6139 301082 -83561 202623 -25243 157122 -128640 98021 85957 -112221 -423232 -130573
6128 -149303 -203427 199345 236721 -17988 192587 25577 247681 100124 -19064 -126330 306070
6116 -8537 49475 -117929 -42709 -53010 267099 -294269 -140060 -77534 7290 77009 211140
6105 211140 1657 167050 122305 12772 -363356 2382 -17018 -358434 -17329 311124 -43716
6093 211968 -7392 -26451 -109037 64777 94845 87959 -207381 -188757 77499 -10145 24033 63609
6081 63609 92186 142865 -296113 154384 59722 -92701 113191 210034 -67666 185129 84706
6069 -89910 18010 -82176 -104318 57987 -67539 -19275 93617 -145064 -121019 33749 53061 -7253
6056 -116930 35354 -36295 47984 276901 -98578 45922 104660 -41485 -236832 31008 -181091
6044 -33262 236065 358420 218230 17491 165960 -431123 200853 148139 19781 -79751 -7620
6032 -261764 89270 -35150 -113513 -30026 -113652 -239960 -277157 51742 -83552 -254716 -1342
6020 241399 -346499 -322150 13652 -60393 -122007 96349 41456 -85712 79472 -193072 -106717
6009 -106717 -335036 155364 146200 -89757 171224 319451 -48414 -11828 347145 -33230 -861
5997 -64324 -61620 334778 -34673 460 -246204 -82225 -2671 133820 291305 -113849 218528
5985 22235 69720 29308 243303 15823 70905 -205960 -36415 -31420 8283 -73857 124407 130974
5973 130974 258207 197181 173156 -144923 -101301 -48809 -240888 301301 86048 -162515 -34622
5961 -124858 337192 -32962 -146725 -156653 -13303 -127785 93247 68775 79204 63457 231711
5950 231711 114587 154944 41237 471574 221291 64116 -70692 43282 -106557 -136316 -157575
5939 -157575 98281 -119504 -60560 91204 -262536 7796 130410 -22027 382836 -1438 160215
5927 -285157 163173 -49803 79733 134309 61708 -79769 126305 -98417 -166572 -128519 -8629
5915 -123197 138632 129917 181185 138455 99544 -68559 -64669 -28472 231288 -257356 -65774
5903 -227718 -37127 60679 70153 112481 351022 -157513 -413598 -46856 73186 188608 164409
5892 164409 -440898 66417 10595 79015 -33281 85712 -325337 -285926 -248967 -143607 21462
5880 211441 -126240 340404 -81749 -93538 -197047 92815 -551383 -318138 -83890 147769
5869 -97479 58439 -613 30652 14919 107103 -135940 187253 117013 -162657 -74100 42583 376972
5857 376972 11773 -40689 26510 61406 -73533 406895 -110089 44534 81850 -168324 48993
5845 244219 -56727 -122290 -261940 -20485 55818 -251699 14591 73671 134158 -256204 31601
5833 -178458 -239029 107754 -128700 152311 -114988 -209711 89586 -193702 152117 -308476
5822 163329 -20268 -220603 122198 -293047 -50384 202601 63035 -109190 39896 -52811 403655
5810 -105354 117817 -338800 235697 181736 71843 -22172 69524 -24612 264524 -149494 26647
5798 -103333 95085 92819 289765 -161215 216062 210554 50416 -116042 95872 -85944 -60766
5787 -60766 -143357 249207 -185824 3620 -260180 -39816 -181097 95299 -112530 266377 -89177
5775 241807 -83104 26872 -13879 -35891 58064 314352 -28400 -11410 13994 -122018 283471
5763 -312161 111655 198324 -37938 -60058 117969 64986 158309 -165059 -113423 -185040 -14218
5751 164483 -55723 206670 -61445 -18724 141282 -131966 44387 79485 8138 -122085 67884
5739 162148 -28916 -144106 -55631 458446 185945 -90126 260106 -108188 205679 178763
5729 178763 -133099 193797 -75446 212427 152603 271469 -446153 -227033 -160752 45517
5718 -234326 70863 -196179 119938 32498 -11637 159526 -185766 -126297 91455 -43619 35303
5706 266672 -6013 189790 -192713 -157443 187165 -295674 53582 67898 262627 -43801 149416
5694 -51719 237533 -44879 -87606 221741 -284192 -150909 427442 100203 93965 98160 -325045
5682 -18830 -251919 -78863 256891 114011 -73112 -56079 406723 -297454 225143 -133534
5671 -81312 -119508 -135702 63643 -59690 162841 276413 -94404 -234264 381411 -4659 -350335
5660 -350335 118627 -25108 10472 376872 303108 -52416 137265 66063 136065 95946 253796
5649 253796 27480 -182455 37646 -229553 111883 -35232 155076 -404223 9732 -285065 -144688
5638 -144688 6864 -196015 226226 276237 -88386 -2458 48584 -18181 97270 230150 70032
5626 -91723 181898 -255321 330568 -174244 -58590 241205 -67246 -12824 -352289 -46298 -247426
5615 -247426 134081 8065 -132537 141984 122555 5325 202296 -34474 -93627 -393641 115476
5603 62053 -1888 20797 -214236 89670 -16924 71386 -49230 -72584 73239 -253266 25671 -78600
5590 1355 411577 157476 -56786 -288499 -206750 -67098 87610 -371998 -191055 211151 -43813
5578 355599 335937 -181595 197010 28971 227048 -189987 24926 -66380 -118079 -176964 -65388
5566 -64206 -414009 -41773 -197998 -144585 105939 34662 -47951 -191313 72305 131322 -326661
5554 304385 70882 -154390 36562 -22739 -77991 -189074 -111132 49907 -193964 21371 -93645
5542 -89649 -154156 64293 284003 -26969 -55411 242575 -139182 16833 119069 -115678 -83254
5531 -83254 -86116 150802 81595 58291 7794 178208 50589 -204101 23591 -77440 -12932 -90851
5519 -90851 -174467 -477814 47450 -22589 -75343 264905 384236 452719 16244 -94995 33244
5507 -142985 -80073 249031 4665 -14708 -180769 -367277 195432 140978 146989 127376 -260153
5495 -52483 -113409 -199224 -93042 157629 -89202 -206999 301726 -137508 205616 -210173 -23292
5483 -196569 -161313 -54224 22409 339620 216200 14395 2502 -231877 107138 -114718 211184
5471 -133597 -122453 -31947 238242 -24390 269306 -66996 -98363 50640 -219987 -77425 122464
5459 337458 135048 -29677 142217 3042 -445695 239984 -168490 -208311 18498 -133023 -219232
5448 -219232 -177636 -191147 114605 -355399 96801 86959 -31207 -1621 45022 131821 158014 3803
5435 -233078 158520 -28800 118079 -1943 119992 -171365 -74077 223427 531452 -444863
5424 -179222 -129321 184296 -228986 42692 240218 -75381 462449 433657 -399217 301011
5413 115744 96331 107271 76540 64534 72447 -89383 110559 32784 -142615 -307422 -71605
5401 -279363 -56823 -49716 -68811 244622 135601 50197 -51602 188706 -51750 252332 34686
5389 348775 84696 292866 -32409 -197725 213104 70402 -161012 74285 -203752 -86548 -132767
5378 -132767 -174915 134831 87031 -106650 93921 -358833 340631 157008 66020 175462
5368 175462 80148 131295 17850 114361 -17803 -17259 134763 92568 175598 -188010 -42149 -344203
5356 -344203 260159 197493 -13113 221687 -79888 -251385 -360605 98619 120455 178809 -103940
5344 -59081 -100605 -164551 25191 89257 71264 -371706 188624 67219 230916 4811 77960
5333 77960 133329 342711 -126427 -134335 28386 39758 -214758 -127112 -143778 158637 -53629
5321 180953 -36786 -101936 154279 95397 -45455 18502 -12875 253910 -37785 197070 57379
5309 319643 -266341 -41969 -153629 -229550 -25528 -202681 -312940 99915 -135414 -89096 46783
5297 88946 -369 -9174 129244 125896 -100676 -58047 43057 -78187 -50097 86597 -87636 -94786
5285 -94786 28112 -319968 -32593 -246495 -180606 59262 -67832 -51017 165677 281463 54735
5273 -38021 -293036 -113713 106475 -155633 -15434 414988 -56250 -211571 -55698 -27243 -153679
5262 -153679 213792 20819 -199344 29466 -68624 56294 -295313 373555 113019 8922 -412627
5250 -228840 134481 102149 -121819 121317 -80266 -22356 39656 18190 246203 -19130 34047
5238 190887 257716 -213994 39006 130331 281969 -81527 10043 98299 18814 -131467 152115
5226 177926 97414 -231923 113972 -286817 154428 178077 388506 -61412 -83534 19114 123882
5215 123882 -108647 22746 77084 310312 121135 -156190 -83547 -222201 4281 -151611 -246206
5204 -246206 -265681 -19005 168477 -281548 -69492 51713 -180169 77968 246633 -230234 -242668
5193 -242668 -128184 85684 -268253 176730 44754 -48045 -261444 247115 -349676 -168089
5182 -64171 -289415 53879 203589 -432195 -183729 126106 -124680 -262892 -207567 101654
5171 -47511 -31464 13678 39191 27701 134593 803 -74916 70114 51742 127476 -155020 -236661
5159 -236661 118610 144364 -155849 61410 90405 71673 126533 136777 48730 -153367 -199837
5148 -199837 305038 -100197 -287391 15229 -143366 -18945 -69114 204391 332343 20077
5137 -304024 -338231 -414020 93096 76032 22113 -59233 -46600 -155174 61150 139025 -140477
5125 -274039 -28699 460545 26390 18066 71283 40626 12365 -79913 -194795 -273499 92135
5113 153117 -62919 38507 -28510 -177051 15895 99958 -95548 -6628 178684 201803 189636
5102 189636 -316514 62629 76833 64938 -200218 251985 189652 -15951 -287129 -43191 86089
5090 -148331 132721 -195783 24668 -644334 -374268 107039 -136880 -174725 -111568 230829
5079 -144133 272736 47001 -159151 -167792 -37341 -46614 6403 101034 67564 313473 -75840 -172093
5067 -172093 113932 304760 32710 -208998 124273 -139204 -153725 362091 -162586 -29336
5056 -185227 164254 -59239 -80640 -95130 135906 -142026 -79009 106925 21968 -43267 -60333
5045 -60333 164956 78009 -63613 287274 182056 161822 -4827 81131 -137958 314596 -221510
5033 46482 -159803 284390 -246692 -73488 -42338 17007 -115514 -58545 368238 43638 -375181
5021 161055 321220 7420 24848 154727 187854 63538 63182 -87332 -172245 -27422 90007 300120
5009 300120 -114989 267885 -164401 -52977 163151 -13689 21577 -65180 -8650 45739 37143
4998 37143 86071 -111393 82315 258262 -94636 -29742 -53953 -955 35748 -97288 210672 36650
4985 -35119 -123620 -89255 8797 -89352 326952 19750 42053 -1294 359356 14909 -292845 63183
4972 51116 308224 -347992 209527 84955 -91550 -84319 -5321 -179116 -71018 -283971 -110273
4960 199497 288456 125395 -48144 -153058 120182 265940 -153491 -21730 50775 -265411
4949 -106301 33621 -122114 123694 -224208 470813 459358 -56419 -334796 491456 229603
4938 115420 182667 77639 18013 219799 -46570 -55863 -110674 -156312 -75564 -2998 14077 243060
4926 243060 218928 -247618 -125327 93810 61983 -136596 118125 156003 -207305 75061 -272938
4914 64508 151186 -108007 94458 119807 29967 61503 -106166 -109524 87759 -276777 37589
4902 -153103 79647 -24885 207620 -32396 375034 -67065 -211841 250726 -56862 -83209 123837
4890 -125192 66873 -30111 405710 -36201 -24250 -154753 217780 -178181 -116897 -72622 11494
4878 -90813 -44329 -22877 131521 -285947 -112142 335992 -168567 84048 -142078 287016
4867 -180909 58164 -14879 -133996 60834 27970 217734 107279 -184146 106450 11969 -50564
4855 99982 91793 269350 -185780 77944 -351695 -52368 -153053 197914 -69404 -92404 69401
4843 129462 -51592 178188 -78808 10951 82605 21320 50715 79600 -78068 -39615 -36553 -460733
4831 -460733 45209 250471 203274 119183 -100308 130689 -57933 -147833 180980 239172 -292521
4819 -220742 21270 70660 594310 63505 -227131 -57290 119907 51004 1374 -190458 133219
4807 62781 -244041 -47625 -355746 279759 234507 -83034 -194253 44917 -428049 -93562 -93873
4796 -93873 16764 -185649 124640 30225 -66986 217348 89132 15447 98333 -205785 215824
4784 172026 -416260 -126280 30445 84667 309835 -22093 52708 39130 -69575 214954 -93233
4772 -56343 188436 -175423 -121337 133810 -213788 -291288 43011 -51864 -101003 -22858 106941
4760 -61010 -271349 12224 47034 -111932 -384927 -151408 201130 -17553 -210988 -184272 622338
4748 144413 242586 86524 -152254 109098 -87432 339135 -220189 -205229 133270 -17512 -168112
4737 -168112 -99033 20915 473800 152599 67445 193065 -309143 -113716 163672 186049
4727 186049 21229 -18196 75361 252722 -82547 -39896 -77512 -27612 48230 57074 -167791
4715 28219 113677 -101945 168296 -163280 72750 -193584 203390 123983 115512 -190694 -248798
4704 -248798 -371291 -89074 60604 -19046 63955 -149286 30733 128473 -222404 40482 259793
4693 259793 112377 245312 -246515 263756 84985 54057 -67867 -365454 187469 95640
4683 95640 86400 4297 -167853 -156094 12473 -147681 30608 301299 200079 -15782 -163009
4672 -163009 15065 69034 957 -120421 -143136 66913 -41436 21650 54773 24287 59071 305568
4660 305568 -219759 305640 -2923 -246064 27519 -358879 -273122 -136386 25960 32339 -55359
4648 -156651 204365 -167878 222902 314897 177994 51326 -172979 105700 62574 -129173
4637 33489 14144 66486 251347 -3613 -76015 -24341 254391 51221 78804 21185 -320605
4625 -36727 38243 -40548 72373 -226479 -106050 222610 -314776 40959 19694 -196178 77737
4613 -22303 106784 222130 -164997 -171435 -186989 192349 62513 -176990 -50663 61243 -156354
4601 -138601 -265434 19841 42903 214050 -20486 121916 -180251 -281517 279981 -297866
4590 264544 -47674 -403998 -46937 -118644 -107365 2131 -38008 204999 -123740 -253009 -185135
4579 -185135 310934 -42598 -183981 463092 -48740 -109168 -152654 38489 -51566 124028 96609
4568 96609 227339 -5420 -185232 3599 176321 1830 -444641 -184287 -283748 -410238 -14134
4556 159378 -48340 -26089 13391 126538 98508 -348301 394774 115424 343916 -8770 -51258
4545 -51258 213738 175846 -59110 -137768 -10113 287484 3195 -6096 -188091 -157683 399520
4533 148138 208798 154652 -49021 -26295 17142 -166812 -244633 -60304 172536 -55329 -24205
4521 289410 -69838 -5071 60056 -341473 -97055 -276892 -211194 -111092 33832 43069 1994 85163
4509 85163 25433 218371 -108327 -98092 168679 -92005 236763 -91554 186968 -111732 1067
4497 -78406 84655 -45308 -127651 101502 269461 210063 74802 1576 41386 -78478 260777
$$ [...]
##END NTUPLES=NMR SPECTRUM
##END=
