
##TITLE=AC1225_PUEHDE098_6075357_c2Lw6cslGK
##JCAMPDX= 6.0         $$ Bruker NMR JCAMP-DX V2.0
##DATA TYPE= NMR SPECTRUM
##DATA CLASS= NTUPLES
##ORIGIN= BRUKER
##OWNER= Administrator
$$ 1.72 TOPSPIN		Version 2.1
$$ 2012-05-07 22:27:14.296 -0500  Administrator@TOPSPIN
$$ Compression mode = diff/dup
##.OBSERVE FREQUENCY= 400.13188235
##.OBSERVE NUCLEUS= ^1H
##.ACQUISITION MODE= SIMULTANEOUS (DQD)
##.ACQUISITION SCHEME= undefined
##.AVERAGES= 64
##.DIGITISER RES= 22
##SPECTROMETER/DATA SYSTEM= spect
##.PULSE SEQUENCE= noesygpps1d.comp
##.SOLVENT NAME= COFFEE_meoh
##.SHIFT REFERENCE= INTERNAL, COFFEE_meoh, 1, 14.96638
##AUDIT TRAIL= $$ (NUMBER, WHEN, WHO, WHERE, PROCESS, VERSION, WHAT)
$$ ##TITLE= Audit trail, TOPSPIN		Version 2.1
$$ ##JCAMPDX= 5.01
$$ ##ORIGIN= Bruker BioSpin GmbH
$$ ##OWNER= Administrator
$$ $$ C:\Bruker\TOPSPIN/data/COFFEE/nmr/AC1225_PUEHDE098_6075357_c2Lw6cslGK/12/pdata/1/auditp.txt
$$ ##AUDIT TRAIL=  $$ (NUMBER, WHEN, WHO, WHERE, PROCESS, VERSION, WHAT)
(   1,<2012-05-07 22:27:09.375 -0500>,<Administrator>,<TOPSPIN>,<go>,<TOPSPIN 2.1>,
      <created by zg
	started at 2012-05-07 22:15:39.156 -0500,
	POWCHK enabled, PULCHK disabled,
       configuration hash MD5:
       AF F2 23 6B 01 CD 40 DD E5 A1 38 A0 06 EA F7 77
       data hash MD5: 64K
       24 FB 0E A0 B9 DF CC 3B F1 B9 DC 70 37 32 71 ED>)
(   2,<2012-05-07 22:27:12.093 -0500>,<Administrator>,<TOPSPIN>,<proc1d>,<TOPSPIN 2.1>,
      <Start of raw data processing
       efp LB = 0.3 FT_mod = 6 PKNL = 1 PHC0 = 0 PHC1 = 0 SI = 128K 
       data hash MD5: 128K
       E5 05 F2 F1 1E B4 E9 52 D7 95 05 C7 66 AF 59 AE>)
(   3,<2012-05-07 22:27:13.421 -0500>,<Administrator>,<TOPSPIN>,<proc1d>,<TOPSPIN 2.1>,
      <pk PHC0 = 34.70032 PHC1 = 0 
       data hash MD5: 128K
       DF 18 6F 29 CE E0 A3 A9 FF 8B 33 FB CD 3C 95 25>)
(   4,<2012-05-07 22:27:13.984 -0500>,<Administrator>,<TOPSPIN>,<proc1d>,<TOPSPIN 2.1>,
      <abs ABSG = 1 
       data hash MD5: 128K
       87 41 39 90 13 F4 69 AD 50 17 4C 27 38 78 12 F0>)
(   5,<2012-05-07 22:27:14.062 -0500>,<Administrator>,<TOPSPIN>,<proc1d>,<TOPSPIN 2.1>,
      <abs ABSG = 2 
       data hash MD5: 128K
       87 8C 0E FC 1E 8F 1D E3 B7 15 02 FB AE 05 68 4E>)
(   6,<2012-05-07 22:27:14.109 -0500>,<Administrator>,<TOPSPIN>,<proc1d>,<TOPSPIN 2.1>,
      <abs ABSG = 3 
       data hash MD5: 128K
       FE B3 7C F7 BC DA A4 E2 FB 7A 30 4E 24 32 9C 02>)
(   7,<2012-05-07 22:27:14.156 -0500>,<Administrator>,<TOPSPIN>,<proc1d>,<TOPSPIN 2.1>,
      <abs ABSG = 4 
       data hash MD5: 128K
       F2 DE 02 6A 7E DF 6D CF AF 72 3C 9C E8 F4 84 AD>)
(   8,<2012-05-07 22:27:14.203 -0500>,<Administrator>,<TOPSPIN>,<proc1d>,<TOPSPIN 2.1>,
      <abs ABSG = 5 
       data hash MD5: 128K
       99 E8 FE FD 85 42 36 EA 65 D3 3F 78 E8 94 B2 05>)
$$ ##END=
$$ 
$$ $$ hash MD5
$$ $$ 68 8A 26 FB 05 C6 2E 29 51 8A F2 9D DA 75 A9 D8
##$RELAX= 
##$RELAX= 
##$RELAX= 
##$RELAX= 
##$RELAX= 
##$RELAX= 
##$RELAX= 
##$RELAX= 
$$ Bruker specific parameters
$$ [...]
##$TP07= 0
##$TPNAME0= <>
##$TPNAME1= <>
##$TPNAME2= <>
##$TPNAME3= <>
##$TPNAME4= <>
##$TPNAME5= <>
##$TPNAME6= <>
##$TPNAME7= <>
##$TPOAL= (0..7)
0.5 0.5 0.5 0.5 0.5 0.5 0.5 0.5
##$TPOFFS= (0..7)
0 0 0 0 0 0 0 0
##$TUNHIN= 0
##$TUNHOUT= 0
##$TUNXOUT= 0
##$USERA1= <user>
##$USERA2= <user>
##$USERA3= <user>
##$USERA4= <user>
##$USERA5= <user>
##$V9= 5
##$VALIST= <valist>
##$VCLIST= <CCCCCCCCCCCCCCC>
##$VD= 0
##$VDLIST= <DDDDDDDDDDDDDDD>
##$VPLIST= <PPPPPPPPPPPPPPP>
##$VTLIST= <TTTTTTTTTTTTTTT>
##$WBST= 1024
##$WBSW= 4
##$XGAIN= (0..3)
0 0 0 0
##$XL= 0
##$YL= 0
##$YMAX_a= 10686459
##$YMIN_a= -5910975
##$ZGOPTNS= <>
##$ZL1= 120
##$ZL2= 120
##$ZL3= 120
##$ZL4= 120
##$ABSF1= 14.96638
##$ABSF2= -5.58615
##$ABSG= 5
##$ABSL= 3
##$ALPHA= 0
##$AQORDER= 0
##$ASSFAC= 0
##$ASSFACI= 0
##$ASSFACX= 0
##$ASSWID= 0
##$AUNMP= <proc_prof1d_extract.lims>
##$AXLEFT= 0
##$AXNAME= <>
##$AXNUC= <1H>
##$AXRIGHT= 0
##$AXTYPE= 0
##$AXUNIT= <>
##$AZFE= 0.1
##$AZFW= 0.1
##$BCFW= 0
##$BC_mod= 0
##$BYTORDP= 0
##$COROFFS= 0
##$CY= 15
##$DATMOD= 1
##$DC= 0
##$DFILT= <>
##$DTYPP= 0
##$F1P= 0
##$F2P= 0
##$FCOR= 0.5
##$FTSIZE= 131072
##$FT_mod= 6
##$GAMMA= 0
##$GB= 0
##$INTBC= 1
##$INTSCL= 1
##$ISEN= 128
##$LB= 0.3
##$LEV0= 0
##$LPBIN= 0
##$MAXI= 10000
##$MC2= 0
##$MEAN= 0
##$ME_mod= 0
##$MI= 0
##$NCOEF= 0
##$NC_proc= -3
##$NLEV= 6
##$NOISF1= 0
##$NOISF2= 0
##$NSP= 0
##$NTH_PI= 0
##$NZP= 0
##$OFFSET= 14.96638
##$PC= 1
##$PHC0= 34.70032
##$PHC1= 0
##$PH_mod= 1
##$PKNL= yes
##$PPARMOD= 0
##$PPDIAG= 0
##$PPIPTYP= 0
##$PPMPNUM= 2147483647
##$PPRESOL= 1
##$PSCAL= 4
##$PSIGN= 0
##$PYNMP= <proc.py>
##$REVERSE= no
##$SF= 400.130005694423
##$SI= 131072
##$SIGF1= 0
##$SIGF2= 0
##$SINO= 400
##$SIOLD= 131072
##$SPECTYP= <>
##$SREGLST= <1H.CDCl3>
##$SSB= 0
##$STSI= 131072
##$STSR= 0
##$SW_p= 8223.68421052632
##$SYMM= 0
##$S_DEV= 0
##$TDeff= 65536
##$TDoff= 0
##$TI= <>
##$TILT= no
##$TM1= 0
##$TM2= 0
##$TOPLEV= 0
##$USERP1= <user>
##$USERP2= <user>
##$USERP3= <user>
##$USERP4= <user>
##$USERP5= <user>
##$WDW= 1
##$XDIM= 131072
##$YMAX_p= 366312989
##$YMIN_p= -57093792
##$CURPLOT= <Network HP LaserJet P1505>
##$CURPRIN= <$Network HP LaserJet P1505>
##$DFORMAT= <normdp>
##$LAYOUT= <+/1D_H.xwp>
##$LFORMAT= <normlp>
##$PFORMAT= <normpl>
##$SURQMSG= 1
$$ End of Bruker specific parameters
$$ ---------------------------------
##NTUPLES= NMR SPECTRUM
##VAR_NAME=  FREQUENCY,     SPECTRUM/REAL,   SPECTRUM/IMAG
##SYMBOL=    X,             R,               I
##VAR_TYPE=  INDEPENDENT,   DEPENDENT,       DEPENDENT
##VAR_FORM=  AFFN,          ASDF,            ASDF
##VAR_DIM=   131072,        131072,          131072
##UNITS=     HZ,            ARBITRARY UNITS, ARBITRARY UNITS
##FACTOR=    0.0627417313425165, 1,          1
##FIRST=     8223.62146879498, 7291,         -107006
##LAST=      0,             9817,            -105440
##MIN=       0,             -57093792,       0
##MAX=       8223.62146879498, 366312989,    0
$$ Real data points
##PAGE= N=1
##DATA TABLE= (X++(R..R)), XYDATA
$$ [...]
61440D15570N10k39k40L77J337J979J507p1j655k157j635q57j25P83J616J544
$$ 415570 416080 415841 415601 415978 417315 419294 420801 420730 419075 416918 415283 414426 414301 415084 416700 418244
61424D18244M23p03r72q81j198j357j86J976L376L292K902L189L407K593J342
$$ 418244 418667 417964 416992 416111 414913 413556 413370 415346 418722 422014 424916 428105 431512 434105 435447
61409D35447P04K22j245l209l784k318k97P75J094J620K449K928K770K289J904
$$ 435447 436151 436373 435128 431919 428135 425817 425520 426295 427389 429009 431458 434386 437156 439445 441349
61394D41349J815J909J622L99j372k267j301P65K156K153J921K982N141O482N569
$$ 441349 443164 445073 446695 447094 445722 443455 442154 442919 445075 447228 449149 452131 457272 463754 469323
61379D69323L157J284J027J897L171M566N392M515K194P46J884M136M564K666
$$ 469323 472480 473764 474791 476688 479859 484425 489817 494332 496526 497272 499156 503292 507856 510522
61365E10522P82O53J452J755J652J978K767L574M296M682L982K157O67Q15J899
$$ 510522 511304 511957 513409 515164 516816 518794 521561 525135 529431 534113 538095 540252 540919 541734 543633
61350E43633K167J200J32k56m02q86j589k162k528k645k450k290k728l726m464
$$ 543633 545800 547000 547132 546876 546474 545588 543999 541837 539309 536664 534214 531924 529196 525470 521006
61335E21006m235l101j574j18Q20Q23%p72n58N42J330P07j056k523k620j647m75
$$ 521006 516771 513670 512096 511978 512798 513621 513621 512849 512291 512833 514163 514870 513814 511291 508671 507024 506549
61318E06549Q19K688M651N239L961K403K506M245N842N937M683K970J484O47N88
$$ 506549 507368 510056 514707 519946 523907 526310 528816 533061 538903 544840 549523 552493 553977 554624 555212
61303E55212R56J218J266J401J799K492L663N358O988P819P899P931Q238Q628
$$ 555212 556168 557386 558652 560053 561852 564344 568007 573365 580353 588172 596071 604002 612240 620868
61289F20868R260J0657J2572J3680J2940J0845Q889Q111Q320Q398P219M794K563
$$ 620868 630128 640785 653357 667037 679977 690822 699711 707822 716142 724540 731759 736553 739116
61276G39116K097L424N163O191O382N798M395K783K022J945R12j845m592n093
$$ 739116 741213 744637 749800 755991 762373 768171 772566 775349 777371 779316 780228 778383 773791 768698
61262G68698l525k053j970k598k892k755k548k347k023j372m6K038M172N422N676
$$ 768698 765173 763120 761150 758552 755660 752905 750357 748010 745987 744615 744569 746607 750779 756201 761877
61247G61877N465M967M108L483M017N483O474O125M869L205R45j736l630l890
$$ 761877 767342 772309 776417 779900 783917 789400 795874 801999 806868 810073 811018 809282 805652 801762
61233H01762l309l296m106m906n161n072m906m627m120l333k391j704j545j308
$$ 801762 798453 795157 791051 786145 780984 775912 771006 766379 762259 758926 756535 754831 753286 751978
61219G51978k6K053L432L525L690N049O510O485N594N743P028P732P318P279Q422
$$ 751978 751952 754005 757437 760962 764652 769701 776211 782696 788290 794033 801061 808793 816111 823390 831812
61204H31812R401Q914P736P299P612P862Q084Q815R790J0182R787Q905P528N624
$$ 831812 841213 850127 857863 865162 872774 880636 888720 897535 907325 917507 927294 936199 943727 949351
61190I49351L860L049L182L751M539N202M750K617q1j726k332l207m613n352m967
$$ 949351 953211 956260 959442 963193 967732 972934 977684 980301 980220 978494 976162 972955 968342 962990 958023
61175I58023m781o007p948q951q382o843n064l402k135j547j681k251k657k224
$$ 958023 953242 947235 939287 930336 921954 915111 910047 906645 904510 902963 901282 899031 896374 894150
61161H94150r07K30j0j373k357k122j245l22R60K561L169J794m99j751j573j061
$$ 894150 893243 893473 893463 892090 889733 887611 886366 886044 887004 889565 892734 894528 894029 892278 890705 889644
61145H89644o55L78K268L981M640M613M695N215O379Q522J1250J3235J3691J3433
$$ 889644 888989 889367 891635 895616 900256 904869 909564 914779 921158 929680 940930 954165 967856 981289
61131I81289J3638J3985J3122J0784Q495P796Q400Q444O469L011L15L47K859N452
$$ 981289 994927 1008912 1022034 1032818 1041313 1049109 1057509 1065953 1072422 1075433 1075748 1076095 1078954 1084406
61117A084406N783L679J043q8O09J601R84j583m429n667n367n238o106o876o513
$$ 1084406 1090189 1093868 1094911 1094823 1095432 1097033 1098017 1096434 1092005 1086338 1080971 1075733 1069627 1062751 1056238
61102A056238n900o538q172r219r046q417p890p364p279q454j0257j0596q563
$$ 1056238 1050338 1043800 1035628 1026409 1017363 1008946 1001056 993692 986413 977959 967702 957106 948543
61089I48543n798m220l781l554l744n078p090q716r950j1384j2541j2393j1336
$$ 948543 942745 938525 934744 931190 927446 922368 915278 906562 896612 885228 872687 860294 848958
61076H48958j0895j1416j1613j0665r096p269m763j957n40j258k433j930L38L064
$$ 848958 838063 826647 815034 804369 795273 788004 783241 781284 780744 779486 777053 775123 775461 778525
61062G78525N686Q487J1124J2683J3163J3709J5214J7446J9618K1015K1269K0772
$$ 778525 784211 792698 803822 816505 829668 843377 858591 876037 895655 916670 937939 958711
61050I58711K0740K2033K3885K4683K4000K3000K2615K2294K1034J8843J6450
$$ 958711 979451 1001484 1025369 1050052 1074052 1097052 1119667 1141961 1162995 1181838 1198288
61039A198288J4007J0924P005L097K05j815m184p623j1236j3509j4328j5241j7408
$$ 1198288 1212295 1223219 1230224 1233321 1233526 1231711 1227527 1219904 1208668 1195159 1180831 1165590 1148182
61026A148182k0025k1462k1462k1271k1793k2509k2491k1684k0680j9745j8578
$$ 1148182 1128157 1106695 1085233 1063962 1042169 1019660 997169 975485 954805 935060 916482
61015I16482j6969j5291j4223j4018j4150j3786j2651j1293j0358r732q615o370
$$ 916482 899513 884222 869999 855981 841831 828045 815394 804101 793743 784011 775396 769026
61003G69026l313o77L55r9m28R16L670O135P334P993R109J0551J1725J2800J4320
$$ 769026 765713 765036 765391 765292 764864 765780 769450 775585 782919 790912 800021 810572 822297 835097 849417
60988H49417J6139J7686J8956K0346K1803K3021K4220K5983K8500L1653L5369
$$ 849417 865556 883242 902198 922544 944347 967368 991588 1017571 1046071 1077724 1113093
60977A113093L9096M1553M2259M2807M5300M9763N4428N8266O1686O5017O8289
$$ 1113093 1152189 1193742 1236001 1278808 1324108 1373871 1428299 1486565 1548251 1613268 1681557
60966A681557P2685Q0205R1183J03905J17287J32084J48799J66554J85245K06537
$$ 1681557 1754242 1834447 1925630 2029535 2146822 2278906 2427705 2594259 2779504 2986041
60956B986041K30984K56390K81118L06254L30039L41082L22852K68414J89392
$$ 2986041 3217025 3473415 3754533 4060787 4390826 4731908 5054760 5323174 5512566
60947E512566J08900M6487R961k280L724J8545K8289J7002k5729r6930j79705
$$ 5512566 5621466 5667953 5677914 5675634 5679358 5697903 5726192 5743194 5717465 5620535 5440830
60936E440830k52375l00591l22436l24175l13354k95755k75505k54806k33584
$$ 5440830 5188455 4887864 4565428 4241253 3927899 3632144 3356639 3101833 2868249
60927B868249k11141j88397j67445j49220j33034j18533j06445r6893q8430p9769
$$ 2868249 2657108 2468711 2301266 2152046 2019012 1900479 1794034 1697141 1608711 1528942
60917A528942p1379o4291n8258n2424m7129m3421m0999l8257l4589l1197k9177
$$ 1528942 1457563 1393272 1335014 1282590 1235461 1192040 1151041 1112784 1078195 1046998 1017821
60906A017821k8050k6858k5436k3858k1788j9356j7624j6973j5987j3373j0219
$$ 1017821 989771 962913 937477 913619 891831 872475 854851 837878 821891 808518 798299
60895G98299q643q643q158o198m040k929k334j366m32m16j097j391o59Q52K403
$$ 798299 789656 781013 772855 766657 762617 759688 757354 755988 755556 755140 754043 752652 751993 752845 755248
60880G55248L172K903K485L098M329M188J608j839l590k841j016m8q15k694m095
$$ 755248 758420 761323 763808 766906 771235 775423 777031 775192 771602 768761 767745 767697 766882 764188 760093
60865G60093l892k778k466l303l787k912j721j547k033k219k473l681n171n221
$$ 760093 756201 753423 750957 747654 743867 740955 739234 737687 735654 733435 730962 727281 722110 716889
60851G16889l402r40J009K005J596l66k623l289k031k77Q50J548K132K356K351
$$ 716889 713487 712547 713556 715561 717157 716791 714168 710879 708848 708571 709421 710969 713101 715457 717808
60836G17808K948M346N529N557M639L526K764K749L502M034L166J401P22J818
$$ 717808 720756 725102 730631 736188 740827 744353 747117 749866 753368 757402 760568 761969 762691 764509
60822G64509K971K678K034L023N470P353P819Q096R376J1291J2911J4101J5266
$$ 764509 767480 770158 772192 775215 780685 788038 795857 803953 813329 824620 837531 851632 866898
60809H66898J6448J7422J8203J8950J9586J9908J9922J9821J9772J9938K0594
$$ 866898 883346 900768 918971 937921 957507 977415 997337 1017158 1036930 1056868 1077462
60798A077462K1864K3357K4457K5134K6157K8159L0607L2318L2946L3308L3962
$$ 1077462 1099326 1122683 1147140 1172274 1198431 1226590 1257197 1289515 1322461 1355769 1389731
60787A389731L4173L3019L0999K9630K9296K8436K5117J9058J1762N045m31n416
$$ 1389731 1423904 1456923 1487922 1517552 1546848 1575284 1600401 1619459 1631221 1636266 1635835 1630419
60775A630419j0997j7233k2903k6877k9470l2000l5144l8265m0342m1019m0703
$$ 1630419 1619422 1602189 1579286 1552409 1522939 1490939 1455795 1417530 1377188 1336169 1295466
60764A295466m0108l9729l9383l8282l5949l2964l0331k8324k6633k5422k5222
$$ 1295466 1255358 1215629 1176246 1137964 1102015 1069051 1038720 1010396 983763 958341 933119
60753I33119k5622k5070k2560j8921j5847j4076j2987j1632r691p458n336l498
$$ 933119 907497 882427 859867 840946 825099 811023 798036 786404 776713 769255 763919 760421
60741G60421k072j485k145l589m510m086k865j836j206q28j060k029k698k064
$$ 760421 758349 756864 754719 751130 746620 742534 739669 737833 736627 735799 734739 732710 730012 727948
60727G27948r77j031j881j580J22R83m08k486l168k800l021l960m394l991l619
$$ 727948 726971 725940 724059 722479 722601 723584 723176 720690 717522 714722 711701 707741 703347 699356 695737
60712F95737l758m020m158m383m765n244n973o900p429p314p358q130q644p583
$$ 695737 691979 687959 683801 679418 674653 669409 663436 656536 649107 641793 634435 626305 617661 610078
60698F10078n466m113m162m553m511m538m997n109m080k387j230j158j614j519
$$ 610078 604612 600499 596337 591784 587273 582735 577738 572629 568549 566162 564932 563774 562160 560641
60684E60641k30J685K739K142Q66L45N25L52o7N80K433L639K720N48r08q54J62
$$ 560641 560411 562096 564835 566977 567843 568188 568713 569065 568998 569578 572011 575650 578370 578918 578010 577156 577318
60667E77318J300J556l9k948m606l058J78J604N0k232l144l454m831o752p191
$$ 577318 578618 580174 580135 577187 572581 569523 569701 571305 571355 569123 565979 562525 557694 550942 543751
60652E43751n729m198m176n189n735n064l608k352k217l278m381m225l048k449
$$ 543751 538022 533824 529648 524459 518724 513660 510052 507700 505483 502205 497824 493599 490551 488102
60638D88102l163m039l820k852k115j523m59O22O40l17r59o03J37N19M72K12J0
$$ 488102 484939 480900 477080 474228 472113 470590 470131 470753 471393 471076 470117 469514 469651 470170 470642 470854 470864
60621D70864L59J379K120J568K71k29N22J639K545L263L202J604n17r88M11J601
$$ 470864 471223 472602 474722 476290 476561 476332 476854 478493 481038 484301 487503 489107 488590 487602 488013 489614
60605D89614J651K094L739M804M132L680N357P423P079N075M442N592O182N434
$$ 489614 491265 493359 497098 501902 506034 509714 515071 522494 529573 534648 539090 544682 550864 556298
60591E56298N057N673N644M347L506M065M385L032J158L90K74n22j971l305m622
$$ 556298 561355 567028 572672 577019 580525 584590 588975 592007 593165 593555 593829 593307 591336 588031 583409
60576E83409o250p530p710p250o907o402n358m629n187o298o393n320m309l914
$$ 583409 577159 569629 561919 554669 547762 541360 536002 531373 526186 519888 513495 508175 503866 499952
60562D99952l438k347r43N34K164L441L227J207j360k928l215k889k256j058M22
$$ 499952 496514 494167 493224 493758 495922 499363 502590 503797 502437 499509 496294 493405 491149 490091 490513
60547D90513R83j18j870k437j367nN71R26J901K888K750J738J133J334J740K221
$$ 490513 491496 491378 489508 487071 485704 485699 486270 487196 489097 491985 494735 496473 497606 498940 500680 502901
60531E02901L015L397K431J130J717M166N678M646K957K877L713L629L166M400
$$ 502901 505916 509313 511744 512874 514591 518757 524435 529081 532038 534915 538628 542257 545423 549823
60517E49823P454J0362J2087J3358J4447J4257J2236R599P913P522P673P214N053
$$ 549823 557277 567639 579726 593084 607531 621788 634024 643623 651536 659058 666731 673945 678998
60504F78998J133k749m200k767l85R82J218J344K016L294N052O934Q427R512J0867
$$ 678998 680131 677382 673182 670415 670030 671012 672230 673574 675590 678884 683936 690870 699297 708809 719676
60489G19676J2995J5380J6811J6430J4538J2558J1847J2064J1105P456K336j492
$$ 719676 732671 748051 764862 781292 795830 808388 820235 832299 843404 850860 853196 851704
60477H51704k891l211l910m737m778m097l427k898k134j268j027j670k402j921
$$ 851704 848813 845602 841692 836955 832177 828080 824653 821755 819621 818353 817326 815656 813254 811333
60463H11333K85L148M689M051K748L179N916R265J1585J3056J4717J6861J9185
$$ 811333 811618 814766 819455 823506 826254 829433 835349 844614 856199 869255 883972 900833 920018
60450I20018K1838K5321K9673L4392L8848M2229M3636M3131M2267M2621M3711
$$ 920018 941856 967177 996850 1031242 1070090 1112319 1155955 1199086 1241353 1283974 1327685
60439A327685M3206L9218L1796K2229J1698Q45j0052k0870l1287m0380m6963n0578
$$ 1327685 1370891 1410109 1441905 1464134 1475832 1476677 1466625 1445755 1414468 1374088 1327125 1276547
60427A276547n1874n1875n1115m9639m7423m4501m0944l7057l3450l0650k8617
$$ 1276547 1224673 1172798 1121683 1072044 1024621 980120 939176 902119 868669 838019 809402
60416H09402k6824k4703k1986j8872j6020j4129j3245j2699j1948j1278j1085
$$ 809402 782578 757875 735889 717017 700997 686868 673623 660924 648976 637698 626613
60405F26613j0798r330o820n000n107o086n858m061k435k386l396m325n109o062
$$ 626613 615815 606485 599665 594665 589558 583472 577614 573553 571118 568732 565336 561011 555902 549840
60391E49840o380m844j858N86J255Q15K64n36j930l153l214k516k268k501k115
$$ 549840 543460 538616 536758 537344 538599 539414 539678 539142 537212 534059 530845 528329 526061 523560 521445
60376E21445r79n68j731l075k669p26O47J62j328k209j763k31J754L235L207J645
$$ 521445 520466 519898 518167 515092 512423 511697 512344 512506 511178 508969 507206 506975 508729 511964 515171 516816
60360E16816j80r89q20n26m38k70rl7l06k94J47N99Q99J355J984K267K127K259
$$ 516816 516636 515647 514827 514301 513863 513593 513584 513547 513241 512947 513094 513693 514592 515947 517931 520198 522325 524584
60342E24584K958L323K462R72K44O02J131J290J597K430L123K864K015J750K570
$$ 524584 527542 530865 533327 534299 534543 535145 536276 537566 539163 541593 544716 547580 549595 551345 553915
60327E53915L659L849K872J569J053J776L285M644N026M189K687J623J763K702
$$ 553915 557574 561423 564295 565864 566917 568693 571978 576622 581648 585837 588524 590147 591910 594612
60313E94612L166K350P69m51p63l88M09J649L308N056O387O807O043M435K919
$$ 594612 597778 600128 600897 600446 599683 599295 599704 601353 604661 609717 616104 622911 628954 633389 636308
60298F36308K103J549O06k10L95K556M665N277M742M166L560K177L18o72m46m36
$$ 636308 638411 639960 640566 640356 640751 643307 647972 653249 657991 662157 665717 667894 668212 667540 667094 666658
60282F66658j843l810m515l413j428O52K693M187M073K168j50j389j490j332j406
$$ 666658 664815 661005 656490 653077 651649 652301 654994 659181 663254 665422 665272 663883 662393 661061 659655
60267F59655j754k553l595l551j103K956N976O329N231N168P152J0067J2131J2377
$$ 659655 657901 655348 651753 648202 647099 650055 656031 662360 667591 672759 679911 689978 702109 714486
60253G14486J1160R939J0366J3002J6789J9927K1065J9736J6312J1869P469L091
$$ 714486 725646 735585 745951 758953 775742 795669 816734 836470 852782 864651 872120 875211
60241H75211k155q282j3662j6754j7988j8881j9753j9613j8073j6069j4356j2478
$$ 875211 873056 864774 851112 834358 816370 797489 777736 758123 740050 723981 709625 697147
60229F97147r864p156n588n485n927n807m841l519k274q82J018K825L043J038
$$ 697147 687283 680127 674539 669054 663127 657320 652479 648960 646686 645804 646822 649647 652690 653728
60215F53728j749l197k812j779j029m79j58o18j817k840l418m444o143o932n393
$$ 653728 651979 648782 645970 644191 643162 642683 642525 641907 640090 637250 633832 629388 623245 616313 610920
60200F10920k537o79n92j221j809k635l613l868l162k465k360k032o53J222K536
$$ 610920 608383 607704 607112 605891 604082 601447 597834 593966 590804 588339 585979 583947 583294 584516 587052
60185E87052L182L569L409K259Q65N82J366J662P19k04L11J660J998Q38k82J12
$$ 587052 590234 593803 597212 599471 600336 600918 602284 603946 604665 604461 604772 606432 608430 609268 608986 609098
60169F09098J527K243J582P99J462L324M336L102Q47K22K209N076O688O867O697
$$ 609098 610625 612868 614450 615249 616711 620035 624371 627473 628320 628542 630751 635827 642515 649382 656079
60154F56079O384N264L651L109M353O061O612O222O420P818R321R491Q058O025
$$ 656079 662463 667727 671378 674487 678840 684901 691513 697735 704155 711973 721294 730785 738843 744868
60140G44868M733M868O014P055P124O243N016L963L205K646K352K747M215O211
$$ 744868 749601 754469 760483 767538 774662 780905 785921 789884 793089 795735 798087 800834 805049 811260
60126H11260P124N759K889N27m12p28j116j091m12k81j847m343o041o556o853
$$ 811260 818384 824143 827032 827559 827147 826419 825303 824212 823800 823519 821672 817329 811288 804732 797879
60111G97879p290p153o087m681l376k025q58q20k217l833m039k505m49N31k36
$$ 797879 790589 783436 777349 772668 769292 767267 766409 765589 763372 759539 755500 752995 752546 753077 752841
60096G52841j959l061k690j443l66L63J170K011K517K836L317L528K821J755J674
$$ 752841 750882 747821 745131 743688 743322 743685 744855 746866 749383 752219 755536 759064 761885 763640 765314
60081G65314K756L880M614N871P932R318Q565O127L626K137J904K733L759L789
$$ 765314 768070 771950 776564 782435 790367 799685 808250 814377 818003 820140 822044 824777 828536 832325
60067H32325K888K659L833M599K835o54k864k317n08M87L10j95n34p59p01O4J556
$$ 832325 835213 837872 841705 846304 849139 848485 845621 843304 842796 843283 843593 843398 842864 842105 841404 841468 843024
60050H43024L069L745L417K834K787L149L212K881K764K894K398R31m76q25n22
$$ 843024 846093 849838 853255 856089 858876 862025 865237 868118 870882 873776 876174 877105 876629 875804 875282
60035H75282m43m50k1L45l00j799l170m100m745m405k206Q62K446J816P41O42
$$ 875282 874839 874389 874368 874713 874413 872614 869444 865344 860599 856194 853988 854850 857296 859112 859853 860495
60019H60495N20j090l473m556l657j999q20k92k40q44k330m549o984q811r279
$$ 860495 861015 859925 856452 851896 848239 846240 845420 845128 844888 844044 841714 837165 830181 821370 812091
60004H12091q565p962q439r223q643o372l929k816l089m044n339o660p211o552
$$ 812091 803526 795564 787125 777902 769259 762887 758958 756142 753053 749009 743670 737010 729799 723247
59990G23247n575n393n431l968p80K121L095L016L609M659M483K786J221R17J168
$$ 723247 717672 712279 706848 702880 702100 704221 707316 710332 713941 718600 723083 725869 727090 728007 729175
59975G29175J110J147J693J896Q83o44j408j490j779k094j499l56l35k060m078
$$ 729175 730285 731432 733125 735021 735904 735260 733852 732362 730583 728489 726990 726634 726299 724239 720161
59960G20161m751m073l149k865l536m935o063n744m087k727k910m012m537l953
$$ 720161 715410 711337 708188 705323 701787 696852 690789 685045 680958 678231 675321 671309 666772 662819
59946F62819k856j942j656k331l751m850m713l687k722j901o03J030J931J730
$$ 662819 659963 658021 656365 654034 650283 645433 640720 637033 634311 632410 631807 632837 634768 636498
59932F36498J427J872K371J662k21j862k084q83J148L451N305N773M537K571J403
$$ 636498 637925 639797 642168 643830 643609 641747 639663 638780 639928 643379 648684 654457 658994 661565 662968
59917F62968J668K701L428L396K881K428K337K313J531n37l169m650l937j835
$$ 662968 664636 667337 670765 674161 677042 679470 681807 684120 685651 685114 681945 677295 673358 671523
59903F71523k39k14j108j540r33P6N72N55Q85K025L172L160K074J264J549K128
$$ 671523 671284 671070 669962 668422 667489 667565 668137 668692 669577 671602 674774 677934 680008 681272 682821 684949
59887F84949J760M78m96j82J312L195M669N355N422N129M131J860j023k489j415
$$ 684949 686709 687187 686691 686509 687821 691016 695685 701040 706462 711591 715722 717582 716559 714070 712655
59872G12655O42J168j95j545j543q00k78Q2N31O24K07K14J432L144M102M424N376
$$ 712655 713297 714465 714270 712725 711182 710382 710104 710186 710717 711341 711548 711762 713194 716338 720440 724864 730240
59855G30240P366R112Q993O765L897K496L618O217P968P551N878M611L966K790
$$ 730240 737606 746718 755711 762476 766373 768869 772487 778704 786672 794223 800101 804712 808678 811468
59841H11468N88j597k606k578k332j960r25N14R69m18k393k625m70K124L039K658
$$ 811468 812056 810459 807853 805275 802943 800983 800058 800572 801541 801123 798730 796105 795635 797759 800798 803456
59825H03456L037M779O122N549L912L007L015K713J805J492K401L211K194n17
$$ 803456 806493 811272 817394 822943 826855 829862 832877 835590 837395 838887 841288 844499 846693 846176
59811H46176k964l527k417j093o53j059j599j818j916k394l424m592n298n305
$$ 846176 843212 839685 837268 836175 835522 834463 832864 831046 829130 826736 823312 818720 813422 808117
59797H08117m876m330l744l233l215l832m284l469j590k62n18j478j816j787k517
$$ 808117 803241 798911 795167 791934 788719 784887 780603 777134 775544 775282 774764 773286 771470 769683 767166
59782G67166l781m069k952j811j710k024j826j329r71k42J377L231M416N054N488
$$ 767166 763385 759316 756364 754553 752843 750819 748993 747664 746693 746451 747828 751059 755475 760529 766017
59767G66017M976K825J53j168j140j456k753l872m007l780l638k982j762j214
$$ 766017 770993 773818 773971 772803 771663 770207 767454 763582 759575 755795 752157 749175 747413 746199
59753G46199j845k176r74N49N62m04l33R34J427K70j092j411j515k425l294k682
$$ 746199 744354 742178 741204 741753 742315 741911 741578 742512 743939 744209 743117 741706 740191 737766 734472 731790
59737G31790j081n17j967m359n983n868m029j459J23l24j798k165o17J547K704
$$ 731790 730709 730192 728225 723866 717883 712015 707986 706527 706650 706326 704528 702363 701746 703293 705997
59722G05997K459J280k62j387j343m38J9m98r67o05k05n22n01J054K937K836R99
$$ 705997 708456 709736 709474 708087 706744 706306 706325 705827 704860 704255 704050 703528 703027 704081 707018 709854 710853
59705G10853K49J914L951M138L143K952L705M013L503L214L663M077L745L008
$$ 710853 711102 713016 716967 721105 724248 727200 730905 734918 738421 741635 745298 749375 753120 756128
59691G56128K720L372M875O509P230O620N403M596M444M651N137N697N458L834
$$ 756128 758848 762220 767095 773604 780834 787454 792857 797453 801897 806548 811685 817382 822840 826674
59677H26674J769R12J526K254K091J526J461J902K172J701K81j771l464l805k870
$$ 826674 828443 829355 830881 833135 835226 836752 838213 840115 842287 843988 844269 842498 839034 835229 832359
59662H32359j723r95l26N95J235R97K11k50R0J064K135K598K053J115J047K271
$$ 832359 830636 829641 829315 829910 831145 832142 832353 832103 832193 833257 835392 837990 840043 841158 842205 844476
59646H44476L713M191L859L611L543L041K043J291J109R66O63J157L394O594Q592
$$ 844476 848189 852380 856239 859850 863393 866434 868477 869768 870877 871843 872506 873663 877057 883651 892243
59631H92243Q075N934M054L197K704J945J206Q43M05p01k085k665k047j016o55
$$ 892243 900318 906252 910306 913503 916207 918152 919358 920201 920606 919905 917820 915155 913108 912092 911437
59616I11437j363k711l936m614n105o044p222p490o325m792m170m238m032l652
$$ 911437 910074 907363 903427 898813 893708 887664 880442 872952 866627 861835 857665 853427 849395 845743
59602H45743l901m388l801k127q36m25L53K068L309K974K254K674L559L300K185
$$ 845743 841842 837454 833653 831526 830690 830265 830618 832686 835995 838969 841223 843897 847456 850756 852941
59587H52941J920K764L121K045M52l81k42K43J10j638m969q017q661p148n827
$$ 852941 854861 857625 860746 862791 863243 862862 862620 862863 862973 861335 856366 848349 839688 832540 826713
59572H26713o036o587n812l886k410k571m244o185o740n343l580l773o064q161
$$ 826713 820677 814090 808278 804392 801982 799411 795167 788982 782242 776899 773319 769546 763482 755321
59558G55321q369p575p330p347o348m504l392l746m519m331k928j127M6J42l84
$$ 755321 746952 739377 732047 724700 718352 713848 710456 706710 702191 697860 694932 693805 693851 693993 693609
59543F93609o61m11j23j49l35p52j791k955k744q10Q18J76j815k558j397j63k08
$$ 693609 692948 692537 692414 692265 691930 691178 689387 686432 683688 682878 683696 683872 682057 679499 678102 677939 677731
59526F77731p69o27J60Q26Q53k17k618n260o017m088j278K3n68j686k240k212
$$ 677731 676962 676335 676495 677321 678174 677957 675339 670079 664062 659974 658696 658719 658151 656465 654225 652013
59510F52013j931j689j869k634l517l916l817l512k917j709N6J971L679M740M608
$$ 652013 650082 648393 646524 643890 640373 636457 632640 629128 626211 624502 624558 626529 630208 634948 639556
59495F39556L384K240K312L385M391N039O079P961J0077J1560J2211J2369J2321
$$ 639556 642940 645180 647492 650877 655268 660307 666386 674347 684424 695984 708195 720564 732885
59482G32885J2234J2429J3458J5744J8757K0463J8343J1828L470l060o147o860
$$ 732885 745119 757548 771006 786750 805507 825970 844313 856141 859611 856551 850404 843544
59470H43544o876o761o325n490m295k728j061K15R81J461J548R23L3r7N09M71
$$ 843544 836668 829907 823582 818092 813797 811069 810008 810223 811204 812665 814213 815136 815169 815072 815581 816052
59454H16052q53k035j593n00j075l643o039o701o629p453q846r107p682n838m953
$$ 816052 815199 813164 811571 811071 809996 806353 800314 793613 786984 779531 770685 761578 753896 748058 743105
59439G43105n156n737o071n907n272m482l855l277k369j159j32N16J148K041K966
$$ 743105 737949 732212 726141 720234 714962 710480 706625 703348 700979 699820 699688 700204 701352 703393 706359
59424G06359L684M311M743M485L651L396M362N399N168M554N629Q115Q931O181
$$ 706359 710043 714354 719097 723582 727233 730629 734991 740390 745558 750112 755741 763856 772787 778968
59410G78968J938l32J55J506K079J643L48j463k528j630N59K142K627L293M745
$$ 778968 780906 780574 780729 782235 784314 785957 786305 784842 782314 780684 781243 783385 786012 789305 794050
59395G94050N920O132O318P324Q368Q410P867P793Q287Q786Q987Q405O017J831
$$ 794050 799970 806102 812420 819744 828112 836522 844389 852182 860469 869255 878242 886647 892664 894495
59381H94495k034l376k616k171l406n574p439q516q736q247p708p630p356n749
$$ 894495 892461 889085 886469 884298 880892 875318 867879 859363 850627 842380 834672 827042 819686 813937
59367H13937l006n87P86J958L873O375Q796J0825J2509J4171J6408J9315K1712
$$ 813937 810931 810344 811130 813088 816961 823336 832132 842957 855466 869637 886045 905360 927072
59354I27072K2438K2469K4090K7390K9042K5615J7080O310l556j0242j2443j0725
$$ 927072 949510 971979 996069 1023459 1052501 1078116 1095196 1101506 1097950 1087708 1075265 1064540
59342A064540p674n431l403N3L992M722k84r597j9285k6124k9124k9133k7688
$$ 1064540 1056866 1051435 1048032 1048085 1052077 1056799 1056515 1046918 1027633 1001509 972385 943252 915564
59329I15564k5760k3206j9727j6121j3702j2474j1142r117p401o856o794o096
$$ 915564 889804 866598 846871 830750 817048 804574 793432 784315 776914 770058 763264 757168
59317G57168m769l382j812J71J727J754P68N70J893L509M044L611L153L024K888
$$ 757168 752399 749017 747205 747376 749103 750857 751625 752195 754088 757597 761641 765252 768405 771429 774317
59302G74317K508J977J577J843L315N703P776Q624Q746R263J0322J1062J1047
$$ 774317 776825 778802 780379 782222 785537 791240 799016 807640 816386 825649 835971 847033 858080
59289H58080J1056J2110J4185J6189J7117J7085J7161J8010J8831J8200J6114
$$ 858080 869136 881246 895431 911620 928737 945822 962983 980993 999824 1018024 1034138
59278A034138J4488J4904J6500J6976J5395J2836J0367P717M429J141j168k641
$$ 1034138 1048626 1063530 1080030 1097006 1112401 1125237 1135604 1143321 1147750 1148891 1147723 1145082
59266A145082m312o622q724r301p881n513m101m688o367p428p483p619q481r475
$$ 1145082 1140770 1134148 1125424 1116123 1108242 1102729 1098628 1093940 1087573 1080145 1072662 1065043 1056562 1047087
59252A047087j0383j2161j5050j7049j5984j2594r856r423j0135j0166r087p495
$$ 1047087 1036704 1024543 1009493 992444 976460 963866 954010 944587 934452 924286 915199 907704
59240I07704n918m764m396m595m600m123l670l514l216k557k073k039j737m23
$$ 907704 901786 897022 892626 888031 883431 879308 875638 872124 868908 866351 864278 862239 860502 860079
59226H60079J569L388M687N394N139L950K994L467M871N535M948M396M975O025
$$ 860079 861648 865036 869723 875117 880256 884206 887200 890667 895538 901073 906021 910417 915392 921417
59212I21417O414O556Q013J1142J4179J5073J3619J1319R550Q542P872P130N892
$$ 921417 927831 934387 942400 953542 967721 982794 996413 1007732 1017282 1025824 1033696 1040826 1046718
59199A046718L802J117j356l249n062p140q888r781j0474j1724j2690j1813r373
$$ 1046718 1050520 1051637 1050281 1047032 1041970 1034830 1025942 1016161 1005687 993963 981273 969460 960087
59186I60087p492p229p239o200n047n305o375o295m680l112k607k387j621q96
$$ 960087 952595 945366 938127 931927 926880 921575 915200 908905 904225 901113 898506 896119 894498 893602
59172H93602j077j807k143k096k524l744n085n832n939n675n113m287l612l761
$$ 893602 892525 890718 888575 886479 883955 880211 875126 869294 863355 857680 852567 848280 844668 840907
59158H40907m968o594p481o952n439m025l425l544l963m496m971m838l527j326
$$ 840907 835939 829345 821864 814912 809473 805448 802023 798479 794516 790020 785049 780211 776684 775358
59144G75358N35R89J03j259k404l019k743j432J29O76K10M48K613N394O321M974
$$ 775358 775893 776882 776985 775726 773322 770303 767560 766128 766257 766933 767143 767591 770204 775598 781919 786893
59128G86893L562M017N764P013P215P235P735Q432Q797Q675Q324Q362R445J1353
$$ 786893 790455 794472 800236 807249 814464 821699 829434 837866 846663 855338 863662 872024 881469 892822
59114H92822J2644J1988R776P628O370N381M148L438M307O523Q664R545R102Q011
$$ 892822 905466 917454 927230 934858 941228 946609 950757 954195 958502 965025 973689 983234 992336 1000347
59100A000347P042O612O491N872M079J356j289l029l786l941l924m247n402p292
$$ 1000347 1007389 1014001 1020492 1026364 1030443 1031799 1030510 1027481 1023695 1019754 1015830 1011583 1006181 998889
59086I98889q961r451q824p931p235o471n470m525l729k710j588j360k452l470
$$ 998889 989928 980477 971653 963722 956487 950016 944546 940021 936292 933582 931994 930634 928182 924712
59072I24712k640k94J366J144L61J004L339N991P641P977P620P743R244J1643
$$ 924712 922072 921778 923144 924288 924649 925653 928992 934983 942624 950601 958221 965964 975208 986851
59058I86851J3333J3539J3412J4274J5464J5274J3732J2875J3902J5399J5302
$$ 986851 1000184 1013723 1027135 1041409 1056873 1072147 1085879 1098754 1112656 1128055 1143357
59047A143357J3653J2211J1900J1823J0948R474Q037O467M387K456J776K028J513
$$ 1143357 1157010 1169221 1181121 1192944 1203892 1213366 1221403 1227870 1232257 1234713 1236489 1238517 1240030
59034A240030m03k107k010j017j301l170m791m948m422m294m506m793n567o958
$$ 1240030 1239627 1237520 1235510 1234493 1233192 1230022 1225231 1220283 1215861 1211567 1207061 1202268 1196701 1189743
59020A189743q193q921j0023j1968j3535j3544j2856j3121j4214j4648j4094j3631
$$ 1189743 1181550 1172629 1162606 1150638 1137103 1123559 1110703 1097582 1083368 1068720 1054626 1040995
59008A040995j3651j3302j2268j1375j0987j0175q193n702l992l778n023o878
$$ 1040995 1027344 1014042 1001774 990399 979412 969237 961044 955342 951350 947572 942549 935671
58996I35671p621n878k536k83o33k306l157k675j794j229r24o82m30k25l68j051
$$ 935671 928050 922172 919636 919353 918720 916414 913257 910582 908788 907559 906635 905953 905523 905298 904930 903879
58980I03879j659j214J07Q58L25l77J07J607L091M158M994N730O813Q948J1572
$$ 903879 902220 901006 901113 901971 902296 901919 902026 903633 906724 910882 915876 921606 928419 937367 948939
58965I48939J2498J0696Q455Q837J1576J3637J3527J2790J2957J3480J3491J3542
$$ 948939 961437 972133 980588 989425 1001001 1014638 1028165 1040955 1053912 1067392 1080883 1094425
58953A094425J4252J4720J3754J1637R429P399N326L520K380J596R17R07J768
$$ 1094425 1108677 1123397 1137151 1148788 1158217 1165616 1170942 1174462 1176842 1178438 1179355 1180262 1182030
58940A182030K177R11r08r03J287L477L866K928J976J284M79m69j535l110n255
$$ 1182030 1184207 1185118 1184210 1183307 1184594 1188071 1191937 1194865 1196841 1198125 1198604 1198135 1196600 1193490 1188235
58925A188235p081p712p387p006p052p541q505r693j0230r380p465n420l630j847
$$ 1188235 1181154 1173442 1166055 1159049 1151997 1144456 1135951 1126258 1116028 1106648 1099183 1093763 1090133 1088286
58911A088286L5J809L363M630N254M945M039L229K939L348M533N867N936M143
$$ 1088286 1088321 1090130 1093493 1098123 1103377 1108322 1112361 1115590 1118529 1121877 1126410 1132277 1138213 1142356
58897A142356K105K052L856M925L368Ol199n555p640r798j1602j2500j2388j1753
$$ 1142356 1144461 1146513 1150369 1155294 1158662 1158668 1155469 1149914 1142274 1132476 1120874 1108374 1095986 1084233
58883A084233j1366j1471j1197r554p117n679n978o849p139p156p461p509o727
$$ 1084233 1072867 1061396 1050199 1040645 1033528 1027849 1021871 1015022 1007883 1000727 993266 985757 979030
58870I79030n895n868n767m107j397J62l37j397j337l40L89M73O07J477K992M448
$$ 979030 973135 967267 961500 957393 955996 956158 955821 954424 953087 952747 953136 953609 954216 955693 958685 963133
58854I63133N187N161M768M090K803J167M39J590M144O961R485J1322J1455R437
$$ 963133 968320 973481 978249 982339 985142 986309 986748 988338 992482 999443 1008928 1020250 1031705 1041142
58840A041142O827N718N955N569M057L186M061N367N669N836P732J1452J5268
$$ 1041142 1047969 1053687 1059642 1065211 1069268 1072454 1076515 1081882 1087551 1093387 1101119 1112571 1127839
58827A127839J7711J8583J8456J8149J8380J9135J9570J9040J7751J5990J3488
$$ 1127839 1145550 1164133 1182589 1200738 1219118 1238253 1257823 1276863 1294614 1310604 1324092
58816A324092J0264P277N317L825J700j174m164p154j0545j4151j6969j8160j7716
$$ 1324092 1334356 1341633 1346950 1350775 1352475 1351301 1347137 1339983 1329438 1315287 1298318 1280158 1262442
58803A262442j6359j5155j4813j4877j4158j2520j1600j2850j5456j7199j6956
$$ 1262442 1246083 1230928 1216115 1201238 1187080 1174560 1162960 1150110 1134654 1117455 1100499
58792A100499j5379j3567j2288j2159j3266j4579j4850j4178j3521j2878j1250
$$ 1100499 1085120 1071553 1059265 1047106 1033840 1019261 1004411 990233 976712 963834 952584
58781I52584q659o676o355o821o664n790n082n066n717o916q198q619p746o455
$$ 952584 943925 937249 930894 924073 917409 911619 906537 901471 895754 888838 880640 872021 864275 857820
58767H57820n910o046n828m797l573k870k770l005l392l716l675l108k119r70
$$ 857820 851910 845864 840036 835239 831666 828796 826026 823021 819629 815913 812238 809130 807011 806041
58753H06041m5K98K11M59J557K810K885J389n58j547j237l23L70N47M83P45J557
$$ 806041 805996 806294 806505 806964 808521 811331 814216 815605 815047 813500 812263 811940 812310 812857 813340 814085 815642
58736H15642K284J960N91n83o00k6Nm17j10J333K855L463L528L892M411M248L377
$$ 815642 817926 819886 820477 819894 819294 819268 819273 818856 818746 820079 822934 826397 829925 833817 838228 842476 845853
58719H45853K931L846N627O791O468N312M690M925M829L372J369N38R77Q37j084
$$ 845853 848784 852630 858257 865048 871516 876828 881518 886443 891272 894644 896013 896551 897528 898365 897281
58704H97281l655n138n524n915o442o234n093l751k603j440m02N8J84O30J111
$$ 897281 893626 888488 882964 877049 870607 864373 859280 855529 852926 851486 851084 851142 851326 851956 853067
58689H53067P58p9J48J828L398L594L201L601M757N646N912O015O423P375Q794
$$ 853067 853825 853746 853894 855722 859120 862714 865915 869516 874273 879919 885831 891846 898269 905644 914438
58674I14438R777R080O963N597O576Q863J0308J0360R945R459Q377O637M947L758
$$ 914438 924215 933295 940258 945855 952431 961294 971602 981962 991907 1001366 1009743 1016380 1021327 1025085
58660A025085L012K713K707K250R58j35K28J560K296K169K293K837K543J042j75
$$ 1025085 1028097 1030810 1033517 1035767 1036725 1036590 1036818 1038378 1040674 1042843 1045136 1047973 1050516 1051558 1051383
58645A051383o6J75j098l455n079n451n983p972j0914j3169j3843j3670j4032
$$ 1051383 1051317 1051492 1050394 1046939 1041860 1036409 1030426 1022454 1011540 998371 984528 970858 956826
58632I56826j5175j5849j5057j3631j3192j3790j3738j2025r793q828r497j0702
$$ 956826 941651 925802 910745 897114 883922 870132 856394 844369 834576 825748 816251 805549
58620H05549j1120r913p092l951k377k888l797l192j230M54J153J782L158M744
$$ 805549 794429 784516 777424 773473 771096 768208 764411 761219 759989 760443 761596 763378 766536 771280
58606G71280N450N024M184L748L985M647N318N629N242M018K455J619K012K536
$$ 771280 776730 781754 785938 789686 793671 798318 803636 809265 814507 818525 820980 822599 824611 827147
58592H27147J546r03k896l298l464n144p596q432p078n587n595o091n220l100
$$ 827147 828693 827790 824894 821596 818132 812988 805392 796960 789882 784295 778700 772609 767389 764289
58578G64289j501j315j776k074k464l280l914l541k450j758j781j453K68K773
$$ 764289 762788 761473 759697 757623 755159 751879 747965 744424 741974 740216 738435 736982 737250 740023
58564G40023M254L819K630K548L934N320N224L750K190J482J593K113K862L719
$$ 740023 744277 748096 750726 753274 757208 762528 767752 771502 773692 775174 776767 778880 781742 785461
58550G85461M268M007K942J797J634K921M879N946N339L988L422L821L883K797
$$ 785461 789729 793736 796678 798475 800109 803030 807909 813855 819194 823182 826604 830425 834308 837105
58536H37105J432J004J317J307R39J330K950M823N831O074O420P315Q545R765
$$ 837105 838537 839541 840858 842165 843104 844434 847384 852207 858038 864112 870532 877847 886392 896157
58522H96157J0790J1602J2367J3177J3646J3236J2103J1031J0310R428Q211P455
$$ 896157 906947 918549 930916 944093 957739 970975 983078 994109 1004419 1013847 1022058 1029513
58510A029513P761Q592R292J0302J2223J4348J5410J5603J6350J8082J9643K0215
$$ 1029513 1037274 1045866 1055158 1065460 1077683 1092031 1107441 1123044 1139394 1157476 1177119 1197334
58498A197334K0375K0643K0372J9132J8106J8616J9852J9540J6747J2761R081
$$ 1197334 1217709 1238352 1258724 1277856 1295962 1314578 1334430 1353970 1370717 1383478 1392559
58487A392559N845K712K9j895l864o884j0279j2017j1304r923j0391j3240j6827
$$ 1392559 1398404 1401116 1401145 1399250 1395386 1388502 1378223 1366206 1354902 1344979 1334588 1321348 1304521
58474A304521j9361k0415k0539k0361k0304k0550k0773k0253j8608j6270j4013
$$ 1304521 1285160 1264745 1244206 1223845 1203541 1182991 1162218 1141965 1123357 1107087 1093074
58463A093074j2275j1053j0163r229p701n406l051j789k119l299l949l228j559
$$ 1093074 1080799 1069746 1059583 1050354 1042653 1037247 1034196 1032407 1030288 1026989 1023040 1019812 1018253
58450A018253j46J56n39j643k787l677l666k255m7J534J716J098P28R93J538J730
$$ 1018253 1018107 1018263 1017724 1016081 1013294 1009617 1005951 1003696 1003649 1005183 1006899 1007997 1008725 1009718 1011256 1012986
58434A012986R66p48k239j882N77L421M709M191L142K836L669N230O702P525Q077
$$ 1012986 1013952 1013204 1010965 1009083 1009660 1013081 1017790 1021981 1025123 1027959 1031628 1036858 1043560 1051085 1059162
58419A059162R213J0913J2149J2492J2842J3824J4412J3359J1242R755R383R092
$$ 1059162 1068375 1079288 1091437 1103929 1116771 1130595 1145007 1158366 1169608 1179363 1188746 1197838
58407A197838Q146O924N738M112J618j221l320l988l449k718k757l373l202j270
$$ 1197838 1205984 1212908 1218646 1222758 1224376 1223155 1219835 1215847 1212398 1209680 1206923 1203550 1200348 1199078
58393A199078J774M385N624N511M618M023M802O531P026M799J162j382k253k801
$$ 1199078 1200852 1205237 1210861 1216372 1220990 1225013 1229815 1236346 1243372 1248171 1249333 1247951 1245698 1242897
58379A242897l747m440m617m974n636n636m393k432l25J784L313L424K589K508
$$ 1242897 1239150 1234710 1230093 1225119 1219483 1213847 1209454 1207022 1206697 1208481 1211794 1215218 1217807 1220315
58365A220315L790N083N194M831N357O924Q706R970J0167Q928O851N313M676L672
$$ 1220315 1224105 1229188 1234382 1239213 1244570 1251494 1260200 1270170 1280337 1289265 1296116 1301429 1306105 1309777
58351A309777J460q04j559j070p98j221j693j995k531l037k461m35K049L782M595
$$ 1309777 1311237 1310433 1308874 1307804 1307006 1305785 1304092 1302097 1299566 1296529 1294068 1293633 1295682 1299464 1304059
58336A304059N180O073P022P305O664N891O103P330Q396Q503Q258Q528Q875Q036
$$ 1304059 1309239 1315312 1322334 1329639 1336303 1342194 1348297 1355627 1364023 1372526 1380784 1389312 1398187 1406223
58322A406223N760L299J926J568J167K2j526k566k565j774p70J38R97J906K972
$$ 1406223 1411983 1415282 1417208 1418776 1419943 1419965 1418439 1415873 1413308 1411534 1410764 1410902 1411899 1413805 1416777
58307A416777M420O395Q652J0764J2517J3883J4814J5446J6248J7411J8368J8463
$$ 1416777 1421197 1427592 1436244 1447008 1459525 1473408 1488222 1503668 1519916 1537327 1555695 1574158
58295A574158J7971J7759J8039J8145J7502J6168J4425J2549J1059J0555J1098
$$ 1574158 1592129 1609888 1627927 1646072 1663574 1679742 1694167 1706716 1717775 1728330 1739428
58284A739428J2210J3376J4249J4634J4837J5701J7591J9744K1255K2287K3403
$$ 1739428 1751638 1765014 1779263 1793897 1808734 1824435 1842026 1861770 1883025 1905312 1928715
58273A928715K4286K4257K3720K3773K4627K5583K6290K6703K6122K3986K1470
$$ 1928715 1953001 1977258 2000978 2024751 2049378 2074961 2101251 2127954 2154076 2178062 2199532
58262B199532K0622K1637K2644K2347K1263K0051J8557J7089J6847J8080J9338
$$ 2199532 2220154 2241791 2264435 2286782 2308045 2328096 2346653 2363742 2380589 2398669 2418007
58251B418007J9505J9308J9775K0494K0527K0141K0477K2046K4348K6585K8210
$$ 2418007 2437512 2456820 2476595 2497089 2517616 2537757 2558234 2580280 2604628 2631213 2659423
58240B659423K9303L0652L2937L5717L7947L9377M0491M1285M1399M1473M2893
$$ 2659423 2688726 2719378 2752315 2788032 2825979 2865356 2905847 2947132 2988531 3030004 3072897
58229C072897M5878M9044N1171N2218N2616N2767N3328N4719N6419N8008O0406
$$ 3072897 3118775 3167819 3218990 3271208 3323824 3376591 3429919 3484638 3541057 3599065 3659471
58218C659471O4440O8795P1518P3148P5814P9526Q2321Q4142Q7381R2843R8279
$$ 3659471 3723911 3792706 3864224 3937372 4013186 4092712 4175033 4259175 4346556 4439399 4537678
58207D537678J02075J05496J09994J15019J19960J25588J32071J37936J42637
$$ 4537678 4639753 4745249 4855243 4970262 5090222 5215810 5347881 5485817 5628454
58198E628454J47776J54241J60526J65612J71148J78854J87781J96052K03671
$$ 5628454 5776230 5930471 6090997 6256609 6427757 6606611 6794392 6990444 7194115
58189G194115K11970K21875K33939K48425K64355K80402K97530L18610L44858
$$ 7194115 7406085 7627960 7861899 8110324 8374679 8655081 8952611 9271221 9616079
58180I616079L74991M08242M45104M84676N24839N65854O09988O56579P01822
$$ 9616079 9991070 10399312 10844416 11329092 11853931 12419785 13029773 13686352 14388174
58171A4388174P44733P88872Q36404Q85126R33355R82764J033930J084206J133136
$$ 14388174 15132907 15921779 16758183 17643309 18576664 19559428 20593358 21677564 22810700
58162B2810700J185205J244196J309451J380717J461481J554284J658020J773200
$$ 22810700 23995905 25240101 26549552 27930269 29391750 30946034 32604054 34377254
58154C4377254J904432K054636K222652K409350K618612K849115L094190L354321
$$ 34377254 36281686 38336322 40558974 42968324 45586936 48436051 51530241 54884562
58146E4884562L640239L959085M309885M699445N146854N658642O213719O793447
$$ 54884562 58524801 62483886 66793771 71493216 76640070 82298712 88512431 95305878
58138I5305878P422462Q164624R081532J0202247J1517980J2985649J4544856
$$ 95305878 102728340 110892964 119974496 130176743 141694723 154680372 169225228
58131A69225228J6151153J7786880J9425080K0992529K2361415K3295667K3316150
$$ 169225228 185376381 203163261 222588341 243580870 265942285 289237952 312554102
58124C12554102K1673294J7670929J1229015L185649n015409j2021450j7090437
$$ 312554102 334227396 351898325 363127340 366312989 361297580 349276130 332185693
58117C32185693k0142589k1509936k1671951k1086513k0095851j8902533j7613711
$$ 332185693 312043104 290533168 268861217 247774704 227678853 208776320 191162609
58110A91162609j6299259j5010935j3776160j2603147j1494198j0447651r456808
$$ 191162609 174863350 159852415 146076255 133473108 121978910 111531259 102074451
58103A02074451q519610p645816o847675o129020n489068m928989m446646m030622
$$ 102074451 93554841 85909025 79061350 72932330 67443262 62514273 58067627 54037005
58095E4037005l667086l348377l069619k822564k599082k395972k210546k036434
$$ 54037005 50369919 47021542 43951923 41129359 38530277 36134305 33923759 31887325
58087C1887325j869623j713973j574631j450016j336126j234351j148246j075438
$$ 31887325 30017702 28303729 26729098 25279082 23942956 22708605 21560359 20484921
58079B0484921j009148r45940q86653q31547p79694p31722o88490o48264o08998
$$ 20484921 19475773 18529833 17643180 16811633 16031939 15300217 14611727 13963463 13354465
58070A3354465n71904n39162n09834m81791m55783m33662m14103l94072l73453
$$ 13354465 12782561 12243399 11733565 11251774 10795991 10362329 9948226 9554154 9180701
58061I180701l54678l38688l24478l11600l00016k88347k75264k61692k49153
$$ 9180701 8826023 8487335 8162857 7851257 7551241 7262894 6987630 6725938 6476785
58052F476785k37058k24207k11632k01066j91848j82202j72465j64131j56645
$$ 6476785 6239727 6015520 5803888 5602822 5410974 5228772 5056307 4892176 4735531
58043D735531j48192j39105j31630j26533j22461j18364j14433j10871j07740
$$ 4735531 4587339 4448234 4316604 4190071 4067610 3949246 3834813 3723942 3616202
58034C616202j05561j04384j02790r9564r5490r1786q7856q2689p7386p3912p1970
$$ 3616202 3510641 3406257 3303467 3203903 3108413 3016627 2928771 2846082 2768696 2694784 2622814
58023B622814o9529o6065o2979o0960n9125n6855n4614n2779n1111m9522m8095
$$ 2622814 2553285 2487220 2424241 2363281 2304156 2247301 2192687 2139908 2088797 2039275 1991180
58012A991180m6481m4320m1969l9900l7873l5761l4366l4211l4277l3302l1588
$$ 1991180 1944699 1900379 1858410 1818510 1780637 1744876 1710510 1676299 1642022 1608720 1577132
58001A577132l0226k9254k8093k7032k6691k6572k5673k4149k3016k2551k2247
$$ 1577132 1546906 1517652 1489559 1462527 1435836 1409264 1383591 1359442 1336426 1313875 1291628
57990A291628k1915k1580k0787j9188j7375j5960j4473j2304j0150r222r564j0241
$$ 1291628 1269713 1248133 1227346 1208158 1190783 1174823 1160350 1148046 1137896 1128674 1119110 1108869
57978A108869j0705j0870j0537r854r654j0262j0749j0455j0265j1100j2159j2194
$$ 1108869 1098164 1087294 1076757 1066903 1057249 1046987 1036238 1025783 1015518 1004418 992259 980065
57966I80065j1613j1632j2065j1689j0318q823p593o610o560q087j0124j0652
$$ 980065 968452 956820 944755 933066 922748 913925 906332 899722 893162 885075 874951 864299
57954H64299r069o528m131k257j359j924l543n187o330o795o060m070k232k081
$$ 864299 855230 848702 844571 842314 840955 839031 835488 830301 823971 817176 811116 807046 804814 802733
57940H02733l150l668l098k471k398k444k503l222m670o034o893p605q143p752
$$ 802733 799583 795915 792817 790346 787948 785504 783001 779779 775109 769075 762182 754577 746434 738682
57926G38682o169m131k391j103l95n00r73p59M53J605J524L19r60j742k471l542
$$ 738682 732513 728382 725991 724888 724493 723993 723020 722261 722714 724319 725843 726162 725202 723460 720989 717447
57910G17447m041k300J767N537O171L998K015J962K638K540K106K166K092J149
$$ 717447 713406 711106 712873 718410 724581 728579 730594 732556 735194 737734 739840 742006 744098 745247
57896G45247J81K39P24O82O60J271J202r18l447l251r7K995L823L165K654K683
$$ 745247 745428 745667 746391 747073 747733 749004 750206 749288 745841 742590 742493 745488 749311 752476 755130 757813
57880G57813L159M366O206P801Q549Q657Q417P918P444P099O231M458K921K998
$$ 757813 760972 765338 771544 779345 787894 796551 804968 812886 820330 827429 833660 838118 841039 844037
57866H44037L971L634J233j839m223n756o395n898m972m963n863o272n721n435
$$ 844037 848008 851642 852875 851036 846813 841057 834662 828764 823792 818829 812966 806694 800973 795538
57852G95538o206p121p115o367n461m526l922m275n127m896l064j138o38j257
$$ 795538 789332 782211 775096 768729 763268 758742 754820 750545 745418 740522 737458 736320 735682 734425
57838G34425j873k117k085j533m74L25M06M51J260K544L524L997M135L861L181
$$ 734425 732552 730435 728350 726817 726343 726668 727074 727525 728785 731329 734853 738850 742985 746846 750027
57823G50027K530K198J877J201L03n30j182j530j574j759k404k900k516j934k551
$$ 750027 752557 754755 756632 757833 758136 757606 756424 754894 753320 751561 749157 746257 743741 741807 739256
57808G39256m124m675l254j235j94jJ07N0l28l83K84R43J091J490K642L353K374
$$ 739256 735132 730457 727203 725968 725774 725773 725880 725930 725602 725219 725503 726446 727537 729027 731669 735022 737396
57791G37396N44k44M56J631K591L157K623M57k164l230k466j501j390j606j737
$$ 737396 737940 737696 738152 739783 742374 745531 748154 748611 746447 743217 740751 739250 737860 736254 734517
57776G34517k533m371n968n752l845j722k94P49J969L242L968L814L084K489K504
$$ 734517 731984 727613 721645 715893 712048 710326 710032 710781 712750 715992 719960 723774 726858 729347 731851
57761G31851K911L029K465J581J150J539K236K196Q56j229k828l194k540j467
$$ 731851 734762 737791 740256 741837 742987 744526 746762 748958 749814 748585 745757 742563 740023 738556
57747G38556l32P28J564K133K575K837K505J301m07j830k306j481N60K903L969
$$ 738556 738224 738952 740516 742649 745224 748061 750566 751867 751460 749630 747324 745843 746403 749306 753275
57732G53275K817L95j119n39J184K242K073J743K359L631M255L524K219J865L255
$$ 753275 756092 756487 755368 754829 756013 758255 760328 762071 764430 768061 772316 775840 778059 779924 783179
57717G83179N735P737Q101O990N636N008M927M631L940L345L031K622J983J504
$$ 783179 788914 796651 804752 811742 817378 822386 827313 831944 835884 839229 842260 844882 846865 848369
57703H48369J273Q08P8j17N36R96L46n65j95J384K532K300J329M05o25k017l276
$$ 848369 849642 850450 850528 850411 850947 851943 852289 851724 851529 852913 855445 857745 859074 859479 858854 856837 853561
57686H53561l708l317k615j957j360o39M29J742K736K924K473J775P94n07j394
$$ 853561 849853 846536 843921 841964 840604 839965 840394 842136 844872 847796 850269 852044 852838 852331 850937
57671H50937j016K25Q51J22j150j736j267k71M39L23l25l59R90K907L832L359
$$ 850937 849921 850146 850997 851119 849969 848233 846966 846695 847134 847457 847132 846773 847763 850670 854502 857861
57655H57861K515K211K395K741L167L496L558L662M044L866K137k80r84J079M270
$$ 857861 860376 862587 864982 867723 870890 874386 877944 881606 885650 889516 891653 891373 890389 891468 895738
57640H95738O424P102P085O792O274N847N715N419M567L670L605M593O105P389
$$ 895738 902162 909264 916349 923141 929415 935262 940977 946396 950963 954633 958238 962831 968936 976325
57626I76325P774P079O107O154P580R379J0489J0991J1748J3468J6279J9828K3636
$$ 976325 984099 991178 997285 1003439 1011019 1020398 1030887 1041878 1053626 1067094 1083373 1103201 1126837
57613A126837K7811L3000L8919M3584M5380M5269M5034M3578L7486K5819J1849
$$ 1126837 1154648 1187648 1226567 1270151 1315531 1360800 1405834 1449412 1486898 1512717 1524566
57602A524566r29j2126k2263k9799l2917l2805l2519l3117l3031l0894k7084k2689
$$ 1524566 1523637 1511511 1489248 1459449 1426532 1393727 1361208 1328091 1295060 1264166 1237082 1214393
57590A214393j8691j6051j5062j4532j2855r898o836m429k532r98rM32L92j60
$$ 1214393 1195702 1179651 1164589 1150057 1137202 1127304 1120468 1116039 1113507 1112509 1112500 1112932 1113324 1113164
57576A113164p07p7J936L557L021R96l35p3R99K207L450M191L795K909K872L598
$$ 1113164 1112457 1112380 1114316 1117873 1120894 1121890 1121555 1121482 1122481 1124688 1128138 1132329 1136124 1139033 1141905 1145503
57560A145503L724K912K341K573K655K001J607K539M317N726O267O112N397M341
$$ 1145503 1149227 1152139 1154480 1157053 1159708 1161709 1163316 1165855 1170172 1175898 1182165 1188277 1193674 1198015
57546A198015L497L269L587M284N283O231O625O552O645P103P394P153O609N980
$$ 1198015 1201512 1204781 1208368 1212652 1217935 1224166 1230791 1237343 1243988 1251091 1258485 1265638 1272247 1278227
57532A278227N129M110L321K901K653K733L643N277O681P106O779O345O150O348
$$ 1278227 1283356 1287466 1290787 1293688 1296341 1299074 1302717 1307994 1314675 1321781 1328560 1334905 1341055 1347403
57518A347403P008P887Q528Q823Q933Q671P607N968M718M480M914N376N610N658
$$ 1347403 1354411 1362298 1370826 1379649 1388582 1397253 1404860 1410828 1415546 1420026 1424940 1430316 1435926 1441584
57504A441584N628N771O320P156Q006Q810R373Q992P406N843N914P351Q164P438
$$ 1441584 1447212 1452983 1459303 1466459 1474465 1483275 1492648 1501640 1509046 1514889 1520803 1528154 1536318 1543756
57490A543756O687P666R963J1664J1754J0776R553Q316P215O930Q209J0720J2638
$$ 1543756 1550443 1558109 1568072 1579736 1591490 1602266 1611819 1620135 1627350 1634280 1642489 1653209 1665847
57477A665847J1975Q747N418M540O195Q397R566R669R294Q869Q778Q984Q447O254
$$ 1665847 1677822 1686569 1691987 1696527 1702722 1711119 1720685 1730354 1739648 1748517 1757295 1766279 1774726 1780980
57463A780980L547K816M791P403Q565Q515Q524Q668Q217P281O636O510O651P086
$$ 1780980 1784527 1787343 1792134 1799537 1808102 1816617 1825141 1833809 1842026 1849307 1855943 1862453 1869104 1876190
57449A876190P736P855P002O125O543Q173R844J1008J1931J2434J1754R870P875
$$ 1876190 1883926 1891781 1898783 1904908 1911451 1919624 1929468 1940476 1952407 1964841 1976595 1986465 1994340
57436A994340O803O757P330Q151Q926R563J0419J1845J3472J4494J4595J4063
$$ 1994340 2001143 2007900 2015230 2023381 2032307 2041870 2052289 2064134 2077606 2092100 2106695 2120758
57424B120758J3186J2184J1539J1595J1927J1880J1699J2118J2888J2820J1568
$$ 2120758 2133944 2146128 2157667 2169262 2181189 2193069 2204768 2216886 2229774 2242594 2254162
57413B254162J0311J0153J0771J1293J1645J2177J2510J1876J0366R027Q602Q792
$$ 2254162 2264473 2274626 2285397 2296690 2308335 2320512 2333022 2344898 2355264 2364291 2372893 2381685
57401B381685Q872Q631Q543R249J0866J2671J3680J3731J3729J4399J5145J4755
$$ 2381685 2390557 2399188 2407731 2416980 2427846 2440517 2454197 2467928 2481657 2496056 2511201 2525956
57389B525956J3094J1387J0733J1024J1620J2287J2945J3148J2682J2320J3058
$$ 2525956 2539050 2550437 2561170 2572194 2583814 2596101 2609046 2622194 2634876 2647196 2660254
57378B660254J4605J5521J5114J4266J3989J4025J3646J3158J3402J4116J3986
$$ 2660254 2674859 2690380 2705494 2719760 2733749 2747774 2761420 2774578 2787980 2802096 2816082
57367B816082J2692J1718J2500J4499J5922J5929J5252J4798J4546J4059J3396
$$ 2816082 2828774 2840492 2852992 2867491 2883413 2899342 2914594 2929392 2943938 2957997 2971393
57356B971393J3011J3020J3054J2762J2248J1981J2348J3266J4117J4270J3798
$$ 2971393 2984404 2997424 3010478 3023240 3035488 3047469 3059817 3073083 3087200 3101470 3115268
57345C115268J3499J3906J4409J3849J2161J0834J1299J3219J5015J5822J6105
$$ 3115268 3128767 3142673 3157082 3170931 3183092 3193926 3205225 3218444 3233459 3249281 3265386
57334C265386J6279J5910J4885J4404J5545J7239J7099J4546J1861J1434J2895
$$ 3265386 3281665 3297575 3312460 3326864 3342409 3359648 3376747 3391293 3403154 3414588 3427483
57323C427483J4046J4009J4140J5677J7740J8358J6874J4533J2994J2882J3743
$$ 3427483 3441529 3455538 3469678 3485355 3503095 3521453 3538327 3552860 3565854 3578736 3592479
57312C592479J4655J4795J3972J2897J2567J3155J3909J4315J4691J5223J5181
$$ 3592479 3607134 3621929 3635901 3648798 3661365 3674520 3688429 3702744 3717435 3732658 3747839
57301C747839J3994J2509J2135J2937J3840J4559J5841J7441J7650J5772J3672
$$ 3747839 3761833 3774342 3786477 3799414 3813254 3827813 3843654 3861095 3878745 3894517 3908189
57290C908189J3390J4296J4321J3294J3054J4316J5483J5078J3747J3013J3308
$$ 3908189 3921579 3935875 3950196 3963490 3976544 3990860 4006343 4021421 4035168 4048181 4061489
57279D061489J4158J5162J5859J5572J4444J3800J4417J5230J4923J4111J4312
$$ 4061489 4075647 4090809 4106668 4122240 4136684 4150484 4164901 4180131 4195054 4209165 4223477
57268D223477J5328J5483J4468J3924J4654J5142J4007J2384J2290J3714J5026
$$ 4223477 4238805 4254288 4268756 4282680 4297334 4312476 4326483 4338867 4351157 4364871 4379897
57257D379897J5644J6379J7390J7770J7418J7471J8289J8619J7752J6912J7288
$$ 4379897 4395541 4411920 4429310 4447080 4464498 4481969 4500258 4518877 4536629 4553541 4570829
57246D570829J7956J7385J6026J5517J5878J5513J3960J2761J3165J4553J5711
$$ 4570829 4588785 4606170 4622196 4637713 4653591 4669104 4683064 4695825 4708990 4723543 4739254
57235D739254J6286J6298J5517J4181J3259J3142J2947J1996J1091J1257J2075
$$ 4739254 4755540 4771838 4787355 4801536 4814795 4827937 4840884 4852880 4863971 4875228 4887303
57224D887303J2353J1943J1708J2018J2404J2517J2516J2544J2609J2856J3298
$$ 4887303 4899656 4911599 4923307 4935325 4947729 4960246 4972762 4985306 4997915 5010771 5024069
57213E024069J3474J3109J2875J3631J4980J5492J4484J2873J2022J2333J3164
$$ 5024069 5037543 5050652 5063527 5077158 5092138 5107630 5122114 5134987 5147009 5159342 5172506
57202E172506J3661J3485J2980J2812J3266J3978J4468J4677J4776J4777J4688
$$ 5172506 5186167 5199652 5212632 5225444 5238710 5252688 5267156 5281833 5296609 5311386 5326074
57191E326074J4676J4656J4025J2358J0064P919O144M489L010K218K426L268L894
$$ 5326074 5340750 5355406 5369431 5381789 5391853 5399772 5405916 5410405 5413415 5415633 5418059 5421327 5425221
57178E425221L634K755K486L698N652O925P595R249J2326J5010J5741J5526J6309
$$ 5425221 5428855 5431610 5434096 5437794 5443446 5450371 5457966 5467215 5479541 5494551 5510292 5525818 5542127
57165E542127J8117J9569K0550K2429K5667K8902L0683L0899L0349K9961L0486
$$ 5542127 5560244 5579813 5600363 5622792 5648459 5677361 5708044 5738943 5769292 5799253 5829739
57154E829739L1838L2594L1194K7788K4029K1109J8968J7252J5805J4163J1832
$$ 5829739 5861577 5894171 5925365 5953153 5977182 5998291 6017259 6034511 6050316 6064479 6076311
57143F076311R315P749P316O974O004M744L587K314Q78j17j99L93J109J491J117
$$ 6076311 6085626 6093375 6100691 6107665 6113669 6118413 6122000 6124314 6125192 6125075 6124876 6125269 6126378 6127869 6128986
57128F128986m0j179j419j020j046j860k892l729m446m846m688m740o284r202
$$ 6128986 6128946 6127767 6126348 6125328 6124282 6122422 6119530 6115801 6111355 6106509 6101821 6097081 6090797 6081595
57114F081595j1692j2471j2232j2477j3736j5354j6257j5666j3833j2391j3129
$$ 6081595 6069903 6057432 6045200 6032723 6018987 6003633 5987376 5971710 5957877 5945486 5932357
57103E932357j6152j9972k3474k6897l0754l4873l8944m3219m8075n3361n8433
$$ 5932357 5916205 5896233 5872759 5845862 5815108 5780235 5741291 5698072 5649997 5596636 5538203
57092E538203o2548o5259o6827o8008o9047o9377o8661o7287o5045o0575n3395
$$ 5538203 5475655 5410396 5343569 5275561 5206514 5137137 5068476 5001189 4936144 4875569 4822174
57081D822174m5283l8010l0792k2128j3125o472k631J41K200J923q78m062o692
$$ 4822174 4776891 4738881 4708089 4685961 4672836 4666364 4663733 4663874 4666074 4667997 4667119 4663057 4656365
57068D656365j0981j9327l1458m5790o1811p9875j00099j22552j47324j73550
$$ 4656365 4645384 4626057 4594599 4548809 4486998 4407123 4307024 4184472 4037148 3863598
57058C863598j99573k24640k49297k73879k98023l21735l45302l68109l89421
$$ 3863598 3664025 3439385 3190088 2916209 2618186 2296451 1951149 1583040 1193619
57049A193619m10491C49123a12163m91889n25634n63068o04013o48133o96476
$$ 1193619 783128 349123 -112163 -604052 -1129686 -1692754 -2296767 -2944900 -3641376
57040c641376p49780q05938q62201r19246r79590j042987j107720j175030j246286
$$ -3641376 -4391156 -5197094 -6059295 -6978541 -7958131 -9001118 -10108838 -11283868 -12530154
57031a2530154j316306j378256j440608j537567j721236k040587k511991l087655
$$ -12530154 -13846460 -15224716 -16665324 -18202891 -19924127 -21964714 -24476705 -27564360
57023b7564360l649939m060566m237856m186060l945018l523376k893312k039311
$$ -27564360 -31214299 -35274865 -39512721 -43698781 -47643799 -51167175 -54060487 -56099798
57015e6099798r93994J65739J332254K375086L166290L627226L756909L615050
$$ -56099798 -57093792 -56928053 -55595799 -53220713 -50054423 -46427197 -42670288 -39055238
57007c9055238L285754K858183K421587K053435J802340J682664J681458J766029
$$ -39055238 -35769484 -32911301 -30489714 -28436279 -26633939 -24951275 -23269817 -21503788
56999b1503788J891014K010717K091845K117131K081866J991543J860038J703886
$$ -21503788 -19612774 -17602057 -15510212 -13393081 -11311215 -9319672 -7459634 -5755748
56991e755748J536307J366951J204118e94698C22834P96191O91091O02032N24618
$$ -5755748 -4219441 -2852490 -1648372 -594698 322834 1119025 1810116 2412148 2936766
56982B936766M54057L90239L36034K91848K54975K23097J95296J70386J47266
$$ 2936766 3390823 3781062 4117096 4408944 4663919 4887016 5082312 5252698 5399964
56973E399964J26515J09186R4433Q0357O6465N3381M1192L0043K1091J4734R109
$$ 5399964 5526479 5635665 5730098 5810455 5876920 5930301 5971493 6001536 6022627 6037361 6046470
56962F046470K669l128o360q541j2985j9994k6934l2779l9424m8173n7746o6630
$$ 6046470 6049139 6046011 6039651 6031110 6018125 5998131 5971197 5938418 5898994 5850821 5793075 5726445
56950E726445p5106q3929r2573r9816j05084j08656j11199j13190j14197j13075
$$ 5726445 5651339 5567410 5474837 5375021 5269937 5161281 5050082 4936892 4822695 4709620
56940D709620j09528j04995j01130r8116r5386r3223r2292r2361r2759r3567r5170
$$ 4709620 4600092 4495097 4393967 4295851 4200465 4107242 4014950 3922589 3829830 3736263 3641093
56929C641093r7159r8880j00489j02358j04062j05068j05744j06579j07246j07640
$$ 3641093 3543934 3445054 3344565 3242207 3138145 3033077 2927333 2820754 2713508 2605868
56919B605868j08821j11540j14638j16516j17452j18897j21071j22763j23061
$$ 2605868 2497047 2385507 2270869 2154353 2036901 1918004 1796933 1674170 1551109
56910A551109j21871j19131j14854j09478j03136r5241q5841p6427o8121o0047
$$ 1551109 1429238 1310107 1195253 1085775 982639 887398 801557 725130 657009 596962
56900E96962n0999m1723l3848k7466k1597j6279j2476j0469j0032j1491j4818
$$ 596962 545963 504240 470392 442926 421329 405050 392574 382105 372073 360582 345764
56889C45764j8365k0258k0460j9955j8749j6549j4397j3447j2850j1080q632p066
$$ 345764 327399 307141 286681 266726 247977 231428 217031 203584 190734 179654 171022 163956
56877A63956o078m065j133J236L212O363J0235J2145J1014Q717O778M262J1n100
$$ 163956 157878 153813 152680 153916 157128 163491 173726 185871 196885 205602 212380 216642 216653 211553
56863B11553r387j2229j3844j4673j5548j6962j7770j6311j3115j0601r703q859
$$ 211553 202166 189937 176093 161420 145872 128910 111140 94829 81714 71113 61410 52551
56851E2551o986n209m689m775m551m363m555m322l107j693p75J09J104J055n69
$$ 52551 45565 40356 35667 30892 26341 21978 17423 13101 9994 8301 7526 7635 8739 9794 9225
56836I225k214k277j459j447c51k097o48J059f7B392L770O546R774J1237R674
$$ 9225 7011 4734 3275 1828 -351 -2448 -3096 -2037 -67 2392 6162 12708 22482 33719 43393
56821D3393O421L999L185K773K138K159L179M143M634N828Q233J0412J1523J3248
$$ 43393 49814 53813 56998 59771 61909 64068 67247 71390 76024 81852 90085 100497 112020 125268
56807A25268J7235K2055K5013K5938K6769K8083K8663K8373K8910L0873L2063
$$ 125268 142503 164558 189571 215509 242278 270361 299024 327397 356307 387180 419243
56796D19243K9753K3588J5446P393N69m568p880r489r877r842r886r328o671j525
$$ 419243 448996 472584 488030 495423 495992 491424 483544 474055 464178 454336 444450 435122 428451 426926
56782D26926M285Q598J1642J5692K1873K8489L3094L5419L7371M0415M3684M4716
$$ 426926 431211 439809 451451 467143 489016 517505 550599 586018 623389 663804 707488 752204
56770G52204M1419L3213K0864O140q302j9615k6299k9134l0064l0247k9544k7607
$$ 752204 793623 826836 847700 853840 845538 825923 799624 770490 740426 710179 680635 653028
56758F53028k4582k0724j6193j1403o859k456K213O656R628J1075J2904J6802
$$ 653028 628446 607722 591529 580126 573267 570811 573024 579680 589308 600383 613287 630089
56746F30089K1767K4668K3116J7178Q671m07q788j5888k1292k4501k5473k5222
$$ 630089 651856 676524 699640 716818 725489 725082 716294 700406 679114 654613 629140 603918
56734F03918k5173k5583k5258k3153j9738j6324j3636j1519r533p324m765k165
$$ 603918 578745 553162 527904 504751 485013 468689 455053 443534 434001 426677 421912 419747
56722D19747M3K143M898P918R043O439R86m486q333j1523j5642k0284k3226k3038
$$ 419747 419790 421933 426831 434749 443792 450231 451217 446731 438398 426875 411233 390949 367723 344685
56708C44685k0900j9371j9469j9633j7958j4880j2742j2837j3892j3717j1545
$$ 344685 323785 304414 284945 265312 247354 232474 219732 206895 193003 179286 167741
56697A67741q369n822n121o341q029q243o601m880m854o128o875o254n066m212
$$ 167741 159372 153550 148429 142088 134059 125816 119215 114335 109481 103353 96478 90224 85158 80946
56683H0946l528k523j499j312k159l083k953j844r29q74q76QJ236J491Q15O02
$$ 80946 77418 74895 73396 72084 69925 66842 63889 62045 61116 60242 59366 59374 60610 62101 62916 63518
56667F3518J292J591N75q05j308j258j543j781j063R5K40o85j079oJ521K005J164
$$ 63518 64810 66401 66976 66171 64863 63605 62062 60281 59218 59313 59553 58868 57789 57783 59304 61309 62473
56650F2473k56j413j588l34J872L641M020L403K669J900P73k35n0J302K177J216
$$ 62473 62217 60804 59216 58882 60754 64395 68415 71818 74487 76387 77160 76925 76875 78177 80354 81570
56634H1570p20j355L22K945M492M398L520K777K495K709L165L230K537J623J227
$$ 81570 80850 79495 79817 82762 87254 91652 95172 97949 100444 103153 106318 109548 112085 113708 114935
56619A14935J146O70N4L66J690K630K092O19o51j370j610r83O82K273K242M96
$$ 114935 116081 116751 116805 117171 118861 121491 123583 124202 123551 122181 120571 119588 120270 122543 124785 125281
56603A25281j387k002j459p60l48K31J426K757L146K234J063R52J895K639K404
$$ 125281 123894 121892 120433 119673 119325 119556 120982 123739 126885 129119 130182 131134 133029 135668 138072
56588A38072J778J688K135K351J780M78j097k361k943k977k820k533j953j176
$$ 138072 139850 141538 143673 146024 147804 148282 147185 144824 141881 138904 136084 133551 131598 130422
56574A30422m21M10J395J944J434M37K65J109J808J663J268J141Q70K49j02j4
$$ 130422 130001 130411 131806 133750 135184 135621 135886 136995 138803 140466 141734 142875 143745 143994 143892 143878
56558A43878l08j103r85P35K186J141j676l340k424l26J023J173P86O10J137K204
$$ 143878 143570 142467 141482 142217 144403 145544 143868 140528 138104 137778 138801 139974 140760 141370 142507 144711
56542A44711K709J613n62k089k042j134m50k39k67m40n86k90M85Q93k3k031l523
$$ 144711 147420 149033 148471 146382 144340 143206 142756 142517 142250 141810 141224 140934 141419 142312 142289 140258 136735
56525A36735k972o25J626K395K354K900L786L473J847Q39J573K577K164J156J488
$$ 136735 133763 133138 134764 137159 139513 142413 146199 149672 151519 152358 153931 156508 158672 159828 161316
56510A61316L040L912L399K760L025L804M497N165N827O203O549P523Q863R332
$$ 161316 164356 168268 171667 174427 177452 181256 185753 190918 196745 202948 209497 217020 225883 235215
56496B35215Q417O966N681M135J957J20n4J208J961M02l185o299o444l789j194
$$ 235215 243632 250598 256279 260414 262371 262491 262437 263645 265606 266008 262823 256524 250080 246291 245097
56481B45097r52k230k770k372k855m698n856m719k419j083j041j121q00n23m37
$$ 245097 244145 241915 239145 236773 233918 229220 223364 218645 216226 215143 214102 212981 212181 211658 211221
56466B11221j93J19Lm24m20K00O94N40K52N77J295J322k6k155l608l293j402P17
$$ 211221 211028 211147 211150 210726 210306 210506 211200 211740 211992 212569 213864 215186 215160 213005 209397 206104 204702 205419
56448B05419J687J281N38M66P44J82j389k498j926n84l23j242j632p56Pn34j439
$$ 205419 207106 208387 208925 209391 210135 210317 208928 206430 204504 203920 203597 202355 200723 199967 199974 199440 198001
56431A98001j185qP57P66N64P6j075k123j772k56P76O05K11M69R83J113Q78L37
$$ 198001 196816 196808 197565 198331 198895 198971 197896 195773 194001 193745 194521 195126 195337 195806 196789 197902 198780 199117
56413A99117o54j589j399q0R44P86M26J130K467K987K269J234O84N37M57M22N48
$$ 199117 198463 196874 195475 195395 196339 197125 197551 198681 201148 204135 206404 207638 208322 208859 209316 209738 210286
56396B10286Q05J079J289J321R69J08r51j381n08J197K272J847P29L66J140K289
$$ 210286 211091 212170 213459 214780 215749 215857 214906 213525 213017 214214 216486 218333 219062 219428 220568 222857
56380B22857K999K781J283j080k637k050l04L05o48j173J3J415R67r52k024r66
$$ 222857 225856 228637 229920 228840 226203 224153 223849 224154 223506 222333 222346 223761 224728 223776 221752 220786
56364B20786J191K541K149O62l14M07K342L636K948Q43r95j447n99P78J766J690
$$ 220786 221977 224518 226667 227329 227015 227422 229764 233400 236348 237191 236196 234749 234150 234928 236694 238384
56348B38384N52r15j871j968j300j84P78Q70j27j564k424k082p55O34J089M06
$$ 238384 238936 238021 236150 234182 232882 232698 233476 234346 234219 232655 230231 228149 227394 228028 229117 229523
56332B29523o27j150j011l24J113L052M033K808M19o47L10J240L66j245j231Q08
$$ 229523 228896 227746 226735 226411 227524 230576 234609 237417 237836 237189 237499 238739 239105 237860 236629 237437
56316B37437K867L128J830N19J99N93R66J295K281M046N376M988L219J701J371
$$ 237437 240304 243432 245262 245781 245980 246573 247539 248834 251115 255161 260537 265525 268744 270445 271816
56301B71816J686J806J608J286Q77N07M04M12K28J89J015K538L587L332J966P5
$$ 271816 273502 275308 276916 278202 279079 279586 279990 280402 280630 280819 281834 284372 287959 291291 293257 293332
56285B93332j627j981j97K612M143L756L225M001N117M940L709K895K841K545
$$ 293332 291705 289724 289527 292139 296282 300038 303263 307264 312381 317321 321030 323925 326766 329311
56271C29311J517O52J140L062N100N499L801J640J105K196K986K392J467J395
$$ 329311 330828 331480 332620 335682 340782 346281 350082 351722 352827 355023 358009 360401 361868 363263
56257C63263J732J578J178J120R71J14q68q62J48J169J483J103M68L05J111K308
$$ 363263 364995 366573 367751 368871 369842 369956 369088 368226 368374 369543 371026 372129 372597 372902 374013 376321
56241C76321K793K791L685N405N762L685J308J017K046K172J452J646K831L459
$$ 376321 379114 381905 385590 390995 396757 400442 401750 402767 404813 406985 408437 410083 412914 416373
56227D16373L480M447O314O928N505M121M598N939O248N541N107N214N065M441
$$ 416373 419853 424300 430614 437542 443047 447168 451766 457705 463953 469494 474601 479815 484880 489321
56213D89321M120M808O452Q448J0076J0977J1496J2197J3005J3374J3376J3875
$$ 489321 493441 498249 504701 513149 523225 534202 545698 557895 570900 584274 597650 611525
56201F11525J5277J6802J7470J7295J7218J8261K0814K4270K7264K8866K9728
$$ 611525 626802 643604 661074 678369 695587 713848 734662 758932 786196 815062 844790
56190H44790L1342L4133L7063L9335M1368M3544M4923M4428M2809M2152M3228
$$ 844790 876132 910265 947328 986663 1028031 1071575 1116498 1160926 1203735 1245887 1289115
56179A289115M4337M3351M0225L6613L3281K9133K3144J6182R915M454j540q473
$$ 1289115 1333452 1376803 1417028 1453641 1486922 1516055 1539199 1555381 1565296 1569750 1568210 1559737
56167A559737j4898j9351k2028k4041k5994k7953k9981l1891l3152l3648l3938
$$ 1559737 1544839 1525488 1503460 1479419 1453425 1425472 1395491 1363600 1330448 1296800 1262862
56156A262862l4216l3778l2196l0110k8237k6427k4551k3259k2893k2645k1898
$$ 1262862 1228646 1194868 1162672 1132562 1104325 1077898 1053347 1030088 1007195 984550 962652
56145I62652k1319k1358k0779j8360j5143j3049j1926j0068p307n358m950m755
$$ 962652 941333 919975 899196 880836 865693 852644 840718 830650 823343 817985 813035 808280
56133H08280l670k325j593j199o65l27n35p88n30o8j5k96j96Q76K813M604N002
$$ 808280 804610 802285 800692 799493 798828 798501 797966 797178 796648 796580 796565 796269 796073 796949 799762 804366 809368
56116H09368M006L379M723P403R460J0322J1160J2645J3935J4342J4555J5502
$$ 809368 813374 816753 821476 828879 838339 848661 859821 872466 886401 900743 915298 930800
56104I30800J7005J8255J8830J8818J8675J9304K1508K4914K8147L0395L2318
$$ 930800 947805 966060 984890 1003708 1022383 1041687 1063195 1088109 1116256 1146651 1178969
56093A178969L5210L9724M5310N0535N4204N6978O1281O8598P7320Q4639R0106
$$ 1178969 1214179 1253903 1299213 1349748 1403952 1460930 1522211 1590809 1668129 1752768 1842874
56082A842874R5644J02189J08277J12323J14328J14487J11666J04500R3313Q0266
$$ 1842874 1938518 2040707 2148984 2261307 2375635 2490122 2601788 2706288 2799601 2879867
56072B879867O8222N9480N4419N0931M6228L9570L2241K4859J6388O303l920j2545
$$ 2879867 2948089 3007569 3061988 3112919 3159147 3198717 3230958 3255817 3272205 3278508 3274588 3262043
56060C262043j9655k6651l4702m4484n6303o9474q2231r2975j00937j05318j05124
$$ 3262043 3242388 3215737 3181035 3136551 3080248 3010774 2928543 2835568 2734631 2629313 2524189
56049B524189j00679r4149q7540q0890p3210o4341n5034m6067l8191l2149k7784
$$ 2524189 2423510 2329361 2241821 2160931 2087721 2023380 1968346 1922279 1884088 1851939 1824155
56038A824155k3723j8904j3956j0256q132o777n395l742j768N09K858M905O218
$$ 1824155 1800432 1781528 1767572 1757316 1749184 1742407 1737012 1733270 1731502 1732011 1734869 1739774 1745992
56025A745992O405N649N128O091Q376J0641J2163J3409J4667J5268J4747J3941
$$ 1745992 1752397 1758046 1763174 1769265 1777641 1788282 1800445 1813854 1828521 1843789 1858536 1872477
56013A872477J4245J6271J9441K2303K3332K2325K1054K1445K3178K4308K4302
$$ 1872477 1886722 1902993 1922434 1944737 1968069 1990394 2011448 2032893 2056071 2080379 2104681
56002B104681K4787K6876K9473L1097L1958L3223L5236L7498L9638M1639M3640
$$ 2104681 2129468 2156344 2185817 2216914 2248872 2282095 2317331 2354829 2394467 2436106 2479746
55991B479746M5905M8350N0043N0188M9611M9986N1509N2834N3404N4159N5514
$$ 2479746 2525651 2574001 2624044 2674232 2723843 2773829 2825338 2878172 2931576 2985735 3041249
55980C041249N6574N6942N7560N8966O0486O1976O4515O8369P2137P5051P8386
$$ 3041249 3097823 3154765 3212325 3271291 3331777 3393753 3458268 3526637 3598774 3673825 3752211
55969C752211Q3187Q8321R2327R5750J00008J05071J09799J13681J17001J20252
$$ 3752211 3835398 3923719 4016046 4111796 4211804 4316875 4426674 4540355 4657356 4777608
55959D777608J24330J30258J37631J44509J49919J55298J62458J71340J80786
$$ 4777608 4901938 5032196 5169827 5314336 5464255 5619553 5782011 5953351 6134137
55950F134137J90282J99899K09772K20713K34215K50834K69618K89672L11038
$$ 6134137 6324419 6524318 6734090 6954803 7189018 7439852 7709470 7999142 8310180
55941H310180L33718L57651L84128M15194M50844M88856N27926N68624O10674
$$ 8310180 8643898 9001549 9385677 9800871 10251715 10740571 11268497 11837121 12447795
55932A2447795O52150O92580P34044P77746Q22254Q66501R11679R58535J005810
$$ 12447795 13099945 13792525 14526569 15304315 16126569 16993070 17904749 18863284 19869094
55923A9869094J053247J103284J157989J217280J281998J355396J439446J532923
$$ 19869094 20922341 22025625 23183614 24400894 25682892 27038288 28477734 30010657
55915C0010657J635426J750077J880060K025910K188188K368910K568313K784701
$$ 30010657 31646083 33396160 35276220 37302130 39490318 41859228 44427541 47212242
55907D7212242L019815L279708L568415L887168M243062M652176N131097N693254
$$ 47212242 50232057 53511765 57080180 60967348 65210410 69862586 74993683 80686937
55899H0686937O357593P150922Q094107R192931J0446245J1849113J3376714J4976567
$$ 80686937 87044530 94195452 102289559 111482490 121928735 133777848 147154562 162131129
55891A62131129J6589179J8167685J9671175K1056185K2268441K3161744K3332584
$$ 162131129 178720308 196887993 216559168 237615353 259883794 283045538 306378122
55884C06378122K2065277J8619623J2769558N147142k958470j0205516j5734485
$$ 306378122 328443399 347063022 359832580 364979722 362021252 351815736 336081251
55877C36081251j9318426k1190426k1781875k1521751k0731347j9609559j8280152
$$ 336081251 316762825 295572399 273790524 252268773 231537426 211927867 193647715
55870A93647715j6843127j5388889j3986936j2678963j1481373j0389465r386664
$$ 193647715 176804588 161415699 147428763 134749800 123268427 112878962 103492298
55863A03492298q460021p607969o832975o133641n507933m957264m480732m069110
$$ 103492298 95032277 87424308 80591333 74457692 68949759 63992495 59511763 55442653
55855E5442653l709837l394745l118431k872761k648581k441036k248857k069939
$$ 55442653 51732816 48338071 45219640 42346879 39698298 37257262 35008405 32938466
55847C2938466j901590j744004j599938j471277j357876j258501j170881j092158
$$ 32938466 31036876 29292872 27692934 26221657 24863781 23605280 22434399 21342241
55839B1342241j020964r57651r01222q48255p96548p47669p03774o63982o26132
$$ 21342241 20321277 19363626 18462404 17614149 16817601 16069932 15366158 14702176 14076044
55830A4076044n90254n57774n28615n01400m75639m51659m29110m07365l86847
$$ 14076044 13485790 12928016 12399401 11898001 11422362 10970703 10541593 10134228 9747381
55821I747381l68643l53150l39905l28024l16222l03555k90740k79596k70548
$$ 9747381 9378738 9025588 8685683 8357659 8041437 7737882 7447142 7167546 6896998
55812F896998k61947k52289k41553k30042k17777k05653j95146j85947j75872
$$ 6896998 6635051 6382762 6141209 5911167 5693390 5487737 5292591 5106644 4930772
55803D930772j64128j52761j43888j37398j32367j28552j25269j21037j15843
$$ 4930772 4766644 4613883 4469995 4332597 4200230 4071678 3946409 3825372 3709529
55794C709529j11758j09693j07569j03496r8659r5106r2619q9994q7606q6180
$$ 3709529 3597771 3488078 3380509 3277013 3178354 3083248 2990629 2900635 2813029 2726849
55784B726849q4435q0730p6021p2685p0987o9111o6166o2885n9722n6448n3569
$$ 2726849 2642414 2561684 2485663 2412978 2341991 2272880 2206714 2143829 2084107 2027659 1974090
55773A974090n2065n1541n0338m7706m4459m1443l8728l6434l5063l4699l4788
$$ 1974090 1922025 1870484 1820146 1772440 1727981 1686538 1647810 1611376 1576313 1541614 1506826
55762A506826l4806l4524l3774l2641l1753l1545l1426l0282k7611k3908k0350
$$ 1506826 1472020 1437496 1403722 1371081 1339328 1307783 1276357 1246075 1218464 1194556 1174206
55751A174206j8276j8179j8856j8453j6655j4737j3213j1075q076n873n685o406
$$ 1174206 1155930 1137751 1118895 1100442 1083787 1069050 1055837 1044762 1036686 1030813 1025128 1018722
55739A018722o440n882n296m017j691ln56j944j416J153L246L258J912M10o94
$$ 1018722 1012282 1006400 1001104 997087 995396 995393 994837 992893 991477 992630 995876 999134 1001046 1001456 1000762
55724A000762r52m82r11l753p791j0112r873r059r256r890j0073j0134j0429j0434
$$ 1000762 999810 999328 998417 994664 986873 976761 966888 957829 948573 938683 928610 918476 908047 897613
55710H97613r998j0095j1370j3019j3817j3322j1696r450p706p465q172q313p704
$$ 897613 887615 877520 866150 853131 839314 825992 814296 804846 797140 789675 781503 773190 765486
55697G65486p786r158j0467j0472r791r602r928j0234j0557j0970j0901j0176
$$ 765486 757700 748542 738075 727603 717812 708210 698282 688048 677491 666521 655620 645444
55685F45444r761j0308j0776r754p624o093n932o396o708o998p512p767o970n053
$$ 645444 635683 625375 614599 604845 597221 591128 585196 578800 572092 565094 557582 549815 542845 537792
55671E37792l053k321l067l988l735k707k436l367m340m491m391m607m489l444
$$ 537792 534739 532418 529351 525363 521628 518921 516485 513118 508778 504287 499896 495289 490800 487356
55657D87356k348k353l095l370l034k712k173p27P96M08k204m729n037l650k421
$$ 487356 485008 482655 479560 476190 473156 470444 468271 467544 468340 468748 466544 461815 456778 453128 450707
55642D50707j842j167n58j305l650n847o178n008l920l508l168k800l359n238
$$ 450707 448865 447698 447140 445835 442185 436338 430160 425152 421232 417724 414556 411756 408397 403159
55628D03159p097p203n450l317k096j888k146k396k262j511l20Q16J598J999J977
$$ 403159 396062 388859 383409 380092 377996 376108 373962 371566 369304 367793 367473 368289 369887 371886 373863
55613C73863J660J685K552L587L351J460p83k025k347k477k391j683q47r18j851
$$ 373863 375523 377208 379760 383347 386698 388158 387375 385350 383003 380526 378135 376452 375605 374687 372836
55598C72836k322j438J71J436K142K533K273Q33j229k341j653n3R41P88l0j050
$$ 372836 370514 369076 369247 370683 372825 375358 377631 378464 377235 374894 373241 373188 374129 374917 374887 373837
55582C73837k090k631k019o12N2j078l224m646m556l562k643k414l135m521n529
$$ 373837 371747 369116 367097 366485 366537 365459 362235 357589 353033 349471 346828 344414 341279 336758 331229
55567C31229n236m114l579l967l909k337l26N1j668l843m803m539m084l978l893
$$ 331229 325993 321879 318300 314333 310424 308087 307761 307812 306144 302301 297498 292959 288875 284897 281004
55552B81004l399k569j781j276j019q14m73p7j35j221l093m370l660j261P60O11
$$ 281004 277605 275036 273255 271979 270960 270146 269673 269596 269461 268240 265147 260777 257117 255856 256616 257227
55536B57227j287k843k648j262j98k57j042j761k028j985j856j525o55O95J832
$$ 257227 255940 253097 250449 249187 248989 248732 247690 245929 243901 241916 240060 238535 237880 238575 240407
55521B40407K153K038K514L952N491O028N467M803N119O656Q531R198P460L509
$$ 240407 242560 244598 247112 251064 256555 262583 268050 272853 277972 284628 293159 302357 309817 313326
55507C13326r58l861m247k950j888k512m552o290o338n182m662n835p744q491
$$ 313326 312368 308507 304260 301310 299422 296910 292358 286068 279730 274548 269886 264051 256307 247816
55493B47816p292n229m085m646n951o246m756k487j011o72n43j25j43j124k074
$$ 247816 240524 235295 231210 226564 220613 214367 209611 207124 206113 205441 204898 204773 204630 203506 201432
55478B01432j659l30K4j249k446j805Q4J230J120J200K447L832L917K903K020
$$ 201432 199773 199443 199467 198218 195772 193967 194051 195281 196401 197601 200048 203880 207797 210700 212720
55463B12720J572Q68j28m91N5N12J33l66J2R41J201K65j309k702l322k839j564
$$ 212720 214292 215160 215032 214541 214596 215108 215241 214875 214887 215828 217029 217294 215985 213283 209961 207122 205558
55446B05558o13r23k184l253l381k567j186m4j69j526k425j574k76r13l312m643
$$ 205558 204945 204022 201838 198585 195204 192637 191451 191407 191238 189712 187287 185713 185437 184524 181212 176569
55430A76569l361j334r28j719j681l85Q13J076P70J42j060k448l014k551j922
$$ 176569 173208 171874 170946 169227 167546 167161 167974 169050 169820 169962 168902 166454 163440 160889 158967
55415A58967j591j091l73m88j947l356k908q74O09L93k30M96K140K493M95k299
$$ 158967 157376 156285 155912 155424 153477 150121 147213 146339 146948 147341 147111 147607 149747 152240 152735 150436
55399A50436l601k888j325J23J366K155J749J64j232j188o9P42N87n7o28j136
$$ 150436 146835 143947 142622 142745 144111 146266 148015 148179 146947 145759 145690 146432 147019 146962 146334 145198
55383A45198j776k480k958k843j841r7J649K555K336J350K24m16k82J68P5o69
$$ 145198 143422 140942 137984 135141 133300 133203 134852 137407 139743 141093 141317 140901 140619 140787 140862 140193
55367A40193j098n41K35R6n97m10Q54J563N61j008j133L43J620J426N50M80J316
$$ 140193 139095 138554 138789 138885 138288 137878 138732 140295 140856 139848 138715 139058 140678 142104 142654 143134 144450
55350A44450J796J126q8q25q50n32o7M57N91r6j154j569j071m18j46J75J007J880
$$ 144450 146246 147372 147284 146459 145609 145077 145010 145467 146058 145962 144808 143239 142168 141750 141604 141779 142786 144666
55332A44666J968J186J36o56r56o32J65R21J259J323J306J070O45M62N68K19q97
$$ 144666 146634 147820 147956 147300 146344 145712 145877 146798 148057 149380 150686 151756 152401 152863 153431 153650 152753
55315A52753j767j371l36j14q43j448j602k018k699k543j304m38j010j896j292
$$ 152753 150986 149615 149279 149165 148322 146874 145272 143254 140555 138012 136708 136270 135260 133364 132072
55300A32072P05K263K263J521J429K162K631J909M90j59N74J475Q99j061k675
$$ 132072 132777 135040 137303 138824 140253 142415 145046 146955 147445 147286 147860 149335 150234 149173 146498
55285A46498k812k084j529j270j072j093j244p19Q33K329K572J958J687J813J459
$$ 146498 143686 141602 140073 138803 137731 136638 135394 134675 135508 137837 140409 142367 144054 145867 147326
55270A47326O65M24P01L0k260m661n232l823j693L18K125L408L471K216M45j040
$$ 147326 147991 148415 149116 149146 146886 142225 136993 133170 131477 131795 133920 137328 140799 143015 143460 142420
55254A42420k062k695k812k291j299j82P14J044P04K71P56K459M241M463K728
$$ 142420 140358 137663 134851 132560 131261 131079 131793 132837 133541 133812 134568 137027 141268 145731 148459
55239A48459L65q81m32Q37J508O83j469l753m594l103J82L595N457N091L075O77
$$ 148459 148824 147943 147511 148348 149856 150539 149070 145317 140723 137620 137802 141397 146854 151945 155020 155697
55223A55697j070k016k581k811k078n9K248L118K028L89m3O50O77j081l342l709
$$ 155697 154627 152611 150030 147219 145141 145082 147330 150448 152476 152865 152822 153472 154149 153068 149726 146017
55207A46017j487J474K926K555J632R61K52o26j072q93r36j764k408j559M01J736
$$ 146017 144530 146004 148930 151485 153117 154078 154330 153704 152632 151739 150803 149039 146631 145072 145473 147209
55191A47209J523N40q2l4M48J052J252N15q49j770j733j422j636k261k773l083
$$ 147209 148732 149272 149190 149156 149604 150656 151908 152423 151574 149804 148071 146649 145013 142752 139979 136896
55175A36896l235k778j282Q09K421K935K499J533L82o41j316j573j370o90J72
$$ 136896 133661 130883 129601 130410 132831 135766 138265 139798 140180 139539 138223 136650 135280 134590 134762
55160A34762P52J080J716K712L130K175L83r67j266q17j29K93j51j482k522j962
$$ 134762 135514 136594 138310 141022 144152 146327 146710 145743 144477 143660 143531 143824 143673 142191 139669 137707
55144A37707r2J473J840J631J519J095j24j432j615n84N49R47R05J084J396J102
$$ 137707 137615 139088 140928 142559 144078 145173 145049 143617 142002 141418 141967 142914 143819 144903 146299 147401
55128A47401r5j390j603n14Q00J150M84l30o50n55l06M9M66P66R08R97R45M78
$$ 147401 147306 145916 144313 143799 144599 145749 146233 145903 145253 144698 144392 144441 144907 145673 146581 147578 148523 149001
55110A49001k90p22l91L21O30K47l14k98M83J307J152o8j138q43N14J478J260
$$ 149001 148711 147989 147598 147919 148549 148796 148482 148184 148667 149974 151126 151058 149920 149077 149591 151069 152329
55093A52329M24k75q07j250j200n13N0j95p74q09l96k33j95M68J551J798P62m58
$$ 152329 152753 152478 151671 150421 149221 148708 148758 148563 147789 146980 146584 146351 146156 146624 148175 149973 150735 150277
55075A50277q53p72q26o09K92R25R6j445j592J94K018K106R61K08L21N47K88m13
$$ 150277 149424 148652 147826 147217 147509 148434 148530 147085 145493 145687 147705 149811 150772 150980 151301 151848 152136 151723
55057A51723j296j851j399j71K30j235l058k639J88K747L001J847J169J109O13
$$ 151723 150427 148576 147177 147006 147236 146001 142943 140304 140492 143239 146240 148087 149256 150365 150978
55042A50978l60p57j77N48N38k95j393j924j251J81Q88Q5j036q07O27J675J654
$$ 150978 150618 149861 149684 150232 150770 150475 149082 147158 145907 146088 146976 147061 146025 145218 145845 147520 149174
55025A49174J268R53L14m94m75N02J190R33P68J504J927M32k398m340m324l263
$$ 149174 150442 151395 151709 151215 150740 151242 152432 153365 154133 155637 157564 157996 155598 151258 146934 143671
55009A43671k278j430m69L70P85J004J459K240L017L206K324O79l76L57K320L413
$$ 143671 141393 139963 139494 139864 140649 141653 143112 145352 148369 151575 153899 154578 154202 154559 156879 160292
54993A60292K233l22k053j767k59Q58Q83M88O52J494K267K293J523K29j271k437
$$ 160292 162525 162203 160150 158383 158124 158982 159865 160353 161005 162499 164766 167059 168582 168811 167540 165103
54977A65103k662j979j178p36j88P86J306L82j227j591j83J294J259L51K48J168
$$ 165103 162441 160462 159284 158548 158360 159146 160452 160834 159607 158016 157833 159127 160386 160737 160985 162153
54961A62153J666P41r13j930j824j116m01K33R18J541J851J901K061K285J711
$$ 162153 163819 164560 163647 161717 159893 158777 158376 158609 159527 161068 162919 164820 166881 169166 170877
54946A70877l65l130m584l639j360K98N83K46K97J178K816M483M776K837j86j875
$$ 170877 170512 167382 162798 159159 157799 158097 158680 158926 159223 160401 163217 167700 172476 175313 175127 173252
54930A73252j247K50Q52N89M95P40R26J420K702L569J999j755m603m212j756R7
$$ 173252 172005 172255 173107 173696 174191 174931 175857 177277 179979 183548 185547 183792 179189 174977 173221 173318
54914A73318P37J498K759L242K267R13L59M24M85O69J162J261K39j304k060j744
$$ 173318 174055 175553 178312 181554 183821 184734 185093 185517 186002 186671 187833 189094 189333 188029 185969 184225
54898A84225j332j638k409k920k633j261J003K990L108J115j123j457R8J524J393
$$ 184225 182893 181255 178846 175926 173293 172032 173035 176025 179133 180248 179125 177668 177766 179290 180683
54883A80683M42Q8K40l13j671k256r87J027J764P96l86l16R78K431L101K792K054
$$ 180683 181125 181213 181453 181140 179469 177213 176226 177253 179017 179813 179427 179111 180089 182520 185621 188413 190467
54866A90467J682J896K109J915J826K311K573J594K65Q22L664O237O204M512L908
$$ 190467 192149 194045 196154 198069 199895 202206 204779 206373 206638 207460 211124 217361 223565 228077 231985
54851B31985N149O283N580L670K349K274K542K148J271Q57J090O91j558m809o720
$$ 231985 237134 243417 248997 252667 255016 257290 259832 261980 263251 264108 265198 265889 264331 259522 252802
54836B52802o347n304n294n717n013l466k814l405l599k299m59M94M37L2l95o60
$$ 252802 246455 241151 235857 230140 225127 221661 218847 215442 211843 209544 209085 209579 210016 210048 209653 208993
54820B08993k40R23J779J391M71P86L013N817P285O762N213M082M120N121O407
$$ 208993 208753 209676 211455 212846 213317 214103 217116 222933 230218 236980 242193 246275 250395 255516 261923
54805B61923P247O961N236K674N55m81j196k675m742o217o484o050n554n166n031
$$ 261923 269170 276131 281367 284041 284596 284115 282919 280244 275502 269285 262801 256751 251197 246031 241000
54790B41000n405o012o017n080l917l427l672l996l763k913k086k074k762k931
$$ 241000 235595 229583 223566 218486 214569 211142 207470 203474 199711 196798 194712 192638 189876 186945
54776A86945j897q58j387k806k751n80J579J867J049O64M27p30k221k409j278
$$ 186945 185048 184190 182803 179997 177246 176666 178245 180112 181161 181825 182252 181522 179301 176892 175614
54761A75614m79p50r41m4J198J329o9k143l560l202q85K147M017L912K716J701
$$ 175614 175135 174385 173444 173400 174598 175927 175858 173715 170155 166953 166068 168215 172232 176144 178860 180561
54745A80561J092L16p93j525j135J51J173J003r2j057j339j289j239q74Q0J152
$$ 180561 181653 181969 181176 179651 178516 178667 179840 180843 180751 179694 178355 177066 175827 174953 175033 176185
54729A76185J630J383P30o7p13p58k19K53L34O34J558K266J726L20o62p53l83
$$ 176185 177815 179198 179928 179861 179148 178390 178171 178424 178758 179392 180950 183216 184942 185262 184600 183847 183464
54712A83464L07J512K799L530M102N353O789P026O183O031P130P640O076L785
$$ 183464 183771 185283 188082 191612 195714 201067 207856 214882 221065 227096 234226 241866 247942 251727
54698B51727L142M341N409N004L693K719K561K726K161P2l068n532o067n232m401
$$ 251727 254869 259210 264619 269623 273316 276035 278596 281322 283483 283555 280487 274955 268888 263656 259255
54683B59255l965l404k720k556k997l396l541l931m587m642l616k265j548j409
$$ 259255 255290 251886 249166 246610 243613 240217 236676 232745 228158 223516 219900 217635 216087 214678
54669B14678j211q39n51j92N83J461J797J803K406L665M329L723L172M322O511
$$ 214678 213467 212628 212077 211885 212468 213929 215726 217529 219935 223600 227929 231652 234824 239146 245657
54654B45657P349O053M620M862N745N012K608O10J0o42k816n685p186o549m852
$$ 245657 253006 259059 263679 268541 274286 279298 281906 282516 282526 281884 279068 273383 266197 259648 254796
54639B54796l565l299l740m127l925l402l383m160m966m899m090l563m031n089
$$ 254796 251231 247932 244192 240065 236140 232738 229355 225195 220229 215330 211240 207677 203646 198557
54625A98557n447l949p20K543L853K747N30j280k152k180j504o27n25j610k885
$$ 198557 193110 189161 188441 190984 194837 197584 198114 196834 194682 192502 190998 190371 189846 188236 185351
54610A85351k925j523J35P41p1j540k240j160J117K610J921k23j842j763l36J412
$$ 185351 182426 180903 181038 181779 181708 180168 177928 176768 177885 180495 182416 182193 180351 178588 178252 179664
54594A79664K566K588J619N16O4K22N25Q19J078R43K23m54l34L75Q53Q39O16J17
$$ 179664 182230 184818 186437 186953 187017 187239 187764 188583 189661 190604 190827 190373 190039 190414 191267 192106 192722 192839
54576A92839q39j616j248o8L80n95j856k025j145j91L22M76L24j04m09j19O39
$$ 192839 192000 190384 189136 189068 189448 188853 186997 184972 183827 183636 183958 184434 184758 184654 184245 184126 184765
54559A84765J114O76n42j627j629m89Q19J348J198J124J401J625J450Q06l76j863
$$ 184765 185879 186555 186013 184386 182757 182268 183087 184435 185633 186757 188158 189783 191233 192039 191663 189800
54543A89800k735k234j032n77j060j200k72Q63J347J693K675L756L727K338M55
$$ 189800 187065 184831 183799 183222 182162 180962 180690 181553 182900 184593 187268 191024 194751 197089 197544
54528A97544r11j036K81K071K443N90j837k516j271k2r2p75p53J68J146J459J145
$$ 197544 196633 195597 195878 197949 200392 200982 199145 196629 195358 195336 195244 194469 193716 193884 195030 196489 197634
54511A97634Q77J312K257K526J249q08j846j070N72J742K103K044J714R34k38
$$ 197634 198511 199823 202080 204606 205855 205047 203201 202131 202703 204445 206548 208592 210306 211240 211002
54496B11002j305j807j727j395j025m18O69J915K530K163J323O25M9n66p62J9
$$ 211002 209697 207890 206163 204768 203743 203325 203994 205909 208439 210602 211925 212550 212599 212033 211271 211290
54480B11290J431K521K991L390L970M153L376J879L08r12j574j536r66m40m79
$$ 211290 212721 215242 218233 221623 225593 229746 233122 235001 235309 234397 232823 231287 230321 229881 229402
54465B29402j103j845k082j415j12J006J456J612J823J417m12k907m143l477k319
$$ 229402 228299 226454 224372 222957 222845 223851 225307 226919 228742 230159 229747 226840 222697 219220 216901
54450B16901j948j705l96J447K040Q37o84q08O25K349K949J950J44r60n30P13
$$ 216901 214953 213248 212852 214299 216339 217176 216492 215684 216309 218658 221607 223557 223701 222741 222211 222924
54434B22924J341Q29j17p26j021j365j614j134M86K810M638M804L156P61j063
$$ 222924 224265 225094 224977 224251 223230 221865 220251 219117 219603 222413 227051 231855 235011 235772 234709
54419B34709j708j294j81J011J402O79j84J38J578K679K529J903K051K982L607
$$ 234709 233001 231707 231526 232537 233939 234618 234434 234572 236150 238829 241358 243261 245312 248294 251901
54404B51901L102J647J16n61m7Q97R80m3q54k60J031J261P8j068j070m64m0O88
$$ 251901 255003 256650 256766 256205 256158 257055 258035 257992 257138 256878 257909 259170 259248 258180 257110 256646 256606 257294
54386B57294K452M291M070J170k395m034l194j495o62r06j242q94j29K30j84r11
$$ 257294 259746 264037 268107 269277 266882 262848 259654 258159 257497 256591 255349 254455 254326 254556 254372 253461
54370B53461j298j218r35m76L85J500K206K090J524J133Q87J81j164k367k443
$$ 253461 252163 250945 250010 249534 249919 251419 253625 255715 257239 258372 259259 259440 258276 255909 253466
54355B53466j376k69j85j000j653j454o86J81J224K462L061K187N03k71L96J200
$$ 253466 252090 251821 251636 250636 248983 247529 246843 247024 248248 250710 253771 255958 256461 256190 256586 257786
54339B57786R97L39J61J6r69k176k096o87M56L85j62l41k98j54O27J876K023Q8
$$ 257786 258783 259122 259283 259299 258330 256154 254058 253371 253827 254212 254050 253709 253411 253257 253884 255760 257783 257871
54321B57871k463l266j985l77J54k66r85j559j414j66J312J470K39n00N66K274
$$ 257871 255408 252142 250157 249780 249934 249668 248683 247124 245710 245544 246856 248326 248565 248065 248631 250905
54305B50905K599J383K58K05M62Jr89j487r55K28J219J385P02k41q35j087j417
$$ 250905 253504 254887 255145 255350 255812 255813 254824 253337 252382 252610 253829 255214 255916 255675 254840 253753 252336
54288B52336j832j782j021j48K17M21J236K396K498P53j703k873k049l51Q07J203
$$ 252336 250504 248722 247701 247553 247770 248191 249427 251823 254321 255074 253371 250498 248449 248098 248905 250108
54272B50108J514K070K287J320r27l396m583l863k120q13n50r63j754k944l892
$$ 250108 251622 253692 255979 257299 256372 252976 248393 244530 242410 241597 241047 240084 238330 235386 231494
54257B31494l261q15J601K125J373J451K640K762M10k682l647j961L30J316J041
$$ 231494 228233 227418 229019 231144 232517 233968 236608 239370 239780 237098 233451 231490 231820 233136 234177
54242B34177O57Q67J458J693R98l70j337j119k52P7l91p54m21J3k20q45r57k35
$$ 234177 234834 235701 237159 238852 239850 239480 238143 237024 236772 236849 236458 235704 235283 235296 235076 234231 233274 233039
54224B33039P67J312J022k1j141j227K81K480L651K999J344p6q92j398j606j304
$$ 233039 233806 235118 236140 236119 234978 233751 234032 236512 240163 243162 244506 244430 243538 242140 240534 239230
54208B39230p94p48j113r20L66J822K153J447J020J417J508J65j847k619j629
$$ 239230 238436 237688 236575 235655 236021 237843 239996 241443 242463 243880 245388 245553 243706 241087 239458
54193B39458m42m99j146p07Q96J916J281J70L34J588K110R98o06j145m61M33O67
$$ 239458 239016 238517 237371 236664 237560 239476 240757 240927 241261 242849 244959 245957 245351 244206 243745 244178 244845
54176B44845N2j088k053k167j615j458k182k787k127p26j72q92j714j683j173
$$ 244845 244897 243809 241756 239589 237974 236516 234334 231547 229420 228694 228522 227630 225916 224233 223060
54161B23060q62o54j67M57Q27P91L08m57o86M77K368K963J411n89r51J12Q50P36
$$ 223060 222198 221544 221377 221834 222661 223452 223760 223303 222617 223094 225462 228425 229836 229247 228296 228408 229258 229994
54143B29994Q87J896K737K162J73k150l558l301j690n0O14P88J510K584K782J730
$$ 229994 230881 232777 235514 237676 237849 235699 232141 228840 227150 227100 227714 228502 230012 232596 235378 237108
54127B37108L15q30j915k849k862j804o46q3K82P80Q48J17o71p54m72n03p65q58
$$ 237108 237423 236593 234678 231829 228967 227163 226517 226434 226716 227496 228344 228461 227790 227036 226564 226061 225296 224438
54109B24438p67m36M34J377J058p81k292j752P8J158Q66K2r90k301l233k832j618
$$ 224438 223671 223235 223669 225046 226104 225323 223031 221279 221357 222515 223381 223403 222413 220112 216879 214047 212429
54092B12429j040j212r30L7N64L89P07J897K536J626K54j58J76M31R27K283L674
$$ 212429 211389 210177 209247 209284 209848 210237 210944 212841 215377 217003 217257 217099 217275 217706 218633 220916 224590
54075B24590L522J710k36j117j261j675k688l578l223j300R98J986J421P59J147
$$ 224590 228112 229822 229586 228469 227208 225533 222845 219267 216044 214744 215742 217728 219149 219908 221055
54060B21055K016K209J583P18j11p19n20O36J624J269j0q10p00l74j63K88Q10
$$ 221055 223071 225280 226863 227581 227470 226751 226231 226867 228491 229760 229750 228940 228240 227866 227703 227991 228801
54043B28801N80n41j544j614j019l05N43J649K636K983K602J701M59q48j794k086
$$ 228801 229381 228840 227296 225682 224663 224358 224901 226550 229186 232169 234771 236472 236931 236083 234289 232203
54027B32203j703p83K65O99J79l91L91K499M051L463J441O0J74P20N73K40Q92
$$ 232203 230500 229717 229982 230681 230860 230469 230860 233359 237410 240873 242314 242374 242548 243268 243841 244081 244973
54010B44973K280K612Q46j757l118k820k126j772j085L82J750K128J915J827J529
$$ 244973 247253 249865 250711 248954 245836 243016 240890 239118 238033 238415 240165 242293 244208 246035 247564
53995B47564N63j76N49K220L088K716K434L069L787L654L096L150M116N528O632
$$ 247564 248127 247951 248500 250720 253808 256524 258958 262027 265814 269468 272564 275714 279830 285358 291990
53980B91990O609N246L650L295L989L926K154k01j754k576l258l588l280l006
$$ 291990 298599 303845 307495 310790 314779 318705 320859 320658 318904 316328 313070 309482 306202 303196
53966C03196l433m000l890l477l478l302j813M88J641P18j134k360k655k603k641
$$ 303196 299763 295763 291873 288396 284918 281616 279803 280291 281932 282650 281516 279156 276501 273898 271257
53951B71257k797k881k571j731p07k0K14P1n92j723k428j699J27J430J057m87
$$ 271257 268460 265579 263008 261277 260570 260550 260764 260835 260243 258520 256092 254393 254520 255950 257007 256520
53935B56520j784j927j117l45n36j674k650k333o87J356K864L276K372O30o28
$$ 256520 254736 252809 251692 251347 250811 249137 246487 244154 243467 244823 247687 250963 253335 253965 253337
53920B53337l88Q29J672J776J875K150J721J83j401j803j234q88j280j642r56
$$ 253337 252949 253778 255450 257226 259101 261251 262972 263155 261754 259951 258717 257829 256549 254907 253951
53905B53951Q09K538L022K288J644K082K984L000J884O72J53K11O19J393K045
$$ 253951 254760 257298 260320 262608 264252 266334 269318 272318 274202 274874 275027 275238 275857 277250 279295
53890B79295J668K49r54r23O3J387L116N298P088P589P128O783O864O711N774
$$ 279295 280963 281212 280258 279335 279398 280785 283901 289199 296287 303876 311004 317787 324651 331362 337136
53875C37136M315L039K417K302K061J344O80P11R11J23j376j789m79P38L09l41
$$ 337136 341451 344490 346907 349209 351270 352614 353294 354005 354916 355039 353663 351874 351395 352133 352442 352101
53859C52101J206M412O181N146L352K992L504L116J741O97L19m58k211l978m442
$$ 352101 353307 357719 363900 369046 372398 375390 378894 382010 383751 384448 384767 384309 382098 378120 373678
53844C73678l436j969j138j251j742j674m34J765L892M757M074L009L229N002
$$ 373678 370242 368273 367135 365884 364142 362468 362034 363799 367691 372448 376522 379531 382760 387762
53830C87762O681O531M589J986j028n060r553j2272j1664q849o328n305n212n394
$$ 387762 394443 400974 405563 407549 406521 401461 391908 379636 367972 359123 352795 347490 342278 336884
53816C36884n973o924p264n925l234r45o24k051l432l375k397k050k763l315k597
$$ 336884 330911 323987 316723 310798 307564 306619 305995 303944 300512 297137 294740 292690 289927 286612 284015
53801B84015j083l3J24j45n40j099j552j449j023j114j975k802k722j781o62N2
$$ 284015 282932 282899 283023 282878 282338 281239 279687 278238 277215 276101 274126 271324 268602 266821 266159 266211
53785B66211K03Q0M08J722L409L937K563M56n30O4R67P67p46k700m014m046k931
$$ 266211 266414 266494 266902 268624 272033 275970 278533 278989 278459 278523 279490 280257 279511 276811 272797 268751 265820
53768B65820j497n41r8L67J112J902K529K933K751J487m56j618r94P12K011K459
$$ 265820 264323 263782 263684 264051 265163 267065 269594 272527 275278 276765 276309 274691 273697 274409 276420 278879
53752B78879K782L376L668L133K115J197L87m45r06n21L64Q67Q04R34J730K466
$$ 278879 281661 285037 288705 291838 293953 295150 295537 295092 294186 293665 294029 294896 295700 296634 298364 300830
53736C00830K059N97n85l96Q86K204L078L815M505M512L337J564M00K44L10j97
$$ 300830 302889 303486 302901 302505 303391 305595 308673 312488 316993 321505 324842 326406 326806 327050 327360 327163
53720C27163j016j314j006r47j749k810k937j813l60L50J53l98q82j147j001m52
$$ 327163 326147 324833 323827 322880 321131 318321 315384 313571 313211 313561 313714 313316 312434 311287 310286 309834
53704C09834j12n67j238q66N79J547J135N44J158K049J145j489l349k736o51J031
$$ 309834 309722 309155 307917 307051 307630 309177 310312 310856 312014 314063 315208 313719 310370 307634 306983 308014
53688C08014J684J499L89j353k365j594K08J562K233L024M129M933N113M687L337
$$ 308014 309698 311197 311586 310233 307868 306274 306482 308044 310277 313301 317430 322363 327476 332163 335500
53673C35500J016r52r16Q24K215K260K255L619N752O858O037L856J650R07K414
$$ 335500 336516 335564 334648 335472 337687 339947 342202 345821 351573 358431 364468 368324 369974 370881 373295
53658C73295N151O748N922L888K638K522K532K333K588L494M274M393M252M390
$$ 373295 378446 385194 391116 395004 397642 400164 402696 405029 407617 411111 415385 419778 424030 428420
53644D28420M788N294N931O408O014M518K796K004K363L131L498L229K610K088
$$ 428420 433208 438502 444433 450841 456855 461373 464169 466173 468536 471667 475165 478394 481004 483092
53630D83092J870J682J077J67k60K86J192J338N04l44k58N25R49L71q34j867k360
$$ 483092 484962 486644 487721 487888 487628 487914 489106 490444 490948 490604 490346 490871 491820 492191 491357 489490 487130
53613D87130k532k689k756k376j423l22K32q1r00j634k027k113j768o76J063K602
$$ 487130 484598 481909 479153 476777 475354 475032 475264 475183 474283 472649 470622 468509 466741 466065 467128 469730
53597D69730K941J840M3j281j332j48J392K240K109J722J883K442K517J670M31
$$ 469730 472671 474511 474554 473273 471941 471793 473185 475425 477534 479256 481139 483581 486098 487768 488199
53582D88199l85n24k07M82J664L208M459M752M143L493L615M347M724M073K742
$$ 488199 487814 487290 487083 487565 489229 492437 496896 501648 505791 509284 512899 517246 521970 526043 528785
53567E28785J686J680L049N561Q167R348Q560P129O906Q040Q923Q423P249O735
$$ 528785 530471 532151 535200 540761 548928 558276 566836 573965 580871 588911 597834 606257 613506 620241
53553F20241P146P845Q443Q815Q321O169K701l50j323r6K033L594L894L120K056
$$ 620241 627387 635232 643675 652490 660811 666980 669681 669331 668008 667912 669945 673539 677433 680553 682609
53538F82609J637K310L464L757K519Q15M26J606K572J730l34j997l001m316n887
$$ 682609 684246 686556 690020 693777 696296 697111 697537 699143 701715 703445 703111 701114 698113 693797 687910
53523F87910o281n015l572l244l338k700j782j685k041j613m47K60K60L79N76
$$ 687910 681629 676614 673042 669798 666460 663760 661978 660293 658252 656639 656192 656452 656712 657091 657667
53508F57667j87j637j760L50K767L199J997J228J701K512L055L709M573N024M936
$$ 657667 657480 655843 654083 654433 657200 660399 662396 663624 665325 667837 670892 674601 679174 684198 689134
53493F89134N179O349P828Q579Q308P504O909P190Q485J0009J0679J0571J1137
$$ 689134 694313 700662 708490 717069 725377 732881 739790 746980 755465 765474 776153 786724 797861
53480G97861J3481J6832J9278J9701J8669J7744J8348K0688K3368K4400K3326
$$ 797861 811342 828174 847452 867153 885822 903566 921914 942602 965970 990370 1013696
53469A013696K2092K3115K6570L0258L2082L2082L1963L3165L5553L7730L8658
$$ 1013696 1035788 1058903 1085473 1115731 1147813 1179895 1211858 1245023 1280576 1318306 1356964
53458A356964L9062M0704M3871M6404M6270M4443M3685M4698M5376M4162M2245
$$ 1356964 1396026 1436730 1480601 1527005 1573275 1617718 1661403 1706101 1751477 1795639 1837884
53447A837884M1419M1567M1648M1779M2511M3101M2400M0947M0223M0170L9398
$$ 1837884 1879303 1920870 1962518 2004297 2046808 2089909 2132309 2173256 2213479 2253649 2293047
53436B293047L7774L6695L6469L5581L3343L1302L0812L0773K9431K7186K5901
$$ 2293047 2330821 2367516 2403985 2439566 2472909 2504211 2535023 2565796 2595227 2622413 2648314
53425B648314K6016K5985K4467K1700J8608J5625J2605R224N220P99l314o527
$$ 2648314 2674330 2700315 2724782 2746482 2765090 2780715 2793320 2802544 2807764 2808563 2805249 2798722
53413B798722r026j1311j3409j5082j6631j8788k1765k4914k7396k8943k9953
$$ 2798722 2789696 2778385 2764976 2749894 2733263 2714475 2692710 2667796 2640400 2611457 2581504
53402B581504l1202l3184l5526l7118l7184l6048l4621l3509l2881l2797l3086
$$ 2581504 2550302 2517118 2481592 2444474 2407290 2371242 2336621 2303112 2270231 2237434 2204348
53391B204348l3121l2327l0778k8897k6655k3533j9323j4619j0487p669o035m811
$$ 2204348 2171227 2138900 2108122 2079225 2052570 2029037 2009714 1995095 1984608 1976939 1970904 1966093
53379A966093l535k505j849m49L120Q479J3397J6346J8143K0470K3768K7295L0218
$$ 1966093 1962558 1960053 1958204 1957755 1960875 1969354 1982751 1999097 2017240 2037710 2061478 2088773 2118991
53366B118991L1912L2123L1960L3675L8205M3749M7948N0552N2554N3892N4151
$$ 2118991 2150903 2183026 2214986 2248661 2286866 2330615 2378563 2429115 2481669 2535561 2589712
53355B589712N4830N8256O3998O8674P0040O9592P0436P4087Q0007Q6726R2501
$$ 2589712 2644542 2702798 2766796 2835470 2905510 2975102 3045538 3119625 3199632 3286358 3378859
53344C378859R6040R7509R8088R8299R7844R7265R8006J00125J01535J00533R7813
$$ 3378859 3474899 3572408 3670496 3768795 3866639 3963904 4061910 4162035 4263570 4364103 4461916
53333D461916R4888R1901Q8246Q4148Q0123P5741P0434O4861N9950N5185M9325
$$ 4461916 4556804 4648705 4736951 4821099 4901222 4976963 5047397 5112258 5172208 5227393 5276718
53322E276718M2554L6393L1436K6481K0075J1897K504p420j7335k7149l7408m8574
$$ 5276718 5319272 5355665 5387101 5413582 5433657 5445554 5448058 5440638 5423303 5396154 5358746 5310172
53310E310172o0074p0578p9189q5791r0374r2836r3648r4061r5199r7114r8841
$$ 5310172 5250098 5179520 5100331 5014540 4924166 4831330 4737682 4643621 4548422 4451308 4352467
53299D352467r9314r8206r6043r3614r1376q9576q8550q8306q7965q6406q3577
$$ 4352467 4253153 4154947 4058904 3965290 3873914 3784338 3695788 3607482 3519517 3433111 3349534
53288C349534q0366p7110p3281o8964o5391o3223o1373n8445n4517n0493m6531
$$ 3349534 3269168 3192058 3118777 3049813 2984422 2921199 2859826 2801381 2746864 2696371 2649840
53277B649840m2232l7844l4095l1198k8957k7411k6429k5226k3394k1853k1544
$$ 2649840 2607608 2569764 2535669 2504471 2475514 2448103 2421674 2396448 2373054 2351201 2329657
53266B329657k1602k0245j7330j4476j2648j0994q518n641l517k474j618L64M046
$$ 2329657 2308055 2287810 2270480 2256004 2243356 2232362 2223844 2218203 2214686 2212212 2210594 2210958 2215004
53253B215004Q472J1677J2675J2730J4037J7438K2052K6630L0215L2091L2436
$$ 2215004 2223476 2235153 2247828 2260558 2274595 2292033 2314085 2340715 2370930 2403021 2435457
53242B435457L2776L4513L7114L9030M0035M1086M2090M1853M0471L9684M0102
$$ 2435457 2468233 2502746 2539860 2578890 2618925 2660011 2702101 2743954 2784425 2824109 2864211
53231B864211M0032L8141L5441L3301L1019K7138K2052J7441J3664R535M413j040
$$ 2864211 2904243 2942384 2977825 3011126 3042145 3069283 3091335 3108776 3122440 3131975 3136388 3135348
53219C135348o293j1675j7322k2490k6480k9559l2409l5173l7597l9955m3120
$$ 3135348 3129055 3117380 3100058 3077568 3051088 3021529 2989120 2953947 2916350 2876395 2833275
53208B833275m7339n1274n3049n2480n1609n2414n4597n6464n7350n7849n7977
$$ 2833275 2785936 2734662 2681613 2629133 2577524 2525110 2470513 2414049 2356699 2298850 2240873
53197B240873n6798n4267n1934n1171n1756n2711n3310n2752n0313m6748m4259
$$ 2240873 2184075 2129808 2077874 2026703 1974947 1922236 1868926 1816174 1765861 1719113 1674854
53186A674854m3939m4353m3765m2441m1330l9770l6459l2002k8462k6626k5476
$$ 1674854 1630915 1586562 1542797 1500356 1459026 1419256 1382797 1350795 1322333 1295707 1270231
53175A270231k4243k3144k2166k0870j9687j9707k0781k1501k1488k2044k3760
$$ 1270231 1245988 1222844 1200678 1179808 1160121 1140414 1119633 1098132 1076644 1054600 1030840
53164A030840k5192k5084k4394k4446k4287k1986j8125j5792j6631j8666j9052
$$ 1030840 1005648 980564 956170 931724 907437 885451 867326 851534 834903 816237 797185
53153G97185j7732j6892j7429j7739j6330j4098j2926j2916j2543j1346j0803
$$ 797185 779453 762561 745132 727393 711063 696965 684039 671123 658580 647234 636431
53142F36431j1990j3740j4154j3094j1927j1364j0873j0142r793j0246j0756j0162
$$ 636431 624441 610701 596547 583453 571526 560162 549289 539147 529354 519108 508352 498190
53130D98190q167n639l850l443l895m041l412k705k583k647k291j961k415l127
$$ 498190 490023 484384 480534 477091 473196 469155 465743 463038 460455 457808 455517 453556 451141 448014
53116D48014k902k028k192l775m742l261k29J822J612j13j997l105k911j490J13
$$ 448014 445112 443084 440892 437117 432375 429114 428885 430707 432319 432206 430209 427104 424193 422703 422816
53101D22816N55n65k406l785m046l257k026j052n86m68p09j495k353k164o50Q14
$$ 422816 423371 422806 420400 416615 412569 409312 407286 406234 405648 405180 404471 402976 400623 398459 397809 398623
53085C98623Q45q3m14J19J81j041k593l064k219r22q8j07o84q71J69K038L297
$$ 398623 399468 399385 398971 399090 399271 398230 395637 392573 390354 389432 389344 389237 388553 387682 387851 389889 393186
53068C93186L109K083J090L8j406k582k372q80M65O74K91L79R95J247O85M0L25
$$ 393186 396295 398378 399468 399506 398100 395518 393146 392266 392731 393405 393696 394075 395070 396317 397002 397042 397367
53051C97367J387J883R79l01k18J159J589n83m116o215n736l944k413j495r28
$$ 397367 398754 400637 401616 401315 401097 402256 403845 403262 399146 392931 387195 383251 380838 379343 378415
53036C78415o37m20J24O48N0j816l311k865j020M00O87O17P80Q76P60R55J623
$$ 378415 377778 377358 377482 378130 378180 376364 373053 370188 369168 369568 370255 370872 371652 372528 373288 374243 375866
53019C75866J891Q59j069k277j391J304L600L079l37l875m721l012j051q0O05
$$ 375866 377757 378616 377547 375270 373879 375183 378783 381862 381525 377650 372929 369917 368866 368786 369391
53004C69391J397J281k30j710j687p56n19j298k169k550k405j455L02J666J292
$$ 369391 370788 372069 371839 370129 368442 367686 367167 365869 363700 361150 358745 357290 357592 359258 360550
52989C60550l57j510j532j460j929k066j075K20K97j144k864l310j924L77J873
$$ 360550 360193 358683 357151 355691 353762 351696 350621 350841 351138 349994 347130 343820 341896 342273 344146
52974C44146J617M05k91j34J89N88J736L319L575J455j675l436k979j334J53Q49
$$ 344146 345763 346168 345877 345743 345932 346520 348256 351575 355150 356605 354930 351494 348515 347181 347334 348183
52958C48183P37J14m94o86l86L21J235J741J268L46L74J779L110K793J062o02
$$ 348183 348920 349034 348540 347854 347468 347789 349024 350765 352033 352379 352753 354532 357642 360435 361497 360895
52942C60895j418j687j733j521j020j17J516L558M561L470J297J8pk0l97J04J982
$$ 360895 359477 357790 356057 354536 353516 353399 354915 358473 363034 366504 367801 367819 367812 367792 367395 367499 369481
52925C69481L514K775K35j760j655j6J502J819J267J119K058L044K379o0k483
$$ 369481 372995 375770 376005 374245 372590 372574 374076 375895 377162 378281 380339 383383 385762 385702 383219
52910C83219l369k880j617N74L417N067M052J799J325L238M840L762R47r47j010
$$ 383219 379850 376970 375353 375927 379344 384411 388463 390262 391587 394825 399665 403427 404374 403427 402417
52895D02417o54j223k346k776k148j349j456k585l807m161l528k513j736j472
$$ 402417 401763 400540 398194 395418 393270 391921 390465 387880 384073 379912 376384 373871 372135 370663
52881C70663j757k362k733k376j370k16P00J158Q44l07j588k055j757j655k234
$$ 370663 368906 366544 363811 361435 360065 359849 360549 361707 362551 362244 360656 358601 356844 355189 352955
52866C52955k860k836k290j594p29K73Q60P61O11J047J582J202j86j710k616k686
$$ 352955 350095 347259 344969 343375 342646 342919 343779 344540 345151 346198 347780 348982 348796 347086 344470 341784
52850C41784j790p8J534J944J157K46qK12M75O19M22m43j729k624k676k072r32
$$ 341784 339994 339916 341450 343394 344551 344797 344789 345001 345476 346095 346517 346074 344345 341721 339045 336973 336041
52833C36041P68K284K246N57q57k19J728K627J495l30j124o08L38Q62O70K1l99
$$ 336041 336809 339093 341339 341896 341039 340820 342548 345175 346670 346340 345216 344608 344946 345808 346478 346499 346100
52816C46100j9R27J612J636J350J084O20j48o51l11N93J273J463J452J285O00
$$ 346100 346081 347008 348620 350256 351606 352690 353310 353162 352511 352200 352793 354066 355529 356981 358266 358866
52800C58866n44j407j459j087r79j166j128o97k79k76p06j385j983j987j166j74
$$ 358866 358322 356915 355456 354369 353390 352224 351096 350399 350120 349844 349138 347753 345770 343783 342617 342443
52784C42443r7j096k090k068j206l46R1P5m99j574k438k220q31R83K300K403J113
$$ 342443 342346 341250 339160 337092 335886 335540 335631 335706 335207 333633 331195 328975 328144 329127 331427 333830 334943
52767C34943o52j295l63O32J53j244j975j900j998j962l85K299L401J556j127
$$ 334943 334291 332996 332633 333265 333418 332174 330199 328299 326301 324339 323954 326253 329654 331210 330083
52752C30083j844n69P53J249J606K289K879K940K314R39o80j394q14r8l58j092
$$ 330083 328239 327670 328423 329672 331278 333567 336446 339386 341700 342639 341959 340565 339751 339653 339295 338203
52736C38203j450j958l311m288l036j22J817J542L29n26j235k023k157j358o02
$$ 338203 336753 334795 331484 327196 324160 324038 325855 327397 327726 327200 325965 323942 321785 320427 319825
52721C19825m91l27K98M27n38j315m64J282J889P95n50p68l3N75M72k2k34NJ92
$$ 319825 319334 319007 319305 319732 319194 317879 317415 318697 320586 321381 320831 320063 320030 320605 321077 321055 320821 320826 321018
52702C21018j21o05o36k40J43N95J399J992J472L09j4O51O62q42k418k326p06
$$ 321018 320897 320292 319656 319416 319559 320154 321553 323545 325017 325326 325312 325963 326625 325783 323365 321039 320333
52685C20333J298L163M526M497L075K101K955M156L252N09j326p39J048K274K421
$$ 320333 321631 324794 329320 333817 336892 338993 341948 346104 349356 349865 348539 347800 348848 351122 353543
52670C53543J566n5j296o58J539K937J996m7j017n15K10K22l67j123j752j995
$$ 353543 355109 355054 353758 353100 354639 357576 359572 359525 358508 357993 358203 358425 358058 356935 355183 353188
52654C53188j764j275p22j80m1q96k509l509k818r68N93J127R13L89j51k92K26
$$ 353188 351424 350149 349427 349247 349206 348310 345801 342292 339474 338506 339099 340226 341139 341528 341377 341085 341311
52637C41311R35J134R91J268J834J436m67k401k359k31K084K831J856mj926l094
$$ 341311 342246 343380 344371 345639 347473 348909 348442 346041 343682 343451 345535 348366 350222 350218 348292 345198
52621C45198k737r57Q93J532J108N95K58l70j264j733j503j009m39M60J424J636
$$ 345198 342461 341504 342397 343929 345037 345632 345890 345520 344256 342523 341020 340011 339572 340032 341456 343092
52605C43092J005M84N97Q05Q82J710L651N330N385M528M352M656L661Q33k134
$$ 343092 344097 344581 345178 345983 346865 348575 352226 357556 362941 367469 371821 376477 380138 380971 378837
52590C78837l394k801j455m97o78k065l687m205l279j714j85J312K588K870J847
$$ 378837 375443 372642 371187 370690 370012 367947 364260 360055 356776 355062 354877 356189 358777 361647 363494
52575C63494M21k55r4n6r82k578l407k128R26L634M183L002J802J239O49o0M4
$$ 363494 363915 363660 363566 363510 362528 359950 356543 354415 355341 358975 363158 366160 367962 369201 369850 369790 369834
52558C69834J136J881J386O31R00J660J319k42j273m55J299J896O19r87j031K49
$$ 369834 370970 372851 374237 374868 375768 377428 378747 378505 377232 376777 378076 379972 380591 379604 378573 378822
52542C78822P55n07j808j062J029J785K57j628j870o18R03K042K404J458l26j162
$$ 378822 379577 379070 377262 376200 377229 379014 379271 377643 375773 375155 376058 378100 380504 381962 381636 380474
52526C80474n1J708K257J450J82j300k864l288j652O30J184q1j052o64l3o0j15
$$ 380474 380423 382131 384388 385838 386020 384720 381856 378568 376916 377546 378730 378649 377597 376933 376900 376840 376725
52509C76725K19jj255k213j574j03N74L06M4m2n17j112q79J00O19L01L07J465
$$ 376725 376944 376943 375688 373475 371901 371798 372372 372678 372722 372680 372163 371051 370172 370272 370891 371192 371499 372964
52491C72964K845L000J863N53k07n06m13J72P93N40o21j353m69J398K341J333
$$ 372964 375809 378809 380672 381225 381018 380512 380099 380271 381064 381604 380983 379630 379161 380559 382900 384233
52475C84233p10k002j597J4J479J561M0j981k901k172q53m21j101j725j235K4
$$ 384233 383523 381521 379924 379938 381417 382978 383018 381037 378136 375964 375111 374690 373589 371864 370629 370653
52459C70653P43K54o66p59J82J162J383J193J238J367J073P39J362K974M252M121
$$ 370653 371396 371650 370984 370225 370407 371569 372952 374145 375383 376750 377823 378562 379924 382898 387150 391271
52443C91271K964J832J155Q15P78R04N71p11k428l502l462k679j643o10K05O37
$$ 391271 394235 396067 397222 398037 398815 399719 400290 399579 397151 393649 390187 387508 385865 385255 385460 386097
52427C86097P33M86l43j585k233j467J04J111J377K078L694M958M505K809J485
$$ 386097 386830 387316 386973 385388 383155 381688 381792 382903 384280 386358 390052 395010 399515 402324 403809
52412D03809J115Q76K49OR89K600L298K475J127N07P32J125J463K069K851L075
$$ 403809 404924 405800 406049 406055 407044 409644 412942 415417 416544 417051 417783 418908 420371 422440 425291 428366
52396D28366K383J339N29k44j290k201k506k689l521m502m184k231j61N03l2n75
$$ 428366 430749 432088 432617 432373 431083 428882 426376 423687 420166 415664 411480 409249 409088 409591 409559 408984
52380D08984p01r21j467j914j977j917j908j543l67J332K595K627J567M32L12
$$ 408984 408283 407362 405895 403981 402004 400087 398179 396636 396269 397601 400196 402823 404390 404822 405134
52365D05134J386K789L579L815M287N192N578M636L198L091M892O991P541O784
$$ 405134 406520 409309 412888 416703 420990 426182 431760 436396 439594 442685 447577 454568 462109 468893
52351D68893O643Q131J0059J0531Q973O134K824o09l758n943o784o519n675m686
$$ 468893 475536 483667 493726 504257 513230 519364 522188 521579 517821 511878 505094 498575 492900 488214
52337D88214l808l065k270j314m96j24J05R25K410L540L245J705K47J7R91K272
$$ 488214 484406 481341 479071 477757 477261 477137 477242 478167 480577 484117 487362 489067 489314 489331 490322 492594
52321D92594L062L299L553M437O003P531P981O910N083M018M723O789Q817R746
$$ 492594 495656 498955 502508 506945 512948 520479 528460 535370 540453 544471 549194 555983 564800 574546
52307E74546R706R598R988J0534J0505R746Q908Q626Q592P938O590N764O647Q894
$$ 574546 584252 593850 603838 614372 624877 634623 643531 652157 660749 668687 675277 681041 687688 696582
52293F96582J1045J2304J3242J4604J6140J7122J7656J8670K0591K2576K3439
$$ 696582 707627 719931 733173 747777 763917 781039 798695 817365 837956 860532 883971
52282H83971K3218K3266K4594K6592K7977K8667K9722L1380L2402L2029L1338
$$ 883971 907189 930455 955049 981641 1009618 1038285 1068007 1099387 1131789 1163818 1195156
52271A195156L1442L1363K9467K6411K4584K4622K4610K3270K1851K1760K2126
$$ 1195156 1226598 1257961 1287428 1313839 1338423 1363045 1387655 1410925 1432776 1454536 1476662
52260A476662K1137J8469J4923J0894O808L992L189K813N86l328o483p353o769
$$ 1476662 1497799 1516268 1531191 1542085 1548893 1552885 1556074 1558887 1559473 1556145 1549662 1542309 1535540
52247A535540o156n944n968o042n746m650l018j376M64K853M989N667N359N932
$$ 1535540 1529384 1523440 1517472 1511430 1505684 1501034 1498016 1496640 1497104 1499957 1504946 1510613 1515972 1521904
52233A521904Q008J0180J1274J1815J2560J3219J3566J4330J5871J7201J7559
$$ 1521904 1529912 1540092 1551366 1563181 1575741 1588960 1602526 1616856 1632727 1649928 1667487
52222A667487J7718J8437J8748J7394J5167J3888J3576J2468R869P121N318L684
$$ 1667487 1685205 1703642 1722390 1739784 1754951 1768839 1782415 1794883 1804752 1811873 1817191 1820875
52210A820875J052k173m638n853o554p494q838j0641j3117j6048j8444j9292j8648
$$ 1820875 1821927 1819754 1815116 1809263 1802709 1795215 1786377 1775736 1762619 1746571 1728127 1708835 1690187
52197A690187j7574j6852j6153j4748j2731j0979r974r313q458p456o639o071
$$ 1690187 1672613 1655761 1639608 1624860 1612129 1601150 1591176 1581863 1573405 1565949 1559310 1553239
52185A553239n640n379n362n490n582n452m799l335j191J022K666L414L261K639
$$ 1553239 1547599 1542220 1536858 1531368 1525786 1520334 1515535 1512200 1511009 1512031 1514697 1518111 1521372 1524011
52171A524011K451L346M828N678N425M773M476M453M314M136M322N148O634Q292
$$ 1524011 1526462 1529808 1534636 1540314 1545739 1550512 1554988 1559441 1563755 1567891 1572213 1577361 1583995 1592287
52157A592287R036Q260P176P873J0497J2545J1908R491P689P198O811N845N044
$$ 1592287 1601323 1609583 1616759 1624632 1635129 1647674 1659582 1669073 1676762 1683960 1690771 1696616 1701660
52144A701660N011N149M615L379J954P47k3k84k40k36m63j039k012k889k607q12
$$ 1701660 1706671 1711820 1716435 1719814 1721768 1722515 1722492 1722208 1721968 1721732 1721269 1720230 1718218 1715329 1712722 1711910
52128A711910J162J520J15j505k099j787j060M2J397K285K127J211K76k12r9N57
$$ 1711910 1713072 1714592 1714707 1713202 1711103 1709316 1708256 1708298 1709695 1711980 1714107 1715318 1715594 1715382 1715283 1715840
52112A715840J217J036j57j354j324P1J864L133L840M568N747P237Q602R728J0907
$$ 1715840 1717057 1718093 1717936 1716582 1715258 1715329 1717193 1720326 1724166 1728734 1734481 1741718 1750320 1760048 1770955
52097A770955J2332J3758J4911J5891J6659J6555J5083J3143J2597J4286J7008
$$ 1770955 1783287 1797045 1811956 1827847 1844506 1861061 1876144 1889287 1901884 1916170 1933178
52086A933178J8868J9255J9150J9814K1558K3521K4417K3584K1586J9738J8940
$$ 1933178 1952046 1971301 1990451 2010265 2031823 2055344 2079761 2103345 2124931 2144669 2163609
52075B163609J9006J9111J8757J8178J7893J7930J7673J6719J5753J5887J6930
$$ 2163609 2182615 2201726 2220483 2238661 2256554 2274484 2292157 2308876 2324629 2340516 2357446
52064B357446J7117J5309J2778J1712J2315J2665J1506R666Q256O813M294R53
$$ 2357446 2374563 2389872 2402650 2414362 2426677 2439342 2450848 2460514 2468770 2475583 2479877 2480830
52052B480830j989m046n707p196q227r028j0445j2584j4133j3718j1455q618o029
$$ 2480830 2478841 2474795 2469088 2461892 2453665 2444637 2434192 2421608 2407475 2393757 2382302 2373684 2367655
52039B367655l432m40K501M489N327O018P979J1771J6525K0503K2381K2167K1024
$$ 2367655 2364223 2363783 2366284 2370773 2376100 2382118 2390097 2401868 2418393 2438896 2461277 2483444 2504468
52026B504468K0113J9596J8789J7225J5361J4123J3906J4086J3446J1130P532
$$ 2504468 2524581 2544177 2562966 2580191 2595552 2609675 2623581 2637667 2651113 2662243 2669775
52015B669775M199K536K375K098L39k753o139r291j2463j5945j9646k3357k6802
$$ 2669775 2673974 2676510 2678885 2680983 2681322 2678569 2672430 2663139 2650676 2634731 2615085 2591728 2564926
52002B564926k9538l1176l1845l2095l2373l2897l3832l5162l6405l6885l6358
$$ 2564926 2535388 2504212 2472367 2440272 2407899 2375002 2341170 2306008 2269603 2232718 2196360
51991B196360l5018l3097l0873k8870k7435k6192k4490k2331k0266j8509j6914
$$ 2196360 2161342 2128245 2097372 2068502 2041067 2014875 1990385 1968054 1947788 1929279 1912365
51980A912365j5710j5334j5393j4857j3545j2434j1971j1246r582p890p271p192
$$ 1912365 1896655 1881321 1865928 1851071 1837526 1825092 1813121 1801875 1792293 1784403 1777132 1769940
51968A769940o370m982m460n248o408p538r438j2159j3990j3639j2430j2841j5300
$$ 1769940 1763570 1758588 1754128 1748880 1742472 1734934 1725496 1713337 1699347 1685708 1673278 1660437 1645137
51955A645137j7862j9002j9289k0041k1520k3180k4778k6296k7277k7159k6134
$$ 1645137 1627275 1608273 1588984 1568943 1547423 1524243 1499465 1473169 1445892 1418733 1392599
51944A392599k5038k4510k4725k5656k6774k6670k4087j9716j6198j5664j7547
$$ 1392599 1367561 1343051 1318326 1292670 1265896 1239226 1215139 1195423 1179225 1163561 1146014
51933A146014j9285j8932j6780j4630j3829j4013j3632j1769r239p630p490p974
$$ 1146014 1126729 1107797 1091017 1076387 1062558 1048545 1034913 1023144 1013905 1006275 998785 990811
51921I90811q151p907p578p582q534j0659j2801j3162j1593r967r523r107p374
$$ 990811 982660 974753 967175 959593 951059 940400 927599 914437 902844 892877 883354 874247 866873
51908H66873n465n673p991r894r499p211m213j101J555L007L453M152N600O637
$$ 866873 861408 855735 847744 837850 828351 821140 816927 815826 817381 820388 823841 827993 833593 840230
51894H40230O150M644L347K577J937J459J544K097K511K395J807J118R18J686
$$ 840230 846380 851024 854371 856948 858885 860344 861888 863985 866496 868891 870698 871816 872734 874420
51880H74420L068M007L981L784M541O325Q086Q751Q037O532N140M171K980Q68
$$ 874420 877488 881495 885476 889260 893801 900126 908212 916963 925000 931532 936672 940843 943823 944691
51866I44691j830m283o522r149j1739j2968j2737j2610j3496j4339j4186j4024
$$ 944691 942861 938578 932056 922907 911168 898200 885463 872853 859357 845018 830832 816808
51854H16808j4975j5932j4930j2226j0004r113q010n284j686J009K066K166K437
$$ 816808 801833 785901 770971 758745 748741 739628 731618 726334 724648 725657 727723 729889 732326
51841G32326L615N692Q175J0893J4195J7835K0259K0064J7766J4851J1433O412
$$ 732326 735941 741633 749808 760701 774896 792731 812990 833054 850820 865671 877104 883516
51829H83516R6n195p805q674r666j1205j2582j3472j3803j2835r982o310l911
$$ 883516 883612 878417 870612 861938 852272 841067 828485 815013 801210 788375 778393 772083 768172
51816G68172l469l553k609q23M56M92l17j191j593j192M8J502K080J200o67k751
$$ 768172 764703 761150 758541 757718 758174 758666 758349 757158 755565 754373 754421 755923 758003 759203 758536 755785
51800G55785m877o952p948o602l426q62n66j429j324o5P99O46M26N86K42q61j302
$$ 755785 750908 743956 736008 729406 725980 725118 724552 723123 721799 721734 722533 723179 723605 724191 724433 723572 722270
51783G22270k30P44m21l043m505l983l385m204n316m962l507k717l034l286k900
$$ 722270 722040 722784 722363 719320 714815 710832 707447 703243 697927 692965 689458 686741 683707 680421 677521
51768F77521k730l275l579k812j839j936k659k475j330r82k287l669l279j676
$$ 677521 674791 671516 667937 665125 663286 661350 658691 656216 654886 653904 651617 647948 644669 642993
51754F42993j089k378m095m489l404j834n40L72J069J783K714L652L887K890R96
$$ 642993 641904 639526 635431 630942 627538 625704 625164 625536 626605 628388 631102 634754 638641 641531 642527
51739F42527q29j938k409k616k746k883l262m037m778m746l867l043l076l552
$$ 642527 641698 639760 637351 634735 631989 629106 625844 621807 617029 612283 608416 605373 602297 598745
51725E98745l327k014l22R71J682J802J241L04l31n09p01q96k87J245K286J667
$$ 598745 595418 593404 593082 594053 595735 597537 598778 599082 598751 598242 597541 596645 596358 597603 599889 601556
51709F01556L47L23K038M133N568O616P654Q354Q475Q431Q486Q210P226N838M379
$$ 601556 601903 602226 604264 608397 613965 620581 628235 636589 645064 653495 661981 670191 677417 683255 687634
51694F87634K605L29j817k919k906k673l141m305n275n187m147k987j919l8L197
$$ 687634 690239 690568 688751 685832 682926 680253 677112 672807 667532 662345 658198 655211 653292 653254 656451
51679F56451O521Q068P882P956R492J1268J1328R434P134O043O588P986Q943Q746
$$ 656451 662972 671040 678922 686878 696370 707638 718966 728400 735534 741577 748165 756151 765094 773840
51665G73840P832O862N282J822l314p917j0053r938q870p377n618m666n810q653
$$ 773840 781672 788534 793816 795638 792324 784407 774354 764416 755546 748169 742551 737885 732075 723422
51651G23422j1140j1587j0005p510n294m083l794l561k571q48J006K500L098K137
$$ 723422 712282 700695 690690 683180 677886 673803 670009 666448 663877 663029 664035 666535 669633 671770
51637F71770j61k002j539R59L507M769M923M348K917R32p11j891l484n493o248
$$ 671770 671609 669607 668068 669027 672534 677303 682226 686574 689491 690423 689712 687821 684337 678844 672596
51622F72596m712k483j927k900k992r21J880L451L697L931M973O618Q448J0336
$$ 672596 667884 665401 663474 660574 657582 656661 658541 661992 665689 669620 674593 681211 689659 699995
51608F99995J2232J3942J5040J4793J2620Q892M907J632j107l720n762o465o050
$$ 699995 712227 726169 741209 756002 768622 777514 782421 784053 782946 779226 773464 766999 760949
51595G60949n506n347n494o265q132j0324j1100j0097r059r218r178o987l524
$$ 760949 755443 750096 744602 738337 730205 719881 708781 698684 689625 680407 671229 664242 660718
51582F60718j855l286n822o947o377n354m615m124l928m077m120l684l231l518
$$ 660718 658863 655577 649755 642808 636431 631077 626462 622338 618410 614333 610213 606529 603298 599780
51568E99780m394m939m744m292l993l434j995Q9J578J337m55k200k241l81K000
$$ 599780 595386 590447 585703 581411 577418 573984 571989 572078 573656 574993 574538 572338 570097 569716 571716
51553E71716L312L095K138J611K044K900L152K469J630J431J643J755K311M312
$$ 571716 575028 578123 580261 581872 583916 586816 589968 592437 594067 595498 597141 598896 601207 605519
51539F05519P348R607J0072R489Q655P136M563K022Q03O25L66j01k07k68j059
$$ 605519 612867 622474 632546 642035 650690 657826 662389 664411 665214 665839 666205 666104 665897 665629 664570
51524F64570k015j554N36K641L825N206P917J0871J2028J1372J1159J3026J6011
$$ 664570 662555 661001 661537 664178 668003 673209 681126 691997 704025 715397 726556 739582 755593
51511G55593J7960J8175J7831J8005J8327J8009J7394J7478J8206J8452J7997
$$ 755593 773553 791728 809559 827564 845891 863900 881294 898772 916978 935430 953427
51500I53427J8335K0766K4644K8422L1635L4579L6618L6307L3166K8145K2197
$$ 953427 971762 992528 1017172 1045594 1077229 1111808 1148426 1184733 1217899 1246044 1268241
51489A268241J5532Q387J421n013j0949j5963j9344k1551k4226k8024l1506l3059
$$ 1268241 1283773 1292160 1293581 1288568 1277619 1261656 1242312 1220761 1196535 1168511 1137005 1103946
51477A103946l2999l2629l2137l0756k8577k6649k5311k3746k1512j9331j7984
$$ 1103946 1070947 1038318 1006181 975425 946848 920199 894888 871142 849630 830299 812315
51466H12315j7292j6798j6491j6253j5256j2928j0093q205p600p406p111p164
$$ 812315 795023 778225 761734 745481 730225 717297 707204 698999 691399 683993 676882 669718
51454F69718p749q036p320o147n370m749l512j934j066r39l50J158K380K221J337
$$ 669718 661969 653933 646613 640466 635096 630347 626835 624901 623835 622896 622546 623704 626084 628305 629642
51439F29642J191K178L641N071O218O515N607M207L311K609Q05k317n260o552
$$ 629642 630833 633011 636652 641723 647941 654456 660063 664270 667581 670190 670995 668678 663418 656866
51425F56866o352n791n478n181m718m636n805q249j0451j0482q209n794n163n686
$$ 656866 650514 644723 639245 634064 629346 624710 618905 610656 600205 589723 581514 575720 570557 564871
51411E64871n400m023l159l615m223l776k669j827j287p03l08l23j77P33J988
$$ 564871 559471 555448 552289 548674 544451 540675 538006 536179 534892 534189 533881 533558 533381 534114 536102
51396E36102K705K692K365J957J422Q36K99j89l19M46K026L603M836O457R004
$$ 536102 538807 541499 543864 545821 547243 548079 548378 548189 547870 548316 550342 553945 558781 565238 574242
51381E74242J1761J3687J4574J4459J2925J0158P763P043P033N877L739K427K301
$$ 574242 586003 599690 614264 628723 641648 651806 659569 666612 673645 679522 683261 685688 687989
51368F87989J530j079m332o561p728q510q571p186m967l452l115k926k013q67
$$ 687989 689519 688440 684108 677547 669819 661309 652738 645552 640585 637133 634018 631092 629079 628212
51354F28212m74q03p77K17J286J021n61j753j295j10K6q36p54J448M577O650P111
$$ 628212 627738 626935 626158 626375 627661 628682 628121 626368 625073 624963 624989 624153 623399 624847 629424 636074 643185
51337F43185O882O940P659Q952J0398J1406J1763J1704J1392J0942J1199J3403
$$ 643185 650067 657007 664666 673618 684016 695422 707185 718889 730281 741223 752422 765825
51325G65825J7396K1195K3385K5071K8109L2107L4998L6343L8096M1604M5433
$$ 765825 783221 804416 827801 852872 880981 913088 948086 984429 1022525 1064129 1109562
51314A109562M7110M5761M2157L7275L1950K7050K2669J7520J0365J835o208j2966
$$ 1109562 1156672 1202433 1244590 1281865 1313815 1340865 1363534 1381054 1391419 1393254 1387046 1374080
51302A374080j9280k5949l2620l8572m3542m7313m9288m9125m7312m4652m1600
$$ 1374080 1354800 1328851 1296231 1257659 1214117 1166804 1117516 1068391 1021079 976427 934827
51291I34827l8397l5356l2549k9667k6506k3231j9965j6689j3934j2651j2769
$$ 934827 896430 861074 828525 798858 772352 749121 729156 712467 698533 685882 673113
51280F73113j2633j0891q412p184p629q266p988p275o800o202n079m047l773l616
$$ 673113 660480 649589 641177 633993 626364 618098 610110 602835 596035 589833 584754 580707 576934 573318
51266E73318k536r98p32k288m022m161l145k957m314n592m957k745r06l86l33
$$ 573318 570782 569784 569052 566764 562742 558581 555436 552479 548165 542573 537616 534871 533965 533579 533246
51251E33246m0l88k387n065o238n150l159j673o08O97K096K870K752K106J546
$$ 533246 533206 532818 530431 525366 519128 513978 510819 509146 508538 509235 511331 514201 516953 519059 520605
51236E20605J707K823M156M489L656K884L093L581L169J939R34N43L00N4K56J022
$$ 520605 522312 525135 529291 533780 537436 540320 543413 546994 550163 552102 553036 553579 553879 553933 554189 555211
51220E55211J736J821J381R18Q55J382K256K767K251P49j054k284k221o20J751
$$ 555211 556947 558768 560149 561067 561922 563304 565560 568327 570578 571327 570273 567989 565768 565148 566899
51205E66899L337L232K073R56K3j130k104j997r39k47p79k003k821k678j820j101
$$ 566899 570236 573468 575541 576497 576520 575390 573286 571289 570350 570103 569324 567321 564500 561822 560002 558901
51189E58901j412k568l075j935k82p2j389k560k842l129l823m009l380k986k956
$$ 558901 557489 554921 551846 549911 549629 549557 548168 545608 542766 539637 535814 531805 528425 525439 522483
51174E22483j622J592M271M037K065J241J870J893P62J93R14J333L77p15n28L42
$$ 522483 520861 522453 526724 530761 532826 534067 535937 537830 538592 538785 539699 541032 541409 540694 540166 540508
51158E40508N72J08m04q68j104j98K024L740L065P29p63m14M56N92L59N33Q67
$$ 540508 541080 541188 540784 539916 538812 538614 540638 544378 547443 548172 547409 546995 547451 548043 548402 548935 549802
51141E49802O72k4n78n40J09J039J563R93m82j660j424J81K123L274L013J490
$$ 549802 550474 550450 549872 549332 549441 550480 552043 553036 552554 550894 549470 549651 551774 555048 558061 559551
51125E59551l28j277j080o16p70j367j563r20L39J837L213M018L926L031J637
$$ 559551 559223 557946 556866 556250 555480 554113 552550 551630 551969 553806 557019 561037 564963 567994 569631
51110E69631M8j052o57J280K996K531K80j261o16R65J579J286J471K417K971K400
$$ 569631 569679 568627 567970 569250 572246 574777 575057 573796 573180 574145 575724 577010 578481 580898 583869 586269
51094E86269J292L84l50j039j246o75J13K30n31j744k982l867l792k229M96L092
$$ 586269 587561 587945 587595 586556 585310 584635 584748 584978 584447 582703 579721 575854 572062 569833 570329 573421
51078E73421M177L286J179o61j022J71J852K725K379J521J195J707K353K184J064
$$ 573421 577598 580884 582063 581402 580380 580551 582403 585128 587507 589028 590223 591930 594283 596467 597531
51063E97531j87p52o79n22m55j24O96J783K733L185K824J785R82J393K769L791
$$ 597531 597344 596592 595913 595391 594936 594812 595508 597291 600024 603209 606033 607818 608800 610193 612962 616753
51047F16753L754L392L598M048L854K987K194J841J713J831K524L697M784N422
$$ 616753 620507 623899 627497 631545 635399 638386 640580 642421 644134 645965 648489 652186 656970 662392
51033F62392N587N047L693K385K340L260L223J217j182j785p10Q8j50j18J076
$$ 662392 667979 673026 676719 679104 681444 684704 687927 689144 687962 686177 685467 685555 685405 685287 686363
51018F86363K165J531k66j100j32J261J531R66J114K970O194R650J2105J2746
$$ 686363 688528 690059 689793 688693 688561 689822 691353 692319 693433 696403 702597 712247 724352 737098
51004G37098J1807J0733J1189J3559J6617J8586J8461J6476J3772J1704J0993
$$ 737098 748905 759638 770827 784386 801003 819589 838050 854526 868298 880002 890995
50993H90995J1416J2446J3996J6093J7928J8121J6228J3376J0932R053P038M600
$$ 890995 902411 914857 928853 944946 962874 980995 997223 1010599 1021531 1030584 1037622 1042222
50981A042222J992p34l709o530q308q755q656r183j1023j4175j7963k1153k2628
$$ 1042222 1044214 1043480 1039771 1033241 1024933 1016178 1007522 998339 987316 973141 955178 934025 911397
50968I11397k2216k0584j8286j5399j2105q995o471m466k935k036j454l14J660
$$ 911397 889181 868597 850311 834912 822807 813812 807341 802875 799940 797904 796450 796136 797796
50955G97796L612M889O303Q940J2091J3731J3227J2327J2864J4450J5298J4767
$$ 797796 801408 806297 812600 821540 833631 847362 860589 872916 885780 900230 915528 930295
50943I30295J4004J4235J5403J6799J8224J9931K1691K2771K2930K2894K3326
$$ 930295 944299 958534 973937 990736 1008960 1028891 1050582 1073353 1096283 1119177 1142503
50932A142503K3696K2869K0963J9735K0615K2711K3629K2172J9393J6933J5192
$$ 1142503 1166199 1189068 1210031 1229766 1250381 1273092 1296721 1318893 1338286 1355219 1370411
50921A370411J3750J2835J3293J5157J7207J8429J9328K1264K4777K9257L4151
$$ 1370411 1384161 1396996 1410289 1425446 1442653 1461082 1480410 1501674 1526451 1555708 1589859
50910A589859L9752M6316N2971N8405O2583O6953P2537P8406Q2727Q4983Q6467
$$ 1589859 1629611 1675927 1728898 1787303 1849886 1916839 1989376 2067782 2150509 2235492 2321959
50899B321959Q8619R1445R3611R3593R0658Q5320P9010P2921O6948O0171N2418
$$ 2321959 2410578 2502023 2595634 2689227 2779885 2865205 2944215 3017136 3084084 3144255 3196673
50888C196673M4688L7831L1487K4937J8356J2482P295J886m259j0458j5513j8896
$$ 3196673 3241361 3279192 3310679 3335616 3353972 3366454 3373749 3375635 3371376 3360918 3345405 3326509
50876C326509k1169k3387k6067k8712l0537l1707l3421l6544m0676m4971m9296
$$ 3326509 3305340 3281953 3255886 3227174 3196637 3164930 3131509 3094965 3054289 3009318 2960022
50865B960022n3896n8491o2519o6047o9476p2488p4204p4372p3524p1976o9576
$$ 2960022 2906126 2847635 2785116 2719069 2649593 2577105 2502901 2428529 2355005 2283029 2213453
50854B213453o6398o2752n8493n3405m8370m4865m2942m1007l8132l5172l2854
$$ 2213453 2147055 2084303 2025810 1972405 1924035 1879170 1836228 1795221 1757089 1721917 1689063
50843A689063l0245k6412k2374j9697j8004j5663j2597j0577j0520j1076j0371
$$ 1689063 1658818 1632406 1610032 1590335 1572331 1556668 1544071 1533494 1522974 1511898 1501527
50832A501527q053n202l033k121k157k078r30J190L366N012O260P439Q834J0736
$$ 1501527 1493474 1488272 1485239 1483118 1480961 1478883 1477953 1479143 1482509 1487521 1493781 1501220 1510054 1520790
50818A520790J2977J4607J4913J4589J5015J6552J8594K0998K4192K7943L1511
$$ 1520790 1533767 1548374 1563287 1577876 1592891 1609443 1628037 1649035 1673227 1701170 1732681
50807A732681L5081L9437M3915M6555M7128M8264N2410N9019O6042P2823P9952
$$ 1732681 1767762 1807199 1851114 1897669 1944797 1993061 2045471 2104490 2170532 2243355 2323307
50796B323307Q7315R4183J00797J08229J16821J26014J35487J45300J55181J64830
$$ 2323307 2410622 2504805 2605602 2713831 2830652 2956666 3092153 3237453 3392634 3557464
50786C557464J74561J84378J92824J98215K00843K02397K03196K01576J96122
$$ 3557464 3732025 3916403 4109227 4307442 4508285 4710682 4913878 5115454 5311576
50777E311576J86841J73902J57073J37210J16579R6498P5939N3722L1109J0827
$$ 5311576 5498417 5672319 5829392 5966602 6083181 6179679 6255618 6309340 6340449 6351276
50767F351276n741j9039k9567l7079m1369m2642m1088l7219l2695k9694k9268
$$ 6351276 6345535 6326496 6296929 6259850 6218481 6175839 6134751 6097532 6064837 6035143 6005875
50756F005875l1169l5418m2831n3477o5730p7924r0242j03847j18432j31884j42589
$$ 6005875 5974706 5939288 5896457 5842980 5777250 5699326 5609084 5505237 5386805 5254921 5112332
50745E112332j50876j57710j62852j65245j64600j61494j56055j47814j37162
$$ 5112332 4961456 4803746 4640894 4475649 4311049 4149555 3993500 3845686 3708524
50736C708524j25810j15187j05095r4654q3742p2654o1094m8974l8003l0875k8290
$$ 3708524 3582714 3467527 3362432 3267778 3184036 3111382 3050288 3001314 2963311 2932436 2904146
50725B904146k7834k6488k3543k0437j8520j7903j8092j8792j9883k1176k2429
$$ 2904146 2876312 2849824 2826281 2805844 2787324 2769421 2751329 2732537 2712654 2691478 2669049
50714B669049k3511k4566k5948k7845k9924l1739l3446l5595l8084m0002m0847
$$ 2669049 2645538 2620972 2595024 2567179 2537255 2505516 2472070 2436475 2398391 2358389 2317542
50703B317542m1142m1382m1171m0060l8526l6926l4301k9631k4098k0276j8724
$$ 2317542 2276400 2235018 2193847 2153787 2115261 2078335 2044034 2014403 1990305 1970029 1951305
50692A951305j6961j2674o549q76L568P631J1708J5325J8709K2984K8406L3846
$$ 1951305 1934344 1921670 1915121 1914245 1917813 1925444 1937152 1952477 1971186 1994170 2022576 2056422
50680B056422L8652M3715M9820N6160O1603O6593P2460P9333Q6088R2078R7560
$$ 2056422 2095074 2138789 2188609 2244769 2306372 2372965 2445425 2524758 2610846 2702924 2800484
50669B800484J02439J05988J08115J09595J10633J10340J08205J04916J00915
$$ 2800484 2902923 3008911 3117026 3226621 3337254 3447594 3555799 3660715 3761630
50660C761630R5170Q6483P5252O2830M9691L5457K0304N178r167k2132l2384l8292
$$ 3761630 3856800 3943283 4018535 4081365 4131056 4166513 4186817 4191995 4182828 4160696 4128312 4090020
50648D090020l9546l7481l3628k8835k3796j9212j4991j0424n855l226m230q575
$$ 4090020 4050474 4012993 3979365 3950530 3926734 3907522 3892531 3882107 3876252 3873026 3868796 3860221
50636C860221j4831k2244l0837m0219m9427n7791o5090p0865p4296p4977p3236
$$ 3860221 3845390 3823146 3792309 3752090 3702663 3644872 3579782 3508917 3434621 3359644 3286408
50625C286408o9538o4144n7463n0316m3347l6329k8378j8885q074L290J4554K5295
$$ 3286408 3216870 3152726 3095263 3044947 3001600 2965271 2936893 2918008 2909934 2913224 2927778 2953073
50613B953073L4991M3145M9808N5491O0115O2582O2078N9440N6396N3553N0145
$$ 2953073 2988064 3031209 3081017 3136508 3196623 3259205 3321283 3380723 3437119 3490672 3540817
50602C540817M5807M1499L8330L6413L5400L5113L4989L3893L1526K9279K8586
$$ 3540817 3586624 3628123 3666453 3702866 3738266 3773379 3808368 3842261 3873787 3903066 3931652
50591C931652K8969K8927K8425K9045L1575L4756L7019L8559M0951M5094N0122
$$ 3931652 3960621 3989548 4017973 4047018 4078593 4113349 4150368 4188927 4229878 4274972 4325094
50580D325094N4168N6135N6696N7379N8364N7680N3379M6320L9556L4756L0434
$$ 4325094 4379262 4435397 4492093 4549472 4607836 4665516 4718895 4765215 4804771 4839527 4869961
50569D869961K4263J5987O794l441j6521l3185n1167o6655p7114q2178q2451p8542
$$ 4869961 4894224 4910211 4917005 4913564 4897043 4863858 4812691 4746036 4668922 4586744 4504293 4425751
50557D425751p1309o2125n2294m2413l2706k3657j5903r662m930k298k961p361
$$ 4425751 4354442 4292317 4240023 4197610 4164904 4141247 4125344 4115682 4110752 4108454 4105493 4098132
50545D098132j4345k2226l0601m0425n2226o4841p6289q5508r2688r8165j01746
$$ 4098132 4083787 4061561 4030960 3990535 3938309 3873468 3797179 3711671 3618983 3520818 3419072
50534C419072j03341j03574j03023j01102r6605q9623q2053p5602o9850o3271
$$ 3419072 3315731 3212157 3109134 3008032 2911427 2821804 2739751 2664149 2594299 2531028
50524B531028n5835m9308m4719m0752l5493k9079k3520k0143j8260j6462j4267
$$ 2531028 2475193 2425885 2381166 2340414 2304921 2275842 2252322 2232179 2213919 2197457 2183190
50513B183190j1936r304n717j201L084O096Q308J1274J5784K1171K6576L2091
$$ 2183190 2171254 2161950 2156233 2155032 2158116 2164212 2172520 2183794 2199578 2220749 2247325 2279416
50501B279416L7976M3488M7680N1021N5058O0340O5852P0725P5270P9845Q3872
$$ 2279416 2317392 2360880 2408560 2459581 2514639 2574979 2640831 2711556 2786826 2866671 2950543
50490B950543Q6725Q8546Q9392Q8689Q6674Q5344Q6510Q9423R1953R3852R7172
$$ 2950543 3037268 3125814 3215206 3303895 3390569 3475913 3562423 3651846 3743799 3837651 3934823
50479C934823J03260J10907J18054J24193J30334J37464J45833J55237J65215
$$ 3934823 4038083 4148990 4267044 4391237 4521571 4659035 4804868 4960105 5125320
50470E125320J75060J84032J91617J97628K02219K05614K07433K06466K01689
$$ 5125320 5300380 5484412 5676029 5873657 6075876 6281490 6488923 6695389 6897078
50461F897078J93350J82344J68686J51496J30598J07094Q1909N4699K4967o252
$$ 6897078 7090428 7272772 7441458 7592954 7723552 7830646 7912555 7967254 7992221 7985969
50451G985969l6835o5471r2306j17410j39340j55936j66405j71784j72977j69132
$$ 7985969 7949134 7883663 7791357 7673947 7534607 7378671 7212266 7040482 6867505 6698373
50441F698373j58964j43207j24366j03945q1584n7656l4926j6159j277J1188K0523
$$ 6698373 6539409 6396202 6271836 6167891 6086307 6028651 5993725 5977566 5976289 5987477 6008000
50430F008000K3732J8819O417j1806l4501o0101q6611j12475j36472j56721j71410
$$ 6008000 6031732 6050551 6056968 6045162 6010661 5950560 5863949 5751474 5615002 5458281 5286871
50419E286871j80779j86744j90238j90690j88442j85246j81412j74784j64283
$$ 5286871 5106092 4919348 4729110 4538420 4349978 4164732 3983320 3808536 3644253
50410C644253j52518j42800j35032j26795j17393j08344j00435r2715q4494p6392
$$ 3644253 3491735 3348935 3213903 3087108 2969715 2861371 2760936 2668221 2583727 2507335
50400B507335o9036o2205n5594m9208m2964l6825l1325k6921k3111j9245j5701
$$ 2507335 2438299 2376094 2320500 2271292 2228328 2191503 2160178 2133257 2110146 2090901 2075200
50389B075200j2967j0031n522j87L658N381O794R154J1382J2084J1672J1287J1049
$$ 2075200 2062233 2052202 2046680 2046493 2050151 2055532 2062326 2071480 2082862 2094946 2106618 2117905 2128954
50376B128954J0716J1022J2867J5884J9082K2493K6895L2244L7551M2287M6818
$$ 2128954 2139670 2150692 2163559 2179443 2198525 2221018 2247913 2280157 2317708 2359995 2406813
50365B406813N1332N5287N8335O1084O4445O8534P2730P6831Q1575Q7689R4584
$$ 2406813 2458145 2513432 2571767 2632851 2697296 2765830 2838560 2915391 2996966 3084655 3179239
50354C179239J00715J05457J09853J14798J19028J20143J17539J13180J09033
$$ 3179239 3279954 3385411 3495264 3610062 3729090 3849233 3966772 4079952 4188985
50345D188985J04861R9135R1179Q1441P0223N7305M2781K7323J1307n728k4300
$$ 4188985 4293846 4392981 4484160 4565601 4635824 4693129 4735910 4763233 4774540 4768812 4744512
50334D744512m3822o2584p9015r2715j03921j12129j15896j14441j08867j01190
$$ 4744512 4700690 4638106 4559091 4466376 4362455 4250326 4134430 4019989 3911122 3809932
50324C809932r2490q2723p1860o0139m7407l3524j9641p944L11N413P613O222
$$ 3809932 3717442 3634719 3562859 3502720 3455313 3421789 3402148 3394204 3394515 3399928 3407541 3413763
50312C413763J133o199j4340k3543l4515m6314n7004o5973p4068q1497q7094q9901
$$ 3413763 3414896 3408697 3394357 3370814 3336299 3289985 3232981 3167008 3092940 3011443 2924349 2834448
50300B834448r0304q9300q7611q5765q3988q1612p7634p2278o7035o2659n8258
$$ 2834448 2744144 2654844 2567233 2481468 2397480 2315868 2238234 2165956 2098921 2036262 1978004
50289A978004n3166m8488m5384m2784l8608l3089k8855k7207k6023k2570j7197
$$ 1978004 1924838 1876350 1830966 1788182 1749574 1716485 1687630 1660423 1634400 1611830 1594633
50278A594633j2791j1063j0868j0084p918n030k515j129p54j55J929N091P483
$$ 1594633 1581842 1570779 1559911 1549827 1541909 1536879 1534364 1533235 1532481 1532326 1534255 1539346 1546829
50265A546829Q236Q692J0384J2695J3691J2630J0326P393L726j92k993l899l403
$$ 1546829 1555065 1563757 1574141 1586836 1600527 1613157 1623483 1630876 1634602 1634410 1631417 1627518 1624115
50252A624115k077K95L781P531J0648J3060J4961J6119J6367J6073J5498J4372
$$ 1624115 1622038 1622333 1626114 1633645 1644293 1657353 1672314 1688433 1704800 1720873 1736371 1750743
50240A750743J2771J1547J1143J0734R495P945P014O387N019K904J009k15j113
$$ 1750743 1763514 1775061 1786204 1796938 1806433 1814378 1821392 1827779 1832798 1835702 1836711 1836496 1835383
50227A835383j777j929j742j507n50K090N853Q946J0769J2563J5306J8552K1986
$$ 1835383 1833606 1831677 1829935 1828428 1827878 1829968 1835821 1844767 1855536 1868099 1883405 1901957 1923943
50214A923943K6275L0840L2150K6278J3116l108j7177k5843k8415k6404k2769
$$ 1923943 1950218 1981058 2013208 2039486 2052602 2049494 2032317 2006474 1978059 1951655 1928886
50203A928886j9927j7850j4972j1003p581n786m496k148R80L450M811N753O505
$$ 1928886 1908959 1891109 1876137 1865134 1857553 1851767 1847271 1845123 1846103 1849553 1854364 1860117 1866622
50190A866622O526N869N572O260P474Q908J1326J5322J9894K3415K5919K9209
$$ 1866622 1873148 1879017 1884589 1890849 1898323 1907231 1918557 1933879 1953773 1977188 2003107 2032316
50178B032316L4458M0634M5920M9936N3661N7489O0373O1204O0173N8152N5228
$$ 2032316 2066774 2107408 2153328 2203264 2256925 2314414 2374787 2435991 2496164 2554316 2609544
50167B609544N0789M5002L9337L5124L2118K9049K5107K0176J3835N121o404j9988
$$ 2609544 2660333 2705335 2744672 2779796 2811914 2840963 2866070 2886246 2900081 2905202 2898798 2878810
50155B878810l4375m8462o1024p0663p6880q0640q3056q3779q1711p6995p1263
$$ 2878810 2844435 2795973 2734949 2664286 2587406 2506766 2423710 2339931 2258220 2181225 2109962
50144B109962o5792o0666n5938n2378n0295m8658m6525m4689m4638m6080m6728
$$ 2109962 2044170 1983504 1927566 1875188 1824893 1776235 1729710 1685021 1640383 1594303 1547575
50133A547575m4895m1325l7971l5664l3735l1553k9455k7957k6697k4798k2067
$$ 1547575 1502680 1461355 1423384 1387720 1353985 1322432 1292977 1265020 1238323 1213525 1191458
50122A191458j9178j6700j4538j2624j1387j0949j0344q468n562k917j276l47
$$ 1191458 1172280 1155580 1141042 1128418 1117031 1106082 1095738 1087270 1081708 1078791 1077515 1077168
50110A077168K56P28J721L922O585P845P262O765Q160J0747J2575J3066J3093
$$ 1077168 1077424 1078152 1079873 1083795 1090380 1098225 1105487 1112252 1120412 1131159 1143734 1156800 1169893
50097A169893J3322J4047J6010J9570K3339K5312K5480K5593K6330K6466K5257
$$ 1169893 1183215 1197262 1213272 1232842 1256181 1281493 1306973 1332566 1358896 1385362 1410619
50086A410619K3801K3218K3059K2664K2656K3768K5191K5613K5285K5587K6910
$$ 1410619 1434420 1457638 1480697 1503361 1526017 1549785 1574976 1600589 1625874 1651461 1678371
50075A678371K8337K9400L0941L3928L8280M3170M7961N2578N7234O2030O6787
$$ 1678371 1706708 1736108 1767049 1800977 1839257 1882427 1930388 1982966 2040200 2102230 2169017
50064B169017P1505P6993Q4488R4235J04822J14448J22477J29397J35602J40858
$$ 2169017 2240522 2317515 2402003 2496238 2601060 2715508 2837985 2967382 3102984 3243842
50054C243842J44568J45891J43944J38673J31470J24226J17857J12316J07587
$$ 3243842 3388410 3534301 3678245 3816918 3948388 4072614 4190471 4302787 4410374
50045D410374J03594R9005R1166P7911N9037L5893J0111j6941m4036o9961r3557
$$ 4410374 4513968 4612973 4704139 4782050 4841087 4876980 4887091 4870150 4826114 4756153 4662596
50034D662596j13781j30010j42254j50765j55505j56484j54623j51483j47784
$$ 4662596 4548815 4418805 4276551 4125786 3970281 3813797 3659174 3507691 3359907
50025C359907j42712j35192j25562j15398j06014r7709r0399q4255p9264p4591
$$ 3359907 3217195 3082003 2956441 2841043 2735029 2637320 2546921 2462666 2383402 2308811
$$ [...]
##END NTUPLES=NMR SPECTRUM
##END=
