
##TITLE=AC1225_PUEHDE098_6075357_c2Lw6cslGK
##JCAMPDX= 6.0         $$ Bruker NMR JCAMP-DX V2.0
##DATA TYPE= NMR SPECTRUM
##DATA CLASS= NTUPLES
##ORIGIN= BRUKER
##OWNER= Administrator
$$ 1.72 TOPSPIN		Version 2.1
$$ 2012-05-08 21:23:34.906 -0500  Administrator@TOPSPIN
$$ Compression mode = diff/dup
##.OBSERVE FREQUENCY= 400.13188235
##.OBSERVE NUCLEUS= ^1H
##.ACQUISITION MODE= SIMULTANEOUS (DQD)
##.ACQUISITION SCHEME= undefined
##.AVERAGES= 8
##.DIGITISER RES= 22
##SPECTROMETER/DATA SYSTEM= spect
##.PULSE SEQUENCE= zg30
##.SOLVENT NAME= COFFEE_meoh
##.SHIFT REFERENCE= INTERNAL, COFFEE_meoh, 1, 14.98061
##AUDIT TRAIL= $$ (NUMBER, WHEN, WHO, WHERE, PROCESS, VERSION, WHAT)
$$ ##TITLE= Audit trail, TOPSPIN		Version 2.1
$$ ##JCAMPDX= 5.01
$$ ##ORIGIN= Bruker BioSpin GmbH
$$ ##OWNER= Administrator
$$ $$ C:\Bruker\TOPSPIN/data/COFFEE/nmr/AC1225_PUEHDE098_6075357_c2Lw6cslGK/20/pdata/1/auditp.txt
$$ ##AUDIT TRAIL=  $$ (NUMBER, WHEN, WHO, WHERE, PROCESS, VERSION, WHAT)
(   1,<2012-05-08 21:23:28.046 -0500>,<Administrator>,<TOPSPIN>,<go>,<TOPSPIN 2.1>,
      <created by zg
	started at 2012-05-08 21:22:21.500 -0500,
	POWCHK enabled, PULCHK disabled,
       configuration hash MD5:
       AF F2 23 6B 01 CD 40 DD E5 A1 38 A0 06 EA F7 77
       data hash MD5: 64K
       8C 96 5C 51 8F 32 C2 CC D6 63 BD 43 B0 24 08 37>)
(   2,<2012-05-08 21:23:30.718 -0500>,<Administrator>,<TOPSPIN>,<proc1d>,<TOPSPIN 2.1>,
      <Start of raw data processing
       efp LB = 0 FT_mod = 6 PKNL = 1 PHC0 = 0 PHC1 = 0 SI = 32K 
       data hash MD5: 32K
       D4 1D F3 ED 68 19 9C 44 26 BC 7F 3A 6D E8 30 62>)
(   3,<2012-05-08 21:23:31.109 -0500>,<Administrator>,<TOPSPIN>,<proc1d>,<TOPSPIN 2.1>,
      <pk PHC0 = 212.9315 PHC1 = 0 
       data hash MD5: 32K
       90 98 CD 84 10 9D 35 B4 EB 77 47 39 01 B6 8B 12>)
(   4,<2012-05-08 21:23:31.203 -0500>,<Administrator>,<TOPSPIN>,<proc1d>,<TOPSPIN 2.1>,
      <abs ABSG = 1 
       data hash MD5: 32K
       96 4C B9 9D 30 BB 83 8B D8 8A 16 AA 4F 67 4A B9>)
(   5,<2012-05-08 21:23:31.234 -0500>,<Administrator>,<TOPSPIN>,<proc1d>,<TOPSPIN 2.1>,
      <abs ABSG = 2 
       data hash MD5: 32K
       14 A7 CB D2 94 7A E6 86 9A 0A 85 69 E2 0F 01 49>)
(   6,<2012-05-08 21:23:31.250 -0500>,<Administrator>,<TOPSPIN>,<proc1d>,<TOPSPIN 2.1>,
      <abs ABSG = 3 
       data hash MD5: 32K
       4F 11 19 66 7E 7E 70 99 34 98 A8 EE 37 26 98 87>)
(   7,<2012-05-08 21:23:31.281 -0500>,<Administrator>,<TOPSPIN>,<proc1d>,<TOPSPIN 2.1>,
      <abs ABSG = 4 
       data hash MD5: 32K
       02 34 5A BD 62 12 97 B7 B1 34 E2 71 A2 75 34 19>)
(   8,<2012-05-08 21:23:31.312 -0500>,<Administrator>,<TOPSPIN>,<proc1d>,<TOPSPIN 2.1>,
      <abs ABSG = 5 
       data hash MD5: 32K
       4B 2C 7D 44 3A 81 E0 63 85 52 67 A1 E1 B4 02 F4>)
$$ ##END=
$$ 
$$ $$ hash MD5
$$ $$ A8 92 D3 DC 50 C7 26 FD 43 44 88 35 33 F1 AD 1E
##$RELAX= 
##$RELAX= 
##$RELAX= 
##$RELAX= 
##$RELAX= 
##$RELAX= 
##$RELAX= 
$$ Bruker specific parameters
$$ --------------------------
$$ [...]
##$TP= (0..7)
150 150 150 150 150 150 150 150
##$TP07= 0
##$TPNAME0= <>
##$TPNAME1= <>
##$TPNAME2= <>
##$TPNAME3= <>
##$TPNAME4= <>
##$TPNAME5= <>
##$TPNAME6= <>
##$TPNAME7= <>
##$TPOAL= (0..7)
0.5 0.5 0.5 0.5 0.5 0.5 0.5 0.5
##$TPOFFS= (0..7)
0 0 0 0 0 0 0 0
##$TUNHIN= 0
##$TUNHOUT= 0
##$TUNXOUT= 0
##$USERA1= <user>
##$USERA2= <user>
##$USERA3= <user>
##$USERA4= <user>
##$USERA5= <user>
##$V9= 5
##$VALIST= <valist>
##$VCLIST= <CCCCCCCCCCCCCCC>
##$VD= 0
##$VDLIST= <DDDDDDDDDDDDDDD>
##$VPLIST= <PPPPPPPPPPPPPPP>
##$VTLIST= <TTTTTTTTTTTTTTT>
##$WBST= 1024
##$WBSW= 4
##$XGAIN= (0..3)
0 0 0 0
##$XL= 0
##$YL= 0
##$YMAX_a= 523753
##$YMIN_a= -630642
##$ZGOPTNS= <>
##$ZL1= 120
##$ZL2= 120
##$ZL3= 120
##$ZL4= 120
##$ABSF1= 14.98061
##$ABSF2= -5.57192
##$ABSG= 5
##$ABSL= 3
##$ALPHA= 0
##$AQORDER= 0
##$ASSFAC= 0
##$ASSFACI= 0
##$ASSFACX= 0
##$ASSWID= 0
##$AUNMP= <proc_prof1d_extract_pilot.lims>
##$AXLEFT= 0
##$AXNAME= <>
##$AXNUC= <1H>
##$AXRIGHT= 0
##$AXTYPE= 0
##$AXUNIT= <>
##$AZFE= 0.1
##$AZFW= 0.1
##$BCFW= 0
##$BC_mod= 0
##$BYTORDP= 0
##$COROFFS= 0
##$CY= 15
##$DATMOD= 1
##$DC= 0
##$DFILT= <>
##$DTYPP= 0
##$F1P= 0
##$F2P= 0
##$FCOR= 0.5
##$FTSIZE= 32768
##$FT_mod= 6
##$GAMMA= 0
##$GB= 0
##$INTBC= 1
##$INTSCL= 1
##$ISEN= 128
##$LB= 0
##$LEV0= 0
##$LPBIN= 0
##$MAXI= 10000
##$MC2= 0
##$MEAN= 0
##$ME_mod= 0
##$MI= 0
##$NCOEF= 0
##$NC_proc= -8
##$NLEV= 6
##$NOISF1= 0
##$NOISF2= 0
##$NSP= 0
##$NTH_PI= 0
##$NZP= 0
##$OFFSET= 14.98061
##$PC= 1
##$PHC0= 212.9315
##$PHC1= 0
##$PH_mod= 1
##$PKNL= yes
##$PPARMOD= 0
##$PPDIAG= 0
##$PPIPTYP= 0
##$PPMPNUM= 2147483647
##$PPRESOL= 1
##$PSCAL= 4
##$PSIGN= 0
##$PYNMP= <proc.py>
##$REVERSE= no
##$SF= 400.13
##$SI= 32768
##$SIGF1= 0
##$SIGF2= 0
##$SINO= 400
##$SIOLD= 32768
##$SPECTYP= <>
##$SREGLST= <1H.CDCl3>
##$SSB= 0
##$STSI= 32768
##$STSR= 0
##$SW_p= 8223.68421052632
##$SYMM= 0
##$S_DEV= 0
##$TDeff= 65536
##$TDoff= 0
##$TI= <>
##$TILT= no
##$TM1= 0
##$TM2= 0
##$TOPLEV= 0
##$USERP1= <user>
##$USERP2= <user>
##$USERP3= <user>
##$USERP4= <user>
##$USERP5= <user>
##$WDW= 1
##$XDIM= 32768
##$YMAX_p= 442506855
##$YMIN_p= -701734
##$CURPLOT= <Network HP LaserJet P1505>
##$CURPRIN= <$Network HP LaserJet P1505>
##$DFORMAT= <normdp>
##$LAYOUT= <+/1D_H.xwp>
##$LFORMAT= <normlp>
##$PFORMAT= <normpl>
##$SURQMSG= 1
$$ End of Bruker specific parameters
$$ ---------------------------------
##NTUPLES= NMR SPECTRUM
##VAR_NAME=  FREQUENCY,     SPECTRUM/REAL,   SPECTRUM/IMAG
##SYMBOL=    X,             R,               I
##VAR_TYPE=  INDEPENDENT,   DEPENDENT,       DEPENDENT
##VAR_FORM=  AFFN,          ASDF,            ASDF
##VAR_DIM=   32768,         32768,           32768
##UNITS=     HZ,            ARBITRARY UNITS, ARBITRARY UNITS
##FACTOR=    0.250966925370066, 1,           1
##FIRST=     8223.43324360095, -21660,       195629
##LAST=      0,             -161031,         -126395
##MIN=       0,             -701734,         0
##MAX=       8223.43324360095, 442506855,    0
$$ Real data points
##PAGE= N=1
##DATA TABLE= (X++(R..R)), XYDATA
$$ [...]
19515H173K50148g8379n4637G9971C7388J5847K77521d058q3455Q656j7789B442
19502f3666F7087a02450j53122C1926j0512c0935j82823A3058d18747b08952k4631
19491b33583G0245L6751D5920J5792b3045j60168m6314J11798j02729E3724a66349
19479a17572p7081B98970a05527l12475i8659l12958A36770d8388B14407b89199
19468a65124A64313I868d1978A85923b1959j37163A28553a44987A32015c5877
19457c43869a57386f4661k3045c1541j06353F5159c23l10981B86972b60614I3896
19445b35141e7383A34885A7125a63289N4844C9258b21335A41099a0139A20143
19434A58417m096a36884C60500c3784A5711i2464l4755A81536m0625a49083j5623
$$ plain form
19515 8173 258321 -78379 -133016 79971 37388 53235 330756 -4058 -87513 -78857 -96646 2442
19502 -63666 67087 -102450 -255572 31926 21414 -30935 -213758 13058 -418747 -208952 -233583
19491 -233583 70245 106996 45920 61712 -23045 -183213 -229527 -117729 -220458 53724 -166349
19479 -117572 -194653 298970 -105527 -418002 -98659 -411617 136770 -48388 214407 -289199
19468 -165124 164313 9868 -41978 185923 -21959 -159122 128553 -144987 132015 -35877
19457 -343869 -157386 -64661 -87706 -31541 -137894 65159 -323 -311304 286972 -260614 93896
19445 -235141 -57383 134885 17125 -163289 -108445 39258 -221335 141099 -10139 120143
19434 158417 154321 -136884 360500 -33784 15711 -92464 -127219 181536 140911 -149083 -164706
19423a64706q7882A51293K246b2328l09353l1483a3750A45783J43867B7699a10690
19411f8941B8623k011a4529o1400H658b15885E51055E0702a7491A49380o3292
19400H6088m031a27676G5387d16580C32389b37512d8039D7855a34248O6602j01687
19389a69333A35585b30882a10325k300L4621l82002f1736A74045b87450G9053
19378A9698d516l22900a23248n2924H6622c73504a62226m0510i6029B26676a01818
19366d94022H2302b88237E9198b80735C8609b3138B95396L0857j29528a84559
19355a14029A61602a91800j43232N7885A5654M9073A8507J05597c19772a24989
19344E6083O5198g5294A11004a51423j17729b8032j70360r7665e8871P243B45502
$$ plain form
19423 -164706 -252588 151293 153539 -22328 -331681 -363164 -13750 145783 289650 27699 -110690
19411 -68941 28623 26612 -14529 -75929 8658 -215885 551055 50702 -17491 149380 86088
19400 86088 82057 -127676 75387 -416580 332389 -237512 -48039 47855 -134248 -67646 -169333
19389 -169333 135585 -230882 -110325 -112625 -78004 -460006 -61736 174045 -287450 79053
19378 19698 -4516 -327416 -123248 -176172 86622 -373504 -162226 -202736 -96029 226676 -101818
19366 -494022 82302 -288237 59198 -280735 38609 -23138 295396 326253 196725 -184559
19355 -114029 161602 -191800 -335032 -277147 15654 64727 18507 124104 -319772 -124989
19344 56083 121281 -75294 111004 -151423 -269152 -28032 -198392 -296057 -58871 -51628 245502
19332c51757J29511B20154r9679c24171E0031a52273q6487j88979J52044C5347
19321c9382B13005b44662M8941B83225b31915a14895j8300m8220B40008b87893
19310G8295B2808a15891a8293H3351a52970l8881C12411a3836L680j89735H9438
19298a6641C6054j0866c12589A59262E1018a81455D2355c28929B31183B9953g0124
19286C0660K02537d7858B640g4598G7187a26873j12544i5023d2309k97692A991
19274c4929F1863O4976o413E8759c2107A64744b75118j87585N7126k96157F9895
19262H153h1125F5740a92094H3259g6837D3116K71904b8980L217E8799c1744j88759
19250b20503D4161b06744O0180O5743A38952a4549B86529b13564G3853R0599n6519
$$ plain form
19332 -351757 -222246 220154 120475 -324171 50031 -152273 -238760 -427739 -275695 35347
19321 -39382 213005 -244662 -195721 283225 -231915 -114895 -133195 -181415 240008 -287893
19310 78295 22808 -115891 -18293 83351 -152970 -191851 312411 -13836 -10156 -199891 89438
19298 -16641 36054 25188 -312589 159262 51018 -181455 42355 -328929 231183 29953 -70124
19286 30660 233197 -47858 2640 -74598 77187 -126873 -239417 -95023 -42309 -340001 1991
19274 -34929 61863 126839 120426 58759 -32107 164744 -275118 -462703 -405577 -701734 69895
19262 8153 -81125 65740 -192094 83259 -76837 43116 315020 -28980 -25763 58799 -31744 -220503
19250 -220503 44161 -206744 -146564 -80821 138952 -14549 286529 -213564 73853 164452 107933
19239A07933j5513Q1743p34i867B79369a77827E9955R6933a17146n7324n100J6766
19227a62804l3608G2450f868j70162B87339J20115a24114j04559c7821j54350
19217a92171i17C4588e3840l20143J57942H8060a75014m5321Q5446L059n1137
19206a82967n0641Q8196H4073M0478h8632D9858c37736P3524L0805P5387l14747
19195d72767B56313J49279B2376a02038j61631k00630H4423N4758d2097k15575
19185b57672K0604H6373g0933J8206k1283j09387c8357F9289a47368f1312j49118
19174b10430k3437A38799A7186L713K96746A4306c12957K8118d09k36293j39653
19163c76355a39919k35795f9461H221J08492c9466k2703B34757D7171a65526k60823
$$ plain form
19239 107933 92420 174163 173429 -9867 279369 -177827 59955 156888 -117146 -174470 -179570 -162804
19227 -162804 -196412 72450 -6868 -177030 287339 407454 -124114 -228673 -37821 -192171
19217 -192171 -917 34588 -53840 -373983 -216041 88060 -175014 -220335 -134889 -131830 -182967
19206 -182967 -233608 -145412 84073 124551 -88632 49858 -337736 -264212 -233407 -158020 -472767
19195 -472767 256313 405592 22376 -102038 -263669 -464299 84423 139181 -42097 -257672
19185 -257672 -237068 86373 -70933 -52727 -74010 -183397 -38357 69289 -147368 -61312 -210430
19174 -210430 -233867 138799 17186 20899 317645 14306 -312957 -284839 -409 -236702 -376355
19163 -376355 -139919 -375714 -69461 8221 116713 -39466 -62169 234757 47171 -165526 -426349
19152d26349a35917A01082R2086b80727F2907L1971a416A0402J00703b23235g8861
19140c30473i5220p4778e0595F9399b62900O9911M9785k70963a3001j57607F1846
19128H2898J34347c06594h6618J6058A96826a07543A73522A8752b15098e7492
19117d301I9709d84938d891j00148N2061C5804b47786P9732A85097b30803A40174
19105C7507c7001A8427b35071B1566J40949k7267F5704K38687F1975K76630b5347
19093a95681d6121A11096a55507j38357A70096p5882a54890a2700q0776C0210
19082B6912J21568F2524K80288F0879N091f9044A25767L8844a54195F621N608
19071A2229d14322J47470B53709c68111A38319b5441A21583L7303E2904K283b79930
$$ plain form
19152 -426349 -135917 101082 193168 -280727 62907 94878 -1416 10402 111105 -223235 -78861
19140 -330473 -95220 -169998 -50595 69399 -262900 -192989 -143204 -414167 -13001 -170608 61846
19128 82898 217245 -306594 -86618 -70560 196826 -107543 173522 18752 -215098 -57492
19117 -4301 99709 -484938 -4891 -105039 -52978 35804 -247786 -168054 185097 -230803 140174
19105 37507 -37001 18427 -235071 21566 162515 135248 65704 304391 61975 338605 -25347
19093 -195681 -46121 111096 -155507 -293864 170096 94214 -154890 -12700 -93476 30210
19082 26912 148480 62524 342812 60879 65970 -69044 125767 164611 -154195 6621 12229
19071 12229 -414322 -266852 253709 -368111 138319 -25441 121583 158886 52904 55187 -279930
19059e6765F6899L44405F9161d00667g2894j84475b8288A97550b63412i6674j05980
19048b02654f169A25676B4496a55108b930A89634c9598m00835B18567H1265P6015
19037A57280b36695a02902F4839d6054j22905l5752F1967c48973a06535l63854
19027d70389A34624J2211a61717j36014f014l96672B13465c5915C70910H8992
19016A1149K60644d7433j62302B10567e5740C147K82652b82883J23546N7858b5396
19004c10936E6709a86251j07304B75636C1805a38206B53578b81469A35636k6327
18994A09309d3624k44519e1469C19250a30473l15392D6453a16709H4139J64762
18984B48901G0039b80589c0145r4814j39979h758m3919B35325G304c29914K7208
$$ plain form
19059 -56765 66899 411304 69161 -400667 -72894 -257369 -28288 197550 -263412 -96674 -202654
19048 -202654 -6169 125676 24496 -155108 -2930 189634 -39598 -440433 218567 81265 157280
19037 157280 -236695 -102902 64839 -46054 -168959 -204711 61967 -348973 -106535 -470389
19027 -470389 134624 146835 -161717 -297731 -6014 -402686 213465 -35915 370910 88992
19016 11149 271793 -47433 -209735 210567 -55740 3147 285799 -282883 -159337 -101479 -25396
19004 -310936 56709 -186251 -293555 275636 31805 -138206 253578 -281469 135636 109309
18994 109309 -43624 -288143 -51469 319250 -130473 -445865 46453 -116709 84139 248901
18984 248901 70039 -280589 -30145 -124959 -264938 -8758 -52677 235325 7304 -329914 -302706
18973c02706f498C61548a12790A56012b36075A0890d4156l67184d8701j29790
18963a78491j87681B45797b40246J05625I5763h3209E7615a7191F0658L64376
18953D25034A23184a22564F2502L7468D2635a24606A37664a38379A12348c01402
18942b10658n1945a23666A50930K96665b48890d0744j84842B30659c5558F3850
18931B1400J22506l5141A7286p155b2207B00822H1692b40847D2236b59044H0541
18919a1788k26927m1898A92353d3068B3351J57976f246C1642g6024O32k47527
18908c22919a12030h97m53938I2656f8561A75753A8776i6717b1771E9904a15422
18896g5761B72595j04852I478c67083D6608a0852G4394b0395m57233B4572a20679
$$ plain form
18973 -302706 -6498 361548 -112790 156012 -236075 10890 -44156 -411340 -48701 -178491
18963 -178491 -366172 245797 -240246 -134621 95763 -83209 57615 -17191 60658 425034
18953 425034 123184 -122564 62502 99970 42635 -124606 137664 -138379 112348 -301402
18942 -210658 -262603 -123666 150930 447595 -248890 -40744 -225586 230659 -35558 63850
18931 21400 143906 108765 17286 10131 -22207 200822 81692 -240847 42236 -259044 80541
18919 -11788 -238715 -280613 192353 -43068 23351 181327 -6246 31642 -76024 -75392 -322919
18908 -322919 -112030 -897 -454835 92656 -68561 175753 18776 -96717 -21771 59904 -115422
18896 -75761 272595 167743 9478 -367083 46608 -10852 74394 -20395 -477628 24572 -120679
18884C7972h8942H7656a11845J0344q5943b145I3993a3762k73094J26414k00420
18873c60862a65417a2361m4249A96206a7314k25214E9967a59714j89106B4391
18862e7012A28641f03845a16825H160a52416A1645N485c33422J48598a2232A52111
18850b09593h4883k27381b6313k60951C7609b21562A44694K41322A63077b35512
18839b78603J6797D9917L9371b41792C1887J17169A3938R9280C979a30979A57596
18827a0231j5003j80830R1311j79438A39309a41600J4755j80936K0119A33381
18816A98534c57549a30313M4943k69867A55386l2807a05744I0988j9460b40592
18805C8941L71018C7320N1390f8376b7852B02594D0331f0006l6342C07516E9412
$$ plain form
18884 37972 -88942 87656 -111845 -101501 -187444 -2145 93993 -13762 -286856 -160442 -360862
18873 -360862 -165417 -12361 -56610 196206 -17314 -242528 59967 -159714 -348820 24391
18862 -57012 128641 -603845 -116825 8160 -152416 11645 17130 -333422 -184824 -12232 152111
18850 -209593 -84883 -312264 -26313 -287264 37609 -221562 144694 386016 163077 -235512
18839 -278603 -261806 49917 89288 -241792 31887 149056 13938 113218 3979 -130979 157596
18827 -10231 -25234 -206064 -114753 -294191 139309 -141600 -126845 -307781 -287662 133381
18816 198534 -357549 -130313 -85370 -355237 155386 122579 -105744 90988 71528 -240592
18805 38941 409959 37320 88710 -68376 -27852 202594 40331 -60006 -96348 307516 59412
18793c154F0244J20700a52644o1024o8398b1857k83144a37077G7489h8144n8655
18782a46799n2777g027A00919k1839c7424A39540d56129Q9267a40267H2197L3844
18771A16041a58541f4328E104a33164e1883j54275C1255h3746k62350g1427c4721
18759a35291A25774J39649c849A26227f80D34307H1281b64929N1150O9013j10433
18748b55199d9604A52641a06174k72520a33781F7831b54388A49473D7168d9254
18737c97704Q6592e732A36837A7639L31911c06040f5093j30559A15673c78451
18726b5144k5391L801b0398j99493A01343l6873h5726B14537e1828A464g9248
18714b07401b1641K450D323d6179r7056k7303b9408k23639O5943b6645A6109a79963
$$ plain form
18793 -3154 60244 180944 -152644 -213668 -282066 -21857 -305001 -137077 77489 -88144 -146799
18782 -146799 -199576 -7027 100919 79080 -37424 139540 -456129 -366862 -140267 82197 116041
18771 116041 -158541 -64328 5104 -133164 -51883 -206158 31255 -83746 -346096 -71427 -34721
18759 -135291 125774 265423 -3849 126227 -680 434307 81281 -264929 -213779 -144766 -255199
18748 -255199 -49604 152641 -106174 -378694 -133781 67831 -254388 149473 47168 -49254
18737 -397704 -311112 -5732 136837 17639 349550 -306040 -65093 -195652 115673 -378451
18726 -25144 -50535 -46734 -20398 -219891 101343 64470 -85726 214537 -51828 1464 -79248
18714 -207401 -21641 -19191 4323 -46179 -143235 -170538 -29408 -253047 -187104 -26645 16109 -179963
18701D25812b14442l3990d5015j5252A82416b30680E9904i0536p4006C46326c45761
18689C23234j40243F6381b12228d9581b3882A25503E1634b52894J24146A07760
18678B12646F11L4086P3425k591d4845D8560K77926a41850l413M1594r4373K6084
18666a71958d0281j3147r6222C7388A8016K25338p8568h0541B42291n1186O937
18655A98042e1949b1234l12523J51798K2165e6523A91616b50992R3849A24495
18644a87105H8053D3015b18568k7836G3354i172j26864q4697C24795H9423c18577
18632h5951I5017a74895j52412H668O7084c6989q9241J5691A21125i239A26613
18620a19295M306N5549J192k9628j3057b7054j22548B14388j7033a25678A4849
$$ plain form
18701 425812 -214442 -248432 -45015 -60267 182416 -230680 59904 -90536 -164542 346326 -345761
18689 323234 182991 66381 -212228 -49581 -23882 125503 51634 -252894 -128748 107760
18678 212646 611 34697 108122 105531 -44845 48560 326486 -141850 -145263 -103669 -198042 -171958
18666 -171958 -40281 -53428 -149650 37388 18016 243354 164786 -80541 242291 191105 198042
18655 198042 -51949 -21234 -333757 -181959 -159794 -56523 191616 -250992 -157143 124495
18644 -187105 88053 43015 -218568 -246404 73354 -9172 -136036 -220733 324795 89423 -318577
18632 -85951 95017 -174895 -327307 8668 75752 -36989 -126230 -110539 121125 -9239 126613
18620 -119295 -114989 -59440 -58248 -87876 -100933 -27054 -149602 214388 197355 -125678 14849
18608B9795a89604B8433i6417D1330a3379k05958e7900B7158i8491j5670j2533
18597a26694L0978C1622J39239a50647j33988J20292A19923a50444c6745k72081
18587c08826i405A55108b88589I9595q26m2590J43388e8102B70373L2429a05403
18575c81492a29747B2333b29995k38745b5424J2677m4482j21108O4748k535F5977
18563a88574D4435a57377l9773K2310g3479B91710A9571R3218d2041k00090i0887
18551C4683A485J50910a10336j48880B4628c63371H7505e8826A01711a66659r7973
18540b64632J02392j27221a12946F4675a29766M9143B7712K34975j27986f1799
18529c22895A54136G351b98849f1613j7296j0554B4881N1051c20019P8355E8442
$$ plain form
18608 29795 -189604 28433 -96417 41330 -13379 -219337 -57900 27158 -98491 -114161 -126694
18597 -126694 -95716 31622 170861 -150647 -284635 -164343 119923 -150444 -36745 -308826
18587 -308826 -9405 155108 -288589 99595 98769 56179 199567 -58102 270373 302802 -105403
18575 -381492 -129747 22333 -229995 -468740 -25424 -12747 -57229 -178337 -113589 -116124 65977
18563 -188574 44435 -157377 -197150 -174840 -73479 291710 19571 112789 -42041 -242131 -90887
18551 34683 1485 152395 -110336 -259216 24628 -363371 87505 -58826 101711 -166659 -264632
18540 -264632 -162240 -289461 -112946 64675 -129766 -80623 27712 262687 134701 -61799
18529 -322895 154136 7351 -298849 -61613 -78909 -89463 24881 75932 -320019 -241664 58442
18517b68091Q7119J3413j8723C1110e1473A3901b10839A79185D9441c36480B24051
18505a05912D1344a32126a1599k49578g5688L4694B05129b93823I2791b05027
18494H4028c25521d4427n1932B6231K31226a83321r8853A56184c90442J76190
18484b14252B19737a6957B3431b42564A58558N0581F9004K7437c55828a01779
18473F8987A295a77583C21288a63445O6802j67523A30627e11024f1673J1068j87996
18462b38601M5624A12011b92541a12071E3430h1436b6374o6300A95867o483D4143
18450b46124R0401d5168n9983j82252j53009C6088J79978r4258d6327i201A22899
18438a27046D6525B1003L03993M0566H7230a47905d5566a5029A20982b67453j16597
$$ plain form
18517 -268091 -180972 -167559 -186282 31110 -51473 13901 -210839 179185 49441 -336480 224051
18505 -105912 41344 -132126 -11599 -261177 -75688 -40994 205129 -293823 92791 -205027
18494 84028 -325521 -44427 -96359 26231 257457 -183321 -282174 156184 -390442 -214252
18484 -214252 219737 -16957 23431 -242564 158558 209139 69004 96441 -355828 -101779
18473 68987 1295 -177583 321288 -163445 -96643 -264166 130627 -511024 -61673 -50605 -238601
18462 -238601 -192977 112011 -292541 -112071 53430 -81436 -26374 -92674 195867 189384 44143
18450 -246124 -155723 -45168 -105151 -287403 -440412 36088 216066 121808 -46327 -9201 122899
18438 -127046 46525 21003 324996 365562 87230 -147905 -45566 -15029 120982 -267453 -384050
18427c84050J57339B9459a32082G2783k5915N6370C7228f0223A4084a00059J8281
18416h1778b9944C6236a16850G4070h3560A40227a14068l2683k1847A92792d7422
18404B67641a12341A61468c15106H7446q352c96872a17847b9879j97054G0146
18393b73119j52228A04651a42413E4145a49071d0793j65553h5811A691K04638
18383B06329o6151B2035c7231o0836G3750J56996I8239b88582B20269e6603n7082
18372a13685c686k55144c2914m5359B21192n9063b6017l6436I3652a01410j06767
18361b08177Q0066A79773o4335F384a63094f2859B75824I1187c93599g1500l8478
18350a09978j0208B5187G788d2878D5405R677j5435J80620a29185K5026j09140
$$ plain form
18427 -384050 -226711 29459 -132082 72783 46868 103238 37228 -60223 14084 -100059 -81778
18416 -81778 -29944 36236 -116850 74070 -83560 140227 -114068 -146751 -168598 192792 -47422
18404 267641 -112341 161468 -315106 87446 79094 -396872 -117847 -29879 -226933 70146
18393 -273119 -425347 104651 -142413 54145 -149071 -40793 -206346 -85811 1691 206329
18383 206329 140178 22035 -37231 -98067 73750 230746 98239 -288582 220269 -56603 -113685
18372 -113685 -3686 -258830 -32914 -78273 221192 162129 -26017 -62453 93652 -101410 -208177
18361 -208177 -128111 179773 115438 6384 -163094 -62859 275824 91187 -393599 -71500 -109978
18350 -109978 -120186 25187 7788 -42878 45405 55082 39647 220267 -129185 -104159 -213299
18339b13299A05127K26986a59472o8882A5648L38337E1816g8754o7318o4890A26000
18327A3507a30337J9776B96007A2750J37315a02070C8892e1144A13213B7931c8047
18315b20461p665A1358b31649O7132E9340A4162a75374D2631J11241f9612A99359
18303b65143A32052K29371I4297m6186d3465F4491a40766j63067C26825a3937
18292A36968J5287d8013k86942A27885b09228b7390j76714i5015d4462E7004a08627
18280a61143j25609i8290A52374L6285a29456r316a4347j0298j0306B75108b92648
18268a20638A047a31991r5162H8413N6168l6186n834a12144I6001c6736E2366
18256B7287h86H0544d4494A22323l703J14053P9025f8653h93l3640F4618h0564
$$ plain form
18339 -213299 105127 332113 -159472 -228354 15648 353985 51816 -78754 -146072 -210962 126000
18327 13507 -130337 -110561 296007 12750 150065 -102070 38892 -51144 113213 27931 -38047
18315 -220461 -228126 11358 -231649 -164517 59340 14162 -175374 42631 153872 -69612 199359
18303 -265143 132052 361423 94297 48111 -43465 64491 -140766 -303833 326825 -13937
18292 136968 152255 -48013 -334955 127885 -209228 -27390 -204104 -95015 -44462 57004 -108627
18280 -161143 -286752 -98290 152374 188659 -129456 -138772 -14347 -24645 -34951 275108 -292648
18268 -120638 1047 -131991 -227153 88413 144581 108395 102561 -112144 96001 -36736 52366
18256 27287 -886 80544 -44494 122323 118620 232673 311698 -68653 -893 -34533 64618 -80564
18243b46826D6364a40649F8779b54162b8698B3767a24535A5351F100J14738a60833
18231b9702l36037c7134l66658H3752K88023c800G9667J15255L904h8456B18906
18219A48032G3569a53186k49935b5101j35645r7488d8059A51673f0014n4219K4563
18208h9670D387K9381a13857B22231c01069e1829k89525A9688c82717a70894H9773
18196c6963l32927B788a17128K8150A08739b4611F7324b64872i0347C23253A4159
18184a44703f8957H5761a7162a639D9289b02348G7014a83937A22328C2341A3331
18172b45074A26665a40566A06097c9581A95944b4974n3401A50068K7003J15146
18162B92217b5554E4990Q0229c9127F9172b3962n3785B17218P6824a59301L6790
$$ plain form
18243 -246826 46364 -140649 68779 -254162 -28698 23767 -124535 15351 6100 120838 -160833
18231 -29702 -365739 -37134 -403792 83752 371775 -3800 79667 194922 198826 -88456 218906
18219 148032 73569 -153186 -403121 -25101 -160746 -258234 -48059 151673 -60014 -114233 -89670
18208 -89670 4387 33768 -113857 222231 -301069 -51829 -341354 19688 -382717 -170894 89773
18196 -36963 -369890 2788 -117128 -88978 108739 -24611 67324 -264872 -90347 323253 14159
18184 -144703 -68957 85761 -17162 -1639 49289 -202348 77014 -183937 122328 32341 13331
18172 -245074 126665 -140566 106097 -39581 195944 -24974 -78375 150068 177071 292217
18162 292217 -25554 54990 135219 -39127 69172 -23962 -77747 217218 294042 -159301 -122511
18151a22511b6027l65967B46787a0307j66766H1642a31341A72762b79178B0a40691
18139b66697a23604K7592n0252l4072A21598C4139d30212f4353G7055f0168r1419
18128a51587A08576J49265A9614i8466q4275f0561A1348d4888A63966a32745b156
18116B10653a84809k9868c1892A24003g9127G5020A5038i8170F0087c27815D8220
18104a15869A35292J850k1930O3067k6202C814b06984F363J20666b85838C3953
18092b50957c3987C48933e0434j71510B7146A0684c17846I2664c57518a53025
18081c1351j34472j94280D800j307M2745K40618f9340H0016a4526A17482b20122
18069a10185A07598a3768d150p5745A03661J9524f7957A41887h9712k6820E3855
$$ plain form
18151 -122511 -26027 -391994 246787 -10307 -177073 81642 -131341 172762 -279178 20 -140691
18139 -266697 -123604 -96012 -146264 -180336 121598 34139 -430212 -64353 77055 -60168 -151587
18128 -151587 108576 257841 19614 -98466 -182741 -60561 11348 -44888 163966 -132745 -2156
18116 210653 -184809 -214677 -31892 124003 -79127 75020 15038 -98170 60087 -327815 48220
18104 -115869 135292 137142 115212 178279 152077 3814 -206984 6363 127029 -285838 33953
18092 -250957 -33987 348933 -50434 -221944 27146 10684 -317846 92664 -357518 -153025
18081 -31351 -165823 -360103 4800 3493 46238 286856 -69340 80016 -14526 117482 -220122
18069 -110185 107598 -13768 -4150 -79895 103661 123185 -67957 141887 -89712 -116532 53855
18057I222L6875a9104A13576c53736g8149m5610M1996k3953C8772a22537B07911
18045g0532c649p2690L2081m327k35741A25763R0237p7486C9705A1303e2444E1695
18032a0610K529j10356B35100h3930B14503f1302m467H486J8222n637e9644A89542
18019G8528A8653K20111R3607g7028N01A37508b14148G4653c18513N4734I7879
18007b47117N5324A14343N8229a96284B22963o2721a67538m2767G814b23811B6799
17995C07923f8975A38077L7136a14669D5444c58834J68708N7640q3498A77876
17984A69865c37286a60830D3562K7436c385C6856d5717A8679h386E52a56126C3758
17971C7196a11177F8704k8640K05386c6413J0719E5328a13144A17504B3756L13664
$$ plain form
18057 9222 46097 -19104 113576 -353736 -78149 -123759 -81763 -105716 38772 -122537 207911
18045 -70532 -3649 -76339 -44258 -48585 -284326 125763 216000 138514 39705 11303 -52444 51695
18032 -10610 -8081 -118437 235100 -83930 214503 -61302 -65769 8486 26708 21071 -59644 189542
18019 78528 18653 238764 332371 -77028 -76527 137508 -214148 74653 -318513 -263779 97879
18007 -247117 -191793 114343 172572 -196284 222963 160242 -167538 -210305 7814 -223811 26799
17995 307923 -68975 138077 175213 -114669 45444 -358834 -190126 -132486 -215984 177876
17984 169865 -337286 -160830 43562 70998 -3385 36856 -45717 18679 -8386 552 -156126 33758
17971 37196 -111177 68704 40064 245450 -36413 -25694 55328 -113144 117504 23756 337420
17960C37420a09958A19189a49165e6426A9498b98939E3250k0838c6837A1445a76449
17948a07958F2065a55918f4402A66577E3257O7833a55870A29881b02706A50401
17937H4208A6526J6372c63587C0866K0278N4308O0462a9579A8960a78714c2067
17925e2033A1230a92194a4591A16638k0398f1810j72552D5863c34425J14415O1481
17914a58529H9042C4704c7273k37568A20091h769j93270J8375N9018E7056a27546
17902a52697f4271A13922b85708G7177a85884a5501j55311O7047l1691I1588B5185
17890H8159J25616A05114J20343p9326b47556C3328g2149l1706E7612a74549B04764
17878B61908b30300d2510B68247E4442g0350k00103A27385a01580b2339L287A09999
$$ plain form
17960 337420 -109958 119189 -149165 -56426 19498 -298939 53250 32412 -36837 11445 -176449
17948 -107958 62065 -155918 -64402 166577 53257 121090 -155870 129881 -202706 150401
17937 84208 16526 32898 -363587 30866 51144 105452 165914 -19579 18960 -178714 -32067
17925 -52033 11230 -192194 -14591 116638 96240 -61810 -234362 45863 -334425 -220010 -158529
17914 -158529 89042 34704 -37273 -274841 120091 -8769 -202039 -183664 -124646 57056 -127546
17902 -152697 -64271 113922 -285708 77177 -185884 -15501 -170812 -103765 -135456 91588 25185
17890 88159 213775 105114 225457 146131 -247556 33328 -72149 -103855 57612 -174549 204764
17878 261908 -230300 -42510 268247 54442 -70350 -270453 127385 -101580 -22339 -19052 109999
17866f0588l5284M3535I3504J29398a28672G0378b25391a08328q4734P5708j22108
17855b39462M2871d8411J3215A29293F2423a81242O5317p3502c8272H020L87864
17844C95884d6723l6771m0997B94839R0469d6749A87631a36981B2116J67653F7279
17832A53157J41617a66788A72340g4283A07474a09667G4078d3226k00937N0647
17822a93516K8848A96911F2625b78564b2493j82697q0037B49476A17563J16530
17812B34093R8746b6641p4921A07492a48792o6049I5054D6699P4528P0020K1584
17801B12831f5349B5920e3591b5904A28458L313F0740n307c9975A52617J29875
17790B82492h9204D92626a06770A98914r5480l6269J23562f8552j00734a0542
$$ plain form
17866 -60588 -95872 -52337 93504 222902 -128672 70378 -225391 -108328 -193062 -117354 -239462
17855 -239462 -196591 -48411 -35196 129293 62423 -181242 -115925 -189427 -38272 8020 395884
17844 395884 -46723 -83494 -124491 294839 385308 -46749 187631 -136981 22116 189769 67279
17832 153157 294774 -166788 172340 -74283 107474 -109667 74078 -43226 -244163 -193516
17822 -193516 -164668 196911 62625 -278564 -22493 -205190 -285227 249476 117563 234093
17812 234093 332839 -26641 -101562 107492 -148792 -214841 95054 46699 121227 191247 212831
17801 212831 -65349 25920 -53591 -25904 128458 131771 60740 55433 -39975 152617 282492
17790 282492 -89204 492626 -106770 198914 103434 67165 190727 -68552 -169286 -10542
17779A18566a60467A35832l3680Q7102k1522K9359p9838a19020B79587c43142
17768b7323A3229J15955a26929H9025K26536j39633F657P7398a35811A72836M1836
17757B14672M0398i0204A24727e7166B99088a24434c2769L75j68579m3982j5981
17746b60936d852A5584e1996F4369A7269b45976K9105B06548i5470a974j84449
17735a86423P6127a8863B2391d6909m1228j10108A30075h9213B11233c22495a37691
17723a58933O3787E6393R625a51576J0706e4888F06J1705a54582P2542A02656
17711H1125b31325A63947l3079c0904A25473A8489L2613c02449C12084c9890A0946
17699d105C05409a55471N5736k16632J56766A87084A7151J25238A6538c87671
$$ plain form
17779 118566 -160467 135832 102152 189254 167732 197091 117253 -119020 279587 -343142
17768 -27323 13229 129184 -126929 89025 315561 175928 6657 84055 -135811 172836 214672
17757 214672 255070 -90204 124727 -57166 299088 -124434 -32769 -32394 -200973 -244955 -260936
17746 -260936 -4852 15584 -51996 64369 17269 -245976 -216871 206548 -95470 -1974 -186423
17735 -186423 -110296 -18863 22391 -46909 -88137 -198245 130075 -89213 211233 -322495 -137691
17723 -158933 -95146 56393 66018 -151576 -140870 -54888 606 12311 -154582 -82040 102656
17711 81125 -231325 163947 130868 -30904 125473 18489 51102 -302449 312084 -39890 10946
17699 -4105 305409 -155471 -99735 -316367 -159601 187084 17151 142389 16538 -387671
17688B34778A0393J28676E961b92127G8350b62698C59390h6010F2621K29112a80253
17676A00582b93693f9275D12476G2308L45037a57586B69129C8130L35363j0116
17666C63377A3270c7274k9361A03059J32482a48314k62565a09113h548A7367K14828
17655B32195Q0285a59996C11745f264m8912k8841m511l23408c3355D7155R9715
17644A46870E9673A2110K48969L2839i5675A08427g24C12301A51865a679A2165
17632B31886h708I8322k1989L20002c46208D7531P1269C1894K74424a8391H8310
17620a8844A34720K5037J11037H9676b7828m6791j32167C03920g6505J5072A44940
17608C8623J73518o8622K00680A47795k7896J3947b09554B08987a91830G3138
$$ plain form
17688 234778 10393 139069 5961 -292127 78350 -262698 359390 -86010 62621 291733 -180253
17676 100582 -293693 -69275 412476 72308 417345 -157586 269129 38130 373493 363377
17666 363377 13270 -37274 -66635 103059 235541 -148314 -410879 -109113 -8548 17367 232195
17655 232195 312480 -159996 311745 -6264 -55176 -84017 -88528 -411936 -33355 47155 146870
17644 146870 59673 12110 261079 293918 -95675 108427 -724 312301 151865 -1679 12165
17632 231886 -8708 98322 76333 396335 -346208 47531 118800 31894 306318 -18391 88310
17620 -18844 134720 159757 270794 89676 -27828 -74619 -206786 303920 -76505 -61433 144940
17608 38623 212141 143519 344199 147795 119899 133846 -209554 208987 -191830 73138
17597a891G6093i3332m4764O4228B9989N4042K15794H0339R6035K4328O8418E43
17584H2659k9071c16224C37692A0629K30037g5447C3329a11043N5048A5332b05715
17572a19410A60145G2604a80296B28526f7879A25151l672b38147e3062F3531K99106
17561C62637F0160J99527A28981b0040F9025J64618G8057a24248G71c28969A80888
17549B81238J9022a51926D70327A63892a34629A48999P2943J65301n1244A66538
17538A76530K75836E2339K80615j42636O9991A29295F1515J38719E8843c392G4978
17526i3463g94A07715l9221j7996J73485p6141f7126b3217d370A72299j3375p8312
17514H0612k9514M5381C031N1083K74977R8828l7345A69819J43467L7454L1981
$$ plain form
17597 -1891 76093 -93332 -138096 -73868 29989 84031 299825 80339 176374 200702 269120 543
17584 82659 53588 -316224 337692 10629 240666 -75447 33329 -111043 -55995 15332 -205715
17572 -119410 160145 72604 -180296 228526 -67879 125151 121479 -238147 -53062 63531 362637
17561 362637 60160 259687 128981 -20040 69025 233643 78057 -124248 771 -328969 180888
17549 281238 300260 -151926 470327 163892 -134629 148999 221942 387243 335999 166538
17538 176530 452366 52339 332954 190318 260309 129295 61515 200234 58843 -3392 74978
17526 -93463 -794 107715 68494 50498 223983 147842 -67126 -23217 -4370 172299 158924 80612
17514 80612 51098 96479 3031 54114 329091 427919 390574 169819 313286 350740 382721
17503C82721A40528K27712I3816L2764D0443K0850N2533J14918N0816E1462J5503
17492F6965c4757C29004R5214A80037n8982j019a9217B5497K06666B2494a9558
17480B49017K35384E1268a9143A74672Q434b41158J11390M8375D1780a00864D3157
17468B10722L3558k7168D5531M8203J79138g7056A45670G83i5018I1637L25707
17457D17344A5195L00129I0629J5285J52985M9363D3660A7430J62019p0316P8944
17446A88077J72598A03151j2496m0027L67545j20165G5334J74450H3301J71884
17436B55185j2776K96257r4902j79203N0312j3645j17339K0804K4106J12380A57246
17424F1172K81094K6442B1872N56879B09275J575l7793N8636n9286L63879j04019
$$ plain form
17503 382721 140528 368240 93816 126580 40443 61293 113826 228744 279560 51462 66965
17492 66965 -34757 329004 424218 180037 121055 120036 -19217 25497 232163 22494 -19558
17480 249017 484401 51268 -19143 174672 183106 -241158 -129768 -81393 41780 -100864 43157
17468 210722 244280 217112 45531 93734 272872 -77056 145670 783 -95018 91637 417344
17457 417344 15195 315324 90629 105914 258899 308262 43660 17430 179449 109133 188077
17446 188077 360675 103151 90655 50628 418173 298008 75334 249784 83301 255185
17436 255185 242409 538666 443764 264561 314873 301228 183889 204693 228799 341179 157246
17424 61172 342266 368708 21872 578751 209275 210850 173057 231693 172407 536286 432267
17413D32267A86576j5925J11168j24753f6537I3569M29617B40472K06709A76111
17402i2944B43274k336J3311I1495B5589J62998a21320B88067i3015F1897K34189
17391B96086e1345C081J47333K46957A73185J94593J08501A36922L0265B6616
17380A62139K33405j87702b99A73539D381K15825J22941a52046C50887A07209
17369C28925a11406A63135O0013a9562j8249B76740c748A1217b3034k36104r1773
17358c50911A59813B5538M33867j82457j21354B0638K509K11128K15668g7753
17347C42088A2431P7350c6756j58411B86720m6544I2196J26117r7500J08404c5849
17335A2505K07487q2420R1880J20734a16587G258h5055B34096H2322J71282b3003
$$ plain form
17413 432267 186576 170651 281819 157066 -66537 93569 523186 240472 447181 176111
17402 -92944 243274 240938 254249 91495 25589 188587 -121320 288067 -93015 61897 296086
17391 296086 -51345 3081 150414 397371 173185 367778 476279 136922 167187 26616
17380 162139 395544 207842 -299 173539 4381 220206 343147 -152046 350887 107209
17369 328925 -111406 163135 223148 -19562 -37811 276740 -3748 11217 -23034 -259138 -350911
17358 -350911 159813 25538 459405 276948 155594 20638 23147 234275 449943 -77753
17347 342088 12431 89781 -36756 -195167 286720 240176 92196 218313 120813 229217 -35849
17335 12505 219992 137572 229452 350186 -116587 7258 -85055 234096 82322 253604 -23003
17323c5172H8467L29788A3121L68549B7506J15202F3233k614R3651n4458i9221
17311A63930a83895G7846k5047J64457A00127p706J09636K39766j74787j02318
17301A64718K12122A35048c2987A53720J26268k4185I2591J08385J76793C1359
17290B59090L5927a7782o2427C29119j41548k9186p0608J80782c0303C29049p2976
17279B56073r8841F327J9023K23262J48834A67329o539c7327B19472b51253A32662
17267b9277A35813M9447J61782F1441Q0537a66336C07615Q9072j78746J4757I1213
17255C21986j15317j8753R5815n7871n5741J75023A58270N517l8974K79619a00209
17243B15007L81100B59646A0372K28626b18159D81698A57812l2401B729J56934
$$ plain form
17323 -35172 88467 418255 13121 381670 27506 142708 63233 60619 154270 99812 -99221
17311 163930 -183895 77846 52799 217256 100127 92421 202057 441823 267036 164718
17301 164718 376840 135048 -32987 153720 279988 255803 92591 200976 377769 31359
17290 259090 295017 -17782 -80209 329119 187571 158385 87777 268559 -30303 329049 256073
17279 256073 157232 6327 25350 248612 397446 167329 160790 -37327 219472 -251253 132662
17267 -29277 135813 185260 347042 61441 141978 -166336 307615 396687 217941 232698 91213
17255 321986 206669 187916 283731 225860 170119 345142 158270 163787 124813 404432 -100209
17243 215007 596107 259646 10372 238998 -218159 481698 157812 125411 2729 159663
17233A59663K98814H2604J73444j7882D2652K3814J67472n5751Q923n9125A9979
17221a00635B85234p8816n9492o7769Q3544J40474A24171Q4814E9001a8902B96792
17209C08943Q1029H9026K20123k6383a968G1355J57331o6902J99478D4600J89266
17198B33866K98092B40202m3269J70292K6510n0868E1108j883L34773b34088D44153
17186B43951n3009d485B53807e3674D10079A40720G20M14910A23329c2294F4308
17174A09882M85308A20936J52400j26228K27030j19416J19989r225a39799D48848
17163a93672D95023o1501B14349J95877a46292B98932J18118j56538A01068b7220
17152a2387B68827J87428n1840g4762l6971E30190B2653J1164Q1296L01268K8718
$$ plain form
17233 159663 458477 82604 256048 238166 42652 66466 233938 178187 187110 127985 19979
17221 -100635 285234 206418 146926 79157 162701 303175 124171 208985 59001 -18902 296792
17209 308943 389972 89026 309149 282766 -1968 71355 228686 161784 361262 44600 233866
17198 233866 531958 240202 196933 367225 393735 342867 51108 49225 383998 -234088 444153
17186 243951 190942 -4485 253807 -53674 410079 140720 720 415630 123329 -32294 64308
17174 109882 595190 120936 273336 147108 374138 254722 374711 365486 -139799 448848
17163 -193672 495023 433522 214349 410226 -146292 298932 417050 260512 101068 -27220
17152 -12387 268827 456255 404415 -74762 -111733 530190 22653 33817 115113 416381 445099
17141D45099A23593L6274J44104K03689A71458P1846J28503A79794Q6995R4589
17131C61378j16409L50224A92572K57148l0996A21686J68690K06149j63048A45014
17120B64737j23095E4273K37280P6202I7818K53302J31046j09955J39131j59210
17110C52132J38966k25762J41951m7558A26944M93810A74789K66679C6360K56672
17100B93032c523D30351O6068j86354A32798L80785m9295L3064j07719j09974
17090B79659L90271B22721K90659j97107j37787K68797k3080q093B05699L58822
17080E64521A63930L21612d8669E40586B66420J33497j25375N78763k89986j17199
17070D46120j62999n4328j6145J86367Q380A51868L40008r6808m8944J23083j98473
$$ plain form
17141 445099 123593 159867 303971 507660 171458 243304 371807 179794 266789 361378
17131 361378 244969 595193 192572 449720 418724 121686 290376 496525 333477 145014
17120 264737 141642 54273 291553 367755 97818 351120 482166 372211 511342 352132
17110 352132 491098 265336 407287 359729 126944 620754 174789 441468 36360 293032
17100 293032 -3523 430351 496419 310065 132798 513583 464288 497352 389633 279659
17090 279659 669930 222721 513380 316273 178486 447283 424203 416110 205699 564521
17080 564521 163930 485542 -48669 540586 266420 399917 274542 853305 563319 446120
17070 446120 283121 228793 212648 399015 407395 151868 491876 395068 346124 469207 270734
17059B70734J69046j9303n4990r7505P2845J25960J10206k29254J30999n2731
17049D26007o8642J32152j50504J42361n682k920o3755N00172B79165J97463B25673
17037D05300K1773J07870K9838j35057J65706J81897k87896K48630p1141j99562
17027D67358J03378J06956C06147J10381M29510j53582J02797j73591m5132j38237
17017D38293j96059L87177J23061j80399K6239j64835M83417j42444j37996q793
17007F27661C03491M81251j16977Q7510K81780B77102M35098q3891J09498k83303
16997D54504j15611L69560K31523j68793j28830j7199k50812K58076j61346n7814
16987D13258K79880o4568L70059j88765O1494j23402J03740j98060J00308M9160
$$ plain form
17059 270734 439780 420477 365487 267982 340827 466787 576993 347739 478738 426007
17049 426007 357365 489517 339013 481374 475692 472772 409017 909189 279165 476628 225673
17037 405300 427073 534943 564781 429724 595430 777327 489431 738061 666920 467358
17027 467358 570736 677692 306147 416528 846038 692456 795253 621662 576530 438293
17017 438293 242234 629411 752472 572073 598312 433477 916894 774450 636454 627661
17007 627661 303491 784742 667765 755275 1037055 277102 712200 628309 737807 454504
16997 454504 338893 708453 939976 771183 642353 625154 374342 632418 471072 413258
16987 413258 693138 628570 998629 809864 871358 747956 851696 653636 753944 803104
16977H03104K030l47449O6185K26000R4149j59818j69185J83623K41224k40923
16967F98940L07109j35111l6096K89796j34329l96372N18613l1272k98586K43135
16957A025827l94853K10094n5577J52722k43534J85025L79663n06477q933K60954
16947A004911j83826l886O6934j3137L37584k12518J03669l5557P4102J17794
16937A256070O9366m36493L38437k98845M89916m07697J46855k24862P7855J84379
16927A194981l78335N29115m1455J4716n31017L87230J20840J16973J5697r872
16917A418873j82254k973J7581L8528J07309R890j91055K16657J4446m8840M2290
16906A440452l7368l14348J91595K89683j32706J10084j18897M57961l63188j8517
$$ plain form
16977 803104 805134 457685 523870 749870 844019 684201 515016 698639 939863 698940
16967 698940 1006049 870938 834842 1124638 990309 593937 1112550 1081278 782692 1025827
16957 1025827 630974 841068 785491 938213 694679 879704 1259367 752890 743957 1004911
16947 1004911 821085 817199 884133 870996 1208580 996062 1099731 1064174 1138276 1256070
16937 1256070 1325436 888943 1227380 928535 1418451 1010754 1157609 932747 1010602 1194981
16927 1194981 816646 1345761 1304306 1319022 788005 1175235 1296075 1413048 1428745 1418873
16917 1418873 1236619 1233646 1251227 1289755 1397064 1406954 1215899 1432556 1447002 1398162 1440452
16906 1440452 1403084 1088736 1280331 1570014 1437308 1547392 1428495 1886456 1523268 1504751
16896A504751K24023r2907k34447L36063R5526j87538P5181J4225n6067J12435
16886A791245m2839P2570k81803M60825j46934q2840N33512l14472K82252k04731
16876B066785N4525k38482L57840j26286k72709J27278J84547j78316K30370L20136
16866B525688l39934J31677j75595K11005K24238J53014l96935J14064J88051
16857B635273L4381j11867q5416p2070K65866K9811M77270k29194M0559J65249
16847C149862m72172K40564J1794R9414L69487j35008P6284K71438j46895J48167
16837C612935J34529k14693J49951m2371J07684N7468J29827M5171Q7684q3221
16827C984964K03156J7476J31830M6007P0971K53001J71180J02873k04657K86659
$$ plain form
16896 1504751 1728774 1635867 1401420 1737483 1833009 1645471 1720652 1734877 1678810 1791245
16886 1791245 1748406 1820976 1539173 1999998 1853064 1770224 2303736 1989264 2271516 2066785
16876 2066785 2121310 1882828 2240668 2114382 1841673 1968951 2153498 1975182 2205552 2525688
16866 2525688 2185754 2317431 2141836 2352841 2577079 2730093 2333158 2447222 2635273
16857 2635273 2669654 2557787 2472371 2400301 2666167 2695978 3173248 2944054 2984613 3149862
16847 3149862 2677690 2918254 2930048 3029462 3398949 3263941 3340225 3611663 3464768 3612935
16837 3612935 3747464 3532771 3682722 3640351 3748035 3805503 3935330 3980501 4068185 3984964
16827 3984964 4188120 4205596 4337426 4383433 4454404 4707405 4878585 4981458 4776801 5063460
16817E063460k07349N23658n4804L38615j34878k2421K23279k5153J59971L53144
16807F217522P5839q6959K36497j82783M14776K26113q7093K81548J59640M02136
16797G657236J0786L34606l04611M94624J50868J48756O18320j57744M65054O5123
16787I483018N5147M58912L44758K00852K99554M11133K69458j04029O52592P1682
16777A2143077O01601K62375M97007L61173O53410K38377L76478N91613K37996
16768A5963107P16935M28264N00985N17493M11496R66022N62497O92514Q32525
16759B1591838N06088J095398Q95639P63065Q56606J121508N86702J096544J236161
16750B9749549J046273J484516J193793J018789J766791J064997J794157J818978
$$ plain form
16817 5063460 4856111 5379769 5324965 5663580 5528702 5506281 5729560 5704407 5864378 6217522
16807 6217522 6293361 6206402 6442899 6260116 6674892 6901005 6813912 7095460 7255100 7657236
16797 7657236 7668022 8002628 7698017 8192641 8343509 8492265 9110585 8952841 9417895 9483018
16787 9483018 9538165 9997077 10341835 10542687 10842241 11253374 11522832 11418803 12071395 12143077
16777 12143077 12744678 13007053 13504060 13865233 14518643 14757020 15133498 15725111 15963107
16768 15963107 16680042 17108306 17609291 18126784 18538280 19504302 20066799 20759313 21591838
16759 21591838 22097926 23193324 24088963 24852028 25708634 26830142 27416844 28513388 29749549
16750 29749549 30795822 32280338 33474131 34492920 36259711 37324708 39118865 40937843
16742D0937843J839198J837442K398225J669868K524176K169600K590214K573399
16734E8539965L069030K882154L127318L188749L490394L857381L772792L752542
16726H5680325M397862M570741M240358M985794M497356M959121N030819N166260
16718A23528636M862712N117865M346538M963588M252926M001933L529646K836372
16710A57440216K421290J726523R39531M18582m73359p25551k201758k276724
16702A57268750l007152l498620l957576m299651m521033n061175m770349n475824
16694A22677370m826527m608197n273775n157662m402599m286846m561450m593829
16686H4966485m108224l506711l826630l566338l216840l333440k933823k739769
$$ plain form
16742 40937843 42777041 44614483 47012708 48682576 51206752 53376352 55966566 58539965
16734 58539965 61608995 64491149 67618467 70807216 74297610 78154991 81927783 85680325
16726 85680325 90078187 94648928 98889286 103875080 108372436 113331557 118362376 123528636
16718 123528636 128391348 133509213 137855751 142819339 147072265 151074198 154603844 157440216
16710 157440216 159861506 161588029 162527560 162946142 162472783 161747232 159545474 157268750
16702 157268750 154261598 150762978 146805402 142505751 137984718 132923543 128153194 122677370
16694 122677370 117850843 113242646 107968871 102811209 98408610 94121764 89560314 84966485
16686 84966485 80858261 77351550 73524920 69958582 66741742 63408302 60474479 57734710
16678E7734710k831490k213028k394795k666631j882305j975220j485132k404822
16670C9881287j342793j300461j784673j491850j423199j134910j247107j224381
16662B8931913q94530r58084r17476q86105j542971n20623p18028j045246n36825
16653B0912025n08470p68407n13326p42719m65299n35869o85533o52718o23391
16644A5416293p6848o76234k98329o63685k11845j38346o11386m32437m98851
16635A1808332j34498j95949m46837p9039k66804n41557O4322n04718k46741m69155
16625H987356k0749j95751j28407m5665m15346l70603l5437l18853j22477j89852
16615G144216J1572k20832l20039j88667k20174P0055j02819k22068J61498k62385
$$ plain form
16678 57734710 54903220 52690192 50295397 47628766 45746461 43771241 42286109 39881287
16670 39881287 38538494 37238033 35453360 33961510 32538311 31403401 30156294 28931913
16662 28931913 28037383 27079299 26161823 25275718 23732747 23212124 22494096 21448850 20912025
16653 20912025 20403555 19635148 19121822 18379103 17913804 17377935 16692402 16039684 15416293
16644 15416293 15339445 14663211 14364882 13701197 13489352 13351006 12739620 12307183 11808332
16635 11808332 11673834 11477885 11031048 10952009 10685205 10143648 10207970 9703252 9456511 8987356
16625 8987356 8966607 8770856 8642449 8596784 8181438 7810835 7775398 7456545 7334068 7144216
16615 7144216 7155788 6934956 6614917 6426250 6206076 6276131 6173312 5951244 6112742 5850357
16605E850357k24171j63639L4078n04601K8019J20843p6442l20175k39848J3850
16595D518271n5522L71960n27128k21058J31646k05351j62924Q9298k45072L35347
16585D029467l15458j08519o6020j57022J6712L83179m06700P2937k09858k69695
16575B969023J87077J12391j93248K77152m65189l47802M47426M506l66066j4197
16565B611073K36717m10092J3548O2861j14420j51695M37398l59907K08186m3437
16555B490232l86764M39458k85727r2157J58918k54738K8260k05297L33724j73619
16545B052290j66365K87018k47443K30544l44964k6610n5410j56460J47608J4309
16535A734517K52701p1085l20035K36638l11873M06197l07942n2725K37492j71711
$$ plain form
16605 5850357 5626186 5462547 5496625 4992024 5020043 5140886 5064444 4744269 4504421 4518271
16595 4518271 4462749 4834709 4307581 4086523 4218169 4012818 3849894 3939192 3694120 4029467
16585 4029467 3714009 3605490 3539470 3382448 3399160 3782339 3375639 3448576 3238718 2969023
16575 2969023 3156100 3268491 3075243 3352395 2887206 2539404 2986830 2991336 2625270 2611073
16565 2611073 2847790 2437698 2451246 2514107 2399687 2247992 2685390 2325483 2533669 2490232
16555 2490232 2103468 2542926 2257199 2165042 2323960 2069222 2097482 1892185 2225909 2052290
16545 2052290 1885925 2172943 1925500 2156044 1811080 1784470 1729060 1572600 1720208 1734517
16535 1734517 1987218 1916133 1596098 1832736 1520863 1927060 1619118 1566393 1803885 1632174
16525A632174k74573J6219M14417k78904m21346K38510l26238L25704l01049L64862
16515A389776p7332j94723N63714l18814p0926Q5403n10099K27644j4931J44442
16505A224154K09278m92700L7502K45283k16640N2601J33004j77009q6612N132
16495I33993r0151K54899k34297K54053r4537K82606m56897n0496M82830k48120
16485A033883l10307J13068m6415K40392j86898M14381l48293l56565J54979j6385
16475F91840L15454j77622P2550O8739J95390n21110R9119R0614j62089K29829
16465I02714l40497k6385K38202K52769p3496p7447Q1194m67719N15404k92678
16455G12061k94344K23083Q8155J91025k18009j1897K57445l14575J18637k21833
$$ plain form
16525 1632174 1357601 1373820 1788237 1509333 1087987 1326497 1000259 1325963 1024914 1389776
16515 1389776 1312444 1117721 1681435 1362621 1291695 1377098 866999 1094643 1079712 1224154
16505 1224154 1433432 940732 978234 1223517 1006877 1059478 1192482 1015473 928861 933993
16495 933993 843842 1098741 864444 1118497 1023960 1306566 849669 799173 1282003 1033883
16485 1033883 723576 836644 790229 1030621 843723 1258104 909811 553246 708225 691840
16475 691840 1007294 829672 902222 970961 1166351 645241 744360 834974 672885 902714
16465 902714 562217 535832 774034 1026803 953307 875860 957054 489335 1004739 712061
16455 712061 417717 640800 728955 919980 701971 690074 947519 632944 751581 529748
16445E29748n8056J52450M11365j31916k77789J62237L40334m50234Q3092J47139
16435I08370l91779Q6303K17446k20620K49634l6455l16071L85142k06522k19884
16425D55564K16093n5799j1737J89862L838k84981P7775M7939k64129j19109M18788
16414F74104L22955l89837J08348K6741J60681j44430l4157l21508L70700q7748
16404F85849j25843m5130L99803k46735C23572O25111D67169R3486j75440L22479
16394G07694k17330R248Q7708l5385J33866j23462L05722k85288j7118L5735r0536
16383E10854j27930K58659C17394J0095K76562m9529j40911K57133J25489k11630
16373E84603j4353j46624J44887j27734k0210m9260K82731j44995k16514R9630
$$ plain form
16445 529748 471692 624142 1035507 903591 625802 788039 1128373 678139 761231 908370
16435 908370 516591 602894 820340 599720 849354 812899 496828 881970 675448 455564
16425 455564 671657 615858 604121 793983 797821 512840 590615 638554 374425 255316 674104
16414 674104 997059 607222 715570 742311 902992 758562 724405 402897 773597 685849
16404 685849 560006 514876 914679 667944 323572 948683 467169 560655 385215 707694
16394 707694 490364 499612 587320 551935 685801 562339 868061 582773 565655 601390 510854
16383 510854 382924 641583 317394 327489 604051 554522 413611 670744 796233 584603
16373 584603 570250 423626 568513 440779 420569 371309 654040 509045 292531 392161
16363C92161l827N7746K16336B38381M24461k78590J03141M3755p9004L13334
16353G65478j48049p0922J56910k13946j65119K34780K21285l06193j16860J98121
16343E55485j09482K4656A84439L93486o0177j19499K22767o7579k6427L7392
16333E64402n1570K29472j84852j12885o8003R6074K03830r9051l1748n5491j12981
16322C77197L13663j70075k07163N77565l47737j87745L81141l26870o3434r8
16312C46444L32444A94052J97811J4749J05361N5207o6059j57429J85303j07330
16302D21665j21170J48463K41712B15891L21249r3093o8100J83264j37953o1565
16292C59693J57468O0627p8817K24739k38252j3173p263o6043J38979K51007l20408
$$ plain form
16363 392161 388334 446080 662416 238381 662842 384252 487393 531148 452144 765478
16353 765478 617429 546507 703417 489471 324352 559132 780417 474224 357364 555485
16343 555485 446003 470659 184439 577925 517748 398249 621016 553437 527010 564402
16333 564402 512832 742304 557452 444567 376564 472638 676468 577417 545669 490178 377197
16322 377197 690860 520785 313622 891187 543450 355705 736846 409976 346542 346444
16312 346444 678888 194052 391863 406612 511973 567180 501121 343692 528995 421665
16302 421665 300495 448958 690670 215891 537140 444047 375947 559211 421258 359693
16292 359693 517161 577788 498971 723710 485458 472285 465022 398979 537958 788965 468557
16281D68557q4862J03211j36282N7123J2413J52441k6292L2574B81542J50807
16271D32349K82715r0882B34081O7558K65114j99339K7555K10264M4915B43742
16260D14584j16410J18164J95692B25519L66294M2966j53801k01359J44453K56581
16250F80653r5863j28512j59609k3575M20074k48819j6266r985N1337l7870j9691
16239D11874r6938J92117j13900K73982B60378q6327J44235J28612Q4863K20751
16229G52512l46389j25259R25P8957J53970m5040r1125j35728N8774k7032R615
16218B84180Q7921A12774K83548M4240j15360Q9861j150n492j47698K22366j41973
16207C41116j51659J47149j15663K58264J34318B34307N7095A06844J56596M3900
$$ plain form
16281 468557 383695 486906 350624 407747 420160 572601 546309 578883 281542 432349
16271 432349 715064 624182 234081 301639 566753 367414 394969 605233 650148 243742
16260 414584 298174 416338 612030 225519 591813 634779 480978 279619 424072 680653
16250 680653 584790 456278 296669 273094 693168 444349 428083 418098 469435 431565 411874
16239 411874 314936 507053 393153 667135 260378 174051 318286 446898 531761 752512
16229 752512 406123 280864 281789 360746 514716 469676 378551 242823 301597 274565 284180
16218 284180 372101 112774 396322 440562 325202 415063 413913 408421 260723 483089 341116
16207 341116 189457 336606 220943 479207 613525 234307 291402 106844 263440 307340
16197C07340J3307Q3059L6793l7490B00492J51853J44809j71347L0495J10581
16187D66883k19160J19429G1254J60802K67740A65777J84407A55371K01185o6141
16177B90415J46681K1645j3649j21932D4048K64070D6656a19950C60399H0331
16166A15082L9061E9426J62088e6333D68975q928A75333R1579c2595A79840M5381
16155B25221k1618o1096E585N14484j47729K9230M4654D8802a3272B85212K24393
16144E09605B26322g610A57798F9610g2938B17305J20225a2583C83971A08728
16133A95446I2627J73318J34443c36587A13414Q8421p1508g835k55564C89880
16122D7970b16169B31303H0371P6676B9156a848D1249K25371o7212p758o775L9560
$$ plain form
16197 307340 320647 403706 440499 403009 200492 352345 497154 325807 356302 466883
16187 466883 247723 367152 71254 232056 499796 165777 350184 155371 356556 290415
16177 290415 437096 458741 445092 323160 44048 308118 46656 -119950 360399 80331
16166 115082 154143 59426 221514 -56333 468975 460047 175333 266912 -32595 179840 225221
16155 225221 203603 142507 5585 520069 372340 401570 446224 48802 -13272 285212 509605
16144 509605 226322 -7610 157798 69610 -72938 217305 337530 -12583 383971 108728
16133 195446 92627 265945 400388 -336587 113414 201835 130327 -7835 -263399 389880
16122 47970 -216169 231303 80371 157047 29156 -1848 41249 266620 199408 191650 184875 224435
16110B24435q6268K47915A02413O7470J962J3983a7648D36526j55271A07760a50510
16098A78555B0672J76442A1717a23644C4329e2879C79283A29020M3988k5543J36965
16087B84430r3564b3182A15953n0048J05870C828Q7024J2395m717a40408A60870
16075C9531c7173D7114J67282J08307A44746P7592b463E2011p251h5097F7329
16063A00283O9405f6161B52815k0750g8780Q416j8994j60514C70534l6107h8237
16051a26554p7451N2813M4664G7325J23448h5629F4218J98966i8147A9636J89375
16040B09011G1332a60585l67564d8323j57883C30969H4388L5522l3346N4153B2918
16028B16383b2147q3182C46830f1553A81873c4031j90249c6193C81435h066A27428
$$ plain form
16110 224435 138167 386082 102413 169883 171845 185828 -17648 436526 281255 107760 -150510
16098 178555 20672 197114 11717 -123644 34329 -52879 379283 129020 173008 147465 284430
16087 284430 190866 -23182 115953 65905 171775 3828 90852 103247 98530 -140408 160870
16075 39531 -37173 47114 214396 322703 144746 222338 -2463 52011 44760 -85097 67329
16063 100283 169688 -66161 252815 232065 -78780 -70364 -89358 -249872 370534 334427 -88237
16051 -126554 -204005 -151192 -106528 77325 200773 -85629 64218 263184 -98147 19636 209011
16040 209011 71332 -160585 -528149 -48323 -206206 330969 84388 119910 86564 140717 22918
16028 216383 -22147 -105329 346830 -61553 181873 -34031 -224280 -36193 381435 -8066 127428
16016d58222e1154q0264j68258g204E9164h7319A77236f501k06148k5282B01273
16004a46342m1893E69K40230a68705O729e6060j30982k0405P6899b7649a0578
15992G9874a94830B9177H721a30759C8495b82568K3772b7694j81589B22481b07377
15980D4426b11657B55405B2418K21746J22687c5184B05706j4525A8438J78832
15970A97270J32149J02269m4945m7109J29527j54677b46583A84618O6198a60976
15959a2027j7090j17673e9615l0375A42117i3361m7617G5616a77691D05672a44262
15947E5996a34510J2151k12061g0714K1632D2508a31730d1343k5726p3718A15327
15935e46696I6444l0027B9820b62017B18802d49365E1592P737M5533b98208J32529
$$ plain form
16016 -458222 -51154 -131418 -299676 -7204 59164 -87319 177236 -6501 -212649 -237931 201273
16004 -146342 -188235 569 240799 -168705 -161976 -56060 -187042 -207447 -130548 -27649 -10578
15992 79874 -194830 29177 8721 -130759 38495 -282568 -258796 -27694 -209283 222481 -207377
15980 44426 -211657 255405 22418 244164 366851 -35184 205706 191181 18438 197270
15970 197270 329419 431688 386743 339634 469161 314484 -246583 184618 250816 -160976
15959 -12027 -29117 -146790 -59615 -89990 142117 -93361 -140978 75616 -177691 405672 -144262
15947 55996 -134510 -122359 -334420 -70714 -49082 42508 -131730 -41343 -67069 -140787 115327
15935 -546696 96444 66417 29820 -262017 218802 -449365 51592 59329 104862 -298208 -165679
15924a65679O2287J0833o19c6536m9902j80515P1820g6490A71223G226h8249A817
15911B3771a87028E13457a4337A74731b35325a03260c4201q1714F0695i4330j01583
15900a95913A88776a59963E4871a65074C71840b37268E0175J23457a28069C9066
15889G3384h5121H0862b01508E8130G661L93664j81977c7551p8186c2069o6710
15878i8779F4080K10466A00170c1183j34254C15434H7864h0158A42150N026b18663
15866A1724g8159C6888J7799J32074b25449Q4504H6737A2017b28477A09342A4636
15854b34375g8844K4336m0557J6224l1693j94973A42458d8236B10801a63659o4650
15843b28309B90169g7904I2625J74745a864G5101B0761b04321A38730a65514k10583
$$ plain form
15924 -165679 -103392 -92559 -93178 -36536 -86438 -266953 -195133 -76490 171223 7226 -88249 1817
15911 23771 -187028 513457 -14337 174731 -235325 -103260 -34201 -115915 60695 -94330 -195913
15900 -195913 188776 -159963 54871 -165074 371840 -237268 50175 173632 -128069 39066
15889 73384 -85121 80862 -201508 58130 7661 401325 219348 -37551 -115737 -32069 -98779
15878 -98779 64080 274546 100170 -31183 -165437 315434 87864 -80158 142150 147176 -218663
15866 11724 -78159 36888 54687 186761 -225449 -140945 86737 12017 -228477 109342 14636
15854 -234375 -78844 -54508 -95065 -78841 -110534 -305507 142458 -48236 210801 -163659 -228309
15843 -228309 290169 -77904 92625 267370 -1864 75101 20761 -204321 138730 -165514 -376097
15832c76097g1529J4343A20352c71397A33847a52720q3508p4444a09286p6108
15822a85394A08747a84923B62047e3462C6887K07129c90438e1913A68420k8827
15812A39593c66875g4901F6074J88018D7360b78805l5100O2358j46771R0331B11311
15800I3207b94259A22610a71793k26892C1408a65507g9635j57482A73554A5595
15789f1073B34635e0538k8407A57361a31284L6316K1593C18568l3523H1624a2007
15777A07663d1150j04433B07628a00309k5791d3130k49289A59431i5614j79363
15767b74977h4550j74837A35273P4517j04137c84258R5279a39662L1422j19155
15757b27395C5845N3825a27889c2795q861l44036B58061j26538a06437n7816O0136
$$ plain form
15832 -376097 -71529 -57186 120352 -371397 133847 -152720 -236228 -310672 -109286 -185394
15822 -185394 108747 -184923 262047 -53462 36887 244016 -390438 -51913 168420 139593
15812 139593 -366875 -74901 66074 254092 47360 -278805 -313905 -251547 -398318 -307987 211311
15800 93207 -294259 122610 -171793 -398685 31408 -165507 -79635 -237117 173554 15595
15789 -61073 234635 -50538 -78945 157361 -131284 -94968 -73375 318568 285045 81624 -12007
15777 107663 -41150 -145583 207628 -100309 -126100 -43130 -292419 159431 -95614 -274977
15767 -274977 -84550 -259387 135273 209790 105653 -384258 -288979 -139662 -108240 -227395
15757 -227395 35845 89670 -127889 -32795 -41656 -385692 258061 131523 -106437 -164253 -104117
15746a04117I3492J6993b1189A32199l8432o873a54048A73977a76546A47062d8003
15734A6716R9726C3632b90878A17318J49849a22634j98454l1119B4085a93462
15723b04217R3262n2490m6870B44486C5951a74254j66930J30964e2691k41731
15713b94422C9796c01683a28436G4553a18860D1460a31519A50000A7895b31379
15702a22993K4403j2039A27776f0463j57147D9384O741b18140R2833j98271R9191
15691b24387i9780I5797j9078b37155N2048g8597A15324a3964m1582A9823K4742
15680D4565K68690C5639c51138A943L18676o611F3707a06893A69089k3555b15998
15668c07722I6781c77813B2268b38039B17735a93192I9756d3611k9365I9208m8709
$$ plain form
15746 -104117 93492 110485 -21189 132199 93767 86894 -154048 173977 -176546 147062 -48003
15734 16716 116442 33632 -290878 117318 267167 -122634 -321088 -352207 24085 -193462
15723 -204217 -110955 -163445 -210315 244486 35951 -174254 -341184 -210220 -52691 -294422
15713 -294422 39796 -301683 -128436 74553 -118860 41460 -131519 150000 17895 -231379
15702 -122993 -98590 -110629 127776 -60463 -217610 49384 56125 -218140 -125307 -323578 -224387
15691 -224387 -99780 95797 76719 -237155 -185107 -78597 115324 -13964 -55546 19823 44565
15680 44565 313255 35639 -351138 1943 320619 314008 63707 -106893 169089 145534 -215998
15668 -307722 96781 -377813 22268 -238039 217735 -193192 99756 -43611 -72976 99208 50499
15657E0499M2295a98451b3253k4738A0134b43179j9110M5905A05560a62941A48417
15645a4768q3303A15009a95591K9963b7032G004h8750L6678k0796B90053b28950
15633H0437b28605I5301J16930C4832J86245a23451l10362a94842k26936a69504
15622c8468I0246e29918K49082N3730d2589A2821J78552J52527D6338J18839f1046
15610A73875a1641j94779q1959G418C418J57942b72409P6686L3688g3423a1249
15598A12271d1713j40476d0786j98080J03901C8050a36161B5558O4056B8255K8927
15587E7182b34221k30532A26622m153f2141B7612J65615B918f3718A05180m2265
15576F2915N398e8755C29597A464c38473e2213k31715B02164r9804J99483b23780
$$ plain form
15657 50499 92794 -198451 -23253 -47991 10134 -243179 -262289 -216384 105560 -162941 148417
15645 -14768 -98071 115009 -195591 -165628 -27032 7004 -88750 -52072 -72868 290053 -228950
15633 80437 -228605 95301 212231 34832 221077 -123451 -433813 -194842 -421778 -169504
15622 -38468 90246 -529918 -280836 -227106 -42589 12821 191373 343900 46338 165177 -61046
15610 173875 -11641 -206420 -288379 7418 3418 161360 -272409 -195723 -162035 -73423 -11249
15598 112271 -41713 -182189 -40786 -238866 -134965 38050 -136161 25558 89614 28255 57182
15587 57182 -234221 -464753 126622 122469 -62141 27612 193227 2918 -63718 105180 62915
15576 62915 68313 -58755 329597 1464 -338473 -52213 -283928 202164 102360 301843 -223780
15564A5603c91570B38660c99387a06198d7174B9773R4037a67336B65299a60141
15553G11g88B00852p8827a2140j45082P2077B5633J27272a45999b7396A81130
15541A23714N0302a81836p238A37037b46657B51249D7348c5011j06298e7693j5238
15530g2931A04101a10071k51646d241m927B54396F8800Q6938P587B8219a15290
15518G7097k0632J82933b37080f2066J7563C6758b04367a2317H6853M9131a69858
15506b10753A29027C3268a69813o5527d3606B00488c8551C13260N6432j52940
15496B16752b23075A40303h2308A48616h6625m9841d9377E9404a59180I507a02762
15484A79314g1442j36569h7432A61096F5415c909l2720I7359K2395a38232I3508
$$ plain form
15564 15603 -391570 238660 -399387 -106198 -47174 29773 123810 -167336 265299 -160141
15553 711 -788 200852 122025 -12140 -157222 -85145 25633 152905 -145999 -27396 181130
15541 123714 174016 -181836 -189074 137037 -246657 251249 47348 -35011 -141309 -57693 -72931
15530 -72931 104101 -110071 -361717 -4241 -9168 254396 68800 155738 163325 28219 -115290
15518 77097 56465 239398 -237080 -62066 -44503 36758 -204367 -12317 86853 135984 -169858
15506 -210753 129027 33268 -169813 -235340 -43606 200488 -38551 313260 369692 216752
15496 216752 -223075 140303 -82308 148616 -86625 -136466 -49377 59404 -159180 9507 -102762
15484 179314 -71442 -208011 -87432 161096 65415 -3909 -36629 97359 119754 -138232 93508
15472B60254c03327B42361a01471G9901d0040B8443P1047C249f1491j05142j1904
15461a78537c2235r1180d1310B7712G114J24156g3660q3270c663B0026c41895
15449b25250B08532c53992c2602j5858C7817J5968G886K90775a53015A15098a70903
15437A66648a59185o4520A22949b4526C60933A32848J01293j06767d8416q0358
15427a28774j15110L9558C28731j09400p8883k2792b3660A78776l423f9779A83219
15415B60918f8547q7997B4664a72235P3655G2631b6828j3848l2805p6801f7719
15403B13622d48618a84488G5472a83044I8528K5271P3222c5968k85236P3566C47110
15391D9546o142b14142D7413K73701G0882M001K4583f2941A57663a76673B47679
$$ plain form
15472 260254 -303327 242361 -101471 79901 -40040 28443 99490 3249 -61491 -166633 -178537
15461 -178537 -32235 -123415 -41310 27712 7114 131270 -73660 -156930 -3663 20026 -341895
15449 -225250 208532 -353992 -32602 -48460 37817 53785 7886 298661 -153015 115098 -170903
15437 166648 -159185 -223705 122949 -24526 360933 132848 234141 127374 -48416 -128774
15427 -128774 -243884 -204326 328731 219331 140448 117656 -23660 178776 175353 -69779 183219
15415 260918 -68547 -156544 24664 -172235 -98580 72631 -26828 -40676 -73481 -150282 -67719
15403 213622 -448618 -184488 75472 -183044 98528 123799 197021 -35968 -321204 -247638 347110
15391 49546 43404 -214142 47413 321114 70882 74883 99466 -62941 157663 -176673 247679
15379a1743E5753K2251c40633a52408J1999o0064C9573K36239C0814d6866J3659
15368c3207G7779a98726i1938A94135a21489H7424R2263c7458B07739B3656d43861
15356B20375m849F8456a07788M1756D25476A31870A658a48789m3711B6433L3842
15345F0275a03669E5160R7708N2728C1334K80334A5849J86290H5900b46510H2685
15333A4636J58751a01745K1458G5932K02094j34684d3887C089a0528o4500C90781
15321A2563a72541f1922A29459C3068A0134c37578J56663L8177A31862e5345F0323
15309b1321o6329m0517b725k6381E0707J10097a5194A16989M32592j73172j71683
15298B04726J82798b37090j01651L3429A33104K1986p2775L44344B05842n4276
$$ plain form
15379 -11743 55753 78004 -340633 -152408 -140409 -200473 39573 275812 30814 -46866 -33207
15368 -33207 77779 -198726 -91938 194135 -121489 87424 179687 -37458 207739 23656 -443861
15356 220375 215526 68456 -107788 -66032 425476 131870 1658 -148789 -192500 26433 60275
15345 60275 -103669 55160 152868 205596 31334 311668 15849 202139 85900 -246510 82685
15333 14636 173387 -101745 -80287 75932 278026 143342 -43887 3089 -10528 -75028 390781
15321 12563 -172541 -61922 129459 33068 10134 -337578 -180915 -142738 131862 -55345 60323
15309 -21321 -87650 -128167 -2725 -29106 50707 160804 -15194 116989 549581 376409 204726
15298 204726 387524 -237090 -338741 -305312 133104 155090 82315 426659 205842 151566
15288A51566a4250j41776P1111B10502I7741K21227o7791a76428A94330p0882
15278A23448b05062a1189A89111P2651M4694j27088b77412R4915j4791A52851
15267d02551c5557I6595a46908I1025L20907a00661K9827j3724H9990J6154B8948
15255A85538b67879B70278L8700f7120F4220a94067B4592P2503m6182d4536j12065
15244a56601C47717B9238J97284q2039L7365d870A14526l9331K23868A19306D0723
15232G7284J07374o3073R5595b82157C9322e5142B21517A02305i0422b2395G3979
15220A17581a03718b1762a930j8008m8524E6341B205g8366j27108A33057l4021
15209I9036f896D4045K05223c6404j62372H7704l6839f6608k40253C3771d7957
$$ plain form
15288 151566 -14250 -156026 -84915 210502 97741 318968 251177 -176428 194330 123448
15278 123448 -205062 -11189 189111 261762 306456 179368 -277412 -182497 -197288 152851
15267 -402551 -35557 96595 -146908 91025 411932 -100661 -70834 -84558 89990 106144 28948
15255 185538 -267879 270278 308978 -67120 64220 -194067 24592 97095 50913 -44536 -156601
15244 -156601 347717 29238 226522 144483 181848 -4870 114526 75195 299063 119306 40723
15232 77284 184658 121585 217180 -282157 39322 -55142 221517 102305 -90422 -22395 73979
15220 117581 -103718 -21762 -1930 -19938 -68462 56341 2205 -78366 -205474 133057 99036
15209 99036 -6896 44045 249268 -36404 -198776 87704 50865 -66608 -306861 33771 -47957
15197a29184j8387G5155Q1538h4493R920B59860d7449E112e3608E8262k315e7226
15184i1401B28362d9934A89151j0671b34685F8883d3558j5876C02798e267A39450
15172E8335K21125J05734A08807B6755R9994J48895a05207J9328E0322J0060L76108
15161D36490C8141K48839a07991D62772a51397r2377C7343K25101J07644j01822
15151B68266q880l8276b8254A18785b2969l5531n1090A35063n8236b1890H8515
15139b27011B56627B7655J399L39397d6044C34814a56657j3205A92476n7734d7725
15127B93025p7208p3271I218J22923J56654r1855a4675A41888l6709b20066I5092
15115F7384K70890O5966j82901l6846F3380J29550a63299G2197J6446P5955L32190
$$ plain form
15197 -129184 -147571 75155 156693 -84493 -74573 259860 -47449 5112 -53608 58262 55947 -57226
15184 -91401 228362 -49934 189151 178480 -234685 68883 -43558 -59434 302798 -5267 139450
15172 58335 279460 385194 108807 26755 126749 275644 -105207 -85879 50322 60382 436490
15161 436490 38141 286980 -107991 462772 -151397 -243774 37343 262444 370088 268266
15151 268266 259386 221110 -28254 118785 -22969 -58500 -109590 135063 76827 -21890 88515
15139 -227011 256627 27655 29054 368451 -46044 334814 -156657 -169862 192476 134742 -47725
15127 293025 215817 142546 9218 132141 288795 196940 -14675 141888 105179 -220066 95092
15115 67384 338274 404240 221339 184493 63380 192930 -163299 72197 88643 164598 496788
15104D96788B27251c0248C09397r3398K75638a69540H2293a5166A200b4910j0949
15093c5859B66356a06588e1099C66366b7952C19094a57673k7727I6436J90403
15083B86839a34775A49215b3948A43671J28760B3916K06297m1857o6861a45018
15072G4355i5457C32447A18746i4677B11875m6189h5467A95136n4001K27746H0583
15060a1909A85562D3825Q0885E0182J34425J12023D2994L35084F4454a83616D4616
15048D03950A86581K44705j71819N5925b8938B18549c1755H5002K66565A42666
15037E26701d8575B2491b24108B02410m113Q4073j25558K01917n9384J49762B20530
15025B78978R1148J72141A78485k0028K84429A89505Q7542C3795a31654D63825
$$ plain form
15104 496788 227251 -30248 309397 215999 491637 -169540 82293 -15166 1200 -24910 -35859
15093 -35859 266356 -106588 -51099 366366 -27952 319094 -157673 -185400 96436 286839
15083 286839 -134775 149215 -23948 143671 272431 23916 230213 188356 121495 -145018
15072 74355 -95457 332447 118746 -94677 211875 165686 -85467 195136 141135 368881 80583
15060 -11909 185562 43825 124710 50182 184607 296630 42994 378078 64454 -183616 44616
15048 403950 186581 431286 259467 315392 -28938 218549 -31755 85002 351567 142666
15037 526701 -48575 22491 -224108 202410 198297 282370 156812 358729 299345 449107 220530
15025 278978 370126 542267 178485 158457 442886 189505 277047 33795 -131654 463825
15014C0297L27481J40447J3899B17762m1667P3218p5946k64A0255J09977q787
15003A11445M13134F6380J09699K74815I9589b8784B74747k3197I4124J06550
14993B00674l7703L2977J30289M7089J12863p4277A26140E5723J20342L7745l9273
14982A74537J66770J14026J73l6428j0214B01063p4676h917j19582I3273K74020
14971C67293j2618G5750P9517L32702B04679K0176M7864J78447j29904J45330
14961D66592j9152p0057O811A89202K53000R0161n5374B28112L32327k20888K3966
14950C63517j4488j9104n334n3916A02366R7881K00425j62696G0238O64717C10601
14938F9245J22364K20574K4992J7387j87494k3315P9518A22262J69485J34733
$$ plain form
15014 30297 357778 498225 512124 217762 176095 249313 173367 173103 10255 120232 111445
15003 111445 524579 66380 176079 450894 99589 -28784 274747 251550 94124 200674
14993 200674 162971 195948 326237 373326 486189 411912 126140 55723 176065 213810 174537
14982 174537 341307 455333 455506 419078 408864 201063 126387 -8917 -128499 93273 367293
14971 367293 354675 75750 155267 487969 204679 224855 272719 451166 321262 466592
14961 466592 447440 377383 384194 189202 442202 532363 476989 228112 560439 339551 363517
14950 363517 349029 329925 324591 270675 102366 200247 400672 237976 70238 734955 310601
14938 69245 191609 412183 437175 454562 267068 243753 323271 122262 291747 426480
14928D26480n4017j00967L00966b2266B03689J37800J37228j61720L6195R6456
14918D49648B19447L12222j77986q8314M84653l39486L9278J43426R5241k23977
14908D64504J79556O6116j63827k24226K38190P2099j95282L68956B71886K41870
14898E13756L20349j80295k4712k70444j18901L44881j40332p3323j31210K28283
14888D68052j62016J67117A56179J66098Q608O3434M3290l6098M8650n5212q5579
14877C09370J06998l1027R8447j1525j95951J23170j49403K56298j61252P854
14867C52979j7313K04254k18266J69789j66066K78752M0832j98141G3978O23962
14857F97940j54284l6872R2099o504J24806k48227j59070j26125K24555o3179
$$ plain form
14928 426480 372463 271496 572462 -22266 203689 341489 478717 316997 353192 449648
14918 449648 219447 531669 353683 265369 750022 410536 449814 593240 688481 464504
14908 464504 644060 710176 546349 322123 560313 632412 437130 806086 271886 513756
14898 513756 834105 653810 629098 358654 239753 584634 444302 370979 239769 468052
14888 468052 306036 473153 156179 322277 330885 394319 437609 401511 450161 394949 309370
14877 309370 416368 385341 483788 472263 276312 399482 250079 506377 345125 352979
14867 352979 335666 539920 321654 491443 325377 604129 644961 446820 73978 697940
14857 697940 543656 506784 598883 592379 717185 468958 309888 183763 408318 345139
14847C45139L48500B68131L85028j55789R3203J46248k14441b1356F02622k23201
14837C79421L7838N8040n9864K30681J15844l11966F9488M11901k08008L18992
14827E92373k6386q0678M1637B58565L30072L4499j66557j15557L51217k04182
14817D88057J47889l2496J34466N3372p2505k77499J03310j04103J39774J44277
14807G24542o8943B81682K74643R570K41719N53l90858M2477r1660J54246L562
14796E25934K54331B3587N89693k11293M1365o8429L87208m5608l14320J87084
14786E89287B53748K21763j8284M4722k0362J81336j13163K07927n5369j18897
14776E83421K57974l93999J41749k7327k76319L89238k72807M12139k74919l6160
$$ plain form
14847 345139 693639 268131 653159 497370 590573 736821 522380 -21356 602622 379421
14837 379421 417259 475299 415435 646116 761960 449994 69488 481389 273381 592373
14827 592373 565987 485309 526946 258565 588637 623136 456579 341022 692239 488057
14817 488057 635946 603450 737916 791288 718783 441284 544594 440491 580265 724542
14807 724542 655599 281682 556325 565895 807614 808167 417309 459786 368126 522372 525934
14796 525934 780265 23587 613280 401987 443352 374923 762131 716523 402203 589287
14786 589287 253748 475511 457227 501949 481587 662923 549760 757687 702318 583421
14776 583421 841395 447396 589145 561818 285499 674737 401930 814069 539150 502990
14766E02990K73221L4259k16482n7793N434M00630l85675p344j60037O03645B93002
14754G27415j5104n4238j0433o4356P815l387r2815M7516R9587K6042k80023K64829
14742F52848L13577l38985J25259C45676K15972J63344C38592K78726K23496k57982
14732E82832J53663J54462J02618j92562l73119J01683O15325E42703K47274K3400
14722H13377N3179j39698n8740m8744j21449K84736l32J63511J07502j15976q8811
14711H48555k99822L4129M03571m8182J39533j09108k16598J9527K41908P6336
14701A089849k90739o2683L32803k83975K0429K02061l55500J58491j41660J92215
14691H61291J6700J91217K41448m41175K46698k41788J27897K8285o9976l1042
$$ plain form
14766 502990 776211 810470 593988 536195 541629 942259 556584 549240 389203 992848 293002
14754 727415 712311 658073 647640 583284 591099 587712 494897 542413 642000 668042 388019 652848
14742 652848 966425 627440 752699 345676 561648 724992 338592 617318 840814 582832
14732 582832 736495 890957 993575 801013 427894 529577 1144902 542703 789977 813377
14722 813377 866556 726858 668118 619374 497925 782661 782329 945840 1053342 937366 848555
14711 848555 548733 582862 986433 938251 1077784 968676 752078 771605 1013513 1089849
14701 1089849 799110 736427 1069230 785255 805684 1007745 652245 810736 669076 861291
14691 861291 877991 1069208 1310656 869481 1116179 874391 1002288 1030573 960597 929555
14681I29555q287J93804q0156l59250M59694J34343j99476j14854k26612K80556
14671A009317K5147r8545o9546K18634n06816Q35051l75433j59925Q9100n7657
14661I09327K81237j24741J20007l61761K37653M2497j05466K58817n4562k44767
14651I58241K56935j97458K69421L7865j32323o7930N3470l04387J50163j15696
14641I08301M59032k15376k6219J74101l06219J18773J86022l43036M09147q2365
14631A282161j99379J60609j80392L39712J96877m49044J40925j09241Q4451J00573
14621A367252J66273l09274J03712J16389J19894k37117J21188j12236L39502
14612A675583l06197j51363P5183N84577n39265j52095N4661J56064J45746P8619
$$ plain form
14681 929555 921268 1115072 1034916 675666 1135360 1269703 1070227 955373 728761 1009317
14671 1009317 1034464 935919 866373 1085007 578191 1413242 1037809 877884 966984 909327
14661 909327 1190564 1065823 1185830 824069 1061722 1104219 998753 1257570 1203008 958241
14651 958241 1215176 1017718 1287139 1325004 1192681 1124751 1178221 873834 1023997 908301
14641 908301 1367333 1151957 1125738 1299839 993620 1112393 1298415 955379 1364526 1282161
14631 1282161 1082782 1243391 1062999 1402711 1599588 1150544 1291469 1182228 1266679 1367252
14621 1367252 1533525 1224251 1327963 1444352 1564246 1327129 1448317 1336081 1675583
14612 1675583 1369386 1218023 1293206 1877783 1338518 1186423 1241084 1397148 1542894 1621513
14602A621513j68317k4617P1195j0630k3545L63313l27751K3050J17303K79600
14592A921114k60141j76585j3964M94809k71318K16344q0960l9682J66133j62451
14582A793299j48681Q1051K83506m1262k7324P2959Q4726l05262L60936j5935
14572B138013l81204M08093j56826j43411K35958j12184J0620j82395K52653K10133
14562B279450m28895N14332J02210l40129j9171K75137J07281J80868p7240J77608
14552B771451l19745J99689K51987K2518l42515K61713J26457j83544P09721j2317
14542C485415M11357J75483M05772j3371R97999N99408J059828J343786K523208
14533A0988885L217941M716688M374228j357683n888986m891430k918382k288656
$$ plain form
14602 1621513 1453196 1428579 1499774 1489144 1465599 1828912 1501161 1524211 1641514 1921114
14592 1921114 1660973 1484388 1470424 1965233 1693915 1910259 1829299 1789617 1955750 1793299
14582 1793299 1644618 1725669 2009175 1967913 1940589 2013548 2098274 1793012 2153948 2138013
14572 2138013 1756809 2164902 2008076 1864665 2100623 1988439 1999059 1816664 2069317 2279450
14562 2279450 1850555 2364887 2467097 2126968 2107797 2382934 2490215 2671083 2593843 2771451
14552 2771451 2451706 2651395 2903382 2925900 2583385 2845098 2971555 2788011 3497732 3485415
14542 3485415 3896772 4072255 4478027 4464656 5462655 6062063 7121891 8465677 10988885
14533 10988885 14206826 18923514 23297742 21940059 16051073 11159643 8241261 5952605
14525E952605j247919q38634j12902n25751l97713K20229l98211J42829m1270
14516B753263l2488j70416j7403J35533j16634K22265j81447J59001R7762k15369
14506B634067J57230q9863J28506J35334J707j53990R8343K65543j51551n080
14496C020246j04720K82599m8894k11914K43711m3301J08926j76236N17494P1574
14486C659485j80845J75061K02219k28481R8912m53232M84686l68311P17384m66331
14476C640547L97734k65152L41109j28783j07635L12551k64258K1039L10747J51415
14466D409314J09205l07589J35250O7507K39494j13006j81518J02944K92294k45263
14456D508632J72342N12476m76871j34964M52536j1271K0915n0147K65597J73168
$$ plain form
14525 5952605 4704686 3866052 3753150 3227399 2829686 3049915 2651704 2794533 2753263
14516 2753263 2720775 2550359 2532956 2668489 2551855 2774120 2592673 2751674 2849436 2634067
14506 2634067 2791297 2701434 2829940 2965274 2966981 2812991 2911334 3176877 3025326 3020246
14496 3020246 2915526 3198125 3149231 2937317 3181028 3137727 3246653 3070417 3587911 3659485
14486 3659485 3478640 3653701 3855920 3627439 3726351 3273119 3757805 3389494 4106878 3640547
14476 3640547 4038281 3773129 4114238 3985455 3877820 4190371 3926113 3947152 4257899 4409314
14466 4409314 4518519 4210930 4346180 4413687 4653181 4540175 4358657 4461601 4753895 4508632
14456 4508632 4680974 5193450 4716579 4581615 5034151 5022880 5043795 4993648 5259245 5432413
14446E432413l21675M87822j19272N4231p7508M66551k35673j09255J75597k38373
14436E514858M36839K06786O2228j3413k93195N33782j92310K7121K56870j7577
14426F521989K88977j03067J74104J97793k51467N800N52282k08598K94154J32495
14416G604462j30984L36916n5813K99796P9268j19956M61638O162J43201j55385
14406H469305N5368N20897j6534J72247L74646j11266K6529K42339K67542l18632
14396I682441Q43273m57520O65839j26957J10776Q3888K33639J22645M37037J35806
14386A1730867J17851l1612K96068L27290r8794M5123P69048j19214P36805J06881
14376A3880313k18250N03814L32725J6374K11446J26884J89631P82963K56614
$$ plain form
14446 5432413 5110738 5598560 5479288 5533519 5456011 5922562 5686889 5577634 5753231 5514858
14436 5514858 5951697 6158483 6220711 6207298 5914103 6447885 6255575 6282696 6539566 6521989
14426 6521989 6810966 6707899 6882003 7079796 6828329 6834129 7386411 7177813 7471967 7604462
14416 7604462 7473478 7810394 7754581 8054377 8133645 8013689 8475327 8481489 8624690 8469305
14406 8469305 8524673 9045570 9029036 9201283 9575929 9464663 9491192 9733531 10001073 9682441
14396 9682441 10525714 10068194 10734033 10607076 10717852 10801740 11035379 11158024 11595061 11730867
14386 11730867 11848718 11817106 12113174 12440464 12341670 12386793 13155841 13036627 13773432 13880313
14376 13880313 13662063 14165877 14498602 14514976 14726422 14853306 15042937 15825900 16082514
14367A6082514J85704L46864J96210O03950L3553P7988O50965M70370J41425K99561
14357A9089104N11488N37491M22105L45832L53019M07863M41497N96037L44568
14348B3049004O07430N47741L32018Q01697K13543N88810M33951R26478m4066
14339B7456606J475263L09558O45742P56900O77026P25139P05587J179543Q32658
14330C4764022J045280O07381R36052J262869R14717J199256J266460R19006J142126
14321D4057169J217455J649925J077121J611954J520610J336415J436707J953334
14313E5860690J379927K004378K050103J842997K152756J979130K671151J963334
14305G1904466K651326K376874L208717K898030K494120L423860L260966L390325
$$ plain form
14367 16082514 16268218 16615082 16811292 17415242 17448795 17526783 18177748 18648118 18789543 19089104
14357 19089104 19600592 20138083 20560188 20906020 21259039 21666902 22108399 22704436 23049004
14348 23049004 23656434 24204175 24536193 25337890 25551433 26140243 26574194 27500672 27456606
14339 27456606 28931869 29241427 29887169 30644069 31321095 32046234 32751821 33931364 34764022
14330 34764022 35809302 36416683 37352735 38615604 39530321 40729577 41996037 42915043 44057169
14321 44057169 45274624 46924549 48001670 49613624 51134234 52470649 53907356 55860690
14313 55860690 57240617 59244995 61295098 63138095 65290851 67269981 69941132 71904466
14305 71904466 74555792 76932666 80141383 83039413 85533533 88957393 92218359 95608684
14297I5608684L557574M089346L620776M291782M425456N144952M997497N058225
14289A30794292N593327N969853O195173O526990O798593P015543Q116810P606092
14281A84616673Q909214Q688834R611198R800247J0223067J0931724J1183439
14274B53964396J1499243J2285054J2589747J2779441J3160030J3282607J3132755
14267C42693273J2780790J2871584J2139031J1399587J0780237R702627Q657561
14260D21024690P682619O508697M253141K279888P57820m56175l149221n311936
14252D33589523n913086o478361p922070r305360j0318615j1636269j2320042
14245C69695720j2550955j3376291j3393511j3130307j3207266j3616528j3019362
$$ plain form
14297 95608684 99166258 103255604 106876380 111168162 115593618 120738570 125736067 130794292
14289 130794292 136387619 142357472 148552645 155079635 161878228 168893771 177010581 184616673
14281 184616673 193525887 202214721 211825919 221626166 231849233 242780957 253964396
14274 253964396 265463639 277748693 290338440 303117881 316277911 329560518 342693273
14267 342693273 355474063 368345647 380484678 391884265 402664502 412367129 421024690
14260 421024690 428707309 435216006 439469147 441749035 442506855 442050680 438901459 433589523
14252 433589523 427676437 421198076 413276006 403970646 393652031 382015762 369695720
14245 369695720 357144765 343768474 330374963 317244656 304037390 290420862 277401500
14238B77401500j3322370j2833991j2472640j1710875j1311037j0595655j0001817
14231A95153115r567872q865827q642068p797525p451178o907231o729035o013324
14223A33179055n858787n268864n635219m980411m318208m247607m189773l926876
14215I4753310l801889l508283l321671k929342l461036k580275k687668k864224
14207F9598922k329531k348991k076225k115731k041517k112769j312898j950568
14199E3310692j626537j708179j092456k096666j076389j462553q54344j136404
14191D2257164j401851j228376o37383j309063j105943j107694l46073j217297
14183C3903484r99672n43803j128298r11956n51199n36155p53591p71581n32968
$$ plain form
14238 277401500 264079130 251245139 238772499 227061624 215750587 205154932 195153115
14231 195153115 185585243 176719416 168077348 160279823 152828645 145921414 139192379 133179055
14223 133179055 127320268 122051404 116416185 111435774 107117566 102869959 98680186 94753310
14215 94753310 90951421 87443138 84121467 81192125 77731089 75150814 72463146 69598922
14207 69598922 67269391 64920400 62844175 60728444 58686927 56574158 55261260 53310692
14199 53310692 51684155 49975976 48883520 46786854 45710465 44247912 43393568 42257164
14191 42257164 40855313 39626937 38989554 37680491 36574548 35466854 35120781 33903484
14183 33903484 32903812 32360009 31231711 30319755 29768556 29232401 28478810 27707229 27174261
14174B7174261o26121j054724k16658r03501l24873j81668j148192k73499o38789
14165B1806236n42180k29254o25742o51095j9589m97427l25152k29343n08755
14156A8177699m8869r01995l14236P727n40766k22507j11194m05726l06488j60276
14146A5173369l20861k89107k05998l17623k86259J23378o31448j17421r3264
14137A3034766k25062m64237l2588P6818p30897J40170j86574j51500n181o56194
14127A0799521P4233j82088j55491j56788l34377K21464k67211m79458J76063
14118I695868l45735L23891J9289p29896p756p1208j33228k48602l05921J91452
14108H388154k10643Q6866n08217J67266k84660J21747j58720j62517j10362P2419
$$ plain form
14174 27174261 26548140 25493416 25276758 24373257 24048384 23866716 22718524 22445025 21806236
14165 21806236 21264056 21034802 20409060 19757965 19738376 19240949 18915797 18686454 18177699
14156 18177699 18128830 17226835 16912599 16920326 16379560 16157053 16045859 15640133 15333645 15173369
14146 15173369 14852508 14563401 14357403 14039780 13753521 13876899 13245451 13128030 13034766
14137 13034766 12809704 12345467 12312879 12389697 11658800 11798970 11612396 11460896 11455715 10799521
14127 10799521 10873754 10691666 10536175 10379387 10045010 10266474 9999263 9519805 9695868
14118 9695868 9350133 9674024 9693313 8963417 8955661 8884453 8751225 8502623 8196702 8388154
14108 8388154 8177511 8264377 7756160 7923426 7638766 7760513 7601793 7439276 7328914 7401333
14098G401333k25241n2698K10083m60028k6556L2715j62463j86782k1943l09671
14088F198749J4810j02445n616R5313k17640K21598n98278J90506K07451k00603
14078E803845p6365l67752K18300j65381R8412j35622J16328l6661p3222r6679
14068E285203k66635O6553N0809J27088k53425n32171M55108k69191L7893o12226
14058D089006N36712k1394k56709J49339O930m59121K86598K0377k05904r1627
14048D054207j00501L42414r9596j02752k29480K60010j40884J494k72545m5677
14038C666690J69586r1494J38431j7975n46004M15494l19824J63056o1105O4303
14028C581158k09736k1955j97177L86256j45407m2101k18832L53983l07828L67762
$$ plain form
14098 7401333 7176092 7123394 7333477 6873449 6846893 6879608 6717145 6530363 6508420 6198749
14088 6198749 6213559 6111114 6105498 6200811 5983171 6204769 5606491 5796997 6004448 5803845
14078 5803845 5727480 5359728 5578028 5412647 5511059 5375437 5491765 5455104 5381882 5285203
14068 5285203 5018568 5085121 5135930 5263018 5009593 4477422 4932530 4663339 4701232 4089006
14058 4089006 4625718 4604324 4347615 4496954 4503884 4044763 4331361 4351738 4145834 4054207
14048 4054207 3953706 4296120 4196524 4093772 3864292 4124302 3983418 3984912 3712367 3666690
14038 3666690 3836276 3744782 3883213 3865238 3319234 3734728 3414904 3577960 3516855 3581158
14028 3581158 3371422 3349467 3152290 3538546 3393139 3351038 3132206 3486189 3178361 3546123
14018C546123j48970j1708j44310J33162o4833j45971k15163K37768n00038K61489
14008B947549m10153M26117m5862o4231k69743L74638m53997k2205K27138k18172
13998B491079J61227J93106k69112K36157k68960J21050K3364J20531N7856k38370
13988B627928O2944k92199R1502L7701O6274M44944j19440P70L900N60772P8206
13977C563302L62477R45894J126551K197230K830682N130540N159189J254888
13969B2570753m310343m495683l454368k049532j739118j169656n49810l79976
13961D422267n54660k32023k00273j87556j68232J7515l58436m9094Q676m39639
13951B258545L46278k07293j36835P6439K12723l65717n4132K61557j41551o2875
$$ plain form
14018 3546123 3397153 3385445 3241135 3374297 3309464 3163493 2948330 3186098 2686060 2947549
14008 2947549 2537396 2963513 2917651 2853420 2583677 2958315 2504318 2482113 2709251 2491079
13998 2491079 2652306 2845412 2576300 2812457 2543497 2664547 2687911 2808442 2866298 2627928
13988 2627928 2690872 2398673 2490175 2527876 2594150 3039094 2919654 2920424 2924324 3485096 3563302
13977 3563302 3925779 4871673 5998224 8195454 11026136 16156676 21315865 22570753
13969 22570753 18260410 13764727 10310359 8260827 6521709 5352053 4802243 4422267
13961 4422267 3867607 3635584 3435311 3247755 3079523 3097038 2738602 2689508 2698184 2258545
13951 2258545 2604823 2397530 2260695 2337134 2549857 2184140 2130008 2391565 2250014 2187139
13941B187139K5757k35447N07036l64154L5234j163r459l0077m0434k81389j3826
13930A779217M73202l35119K40827l91181R8613j9018m9169K74816L9065m19153
13920A692100K16088L1538k80738m4580J33698L01141m6349n41075K62520Q2841
13910A807184k92430J55223j00709J19405J74034l03548J6254L820l4730J55488
13900A699991k17331J39298k06284J06263j73173J62507O3925l34075J82860K6909
13890A450890K08999j17419o7994K2576O1163k63436m2645J07513p7583q4634
13880A197430R8093o0293J18384J59880l77433L67436Q9692p7242l70846J64848
13870A309949J12322J07959o0346n7166k16342L0204O6581k91188L73910l55604
$$ plain form
13941 2187139 2212896 1977449 2484485 2120331 2155565 2154402 2144943 2114866 2074432 1793043 1779217
13930 1779217 2252419 1917300 2158127 1766946 1865559 1846541 1797372 2072188 2111253 1692100
13920 1692100 1908188 1939726 1658988 1614408 1748106 2049247 2002898 1461823 1724343 1807184
13910 1807184 1514754 1669977 1569268 1688673 1862707 1559159 1575413 1579233 1544503 1699991
13900 1699991 1482660 1621958 1415674 1521937 1348764 1511271 1575196 1241121 1423981 1450890
13890 1450890 1659889 1542470 1474476 1497052 1558215 1294779 1252134 1359647 1282064 1197430
13880 1197430 1295523 1235230 1353614 1513494 1136061 1503497 1593189 1515947 1145101 1309949
13870 1309949 1422271 1530230 1469884 1412718 1196376 1226580 1293161 1001973 1375883 1020279
13860A020279J07486L34949k01592K78820n84018R6803n0720J48947N4823J08506
13850A314283m34895M04709k64022K93191J38182j80752M23194m67198n8560k23146
13840I44986J08159l070j92963j7968J88602J61858l56154L61036l07678L41434
13830A228242j71060j15687K77585j63698l9063j4426k1839M0811P0652k97528
13820G93989J99623k4171l3712K56505m62381K60036P6910m9572j1716k2090M2032
13809A025453j77354j52435j50706K01224J01758J29362J53227m15627p03o757
13799G07442P7526K02431k88450M4473N7837M40922k68089j7599l31982K02924
13789H27435k23189L96988J44450l24707k79250L98649n3437K0373J14635k41178
$$ plain form
13860 1020279 1127765 1462714 1261122 1539942 955924 1052727 1002007 1150954 1205777 1314283
13850 1314283 879388 1284097 1020075 1313266 1451448 1270696 1693890 1226692 1168132 944986
13840 944986 1053145 1050075 857112 839144 1027746 1189604 833450 1194486 886808 1228242
13830 1228242 1057182 941495 1219080 1055382 1016319 1001893 980054 1020865 1091517 793989
13820 793989 993612 969441 935729 1192234 729853 989889 1066799 1017227 1005511 983421 1025453
13809 1025453 848099 695664 544958 746182 847940 977302 1130529 714902 714199 707442
13799 707442 784968 987399 698949 743422 801259 1242181 974092 956493 624511 827435
13789 827435 604246 1001234 1145684 820977 541727 940376 886939 907312 1021947 780769
13779G80769j14411R4631Q0013m286J02817k12399k8016J44496j05728L34879
13769A072765l32036J08049C46153L23806n8529J59218j29986j38159L04342k11441
13759E95404J53238M1629J04405k08688M2378J35089k55315L26482N9240j76461
13749H17401D05562Q01949E86077K19171j10205j27935K09460o5923K0083K63063
13739I93791m00030j33280K74578j27104n2047K96084k00583L58596j4532l20188
13729F75285M9652j59841M8406L04095j73164q8968j8309k22794M93132D42469
13718G20564K55705l90743J79131k14125K20256j63521k01362M97074k79923K73525
13708H96581k70325j06064J58903n0396M6961B60276P9465J21074J65953Q5541
$$ plain form
13779 780769 666358 760989 841002 836716 939533 727134 699118 843614 737886 1072765
13769 1072765 740729 848778 346153 669959 611430 770648 640662 502503 806845 595404
13759 595404 748642 790271 894676 685988 728366 863455 608140 934622 993862 817401
13749 817401 405562 1207511 586077 805248 695043 567108 776568 710645 730728 993791
13739 993791 593761 460481 735059 607955 555908 851992 651409 1010005 995473 675285
13729 675285 724937 565096 613502 917597 744433 655465 637156 414362 907494 442469
13718 720564 976269 585526 764657 550532 770788 607267 405905 902979 623056 896581
13708 896581 626256 520192 679095 628699 675660 260276 339741 460815 626768 712309
13698G12309q6333J01220j91286J73712k08549Q0742q0132Q4164j08311Q2206
13688E59742j09556L64743l16761N3031j25336N14022l32116l03094J36203j79471
13678B61407J89140j23943O69962D34166K00371o475k27216J89119O4838B62781
13667F64335J46987C26350O68976k07945j55398l08049J61196k9766q0147J48318
13657E23535r3815j3808l4569M1462K839m6102M05958m6579J3343l69416J66600
13646E49448J46220A90663M70911j12111q7303J98897k47566R5813J41078k19307
13636D31075j00533P5312q7646Q2030A76136M56248B81429K31390J4978k7424
13626E00373j29990L52032M774l24910m191n0327K7162j36216J41924L5729J6382
$$ plain form
13698 712309 625976 727196 535910 709622 501073 581815 501683 585847 477536 559742
13688 559742 450186 814929 498168 551199 425863 939885 607769 304675 440878 261407
13678 261407 450547 326604 996566 434166 634537 628062 400846 589965 654803 262781
13667 664335 811322 326350 995326 787381 631983 323934 485130 455364 375217 523535
13657 523535 429720 415912 381343 422805 425644 379542 785500 738921 752264 382848 549448
13646 549448 695668 190663 661574 549463 462160 661057 413491 509304 650382 431075
13636 431075 330542 405854 318208 400238 176136 632384 281429 512819 527797 500373
13626 500373 370383 722415 727189 402279 398088 347761 374923 238707 380631 416360 432742
13615D32742r4232K31525k70189M8302K02414A59809N5814J38951K78796m6914
13605E86456B58592J66849j25374L0993K36267k06051J72654E2741N80140j24447
13595E08434n0103B04987K04383M1397j87100m823P3976j06648J12378K31713
13585E70263B60432M77333k15672j45178A65758P9202A17773L49434B21954Q5875
13575C07829J76490A51227L48281j94284O73K48377j00210B08407P5877K7691
13565C11975o0567L87415j52224j64993m4175F7068K55564J925J34127K14916
13555F73600B39128j11085J57078K97540j86350K04393j13181f939C81137n912
13545C75225K2792n0616A09187Q2448J46405L99279F4833j0396L10558j23275
$$ plain form
13615 432742 338510 570035 299846 348148 550562 159809 215623 354574 633370 586456
13605 586456 258592 425441 300067 331060 567327 361276 533930 52741 632881 508434
13595 508434 458331 204987 409370 450767 263667 258844 332820 226172 338550 570263
13585 570263 260432 737765 522093 376915 165758 244960 117773 467207 221954 307829
13575 307829 484319 151227 499508 305224 305897 554274 454064 208407 284284 311975
13565 311975 251408 638823 486599 321606 277431 67068 322632 324557 458684 673600
13555 673600 239128 128043 285121 582661 396311 600704 487523 -6939 381137 375225
13545 375225 398017 347401 109187 191635 338040 737319 64833 54437 364995 241720
13535B41720O0818R6610j74775K69L53495j30655l1365l037j28263J28531A44003
13523D15192j19823P6122l4233M35716l38470J20915A95996P9354A11092H486
13512A2367N6837J88622r4206l536b2761E70900k17336J41213A41188J33764p3572
13501B01380j1074Q2275K49009A42856K33737o4431l9096p4627K65319b04864
13490C57346H6776J27179K35830q2584N6338k09348Q4311l5332j18286K97599
13480D42483N0952a34065E01639A90377N7944q1415Q630J18144h7405B17112K43859
13469D60971N382A22097L42112j50629j28231O376N46529A63482J45989P9535
13459C89006j30676a20928C23485J76373j10220K73885c9047E11404j28575o7997
$$ plain form
13535 241720 302538 399148 224373 224642 578137 447482 416117 413080 284817 413348 144003
13523 415192 295369 371491 337258 772974 434504 555419 195996 275350 111092 8486
13512 12367 69204 257826 163620 160084 -22761 570900 353564 494777 141188 274952 201380
13501 201380 190306 272581 521590 142856 376593 312162 273066 198439 463758 -204864
13490 357346 86776 213955 449785 367201 423539 214191 298502 263170 144884 442483
13480 442483 493435 -134065 501639 190377 248321 166906 175536 293680 -87405 217112 460971
13469 460971 466353 122097 464209 313580 185349 191725 738254 163482 309471 389006
13459 389006 258330 -120928 323485 499858 389638 663523 -39047 511404 382829 314832
13449C14832n7687p7529B0670J71509J87168a33236f3831A08655j0699g6829G2784
13437C31563g5990a4680A1400J49814A1932N49667A79974L00778A80118J59154
13427C39272j33236p1471K39630m9707k59c1309A61594J95899j31767e2829C83783
13415C86398j67827K20757I7815a9279B19256K88611A48907L07878j70626l567
13405B82592L66510d6486A88220j0933M9524R628p4632J61423J11338A96629K78835
13394D75464k26782N8331j26029J72627j59242o6724P1411G9611k9796J27882
13384A77697N7617D9683K97796K9551A45966Q0719o4233j2575K72840J44530j74103
13373C93144A76286N6609J95896A21876K58196A36936J32934B2489e6102B85423
$$ plain form
13449 314832 257145 179616 20670 192179 379347 -133236 -63831 108655 97956 -76829 72784
13437 331563 -75990 -14680 11400 161214 11932 561599 179974 480752 180118 339272
13427 339272 206036 134565 374195 324488 324229 -31309 161594 357493 225726 -52829 383783
13415 386398 218571 439328 97815 -19279 219256 507867 148907 456785 286159 282592
13405 282592 649102 -46486 188220 177287 226811 236439 161807 323230 434568 196629 475464
13394 475464 248682 307013 180984 353611 194369 127645 199056 79611 49815 177697
13384 177697 235314 49683 347479 377030 145966 226685 162452 149877 422717 567247 393144
13373 393144 176286 232895 428791 121876 380072 136936 269870 22489 -56102 285423
13362A2658R3099K93625p8872k6997J31705M4049j36053A11401K6965R4669C4243
13350E38396B51382B2672K30796a3984A95679B5333a53696D05487r8364K0764
13340C27887A15366m1428J21583n5949a46568C38103i707B56303J02904c6321
13329C52275j36331J11904j63776J65874A33290K11041R6092j38542F6036L26795
13319C92831P496h418B27923G7537l3268K21871G6084M53263d5047A07945L89181
13308D97126r8623M1897j51369J71409i1041C94378M5171a70437B07369p0188
13298A37181K7058J321J9227a51198N2827A29217M5607P9560J49227A52847l9269
13287A13578J40834A1989L56773M5273r5491a46314I3619j2507N641J06658n874
$$ plain form
13362 12658 105757 399382 320510 293513 425218 469267 333214 111401 138366 233035 34243
13350 538396 251382 22672 253468 -13984 195679 25333 -153696 405487 307123 327887
13340 327887 115366 73938 195521 139572 -146568 338103 -9707 256303 359207 -36321
13329 352275 215944 327848 164072 329946 133290 344331 440423 301881 66036 392831
13319 392831 400327 -8418 227923 77537 44269 266140 76084 529347 -45047 107945 497126
13308 497126 398503 440400 289031 460440 -91041 394378 439549 -170437 207369 137181
13298 137181 164239 165560 184787 -151198 -98371 129217 174824 254384 403611 152847 113578
13287 113578 254412 11989 368762 414035 318544 -146314 93619 81112 86753 193411 187537
13276A87537b05568A88699q8954J3255N4121L4639o1799N8493r1101c3473h826
13264C4478J07258a02565A19905E5274c9043B55562a52321G9469p304c41966A59739
13252A10051B6840K53026A33908b6091j03971A79436G5445R2713K70865b2962
13241H7232D586M8462J53620d2600B6165K6522A5976L00205G2957L73774D4425
13229C00080j19388c6820A96619N93100A31806E2896K27373J30295k00040L5428
13219B45952A04958M9055G6461K93181I1291N6483C7952D780b01754A47486k2690
13208A24796K41863j13633D5566K49625N50L0647Q8915b0580A81725a95653c8182
13196g4496B47708a9766A76106j6916a11126A96370b69999B6942J60277o5186
$$ plain form
13276 187537 -205568 188699 99745 113000 167121 201760 139961 198454 107353 -33473 -8826
13264 34478 141736 -102565 119905 55274 -39043 255562 -152321 79469 72165 -341966 159739
13252 110051 26840 279866 133908 -26091 -130062 179436 75445 168158 439023 -22962
13241 87232 4586 53048 206668 -42600 26165 52687 15976 316181 72957 446731 44425
13229 300080 180692 -36820 196619 789719 131806 52896 280269 410564 210524 245952
13219 245952 104958 154013 76461 369642 91291 147774 37952 4780 -201754 147486 124796
13208 124796 366659 253026 45566 295191 295741 326388 415303 -20580 181725 -195653 -38182
13196 -74496 247708 -19766 176106 159190 -111126 196370 -269999 26942 187219 122033
13186A22033c6475C4603a96779F02709A57034k1079j1123Q0192a75466A40514
13175d04709H1326J02426p3825K74507F4318J34915J00905o7279l0110a14128
13164C12439d06836C52332a01502A52133J22563A31514C3463K77131H2362K87655
13154C70017A03902K49609j54905K09660l2036j48081J20996A1208a29415A62625
13143E9443g8492m5480A66235C5695K22052o8888a50700J3928B20895f2699D50269
13131f2972I9606E65J65890J31543D7243a69438l4543i1105E14660B26996I4569
13119a66010A1281M13912c89037a90525I4837L6298R169O1173i416j01680B93187
13107b5172A38268P7703C372J91185p7868b24670A69732M1253I4757C63P7566
$$ plain form
13186 122033 -36475 34603 -196779 602709 157034 135955 124832 205024 -175466 140514
13175 -404709 81326 183752 109927 384434 64318 199233 300138 232859 202749 -114128
13164 312439 -406836 352332 -101502 152133 274696 131514 33463 310594 82362 370017
13154 370017 103902 353511 198606 408266 376230 228149 349145 11208 -129415 162625
13143 59443 -78492 -123972 166235 35695 257747 188859 -150700 -136772 220895 -62699 450269
13131 -62972 99606 565 166455 297998 47243 -169438 -203981 -91105 514660 226996 94569
13119 -166010 11281 425193 -389037 -190525 94837 131135 140304 201477 -9416 -111096 293187
13107 -25172 138268 215971 3372 194557 116689 -224670 169732 210985 94757 363 77929
13096G7929K3952J35118e0026B05291Q8226H2826P693C6557O9603J7897l6212
13085H7845d0687q3572j7127A70194H1481c3703A98334e1405A14636J02443B4487
13073b1187j62142H8506D3967K4401J44111p2620M08200g9472A56296L24445O6149
13062E46890A83567e3306H8423J10315J11914a07802C05102r2353p0407J0058
13052A52400g2999B93692b0226A12708a2907l2989A53579D3963a04415M2594A48622
13040a0290A03261M8200l810n9882L57162A93048a98164E8348J18481a02024c5327
13028a7035n8332B39183F228M00127q2149K2725j31098a40132B10744a15654o5841
13017a81495A35545K0138E3280J71047K07709c659m8194F5957b26340G7682a0969
$$ plain form
13096 77929 101881 236999 -50026 205291 293517 82826 90519 36557 106160 124057 87845
13085 87845 -40687 -124259 -141386 170194 81481 -33703 198334 -51405 114636 217079 24487
13073 -21187 -183329 88506 43967 68368 212479 139859 548059 -79472 156296 480741 546890
13062 546890 183567 -53306 88423 198738 310652 -107802 305102 212749 142342 152400
13052 152400 -72999 293692 -20226 112708 -12907 -45896 153579 43963 -104415 -61821 148622
13040 -10290 103261 151461 147651 87769 444931 193048 -198164 58348 176829 -102024 -35327
13028 -17035 -75367 239183 6228 406355 324206 346931 215833 -140132 210744 -115654 -181495
13017 -181495 135545 155683 53280 224327 432036 -3659 -51853 65957 -226340 77682 -10969
13005A34143a27042F5286P1290K70816b704l270A75687A5322J91683C6874K47884
12994B84758p348H0343P1964b36048B787Q5623K68715A10604C3582b16458H134
12982b5864B56012a1191A0916i4777B6763i8477A26902B8860g8128D1385g7154
12970C26843C2177b77601h8251A62195o6846b31314H2989q539i0034C04851B4516
12958a82666A70185q1891j9165L03342a45988A5584O7011g2089C77254a30265
12947B7353Q0853f9251k00174c5424B96338r6241J15024A05165l22N1507b4316
12935a38484b9451A08025a23905A42430J03506J37j15369J6875b5396r5797B77818
12923e1770q4063j15822r718A91115o5703g8829E09520A32209j5519J66841j19062
$$ plain form
13005 134143 -127042 65286 136576 407392 -2704 -5974 175687 15322 207005 36874 284758
12994 284758 277410 80343 152307 -236048 2787 88410 357125 110604 33582 -216458 8134
12982 -25864 256012 -11191 10916 -94777 26763 -98477 126902 28860 -78128 41385 -77154
12970 326843 32177 -277601 -88251 162195 95349 -231314 82989 74450 -90034 304851 24516
12958 -182666 170185 88294 69129 372471 -145988 15584 82595 -72089 377254 -130265
12947 27353 108206 -69251 -269425 -35424 296338 200097 315121 105165 104843 156350 -24316
12935 -138484 -29451 108025 -123905 142430 245936 246073 130704 147579 -25396 -121193 277818
12923 -51770 -135833 -251655 -261373 191115 125412 -78829 509520 132209 116690 283531 164469
12912A64469c68927c5115B17904C2706b33047g339j40329A2088L6074a66887B91004
12900C44337b6263B36642c11103F9101c1337A12894G29a36945c1234A51050b31558
12888a26907B58522A06393b05089B50281A18060j1806J8806b7673a1246A10972
12877a95661C2502J05197b27541c2871k4179F0914b33935b3792G5217O0662F1539
12865c6219G7165J11116E0913K58537A47079k0189n5914K04978e3724b851A49880
12853D8209M754J29974b12278A05772m4626c8136p4836C7166J2266D718J79532
12842A84250p5075L55529G3162J5106a09356M2370a7926o9678H1562J50536a51868
12830A07903c01989B7423f977B91516a88949A66237D9004b68879g8421j2038B87807
$$ plain form
12912 164469 -368927 -35115 217904 32706 -233047 -7339 -147668 12088 48162 -166887 291004
12900 344337 -26263 236642 -311103 69101 -31337 112894 729 -136945 -31234 151050 -231558
12888 -126907 258522 106393 -205089 250281 118060 106254 125060 -27673 -11246 110972
12877 -195661 32502 137699 -227541 -32871 -57050 60914 -233935 -23792 75217 135879 61539
12865 -36219 77165 188281 50913 309450 147079 126890 70976 275954 -53724 -2851 149880
12853 48209 52963 182937 -212278 105772 61146 -38136 -112972 37166 49432 4718 184250
12842 184250 109175 464704 73162 88268 -109356 -66986 -17926 -87604 81562 232098 -151868
12830 107903 -301989 27423 -6977 291516 -188949 166237 49004 -268879 -78421 -90459 287807
12818H3657J24228E798J0027b1147A93415i4166k40725b6279j53003N7496I8481
12806i4968A8184B482a52049c1329k2201I1435P4199a33206j27644f5484H2914
12794A44940O06977b1566d298j0298n2406k75368B03419c12494H029K79835a47512
12782a03462M4834F1077a50416d1064A58389h3784B08772n6518a52493F1259L02132
12771C63391I3241N6879C0543O6176K1374J70420p4523a05942B21772F0335d9215
12759D96013a42013B73235A18603i7869j24384e9853m3095p015l0034L6209b8246
12747e5156C16499a20732K9078A28012g0465r9907n3666h9416d4405A79585k0909
12736A58676b97386C01356A17188K6588g2931c3746A47884e2915n6880B08443
$$ plain form
12818 83657 207885 5798 15825 -21147 193415 -94166 -334891 -26279 -179282 -121786 98481
12806 -94968 18184 2482 -152049 -31329 -53530 91435 165634 -133206 -260850 -65484 82914
12794 144940 751917 -21566 -4298 -14596 -67002 -342370 203419 -312494 8029 287864 -147512
12782 -103462 -58628 61077 -150416 -41064 158389 -83784 208772 152254 -152493 61259 363391
12771 363391 93241 150120 30543 96719 118093 288513 213990 -105942 221772 60335 -49215
12759 496013 -142013 273235 118603 -97869 -222253 -59853 -102948 -109963 -139997 -103788 -28246
12747 -55156 316499 -120732 -91654 128012 -70465 -170372 -224038 -89416 -44405 179585 158676
12736 158676 -297386 301356 117188 143776 -72931 -33746 147884 -52915 -109795 208443
12725C01423h6287D47528a2584l3360I3459a5787j91566G1112J21190J92648o9622
12714C15328C3395c77988f725C1916b08444A44333C3152a04772B3022N0398d7663
12702B30052i306A7574a22196j7267A42844A4880J39601J422M7637r2465b7040
12690C33711j12476a52738F9359P5K43512N6091a35434c1307B08082f6701B91831
12678A36079a52602m7270C22672D288h1375A74481k7380F5124P0993J84993a37588
12666F960K8883a93566B04223B4034J0579M7470P8857f6866q3480B7792a02165
12654B88907l666m12h3510a7261A47958J5190J8834E9452J02948L1780M3829q6718
12642A51291A6818b24762Q4288I6065Q1742F7486L96125b06375D03980j30401
$$ plain form
12725 301423 -86287 447528 -12584 -45944 93459 -15787 -207353 71112 192302 384950 315328
12714 315328 33395 -377988 -6725 31916 -208444 144333 33152 -104772 23022 73420 -47663
12702 230052 -9306 17574 -122196 -139463 142844 14880 154481 155903 203540 111075 -27040
12690 333711 221235 -152738 69359 69434 312946 369037 -135434 -31307 208082 -66701 291831
12678 136079 -152602 -199872 322672 4288 -81375 174481 147101 65124 136117 321110 -137588
12666 6960 35843 -193566 204223 24034 34613 82083 160940 -66866 -150346 27792 -102165
12654 288907 285241 284829 -83510 -17261 147958 163148 181982 59452 162400 194180 238009 151291
12642 151291 16818 -224762 -140474 96065 177807 67486 463611 -206375 403980 273579
12632B73579i8156B13580I8766g9982D42949B09437i7962D60981A1952a33342
12621c39571d3437j69691A3558c4722B87548l32c48150B6343K5989N19737A09891
12609B71421r1343H1353a18188D06898l1028N7743j77404j5404c7694A02039b09178
12597A16592E0963j2718b34899i495A14616i9619C1939J39684o5048b157A04715
12585A61833J41335r5722o6516E9738c08357A04997b28164A03144b1944p4667
12575i6611a0946j41973N6164d1166B63322I1771b13604j509a07150A0986J64732
12564A75718K6493D1362a60425B43232I7179a2703p9649I9171b65237e0469k18215
12553b68684a850B6574J58590c1298j20582C7240a62462A79597B4246h3787A39313
$$ plain form
12632 273579 -98156 213580 98766 -79982 442949 209437 -97962 460981 11952 -133342
12621 -339571 -43437 -213128 13558 -34722 287548 287216 -348150 26343 52332 572069 109891
12609 271421 180078 81353 -118188 406898 375870 433613 256209 240805 -37694 102039 -209178
12597 116592 50963 38245 -234899 -9495 114616 -99619 31939 171623 106575 -2157 104715
12585 161833 303168 207446 140930 59738 -308357 104997 -228164 103144 -21944 -96611
12575 -96611 -10946 -152919 -96755 -41166 263322 91771 -213604 -215113 -107150 10986 175718
12564 175718 202211 41362 -160425 243232 97179 -12703 -92352 99171 -265237 -50469 -268684
12553 -268684 -1850 26574 185164 -31298 -151880 37240 -162462 179597 24246 -83787 139313
12541B19081a16364G3785h873G3799J42891G2367c4905A02309d7392k35872Q1021
12530b02243I5531P5173c42524H5994K4445Q5463p6799a60389c3850C55417c20862
12518i5447E81202A68021c8278D5905c03080h9279A56803l1617g3685c4586H1399
12506C72395D3110J28344j7436l8424k7385c33117B7351J38799J60525a5134B50814
12494A00965J91074r1258p4392L20239h3959j68963a12241a8720B47002a40244
12483b05480f1982j54360a05351G2628J90548A8150c87082D9447a06076l3730
12473a39806j31981a25452f1079B58006I9680g3854R10A70620k744j3855f9726
12461b6355p8387L5452b9803E4717O5673k5140K62258g8693A0661c54701a59648
$$ plain form
12541 219081 -116364 73785 -8873 73799 216690 72367 -34905 102309 -47392 -283264 -202243
12530 -202243 95531 170704 -342524 85994 110439 195902 119103 -160389 -33850 355417 -320862
12518 -95447 581202 168021 -38278 45905 -303080 -89279 156803 125186 -73685 -34586 81399
12506 372395 43110 171454 154018 115594 88209 -333117 27351 166150 326675 -15134 250814
12494 100965 292039 200781 126389 446628 -83959 -252922 -112241 -18720 247002 -140244
12483 -205480 -61982 -216342 -105351 72628 263176 18150 -387082 49447 -106076 -139806
12473 -139806 -271787 -125452 -61079 258006 99680 -73854 -72944 170620 167876 154021 -69726
12461 -26355 -104742 -69290 -29803 54717 120390 95250 357508 -78693 10661 -354701 -159648
12449A9598J77256A3391J96192a06865m629A66352d74275a83388A00774J18367
12439B19141a11403F2932a78675F978J78709c0226A09027a07992m2706o5256E5013
12427a64717a2985k16535a07185B9240i972j35277A6200C508J02286P8289J44053
12416C28136c0624C63224A16883b58597A52349o5131N5255c5997r1922B14574
12405g9081A0887M1872b363k69496a17694D32552j42984A00594K77267j57760
12395B20101c5361k1812j19392E4210a11341A78540d9823j68392h4599K2140k31921
12384b94380c4263j01901A44567M6381m1023a91752I745a85725A08125B1964K7206
12373D9170g3341a2176A04570i3452l3475B00322c1823o1449A86305a80263B9249
$$ plain form
12449 19598 196854 13391 209583 -106865 -111494 166352 -474275 -183388 100774 219141
12439 219141 -111403 62932 -178675 6978 185687 -30226 109027 -107992 -150698 -215954 55013
12427 -164717 -12985 -229520 -107185 29240 -9972 -145249 16200 3508 105794 184083 328136
12416 328136 -30624 363224 116883 -258597 152349 87218 142473 -35997 -127919 214574
12405 -79081 10887 52759 -2363 -271859 -117694 432552 289568 100594 377861 220101
12395 220101 -35361 -57173 -176565 54210 -111341 178540 -49823 -218215 -84599 -62459 -294380
12384 -294380 -34263 -136164 144567 190948 149925 -191752 9745 -185725 108125 21964 49170
12373 49170 -73341 -12176 104570 -93452 -126927 200322 -31823 -93272 186305 -180263 29249
12361i3781l8036p8067C7005a11770J9973j1896G385J33844a69594K9836I817
12349A4897J05832F114J1073J08461e0975L941N417J0352j32533g1367q4926b6871
12336A20918C4959K33119a70850F6299i6560j24952A73906d10638J71506M420
12326b34712A67673b6049o6233M1339j50631l7358A94576a23317F5264a83010
12315F2239J1659d2409a6729H070f600A49922a35843B01848A392J32195F391O2721
12303F9112a74027J3779G5592l5851K39548A00948a9253j3465q030j60967I4609
12291h2427m633k3572A43225C4322H091J59252n1102e0088j40439H2679d7716
12279D0830f1898k86117A17039K94944G1570B7193j2446K9858b81717c8240C66511
$$ plain form
12361 -93781 -131817 -209884 37005 -111770 -91797 -103693 7385 141229 -169594 -139758 9817
12349 14897 120729 6114 17187 125648 -50975 -47034 -41617 -31265 -163798 -71367 -156293 -26871
12336 120918 34959 268078 -170850 66299 -96560 -221512 173906 -410638 -239132 -234712
12326 -234712 167673 -26049 -92282 -50943 -201574 -238932 194576 -123317 65264 -183010
12315 62239 73898 -42409 -16729 8070 -6600 149922 -135843 201848 1392 133587 6391 69112
12303 69112 -174027 -160248 75592 39741 279289 100948 -19253 -32718 -40748 -201715 94609
12291 -82427 -87060 -110632 143225 34322 8091 167343 116241 -50088 -190527 82679 -47716
12279 40830 -61898 -348015 117039 411983 71570 27193 14747 44605 -281717 -38240 366511
12267C8852a8283l1625B16905a83133A01328M4424b12992A66209k4320P843a99011
12255A07106h0854a0159j8458J1398a363A52343c3427j82166C17244b5345B00504
12243D9051J12195a41357A20069g9010G9558J06701k6939n2378R5329i3772C07217
12231A97028a02502D9439J28966m8137A1083J44023N568k2467f3055M063B25533
12219B6417R9495J89783F9255J42876A05920i7433B40589N0167k6932k7740J0287
12208B46371p7843e0543A62637R6158J28041D0861R1179e7189C19331j58565k8698
12197A32068e2422A73742E5325J28232m1053K06951D7276J20927P7272q8358N9350
12186B16467L786j7492M7839N32202A5326L64917A89995o481G7828J31466A9702
$$ plain form
12267 38852 -18283 -49908 216905 -183133 101328 145752 -212992 166209 141889 149732 -199011
12255 107106 -80854 -10159 -28617 -17219 -1363 152343 -33427 -215593 317244 -25345 200504
12243 49051 161246 -141357 120069 -79010 79558 186259 159320 106942 202271 -93772 307217
12231 197028 -102502 49439 178405 130268 11083 155106 160674 138207 -63055 -58992 225533
12219 26417 125912 315695 69255 212131 105920 -97433 240589 290756 263824 236084 246371
12208 246371 168528 -50543 162637 258795 386836 40861 132040 -57189 319331 160766 132068
12197 132068 -52422 173742 55325 183557 142504 349455 47276 168203 245475 157117 216467
12186 216467 220253 202761 250600 782802 15326 380243 189995 183514 77828 209294 19702
12174B13555i525H87Q7845I475N42526A89024a57233B26181A4661d2152A15787
12162d7666A86325F4473b79831C04861h3824C77183A08037b40311C23579j20807
12152B02772G9677J10717H0858i6612A9778J08307J70126J11326D6414p391a6640
12140d9790D1382g85B65280A02523d9711j0517A78709c10541C18068d9005A06999
12128a38842K7531A40359B0139L02385a66100j07356A03058e8343P517A8979O4571
12117H3550M5601n4119q099k1416A3432a99920B90812h2900G3732B6590J84982
12106B11572J12395e00370b42126B71997A00869G255b6919B31589b05016f5524
12095a50216B42172a03449D2522b88777a42501j24554A4196c15183A50806e943
$$ plain form
12174 213555 -9525 887 88732 9475 552001 189024 -157233 226181 14661 -42152 115787
12162 -47666 186325 64473 -279831 304861 -83824 377183 108037 -240311 323579 202772
12152 202772 79677 190394 80858 -96612 19778 128085 298211 409537 46414 39023 -16640
12140 -49790 41382 -785 265280 102523 -49711 -60228 178709 -310541 318068 -49005 106999
12128 -138842 -111311 140359 20139 322524 -166100 -273456 103058 -58343 -50826 18979 83550
12117 83550 129151 75032 66933 45517 13432 -199920 290812 -82900 73732 26590 211572
12106 211572 323967 -500370 -242126 271997 100869 7255 -26919 231589 -205016 -65524
12095 -150216 242172 -103449 42522 -288777 -142501 -267055 14196 -315183 150806 -5943
12084E8898c63979A7317a3690l69296e0986m13635a2348j96976k1815a06239D56145
12072b72978C11065b26516B80595D7262J21366a37301F9196J58281g9613j4825
12062i4438I2808J7847D0098O4820k0390O20c38118e7323b2154q2833A2429d5220
12049a59556P7563B59602j00432J2336o9779a72919F9230a90717b2904k01501
12039b24405A29700M3251k413J83115b4216B87351g9582r0804j08194g9959D3755
12027e5030C9873a71981j4639l3005G9734J5896b8159A3887L4883k394h1235D2366
12014G8260J3943g9914K9448n66156D0930A6866L89527A21155f2424k15365B7724
12002E4732a0753l3991j0763I3677J01433c223k6856I6329a76775B92330A16771
$$ plain form
12084 58898 -363979 17317 -13690 -382986 -50986 -464621 -12348 -209324 -231139 -106239 456145
12072 -272978 311065 -226516 280595 47262 168628 -137301 69196 227477 -79613 -94438
12062 -94438 92808 110655 40098 104918 84528 85148 -338118 -57323 -22154 -104987 12429 -45220
12049 -159556 -81993 259602 159170 171506 101727 -172919 69230 -190717 -22904 -224405
12039 -224405 129700 172951 170538 353653 -24216 287351 -79582 -170386 -278580 -79959 43755
12027 -55030 39873 -171981 -186620 -219625 79734 95630 -28159 13887 48770 46376 -81235 42366
12014 78260 92203 -79914 -50466 -616622 40930 16866 406393 121155 -62424 -277789 27724
12002 54732 -10753 -44744 -55507 93677 195110 -3223 -30079 96329 -176775 292330 116771
11990g0097n5519A35004b24423A96474b3917b765m82402a19584l394A31989c52157
11978a75714J645N0400A09322M5583k2633a43418f9360D1564b22553c0011j27006
11967a57017A97270a00632M7408B37274p8375d1898A26838d60221N3734a91435
11956A18451R83a77326L4803A57384c82673F1700k617j4399a15066G5228B5332
11944A50531M1797I431N733L0892a00021f857B5689J53537n6425b27889A551f24026
11931b39179D39462h6487m8922A47226b1937B4113a06006B02817q1195a45620
11920b15710J06678j44386A98625G0127A7456d324C60384d451H0742a94167j77340
11909c71507o6397C5827c34503a19713H5083M2476j0950g9210k7759B70408b00527
$$ plain form
11990 -70097 -125616 135004 -224423 196474 -23917 -2765 -485167 -119584 -122978 131989 -352157
11978 -175714 -174069 -123669 109322 154905 132272 -143418 -69360 41564 -222553 -30011 -157017
11967 -157017 197270 -100632 -53224 237274 158899 -41898 126838 -460221 -406487 -191435
11956 118451 119434 -177326 -142523 157384 -382673 61700 59083 44684 -115066 75228 25332
11944 150531 192328 9431 15164 46056 -100021 -6857 25689 179226 122801 -227889 1551 -624026
11931 -239179 439462 -86487 -135409 147226 -21937 24113 -106006 202817 121622 -145620
11920 -215710 -109032 -253418 198625 70127 17456 -4324 360384 -4451 80742 -194167 -371507
11909 -371507 -437904 35827 -334503 -119713 85083 127559 116609 -79210 -106969 270408 -200527
11897a880n5477B04908A3168K14001F7645a53569o735m91017C0992a23171l928
11886a27099A27010a64710M351N0541A28581K3737g1921j04703j3111L4308g3016
11874a92234G9648L4400b4883j19608j28881B5066d29747h8686C08574c0691D1184
11862e122A94472i0381k8043E8348b41222G9100a2672C85326a17113o7538j19240
11851c03891j27507b925k62973I5125c4570l6285A45890M4488h6378G0851C1402
11839a90255M3075j03195A05991a69870A75465a09548j04526k38258G3660N8603
11829A32263b04803Q7943A37710J57779C7307H230J02815k220h8278A2551b51738
11817e3822I6440d50271a43412b6831I676a99755O5556N2904H3404b20581f0134
$$ plain form
11897 -1880 -57357 204908 13168 227169 67645 -153569 -160304 -651321 30992 -123171 -127099
11886 -127099 127010 -164710 -160359 -109818 128581 152318 -71921 -176624 -189735 -155427 -73016
11874 -192234 79648 114048 -24883 -144491 -273372 25066 -429747 -88686 308574 -30691 41184
11862 -5122 194472 -90381 -118424 58348 -241222 79100 -12672 385326 -117113 -184651 -303891
11851 -303891 -431398 -2925 -265898 95125 -34570 -70855 145890 190378 -86378 70851 31402
11839 -190255 -147180 -250375 105991 -169870 175465 -109548 -214074 -452332 73660 132263
11829 132263 -204803 -116860 137710 295489 37307 8230 111045 108825 -88278 12551 -251738
11817 -53822 96440 -450271 -143412 -26831 9676 -199755 -134199 -81295 83404 -220581 -60134
11805b52505B738a04503a1281B62030i8456I4331B1995N3846b06252g5515k33373
11794c08888A63648h447q4683J965j2871A71930q2583m2503J09670b6461F0264
11782b188E88590i774A70369H0026M1502b70235K3036G4383d4730O388b436j90907
11770a93343C78364e2319j41240e9107n7594A16435a27924A48921n8009A2770
11759b52556l5302C1527K4232b51749R820J3442a03939h593n7916r0964j89209
11748c46682B07525a68150A33564C2534d6258k97491d7895D12383a52325A68422
11737H7976c28745a48941G7887B2208c12605c8652B6700a5340j94400C39491A68266
11725f645A24065M9732N1111b82646R0997B74788a79082d3521j65885B48554j02561
$$ plain form
11805 -252505 2738 -104503 -11281 262030 -98456 94331 21995 75841 -206252 -75515 -308888
11794 -308888 163648 -8447 -93130 -91165 -104036 171930 89347 46844 156514 -26461 60264
11782 -2188 588590 -9774 170369 80026 121528 -270235 -247199 74383 -44730 -38342 -2436 -193343
11770 -193343 378364 -52319 -193559 -59107 -116701 116435 -127924 148921 90912 12770
11759 -252556 -287858 31527 55759 -251749 -241929 -228487 -103939 -8593 -66509 -157473 -346682
11748 -346682 207525 -168150 133564 32534 -46258 -343749 -47895 412383 -152325 168422
11737 87976 -328745 -148941 77887 22208 -312605 -38652 26700 -15340 -209740 339491 168266
11725 -6645 124065 173797 224908 -282646 -191649 274788 -179082 -43521 -209406 248554 145993
11714A45993c42855a46345H992J2442b02630E0119N2122a30618d4191j65221c9538
11702B11557E7535C538c9602A24476J00338P8360b1302A69301c2163B4414a33275
11690I2933M1711a476C9742J65089j01551P3209O1651b89042J40931q3285N3018
11679a78378A75864J00390e2504C85968a36192d0888B8529K67377c7744j61243
11669a98987O0679A7095J23348L03861k18609r6223b57733G9537k4037e7197B8474
11657c1319j19995B51723k2007b41543d8640D3753a12849j25767J11672L5898
11647i1046m8170J1272D9840c04895E2060h3845L5983l6416l3613j33338A28584
11635B02708O9785a74522J5045A31423l232c603D8073K54552C458d5974A34402
$$ plain form
11714 145993 -342855 -146345 8992 21434 -202630 50119 102241 -130618 -44191 -209412 -39538
11702 211557 57535 3538 -39602 124476 224814 303174 -21302 169301 -32163 24414 -133275
11690 92933 134644 -1476 39742 204831 103280 176489 238140 -289042 -148111 -231396 -178378
11679 -178378 175864 276254 -52504 385968 -136192 -40888 28529 295906 -37744 -198987
11669 -198987 -138308 17095 140443 444304 225695 129472 -257733 79537 55500 -57197 28474
11657 -31319 -151314 251723 229716 -241543 -48640 43753 -112849 -238616 -126944 -91046
11647 -91046 -139216 -127944 49840 -304895 52060 -83845 -47862 -84278 -117891 -251229 128584
11635 202708 272493 -174522 -159477 131423 128191 -3603 48073 302625 3458 -45974 134402
11623b44620R3384e8037j42392C7547L4732i527E0033K82172q2114a19391c9528
11611A60525h0483D12999A12106J04459a22698G4668N7465a09187K9072I8499
11600A01913J53090E1695c92251C03918a09139B7265J7339J79865L32287e9484
11589A36250i9828k5358A16430E265a6256C45043A47501c3048I8849k5373a11705
11577E493a44339B67804A3402L00489A54898a14497B31457B7352J03784c5598
11566F0995Q4678i8606B63586J392l6045P3275J43033j14237C2131P5152M2397
11555A49680K28772h20r8462Q948a480I3033c3219l5719D9965J03828g9811A64671
11542A7975h3992j55063b3851C85391a0315k47105D5061J83832m8424o4117a37111
$$ plain form
11623 -244620 -151236 -58037 -200429 37547 72279 -9527 50033 332205 250091 -119391 -39528
11611 160525 -80483 412999 112106 216565 -122698 74668 132133 -109187 -80115 98499
11600 101913 255003 51695 -392251 303918 -109139 27265 44604 224469 556756 -59484
11589 136250 -99828 -125186 116430 5265 -16256 345043 147501 -33048 98849 73476 -111705
11577 5493 -144339 267804 13402 313891 154898 -114497 231457 27352 131136 -35598
11566 60995 145673 -98606 263586 264978 228933 302208 445241 331004 32131 107283 149680
11555 149680 378452 -820 -99282 -90334 -1480 93033 -33219 -68938 49965 153793 -79811 164671
11542 17975 -83992 -239055 -23851 385391 -10315 -257420 45061 228893 180469 116352 -137111
11530d8305C57313D5255J48583D3447P4043J33710I5626J99819a38939c8220B42845
11518b47634C76593A28104m1531J08819D247d2526B09038b42128G0473l0113P7176
11507A17536c1137E0638P4211M9618H2435N4775a55328A43964h089A18431K4577
11496A43008K36624A06994d9252k4796L2549k17832B83251F6345K40188c88492
11485B02957o333a65456A96359a52848A44225f6454B68190A08272B283P8746J30642
11474B11671J0112L33420B14858a2696B52893O27A6779J91805K1926i8846B27806
11462A08674J82344K3234L0775j32370O842p5106J84814B7988d5360B21434A01672
11450G5927J18292p1123J96705I7344J01123H0448K56202J43725a83291A90317
$$ plain form
11530 -48305 357313 45255 193838 43447 117490 251200 95626 295445 -138939 -38220 242845
11518 -247634 376593 128104 86573 195392 4247 -42526 209038 -242128 70473 40360 117536
11507 117536 -31137 50638 124849 174467 82435 137210 -155328 143964 -8089 118431 143008
11496 143008 379632 106994 -49252 -74048 -41499 -259331 283251 66345 306533 -388492
11485 202957 196624 -165456 196359 -152848 144225 -66454 268190 108272 2283 81029 211671
11474 211671 221783 555203 214858 -12696 252893 253520 16779 208584 230510 -98846 227806
11462 108674 291018 314252 345027 212657 219499 144393 329207 27988 -45360 221434 101672
11450 75927 194219 123096 319801 97344 198467 80448 336650 480375 -183291 190317
11439A15318E3112J52369K5374g9671B98038A19069P8653k9592d98800A725c5732
11427a87392F29014j89585h3668E9882p642q486a58868A41554Q881f9484a3682
11415c08859a30043n147B0085J83135B2581c9894j08027c1018j47660A564K36249
11404B37813K03083A04270e0974k36830B38073a61730A34063a38948D7216a8323
11393i7017F9284b90526J43351B35189a53646A75359m5049b88253a9892q7430
11383a07322c6432r3161E3639g8311A01206D8094J95025a51367D2215J25282a25369
11371A05672c3677j31219A08532a03342A39374j0897M0747b26807R3081F6791
11360A58482D2888J89890e4344o97H0598N7959a30541d7890j25682j9272J0220
$$ plain form
11439 115318 53112 205481 230855 -79671 298038 119069 197722 168130 -498800 1725 -35732
11427 -187392 629014 439429 -83668 59882 52240 43754 -158868 141554 150435 -69484 -13682
11415 -308859 -130043 -135190 20085 203220 22581 -39894 -147921 -31018 -178678 1564 237813
11404 237813 440896 104270 -50974 -287804 238073 -161730 134063 -138948 47216 -18323
11393 -97017 69284 -290526 -147175 235189 -153646 175359 130310 -288253 -19892 -107322
11383 -107322 -36432 -129593 53639 -78311 101206 48094 243119 -151367 42215 167497 -125369
11371 105672 -33677 -164896 108532 -103342 139374 128477 169224 -226807 -133726 66791
11360 158482 42888 232778 -54344 -55041 80598 138557 -130541 -47890 -173572 -192844 -182624
11349a82624D7967b04729l3536h3118b5777k002B7021a41682o0277i7875M8418
11338d9457m4560L6120j44478f2258D459a38277q6251A84006J35081D3410a91813
11326B15428f1312B36785a29855b3064o5758L2698B37746a28037N0761j03390
11316a80666D4509J20384J1689g7792A24670J26126a70123A62403e7524G3850
11305C127K68445j25703L429c36901a67777j19965I6245L1828b9774A14126a67587
11293C9922J72218a61974n7049D4520b04065B1799J11913a22320k36788A72037
11282b0695B8351a5288l9466J3725A16775A7977b35083H5709d3236m5093o7137
11271a55466B50099p6995c26912A27539F0946a54426q0739E6243K46727b66317
$$ plain form
11349 -182624 47967 -204729 -238265 -83118 -25777 -27779 27021 -141682 -201959 -97875 -49457
11338 -49457 -94017 -57897 -202375 -62258 4459 -138277 -224528 184006 319087 43410 -191813
11326 215428 -61312 236785 -129855 -23064 -88822 -56124 237746 -128037 -77276 -180666
11316 -180666 44509 164893 176582 -77792 124670 250796 -170123 162403 -57524 73850
11305 3127 271572 145869 149298 -336901 -167777 -287742 96245 128073 -29774 114126 -167587
11293 39922 212140 -161974 -219023 44520 -204065 21799 133712 -122320 -359108 172037
11282 -20695 28351 -15288 -54754 -41029 116775 17977 -235083 85709 -43236 -88329 -155466
11271 -155466 250099 173104 -326912 127539 60946 -154426 -235165 56243 302970 -266317
11260b99210B91618b84784D52827G0232a92834P3653d9840J7863j80960f8817
11249E5394a88971G5997d1751B07346a77285Q7590I9925a03536A29575a10698
11238A89596a75555j1447c509D9464J42637r4335O9478a23204j85639A22385e440
11226b02691A96934a93102f9232E5290b05391o1416j26336J68473K1584H9977
11215a75772g7340o2509O7422j61505A62899A9229N4125J27092a40607B8451b16032
11203f3237A27381J64191i4446l7041p0816A13678L6128K09057G0692m643c51723
11191a5740j40950g1274l74775B78888H5660c66919a02988D8713a9621G9399l6632
11180D2767b06463g4506G2009a28794N0995k4471G7166a88549A49745a72373h6064
$$ plain form
11260 -299210 291618 -284784 452827 70232 -192834 -119181 -49840 -31977 -212937 -68817
11249 55394 -188971 75997 -41751 207346 -177285 -89695 99925 -103536 129575 -110698
11238 189596 -175555 -187002 -3509 49464 192101 97766 167244 -123204 -308843 122385 -5440
11226 -202691 196934 -193102 -69232 55290 -205391 -266807 -393143 -224670 -203086 89977
11215 -175772 -77340 -139849 -72427 -233932 162899 19229 73354 200446 -140607 28451 -216032
11203 -63237 127381 291572 -94446 -131487 -202303 113678 149806 358863 70692 66049 -351723
11191 -15740 -156690 -71274 -446049 278888 85660 -366919 -102988 48713 -19621 79399 42767
11180 42767 -206463 -74506 72009 -128794 -77799 -102270 77166 -188549 149745 -172373 -86064
11168A86895b58448F692a59192c9645j997j3675j95845j00334a1463m83630b3917
11156c0633B24096c13191L6908m7593J41693K3462A04243l6566N1508f7641A41878
11144a53335d5429l7823c2233A0290R0044a08356j11599K4304A45209D4440J85504
11133B29944q5398b3065a176B1640P2902a45052f1210k49605H3157c2779k91100
11122c23879a39759A07623a25528C46051c2272A71452a61996A30591J76924H4838
11111B17164J2334b11017A97587G1019K7271d02147A6332b41061G0215b97577
11100E0689L1323K1253b70468A9194i0380I0801A283J41328O563C3681J82893
11089B16574E7345M31769A12556P4322D3758J41332H2623J49023L3971A17657
$$ plain form
11168 186895 -258448 6692 -159192 -39645 -41642 -55317 -251162 -351496 -11463 -495093 -23917
11156 -30633 224096 -313191 -276283 -323876 -182183 -158721 104243 67677 119185 -67641 141878
11144 -153335 -45429 -83252 -32233 10290 100334 -108356 -219955 -195651 145209 44440 229944
11133 229944 144546 -23065 -1176 21640 94542 -145052 -61210 -310815 83157 -32779 -323879
11122 -323879 -139759 107623 -125528 346051 -32272 171452 -161996 130591 307515 84838
11111 217164 229498 -211017 197587 71019 98290 -402147 16332 -241061 70215 -297577
11100 50689 82012 103265 -270468 19194 -90380 90801 1283 142611 149174 33681 216574
11089 216574 57345 489114 112556 186878 43758 185090 82623 231646 265617 117657
11078B86969L53428I2923f0779B11250n4615K71934A71646J85545K5071j71702
11068B10560K33275L77303b97040B10577m3675J77258p2759J51538j52389L18798
11058E89348a066D10881j41427J74450k02813e4805B90982N2803J21225O5415
11048E30425k17974P0879Q4449J34514j05360j06275L06270k30296J65886K9585
11038F62103N9968j90280K62068B75584L71385O6162j41241K33599l59798J40962
11028E86653K92085j86019j12031M09267k52639N1024K94333k25544j8168l24157
11018E14804K70297k79078l9557o3398L54703K7377p6202K81828l04714M1871
11008G27931k20667L88397l30272J44068k05579p877M5709L1388J40046J09757
$$ plain form
11078 286969 640397 92923 -60779 211250 156635 428569 171646 357191 382262 210560
11068 210560 443835 821138 -297040 210577 166902 344160 271401 422939 270550 589348
11058 589348 -1066 410881 269454 443904 241091 -54805 290982 343785 465010 530425
11048 530425 312451 383330 467779 602293 496933 390658 696928 466632 632518 662103
11038 662103 722071 531791 793859 275584 646969 713131 571890 805489 445691 586653
11028 586653 878738 692719 580688 989955 737316 788340 1082673 857129 838961 514804
11018 514804 785101 506023 466466 403068 757771 785148 708946 990774 686060 727931
11008 727931 507264 895661 565389 709457 503878 496001 541710 573098 713144 822901
10998H22901k67366j66165L10600j5794k15596j78845J5165J69971K20310j50130
10988E45051j33840J94830j79168J38698N7384l0918K29320k30538L7454j46986
10978D81287J67525O8560J40341m23217K80593K62649O0281k7494D87483Q48276
10968A335759m00991J0026J24465L02035j20973O9710n0279M97749L72006L3517
10958B173024K63641J21885n41834K31945q9241J88543m14920k019j84150j34531
10948A612343j81724M9741m1210J68287k47803M18357k88049k84942M9050j80622
10938A073428L67081m38880D75297L12408L739j15404k87551A84794K22998L9570
10928D47362A69352j0203L04586A96352K71483A37982N2957l4173J4509e152C27729
$$ plain form
10998 822901 555535 389370 699970 684176 468580 289735 304900 474871 695181 545051
10988 545051 411211 606041 426873 565571 622955 592037 821357 590819 628273 481287
10978 481287 648812 717372 857713 434496 715089 977738 1038019 1010525 487483 1335759
10968 1335759 934768 944794 1069259 1371294 1250321 1320031 1269752 1767501 2139507 2173024
10958 2173024 2436665 2558550 2016716 2248661 2159420 2347963 1933043 1931024 1746874 1612343
10948 1612343 1430619 1480360 1439150 1607437 1359634 1777991 1489942 1205000 1254050 1073428
10938 1073428 1440509 1001629 475297 787705 791444 676040 388489 184794 407792 447362
10928 447362 169352 159149 463735 196352 467835 137982 190939 156766 171275 -5152 327729
10916A07918C2496L7712J10588d1896A34100A4821h8413j15920f4321A2709M8294
10905F1003a55002A83574j0962i7604k42872A40693k2147a15929B74996d1635
10894a68764k15774A88599i447H7534K64338A44828D3007A211c02059A06811k7068
10883G9743j6373J05051b8317A30685E1546J22942c5051j20398c0020m2984k53043
10872c26047c966R13A80526a91213B83863d42824a14272n5868I5163K03969p6052
10861B23080i7605l11787a90456j10671h9918C6632K73854H5566c4478k73070
10851c07548A56553a11780K7469a6134F2413I242K38228b9829k43306A16160b38443
10839a19949o8533E23295a22017r4821d4217j60373L6831l7078E9871a21829k42870
$$ plain form
10916 107918 32496 70208 180796 -41896 134100 14821 -88413 -204333 -64321 12709 61003
10905 61003 -155002 183574 172612 -97604 -340476 140693 118546 -115929 274996 -41635
10894 -168764 -384538 188599 -9447 87534 351872 144828 43007 1211 -302059 106811 79743
10883 79743 63370 168421 -28317 130685 51546 174488 -35051 -155449 -30020 -73004 -326047
10872 -326047 -3966 -3053 180526 -191213 283863 -442824 -114272 -170140 95163 299132 223080
10861 223080 -97605 -409392 -190456 -301127 -89918 36632 310486 85566 -34478 -307548
10851 -307548 156553 -111780 -84311 -16134 62413 9242 247470 -29829 -273135 116160 -238443
10839 -119949 -188482 523295 -122017 -216838 -44217 -204590 -167759 -204837 59871 -121829 -364699
10828c64699F1821g7658B98112d9664m6614C5050h4387n7802k24688a31889B64662
10816B59906G6219P1271a02189L8892E6804J48913a8982F2981J90592j06252F9686
10804a89345C3247b21112N2940A57420l541g4046B45575b07617A96293J34044
10794C30337g804i04D4892g783p8383C21i7007A07431b9436j35573I7450d23388
10781a39005I8684A408K27410b31893J621C25997a03340H2925b33178a7138p4474
10770i1612d4679m6837L8886c037l67638J27518I0208b66835G3034J52321e9104
10758a30664d6511k08265D904R7104o776a73347j35145H3699C2064i7945k8715
10747a26660G5644k6972b47801P2670k72176a10374j28493e8668m4004k39517
$$ plain form
10828 -364699 61821 -77658 298112 -49664 -96278 35050 -84387 -142189 -366877 -131889 264662
10816 259906 76219 147490 -102189 -63297 56804 205717 -18982 62981 253573 147321 69686
10804 -189345 33247 -221112 -168172 157420 153879 -74046 245575 -207617 196293 330337
10794 330337 -7804 -904 44892 -7783 -86166 321 -97007 107431 -29436 -165009 97450 -423388
10781 -139005 98684 1408 228818 -231893 -230272 325997 -103340 82925 -233178 -17138 -91612
10770 -91612 -44679 -91516 -52630 -3037 -370675 -243157 90208 -266835 73034 225355 -59104
10758 -130664 -46511 -254776 4904 102008 95232 -173347 -308492 83699 32064 -97945 -126660
10747 -126660 75644 48672 -247801 -175131 -447307 -110374 -238867 -58668 -102672 -342189
10737c42189F5248d5786I1533J72533i541A9856J71382e8398o4024B10453d2353
10725A2025Q580d52613d3203j27843f5974o120b0252q7314F1137c04451J04930
10714a99521B31610b28053M6459B1754c7931A77269b93671C5142J8478b19274
10703h2838o2696A19083m7965a37854B35336d59731h5712A02690b843j85329A68649
10691A29873d43875B87737C1443a02418A80235b86596H4052d71360A2876L5556
10681D8432K16057l4025a08678A75124a08160C59070A37142F1123a90741E7146
10670C21462b10313A47706d9357D211h6804j80773B16590j01470c25957J45809
10660a80148A37811f4212B77647h7937n2849a3295l866A26216N0045a0186n0565
$$ plain form
10737 -342189 65248 -45786 91533 264066 -9541 19856 191238 -58398 -122422 210453 -42353
10725 12025 20605 -452613 -43203 -171046 -65974 -72094 -20252 -107566 61137 -304451 -199521
10714 -199521 231610 -228053 -181594 21754 -37931 177269 -293671 35142 53620 -219274
10703 -82838 -145534 119083 71118 -137854 235336 -459731 -85712 102690 -2843 -188172 168649
10691 129873 -443875 287737 31443 -102418 180235 -286596 84052 -471360 12876 48432
10681 48432 264489 230464 -108678 175124 -108160 359070 137142 61123 -190741 57146
10670 321462 -210313 147706 -49357 4211 -86804 -267577 216590 115120 -325957 -180148
10660 -180148 137811 -64212 277647 -87937 -140786 -13295 -17161 126216 176261 -10186 -60751
10649f0751H2783p957f207D8110h4578A57002F5438L67794b44574A17610a7206
10637a41839G0535a50733k02456g085q6131j57543i2899A06003a4798l77313a59837
10625a74861C7735a24439J0581p8256N3851A26985e9126p3356B31478I1462c31057
10613g4894J9466j83606b3446A76241o934b54193A04688i7939B66116O477b72583
10601a30641j06342B22682a0150B4203J99683i5032q1318l0990C7107J81144A6206
10589a33448B14687r8148b98034A3533O7655B2151J44969G1389b66949B5523c4957
10577A30180b72644a502q3413n8538m5677n7469J4511B68498a32040a0168A27973
10565c718E6927b16272D0720A0767M06a37630o0602A08523n1746a95225l09172
$$ plain form
10649 -60751 82783 74826 -6207 48110 -84578 157002 65438 433232 -244574 117610 -17206
10637 -141839 70535 -150733 -353189 -7085 -93216 -250759 -92899 106003 -14798 -392111 -159837
10625 -174861 37735 -124439 -113858 -192114 -138263 126985 -59126 -132482 231478 91462 -331057
10613 -74894 -55428 -239034 -23446 176241 169307 -254193 104688 -97939 266116 272593 -272583
10601 -130641 -236983 222682 -10150 24203 223886 -95032 -176350 -207340 37107 218251 16206
10589 -133448 214687 116539 -298034 13533 81188 22151 167120 71389 -266949 25523 -34957
10577 130180 -272644 -1502 -84915 -143453 -189130 -246599 -232088 268498 -132040 -10168 127973
10565 -3718 56927 -216272 40720 10767 11173 -137630 -198232 108523 56777 -195225 -504397
10554e04397J93128h9850B0395a79787Q4981M1898A59433a64409d0935j45550
10544a86485B13375a53043C54811a13678A13485q86b46143E0740a86138d1836
10533a56717n145A2993a6322F2537b66606O3383d2770l5819k78362a65445q7557
10522b53002B3138a57709K4150j97376q1952H2190Q4707e4293q4939J3585B2127
10510A94858e660j42922j8029r169a4956j51835l6680k0082L7408P4279k58215
10499c70081B32435c09801B2905K014b14324B1464a0795A5817N4595J07589A5469
10487c4459j61632P6582I667c68275f1153I1403c33097c6428e409j56677f0285
10475B11903k338a6711j00290D2334i7026D65769B27841J54170H0427J38139A9190
$$ plain form
10554 -504397 -311269 -89850 20395 -179787 -94806 -52908 159433 -164409 -40935 -186485
10544 -186485 213375 -153043 354811 -113678 113485 112599 -246143 50740 -186138 -41836
10533 -156717 -161862 12993 -16322 62537 -266606 -203223 -42770 -78589 -356951 -165445 -253002
10522 -253002 23138 -157709 -133559 -330935 -412887 82190 166897 -54293 -139232 -125647 22127
10510 194858 -5660 -148582 -166611 -175780 -14956 -166791 -203471 -223553 -186145 -111866 -370081
10499 -370081 232435 -309801 22905 24919 -214324 21464 -10795 15817 70412 178001 15469
10487 -34459 -196091 -119509 9667 -368275 -61153 91403 -333097 -36428 -5409 -162086 -60285
10475 211903 209565 -16711 -117001 42334 -97026 465769 227841 382011 80427 218566 19190
10463F7061K21022l2950e0142F2923b58156B1104D37K0339b47973A08261J45161
10452B53422k234a34089G5113j8428J25280f7945h468B5814J89757A0215d4525
10440H3937a31727A35792B2118i1982K5070k30988B27059A5988b82001J10199
10430a71802j34255c2662q1535A8301a24659e5323A77019c0088j19819H2229J31832
10419B14061i7189B5500c3618I9713c89900d6806B9088h2307A11026c78832G0190
10407c44021A36553a01124C9316L7772O2577a5927E8383J13387O1272g7928J7358
10396f0570j3400q7801A09490a39088e0428m1675j32232j03949A47792a98764
10385A40015j6216h7336D37745A33059D9495a33370A22437l7542i5035A52451
$$ plain form
10463 67061 288083 255133 -50142 62923 -258156 21104 437 20776 -247973 108261 253422
10452 253422 251188 -134089 75113 56685 181965 -67945 -8468 25814 215571 10215 -44525
10440 83937 -131727 135792 22118 -91982 -66912 -297900 227059 15988 -282001 -171802
10430 -171802 -306057 -32662 -114197 18301 -124659 -55323 177019 -30088 -149907 82229 214061
10419 214061 -97189 25500 -33618 99713 -389900 -46806 29088 -82307 111026 -378832 70190
10407 -344021 136553 -101124 39316 77088 139665 -15927 58383 171770 233042 -77928 -60570
10396 -60570 -73970 -161771 109490 -139088 -50428 -92103 -224335 -328284 147792 -198764
10385 140015 123799 -87336 437745 133059 49495 -133370 122437 84895 -95035 152451
10374F8367J18242P9450b7355H7071Q6628j2436L8384i7883B43516p4099J48961
10363C18378H1481J75210j01597J94202A15621d2388B47866j5394A12437K87721
10353D00158J20122R2614l04223R1053J74884H0766K70215p1307J40121p3474
10343C46321F0786k9924j4289N18130J32704a2114C10454J09352l1569N2761o6599
10332C74399j17996Q1588H930O12649k76142A00300r088m789C8702K80803l7168
10321B82337m1034N5551I2036L41482d1782A94175D0993K09611n6596a43423a7105
10309A47207C62J98994O9001n9394F9231C0380J75468a43602H5196K4305N4808
10298A64309g4236A65370c11943a13990H391g8461A30325c66363J25369A66301
$$ plain form
10374 68367 186609 266059 -27355 87071 173699 161263 199647 -97883 243516 169417 318378
10363 318378 81481 256691 155094 349296 115621 -42388 247866 232472 112437 400158
10353 400158 520280 612894 308671 399724 574608 80766 350981 279674 419795 346321
10343 346321 60786 30862 16573 534703 667407 -12114 310454 419806 388237 440998 374399
10332 374399 256403 337991 8930 621579 345437 100300 91212 86423 38702 319505 282337
10321 282337 241303 296854 92036 433518 -41782 194175 40993 250604 194008 -143423 -17105
10309 147207 362 199356 268357 208963 69231 30380 205848 -143602 85196 109501 164309
10298 164309 -74236 165370 -311943 -113990 8391 -78461 130325 -366363 -240994 166301
10287H6117c35159J50529K7313d8052j16123N6043B84681a98922j28907J35881
10277a91948N9438F2663b1850k24066P2272a5779B10706J47794i3410Q358A20849
10265a18121e7493l50366G3415K19962b5813j33166A96405q5441g6894n6711e7725
10253i9646a0471H2617P3680N0o2415a04065C88346j19821K27209d015H3580J40064
10241B23644J72406A34361D5062a30733e9829F1305a14686a6095H3282R6100a86043
10229I4471C1966a17263H5484B0693P6843a03237c6678C9438f6918D1833a42541
10217A16431d949B06702a34620A16901a32752j15183H8200b41816q1493E5020
10206a31819l96909e1838F8819h9582L9988C6579a82761j285P7657G6881d03799
$$ plain form
10287 86117 -335159 -184630 -157317 -48052 -164175 -108132 284681 -198922 -327829 -191948
10277 -191948 -132510 62663 -21850 -245916 -173644 -15779 210706 358500 -93410 -85052 120849
10265 -118121 -57493 -407859 73415 293377 -25813 -158979 196405 110964 -76894 -133605 -57725
10253 -99646 -10471 82617 156297 156347 93932 -104065 388346 268525 495734 -4015 83580 223644
10241 223644 396050 134361 45062 -130733 -59829 61305 -114686 -16095 83282 179382 -186043
10229 94471 31966 -117263 85484 20693 97536 -103237 -36678 39438 -66918 41833 -142541
10217 116431 -4949 206702 -134620 116901 -132752 -247935 88200 -241816 -323309 55020
10206 -131819 -528728 -51838 68819 -89582 -49594 36579 -182761 -184046 -106389 76881 -403799
10194A97319A2428a30342f0188b4685j61732r6660A25114D2608b3724k57882H2841
10182a77226c2596A6949a97710E934c04510M1387k92547c633C4522M6465a64667
10170a07104A14566a10847B71886a69041e8724H8388J7966c29346a23989A33350
10159d18255F1476B3991Q538b2688k97334a43822k08843J06397J19766A15643
10148A85517f2010j78745I6099a0241j39871B26795a03636D20055A45286n6150
10138H9136q381d3444k8501k64755J47949H2251a89010c4465C0738c15406d3158
10126d504j46773b9263A20094c20367B3430H333a41484A2297L25529d89203C60363
10114F9093K9941f3449b7758C02452a63468r5841i3518A08956J00528a34233m4794
$$ plain form
10194 197319 12428 -130342 -60188 -24685 -186417 -283077 125114 42608 -23724 -281606 82841
10182 -177226 -32596 16949 -197710 5934 -304510 -263123 -555670 -3633 34522 80987 -164667
10170 -107104 114566 -110847 271886 -169041 -58724 88388 106354 -329346 -123989 133350
10159 -418255 61476 23991 32529 -22688 -320022 -143822 -352665 -246268 -126502 115643
10148 185517 -62010 -240755 96099 -10241 -150112 226795 -103636 420055 145286 89136
10138 89136 80755 -43444 -71945 -336700 -188751 82251 -189010 -34465 30738 -315406 -43158
10126 -4504 -151277 -29263 120094 -320367 23430 8333 -141484 12297 337826 -489203 360363
10114 69093 99034 -63449 -27758 302452 -163468 -259309 -93518 108956 209484 -134233 -179027
10103a79027q182M8860M8768c7806f54r5902j18324J03806k02657F059R1758J61531
10091B59348a74132J7404B47250d66602e3774m5924k010J556l12781E3704a81538
10079b2951A80125A01h4376A04696c08233j18637b04903n746i6852B67369c72706
10067B82797b26499C25995g1044C11531p0345k7634A05137C9872b4720A9745e43
10055G5445a5851A27290a1246B76821h8534C0355J20040f9173N011k7044r5816
10044a87022p875G9450J96579A05431d8585k65211B93093d5234j29872c193H333
10032b26896O2218r5310R7374a0131l62123J75797j56779h5419c8985a5167B71756
10020G153L3109N4429B7809d5976j64829M0336M0296E7293a49803f0782C5053
$$ plain form
10103 -179027 -187209 -138349 -89581 -37806 -654 -96556 -214880 -111074 -313731 6059 97817 259348
10091 259348 -174132 -156728 247250 -466602 -53774 -99698 -101708 -100152 -412933 53704 -181538
10079 -22951 180125 101 -84376 104696 -308233 -426870 -204903 -210649 -96852 267369 -372706
10067 282797 -226499 325995 -71044 311531 241186 213552 105137 39872 -24720 19745 -543
10055 75445 -15851 127290 -11246 276821 -88534 30355 150395 -69173 -64162 -91206 -187022
10044 -187022 -194897 79450 276029 105431 -48585 -313796 293093 -45234 -175106 -3193 8333
10032 -226896 -164678 -259988 -162614 -10131 -372254 -196457 -353236 -85419 -38985 -15167 271756
10020 7153 40262 94691 27809 -45976 -210805 -170469 -130173 57293 -149803 -60782 35053
10008H0545e7601B15662l3606C9124a44530c0906j07396F1677i3034d5165j44274
9997a89439b8916o7361B63272E7845a6903C7181E519a13389j07357h9457j17630
9986b07087K2654H7301i7320B47900O598c1924A1801N3723b45772i2747A15835
9974A18380a19007b4690l9438k71824G96P0321j873f1872j66473i8863a8400j52154
9962a70554q5955J10836j19375H3648L7689J75240D5672j6126o294M632L6232
9951F4116a32101l4994N1448B0740a01720M3454j27337j89995A14444c16861h5789
9939a68072C51324b38882a007j14991A37488h6537A1826K29313b0484j12398j3279
9928a46161c2050A31088D5228a311C11331a61624B98170r0922n1894d1096P780
$$ plain form
10008 80545 -57601 215662 182056 39124 -144530 -30906 -138302 61677 -93034 -45165 -189439
9997 -189439 -28916 -96277 263272 57845 -16903 37181 5519 -113389 -220746 -89457 -207087
9986 -207087 -184433 87301 -97320 247900 254498 -31924 11801 65524 -245772 -92747 115835
9974 118380 -119007 -24690 -64128 -335952 796 71117 69244 -61872 -228345 -98863 -18400 -170554
9962 -170554 -256509 -145673 -265048 83648 121337 296577 45672 29546 23252 27884 64116
9951 64116 -132101 -167095 -115647 20740 -101720 -58266 -185603 -375598 114444 -316861 -85789
9939 -168072 351324 -238882 -1007 -115998 137488 -86537 11826 241139 -20484 -132882 -146161
9928 -146161 -32050 131088 45228 -1311 311331 -161624 298170 207248 155354 -41096 -33316
9917c3316j74372K1191C5586J4062L5188b23906C0538b39127A04866l4116L1801
9906A02551j8681D75c07122m4495A73952p2239a45671j28958A17294a03503C3357
9894G9951c42362d5088l9012D17085H9158j6026a75288O9277C21066A4778c7867
9882a96739g229A3216b68944A246a35719A29771b21775g0780E8642J4541Q6640
9871A59823p2378b55656b8070A46962a82663g8936E7015b49240A75526e9810a5490
9859C34903d17673C33486b00764L0513h0066E124K26886G0109a3713k3658l0697
9848f8068j68406l3572D348Q3572B5513c5717F2326d2391j42667A1347a4263r9317
9836a13580n1160l5239D8060b66351a910r1836K1112A72903b42199n7414C3478
$$ plain form
9917 -33316 -207688 -186497 35586 49648 84836 -223906 30538 -239127 104866 70750 102551
9906 102551 83870 475 -307122 -351617 173952 101713 -145671 -274629 117294 -103503 33357
9894 79951 -342362 -45088 -84100 417085 89158 73132 -175288 -106011 321066 14778 -37867
9882 -196739 -7229 13216 -268944 1246 -135719 129771 -221775 -70780 58642 73183 159823
9871 159823 87445 -255656 -28070 146962 -182663 -78936 57015 -249240 175526 -59810 -15490
9859 334903 -417673 333486 -200764 -170251 -80066 5124 232010 70109 -13713 -37371 -68068
9848 -68068 -236474 -270046 4348 87920 25513 -35717 62326 -42391 -185058 11347 -14263 -113580
9836 -113580 -164740 -199979 48060 -266351 -1910 -93746 -72634 172903 -242199 -299613 33478
9824g7240L0639a2652j74468A6376J69403C6986d07874a75A1479J98350b6778
9812b93152C6665a15110D2867a67678D0507M73423e43893A35179a87210B60029
9801A44712c11770d3251k0103j36308A7143e7781j73256k1646C53085A14676a26510
9789b19637A32768e5215j00411M6240k09139i1009B12416I4235a57974N3307N946
9778i8721m402d8122j88883k2895D5408b6356l36564C81948d2710B13710D168
9766i4497I8863b86501a21120I398g9195r2499f9197l09117J78741A14566L3569
9755A48135a21694L9404A59751e9841j9343j43091l2724J23310j76596A4262P9430
9744I3692e4920B55213E0475g2750n6366M5594m00882R6634a19491N7023k25362
$$ plain form
9824 -77240 -46601 -12652 -187120 16376 185779 36986 -407874 -175 11479 209829 -26778
9812 -293152 36665 -115110 42867 -167678 40507 513930 -543893 135179 -187210 260029
9801 144712 -311770 -43251 -63354 -199662 17143 -57781 -231037 -252683 353085 114676 -126510
9789 -219637 132768 -55215 -155626 -109386 -318525 -91009 212416 94235 -157974 -104667 -98721
9778 -98721 -103123 -48122 -237005 -259900 45408 -26356 -362920 381948 -42710 213710 4168
9766 -94497 98863 -286501 -121120 9398 -79195 -171694 -69197 -378314 -199573 114566 148135
9755 148135 -121694 -82290 159751 -59841 -79184 -222275 -254999 -131689 -308285 14262 93692
9744 93692 -54920 255213 50475 -72750 -129116 -83522 -484404 -387770 -119491 -62468 -287830
9733b87830A83438d3341B24379B8098J62320a28050B64013i6987a8054j64427
9723a82481j50079O7138A24494e59449B87418b04181B34398d3196G4575A7317
9712h7024F7285B2481d9209j47857A07776c8521A41943I83a70100f1538j97112
9701b58650e919j45179d9832l62808a89915A08976d5194r0673C6792c10778f2500
9689c73071a45787a5705n9977C0735j1473c1638r8223N4906A14754a86110K9649
9678a56461B83120a20163C12449c60288a66597p5974a8069l38237j17651h5006
9667A45728L4152a21810B0367a55566o1602k60755h6684k13193a09119j49047
9657b58166p520b5283j02983K4348d2592j34630A9426d9206p1805A73947F0031
$$ plain form
9733 -287830 183438 -43341 224379 28098 190418 -128050 264013 -96987 -18054 -182481
9723 -182481 -332560 -265422 124494 -559449 287418 -204181 234398 -43196 74575 17317
9712 -87024 67285 22481 -49209 -197066 107776 -38521 141943 983 -170100 -61538 -258650
9701 -258650 -5919 -151098 -49832 -412640 -189915 108976 -45194 -135867 36792 -310778 -62500
9689 -373071 -145787 -15705 -75682 30735 19262 -31638 -129861 -74955 114754 -186110 -156461
9678 -156461 283120 -120163 312449 -360288 -166597 -242571 -18069 -356306 -473957 -85006
9667 145728 179880 -121810 20367 -155566 -217168 -477923 -86684 -299877 -109119 -258166
9657 -258166 -265686 -25283 -128266 -103918 -42592 -177222 19426 -49206 -121011 173947 60031
9645h523A2922b18144k6245f1154k02342j51704a11619A31284a66379b5854j83367
9634b09221J8080A74777J9522a20692o0750a5007A05311A3634a87478K591H7451
9622b07412j88232B84774b40194h3005l68311c0366B0702g9802A8693K38532b56998
9610B96067a12345A34828c42120A59227Q443b40543A75854e5846D6087M281e0035
9598C9403K2879a87241K0144M1082L8616a2436A05473J82711d24000C5722g0185
9586c36107A25283a5686r4487A39317n4360M9705A6271P4073b1498C1354K26009
9575B57363d23142h6240k69248a69232O4281H6625J066c99775d2579D9775j2663
9564C7112a48065I1225a53532j50742A30931g3686B6510d6292j54110E6606J48469
$$ plain form
9645 -8523 12922 -218144 -244389 -61154 -263496 -415200 -111619 131284 -166379 -25854 -209221
9634 -209221 -191141 174777 194299 -120692 -181442 -15007 105311 13634 -187478 -184887 87451
9622 -207412 -395644 284774 -240194 -83005 -451316 -30366 20702 -79802 18693 257225 -256998
9610 296067 -112345 134828 -342120 159227 167670 -240543 175854 -55846 46087 50368 -50035
9598 39403 62282 -187241 -167097 -126015 -87399 -12436 105473 288184 -424000 35722 -70185
9586 -336107 125283 -15686 -110173 139317 84957 134662 16271 90344 -21498 31354 257363
9575 257363 -423142 -86240 -355488 -169232 -104951 86625 87691 -399775 -42579 49775 37112
9564 37112 -148065 91225 -153532 -304274 130931 -73686 26510 -46292 -200402 56606 205075
9553B05075b21162r9011M3954A38529l3800A9438i5461j25766B267b73198A8836
9541G6487b28975b7365j2574C4020c75338F2462N8745c50345A56818a46698A12953
9529B32189C8794f7786E4191b67140i9918p3787r324n7864A77033a05402C31318
9517d7521q4688b1685l12225J04065C5318d2222l8717n2520l3222c664A21242
9505a16813A7230L8867d560B49729B6834b32259M4225F7428f0724C6997K19935
9494B56932b61664c0746H3049A5398h275A698b2605q9145N0736a8379j86487i1976
9481A05388J11B9388L1637a91792C36850e030A18368R9979D2758b54840a26198
9469b02212F6295g7921j52003f9706M618n4811A50817a61635c8531j77693B56133
$$ plain form
9553 205075 -221162 -320173 -276219 138529 104729 19438 -95461 -221227 2267 -273198 18836
9541 76487 -228975 -27365 -39939 34020 -375338 62462 121207 -350345 156818 -146698 112953
9529 232189 38794 -67786 54191 -267140 -99918 -173705 -183029 -240893 177033 -105402 331318
9517 -47521 -132209 -21685 -333910 -229845 35318 -42222 -80939 -133459 -166681 -3664 121242
9505 -116813 17230 56097 -4560 249729 26834 -232259 -188034 67428 -60724 36997 256932
9494 256932 -261664 -30746 83049 15398 -8275 1698 -22605 -111750 -61014 -18379 -204866 -91976
9481 105388 105499 29388 61025 -191792 336850 -5030 118368 218347 42758 -254840 -126198
9469 -202212 66295 -77921 -229924 -69706 -65088 -119899 150817 -161635 -38531 -216224 256133
9457b55491b4064j89784r9104a20558N2863j43615b6505k98372A69371C0538a45422
9445a7142g059A97836a66999B022d9053j26586E788b0199A13033C2425e3210k0984
9433g4194j88433A59658A8635L4950a20427k92191b6677B2578c83433A25341J0911
9422A36252i2780A29939a13708A16663A6872d7672j06738E5139c17397A59803
9411B7794n857c6798A53056D3450a51780B77641c22817l056O6262A65676a21299
9399E6185e2453j57569k823k56185J63734a48235M4953j99553H6077c66569i1240
9387b49463A939e6764r5870d1678C7594K28901h4439n4623E3001b122B14804a9775
9374A45222B9441L3747e9137H7358J74729b37668A03563d3163A41732a10666j0177
$$ plain form
9457 -255491 -24064 -213848 -312952 -120558 -67695 -211310 -26505 -324877 169371 30538 -145422
9445 -17142 -7059 197836 -166999 2022 -49053 -175639 5788 -20199 113033 32425 -53210 -74194
9433 -74194 -262627 159658 18635 53585 -120427 -412618 -26677 22578 -383433 125341 136252
9422 136252 -92780 129939 -113708 116663 16872 -47672 -154410 55139 -317397 159803
9411 27794 21937 -36798 153056 43450 -151780 277641 -322817 -325873 -259611 165676 -121299
9399 56185 -52453 -210022 -212845 -469030 -305296 -148235 -103282 -302835 86077 -366569 -91240
9387 -249463 1939 -56764 -152634 -41678 37594 266495 -84439 -139062 53001 -2122 214804 -19775
9374 145222 29441 63188 -59137 87358 262087 -237668 103563 -43163 141732 -110666 -120843
9363a20843r1211k3857h8579k14181Q6416a03090g243p1011q0613A6870K1816
9352C8686d14333J59355A25372a39542Q765j43644H5000b05330f6140A09311b76282
9340A24199g6425n5783B49685a56343P6445E6490b20778G6514g3566p9849n6100
9329b09515k61895K26611m101F9229a01890A76428F8288b24706G2010b67545B53434
9317d84515i0900b0042j16774G2151d6533C589c19778a43338A06158j3951g8217
9305b74299a31864F0597a33420k2651N1108J653R272k9779q9516n4228B53797
9293g8046j43598a3824B06186l8056B9849i3772q9488I0525g3852A6854a90108
9281c30843a56155m3603a285B96085a24892j43275f0810k33915e0054p6510L9433
$$ plain form
9363 -120843 -212054 -235911 -88579 -302760 -216344 -103090 -7243 -78254 -158867 16870 38686
9352 38686 -414333 -254978 125372 -139542 -130777 -274421 85000 -205330 -66140 109311 -276282
9340 124199 -76425 -132208 249685 -156343 -79898 56490 -220778 76514 -73566 -153415 -209515
9329 -209515 -471410 -244799 -248900 69229 -101890 176428 68288 -224706 72010 -267545 253434
9317 -484515 -90900 -20042 -136816 72151 -46533 3589 -319778 -143338 106158 92207 -78217
9305 -274299 -131864 60597 -133420 -156071 -104963 -103310 -94038 -123817 -213333 -267561 253797
9293 -78046 -221644 -13824 206186 168130 29849 -93772 -183260 90525 -73852 16854 -190108
9281 -330843 -156155 -199758 -1285 296085 -124892 -268167 -60810 -294725 -50054 -126564 -87131
9270h7131F4781b34299K3462g8833A1051i6142m1132B24236c47767E6275a43952
9258a13547j98302A7532R3196d72778b0175j72584a4112B83545c98980d2508K0817
9247b1691k87363a33475e1493n2597A1229a84512k37166h6200B62294b30157E8282
9235d0458B7286J37969C8071J66358c61223c3890k72923a19065b4749r5627I5808
9223a2920C29735a12916c2075A53144L55656b78819d2959j73558M3020c4666D3983
9211a9983B48886a19587D3365J01270b78147E1632a25130l3921l965B6770c4298
9199h306j86295f3805b9154B065O677a82383Q6571a3375A31188L63910a78227
9187B9483K48874a17099p8996O6833N7689A96701b54165g9209E5729c26652h4426
$$ plain form
9270 -87131 64781 -234299 -210837 -78833 11051 -96142 -137274 224236 -347767 56275 -143952
9258 -113547 -311849 17532 110728 -472778 -20175 -192759 -14112 283545 -398980 -42508 -21691
9247 -21691 -309054 -133475 -51493 -104090 11229 -184512 -421678 -86200 262294 -230157 58282
9235 -40458 27286 165255 38071 204429 -361223 -33890 -306813 -119065 -24749 -120376 95808
9223 -12920 329735 -112916 -32075 153144 508800 -278819 -42959 -216517 -173497 -34666 43983
9211 -19983 248886 -119587 43365 144635 -278147 51632 -125130 -159051 -163016 26770 -34298
9199 -8306 -194601 -63805 -29154 2065 8742 -182383 -95812 -13375 131188 495098 -178227
9187 29483 278357 -117099 -196095 -129262 -71573 196701 -254165 -79209 55729 -326652 -84426
9175A8329c04683F0094d32099b12921G2315g7874B5951M0410N0066b8291A62997
9163i1734p0274C4809a06218l8439A71637b76l13523D541O7608g7871b1799m1853
9151f3652p90l02711b8067j3041q7155A51301E3851g2362n9592k736H9073R1517
9139A80590J7018F3622M8903J47777a66969H4815g3011h565k15183A27725c2918
9127A65480B1479a16060A44083b03340B4674c41796d1966l32484B67824D7417
9116E2223d28090a45865A72860q1634d1406E1707j2153J7643b5532j09564B63554
9104A14053f6006r2662A2896a46455N0430D8685i162A85235a75537A46661a36501
9092b44426C2022Q3130b51799J18079A7620c12423A64550N2328c32939C2657h9558
$$ plain form
9175 18329 -304683 60094 -432099 -212921 72315 -77874 25951 66361 116427 -28291 162997
9163 -91734 -162008 34809 -106218 -144657 171637 -276 -313799 4541 72149 -77871 -21799 -63652
9151 -63652 -64442 -367153 -28067 -41108 -128263 151301 53851 -72362 -131954 -134690 89073 180590
9139 180590 197608 63622 112525 260302 -166969 84815 -73011 -8565 -223748 127725 -32918
9127 165480 21479 -116060 144083 -203340 24674 -341796 -41966 -374450 267824 47417
9116 52223 -428090 -145865 172860 91226 -41406 51707 39554 57197 -25532 -135096 263554
9104 114053 -66006 -158668 12896 -146455 -96025 48685 -9162 185235 -175537 146661 -136501
9092 -244426 32022 115152 -251799 -133720 17620 -312423 164550 216878 -332939 32657 -89558
9080e3616H5436b44695a07162H2236q147b98601E9443J32134b04974j90984a56168
9068A43747b33134a0214B29722b05789j5769a07867f823F4622c16963h0038o9814
9057a49852A8229e434j53119j34791L0156h3789k52566B5065f0742K3218m76382
9046e13906a16450K3288A65223E7373J14357c81816n0280A36945J37136d6031
9035a3287j23329K3238c1578k26131a06115j14632f532k87167H894c17601a34475
9023A22597j6770A9651k352K96232c82944f0348H388b33351k00387Q9639f0836
9011A68441c57014B44573C5185Q5722b43767C1757a30615H3419a32762H6354b02480
8999A48317c59333e4929j06864q2060N1531A4321c4861j9552I006c48872A68439
$$ plain form
9080 -53616 85436 -244695 -107162 82236 74089 -298601 59443 191577 -204974 -395958 -156168
9068 143747 -233134 -10214 229722 -205789 -221558 -107867 -6823 64622 -316963 -80038 -149852
9057 -149852 18229 -5434 -158553 -293344 -263188 -83789 -336355 25065 -60742 -37524 -513906
9046 -513906 -116450 -93162 165223 57373 171730 -381816 -432096 136945 274081 -46031
9035 -13287 -136616 -113378 -31578 -257709 -106115 -220747 -6532 -293699 8894 -317601 -134475
9023 122597 105827 19651 17299 313531 -382944 -60348 8388 -233351 -433738 -344099 -60836
9011 168441 -357014 244573 35185 120907 -243767 31757 -130615 83419 -132762 86354 -202480
8999 148317 -359333 -54929 -161793 -243853 -192322 14321 -34861 -54413 9006 -348872 168439
8987I343P0134h812C50959B1490b29136n6954A49921C6033b93967Q3644B75081
8975i9813B80797i0673k27880L8014n8074A36046R7286a76916o3522e1769j75837
8964b27606B5997b31046i1529k9287A33671Q8335a9242B1691g4328C48271C7438
8952g3701m54210a38089M5327g995l03128A81646L8356b8098j03092j03485f2185
8940a44924o30B1558a05281k22138C4075Q6474o544a284C28327j38257a42628
8928C44539A3275L85058j03323c0019d09B38551A13688J29516q1049L01902A39075
8916C4950L87851r1223J91388r7359q0773M37190P0754J191570Q87231K145527
8906E077106O760090m213944l399228j772010j174237n86908J21406A20189D6464
$$ plain form
8987 9343 79477 -8812 350959 21490 -229136 -286090 149921 36033 -293967 -210323 275081
8975 -99813 280797 -90673 -318553 -280539 -338613 136046 233332 -176916 -240438 -51769 -227606
8964 -227606 25997 -231046 -91529 -120816 133671 222006 -19242 21691 -74328 348271 37438
8952 -73701 -527911 -138089 -92762 -7995 -311123 181646 220002 -28098 -131190 -234675 -62185
8940 -144924 -145554 21558 -105281 -327419 34075 120549 114005 -1284 328327 190070 -142628
8928 344539 13275 398333 295010 -30019 -409 238551 113688 243204 162155 464057 139075
8916 34950 422801 331578 522966 425607 344834 782024 852778 2044348 2931579 5077106
8906 5077106 11837196 7623252 4224024 2452014 1277777 690869 812275 120189 46464
8896B6991J50111K4168L4448J40885j01342P4449J85067B30085c03040F6589a84888
8884b8803l08024F9595A2994a99731E256K89667j08986B7521b16769B88257b55168
8872a4858j50490o5900a14440M5764B95306j12381B0786J12256b1345C16572a69337
8860A36412c62619p7405j34490b23133a5812A22382h2147G7825J6828m537b91609
8848A68592J44459a58337N0795A80470E4245J22353G1263A9969a38584O6311j27161
$$ plain form
8896 26991 177102 201270 235718 376603 275261 349710 534777 230085 -303040 66589 -184888
8884 -28803 -336827 69595 12994 -199731 5256 294923 185937 27521 -216769 288257 -255168
8872 -14858 -165348 -231248 -114440 -68676 295306 182925 20786 133042 -21345 316572 -169337
8860 136412 -362619 -440024 -574514 -223133 -15812 122382 -82147 77825 94653 90116 -291609
8848 168592 313051 -158337 -107542 180470 54245 176598 71263 19969 -138584 -72273 -199434
$$ [...]
##END NTUPLES=NMR SPECTRUM
##END=
