
##TITLE=AC1225_PUEHDE098_6075357_c2Lw6cslGK
##JCAMPDX= 6.0         $$ Bruker NMR JCAMP-DX V2.0
##DATA TYPE= NMR SPECTRUM
##DATA CLASS= NTUPLES
##ORIGIN= BRUKER
##OWNER= Administrator
$$ 1.72 TOPSPIN		Version 2.1
$$ 2012-05-08 21:36:41.640 -0500  Administrator@TOPSPIN
$$ Compression mode = diff/dup
##.OBSERVE FREQUENCY= 400.13188235
##.OBSERVE NUCLEUS= ^1H
##.ACQUISITION MODE= SIMULTANEOUS (DQD)
##.ACQUISITION SCHEME= undefined
##.AVERAGES= 64
##.DIGITISER RES= 22
##SPECTROMETER/DATA SYSTEM= spect
##.PULSE SEQUENCE= noesygpps1d.comp
##.SOLVENT NAME= COFFEE_meoh
##.SHIFT REFERENCE= INTERNAL, COFFEE_meoh, 1, 14.96668
##AUDIT TRAIL= $$ (NUMBER, WHEN, WHO, WHERE, PROCESS, VERSION, WHAT)
$$ ##TITLE= Audit trail, TOPSPIN		Version 2.1
$$ ##JCAMPDX= 5.01
$$ ##ORIGIN= Bruker BioSpin GmbH
$$ ##OWNER= Administrator
$$ $$ C:\Bruker\TOPSPIN/data/COFFEE/nmr/AC1225_PUEHDE098_6075357_c2Lw6cslGK/22/pdata/1/auditp.txt
$$ ##AUDIT TRAIL=  $$ (NUMBER, WHEN, WHO, WHERE, PROCESS, VERSION, WHAT)
(   1,<2012-05-08 21:36:36.546 -0500>,<Administrator>,<TOPSPIN>,<go>,<TOPSPIN 2.1>,
      <created by zg
	started at 2012-05-08 21:25:06.250 -0500,
	POWCHK enabled, PULCHK disabled,
       configuration hash MD5:
       AF F2 23 6B 01 CD 40 DD E5 A1 38 A0 06 EA F7 77
       data hash MD5: 64K
       73 8F 7D 5A 73 18 B0 C0 3D 86 69 D5 D2 9D EC 44>)
(   2,<2012-05-08 21:36:39.406 -0500>,<Administrator>,<TOPSPIN>,<proc1d>,<TOPSPIN 2.1>,
      <Start of raw data processing
       efp LB = 0.3 FT_mod = 6 PKNL = 1 PHC0 = 0 PHC1 = 0 SI = 128K 
       data hash MD5: 128K
       05 FD 13 9C BD 52 A3 CE 12 68 19 18 38 A7 A9 1F>)
(   3,<2012-05-08 21:36:40.609 -0500>,<Administrator>,<TOPSPIN>,<proc1d>,<TOPSPIN 2.1>,
      <pk PHC0 = 34.58496 PHC1 = 0 
       data hash MD5: 128K
       52 41 1E BC 38 46 AF 5E B0 C5 BF 1C 0F 1B 4D 4C>)
(   4,<2012-05-08 21:36:41.343 -0500>,<Administrator>,<TOPSPIN>,<proc1d>,<TOPSPIN 2.1>,
      <abs ABSG = 1 
       data hash MD5: 128K
       4B 80 D8 D7 2C DC B8 FC 7E 9B 05 0F 4B 31 3C E1>)
(   5,<2012-05-08 21:36:41.406 -0500>,<Administrator>,<TOPSPIN>,<proc1d>,<TOPSPIN 2.1>,
      <abs ABSG = 2 
       data hash MD5: 128K
       03 30 24 40 E8 98 84 63 70 1B DF 9C 39 48 8C 48>)
(   6,<2012-05-08 21:36:41.453 -0500>,<Administrator>,<TOPSPIN>,<proc1d>,<TOPSPIN 2.1>,
      <abs ABSG = 3 
       data hash MD5: 128K
       19 2F 53 F1 9B 3D 71 29 FA 08 7B E3 8A 0F A6 C4>)
(   7,<2012-05-08 21:36:41.515 -0500>,<Administrator>,<TOPSPIN>,<proc1d>,<TOPSPIN 2.1>,
      <abs ABSG = 4 
       data hash MD5: 128K
       69 73 6B 5A 4B 5C 0A AF 71 E3 84 12 3A 21 11 34>)
(   8,<2012-05-08 21:36:41.562 -0500>,<Administrator>,<TOPSPIN>,<proc1d>,<TOPSPIN 2.1>,
      <abs ABSG = 5 
       data hash MD5: 128K
       77 9F 5D EF BF 98 8D 58 80 51 43 1B A8 74 22 82>)
$$ ##END=
$$ 
$$ $$ hash MD5
$$ $$ DF D9 F9 51 57 F4 7B 0A 94 AD FD C0 6C A6 B6 DE
##$RELAX= 
##$RELAX= 
##$RELAX= 
##$RELAX= 
##$RELAX= 
##$RELAX= 
##$RELAX= 
##$RELAX= 
$$ Bruker specific parameters
$$ [...]
##$TP07= 0
##$TPNAME0= <>
##$TPNAME1= <>
##$TPNAME2= <>
##$TPNAME3= <>
##$TPNAME4= <>
##$TPNAME5= <>
##$TPNAME6= <>
##$TPNAME7= <>
##$TPOAL= (0..7)
0.5 0.5 0.5 0.5 0.5 0.5 0.5 0.5
##$TPOFFS= (0..7)
0 0 0 0 0 0 0 0
##$TUNHIN= 0
##$TUNHOUT= 0
##$TUNXOUT= 0
##$USERA1= <user>
##$USERA2= <user>
##$USERA3= <user>
##$USERA4= <user>
##$USERA5= <user>
##$V9= 5
##$VALIST= <valist>
##$VCLIST= <CCCCCCCCCCCCCCC>
##$VD= 0
##$VDLIST= <DDDDDDDDDDDDDDD>
##$VPLIST= <PPPPPPPPPPPPPPP>
##$VTLIST= <TTTTTTTTTTTTTTT>
##$WBST= 1024
##$WBSW= 4
##$XGAIN= (0..3)
0 0 0 0
##$XL= 0
##$YL= 0
##$YMAX_a= 12105151
##$YMIN_a= -5904203
##$ZGOPTNS= <>
##$ZL1= 120
##$ZL2= 120
##$ZL3= 120
##$ZL4= 120
##$ABSF1= 14.96668
##$ABSF2= -5.585851
##$ABSG= 5
##$ABSL= 3
##$ALPHA= 0
##$AQORDER= 0
##$ASSFAC= 0
##$ASSFACI= 0
##$ASSFACX= 0
##$ASSWID= 0
##$AUNMP= <proc_prof1d_extract.lims>
##$AXLEFT= 0
##$AXNAME= <>
##$AXNUC= <1H>
##$AXRIGHT= 0
##$AXTYPE= 0
##$AXUNIT= <>
##$AZFE= 0.1
##$AZFW= 0.1
##$BCFW= 0
##$BC_mod= 0
##$BYTORDP= 0
##$COROFFS= 0
##$CY= 15
##$DATMOD= 1
##$DC= 0
##$DFILT= <>
##$DTYPP= 0
##$F1P= 0
##$F2P= 0
##$FCOR= 0.5
##$FTSIZE= 131072
##$FT_mod= 6
##$GAMMA= 0
##$GB= 0
##$INTBC= 1
##$INTSCL= 1
##$ISEN= 128
##$LB= 0.3
##$LEV0= 0
##$LPBIN= 0
##$MAXI= 10000
##$MC2= 0
##$MEAN= 0
##$ME_mod= 0
##$MI= 0
##$NCOEF= 0
##$NC_proc= -3
##$NLEV= 6
##$NOISF1= 0
##$NOISF2= 0
##$NSP= 0
##$NTH_PI= 0
##$NZP= 0
##$OFFSET= 14.96668
##$PC= 1
##$PHC0= 34.58496
##$PHC1= 0
##$PH_mod= 1
##$PKNL= yes
##$PPARMOD= 0
##$PPDIAG= 0
##$PPIPTYP= 0
##$PPMPNUM= 2147483647
##$PPRESOL= 1
##$PSCAL= 4
##$PSIGN= 0
##$PYNMP= <proc.py>
##$REVERSE= no
##$SF= 400.130005574331
##$SI= 131072
##$SIGF1= 0
##$SIGF2= 0
##$SINO= 400
##$SIOLD= 131072
##$SPECTYP= <>
##$SREGLST= <1H.CDCl3>
##$SSB= 0
##$STSI= 131072
##$STSR= 0
##$SW_p= 8223.68421052632
##$SYMM= 0
##$S_DEV= 0
##$TDeff= 65536
##$TDoff= 0
##$TI= <>
##$TILT= no
##$TM1= 0
##$TM2= 0
##$TOPLEV= 0
##$USERP1= <user>
##$USERP2= <user>
##$USERP3= <user>
##$USERP4= <user>
##$USERP5= <user>
##$WDW= 1
##$XDIM= 131072
##$YMAX_p= 330720516
##$YMIN_p= -22016582
##$CURPLOT= <Network HP LaserJet P1505>
##$CURPRIN= <$Network HP LaserJet P1505>
##$DFORMAT= <normdp>
##$LAYOUT= <+/1D_H.xwp>
##$LFORMAT= <normlp>
##$PFORMAT= <normpl>
##$SURQMSG= 1
$$ End of Bruker specific parameters
$$ ---------------------------------
##NTUPLES= NMR SPECTRUM
##VAR_NAME=  FREQUENCY,     SPECTRUM/REAL,   SPECTRUM/IMAG
##SYMBOL=    X,             R,               I
##VAR_TYPE=  INDEPENDENT,   DEPENDENT,       DEPENDENT
##VAR_FORM=  AFFN,          ASDF,            ASDF
##VAR_DIM=   131072,        131072,          131072
##UNITS=     HZ,            ARBITRARY UNITS, ARBITRARY UNITS
##FACTOR=    0.0627417313425165, 1,          1
##FIRST=     8223.62146879498, -2870,        -118835
##LAST=      0,             1479,            -120182
##MIN=       0,             -22016582,       0
##MAX=       8223.62146879498, 330720516,    0
$$ Real data points
##PAGE= N=1
##DATA TABLE= (X++(R..R)), XYDATA
$$ [...]
61071A060426o935n804n812o857p824p967p450o705n972n410n075m633l566j762
61057I78654K43J625J837J017L0j15Q27K172L068L192K613J416l07k458n215q945
61041I79654j3467j7683k0215k0322j8196j4952j2461j2318j4235j5965j5525
61030H04315j3221j0872r440q301o792n404n139o080p059o791n282l887l701m049
61016G08297l338j427K6Q2J13J784M456O111O139N515M679L262J903K183M076
61001G43861N382M743L550L694M860N571N642N852O029N390M458M740O454Q115
60987H18341Q659Q444P871O556M596L318L726M997N648N586N904P026Q174Q801
60973I07647R631J1744J5134J8578K0879K1976K2942K5035K8799L4028M0522M8607
$$ y = [1060426, 1053491, 1047687, 1041875, 1035018, 1027194, 1019227, 1011777, 1005072, 999100, 993690, 988615, 983982, 980416, 978654, 978897, 980522, 982359, 983376, 983406, 983291, 984118, 986290, 989358, 992550, 995163, 996579, 996272, 993814, 988599, 979654, 966187, 948504, 928289, 907967, 889771, 874819, 862358, 850040, 835805, 819840, 804315, 791094, 780222, 770782, 762481, 755689, 750285, 745146, 739066, 732007, 725216, 719934, 716047, 712346, 708297, 704959, 703532, 703558, 703640, 703753, 705537, 709993, 716104, 722243, 727758, 732437, 735699, 737602, 739785, 743861, 749243, 753986, 757536, 761230, 766090, 771661, 777303, 783155, 789184, 794574, 799032, 803772, 810226, 818341, 827000, 835444, 843315, 849871, 854467, 857785, 861511, 866508, 872156, 877742, 883646, 890672, 898846, 907647, 917278, 929022, 944156, 962734, 983613, 1005589, 1028531, 1053566, 1082365, 1116393, 1156915, 1205522]
60961A205522N8748P0773Q3717R6697J09813J24110J40745J60381J82779K05310
60951B438595K20770K18176J89468J37884P8867L0418J984p162j387J4950L3751
60940C356314M0763K2733k1657p9719j34098j73244j94226j99498j93618j81520
60930B242230j66950j51533j35810j20661j06959r4492q2606p1701o2867n6053
60920A192598m9920m3729l8098l3551k9442k5134k1133j8153j5900j3682j1622
60909H92234j0264r468q760q333q590q976q549p587p274p705p621o501n529n697
60895G81380o273o131n578n598o085o142n653n208m794l976l232l594m812n310
60881G08994m473l678m268n721o746p258q046r105r592r251q755q564q341p607
$$ y = [1205522, 1264270, 1335043, 1418760, 1515457, 1625270, 1749380, 1890125, 2050506, 2233285, 2438595, 2659365, 2877541, 3067009, 3204893, 3283760, 3314178, 3316162, 3309000, 3307613, 3322563, 3356314, 3397077, 3419810, 3398153, 3318434, 3184336, 3011092, 2816866, 2617368, 2423750, 2242230, 2075280, 1923747, 1787937, 1667276, 1560317, 1465825, 1383219, 1311518, 1248651, 1192598, 1142678, 1098949, 1060851, 1027300, 997858, 972724, 951591, 933438, 917538, 903856, 892234, 881970, 872502, 863742, 855409, 846819, 837843, 829294, 821707, 814433, 806728, 799107, 792606, 787077, 781380, 775107, 768976, 763398, 757800, 751715, 745573, 739920, 734712, 729918, 725942, 722710, 719116, 714304, 708994, 704521, 700843, 696575, 690854, 684108, 676850, 668804, 659699, 650107, 640856, 632101, 623537, 615196, 607589]
60867F07589o297m577k745j426j147j601j900j700j500j617j654j198m61K66J186
60852E81218K491L699M095L632K847K181J801J965K862M053M607M016K772J865
60838F24104J848K347K403J422j25j157j266j199j819k984l971m642n440o387
60824F03134o874o600o001n492m890l964l039k630k732k884k746k267j478l96
60810E51141Q73K016K576K259J495J452K899M996N804M349J694k19m35N94J730
60795E83224J950R03o97j474o76J199L234N051O524P221O839N897N210M898M515
60780F33818L852K959J727K32q55j122j332k405l792m148l628l852n242o005m739
60765F05468k714k274l802n583o193n799n293n210n531n733n192m156l980n517
$$ y = [607589, 601292, 596715, 593970, 592544, 591397, 589796, 587896, 586196, 584696, 583079, 581425, 580227, 579766, 580032, 581218, 583709, 587408, 591503, 595135, 597982, 600163, 601964, 603929, 606791, 610844, 615451, 619467, 622239, 624104, 625952, 628299, 630702, 632124, 631999, 630842, 629576, 628377, 626558, 623574, 619603, 614961, 609521, 603134, 596260, 589660, 583659, 578167, 573277, 569313, 566274, 563644, 560912, 558028, 555282, 553015, 551537, 551141, 552014, 554030, 556606, 558865, 560360, 561812, 564711, 569707, 575511, 579860, 581554, 581335, 580900, 581494, 583224, 585174, 586077, 585380, 583906, 583230, 584429, 587663, 592714, 599238, 606459, 613298, 619195, 624405, 629303, 633818, 637670, 640629, 642356, 642588, 641733, 640611, 639279, 636874, 633082, 628934, 625306, 621454, 616212, 610207, 605468, 602754, 600480, 596678, 591095, 584902, 579103, 573810, 568600, 563069, 557336, 552144, 547988, 544008, 538491]
60751E38491p610q216o872m962l583k437j062J03N65P48J317K172K702K535J667
60736E15558L94m58j4J373K145J508N93P59J609J844J428J409J966K304K451L430
60720E38299N317O664O592N947N584M890L161J325Q96J938L303M177M217K951
60706E95261N86j128n79J343K214J262p5p39j205j621r78Q83K239J837Q28R15
60690F01043J757J953J629K000K857K436J21k376l134k334j861l127n710p853
60676E87401q251p403o840o869o062l606j135p40j902k166p15O38L61o24n67O56
60660E42176J821K180K023J836J772J692J327O35K25Q08K022K518J687N44K51
60645E63517M39j64j811l430m174m483n331o784p706o941m743k784k626m226o158
$$ y = [538491, 530881, 522665, 515793, 510831, 507248, 504811, 503749, 503852, 504417, 505165, 506482, 508654, 511356, 513891, 515558, 515952, 515494, 515480, 516853, 518998, 520506, 521099, 521858, 523467, 525311, 526739, 528148, 530114, 532418, 534869, 538299, 543616, 550280, 556872, 562819, 568403, 573293, 576454, 577779, 578675, 580613, 583916, 588093, 592310, 595261, 595847, 594719, 594140, 595483, 597697, 598959, 598884, 598145, 596940, 595319, 594341, 595224, 597463, 599300, 600128, 601043, 602800, 604753, 606382, 608382, 611239, 613675, 613796, 611420, 608286, 605952, 604091, 600964, 595254, 587401, 579150, 571747, 564907, 558038, 551976, 548370, 547235, 546495, 544593, 542427, 541712, 542350, 542711, 542087, 541520, 542176, 543997, 546177, 548200, 550036, 551808, 553500, 554827, 555462, 555687, 556495, 558517, 561035, 562722, 563266, 563517, 563956, 563792, 561981, 558551, 554377, 549894, 544563, 537779, 530073, 523132, 518389, 515605, 512979, 508753, 502595]
60630E02595p054o530n049l484k572k234j650n47Or55k461k649j472q47j732k711
60614D60654k261j019o14j245j651r36N85K032K678K402J927K139K841K927K157
60599D72616J719K426L578M432N544P330Q587Q140P125P602R303R733P636M582
60585E60353K759K674L566M753N788O233N964N183L928K173N30J9Q31K028K648
60570F09430K496J791P32l38j069j520j850j597j79J795K634J447q33k605l162
60555F07172k818k231j990k355k992l338l412l739m504n254n496m959l353q32
60541E59899J221J030j355l627l731k164j074j547k616k714j409M72J917K683
60527E46985L116L212K458R26q2O76K689M288M843N244O075O642O340N837O056
$$ y = [502595, 495541, 489011, 483962, 480478, 477906, 475672, 474022, 473475, 473481, 472526, 470065, 467416, 465944, 465097, 463365, 460654, 458393, 457374, 456760, 455515, 453864, 452928, 453513, 455545, 458223, 460625, 462552, 464691, 467532, 470459, 472616, 474335, 476761, 480339, 484771, 490315, 497645, 506232, 514372, 521497, 529099, 538402, 548135, 555771, 560353, 563112, 565786, 569352, 574105, 579893, 586126, 592090, 597273, 601201, 603374, 603904, 603923, 604754, 606782, 609430, 611926, 613717, 614449, 614111, 613042, 611522, 609672, 608075, 607896, 609691, 612325, 613772, 612939, 610334, 607172, 604354, 602123, 600133, 597778, 594786, 591448, 588036, 584297, 579793, 574539, 569043, 564084, 560731, 559899, 561120, 562150, 560795, 557168, 553437, 551273, 550199, 548652, 546036, 543322, 541913, 542385, 544302, 546985, 550101, 553313, 555771, 556697, 556615, 557291, 559980, 564268, 569111, 574355, 580430, 587072, 593412, 599249, 605305]
60512F05305O755P093P016P137P642Q082Q190Q192Q362Q742R286R968J0825J2149
60498G24744J4434J7883K1988K5784K8515L0235L1971L5018L9636M4629M8762
60487A063599N2300N6291O0451O2937O2341N8811N2707M3404L0349J4644j317
60476A556517j5563k7320l6539m3157m6780m6870m3657l8874l4762l2066k9639
60465A161290k6347k2460j8785j5411j2035q723n493j796K801P936J3148J8717
60453A092842K5080L1803L7909M2921M7108N1012N4967N8434N9535N6215M8514
60442A606340L8839K9335K0032J0402J526m637p281o690k897L992J2541K0767
60430A722269K8245L6257M5750N6139O5819P2708P4517O9914N9584M5265K7752
$$ y = [605305, 612060, 619153, 626169, 633306, 640948, 649030, 657220, 665412, 673774, 682516, 691802, 701770, 712595, 724744, 739178, 757061, 779049, 804833, 833348, 863583, 895554, 930572, 970208, 1014837, 1063599, 1115899, 1172190, 1232641, 1295578, 1357919, 1416730, 1469437, 1512841, 1543190, 1557834, 1556517, 1540954, 1513634, 1477095, 1433938, 1387158, 1340288, 1296631, 1257757, 1222995, 1190929, 1161290, 1134943, 1112483, 1093698, 1078287, 1066252, 1057529, 1052036, 1050240, 1053041, 1060977, 1074125, 1092842, 1117922, 1149725, 1187634, 1230555, 1277663, 1328675, 1383642, 1442076, 1501611, 1557826, 1606340, 1645179, 1674514, 1694546, 1704948, 1706474, 1701837, 1694556, 1687866, 1684969, 1688961, 1701502, 1722269, 1750514, 1786771, 1832521, 1888660, 1954479, 2027187, 2101704, 2171618, 2231202, 2276467, 2304219]
60419B304219O905j6558m0423o2205q0018r2530r9338j01530j00746r7747r2834
60408A527195q7208q2251p7521p1308o3458n5979n0370m6065m2152l8788l5906
60397H76189l2306k7477k3036k0739k0019j9041j7394j5990j4931j3379j1522
60386F60355j0720j1234j1342r626p065n739o127o793o489n458m419l341j992
60373E70010j003j250k286k607j807j335k361l872m057k826j641j261j157j009
60359E41538j207j551j055L51J271P98j06j03O56J306J991L424N078N353L831
60344E61575K340L005N673P925P735N725M327M868O235O808O730P242Q374Q824
60330F47386Q081P230P218P665P874P823P528O687N709N873P429Q580P590N166
$$ y = [2304219, 2311124, 2294566, 2254143, 2191938, 2111920, 2019390, 1920052, 1818522, 1717776, 1620029, 1527195, 1439987, 1357736, 1280215, 1208907, 1145449, 1089470, 1039100, 993035, 950883, 912095, 876189, 843883, 816406, 793370, 772631, 752612, 733571, 716177, 700187, 685256, 671877, 660355, 649635, 638401, 627059, 617433, 610368, 604629, 598502, 591709, 585220, 579762, 575343, 572002, 570010, 569007, 567757, 565471, 562864, 561057, 559722, 557361, 553489, 549432, 546606, 544965, 543704, 542547, 541538, 540331, 538780, 537725, 538076, 539347, 540145, 540039, 539936, 540592, 541898, 543889, 547313, 552391, 557744, 561575, 563915, 566920, 572593, 580518, 588253, 593978, 598305, 603173, 609408, 616216, 622946, 630188, 638562, 647386, 655467, 662697, 669915, 677580, 685454, 693277, 700805, 707492, 713201, 719074, 726503, 735083, 742673, 747839]
60316G47839L501L618M719N671N897N134L495J699M48k12l71K52J481K109J339
60301G86619K38L23J207J222J93n7J665M245N761N541M183K509J127L83J27j20
60285H15166o03j326k430l832m564l596j484j10l47j184j688k610m874p391p954
60270G71173o225m411m528n924o259m516k144j194k065l610m942o169p191o896
60256G05099m394o19K246K938K156J499J896K997L505K251n06k956l565k855k699
60241G06993l994n943p408p921p360n948m895n620p596q164n571j294J805K806
60227F39890K876K742J848J48j028p19J90K88k36K7J448K640K324J074N50J411
60211F55473K784L642L981M381N049N742O223O315N825M922M332M545N066N103
$$ y = [747839, 751340, 754958, 759677, 765348, 771245, 776379, 779874, 781573, 782021, 781809, 781438, 781690, 783171, 785280, 786619, 786857, 787180, 788387, 789609, 789802, 789745, 791410, 795655, 801416, 806957, 811140, 813649, 814776, 815159, 815286, 815166, 814563, 813237, 810807, 806975, 802411, 798815, 797331, 797221, 796874, 795690, 794002, 791392, 786518, 779127, 771173, 764948, 760537, 756009, 750085, 743826, 739310, 737166, 735972, 733907, 730297, 725355, 719186, 711995, 705099, 700705, 700086, 702332, 705270, 707426, 708925, 710821, 713818, 717323, 719574, 719068, 716112, 712547, 709692, 706993, 702999, 697056, 689648, 681727, 674367, 668419, 663524, 657904, 650308, 642144, 636573, 635279, 637084, 639890, 642766, 645508, 647356, 647504, 646476, 645757, 645947, 646235, 645999, 646026, 647474, 650114, 652438, 653512, 654062, 655473, 658257, 661899, 665880, 670261, 675310, 681052, 687275, 693590, 699415, 704337, 708669, 713214, 718280, 723383]
60197G23383M848N247O465P388P015N692M525M075M039L943L822M368O370R645
60183H00825J2601J3612J3026J2956J4635J6804J7472J6587J6010J7153J9655
60172I71336K2445K5185K8306L2079L6085L9456M1613M2942M4632M7515N1166
60161A382760N4414N6554N7680N7905N6997N4993N2556N0263M7729M4044L8991
60150A954886L3494K8538K3983J8811J2610O474K098O2p61k005m187o270o701
60137B061032m821j410K084M829P176R997J3769J8400K3712K9647L6100M2767
60125B243282M9112N4277N7488N8952O0125O2246O4600O4926O1724N5591M8167
60114B880490M0514L2929K5590J8618J1652L957m892j4452k3443l0448l5070l8343
$$ y = [723383, 728231, 733478, 739943, 747331, 754346, 760038, 764563, 768638, 772677, 776620, 780442, 784810, 791180, 800825, 813426, 827038, 840064, 853020, 867655, 884459, 901931, 918518, 934528, 951681, 971336, 993781, 1018966, 1047272, 1079351, 1115436, 1154892, 1196505, 1239447, 1284079, 1331594, 1382760, 1437174, 1493728, 1551408, 1609313, 1666310, 1721303, 1773859, 1824122, 1871851, 1915895, 1954886, 1988380, 2016918, 2040901, 2059712, 2072322, 2078796, 2080894, 2080956, 2080195, 2078190, 2074003, 2067733, 2061032, 2056211, 2054801, 2056885, 2061714, 2068890, 2078887, 2092656, 2111056, 2134768, 2164415, 2200515, 2243282, 2292394, 2346671, 2404159, 2463111, 2523236, 2585482, 2650082, 2715008, 2776732, 2832323, 2880490, 2921004, 2953933, 2979523, 2998141, 3009793, 3013750, 3008858, 2994406, 2970963, 2940515, 2905445, 2867102]
60102B867102m1432m3967m4338m1838l7635l3318k9295k5020k0049j4256p710
60091B528244r64N087J0249J5260K0348K4350K6050K5672K4112K1483J7630J3449
60079B730970J0266Q168O170L916J897J75j686l388l899k939j142J382N311J0649
60065B765850J6492K2631K9870L8049M5546N1821N8940O8846Q0253R0122R7647
60054C366067J04828J13196J21780J28772J33676J36933J38465J37694J34562
60045D515973J29594J22852J13455J00573Q4738O7661N0493L2604J2806q398k8725
60034E193626m6487o2052p6349q8918r8581j05350j10289j13643j14487j12410
60024D265060j08339j03209r6928q9254q0995p3324o6348n9041n0585m1334l2476
$$ y = [2867102, 2825670, 2781703, 2737365, 2695527, 2657892, 2624574, 2595279, 2570259, 2550210, 2535954, 2528244, 2527280, 2532367, 2542616, 2557876, 2578224, 2602574, 2628624, 2654296, 2678408, 2699891, 2717521, 2730970, 2741236, 2749404, 2755574, 2759490, 2761387, 2761562, 2759876, 2756488, 2752589, 2749650, 2748508, 2749890, 2755201, 2765850, 2782342, 2804973, 2834843, 2872892, 2918438, 2970259, 3029199, 3098045, 3178298, 3268420, 3366067, 3470895, 3584091, 3705871, 3834643, 3968319, 4105252, 4243717, 4381411, 4515973, 4645567, 4768419, 4881874, 4982447, 5067185, 5134846, 5185339, 5217943, 5230749, 5222351, 5193626, 5147139, 5085087, 5008738, 4919820, 4821239, 4715889, 4605600, 4491957, 4377470, 4265060, 4156721, 4053512, 3956584, 3867330, 3786335, 3713011, 3646663, 3587622, 3537037, 3495703, 3463227]
60013C463227k5061j9300j4590j0238o153k726j04J935L330L481J974o71l432
60000C391672n822q157j0865j3937j7267k1220k6299l2043l6726l8890l9309m0576
59988C100561m4065m7967m9186m6945m3496m1172l9892l7991l4501k9752k4285
59977B661309j8095j0966k992N260J3043K0103K7163L5170M3753N1132N6082N9439
59965B940401O2771O6035O7472O5723O1158N5059M8365M1420L4214K6468J7894
59954C486980Q560j198j1154k0996k9919l7099m2575m7001n0459n2343n2548n1823
59942C098425n0532m7996m3673l8227l2631k6869k0313j2953n338K361J0443J8936
59930B851633K7584L6353M5272N3858O1497O8280P4596P9857Q2445Q1327P7158
$$ y = [3463227, 3438166, 3418866, 3404276, 3394038, 3387885, 3385159, 3385055, 3386990, 3390320, 3393801, 3395775, 3395104, 3391672, 3385850, 3377693, 3366828, 3352891, 3335624, 3314404, 3288105, 3256062, 3219336, 3180446, 3141137, 3100561, 3056496, 3008529, 2959343, 2912398, 2868902, 2827730, 2787838, 2749847, 2715346, 2685594, 2661309, 2643214, 2632248, 2629256, 2634516, 2647559, 2667662, 2694825, 2729995, 2773748, 2824880, 2880962, 2940401, 3003172, 3069207, 3136679, 3202402, 3263560, 3318619, 3366984, 3408404, 3442618, 3469086, 3486980, 3495540, 3494342, 3483188, 3462192, 3432273, 3395174, 3352599, 3305598, 3255139, 3202796, 3150248, 3098425, 3047893, 2999897, 2956224, 2917997, 2885366, 2858497, 2838184, 2825231, 2819893, 2822254, 2832697, 2851633, 2879217, 2915570, 2960842, 3014700, 3076197, 3144477, 3219073, 3298930, 3381375, 3462702, 3539860]
59919C539860P1469O5200N8235M9983M0178K9260J8118P328l181j3564k3582l3049
59907C806255m2041m9915n4855n5732n3999n2138n0238m5939l8302k9667k2549
59896C310880j6390r158q69O642J2857J9213K6427L3204L8247M2009M5507M8630
59884C557199N0595N1319N1239N0311M8195M5311M2742M0932L9037L5908L1455
59873D044243K6765K3041K0726J9761K0334K2820K6915L1426L5442L9446M4706
59862D355625N1683N9541O7153P4055Q0323Q5949R0526R3267R3326R0404Q4931
59851E226783P7375O7561N5232M0997K6005J0634n576k2493l8706n2709o4122
59840E320981p3253q0086q4519q7196q9141r0482r0126q7043q1482p4663o7483
$$ y = [3539860, 3611329, 3676529, 3734764, 3784747, 3824925, 3854185, 3872303, 3879631, 3876450, 3862886, 3839304, 3806255, 3764214, 3714299, 3659444, 3603712, 3549713, 3497575, 3447337, 3401398, 3363096, 3333429, 3310880, 3294490, 3285332, 3284463, 3291105, 3303962, 3323175, 3349602, 3382806, 3421053, 3463062, 3508569, 3557199, 3607794, 3659113, 3710352, 3760663, 3808858, 3854169, 3896911, 3937843, 3976880, 4012788, 4044243, 4071008, 4094049, 4114775, 4134536, 4154870, 4177690, 4204605, 4236031, 4271473, 4310919, 4355625, 4407308, 4466849, 4534002, 4608057, 4688380, 4774329, 4864855, 4958122, 5051448, 5141852, 5226783, 5304158, 5371719, 5426951, 5467948, 5493953, 5504587, 5499011, 5476518, 5437812, 5385103, 5320981, 5247728, 5167642, 5083123, 4995927, 4906786, 4816304, 4726178, 4639135, 4557653, 4482990, 4415507]
59829D415507n9954n1854m3472l5329k7418j9428j1677n066K88N507J1383J6963
59817D195450K0607K1854K1270J9032J4973R797M633p17p509j5745k3707l0392
59805D229546l6836m4131n1561n7787o2596o6266o8431o9066o9465p0550p1079
59794C561778o9408o6404o4469o4005o3032o0477n7684n5964n4535n1975m8276
59783B905549m4313m0309l6040l1796k8218k5534k3694k2753k2559k2516k2185
59772B585632k1664k1015k0046j9013j8654j8854j8173j5605j2128r369p227m092
59760B399792N64M998P030O461N195N195O564P612O844M641K656J767J413J022
59746B461754R30J351J426M10r57j356o92J85J083K449L908M430M148M597O526
$$ y = [4415507, 4355553, 4303699, 4260227, 4224898, 4197480, 4178052, 4166375, 4161309, 4161597, 4167104, 4178487, 4195450, 4216057, 4237911, 4259181, 4278213, 4293186, 4302983, 4307616, 4306899, 4299390, 4283645, 4259938, 4229546, 4192710, 4148579, 4097018, 4039231, 3976635, 3910369, 3841938, 3772872, 3703407, 3632857, 3561778, 3492370, 3425966, 3361497, 3297492, 3234460, 3173983, 3116299, 3060335, 3005800, 2953825, 2905549, 2861236, 2820927, 2784887, 2753091, 2724873, 2699339, 2675645, 2652892, 2630333, 2607817, 2585632, 2563968, 2542953, 2522907, 2503894, 2485240, 2466386, 2448213, 2432608, 2420480, 2411111, 2403884, 2399792, 2400356, 2405354, 2412384, 2418845, 2424040, 2429235, 2435799, 2443411, 2450255, 2454896, 2457552, 2459319, 2460732, 2461754, 2462684, 2464035, 2465461, 2465871, 2464914, 2463558, 2462866, 2463051, 2464134, 2466583, 2470491, 2474921, 2479069, 2483666, 2490192]
59731B490192Q746R846R941R768R175P744O362O687R026J1849J3673J4517J5168
59718B622694J5773J5821J5191J4649J5292J7764K1983K7294L2740L7409M0921
59707B877531M3852M7439N2645N9542O7659P6609Q5919R4662J02169J09194J17370
59696C734591J26996J36121J42314J44352J41341J31247J12100Q4659N2433J9038
59686D825192j3119m1518o3072p6331q2959q5571q4891q0338p2537o3385n3826
59675D107645m3404l2329k2302j4480p732L5R592K0046L0141L9091M6764N3898
59663D186965O1756P0935Q0827R0791J01272J12921J25116J36423J46463J56454
59653E269923J67856J81207J96182K11942K27303K41429K54593K67555K79977
$$ y = [2490192, 2498938, 2508784, 2518725, 2528493, 2537668, 2545412, 2551774, 2558461, 2567487, 2579336, 2593009, 2607526, 2622694, 2638467, 2654288, 2669479, 2684128, 2699420, 2717184, 2739167, 2766461, 2799201, 2836610, 2877531, 2921383, 2968822, 3021467, 3081009, 3148668, 3225277, 3311196, 3405858, 3508027, 3617221, 3734591, 3861587, 3997708, 4140022, 4284374, 4425715, 4556962, 4669062, 4753721, 4806154, 4825192, 4812073, 4770555, 4707483, 4631152, 4548193, 4462622, 4377731, 4297393, 4224856, 4161471, 4107645, 4064241, 4031912, 4009610, 3995130, 3987398, 3987433, 3997025, 4017071, 4047212, 4086303, 4133067, 4186965, 4248721, 4319656, 4400483, 4491274, 4592546, 4705467, 4830583, 4967006, 5113469, 5269923, 5437779, 5618986, 5815168, 6027110, 6254413, 6495842, 6750435, 7017990, 7297967]
59644G297967K90220K97044L00766L02092L00500K94567K83614K68324K49872
59635I884966K29180K07149J85091J64343J45566J28573J12922R8467Q5305P3314
59625A1314876O2174N1911M2987L5471K8477K1017J3317O757K449N07O82K897
59613A1583522O767J1272J5628K0268K6421L4827M5163N6584O8332Q0016R1684
59602A2040484J03596J15557J26493J35159J41230J45269J47316J46061J39859
59593A3241024J28358J12501R2941O9119M0307P005k9402o8005j08413j49316
59583A3336119j88122k22542k51777k75603k93142l03596l07690l07246l03357
59574A0883044k95792k84181k69054k52016k35707k23289k16996k17183k23563
$$ y = [7297967, 7588187, 7885231, 8185997, 8488089, 8788589, 9083156, 9366770, 9635094, 9884966, 10114146, 10321295, 10506386, 10670729, 10816295, 10944868, 11057790, 11156257, 11241562, 11314876, 11377050, 11428961, 11471948, 11507419, 11535896, 11556913, 11570230, 11576987, 11579436, 11579943, 11580625, 11583522, 11590289, 11601561, 11617189, 11637457, 11663878, 11698705, 11743868, 11800452, 11868784, 11948800, 12040484, 12144080, 12259637, 12386130, 12521289, 12662519, 12807788, 12955104, 13101165, 13241024, 13369382, 13481883, 13574824, 13643943, 13684250, 13691255, 13661853, 13593848, 13485435, 13336119, 13147997, 12925455, 12673678, 12398075, 12104933, 11801337, 11493647, 11186401, 10883044, 10587252, 10303071, 10034017, 9782001, 9546294, 9323005, 9106009, 8888826, 8665263]
59565H665263k36566k55786k77324k94938l04639l06748l03111k94381k81107
59556F110663k65406k49515k33722k17440k01305j86381j72114j57144j41882
59547D285754j28444j18034j10006j03393r7611r1633q4307p5957o8218o1889
59537C346262n6362n1425m7924m5953m4020m1029l7869l5980l5379l5179l5104
59526B880038l5350l5602l5341l4622l3634l2067k9792k7622k6371k5548k4012
59515B540077k1605j9151j7034j4898j2660j0793r408p915n920l792j985l49J605
59502B416172M053O776R548J2451J5747J9430K2954K5700K7733K9683L1883L4342
59490B656472L7599M2436M8099N2091N3091N3250N5975O1774O8096P3003P6824
$$ y = [8665263, 8428697, 8172911, 7895587, 7600649, 7296010, 6989262, 6686151, 6391770, 6110663, 5845257, 5595742, 5362020, 5144580, 4943275, 4756894, 4584780, 4427636, 4285754, 4157310, 4039276, 3929270, 3825877, 3728266, 3636633, 3552326, 3476369, 3408151, 3346262, 3289900, 3238475, 3190551, 3144598, 3100578, 3059549, 3021680, 2985700, 2950321, 2915142, 2880038, 2844688, 2809086, 2773745, 2739123, 2705489, 2673422, 2643630, 2616008, 2589637, 2564089, 2540077, 2518472, 2499321, 2482287, 2467389, 2454729, 2443936, 2434528, 2426613, 2420693, 2416901, 2414916, 2414567, 2416172, 2420225, 2427001, 2436549, 2449000, 2464747, 2484177, 2507131, 2532831, 2560564, 2590247, 2622130, 2656472, 2694071, 2736507, 2784606, 2836697, 2889788, 2943038, 2999013, 3060787, 3128883, 3201886, 3278710]
59479C278710P9650P9466P4546O6340N8220N2015M7352M3910M2343M2676M3229
59468C908457M1939L8184L2984K7942K4066K0822J6234Q766n47q711j3904j7302
59456D078930k1287k6687l2488l7385m0529m1315l9846l7608l6435l6339l5359
59445C693652l2018k7080k2253j7814j2465n293L051J1274J8953K6786L5574M5265
59433C717632N5009O4080P2493Q0573Q8014R3721R6760R7302R6348R4496R1043
59422D647471Q4446P3900O0377M5766L0761J4316m223k3153l9742n3199o4855
59411D771865p5270q2856q6215q6326q5033q2482p7644p0766o3492n6645m9526
59400C955610m1697l3999k7410k2023j7773j5080j4030j3730j3317j3159j4382
$$ y = [3278710, 3358360, 3437826, 3512372, 3578712, 3636932, 3688947, 3736299, 3780209, 3822552, 3865228, 3908457, 3950396, 3988580, 4021564, 4049506, 4073572, 4094394, 4110628, 4119394, 4118847, 4110136, 4096232, 4078930, 4057643, 4030956, 3998468, 3961083, 3920554, 3879239, 3839393, 3801785, 3765350, 3729011, 3693652, 3661634, 3634554, 3612301, 3594487, 3582022, 3576729, 3579780, 3591054, 3610007, 3636793, 3672367, 3717632, 3772641, 3836721, 3909214, 3989787, 4077801, 4171522, 4268282, 4365584, 4461932, 4556428, 4647471, 4731917, 4805817, 4866194, 4911960, 4942721, 4957037, 4952814, 4929661, 4889919, 4836720, 4771865, 4696595, 4613739, 4527524, 4441198, 4356165, 4273683, 4196039, 4125273, 4061781, 4005136, 3955610, 3913913, 3879914, 3852504, 3830481, 3812708, 3797628, 3783598, 3769868, 3756551, 3743392, 3729010]
59389C729010j7496k1951k6878l1839l6944m2372m7787n2494n6374o0244o4543
59378C270088o8218p0062p0864p2604p5295p6386p4208p0375o7398o5225o1994
59367B497459n7469n3510n1045m8536m4301l9008l4721l2115k9690k5597j9470
59356B061997j2345n407P03N357P382N681N85n880j1342j4506j5203j3721j0576
59343A992725o370j355M421R802J2007Q723Q74p765j3982j7328j8751j8431j6092
59330A928478j2649r893q387o749l609O14M575Q022J1871J6402K0573K3597K6225
59317A999070K9604L3405L6242L7791L9394M2186M5641M8634N1168N4251N8410
59306B475796O3161O7816P1970P5227P7326P9011Q2042Q7616R4945J02245J09157
$$ y = [3729010, 3711514, 3689563, 3662685, 3630846, 3593902, 3551530, 3503743, 3451249, 3394875, 3334631, 3270088, 3201870, 3131808, 3060944, 2988340, 2913045, 2836659, 2762451, 2692076, 2624678, 2559453, 2497459, 2439990, 2386480, 2335435, 2286899, 2242598, 2203590, 2168869, 2136754, 2107064, 2081467, 2061997, 2049652, 2044245, 2044948, 2050305, 2057687, 2063368, 2063953, 2058073, 2046731, 2032225, 2017022, 2003301, 1992725, 1986355, 1985000, 1989421, 1999223, 2011230, 2019953, 2020827, 2013062, 1999080, 1981752, 1963001, 1944570, 1928478, 1915829, 1905936, 1897549, 1890800, 1887191, 1887805, 1892380, 1900402, 1912273, 1928675, 1949248, 1972845, 1999070, 2028674, 2062079, 2098321, 2136112, 2175506, 2217692, 2263333, 2311967, 2363135, 2417386, 2475796, 2538957, 2606773, 2678743, 2753970, 2831296, 2910307, 2992349, 3079965, 3174910, 3277155, 3386312]
59295C386312J17297J27827J39329J49269J57353J65970J76967J89425K01477
59286D811226K12822K23928K33701K39993K42219K41520K38344K31804K21771
59277F897328K09525J95457J78038J56341J32065J07674Q3788N9952L6631J4587
59267H071386p006k9825n4036p8143j00955j22289j42051j60105j76866j92590
59257G007520k06201k16223k22727k26923k28961k27818k23499k17516k10833
59248E026819k02861j93067j82122j70800j59024j46802j34975j24320j14853
59239C597995j06449r9121r2166q4337p5565o7327o0576n4537m8441m3065l9240
59228B827171l5951l1526k6102k1353j8070j5434j2561r561o951m898l128j008
$$ y = [3386312, 3503609, 3631436, 3770765, 3920034, 4077387, 4243357, 4420324, 4609749, 4811226, 5024048, 5247976, 5481677, 5721670, 5963889, 6205409, 6443753, 6675557, 6897328, 7106853, 7302310, 7480348, 7636689, 7768754, 7876428, 7960216, 8020168, 8056799, 8071386, 8064380, 8034555, 7980519, 7902376, 7801421, 7679132, 7537081, 7376976, 7200110, 7007520, 6801319, 6585096, 6362369, 6135446, 5906485, 5678667, 5455168, 5237652, 5026819, 4823958, 4630891, 4448769, 4277969, 4118945, 3972143, 3837168, 3712848, 3597995, 3491546, 3392425, 3300259, 3215922, 3140357, 3073030, 3012454, 2957917, 2909476, 2866411, 2827171, 2791220, 2759694, 2733592, 2712239, 2694169, 2678735, 2666174, 2656613, 2649662, 2644764, 2641636, 2640628]
59216B640628K187O355J0223J2650J4028J5668J7974K0125K1432K2019K2130K1567
59204B826986K0178J8219J6012J3617J0880P493L079k395q385j4329k0213k6103
59192B845039l1389l5271l7807l9835m1888m3881m5750m7587m9042m9358m8279
59181B374952m6340m4060m1444l8582l6130l4743l4347l4178l3313l1086k7478
59170A973251k3359j9961j7765j6219j4656j3010j1332r215o311l172p86P68K588
59157A840821N576R196J2078J3744J5194J7667K1354K5583K9829L3839L7054L8968
59145B100903M0328M3074M8433N5589O2847O9493P5831Q2099Q8487R5809J04698
59134B867591J14106J21901J27400J32047J37037J41341J43041J41611J37739
$$ y = [2640628, 2642815, 2649170, 2659393, 2672043, 2686071, 2701739, 2719713, 2739838, 2761270, 2783289, 2805419, 2826986, 2847164, 2865383, 2881395, 2895012, 2905892, 2913385, 2916464, 2914069, 2905684, 2891355, 2871142, 2845039, 2813650, 2778379, 2740572, 2700737, 2658849, 2614968, 2569218, 2521631, 2472589, 2423231, 2374952, 2328612, 2284552, 2243108, 2204526, 2168396, 2133653, 2099306, 2065128, 2031815, 2000729, 1973251, 1949892, 1929931, 1912166, 1895947, 1881291, 1868281, 1856949, 1847734, 1841423, 1838251, 1837465, 1838233, 1840821, 1846397, 1855593, 1867671, 1881415, 1896609, 1914276, 1935630, 1961213, 1991042, 2024881, 2061935, 2100903, 2141231, 2184305, 2232738, 2288327, 2351174, 2420667, 2496498, 2578597, 2667084, 2762893, 2867591, 2981697, 3103598, 3230998, 3363045, 3500082, 3641423, 3784464, 3926075, 4063814]
59125D063814J31499J22058J08996R2772P3856N2423K9165N420j7764l9995o0744
59114D561500p8953r3920j05783j14780j20662j23442j24012j23173j20615j15784
59104C440376j09462j03368r8198r3038q6956q0199p3474o6938o0568n4877n0411
59093B562887m6848m3309l9410l5534l2233k9850k8440k7547k6260k4120k1778
59082B207558k0176j9244j8246j7244j7106j7764j7572j5125j1138p666n843n099
59070B035335m379l260j834k11J466K945M172N607P847J0891J3824J5420J5220
59057B103043J4034J3153J3073J3190J2833J2119J1497J0793R374P201N119L808
59045B229237K919J585m86k779m609n560n434m398l258l042l864m703m663m017
$$ y = [4063814, 4195313, 4317371, 4426367, 4519139, 4592995, 4645418, 4674583, 4680003, 4662239, 4622244, 4561500, 4482547, 4388627, 4282844, 4168064, 4047402, 3923960, 3799948, 3676775, 3556160, 3440376, 3330914, 3227546, 3129348, 3036310, 2949354, 2869155, 2795681, 2728743, 2668175, 2613298, 2562887, 2516039, 2472730, 2433320, 2397786, 2365553, 2335703, 2307263, 2279716, 2253456, 2229336, 2207558, 2187382, 2168138, 2149892, 2132648, 2115542, 2097778, 2080206, 2065081, 2053943, 2046277, 2040434, 2035335, 2030956, 2027696, 2025862, 2025651, 2027117, 2030062, 2034234, 2039841, 2047688, 2058579, 2072403, 2087823, 2103043, 2117077, 2130230, 2143303, 2156493, 2169326, 2181445, 2192942, 2203735, 2213109, 2220310, 2225429, 2229237, 2232156, 2233741, 2233255, 2230476, 2225867, 2220307, 2214873, 2210475, 2207217, 2204175, 2200311, 2195608, 2190945, 2186928]
59031B186928l400k437k94K553M337M288L853M872P238R260R887R500Q872Q338
59017B253795Q068Q299Q975R640R793R088P465N397L585J868q85m977q714j0377
59003B301020j0852j2557j5948j9025k0655k2214k5066k8286l0313l1305l2201
58992B052598l2659l1857l0540l0279l0985l0955k9415k7404k5976k5001k4126
58981A733401k3484k2978k1989k0385j8851j7738j6479j4670j2891j1826j1284
58970A540826j0718j0011r222q176o929n971n267l712m84L442O057O447N425M206
58956A505913L317K824K606K164Q81j174l198m650n694o400o305n287m141l521
58942A477335k968j862q29r68k001k587k446k681l550l672k306r41j248k503k667
$$ y = [2186928, 2183528, 2181091, 2180797, 2183350, 2187687, 2191975, 2195828, 2200700, 2207938, 2217198, 2227085, 2236585, 2245457, 2253795, 2261863, 2270162, 2279137, 2288777, 2298570, 2307658, 2315123, 2320520, 2324105, 2325973, 2325088, 2320111, 2311397, 2301020, 2290168, 2277611, 2261663, 2242638, 2221983, 2199769, 2174703, 2146417, 2116104, 2084799, 2052598, 2019939, 1988082, 1957542, 1927263, 1896278, 1865323, 1835908, 1808504, 1782528, 1757527, 1733401, 1709917, 1686939, 1664950, 1644565, 1625714, 1607976, 1591497, 1576827, 1563936, 1552110, 1540826, 1530108, 1520097, 1510875, 1502699, 1495770, 1489799, 1484532, 1480820, 1480336, 1483778, 1489835, 1496282, 1501707, 1505913, 1509230, 1512054, 1514660, 1516824, 1517705, 1516531, 1513333, 1508683, 1502989, 1496589, 1490284, 1484997, 1480856, 1477335, 1474367, 1472505, 1471676, 1470708, 1468707, 1466120, 1463674, 1460993, 1457443, 1453771, 1451465, 1450524, 1449276, 1446773, 1444106]
58927A444106j222P37K678N042P627R480J0609J2083J4124J5741J6673J7982J9995
58914A575655K1379K1281K0859K1352K1879K0669J7602J4154J1439R490Q014O706
58902A770479N250L899L395L547K787K67k531l642l330l472m821o374p006o256
58888A752192l924m90K441L653M060N369P427Q715R140J0082J1626J2174J1444
58875A833909J1513J3762J6823J8898K0282K1959K3283K3063K2047K2241K4063
58864B051843K5951K6866K7652K9505L2251L4811L6807L8955M1894M5088M7396
58853B439019M8791N0856N4908O0107O4430O7261O9814P2921P5785P7347P7694
58842C158933P7470P7072P7019P8010P9729Q0810Q0921Q1770Q4868Q9378R3506
$$ y = [1444106, 1442884, 1443621, 1446299, 1451341, 1458968, 1468448, 1479057, 1491140, 1505264, 1521005, 1537678, 1555660, 1575655, 1597034, 1618315, 1639174, 1660526, 1682405, 1703074, 1720676, 1734830, 1746269, 1755759, 1763773, 1770479, 1775729, 1779628, 1783023, 1786570, 1789357, 1789624, 1787093, 1783451, 1780121, 1776649, 1771828, 1765454, 1758448, 1752192, 1748268, 1747778, 1750219, 1753872, 1757932, 1763301, 1770728, 1779443, 1788583, 1798665, 1810291, 1822465, 1833909, 1845422, 1859184, 1876007, 1894905, 1915187, 1937146, 1960429, 1983492, 2005539, 2027780, 2051843, 2077794, 2104660, 2132312, 2161817, 2194068, 2228879, 2265686, 2304641, 2346535, 2391623, 2439019, 2487810, 2538666, 2593574, 2653681, 2718111, 2785372, 2855186, 2928107, 3003892, 3081239, 3158933, 3236403, 3313475, 3390494, 3468504, 3548233, 3629043, 3709964, 3791734, 3876602, 3965980, 4059486]
58831D059486R7155J01427J06196J10002J12295J14115J16292J18389J19807J20671
58821E175835J21136J20759J19029J15862J11372J05871J00057R4108Q6502P5126
58811F225657O0182M4671L1132J8951O124p433j9971l0871m1599n3386o5536p6632
58799F091289q6168r4141j00157j04192j07521j11488j15665j18448j19361j19376
58789E014772j18949j17273j14048j10572j08118j06297j04017j01113r7865r3807
58779C942713q8480q2816p8271p4772p0991o6464o1956n7701n2947m7619m2902
58768C217794l9514l6638l3325k9778k6450k3025j9239j5675j2635r073l915J989
58756B970516O584R111J0767J2887J5551J8323K1451K5520L0194L3919L5275L4552
$$ y = [4059486, 4156641, 4258068, 4364264, 4474266, 4586561, 4700676, 4816968, 4935357, 5055164, 5175835, 5296971, 5417730, 5536759, 5652621, 5763993, 5869864, 5969921, 6064029, 6150531, 6225657, 6285839, 6330510, 6361642, 6380593, 6386717, 6379284, 6359313, 6328442, 6286843, 6233457, 6167921, 6091289, 6005121, 5910980, 5810823, 5706631, 5599110, 5487622, 5371957, 5253509, 5134148, 5014772, 4895823, 4778550, 4664502, 4553930, 4445812, 4339515, 4235498, 4134385, 4036520, 3942713, 3854233, 3771417, 3693146, 3618374, 3547383, 3480919, 3418963, 3361262, 3308315, 3260696, 3217794, 3178280, 3141642, 3108317, 3078539, 3052089, 3029064, 3009825, 2994150, 2981515, 2972442, 2968527, 2970516, 2977100, 2986211, 2996978, 3009865, 3025416, 3043739, 3065190, 3090710, 3120904, 3154823, 3190098, 3224650]
58744C224650L3720L4692L7865M2465M7721N3043N7618O0904O3618O7158P1899
58733C795353P6884Q1435Q5952R0772R5312R9036J02429J06193J10125J13494
58723D756985J15980J17552J17852J16458J13552J09769J05605J01163R6097Q9592
58713E840605Q0858O9972N7722M4557L0279J4919p90j6031l0327m3362n5245o6876
58701E926281p8898r0205r8854j04791j10082j15904j20937j23585j24276j24484
58691D834265j24741j24723j24082j22206j18412j13417j09226j06454j03339
58682C787665r8601r3574q9785q6308q1623p6538p2716o9533o5180n9992n5890
58671B937925n3062m9995m6574m4316m3524m2902m2116m2042m2173m0637l7363
$$ y = [3224650, 3258370, 3293062, 3330927, 3373392, 3421113, 3474156, 3531774, 3592678, 3656296, 3723454, 3795353, 3872237, 3953672, 4039624, 4130396, 4225708, 4324744, 4427173, 4533366, 4643491, 4756985, 4872965, 4990517, 5108369, 5224827, 5338379, 5448148, 5553753, 5654916, 5751013, 5840605, 5921463, 5991435, 6049157, 6093714, 6123993, 6138912, 6138122, 6122091, 6091764, 6048402, 5993157, 5926281, 5847383, 5757178, 5658324, 5553533, 5443451, 5327547, 5206610, 5083025, 4958749, 4834265, 4709524, 4584801, 4460719, 4338513, 4220101, 4106684, 3997458, 3891004, 3787665, 3689064, 3595490, 3505705, 3419397, 3337774, 3261236, 3188520, 3118987, 3053807, 2993815, 2937925, 2884863, 2834868, 2788294, 2743978, 2700454, 2657552, 2615436, 2573394, 2531221, 2490584, 2453221]
58660B453221l4536l3046l1205k8097k5377k4238k3079k0242j7049j5820j6283
58649B184249j6329j5522j5741j8601k3689k9349l4085l7423l9942m2193m3367
58638A868008m2036l8646l5869l5602l6718l6845l5232l2764l0134k7404k4730
58627A492028k2168j9306j6037j3249j1743j1039j0095q692p188n553l722k419
58615A360817k686m795q219j2074j5060j5792j4254j2213j1257j0991j0122q579
58603A234775p392p109p478q251r119r285q268o846o129o058n969o112p170q463
58589A131126q238n953l038j068k78k73r99k274l152k610p13J365K476K531K526
58574A111428L512N513P496Q456Q243P347O378N911O230O995P837R290J2047J4973
$$ y = [2453221, 2418685, 2385639, 2354434, 2326337, 2300960, 2276722, 2253643, 2233401, 2216352, 2200532, 2184249, 2167920, 2152398, 2136657, 2118056, 2094367, 2065018, 2030933, 1993510, 1953568, 1911375, 1868008, 1825972, 1787326, 1751457, 1715855, 1679137, 1642292, 1607060, 1574296, 1544162, 1516758, 1492028, 1469860, 1450554, 1434517, 1421268, 1409525, 1398486, 1388391, 1379699, 1372511, 1366958, 1363236, 1360817, 1358131, 1353336, 1345117, 1333043, 1317983, 1302191, 1287937, 1275724, 1264467, 1253476, 1243354, 1234775, 1227383, 1220274, 1212796, 1204545, 1195426, 1186141, 1177873, 1171027, 1164898, 1158840, 1152871, 1146759, 1139589, 1131126, 1122888, 1116935, 1113897, 1112829, 1112551, 1112278, 1111279, 1109005, 1105853, 1103243, 1102530, 1103895, 1106371, 1108902, 1111428, 1114940, 1120453, 1127949, 1136405, 1144648, 1151995, 1158373, 1164284, 1170514, 1177509, 1185346, 1194636, 1206683, 1221656]
58560A221656J5523J3112J0664J1163J3694J4809J3163J0759R702R863J0126J0205
58548A364439J0342J0527J0821J1598J2946J4524J6352J8828K1680K3826K4652
58537A540535K4563K3992K2992K2221K3101K6088K9720L2333L3993L5753L7632
58526A852923L8594L8258L7456L6928L6485L5723L4878L4275L3368L1100K7240
58515B237228K2822J8894J5201J0795N773J539j005k683m829p457r642j1260j3238
58502B262138j5967j8537j9904k0098j9897j9929k0322k0807k0859k0267j9704
58491B045847k0256k2147k4520k6532k8048k9047k9173k8362k7328k6773k6527
58480A757134k5960k4913k3760k2777k1927k1007j9717j7867j5968j5218j6171
$$ y = [1221656, 1237179, 1250291, 1260955, 1272118, 1285812, 1300621, 1313784, 1324543, 1334245, 1344108, 1354234, 1364439, 1374781, 1385308, 1396129, 1407727, 1420673, 1435197, 1451549, 1470377, 1492057, 1515883, 1540535, 1565098, 1589090, 1612082, 1634303, 1657404, 1683492, 1713212, 1745545, 1779538, 1815291, 1852923, 1891517, 1929775, 1967231, 2004159, 2040644, 2076367, 2111245, 2145520, 2178888, 2209988, 2237228, 2260050, 2278944, 2294145, 2304940, 2310713, 2312252, 2311247, 2308564, 2303735, 2296278, 2286636, 2275376, 2262138, 2246171, 2227634, 2207730, 2187632, 2167735, 2147806, 2127484, 2106677, 2085818, 2065551, 2045847, 2025591, 2003444, 1978924, 1952392, 1924344, 1895297, 1866124, 1837762, 1810434, 1783661, 1757134, 1731174, 1706261, 1682501, 1659724, 1637797, 1616790, 1597073, 1579206, 1563238, 1548020, 1531849]
58469A531849j7593j7433j5090j2152j0506j0265j0063r134q171p960q071p573
58457A397838o640o298o718o788n734m090k509o79J661L570L987L432L249L601
58443A377882L612L238L346L830L356J533j83n44q7K44Q11K421M636O290P081
58428A417466P433P290O317N100M837N664O334N842M642L979M391N176N080L518
58414A493069J262k34l93J3N8k98p62j515k663l527l431k762k282j828r42l51
58398A473414j197k761k709k91K312K800J767J520K800M100M020K843J643J000
58384A491261J063J963L434M559M586M004M175N760P839R040R267R641J0608J0920
58370A578120R359O947O193P954J0266J0879R904R007Q927R140R475J0485J1979
$$ y = [1531849, 1514256, 1496823, 1481733, 1469581, 1459075, 1448810, 1438747, 1429613, 1421442, 1413482, 1405411, 1397838, 1391198, 1384900, 1378182, 1371394, 1365660, 1361570, 1359061, 1358382, 1360043, 1363613, 1367600, 1371032, 1374281, 1377882, 1381494, 1384732, 1388078, 1391908, 1395264, 1396797, 1396614, 1396070, 1395983, 1396227, 1397038, 1399459, 1404095, 1410385, 1417466, 1424899, 1432189, 1438506, 1443606, 1448443, 1454107, 1460441, 1466283, 1470925, 1474904, 1479295, 1484471, 1489551, 1493069, 1494331, 1494097, 1493704, 1493717, 1493775, 1493477, 1492715, 1491200, 1488537, 1485010, 1481579, 1478817, 1476535, 1474707, 1473765, 1473414, 1472217, 1469456, 1466747, 1466456, 1468768, 1471568, 1473335, 1474855, 1477655, 1481755, 1485775, 1488618, 1490261, 1491261, 1492324, 1494287, 1497721, 1502280, 1506866, 1510870, 1515045, 1520805, 1528644, 1537684, 1546951, 1556592, 1567200, 1578120, 1587479, 1594426, 1600619, 1608573, 1618839, 1629718, 1639622, 1648629, 1657556, 1666696, 1676171, 1686656, 1698635]
58357A698635J2695J2062J1110J0909J0959J0157Q737Q070Q775J0032J0866J1208
58345A824215J1404J1521J1597J2024J3044J4068J4100J2940J1618J1380J2358
58334A960269J3571J4255J4795J5787J6519J5438J2567J0369J1139J4001J5783
58323B114493J4836J2605J1235J1063J1286J1736J2591J3156J2533J1231J0670
58312B247435J1054J1218J0844J1266J3264J5434J6059J5715J6445J8642K0364
58301B407740K0144J9063J9102K0383K1284K1018K0744K1693K3273K4002K3762
58290B642208K3954K5285K6616K6674K6015K6224K7514K8455K8141K7418K7446
58279B935950K8157K8964L0059L1850L3614L4099L3461L3302L4450L5825L6098
$$ y = [1698635, 1711330, 1723392, 1734502, 1745411, 1756370, 1766527, 1775264, 1783334, 1792109, 1802141, 1813007, 1824215, 1835619, 1847140, 1858737, 1870761, 1883805, 1897873, 1911973, 1924913, 1936531, 1947911, 1960269, 1973840, 1988095, 2002890, 2018677, 2035196, 2050634, 2063201, 2073570, 2084709, 2098710, 2114493, 2129329, 2141934, 2153169, 2164232, 2175518, 2187254, 2199845, 2213001, 2225534, 2236765, 2247435, 2258489, 2269707, 2280551, 2291817, 2305081, 2320515, 2336574, 2352289, 2368734, 2387376, 2407740, 2427884, 2446947, 2466049, 2486432, 2507716, 2528734, 2549478, 2571171, 2594444, 2618446, 2642208, 2666162, 2691447, 2718063, 2744737, 2770752, 2796976, 2824490, 2852945, 2881086, 2908504, 2935950, 2964107, 2993071, 3023130, 3054980, 3088594, 3122693, 3156154, 3189456, 3223906, 3259731, 3295829]
58268C295829L5651L5955L7490L9189L9932L9917M0293M1668M3174M3314M1902
58257C734314M0821M2073M5253M7966M9020M9895N2266N5301N6950N7053N7425
58246D288337N9037O0942O2192O3131O4074O4316O3524O2970O4155O6766O8988
58235D988432O9557O8805O8107O9010P2320P7305Q2048Q5153Q6781Q7806Q8850
58224E844174R0646R4085R8889J03108J05442J07298J11045J16688J21941J25436
58214F918752J28126J31408J35517J40238J45708J51836J57983J63882J69993
58205H243443J76495J82805J88562J94326K00909K08705K17924K28554K39699
58196A0081422K49906K58615K66617K74878K83835K94075L06416L20816L36139
$$ y = [3295829, 3331480, 3367435, 3404925, 3444114, 3484046, 3523963, 3564256, 3605924, 3649098, 3692412, 3734314, 3775135, 3817208, 3862461, 3910427, 3959447, 4009342, 4061608, 4116909, 4173859, 4230912, 4288337, 4347374, 4408316, 4470508, 4533639, 4597713, 4662029, 4725553, 4788523, 4852678, 4919444, 4988432, 5057989, 5126794, 5194901, 5263911, 5336231, 5413536, 5495584, 5580737, 5667518, 5755324, 5844174, 5934820, 6028905, 6127794, 6230902, 6336344, 6443642, 6554687, 6671375, 6793316, 6918752, 7046878, 7178286, 7313803, 7454041, 7599749, 7751585, 7909568, 8073450, 8243443, 8419938, 8602743, 8791305, 8985631, 9186540, 9395245, 9613169, 9841723, 10081422, 10331328, 10589943, 10856560, 11131438, 11415273, 11709348, 12015764, 12336580, 12672719]
58187A2672719L51695L68036L85857M05027M25305M46852M69439M92322N15702
58178A6532954N41182N69764O00466O32010O64976P00941P40219P81848Q25502
58169B2589862Q72248R23494R80019J041900J108756J180154J256290J338011
58161C1290734J425911J519956J620135J727003J841387J964348K097545K242803
58153D5729822K401606K576261K771321K991908L240696L518777L829676M180164
58145G1240231M577574N030302N550129O145413O806230P502954Q210977Q939015
58137A24002825R726986J0613092J1604526J2676153J3785987J4884571J5912654
58130B13206794J6793702J7421616J7642295J7243754J5983138J3665589J0251147
$$ y = [12672719, 13024414, 13392450, 13778307, 14183334, 14608639, 15055491, 15524930, 16017252, 16532954, 17074136, 17643900, 18244366, 18876376, 19541352, 20242293, 20982512, 21764360, 22589862, 23462110, 24385604, 25365623, 26407523, 27516279, 28696433, 29952723, 31290734, 32716645, 34236601, 35856736, 37583739, 39425126, 41389474, 43487019, 45729822, 48131428, 50707689, 53479010, 56470918, 59711614, 63230391, 67060067, 71240231, 75817805, 80848107, 86398236, 92543649, 99349879, 106852833, 115063810, 124002825, 133729811, 144342903, 155947429, 168623582, 182409569, 197294140, 213206794, 230000496, 247422112, 265064407, 282308161, 298291299, 311956888, 322208035]
58123C22208035N930202J109784l697084q021599j1549140j4148689j5839986
58116B75991523j6738838j7005498j6803812j6276190j5536141j4670616j3742804
58109A65217624j2794805j1853621j0937702j0059459r225791q441063p710171
58102I4195012p037123o421763n860474n349758m886867m467629m086549l739473
58094E2345376l424113l137735k876545k637735k420395k223775k046161j885961
58086C1692956j742404j614347j499418j395032j299595j212423j133165j061508
58078B0735064r96801r37665q82492q30272p80735p33966o90382o50590o14499
58069A3617662n80878n48422n16905m86866m58806m33257m10636l90158l69827
$$ y = [322208035, 328138237, 329248021, 325550937, 317529338, 305980198, 291831509, 275991523, 259252685, 242247187, 225443375, 209167185, 193631044, 178960428, 165217624, 152422819, 140569198, 129631496, 119572037, 110346246, 101905183, 94195012, 87157889, 80736126, 74875652, 69525894, 64639027, 60171398, 56084849, 52345376, 48921263, 45783528, 42906983, 40269248, 37848853, 35625078, 33578917, 31692956, 29950552, 28336205, 26836787, 25441755, 24142160, 22929737, 21796572, 20735064, 19738263, 18800598, 17918106, 17087834, 16307099, 15573133, 14882751, 14232161, 13617662, 13036784, 12488362, 11971457, 11484591, 11025785, 10592528, 10181892, 9791734, 9421907]
58060I421907l48693l28225l10222k94208k78425k62579k47824k34483k21612
58051F895636k08772j96680j86045j77008j69438j62515j54529j44693j34817
58042E361139j27359j22164j16954j10884j05305j00893r6347r0799q5381q1329
58032D323724p8041p4233o9889o6098o3717o2747o2231o0614n7275n3772n2190
58021C622917n2269n1861n0350m9389m9613m9028m6185m2846m1609m2235m2396
58010C105136m1046l9061l7123l4950l2601l0909l0280l0029k9170k7304k4916
57999B747747k3117k2641k2835k2286k0938k0447k1730k3332k3344k1970k0782
57988B504325k0323j9857j8963j7740j5899j3306j1277j1484j3386j4364j2947
$$ y = [9421907, 9073214, 8744989, 8434767, 8140559, 7862134, 7599555, 7351731, 7117248, 6895636, 6686864, 6490184, 6304139, 6127131, 5957693, 5795178, 5640649, 5495956, 5361139, 5233780, 5111616, 4994662, 4883778, 4778473, 4677580, 4581233, 4490434, 4405053, 4323724, 4245683, 4171450, 4101561, 4035463, 3971746, 3908999, 3846768, 3786154, 3728879, 3675107, 3622917, 3570648, 3518787, 3468437, 3419048, 3369435, 3320407, 3274222, 3231376, 3189767, 3147532, 3105136, 3064090, 3025029, 2987906, 2952956, 2920355, 2889446, 2859166, 2829137, 2799967, 2772663, 2747747, 2724630, 2701989, 2679154, 2656868, 2635930, 2615483, 2593753, 2570421, 2547077, 2525107, 2504325, 2484002, 2464145, 2445182, 2427442, 2411543, 2398237, 2386960, 2375476, 2362090, 2347726, 2334779]
57977B334779j0529r257r342r391q468o938n721n500o371p680q317p740o678o450
57963B226397p497q837r158q292p302p026o912n827l742j905j187j086p70k30
57949B156626J11K34K43q4o04l10J413L460M150L482K972L305L588L357L776N927
57933B191646Q939J0964J1454J1310J1024J0025Q256P298Q797J2066J4234J3291
57921B319304J0383Q489R085J0888J1861J1509J0752J0369J0409J0711J1131J1305
57909B446196J0990J0603J0772J1288J1142R750P577N309K984K99k647n310p212
57896B511741q282q677q539p976p280p005p394p712o737m396k362k197l188k996
57882B427000n00K942N314O027N834N472N127M780M334L706L150L091L206K247
$$ y = [2334779, 2324250, 2314993, 2305651, 2296260, 2287792, 2280854, 2275133, 2269633, 2263262, 2255582, 2247265, 2239525, 2232847, 2226397, 2218900, 2210063, 2200905, 2192613, 2185311, 2178285, 2171373, 2165546, 2161804, 2159899, 2158712, 2157626, 2156856, 2156626, 2156737, 2156971, 2157214, 2157130, 2156526, 2156216, 2157629, 2161089, 2165239, 2168721, 2171693, 2174998, 2178586, 2181943, 2185719, 2191646, 2200585, 2211549, 2223003, 2234313, 2245337, 2255362, 2263618, 2270916, 2279713, 2291779, 2306013, 2319304, 2329687, 2338176, 2347261, 2358149, 2370010, 2381519, 2392271, 2402640, 2413049, 2423760, 2434891, 2446196, 2457186, 2467789, 2478561, 2489849, 2500991, 2510741, 2518318, 2523627, 2526611, 2526910, 2524263, 2518953, 2511741, 2503459, 2494782, 2486243, 2478267, 2470987, 2463982, 2456588, 2448876, 2442139, 2437743, 2435381, 2433184, 2429996, 2427000, 2426500, 2429442, 2434756, 2440783, 2446617, 2452089, 2457216, 2461996, 2466330, 2470036, 2473186, 2476277, 2479483, 2481730]
57868B481730m40l678n630o013o076o378n847l602p76N72j00j366j726r65M10
57853B440115K188M353O565Q397R813J0819J0974R921Q291P251P020O573N177
57840B537457L505K616K498K365K001J822J748J081k35j157q51J80Q69R55R25
57825B555779R29N45m28j516k025j651o16M31P99M85M44J695L992N972O743O777
57809B578355O999P562Q024Q336Q981J0226J1769J3115J3849J3636J2513J1287
57797B704652J1031J1881J2713J2315J0619Q486O647N336M569M297M270M222M182
57784B805220M247M111L344K245J744K258L122L651M275N878Q312J0411J1459
57771B870277J1819J1847J1186R821Q918R392J0212R622Q074Q131J0741J3234
$$ y = [2481730, 2481290, 2477612, 2471982, 2465969, 2459893, 2453515, 2447668, 2444066, 2443290, 2443862, 2443762, 2442396, 2440670, 2439705, 2440115, 2442303, 2446656, 2453221, 2461618, 2471431, 2482250, 2493224, 2503145, 2511436, 2518687, 2525707, 2532280, 2537457, 2540962, 2543578, 2546076, 2548441, 2550442, 2552264, 2554012, 2555093, 2554858, 2553701, 2552850, 2553030, 2553899, 2554854, 2555779, 2556708, 2557253, 2556825, 2555309, 2553284, 2551633, 2551017, 2551448, 2552247, 2552732, 2553176, 2554871, 2558863, 2564835, 2571578, 2578355, 2585354, 2592916, 2600940, 2609276, 2618257, 2628483, 2640252, 2653367, 2667216, 2680852, 2693365, 2704652, 2715683, 2727564, 2740277, 2752592, 2763211, 2771697, 2778344, 2783680, 2788249, 2792546, 2796816, 2801038, 2805220, 2809467, 2813578, 2816922, 2819167, 2820911, 2823169, 2826291, 2829942, 2834217, 2840095, 2848407, 2858818, 2870277, 2882096, 2893943, 2905129, 2914950, 2923868, 2933260, 2943472, 2953094, 2961168, 2969299, 2980040, 2993274]
57759B993274J2539R293O830O604O851N977N007N509O940P717P863Q651J0075
57746C093130J0612R641Q522Q692R919J1098J1862J2547J3255J3872J4609J5792
57734C233551J7129J7910J7972J7933J8264J8570J8209J7396J7119J7795J8417
57723C430265J7548J5019J2030R647P810O228N277N309N577M854L104J628J403
57710C525699J976K277K004J770K191L072L552L100K434L027N289P720Q606Q099
57696C580816P695P884P722O916O879Q757J1488J2942J2464J1268J0658J0883
57684C696372J1695J2961J4389J5290J5176J4377J3712J3637J3917J4157J4453
57673C850136J5196J6211J6647J6108J5535J6163J7771J8877J8730J8207J8254
$$ y = [2993274, 3005813, 3015106, 3021936, 3028540, 3035391, 3041368, 3046375, 3051884, 3058824, 3066541, 3074404, 3083055, 3093130, 3103742, 3113383, 3121905, 3130597, 3140516, 3151614, 3163476, 3176023, 3189278, 3203150, 3217759, 3233551, 3250680, 3268590, 3286562, 3304495, 3322759, 3341329, 3359538, 3376934, 3394053, 3411848, 3430265, 3447813, 3462832, 3474862, 3484509, 3492319, 3498547, 3503824, 3509133, 3514710, 3519564, 3522668, 3524296, 3525699, 3527675, 3529952, 3531956, 3533726, 3535917, 3538989, 3542541, 3545641, 3548075, 3551102, 3556391, 3564111, 3572717, 3580816, 3588511, 3596395, 3604117, 3611033, 3617912, 3626669, 3638157, 3651099, 3663563, 3674831, 3685489, 3696372, 3708067, 3721028, 3735417, 3750707, 3765883, 3780260, 3793972, 3807609, 3821526, 3835683, 3850136, 3865332, 3881543, 3898190, 3914298, 3929833, 3945996, 3963767, 3982644, 4001374, 4019581, 4037835]
57662D037835J8405J7622J5953J4503J4085J4655J5835J7151J7912J7593J6472
57651D218021J5401J4901J4929J5348J6042J6653J6877J7074J7931J9322K0219
57640D402718K0097J9740K0164K1171K1732K1654K1890K3047K4332K4611K4010
57629D645166K3716K4318K5243K6011K7147K9289L2046L4513L6564L8796M1571
57618D984380M4999M9680N6235O3871P0539P5254P9574Q6015R5239J05091J11610
57607E822487J10494R8566P5642M5755J5879p615k2110k8917l0771k9294k4956
57596F025160j8880j3356r766o749j873N004J1462J5791J8985K2649K6333K8293
57584F103053K8201K7622K7878K8552K8240K6060K2409J8652J6021J4455J2673
$$ y = [4037835, 4056240, 4073862, 4089815, 4104318, 4118403, 4133058, 4148893, 4166044, 4183956, 4201549, 4218021, 4233422, 4248323, 4263252, 4278600, 4294642, 4311295, 4328172, 4345246, 4363177, 4382499, 4402718, 4422815, 4442555, 4462719, 4483890, 4505622, 4527276, 4549166, 4572213, 4596545, 4621156, 4645166, 4668882, 4693200, 4718443, 4744454, 4771601, 4800890, 4832936, 4867449, 4904013, 4942809, 4984380, 5029379, 5079059, 5135294, 5199165, 5269704, 5344958, 5424532, 5510547, 5605786, 5710877, 5822487, 5932981, 6031547, 6107189, 6152944, 6168823, 6161208, 6139098, 6110181, 6079410, 6050116, 6025160, 6006280, 5992924, 5983158, 5976409, 5974536, 5979540, 5991002, 6006793, 6025778, 6048427, 6074760, 6103053, 6131254, 6158876, 6186754, 6215306, 6243546, 6269606, 6292015, 6310667, 6326688, 6341143, 6353816]
57573F353816R717O048K881R59L14N34O30n38k777m145l106o36R98J250J719L584
57557F371248O033P618Q031P940P931Q303R329J1029J2937J4571J5923J7194J8286
57544F516373J8907J9156J9701K1212K3674K6363K8656L0599L2333L3359L3145
57533F803478L2457L2985L5203L7665L9026L9653M0308M0480L9447L8113L7841
57522G216656L7876L6003L2004K8457K7240K6814K4173J8584J2278P925O306O193
57510G480509N812M329K142o4k182m187n325m787l052j582j053p95j46P56J744
57495G472119L033M356M767M071L598M698P080R403J0945J1973J2830J3464J3743
57482G576080J3722J3701J4147J5260J6515J7198J7484J8167J9146J9197J7945
$$ y = [6353816, 6363533, 6369581, 6372462, 6373421, 6373735, 6374269, 6374899, 6374361, 6371584, 6367439, 6364333, 6363697, 6364695, 6365945, 6367664, 6371248, 6377281, 6384899, 6392930, 6400870, 6408801, 6417104, 6426433, 6437462, 6450399, 6464970, 6480893, 6498087, 6516373, 6535280, 6554436, 6574137, 6595349, 6619023, 6645386, 6674042, 6704641, 6736974, 6770333, 6803478, 6835935, 6868920, 6904123, 6941788, 6980814, 7020467, 7060775, 7101255, 7140702, 7178815, 7216656, 7254532, 7290535, 7322539, 7350996, 7378236, 7405050, 7429223, 7447807, 7460085, 7468010, 7474316, 7480509, 7486321, 7490650, 7492792, 7492728, 7490546, 7486359, 7481034, 7476247, 7473195, 7471613, 7470560, 7469765, 7469619, 7470375, 7472119, 7475152, 7479508, 7484275, 7488346, 7491944, 7496642, 7503722, 7513125, 7524070, 7536043, 7548873, 7562337, 7576080, 7589802, 7603503, 7617650, 7632910, 7649425, 7666623, 7684107, 7702274, 7721420, 7740617, 7758562]
57471G758562J6983J7999K0471K2345K2624K2204K2306K3190K4446K5636K6329
57460H003095K6241K5650K5228K5312K5693K6238K7155K8469K9673L0247L0254
57449H303255L0116K9994K9822K9898L0927L3122L5538L6887L7031L7141L8066
57438H671797L9178L9404L8808L8356L8363L8241L7762L7560L7976L8198L7093
57427I092736L4464L1129K8093K5838K4101K2213J9883J7468J5224J2691R747
57416I333587P675P814R239R340P170M592L530L634L757M151N568P262P818P489
57402I422626P822R008R422Q220O938P658J0424J3329J4721J4706J4584J5254
57390I554712J6421J7376J8127J9291K0881K2051K2325K2322K2750K3470K4141
$$ y = [7758562, 7775545, 7793544, 7814015, 7836360, 7858984, 7881188, 7903494, 7926684, 7951130, 7976766, 8003095, 8029336, 8054986, 8080214, 8105526, 8131219, 8157457, 8184612, 8213081, 8242754, 8273001, 8303255, 8333371, 8363365, 8393187, 8423085, 8454012, 8487134, 8522672, 8559559, 8596590, 8633731, 8671797, 8710975, 8750379, 8789187, 8827543, 8865906, 8904147, 8941909, 8979469, 9017445, 9055643, 9092736, 9127200, 9158329, 9186422, 9212260, 9236361, 9258574, 9278457, 9295925, 9311149, 9323840, 9333587, 9341262, 9349076, 9358315, 9367655, 9374825, 9379417, 9382947, 9386581, 9390338, 9394489, 9400057, 9407319, 9415137, 9422626, 9430448, 9439456, 9448878, 9457098, 9464036, 9471694, 9482118, 9495447, 9510168, 9524874, 9539458, 9554712, 9571133, 9588509, 9606636, 9625927, 9646808, 9668859, 9691184, 9713506, 9736256, 9759726, 9783867]
57379I783867K5035K6325K7307K7366K7133K7587K8439K8638K8096K7625K7332
57368A0084750K6529K5184K4018K2942K0939J7924J5293J3792J2191R183N607
57357A0278352L382K750K063K53j811k873l202l999n401o151n619n068o031p823
57343A0238822q056n913l469k924l622l188j012J095J581R81P44J511K994M501
57329A0224045N081M135K458J821K892M409M894M408L890L687L547L469L615L819
57315A0276170L968M459N421O038N605M855N122O359P218P054O614O423N787M248
57301A0355341K993L556N495O628N830M537M814O628P958P508O223N701N985N928
57287A0435125N303N224O189O966O277M832M460N575O679O485N446M704M455M201
$$ y = [9783867, 9808902, 9835227, 9862534, 9889900, 9917033, 9944620, 9973059, 10001697, 10029793, 10057418, 10084750, 10111279, 10136463, 10160481, 10183423, 10204362, 10222286, 10237579, 10251371, 10263562, 10272745, 10278352, 10281734, 10284484, 10286547, 10286800, 10284989, 10282116, 10278914, 10274915, 10269514, 10263363, 10257744, 10252676, 10246645, 10238822, 10230766, 10224853, 10221384, 10218460, 10214838, 10211650, 10210638, 10211733, 10213314, 10214295, 10215039, 10216550, 10219544, 10224045, 10229126, 10233261, 10235719, 10237540, 10240432, 10244841, 10249735, 10254143, 10258033, 10261720, 10265267, 10268736, 10272351, 10276170, 10280138, 10284597, 10290018, 10296056, 10301661, 10306516, 10311638, 10317997, 10325215, 10332269, 10338883, 10345306, 10351093, 10355341, 10358334, 10361890, 10367385, 10374013, 10379843, 10384380, 10389194, 10395822, 10403780, 10411288, 10417511, 10423212, 10429197, 10435125, 10440428, 10445652, 10451841, 10458807, 10465084, 10469916, 10474376, 10479951, 10486630, 10493115, 10498561, 10503265, 10507720, 10511921]
57273A0511921L991M436N507O228N846M667L390K084N03q69r46M99K074K089M38
57258A0551858j265j457j32J384J758O91r40j765j187m0L02k11m6J843M251M919
57242A0559963L235Q52m38m09J31N12L33o11j751j832m88Q73Q02n3K32K136M068
57225A0567555M549L669K232P92R8J035L248M906M809L841L359L254K852K729
57211A0608928L881N631O190N102L540K215O63j261l064n144q760j3670j7548
57198A0586703j8824j8619j8698j8959j8448j7641j7835j8995j9899k0147k0324
57187A0378314k0464j9869j8589j7548j6917j5696j3335j0711q937q070p497o928
57175A0213753o427n931n167l851j828O92L050M699N757O588P053O861O477O751
$$ y = [10511921, 10515912, 10520348, 10525855, 10532083, 10537929, 10542596, 10545986, 10548070, 10548573, 10547704, 10546758, 10547257, 10549331, 10551420, 10551858, 10550593, 10549136, 10549004, 10550388, 10552146, 10552837, 10551897, 10550132, 10548945, 10548905, 10549207, 10548996, 10548950, 10550793, 10555044, 10559963, 10563198, 10564050, 10563612, 10563203, 10563334, 10563846, 10564179, 10563568, 10561817, 10559985, 10559497, 10560370, 10561172, 10561119, 10561351, 10563487, 10567555, 10572104, 10575773, 10578005, 10578797, 10578895, 10579930, 10583178, 10588084, 10592893, 10596734, 10600093, 10603347, 10606199, 10608928, 10612809, 10618440, 10624630, 10629732, 10633272, 10635487, 10636150, 10634889, 10631825, 10626681, 10617921, 10604251, 10586703, 10567879, 10549260, 10530562, 10511603, 10493155, 10475514, 10457679, 10438684, 10418785, 10398638, 10378314, 10357850, 10337981, 10319392, 10301844, 10284927, 10269231, 10255896, 10245185, 10236248, 10228178, 10220681, 10213753, 10207326, 10201395, 10196228, 10192377, 10190549, 10191241, 10194291, 10198990, 10204747, 10211335, 10218388, 10225249, 10231726, 10238477]
57161A0238477P555P756O801N499M677L913K432O65q2M72R21j18k207l708m058
57146A0268995m512o180q210q945q525q878j0943j3423j4980j6131j7870j9630
57134A0130768k0327k0537k1832k4344k6788k8775l1234l4454l7473l9844m2304
57123I802856m5052m7015m7673m8268n0175n3137n6007n8212n9655o0223o0258
57112I217181o0647o1495o1649o0462n9018n8522n8408n7299n4960n1999m8505
57101H584217m4536m1313m0081m0022l9145l7333l6825l9155m3202m6971m9997
57090H125637n3167n7180o2224o8377p5195q1159q4546q4985q3666q1971q0328
57079G312839p8591p7088p6889p8812q2450q6490r0209r4192r9365j05686j12310
$$ y = [10238477, 10246032, 10253788, 10260589, 10266088, 10270765, 10274678, 10277110, 10277775, 10277693, 10278165, 10279086, 10278968, 10276761, 10273053, 10268995, 10264483, 10258303, 10250093, 10241148, 10232623, 10223745, 10212802, 10199379, 10184399, 10168268, 10150398, 10130768, 10110441, 10089904, 10068072, 10043728, 10016940, 9988165, 9956931, 9922477, 9885004, 9845160, 9802856, 9757804, 9710789, 9663116, 9614848, 9564673, 9511536, 9455529, 9397317, 9337662, 9277439, 9217181, 9156534, 9095039, 9033390, 8972928, 8913910, 8855388, 8796980, 8739681, 8684721, 8632722, 8584217, 8539681, 8498368, 8458287, 8418265, 8379120, 8341787, 8304962, 8265807, 8222605, 8175634, 8125637, 8072470, 8015290, 7953066, 7884689, 7809494, 7728335, 7643789, 7558804, 7475138, 7393167, 7312839, 7234248, 7157160, 7080271, 7001459, 6919009, 6832519, 6742310, 6648118, 6548753, 6443067, 6330757]
57068F330757j18745j25150j31604j37768j43604j49840j57354j66253j75827
57059E024612j85356j94961k05735k18861k34329k50713k66569k81948k98067
57050B888073l15607l34065l52892l72560l93954m16929B61894b00596m84047
57041f84643n06107n29887n55617n82739o10842o40277o72117p07779p48516p94599
57031g033123q44712q96526r48116r98248j045096j085675j117626j140717j154545
57022a6264384j153773j126373j057308r34237p51125n09609k19773J00456M28641
57013b1487485P42486J022766J254305J427381J539722J596317J605896J577167
57005a0721445J518149J437459J344089J245348J145792J048271R54911Q66637
$$ y = [6330757, 6212012, 6086862, 5955258, 5817490, 5673886, 5524046, 5366692, 5200439, 5024612, 4839256, 4644295, 4438560, 4219699, 3985370, 3734657, 3468088, 3186140, 2888073, 2572466, 2238401, 1885509, 1512949, 1118995, 702066, 261894, -200596, -684643, -1190750, -1720637, -2276254, -2858993, -3469835, -4110112, -4782229, -5490008, -6238524, -7033123, -7877835, -8774361, -9722477, -10720725, -11765821, -12851496, -13969122, -15109839, -16264384, -17418157, -18544530, -19601838, -20536075, -21287200, -21796809, -22016582, -21916126, -21487485, -20744999, -19722233, -18467928, -17040547, -15500825, -13904508, -12298612, -10721445, -9203296, -7765837, -6421748, -5176400, -4030608, -2982337, -2027426, -1160789]
56997a160789c77842C25532O28592N59009M93072M28578L65834L07899K57241
56988C365757K13371J74527J40189J10670Q5148O1896M0282K1164N116q695k1525
56977D187900l3870m5505n5999o4919p2156p8299q4157q9797r4609r8353j01422
56966C368814j03995j05846j07264j09178j11879j14420j15939j16734j17320
56957B366239j17214j15777j13662j12140j11126j09131j05230j00065r4694q9542
56947A297658q4780q0728p7163p3028o7619o1641n6380n2230m8712m5474m2455
56936F07448l9216l5083l0162k5481k1799j8809j5880j3114j1160j0121r210p623
56924C69790n521l864l304l491l700l965n015o982q763r253q717q267q290q194
$$ y = [-1160789, -377842, 325532, 954124, 1513133, 2006205, 2434783, 2800617, 3108516, 3365757, 3579128, 3753655, 3893844, 4004514, 4089662, 4151558, 4191840, 4213004, 4218120, 4209425, 4187900, 4154030, 4108525, 4052526, 3987607, 3915451, 3837152, 3752995, 3663198, 3568589, 3470236, 3368814, 3264819, 3158973, 3051709, 2942531, 2830652, 2716232, 2600293, 2483559, 2366239, 2249025, 2133248, 2019586, 1907446, 1796320, 1687189, 1581959, 1481894, 1387200, 1297658, 1212878, 1132150, 1054987, 981959, 914340, 852699, 796319, 744089, 695377, 649903, 607448, 568232, 533149, 502987, 477506, 455707, 436898, 421018, 407904, 396744, 386623, 377413, 369790, 364269, 360405, 357101, 353610, 349910, 345945, 340930, 333948, 325185, 315932, 307215, 298948, 290658, 282464]
56910B82464p592o697n445l319m56K001L310M087N095O005O215O229O942Q026
56896C06865Q272P327N913M425K666J028M10N97M3j952l992m437l539k674k229
56881C18723j495k39R39J848L162N236P262Q147P885P546P872Q246P363M887K002
56866C89384j67k123n086q696j0935j0810r827r922j0963j1465j1018j0500j0225
56853B77647r531q105o479n001l666l121m381o807p793n653j911M05K90n79l61
56838B14954J052K634L683M190M455M827N590O774Q192R686J1138J2286J2840
56825C02301J2813J2391J1488R896Q017O882P058P819P897O869N376M187L636
56812D06630L969N500P968J0312J1676J2381J3346J4649J5414J5245J4984J5554
$$ y = [282464, 274872, 268175, 262730, 259411, 258955, 260956, 264266, 268353, 273448, 279453, 285668, 291897, 298839, 306865, 315137, 322464, 328377, 332802, 335468, 336496, 336906, 337503, 337546, 335594, 331602, 327165, 323626, 320952, 318723, 317228, 316989, 317928, 319776, 322938, 328174, 335436, 343583, 351468, 359014, 366886, 375132, 382495, 387382, 389384, 389217, 387094, 382008, 373312, 362377, 351567, 341740, 331818, 320855, 309390, 298372, 287872, 277647, 268116, 260011, 253532, 248531, 244865, 241744, 237363, 230556, 222763, 217110, 215199, 215604, 215894, 215315, 214954, 216006, 218640, 222323, 226513, 230968, 235795, 241385, 248159, 256351, 266037, 277175, 289461, 302301, 315114, 327505, 338993, 348889, 356906, 363788, 370846, 378665, 386562, 393431, 398807, 402994, 406630, 410599, 416099, 424067, 434379, 446055, 458436, 471782, 486431, 501845, 517090, 532074, 547628]
56800E47628J6472J6187J3832J0117O532L999K425J083p34l167n574o958o746
56787E95096n085k410Q26L811N393N354N393P815J2819J8010K1175K2652K4002
56774G14851K5195K4726K2156J8709J4919R576K053n739j1266j4228j6085j7489
56762G67378j7912j7346j6549j5521j3450j0474p975o590n222k632J072N007Q493
56749F68279J0817J1237R905P897N705K653j602o083r850j3186j6530j9266k0692
56736F29284k1249k1553k1002j8727j5347j2440j0612r282p969o632n051l067
56724D76353j185J18J220K406K557L66l384o325p363p713q957j1274j3824j5641
56710D07354j5914j4541j2616j1488j1217j0887j0216r599q785p174n575n794
$$ y = [547628, 564100, 580287, 594119, 604236, 610768, 614767, 617192, 618275, 617541, 614374, 608800, 601842, 595096, 590011, 587601, 588427, 592238, 597631, 602985, 608378, 616193, 629012, 647022, 668197, 690849, 714851, 740046, 764772, 786928, 805637, 820556, 830132, 832185, 826446, 815180, 800952, 784867, 767378, 749466, 732120, 715571, 700050, 686600, 676126, 668151, 661561, 656339, 653707, 654779, 659786, 668279, 679096, 690333, 700238, 708135, 713840, 716493, 714891, 708808, 698958, 685772, 669242, 649976, 629284, 608035, 586482, 565480, 546753, 531406, 518966, 508354, 499072, 491103, 484471, 479420, 476353, 475168, 475286, 476506, 478912, 481469, 481835, 478451, 472126, 464763, 457050, 448093, 436819, 422995, 407354, 391440, 376899, 364283, 352795, 341578, 330691, 320475, 310876, 302091, 294917, 289342, 283548]
56698B83548p974j0052j0501r971r308p744m564j195J41p79k182k658k313j968
56684B12480k304l509m835m864l120r63K7N0L38R07M94j228k796k751j345J35
56668A86716R29J227J369J328Q50j65j440k405k552j765l53J041J616R52m05j139
56652A85804m28J149K199J949R34K98N95J252J200Q3j291j804j099M07K027K902
56636A96177K119k39k442k669j180J28L83N02J162J573J088N16O87R48L94l13
56620A98834N8J184J572P89j35l25J90J242K769M145M437L592K524J896J581J402
56604B25755J511J879K109J944J496R58O08Q29J554K038J952K075K883L182J705
56589B52478l44m02J743L468L147K297K716L510K868J392J247K672L596K789J414
$$ y = [283548, 275574, 265522, 255021, 245050, 235742, 227998, 223434, 222239, 222380, 221601, 219419, 216761, 214448, 212480, 210176, 206667, 201832, 196968, 193848, 192885, 192912, 192962, 193300, 194207, 194701, 193473, 190677, 187926, 186581, 186716, 187645, 188872, 190241, 191569, 192419, 192254, 190814, 188409, 185857, 184092, 183739, 184780, 186396, 187348, 186943, 185804, 185376, 186525, 188724, 190673, 191607, 191905, 192500, 193752, 194952, 195035, 193744, 191940, 190841, 191248, 193275, 196177, 198296, 198057, 195615, 192946, 191766, 191894, 192277, 192779, 193941, 195514, 196602, 197118, 197805, 198753, 199147, 198834, 198892, 200076, 201648, 202437, 202302, 201977, 202167, 203409, 206178, 210323, 214760, 218352, 220876, 222772, 224353, 225755, 227266, 229145, 231254, 233198, 234694, 235652, 236260, 237089, 238643, 240681, 242633, 244708, 247591, 250773, 252478, 252134, 251732, 253475, 256943, 260090, 262387, 265103, 268613, 271481, 272873, 274120, 276792, 280388, 283177, 284591]
56574B84591R17J065R30N44M99O87M67k90j165j934k654l156l147k758k467k452
56558B69677k542k757l248l554k807j083J05m43j839k026l78J549K110J374M54
56543B54592r8m97q93j214j589k092k305j815j065r24j406j566q70L9K90l9r4
56526B38454O83J980K854K420O01j499k378j608l78j71r56j171L41K729L933L082
56510B48916J537J159J939K242J302N05J558M184O487P165O397M884L143J833
56496B93251J670K436K896K225J090P04J282J952J958J395Q24O84J054J651J935
56481C17007J552P41J63K40P07Q68K55j009k358l252l529l489l664m211m421l157
56465B92443l15K373K706L64k683m214l648j792K95J636J473j6j583k304k573
$$ y = [284591, 285508, 286573, 287503, 288047, 288546, 289233, 289700, 289410, 288245, 286311, 283657, 280501, 277354, 274596, 272129, 269677, 267135, 264378, 261130, 257576, 254769, 253686, 253791, 253348, 251509, 249483, 249105, 250654, 252764, 254138, 254592, 254494, 253997, 253104, 251890, 250301, 248209, 245904, 244089, 243024, 242100, 240694, 239128, 238258, 238297, 238587, 238548, 238454, 239137, 241117, 243971, 246391, 246992, 245493, 243115, 241507, 241129, 240958, 240002, 238831, 239172, 241901, 245834, 248916, 250453, 251612, 253551, 255793, 257095, 257600, 259158, 263342, 269829, 276994, 283391, 288275, 291418, 293251, 294921, 297357, 300253, 302478, 303568, 304272, 305554, 307506, 309464, 310859, 311683, 312367, 313421, 315072, 317007, 318559, 319300, 319463, 319703, 320410, 321278, 321533, 320524, 318166, 314914, 311385, 307896, 304232, 300021, 295600, 292443, 292128, 294501, 297207, 297571, 294888, 290674, 287026, 285234, 285529, 287165, 288638, 288622, 287039, 284735, 282162]
56450B82162k941k799j454J13K45q48j232j89P89M74k52JJ045J817K107K297K211
56433B83546J512O92M10K32o66j785j603K42K246K847K073J057O78J060J813K277
56417B96631J940R67R7j81m5J05K27N28J074J708K185K276J976J661J932L011
56401C16092M392N127M569K956J339O96R76J296J130R00J033J018J19j277j877
56386C38489j181j06L13J54J28N17J067J524J625R74m76j991k705k623k359j970
56370C31380q77Q55J983J463j44j366j641j624j759j511n13L15l23k202l536l103
56354C17397j741j169j650j675j29J968K580J213m69q65m12o14j599j811k46K012
56338C12790L131K699J894J892K790L905M474M173L466L279L859M185L148J123
$$ y = [282162, 279221, 276422, 274968, 275081, 275326, 274478, 273246, 273057, 273846, 274320, 274068, 274069, 275114, 276931, 279038, 281335, 283546, 285058, 285750, 286160, 286392, 285726, 283941, 282338, 282580, 284826, 287673, 289746, 290803, 291481, 292541, 294354, 296631, 298571, 299538, 299635, 299454, 299409, 299514, 299741, 300269, 301343, 303051, 305236, 307512, 309488, 311149, 313081, 316092, 320484, 325611, 330180, 333136, 334475, 335171, 336147, 337443, 338573, 339473, 340506, 341524, 341643, 340366, 338489, 337308, 337202, 337515, 337669, 337797, 338314, 339381, 340905, 342530, 343504, 343028, 341037, 338332, 335709, 333350, 331380, 330503, 331358, 333341, 334804, 334660, 333294, 331653, 330029, 328270, 326759, 326246, 326561, 326238, 324036, 320500, 317397, 315656, 314487, 312837, 311162, 311033, 313001, 315581, 316794, 316325, 315460, 315048, 314434, 312835, 311024, 310778, 312790, 315921, 318620, 320514, 322406, 325196, 329101, 333575, 337748, 341214, 344493, 348352, 352537, 355685, 356808]
56324C56808l88n32K56J279K266K849K526J641J415K353L404L488L052L198L908
56309C87523M235L888L364K648J172o97j433l54J233J730J357J435K194K525J945
56294D12765J391J647K144K094J887K307K967K906K395K561L199K686Q08j58J457
56279D43056L938M429K955J971K310K199P09l96N02K307L167L284L883M585M161
56264D83060L186L497N043N643M379L052L305M130L655K169J633K878M731N771
56250E36132N626M603L216K309K671M004N017N015M834N676P359Q337P463N247
56236F07509L254K584L059L720L995M314N617Q091J0528J1305J0185Q761Q683
56223F91605R713J0100Q939P489P706R942J2612J3968J3648J2466J1328J0763
$$ y = [356808, 356420, 355888, 356144, 357423, 359689, 362538, 365064, 366705, 368120, 370473, 373877, 377365, 380417, 383615, 387523, 391758, 395646, 399010, 401658, 402830, 402133, 400700, 400346, 401579, 403309, 404666, 406101, 408295, 410820, 412765, 414156, 415803, 417947, 420041, 421928, 424235, 427202, 430108, 432503, 435064, 438263, 440949, 441757, 441599, 443056, 446994, 451423, 454378, 456349, 458659, 460858, 461567, 461171, 461673, 463980, 467147, 470431, 474314, 478899, 483060, 486246, 489743, 494786, 500429, 504808, 507860, 511165, 515295, 518950, 521119, 522752, 525630, 530361, 536132, 541758, 546361, 549577, 551886, 554557, 558561, 563578, 568593, 573427, 579103, 586462, 594799, 602262, 607509, 610763, 613347, 616406, 620126, 624121, 628435, 634052, 642143, 652671, 663976, 674161, 682922, 691605, 701318, 711418, 720357, 727846, 735552, 745494, 758106, 772074, 785722, 798188, 809516, 820279]
56211H20279J1170J2851J5456J7759J8514J7776J7068J7863K0031K2087K2990
56200A013844K3332K4625K7768L2270L6751M0021M1950M3473M5596M8357N0945
56189A428932N2797N4211N5824N7785N9714O1066O1350O0222N7514N3150M7135
56178B049700L9986L2972K7120K1859J5412O969k082r601j4838j8705k2415k6341
56166B100036k9900l2102l2598l2481l3481l5990l8621m0097m0671m0972m0525
56155A702598l8689l6315l5049l5165l5396l4680l2934l0325k7128k4187k2211
56144A350519k0587j8163j5186j2954j1559r763p475o331o943p321n518k427m07
56131A225885l8Q7J007K440L980N728P538Q718Q776P880O669O095P138R897J3070
$$ y = [820279, 831449, 844300, 859756, 877515, 896029, 913805, 930873, 948736, 968767, 990854, 1013844, 1037176, 1061801, 1089569, 1121839, 1158590, 1198611, 1240561, 1284034, 1329630, 1377987, 1428932, 1481729, 1535940, 1591764, 1649549, 1709263, 1770329, 1831679, 1891901, 1949415, 2002565, 2049700, 2089686, 2122658, 2149778, 2171637, 2187049, 2194018, 2191936, 2182335, 2167497, 2148792, 2126377, 2100036, 2070136, 2038034, 2005436, 1972955, 1939474, 1903484, 1864863, 1824766, 1784095, 1743123, 1702598, 1663909, 1627594, 1592545, 1557380, 1521984, 1487304, 1454370, 1424045, 1396917, 1372730, 1350519, 1329932, 1311769, 1296583, 1283629, 1272070, 1262307, 1254832, 1248501, 1241558, 1234237, 1228719, 1226292, 1225885, 1225847, 1225934, 1226941, 1229381, 1233361, 1239089, 1246627, 1255345, 1264121, 1272001, 1278670, 1284765, 1291903, 1301800, 1314870]
56116A314870J5030J5297J4547J3601J3118J3795J5836J8310J9916K0434K0742
56105A495496K1521K2728K4311K6480K9085L1436L3078L4364L6115L8953M2943
56094A836510M7603N2426N7654O4072P1691P9420Q6754R5105J06201J19618J33184
56083B750238J45400J55798J62855J63579J56128J41819J23999J05989R0565P9838
56073D076208P4058P1133O8256O3666N6436M5735L1684J6391K820p449j4890k1162
56061D462886k8611l9958n6737p7463r8144j14926j25941j31050j30888j26494
56051C532674j19099j09755r9259q8231p6947o5472n4449m5294l8663l3238k7120
56040B775147k0247j4133r359m916l08L463N869Q155J1379J4438J5782J6080J7365
$$ y = [1314870, 1329900, 1345197, 1359744, 1373345, 1386463, 1400258, 1416094, 1434404, 1454320, 1474754, 1495496, 1517017, 1539745, 1564056, 1590536, 1619621, 1651057, 1684135, 1718499, 1754614, 1793567, 1836510, 1884113, 1936539, 1994193, 2058265, 2129956, 2209376, 2296130, 2391235, 2497436, 2617054, 2750238, 2895638, 3051436, 3214291, 3377870, 3533998, 3675817, 3799816, 3905805, 3996370, 4076208, 4150266, 4221399, 4289655, 4353321, 4409757, 4455492, 4487176, 4503567, 4506387, 4498938, 4484048, 4462886, 4434275, 4394317, 4337580, 4260117, 4161973, 4047047, 3921106, 3790056, 3659168, 3532674, 3413575, 3303820, 3204561, 3116330, 3039383, 2973911, 2919462, 2874168, 2835505, 2802267, 2775147, 2754900, 2740767, 2731408, 2726492, 2726184, 2729647, 2735516, 2743671, 2755050, 2769488, 2785270, 2801350, 2818715]
56027B818715J9945K2214K3515K5131K7828L0243L0917L0557L0920L2345L3845
56016C126175L5125L6885L9152M0758M1018M0948M2122M4848M8018N0529N2309
56005C597887N4063N6215N8286N9414N9616O0118O1876O4077O4963O4281O3792
55994D264588O4987O7118O8518O9094P0321P2933P5879P7834P8800P9746Q1451
55983E071269Q4292Q8486R3709R8736J02350J04717J07314J11214J15859J19859
55973F097805J22782J25622J29509J34463J39880J45784J52767J60532J67459
55964G376603J72318J75961J80517J87211J95655K04947K14493K23841K32827
55955I164373K42081K52389K63300K73527K83128K94047L07641L22871L38084
$$ y = [2818715, 2838660, 2860874, 2884389, 2909520, 2937348, 2967591, 2998508, 3029065, 3059985, 3092330, 3126175, 3161300, 3198185, 3237337, 3278095, 3319113, 3360061, 3402183, 3447031, 3495049, 3545578, 3597887, 3651950, 3708165, 3766451, 3825865, 3885481, 3945599, 4007475, 4071552, 4136515, 4200796, 4264588, 4329575, 4396693, 4465211, 4534305, 4604626, 4677559, 4753438, 4831272, 4910072, 4989818, 5071269, 5155561, 5244047, 5337756, 5436492, 5538842, 5643559, 5750873, 5862087, 5977946, 6097805, 6220587, 6346209, 6475718, 6610181, 6750061, 6895845, 7048612, 7209144, 7376603, 7548921, 7724882, 7905399, 8092610, 8288265, 8493212, 8707705, 8931546, 9164373, 9406454, 9658843, 9922143, 10195670, 10478798, 10772845, 11080486, 11403357, 11741441]
55946A1741441L53528L70612L89385M08557M27754M48087M70304M94019N19138
55937A5622825N46462N76149O06887O37728O69835P05359P45140P88433Q34554
55928B1733372Q83852R37205R95225J058073J125771J198704J277612J362622
55920C0572436J452464J545857J643991J750350J867423J994752K131453K279545
55912D5238271K443222K625645K828659L055664L312601L605319L937616M313005
55904G1360002M737239N217710N761049O372610P057900P822907Q672261R607150
55896A26608828J0624363J1715515J2865285J4048867J5228997J6351409J7336590
55889B24779854J8067194J8375419J8043018J6832197J4557058J1177840O870065
$$ y = [11741441, 12094969, 12465581, 12854966, 13263523, 13691277, 14139364, 14609668, 15103687, 15622825, 16169287, 16745436, 17352323, 17990051, 18659886, 19365245, 20110385, 20898818, 21733372, 22617224, 23554429, 24549654, 25607727, 26733498, 27932202, 29209814, 30572436, 32024900, 33570757, 35214748, 36965098, 38832521, 40827273, 42958726, 45238271, 47681493, 50307138, 53135797, 56191461, 59504062, 63109381, 67046997, 71360002, 76097241, 81314951, 87076000, 93448610, 100506510, 108329417, 117001678, 126608828, 137233191, 148948706, 161813991, 175862858, 191091855, 207443264, 224779854, 242847048, 261222467, 279265485, 296097682, 310654740, 321832580, 328702645]
55882C28702645K017871k880420p351074j1058317j3846805j5717476j6772627
55875B63093797j7162749j7047991j6574004j5859978j4996820j4051615j3073520
55868A54327120j2097967j1148879j0240695r381614q577120p831348p145994
55861H7903503o519601n949077n431383m963026m538901m153280l801918l482073
55853D9064244l190737k924439k680978k460048k261392k083330j923352j779184
55845B9760784j648847j530703j423958j328205j242109j163477j090977j024565
55837A9307943r63769r06989q53332q03660p58531p16306o74883o34485n96957
55828A2399031n62908n31178n00973m72717m46693m22333l99283l77895l58174
$$ y = [328702645, 330720516, 327840096, 320489022, 309430705, 295583900, 279866424, 263093797, 245931048, 228883057, 212309053, 196449075, 181452255, 167400640, 154327120, 142229153, 131080274, 120839579, 111457965, 102880845, 95049497, 87903503, 81383902, 75434825, 70003442, 65040416, 60501515, 56348235, 52546317, 49064244, 45873507, 42949068, 40268090, 37808042, 35546650, 33463320, 31539968, 29760784, 28111937, 26581234, 25157276, 23829071, 22586962, 21423485, 20332508, 19307943, 18344174, 17437185, 16583853, 15780193, 15021662, 14305356, 13630473, 12995988, 12399031, 11836123, 11304945, 10803972, 10331255, 9884562, 9462229, 9062946, 8685051, 8326877]
55819H326877l39268l20546l02333k85260k69544k55331k42958k32389k22875
55810E856373k13514k03755j93276j82140j71278j62129j55190j49328j42943
55801D282820j35448j27420j19759j13169j08071j04408j01399r7868r3113q7549
55791C194616q2461p8892p6716p4980p3140p1338o9342o6156o1489n6891n4273
55780B428938n3562n2963n1420m9516m7932m6374m4631m3439m3349m3464m2275
55769A910013l9527l6543l4748l4236l3779l2163k9667k7937k7910k8282k7032
55758A558189k4374k2724k3336k4411k3560k1024j9099j9025j9807j9882j8660
55747A322287j6403j3757j1726j1144j1607j1547r870p210n117m296m142l979
$$ y = [8326877, 7987609, 7667063, 7364730, 7079470, 6809926, 6554595, 6311637, 6079248, 5856373, 5642859, 5439104, 5245828, 5063688, 4892410, 4730281, 4575091, 4425763, 4282820, 4147372, 4019952, 3900193, 3787024, 3678953, 3574545, 3473146, 3375278, 3282165, 3194616, 3112155, 3033263, 2956547, 2881567, 2808427, 2737089, 2667747, 2601591, 2540102, 2483211, 2428938, 2375376, 2322413, 2270993, 2221477, 2173545, 2127171, 2082540, 2039101, 1995752, 1952288, 1910013, 1870486, 1833943, 1799195, 1764959, 1731180, 1699017, 1669350, 1641413, 1613503, 1585221, 1558189, 1533815, 1511091, 1487755, 1463344, 1439784, 1418760, 1399661, 1380636, 1360829, 1340947, 1322287, 1305884, 1292127, 1280401, 1269257, 1257650, 1246103, 1236233, 1229023, 1223906, 1219610, 1215468, 1211489]
55735A211489m098n146o729p513p023o621p747r779j0726j0084r618j0908j3366
55722A102131j5444j6767j7998j9263j9940j9710j8887j7705j6032j3715j0721
55711I15949p299m529m114o606j0150j2001j1230r151p363o472o574p643r042
55698H13775r668r076p857o666n754n623p059r767j1947j2129j0901r886r514
55685F97928q813p285n808n354n668n881o000o968r230j1819j3340j3532j3366
55672E84864j3582j3837j3421j2334j1077r828q447p123o313o022n776n462n541
55659D66101o231o886o649n458m052l105k627k309k280l181n189p169p498n958
55645C97509m233l992n046o045o372o369o080n117l892l681m876o082n734l986
$$ y = [1211489, 1207391, 1202245, 1195516, 1188003, 1180980, 1174359, 1166612, 1156833, 1146107, 1136023, 1126405, 1115497, 1102131, 1086687, 1069920, 1051922, 1032659, 1012719, 993009, 974122, 956417, 940385, 926670, 915949, 908650, 904121, 900007, 893401, 883251, 871250, 860020, 850869, 843506, 837034, 830460, 822817, 813775, 804107, 795031, 787174, 780508, 774754, 769131, 762072, 752305, 740358, 728229, 717328, 707442, 697928, 689115, 681830, 676022, 670668, 665000, 659119, 653119, 646151, 636921, 625102, 611762, 598230, 584864, 571282, 557445, 544024, 531690, 520613, 510785, 502338, 495215, 488902, 482880, 477104, 471642, 466101, 459870, 452984, 446335, 440877, 436825, 433720, 431093, 428784, 426504, 423323, 418134, 410965, 403467, 397509, 393276, 389284, 384238, 378193, 371821, 365452, 359372, 354255, 350363, 346682, 341806, 335724, 329990, 326004]
55631C26004k354j957k605l308l177k109r32o27j100j112L10K687M592M988L871
55616C23171K070O83L22N35L35m93j095p90m9K57k7m18n78m71j11L71P70J275
55598C25757K312L525L643K127L00m8J212K636L026K281Q54o21j384j243j046
55583C43331j584k363k551k660l807n491n901m729l865m485n165m144k052q63
55569B93671j058j450j269q20k82O00J549J747J166P39R57J271J150P50Q2j398
55553B97405l664n476n737m936m338m219l926l351l154l433l322k368j395j283
55539B46803j601j365p79j148l047n391o763p002o988p263p422o836n556m337
55525A81305l815l763l325k192j280j687l046l742k964j719j278j450j259o83
$$ y = [326004, 323650, 321693, 319088, 315780, 312603, 310494, 309562, 308935, 307835, 306723, 307033, 309720, 314312, 319300, 323171, 325241, 325924, 326246, 326781, 327116, 326623, 325528, 324738, 324689, 324946, 324919, 324501, 323923, 323452, 323341, 323712, 324482, 325757, 328069, 331594, 335237, 337364, 337664, 337616, 338828, 341464, 344490, 346771, 347625, 347004, 345620, 344377, 343331, 341747, 339384, 336833, 334173, 330366, 324875, 318974, 314245, 310380, 305895, 300730, 296586, 294534, 293671, 292613, 291163, 289894, 289074, 288792, 289392, 290941, 292688, 293854, 294593, 295550, 296821, 297971, 298721, 298803, 297405, 293741, 288265, 282528, 277592, 273254, 269035, 265109, 261758, 258604, 255171, 251849, 249481, 248086, 246803, 245202, 243837, 243058, 241910, 238863, 233472, 226709, 219707, 212719, 205456, 198034, 191198, 185642, 181305, 177490, 173727, 170402, 168210, 166930, 165243, 162197, 158455, 155491, 153772, 152494, 151044, 149785, 149102]
55511A49102n18r25j277j460k079l188l990m083l992m041l751k940k384k667l295
55496A08512l620l831m152m013k960j634p83j69M84M10q44j897j189M03P31j51
55480H5297m7J700L095K807K203K739L472K935J788J511J754J200J98K67J374
55465A12293J811Q64l24p17n84n43q61j847l426m352l405j518q63j615j682k96
55449I2935N19p25k326j920o2Q61K02o21p41o03m09K10R08P63j00n52k63M7K11
55430H8334Q89J910K098J350J235K570L831L166J029m27P7K006M020M963M320
55415A21371K592R79R2o66j956l384m103m013l655l464l737m604n427n088l700
55400H1237l078m296n789n387l524k531l120l624k858j734j464j878k352k911
$$ y = [149102, 148584, 147659, 146382, 144922, 142843, 139655, 135665, 131582, 127590, 123549, 119798, 116858, 114474, 111807, 108512, 104892, 101061, 96909, 92896, 89936, 88302, 87519, 87350, 87834, 88244, 87400, 85503, 84314, 84717, 85448, 85297, 85250, 86950, 90045, 92852, 95055, 97794, 101266, 104201, 105989, 107500, 109254, 110454, 110652, 110919, 112293, 114104, 114968, 114644, 113927, 113343, 112800, 111939, 110092, 106666, 102314, 98909, 97391, 96528, 94913, 93231, 92935, 93454, 92729, 90403, 88483, 88421, 89282, 89484, 88863, 88122, 87519, 87110, 87320, 88228, 88991, 88891, 88339, 88076, 88123, 88334, 89223, 91133, 93231, 94581, 95816, 98386, 102217, 105383, 106412, 105985, 106062, 108068, 112088, 117051, 121371, 123963, 124942, 125034, 124368, 122412, 119028, 114925, 110912, 107257, 103793, 100056, 95452, 90025, 84937, 81237, 78159, 73863, 68074, 62687, 59163, 56632, 53512, 49888, 47030, 45296, 43832, 41954, 39602, 36691]
55386C6691l509l431k373j140m39k8K22l79j856k567j190J066J786N48p64o56
55370B1981K99O76r4j558k878l331k759j756j009n29M6O14P49M41Q0j50j77L23
55352A0968J395K165J715M47m77q96j681k966l655l025j671m10O47J462J565R99
55336F582P77J558K598K788K096J153J13j123k065j947p87O19J579J760J052k14
55320A6539j175j267q84o65n04jN05K78n76j098o81K55Q21L47j187k844l202j861
55302B800j79K76k80l65M87J211R39P4p11j354A085e15o00M06IO58Q10R51M52
55283B880n16r71l09R14J641J458J012J089J349N70j441k843j784Q96K400J561
55267G906J80J42P79L55j027j740j234n79m54k74L70P56K60n35p01k66J20K66
$$ y = [36691, 33182, 29751, 27378, 26238, 25799, 25771, 25993, 25614, 23758, 21191, 20001, 21067, 22853, 23401, 22637, 21981, 22280, 22956, 22862, 21304, 18426, 15095, 12336, 10580, 9571, 9042, 9088, 9702, 10451, 10892, 10972, 10822, 10645, 10968, 12363, 14528, 16243, 16690, 16213, 15317, 13636, 10670, 7015, 3990, 2319, 1909, 2556, 4018, 5583, 6582, 7359, 8917, 11515, 14303, 16399, 17552, 17665, 16542, 14477, 12530, 11743, 12362, 13941, 15701, 16753, 16539, 15364, 14097, 13213, 12548, 12044, 12043, 12548, 12826, 12250, 11152, 10471, 10726, 11547, 11894, 10707, 7863, 4661, 2800, 2621, 2897, 2617, 2252, 2739, 3950, 4889, 4963, 4252, 2898, 1085, -515, -1115, -709, 9, 667, 1477, 2428, 2880, 2364, 1393, 1084, 1998, 3639, 5097, 6109, 7198, 8547, 9117, 7676, 4833, 3049, 3945, 6345, 7906, 8086, 8228, 9007, 9362, 8335, 6595, 5361, 4782, 4328, 4054, 4424, 5180, 5440, 4905, 4204, 3938, 4058, 4324]
55249D324M29M66q5j085j557p50Q70J969J659L37q23j071o52j99R6N18J172J701
55231G319J741J305M87q33k585C552G0a195f4A783Q57p1L08J224J210K20n53o29
55213D349p70j459I5a755j379j095l65J521E88M182K622N97k44J7L13J78k10r89
55195G054k474D77c994k941o40N87J00j230k301k669k190p05J274K397J838N36
55179i938P4O09R73P55Q51J563J737P35k3J029A305L228J288r12j620j208q51
55162A230D63a50m41k38b94A498K052K37A645f08b12B883L339J791P96R85R23
55145A0717k34j532j967j891j744q26J262K903K063o01k194j429j76m32j492I34
55128F19P62J310J765J736M05j490j930l81J412J940J708J760J918J466N23l50
$$ y = [4324, 4753, 5219, 5134, 4049, 2492, 1742, 2612, 4581, 6240, 6577, 5754, 4683, 4031, 3832, 3928, 4446, 5618, 7319, 9060, 10365, 10852, 10019, 7434, 3552, 70, -1195, -64, 1783, 2640, 2569, 2877, 4101, 5311, 5531, 4978, 4349, 3579, 2120, 95, -1755, -3134, -4229, -4594, -3073, 588, 4770, 7392, 7989, 7745, 7762, 8075, 8253, 8043, 7054, 4580, 477, -3994, -6935, -7575, -6988, -6888, -8118, -10419, -13088, -15278, -15983, -14709, -12312, -10474, -9938, -9864, -9255, -8282, -7527, -6676, -5113, -3376, -2641, -2664, -1635, 1305, 4533, 5821, 4909, 3289, 2081, 1230, 463, -150, -591, -829, -294, 1498, 3550, 3787, 1645, -608, -212, 2883, 6222, 8013, 8809, 9794, 10717, 10483, 8951, 6984, 5093, 3349, 2523, 3785, 6688, 8751, 8150, 5956, 4527, 4351, 3919, 2427, 934, 619, 1381, 2691, 4456, 6192, 6597, 5107, 3177, 2796, 4208, 6148, 7856, 9616, 11534, 13000, 13523, 13173]
55112A3173j034j413r32L97J417J367J072J440J625L45j600k091q34J64l28j056
55096A1712n05O97Q04n60k127k719k242j309o08m85o27l33N04J127R58M03J32
55079D822Q7j24m19m67k02M58J728K970K592J29k239k058M5J220N83J83J378K635
55061A3321K298J343J488K124J450k76j054l12M69L35j08m47j281k541k900j758
55045A2151l41J45R3K75L89k2k71M69J663K170J883J476J176R59J398K919M552
55028C1084M738L219J119o44j822k092j249k47n74k230l386k586m07J444J905
55013B8272J048m40j770k409k342j792q46L31J191J348J117Q51J56j190k092j271
54997B0162O00J492P56k74p32j317k346k574j213M48R41Q16J284J743O86j471
$$ y = [13173, 12139, 10726, 9794, 10191, 11608, 12975, 14047, 15487, 17112, 17457, 15857, 13766, 12932, 13096, 12768, 11712, 11207, 11904, 12708, 12148, 10021, 7302, 5060, 3751, 3143, 2658, 2031, 1698, 2202, 3329, 4287, 4690, 4822, 4909, 4785, 4366, 3899, 3697, 4155, 5883, 8853, 11445, 11574, 9335, 7277, 7322, 8542, 9125, 9308, 10686, 13321, 15619, 16962, 18450, 20574, 22024, 21748, 20694, 20382, 20851, 21186, 21078, 20631, 19350, 16809, 13909, 12151, 11810, 11955, 12048, 12323, 12712, 12690, 12419, 12888, 14551, 16721, 18604, 20080, 21256, 22215, 23613, 26532, 31084, 35822, 39041, 40160, 39516, 37694, 35602, 34353, 34106, 33532, 31302, 27916, 25330, 24923, 26367, 28272, 29320, 28880, 27110, 24701, 22359, 20567, 19721, 20052, 21243, 22591, 23708, 24559, 24715, 23525, 21433, 20162, 20762, 22254, 23010, 22736, 22004, 20687, 18341, 15767, 14554, 15002, 15943, 16759, 18043, 19786, 20472, 19001]
54981A9001k476j213J088K730L159K479R30o89j246p01k72o77j100o29J88J39
54965B0711q63j725j647q12K63J310K108K357J974J297Q05Q19J434K380K920K290
54949C5621O35q24r73q7O12P09J144K671M295M200K020o41k109k250j855j281
54933D1887m27M85R62R53Q47Q26P70P83J123J535J296K38p19n08Q73K363K924
54916E6211K339J155J55j70Q7M56P25J254K320L240K711L47k485l910l458k251
54900E8726j430j027n60k8J57j82r00j843k763l068k226m30J342J991J042q62
54884D7939k130j471O15K218K371K199L023M164L959K297O28l47j188j809r10
54869F1558J853M689N872N932O454P538P890P118O539P544R926J2094J2591J1385
$$ y = [19001, 16525, 15312, 16400, 19130, 22289, 24768, 25698, 25009, 23763, 23062, 22790, 22113, 21013, 20384, 20572, 20711, 19848, 18123, 16476, 15664, 15927, 17237, 19345, 21702, 23676, 24973, 25778, 26597, 28031, 30411, 33331, 35621, 36256, 35432, 34459, 34372, 34984, 35693, 36837, 39508, 43803, 48003, 50023, 49382, 47273, 45023, 43168, 41887, 41460, 41945, 42907, 43860, 44707, 45533, 46303, 47086, 48209, 49744, 51040, 51278, 50559, 50051, 50924, 53287, 56211, 58550, 59705, 59860, 59690, 59777, 60233, 60958, 62212, 64532, 67772, 70483, 70830, 68345, 64435, 60977, 58726, 57296, 56269, 55709, 55681, 55838, 55656, 54756, 52913, 50150, 47082, 44856, 44426, 45768, 47759, 48801, 47939, 45809, 44338, 44953, 47171, 49542, 51741, 54764, 58928, 62887, 65184, 65812, 65465, 64277, 62468, 61558, 63411, 68100, 73972, 79904, 86358, 93896, 101786, 108904, 115443, 122987, 132913, 145007, 157598, 168983]
54855A68983R795Q952Q367O550L089p02l547n623p667r509j0548j0947j1314j1418
54841A34461j0296p701m707k738k395l189m112m429m120l508k687j755j259j516
54827H0049j534M1K720M319L916L141L611M651M978N211O833R440J1082J1003
54813A49461J0293R785Q963P168M663K210L93p75k195n041q871j1258j0733r118
54799A44945r214j0799j1188r358p071n776m937m031l766m266m113k586j153j367
54785F5320k625l329l029k219j150q3L02p3j12Q64J910J893J143N13r2r67j316
54768E6950l64R73J062j04j077j116q24q22j081j499j943j851r06L2j03q05n64
54751D5958P25J318R6j772k358j364q2M89O53J106J670J360j98j857k013n45J026
$$ y = [168983, 178778, 187730, 196097, 202647, 205736, 205034, 201487, 195864, 188197, 178688, 168140, 157193, 145879, 134461, 124165, 116464, 111757, 109019, 106624, 103435, 99323, 94894, 90774, 87266, 84579, 82824, 81565, 80049, 78515, 78556, 81276, 85595, 89511, 92652, 96263, 100914, 105892, 111103, 117936, 127376, 138458, 149461, 159754, 169539, 178502, 185670, 190333, 192543, 192936, 192161, 189966, 184925, 176054, 164796, 154063, 144945, 135731, 124932, 113744, 104386, 97315, 91539, 86602, 82571, 78805, 74539, 70426, 67840, 66687, 65320, 62695, 59366, 56337, 54118, 52968, 52885, 53187, 53114, 53002, 53866, 55776, 57669, 58812, 59325, 59233, 58266, 56950, 56586, 57559, 58621, 58517, 57440, 56324, 55500, 54678, 53597, 52098, 50155, 48304, 47398, 47430, 47327, 46522, 45958, 46683, 48001, 48097, 46325, 43967, 42603, 42521, 43010, 43663, 44769, 46439, 47799, 47601, 45744, 43731, 43186, 44212]
54734D4212J523J389J548J929K036K081K379K259R22q88j498o00N02J015J616
54719F0425K868L977L979L195K718L138M374O118P684Q054P006N858O250Q242
54705A33886J0282J1036J0640J0082R928R957R604Q426O224L167n9k478l553l697
54691B13445l790m166m401m221m008m027l660k152M6J474J348N18M41J615L241
54676A91703M208M174L755L635L557K552M75j289j370l71j46j159j717l56K238
54661B09889M406N688O570O776N364K531j35j629k684m386o536q246r408j0488
54647A97712j1306j1022r410p407o202o380p790r500j0017q484n925m310m189
54634I5770m260l734l614m662n392l804n04J734J455n4r25p81k18L99R37J321
$$ y = [44212, 45735, 47124, 48672, 50601, 52637, 54718, 57097, 59356, 60278, 59390, 57892, 57292, 57794, 58809, 60425, 63293, 67270, 71249, 74444, 77162, 80300, 84674, 90792, 98476, 106530, 113536, 119394, 125644, 133886, 144168, 155204, 165844, 175926, 185854, 195811, 205415, 213841, 220065, 223232, 223173, 220695, 217142, 213445, 209655, 205489, 201088, 196867, 192859, 188832, 185172, 183020, 183066, 184540, 185888, 186406, 186847, 188462, 191703, 195911, 200085, 203840, 207475, 211032, 213584, 214059, 212770, 211400, 211029, 210883, 209724, 208007, 207651, 209889, 214295, 219983, 226553, 233329, 238693, 241224, 241089, 239460, 236776, 232390, 225854, 217608, 208200, 197712, 186406, 175384, 165974, 158567, 152365, 145985, 138195, 128695, 118678, 110194, 104269, 99959, 95770, 91510, 87776, 84162, 79500, 74108, 70304, 69800, 71534, 72989, 72935, 72010, 71229, 71011, 71410, 72347, 73668]
54618G3668J886K959L743K868N61j090q19K19O18J047K754M799M851K461l67j878
54602I8280k219k054j334j28N63n8j333j849j026O31K358L595L824K776J002j88
54586A02840K19J799K860K140L26n23Q09L444N709O988P819Q677R547J0448J1533
54571A74635J2616J3258J3368J3208J2891J2379J1809J1236J0164Q037N071J885
54559C00557j533n549r580j2155j2664j2160j1872j1698j0784r081p530o932p208
54546A81811p719p943p739p156o079m259j977m13p25k602m321m656m191m243m834
54531A12954m612k920j143j204k973m189l303j525j001j671j468L43J898J547
54517I0733L80N05J946K919K484J246k02j751k853k922k754l647m821l748M8L431
$$ y = [73668, 75554, 78513, 82256, 85124, 85685, 84595, 83776, 83995, 84613, 85660, 88414, 93213, 98064, 100525, 100158, 98280, 96061, 94007, 92673, 92545, 93108, 93050, 91717, 89868, 88842, 89473, 91831, 95426, 99250, 102026, 103028, 102840, 103059, 104858, 107718, 109858, 110184, 109661, 110470, 113914, 119623, 126611, 134430, 143107, 152654, 163102, 174635, 187251, 200509, 213877, 227085, 239976, 252355, 264164, 275400, 285564, 293601, 298672, 300557, 299024, 293475, 283895, 271740, 259076, 246916, 235044, 223346, 212562, 203481, 195951, 189019, 181811, 174092, 166149, 158410, 151254, 145175, 140916, 138939, 138526, 137801, 135199, 130878, 126222, 122031, 117788, 112954, 108342, 105422, 104279, 103075, 100102, 95913, 92610, 91085, 90084, 88413, 86945, 87288, 89186, 90733, 91113, 91618, 93564, 96483, 98967, 100213, 100011, 98260, 95407, 92485, 89731, 86084, 81263, 77515, 77563, 80994]
54501H0994L306N04j575j281M4O07L04J04N41J205J196o1k030l136k202J86K109
54484H0815K202R04j10M90K629N093O669O798N338K426q88k624j656P37K245K322
54468A13390K377L216L979M034M249N369O514O484N617N170N689O870Q099Q221
54454A89278N949J917q64k97J716J408k026n605o473m895l064k575l671n701p602
54439A57495q546q466p608n924l661j993j773k029j091Q76K065J588L32q00j715
54424A18750k039j215j44o03k257k416N3K665K888J785J950L310L600K159O33
54409A29119K3m99j562k433k471k096j665q36L64J180J438J972L057L698L227
54394A32516K498K526K771J933k17k763m825n848n115k255J715M703N231L444
$$ y = [80994, 84300, 84804, 83229, 81948, 81992, 82599, 82903, 83007, 83548, 84753, 85949, 85888, 83858, 80722, 78520, 78706, 80815, 83017, 83921, 83811, 84301, 86930, 92023, 98692, 105490, 110828, 113254, 112366, 109742, 108086, 108823, 111068, 113390, 115767, 118983, 122962, 126996, 131245, 136614, 143128, 149612, 155229, 160399, 166088, 172958, 181057, 189278, 195227, 197144, 196280, 195983, 197699, 199107, 197081, 191476, 185003, 180108, 177044, 174469, 170798, 165097, 157495, 148949, 140483, 132875, 126951, 123290, 121297, 119524, 117495, 116404, 117280, 119345, 120933, 121265, 120465, 118750, 116711, 115496, 115352, 114749, 112492, 110076, 110129, 112794, 115682, 117467, 119417, 122727, 126327, 128486, 129119, 129142, 128643, 127081, 124648, 122177, 120081, 118416, 117580, 117944, 119124, 120562, 122534, 125591, 129289, 132516, 135014, 137540, 140311, 142244, 142027, 139264, 134439, 128591, 123476, 121221, 122936, 127639, 132870, 136314]
54380A36314O05j835k765j869R8J722J963P79j103k792l684l671l021k046r48
54365A17747N0P45J281K050K935L017J590p05k282k205r45L75J068J153J045J187
54349A28106J793K661L357L602L376K763J927J303J329J857K036J171m08j557
54335A53316j494o87l05q19j427j147k04K97m7l58J88J207J767J627J036o8j683
54318A51199k919k693j331l30l64n84k66p9q20j814j699m71L76q6r57p33O38J564
54300A38631P90r34j690q58O5m20j680j986j139o10j065j332m08R68J568J354
54284A31254P95l21k079l365l037j705q90q97r22q50j273j917j828j233j373k257
54268A08102k412j530j393l056m830m654l079k035j626l03K080L553K742O00j182
$$ y = [136314, 136919, 135084, 132319, 130450, 130548, 132270, 134233, 135012, 133909, 131117, 127433, 123762, 120741, 118695, 117747, 117797, 118542, 119823, 121873, 124808, 127825, 129415, 128710, 126428, 124223, 123278, 123653, 124721, 125874, 126919, 128106, 129899, 132560, 135917, 139519, 142895, 145658, 147585, 148888, 150217, 152074, 154110, 155281, 154873, 153316, 151822, 151135, 150830, 150011, 148584, 147437, 147233, 147530, 147483, 147125, 147313, 148520, 150287, 151914, 152950, 152882, 151199, 148280, 145587, 144256, 143926, 143562, 142978, 142712, 142633, 141813, 139999, 138300, 137829, 138205, 138119, 137162, 136429, 137067, 138631, 139421, 138487, 136797, 135939, 136004, 135584, 133904, 131918, 130779, 130169, 129104, 127772, 127364, 128332, 129900, 131254, 132049, 131728, 129649, 126284, 123247, 121542, 120652, 119755, 118833, 117983, 116710, 114793, 112965, 111732, 110359, 108102, 105690, 104160, 102767, 99711, 94881, 90227, 87148, 85113, 83487, 83184, 85264, 88817, 91559, 92159, 90977]
54253I0977k075k299j684j38J392J576K74j333k092j848j107l48K28P41J577K852
54237H6693L855L487J624l49q42K70J583J662K86j632k852k638j353k26j28o21
54221H8819p15k93k2m3M8j68j733m091m679k115J450K900K097J318J379P91j090
54204H3853k587k280j077m31j44N56J086M44o84n62R99K266J965P96J45K32J24
54187H4701p59j743j663m01O77K86r96j341j60J084J026K07j47k04r80k304k819
54170G4464k034r60m88l07O8K04m69j402j396j90J145J536J116Q15J012J233J120
54153G5467J033J211J034n8j227j084J26M91r28k638k753j424j74L57P75J460
54137G1668K055K150J558O9k028l518l418k353j753j804j470m00N95J138J887
$$ y = [90977, 88902, 86603, 84919, 84781, 86173, 87749, 88023, 86690, 84598, 82750, 81643, 81295, 81523, 82264, 83841, 86693, 90548, 94035, 95659, 95310, 94468, 94738, 96321, 97983, 98269, 96637, 93785, 91147, 89794, 89568, 89440, 88819, 88104, 87811, 87789, 87746, 87794, 87626, 85893, 81802, 77123, 75008, 76458, 79358, 81455, 82773, 84152, 84943, 83853, 81266, 78986, 77909, 77478, 77334, 77890, 78976, 79420, 78736, 78174, 79173, 81439, 83404, 84200, 84345, 84577, 84701, 83942, 82199, 80536, 80135, 80812, 81098, 80102, 78761, 78601, 79685, 80711, 80918, 80771, 80567, 79587, 77283, 74464, 72430, 71470, 70982, 70675, 70743, 70947, 70478, 69076, 67680, 67490, 68635, 70171, 71287, 72102, 73114, 74347, 75467, 76500, 77711, 78745, 78687, 77460, 76376, 76502, 76993, 76065, 73427, 70674, 69250, 69076, 69433, 70208, 71668, 73723, 75873, 77431, 77500, 75472, 71954, 68536, 66183, 64430, 62626, 61156, 60756, 61351, 62489, 64376]
54122F4376L010L448K496R83k7p78j950k915k246J22K326K494O81j407k253j903
54106F6457j563j993k501j805J93J993K093O17j002j621j274o52j94J88O32R39
54090F0507P48J20m42o48q08j200j426r96l38l68j026j034M05K329L055K017R5
54073F0990j552k336k137j156pO15O82Q54J371J354j27k433l606k619p03J89k99
54056D9080j036j381j743k100j432N93K555K975K279J927K236K286J644Q31J42
54041E8856o95j555j735j003%O11O84K73l11j95J157K657K511P11p35n22L52N19
54023F1580L57R17J817J734N76l68l06J88L62L30O10J235J629J104m22j967k041
54006F7335k30K070L071K583J897J835J772Q16p20j642j363o01m58j020j217j82
$$ y = [64376, 67386, 70834, 73330, 74313, 74286, 73508, 71558, 68643, 66397, 66519, 68845, 71339, 72020, 70613, 68360, 66457, 64894, 62901, 60400, 58595, 58788, 60781, 62874, 63491, 62489, 60868, 59594, 58942, 58748, 58936, 59568, 60507, 61255, 61375, 60933, 60285, 59477, 58277, 56851, 55855, 55517, 55149, 54123, 53089, 53494, 55823, 58878, 60895, 60990, 59438, 57102, 54965, 53809, 53802, 54417, 55099, 55953, 57324, 58678, 58551, 56118, 52512, 49893, 49190, 49379, 49080, 48044, 46663, 44920, 42820, 41388, 41981, 44536, 47511, 49790, 51717, 53953, 56239, 57883, 58714, 58856, 58161, 56606, 54871, 53868, 53868, 54479, 55163, 55436, 55125, 54930, 56087, 58744, 61255, 61966, 61231, 60709, 61061, 61580, 61937, 62854, 64671, 66405, 66981, 66613, 66307, 66495, 66857, 67187, 67797, 69032, 70661, 71765, 71343, 69376, 67335, 67105, 69175, 72246, 74829, 76726, 78561, 80333, 81149, 80429, 78787, 77424, 76823, 76365, 75345, 74128, 73946]
53990G3946J485K321J782Q48O22R83J044N45J42N50J824L353M239L830K237K52
53974A00003j376k354k489j557J55J739K502K504J871L63j742l156k916j777j133
53959I0637r99k73J151J918J148m31j672k315k624k646k483k523k767k596j786
53944G1739j052r11p87j32K48o93k166k062J37K317K156k59k913m202l905k362
53928E5153N3K475L645L101J923J613K360K885K014M5j638j981j108Q5P82P24
53912G2131J89k54j22O12J496K046K214K311K552K910L264L414K895J333p56j978
53896I4257j497k08K99j38kJ684L809M535L663K667K651L285L849M422N351O234
53880A34861O176N104M195M637O227P581P762P244O918O592N291K932P02n85j474
$$ y = [73946, 75431, 77752, 79534, 80382, 81004, 81987, 83031, 83576, 83718, 84268, 86092, 89445, 93684, 97514, 99751, 100003, 98627, 96273, 93784, 92227, 92382, 94121, 96623, 99127, 100998, 101361, 99619, 96463, 93547, 91770, 90637, 89638, 89365, 90516, 92434, 93582, 93151, 91479, 89164, 86540, 83894, 81411, 78888, 76121, 73525, 71739, 70687, 69776, 68989, 68857, 69105, 68412, 66246, 64184, 64321, 66638, 68794, 68535, 65622, 61420, 57515, 55153, 55206, 57681, 61326, 64427, 66350, 67963, 70323, 73208, 75222, 75267, 73629, 71648, 70540, 70625, 71407, 72131, 72320, 72066, 71944, 72556, 74052, 76098, 78312, 80623, 83175, 86085, 89349, 92763, 95658, 96991, 96235, 94257, 92760, 92552, 92851, 92713, 92711, 94395, 98204, 102739, 106402, 109069, 111720, 115005, 118854, 123276, 128627, 134861, 141037, 146141, 150336, 154973, 161200, 168781, 176543, 183787, 190705, 197297, 202588, 205520, 206222, 205637, 204163]
53865B04163k556l201k698j931k411l938m761m144l254l060k869j763l53m4j271
53850A65909l283n034n623m602k692j549j961k870l025k866l538m633m426k328
53836A17479K22J524J204k00j978l217l075j863j057j501k165j573j7O60m65j953
53820A02025j621Q35L328L605J583q32j927j640r34m86m22p50j295j448p39M02
53804I9684J028Q18K47l64j241k371l043k723j941j677k077k295j669n64J83L03
53788H2298K42L84N63N27M59O06O61J22p75j089l97O30J205J360J435J250M76
53771H9957n34j053r12m85N2O90J088Q72M09M79J078J389R98M01J58L10Q97K094
53753I7888L407L545J886m94j896j779r22j37N33J423K546L482L769L509L401
$$ y = [204163, 201607, 198406, 195708, 193777, 191366, 187428, 182667, 178523, 175269, 172209, 169340, 167577, 167224, 167180, 165909, 162626, 157592, 151969, 147367, 144675, 143126, 141165, 138295, 135270, 132404, 128866, 124233, 119807, 117479, 117701, 119225, 120429, 120229, 118251, 115034, 111959, 110096, 109039, 107538, 105373, 103800, 103783, 104443, 103978, 102025, 100404, 101239, 104567, 108172, 109755, 108923, 106996, 105356, 104422, 103936, 103514, 102764, 101469, 100021, 99282, 99684, 100712, 101530, 101777, 101413, 100172, 97801, 94758, 92035, 90094, 88417, 86340, 84045, 82376, 81812, 81995, 82298, 82540, 82924, 83487, 84014, 84473, 85079, 85740, 85862, 85087, 83998, 83601, 84231, 85436, 86796, 88231, 89481, 89957, 89423, 88370, 87458, 86973, 87025, 87715, 88803, 89675, 90084, 90563, 91641, 93030, 94028, 94429, 94587, 94897, 95794, 97888, 101295, 104840, 106726, 106232, 104336, 102557, 101635, 101498, 102031, 103454, 106000, 109482, 113251, 116760, 120161]
53738A20161L861M186L303J480L32O15R58k19k320l318k579j482j097p62L04J240
53722A24663O64r89j627j32K207L397L022K126J356K95j229k206j643k13L22o69
53706A29344j893j906q63J17O29J078J406Q94n08j593j215K74J440J400N31j98
53690A28937k30J77K80l58j247j378m88M93N89J45L63J639K969L214K445J759
53674A39309K013L020L862L868L335L060L121K555P90r92r68R53K900L440L123
53659A73389L108L385L279K829K544K373K090K184L167M256M117K823J804J814
53645B13162K181K307K618L577M891O052O721O384M820L222L360N074O074M977
53631B75420L048J882J122k5n89O98K740L156J628J11j65J75M99J087J824J840
$$ y = [120161, 124022, 128208, 131511, 132991, 133323, 133938, 134896, 134677, 132357, 129039, 126460, 124978, 123881, 123119, 123423, 124663, 125327, 124338, 122711, 122579, 124786, 128183, 131205, 133331, 134687, 134982, 133753, 131547, 129904, 129691, 130013, 129344, 127451, 125545, 124682, 124799, 125428, 126506, 127912, 128806, 128298, 126705, 125490, 125764, 127204, 128604, 129135, 128937, 128707, 128884, 129164, 128806, 127559, 126181, 125693, 126186, 126775, 126920, 127283, 128922, 131891, 135105, 137550, 139309, 141322, 144342, 148204, 152072, 155407, 158467, 161588, 164143, 164933, 163941, 162973, 163926, 166826, 170266, 173389, 176497, 179882, 183161, 185990, 188534, 190907, 192997, 195181, 198348, 202604, 206721, 209544, 211348, 213162, 215343, 217650, 220268, 223845, 228736, 234788, 241509, 247893, 252713, 255935, 259295, 264369, 270443, 275420, 278468, 280350, 281472, 281447, 280858, 281556, 284296, 287452, 289080, 289191, 289026, 289201, 289700, 290787, 292611, 294451]
53615B94451R65O6n87j600k730k656j276m24j166k020j257M85J489J591J757J852
53599B88940Q54j031k292k134j221l35L44O76N09L11O30R27K59q45o87J009K420
53582B88334K226J432J564K316K353J634J367K003K719K825K567K395K415K735
53568C18885L421L949L618K807K845M208N611N620M522L840M400N696O827P258
53554C83507O818N761M902M949N550N673N052M529M634M684L951L017L072M093
53540D50192M710L955K415J337J230J758K419K759K168L01k132l557l042j452
53526D63061o50j500l000l571k826j721j149r73n47K36P77N09m93j529j789r35
53510D43900N73J725J737P23l77o16J03Q59N92o28j405m22J927L747L641K141
$$ y = [294451, 295416, 295482, 294895, 293295, 290565, 287909, 286633, 286209, 285043, 283023, 281766, 282251, 283740, 285331, 287088, 288940, 289794, 288763, 286471, 284337, 283116, 282781, 283125, 283801, 284310, 284621, 285251, 286178, 286437, 285592, 284905, 285914, 288334, 290560, 291992, 293556, 295872, 298225, 299859, 301226, 303229, 305948, 308773, 311340, 313735, 316150, 318885, 322306, 326255, 329873, 332680, 335525, 339733, 345344, 350964, 355486, 359326, 363726, 369422, 376249, 383507, 390325, 396086, 400988, 405937, 411487, 417160, 422212, 426741, 431375, 436059, 440010, 443027, 446099, 450192, 454902, 458857, 461272, 462609, 463839, 465597, 468016, 470775, 472943, 473244, 471112, 467555, 464513, 463061, 462411, 460911, 457911, 454340, 451514, 449793, 448644, 447671, 447124, 447360, 448137, 448646, 448153, 446624, 444835, 443900, 444473, 446198, 447935, 448658, 448281, 447665, 447768, 448627, 449219, 448591, 447186, 446764, 448691, 452438, 456079, 458220]
53494D58220R95J386L100N112O476O778O162N206M629M936O089P477Q374Q670
53480E33610R024J0065J1594J2931J3874J4757J5667J6305J6685J7250J8091J8744
53468G08597J9108J9825K1354K3228K4720K5724K6471K7022K7534K8524L0248
53457I82355L2211L3847L5212L6483L7459L8166L9215M0693M1442M0523L8896
53446A396502L8322L8935L9284L8762L8505L9473M0853M1037L9521L7277L5729
53435A824200L5663L6723L7693L7502L6093L4123L2175L0705L0211L0593L0678
53424B196359K9447K7617K6802K7068K6522K3846K0059J7074J5291J3464J0528
53413B434077O764L180J76k863o511j0039j1924j1917j1782j3154j5464j7180
$$ y = [458220, 459215, 460601, 463701, 468813, 475289, 482067, 488229, 493435, 498064, 503000, 509089, 516566, 524940, 533610, 542634, 552699, 564293, 577224, 591098, 605855, 621522, 637827, 654512, 671762, 689853, 708597, 727705, 747530, 768884, 792112, 816832, 842556, 869027, 896049, 923583, 952107, 982355, 1014566, 1048413, 1083625, 1120108, 1157567, 1195733, 1234948, 1275641, 1317083, 1357606, 1396502, 1434824, 1473759, 1513043, 1551805, 1590310, 1629783, 1670636, 1711673, 1751194, 1788471, 1824200, 1859863, 1896586, 1934279, 1971781, 2007874, 2041997, 2074172, 2104877, 2135088, 2165681, 2196359, 2225806, 2253423, 2280225, 2307293, 2333815, 2357661, 2377720, 2394794, 2410085, 2423549, 2434077, 2440841, 2444021, 2444197, 2441334, 2434823, 2424784, 2412860, 2400943, 2389161, 2376007, 2360543, 2343363]
53401B343363j8314k0096k2538k4382k5508k7332l0071l1644l0507k8058k6816
53390B058097k7300k8129k8388k8339k8166k7362k5431k2415j8760j5168j2379
53379A796260j0626r483q526p614o402m252j054K552N980R053J1346J2284J2439
53366A801957J3512J6348J9847K2621K4705K6875K9313L1848L4510L6922L8227
53355B096685L8628L9822M2739M6032M8290N0382N3774N7653O0037O1160O3347
53344B658549O7558P2313P6165P9257Q2024Q4277Q6111Q8029Q9674R0017Q9253
53333C563227Q8793Q8860Q7944Q5448Q2991Q1811Q0654P7695P3185O8487O3650
53322D442745N7904N1776M6727M2798L8433L2696K6261K0020J4061Q259K545l865
$$ y = [2343363, 2325049, 2304953, 2282415, 2258033, 2232525, 2205193, 2175122, 2143478, 2112971, 2084913, 2058097, 2030797, 2002668, 1974280, 1945941, 1917775, 1890413, 1864982, 1842567, 1823807, 1808639, 1796260, 1785634, 1776151, 1767625, 1760011, 1753609, 1749357, 1748303, 1750855, 1756835, 1765888, 1777234, 1789518, 1801957, 1815469, 1831817, 1851664, 1874285, 1898990, 1925865, 1955178, 1987026, 2021536, 2058458, 2096685, 2135313, 2175135, 2217874, 2263906, 2312196, 2362578, 2416352, 2474005, 2534042, 2595202, 2658549, 2726107, 2798420, 2874585, 2953842, 3035866, 3120143, 3206254, 3294283, 3383957, 3473974, 3563227, 3652020, 3740880, 3828824, 3914272, 3997263, 4079074, 4159728, 4237423, 4310608, 4379095, 4442745, 4500649, 4552425, 4599152, 4641950, 4680383, 4713079, 4739340, 4759360, 4773421, 4781680, 4784225, 4780360]
53310D780360j2312k2965l4103m3787n1679n8513o4606o9768p4185p8284q1754
53299D188404q3775q4285q4141q3807q2696q0458p8043p6655p6160p5451p4238
53288C308695p3406p3604p4297p4497p3618p1423o8023o4306o1501n9633n7143
53277B557244n2783m7340m2627l9386l7059l5195l3940l3153l2217l0953k9851
53266B142740k9032k7802k5777k3777k2926k3015k2490k0258j7098j4852j4228
53255A901485j3828j1745p745l317L21L285N922P779Q488Q990J0773J4048J7567
53242A942023K0223K2167K4229K6801K9401L1178L1882L2473L4225L6934L8663
53231B270199L7836L5108L2468L0986L0206K9232K7528K4941K1866J9149J7067
$$ y = [4780360, 4768048, 4745083, 4710980, 4667193, 4615514, 4557001, 4492395, 4422627, 4348442, 4270158, 4188404, 4104629, 4020344, 3936203, 3852396, 3769700, 3689242, 3611199, 3534544, 3458384, 3382933, 3308695, 3235289, 3161685, 3087388, 3012891, 2939273, 2867850, 2799827, 2735521, 2674020, 2614387, 2557244, 2504461, 2457121, 2414494, 2375108, 2338049, 2302854, 2268914, 2235761, 2203544, 2172591, 2142740, 2113708, 2085906, 2060129, 2036352, 2013426, 1990411, 1967921, 1947663, 1930565, 1915713, 1901485, 1887657, 1875912, 1868167, 1864850, 1865171, 1868456, 1874378, 1882157, 1890645, 1899635, 1910408, 1924456, 1942023, 1962246, 1984413, 2008642, 2035443, 2064844, 2096022, 2127904, 2160377, 2194602, 2231536, 2270199, 2308035, 2343143, 2375611, 2406597, 2436803, 2466035, 2493563, 2518504, 2540370, 2559519, 2576586]
53220B576586J4693J1151O989L290j30m252q883j2648j5048j7153j9986k3501
53208B511108k7391l1552l5330l7716l8863m0219m2444m4413m5054m5110m5987
53197B077029m7763m9280m9700m9063m7749m6100m4295m2201l9791l7965l8010
53186A585112l9773m1351m1336m0379l9694l9070l7633l5685l4244l3171l1279
53175A171497k8239k5026k2451k0525j9326j9262k0081k0750k0781k0770k1197
53164I33089k1645k1791k2105k2884k3330k2721k1806k1905k2779k2720k0991
53153F88412j9031j8564j9293j9422j8057j6144j4964j4555j4098j3298j2759
53142E08227j3080j4016j4722j4687j4209j3873j3588j2517j0212p546o032o141
$$ y = [2576586, 2591279, 2602430, 2609419, 2612709, 2612579, 2608327, 2599444, 2586796, 2571748, 2554595, 2534609, 2511108, 2483717, 2452165, 2416835, 2379119, 2340256, 2300037, 2257593, 2213180, 2168126, 2123016, 2077029, 2029266, 1979986, 1930286, 1881223, 1833474, 1787374, 1743079, 1700878, 1661087, 1623122, 1585112, 1545339, 1503988, 1462652, 1422273, 1382579, 1343509, 1305876, 1270191, 1235947, 1202776, 1171497, 1143258, 1118232, 1095781, 1075256, 1055930, 1036668, 1016587, 995837, 975056, 954286, 933089, 911444, 889653, 867548, 844664, 821334, 798613, 776807, 754902, 732123, 709403, 688412, 669381, 650817, 631524, 612102, 594045, 577901, 562937, 548382, 534284, 520986, 508227, 495147, 481131, 466409, 451722, 437513, 423640, 410052, 397535, 387323, 379777, 373745, 367604]
53130C67604o874p053o450n519m670m203m319m648m349l223k153j825j615o49
53116C10054N21N35o79j615j226k43m9r62k088k398j636n32k71j389l051l737
53100B91234k789j020J49m9j134j816j215K6L01r19k317k595k200k212k327j570
53084B69547m54n68j903k490j195P30J559J130J82r60k050k472k197k351l666
53069B52842n103n054l440j589m60M5K65K04k73j155k133k540j846n86j45j187
53053B27845k746l378k792j836j322j344j472j170l57K20m00k184l983m772m462
53038A95847l491k366j693j787j979j304k3N58N6n61p97j356k316k334p92O84
53022A76346L44j183k043j820j416j072k68P55R78J17j098j906j876p01J199K279
$$ y = [367604, 360730, 353677, 347227, 341708, 337038, 332835, 328516, 323868, 319519, 316296, 314143, 312318, 310703, 310054, 310575, 311110, 310431, 308816, 307590, 307347, 307298, 306336, 304248, 301850, 300214, 299682, 299411, 298022, 294971, 291234, 288445, 287425, 287574, 287525, 286391, 284575, 283360, 283386, 283687, 282768, 280451, 277856, 275656, 273444, 271117, 269547, 269093, 268525, 266622, 264132, 262937, 263667, 265226, 266356, 266538, 265578, 263528, 261056, 258859, 256508, 252842, 247739, 242685, 239245, 237656, 237196, 237241, 237506, 237710, 237437, 236282, 234149, 231609, 229763, 229177, 229032, 227845, 225099, 221721, 218929, 217093, 215771, 214427, 212955, 211785, 211428, 211648, 211248, 209064, 205081, 200309, 195847, 192356, 189990, 188297, 186510, 184531, 183227, 183204, 183762, 183818, 183257, 182460, 181104, 178788, 176454, 175662, 176346, 176690, 175507, 173464, 171644, 170228, 169156, 168888, 169643, 170621, 170738, 169640, 167734, 165858, 165157, 166356, 168635]
53006A68635J429m05j384j178q79q54l38Q06J482R74jk86M34J562K114J352m91
52989A72972k097k328j301K02J697K628K028j42k152k540k285l129m391l736r02
52974A54524J748K718L063L808M016K687Q28L9L27O66P20O60K28p31j478j305
52958A72518o35j52N18K020L723M235L244J802Q00K55QJ20L68J93m81j003r19
52941A86614o52p91j118q90QQ54J212J734L147M805N204M002K559K066K167K169
52925B13090K421L280L597J991o92j918o00J804L494M100L885K850J453Q64J457
52910B41076K018J423J86n51o93q52j005p70n16r36j628j254O18K613K914J185
52894B43828j176k557k634k298k195j929r54K55O84R2r30j935k716k620j116R43
$$ y = [168635, 170064, 169659, 168275, 167097, 166218, 165364, 165026, 165832, 167314, 168288, 168287, 168001, 168435, 169997, 172111, 173463, 172972, 170875, 168547, 167246, 167448, 169145, 171773, 173801, 173659, 171507, 168967, 166682, 163553, 159162, 155426, 154524, 156272, 158990, 162053, 165861, 169877, 172564, 173392, 173431, 173758, 174424, 175144, 175804, 176032, 175301, 173823, 172518, 171883, 171731, 172249, 174269, 177992, 182227, 185471, 187273, 188073, 188328, 188336, 188456, 188824, 189017, 188536, 187533, 186614, 185962, 185171, 184053, 183163, 183171, 184025, 185237, 186971, 190118, 194923, 200127, 204129, 206688, 208754, 210921, 213090, 215511, 218791, 222388, 224379, 223687, 221769, 221169, 222973, 226467, 230567, 234452, 237302, 238755, 239619, 241076, 243094, 244517, 244703, 244152, 243459, 242607, 241602, 240832, 240316, 239380, 237752, 236498, 237116, 239729, 242643, 243828, 242652, 240095, 237461, 235163, 232968, 231039, 230085, 230340, 231024, 231116, 230186, 228251, 225535, 222915, 221799, 222742]
52878B22742J902J506J155J598J786P65o11r73l40L09M38M1p95j403o54J300K406
52861B31172J122j360k788k801k570k316j294L2O0j325k231j483j90J63k59n40
52845B13392n90o70l83N57J293P72o66j763k081k201k314j817n63M48K13j001
52829B02626j968j790n76Q44J608J403O72J52Rj71m15M6J541K743J816r78l024
52812B04538k300J82J777J367k3j273k246k786k182m80Q70O31n91j335j383j806
52796A92960l142m550m970m365l472k799k239j576j004j003j589j947j217L27
52782A59414J369J003k97j314j240l2J753L055K874J363ON0J104J894J976J985
52766A74963K289K387J795Q43K88M83J172J789J842J191P3j114j955k042j334
$$ y = [222742, 224644, 226150, 227305, 228903, 230689, 231454, 230843, 229870, 229530, 229839, 230277, 230318, 229523, 228120, 227466, 228766, 231172, 232294, 230934, 228146, 225345, 222775, 220459, 219165, 219197, 219257, 217932, 215701, 214218, 214028, 214191, 213932, 213392, 212802, 212132, 211749, 212306, 213599, 214371, 213705, 211942, 209861, 207660, 205346, 203529, 202966, 203414, 203627, 202626, 200658, 198868, 198292, 199136, 200744, 202147, 202819, 202971, 202980, 202809, 202394, 202440, 203981, 206724, 208540, 207562, 204538, 202238, 202420, 204197, 205564, 205541, 204268, 202022, 199236, 197054, 196574, 197444, 198075, 197484, 196149, 194766, 192960, 189818, 185268, 180298, 175933, 172461, 169662, 167423, 165847, 164843, 163840, 162251, 160304, 159087, 159414, 160783, 161786, 161489, 160175, 158935, 158903, 160656, 163711, 166585, 167948, 167954, 168004, 169108, 171002, 172978, 174963, 177252, 179639, 181434, 182277, 182565, 183048, 184220, 186009, 187851, 189042, 189115, 188001, 186046, 184004, 182670]
52751A82670o11r81k490l688l274j778q42j077j554j403j025j345k450l415l240
52736A53497j795m6P43L69j3N97J450Q49j387l338l299j847q34r50j248q38r0
52719A41820N7p13j780k086q34J720M015M181J888j021k241j233N32J350Q85k4
52703A46516m82k09N11J062Q92J00m85j36P89J100J63j180j377O6J815K034N95
52686A51774o09K0J534J525o15k679k435l63J352J709J437J095J81j636l494m116
52670A44680l002o68J706K925K750K215K373K864K642J824J558K110K448K034
52656A68459J580J540J343Q74J204K753M031L676K689L069M767N718M725K922
52642B09350K119K774L853M092L154J863J207J020K18j380k450k115j478j984
$$ y = [182670, 182059, 181078, 178588, 174900, 171626, 169848, 169006, 167929, 166375, 164972, 163947, 162602, 160152, 156737, 153497, 151702, 151656, 152399, 152768, 152755, 153352, 154802, 155651, 154264, 150926, 147627, 145780, 144946, 143996, 142748, 141910, 141820, 141877, 141164, 139384, 137298, 136464, 138184, 142199, 146380, 148268, 147247, 145006, 143773, 144305, 145655, 146540, 146516, 146034, 145825, 146336, 147398, 148290, 148390, 147905, 147769, 148558, 149658, 149821, 148641, 147264, 147330, 149145, 151179, 151774, 151165, 151185, 152719, 154244, 153629, 150950, 148515, 148152, 149504, 151213, 152650, 153745, 153926, 152290, 148796, 144680, 141678, 141010, 142716, 145641, 148391, 150606, 152979, 155843, 158485, 160309, 161867, 163977, 166425, 168459, 170039, 171579, 172922, 173796, 175000, 177753, 181784, 185460, 188149, 191218, 195985, 201703, 206428, 209350, 211469, 214243, 218096, 222188, 225342, 227205, 228412, 229432, 229650, 228270, 225820, 223705, 222227, 220243]
52628B20243l067k981j534l25k09j25J021K545K811J257r60j974p86J654L025
52613B20595J842r09k869k855j638m56J85K09m35j494k412k941l253l312k815
52598A97442j800p26J70R23J213M76j151k617k951k082o54L79K23r64j804j148
52582A84929K90P72j03r91r67o45o89o42j19P3o78j197J96L079N032M475K339
52565A95154O29J26J29j55n74n06J83Q79R19K76o02j327j781k020k227k557k623
52548A83923j591O47K690K919J520K93L26Q42P43K78M77J516K616L180L361L471
52532B07211L426K856J569j9r19l79J127K091J591K92m81l92k44o28j150j097
52516B14854m10L24N36N0j031k355l239l035j909q61n38l39N96J751J681K78o78
$$ y = [220243, 217176, 214195, 212661, 212336, 212127, 212002, 213023, 215568, 218379, 219636, 218676, 216702, 215916, 217570, 220595, 222437, 221528, 218659, 215804, 214166, 213710, 213895, 214104, 213669, 212175, 209763, 206822, 203569, 200257, 197442, 195642, 194916, 195086, 196009, 197222, 197698, 196547, 193930, 190979, 188897, 188243, 188622, 188845, 187881, 186077, 184929, 185219, 185991, 185888, 184897, 183930, 183285, 182596, 181954, 181835, 181908, 181230, 180033, 180229, 183308, 188340, 192815, 195154, 195783, 195909, 196038, 195883, 195309, 194803, 194986, 195865, 196784, 197060, 196458, 195131, 193350, 191330, 189103, 186546, 183923, 182332, 182979, 185669, 188588, 190108, 190401, 190727, 191569, 192312, 192590, 193067, 194583, 197199, 200379, 203740, 207211, 210637, 213493, 215062, 215043, 214124, 213745, 214872, 216963, 218554, 218846, 218365, 217973, 217729, 217101, 215951, 214854, 214444, 214768, 215304, 215354, 214323, 211968, 208729, 205694, 203785, 202924, 202386, 202047, 202643, 204394, 206075, 206353, 205675]
52499B05675J14J570J739M89n34k49P84J530J563R89K67J06O88R64k83k563l899
52482B08950l129j161K70L64m27j106j029n98r34k193k773j329R32J528J59j012
52466A96512p32l18j192k676l431l517l564l220j912l61K13k01p26j016j228j098
52450A71533l19N14N36j01m86k43K46M96J07j136k555k781j560n40j001j747p59
52433A60204J682L362L296K593K205J680N55o78j567k225k299q92J691L478L160
52418A76245J807J178J270Q48k46q45m07J53n2n15p3J427K838L012K013R24O92
52401A90269J268J875J857J205L72j78j98M05J599L012L717K720J94k137k534
52386B03446j210j9q8n90k51Q20J527J343O51pl36j73L15N51K47j21k2L03L68
$$ y = [205675, 205789, 207359, 209098, 209587, 209053, 208804, 209588, 211118, 212681, 213670, 213937, 214043, 214731, 215695, 215412, 212849, 208950, 205821, 204660, 204930, 205294, 204867, 203761, 202732, 202134, 201200, 199007, 196234, 194905, 195837, 197365, 197524, 196512, 195780, 195462, 194270, 191594, 188163, 184646, 181082, 177862, 175950, 175589, 175802, 175601, 174875, 173859, 172631, 171533, 171214, 171728, 172264, 172163, 171677, 171434, 171680, 172176, 172283, 171147, 168592, 165811, 164251, 163711, 162710, 160963, 160204, 161886, 165248, 168544, 171137, 173342, 175022, 175577, 174899, 173332, 171107, 168808, 167916, 169607, 173085, 176245, 178052, 179230, 180500, 181348, 181102, 180257, 179850, 180003, 179951, 179436, 179363, 180790, 183628, 186640, 188653, 189577, 190269, 191537, 193412, 195269, 196474, 196846, 196668, 196470, 196875, 198474, 201486, 205203, 207923, 208117, 205980, 203446, 202236, 202217, 202129, 201539, 201288, 202108, 203635, 204978, 205629, 205622, 205286, 205113, 205428, 205979, 206226, 206105, 206083, 206386, 206754]
52367B06754L27O08J059J284J443J888K262J916J024M56O00J074J436J425P80
52352B24336k98q79l68M50N08J56N13J348J314L69K65J943L893M056K348M48k61
52335B40141K26R92J170P93R40K575N191P247P852P234N812M060L165M191O183
52320B97772O772N357M044M525N696N701M763M272M252L792L272L993N813P064
52306C67088P059P026Q133R917J1231J1621J1280J0521R845R913J0915J2328J3495
52293E00372J4118J4268J4394J5307J7486K0373K2801K4135K4643K4959K5725
52282G18581K7463K9960L1963L2399L1780L1569L2241L2995L3357L3809L4422
52271A070539L4212L2568L0420K9141K8902K8878K8480K7547K5867K3403K0844
$$ y = [206754, 207081, 207689, 208748, 210032, 211475, 213363, 215625, 217541, 218565, 219021, 219621, 220695, 222131, 223556, 224336, 224038, 223159, 222791, 223241, 223749, 223905, 224418, 225766, 227080, 227449, 227714, 229657, 233550, 237606, 239954, 240402, 240141, 240367, 241359, 242529, 243322, 244262, 246837, 252028, 259275, 267127, 274361, 280173, 284233, 287398, 291589, 297772, 304544, 309901, 313945, 318470, 324166, 329867, 334630, 338902, 343154, 346946, 350218, 354211, 360024, 367088, 374147, 381173, 389306, 399223, 410454, 422075, 433355, 443876, 453721, 463634, 474549, 486877, 500372, 514490, 528758, 543152, 558459, 575945, 596318, 619119, 643254, 667897, 692856, 718581, 746044, 776004, 807967, 840366, 872146, 903715, 935956, 968951, 1002308, 1036117, 1070539, 1104751, 1137319, 1167739, 1196880, 1225782, 1254660, 1283140, 1310687, 1336554, 1359957, 1380801]
52260A380801J9005J7670J5737J2608Q831N252K138n01k242k567j896j641k811
52247A450384m843o314o703o719o865o657n798n082n081m663k286J552M786O717
52233A402428Q742J1687J4259J5261J5795J7622K0306K1835K1547K0713K0259
52222A590454J9712J8689J7922J7977J8065J7004J4746J2249J0228Q594O841M575
52210A757056J750j313m269p105r896j2350j4060j5142j6022j6689j6941j7327
52198A627692j8809k1139k2725k2712k2221k2583k3212k2512k0385j8424j7574
52187A395396j6936j5289j2745j0343q639p346o024m583l305k493j987j053Q23
52174A305476K963L959L367K432K679M219N876O766P123P689Q769R927J0344R553
$$ y = [1380801, 1399806, 1417476, 1433213, 1445821, 1454652, 1459904, 1462042, 1461541, 1459299, 1456732, 1454836, 1453195, 1450384, 1445541, 1439227, 1432524, 1425805, 1418940, 1412283, 1406485, 1401403, 1396322, 1391659, 1389373, 1390925, 1395711, 1402428, 1411170, 1422857, 1437116, 1452377, 1468172, 1485794, 1506100, 1527935, 1549482, 1570195, 1590454, 1610166, 1628855, 1646777, 1664754, 1682819, 1699823, 1714569, 1726818, 1737046, 1745640, 1752481, 1757056, 1758806, 1757493, 1753224, 1746119, 1736223, 1723873, 1709813, 1694671, 1678649, 1661960, 1645019, 1627692, 1608883, 1587744, 1565019, 1542307, 1520086, 1497503, 1474291, 1451779, 1431394, 1412970, 1395396, 1378460, 1363171, 1350426, 1340083, 1331444, 1324098, 1318074, 1313491, 1310186, 1307693, 1305706, 1304653, 1305476, 1308439, 1312398, 1315765, 1318197, 1320876, 1325095, 1330971, 1337737, 1344860, 1352549, 1361318, 1371245, 1381589, 1391142]
52160A391142Q090P194P549Q436Q665Q091P506P112O105M269K999L740N816O989
52146A483703O162M500L578L406K924J695K50q08j251r97j82O49J055J149R37
52131A506770l51l148o034o850n573m543n105n606m009j268j88j440k727k088
52117A457840k91P61N64r5p99j814k940l172j851L68K019K303J875K058L342N017
52101A465185O414P913R985J1710J1409R059P062P861J1091J4003J4634J4047
52089A590373J4999J8592K2847K5019K4892K4768K6113K7541K7018K4935K3433
52078A850530K3284K3205K2296K1292K0893K0481J9396J8230J7826J7908J7665
52067B073006J6827J5270J2502Q589M866K524J074o77k691m071m913o228q050
$$ y = [1391142, 1399232, 1406426, 1413975, 1422411, 1431076, 1439167, 1446673, 1453785, 1459890, 1464159, 1467158, 1470898, 1476714, 1483703, 1489865, 1494365, 1497943, 1501349, 1504273, 1505968, 1506218, 1505410, 1504159, 1503162, 1502980, 1503629, 1504684, 1505833, 1506770, 1506419, 1503271, 1497237, 1490387, 1484814, 1480271, 1475166, 1469560, 1465551, 1464283, 1464095, 1462655, 1459928, 1457840, 1457549, 1458310, 1458874, 1458779, 1457980, 1456166, 1453226, 1450054, 1448203, 1448571, 1450590, 1452893, 1454768, 1456826, 1460168, 1465185, 1471599, 1479512, 1489497, 1501207, 1512616, 1521675, 1528737, 1536598, 1547689, 1561692, 1576326, 1590373, 1605372, 1623964, 1646811, 1671830, 1696722, 1721490, 1747603, 1775144, 1802162, 1827097, 1850530, 1873814, 1897019, 1919315, 1940607, 1961500, 1981981, 2001377, 2019607, 2037433, 2055341, 2073006, 2089833, 2105103, 2117605, 2126194, 2131060, 2133584, 2134658, 2133981, 2131290, 2127219, 2122306, 2116078, 2108028]
52054B108028r093q717q052q543j0140j1621j2148j1903j1368j0555r233p613
52042A989042o389n725m607j983J556M266N654P204R992J2917J4516J5425J7366
52029B059234K0239K2109K2123K1727K2548K4403K5959K6257K5171K3153K1052
52018B313975J9499J8274J6894J5595J4687J3120R194L000l335q398j2904j7576
52006B382025k1318k2930k3421k4905k7879l1202l4365l7901m1541m3772m3819
51995B028972m2851m2465m2803m2949m2478m1780m1219m0672l9823l8321l5768
51984A577843l2219k8725k6681k6195k5616k3410k0204j8086j7834j7822j6307
51973A324744j3848j2497j3009j4024j3954j2658j1002r759r382j0134j1926j4313
$$ y = [2108028, 2098935, 2090218, 2082166, 2073623, 2063483, 2051862, 2039714, 2027811, 2016443, 2005888, 1996655, 1989042, 1982653, 1976928, 1972321, 1970338, 1971894, 1976160, 1981814, 1989018, 1999010, 2011927, 2026443, 2041868, 2059234, 2079473, 2101582, 2123705, 2145432, 2167980, 2192383, 2218342, 2244599, 2269770, 2292923, 2313975, 2333474, 2351748, 2368642, 2384237, 2398924, 2412044, 2421238, 2424238, 2420903, 2412505, 2399601, 2382025, 2360707, 2337777, 2314356, 2289451, 2261572, 2230370, 2196005, 2158104, 2116563, 2072791, 2028972, 1986121, 1943656, 1900853, 1857904, 1815426, 1773646, 1732427, 1691755, 1651932, 1613611, 1577843, 1545624, 1516899, 1490218, 1464023, 1438407, 1414997, 1394793, 1376707, 1358873, 1341051, 1324744, 1310896, 1298399, 1285390, 1271366, 1257412, 1244754, 1233752, 1223993, 1214611, 1204477, 1192551, 1178238]
51961A178238j6981j9737k1964k2792k2192k1299k1207k1933k2920k3995k5251
51950I37967k6454k7201k7446k7411k7222k6882k6431k5830k5062k4433k4274
51939F49321k4173k3375k2242k2230k3593k4148k1731j7310j4090j3542j3884
51928D29003j2897j0839r551r708j0175r786q632p454o645o244o323o771o995
51915C16983o431n388m672m266l159j057N29m4k176l630l530l285m095n033m684
51900B66062l469k902l207l240k506j686j186o43k44r98l021m649m269k279l97
51885B31366L84K65l34j185j879j961j492q90l17K06K83l57j034q27j52n35k313
51868B19228l768l386j965j364j876k247j970j920k574l127k925k515k448k199
$$ y = [1178238, 1161257, 1141520, 1119556, 1096764, 1074572, 1053273, 1032066, 1010133, 987213, 963218, 937967, 911513, 884312, 856866, 829455, 802233, 775351, 748920, 723090, 698028, 673595, 649321, 625148, 601773, 579531, 557301, 533708, 509560, 487829, 470519, 456429, 442887, 429003, 416106, 405267, 395716, 386008, 375833, 366047, 357415, 349961, 343316, 337072, 330749, 323978, 316983, 310552, 305164, 300492, 296226, 293067, 292010, 292539, 292495, 290319, 286689, 283159, 279874, 275779, 270746, 266062, 262593, 259691, 256484, 253244, 250738, 249052, 247866, 247223, 246979, 245981, 242960, 238311, 234042, 231763, 231366, 231750, 232015, 231681, 230496, 228617, 226656, 225164, 224274, 223957, 224163, 224446, 224089, 223055, 222228, 222076, 221541, 219228, 215460, 212074, 210109, 208745, 206869, 204622, 202652, 200732, 198158, 195031, 192106, 189591, 187143, 184944]
51854A84944j216k29l66j435k194j981j219n43k74n60j321k206l024l824m131
51839A60421l082j112k58j395k369q52J829K226j41k120j589k4N72N00O31K95
51823A53532j022j835q41N93M12p98r22J66Q16P11J106K044K016P40m4P26J966
51806A59366K434K394K414K135J337Q99J604K935L901M205M011L421K911L291
51792A97258M520N479N537N375N639N900N878O563Q801J1572J2982J2595J1658
51779B99757J1189J1024J0606R846Q958P912O235L325o27m078n428n180n697q136
51765C39706j0787j1513j0650r918r463q076n969m990n721o362n435l782k859
51752B44181k484j755j115j779l483m428l547j639p2O28O06L9p90j327j213p34
$$ y = [184944, 183728, 183499, 183133, 181698, 179504, 177523, 176304, 175761, 175487, 174927, 173606, 171400, 168376, 164552, 160421, 157339, 156227, 155969, 154574, 152205, 151353, 153182, 155408, 155267, 153147, 151558, 151534, 152106, 152606, 153237, 153532, 152510, 150675, 149834, 150427, 150839, 150041, 149119, 149285, 150101, 150812, 151918, 153962, 155978, 156718, 156674, 157400, 159366, 161800, 164194, 166608, 168743, 170080, 170979, 172583, 175518, 179419, 183624, 187635, 191056, 193967, 197258, 201778, 207257, 212794, 218169, 223808, 229708, 235586, 242149, 250950, 262522, 275504, 288099, 299757, 310946, 321970, 332576, 342422, 351380, 359292, 365527, 368852, 368225, 364147, 358719, 353539, 347842, 339706, 328919, 317406, 306756, 296838, 287375, 279299, 273330, 268340, 262619, 256257, 250822, 247040, 244181, 241697, 239942, 238827, 237048, 233565, 229137, 225590, 223951, 223879, 224507, 225113, 225152, 224362, 223035, 221822, 221088]
51736B21088m94p45j250j605j628j547j780k334k599k098j286r78j052n81N83
51721B01694J269O09n91r75m10L55J236K687M087L834J504j230k523k328j761
51706B07457j351q30q1O76J399K168K789L021K861K154L74k409m809n249l641
51691B04529j167J279L474M944M988L681J884N6j865l220k691j55K619L949M009
51676B26314L797L322K021L25n67k94L53P37Q56N01q07k616l393k348o33J46J23
51659B27837P22K290L305K353o4k292l342l259k341j051m18j224k622k816j532
51644B15546o51j626l390l973l217k369j630L4K583M245L793K130P86N4n08o70
51628B11137L8J040J076j11j322j340l44L28l92k153l430l067j504j81J49k0J1
$$ y = [221088, 220594, 219849, 218599, 216994, 215366, 213819, 212039, 209705, 207106, 205008, 203722, 202744, 201692, 201111, 201694, 202963, 203572, 202981, 202006, 201596, 201951, 203187, 205874, 209961, 213795, 215299, 214069, 211546, 209218, 207457, 206106, 205276, 205195, 205871, 207270, 209438, 212227, 215248, 218109, 220263, 220637, 218228, 213419, 208170, 204529, 203362, 204641, 208115, 213059, 218047, 221728, 223612, 223668, 221803, 218583, 215892, 215737, 218356, 222305, 226314, 230111, 233433, 235454, 235779, 235212, 234918, 235271, 236008, 236864, 237365, 236558, 233942, 230549, 228201, 227568, 227714, 227837, 228559, 230849, 234154, 236507, 236443, 234151, 230809, 227550, 225209, 224158, 223740, 222516, 219894, 217078, 215546, 214895, 213269, 209879, 205906, 202689, 200320, 198690, 198724, 201307, 205552, 209345, 211475, 212261, 212315, 211807, 211137, 211175, 212215, 213291, 213180, 211858, 210518, 210174, 210502, 210110, 207957, 204527, 201460, 199956, 199775, 199924, 199904, 199915]
51611A99915L20Q34J689K667L091K817K624K979L092K055K97j021j569j881k121
51596B15788j945j392q55j72J262L261M563M197K551Q84J53M50J204J659J412
51581B33020M87j022k894m223l735j406Q75J336M70O6N66Q66M81J73J39n92k265
51564B22342l552l574l354l964m534l594j538M3Q41J840L062L213J941O83O37
51549B10492J118Q12l42j361j640j311p45m34r16k100l041l006k412k081j967
51534A91066j496q71r57j827k352j594J08J700K493K367J493L37o36j537k852
51519A85442m227m174j753J831M239M397L193J999J425J444J718J611P90M7N47
51504A98529J975K518J408J74M48J472J369J48l61O58K034K738L182L688L355
$$ y = [199915, 200235, 201069, 202758, 205425, 208516, 211333, 213957, 216936, 220028, 222083, 222380, 221359, 219790, 217909, 215788, 213843, 212451, 211596, 211424, 212686, 215947, 220510, 224707, 227258, 228142, 228295, 228745, 229949, 231608, 233020, 233507, 232485, 229591, 225368, 221633, 220227, 221102, 222438, 222908, 222974, 223540, 224406, 224887, 225060, 225199, 224607, 222342, 218790, 215216, 211862, 207898, 203364, 199770, 198232, 198275, 199116, 200956, 204018, 207231, 209172, 209855, 210492, 211610, 212422, 212080, 210719, 209079, 207768, 207023, 206589, 205673, 203573, 200532, 197526, 195114, 193033, 191066, 189570, 188699, 187742, 185915, 183563, 181969, 182077, 183777, 186270, 188637, 190130, 190467, 189831, 188294, 185442, 181215, 177041, 175288, 177119, 181358, 185755, 188948, 190947, 192372, 193816, 195534, 197145, 197935, 197982, 198529, 200504, 203022, 204430, 204604, 205052, 206524, 207893, 208041, 207680, 208338, 210372, 213110, 216292, 219980, 223335]
51489B23335J676O6L12K091L424L279K444K029K266K866L521L871L755L663M150
51474B62748M855M929M381L970L644K459M21r03n04M46K16j001j553q50q2m99
51458B82677j991l599m613m927m856m727m317l007r38M06l16k471m038l938k788
51443B36557j592p45n19j163k106k194j246m78q30j853k723l287l463k801j563
51428B09994j133k155l237k849j663j452k270k438j159O12J874K592K693J680
51414B01089k04j637j799j307j101j311j689k195k561k165j025j55k98j058j818
51399A80766k681l762m397l950k839j915j284o23j38k18m86j73O59J168J087J177
51383A62391K151L606M286L164M66k141k789j328L73N98k26n64j93l28j286j640
$$ y = [223335, 225011, 225077, 225389, 227480, 230904, 234183, 236627, 238656, 240922, 243788, 247309, 251180, 254935, 258598, 262748, 267603, 272532, 276913, 280883, 284527, 286986, 287407, 286504, 286000, 286446, 286662, 285661, 284108, 283258, 283176, 282677, 280686, 277087, 272474, 267547, 262691, 257964, 253647, 250640, 249702, 250108, 249792, 247321, 243283, 239345, 236557, 234965, 234220, 233701, 232538, 230432, 228238, 226992, 226514, 225684, 223831, 221108, 217821, 214358, 211557, 209994, 208861, 206706, 203469, 200620, 198957, 197505, 195235, 192797, 191638, 192250, 194124, 196716, 199409, 201089, 200885, 199248, 197449, 196142, 195041, 193730, 192041, 189846, 187285, 185120, 184095, 183940, 183642, 182584, 180766, 178085, 174323, 169926, 165976, 163137, 161222, 159938, 159315, 159177, 158959, 158473, 158300, 158959, 160127, 161214, 162391, 164542, 168148, 172434, 175598, 176064, 173923, 171134, 169806, 170179, 170777, 170551, 169987, 169794, 169466, 168180, 166540]
51367A66540l26J536K071J247Q08J724K903K894J967J551K018K135R79n36q82
51352A86629j29J74p16j716j642r52q96j511j561m65P35P37l74j382j661j933
51336A73337l094m707n307m236k431j086k56M09K74j461l699l887j203K144L609
51321A48406L108K069R74n66k115k661k379k494l230l337k008L5J753K897L398
51306A43850K852J367P1j55J18l37j773l305m043l809k865j557k85M76M52j46
51290A30911n55j07Q90J272N25l00J35J512K221J561M85Ok4j57m26p06j039j052
51272A35152n2J581K160P95j068j387j70Q74Q61N70Q26J342J469J080M19k48n72
51255A43632k58N16J345K141K945L384L075K450K238K069Q12j475l034k604j092
$$ y = [166540, 166214, 167750, 169821, 171068, 171876, 173600, 176503, 179397, 181364, 182915, 184933, 187068, 188047, 187511, 186629, 186500, 186674, 185958, 184242, 182600, 181648, 180752, 179241, 177680, 177215, 177950, 178687, 178313, 176931, 175270, 173337, 170243, 165536, 160229, 155993, 153562, 152476, 152220, 152629, 152903, 151442, 147743, 143856, 142653, 144797, 148406, 151514, 153583, 154557, 153991, 151876, 149215, 146836, 144342, 141112, 137775, 135767, 135802, 137555, 140452, 143850, 146702, 148069, 148140, 147985, 148103, 147766, 145993, 142688, 138645, 134836, 131971, 130414, 130129, 130605, 131057, 130911, 130356, 130249, 131139, 132411, 132936, 132636, 132771, 134283, 136504, 138065, 138550, 138556, 138532, 138375, 137949, 137243, 136204, 135152, 135100, 136681, 138841, 139636, 138568, 137181, 137011, 137885, 138746, 139316, 140142, 141484, 142953, 144033, 144452, 144204, 143632, 143374, 143890, 145235, 147376, 150321, 153705, 156780, 159230, 161468, 163537, 164349, 162874, 159840, 157236, 156144]
51240A56144l16p48j489j813j725j285m86K36K94r8m7O68J087K49j484k660k125
51223A44402q4J994K519J169p98j848j657j045o70n11m76o05n46K65J523K039
51207A45671J372O21Q02J267Q60l7j0J149K205K531K847L418L134J398k11L33
51191A67350K656M235L512J525K10N3M8n96j480j761j319q25p74q80o25q6K60
51174A71503L07L32L29R0J1R78K991M662M578K680j25k911m777m754k799l16J248
51157A74027J913K406K471J382j84m42J001K351K025Q09O63K104L586L381J424
51142A98917o36j060J87J361R27o73j804j869j660j638j210j65N62L48jL74Q41
51125A92801K81r66j495q66j8K76J26k93j134k068k082o88J217K209J674R5j517
$$ y = [156144, 155828, 155080, 153591, 151778, 150053, 148768, 148282, 148518, 148812, 148714, 148667, 149335, 150422, 150671, 149187, 146527, 144402, 144318, 146312, 148831, 150000, 149202, 147354, 145697, 144652, 143982, 143471, 142995, 142390, 141844, 142109, 143632, 145671, 147043, 147664, 148466, 149733, 150593, 150556, 150546, 151695, 153900, 156431, 159278, 162696, 165830, 167228, 167017, 167350, 170006, 174241, 177753, 179278, 179488, 179541, 179589, 178993, 177513, 175752, 174433, 173608, 172834, 171954, 171329, 171243, 171503, 171810, 172142, 172471, 172561, 172572, 173550, 176541, 181203, 185781, 188461, 188336, 185425, 180648, 175894, 173095, 172779, 174027, 175940, 178346, 180817, 182199, 182015, 181573, 182574, 184925, 186950, 187759, 188422, 190526, 194112, 197493, 198917, 198281, 197221, 197408, 198769, 199696, 199023, 197219, 195350, 193690, 192052, 190842, 190677, 191239, 191587, 191586, 191960, 192801, 193082, 192116, 190621, 189755, 189737, 190013, 190139, 189846, 188712, 186644, 184562, 183874, 185091, 187300, 188974, 189069, 187552]
51108A87552k214j682n82qk08k62O29J962K606K308J800J553J244O20P0j02k69
51091A95017o67o21N10J892K001Q48J33P79J648J517J063J520K334J924L48o77
51075B09569m71k09o34q87m21l24j278j809l39J929K299M00j249o34J542L446
51059B10930M353M385L361J171j211k317j795q06o48j339j682o12J541L196L046
51044B21573J410j65n84j46K37L11O47J703L076L795L351K333J980K971M726N950
51028B53168N752M234K265R27Q75J947L243L749K899Q50j436k538j786k76J51
51013B74024o90r40O86K886L611L028L012M013M319K777N79m13J05J246K407L358
50997C04008L575K684J187o9q65j430j694j426p04M00J993L551L658J760l54l14
$$ y = [187552, 185338, 183656, 183074, 183066, 182858, 182596, 183225, 185187, 187793, 190101, 191901, 193454, 194698, 195318, 195388, 195286, 195017, 194350, 193729, 194239, 196131, 198132, 198980, 199113, 199892, 201540, 203057, 204120, 205640, 207974, 209898, 210246, 209569, 209098, 208889, 208255, 207368, 206947, 206623, 205345, 203536, 203197, 205126, 207425, 207825, 206576, 205942, 207484, 210930, 215283, 219668, 223029, 224200, 222989, 220672, 218877, 218071, 217423, 216084, 214402, 213790, 215331, 218527, 221573, 222983, 222818, 222234, 222088, 222325, 222636, 223283, 224986, 228062, 231857, 235208, 237541, 239521, 242492, 247218, 253168, 258920, 263154, 265419, 266346, 267221, 269168, 272411, 276160, 279059, 279909, 278473, 275935, 274149, 273873, 274024, 273334, 272394, 273080, 275966, 279577, 282605, 285617, 289630, 293949, 296726, 297305, 296892, 296997, 298243, 300650, 304008, 307583, 310267, 311454, 311385, 310520, 309090, 307396, 305970, 305266, 305666, 307659, 311210, 314868, 316628, 316274, 315960]
50981C15960J693L147K675J674J768K331J800L46m45j7N23K89k51l24N0M65Q76
50964C32560J326J585J592J868K916M580O322P769Q587Q296O924N528N199N680
50950D00732N759N057M522M965N986O904P867R226J0372J0372R626R829J1835
50937E03052J4346J5322J4297J2782J2460J3670J5627J7584J9249K0362K0631
50926F79382K0384K0869K3292K7498L2023L5434L7346L8213L8829M0282M3612
50915A037164M8830N4579N9453O3478O7724P2591P7378Q1634Q6102R1723R8126
50904A838782J03802J07742J10364J12576J14211J13870J10522J04893R8697R2632
50894B908091Q5820P7413O7823N7800M7144L5483K3797J3808N793j539q793j4830
$$ y = [315960, 317653, 320800, 323475, 325149, 326917, 329248, 331048, 331394, 330949, 330932, 331455, 331744, 331493, 331169, 331219, 331684, 332560, 333886, 335471, 337063, 338931, 341847, 346427, 352749, 360518, 369105, 377401, 384325, 389853, 395052, 400732, 406491, 411548, 416070, 421035, 427021, 433925, 441792, 451018, 461390, 471762, 481388, 491217, 503052, 517398, 532720, 547017, 559799, 572259, 585929, 601556, 619140, 638389, 658751, 679382, 699766, 720635, 743927, 771425, 803448, 838882, 876228, 914441, 953270, 993552, 1037164, 1085994, 1140573, 1200026, 1263504, 1331228, 1403819, 1481197, 1562831, 1648933, 1740656, 1838782, 1942584, 2050326, 2160690, 2273266, 2387477, 2501347, 2611869, 2716762, 2815459, 2908091, 2993911, 3071324, 3139147, 3196947, 3244091, 3279574, 3303371, 3317179, 3322972, 3321433, 3312640, 3297810]
50882C297810j8590k0691k2277k3384k3660k3919k5480k8256l0946l3076l5700
50871C011831l9899m5633n2281n9196o5437p0186p3934p8325q3980q9272r2154
50860B261534r2521r1789r0603q8247q4305p9707p5626p2028o7870o2443n6077
50849A400318m9715m4125l9465l5445l1723k8174k4776k1529j8520j5863j3360
50838A077623j0528p395m968m297m960n160l623r96J006J596J654K601M893P714
50824A055160R946J1313J2463J4057J5971J7585J8729J9964K1887K4466K7220
50813A248761K9771L2022L4010L5809L7552L9517M2217M6180N1379N6997O2194
50802A716409O7078P2524P9038Q6425R4517J03521J13377J23645J34452J46736
$$ y = [3297810, 3279220, 3258529, 3236252, 3212868, 3189208, 3165289, 3139809, 3111553, 3080607, 3047531, 3011831, 2971932, 2926299, 2874018, 2814822, 2749385, 2679199, 2605265, 2526940, 2442960, 2353688, 2261534, 2169013, 2077224, 1986621, 1898374, 1814069, 1734362, 1658736, 1586708, 1518838, 1456395, 1400318, 1350603, 1306478, 1267013, 1231568, 1199845, 1171671, 1146895, 1125366, 1106846, 1090983, 1077623, 1067095, 1059700, 1054732, 1050435, 1045475, 1040315, 1036692, 1035696, 1036702, 1038298, 1039952, 1042553, 1047446, 1055160, 1065106, 1076419, 1088882, 1102939, 1118910, 1136495, 1155224, 1175188, 1197075, 1221541, 1248761, 1278532, 1310554, 1344564, 1380373, 1417925, 1457442, 1499659, 1545839, 1597218, 1654215, 1716409, 1783487, 1856011, 1935049, 2021474, 2115991, 2219512, 2332889, 2456534, 2590986, 2737722]
50792B737722J60752J75076J88057J99777K11449K23205K33695K41850K47815
50783D619398K51883K53492K51719K45898K35411K19696J98955J74130J46017
50774F596599J15283Q3728N4227K8463N662j5358l3671m7102n5122n9322o1091
50763F612296o0210n6186m9882m3412l9064l8578m2575n0355o0898p4331r1410
50752F005395j11198j30553j46972j61147j75452j90315k03406k12194k15927
50743D458231k14885k09273j99806j88417j77083j66029j54054j40528j26340
50734B881816j12858j00591q9142p7959o6830n6097m6652l9417l4436l0785k7628
50723B199421k5093k3766k3583k3747k3704k3585k3658k3741k3462k2886k2584
$$ y = [2737722, 2898474, 3073550, 3261607, 3461384, 3672833, 3896038, 4129733, 4371583, 4619398, 4871281, 5124773, 5376492, 5622390, 5857801, 6077497, 6276452, 6450582, 6596599, 6711882, 6795610, 6849837, 6878300, 6883962, 6868604, 6834933, 6787831, 6732709, 6673387, 6612296, 6552086, 6495900, 6446018, 6402606, 6363542, 6324964, 6282389, 6232034, 6171136, 6096805, 6005395, 5894197, 5763644, 5616672, 5455525, 5280073, 5089758, 4886352, 4674158, 4458231, 4243346, 4034073, 3834267, 3645850, 3468767, 3302738, 3148684, 3008156, 2881816, 2768958, 2668367, 2579225, 2501266, 2434436, 2378339, 2331687, 2292270, 2257834, 2227049, 2199421, 2174328, 2150562, 2126979, 2103232, 2079528, 2055943, 2032285, 2008544, 1985082, 1962196, 1939612]
50712A939612k3094k4424k6100k7662k8993l0119l0825l0824l0278k9731k9345
50701A628217k8616k7125k5112k2762j9581j5209j0549o990m425j102M148J0367
50689A481261J5745J9786K3395K7293L1266L5104L9510M5428N2649N9600O5060
50678A896097O9940P6616Q6001R5992J03777J09284J15023J22382J29618J34295
50668B939025J36315J37321J37978J37410J35009J31121J25707J17687J06220
50659D103793R1726P5008N6191L5487J4577l907j8463k9557l8167m4108m6403
50648D196177m4978m1179l6617l2162k8314k5620k4089k2912k1894k2730k7580
50637C868102l6386m6919n7695o9345q2405r5139j04832j10397j12481j11746
$$ y = [1939612, 1916518, 1892094, 1865994, 1838332, 1809339, 1779220, 1748395, 1717571, 1687293, 1657562, 1628217, 1599601, 1572476, 1547364, 1524602, 1505021, 1489812, 1479263, 1472273, 1467848, 1466746, 1470894, 1481261, 1497006, 1516792, 1540187, 1567480, 1598746, 1633850, 1673360, 1718788, 1771437, 1831037, 1896097, 1966037, 2042653, 2128654, 2224646, 2328423, 2437707, 2552730, 2675112, 2804730, 2939025, 3075340, 3212661, 3350639, 3488049, 3623058, 3754179, 3879886, 3997573, 4103793, 4195519, 4270527, 4326718, 4362205, 4376782, 4372875, 4354412, 4324855, 4286688, 4242580, 4196177, 4151199, 4110020, 4073403, 4041241, 4012927, 3987307, 3963218, 3940306, 3918412, 3895682, 3868102, 3831716, 3784797, 3727102, 3657757, 3575352, 3480213, 3375381, 3264984, 3152503, 3040757]
50627C040757j08342j02757r5786q7716p8477o8566n8833m9435l9907l0144k0323
50616B300471j0055J097J2240K1489K8123L3215L7733M1201M2818M2829M1861
50605B593022L9755L6198L1942K8364K5976K4273K2876K1925K1286K0307J8761
50594B884685J7442J7246J8051J8928J9371J9733K0472K1613K3319K6382L1303
50583C118545L7079M1818M4703M6496M7793M7864M5899M2377L8127L2733K5284
50572C568718J6419Q188J692m093j0831j9049k7920l5908m1553m4522m5981m7081
50560C318079m7081m4234l8416l1456k4661j7732j0806n399j965J711P498J3295
50548C118833J4852J0944M517j566p691j5597k5258l5208m4960n5273o6164p6051
$$ y = [3040757, 2932415, 2829658, 2733872, 2646156, 2567679, 2499113, 2440280, 2390845, 2350938, 2320794, 2300471, 2290416, 2291513, 2303753, 2325242, 2353365, 2386580, 2424313, 2465514, 2508332, 2551161, 2593022, 2632777, 2668975, 2700917, 2729281, 2755257, 2779530, 2802406, 2824331, 2845617, 2865924, 2884685, 2902127, 2919373, 2937424, 2956352, 2975723, 2995456, 3015928, 3037541, 3060860, 3087242, 3118545, 3155624, 3197442, 3242145, 3288641, 3336434, 3384298, 3430197, 3472574, 3510701, 3543434, 3568718, 3585137, 3593325, 3595017, 3590924, 3580093, 3561044, 3533124, 3497216, 3455663, 3411141, 3365160, 3318079, 3270998, 3226764, 3188348, 3156892, 3132231, 3114499, 3103693, 3098294, 3096329, 3098040, 3105538, 3118833, 3133685, 3144629, 3149146, 3147580, 3139889, 3124292, 3099034, 3063826, 3018866, 2963593, 2897429, 2821378]
50536B821378q3260q7552q9757r0427q9516q7130q3963q0684p7194p2864o7457
50525A911574o1532n5898n0898m6278m1492l6094l0138k4381j9843j6822j4421
50514A513777j1272o816j833K449N716Q987J3323J8229K1952K3687K4796K7089
50502A640084L0431L3254L5155L7610M1772M6864N1477N5369N9044O2455O5303
50491B158818O7909P0556P2297P1888O9935O8749O9613P1316P2195P2735P5058
50480B941069Q0014Q5967R0841R4767R9944J07885J17447J25977J32211J37456
50470D013578J43927J52325J61302J68877J73892J76203J75921J72855J66761
50461E505641J57848J46645J33113J16390R5893P2512M7998K3212k328k8999n5772
$$ y = [2821378, 2738118, 2650566, 2560809, 2470382, 2380866, 2293736, 2209773, 2129089, 2051895, 1979031, 1911574, 1850042, 1794144, 1743246, 1696968, 1655476, 1619382, 1589244, 1564863, 1545020, 1528198, 1513777, 1502505, 1495689, 1493856, 1496305, 1502021, 1511008, 1524331, 1542560, 1564512, 1588199, 1612995, 1640084, 1670515, 1703769, 1738924, 1776534, 1818306, 1865170, 1916647, 1972016, 2031060, 2093515, 2158818, 2226727, 2297283, 2369580, 2441468, 2511403, 2580152, 2649765, 2721081, 2793276, 2866011, 2941069, 3021083, 3107050, 3197891, 3292658, 3392602, 3500487, 3617934, 3743911, 3876122, 4013578, 4157505, 4309830, 4471132, 4640009, 4813901, 4990104, 5166025, 5338880, 5505641, 5663489, 5810134, 5943247, 6059637, 6155530, 6228042, 6276040, 6299252, 6296924, 6267925, 6212153]
50450F212153q0780j02621j20770j35144j45650j51916j53379j49961j42690j32926
50440D896316j20772j05095q5689o4632m4730k7089j1046L795J6316K4557K6965
50429D508896K2958J2898k271k1543m3886o7635r0318j09830j25689j38693j49322
50418C795565j56883j60329j59593j55960j51012j45288j38256j29910j21851
50409B476483j15756j10922j04611r5297q4486p4752o7105o1015n5781n0669m4712
50398A611377l7917l1948k8185k5636k2292j8102j4708j2440r702n800k306o11
50386A401730L22K435N718Q336R115Q869R222J0801J2745J3842J4227J5681J9637
50373A532680K5105K9582L2101L4189L7328M0779M2876M3497M4055M5512M7727
$$ y = [6212153, 6131373, 6028752, 5907982, 5772838, 5627188, 5475272, 5321893, 5171932, 5029242, 4896316, 4775544, 4670449, 4584760, 4520128, 4475398, 4448309, 4437263, 4441058, 4457374, 4481931, 4508896, 4531854, 4544752, 4542481, 4520938, 4477052, 4409417, 4319099, 4209269, 4083580, 3944887, 3795565, 3638682, 3478353, 3318760, 3162800, 3011788, 2866500, 2728244, 2598334, 2476483, 2360727, 2249805, 2145194, 2049897, 1965411, 1890659, 1823554, 1762539, 1706758, 1656089, 1611377, 1573460, 1541512, 1513327, 1487691, 1465399, 1447297, 1432589, 1420149, 1410447, 1404647, 1402341, 1401730, 1402052, 1404487, 1410205, 1418541, 1427656, 1436525, 1445747, 1456548, 1469293, 1483135, 1497362, 1513043, 1532680, 1557785, 1587367, 1619468, 1653657, 1690985, 1731764, 1774640, 1818137, 1862192, 1907704, 1955431]
50362A955431N0505N4118N8653O3626O8506P3059P7156Q0778Q4248Q8001R2013
50351B746094R5851R9106J01306J01596R9305R4892Q9555Q3631P6168O6429N5018
50340C708951M2861K9675J4539k355j9514l5804n1243o5881p9007q9984r8927
50329C353311j05624j08599j06622j00728r3343q5486p6285o5424n4400m4513
50319B512287l5107k5057j4982o568l57M209O853O249J992m579j2087k0581l0607
50306B381665m1492n1339n8549o3018o5915o8527p1136p2883p2743p0564o7037
50295A678462o2933n8698n4557n0549m6553m2621l9063l5972l2923k9566k6125
50284A198902k2796j9258j5440j2227j0430r289p245m133j549p75j256j378r8
$$ y = [1955431, 2005936, 2060054, 2118707, 2182333, 2250839, 2323898, 2401054, 2481832, 2566080, 2654081, 2746094, 2841945, 2941051, 3042357, 3143953, 3243258, 3338150, 3427705, 3511336, 3587504, 3653933, 3708951, 3751812, 3781487, 3796026, 3793671, 3774157, 3738353, 3687110, 3621229, 3542222, 3452238, 3353311, 3247687, 3139088, 3032466, 2931738, 2838395, 2752909, 2676624, 2611200, 2556800, 2512287, 2477180, 2452123, 2437141, 2430573, 2430216, 2434425, 2441278, 2447527, 2449519, 2444940, 2432853, 2412272, 2381665, 2340173, 2288834, 2230285, 2167267, 2101352, 2032825, 1961689, 1888806, 1816063, 1745499, 1678462, 1615529, 1556831, 1502274, 1451725, 1405172, 1362551, 1323488, 1287516, 1254593, 1225027, 1198902, 1176106, 1156848, 1141408, 1129181, 1118751, 1109462, 1102217, 1098084, 1096535, 1095760, 1094504, 1093126, 1093028]
50271A093028K304M395M535K364m59j761r97Q06K851N115P205Q287Q579R424J1284
50256A156960J2868J3070J2622J2854J3840J4824J5727J7005J8566J9744K0117
50245A328197J9581J8060J5976J4506J4446J4951J4183J1307P343M214L163L839
50233A469766M516L534P93k477n411q165j0735j2293j2453j2300j3054j4247j4232
50220A373242j2247r186o668n988p559j0502j3064j4142j4216j4335j4626j4388
50208A236321j3156j0974q130n400l912l903m035k887o72J332K430K691K176J217
50194A193098P94J262J182j024m583p231q317r118j0132j0298r488r506j1404
50181A115235j3541j3879j2906j2666j3765j5045j5696j6055j6377j6217j5321
$$ y = [1093028, 1095332, 1099727, 1104262, 1106626, 1106167, 1104406, 1103409, 1104215, 1107066, 1112181, 1119386, 1127673, 1136252, 1145676, 1156960, 1169828, 1182898, 1195520, 1208374, 1222214, 1237038, 1252765, 1269770, 1288336, 1308080, 1328197, 1347778, 1365838, 1381814, 1396320, 1410766, 1425717, 1439900, 1451207, 1458550, 1462764, 1465927, 1469766, 1474282, 1477816, 1478609, 1476132, 1470721, 1462556, 1451821, 1439528, 1427075, 1414775, 1401721, 1387474, 1373242, 1360995, 1351809, 1345141, 1339153, 1331594, 1321092, 1308028, 1293886, 1279670, 1265335, 1250709, 1236321, 1223165, 1212191, 1204061, 1198661, 1194749, 1190846, 1186811, 1183924, 1183252, 1184584, 1187014, 1189705, 1191881, 1193098, 1193892, 1195154, 1196336, 1195312, 1190729, 1183498, 1175181, 1166063, 1155931, 1145633, 1136145, 1126639, 1115235, 1101694, 1087815, 1074909, 1062243, 1048478, 1033433, 1017737, 1001682, 985305, 969088, 953767]
50170I53767j4149j3247j2677j2146j1188r384p022n403n605o869p099n342k985
50157H40651j959k345k589j723m10L77P09J105J335Q52J27L45J620K649K718K867
50141H46329M159N698N727M175K673K207K246K355L254N605Q794J1610J3454J4442
50127I32728J5202J7058K1490K8601L6625M3626M9164N3855N8062O1793O5188
50116A383392O8212P0185P0431O9047O6317O1854N5324M7732M1031L6289L2946
50105B002760K9878K6499K2782J8793J4316Q590N45j0196k2677l5441m7621n8605
50093A949623o7133p1865p2921p1889p0077o7487o3678n8750n3199m7540m2391
50082A262693l8252l4859l1378k7460k3466j9639j5997j3245j2430j2960j2364
$$ y = [953767, 939618, 926371, 913694, 901548, 890360, 880976, 873954, 868551, 862946, 856077, 848978, 843636, 840651, 838692, 836347, 833758, 832035, 831625, 832002, 832711, 833816, 835151, 836003, 836130, 836475, 838095, 840744, 843462, 846329, 850488, 856186, 861913, 866088, 868761, 870968, 873214, 875569, 878823, 884428, 893222, 904832, 918286, 932728, 947930, 964988, 986478, 1015079, 1051704, 1095330, 1144494, 1198349, 1256411, 1318204, 1383392, 1451604, 1521789, 1592220, 1661267, 1727584, 1789438, 1844762, 1892494, 1933525, 1969814, 2002760, 2032638, 2059137, 2081919, 2100712, 2115028, 2123618, 2124163, 2113967, 2091290, 2055849, 2008228, 1949623, 1882490, 1810625, 1737704, 1665815, 1595738, 1528251, 1464573, 1405823, 1352624, 1305084, 1262693, 1224441, 1189582, 1158204, 1130744, 1107278, 1087639, 1071642, 1058397, 1045967, 1033007, 1020643]
50071A020643r218n310l344l350l173k055j478k113k251m07K154L107K265J440
50057I96910J665K359L065M349O495Q635R912J0698J1936J3983J6627J9579K2279
50044A128492K3893K4369K4936K6572K8351K8570K7320K6503K7023K7499K6554
50033A420082K5002K4434K4503K3384K0650J8048J7081J7285J7465J7422J7488
50022A642844J7303J6326J5088J4816J5861J7405J8770K0227K2353K5320K9134
50011A855447L3919L9665M5970N2419N9084O6512P5265Q5346R5901J05686J14131
50000B629345J21696J28704J34135J36289J34525J29567J22224J12854J02264
49991C751603R2034Q3214P5508O8164O0914N3327M4115L2046J6929j046k2119
$$ y = [1020643, 1011425, 1006115, 1002771, 999421, 996248, 994193, 992715, 990602, 988351, 987944, 990098, 993205, 995470, 996910, 998575, 1000934, 1003999, 1008348, 1014843, 1023478, 1033390, 1044088, 1056024, 1070007, 1086634, 1106213, 1128492, 1152385, 1176754, 1201690, 1228262, 1256613, 1285183, 1312503, 1339006, 1366029, 1393528, 1420082, 1445084, 1469518, 1494021, 1517405, 1538055, 1556103, 1573184, 1590469, 1607934, 1625356, 1642844, 1660147, 1676473, 1691561, 1706377, 1722238, 1739643, 1758413, 1778640, 1800993, 1826313, 1855447, 1889366, 1929031, 1975001, 2027420, 2086504, 2153016, 2228281, 2313627, 2409528, 2515214, 2629345, 2751041, 2879745, 3013880, 3150169, 3284694, 3414261, 3536485, 3649339, 3751603, 3843637, 3926851, 4002359, 4070523, 4131437, 4184764, 4228879, 4260925, 4277854, 4276808, 4254689]
49980D254689m5851o9731r0494j06970j20464j32140j41358j47023j49406j49645
49970C101607j48258j45026j40041j34100j27922j21466j14114j05514r6229q7413
49960A881524p9685p2610o5697n9491n4909n1645m8310m4308m0593l8107l6359
49949A289810l4298l1883k9962k8910k8228k7402k6536k6040k6049k6190k5825
49938I78487k4577k2773k1177k0199j9639j9167j8657j7968j6862j5346j3672
49927G68450j1906j0016q430p828q136q430q166p754p564p259o657o201n827m375
49913F59901j363J494K061O75k74M89J898K690L122L919M858N447O136P708R855
49898G08616J1364J1822J2379J4528J8381K2336K4577K4924K5055K6750L0222
$$ y = [4254689, 4208838, 4139107, 4048613, 3941643, 3821179, 3689039, 3547681, 3400658, 3251252, 3101607, 2953349, 2808323, 2668282, 2534182, 2406260, 2284794, 2170680, 2065166, 1968937, 1881524, 1801839, 1729229, 1663532, 1604041, 1549132, 1497487, 1449177, 1404869, 1364276, 1326169, 1289810, 1255512, 1223629, 1193667, 1164757, 1136529, 1109127, 1082591, 1056551, 1030502, 1004312, 978487, 953910, 931137, 909960, 889761, 870122, 850955, 832298, 814330, 797468, 782122, 768450, 756544, 746528, 738098, 730270, 722134, 713704, 705538, 697784, 690220, 682961, 676304, 670103, 664276, 659901, 658538, 660032, 662093, 662768, 662494, 662983, 664881, 667571, 670693, 674612, 679470, 684917, 691053, 698761, 708616, 719980, 731802, 744181, 758709, 777090, 799426, 824003, 848927, 873982, 900732, 930954]
49887I30954L4559L9311M4668N0189N4649N7851O1556O7533P5043Q1266Q4166
49876A581745Q3980Q1916P8304P2617O4699N5458M6540L9571L5288L2911L0698
$$ y = [930954, 965513, 1004824, 1049492, 1099681, 1154330, 1212181, 1273737, 1341270, 1416313, 1497579, 1581745, 1665725, 1747641, 1825945, 1898562, 1963261, 2018719, 2065259, 2104830, 2140118, 2173029, 2203727]
$$ [...]
##END NTUPLES=NMR SPECTRUM
##END=
