
##TITLE=AC1225_PUEHDE098_6540727_UGgECoJWBi
##JCAMPDX= 6.0         $$ Bruker NMR JCAMP-DX V2.0
##DATA TYPE= NMR SPECTRUM
##DATA CLASS= NTUPLES
##ORIGIN= BRUKER
##OWNER= Administrator
$$ 1.72 TOPSPIN		Version 2.1
$$ 2012-07-18 01:37:46.937 -0500  Administrator@TOPSPIN
$$ Compression mode = diff/dup
##.OBSERVE FREQUENCY= 400.02188249412
##.OBSERVE NUCLEUS= ^1H
##.ACQUISITION MODE= SIMULTANEOUS (DQD)
##.ACQUISITION SCHEME= undefined
##.AVERAGES= 8
##.DIGITISER RES= 22
##SPECTROMETER/DATA SYSTEM= spect
##.PULSE SEQUENCE= zg30
##.SOLVENT NAME= COFFEE_meoh
##.SHIFT REFERENCE= INTERNAL, COFFEE_meoh, 1, 14.98509
##AUDIT TRAIL= $$ (NUMBER, WHEN, WHO, WHERE, PROCESS, VERSION, WHAT)
$$ ##TITLE= Audit trail, TOPSPIN		Version 2.1
$$ ##JCAMPDX= 5.01
$$ ##ORIGIN= Bruker BioSpin GmbH
$$ ##OWNER= Administrator
$$ $$ C:\Bruker\TOPSPIN/data/COFFEE/nmr/AC1225_PUEHDE098_6540727_UGgECoJWBi/10/pdata/1/auditp.txt
$$ ##AUDIT TRAIL=  $$ (NUMBER, WHEN, WHO, WHERE, PROCESS, VERSION, WHAT)
(   1,<2012-07-18 01:37:40.203 -0500>,<Administrator>,<TOPSPIN>,<go>,<TOPSPIN 2.1>,
      <created by zg
	started at 2012-07-18 01:36:33.562 -0500,
	POWCHK enabled, PULCHK disabled,
       configuration hash MD5:
       6B 1B 68 BB D9 2E 58 E2 7F 35 AD 54 07 DF 0E 41
       data hash MD5: 64K
       E3 AE 4D 2D B9 AA 74 5C 4F CA 7F B9 A3 39 60 84>)
(   2,<2012-07-18 01:37:42.828 -0500>,<Administrator>,<TOPSPIN>,<proc1d>,<TOPSPIN 2.1>,
      <Start of raw data processing
       efp LB = 0 FT_mod = 6 PKNL = 1 PHC0 = 0 PHC1 = 0 SI = 32K 
       data hash MD5: 32K
       18 63 D8 40 92 78 DD 3B 88 5A 23 E4 81 BE A0 CF>)
(   3,<2012-07-18 01:37:43.218 -0500>,<Administrator>,<TOPSPIN>,<proc1d>,<TOPSPIN 2.1>,
      <pk PHC0 = 179.4727 PHC1 = 0 
       data hash MD5: 32K
       63 B0 D8 CE 70 3D 61 87 0C 43 7B C5 2C 7F 2F EE>)
(   4,<2012-07-18 01:37:43.343 -0500>,<Administrator>,<TOPSPIN>,<proc1d>,<TOPSPIN 2.1>,
      <abs ABSG = 1 
       data hash MD5: 32K
       6B 99 C1 A0 8A C4 38 E7 28 EB A9 11 BE 18 51 B5>)
(   5,<2012-07-18 01:37:43.375 -0500>,<Administrator>,<TOPSPIN>,<proc1d>,<TOPSPIN 2.1>,
      <abs ABSG = 2 
       data hash MD5: 32K
       3B FA 45 C6 15 93 61 D8 F3 6B 7A 7E 99 B1 50 44>)
(   6,<2012-07-18 01:37:43.406 -0500>,<Administrator>,<TOPSPIN>,<proc1d>,<TOPSPIN 2.1>,
      <abs ABSG = 3 
       data hash MD5: 32K
       DE 04 11 28 6B 60 6F 47 B0 C1 8B 1F 3C 02 E3 19>)
(   7,<2012-07-18 01:37:43.421 -0500>,<Administrator>,<TOPSPIN>,<proc1d>,<TOPSPIN 2.1>,
      <abs ABSG = 4 
       data hash MD5: 32K
       BB 17 39 8A 9E 2B 23 E8 7B CB C3 81 A3 2E AA AD>)
(   8,<2012-07-18 01:37:43.453 -0500>,<Administrator>,<TOPSPIN>,<proc1d>,<TOPSPIN 2.1>,
      <abs ABSG = 5 
       data hash MD5: 32K
       C1 C2 FF 5D EF 9A E4 E8 82 D4 65 81 07 11 6D F2>)
$$ ##END=
$$ 
$$ $$ hash MD5
$$ $$ 6B FE 04 37 46 92 C2 48 5E 31 E1 D4 C0 A9 94 DD
##$RELAX= 
##$RELAX= 
##$RELAX= 
##$RELAX= 
##$RELAX= 
##$RELAX= 
##$RELAX= 
$$ Bruker specific parameters
$$ --------------------------
$$ [...]
##$TP= (0..7)
150 150 150 150 150 150 150 150
##$TP07= 0
##$TPNAME0= <>
##$TPNAME1= <>
##$TPNAME2= <>
##$TPNAME3= <>
##$TPNAME4= <>
##$TPNAME5= <>
##$TPNAME6= <>
##$TPNAME7= <>
##$TPOAL= (0..7)
0.5 0.5 0.5 0.5 0.5 0.5 0.5 0.5
##$TPOFFS= (0..7)
0 0 0 0 0 0 0 0
##$TUNHIN= 0
##$TUNHOUT= 0
##$TUNXOUT= 0
##$USERA1= <user>
##$USERA2= <user>
##$USERA3= <user>
##$USERA4= <user>
##$USERA5= <user>
##$V9= 5
##$VALIST= <valist>
##$VCLIST= <CCCCCCCCCCCCCCC>
##$VD= 0
##$VDLIST= <DDDDDDDDDDDDDDD>
##$VPLIST= <PPPPPPPPPPPPPPP>
##$VTLIST= <TTTTTTTTTTTTTTT>
##$WBST= 2048
##$WBSW= 25
##$XGAIN= (0..3)
0 0 0 0
##$XL= 0
##$YL= 0
##$YMAX_a= 504507
##$YMIN_a= -644682
##$ZGOPTNS= <>
##$ZL1= 120
##$ZL2= 120
##$ZL3= 120
##$ZL4= 120
##$ABSF1= 14.98509
##$ABSF2= -5.573092
##$ABSG= 5
##$ABSL= 3
##$ALPHA= 0
##$AQORDER= 0
##$ASSFAC= 0
##$ASSFACI= 0
##$ASSFACX= 0
##$ASSWID= 0
##$AUNMP= <proc_prof1d_extract_pilot.lims>
##$AXLEFT= 0
##$AXNAME= <>
##$AXNUC= <1H>
##$AXRIGHT= 0
##$AXTYPE= 0
##$AXUNIT= <>
##$AZFE= 0.1
##$AZFW= 0.1
##$BCFW= 0
##$BC_mod= 0
##$BYTORDP= 0
##$COROFFS= 0
##$CY= 15
##$DATMOD= 1
##$DC= 0
##$DFILT= <>
##$DTYPP= 0
##$F1P= 0
##$F2P= 0
##$FCOR= 0.5
##$FTSIZE= 32768
##$FT_mod= 6
##$GAMMA= 0
##$GB= 0
##$INTBC= 1
##$INTSCL= 1
##$ISEN= 128
##$LB= 0
##$LEV0= 0
##$LPBIN= 0
##$MAXI= 10000
##$MC2= 0
##$MEAN= 0
##$ME_mod= 0
##$MI= 0
##$NCOEF= 0
##$NC_proc= -8
##$NLEV= 6
##$NOISF1= 0
##$NOISF2= 0
##$NSP= 0
##$NTH_PI= 0
##$NZP= 0
##$OFFSET= 14.98509
##$PC= 1
##$PHC0= 179.4727
##$PHC1= 0
##$PH_mod= 1
##$PKNL= yes
##$PPARMOD= 0
##$PPDIAG= 0
##$PPIPTYP= 0
##$PPMPNUM= 2147483647
##$PPRESOL= 1
##$PSCAL= 4
##$PSIGN= 0
##$PYNMP= <proc.py>
##$REVERSE= no
##$SF= 400.02
##$SI= 32768
##$SIGF1= 0
##$SIGF2= 0
##$SINO= 400
##$SIOLD= 32768
##$SPECTYP= <>
##$SREGLST= <1H.CDCl3>
##$SSB= 0
##$STSI= 32768
##$STSR= 0
##$SW_p= 8223.68421052631
##$SYMM= 0
##$S_DEV= 0
##$TDeff= 65536
##$TDoff= 0
##$TI= <>
##$TILT= no
##$TM1= 0
##$TM2= 0
##$TOPLEV= 0
##$USERP1= <user>
##$USERP2= <user>
##$USERP3= <user>
##$USERP4= <user>
##$USERP5= <user>
##$WDW= 1
##$XDIM= 32768
##$YMAX_p= 466519806
##$YMIN_p= -727754
##$CURPLOT= <Network HP LaserJet P1505>
##$CURPRIN= <$Network HP LaserJet P1505>
##$DFORMAT= <normdp>
##$LAYOUT= <+/1D_H.xwp>
##$LFORMAT= <normlp>
##$PFORMAT= <normpl>
##$SURQMSG= 1
$$ End of Bruker specific parameters
$$ ---------------------------------
##NTUPLES= NMR SPECTRUM
##VAR_NAME=  FREQUENCY,     SPECTRUM/REAL,   SPECTRUM/IMAG
##SYMBOL=    X,             R,               I
##VAR_TYPE=  INDEPENDENT,   DEPENDENT,       DEPENDENT
##VAR_FORM=  AFFN,          ASDF,            ASDF
##VAR_DIM=   32768,         32768,           32768
##UNITS=     HZ,            ARBITRARY UNITS, ARBITRARY UNITS
##FACTOR=    0.250966925370066, 1,           1
##FIRST=     8223.43324360094, 354958,       -62215
##LAST=      0,             56787,           56356
##MIN=       0,             -727754,         0
##MAX=       8223.43324360094, 466519806,    0
$$ Real data points
##PAGE= N=1
##DATA TABLE= (X++(R..R)), XYDATA
$$ [...]
19533d3633q9855K2987m9197k9147c021l42811J17872d2893B60781b76043g0483
19521E7840e9310a4178A4827a9025D3537c0715B23894A0235b08599p4425j1135
19510b94159A28742h3169A87931b92970D3118d9837q6086A7209J40056f1160p0475
19499a31635A22413k4424a41797B1390Q3348a11720k25096a21950B983a38182
19488a21579j19897A45447a1065l79123e5111j50096B740J3091d31664B9686K19730
19477B49416h8797k61056a04643K0558L8151n5549l1272B05458n6614O3081d8826
19465A09182J28537a86946A81259a55367j16162P7518j93400A29705F3702b49777
19454a2264A06526b97695f342E6652J5380a51075j27364G7603a3037j56689f1581
$$ y = [-43633, -133488, -110501, -159698, -188845, -3021, -345832, -227960, -42893, 260781, -276043, -70483, 57840, -59310, -14178, 14827, -19025, 43537, -30715, 223894, 10235, -208599, -283024, -294159, 128742, -83169, 187931, -292970, 43118, -49837, -135923, 17209, 157265, -61160, -131635, 122413, 97989, -141797, 21390, 104738, -111720, -336816, -121950, 2983, -138182, -121579, -241476, 145447, -11065, -390188, -55111, -205207, 2740, 15831, -431664, 29686, 249416, -88797, -349853, -104643, -84085, -45934, -101483, -132755, 205458, 148844, 211925, -48826, 109182, 237719, -186946, 181259, -155367, -271529, -194011, -387411, 129705, 63702, -249777, -12264, 106526, -297695, -6342, 56652, 72032, -151075, -278439, 77603, -13037, -169726, -61581]
19442A48333d0181j98308n0570J25751A1810c9664A50698J37998b55066I2711
19431c30829F8305a99086I9550c75397I4070g4866j17857e9584P759B91581d4012
19419a09882A07207a76669l9336A7944p697O2622a92171h0639j22296G3459c71541
19407b24814P25R3296J7536C8565a8044k27872J14229L2400n4094F3188a39234
19395F2917b55134A95774a38566O3083H4294K8722h5711j16621A35389b00508
19384a7618j65210l4167Q8498k26759G5468i322A55619M6604A4352a22369D5225
19372a16860C8429b91723A55721B626J87316a80936H8312h5514j87993D7271a42287
19360B14771f30504K53228e1276A02443j4208d09050g4005G9290d2813j4363r795
$$ y = [148333, -40181, -238489, -289059, -163308, 11810, -39664, 150698, 288696, -255066, 92711, -330829, 68305, -199086, 99550, -375397, 94070, -74866, -192723, -59584, -51825, 291581, -44012, -109882, 107207, -176669, -216005, 17944, 10247, 72869, -192171, -80639, -202935, 73459, -371541, -224814, -224089, -130793, -113257, 38565, -18044, -245916, -131687, -99287, -153381, 63188, -139234, 62917, -255134, 195774, -138566, -75483, 84294, 113016, -85711, -202332, 135389, -200508, -17618, -182828, -216995, -128497, -355256, 75468, -9322, 155619, 202223, 14352, -122369, 45225, -116860, 38429, -291723, 155721, 2626, 189942, -180936, 88312, -85514, -273507, 47271, -142287, 214771, -630504, -377276, -51276, 102443, 88235, -409050, -74005, 79290, -42813, -57176, -66971]
19349f6971j77072B89915A01061k3950d30900q3235c5367G7469J55997b13687
19338B69762i8596j29367J9790G9687b87856B58373a19996e035F2004b23756a1637
19326A28330H657a5549l9364l10597A4854f3472q6647A00715F316J15398a43712
19314a97933D0162a0343j46482C82748F4435q505O9454a37273A58933g422A37304
19302H0400b76365A974J45010p0994K08352a82573g8761r7973H3581b9785j25279
19291a55064e4526K0656r5163a036k04768l8998a02654l32236B9751b12763c5218
19279c81848R7455J26814G6081b70466f5654D1201O049J64551a48609B03269G1708
19267B62077b76721a27009j02086g7368j58387A19396g2518A31968k2778f9448
$$ y = [-66971, -244043, 289915, 101061, 77111, -430900, -514135, -35367, 77469, 233466, -213687, 269762, -98596, -227963, -208173, 79687, -287856, 258373, -119996, -5035, 62004, -223756, -11637, 128330, 8657, -15549, -54913, -365510, 14854, -63472, -150119, 100715, 6316, 121714, -143712, -197933, 40162, -10343, -156825, 382748, 64435, 55930, 125384, -137273, 158933, -7422, 137304, 80400, -276365, 1974, 146984, 75990, 284342, -182573, -78761, -176734, 83581, -29785, -155064, -54526, -33870, -129033, -1036, -205804, -244802, -102654, -434890, 29751, -212763, -35218, -381848, -284393, -157579, 76081, -270466, -65654, 41201, 47250, 211801, -148609, 203269, 71708, 262077, -276721, -127009, -229095, -77368, -235755, 119396, -72518, 131968, 109190, -69448]
19256B21777K0418a36580k51413J59673L6924A11781J71784B9504c02167C00679
19245b19824b6243j14322N608I0315b02635f2997A0753K10115F030a39635e6041
19233b44862a21174j09370O2916j6841l1756M823A11701B052O9830c23815A72645
19221b49410a02073C01962j12212q2912A0422J43197K9252c2722r6584f999j5273
19210b2272r7951A40217J41999b94032A61414F329c64579a21698H4142h3737l13476
19199c97213a27934H7332b83773P3554D6904L13270a03551k22805A4146a05631
19188I2851b65875F0599i1807o2961A18344b39611c4591o5832A98539b86818A55312
19176h2673r7518n3640a08481K8270I2184d43313a664k78073f5927a376l43848
$$ y = [221777, 242195, -136580, -387993, -228320, -191396, 111781, 283565, 29504, -302167, 300679, -219824, -26243, -140565, -134957, 90315, -202635, -62997, 10753, 220868, 6030, -139635, -56041, -244862, -121174, -230544, -167628, -184469, -216225, -211402, 111701, 2052, 71882, -323815, 172645, -249410, -102073, 301962, 189750, 106838, 10422, 153619, 182871, -32722, -129306, -6999, -22272, -120223, 140217, 282216, -294032, 161414, 6329, -364579, -121698, 84142, -83737, -397213, -127934, 87332, -283773, -210219, 46904, 360174, -103551, -326356, 14146, -105631, 92851, -265875, 60599, -91807, -154768, 118344, -239611, -34591, -100423, 198539, -286818, 155312, -82673, -180191, -233831, -108481, -80211, 92184, -443313, -1664, -279737, -65927, -1376, -345224]
19165c45224a70199e6620j05375M2515N3069o5719B8278R0174a21984n2948J9232
19154a55700j0368f968A80198E3691c20829d8858k0527j27076D4849a71043B21052
19142d59442d5381l05970J68214d4670j91836E411J54411a6016E359J28254d9895
19130A54898c210F850J05219a1938C31955g1566j34772n136h0453D2961b02589
19118A22812d02286a60390b1590A53655A4611a02020A8275O4119J94673b7262
19107i5745o1721F5494K23297a21002l5352n348r2860A38591a02969C38157g3448
19095c8607j05801F8183a78297e3635J690l50473a53932C3297i0250b7470j3449
19084d0919f117k56134J01976B4658K1121c47292E7854a43881j27929M9982P0040
$$ y = [-345224, -170199, -56620, -161995, -119480, -66411, -132130, 28278, 118452, -121984, -174932, -155700, -166068, -6968, 180198, 53691, -320829, -48858, -69385, -196461, 44849, -171043, 221052, -459442, -45381, -351351, -183137, -44670, -236506, 5411, 159822, -16016, 5359, 133613, -49895, 154898, -3210, 6850, 112069, -11938, 331955, -71566, -206338, -211474, -80453, 42961, -202589, 122812, -402286, -160390, -21590, 153655, 14611, -102020, 18275, 82394, 277067, -27262, -95745, -157466, 65494, 288791, -121002, -156354, -161702, -254562, 138591, -102969, 338157, -73448, -38607, -144408, 68183, -178297, -53635, -51945, -402418, -153932, 33297, -90250, -27470, -40919, -6117, -262251, -160275, 24658, 45779, -347292, 57854, -143881, -271810, -221828, -151788]
19073a51788f0896A8036L48050j25291e1037l2942j89475e226j42413o878L7197
19062a17320A26664n4380b91067g4373k38156g5014I567R3024b59109C2228a24940
19050i8332A19864N101C7304H470a83635A95503b9326o9650L0822p1763n4378
19039a94295C7263j5413b70006A41020l6752J85931G1207K25620A20738a2635
19028g555n2349C30353P8906i9663a0622p8531j18118B37653c53720Q3084A53826
19016b81022a39091E1593b63245B0563J48264a06733P480k6589B71613a99010
19005a70658A9402m150F115b58631R1373B87045A0937a08637c9893A04818K09815
18994C14633b1619p8689r3391B34037a30867K8206n5034O6949E1290J9566e6815
$$ y = [-151788, -60896, 18036, 366086, 240795, -51037, -83979, -273454, -5226, -147639, -154517, -117320, 126664, 72284, -291067, -74373, -312529, -75014, 9567, 102591, -259109, 32228, -124940, -98332, 119864, 124965, 37304, 8470, -183635, 195503, -29326, -98976, -68154, -139917, -194295, 37263, 21850, -270006, 141020, 104268, 290199, 71207, 296827, 120738, -12635, -7555, -59904, 330353, 409259, -99663, -10622, -89153, -207271, 237653, -353720, -270636, 153826, -281022, -139091, 51593, -263245, 20563, 168827, -106733, -99253, -125842, 271613, -199010, -170658, 19402, 15252, 6115, -258631, -167258, 287045, 10937, -108637, -39893, 104818, 314633, -21619, -100308, -193699, 234037, -130867, -102661, -157695, -90746, 51290, 70856, -56815]
18982A24971C4944a20892n7920H8926J8336f8450k2297m9735A62896E9224a29343
18970b4017j10202f3599l6945D4622b20114p0907J25757A40085a17473j4199M4210
18959h7462j27587A40219D1347g7799A47323P4288a76221b6468j51366A3247a05417
18947a38273c3184l82525L956a10213q2405C20405J79748I526d5983A83148e1416
18935a97405L0838B90979a9381l96450D56571A99302E195h3124F193M7949h0908
18923e0434g706A07359i5273k04537A33292a79919k01326H3668d3964k29636B8518
18911a68380K6069E0068d8254k30137R6317j06988a40201a0463m37644a05378
18900c87715a88648j22629g2571j94938J29704r7883B15673a09444F4210f284
$$ y = [124971, 34944, -120892, -178812, 88926, 107262, -68450, -90747, -140482, 162896, 59224, -129343, -24017, -134219, -63599, -100544, 44622, -220114, -291021, -165264, 140085, -117473, -131672, -87462, -215049, 140219, 41347, -77799, 147323, 221611, -176221, -26468, -177834, 13247, -105417, -138273, -33184, -415709, -411753, -110213, -192618, 320405, 500153, 9526, -45983, 183148, -51416, -197405, -166567, 290979, -19381, -415831, 456571, 199302, 5195, -83124, 6193, 54142, -80908, -50434, -7706, 107359, -95273, -299810, 133292, -179919, -381245, 83668, -43964, -273600, 28518, -168380, -142311, 50068, -48254, -278391, -182074, -289062, -140201, -10463, -448107, -105378, -387715, -188648, -311277, -72571, -267509, -137805, -235688, 215673, -109444, 64210, -6284]
18889d1864B56429m1762j952m8596c65000J39878Q4973a485l1691j48589Q8190
18878i3575G7496K74573C0474h5029j59330D1646J88800r0363b33269I102a8120
18866b24322f4107k20958N0373A22537n1188J7057M1881b1850n1022C7131b2666
18854a60303H1315j4053D504a84798B19644a02409B63970e43B62193D1734d2959
18842h5025n3186B63375c26457a08439M5485j72336j44959B35775d9803a8504
18831b4926B40634b71338D989b10703N9245C03726B23c25740a14145j46147J18990
18820a41302A60609J41694P4762f852B51848R9283E4885K08680D0197L05321K3022
18809C68540a21489A0113b25772e7690H0832b724H1463a55669H1612R317a37122
$$ y = [-41864, 256429, 214667, 212715, 164119, -365000, -225122, -140149, -1485, -33176, -181765, -93575, 77496, 352069, 30474, -85029, -244359, 41646, 230446, 140083, -233269, 9102, -18120, -224322, -64107, -285065, -234692, 122537, 71349, 88406, 130287, -21850, -72872, 37131, -22666, -160303, 81315, 67262, 4504, -184798, 219644, -102409, 263970, -543, 262193, 41734, -42959, -85025, -138211, 263375, -326457, -108439, -62954, -235290, -380249, 235775, -49803, -18504, -24926, 240634, -271338, 4989, -210703, -151458, 303726, 223, -325740, -114145, -260292, -141302, 160609, 302303, 377065, -6852, 251848, 351131, 54885, 263565, 40197, 345518, 368540, -121489, 10113, -225772, -57690, 80832, -2724, 81463, -155669, 81612, 90929, -137122]
18797H510a42990n5533M5393b644n07316B06475a30038j05645Q0776A21832a9498
18785a64195C19895a78205N9318A84109g0430k22243B56346A5200L34367E3521
18774c02359C1242K5654e9651K9631A10494a60298A89515a2727H5222B8167b42191
18762b11799c2250H9505a2100l6540k55078l9218J351a213j49053k19718a76859
18750c6812D9222b24151f7207A82224i1625k66278D9282b33828J15165p5924G9071
18738c0802k9045j3426j76354r6081B1601a34097f1507j25592j45545D17588A7402
18726A03991m090c77481A81948J98066a19377b9432l43187B1676b50981E6912
18715C06874a06340c5699C3474b05423M2990O7575B10513b997k62809g7537j96471
$$ y = [8510, -142990, -198523, -153130, -2644, -509960, 206475, -130038, -235683, -154907, 121832, -19498, -164195, 319895, -178205, -118887, 184109, -70430, -292673, 256346, 15200, 349567, 53521, -302359, 31242, 56896, -59651, -30020, 110494, -160298, 189515, -12727, 85222, 28167, -242191, -211799, -32250, 89505, -12100, -48640, -303718, -342936, -341585, -1213, -150266, -369984, -176859, -36812, 49222, -224151, -67207, 182224, -91625, -357903, 49282, -233828, -118663, -194587, 79071, -30802, -59847, -73273, -249627, -345708, 21601, -134097, -61507, -187099, -332644, 417588, 17402, 103991, 99901, -377481, 181948, 380014, -119377, -29432, -372619, 21676, -250981, 56912, 306874, -106340, -35699, 33474, -205423, -162433, -94858, 210513, -2997, -265806, -77537, -274008]
18704b74008e4538K3791p6256j2231A42628l6446a5395l9862H3110A3635Q1047
18693I4682a85670A39211g1319B99695c29573a7856k14565l7614A96556D1766
18682c28084A39958b14143K2847j48970Q131R4818b9113k58545c8624j43449h246
18670f7511l0492A65206n7663j5429b1050B41342C9474a36929c4781E4090J74391
18659B28481i45E7180J74452c5827H4388J62817J16585b3546l2011G7310g4512
18647g1959p8295c4894p4191B0607J8236h7532B38842a12618a1823j76219D0088
18635b47765h1978c0262A29122L8418d6641j92328M878N0327q3326C9696f0375
18623A88665e23571a24783A54491a8011k07747B51063c13465H7569J26296K8178
$$ y = [-274008, -54538, -30747, -107003, -119234, 142628, 106182, -15395, -55257, 83110, 13635, 94682, -185670, 139211, -71319, 299695, -329573, -17856, -232421, -270035, 196556, 41766, -328084, 139958, -214143, -191296, -340266, -332135, -237317, -29113, -287658, -38624, -182073, -8246, -67511, -98003, 165206, 107543, 92114, -21050, 241342, 39474, -136929, -34781, 54090, 228481, -945, 57180, 231632, -35827, 84388, 247205, 363790, -23546, -55557, 77310, -74512, -71959, -150254, -34894, -109085, 20607, 38843, -87532, 238842, -112618, -11823, -188042, 40088, -247765, -81978, -30262, 129122, 167540, -46641, -238969, -234091, -183764, -267090, 39696, -60375, 188665, -523571, -124783, 154491, -18011, -225758, 251063, -313465, 87569, 213865, 242043]
18613B42043e6518A27352n9238a65024j9093r5692h8632j95162L1942a09156q7161
18602a96317h968q0597E9593k20B3760i433j05034r8605e3415A88439b19047g0732
18589e06468a92794K2717L3872L8376J0581k81511e3364H0974K79304f0923A72287
18577c70006J46411h8581A28165m8519a88510K9604d4250a4860k26828e5257B4029
18565c20968d5637j30044j05715a19350j32709g4282l35301H086J4960J07120
18555A30166b31407B74574F5952k0219b92499a30154B04349B9045a87720F9189
18544a92659f8517k76083a2208B72598b60499B9570b04050I4995a33286n0561
18534a83847J8767k69418a95934E8410h599j34799F4587q8b96503G2727c26802
$$ y = [242043, -56518, 127352, 68114, -165024, -184117, -279809, -88632, -283794, -251852, -109156, -196317, -8968, -89565, 59593, 59373, 23760, -9433, -114467, -213072, -53415, 188439, -219047, -70732, -506468, -192794, -170077, -136205, -97829, -87248, -368759, -53364, 80974, 360278, -60923, 172287, -370006, -223595, -88581, 128165, 79646, -188510, -158906, -44250, -14860, -241688, -55257, 24029, -320968, -45637, -175681, -281396, -119350, -252059, -74282, -409583, 8086, 23046, 130166, -231407, 274574, 65952, 45733, -292499, -130154, 204349, 29045, -187720, 69189, -192659, -68517, -344600, -12208, 272598, -260499, 29570, -204050, 94995, -133286, -183847, -165080, -434498, -195934, 58410, -8599, -143398, 64587, 64499, -296503, 72727, -326802]
18522a05860q3441K6074e571B57520B7306h0577J1443B61973c1493j28324B46717
18510d3922j89951q6748A0833a89024B59009a26485B0294a53980b6285A8846c2901
18498d934n3082k06707O1976C493a09413C5507K3048c41663A18190a10463G6206
18486D2574b71993A79492C6630K16478H2254O0139G1092J96246a0485k08040E5802
18474A48379R1935h1258o4371B16830k7459a12064A45744a27550j24065J05520
18464a46095l6228A81076a93957L9029K4222k32644O3574A50790K4824J31653
18454C07267C8360a44246d7627j79010M2475a3385j09919j84054k3766J02538
18444b28586B03188c65835d5865a6755A29736a7178G7472a39580B72023m9238
$$ y = [-105860, -189301, -163227, -5571, 257520, 27306, -80577, -69134, 261973, -31493, -159817, 246717, -43922, -233873, -320621, 10833, -189024, 259009, -126485, 20294, -153980, -26285, 18846, -32901, -4934, -58016, -264723, -202747, 3493, -109413, 35507, 58555, -341663, 118190, -110463, 76206, 42574, -271993, 179492, 36630, 253108, 82254, 142393, 71092, 267338, -10485, -218525, 55802, 148379, 240314, -81258, -145629, 216830, 189371, -112064, 145744, -127550, -251615, -146095, -182323, 181076, -193957, -154928, -130706, -363350, -299776, 150790, 175614, 307267, 38360, -144246, -47627, -226637, -184162, -13385, -123304, -307358, -331124, -228586, 203188, -365835, -45865, -16755, 129736, -17178, 77472, -139580, 272023, 222785]
18434B22785d6849j76669P635A05615a03195E0555j5757R1301c45649i2567j05876
18423a98443q0461A84137G3135b92589I3112k5974L96943a87899B65868i8635
18412a44270j33282R9647j68849g8157E7439a81077e0887A99218g5314a7384D4248
18400B3291d7622k32788f1488a0342j92188D11148A39105J88193B8321J06517
18390A34838d3797j48396C7095a41305C5877d2831A82164a55539L1866A17322
18379i1492B16455a1505j07751L3678J5973k6574k5863K2283I1969m1800a00501
18367C1546a75772c8117B50987a16539K6630n6102j47507C7670K73232A15132
18356b65581A22929R1522c20851g2921A35114c4120k97813h2306J2128C4868i9350
$$ y = [222785, -46849, -223518, -215883, 105615, -103195, 50555, 34798, 126099, -345649, -92567, -198443, -278904, 184137, 73135, -292589, 93112, 67138, 464081, -187899, 265868, -98635, -144270, -277552, -177905, -346754, -78157, 57439, -181077, -50887, 199218, -75314, -17384, 44248, 23291, -47622, -280410, -61488, -10342, -202530, 411148, 139105, 327298, 28321, 134838, -43797, -192193, 37095, -141305, 35877, -42831, 182164, -155539, -123673, 117322, -91492, 216455, -11505, -119256, -85578, -69605, -96179, -122042, -99759, 91969, 50169, -100501, 31546, -175772, -38117, 250987, -116539, -89909, -146011, -293518, 37670, 310902, 115132, -265581, 122929, 214451, -320851, -72921, 135114, -34120, -331933, -82306, -70178, 34868, -99350]
18344B24023a4685B09521r9463C6409b4681j18554N9517j32231B7474a00544n7931
18333a58475J0331b6716j70321l7304P2454A84558b74164h9108A97749J7272g3572
18321h2322J0129A51678k7622b00763p1468A62142c08354g2220b0440A58937a51908
18309i985I4442c78822J78048k2941G6506a42602A42841J45283I4892J66853a53464
18297a57656I3993d11899a42933G4540b96598O7939B6001J6771a33824F7450k8676
18286C8774e8431m8246E7123b39351c3972j25239H2974N9478i7449k6286A40073
18274a97610I8882a87004K6196r2729F2389i7696p935A98654a6219E815e302j37503
18262a42805A36222B1668a67234H9656c1037m4214B11544a94839j6465C3359b51526
$$ y = [224023, -14685, 209521, 110058, 36409, -24681, -143235, -83718, -215949, 27474, -100544, -158475, -148144, -26716, -197037, -234341, -161887, 184558, -274164, -89108, 197749, 215021, -73572, -82322, -72193, 151678, 124056, -200763, -272231, 162142, -308354, -72220, -20440, 158937, -151908, -9985, 94442, -378822, -200774, -223715, 76506, -142602, 142841, 288124, 94892, 261745, -153464, -157656, 93993, -411899, -142933, 74540, -296598, -228659, 26001, 42772, -133824, 67450, 38774, -58431, -106677, 57123, -239351, -33972, -159211, 82974, 142452, -97449, -123735, 140073, -197610, 98882, -187004, -160808, -253537, 62389, -97696, -105631, 198654, -16219, 5815, -5302, -142805, 136222, 21668, -167234, 89656, -31037, -75251, 211544, -194839, -211304, 33359, -251526]
18250A08231i3014A4391d4965j56964A38798b90827G7068b52513l33135h6212
18239C66976b63289e8412F2265a08087q1436j74323i5407j88314g6300j76166
18229b52466A13340i4247J9906K7476l253j56018j41839a06606J4948k5184c7799
18217F5761K3597i0974C655f3858m3475B7271J00824i2565H6337K2189a94785
18205c0919a1044D931b8809B11262j9375e41202A01550a12929d3754E9217J19739
18194A78956f7125l4091j55835a14212G406a17030j34898F3891p210L2445d2320
18182A52586c08170D36530I3546a06341G0954Q9333J5981H2081k4760K78371r0241
18171B45451d885n6826j68108A21702E7136J21786N2893F0132b65009d8538B66104
$$ y = [108231, -93014, 14391, -44965, -201929, 138798, -290827, 77068, -252513, -585648, -86212, 366976, -263289, -58412, 62265, -108087, -189523, -363846, -95407, -283721, -76300, -252466, 113340, -94247, -74341, -46865, -50118, -206136, -347975, -106606, -91658, -116842, -37799, 65761, 89358, -90974, 3655, -63858, -107333, 27271, 128095, -92565, 86337, 108526, -194785, -30919, -11044, 4931, -28809, 211262, 191887, -541202, 101550, -112929, -43754, 59217, 178956, -67125, -101216, -257051, -114212, 7406, -117030, -251928, 63891, 56681, 89126, -42320, 152586, -308170, 436530, 93546, -106341, 70954, 160287, 176268, 82081, 57321, 335692, 245451, -4885, -61711, -229819, 121702, 57136, 178922, 231815, 60132, -265009, -48538, 266104]
18159f4842B41494C0880M8853J56898J22174b92834G6263J6494B251d23325f7010
18147c26979J52801B9157J59051b5491n23358B5383a71101h0921A6772c04368
18136b14939l14149K41839c7657K615a3892j16413A42497E9241J47110A5136K26052
18125B41188h2609n5685N6177j12868C0591a6631j40649O1561m7373b1543r9757
18114a21300l3195D776b3442B06551E964d5423j1710A29199b44709A41378a72224
18102D3889h6022B12525c03331J30708B38425c17403D3108c1400g278A11253J40672
18091B51925b2085m037G2141a4911l22078B95149q6751R5767I3872B1095J74084
18080A95179b82739D6917a56347A1798a27760k65119e3703j14609q9114d9165
$$ y = [-64842, 241494, 30880, 79733, 236631, 358805, -292834, 76263, 92757, 2251, -423325, -67010, -326979, -174178, 29157, 188208, -25491, -548849, 25383, -171101, -80921, 16772, -304368, -214939, -529088, -287249, -37657, -35042, -13892, -130305, 142497, 59241, 206351, 15136, 241188, -82609, -138294, -82117, -194985, 30591, -16631, -157280, -95719, -143092, -21543, -121300, -154495, 4776, -23442, 206551, 5964, -45423, -57133, 129199, -244709, 141378, -172224, 43889, -86022, 212525, -303331, -172623, 238425, -317403, 43108, -31400, -7278, 111253, 251925, -22085, -26122, 72141, -14911, -336989, 295149, 208398, 304165, 93872, 21095, 195179, -282739, 46917, -156347, 11798, -127760, -392879, -53703, -168312, -257426, -49165]
18069f1770A28613a91921l0527C1845b6300I8833j8526a77951n9083h8256F6671
18057b87932h8689r9896O7303j95488N1163B14991a91897j28182A70974f6289
18046a63819C8425J6239J32181b9187g886B45295a16045B58523a47353b6111j52182
18035a78293k32345a13823j29150P2285g0406q6359L6190D3739g3427A43471J53376
18024B96847c7841A2451K01285a34094b7430j9134G1780K13233p2228b44726E2517
18012a58283A25779j5962b2752j03298n2845h1003H5544b82317G8546K23405F7817
18000B26574K50060A71026F1928J00788c42440I4435J11526m113a40699K1703
17990a18996N3730J5036r9916f4999j06965f6995E1289J77889a49393A923f8003
$$ y = [-61770, 128613, -191921, -222448, 31845, -26300, 98833, 80307, -177951, -237034, -88256, 66671, -287932, -88689, -188585, -121282, -316770, -265607, 214991, -191897, -320079, 170974, -66289, -163819, 38425, 54664, 186845, -29187, -7886, 245295, -116045, 258523, -147353, -26111, -178293, -410638, -113823, -242973, -170688, -70406, -156765, -120575, 43739, -73427, 143471, 296847, -37841, 12451, 213736, -134094, -27430, -46564, 71780, 285013, 212785, -244726, 52517, -158283, 125779, 109817, -22752, -126050, -178895, -81003, 85544, -282317, 78546, 301951, 67817, 226574, 476634, 171026, 61928, 162716, -342440, 94435, 205961, 201848, -140699, -118996, -65266, -50230, -150146, -64999, -171964, -66995, 51289, 229178, -149393, 1923, -68003]
17978A05365a57103B76703B3689J8641a16808D14267k04600C8368a22636n4582
17968a77218o9223e4501a7670A02635h2918o9607k62441f3627B3776f3281a8695
17956A04804c05034i5660k38140k8681A29818e764k7344E1222A9412I373d49867
17944d5989q7131I8651J00850O9793F1779R5179n0432Q2458A8213q722b8393j3246
17932d1639H9448a6845A17679b25323h5352J5094L3829A5620l819K77499a02547
17920b1325m3898A24029b65889h9785m7277a4354E6023b30581B0811n881K9266
17909D4196N7937D332Q9329d1685o813C69935G8061l554a08277k06732D4741g3646
17896b26287C99190b00810F4198f689q4408B06584d2268j21486g612j67637o7349
$$ y = [105365, -157103, 276703, 23689, 42330, -116808, 414267, 209667, 38368, -122636, -177218, -246441, -54501, -17670, 102635, -82918, -152525, -414966, -63627, 23776, -63281, -18695, 104804, -305034, -95660, -333800, -362481, 129818, -5764, -33108, 51222, 19412, 9373, -449867, -45989, -133120, 98651, 199501, 269294, 61779, 156958, 106526, 188984, 18213, 9491, -28393, -41639, 89448, -16845, 117679, -225323, -85352, -70258, -36429, 15620, 11801, 289300, -102547, -21325, -65223, 124029, -265889, -89785, -137062, -14354, 56023, -230581, 20811, 14930, 44196, 102133, 4332, 93661, -41685, -48498, 369935, 78061, 74507, -108277, -315009, 44741, -73646, -226287, 399190, -200810, 64198, -6689, -91097, 206584, -42268, -163754, -7612, -175249, -242598]
17885b42598O9593F8128a39520k06554B25237j0938C8252p512N4808a78512P6096
17874a02416B05444l7587l6555b50730J08140A27152R7409c97163C39299E1959
17863D717b4612l3687b7282l3672A8868J49553D4386i7597A02333A9526b5192
17851a41748i66j80667k8686b3096B88456a12168L4530A77320M4566a11996J0893
17840a01103G0388d7200r1289G0389d23596G8182K4975c10436E0718b27342A02061
17828A39626O6981b12539H3073a75112B02434c32238I2821b35862g3563I5085
17817h8277B89056A7102O964a5737l10767A32302J06211n3985C8841c059j06991
17806a10050B26243a19970C22093a85373b9813p2266A59734n442K0600D1842O4827
$$ y = [-242598, -173005, 68128, -139520, -346074, 225237, 214299, 38252, 30740, 85548, -178512, -102416, 205444, 167857, 131302, -250730, -142590, 127152, 224561, -397163, 339299, 51959, 4717, -24612, -58299, -27282, -60954, 18868, 168421, 44386, -97597, 102333, 19526, -25192, -141748, -966, -181633, -210319, -23096, 288456, -112168, -77638, 177320, 221886, -111996, -101103, 70388, -47200, -138489, 70389, -423596, 78182, 103157, -310436, 50718, -227342, 102061, 139626, 206607, -212539, 83073, -175112, 202434, -332238, 92821, -235862, -73563, 95085, -88277, 289056, 17102, 24066, -15737, -326504, 132302, 238513, 184528, 38841, -3059, -110050, 226243, -119970, 322093, -185373, -29813, -102079, 159734, 154292, 174892, 41842, 106669]
17795A06669F510J65479d7194C0660c1570j17802L7408E5924J79141D2405J92374
17784B34779j07550g6876C5166d7442A74293m2033h967q6070A09540a51578D4971
17772a83631A45790f2738K3813k63364Q6310A97709r2378m9857b27293j63094
17762c90387D8573c02774J20881D0018c6593A04728E2135c4095A85847b403H9354
17750i8721J2472F0503J49849a59582e5688n7607E14395a3004B32750b96297c995
17738i6794B18089b26260Q4513A76096a66830P7370F4399B722c51157h3378A8018
17726d09234a5460A62167a08580e3729A0769M2459A0409J40265i3106k2846I3541
17714a12211A2306f0752B0273J07431n7004N3930P760E7398A6670b33752B98460
$$ y = [106669, 6510, 171989, -47194, 30660, -31570, -149372, -111964, 55924, 235065, 42405, 234779, 127229, -76876, 35166, -47442, 174293, 132260, -8967, -95037, 109540, -151578, 44971, -183631, 145790, -62738, -38925, -302289, -215979, 197709, 105331, 55474, -227293, -390387, 48573, -302774, -181893, 40018, -36593, 104728, 52135, -34095, 185847, -2403, 89354, -98721, -86249, 60503, 210352, -159582, -55688, -113295, 514395, -13004, 232750, -296297, -3995, -96794, 218089, -226260, -141747, 176096, -166830, -89460, 64399, 2722, -351157, -83378, 18018, -409234, -15460, 162167, -108580, -53729, 10769, 53228, 10409, 150674, -93106, -115952, 93541, -112211, 12306, -60752, 20273, 127704, 70700, 124630, 132390, 57398, 16670, -233752, 298460]
17702H0755e4094R857B2121a54307B4978i5779j2343D2992J16548G6263e23969
17690A66175b25947e6059A41908b9199A36801O7997k3063n5074l0672J02049l3141
17679A64897D4788J19227C0318h7204A94675j5459f8343B34865d3175C72239J9387
17668C91626c94739J92241b6273l2188B60942G6626b37826A47283D4876D707J12540
17657A17247n0484c0731A70580a48583C7235Q942R5659K0462i1216b128C78909
17645a36549c5313j67462L4168k32777c3542l00073B17609q857H8752c6132l59184
17634c95316a56108B7919M3448L0994e4014C8334A5656J33144b16621a03044B54763
17622e2005G4633R4255F8943a03200r0570B80620G0468f5579E33155G4740l995
$$ y = [80755, -54094, -44237, 22121, -154307, 24978, -95779, -108122, 42992, 159540, 76263, -523969, 166175, -225947, -56059, 141908, -29199, 136801, 204798, 181735, 126661, 95989, 198038, 164897, 44788, 164015, 30318, -87204, 194675, 179216, -68343, 234865, -43175, 372239, 391626, -394739, -202498, -26273, -58461, 260942, 76626, -237826, 147283, 44876, 4707, 117247, 66763, -30731, 170580, -148583, 37235, 46177, 141836, 162298, -91216, -2128, 378909, -136549, -35313, -202775, -168607, -401384, -33542, -333615, 217609, 208752, 88752, -36132, -395316, -156108, 27919, 71367, 102361, -54014, 38334, 15656, 148800, -216621, -103044, 254763, -52005, 74633, 168888, 68943, -103200, -193770, 280620, 70468, -65579, 533155, 74740, 70745]
17611G0745a14609E8073b813j23078p2141F6154B1228c4080A95139q6551j4205
17600I4383a23604A50287a6739q8279p93G6510e5564m5935C58226A07258D2917
17588D2500a78573B60862N285r740c7136A56160a62340B5933K90127c1957F6616
17576A85024e0408B26451b23737A47567B8888J08928J3449E2885b086D4189e4767
17564F142J43439a05289A97927G2811K6829K59086C1342J9871d263E5923a35453
17552A41759J9085e561A19050m7529K9956O0660c3901P33C95971j12606C0861
17540I8234m0859g7777D9714A7094R8633J52087b5508C11285f3095C90239j86006
17529B04233i0107b6847j1138J691k9066p0325A32749R2646b9144B34607a88358
$$ y = [70745, -114609, 58073, -2813, -125891, -198032, 66154, 21228, -34080, 195139, 108588, 94383, -123604, 150287, -16739, -105018, -105811, 76510, -55564, -101499, 358226, 107258, 42917, 42500, -178573, 260862, 266147, 256407, -37136, 156160, -162340, 25933, 316060, -31957, 66616, 185024, -50408, 226451, -223737, 147567, 28888, 137816, 151265, 52885, -2086, 44189, -54767, 6142, 149581, -105289, 197927, 72811, 99640, 358726, 31342, 51213, -4263, 55923, -135453, 141759, 160844, -5561, 119050, 71521, 101477, 162137, -33901, -33168, 395971, 283365, 30861, 98234, 57375, -77777, 49714, 17094, 115727, 267814, -25508, 311285, -63095, 390239, 204233, -90107, -26847, -37985, -36294, -65360, -135685, 132749, 225395, -29144, 234607, -188358]
17517B62841a23771C3043N0736f8869B6641K17824H1835a55671g2951C0590e302
17505B42328i5661L7902A62769K44954l7066a07622E2554a06409k09918C65079
17494D75737A80114D3455a14697B58801H5516f6847C19855b2970j12309O0937
17484g4342j8123J9694k19191J26489A00265l2605A3553f20B58248J43169A73138
17472B24855C8542J50684p3077K70304j33843d86925A46409e57880A64840a5129
17461a50321D09218a86270B00774N3266M3835K1741j02695J07679A62021J93590
17451C55611A48032J60838p2001o2538r825j1922M16183a91364C29258I3837L66064
17440D59901B08674e2719B86262J32936j40285r80A36965P6063h061B02706r7279
$$ y = [262841, -123771, 33043, 83779, -68869, 26641, 244465, 81835, -155671, -72951, 30590, -5302, 242328, -95661, -57759, 162769, 407723, 370657, -107622, 52554, -106409, -316327, 365079, 475737, 180114, 43455, -114697, 258801, 85516, -66847, 319855, -22970, -135279, -74342, -92465, -72771, -291962, -165473, 100265, 67660, 13553, -620, 258248, 401417, 173138, 224855, 38542, 189226, 116149, 386453, 252610, -486925, 146409, -557880, 164840, -15129, -150321, 409218, -186270, 200774, 254040, 297875, 319616, 216921, 324600, 162021, 355611, 148032, 308870, 236869, 174331, 164506, 152584, 568767, -191364, 329258, 93837, 459901, 208674, -52719, 286262, 419198, 278913, 277933, 136965, 213028, -8061, 202706, 105427]
17429A05427P8608M34996A73934J74233j62767J30021E5054R8823l7470K68138
17419C84545A60214D3748L51583j90916K56504R2493B33598E4557O046L8612a39821
17407B17260o9606D1300a2485G5336J974A251J19030b0022j73884A55336a05860
17395A33102b96503D8461J66599o1815F4475i4127m4024C99571R5238A6486K24819
17384B41305a62491D96845k26304A01895c38883a42150B86253j5512j6962g9095
17373B15359L04775B42112J16786A10281M270J3447J12807K303b3451D5955M9267
17362I5222J44094C8570d3779e09B49936j11900n6741K13499n5699a39610l042
17351a42652H5243J82745G9807J11504N4128m8710C679K62963e366k32072a777
$$ y = [105427, 184035, 619031, 173934, 348167, 185400, 315421, 55054, 153877, 116407, 384545, 160214, 43748, 395331, 204415, 460919, 553412, 233598, 54557, 60603, 99215, -139821, 217260, 147654, 41300, -12485, 75336, 77310, 1251, 120281, -20022, -193906, 155336, -105860, 133102, -296503, 48461, 215060, 153245, 64475, -94127, -138151, 399571, 494809, 16486, 241305, -162491, 496845, 270541, 101895, -338883, -142150, 286253, 270741, 253779, -79095, 215359, 520134, 242112, 358898, 110281, 114551, 127998, 240805, 243108, -23451, 45955, 95222, 239316, 38570, -43779, -509, 249936, 138036, 81295, 294794, 239095, -139610, -142652, 85243, 267988, 79807, 191311, 245439, 196729, 3679, 266642, -5366, -237438, -1777]
17339H2057f6862A52022M4383J08569j00167L43974G7421c3826E8524J37785J22406
17328C18715c7028j23066A30279C2269e12771A64581A4264J79288J15419j27457
17318A81514p5283J7261a97615B98470j259N5648C960L38867d3086B87467O0822
17307C48289j37397k2078O1576b3546A51903n5654O2199L31908j53595j21372
17297B15389r2572n1293a24878B52369R5033K1677a49016A42528i359A59184D0806
17285b0511C95072j84319p8320N815L5306J54065j03444o6609Q333j5391K16260
17274C66768r7413R9359q4590a11578D19465k07270f2182I8093L43762j88310
17264B53545j8993k2927a0216A15545b0424A76214h2438D59920A59149C4055K94659
$$ y = [82057, -66862, 152022, 196405, 304974, 204807, 548781, 77421, -33826, 58524, 196309, 318715, -37028, -160094, 130279, 32269, -512771, 164581, 14264, 193552, 308971, 181514, 106231, 123492, -197615, 298470, 297211, 352859, 3960, 342827, -43086, 287467, 348289, 210892, 188814, 250390, -23546, 151903, 96249, 158448, 490356, 336761, 215389, 122817, 71524, -124878, 252369, 347402, 369079, -149016, 142528, -9359, 159184, 40806, -20511, 395072, 210753, 132433, 138248, 173554, 327619, 224175, 157566, 165899, 150508, 366768, 269355, 368714, 284124, -111578, 419465, 212195, -62182, 98093, 441855, 253545, 234552, 211625, -10216, 115545, -20424, 176214, -82438, 459920, 159149, 34055, 328714]
17253C28714j62628f4242A37114N4956J48765b8202F4402J00353J50222H6054
17242B52032k529K0532q946K94140j98504L6129A86359N6167D5057J45178o7002
17231A23233c665F37104A34176E3805K54738a89745C20590p7455a2527A27188
17220A39350K37042m0884j22285o4027Q2182j2573J90212I453i981C22833J1175
17209C34008J9119H3034K65510G4159J35233n5175J89273A375M55689a43981L4754
17198a09227c1486B32955c2390A20086L89241B6130K60813A9222L02080j27022
17188A94280D9922L7085a25951C93563N1784f2616A64532K35321m3422o0113O98
17177B97016M47476B78291d9636B44126H0044K27478A05762C4407N16751A58096
$$ y = [328714, 166086, -64242, 137114, 192070, 340835, -28202, 64402, 164755, 314977, 86054, 252032, 249503, 270035, 261089, 555229, 356725, 392854, 186359, 242526, 45057, 190235, 123233, -3665, 637104, 134176, 53805, 308543, -189745, 320590, 243135, -12527, 127188, 139350, 376392, 335508, 213223, 149196, 231378, 218805, 409017, 9453, -9981, 322833, 334008, 353127, 83034, 348544, 74159, 209392, 154217, 343490, 1375, 457064, -143981, -109227, -31486, 232955, -32390, 120086, 509327, 26130, 286943, 19222, 321302, 194280, 49922, 87007, -125951, 393563, 445347, -62616, 164532, 399853, 356431, 296318, 297016, 744492, 278291, -49636, 244126, 80044, 307522, 105762, 34407, 551158, 158096]
17166C95457R4609n7829j15500H948P4741R0280j3833J32659j11574k5480J42820
17155B98561K01007l4254i9303j8678D65008j87467A28841M25895p3529k25618
17145B55589j15894K01665k3520q8293J62204r9506L10725A38461L68850B38171
17134E79501k56875K5162j58554L15091A96151l6067J40892L4740F1979K0717
17124H2696J84950J94263q2755m8026N9781D7333M05707j16142Q3274n9319Q332
17113C69185J02505J0476b2010B51654M31830l21108R2799A94394K07981j21865
17103B80510d9882D99326B04158J95798j76745K12058j04541O8682G6611L73296
17093D49907L24727k26695K32830B58678J39641m4099L4588j06116l4236J57433
$$ y = [395457, 490066, 432237, 316737, 8948, 83689, 173969, 160136, 292795, 181221, 155741, 298561, 499568, 465314, -99303, -117981, 465008, 277541, 128841, 554736, 481207, 255589, 139695, 341360, 317840, 229547, 391751, 292245, 602970, 138461, 507311, 238171, 579501, 322626, 347788, 189234, 504325, 196151, 160084, 300976, 335716, 61979, 82696, 267646, 461909, 379154, 331128, 390909, 47333, 453040, 336898, 420172, 360853, 369185, 471690, 482166, -22010, 251654, 683484, 362376, 455175, 194394, 402375, 280510, -49882, 499326, 204158, 399956, 223211, 435269, 330728, 399410, 76611, 449907, 774634, 547939, 780769, 258678, 398319, 354220, 388808, 282692, 248456, 405889]
17083D05889L24283l59170K7365j69833J69897K774L4998J16254R8703k22635
17073D28525J4980j38658K42264m0379j64876J77780J3059k29188K02710q4337
17063D21880K3136J38453K17367C33756J25545P6319m3840L78608B1021M60889
17053D81910J13592M0974k66025K03324k00525p0322K21927B54970P9537L12138
17043F46645m8856k17311K43479n4006k1769J90443k34023Q9260k71351K05835
17033E28346M8114K38840k90515j12376M06133q8207l38383M14047k20948L16880
17023I01931D18645M05716k63228k80366K22023J57423L38847K0973m47318K52424
17013H25139j55367j51721L37623j63719j5893j74512L47989J67131k68556K09959
$$ y = [405889, 730172, 371002, 398367, 228534, 398431, 401205, 436203, 552457, 651160, 428525, 443505, 304847, 547111, 506732, 341856, 519636, 532695, 303507, 506217, 421880, 445016, 583469, 800836, 333756, 459301, 535620, 491780, 870388, 21021, 481910, 595502, 636476, 370451, 573775, 373250, 302928, 524855, 254970, 334507, 646645, 597789, 380478, 623957, 569951, 548182, 738625, 504602, 593862, 322511, 528346, 576460, 815300, 524785, 412409, 818542, 730335, 391952, 805999, 585051, 901931, 418645, 824361, 561133, 280767, 502790, 660213, 999060, 1020033, 572715, 825139, 669772, 518051, 855674, 691955, 676062, 501550, 849539, 1016670, 748114, 958073]
17003I58073j30162l42354R4711p1679M70362k65323J35506r6645K26815j05956
16993H73348L3224k50807J8100N214L45700k84153J53576k96485K44259J14705
16983I56681n2863J31772j65597l8255J93958J18819q4089j12603l43492L42752
16973I47083J19073r008k34038M10993k04069j98018P0797j15942L60582j57611
16963I89842j10082L0914K83074n6891J12542j85549k96483O8024O5758j25505
16953G75644M30660j41429j60436M54800l77079J76912k20758M60038j51515L2027
16943A278864J93768m96299L92118l02985J24619J87112P4576l78026R8532L65136
16933A537415J7697l63330Q0711N6211P2611O9356J21118j27961j89455K19267
$$ y = [958073, 827911, 485557, 580268, 508589, 978951, 713628, 849134, 752489, 979304, 873348, 906572, 655765, 673865, 679079, 1024779, 740626, 894202, 597717, 841976, 956681, 903818, 1035590, 869993, 831738, 1025696, 1144515, 1060426, 947823, 604331, 947083, 1066156, 1057148, 823110, 1234103, 1030034, 832016, 902813, 786871, 1147453, 989842, 879760, 910674, 1193748, 1136857, 1249399, 1063850, 767367, 835391, 901149, 775644, 1206304, 1064875, 904439, 1359239, 982160, 1159072, 938314, 1398352, 1246837, 1278864, 1472632, 976333, 1368451, 1065466, 1190085, 1377197, 1451773, 1073747, 1172279, 1537415, 1555112, 1191782, 1272493, 1328704, 1401315, 1470671, 1591789, 1463828, 1274373, 1493640]
16923A493640J0615J816R9656l07009L19379j30623j31585K01951J95435M5987
16913A799262k22107k2203J95560k80928N5924K9512p9011R8864q2505P526j27911
16902A371983J74972O1788K19853j71548J67251j71086K15824k61865M02028J07191
16892B116391m53265M70078k45116K28318J66536m72019J94920M11885j22443
16883B295285j03734N5602J5321m6604M14543k95109J15780j06860K18941J01045
16873B664210K26448k54683n7504K98268k97985k38040L28548K32141k60940k99021
16863B341442L60240K74982p883K70031k08017N43019q07144N70308q6737n9155
16853C191086K92750l10905P5377N5463K22658j69975R5483L04888K7174k70080
$$ y = [1493640, 1504255, 1506071, 1605727, 1298718, 1618097, 1487474, 1355889, 1557840, 1753275, 1799262, 1577155, 1554952, 1750512, 1469584, 1525508, 1555020, 1476009, 1574873, 1492368, 1499894, 1371983, 1546955, 1608743, 1828596, 1657048, 1824299, 1653213, 1869037, 1607172, 2009200, 2116391, 1663126, 2133204, 1888088, 2116406, 2282942, 1810923, 2005843, 2417728, 2295285, 2191551, 2247153, 2262474, 2215870, 2630413, 2335304, 2451084, 2344224, 2563165, 2664210, 2890658, 2635975, 2578471, 2876739, 2578754, 2340714, 2669262, 2901403, 2640463, 2341442, 2701682, 2976664, 2968781, 3238812, 3030795, 3573814, 2766670, 3336978, 3250241, 3191086, 3483836, 3172931, 3248308, 3303771, 3526429, 3356454, 3451937, 3756825, 3783999, 3513919]
16843C513919L99393J02428K04366L2200m5184K7624l2684R4723k9797K64952
16833D531940j8436R4123K83394k23312J26084J9871K89260J57910J15509j70656
16823E205687R1612K82863K04918J5471M2573K23829j28627K77878J52800K12341
16813F581345j10563J65113K10638j4610M95487K27258l18204J49011R1851O16337
16803H093663R0559Q7591M06801m4931J53062L78673p8343O52839p8962N7020
16793I717972J009582J633M5299N94290j42145N61567L43413M9241L60864O70533
16783A3212249L05159K4755Q56550L87925N22865J96860P00953L31329Q32041
16774A7370686M13601P41811L18391P40264O29035R65200N52448P24625O92013
$$ y = [3513919, 3913312, 4015740, 4220106, 4252306, 4207122, 4234746, 4202062, 4296785, 4266988, 4531940, 4513504, 4607627, 4891021, 4667709, 4793793, 4813664, 5102924, 5260834, 5376343, 5205687, 5297299, 5580162, 5785080, 5800551, 5843124, 6066953, 5938326, 6216204, 6369004, 6581345, 6470782, 6635895, 6846533, 6831923, 7327410, 7554668, 7236464, 7385475, 7477326, 8093663, 8184222, 8271813, 8678614, 8633683, 8786745, 9165418, 9087075, 9739914, 9660952, 9717972, 10727554, 10729187, 10774486, 11368776, 11226631, 11788198, 12131611, 12180852, 12541716, 13212249, 13517408, 13542163, 14398713, 14786638, 15309503, 15506363, 16207316, 16538645, 17370686, 17784287, 18526098, 18844489, 19584753, 20213788, 21178988, 21731436, 22456061, 23148074]
16765B3148074J231810Q00304P88715J056217R68560J496425J421483J091174
16757C2002762J331291J509668J355268J920170J262339K176492J601505K477477
16749D5636972K300375J725756K884190K727559L028838K979178L331107L396038
16741F8010013L931243L808865M220066M808473M565326N050043N574911N531299
16733A05500239O144498O397016O384595O953862O773328P302432O665950O969130
16725A59091050O769409N945979N629931N372967L783199L146200K085800O87434
16717A92511969o40580j384331l050652l877386n008646n483595o496813o797533
16709A59772433o926618p341981p549707o844032p136923p005812o527212o231549
$$ y = [23148074, 24379884, 25180188, 25968903, 27025120, 27993680, 29490105, 30911588, 32002762, 33334053, 34843721, 36198989, 38119159, 39381498, 41557990, 43159495, 45636972, 47937347, 49663103, 52547293, 55274852, 58303690, 61282868, 64613975, 68010013, 71941256, 75750121, 79970187, 84778660, 89343986, 94394029, 99968940, 105500239, 111644737, 118041753, 124426348, 131380210, 138153538, 145455970, 152121920, 159091050, 165860459, 171806438, 177436369, 182809336, 186592535, 189738735, 191824535, 192511969, 191871389, 190487058, 187436406, 183559020, 178550374, 173066779, 166569966, 159772433, 152845815, 145503834, 137954127, 131110095, 123973172, 116967360, 110440148, 104208599]
16701A04208599n663034n502576n429034n360367m463830m464407l826199m056700
16693F5442452l257008l311125l345094k892377k595795j993213k868004j995569
16685D3184267k167790k085806j689579j743656j561030j453970j371824j255112
16677B9855500j528305o81066j608560r81402n51063j154944j056750q09603r19087
16668B0564720p12443j07349j146805n31891n57964o96631q07836n88465j94853
16659A5220483m98909m81420o43471l52002m94270l85455m29225j38326j65229
16650A1632176k00805l51064n83340j77868m78132L50022p82425k14700k58828
16641H935036k27184k0043m94390j49091n3172m44881K19003k72346l11334k51043
$$ y = [104208599, 98545565, 93042989, 87613955, 82253588, 77789758, 73325351, 69499152, 65442452, 62185444, 58874319, 55529225, 52636848, 50041053, 48047840, 45179836, 43184267, 41016477, 38930671, 37241092, 35497436, 33936406, 32482436, 31110612, 29855500, 28327195, 27646129, 26037569, 25056167, 24505104, 23350160, 22293410, 21483807, 20564720, 19852277, 19744928, 18598123, 18066232, 17508268, 16811637, 16003801, 15415336, 15220483, 14721574, 14240154, 13596683, 13244681, 12750411, 12364956, 11935731, 11797405, 11632176, 11431371, 11080307, 10496967, 10319099, 9840967, 10190989, 9408564, 9193864, 8935036, 8707852, 8687809, 8193419, 8044328, 7991156, 7546275, 7765278, 7492932, 7181598, 6930555]
16631F930555k53789L8418j97069q7629q0809j61919l13677O4201k79529k32102
16621E426651K6295M3286P2337j83099j85864J19276l27424k15687J26613n05276
16611D397108J51426l25388L37325k61882O6093k39353O7190k93825P0602k19540
16601C749756L16774n56986M2361J03391l48533K36561K6440q4584j94566J97171
16591C487785l23157l49523M51209k61058K32096o97700P30256n11144L60615
16582C119379j86584o65426N6642K54906J5375j66360o1116J7046j37067J34026
16572B380821k55235J25312K39259r2643J2966l60715J50005J46952k94227r9077
16562A953418Q6663k11844L93007j48118o1107J3421J39168j87268k3171l11044
$$ y = [6930555, 6676766, 6715184, 6518115, 6430486, 6349677, 6187758, 5874081, 5938282, 5658753, 5426651, 5452946, 5496232, 5568569, 5385470, 5199606, 5318882, 4991458, 4775771, 4902384, 4397108, 4548534, 4223146, 4560471, 4298589, 4364682, 4125329, 4192519, 3898694, 3969296, 3749756, 4066530, 3509544, 3551905, 3655296, 3306763, 3543324, 3569764, 3485180, 3290614, 3487785, 3164628, 2815105, 3266314, 3005256, 3237352, 2539652, 3269908, 2758764, 3119379, 2932795, 2267369, 2324011, 2578917, 2594292, 2427932, 2366816, 2383862, 2246795, 2380821, 2125586, 2250898, 2490157, 2397514, 2410480, 2049765, 2199770, 2346722, 2052495, 1953418, 2040081, 1828237, 2221244, 2073126, 2012019, 2025440, 2164608, 1977340, 1954169, 1643125]
16552A643125K21651l30342K38361r0721l2560P3892R0507j73125r0065J8315
16542A569038L19953n11604K81246j43396K27256l38022J17468k86421J84902
16533A420420P0585J72772m1699n3878m93929P4812K93330j35694J41484j73072
16523A275131j48354J47455P600k20917o6107j31947K66757j70468N0387L63082
16513A372619k32874k54277K48219K6028J13902m61043K08301j10753J74736O4971
16503A149829r9685q1415M41233o17041L72569o8167q650m8831M4020l10537L1534
16492H04859K52615k56093Q5101J07062M6203j68724p9470J97022J50641m92901
16482F46315J6036J22576J76954L8745k14273J67399l52554N5410j7316K64339
$$ y = [1643125, 1864776, 1534434, 1772795, 1682074, 1649514, 1723406, 1813913, 1640788, 1550723, 1569038, 1888991, 1377387, 1658633, 1515237, 1742493, 1404471, 1521939, 1235518, 1420420, 1491005, 1663777, 1622078, 1568200, 1074271, 1149083, 1442413, 1306719, 1448203, 1275131, 1126777, 1274232, 1281832, 1060915, 994808, 862861, 1129618, 959150, 1009537, 1372619, 1139745, 885468, 1133687, 1159715, 1273617, 812574, 1020875, 910122, 1084858, 1149829, 1050144, 968729, 1409962, 792921, 1165490, 1097323, 1088673, 1039842, 1083862, 773325, 804859, 1057474, 801381, 886482, 993544, 1039747, 871023, 791553, 988575, 1139216, 646315, 662351, 784927, 961881, 1000626, 786353, 953752, 601198, 656608, 639292, 903631]
16472I03631l53842L08662K9173n8422q0123M2589l33132J55234J10566J24358
16462H48694j17527k99320M76595l55744K13948J41629j76047M7919l25775L09300
16452G63672k1701n7751o1458j45114K17965k35549A91623L87876B50167n0591
16442A99576L10897K02921J97172m35541N10865D16427J60162J8490l1385K1179
16432E84873k13045M13107l62694O9763j00391M12174l41911N9720l9835K08086
16422F89847B53262K39484J24595K7864k90449J7294L780O0313K44206A00877
16411E00009J0687q9529J77421A71347L11703j295j67616J2124P0474m3348K23347
16400E76736O2882B57436K09484r095N6387j79852J6183L9531J37464j63368k7131
$$ y = [903631, 549789, 858451, 887624, 829202, 749079, 791668, 458536, 613770, 724336, 848694, 731167, 431847, 908442, 552698, 766646, 908275, 732228, 780147, 454372, 763672, 741971, 684220, 622762, 477648, 695613, 460064, 191623, 579499, 250167, 199576, 510473, 713394, 910566, 475025, 985890, 416427, 576589, 595079, 563694, 584873, 371828, 784935, 422241, 492004, 391613, 803787, 461876, 521596, 481761, 689847, 253262, 492746, 617341, 645205, 354756, 372050, 375830, 436143, 680349, 100877, 500009, 510696, 421167, 598588, 171347, 483050, 481755, 314139, 326263, 396737, 353389, 576736, 639618, 257436, 466920, 457825, 514212, 334360, 350543, 390074, 527538, 364170, 337039]
16389C37039J77802j19407N616j86919N1449J78112J03340k66311K69180k14252
16379C35649G2390r910L26168p9849j0792k4639L09375k48596J07352J7403G6848
16367A49515K55446E2080M96419A84621K8690B8532M06367j50565p5557L63487
16357E72264j36359A1137K70345J27463j29223J2876i0084B34510K41979k36594
16347B39895J36946I6002M5765K90445B08281J78373j52206j07927D469a11356
16336A79946N9272L89417G7319O7602J95490c6133C43167j36911P2244M3901b791
16324I5056K99959A53857j8712K38596B482J04240Q0104K31953J53732E628L0107
16313C5735K66135K9464a98623A23865L68111A06007Q2874L23789I3421K33074
$$ y = [337039, 514841, 395434, 401050, 214131, 265580, 443692, 547032, 280721, 549901, 335649, 72390, 62480, 388648, 308799, 298007, 273368, 582743, 334147, 441499, 458902, 76848, 149515, 404961, 52080, 548499, 184621, 213311, 28532, 434899, 284334, 208777, 572264, 435905, 11137, 281482, 408945, 279722, 292598, -90084, 234510, 476489, 239895, 376841, 96002, 141767, 432212, 208281, 386654, 234448, 126521, 4469, -111356, 179946, 239218, 628635, 77319, 144921, 340411, -36133, 343167, 206256, 278500, 322401, -2791, 95056, 395015, 153857, 135145, 373741, 2482, 106722, 186826, 418779, 572511, 5628, 35735, 301870, 331334, -198623, 123865, 491976, 106007, 188881, 512670, 93421, 326495]
16303C26495j7428d5181C02226a20062K7278a2129j0485C75835Q134B7336L95413
16292D22749j78204r3475N0694e3310M212E07151B05788G0183P1460n5654L31941
16281D17930j58875R9398j63711M012B5970a18367D36737f9611A87977a04137
16270A91253A6530J89229o947c17279A29123J48376p201K3861M7037B6246J56938
16259A83184J16320p7867I7495K07129A20947k6919b26089B35618D3024d5408
16248A74294C4170r061j0706K1654g964A49082a21684C55742A4908a4070o1981
16237g6051C75368j33476H8612k0512a62545D72249a02899B89672J62714k14540
16227B37846A17581J02743G6265B6563a6222B03616r2032N6489N5813O4023b9479
$$ y = [326495, 309067, -45181, 302226, -120062, -92784, -12129, -22614, 375835, 383969, 27336, 422749, 244545, 151070, 201764, -53310, -49098, 507151, 205788, 70183, 141643, 85989, 417930, 259055, 358453, 194742, 198754, 25970, -118367, 436737, -69611, 187977, -104137, 191253, 16530, 205759, 198812, -317279, 129123, 277499, 270298, 294159, 341196, 26246, 183184, 299504, 221637, 97495, 304624, 120947, 94028, -226089, 235618, 43024, -45408, 174294, 34170, 25109, 14403, 36057, -7964, 149082, -121684, 355742, 14908, -14070, -76051, 375368, 241892, 88612, 68100, -162545, 472249, -102899, 289672, 452386, 237846, 117581, 220324, 76265, 26563, -16222, 203616, 111584, 168073, 223886, 287909, -29479]
16215B96729j41209o0876O8887c3393D01566E7725K5342l406K3817J65759a04053
16203a25886B01345k6840a05572M1281C80979m1108c63778A14588J23691L5060
16193B73339c1460B23004J3640C8612c83581B93378k7535a7576B46257o3490C1714
16181b0652A30242n583E1156K99926F7401M9472C2428b04927A31539A8637J20348
16170A38985d1489A24321a01222m3318C27136D7808J6487M9736C4821g1331E6627
16158d2507M384A26630J14374J62792A94731b1857n9050I1920a78115E5671d5263
16146a55213P7322A9068i960A43876b4986r1988J0154C06261e6356C00899B8738
16134A44651a63310B78059H046b69156A61949P9046F2230K06388b26355H7714
$$ y = [296729, 155520, 94644, 163531, -33393, 401566, 57725, 83067, 79661, 103478, 269237, -104053, -125886, 201345, 174505, -105572, -64291, 380979, 339871, -363778, 114588, 238279, 273339, -31460, 223004, 236644, 38612, -383581, 293378, 265843, -17576, 246257, 182767, 31714, -20652, 130242, 124659, 51156, 351082, 67401, 116873, 32428, -204927, 131539, 18637, 138985, -41489, 124321, -101222, -144540, 327136, 47808, 64295, 114031, 34821, -71331, 56627, -42507, -38123, 126630, 241004, 403796, 194731, -21857, -80907, 91920, -178115, 55671, -45263, -155213, -77891, 19068, -9960, 143876, -24986, -116974, -106820, 306261, -56356, 300899, 28738, 144651, -163310, 278059, 8046, -269156, 161949, 240995, 62230, 268618, -226355, 87714]
16123a3412j77462B67297h0249D8417k4015Q3564K1978k4093d2385A59370B7658
16111b20349B5567J53925H2661K337g5631L3553A63012a4337k05730e9254B08077
16099D28776c12723a05957P553B12948b51114A97408C6070a74399p009B81264
16088b44306d7850n8119p0503A79679B9711a87853L3739C45088j01186D9922a14134
16076f7157b8027F5891c2777E2433B1290J7250N8983B306L4130M05272c74682
16064a66032E948a08981N3720l0863A29082k9634A077K15031o1389K59411f0590
16052g5653A31140f2091B13669J17213b56050a3377m7560k23724G6339j8454e4308
16040A60280F5582a11691A57318a49019d1320B61444h1233l70583D4898K00318
$$ y = [-13412, -190874, 267297, -80249, 48417, 24402, 107966, 129944, 105851, -42385, 159370, 27658, -220349, 25567, 179492, 82661, 84998, -75631, -42078, 163012, -14337, -220067, -59254, 208077, 428776, -312723, -105957, -98404, 212948, -251114, 197408, 36070, -174399, -181408, 281264, -244306, -47850, -105969, -176472, 179679, 29711, -187853, -154114, 345088, 243902, 49922, -114134, -67157, -28027, 65891, -32777, 52433, 21290, 38540, 97523, 2306, 36436, 441708, -374682, -166032, 5948, -108981, -55261, -86124, 129082, 99448, 1077, 216108, 154719, 414130, -60590, -75653, 131140, -62091, 213669, 330882, -256050, -13377, -60937, -284661, 76339, 57885, -54308, 160280, 65582, -111691, 157318, -149019, -41320, 261444, -81233, -451816, 44898, 245216]
16030B45216a32593j70385G6946c42806A55240b95019J03701R2698K120A3515
16019a30121F8086e4803A0906a59443J1570L8091n5757d9342A59289a34713K4077
16008a10636N4475G345J12307J652a1270l3174m42794A27520E9575J1565j8057
15997E3083b50647i2107P711b8693B37977m7512D9422L22656c6346o2619L936
15986i5029p6971A04648K31750l127A54089J53025J23703A83409b62416e23C01715
15974A28805D2994K38576a70445G779a19400J1463d6565e979B1167a67671A35933
15962I0621A3885a40894j55871F097K9520a36845m771e0051A77584a06725o1603
15951a68328B53702b18452h0918B54489C9574a66753A11440a41757l3928f9695
$$ y = [245216, -132593, -302978, 76946, -342806, 155240, -295019, -191318, -98620, -96500, 13515, -130121, 68086, -54803, 10906, -159443, -147873, -109782, -165539, -49342, 159289, -134713, -110636, -56161, 7345, 119652, 121304, -11270, -44444, -487238, 127520, 59575, 71140, 53083, -250647, -92107, -84396, -28693, 237977, 190465, 49422, 372078, -36346, -98965, -95029, -172000, 104648, 336398, 333271, 154089, 307114, 430817, 183409, -262416, -523, 301715, 128805, 42994, 281570, -170445, 7779, -119400, -107937, -46565, -5979, 21167, -167671, 135933, 90621, 13885, -140894, -296765, 6097, 35617, -136845, -141616, -50051, 177584, -106725, -168328, 253702, -218452, -80918, 254489, 39574, -166753, 111440, -141757, -175685, -69695]
15940b524B34453a83471A26593N6115g0495a6978n4822j60471g4121r200B24126
15928H0331k6052A6298h8308b6817j49959K9848B1229a96246g4699j25014B34124
15916B53227d6939b1601j86477k0534A70244b24964a6764A81939q0364a97070
15905a4166A75166a22890A02857a66650B43598P6806a67399g1256l04087A40298
15894b90806J07123E4462c28819i5396n543k1226A2314c1829j53552D3817c22242
15882i6341C5810J53130L61139f7412m9206c3168l73992B71537J0650B2815J55009
15871A77824k9791d8981j30630I9539h6930B00721i2887n5429a7354j41381A9747
15859f516B6849K03438b19047e1981n704A09766E2331a75527k90145b17258p0313
$$ y = [-2524, 234453, -183471, 126593, 182708, -70495, -16978, -71800, -232271, -74121, -83321, 224126, 80331, 54279, 16298, -88308, -26817, -176776, -146928, 21229, -196246, -74699, -199713, 234124, 253227, -46939, -21601, -208078, -228612, 170244, -224964, -16764, 181939, 101575, -197070, -14166, 175166, -122890, 102857, -166650, 243598, 320404, -167399, -71256, -375343, 140298, -290806, -183683, 54462, -328819, -95396, -100939, -122165, 12314, -31829, -185381, 43817, -322242, -96341, 35810, 188940, 550079, -67412, -116618, -33168, -407160, 271537, 282187, 22815, 177824, 148033, -48981, -179611, 99539, -86930, 200721, -92887, -148316, -17354, -158735, 19747, -6516, 26849, 230287, -219047, -51981, -57685, 109766, 52331, -175527, -465672, -217258, -287571]
15848b87571B5175Q4047b05067D05948a52237j37516e9991F4877a44265O6267
15838g7998G4306K34963a00872a0477A65281j413d2082A16459P0628a95536a1522
15826b3157B7575J9744j5697a36507b5507j62820R2411A71721q1352m687b14569
15814e4353r7674A43952J53027E2497k4369a28269A64772p4557e2143J0176n018
15803d6985l5322H2839R4245b40700C1374a59154q000j4796B36992b77666d7183
15791i1920I7585c7373A51604a73288B28940j0744a87414L4442m1115P2632e5957
15779d7278A99419i4231A16825a04170g238k47122F0497h2170J1185o0206k12266
15768c43457a20123M2352q2797j27700B93472b44974j13816a6280A61214L1881
$$ y = [-287571, 25175, 109222, -205067, 405948, -152237, -289753, -59991, 64877, -144265, -77998, 74306, 309269, -100872, -10477, 165281, 163868, -42082, 116459, 187087, -195536, -11522, -23157, 27575, 47319, 31622, -136507, -25507, -188327, -95916, 171721, 90369, 85682, -214569, -54353, -152027, 143952, 296979, 52497, 28128, -128269, 164772, 90215, -52143, -41967, -46985, -82307, 82839, 177084, -240700, 31374, -159154, -167154, -181950, 236992, -277666, -47183, -91920, 97585, -37373, 151604, -173288, 228940, 218196, -187414, -152972, -194087, -121455, -55957, -47278, 199419, -94231, 116825, -104170, -7238, -254360, 60497, -82170, -70985, -131191, -343457, -120123, -77771, -160568, -288268, 293472, -244974, -358790, -16280, 161214, 193095]
15758A93095P0447b156k03899e4588j74479A66264a55655A5233n495R2643a3148
15746d3602A49761J1754D1199a87112E1873J37773a16193k2694F94a13481F5141
15734H1164B842O3915a48950G4538a52186a7998B02242b44232b5342j62481g9506
15722a47426A76203i3770j07382C2254K03530J09789j65976p1657N6079K6845
15712A90864c02125h5087c3680A14975b75169A29406a05312A73875b49101b2369
15701b39199l8893D3913c9067q504k17597J17092b2439A79932b48376A38253a80002
15689A0642b48352D9674J36744D9113B2226K45363C2972c17878O3022A05555N2831
15678A58386e4737j2658j32976A02005i1819b0410B18338q6241o4665K44519p3833
$$ y = [193095, 263542, -2156, -206055, -54588, -229067, 166264, -155655, 15233, 9738, 102381, -13148, -43602, 149761, 161515, 41199, -187112, 51873, 189646, -116193, -138887, 694, -113481, 65141, 81164, 2842, 66757, -148950, 74538, -152186, -17998, 202242, -244232, -25342, -187823, -79506, -147426, 176203, -93770, -201152, 32254, 235784, 345573, 179597, 107940, 164019, 190864, -302125, -85087, -33680, 114975, -275169, 129406, -105312, 173875, -249101, -22369, -239199, -278092, 43913, -39067, -47571, -265168, -148076, -22439, 179932, -248376, 138253, -180002, 10642, -248352, 49674, 186418, 49113, 22226, 267589, 32972, -317878, -254856, 105555, 158386, -54737, -67395, -200371, 102005, -91819, -20410, 218338, 132097, 67432, 311951, 238118]
15667B38118F9056a24700l28088B22825a99027A63905f2689A91831a5102l01302
15657c16404J46892A35399d5950k90914k1670M3307A61929O8067c63648d0909
15646B16359H6408l4779J31572a32664e3688J706J1835A9179d9612j79181A49226
15634a45161g0156l8723c8625m4672A05708d6774A83066a54880H5841b42998D6311
15622B20984b4148j98063N212A94090K27601A00423K0089a91710f9431n1533k87760
15611d08724a59988O8976C63671b42041A34909a10145j64792J35093A67523C9906
15600E0282c57753a77162A70878J77592F4555a42928A88196g5250n6147A67941
15589a36040q8236e1920A73301J21132A6304P4430I621b7785A8850o249M776Q8589
$$ y = [238118, 69056, -124700, -452788, 222825, -199027, 163905, -62689, 191831, -15102, -316404, -169512, 135399, -45950, -336864, -358534, -315227, 161929, 229996, -363648, -40909, 216359, 86408, 51629, 183201, -132664, -53688, -51982, -40147, 19179, -49612, -228793, 149226, -145161, -70156, -108879, -38625, -83297, 105708, -46774, 183066, -154880, 85841, -242998, 46311, 220984, -24148, -222211, -216999, 194090, 421691, 100423, 120512, -191710, -69431, -120964, -408724, -159988, -91012, 363671, -242041, 134909, -110145, -274937, -139844, 167523, 39906, 50282, -357753, -177162, 170878, 348470, 64555, -142928, 188196, -75250, -131397, 167941, -136040, -224276, -51920, 173301, 294433, 16304, 90734, 9621, -27785, 18850, 12601, 17377, 105966]
15577A05966b6230A29954i0997o7637j06930R5068J6036m3352F243J01141A0513
15565A82349G5690a98111P2457j6789A00243D567J07450J35650a78413L8199d2303
15553A58710Q5550f1155A33841a28442k4498f4871j03519m7564k0572A24128a73737
15541a45383A97700a13692A826a73092g7647D6529A6822N9266J8645a08923J8989
15530h9934q7547C07491c6113C38104A13622l2899b79m4220k75983B03274A8c33345
15517A3934K27410C6500Q9164b8894j16707k04250A02230g7472j61611B39504
15506c91927F3022G806A294J70012O8759a70p6005o1808N4245E4085a71605B57760
15493a40630A23414D9068c29747C79250f7916j39209I7234Q3698l1933c45988
$$ y = [105966, -26230, 129954, -90997, -158634, -265564, -170496, -154460, -197812, 6243, 107384, 10513, 182349, 75690, -198111, -125654, -142443, 100243, 4567, 112017, 247667, -178413, -140214, -42303, 158710, 244260, -61155, 133841, -128442, -152940, -64871, -168390, -215954, -236526, 124128, -173737, -145383, 197700, -113692, 1826, -173092, -77647, 46529, 16822, 76088, 94733, -108923, -89934, -177481, 307491, -36113, 338104, 113622, 80723, -279, -44499, -320482, 203274, 18, -333345, 13934, 241344, 36500, 125664, -28894, -145601, -349851, 102230, -77472, -239083, 239504, -391927, 63022, 7806, 1294, 171306, 240065, -170, -76175, -137983, -83738, 54085, -171605, 257760, -140630, 123414, 49068, -329747, 379250, -67916, -207125, 97234, 180932, 148999, -345988]
15482C7013c77339F483L06285H8373R645e3742A18281L9912a1416p1470A52830
15470a44273f0484G4976i0466C8972c03147J27120G0942K8714a87568D7170J14625
15459A61795i441F0427b60309a27790A30614J98550a31638b6837D76634C3859
15448F3958e2931B5832b19865A30412a83208I959b18257K3935L165B89672h2465
15436d29A80742H8272h9881C6962b19649G3579j9207K4324M6365f5714j32974
15425a98688p5014r2801a06624c4942A70930h8332E0407k2287a10270C3697Q8102
15414A21799D4276J7745J10437J80232p1255a62552A17247j2089g9255k0213b1970
15402H795a59109H7578L4235l1565a10166D6588e9764C2952a97203O1105C61816
$$ y = [37013, -377339, 6483, 312768, 88373, 98018, -53742, 118281, 158193, -11416, -82886, 152830, -144273, -60484, 74976, -90466, 38972, -303147, -176027, 70942, 99656, -187568, 47170, 161795, -9441, 60427, -260309, -127790, 130614, 329164, -131638, -26837, 476634, 33859, 63958, -52931, 25832, -219865, 130412, -183208, 9959, -218257, -194322, -191157, 289672, -82465, -429, 180742, 88272, -89881, 36962, -219649, 73579, 54372, 78696, 125061, -65714, -198688, -273702, -366503, -106624, -34942, 170930, -88332, 50407, 28120, -110270, 33697, 121799, 44276, 62021, 172458, 352690, 281435, -162552, 117247, 105158, -79255, -99468, -21970, 8795, -159109, 87578, 121813, 90248, -110166, 46588, -59764, 32952, -197203, -136098, 361816]
15390g7810a0977p2755C53192a04215F8605J56239a82390a0336A40021k5456b78170
15378A90015a9890A21031k1325a64750M9695j95523J51284C24705C1150J77878
15368B09028c64300G6736J19996e5728B05322E8450a72999a3928A29498a93392
15357a24387M1946n6990A10937a35235B15465o8647b8858m9168j13089F1093b42309
15345a57463j9839o3642F2770a91750d0345j34808e9498q7286k8683P1800b3852
15333a9776j44466D5516F346K647h3286B51492M2004R5826A11705b14527P3172
15322a41355d1096q0085b2821A54421a3949r5078K7424A31241n0208N1500H581
15310b67992i7712B13576c6551l14326C155J73172b68348a05091C39019A02727
$$ y = [-77810, -10977, -83732, 353192, -104215, 68605, 224844, -182390, -10336, 140021, 114565, -278170, 190015, -19890, 121031, 99706, -164750, -115055, -310578, -159294, 324705, 31150, 209028, -364300, 76736, 196732, -55728, 205322, 58450, -172999, -13928, 129498, -193392, -124387, -82441, -139431, 110937, -135235, 215465, 146818, -28858, -78026, -191115, 61093, -242309, -157463, -177302, -240944, 62770, -191750, -40345, -175153, -59498, -146784, -175467, -103667, -23852, -19776, -164242, 45516, 6346, 8993, -83286, 251492, 293496, 389322, 111705, -214527, -141355, -41096, -121181, -22821, 154421, -13949, -109027, -81603, 131241, 81033, 132533, 8581, -267992, -97712, 213576, -36551, -350877, 3155, 176327, -268348, -105091, 339019, 102727]
15299a49331F0182M30192k14280E4280b54720D6087a046j3996j20082C01642J09332
15288D10974j65062G7691K0340N9493E2457b97507I9166B1450J43984a47195c1133
15276B95848j1317D177i8699A5797K24717D4546Q884N84831A77011q6577c26603
15264B11171C6788J64796h2895B70060d85000a3696G3779A8802J60587f6675A04001
15252A02319i9808E55726j55381p2984J38517A15412i7243e486D5547P6647K55051
15241C77245a25326j85336A30549D6280a58875g6971A99955A577a16893H192K56325
15230B64517D953P0069J6126a53407F2405d7660C21157f5836B9059K44533i5016
15218A03913N6497a67468H849J56337N9740h0788B65270d52716A98532o2616J21664
$$ y = [-149331, 60182, 490374, 276094, 54280, -254720, 46087, -1046, -15042, -135124, 301642, 410974, 245912, 77691, 98031, 157524, 52457, -297507, 99166, 21450, 165434, -147195, -31133, 295848, 284531, 4177, -98699, 15797, 240514, 44546, 53430, 638261, 177011, 90434, -326603, 211171, 36788, 201584, -82895, 270060, -485000, -13696, 73779, 18802, 179389, -66675, 104001, 102319, -99808, 555726, 400345, 327361, 465878, 115412, -97243, -5486, 45547, 122194, 377245, -125326, -310662, 130549, 46280, -158875, -76971, 199955, 1577, -116893, 8192, 264517, 4953, 75022, 91148, -153407, 62405, -47660, 321157, -65836, 29059, 273592, -95016, 103913, 160410, -167468, 8849, 165186, 224926, -80788, 265270, -452716, 198532, 135916, 257580]
15207B57580g3490A40774f1020m4969A10594N6832a80188O3336A43193a03981
15196d6091A97988M7057j20095l1042b66668A12645L2049k5698c05829I7513M3455
15185A40968a01562A21661a05593o6305G9262A2284Q4198g8625A3311g3425h445
15173b18271J08032C41929f4827k6123A82989C921K04530A4766K84831A24796
15162A8732O901K73650h7267B59303G0214A0598O3939a45367A19274m1073M00374
15151D78575A00367a02543C03867j09106K17669A2608a78310f6893L097A54541
15140A89269L3313G4670J80064B3249c5140D23570A1208J3600R9497J35355D5287
15128I2204k3550P6477h6612E7091K2918K42852j59720J92621J10465B14602R9630
$$ y = [257580, -73490, 140774, -61020, -105989, 110594, 167426, -180188, -116852, 143193, -103981, -46091, 197988, 245045, 124950, 93908, -266668, 112645, 144694, 118996, -305829, 97513, 140968, -101562, 121661, -105593, -171898, 79262, 12284, 96482, -78625, 13311, -73425, -8445, -218271, -110239, 341929, -64827, -90950, 182989, 3921, 208451, 14766, 299597, 124796, 18732, 25633, 299283, -87267, 259303, 70214, 10598, 74537, -145367, 119274, 78201, 478575, 100367, -102543, 303867, 194761, 412430, 12608, -178310, -66893, -63796, 154541, 189269, 222582, 74670, 254734, 23249, -35140, 423570, 11208, 24808, 124305, 259660, 45287, 92204, 68654, 145131, -86612, 57091, 80009, 322861, 163141, 355762, 466227, 214602, 314232]
15117C14232e1643j3279A06765f7884A69654j3378L47518A36204K60380B7650
15106B5767b06364D63348k29885A0152M1409c23085B99977j23455l61m9744a85685
15094a9201F5530J98681B0969L8040K46753A03003M9353Q1129J36471e172l4487
15083c9659B87503m7223K3790D3239i106G5946L22352A875L29999j11002a6073
15071A91101j3288h0612A10791K47251j01276K01808D4831M597N41279B16705
15060B59631l6441O9968L1479n1521B9454J37760F834K91313J11466A02320g946
15048E3298R4402K064K21444A21076R6451J2226c5702B75385o2387D2080j57g6392
15035B50537h5497A65521g2224B98185J35847A81505L8707A04176J60683K26570
$$ y = [314232, -51643, -64922, 106765, -67884, 169654, 156276, 503794, 136204, 396584, 27650, 25767, -206364, 463348, 233463, 10152, 51561, -323085, 299977, 176522, 176161, 126417, -185685, -19201, 65530, 264211, 20969, 59009, 305762, 103003, 152356, 233485, 369956, -5172, -39659, 287503, 240280, 264070, 43239, -9106, 75946, 398298, 1875, 331874, 220872, -16073, 191101, 177813, -80612, 110791, 358042, 256766, 458574, 44831, 49428, 590707, 216705, 259631, 223190, 293158, 324637, 273116, 29454, 167214, 6834, 298147, 409613, 102320, -7946, 53298, 147700, 149764, 371208, 121076, 217527, 229753, -35702, 275385, 212998, 42080, 41923, -76392, 250537, -85497, 165521, -72224, 298185, 434032, 181505, 220212, 104176, 264859, 491429]
15025D91429c1111B03835K25833j15701j06255k4991Q2381J48124D6208L33776
15015C79984j17473a46215A59481J54085K0067p3022f590C79864B9984L37629
15005C67613j8283a15437C56683A8727O8162J50797a75583C20456b01798L629
14995a98169A14230M37181j85097g1401C48322k1644j28055a9062l21871D99866
14984D72389j76546p8628F7561Q7727K36537j61174J46489C3017M00660B3110
14973G9490K29882A13620b805C40523a8167B24489L69105a47520B88176j10054
14963A78122J32799Q4246B725R6701l680L43219A48904L03201k16811J52803J07913
14952D96010j87464j29255p1246n1433N4660J13648K15801g2812B69537l4259
$$ y = [491429, -31111, 203835, 429668, 313967, 207712, 182721, 265102, 413226, 46208, 379984, 262511, -146215, 159481, 313566, 333633, 260611, -6590, 379864, 29984, 367613, 349330, -115437, 356683, 18727, 86889, 237686, -175583, 320456, -201798, -198169, 114230, 551411, 366314, -71401, 348322, 326678, 198623, -19062, -340933, 499866, 472389, 295843, 217215, 67561, 155288, 391825, 230651, 377140, 33017, 433677, 23110, 79490, 309372, 113620, -2805, 340523, -18167, 224489, 593594, -147520, 288176, 178122, 310921, 395167, 2725, 99426, 95746, 438965, 148904, 452105, 235294, 388097, 496010, 308546, 179291, 108045, 56612, 111272, 224920, 440721, -72812, 269537, 235278]
14942B35278K71857k26229J70622d2649E41614j58065A81778K51470q3835Q8769
14932D38182m8782A93287K3533Q2501A43635K89783B12999M45615A68363P3885
14922B42248J1986I2221R1035J76046Q5754J22473j03306r3964j13784K44493
14912E00968p3762o2382J99854j63917K98129l03493I9089K50497J34362B26407
14901E51447B41494M84022B69474E8324N39849B52697a02102A75597C9254K33383
14891B72637J6972D4186L96526A91396J97069A07795L65329j83037J4658p1242
14881B33503n5694Q2715B4519M77751A25259J07465K95336k51879J97982j12054
14871C62109n8558j1101n9396K47311B07557M85493C15825o4141K98286B48463
$$ y = [235278, 507135, 280906, 451528, -42649, 541614, 383549, 181778, 433248, 349413, 438182, 389400, 193287, 216820, 299321, 143635, 433418, 212999, 658614, 168363, 242248, 254234, 92221, 183256, 359302, 445056, 567529, 464223, 370259, 256475, 500968, 427206, 364824, 564678, 400761, 698890, 395397, 99089, 349586, 483948, 226407, 551447, 241494, 725516, 269474, 58324, 598173, 252697, -102102, 175597, 39254, 272637, 289609, 44186, 440712, 191396, 388465, 107795, 473124, 290087, 304745, 233503, 177809, 260524, 24519, 502270, 125259, 232724, 528060, 276181, 474163, 362109, 303551, 292450, 233054, 480365, 207557, 693050, 315825, 251684, 549970, 248463]
14860F78640m8969k76221j45811M76723k57854j18941K34032j23727k04423p7467
14850A35982J81056A34454L23066Lj14088K6887K79470j8011k16746k05324J65579
14839C75290K50908K25609l89008K83887k81113a07236E48770j17489J19874k0877
14829E30278J9402N2869j04004J1049B51048J8351K46965k19170L94988q9528
14819F02654L0868k04992J46616j75479J85154A70753K09963j10731J41392J0509
14809D21886j1428J55781j69855l0127j06799L20101r0043J78686C29300K65892
14799E95192m453J66209m711B56387R0710M5657o2693K81575k54828L86561j93084
14788E50285J08094k42837j4060J91481j80509J71262A36813M93598k11068J93141
$$ y = [678640, 629671, 353450, 207639, 684362, 426508, 307567, 541599, 417872, 213449, 135982, 317038, 134454, 457520, 457523, 343435, 370322, 649792, 631781, 415035, 209711, 375290, 626198, 851807, 462799, 746686, 465573, -107236, 548770, 431281, 551155, 530278, 549680, 602549, 498545, 509594, 251048, 269399, 516364, 297194, 692182, 602654, 633522, 428530, 575146, 399667, 584821, 170753, 380716, 269985, 411377, 421886, 410458, 566239, 396384, 366257, 259458, 579559, 489516, 668202, 329300, 595192, 590739, 756948, 752237, 256387, 347097, 392754, 330061, 611636, 356808, 743369, 550285, 658379, 415542, 401482, 592963, 412454, 583716, 136813, 630411, 419343, 612484]
14778F12484j1784j63781R0379k53833K84145O1963j66325J77659q4211M76254
14768A022950l32926o7317B16977L75098q2665j2688l8551j08883O48357j17234
14758H80411k28400Q7735j97619J31371C01197N06712j80895j76041K37416J63503
14748H51892C91528M46361j55140K61600C85003K35807R7694K24316k86281J85485
14738H42024J17815j63396K35749m10780J7216L15804k13956J4901J01423J7153
14728H73953k62521L19263k98176K64044j25469J15785p4712K78540l96323K28859
14718I23243k73235K71560M4513M7789k58826R7666k18579K44854K92308j69190
14708A002103m05088K60288R7112l77237L52850r6062k25106K97591K3318j1922
$$ y = [612484, 600700, 436919, 527298, 273465, 557610, 619573, 453248, 630907, 546696, 1022950, 690024, 622707, 216977, 592075, 509410, 496722, 458171, 349288, 997645, 880411, 652011, 739746, 542127, 673498, 301197, 807909, 627014, 450973, 688389, 851892, 391528, 837889, 682749, 944349, 385003, 620810, 718504, 942820, 656539, 842024, 959839, 796443, 1032192, 621412, 638628, 954432, 740476, 755377, 856800, 873953, 611432, 930695, 632519, 896563, 771094, 886879, 812167, 1090707, 694384, 923243, 650008, 921568, 966081, 1013870, 755044, 852710, 634131, 878985, 1171293, 1002103, 597015, 857303, 954415, 577178, 930028, 833966, 608860, 906451, 929769, 917847]
14698I17847K60366m06089K36760k11365J54200J43739j60805J31245r2988L09143
14688A282053l79719j428k15322J5324N01562l17347K72087k14533j27952j480
14678H13245J86778J17535m31100O07235k64915J6932j46845K82468k44619L94507
14668A331221k80712l8818L0206K88084m63562J949K25931j03305J67226l6745
14658A121475j16816J21020o1891N5596o6419J62415k1730k7466J25778j05386
14648A186576K38063j41041J34923L8333n4511l59802J76527m1153J23495K74476
14638A575886k62931j11601K43878p9560Q6953n3114k8853r2082J22515j42319
14628A258772J60237J85486l0924l00789j74024J46932L7945k7274L15892L7087
$$ y = [917847, 1178213, 772124, 1008884, 797519, 951719, 1095458, 934653, 1065898, 972910, 1282053, 902334, 900906, 685584, 700908, 1202470, 885123, 1157210, 942677, 814725, 813245, 1000023, 1117558, 686458, 1293693, 1028778, 1045710, 898865, 1181333, 936714, 1331221, 1050509, 1011691, 1041897, 1329981, 866419, 868368, 1094299, 990994, 1158220, 1121475, 1004659, 1125679, 1063788, 1119384, 1052965, 1215380, 1193650, 1166184, 1291962, 1186576, 1424639, 1283598, 1418521, 1456854, 1402343, 1042541, 1219068, 1177915, 1301410, 1575886, 1312955, 1201354, 1445232, 1365672, 1452625, 1399511, 1370658, 1278576, 1401091, 1258772, 1419009, 1604495, 1573571, 1272782, 1098758, 1245690, 1283635, 1256361, 1572253, 1609340]
14618A609340k06108O58K13875l99543L26627P9287p3831J44566k3185J65062
14608A836748k65419Q889J83221r9859k25504L96836l7662j24484J4301j11953
14598A575114J71300K45039J23703j1869l58602J41367P7812m24967L88348K41204
14588B168449m54794L07415k00988L34450j27592l56608K96442J35603P0279j6104
14578B156552K4215J34277M1038m51617L99682l00782M42727n22688K90495Q5082
14568B298981k34231K27852q0900L38193J47013j10709J14869M58061l73162L03013
14558C088980N221q5337L65890l1353L98656l3686O34243P57504P70192K202825
14548H073135L601030P615473J7861900J1198026B0951866H057463l831484j491448
$$ y = [1609340, 1403232, 1403890, 1617765, 1218222, 1544849, 1624136, 1550305, 1694871, 1671686, 1836748, 1571329, 1580218, 1763439, 1663580, 1438076, 1834912, 1797250, 1672766, 1687067, 1575114, 1746414, 1991453, 2115156, 2103287, 1744685, 1886052, 1963864, 1538897, 1927245, 2168449, 1713655, 2021070, 1820082, 2154532, 2026940, 1670332, 1966774, 2102377, 2172656, 2156552, 2180767, 2315044, 2356082, 1904465, 2304147, 2003365, 2446092, 1923404, 2213899, 2298981, 2064750, 2292602, 2211702, 2549895, 2696908, 2586199, 2701068, 3159129, 2785967, 3088980, 3094201, 3008864, 3374754, 3343401, 3742057, 3708371, 4342614, 5100118, 5870310, 8073135, 11674165, 19289638, 37151538, 48349564, 20951866, 8057463, 4225979, 2734531]
14540B734531l65618j01764k32497K67938j88370j8892O0417j83600J97702K02166
14530B372013N1627m26622J3951O78539l10653j18428L47897l24628K67806J20052
14520B671554J50062j37409o0536K33766j87180k89780N63563m67427l8897M92185
14510B929901N8694R9930k97283L50589k28649O6611K11613K64699l44731K89576
14500C400950l58808Q6602J12515J19821Q5825J08234K59598j82192j02005j3425
14490C517115K32861M0656j31838k2868J26780J28591k98198K47168K1954L57259
14480D219480k14608p8634M86515j95923k5061j32308K74391J5899j91295J26738
14470D285194N55421o48113M32262m9635K31240J79042L1535l86179L4453L51806
$$ y = [2734531, 2368913, 2267149, 2034652, 2302590, 2114220, 2095328, 2155745, 1972145, 2169847, 2372013, 2423640, 1997018, 2010969, 2689508, 2378855, 2260427, 2608324, 2283696, 2551502, 2671554, 2821616, 2684207, 2623671, 2857437, 2670257, 2380477, 2944040, 2476613, 2437716, 2929901, 2988595, 3088525, 2791242, 3141831, 2913182, 2979793, 3191406, 3456105, 3111374, 3400950, 3042142, 3128744, 3241259, 3361080, 3446905, 3555139, 3814737, 3632545, 3530540, 3517115, 3749976, 3790632, 3658794, 3635926, 3762706, 3891297, 3593099, 3840267, 3862221, 4219480, 4004872, 3926238, 4412753, 4216830, 4191769, 4059461, 4333852, 4349751, 4158456, 4285194, 4840615, 4192502, 4624764, 4575129, 4806369, 4985411, 5016946, 4630767, 4665220, 5017026]
14460E017026K08014L7357p8966K4026L36230q8672m7524K10399k14059q8781
14450E315050N88680K23518n93320L27345n6562O8760K21095j09406M18825K8253
14440F432238N0102j89845K55212O2714L53888K65940k59557K18099o5816M9238
14430G172213J52423J18763J69788k05280J12953K47548N3250J63249J99982P4606
14420H259495K64928J84172k78744L75473o811K85232j32523L26715K10190J64549
14410I652676l6369M02260j25505L23956L5060j02769N15940k5270N9857L78708
14400A1078544K77058J41149J07445K79540K26735k00590J65530K34625K43186
14391A2553222L21150J70170M18252J2607L41461M09088K22985K72197K83463
$$ y = [5017026, 5225040, 5262397, 5183431, 5207457, 5543687, 5455015, 5407491, 5617890, 5403831, 5315050, 5903730, 6127248, 5533928, 5861273, 5804711, 5873471, 6094566, 5985160, 6403985, 6432238, 6482340, 6292495, 6547707, 6610421, 6964309, 7230249, 6970692, 7188791, 7122975, 7172213, 7324636, 7443399, 7613187, 7407907, 7520860, 7768408, 7821658, 7984907, 8184889, 8259495, 8524423, 8708595, 8429851, 8805324, 8798513, 9083745, 8951222, 9277937, 9488127, 9652676, 9616307, 10018567, 9893062, 10217018, 10252078, 10149309, 10665249, 10639979, 10699836, 11078544, 11355602, 11496751, 11604196, 11883736, 12110471, 11909881, 12075411, 12310036, 12553222, 12874372, 13044542, 13462794, 13475401, 13816862, 14225950, 14448935, 14721132, 15004595]
14382A5004595j50115O41440J81888M30167N8997M47455K80365N72029K58198
14373A7725019J74603J35859N82073L46308J98404O29630O93848p9593O38411
14364B1044562K57106O06402M08156N38751O79891M46257N82743L71695P06195
14355B5641758L04659Q45805Q28161M83785M88352P89148O02938P23792O04921
14346C1313319J201534N63393J039919J123984P46792R38610R43843Q96919J328587
14337D0096900J322546J256779P21580J330472J291247J190404J761515J599760
14329E0571203J511469J292143K285569J983140J107276K228704J992359K210063
14321F5181926K489277J887918K724098K665555K696409K858505K917057L082093
$$ y = [15004595, 14854480, 15495920, 15677808, 16107975, 16166972, 16614427, 16894792, 17466821, 17725019, 17899622, 18035481, 18617554, 18963862, 19162266, 19791896, 20485744, 20406151, 21044562, 21301668, 21908070, 22316226, 22854977, 23534868, 23981125, 24563868, 24935563, 25641758, 25946417, 26792222, 27620383, 28104168, 28592520, 29381668, 29984606, 30708398, 31313319, 32514853, 33078246, 34118165, 35242149, 35988941, 36927551, 37871394, 38768313, 40096900, 41419446, 42676225, 43397805, 44728277, 46019524, 47209928, 48971443, 50571203, 52082672, 53374815, 55660384, 57643524, 58750800, 60979504, 62971863, 65181926, 67671203, 69559121, 72283219, 74948774, 77645183, 80503688, 83420745, 86502838]
14313H6502838L599661L683137L869413L447259M263213M671646M880433M608137
14305A19525737N411573N259698O008689N896137O440107P132773O796613P767778
14297A70239105P948491Q338908Q989922R701469R745598J0647897J0847133J1545442
14289B48003965J2188257J2416927J3269305J3534117J3702706J3642269J4730170
14282C41487716J4705435J4636795J4338654J4065372J3271241J2965288J1315434
14275D36785935J0282736Q991612O305286L046095O79021L96590L2531l930103
14267D62589703m346290p159075r702537j1040617j2743925j3968513j4662997
14260C88965749j4971151j5172681j5950656j5313325j5249443j4347725j4525384
$$ y = [86502838, 90102499, 93785636, 97655049, 101102308, 105365521, 110037167, 114917600, 119525737, 124937310, 130197008, 136205697, 142101834, 148541941, 155674714, 162471327, 170239105, 178187596, 186526504, 195516426, 205217895, 214963493, 225611390, 236458523, 248003965, 260192222, 272609149, 285878454, 299412571, 313115277, 326757546, 341487716, 356193151, 370829946, 385168600, 399233972, 412505213, 425470501, 436785935, 447068671, 456060283, 462365569, 465411664, 466090685, 466487275, 466519806, 462589703, 458243413, 451084338, 441381801, 430341184, 417597259, 403628746, 388965749, 373994598, 358821917, 342871261, 327557936, 312308493, 297960768, 283435384]
14253B83435384j3546397j3141079j2607584j2116204j1159196j0819765j0084678
14246A99960481r996644q667380q554876q096250p359474p174534p136975o369473
14238A36604875n835583n410482n386022n118600m952168m577820l867372m098174
14230I7358654l727598l524607l587728l253257l292060k779368l074862k714213
14222G1404961k486228k149600k132203k198191k069131j778890k351101j570880
14214E4668737j777949o65101j922077j699460j812248j363516r23534p21963
14206D3782889j312219j413789j158049j282783j162898n89637m62786j596500
14198C4804228p45775j024783j132582o37132n71250l26288j082353q20092p97589
$$ y = [283435384, 269888987, 256747908, 244140324, 232024120, 220864924, 210045159, 199960481, 189963837, 181296457, 172741581, 164645331, 157285857, 150111323, 142974348, 136604875, 130769292, 125358810, 119972788, 114854188, 109902020, 105324200, 101456828, 97358654, 93631056, 90106449, 86518721, 83265464, 79973404, 77194036, 74119174, 71404961, 68918733, 66769133, 64636930, 62438739, 60369608, 58590718, 56239617, 54668737, 52890788, 52225687, 50303610, 48604150, 46791902, 45428386, 44504852, 43782889, 42470670, 41056881, 39898832, 38616049, 37453151, 36863514, 36400728, 34804228, 34058453, 33033670, 31901088, 31263956, 30692706, 30366418, 29284065, 28463973, 27666384]
14189B7666384o88412o06433m92346p57804l76786p57586K6549j238586n59772
14180B2215208j25776m07972m72607k03439q70841l01354l60336l28690n57614
14171A8586579p5139m94465n92978J12047l69389p73506o7557j30221k24002m13097
14161A5558272L5135r32557M1537l74097N1029m43754N1085n97720K01513o39939
14151A2950504p299l55513M9101j9285p26993k69853K78080m37995l06167K2851
14141A1177431m22753k2982J20090n06370L64667m31471m9211k83202r5778l93290
14131I457131K26583o70173J73086q6171o6871l35980o6390O4015k52827Q4077
14121H526480m66005k81363L54909k41636j6962j0250j67709k07358j04648l07969
$$ y = [27666384, 26977972, 26371539, 25879193, 25121389, 24744603, 23987017, 24013566, 22774980, 22215208, 22089432, 21681460, 21208853, 21005414, 20134573, 19833219, 19472883, 19144193, 18586579, 18511440, 18016975, 17423997, 17536044, 17166655, 16393149, 16325592, 16195371, 15971369, 15558272, 15593407, 14660850, 14702387, 14328290, 14379319, 13935565, 13986650, 13388930, 13590443, 12950504, 12943205, 12587692, 12636793, 12617508, 11890515, 11620662, 11898742, 11460747, 11154580, 11177431, 10754678, 10731696, 10851786, 10345416, 10710083, 10278612, 10229401, 9946199, 9850421, 9457131, 9683714, 9013541, 9186627, 9100456, 9033585, 8697605, 8631215, 8695230, 8442403, 8526480, 8060475, 7779112, 8134021, 7892385, 7875423, 7865173, 7697464, 7490106, 7385458, 7077489]
14111G077489O7630l6143p5538j16741k02916J01500k13721j21078L5281R9531
14101F615294j41877j13626j11320P9639j11360K0142k42281K40094p1258n11144
14091E652303P691K01658l6547j50052m39018M05943l09452J26806j98851k36620
14081E023861j43243K2685J15546J21625j67417n3163k32187j42307R1684R5074
14071D732158K12082m69886R2333k85130J93866k18961k71170M04163k85049L8712
14061D143118M93381l65058j79801k47013M79789n92652L22659k41536k86812
14052C526075N99165m69529J91383j1522k59000J08245j43972K42851k03432R6817
14042C677081m01651J09981J69540l16505L29280k41459J07923N4740l53418J80731
$$ y = [7077489, 7145119, 7108976, 7033438, 6916697, 6713781, 6815281, 6601560, 6480482, 6515763, 6615294, 6473417, 6359791, 6248471, 6328110, 6216750, 6236892, 5994611, 6234705, 6163447, 5652303, 5659994, 5861652, 5825105, 5675053, 5236035, 5641978, 5332526, 5459332, 5260481, 5023861, 4880618, 4903303, 5018849, 5140474, 4973057, 4919894, 4687707, 4545400, 4637084, 4732158, 4944240, 4474354, 4566687, 4281557, 4475423, 4256462, 3985292, 4389455, 4104406, 4143118, 4636499, 4271441, 4091640, 3844627, 4324416, 3731764, 4054423, 3812887, 3526075, 4125240, 3655711, 3847094, 3835572, 3576572, 3684817, 3540845, 3783696, 3580264, 3677081, 3275430, 3385411, 3554951, 3238446, 3567726, 3326267, 3434190, 3488930, 3135512, 3316243]
14032C316243J372l9370J06057n64305L87483m89798J04508J0309P1144K1235
14022B924878j67019J38066j10653O5647o5831R7560K85407m40432o6866L6231
14012B696988K89782l27195R7163k77378L01557m10423j00956L72621O0588l28780
14002B373967p0769j73521N31355j32702n67500L64341J99780j54791O494O8977
13992B445631k31354P17665L12759P79001K477941O253672J6968911K0600702
13984E0324928k2326042A3686949n088186k294330j238968r43376q7115n20072
13976C514902m4511o6401n37509k15476M39512m56055R3029k1806l41942R6266
13966B460009J75517o0719j73973L84691p98552K01548J5686J10875l8933k26136
$$ y = [3316243, 3317615, 3278245, 3384302, 2819997, 3207480, 2717682, 2822190, 2832499, 2903643, 2924878, 2757859, 2895925, 2785272, 2850919, 2785088, 2882648, 3168055, 2727623, 2660757, 2696988, 2986770, 2659575, 2756738, 2479360, 2780917, 2370494, 2269538, 2642159, 2702747, 2373967, 2303198, 2129677, 2661032, 2528330, 1960830, 2325171, 2524951, 2370160, 2376654, 2445631, 2214277, 2931942, 3244701, 4023702, 6501643, 12755315, 29724226, 50324928, 27998886, 13686949, 8598763, 6304433, 5065465, 4122089, 4034974, 3514902, 3470391, 3403990, 2866481, 2651005, 3090517, 2634462, 2727491, 2705685, 2363743, 2460009, 2635526, 2574807, 2400834, 2785525, 1986973, 2188521, 2204207, 2315082, 2276149, 2050013]
13956B050013L69798j55964j13978K523j83197n7206j34920J67896j3920P0586
13946B001631j27473o3457N91842p02149O58454n44654r9002J99072j38190O7388
13936A843462j96060K86435l05371K05191k53958J44439N2226l20682K85717o2913
13926A678486J90665o00459O52771j29683k27773J39853l18192Q9987J9002L26243
13916A820900k68513O7048j03408O9777L316n7356k67395J18794J74010L99650
13906A956823k06472m77830J83475j25039K04110l34873O18515m74278j52353
13897A192078M76411m19838J81226J86778j80822K11539J07212m54983j07856
13888A191745J21601K5615n3670J06165k14614p2762J80876j42202m6789K5027
$$ y = [2050013, 2419811, 2263847, 2149869, 2152392, 1969195, 1911989, 1777069, 1944965, 1931045, 2001631, 1874158, 1810701, 2402543, 1700394, 2358848, 1814194, 1715192, 1914264, 1776074, 1843462, 1647402, 1933837, 1628466, 1833657, 1579699, 1724138, 1776364, 1455682, 1741399, 1678486, 1869151, 1268692, 1921463, 1791780, 1564007, 1703860, 1385668, 1475655, 1494657, 1820900, 1552387, 1619435, 1516027, 1585804, 1589120, 1531764, 1264369, 1383163, 1557173, 1956823, 1750351, 1272521, 1455996, 1330957, 1535067, 1200194, 1818709, 1344431, 1192078, 1668489, 1248651, 1429877, 1616655, 1435833, 1647372, 1754584, 1299601, 1191745, 1313346, 1338961, 1285291, 1391456, 1176842, 1104080, 1284956, 1142754, 1095965, 1120992]
13878A120992K88808k60067J51627p6932o3554Q3840q6743p6609Q3670j77739
13868I87293K95283k30854L04846m38809J64906J78650j48364k3828Q2002Q9080
13858A260205j49708R460L15184o24615L35217K42968l22271j46453K76996k20255
13848I76728N16602J54305p20199K00200r7234J23860k32849M4187K93709k25332
13838A033977l14075M16081j04531j36307O3585K71289j76209l44044L33432J16862
13828A160060k74035J0050L16604j79173r8561k5030R3003K3768j18014K86755
13818A195427l36631J36663l75268M02449K28942l02548J01292j44053j87144
13809G19129K46899k51608M3558K59997k59116K95571m34062J53299o458K51256
$$ y = [1120992, 1409800, 1149733, 1301360, 1224428, 1160874, 1244714, 1157971, 1081362, 1165032, 987293, 1282576, 1051722, 1356568, 917759, 1082665, 1261315, 1112951, 1089123, 1171125, 1260205, 1110497, 1119957, 1435141, 810526, 1145743, 1388711, 1066440, 919987, 1196983, 976728, 1493330, 1647635, 927436, 1127636, 1030402, 1154262, 921413, 965600, 1259309, 1033977, 719902, 1135983, 1031452, 895145, 958730, 1230019, 1053810, 709766, 1043198, 1160060, 886025, 896075, 1212679, 1033506, 934945, 909915, 1002918, 1026686, 908672, 1195427, 858796, 995459, 620191, 1022640, 1251582, 949034, 1050326, 906273, 719129, 966028, 714420, 757978, 1017975, 758859, 1054430, 620368, 773667, 767209, 1018465]
13799A018465k72888L58535k19529k7918K48090k48689R7166o4311R049o38k67133
13788F30199K41679l9936j02423J10884l3379P0157Q7060J35816l97440J20397
13778H23014k94712N91757l13631P2509j00123o3405q7009L18564k11745r4235
13768F40984M6526J65240K9284j23724O5347K68166C23542K97648J9308j12490
13758E28008J20163L4130K85151k63357K65975k62533r9968J79004l45763K91782
13748G32592j82994O6397O7738k59847M30415j55243K6336K4038k01790J07028
13738F54670m5228k35507M65070k63609K13186m085k0624k9519n3383p7302J45905
13727G49574k40788J55302R3242k06291l1378K90493l92775N46299D09237n2647
$$ y = [1018465, 745577, 1104112, 884583, 856665, 1104755, 856066, 953232, 888921, 897970, 897332, 630199, 871878, 831942, 729519, 840403, 807024, 877181, 964241, 1100057, 702617, 823014, 528302, 1120059, 806428, 878937, 778814, 715409, 628400, 946964, 735219, 640984, 687510, 852750, 882034, 758310, 823657, 1091823, 323542, 621190, 640498, 528008, 648171, 682301, 967452, 704095, 970070, 707537, 607569, 786573, 440810, 732592, 549598, 615995, 683733, 423886, 854301, 699058, 725394, 749432, 547642, 654670, 609442, 373935, 839005, 575396, 788582, 784497, 763873, 734354, 680971, 603669, 749574, 508786, 664088, 757330, 551039, 519661, 810154, 417379, 963678, 409237, 356590]
13717C56590K22423j65001K76007P5642L1667j90388j48812r762J71295j94279
13707D25382o5161K28181j04653J24922J26071j32280j59195J89178k14505L7483
13697D55423J63597k14268K91614k94999K23237k35738N55366l21572j14315J6163
13687E24508M1557O0912L8675j46910j73355A44611O40364l40866l1347j00035
13677C12727J71229M17696C93460K01840k68630K79211m1149j67679M41167l08815
13667E29405B55881J64359J63781j91560j00218L40354m2410J3594J39370j56457
13657E86694j59718j56192J65900j58208L4050L61065l01040r2969K82147r0524
13647D71205L10077C64906m1513J89006L0691k00867R6385M49530C61823N2339
$$ y = [356590, 579013, 414012, 690019, 765661, 797328, 606940, 458128, 448366, 619661, 425382, 360221, 588402, 483749, 608671, 734742, 602462, 443267, 632445, 417940, 455423, 619020, 404752, 696366, 401367, 624604, 388866, 944232, 622660, 508345, 524508, 566065, 626977, 665652, 518742, 345387, 144611, 784975, 444109, 412762, 312727, 483956, 901652, 393460, 595300, 326670, 605881, 564732, 397053, 838220, 529405, 255881, 420240, 584021, 392461, 292243, 632597, 590187, 603781, 743151, 586694, 426976, 270784, 436684, 278476, 312526, 673591, 372551, 279582, 561729, 471205, 781282, 364906, 323393, 512399, 543090, 342223, 438608, 888138, 361823, 414162]
13637D14162p9147L0492J70420q2722k822K7630l9626j18808A26762N44421m6823
13626F24360j6303q3498B16966M29711C13400l6542J0992J62058j43756J36107
13616D42259j19690j43355L72878j70199J15932N0250N8582k37458P6188J0544
13606D55931l8973p850n8727R1564p1092q3480j29873K5140G0453K41280R0110
13595D01843K37347j68140J21075o2868D9917Q1572L4727M07620A6783M04442
13585D21225e8354B59126L58381A59377M22224B26305K08747J15306q3007L8538
13575E05889A89797J34799A42460K4028L48726q5255n0736j08567r5453K44911
13565D20114K16284B09703L56729k23382L47478k06289A18122N01567j99033J49791
$$ y = [414162, 335015, 365507, 535927, 453205, 450383, 478013, 438387, 319579, 126762, 671183, 624360, 608057, 524559, 216966, 646677, 313400, 276858, 287850, 449908, 306152, 442259, 322569, 179214, 552092, 381893, 497825, 548075, 606657, 369199, 445387, 455931, 416958, 409108, 350381, 441945, 370853, 287373, 157500, 182640, 70453, 311733, 401843, 639190, 471050, 592125, 529257, 49917, 131489, 166216, 573836, 16783, 421225, -58354, 259126, 617507, 159377, 581601, 226305, 435052, 550358, 467351, 505889, 189797, 324596, 142460, 166488, 515214, 429959, 379223, 270656, 175203, 420114, 636398, 209703, 566432, 343050, 690528, 484239, 118122, 619689, 420656, 570447]
13555E70447k48066O6683A09534M67792A59833K65590k4215q7141H8115J86404
13545B74519J33705q8798p7985I3296P8217K46071o4338d9412C98477j60548K35415
13534D73344j00304n7903N11936A60567D6891N4645K62038j71437J85015d0819
13523D64809J20502Q0875A33261D9124J20382J24857G8459K47643j11784J14539
13513C28857J05154A58407J68024J17993j40473q9558L03608A52181K94521j05365
13503C41337K4066J43979A27995K73101A55057K75264j04243K03442F8757K18004
13493B86761K0134n9216J86639m0763j42903J62554k028A26426K32342M0541N6513
13482D55822q9520j51726b1451f628E7338h4342I7077L07895A26529K856j5103
$$ y = [570447, 322381, 389064, 109534, 577326, 159833, 425423, 401208, 314067, 88115, 274519, 408224, 319426, 241441, 93296, 171513, 417584, 353246, -49412, 398477, 237929, 473344, 373040, 315137, 827073, 160567, 46891, 101536, 363574, 192137, 377152, -40819, 464809, 585311, 666186, 133261, 49124, 169506, 294363, 78459, 326102, 214318, 328857, 434011, 158407, 326431, 444424, 303951, 214393, 518001, 152181, 446702, 341337, 365403, 509382, 127995, 401096, 155057, 430321, 326078, 529520, 68757, 286761, 306895, 247679, 434318, 393555, 250652, 413206, 411178, 126426, 358768, 399309, 455822, 366302, 214576, -21451, -6628, 57338, -84342, 97077, 404972, 126529, 129385, 114282]
13471A14282L94488B8423K15097J22425j6639K50174B63950q3327J36951k3720
13461B93854C8532M41402A94779H7784P5461K94060A29120J3018e7348D78213
13450A56521j8522L92926j53726A15473k5266g0543G0527L3730M9681J89274a52821
13438A21995m4333K26274J7099A54799a40827H5602D1275K9244J66041P8010j24812
13427A89758Q1651D3578K72248Q4769j10492n5877J44427o1196K73055B45030
13416B37210J26130a24946C31610p3190M2852l0136p8439Q4817A3066J68968q6659
13405I5375L5161K49635n0879f0323A40821D6526J68041a15821F6655K24290c7879
13393A24073K29873P0896a289B93458J06261m7183j01147a50273A20673K05755
$$ y = [114282, 508770, 28423, 243520, 365945, 349306, 599480, 263950, 180623, 317574, 293854, 38532, 479934, 194779, 87784, 163245, 457305, 129120, 142138, -57348, 478213, 156521, 137999, 530925, 377199, 115473, 90207, -70543, 70527, 104257, 153938, 343212, -152821, 121995, 77662, 303936, 321035, 154799, -140827, 85602, 41275, 70519, 236560, 314570, 189758, 271409, 43578, 315826, 400595, 290103, 234226, 378653, 317457, 590512, 245030, 237210, 363340, -124946, 331610, 258420, 301272, 271136, 192697, 277514, 13066, 182034, 95375, 130536, 380171, 329292, -60323, 140821, 46526, 214567, -115821, 66655, 290945, -37879, 124073, 353946, 424842, -1289, 293458, 399719, 352536, 251389, -150273, 120673, 326428]
13383C26428n9553n8704E3063a87454C98545q3438H6126J61622h7804B53971m142
13372B49829L7475J74524A26373L92903L7453B50744m8898Q825B1853J70509L4453
13361B26815k4051k7840L05137B35563E2031N4823K51798A44797K00799j09581
13351B36015K3280J17764J4439F7689J42307A04593J30829J64539A31732K21658
13341C53390O2567J05965B39842r1769J38683n1630J69721g7549D70260A26853
13330H7599r631J88796H480K54546n8781P9820a37550n8293C75869k1882B8738
13318A69543H0583L25355M5768A51641J75689j61859M9967Q2370J29174A02561
13307B45491G1466f1025J8659B69359K09748h2136H3500J02843M6654b46353A78474
$$ y = [326428, 266875, 208171, 53063, -187454, 398545, 315107, 86126, 247748, -87804, 253971, 249829, 287304, 461828, 126373, 519276, 556729, 250744, 201846, 210671, 21853, 192362, 226815, 202764, 174924, 480061, 235563, 52031, 106854, 358652, 144797, 345596, 236015, 259295, 377059, 391498, 67689, 209996, 104593, 235422, 399961, 131732, 353390, 415957, 521922, 239842, 148073, 286756, 235126, 404847, -77549, 470260, 126853, 87599, 77968, 266764, 8480, 263026, 204245, 284065, -137550, -195843, 375869, 353987, 28738, 169543, 80583, 405938, 451706, 151641, 327330, 165471, 215438, 297808, 426982, 102561, 245491, 71466, -61025, -42366, 269359, 479107, -82136, 83500, 186343, 232997, -246353, 178474]
13295C72862j83652i2375B54029P0988H7556L38435j92165c9625F2955h9540L7840
13284e1700C043M99835B21365n0584R4195J43277K5790a0373C23236A9643L89842
13273D09485j90490a31298A69061J61313L1135E64c2783A01598h6608J1794A67377
13261A93422R0992E2575L8943l1626L35521C894R1150J05750K84002c17390B40423
13249a11798G3451N0374K52040j63740J31501F8602K37393a5545C74824j66953
13239B07871J0357g22j1889m7073A08214j6058J42112J5045l8429p8923b35084
13227e559j17203B20379i716c349I0082N9975K75008h5472B8669K50592h8551
13215A01172L30284A42805n3665N9589Q327J27250a07350B03727L9304E244M08721
$$ y = [372862, 189210, -92375, 254029, 325017, 87556, 425991, 233826, -39625, 62955, -89540, -51700, 3043, 502878, 221365, 170781, 264976, 408253, 434043, -10373, 323236, 19643, 409485, 218995, -131298, 169061, 330374, 361509, 564, -32783, 101598, -86608, -74814, 167377, 193422, 284414, 52575, 91518, 59892, 395413, 3894, 95044, 200794, 484796, -317390, 240423, -111798, 73451, 123825, 375865, 212125, 343626, 68602, 305995, -15545, 374824, 207871, 218228, -722, -12611, -59684, 108214, 92156, 234268, 249313, 210884, 131961, -235084, -5559, -122762, 220379, -9716, -3349, 90082, 150057, 425065, -85472, 28669, 279261, -88551, 101172, 431456, 142805, 89140, 148729, 157056, 284306, -107350, 203727, 243031, 5244, 413965]
13204D13965A80411i798j59620C90118a70117A54712C2543c13362A06824K03537
13194C10361A15713K55552j32891J31869b04830B54380F481L05317H6657J39264
13184B25921c714A61562J2144F6454J00474H2801j3420R4450Q8420m9937H422
13172A85981p7530c15361O4522a7586B1942b6850H1405a9640B24418r3247D0424
13160H6752A9126J04005M8891K5297l9535B3203L75134j19054a54884A31824K21836
13149C53660c34696A67385l546G8929K694J22033L1293b3533A27053M4805f2931
13137A79899c7150j6774B06890D5960J0155g7870F4903k8443N3799C9809P8862
13126A18671K40701j66694C7061r989a1233o6846D00877H4374c70522B26389I307
$$ y = [413965, 180411, -9798, -169418, 390118, -170117, 154712, 32543, -313362, 106824, 310361, 115713, 371265, 238374, 370243, -204830, 254380, 6481, 311798, 86657, 225921, -3714, 161562, 173706, 66454, 166928, 82801, 69381, 163831, 252251, 202314, 8422, 185981, 108451, -315361, -250839, -17586, 21942, -26850, 81405, -19640, 224418, 131171, 40424, 86752, 19126, 123131, 172022, 197319, 157784, 23203, 398337, 279283, -154884, 131824, 353660, -334696, 167385, 163839, 78929, 81623, 203656, 234949, -23533, 127053, 171858, -62931, 179899, -37150, -53924, 206890, 45960, 56115, -77870, 64903, 36460, 90259, 39809, 118671, 359372, 192678, 37061, 27072, -11233, -78079, 400877, 84374, -370522, 226389, 9307]
13114i4690B76711A27795J35411m7329g0520A07977R3569e3907I2816c25893A97961
13102a53141C84584A91414K71667e3400A12045a74249l6077A6642p33K09666d3293
13090a04961a3249D8384a89287A66993a97659a4152n0016B57373a0914A81239
13079A805J530d8053C8648K56828a35624A43294L06163q3419F2141J51365p2858
13068A40648m3379K26966b30224C5027K25106a4656F770K39369N643a16165A68619
13056D2495P4105J43252a40988B54285p5450J20348b48698E7042K58244G8249
13045a16921B01630K76q5110k6231a81729A12805g6399A32403D207L53496a26094
13033a33056O5678E10674A20159J70048r6517K12326A23346d8752p161E8576O7914
$$ y = [-94690, 276711, 127795, 263206, 215877, -70520, 107977, 201546, -53907, 92816, -325893, 197961, -153141, 384584, 191414, 463081, -53400, 112045, -174249, -210326, 16642, 15909, 225575, -43293, -104961, -13249, 48384, -189287, 166993, -197659, -14152, -64168, 257373, -10914, 181239, 1805, 3335, -48053, 38648, 295476, -135624, 143294, 449457, 366038, 62141, 213506, 140648, 97269, 324235, -230224, 35027, 260133, -14656, 6770, 246139, 251782, -116165, 168619, 42495, 116600, 259852, -140988, 254285, 178835, 299183, -248698, 57042, 315286, 78249, -116921, 201630, 201906, 116796, 90565, -181729, 112805, -76399, 132403, 4207, 357703, -126094, -133056, -67378, 510674, 120159, 290207, 193690, 406016, 123346, -48752, -55913, 58576, 126490]
13022A26490K3900f7477D40774g8128A29277d1393B09039J949K18931A87705H8226
13010F7477J84077j1501d5677j94927A72443E562O3201a230A43984j4177b1072
12998A24251E5617h3166m3381j0959j47555k6806I5859c2742A9774b88523B30131
12986A0720J66416l5484l3295M48630d7893o0471B35046j09951k3478m647K1833
12975A18803k9757K674a44550a7509B99677a31124M5973M1629j10320A52450a76184
12963b46665O9892A08669a64190C57860b5370C14261a67448C03884G8J2698L2196
12952D4972K81514j58921f9230C28726p0197F3947K0957c1300j00912d2876B55957
12940h0400C27144G1375c51715a63575C68270b73099e2269D30420j04484G2419
$$ y = [126490, 150390, -67477, 440774, -78128, 129277, -41393, 209039, 210988, 429919, 187705, 88226, 67477, 251554, 240053, -45677, -240604, 172443, 5562, 68763, -1230, 143984, 129807, -21072, 124251, 55617, -83166, -126547, -137506, -285061, -311867, 95859, -32742, 19774, -288523, 230131, 10720, 177136, 141652, 108357, 556987, -47893, -108364, 235046, 125095, 101617, 96970, 118803, 89046, 91720, -144550, -17509, 299677, -131124, -85151, -43522, -153842, 152450, -176184, -246665, -176773, 108669, -164190, 357860, -25370, 314261, -167448, 303884, 78, 12776, 44972, 326486, 167565, -69230, 328726, 258529, 63947, 84904, -31300, -132212, -42876, 255957, -80400, 327144, 71375, -351715, -163575, 368270, -273099, -52269, 430420, 325936, 72419]
12929i8448B57648j10491a50552B21093G533L69949I1744a5846k53820D6951e5565
12917a09A54058g7852D0672R487a91899M3697k6557A50543a68825A84577C7569
12905A91035i941j17396E6683N2133b22308B09234I4289a38311B82710a76317
12894A55018J43592b4145l0385H9210J42861O1783A05277M4059G0787a52974B74555
12882b29293C22097B5624i561C15391r4841l881h0137G6469D501O4308o172k5211
12870C7426h1839b1641A5749J36101H861J2659g4372C46330j8801i1691K5064
12859f6627A0904a29485B5920k10i7852A03913j1962h2913j00243J3613D7899
12847B20364j04589p515e3170D14313b30163C06874j28394J20813f6279b7889
$$ y = [-98448, 257648, 147157, -150552, 221093, 7533, 377482, 91744, -15846, -269666, 46951, -55565, -109, 154058, -77852, 40672, 50159, -191899, -148202, -174759, 150543, -168825, 184577, 37569, 191035, -9941, -127337, 56683, 108816, -222308, 209234, 94289, -138311, 282710, -176317, 155018, 298610, -24145, -54530, 89210, 232071, 293854, 105277, 149336, 70787, -152974, 274555, -229293, 322097, 25624, -9561, 315391, 220550, 216669, -80137, 76469, 4501, 68809, 62637, 37426, -81839, -21641, 15749, 151850, 8861, 21520, -74372, 346330, 327529, -91691, -66627, 10904, -129485, 25920, 25710, -97852, 103913, 91951, -82913, -183156, -169543, 47899, 220364, 115775, 108260, -53170, 414313, -230163, 306874, 178480, 299293, -66279, -27889]
12836e3269o2333b5163l19170J6004A03959m0525b11562G644J60791a705A18749
12824b10982R9804I4734N2853F7455K7852a8766C7494e5268a0550m22650B21234
12812A43069a44739A05601j6754K10928A3642a77514o0868a6376n077A65081b03985
12800G7404a55045B25405c4658n3938r5626A40166b05658C05886d0368I8753g4120
12788d33080b02753E6388i8353B54044a7370k95262E4826J53814b13007N7417
12778a55590j08030A79664g3995b0365j40374A05324O7607m0678e4263D1206d6541
12766A81934g3845A02962h4794c1390p737k62060J48830n2031I2645c8371h792
12754C0581c1086A2295h5466A20483a20129O810A82059e6759J5105o0899A77593
$$ y = [-53269, -115602, -25163, -344333, -328329, 103959, 63434, -211562, 7644, 168435, -1705, 118749, -210982, -111178, 94734, 147587, 67455, 95307, -18766, 37494, -55268, -10550, -433200, 221234, 143069, -144739, 105601, 88847, 299775, 13642, -177514, -238382, -16376, -21453, 165081, -203985, 77404, -155045, 225405, -34658, -88596, -184222, 140166, -205658, 305886, -40368, 98753, -74120, -433080, -202753, 56388, -98353, 254044, -17370, -312632, 54826, 208640, -213007, -155590, -263620, 179664, -73995, -20365, -160739, 105324, 172931, 132253, -54263, 41206, -46541, 181934, -73845, 102962, -84794, -31390, -39127, -301187, -152357, -204388, 92645, -38371, -8792, 30581, -31086, 12295, -85466, 120483, -120129, -113319, 182059, -56759, -41654, -102553, 177593]
12742c19968B21331b65117C51361D025N0591f6825j67163C1383K2971J94763I1905
12730B03291h8245a9836A50080o8364K20k9337d2491B17125l9450a45026A56424
12718E5336f6404A8239K60961f6636M988B39891j07555i3828C10631K36252k59898
12707B86985p2273A06474J6351a45581C77223e8661E4671a74946I404J54329p0166
12696I3567L04160a52748R0B81045C5134J93149K0459D8788h8860A21380J6944
12685A38324a27589A87581o7078M0679b1591B8947c6980A25934j3992J49369E586
12673b82186F2220J17587J27078a78160h0244D4123K91856j221C6471Q6152N7857
12662A80480i248B80491I4423J53122c8884A18115K89033j17725r5060J5586F774
$$ y = [-319968, 221331, -265117, 351361, 4025, 54616, -66825, -233988, 31383, 54354, 249117, 91905, 203291, -88245, -19836, 150080, 81716, 81936, 52599, -42491, 217125, 177675, -145026, 156424, 55336, -66404, 18239, 279200, -66636, -61648, 239891, 132336, -93828, 310631, 546883, 286985, 214712, 106474, 122825, -145581, 377223, -58661, 54671, -174946, 9404, 163733, 93567, 397727, -152748, -152658, 281045, 35134, 228283, 248742, 48788, -88860, 121380, 138324, -127589, 187581, 120503, 161182, -21591, 28947, -36980, 125934, 111942, 261311, 5586, -282186, 62220, 179807, 306885, -178160, -80244, 44123, 335979, 334758, 36471, 122623, 180480, -9248, 280491, 94423, 247545, -38884, 118115, 407148, 289423, 194363, 209949, 6774]
12650g043j8938j80247q5782a2241C36560j60457R7048E6368J94622j0198b60703
12638A6998a37252r1088C332J3933R2599O8076J11328L21731b34031B87763j04982
12627A82781n7105J95489M5868A47663Q5817f0295C58748j52523F9460L0076I613
12615F5251h0641A00061Q7184J43710b1402n5577k09408B71264h1474p4899A37871
12603C08501B9183j3393K10488b4044A66706G9714Q9880b0780j67598g9125I9086
12591B09267L9943r8232Q3406a51180c9062D73221b6915B24822A603K91801b71037
12579a14718j5421j87282D66776A25479a64009g3812A82928F2232J75301g7250
12568a66074d0538C2698f8325d916A88536E7469J52605b83448E4475K04709b79938
$$ y = [-7043, -25981, -206228, -292010, -12241, 336560, 176103, 273151, 56368, 250990, 240792, -260703, 16998, -137252, -228340, 3332, 17265, 109864, 177940, 289268, 610999, -234031, 287763, 182781, 125676, 321165, 367033, 147663, 233480, -60295, 358748, 206225, 69460, 99536, 9613, 65251, -80641, 100061, 187245, 330955, -21402, -76979, -286387, 271264, -81474, -156373, 137871, 308501, 29183, 15790, 226278, -24044, 166706, 79714, 169594, -20780, -188378, -79125, 99086, 209267, 249210, 150978, 234384, -151180, -39062, 473221, -26915, 224822, 1603, 293404, -271037, -114718, -130139, -317421, 466776, 125479, -164009, -73812, 182928, 62232, 237533, -77250, -166074, -40538, 32698, -68325, -4916, 188536, 57469, 210074, -283448, 54475, 259184, -279938]
12556A28787a75861A17283d332j76880A57081K19141r777A50367J25314b45743
12545A09773O9729J31455a73265C15301h828j66896b7307r6363A53704J5626j9518
12534A49812b19547h5929a3382B49194k1641H1960J05355N5339j21092R6414J86846
12523D04822f7523n8174B17340p9301O7527b99583B68229J39432C0735a22337
12512d4010j95767a5996j35145A49974C9368b81371D68023a26854B16144J7225
12502B33369a55439A55999h1701A88474d9273m9654C417g450k41009C6132J8613
12491E4745R0478b76865B44117J9133a14282j74383f7859B47b33973C86M2394
12480D2780g0248A00715R9120a22443k3850j1569B26313B5150g2177p7728A83825
$$ y = [128787, -175861, 117283, -4332, -181212, 157081, 376222, 366445, 150367, 275681, -245743, 109773, 179502, 310957, -173265, 315301, -8828, -175724, -27307, -123670, 153704, 169330, 149812, -219547, -85929, -13382, 249194, 227553, 81960, 187315, 242654, 121562, 217976, 404822, -67523, -125697, 217340, 138039, 205566, -299583, 268229, 407661, 30735, -122337, -44010, -239777, -15996, -151141, 149974, 39368, -281371, 468023, -126854, 216144, 233369, -155439, 155999, -81701, 188474, -49273, -98927, 3417, -7450, -248459, 36132, 54745, 145223, -276865, 244117, 263250, -114282, -288665, -67859, 247, -233973, 386, 42780, -70248, 100715, 199835, -122443, -146293, -157862, 226313, 25150, -72177, -149905, 183825]
12468b50370p926a956m8545k56087A83824d4382o0120c6149l86907J66404b4064
12456A61431J22126C771M9246i2630k37133d2314l1914D6333K0429b1432m62718
12445d84150C0168a49489f0325p8789a6840I6032O656i9399k32755I6286R9590
12434A95876D6111Q8685c7948k01574A24195n1896g4010j85229C3643h588B36689
12422a17966B74648L2484c47304a13632A41844b53655C50113A50891b79604h8160
12411B1894L00234a43462j36871h9825o4661P3415B16715I5169a20456B15039
12400a21115B27427A03093d8307F5863J08113a69204e3213A0459b43743D047e8772
12388A19875d29610d0478j28612A23343m0213P7122E8962J18941F3903M4340L07616
$$ y = [-250370, -258296, -1956, -50501, -306588, 183824, -44382, -104502, -36149, -423056, -256652, -24064, 161431, 283557, 3771, 53017, -92630, -329763, -42314, -74228, 46333, 66762, -21432, -484150, 30168, -149489, -60325, -139114, -16840, 96032, 102688, -99399, -332154, 96286, 195876, 46111, 134796, -37948, -239522, 124195, 72299, -74010, -259239, 33643, -8588, 236689, -117966, 274648, 307132, -347304, -113632, 141844, -253655, 350113, 150891, -279604, -88160, 21894, 322128, -143462, -280333, -89825, -154486, -81071, 216715, 95169, -120456, 215039, -121115, 227427, 103093, -48307, 65863, 173976, -169204, -53213, 10459, -243743, 4047, -58772, 119875, -429610, -40478, -169090, 123343, 83130, 160252, 58962, 177903, 63903, 108243, 415859]
12377D15859B06082n4999b72273N5821B04757a33621b7635D4177P0560K45742
12367C60479G8171R8213C2016Q5999J41406R931j02718a65170E25726d97195J70701
12356c26494i5227j92144B37323d0065M522A97144e500F4346J16753a77B02755
12344B94638d0503h200q7443H5059a55939g5181j19643G9991a54426f4898b7955
12332B63687A13461I258J53966P7440B9076d243A79317f8982j11490B68036F6933
12320i1004b8474A38296a32657C46166j59887h2819a09A22475c7503A17951A2075
12308b2234j03214m9057H5107R4890q9572L10095E5889O4958h9927B52024a0438
12296a72295E9827k5321P7453O5534D0771g5267r9072j64061E0827r371J07946
$$ y = [415859, 206082, 151083, -272273, -216452, 204757, -133621, -27635, 44177, 114737, 360479, 78171, 176384, 32016, 118015, 259421, 269352, 166634, -165170, 525726, -497195, -326494, -95227, -287371, 237323, -40065, -35543, 197144, -5500, 64346, 181099, -177, 202755, 294638, -40503, -8200, -95643, 85059, -155939, -75181, -194824, 79991, -154426, -64898, -27955, 263687, 113461, 9258, 163224, 240664, 29076, -4243, 179317, -68982, -180472, 268036, 66933, -91004, -28474, 138296, -132657, 346166, 186279, -82819, -109, 122475, -37503, 117951, 12075, -22234, -125448, -174505, 85107, 179997, 90425, 400520, 55889, 120847, -89927, 252024, -10438, -172295, 59827, 34506, 111959, 177493, 40771, -75267, -174339, -338400, 50827, 41456, 149402]
12285A49402B6584J53659a79842A92743a69789B6278d0882A93808o8692E2633
12274A72419D977K38428A8906a26457a1628A74637E9957k9248K2624k237J24258
12263A75354o3553C9265b08496A13865a28434A71039M1767K43722E3121L8621
12253I1742b90272B26119q8382F4883e8124J0645p3944H3529P6915A774a78068
12241b3784A63950b80711g9764A68155m7303M5438i988A99796O1422M1115J56143
12230D58476B5039e4916k31672C4742K3311M02921A72188o6034k9814K17708g2584
12218B65341R5654J8697I211b1236D55358a11301C47378D4697Q7350J9798n9974
12207I1871K81830a84329h6413B38143q3561K07538j40638Q2634H1728K6902K71115
$$ y = [149402, 26584, 180243, -179842, 192743, -169789, 26278, -40882, 193808, 125116, 52633, 172419, 4977, 243405, 18906, -126457, -11628, 174637, 59957, 30709, 53333, 51096, 175354, 111801, 39265, -208496, 113865, -128434, 171039, 212806, 456528, 53121, 91742, -290272, 226119, 137737, 64883, -58124, -47479, -121423, 83529, 160444, 1774, -178068, -23784, 163950, -280711, -79764, 168155, 120852, 166290, -9988, 199796, 261218, 302333, 458476, 25039, -54916, -286588, 34742, 58053, 460974, 172188, 106154, 76340, 294048, -72584, 265341, 360995, 379692, 9211, -21236, 455358, -111301, 347378, 44697, 132047, 151845, 91871, 373701, -184329, -86413, 238143, 154582, 362120, 221482, 304116, 81728, 108630, 379745]
12196C79745K2082o0014h1636E8386L16612o2086J91705A24323a63503B07163
12185E3219J80727D0116J23133K64721k05765R4873c2847A65194J40984d495j8766
12174b3261B8929j3889h3141c355A9805k903K8143J63072m3059m8458L24149j97799
12162B42950b0448r550d928B3467b32191D3215J85048G9031K58259a02394B06386
12150c54324B36853A06932d2437a2305A25111c11457B3743f8971A975a66366B46318
12138A97636J6435I8413b64302d8137j10028j02101A08992h787H6985p161L32405
12127D12229B9334L81106E2845R5623b59716a24996b1825r2227n020A42857a96313
12115B38501A01520J25446p320h9866j65695B58205p8519k7869o612a17268j19676
$$ y = [379745, 401827, 341813, -81636, 58386, 374998, 312912, 504617, 124323, -163503, 207163, 53219, 233946, 40116, 163249, 427970, 222205, 317078, -32847, 165194, 306178, -4495, -23261, 28929, 15040, -83141, -3355, 19805, 16902, 45045, 208117, 165058, 116600, 440749, 242950, -20448, -29998, -4928, 23467, -232191, 43215, 228263, 79031, 337290, -102394, 206386, -354324, 236853, 106932, -42437, -12305, 125111, -311457, 23743, -68971, 1975, -166366, 246318, 197636, 214071, 98413, -264302, -48137, -158165, -260266, 108992, -8787, 86985, 79824, 412229, 29334, 410440, 52845, 148468, -259716, -124996, -21825, -114052, -119072, 142857, -196313, 238501, 101520, 226966, 219646, -89866, -255561, 258205, 179686, 151817, 145205, -117268, -236944]
12104b36944a0606B20308A03859f1173K711A53083A3986K17276j09902Q3372E3057
12092c57995A43777m4917b1213D23980B00756b6034B6947b84572J36715C1126
12081A87769P054f7969j11993G0239a89964E1758K29030L65480J283963q59738
12071A070493B91792c0495B08176A1522a31106H4961b08122I0411l0512d18082
12060b15455B67111c5893A2030J47610h2502B69750j01771a49359i464j17227
12050a26691h062j51231M4796B38371f3578j81524A1337c2695O014j13406k8529
12039a68616h3111A63312a20016e117q8806A69009o6341b14362q04C4837L5134
12028F9971k9823K76887A24451a57992C60500H892g5307j73843A02702i2996F4761
$$ y = [-236944, -10606, 220308, 103859, -61173, -58462, 153083, 13986, 231262, 121360, 204732, 53057, -357995, 143777, 98860, -21213, 423980, 200756, -26034, 26947, -284572, -147857, 31126, 187769, 194823, -67969, -179962, 70239, -189964, 51758, 280788, 646268, 1930231, 1070493, 291792, -30495, 208176, 11522, -131106, 84961, -208122, 90411, 59899, -418082, -215455, 267111, -35893, 12030, 159640, -82502, 269750, 167979, -149359, -9464, -126691, -8062, -159293, -114497, 238371, -63578, -245102, 11337, -32695, -26681, -140087, -168616, -83111, 163312, -120016, -5117, -93923, 169009, 102668, -214362, -215166, 34837, 69971, 40148, 317035, 124451, -157992, 360500, 8892, -75307, -249150, 102702, -92996, 64761]
12016i8300r1214k7928A15157h1107A15344a15424C9266b11368a1970j05853K3192
12005i4631o6455j11660A65591g8235A7302J747a43591I7631g4964A68290d6577
11993a548l36629D26970c1020k46455I4610d37552B60130j28192J39482c6775
11982A8626a83250B18567D1802j5978c73833B37829b58746J8208A90125K05837
11972C95962b01344J3151B19177A2929a8057A08848J12050b49119a15153B9405
11961I802b59379A2327K5834a2829A9268b60747o6851J05688B9996b44716a10160
11949b73792e1566p1754B4896L2137h7471j8851d3337A62d9998m8003B1581K25328
11937B46909B5641b25850L8941m1629R9847A1839f1865A08397L28276a11841j96928
$$ y = [-98300, -189514, -217442, 115157, -81107, 115344, -115424, 39266, -211368, -11970, -117823, -94631, -161086, -272746, 165591, -78235, 17302, 19049, -143591, 97631, -74964, 168290, -46577, -1548, -338177, 426970, -31020, -277475, 94610, -437552, 260130, 131938, 271420, -36775, 18626, -183250, 218567, 41802, 25824, -373833, 237829, -258746, -240538, 190125, 395962, -201344, -188193, 219177, 12929, -18057, 108848, 220898, -249119, -115153, 29405, 9802, -259379, 12327, 38161, -12829, 19268, -260747, -327598, -221910, 29996, -244716, -110160, -273792, -51566, -123320, 24896, 57033, -87471, -106322, -43337, 162, -49998, -98001, 21581, 246909, 25641, -225850, -186909, -228538, -128691, 11839, -61865, 108397, 436673, -111841, -308769]
11926c08769f678A18477b5957j61826A2284J1855J69874f6393j47968A73415e3176
11914g3555G1726a03380A89763a16499C9262K51025i6054j74984A08762J00435
11904B09197H437a42988B77390J68338H7722d8198p4092C32823c9697B83997o6857
11893B17140b77825C4602G035f8407r8474P9935A24403b81648d8772F3905c2131
11881b48718j09305F9089d9582B9920c68906A3915b57283F07339b41610d4073
11870f4585l03486B10909P5548A05890c36612A4290d2860D0259b00442b0880j62759
11859a83639l9794B86312c59936A39087a33078D82808c04355D840P1034g3627
11848d33160a78640H3238h3219l75177G9789M2132a08710m3113G1693f8582A40181
$$ y = [-308769, -6678, 118477, -25957, -187783, 12284, 24139, 194013, -66393, -214361, 173415, -53176, -73555, 71726, -103380, 189763, -116499, 39262, 290287, -96054, -271038, 108762, 209197, 8437, -142988, 277390, 445728, 87722, -48198, -122290, 332823, -39697, 283997, 217140, -277825, 34602, 7035, -68407, -166881, -86946, 124403, -281648, -48772, 63905, -32131, -248718, -358023, 69089, -49582, 29920, -368906, 13915, -257283, 607339, -241610, -44073, -64585, -368071, 210909, 286457, 105890, -336612, 14290, -42860, 40259, -200442, -20880, -183639, -223433, 286312, -359936, 139087, -133078, 482808, -304355, 4840, 75874, -73627, -433160, -178640, 83238, -83219, -458396, 79789, 121921, -108710, -151823, 71693, -68582, 140181]
11836B19342H6934a02596B02792i0719k01857J01225o3575D03670A91228b31647
11825A22000j1373f3768k24234c2086k13329E4986a03581l3582b9993k40144B15212
11813G848a56131e7315G2816a44544a9900o5701A3815a49296a7709C9703A0309
11801a84117Q4195k9395B16476D4142c5575m4687C26537d14344H155J13190c25227
11789d9675j75476J03706j60204H8256a54312B46943a96672j7913i1640c4966
11778d5493a7353B02238Q4443D2916J61452A4581b04322i4654D28427c57015A21362
11766c36763B69484m8265e133j04194A54227j0564b69796D3048d6931A56160F5518
11754A49303n9656a79578A05437M4969o1641a56970o1850L0077B61165J11505
$$ y = [219342, 86934, -102596, 202792, -90719, -292576, -191351, -254926, 403670, 191228, -231647, 122000, 110627, -63768, -288002, -32086, -245415, 54986, -103581, -137163, -29993, -270137, 215212, 7848, -156131, -57315, 72816, -144544, -19900, -85601, 13815, -149296, -17709, 39703, 10309, -184117, -99922, -129317, 216476, 44142, -35575, -80262, 326537, -414344, 8155, 121345, -325227, -49675, -225151, -121445, -281649, 88256, -154312, 246943, -196672, -214585, -91640, -34966, -45493, -17353, 202238, 286681, 42916, 204368, 14581, -204322, -94654, 428427, -357015, 121362, -336763, 269484, 221219, -5133, -109327, 154227, 143663, -269796, 43048, -46931, 156160, 65518, 149303, 89647, -179578, 105437, 150406, 88765, -156970, -218820, -188743, 261165, 372670]
11744C72670j59960D9488f2457p3517F1394i0266B88158k2010r1105a0501j42924
11733a53425d6630D3300b71911A12681a68428c3098I7706R0272i3497C63508O2441
11722D25949b35515P0248A18956J33236M0865o0984b15121C7715K94989A993P0333
11711G2326c38990A69947l4184E4584B4293h8216A79161b13687a8471k07096A08487
11699H7703a56981A51593c5619E1476L1963e36125A12584c5249j82382A06171
11688d6277D5892b129j14153A72142m034p5538J36012n6310g4716j8623C70517
11676B8007K94746b6323I0536O2504B4013O1210a0431p1021j30995A69253g0433
11664i5156l6481N0374h140k64776a9797l3436C16762B4826J6031a69340B2213
$$ y = [372670, 212710, 49488, -62457, -135974, 61394, -90266, 288158, 266148, 175043, -10501, -153425, -46630, 43300, -271911, 112681, -168428, -33098, 97706, 187978, -93497, 363508, 425949, -235515, -165267, 118956, 252192, 293057, 232073, -215121, 37715, 332704, 1993, 72326, -338990, 169947, 135763, 54584, 24293, -88216, 179161, -213687, -18471, -225567, 108487, 87703, -156981, 151593, -35619, 51476, 83439, -536125, 112584, -35249, -217631, 106171, -46277, 45892, -2129, -116282, 172142, 168108, 92570, 228582, 172272, -74716, -93339, 370517, 28007, 322753, -26323, 90536, 153040, 24013, 85223, -10431, -81452, -212447, 169253, -70433, -95156, -131637, -81263, -8140, -272916, -19797, -53233, 316762, 24826, 40857, -169340, 22213]
11652B08089H5946A4562a88527h6132H9180m1373c4763A41535B2863a75156n6673
11641b31829A36260J65788K4120d0543k5275o4598A33656P5272Q4536A35207D4399
11629I4798D4581M1683R3188q2559a00124A72285a48306A73065a84773Q2769A09693
11617A2530d3574j12106k13324c1006A98213b4444E6482b31849F4498L3166N1642
11606A49306e2334H9416J25355n8415B036J7676K04297k9101m1804c32479J03494
11595b28985B61289E6506P2000d0274o4630r2975I1752r777O8073J29789r7644
11584A82193m9347h3298F4358P1637F0520c4253j0879C03277j15367A6450L79247
11573C95697k2145h707A40770A5257c4880A34930m9910a32487C38622A3301a51256
$$ y = [208089, 85946, 14562, -188527, -86132, 89180, 47807, -34763, 141535, 22863, -175156, -231829, 136260, 302048, 326168, -40543, -65818, -130416, 133656, 208928, 293464, 135207, 44399, 94798, 44581, 86264, 179452, 96893, -100124, 172285, -148306, 173065, -184773, -102004, 109693, 12530, -43574, -155680, -369004, -31006, 198213, -24444, 56482, -231849, 64498, 97664, 149306, -52334, 89416, 214771, 156356, 2036, 19712, 224009, 194908, 153104, -332479, -228985, 261289, 56506, 128506, -40274, -104904, -197879, 91752, 81975, 150048, 279837, 182193, 132846, -83298, 64358, 135995, 60520, -34253, -45132, 303277, 187910, 16450, 395697, 373552, -8707, 140770, 15257, -34880, 134930, 85020, -132487, 338622, 13301, -151256]
11561g2714F50e6837j93628b6237E0913L3432a15133j01708d997n4156B45983
11549a24521B86383j39711J25590C7159J28681K02513a8595k40976B89927J4549
11539C04476A21303J15228m1233J17151C0818j5406J42833F8395a11067H0439
11528B99513A27388J76692p8495F4460K78844a9310f45B47615K7235o260j5010
11517B53580k9823P5508c0295j60631d6581A54576o6019k366K53277D1326a82910
11505D08067j08492j31423N415D6103K3709K40381j11004a20157A90322l6908
11495A53414R5887H3528d5618o3137C51608q715O4256H1309L40012I7232m3425
11484E3807R9170Q934J11592r7795G2730l0911J32012J27465I734J67906c7843
$$ y = [-72714, 650, -56837, -250465, -26237, 50913, 84345, -115133, -216841, -4997, -59153, 245983, -124521, 286383, 146672, 272262, 37159, 165840, 368353, -18595, -259571, 289927, 304476, 121303, 236531, 195298, 312449, 30818, 15412, 158245, 68395, -111067, 80439, 299513, 127388, 304080, 225585, 64460, 343304, -19310, -645, 247615, 274850, 268590, 253580, 223757, 299265, -30295, -190926, -46581, 154576, 88557, 86191, 339468, 41326, -182910, 408067, 299575, 168152, 173567, 46103, 69812, 310193, 199189, -120157, 190322, 153414, 249301, 83528, -45618, -108755, 351608, 342893, 407149, 81309, 421321, 97232, 53807, 152977, 161911, 273503, 175708, 72730, 41819, 173831, 301296, 9734, 177640, -37843]
11472A78958o2970L7098A8958A368L09161O2059g918D14682A15369k5045K2984
11461A13308g5408A15141J91441a45429B58626r4909q562l9953M250J32931a06237
11449b35604O1736i634B43837p3169a64694c6373n6539B86494b41175G718b77754
11437e5430C25227r3731h7534A266b3290j55047E2832c94177G0265J19911B1673
11425E946P8214a6962A36188a4614A81243m4762b19986M5503A93856L435a13600
11413h5172H345e5883A51527A3510M5512O8993c305j8055F3563g5047A84002J54618
11401C38620e8725B7908J93420b0308B78588r1933m1672a06374J275Q286B06911
11389g1908B59544j15390a11971A94406b38731a948r472q3064B00378a0694l7444
$$ y = [178958, 115988, 153086, 18958, 1368, 310529, 372588, -7918, 414682, 115369, 90324, 113308, -75408, 115141, 306582, -145429, 258626, 163717, 155155, 115202, 119452, 252383, -106237, -235604, -173868, -9634, 243837, 170668, -164694, -36373, -92912, 286494, -241175, 7718, -277754, -55430, 325227, 231496, -87534, 1266, -23290, -178337, 52832, -394177, 70265, 190176, 21673, 5946, 84160, -16962, 136188, -14614, 181243, 136481, -219986, -174483, 193856, 197291, -113600, -85172, 8345, -55883, 151527, 13510, 59022, 128015, -3305, -21360, 63563, -75047, 184002, 338620, -58725, 27908, 221328, -20308, 278588, 186655, 144983, -106374, -105099, -96813, 206911, -71908, 259544, 144154, -111971, 194406, -238731, -1948, -11420, -94484, 200378, -10694, -48138]
11378d8138j8282A01845K10960F9959K07505c12068a3421l60200a40101A08214
11367I9674l0598K01738a18369k31361g043j05023A34862c35857g9461l872D3399
11355A05870b42472e9595I2969D4570K01332l7474b66327E2013J09144G8554a5690
11343a57616A4381Q4765a63712E3422M1135J71103d0652B75740a86299C1283L3549
11332F4832j5503K828b45507B54360g256D6913N0437K64927c54498c2806C1387
11320G4257J36403a72848K3392k3210D7815O3433a57855k9172m0811M4997a8678
11308A02521b43183A53295f3603J3150B84317E2823a86207j05582B22019G4683
11297a76392O786j28854a01573A49371L313F0939a51039d3006j6385j62644f1485
$$ y = [-48138, -66420, 101845, 312805, 69959, 277464, -312068, -13421, -373621, -140101, 108214, 99674, 69076, 270814, -118369, -349730, -7043, -112066, 134862, -335857, -79461, -83333, 43399, 105870, -242472, -59595, 92969, 44570, 245902, 208428, -266327, 52013, 161157, 78554, -15690, -157616, 14381, 99146, -163712, 53422, 94557, 265660, -40652, 275740, -186299, 31283, 64832, 49329, 52157, -245507, 254360, -7256, 46913, 97350, 362277, -354498, -32806, 31387, 74257, 210660, -172848, -149456, -172666, 47815, 111248, -157855, -187027, -227838, -182841, -18678, 102521, -243183, 153295, -63603, -50453, 284317, 52823, -186207, -291789, 222019, 74683, -176392, -169606, -298460, -101573, 149371, 152684, 60939, -151039, -43006, -59391, -222035, -61485]
11285g9786j44703p1034A05855e7442k33802J02014P7402q4088e3760B60801a77566
11273b56595i5483f598m03862A82419b96929a726D02079g3123B67315j22763i5407
11261a31182O0402r5307k39748Q469J69443F4293a58501k14958a1389A65140k4100
11250A41040a9878q4375J9158k3572B52428d8954i566A64891c17652B091a68872
11238h147A20542a24391B3850N7150a8007I7597D3966K16850F1136O2536b802
11226f8163K5453D1761b13840c6013A73830c52619G1830A0070c701H9119f676
11214b44760F3144h2786A78195f7834l40156A04853D2049a57051K2308B29246
11203a32526k41645A12423C9714a6047i31I28a56476k0185r2042b7643j31791
$$ y = [-79786, -224489, -295523, 105855, -57442, -291244, -189230, -111828, -195916, -53760, 260801, -177566, -256595, -95483, -6598, -410460, 182419, -296929, -1726, 402079, -73123, 267315, 144552, -95407, -131182, -70780, -166087, -405835, -397366, -227923, 64293, -158501, -373459, -11389, 165140, 141040, -19878, -104253, -85095, -108667, 252428, -48954, -9566, 164891, -317652, 2091, -168872, -8147, 120542, -124391, 23850, 81000, -18007, 97597, 43966, 260816, 61136, 123672, -2802, -68163, -42710, 41761, -213840, -36013, 173830, -352619, 71830, 10070, -3701, 89119, -6676, -244760, 63144, -82786, 178195, -67834, -407990, 104853, 42049, -157051, -134743, 229246, -132526, -374171, 112423, 39714, -16047, -931, 928, -156476, -176661, -268703, -27643, -159434]
11192a59434c5862k43818B50302F7294c2263o5021F0847h4857D453b4119k10723
11181b34842F5087i98m5176k0174m7322e4630b4010B64321c6584D7869G224a24999
11168E1584d1187j91150A25828c14128a48128j993B45714f0877E0226c2068a3102
11156c9061a460k83688f795A49391b42736A35476C5292c64271R4304A96724i1439
11144a59970f8059j50313A25211A2344M8072b09329B6771J73555D0183a17322
11133C62705A29234J41152b41342B54368h602A74948K30027A96084C8746f510
11122H4640i163o4386A8222M4677a0004I8246k2691b4876D47784j81315c5979
11110g8318H8737L2904K6057M2810J71185A80674C0650K50924q055B8927J81185
$$ y = [-159434, -35862, -279680, 250302, 67294, -32263, -97284, 60847, -84857, 4453, -24119, -234842, 65087, -998, -46174, -66348, -113670, -54630, -24010, 264321, -36584, 47869, 7224, -124999, 51584, -41187, -232337, 125828, -314128, -148128, -150121, 245714, -60877, 50226, -32068, -13102, -39061, -1460, -285148, -6795, 149391, -242736, 135476, 35292, -364271, -269967, 196724, -91439, -159970, -68059, -218372, 125211, 12344, 60416, -209329, 26771, 200326, 40183, -117322, 362705, 129234, 270386, -241342, 254368, -8602, 174948, 404975, 196084, 38746, -6510, 84640, -9163, -73549, 18222, 62899, -10004, 98246, 75555, -24876, 447784, 266469, -35979, -78318, 88737, 121641, 147698, 190508, 361693, 180674, 30650, 281574, 273519, 28927, 210112]
11099B10112P9641j37509P0430J63683F0975P9675E7656J47484L03711k28943
11089B79908E8304K09729f1401A70405L3092E5033J90969R9606H881K83608K36654
11078E29143j65491b6798A93248p8210M18124J12265B42549K67562j32159A24999
11067F97967C18010J18032K31527C30129N87410A31740M56085k42889J33987J16975
11057E95898R9718K63740j21199L8301j24073k12786o0173J94492l17588M09200
11047G65530J19154M149n7106k11645J03444k1734J87189J20344l61010N7935
11037G06250K8963Q7141K305k57505Q1559Q3379J61397K3348n0230j39315J14535
11026H41827k85074J63949K68637J33454m10886O8592l54098N29609k98264m7091
$$ y = [210112, 289753, 152244, 222674, 386357, 60975, 140650, 57656, 205140, 508851, 279908, 58304, 268033, -61401, 170405, 203497, 55033, 246002, 345608, 8881, 292489, 529143, 363652, -26798, 193248, 115038, 533162, 645427, 242549, 510111, 377952, 124999, 697967, 318010, 436042, 667569, 330129, 917539, 131740, 587825, 344936, 478923, 595898, 695616, 959356, 838157, 876458, 752385, 539599, 479426, 673918, 356330, 765530, 884684, 888833, 831727, 620082, 723526, 701792, 888981, 1009325, 648315, 706250, 735213, 822354, 824659, 567154, 648713, 732092, 893489, 916837, 866607, 727292, 841827, 556753, 720702, 989339, 1122793, 711907, 780499, 426401, 956010, 657746, 610655]
11016F10655B03255P06376m22241L17446N4963l07526o6219K05235l5220L66643
11006A022712l93372k14382K73957K34307l38758M00351j50846M6135l96153Q0525
10996E64476R6077J69135M9117j58041j63743J18277L0703O3911J71454j70846
10986G70520p7330M9385M29690r1868M57940k95883K43289r2233M78120j17149
10976A754481O21608K46355K89511J6236q7609J32949m05691K64698j11525n95743
10966B125270J97661j89291m49644l6084n3046k7369j1931N7091J12637l22591
10956A402703R0919k72244n2110k80066J75645k22760N5652D41465n9099O4585
10946D46951M1029E4569J50327L46887a50978B46870j02263M52602j13135C9390
$$ y = [610655, 203255, 909631, 487390, 804836, 859799, 552273, 486054, 691289, 656069, 1022712, 629340, 414958, 688915, 923222, 584464, 984815, 833969, 880104, 483951, 564476, 660553, 829688, 878805, 720764, 557021, 675298, 706001, 769912, 941366, 770520, 693190, 742575, 1172265, 1080397, 1538337, 1242454, 1485743, 1393510, 1871630, 1754481, 2376089, 2622444, 2911955, 2928191, 2840582, 2973531, 2567840, 2832538, 2721013, 2125270, 2322931, 2133640, 1683996, 1647912, 1594866, 1567497, 1555566, 1612657, 1725294, 1402703, 1493622, 1221378, 1169268, 889202, 1064847, 842087, 897739, 441465, 382366, 446951, 487980, 54569, 204896, 551783, -150978, 246870, 144607, 597209, 484074, 39390]
10935A56656n600L6592h2166j17562b2517G1481K25016o2390D8008K05082H4326
10923B83552l4249a34736o8415B51086G9093d8698A2253a13683A34806i4828B71717
10911h6639A42457j3730C0094i1976k77240J76533N8146F0012a7525j50967e9967
10899A28152c55616D7553J29181h2455C7544a48655A60339C3999a85169n2035
10889b37204b5955l7556H4328a47996A56275p7177j1446l435c20686m3866C10272
10877B9727M1838J80995q8341a17118H2657c0910A09185M3006E4511O4096K45079
10866C63686a25374j1805m0207P4910j00605H8842J00415c76761J22529A79411
10855A13863a4949j32557b9828F3637c0062j14788A42944i3234l1122J0513j97227
$$ y = [156656, 151056, 187648, -82166, -199728, -22517, 71481, 296497, 234107, 48008, 253090, 84326, 283552, 249303, -134736, -203151, 251086, 79093, -48698, 12253, -113683, 134806, -94828, 271717, -86639, 142457, 128727, 30094, -91976, -369216, -192683, -134537, 60012, -17525, -168492, -59967, 128152, -355616, 47553, 176734, -82455, 37544, -148655, 160339, 33999, -185169, -237204, -25955, -63511, 84328, -147996, 156275, 79098, 67652, 64217, -320686, -364552, 310272, 29727, 71565, 252560, 164219, -117118, 82657, -30910, 109185, 152191, 54511, 118607, 363686, -125374, -137179, -177386, -102476, -203081, 88842, 189257, -376761, -254232, 179411, 113863, -14949, -147506, -29828, 63637, -30062, -144850, 142944, -93234, -124356, -113843, -311070]
10844c11070a00089A89560O3630q7705f9021C0523J16593F0515k9486N1382c04793
10832a2435A4097b5946H445K7385M1892l8031b8562o4704r4729O6029C49020i3587
10819H0525O5382K75312a8239B14802b06179b1751k25605A20047g3660r8160H8858
10807g8189A34905o6703c0259F2479b15705n8878J34786J0495A55394a09984B07910
10795h2175j33780M5441A14616N5089J61984e2141H9336K9189J17208a64388A3507
10783b95197A64601c4542B3006R9514c31512B0585K08572g2973J0735p7187N6220
10772h3205k20544d6707J3214j2119B31872b2561j67326A22409Q6529a00848j68549
10761b69397J02534n9383P9902J402L3157k9658j03584G1314b4720j41523j20311
$$ y = [-311070, -100089, 189560, 253190, 165485, -69021, 30523, 147116, 60515, 31029, 82411, -304793, -12435, 14097, -25946, 8445, 35830, 77722, 39691, -28562, -93266, -187995, -121966, 349020, -93587, 80525, 145907, 421219, -18239, 214802, -206179, -21751, -247356, 120047, -73660, -171820, 88858, -78189, 134905, 68202, -30259, 62479, -215705, -274583, -139797, -129302, 155394, -109984, 207910, -82175, -215955, -170514, 114616, 169705, 331689, -52141, 89336, 118525, 235733, -164388, 13507, -295197, 164601, -34542, 23006, 122520, -331512, 20585, 229157, -72973, -62238, -139425, -83205, -303749, -46707, -33493, -45612, 231872, -22561, -189887, 122409, 208938, -100848, -269397, -166863, -226246, -146344, -144942, -111785, -141443, -245027, 71314, -24720, -166243, -286554]
10750b86554C14737f2449A7356b31222I0734b40044L854I4643J60323a87693E2908
10738i9586B69152A14164b86715A52645i8801l14278J77333J14611B85430b69262
10727a62448a6821I9984a93835I7545b09182C35831C0248b24777j65698a54426
10716a33616c4604A46048P1555b12168B8920a69792M7045B54156K2613G276f5855
10704a28802E17132I7598Q6597c99563a66421o9398B28637a45578C31092b49591
10693d15722C45422c27347a31147B19141b18671A8651a82398J8279j16644L3243
10683b47520j77558d4600J7366j6696j49290B47114c03237f7819C34338D8806
10672B7660L3963e4181j51123H6451b64849g488E6967c25660g1743k50634F7732
$$ y = [-286554, 314737, -62449, 17356, -231222, 90734, -240044, -236190, 94643, 254966, -187693, 52908, -99586, 269152, 114164, -286715, 152645, -98801, -413079, -235746, -121135, 285430, -269262, -162448, -16821, 99984, -193835, 97545, -209182, 335831, 30248, -224777, -390475, -154426, -133616, -34604, 146048, 217603, -212168, 28920, -169792, -122747, 254156, 276769, 7276, -65855, -128802, 517132, 97598, 184195, -399563, -166421, -235819, 228637, -145578, 331092, -249591, -415722, 345422, -327347, -131147, 219141, -218671, 18651, -182398, -164119, -280763, -247520, -425078, -44600, -27234, -43930, -193220, 247114, -303237, -67819, 334338, 48806, 27660, 61623, -54181, -205304, 86451, -264849, -7488, 56967, -325660, -71743, -322377, 67732]
10660A25317A873d36712a55061k3849M9321q3236A66008o8859k621l1153J928
10649F5303c75137C12874A28243c60681G9080R5350c29066B05995b59773d5752
10638d7180G5661b098A49478b32873c4418k5255o2035A2035c7508D210O1001d32489
10625f3657p8097d2043j68257N0867O6439B3181b345A25280n570h4789o565B57797
10612A82351b04044C1891N1550J07278e815I5631N8337b3569m5888A04898d122
10600c87045a30998j97297P4728c1526E2692d38844g8586k75871B1929L5798c56934
10588B57650a17831d2276r14m0284E8626r306a08928l35283a32921R752a4774
10576A6807b87173O8620P3721k853m120A02450j1226b21653a3522j68250i436
$$ y = [125317, 1873, -436712, -155061, -178910, -129589, -212825, 166008, 97149, 94528, 63375, 65303, -375137, 312874, 128243, -360681, 79080, 174430, -329066, 205995, -259773, -45752, -47180, 75661, -2098, 149478, -232873, -34418, -59673, -121708, 12035, -37508, 4210, 65211, -432489, -63657, -141754, -42043, -210300, -159433, -92994, 23181, -2345, 125280, 119710, -84789, -91354, 257797, 182351, -204044, 31891, 83441, 190719, -5815, 95631, 153968, -23569, -69457, 104898, -4122, -387045, -130998, -328295, -253567, -31526, 52692, -438844, -78586, -354457, 21929, 57727, -356934, 257650, -117831, -42276, -43190, -83474, 58626, 49320, -108928, -444211, -132921, -123169, -14774, 16807, -287173, -218553, -144832, -147685, -151805, 102450, 91224, -221653, -13522, -181772, -9436]
10564H4396c0809E9272c99985B22935B9723K07002a60839A72889c7085A43978
10553A30932a86151F659a13765j21756h5389r1115A49617k4559l3628a40569j05352
10542b45921A12037P2151a94508R0072A08024a89096M9473A7684a27265A50650
10531B01619h2622K4293G0604A5932a2824J55F4448b33736A53276d6708l19141
10520c65849a69027C4916J32465I617a63146A05292A1863a49107B8740J67065
10510A95805B1165i9547A68669B1197g6727A33647J11882i6327J4891A546J95922
10499A97468a58313K138m1758B79070d5237k27905A24192N5778F6575J08037c4464
10487A57736Q0953n0440o8871J56987o5104L86269n8729A29238M4711l8901a93751
$$ y = [84396, -30809, 59272, -399985, 222935, 29723, 236725, -160839, 172889, -37085, 143978, 130932, -186151, 6659, -113765, -235521, -85389, -176504, 149617, 125058, 91430, -140569, -245921, 112037, 184188, -194508, -104436, 108024, -189096, -139623, 17684, -127265, 150650, 201619, -82622, -58329, 70604, 15932, -12824, -12669, 64448, -233736, 153276, -46708, -365849, -169027, 34916, 167381, 9617, -163146, 105292, 11863, -149107, 28740, 195805, 21165, -99547, 168669, 21197, -76727, 133647, 245529, -96327, -81436, 1546, 197468, -158313, -156175, -197933, 279070, -45237, -273142, 124192, 179970, 66575, 174612, -34464, 157736, 238689, 188249, 119378, 276365, 211261, 597530, 538801, 129238, 173949, 135048, -193751]
10475b23577P4221P0818D10227c96616E8573i1142B70317b4706l0176p7428C42373
10463A32576a98191r7017D7375b40368c3829I6541J50893o6212a65594g8539A21860
10451A58961b63754J12780H3499L1344L1188c46072C1742b00898c3625A67120
10440e9233k56718p4743e967j38884B05160C1645a38934B45058m8735d1629A89088
10428b63790B37775j399k6070h8186c8757G9289J9832N4440b31259j46245B57166
10416b37282f1014k54198A67776b39153k04026A12469M6863m135a99192E8711
10405d4622B79463f8899h760k29501a09749j41858H1222a4092r0591c9979I1083
10393A30841K17289c3196o3812m9076g1442B04296m3828J349o6447K38049j6230
$$ y = [-223577, -149356, -78538, 410227, -396616, 58573, -91142, 270317, -24706, -54882, -132310, 342373, 132576, -198191, -295208, 47375, -240368, -33829, 96541, 247434, 181222, -165594, -78539, 121860, 158961, -263754, -150974, 83499, 114843, 146031, -346072, 31742, -200898, -33625, 167120, -59233, -315951, -390694, -5967, -144851, 205160, 31645, -138934, 245058, 196323, -41629, 189088, -263790, 237775, 236376, 210306, -88186, -38757, 79289, 99121, 153561, -231259, -377504, 257166, -237282, -61014, -315212, 167776, -239153, -443179, 112469, 159332, 155197, -199192, 58711, -44622, 279463, -68899, -8760, -238261, -109749, -251607, 81222, -14092, -104683, -39979, 91083, 130841, 348130, -33196, -97008, -146084, -71442, 204296, 160468, 161817, 95370, 333419, 317189]
10382C17189b2826A73842K900E9607P9332L7029J61596E9001L44059A8508N23286
10371E41794R3843k50711G5263L68079j29192n9946J67546O5430j90188B4107
10360A31206M77535j89459A02814O5175R485Q434c46861A26771L80045L13714
10350H20530k75036K35345B36303F9513K00776J25270r5371j21376N7323o6991
10340A69144m3266M4640R4357J64266p4380A73659N8461r2693J30860o2815Q36
10329B08308D4274L9339b84332B9814i0326C90575J07302a3970A61695l4580C7221
10317E2813a39380A99852j6082C4491L0490A8548h8622D9631Q6744c14437A05111
10305h3717a8197j90381k01933a82467A12702J20712p650b4853m0673E7745j4185
$$ y = [317189, -22826, 173842, 176742, 59607, 138939, 175968, 337564, 59001, 403060, 18508, 541794, 635637, 384926, 75263, 443342, 314150, 254204, 421750, 487180, 296992, 24107, 131206, 608741, 419282, 102814, 167989, 177474, 185908, -346861, 126771, 506816, 820530, 545494, 780839, 236303, 69513, 270289, 395559, 300188, 178812, 236135, 169144, 125878, 170518, 264875, 429141, 354761, 173659, 232120, 139427, 270287, 207472, 208308, 44274, 83613, -284332, 29814, -90326, 390575, 497877, -13970, 161695, 127115, 37221, 52813, -139380, 199852, 183770, 34491, 64981, 18548, -88622, 49631, 136375, -314437, 105111, -83717, -18197, -208578, -410511, -182467, 112702, 233414, 225764, -24853, -65526, 57745, 43560]
10294D3560L03839a29131F2676J02614a73192C4263a23094j19917M6208M4329
10284a52474g0119a9841n2062A00212P7093G0273a42958A3954h6228B7639N5151
10273H2790d9016q6612b2502Q632j62111A32135C4587h4078n1688b3531C33832
10261D97308j18459A55529R3954O5801M918O7153j27048j16576J32308o674H6414
10249a56161A17980b3279A38281k2999a37314N4480k36698R7619B82720b56878
10238a30550j52337G6488j3311e1115H3504A8722d3867q0229m9437A30730c83649
10226B549h9098B26596a4075k21263A31002d16374O7534c4987A49367e5961E3487
10214e0150k86067G374d715k49893K4811I2797K4212b7836j19391A60420b01360
$$ y = [43560, 347399, -129131, 62676, 165290, -173192, 34263, -123094, -243011, -196803, -152474, -70119, -19841, -71903, 100212, 177305, 70273, -142958, 13954, -86228, 27639, 82790, -49016, -135628, -22502, -13870, -175981, 132135, 34587, -84078, -135766, -23531, 333832, 497308, 378849, 155529, 249483, 315284, 320202, 387355, 260307, 143731, 276039, 269365, 86414, -156161, 117980, -23279, 138281, 115282, -137314, -82834, -319532, -221913, 282720, -256878, -130550, -282887, 76488, 63177, -51115, 83504, 18722, -43867, -124096, -173533, 130730, -383649, 2549, -89098, 226596, -14075, -235338, 131002, -416374, -348840, -34987, 149367, -55961, 53487, -50150, -336217, 7374, -4715, -254608, -229797, 92797, 117009, -27836, -147227, 160420, -201360]
10202i8951b6373m82447i7798F5279O1096C9617E744J38130J21649b39742c0115
10190e3917l984A11808g1211B212O2513a44929a199j62787D1551b60409A19666
10178c28031f4781j15442l03282c8971A62c95279J19100M1094A35434c3543j52294
10167a85837e8945l2451b8341A009J35721b48708n0803D1219h7630A4716K4011
10156C8727a61259B00524b48542A28273L12221E4896b02346B56666c14521K6967
10146b87554A05126c2184b100l74965A08686O32d70443A4733K59150b62194L6284
10135b25910P7940C0450J92783c85256a07117k43621c374j88164A85234a00035
10124d0751A52895b46915g3076b2859n9110j85854f5110p3703J6091c5677n420
$$ y = [-98951, -26373, -508820, -97798, 65279, 126375, 39617, 5744, 143874, 265523, -239742, -30115, -53917, -57901, 111808, -71211, 2212, 64725, -144929, -1199, -163986, 41551, -260409, 119666, -328031, -64781, -180223, -483505, -38971, 162, -395279, -276179, -235085, 135434, -33543, -185837, -58945, -91396, -28341, 1009, 136730, -248708, -299511, 41219, -87630, 14716, 38727, -161259, 200524, -248542, 128273, 440494, 54896, -202346, 256666, -314521, -287554, 105126, -32184, -2100, -377065, 108686, 109318, -470443, 14733, 273883, -262194, -225910, -147970, 30450, 223233, -385256, -107117, -350738, -3374, -191538, 185234, -100035, -40751, 152895, -246915, -73076, -22859, -81969, -267823, -65110, -138813, -122722, -35677, -41097]
10113d1097A03080j4156f01237C00628a24261j81952a0216j97013e6075K3265
10103c2810j06218p0332H0242J8349b38822c7669A40488B8972i2531B25433A09300
10091A1840K9359g4394F6702b4050A9985b10465h355C16336D4565J72417B1675
10079A78606a72427A31795a16378B0957M3747b4771j46507G668a86021I7140J23678
10068B20818a82087c5035A14858d0296B2522a11982A60675e36183A66666K06383
10058C73049a09349I4103b76843A22868b49976i5458j53711P7626A36205o1658
10048G4547k3366j9517K5691J67010j842b17442P1307a5636j63251B74585b42244
10036c8495C03879j15546G1276R1459a33866k0727G7432b93046e1968o7449j25983
$$ y = [-41097, 103080, 88924, -601237, 300628, -124261, -306213, -10216, -207229, -56075, -32810, -139028, -209360, 80242, 98591, -238822, -37669, 140488, 28972, -92531, 225433, 109300, 11840, 41199, -74394, 66702, -24050, 19985, -210465, -8355, 316336, 44565, 216982, 21675, 178606, -172427, 131795, -116378, 20957, 64704, -24771, -171278, 7668, -186021, 97140, 220818, -182087, -35035, 114858, -40296, 22522, -111982, 160675, -536183, 166666, 373049, -109349, 94103, -276843, 122868, -249976, -95458, -249169, -171543, 136205, 74547, 51181, 31664, 57355, 224365, 222523, -217442, -146135, -15636, -178887, 274585, -242244, -38495, 303879, 188333, 71276, 162735, -133866, -154593, 77432, -293046, -51968, -119417, -245400]
10025b45400e4410G0734c40935G2428c76312J82929C3712J71597c6498q8311b4507
10013b59993Q4847M4124H2518b58132E3554b45242C69118i3807o2292f6548m2863
10002a09411j22392A51870B1759J0224g9157j15713h7156l21321a30355j99359
9992c29714J30547H4957a98030b3165k11972q0535f8819r8527j16555A69767B0628
9980f7373j8739q3735A70061a96581m1815c102l29896b4735r1592d957j10336
9969a15293L8244o2167c0114A5687a33874j57130h078G2570b62125B10929g9772
9957a03747a3848k14129b4370C02978B7390J65630K2810a93316A84865b03490
9946A09826b54675B48469c70111J23396A99995c3184j14799q3377f9333l6402
$$ y = [-245400, -54410, 70734, -340935, 72428, -376312, -193383, 33712, 205309, -36498, -124809, -24507, -259993, -175146, -131022, 82518, -258132, 53554, -245242, 369118, -93807, -156099, -66548, -109411, -231803, 151870, 21759, 31983, -79157, -194870, -87156, -408477, -130355, -329714, -199167, 84957, -198030, -23165, -235137, -315672, -68819, -167346, -283901, 169767, 20628, -67373, -86112, -169847, 170061, -196581, -238396, -3102, -332998, -24735, -116327, -4957, -115293, -77049, -139216, -30114, 15687, -133874, -291004, -8078, 72570, -262125, 210929, -79772, -103747, -13848, -227977, -24370, 302978, 27390, 193020, 215830, -193316, 184865, -203490, 109826, -254675, 248469, -370111, -246715, 199995, -33184, -147983, -231360, -69333, -105735]
9936a05735B75169a8405q2257j44411B56103m8638A3517b49039A40523f0141a0496
9924B68043b09861i2395n1218B81285a28639k71325c3622C7123M8131b29764A06331
9912b97997A36604j3485L7571a52079k8356Q2962k50744a35603l09922C2635O4817
9901I7452g9042A86510c05357J14783O840p5487g6029G9080j3561M3844J17027
9890B26390A5869Q7623a62651e4116F6597b44676j14091i2909B01357k6876b00732
9878a87162D6491J73221A2350J92476D8382M706h4622n6104j55005K5053N6910
9867b13768R8802p6806r1270G9258C698a58074A26745a24741j59616r6378a19482
9855A14235a47099b2413m1842A07572c46197G2165J1408A5011R6344R436c95409
$$ y = [-105735, 275169, -18405, -100662, -245073, 256103, 207465, 13517, -249039, 140523, -60141, -10496, 268043, -209861, -92395, -143613, 281285, -128639, -399964, -33622, 37123, 85254, -229764, 106331, -297997, 136604, 123119, 160690, -152079, -180435, -97473, -348217, -135603, -445525, 32635, 97452, -79042, 186510, -305357, -190574, -183734, -259221, -76029, 79080, 65519, 109363, 226390, 15869, 103492, -162651, -54116, 66597, -244676, -358767, -92909, 201357, 174481, -200732, -187162, 46491, 219712, 12350, 204826, 48382, 53088, -84622, -140726, -295731, -270678, -213768, -114966, -191772, -283042, 79258, 3698, -158074, 126745, -124741, -284357, -380735, -119482, 114235, -147099, -22413, -64255, 107572, -346197, 72165, 83573, 15011, 111355, 120791, -395409]
9843A41754c25959F6881b86540q3410G0514K02807a56865B63796c96792C5066
9832A51091i9846j064A1941b31894f7602B44646a11203j87350e5083B6743e9887
9820d4274j0826E8080d830n955B5756c77164I8716h159A99026F5538b4955m4680
9808f9635j6714k2867j0971B69063a84711B27276E0534B2033b18501j07110A68829
9796a45588m8987k45241B42002b15620I2341e0796E9908b0248j40935d2744k57224
9785b99968J18030P0810J0506A56733b46707q8378a46580q1704h5298D5406b49892
9773G9774L7087a73758p781A73226P2455b50274F799a46683A76277D8032e191
9761b00840g3028O611k4363B07593c72355I3577K88428a63683g5813K5530j402
$$ y = [141754, -325959, 66881, -286540, -369950, 70514, 273321, -156865, 263796, -396792, 35066, 151091, -99846, -100910, 11941, -231894, -67602, 244646, -111203, -298553, -55083, 26743, -59887, -44274, -55100, 58080, -4830, -10785, 25756, -377164, 98716, -8159, 199026, 65538, -24955, -69635, -86349, -109216, -120187, 269063, -184711, 227276, 50534, 22033, -218501, -325611, 168829, -145588, -194575, -439816, 242002, -215620, 92341, -50796, 59908, -20248, -161183, -42744, -299968, -181938, -111128, -100622, 156733, -246707, -335085, -146580, -228284, -85298, 45406, -249892, 79774, 116861, -173758, -181539, 173226, 245681, -250274, 6799, -146683, 176277, 48032, -5191, -200840, -73028, -66417, -90780, 207593, -372355, 93577, 382005, -163683, -75813, -50283, -51685]
9750e1685m7894j28196o1035M0423h9879P295o9194b3755k67779a17111I719L0280
9738C9999c22771B21570K32301b41050k1878j52405J45570b5551l20247a41362
9727c31210C1958a6567A46777c7925D6834b56011i4586C07J47947g2634j11024
9716a83658A55966d30948a61330K5204A82600L1114A00479C7449c36463a20159
9705B52915j16946e4533B11479c58035j59346a39027I3622b84816a3714n1745
9695f5459j64335O1601A9670d73285m1327E1716J19977J81382b26649g3093r8722
9684a71815E2121c93028J84093F8947b85968a25536j58404L7356E5609b64689
9673a69826A8943L951i2340j67410a26801N784M4618B36614A13663c00831B28864
$$ y = [-51685, -99579, -227775, -288810, -248387, -89879, -82584, -151778, -23755, -291534, -117111, 9719, 39999, -322771, 221570, 453871, -241050, -262928, -415333, -269763, -25551, -345798, -141362, -331210, 31958, -16567, 146777, -37925, 46834, -256011, -94586, 307, 148254, -72634, -183658, 155966, -430948, -161330, -136126, 182600, 213714, 100479, 37449, -336463, -120159, 252915, 135969, -54533, 211479, -358035, -517381, -139027, 93622, -284816, -13714, -65459, -229794, -168193, 19670, -473285, -514612, 51716, 171693, 353075, -226649, -73093, -171815, 52121, -393028, -208935, 68947, -285968, -125536, -283940, -246584, 55609, -264689, -169826, 18943, 22894, -92340, -259750, -126801, -121017, -76399, 236614, 113663, -300831, 228864]
9661b32970a3077k35505B73384o4646b15868A70941m7981a67243A02484a48834
9650F1110a25558e2617j61408c3255o7186B69625I0687a59331j85049a41339B38867
9638A53477b09673C6596c53428J08213b9895A2168P1704k3141b07044p0127j99708
9627d76879C5623a57083g5614o2916k32185f287j29240e9434p946j08476B99254
9615a4944j58479g8909l3835A865b87127b6052j45480k7776P6610p7799c0777
9603I1622a0853k18725h265B64207l0956a23186B0166d4620G8440b66437f3986
9591A33513j9826f0293I9722b15317Q9864N0466C55830j39647c0108B92934a11420
9579a36852E898c25728J19223e0349j98414J15829k31849H8757P74c11356L876
$$ y = [-232970, -13077, -248582, 273384, 208738, -215868, 170941, 122960, -167243, 102484, -148834, 61110, -125558, -52617, -214025, -33255, -100441, 269625, 90687, -159331, -344380, -141339, 238867, 153477, -209673, 36596, -353428, -245215, -29895, 12168, 83872, 60731, -207044, -277171, -476879, 35623, -157083, -75614, -138530, -370715, -6287, -135527, -59434, -67380, -175856, 299254, -14944, -173423, -78909, -112744, 1865, -287127, -26052, -171532, -199308, -122698, -200497, -30777, 91622, -10853, -229578, -8265, 264207, 233251, -123186, 20166, -44620, 78440, -266437, -63986, 133513, 113687, -60293, 99722, -215317, -125453, -74987, 355830, 216183, -30108, 292934, -111420, -136852, 5898, -325728, -206505, -50349, -248763, -132934, -364783, 88757, 89531, -311356, -307480]
9568c07480C8796f6782p2146K7161F7692N4209b64645R8161g5644c4990C91330
9556A13295L1821i0646c2933L746j03789c5357j00771A6538h6316B51654p8317
9545A73337b13541I1469h8729j71595a08927M4314G8469g4559A325b38885K4152
9534b14733B26468a921l83549c9755j07759C94727e695j40466b6981A10890b39423
9522b30603a8879l21116a174I8320d4936A73189a70453M2085F2134J6302c01128
9510c04787O9379A12510C6465b39150A28011a34481F7081M6466B8266L5424k0988
9499D2702c2453k59389d3342K0644j6842M955j4210I2167d09788a37207A94707
9487D69446a81412A3020J6266a9778A36435a29960m6659A13281a360k30681J13289
$$ y = [-307480, 38796, -66782, -138928, -111767, 67692, 121901, -264645, -166484, -75644, -34990, 391330, 113295, 145116, -90646, -32933, -29187, -132976, -35357, -136128, 16538, -86316, 251654, 173337, -213541, 91469, -88729, -260324, -108927, -64613, 78469, -74559, 1325, -238885, -214733, 226468, -1921, -385470, -39755, -147514, 394727, -5695, -146161, -26981, 110890, -239423, -230603, -18879, -339995, -1174, 98320, -44936, 173189, -170453, -128368, 62134, 78436, -301128, -304787, -235408, 112510, 36465, -239150, 128011, -134481, 67081, 113547, 28266, 63690, 42702, -32453, -291842, -43342, -22698, -39540, -34585, -48795, 92167, -409788, -137207, 194707, 469446, -181412, 13020, 29286, -19778, 136435, -129960, -176619, 113281, -1360, -232041, -118752]
9476a18752m62851B55169j05246a23114d4425m07422J12797i0988N168k74018
9466c59838A8213L68000a94728j52482H8924J61362a08482j61002O4439A44363
9455a88571A5516R9572a45591A0285f6450k4714B3961a27517f2601k1746A28966
9443B31187a47304m7363h140m75747D9740K7950K06175b69052R7300j61114f5670
9431A14823k4061P2175b06444F9539a24932K2113j890b6322A9796g8397C754L3097
9419C6851a20646F40a7295B3877a04276A3227R2098b7021C9017a60034G2986a72235
9406i6568G2264a03451J5087j35559B46666b13138A42396a87575A35393b96616
9395b78389A29922b29684C63741a27010l64795a64770n3409o50C23396Q1595a57535
$$ y = [-118752, -581603, 255169, 149923, -123114, -44425, -451847, -339050, -90988, -85820, -359838, 18213, 386213, -194728, -347210, 88924, 250286, -108482, -269484, -205045, 144363, -188571, 15516, 115088, -145591, 10285, -66450, -91164, 23961, -127517, -62601, -84347, 128966, 231187, -147304, -194667, -8140, -483887, 49740, 77690, 283865, -269052, -171752, -332866, -65670, 114823, 90762, 162937, -206444, 69539, -124932, -102819, -104709, -26322, 19796, -78397, 3754, 36851, -120646, 640, -17295, 23877, -104276, 13227, 105325, -27021, 39017, -160034, 72986, -172235, -96568, 72264, -103451, -88364, -223923, 246666, -213138, 142396, -187575, 135393, -296616, -278389, 129922, -229684, 363741, -127010, -491805, -164770, -218179, -218829, 323396, 404991, -157535]
9383b48866B2477J35203a36599b5193B36952j10881b47259i4358a057F0284b68239
9371b596j32745B46782a41198r1834Q1471m01919h8410j10963L0156k34754J51293
9360b52678G2352f7483h432j49644A36224a5680l03860E4687a82883p6478F9750
9348b64004G7090a31888f0096J8808F604P5527A0838h235A44405e7877j69866
9337b27743O1255n1414I7139i9183A20393b99238a49112N5521H9686J93130b5664
9325B6626J83239f2107A2327O2741b33415I2259h6338H7131j1067b77546A34946
9313B360O8327J27350f3282J2459H1110b33675d2860l13980C4516J84150a74537
9301b76039c5835D2710g8306A92753C311a86581B3447J85444g6827A40721b51184
$$ y = [-248866, 22477, 157680, -136599, -25193, 236952, 126071, -247259, -94358, -1057, 60284, -268239, -2596, -135341, 246782, -141198, -233032, -151561, -553480, -88410, -199373, -169217, -403971, -252678, 72352, -67483, -8432, -158076, 136224, -15680, -319540, 54687, -182883, -259361, 69750, -264004, 77090, -131888, -60096, -41288, 6604, 82131, 10838, -8235, 144405, -57877, -227743, -166488, -217902, 97139, -99183, 120393, -299238, -149112, -93591, 89686, 282816, -25664, 26626, 209865, -62107, 12327, 75068, -233415, 92259, -86338, 87131, 76064, -277546, 134946, 2360, 70687, 198037, -63282, -50823, 81110, -233675, -42860, -356840, 34516, 218666, -174537, -276039, -35835, 42710, -78306, 192753, 3311, -186581, 23447, 208891, -76827, 140721, -251184]
9289a79556D7774b0188B3750a76001f5375j47123j69592A0335J8345N2504b2684
9277b55150A48111a96100A35653c08395d9600k3812H1173K24147A17226c54759
9266b0284A62643R5178b14964q6845P6881I1491a70656b0778k58631A31106a05016
9254A36739i1356A21280D2370a7074l76632G7062K01911e9709j25507a4727k01956
9243b16683A44600A0987M4577J0174j2626p457j3140b99493C6312L14992b00331
9231h1743b115B61077G9460C4290e4108C7966b29726c1268A10045b49844a17305
9219e7580j00511M7419A15127b46025o3268a0795q5693k4493c0871o4822a4530
9207H0110d19085B242N6497b40089A47888B7292c07819B06523b0425n11466G3975
$$ y = [-179556, 47774, -20188, 23750, -176001, -65375, -212498, -382090, 10335, 28680, 81184, -22684, -255150, 148111, -196100, 135653, -308395, -49600, -73412, 81173, 305320, 117226, -354759, -20284, 162643, 257821, -214964, -301809, -224928, 91491, -170656, -20778, -279409, 131106, -105016, 136739, -91356, 121280, 42370, -17074, -393706, 77062, 278973, -59709, -185216, -14727, -216683, 144600, 10987, 55564, 65738, 53112, 45655, 32515, -299493, 36312, 351304, -200331, -81743, -2115, 261077, 79460, 34290, -54108, 37966, -229726, -31268, 110045, -249844, -117305, -57580, -158091, -110672, 115127, -246025, -309293, -10795, -96488, -120981, -30871, -95693, -14530, 80110, -419085, 2242, 58739, -240089, 147888, 27292, -307819, 206523, -20425, -531891, 73975]
9195c10044n701A55671b75145f0142j33222b0886j42009B20130a19650k6135H2811
9183I408K8683a63686E170a96236m437B94704b56181A31666N0096b47702a7198
9171b24584E4769a38023c315j43773a8366I6167D2042J48877q1309c28575B03510
9159e2998D5226K54260b89324J27308A04016b85419b3966h541l13181F9097c60395
9147A3729a95947M3320g0420A79846L6011b9456j85300h8304A34008a04258c2068
9135a40783J3670H2438Q8374A1448J05184F279d2008k0730r4185D1410h7655g449
9122h8841A38676F3207a70427l02981A78682O608g2770n3294c0978j97658k4634
9111b53270R6824N0834l07996R4093g2502q757j19371p7152A30563b48485C25598
$$ y = [-310044, -315745, 155671, -275145, -60142, -193364, -20886, -162895, 220130, -119650, -145785, 82811, 9408, 38091, -163686, 5170, -196236, -200673, 294704, -256181, 131666, 181762, -247702, -17198, -224584, 54769, -138023, -3315, -147088, -18366, 96167, 42042, 190919, 109610, -328575, 203510, -52998, 45226, 299486, -289324, -162016, 104016, -285419, -23966, -8541, -321722, 69097, -360395, 13729, -195947, -152627, -70420, 179846, 215857, -29456, -214756, -88304, 134008, -104258, -32068, -140783, -127113, 82438, 170812, 11448, 116632, 6279, -42008, -62738, -156923, 41410, -87655, -7449, -88841, 138676, 63207, -170427, -473408, 178682, 185290, -72770, -126064, -30978, -228636, -253270, -156446, -105612, -413608, -319515, -72502, -81259, -200630, -277782, 130563, -248485, 325598]
9099a15254A1733e5534B21504g7894E7176c04385B21284a70091M9497e8833B33320
9087a27209C8528K14768c8347A53418a5294A38728a43375B16575j0753b31302
9076b21418i900A52279a18119K9545M0939k44478a25324m05868b1111A87451m3028
9065A44423a3236A95885C4506a54035j18360I9357a32855N0599q9232j38687B92833
9053e7348j96264a11096J5831k37222d3308l51046J68278f3161j9133k3184M0151
9042f5327k5267B22659a73634d3467o1022d8110l213A07953b0980m18415b6902
9030G5024K4304K9785a37083A49126a42872F1547c30824G4226c18984d5175G2696
9018B68267j23678f8249j75724a08052A13460a79530B60059g7305l446L1333A56677
$$ y = [-115254, 11733, -55534, 221504, -77894, 57176, -304385, 221284, -170091, -120594, -58833, 233320, -127209, 38528, 253296, -38347, 153418, -15294, 138728, -143375, 216575, 205822, -231302, -221418, -9900, 152279, -118119, -88574, -47635, -292113, -125324, -531192, -21111, 187451, 144423, -13236, 195885, 34506, -154035, -272395, 99357, -132855, -82256, -171488, -310175, 292833, -57348, -253612, -111096, -95265, -332487, -43308, -394354, -226076, -63161, -82294, -105478, -65327, -90594, 222659, -173634, -43467, -104489, -48110, -51323, 107953, -20980, -439395, -26902, 75024, 99328, 129113, -137083, 149126, -142872, 61547, -330824, 74226, -318984, -45175, 72696, 268267, 144589, -68249, -243973, -108052, 113460, -179530, 260059, -77305, -80751, -49418, 156677]
9006a28287j03595j7681J24366A31998L8821b1771j77966D6996b76373m4319I6043
8994e7564j92581i9061A25496c36164d0226k68626C28287b40935N3507O5415j05253
8983b27266E1288P5555b76306D3003a24253A7273a7429j43234O0480A44560c0665
8971c08670j84008e8085C6499a48909A15524D7123a56967k4382A63812D0280r64
8960C9316b89063I697a53554D7828a09872A68364a44609K5424A88852c08745B38624
8948H5933a4003k55580A83974e0900j89304H1239a6147j16164p6871l2391c7356
8936f9710D1201h989j9418k64609A00724b86048A92958a5527A71434a8633C39786
8924C47747L19170R47542O493527B609005F37235k76433J26019j43727a22065
$$ y = [-128287, -231882, -249563, -125197, 131998, 170819, -21771, -199737, 46996, -276373, -320692, 96043, -57564, -250145, -99061, 125496, -336164, -40226, -308852, 328287, -240935, -187428, -122013, -227266, 51288, 126843, -276306, 43003, -124253, 17273, -17429, -160663, -100183, 144560, -30665, -308670, -492678, -58085, 36499, -148909, 115524, 47123, -156967, -181349, 163812, 40280, 39316, -289063, 9697, -153554, 47828, -109872, 168364, -144609, -119185, 188852, -308745, 238624, 85933, -14003, -269583, 183974, -50900, -240204, 81239, -16147, -132311, -209182, -241573, -37356, -69710, 41201, -8989, -28407, -293016, 100724, -286048, 192958, -15527, 171434, -18633, 339786, 347747, 666917, 1614459, 8107986, 2609005, 637235, 360802, 486821, 343094, -122065]
8914a13540M9735k5123m7004F8953A5557R9539g0053j68658P5210A5329D059a45094
8901I1282d0739k33097I3236d8433k88917F5657g009A32996a11773a0151B37746
8889f8687k11383a6024k01514O1113j42253N2447D4553d9717g668k12822A99690
8877b51456c9502k07198n3183a28087f3587n5389E6639a13353F5425c53078f0005
8865D18556D3167M09293a52808j10333a28991e0931b1780l23283a4233q3239J7508
$$ y = [-113540, -63805, -88928, -135932, 68953, 15557, 115096, -70053, -238711, -163501, 15329, 4059, -145094, 91282, -40739, -273836, 93236, -48433, -337350, 65657, -7009, 132996, -111773, -10151, 237746, -68687, -280070, -16024, -217538, -156425, -298678, -246231, 44553, -49717, -7668, -220490, 199690, -251456, -39502, -246700, -299883, -128087, -63587, -118976, 56639, -113353, 65425, -353078, -60005, 418556, 43167, 452460, -152808, -263141, -128991, -50931, -21780, -345063, -14233, -97472, -79964]
$$ [...]
##END NTUPLES=NMR SPECTRUM
##END=
