
##TITLE=AC1225_PUEHDE098_6540727_UGgECoJWBi
##JCAMPDX= 6.0         $$ Bruker NMR JCAMP-DX V2.0
##DATA TYPE= NMR SPECTRUM
##DATA CLASS= NTUPLES
##ORIGIN= BRUKER
##OWNER= Administrator
$$ 1.72 TOPSPIN		Version 2.1
$$ 2012-07-18 01:50:51.078 -0500  Administrator@TOPSPIN
$$ Compression mode = diff/dup
##.OBSERVE FREQUENCY= 400.02188249412
##.OBSERVE NUCLEUS= ^1H
##.ACQUISITION MODE= SIMULTANEOUS (DQD)
##.ACQUISITION SCHEME= undefined
##.AVERAGES= 64
##.DIGITISER RES= 22
##SPECTROMETER/DATA SYSTEM= spect
##.PULSE SEQUENCE= noesygpps1d.comp
##.SOLVENT NAME= COFFEE_meoh
##.SHIFT REFERENCE= INTERNAL, COFFEE_meoh, 1, 14.96068
##AUDIT TRAIL= $$ (NUMBER, WHEN, WHO, WHERE, PROCESS, VERSION, WHAT)
$$ ##TITLE= Audit trail, TOPSPIN		Version 2.1
$$ ##JCAMPDX= 5.01
$$ ##ORIGIN= Bruker BioSpin GmbH
$$ ##OWNER= Administrator
$$ $$ C:\Bruker\TOPSPIN/data/COFFEE/nmr/AC1225_PUEHDE098_6540727_UGgECoJWBi/12/pdata/1/auditp.txt
$$ ##AUDIT TRAIL=  $$ (NUMBER, WHEN, WHO, WHERE, PROCESS, VERSION, WHAT)
(   1,<2012-07-18 01:50:46.078 -0500>,<Administrator>,<TOPSPIN>,<go>,<TOPSPIN 2.1>,
      <created by zg
	started at 2012-07-18 01:39:15.828 -0500,
	POWCHK enabled, PULCHK disabled,
       configuration hash MD5:
       6B 1B 68 BB D9 2E 58 E2 7F 35 AD 54 07 DF 0E 41
       data hash MD5: 64K
       94 3C 37 B8 09 4E B6 70 B3 22 F3 5A 90 D7 F6 D1>)
(   2,<2012-07-18 01:50:48.812 -0500>,<Administrator>,<TOPSPIN>,<proc1d>,<TOPSPIN 2.1>,
      <Start of raw data processing
       efp LB = 0.3 FT_mod = 6 PKNL = 1 PHC0 = 0 PHC1 = 0 SI = 128K 
       data hash MD5: 128K
       45 F1 E5 3C 28 62 13 45 E1 1A 22 14 2E 3D C3 E8>)
(   3,<2012-07-18 01:50:49.984 -0500>,<Administrator>,<TOPSPIN>,<proc1d>,<TOPSPIN 2.1>,
      <pk PHC0 = 1.680908 PHC1 = 0 
       data hash MD5: 128K
       C7 C0 99 DB A3 24 DF EE B5 02 15 78 C8 EC EE 14>)
(   4,<2012-07-18 01:50:50.218 -0500>,<Administrator>,<TOPSPIN>,<proc1d>,<TOPSPIN 2.1>,
      <abs ABSG = 1 
       data hash MD5: 128K
       15 AF 8B B3 12 C9 BD D4 C0 6C 58 B1 F6 28 32 E2>)
(   5,<2012-07-18 01:50:50.296 -0500>,<Administrator>,<TOPSPIN>,<proc1d>,<TOPSPIN 2.1>,
      <abs ABSG = 2 
       data hash MD5: 128K
       52 1C BF 9F 46 F2 87 2A 7D 73 21 CE 0B 6A 79 37>)
(   6,<2012-07-18 01:50:50.390 -0500>,<Administrator>,<TOPSPIN>,<proc1d>,<TOPSPIN 2.1>,
      <abs ABSG = 3 
       data hash MD5: 128K
       BE 7D E0 B8 55 92 B7 27 E7 1B 8E F7 FC 91 C4 1E>)
(   7,<2012-07-18 01:50:50.890 -0500>,<Administrator>,<TOPSPIN>,<proc1d>,<TOPSPIN 2.1>,
      <abs ABSG = 4 
       data hash MD5: 128K
       C5 D1 8D 23 C9 D9 A3 72 9B 41 7A 28 92 00 90 0B>)
(   8,<2012-07-18 01:50:51.000 -0500>,<Administrator>,<TOPSPIN>,<proc1d>,<TOPSPIN 2.1>,
      <abs ABSG = 5 
       data hash MD5: 128K
       27 13 A1 A3 E4 70 16 3C 18 99 37 71 76 2B AA 97>)
$$ ##END=
$$ 
$$ $$ hash MD5
$$ $$ FA 5D 71 AE 8F 3E 87 DD 8F B7 9E 88 9A 4D 11 E3
##$RELAX= 
##$RELAX= 
##$RELAX= 
##$RELAX= 
##$RELAX= 
##$RELAX= 
##$RELAX= 
##$RELAX= 
$$ Bruker specific parameters
$$ [...]
##$TP07= 0
##$TPNAME0= <>
##$TPNAME1= <>
##$TPNAME2= <>
##$TPNAME3= <>
##$TPNAME4= <>
##$TPNAME5= <>
##$TPNAME6= <>
##$TPNAME7= <>
##$TPOAL= (0..7)
0.5 0.5 0.5 0.5 0.5 0.5 0.5 0.5
##$TPOFFS= (0..7)
0 0 0 0 0 0 0 0
##$TUNHIN= 0
##$TUNHOUT= 0
##$TUNXOUT= 0
##$USERA1= <user>
##$USERA2= <user>
##$USERA3= <user>
##$USERA4= <user>
##$USERA5= <user>
##$V9= 5
##$VALIST= <valist>
##$VCLIST= <CCCCCCCCCCCCCCC>
##$VD= 0
##$VDLIST= <DDDDDDDDDDDDDDD>
##$VPLIST= <PPPPPPPPPPPPPPP>
##$VTLIST= <TTTTTTTTTTTTTTT>
##$WBST= 2048
##$WBSW= 25
##$XGAIN= (0..3)
0 0 0 0
##$XL= 0
##$YL= 0
##$YMAX_a= 11494114
##$YMIN_a= -9113747
##$ZGOPTNS= <>
##$ZL1= 120
##$ZL2= 120
##$ZL3= 120
##$ZL4= 120
##$ABSF1= 14.96068
##$ABSF2= -5.597502
##$ABSG= 5
##$ABSL= 3
##$ALPHA= 0
##$AQORDER= 0
##$ASSFAC= 0
##$ASSFACI= 0
##$ASSFACX= 0
##$ASSWID= 0
##$AUNMP= <proc_prof1d_extract.lims>
##$AXLEFT= 0
##$AXNAME= <>
##$AXNUC= <1H>
##$AXRIGHT= 0
##$AXTYPE= 0
##$AXUNIT= <>
##$AZFE= 0.1
##$AZFW= 0.1
##$BCFW= 0
##$BC_mod= 0
##$BYTORDP= 0
##$COROFFS= 0
##$CY= 15
##$DATMOD= 1
##$DC= 0
##$DFILT= <>
##$DTYPP= 0
##$F1P= 0
##$F2P= 0
##$FCOR= 0.5
##$FTSIZE= 131072
##$FT_mod= 6
##$GAMMA= 0
##$GB= 0
##$INTBC= 1
##$INTSCL= 1
##$ISEN= 128
##$LB= 0.3
##$LEV0= 0
##$LPBIN= 0
##$MAXI= 10000
##$MC2= 0
##$MEAN= 0
##$ME_mod= 0
##$MI= 0
##$NCOEF= 0
##$NC_proc= -2
##$NLEV= 6
##$NOISF1= 0
##$NOISF2= 0
##$NSP= 0
##$NTH_PI= 0
##$NZP= 0
##$OFFSET= 14.96068
##$PC= 1
##$PHC0= 1.680908
##$PHC1= 0
##$PH_mod= 1
##$PKNL= yes
##$PPARMOD= 0
##$PPDIAG= 0
##$PPIPTYP= 0
##$PPMPNUM= 2147483647
##$PPRESOL= 1
##$PSCAL= 4
##$PSIGN= 0
##$PYNMP= <proc.py>
##$REVERSE= no
##$SF= 400.020009764178
##$SI= 131072
##$SIGF1= 0
##$SIGF2= 0
##$SINO= 400
##$SIOLD= 131072
##$SPECTYP= <>
##$SREGLST= <1H.CDCl3>
##$SSB= 0
##$STSI= 131072
##$STSR= 0
##$SW_p= 8223.68421052631
##$SYMM= 0
##$S_DEV= 0
##$TDeff= 65536
##$TDoff= 0
##$TI= <>
##$TILT= no
##$TM1= 0
##$TM2= 0
##$TOPLEV= 0
##$USERP1= <user>
##$USERP2= <user>
##$USERP3= <user>
##$USERP4= <user>
##$USERP5= <user>
##$WDW= 1
##$XDIM= 131072
##$YMAX_p= 405300189
##$YMIN_p= -11440
##$CURPLOT= <Network HP LaserJet P1505>
##$CURPRIN= <$Network HP LaserJet P1505>
##$DFORMAT= <normdp>
##$LAYOUT= <+/1D_H.xwp>
##$LFORMAT= <normlp>
##$PFORMAT= <normpl>
##$SURQMSG= 1
$$ End of Bruker specific parameters
$$ ---------------------------------
##NTUPLES= NMR SPECTRUM
##VAR_NAME=  FREQUENCY,     SPECTRUM/REAL,   SPECTRUM/IMAG
##SYMBOL=    X,             R,               I
##VAR_TYPE=  INDEPENDENT,   DEPENDENT,       DEPENDENT
##VAR_FORM=  AFFN,          ASDF,            ASDF
##VAR_DIM=   131072,        131072,          131072
##UNITS=     HZ,            ARBITRARY UNITS, ARBITRARY UNITS
##FACTOR=    0.0627417313425164, 1,          1
##FIRST=     8223.62146879497, 1418,         -57348
##LAST=      0,             2809,            -57833
##MIN=       0,             -11440,          0
##MAX=       8223.62146879497, 405300189,    0
$$ Real data points
##PAGE= N=1
##DATA TABLE= (X++(R..R)), XYDATA
$$ [...]
61630D41028j050k011l272m188m470m332m195m389m907n310n073m129k886j727
61616C89089p03J86P08O80L44R4j96j155l041n158o479o662o198n695n475n701
61600C44638o311o766o418n372m532m458m652m362l678l305l483l729l553l002
61586B81017k448k189k275k493k466k036j422r59p41p80j174j888k507k560k018
61571B53061j242n72j18J92N57J076J456J211K95p99j639k093j867n43J436K649
61555B53060K301J398J430K360K882K382J558J150J097J110J203J300J112O95
61541B75038N39Q51J216J185P82L25K11Q41K145L241L183K120J049M66K2m13l90
61524B92411J09K93k46q45q81q32j409k251k354j510n30j90n64j289j879j907
$$ y = [441028, 439978, 437967, 434695, 430507, 426037, 421705, 417510, 413121, 408214, 402904, 397831, 393702, 390816, 389089, 388386, 388572, 389280, 389960, 390304, 390398, 390202, 389047, 386006, 380848, 374369, 367707, 361509, 355814, 350339, 344638, 338327, 331561, 325143, 319771, 315239, 310781, 306129, 301767, 298089, 294784, 291301, 287572, 284019, 281017, 278569, 276380, 274105, 271612, 269146, 267110, 265688, 264729, 263988, 263208, 262034, 260146, 257639, 255079, 253061, 251819, 251247, 251129, 251321, 251878, 252954, 254410, 255621, 255916, 255117, 253478, 251385, 249518, 248975, 250411, 253060, 255361, 256759, 258189, 260549, 263431, 265813, 267371, 268521, 269618, 270728, 271931, 273231, 274343, 275038, 275577, 276428, 277644, 278829, 279611, 279936, 280147, 280988, 283133, 286374, 289557, 291677, 292726, 293192, 293214, 292801, 292411, 292520, 292813, 292567, 291722, 290841, 290009, 288600, 286349, 283995, 282485, 281955, 281765, 281201, 279912, 278033, 276126]
61508B76126j313n23J01O63J291J598J142K18l75k65K69Q98J518K064K510L059
61492B88981L827M394M202L410K816K758K678K042J166P36Q60J048R58P64Q24
61477C21464J327K154K801K494Q50j459l035l064k064j203j027j183j174r63p76
61462C15142p04p59j029j521j964j975j471p57k34q0r9J22Q04J616J959J662J282
61445C11994J467K207K984L468L822M283M726M769M270L614L425L900M457M316
61431C63702L423K500K065J798J164L13j12J74Q18J412J874K241K488K678K992
61416C89530L424L503K595N87j723l098k993k180j907k528l296l534l414l399
61402C71567l537l662l800l903l661l092k861l359l874l388j945n29J74K30j97
$$ y = [276126, 274813, 274290, 274391, 275054, 276345, 277943, 279085, 279303, 278928, 278663, 278932, 279830, 281348, 283412, 285922, 288981, 292808, 297202, 301404, 304814, 307630, 310388, 313066, 315108, 316274, 317010, 317870, 318918, 319876, 320640, 321464, 322791, 324945, 327746, 330240, 331090, 329631, 326596, 323532, 321468, 320265, 319238, 318055, 316881, 315918, 315142, 314438, 313679, 312650, 311129, 309165, 307190, 305719, 304962, 304728, 304648, 304549, 304671, 305475, 307091, 309050, 310712, 311994, 313461, 315668, 318652, 322120, 325942, 330225, 334951, 339720, 343990, 347604, 351029, 354929, 359386, 363702, 367125, 369625, 371690, 373488, 374652, 374965, 374853, 375027, 375845, 377257, 379131, 381372, 383860, 386538, 389530, 392954, 396457, 399052, 399639, 397916, 394818, 391825, 389645, 387738, 385210, 381914, 378380, 374966, 371567, 368030, 364368, 360568, 356665, 353004, 349912, 347051, 343692, 339818, 336430, 334485, 333956, 334130, 334360, 334163]
61387C34163j011j742j710q59J09O34Q44J200J946K951L690L569K711K151K660
61372C51306L622L885L417L170L461L586L194K837K816K616J971J516J716K000
61358C91113J705J229J391K220L112L779M341M838N308O070P273Q421Q893Q684
61344D58377Q110P113N551L949L159L280L552L449L258L466L994M354M199L541
61330E19352K531J242l75k210l808m588m495m222m486n214n683n393m555l647
61316D74449k796j735l49R25J394R04K11L24J485L021M212M933N458N971O477
61301E04884O872O749N404K534j122m181n779o145n975n623n150m836n097n737
61287D76798n828m781l197k161j900j776j479j355j444j088N8J472K708M060N646
$$ y = [334163, 333152, 331410, 329700, 328841, 328950, 329584, 330428, 331628, 333574, 336525, 340215, 343784, 346495, 348646, 351306, 354928, 358813, 362230, 365400, 368861, 372447, 375641, 378478, 381294, 383910, 385881, 387397, 389113, 391113, 392818, 394047, 395438, 397658, 400770, 404549, 408890, 413728, 419036, 425106, 432379, 440800, 449693, 458377, 466487, 473600, 479151, 483100, 486259, 489539, 493091, 496540, 499798, 503264, 507258, 511612, 515811, 519352, 521883, 523125, 522750, 520540, 516732, 512144, 507649, 503427, 498941, 493727, 488044, 482651, 478096, 474449, 471653, 469918, 469569, 470494, 471888, 472792, 473003, 473327, 474812, 477833, 482045, 486978, 492436, 498407, 504884, 511756, 518505, 523909, 526443, 525321, 521140, 515361, 509216, 503241, 497618, 492468, 487632, 482535, 476798, 470970, 466189, 462992, 460831, 458931, 457155, 455676, 454321, 452877, 451789, 451847, 453319, 456027, 460087, 465733]
61272D65733O629O341N539N470O110O455O129N617N121M466M051M708O465Q526
61258E47360J0471J2326J3493J2997J1075R189Q029O784M878L149K531K655K591
61245F47528K054J085m83k494m193n261o309p615q362p985p362p582q284q347
61231E76390p650o928o344n383l945k520j385n05k9r3l53m35o42j431k432k765
61215E33550k182j200l48J41J26k55n18n31r40k166l395l436k247p58N16J766
61199E18123L058M199N419P185R348J1249J2675J3954J5131J5777J5518J4095
61187F45731J1190P079L276J431J485J877J663J407J793K393K325J328k34j901
61173F80843l198l782l849l972m345m653m772n046n645o264o730p320q150q718
$$ y = [465733, 472362, 478703, 484242, 489712, 495822, 502277, 508406, 514023, 519144, 523610, 527661, 532369, 538834, 547360, 557831, 570157, 583650, 596647, 607722, 616911, 624940, 631724, 636602, 639751, 642282, 644937, 647528, 649582, 650667, 650184, 647690, 643497, 638236, 631927, 624312, 615950, 607965, 600603, 593021, 584737, 576390, 568740, 561812, 555468, 550085, 546140, 543620, 542235, 541730, 541701, 541608, 541255, 540820, 540178, 538747, 536315, 533550, 531368, 530168, 529820, 529961, 530087, 529832, 529314, 528783, 527843, 525677, 522282, 518846, 516599, 515841, 516357, 518123, 521181, 525380, 530799, 537984, 547332, 558581, 571256, 585210, 600341, 616118, 631636, 645731, 656921, 664000, 667276, 668707, 670192, 672069, 673732, 675139, 676932, 679325, 681650, 682978, 682744, 680843, 677645, 673863, 670014, 666042, 661697, 657044, 652272, 647226, 641581, 635317, 628587, 621267, 613117, 604399]
61159F04399q531p818p300p404p862p933o963n010k881j323k15J003K278K812
61145E47252J987j13l072o426r493j1557j2452j2571j2166j1128r506p724o091
61132D46940m586l283k445j935j077N17K386L772M523N106N998P304Q776J0055
61118D82051J0986J1751J2641J3691J4733J5690J6513J7016J7099J7062J7212
61107F46445J7311J6882J6051J5435J5148J4485J2849J0381P433L889m13m927
61095G70969q547j0627j1583j2462j3913j5670j6973j7428j7292j6931j6438j5863
61083E97242j5403j5038j4381j3334j2438j2155j2068j1437j0240r068q137p203
61071D56340o263n680n483n187m379l098j571j37O86N64j02m52k1J014K218L184
$$ y = [604399, 595868, 588050, 580750, 573346, 565484, 557551, 550588, 545578, 542697, 541374, 541159, 542162, 544440, 547252, 549239, 549126, 546054, 539628, 530135, 518578, 506126, 493555, 481389, 470261, 460755, 453031, 446940, 442354, 439071, 436626, 434691, 433614, 434131, 436517, 440289, 444812, 449918, 455916, 463220, 471996, 482051, 493037, 504788, 517429, 531120, 545853, 561543, 578056, 595072, 612171, 629233, 646445, 663756, 680638, 696689, 712124, 727272, 741757, 754606, 764987, 772420, 776309, 775896, 770969, 762422, 751795, 740212, 727750, 713837, 698167, 681194, 663766, 646474, 629543, 613105, 597242, 581839, 566801, 552420, 539086, 526648, 514493, 502425, 490988, 480748, 471680, 463543, 456340, 450077, 444397, 438914, 433727, 429348, 426250, 424679, 424542, 425228, 425792, 425690, 425238, 425217, 426231, 428449, 431633]
61055D31633L634L828M521N961P257P533P341Q027R792J1523J2487J3178J4207
61042E40922J5403J6397J7360J8653K0225K1661K2383K1883K0330J8910J8846
61031G52973K0122K1775K3301K4856K6345K7500K8819L1133L4131L6830L9674
61020A067459M4659N2902O3733P6806R3171J13338J36404J62861J96156K38868
61010B246357K89017L43109M00326M56337M90647M68356L66357K02017L0960q9364
61000E204119j35211j18072o0313J9272R5643J28506Q0583m9723k19329l68645
60990D576830m58967m85685m65259m17654l58733k99605k46566k01529j64109
60981A478723j33373j08107q7071o9752n6186m5921l7987l1818k7197k3329j9158
$$ y = [431633, 435267, 439095, 443616, 449577, 456834, 464367, 471708, 479735, 489527, 501050, 513537, 526715, 540922, 556325, 572722, 590082, 608735, 628960, 650621, 673004, 694887, 715217, 734127, 752973, 773095, 794870, 818171, 843027, 869372, 896872, 925691, 956824, 990955, 1027785, 1067459, 1112118, 1165020, 1228753, 1305559, 1398730, 1512068, 1648472, 1811333, 2007489, 2246357, 2535374, 2878483, 3278809, 3735146, 4225793, 4694149, 5060506, 5262523, 5293483, 5204119, 5068908, 4950836, 4890523, 4909795, 5005438, 5133944, 5214527, 5164804, 4945475, 4576830, 4117863, 3632178, 3166919, 2749265, 2390532, 2090927, 1844361, 1642832, 1478723, 1345350, 1237243, 1150172, 1080420, 1024234, 978313, 940326, 908508, 881311, 857982, 838824]
60970H38824j4795j1382r257p306m535j260J776M481P032R193J0727J1972J3302
60957H48772J4512J5271J5859J6885J8424J9832K0366J9800J8543J7274J6224
60946A041762J4831J2438R251O116L298J57l722p776j1296j4471j7945k1720k5086
60933I85837k7524k9120l0080l0367k9881k8722k7164k5565k4278k3429k2752
60922F86955k1786k0267j8272j6159j4442j3547j3294j2794j1221q798o618n455
60910E24302n062m786m415m106l800l218k349j447n85L69J286J836K145K836M094
60895E07100N184N330M662L725K446L85k166m180n144n546n875n847n153m346
60881D90575m276m948n597n781n778n837n632m860l931l614m064m598m553m071
$$ y = [838824, 824029, 812647, 803390, 796084, 791549, 790289, 792065, 796546, 803578, 812771, 823498, 835470, 848772, 863284, 878555, 894414, 911299, 929723, 949555, 969921, 989721, 1008264, 1025538, 1041762, 1056593, 1069031, 1078282, 1084398, 1087696, 1087853, 1084131, 1076355, 1065059, 1050588, 1032643, 1010923, 985837, 958313, 929193, 899113, 868746, 838865, 810143, 782979, 757414, 733136, 709707, 686955, 665169, 644902, 626630, 610471, 596029, 582482, 569188, 556394, 545173, 536375, 529757, 524302, 519240, 514454, 510039, 505933, 502133, 498915, 496566, 495119, 494534, 494903, 496189, 498025, 500170, 503006, 507100, 512284, 517614, 522276, 526001, 528447, 528832, 526666, 522486, 517342, 511796, 505921, 500074, 494921, 490575, 486299, 481351, 475754, 469973, 464195, 458358, 452726, 447866, 443935, 440321, 436257, 431659, 427106, 423035]
60867D23035l783l932m148m037l623l116k626k259k144k163j956j480j237j622
60853C84909k335k782k749k326j485m01J83l27j338j529m17J110J947J831J131
60838C75422K54m67q03r22j265j936k473k432j804p86M28J494K006J939J690J556
60822C71901J514J580J859K159K083J645J333J301J095M21l01n11k51M6J43M4
60806C86061k44p40j375k054k626k878k782k719l028l428l338k786k359k342k500
60791C50862k760l325l975m055l444k863k833l034l011k855k815k826k812k905
60777C07349k990k581j549m08L76Q09R45P26N02R07J834K408K264K065K269K397
60761C17323K101J915K185K213J487Q99J585L094L889L374K392J884J976K266
$$ y = [423035, 419252, 415320, 411172, 407135, 403512, 400396, 397770, 395511, 393367, 391204, 389248, 387768, 386531, 384909, 382574, 379792, 377043, 374717, 373232, 372831, 373014, 372687, 371349, 369820, 369403, 370513, 372460, 374291, 375422, 375676, 375209, 374406, 373484, 372219, 370283, 367810, 365378, 363574, 362788, 363216, 364710, 366716, 368655, 370345, 371901, 373415, 374995, 376854, 379013, 381096, 382741, 384074, 385375, 386470, 386891, 386590, 386079, 385828, 385874, 386017, 386061, 385817, 385077, 383702, 381648, 379022, 376144, 373362, 370643, 367615, 364187, 360849, 358063, 355704, 353362, 350862, 348102, 344777, 340802, 336747, 333303, 330440, 327607, 324573, 321562, 318707, 315892, 313066, 310254, 307349, 304359, 301778, 300229, 299821, 300197, 301006, 301951, 302677, 303179, 304086, 305920, 308328, 310592, 312657, 314926, 317323, 319424, 321339, 323524, 325737, 327224, 328123, 329708, 332802, 336691, 340065, 342457, 344341, 346317, 348583]
60747C48583K311J960J624J929K672K672J266p23k203l335m851o505p311p069
60733C31020o513o078n487m568l624k976k719k859l115k817j661l35K11q2n78
60718B87819r50j311j620j638j328q37k79L9k33p44n13O20J415R46o3m76n13r35
60700B79399j356q38L15R91J153J766K905L473K938J968J293J139J796L358M797
60685C05097M697L147J705J324J550J898K547L325L488K954K609K831K956K583
60671C42711K188J896R69p89k332k892l073l613m068l748k979k544k445k252k048
60656C14981k135k275k043j565j202q52k07O36J376K043K795L479L757L408K292
60641C24488M02j760l323l875l814l649l512l402l331l001k097j026o70j077j338
$$ y = [348583, 350894, 352854, 354478, 356407, 359079, 361751, 363017, 362294, 360091, 356756, 351905, 345400, 338089, 331020, 324507, 318429, 312942, 308374, 304750, 301774, 299055, 296196, 293081, 290264, 288603, 288268, 288479, 288397, 287819, 286869, 285558, 283938, 282300, 280972, 280135, 279856, 279895, 279662, 278918, 278405, 279025, 280440, 281386, 281323, 280847, 280334, 279399, 278043, 277205, 277520, 278511, 279664, 281430, 284335, 287808, 290746, 292714, 294007, 295146, 296942, 300300, 305097, 309794, 312941, 314646, 315970, 317520, 319418, 321965, 325290, 328778, 331732, 334341, 337172, 340128, 342711, 344899, 346795, 347764, 346975, 344643, 341751, 338678, 335065, 330997, 327249, 324270, 321726, 319281, 317029, 314981, 312846, 310571, 308528, 306963, 305761, 304909, 304702, 305338, 306714, 308757, 311552, 315031, 318788, 322196, 324488, 324890, 323130, 319807, 315932, 312118, 308469, 304957, 301555, 298224, 295223, 293126, 292100, 291430, 290353, 289015]
60626B89015j032q67j339j724j121K47J495K159K122J245q1p09j7J036J013j10
60610B91332j040q74Q4J026J439J219O29K28L80R21J403J555J297P11K05K44O61
60593C01420P62L77J75N15P49K63m88o59k09L71J010J940K929L499L628L594L402
60576C23278L070L150M134N543O461O849P521Q849J0248J1014J0903R793P485
60563D18298M193Q16j712l153m005m881n804o012m746k355k26P91J445K977N415
60548D01041P715R395J1048J3177J5367J6940J7756J7927J7281J5613J3119J0127
60536E66506O595K393k073n969q804j0700j1791j1839j0736r174q221q184q350
60523D79653p939o899n582m126k610j340m63M73J963L761N243O372P671R325J1065
$$ y = [289015, 287983, 287116, 285777, 284053, 282932, 283179, 284674, 286833, 288955, 290200, 290119, 289410, 289393, 290429, 291442, 291332, 290292, 289418, 289502, 290528, 291967, 293186, 293815, 294043, 294423, 295344, 296747, 298302, 299599, 300310, 300515, 300759, 301420, 302182, 302559, 302734, 303249, 303998, 304261, 303773, 303114, 302905, 303276, 304286, 306226, 309155, 312654, 316282, 319876, 323278, 326348, 329498, 333632, 339175, 345636, 352485, 360006, 368855, 379103, 390117, 401020, 410813, 418298, 422491, 423307, 421595, 418442, 414437, 409556, 403752, 397740, 392994, 390639, 390413, 391204, 392649, 395626, 401041, 408756, 418151, 429199, 442376, 457743, 474683, 492439, 510366, 527647, 543260, 556379, 566506, 573101, 575494, 573421, 567452, 558648, 547948, 536157, 524318, 513582, 504408, 496187, 488003, 479653, 471714, 464815, 459233, 455107, 452497, 451157, 450694, 451167, 453130, 456891, 462134, 468506, 476177, 485502, 496567]
60508D96567J2870J5060J7681K0535K3821K7844L2080L5441L7731L9830M2098
60497H01558M3600M3389M1533L8197L2706K4402J3746J714j1231k4583l6810m6070
60485I22151n1709n4228n4054n1390m6996m2133l7515l3058k8741k4973k1995
60474D75359j9477j7011j4527j2161j0052q344p093o084m991l819k973k865l473
60461C62489m244m452l925l300l220l338k774j629j118j868k885k957k305j925
60447C22549j966j764j161o85m50M1Q29J173N83m48j177j462j580j536j095l23
60431C11528K62J62n50j231j282p19m1L73M98M01J33p4N4M20O11N47N87Q74J122
60412C13675J166J138R34K18p27r61j69P35Q79O10P59J433K239L052L709L599
$$ y = [496567, 509437, 524497, 542178, 562713, 586534, 614378, 646458, 681899, 719630, 759460, 801558, 845158, 888547, 930080, 968277, 1000983, 1025385, 1039131, 1040845, 1029614, 1005031, 968221, 922151, 870442, 816214, 762160, 710770, 663774, 621641, 584126, 551068, 522327, 497354, 475359, 455882, 438871, 424344, 412183, 402131, 393787, 386694, 380610, 375619, 371800, 368827, 365962, 362489, 358245, 353793, 349868, 346568, 343348, 340010, 337236, 335607, 334489, 332621, 329736, 326779, 324474, 322549, 320583, 318819, 317658, 316973, 316523, 316564, 317393, 318566, 319149, 318701, 317524, 316062, 314482, 312946, 311851, 311528, 311790, 311952, 311402, 310171, 308889, 308170, 308129, 308502, 309000, 309401, 309534, 309460, 309514, 309934, 310545, 311092, 311679, 312553, 313675, 314841, 315979, 316913, 317131, 316404, 315443, 315274, 316009, 316888, 317498, 318257, 319690, 321929, 324981, 328690, 332289]
60396C32289K528J509J645K548K926K473K108K393K838K890K727K752K994L236
60382C67856L293L103K927L280M204M921M725L947L333K841J976J025Q52J476
60368D09759J928J685J269J157R62K51n61o80N7J044J598J573J473J964L050L962
60352D30491M122L929M032M214L726K561J522J042P69L81N0j36m73j086j660j913
60336D51571j936j938k138k863m174n410n739n232m688m458m160l635l286l216
60322C98698k874j942q21J32J158K438L503L904L996M563N988Q133J0613J2851
60308D50340J4293J5112J6214J8068J9710J9422J6394J1338N622J18n076j0065
60296E71490j4587j8061k0108k0736j9950j7606j4071j0583q230o782n195l177
$$ y = [332289, 334817, 336326, 337971, 340519, 343445, 345918, 348026, 350419, 353257, 356147, 358874, 361626, 364620, 367856, 371149, 374252, 377179, 380459, 384663, 389584, 394309, 398256, 401589, 404430, 406406, 407431, 408283, 409759, 411687, 413372, 414641, 415798, 416760, 417011, 416450, 415770, 415827, 416871, 418469, 420042, 421515, 423479, 426529, 430491, 434613, 438542, 442574, 446788, 450514, 453075, 454597, 455639, 456408, 456789, 456839, 456703, 456230, 455144, 453484, 451571, 449635, 447697, 445559, 442696, 438522, 433112, 427373, 422141, 417453, 412995, 408835, 405200, 401914, 398698, 395824, 393882, 393061, 393193, 394351, 396789, 400292, 404196, 408192, 412755, 418743, 426876, 437489, 450340, 464633, 479745, 495959, 514027, 533737, 553159, 569553, 580891, 586513, 586631, 581555, 571490, 556903, 538842, 518734, 497998, 478048, 460442, 446371, 435788, 427558, 420776, 415581, 412404]
60284D12404j492o25j26M32P02L16k95m61k31k02n99j086j306j178q30n56p92
60267D04075j664k667l021k459j492r16j064j532j618j081m41m08j090j925k270
60252C80427j893j004j55N8m30r41p55PO20P70Q19J044J112O09l37j157j344p70
60234C76680K91J336J976K184K127J862J435J126J244J733K239K498K455K188
60220D01374J985K264L090L992M569N030N665O214O253O012O090O547O901O891
60206D72877O654O281N835N639N858O007N523M679M137L846L318K764K860L349
60192E39627L147K029J055R05R80O69M27P74J069K64j686l860n402n905n282l950
60176E24861k814k435k460k258j791j393j102p85n86p03r21q85p23q73j401j862
$$ y = [412404, 410912, 410287, 410161, 410593, 411295, 411611, 411316, 410855, 410624, 410422, 409823, 408737, 407431, 406253, 405423, 404867, 404075, 402411, 399744, 396723, 394264, 392772, 391856, 390792, 389260, 387642, 386561, 386120, 385712, 384622, 382697, 380427, 378534, 377530, 377375, 377433, 377003, 376062, 375307, 375314, 375934, 376704, 377523, 378567, 379679, 380288, 379951, 378794, 377450, 376680, 376971, 378307, 380283, 382467, 384594, 386456, 387891, 389017, 390261, 391994, 394233, 396731, 399186, 401374, 403359, 405623, 408713, 412705, 417274, 422304, 427969, 434183, 440436, 446448, 452538, 459085, 465986, 472877, 479531, 485812, 491647, 497286, 503144, 509151, 514674, 519353, 523490, 527336, 530654, 533418, 536278, 539627, 542774, 544803, 545858, 546763, 547743, 548412, 548839, 549613, 550682, 550946, 549260, 545400, 539998, 534093, 528811, 524861, 522047, 519612, 517152, 514894, 513103, 511710, 510608, 509823, 509237, 508534, 507613, 506728, 506005, 505132, 503731, 501869]
60160E01869j842j382q47o44r14j381j497r29J33J121J451Q65k73j078p97N11
60144D94366K094L159L300K621J802J715K549L512L874L915M231M614M459L938
60130E40149L703L595K855J632J032J455J988J823J239P62L75K3QL17M29K17K46
60113E61848P13R91P19M43O36J003J299J843K546K478J269P9J64J191J910J816
60097E80948J288O99L33N99J384J784J300P26Q70J144M81q93j890k306k864l769
60081E79834m444m614m556m316l742l174l103l136k455j349j110k202l593m348
60067E33692m821n784p074p835p577o519n206m189l801l937m158m131l830l364
60053D61466k845k424k137j843j434j009n30L82J846L222L675L194K511K209K395
$$ y = [501869, 500027, 498645, 497798, 497154, 496240, 494859, 493362, 492433, 492566, 493687, 495138, 496003, 495730, 494652, 493855, 494366, 496460, 499619, 502919, 505540, 507342, 509057, 511606, 515118, 518992, 522907, 527138, 531752, 536211, 540149, 543852, 547447, 550302, 551934, 552966, 554421, 556409, 558232, 559471, 560233, 560608, 560631, 560639, 560956, 561385, 561602, 561848, 562561, 563552, 564271, 564714, 565350, 566353, 567652, 569495, 572041, 574519, 575788, 575867, 576031, 577222, 579132, 580948, 582236, 582935, 583268, 583867, 585251, 587035, 588335, 589061, 589931, 591075, 591556, 590663, 588773, 586467, 583603, 579834, 575390, 570776, 566220, 561904, 558162, 554988, 551885, 548749, 546294, 544945, 543835, 541633, 538040, 533692, 528871, 523087, 516013, 508178, 500601, 494082, 488876, 484687, 480886, 476949, 472791, 468660, 464830, 461466, 458621, 456197, 454060, 452217, 450783, 449774, 449244, 449626, 451472, 454694, 458369, 461563, 464074, 466283, 468678]
60038D68678L015L873M390L999K876J802J261J115J055Q41J67j108k568l513l731
60023D82152l529l150k693k523l044l942m353l983l530l678m221m549m585m786
60009D29586n376n986o008n174l789k527j909j937k250k508k556k308j747j019
59995C84492l32K37P48J304K024K883L509L442K754K165K208K652K977L146L444
59980D17653L855M051L822L120J877K35j162j609j085k26L04J92n57j563k146
59965D26761j909j197n74j31L47P28O43J54k41k30J04O44J252J525J168N74M70
59948D30088Q13P25k15j215j190j31R02J034L98k45m02k29j30k22l49l73k60P8
59930D29077O65J190J291J141J310J906K444K799L651N439P451Q589Q749Q744
$$ y = [468678, 471693, 475566, 479956, 483955, 486831, 488633, 489894, 491009, 492064, 492905, 493072, 491964, 489396, 485883, 482152, 478623, 475473, 472780, 470257, 467213, 463271, 458918, 454935, 451405, 447727, 443506, 438957, 434372, 429586, 424210, 418224, 412216, 407042, 403253, 400726, 398817, 396880, 394630, 392122, 389566, 387258, 385511, 384492, 384160, 384397, 385145, 386449, 388473, 391356, 394865, 398307, 401061, 403226, 405434, 408086, 411063, 414209, 417653, 421508, 425559, 429381, 432501, 434378, 434613, 433451, 431842, 430757, 430531, 430835, 431027, 430470, 428907, 426761, 424852, 423655, 423081, 422950, 423297, 424025, 424668, 424822, 424581, 424351, 424455, 425099, 426351, 427876, 429044, 429618, 430088, 430901, 431626, 431411, 430196, 429006, 428875, 429777, 430811, 431209, 430964, 430562, 430333, 430203, 429981, 429632, 429259, 428999, 429077, 429742, 430932, 432223, 433364, 434674, 436580, 439024, 441823, 445474, 450913, 458364, 466953, 475702, 484446]
59916D84446R056R361R161Q294O840N091L620K917K846K878K747K512K124J437
59902E53330O35J15o7k66p59j528k501l542m275m288l591k524j310n4R08J191
59886E31474R83J013J682K539K842K473K089K413L430M418M748M481L982L205
59872E71772J927N74M5M02N35m03j853k746k955l079l262l109k583k081j621p06
59856E50857P60K004K043O84j173k108j360L10J295R18Q4k10l43j359l287n129
59840E43986o237o778o899o328n036l549k379j628j234j183j293j209p72k04J24
59825D99381M5k11j30M35P83J40j024j241K0J613K463K967L810M393L788K484
59809E19716J741J553Q14o93j926k311k406k592k362j385k02N65Q70Q01K96m34
$$ y = [484446, 493502, 502863, 512024, 520318, 527158, 532249, 535869, 538786, 541632, 544510, 547257, 549769, 551893, 553330, 553965, 554080, 554013, 553747, 552988, 551460, 548959, 545417, 541142, 536854, 533263, 530739, 529429, 529375, 530283, 531474, 532457, 533470, 535152, 537691, 540533, 543006, 545095, 547508, 550938, 555356, 560104, 564585, 568567, 571772, 573699, 574273, 574318, 574720, 575255, 574852, 572999, 570253, 567298, 564219, 560957, 557848, 555265, 553184, 551563, 550857, 551617, 553621, 555664, 556348, 555175, 553067, 551707, 552017, 553312, 554230, 554314, 554104, 553761, 552402, 549115, 543986, 537749, 530971, 524072, 517744, 512708, 509159, 506780, 505152, 503918, 502735, 501442, 500233, 499461, 499257, 499381, 499426, 499215, 499085, 499520, 500303, 500443, 499419, 498178, 498198, 499811, 502274, 505241, 509051, 513444, 517232, 519716, 521457, 523010, 523824, 523131, 521205, 518894, 516488, 513896, 511534, 510149, 509947, 510512, 511382, 512183, 512479, 512045]
59793E12045r07j042j149j192q38k67j25n48j081j608k443l360l597l066k615
59778D88207k734k953k844k645k519k055j084j60K30K96L99N55Q25J445K241K649
59762D79853K650K913L672M353M680N256O431P464P489O768O317O806Q165R821
59748E62638J0851J0559R232P801O561N010L144J887J695J751J263N73K44j16
59734F23093j057k121k442k082j765j713j700j890k626l620m184m133l738l048
59720E86974k052j260j259j766j939j588j257j123o84K66J115J265R48Q20J123
59705E79583J634K187K865L745M745N739O687P503P926P742P201O997P548Q456
59691F60558Q885Q353O876M657K169L15k18J18Q5q93k181k973l182l115k954k969
$$ y = [512045, 511138, 510096, 508947, 507755, 506917, 506650, 506525, 505977, 504896, 503288, 500845, 497485, 493888, 490822, 488207, 485473, 482520, 479676, 477031, 474512, 472457, 471373, 471213, 471443, 471739, 472138, 472693, 473518, 474963, 477204, 479853, 482503, 485416, 489088, 493441, 498121, 503377, 509808, 517272, 524761, 531529, 537846, 544652, 552817, 562638, 573489, 584048, 593280, 601081, 607642, 612652, 615796, 617683, 619378, 621129, 622392, 622965, 623209, 623093, 622036, 619915, 617473, 615391, 613626, 611913, 610213, 608323, 605697, 602077, 597893, 593760, 590022, 586974, 584922, 583662, 582403, 580637, 578698, 577110, 575853, 574730, 574046, 574312, 575427, 576692, 577640, 578460, 579583, 581217, 583404, 586269, 590014, 594759, 600498, 607185, 614688, 622614, 630356, 637557, 644554, 652102, 660558, 669443, 677796, 684672, 689329, 691498, 691813, 691595, 691713, 691798, 690905, 688724, 685751, 682569, 679454, 676500, 673531]
59675F73531l633m912o020o363o343o632p039o812n829m754l969l058j594M8J122
59660F07743J532J969K933M054M694M992N649O725P404P247O935P164P434O764
59646F83239N086L017O71k216n183p253q302r166j0219j0910j0899j0601j0294
59633F06970r681q693p817p231o554n815n646o042o000n059m267m777o215p343
59619E15830p715p845q181q685r131r208q528p062n269l535j886m59L62O31R77
59604D40296J639K014J629Q82L13j48n83n00M37J590K031J690J166P82M61J50
59588D53849j45n20r26j124j186j559k329l006l331l656m119m166l484k653k302
59573D19343k238k043j920k189k533k434j927j381q87m14n2K88Q80J536J601R80
$$ y = [673531, 669898, 664986, 658966, 652603, 646260, 639628, 632589, 625777, 619948, 615194, 611225, 608167, 606573, 606621, 607743, 609275, 611244, 614177, 618231, 622925, 627917, 633566, 640291, 647695, 654942, 661877, 669041, 676475, 683239, 688325, 691342, 692013, 689797, 684614, 677361, 669059, 659893, 649674, 638764, 627865, 617264, 606970, 597289, 588596, 580779, 573548, 566994, 561179, 555533, 549491, 543491, 538432, 534165, 529388, 523173, 515830, 508115, 500270, 492089, 483404, 474273, 465065, 456537, 449475, 444206, 440671, 438785, 438326, 438688, 439319, 440296, 441935, 443949, 445578, 446460, 446773, 446625, 446042, 445542, 445979, 447569, 449600, 451290, 452456, 453238, 453699, 453849, 453704, 453184, 452258, 451134, 449948, 448389, 446060, 443054, 439723, 436067, 431948, 427782, 424298, 421645, 419343, 417105, 415062, 413142, 410953, 408420, 405986, 404059, 402678, 401791, 401377, 401325, 401613, 402493, 404029, 405630, 406610]
59557D06610M06L25M23O22J464K840L579L127K504K730L407L923M782O511Q363
59542D51616R544J0698J2655J4845J6625J8928K2256K3837J9729R978o52p656
59530F02403j0503j0939r937p621m648k016r2J198J805J850J808J828J368L0j802
59515E64732l554n098o420p221p354p286p590q229q662q445p625o637n885n266
59501D69460m369l267k719l081l537l058j844r34o74m53J31Q30J414J964K376
59486D52239K418K363K773L532L922L841M090N198O656P638P905P668P064O096
59472E23403M748K996R85q08j927k414k609k661k616k706k936k710j531J43J472
59457E10829K393L410M547N386O023O911P853Q143P762P384P103O322N033M085
$$ y = [406610, 407016, 407341, 407764, 408386, 409850, 412690, 416269, 419396, 421900, 424630, 428037, 431960, 436742, 443253, 451616, 461160, 471858, 484513, 499358, 515983, 534911, 557167, 581004, 600733, 610711, 610059, 602403, 591900, 580961, 571024, 563403, 558755, 556739, 556647, 557845, 559650, 561500, 563308, 565136, 566504, 566534, 564732, 561178, 556080, 549660, 542439, 535085, 527799, 520209, 511980, 503318, 494873, 487248, 480611, 474726, 469460, 465091, 461824, 459105, 456024, 452487, 449429, 447585, 446651, 445977, 445524, 445655, 446485, 447899, 449863, 452239, 454657, 457020, 459793, 463325, 467247, 471088, 475178, 480376, 487032, 494670, 502575, 510243, 517307, 523403, 528151, 531147, 532132, 531324, 529397, 526983, 524374, 521713, 519097, 516391, 513455, 510745, 509214, 509357, 510829, 513222, 516632, 521179, 526565, 532588, 539499, 547352, 555495, 563257, 570641, 577744, 584066, 589099, 593184]
59443E93184L658K509n10m903q955j1203j1220r601p666o501o027n467m751m643
59429E17904n245n500m651l299k285j385R4K153M356O730R472J2186J4306J6009
59415E60845J7846J9833K1812K4444K8277L1469K9905K0852O215q658j9128k3631
59403G10081k2802j8061j1318m429K237R560J6601J8892J2062k614j8192k8250
59391F63767l1646l0860k7830k3175j7925j3567j0448p770n202l290k297j815
59379D87942j507j236n29J046K995M371N040N493N626M887L664L158L654M135
59365E28739L972L821M316M956N046M943N502O785P953Q297P955P762Q519J0204
59351F18770J1954J3053J3747J4587J5343J5359J4803J4593J5022J5357J4987
$$ y = [593184, 596842, 599351, 598841, 593938, 584983, 573780, 562560, 552959, 545293, 538792, 532765, 527298, 522547, 517904, 512659, 507159, 502508, 499209, 496924, 495539, 495633, 497786, 502142, 508872, 518344, 530530, 544836, 560845, 578691, 598524, 620336, 644780, 673057, 704526, 734431, 755283, 761498, 752840, 733712, 710081, 687279, 669218, 657900, 653471, 655708, 665268, 681869, 700761, 712823, 710209, 692017, 663767, 632121, 601261, 573431, 550256, 532331, 518764, 508316, 500546, 495344, 492054, 489757, 487942, 486435, 485199, 484670, 485716, 488711, 493082, 498122, 503615, 509241, 514128, 517792, 520950, 524604, 528739, 532711, 536532, 540848, 545804, 550850, 555793, 561295, 568080, 576033, 584330, 592285, 600047, 608566, 618770, 630724, 643777, 657524, 672111, 687454, 702813, 717616, 732209, 747231, 762588, 777575]
59340G77575J4136J3188J2030J0381Q204N539K548k66k418m170o209q548j0414
59327H11576j1376j1803j2087j2113j1770j1272j0708r858q690p483o375n271
59315F92770m262l507k791j993j881l467o385q914r942j0000r910r463q107o209
59301F05939m737m077l773l324k720k326k459l066l686l923l847l726l474k882
59287E57919k190j945k294k848l143k844j766k48P54O24m7q5R99K878N072O980
59271E57816P829P616P608Q830J0440J0868J0193R810R874Q889O137K870N36q80
59257F58436k061l145m075n124o377p378p875q196q483q359p741p102o593n733
59243E70194m421l324k842k430j470j44R29J339R73J43k64M35J685K247J823J157
$$ y = [777575, 791711, 804899, 816929, 827310, 835514, 841053, 843601, 843335, 840917, 836747, 830538, 821990, 811576, 800200, 788397, 776310, 764197, 752427, 741155, 730447, 720589, 711899, 704416, 698041, 692770, 688508, 685001, 682210, 680217, 678336, 674869, 668484, 659570, 649628, 639628, 629718, 620255, 612148, 605939, 601202, 597125, 593352, 590028, 587308, 584982, 582523, 579457, 575771, 571848, 568001, 564275, 560801, 557919, 555729, 553784, 551490, 548642, 545499, 542655, 540889, 540641, 541395, 542019, 541972, 541887, 542886, 545764, 550836, 557816, 565645, 573261, 580869, 589699, 600139, 611007, 621200, 631010, 640884, 649773, 655910, 658780, 659316, 658436, 656375, 653230, 649155, 644031, 637654, 630276, 622401, 614205, 605722, 597363, 589622, 582520, 575927, 570194, 565773, 562449, 559607, 557177, 555707, 555563, 556492, 557831, 558804, 558947, 558683, 559118, 560803, 563050, 564873, 566030]
59227E66030N97k69j497k481l111l952n038n679n720n743n785n247m311l935l969
59212E09890l005p36J166J440R40R60J347J432J483J880J973J172L04N78J851
59197E22675L049L602L568L045K408K429L205L729L345K796K973L544L782L875
59183E68025M294M741M804M907N459N809N188M042L291K842K036J005M49M42N44
59168F17878P30J262J922K285K408K548K601K482K504K692K413J410N11M45O79
59153F44770L36m69j093j520k053k483k540k571k875l011k743k839l942n335o043
59138F05589o412p284q192p925o517n293n006n081m793m105l318k653k202j718
59124E35090o89R51K529L539M286N171O054O923Q345J0399J2096J2722J2987J3752
$$ y = [566030, 566627, 566358, 564861, 562380, 559269, 555317, 550279, 544600, 538880, 533137, 527352, 522105, 517794, 513859, 509890, 506885, 506149, 507315, 508755, 509695, 510655, 512002, 513434, 514917, 516797, 518770, 519942, 520246, 520824, 522675, 525724, 529326, 532894, 535939, 538347, 540776, 543981, 547710, 551055, 553851, 556824, 560368, 564150, 568025, 572319, 577060, 581864, 586771, 592230, 598039, 603227, 607269, 610560, 613402, 615438, 616443, 616892, 617334, 617878, 618608, 619870, 621792, 624077, 626485, 629033, 631634, 634116, 636620, 639312, 641725, 643135, 643646, 644091, 644770, 645106, 644637, 643544, 642024, 639971, 637488, 634948, 632377, 629502, 626491, 623748, 620909, 616967, 611632, 605589, 599177, 591893, 583701, 575776, 569259, 563966, 558960, 553879, 549086, 544981, 541663, 539010, 536808, 535090, 534401, 535352, 537881, 541420, 545706, 550877, 556931, 563854, 572199, 582598, 594694, 607416, 620403, 634155]
59110F34155J4557J4504J3795J3162J2518J1496J0549J0211R804Q391O433N057
59098G64632M149K674N62j236k419l567m809n582n713n502m852l501k044j488
59084G31304j867k364k763l613n035o530p903r312j0450j0753j0422j0246j0367
59071F39679j0226r611q888q184p288o312n625n238m983n035n436n579n086m717
59057E47471n313o223o100m931l960l742l602l088k604k449k320j975j541j013
59043D98610k69M29P05P39R17J091R71R58J549K304K424K124K306L113L933M631
59027E26535N658P026Q188Q971R653J0314J0978J2138J4081J6031J6952J6910
59015F63435J6574J5713J3497R934N858J718k307n355o487o174n809n755n204
$$ y = [634155, 648712, 663216, 677011, 690173, 702691, 714187, 724736, 734947, 744751, 753142, 759575, 764632, 768781, 771455, 772017, 770781, 768362, 764795, 759986, 754404, 748691, 743189, 738337, 734836, 732792, 731304, 729437, 727073, 724310, 720697, 715662, 709132, 701229, 691917, 681467, 670714, 660292, 650046, 639679, 629453, 619842, 610954, 602770, 595482, 589170, 583545, 578307, 573324, 568289, 562853, 557274, 552188, 547471, 542158, 535935, 529835, 524904, 520944, 517202, 513600, 510512, 507908, 505459, 503139, 501164, 499623, 498610, 498341, 498770, 499475, 500214, 501131, 502222, 503193, 504151, 505700, 508004, 510428, 512552, 514858, 517971, 521904, 526535, 532193, 539219, 547407, 556378, 566031, 576345, 587323, 599461, 613542, 629573, 646525, 663435, 680009, 695722, 709219, 719153, 725011, 726729, 724422, 719067, 712580, 706406, 700597, 694842, 689638]
59002F89638l869k450j266J26J840L275M074M391M149L049J386j14j271k385l392
58987F97181m076m846o231p792q642q707q459p823o577n287m455l302r42J728
58973F21770L043L122L510M635N571O192P299Q551Q501P143O352P124Q217Q319
58959G09349P723P092O124M428K429N60j419l684n932q051j0163j1817j2342j2111
58945F72186j2082j2096j1195r645q770q550p422n072l336l445m263m301l821
58932E78188l712l828l669l410l107k074j77J326J370N20j44o01j328k098k364
58917E54892k118j598q54j85j05l08K74J776K927L032L171M450O199P135P426
58902E86114Q284J0015J1629J2137J1441J0114Q852P989P262O326N522N532O396
$$ y = [689638, 685769, 683319, 682053, 682179, 684019, 687294, 691368, 695759, 699908, 702957, 704343, 704229, 702958, 700573, 697181, 693105, 688259, 682028, 674236, 665594, 656887, 648428, 640605, 634028, 628741, 624286, 620984, 620042, 621770, 624813, 627935, 631445, 636080, 641651, 647843, 655142, 663693, 672194, 679337, 685689, 692813, 701030, 709349, 717072, 724164, 730288, 734716, 737145, 737705, 736286, 732602, 726670, 718619, 708456, 696639, 684297, 672186, 660104, 648008, 636813, 627168, 618398, 609848, 602426, 597354, 594018, 590573, 586310, 582009, 578188, 574476, 570648, 566979, 563569, 560462, 558388, 558211, 559537, 560907, 561427, 561283, 560682, 559354, 557256, 554892, 552774, 551176, 550322, 550137, 550032, 549724, 549998, 551774, 554701, 557733, 560904, 565354, 571553, 578688, 586114, 594398, 604413, 616042, 628179, 639620, 649734, 658586, 666575, 673837, 680163, 685685, 691217, 697613]
58889F97613P623R226J1598J4361J6479J7721J8785J9712J9539J7880J5565J3210
58877H79312J0438P090L922J439q75l420n715p398q928j0582j1681j1529j0370
58864H31703q909p671p133p554q389q809q941r530j0359j0467j0029j0335j1538
58851G12039j2176j1538j0749j0681j0502r335p830o937o462n949n774o270o825
58838F01011o873o832p155p522p603p597p324o145m473l809m447m722l571k250
58824E20688k205k761k528j722j375j251l17J338K631L094L115K982K816K986
58810E27491L608M014L605K717J980J426R46P86R34P13k03j106j296j037q45o63
58794E43070l63k97n91o91k60K90N61O91P57P01J051K514M528N679N906O697Q608
$$ y = [697613, 705236, 714462, 726060, 740421, 756900, 774621, 793406, 813118, 832657, 850537, 866102, 879312, 889750, 896840, 900762, 902201, 901326, 897906, 892191, 884793, 875865, 865283, 853602, 842073, 831703, 822794, 815123, 807990, 800436, 792047, 783238, 774297, 764767, 754408, 743941, 733912, 723577, 712039, 699863, 688325, 677576, 666895, 656393, 647058, 639228, 632291, 625829, 619880, 614106, 607836, 601011, 594138, 587306, 580151, 572629, 565026, 557429, 550105, 543960, 539487, 535678, 531231, 526509, 522938, 520688, 518483, 515722, 513194, 511472, 510097, 508846, 508529, 509867, 512498, 515592, 518707, 521689, 524505, 527491, 531099, 535113, 538718, 541435, 543415, 544841, 545787, 546573, 547507, 548220, 548017, 546911, 545615, 544578, 543733, 543070, 542707, 542410, 541819, 541128, 540868, 541158, 541719, 542410, 543167, 543868, 544919, 547433, 551961, 557640, 563546, 570243, 578851]
58777E78851J0249J0568J0293J0201R686Q169O274M465K043j181l846m989n544
58764F35239o555p350p030o377o653p614q176q087p570o413m655l154k317j418
58750E51870j68M11j14l95O14J876K088J721J722J679J122J114K615M466N038
58735E75659M796N284O554P550Q158Q931R498R151Q313P747P036N423L381J725
58721F69206J45j770l071k758j643j023m70J064K915L590L413M087N919P405P366
58706F94375N886L426N38j880l472n138p646j0245j2008j3593j6012j8458j9178
58693E96595j7994j6278j4907j3732j2588j1420r907q144p053o977o854n922m994
58680D59825m743m238k814j775k245k830j710K65J097J017J707L085L654L455
$$ y = [578851, 589100, 599668, 609961, 620162, 629848, 638017, 644291, 648756, 650799, 649618, 645772, 640783, 635239, 628684, 621334, 614304, 607927, 601274, 593660, 585484, 577397, 569827, 563414, 558759, 555605, 553288, 551870, 551702, 552113, 551999, 551604, 552218, 554094, 556182, 557903, 559625, 561304, 562426, 563540, 566155, 570621, 575659, 580455, 585739, 592293, 599843, 608001, 616932, 626430, 635581, 643894, 651641, 658677, 664100, 667481, 669206, 669351, 667581, 664510, 661752, 660109, 659086, 658616, 659680, 662595, 666185, 669598, 673685, 679604, 687009, 694375, 700261, 703687, 704225, 702345, 698873, 693735, 686089, 675844, 663836, 650243, 634231, 615773, 596595, 578601, 562323, 547416, 533684, 521096, 509676, 499769, 491625, 484572, 477595, 470741, 464819, 459825, 455082, 450844, 448030, 446255, 444010, 441180, 439470, 439735, 440832, 441849, 443556, 446641, 450295, 453750]
58666D53750L968N347O379O950Q111R694J0220R207P517N467K698j84j856k250
58652E25018k525l118l523l777m425n195n344n076n058n017m356l594l489l468
58638D67053k661j744j794k107j233N08J686K224K981L530K750J170M46Q37J290
58623D74936J495J746J495L42k39J312L765M654M108M312N623O196N378M439L851
58608E23413K686J052L66P94Q50L7m49m7M07M52M96K60j022k726l271k564j942
58591E18792j696q26P38J956K724L922N415O247O722Q012R779J0543J0300J0395
58577E93023J0935J0777R982R627R365P843N612M802N784O869P395Q379R931J0957
58563G11281J1749J3937J7412K0076K1185K2088K3272K3381K1903K0012J8053
$$ y = [453750, 457718, 463065, 469444, 476394, 484505, 494199, 504419, 513626, 521143, 526610, 529308, 529124, 527268, 525018, 522493, 519375, 515852, 512075, 507650, 502455, 497111, 492035, 486977, 481960, 477604, 474010, 470521, 467053, 464392, 462648, 460854, 458747, 457514, 458022, 459708, 461932, 464913, 468443, 471193, 472363, 472809, 473646, 474936, 476431, 478177, 479672, 480014, 479775, 481087, 484852, 489506, 493614, 497926, 503549, 509745, 515123, 519562, 523413, 526099, 527151, 527517, 528311, 529161, 529198, 528749, 528702, 529109, 529561, 530057, 530317, 529295, 526569, 523298, 520734, 518792, 517096, 516270, 517008, 518964, 521688, 525610, 531025, 537272, 543994, 552006, 561785, 572328, 582628, 593023, 603958, 614735, 624717, 634344, 643709, 651552, 657164, 661966, 667750, 674619, 682014, 690393, 700324, 711281, 723030, 736967, 754379, 774455, 795640, 817728, 841000, 864381, 886284, 906296, 924349]
58552I24349J4852J0310O094L066L93k243m069n349p422j0043j1332j1001j1070
58539H96535j2659j4641j6179j7979k0279k1952k2451k2361k1580j9281j6063
58528F91110j3715j2420j0705q356o724n906m462k276q36l92K72J003L68j144
58514F25817j349k20j29j625k525j920j533k156k282j378j033j703j699o72o10
58499F04983k062k752j460O1M05N78J296J530J057J325K427K553J650K100M403
58484F18094N949N641N882Q115J0302J0972J1945J4529J6652J6414J5248J4857
58472G54600J4078J1446Q045N158J886k413o003p495q189r355r878q732p193o287
58458G29668m772j800J000K299L268N067O784P769R021J0387R558N968K383M81
$$ y = [924349, 939201, 949511, 955605, 958671, 959064, 956821, 952752, 947403, 939981, 929938, 918606, 907605, 896535, 883876, 869235, 853056, 835077, 814798, 792846, 770395, 748034, 726454, 707173, 691110, 677395, 664975, 654270, 645914, 639190, 633284, 628822, 626546, 625710, 625318, 625590, 626593, 626961, 625817, 624468, 624248, 624119, 622494, 619969, 618049, 616516, 614360, 612078, 610700, 609667, 607964, 606265, 605593, 604983, 602921, 600169, 598709, 598770, 599175, 599753, 601049, 602579, 603636, 604961, 607388, 609941, 611591, 613691, 618094, 624043, 629684, 635566, 643681, 653983, 664955, 676900, 691429, 708081, 724495, 739743, 754600, 768678, 780124, 788169, 793327, 795213, 792800, 786797, 779302, 771113, 761758, 751880, 743148, 735955, 729668, 724896, 723096, 724096, 726395, 729663, 734730, 741514, 749283, 758304, 768691, 778249, 784217, 786600, 787081]
58444G87081j704n543q682r015q293q686q966p327n030l904k954p48J426J949
58430G19604J991L227M827N571O499Q545J0083R751R259J0400J1740J1206R513
58417H22216Q133O282K889p64l226n347p944r480q835p755p851p851o545n496
58403G68426n954n974l807j292o33o03Q07K638L174L318M446N495N280N119O081
58388G86521O377M597K677K469K380O94q15j08J296J348J349L196N570O492O801
58373H30844P612P416N307L925N341P233O953O183P454R373R550R183J0349J1855
58359I38578J1960J2161J3914J4879J2819J0009R278R008O772M410M570N528M654
58346A058540L668N201P316P006O004P494J0010J0403R998J1904J4798J5310J4265
$$ y = [787081, 785377, 779834, 771152, 762137, 753844, 745158, 736192, 728865, 723835, 719931, 716977, 716229, 717655, 719604, 721595, 724822, 729649, 735220, 741719, 750264, 760347, 770098, 779357, 789757, 801497, 812703, 822216, 830349, 836631, 839520, 838756, 835530, 830183, 822239, 812759, 803924, 796169, 788318, 780467, 773922, 768426, 762472, 756498, 752691, 751399, 750766, 750163, 750970, 753608, 756782, 760100, 764546, 770041, 775321, 780440, 786521, 792898, 797495, 800172, 802641, 805021, 805715, 804900, 804792, 806088, 807436, 808785, 811981, 817551, 824043, 830844, 838456, 845872, 851179, 855104, 860445, 867678, 874631, 880814, 888268, 897641, 907191, 916374, 926723, 938578, 950538, 962699, 976613, 991492, 1004311, 1014320, 1023598, 1032606, 1039378, 1043788, 1048358, 1053886, 1058540, 1062208, 1067409, 1074725, 1081731, 1087735, 1095229, 1105239, 1115642, 1125640, 1137544, 1152342, 1167652, 1181917]
58333A181917J4800J6519J7039J6990J8029J8446J6230J3779J4019J4695J2302
58322A354765Q634P473P765O405M745N745P554O705N104O818J0447J1673J1103
58309A454936J2476J5230J5977J5437J6866J9400J9777J8898J9984K2135K2305
58298A653421K1493K2464K3656K2067J9600J9800K1102K0261J9323K1728K4838
58287A889753K4218K2180K3831K7783K9185K8930L1105L4327L4639L4105L7256
58276B217312M1843M2546M1159M3361M8055M9859M9580N2035N5968N6508N5293
58265B753519N7705O2399O4173O4652O9161P5558P7551P6699P9493Q4900Q6675
58254C552485Q5689Q7754R1610R1527Q9507R2190R8007J00411J01182J07123J16311
$$ y = [1181917, 1196717, 1213236, 1230275, 1247265, 1265294, 1283740, 1299970, 1313749, 1327768, 1342463, 1354765, 1363399, 1370872, 1378637, 1385042, 1389787, 1395532, 1403086, 1409791, 1414895, 1421713, 1432160, 1443833, 1454936, 1467412, 1482642, 1498619, 1514056, 1530922, 1550322, 1570099, 1588997, 1608981, 1631116, 1653421, 1674914, 1697378, 1721034, 1743101, 1762701, 1782501, 1803603, 1823864, 1843187, 1864915, 1889753, 1913971, 1936151, 1959982, 1987765, 2016950, 2045880, 2076985, 2111312, 2145951, 2180056, 2217312, 2259155, 2301701, 2342860, 2386221, 2434276, 2484135, 2533715, 2585750, 2641718, 2698226, 2753519, 2811224, 2873623, 2937796, 3002448, 3071609, 3147167, 3224718, 3301417, 3380910, 3465810, 3552485, 3638174, 3725928, 3817538, 3909065, 3998572, 4090762, 4188769, 4289180, 4390362, 4497485, 4613796]
58243D613796J21696J25357J34590J46920J54370J59464J70813J85917J95428
58234F008351K01530K14220K32082K45399K55806K73243K95774L12909L26853
58225H366167L49220L78624M03741M26712M60057N02011N39582N74702O21587
58216A2622403O79552P35729P93686Q70381R65616J065121J173013J308541J471717
58207B1685759J647885J845688K092331K392529K735013L138749L644870M263848
58199D3446672M986033N843831O893001Q119138R439017J0829187J2399529J4324134
58191A16280542J6758907J9812734K3476103K7535432L1635840L5355098L7907060
58184C08761716L7669066L2490867K1209330N169210j1975038k6262562l5440124
$$ y = [4613796, 4735492, 4860849, 4995439, 5142359, 5296729, 5456193, 5627006, 5812923, 6008351, 6209881, 6424101, 6656183, 6901582, 7157388, 7430631, 7726405, 8039314, 8366167, 8715387, 9094011, 9497752, 9924464, 10384521, 10886532, 11426114, 12000816, 12622403, 13301955, 14037684, 14831370, 15701751, 16667367, 17732488, 18905501, 20214042, 21685759, 23333644, 25179332, 27271663, 29664192, 32399205, 35537954, 39182824, 43446672, 48432705, 54276536, 61169537, 69288675, 78727692, 89556879, 101956408, 116280542, 133039449, 152852183, 176328286, 203863718, 235499558, 270854656, 308761716, 346430782, 378921649, 400130979, 405300189, 393325151, 367062589, 331622465]
58177C31622465l9405968l9313244l6584366l2474647k7947074k3595279j9680604
58170A12621283j6295196j3470486j1168763r291478p752470o507267n507647
58163D2627976m685130l994353l426210k965667k576949k239328j958208j730375
58155A9051756j532751j353959j204260j085444r80517q81026p96663p30132o68478
58146I818526o06381n53662n12860m72421m28439l91303l64534l37877l07346
58137E843703k82141k65710k48908k27884k10759k00744j89772j74537j62489
58128C880759j56425j48746j36301j26071j21049j14832j05097r8453r7134r4227
58118B682424q6820q1033p9594p7008p1234o7780o8063o5827n9346n5239n5985
$$ y = [331622465, 292216497, 252903253, 216318887, 183844240, 155897166, 132301887, 112621283, 96326087, 82855601, 71686838, 62395360, 54642890, 48135623, 42627976, 37942846, 33948493, 30522283, 27556616, 24979667, 22740339, 20782131, 19051756, 17519005, 16165046, 14960786, 13875342, 12894825, 12013799, 11217136, 10487004, 9818526, 9212145, 8658483, 8145623, 7673202, 7244763, 6853460, 6488926, 6151049, 5843703, 5561562, 5295852, 5046944, 4819060, 4608301, 4407557, 4217785, 4043248, 3880759, 3724334, 3575588, 3439287, 3313216, 3192167, 3077335, 2972238, 2873785, 2776651, 2682424, 2595604, 2514571, 2434977, 2357969, 2286735, 2218955, 2150892, 2085065, 2025719, 1970480, 1914495]
58107A914495n5258n0106m6329m7224m7811m4893m2486m2732m1435l6975l4137
58096A425109l4823l4264l0350k7529k7662k6284k1820j9306k0906k1622j8511
58085A142032j5599j5573j5112j2494j1614j4251j6261j5498j5788j9097k1404
58074I69341k0326j9389k0765k1159j8821j7419j8843j9281j6482j4065j4499
58063G68292j4463j1494q751q909r334p576n991o929q563r152j0212j2235j2492
58050F42191j0248q826r684r813p747o424p345p676o054n433p195q281p185o861
58036E33419q605r037o506m532n376o087m610l956o270q366p380n691o035o688
58022D44280n623m743n835o765n643m539n288n856m477l191l726m059k534j243
$$ y = [1914495, 1859237, 1809131, 1762802, 1715578, 1667767, 1622874, 1580388, 1537656, 1496221, 1459246, 1425109, 1390286, 1356022, 1325672, 1298143, 1270481, 1244197, 1222377, 1203071, 1182165, 1160543, 1142032, 1126433, 1110860, 1095748, 1083254, 1071640, 1057389, 1041128, 1025630, 1009842, 990745, 969341, 949015, 929626, 908861, 887702, 868881, 851462, 832619, 813338, 796856, 782791, 768292, 753829, 742335, 733584, 724675, 715341, 707765, 701774, 694845, 686282, 677130, 666918, 654683, 642191, 631943, 623117, 613433, 603620, 595873, 589449, 582104, 574428, 568374, 562941, 555746, 547465, 540280, 533419, 524814, 515777, 509271, 504739, 499363, 493276, 488666, 484710, 478440, 470074, 462694, 457003, 450968, 444280, 438657, 433914, 428079, 421314, 415671, 411132, 405844, 399988, 395511, 392320, 388594, 384535, 382001, 380758]
58008C80758j915k676k095k118l695m038j709J54p93j953p73P19K19m60O78J672
57992C61975N79m48Q36K473K140J450K324K909J359l3J090K449J000j738k647
57977C75718k322l010m021l581k740l283m099l424k342k429k459r74N25M15K23
57962C42197J535K535J311l18q1N71n06j882j414n93j739l472l299k326k914l934
57946C25671k870p56m05j396j129N62J940L186N574Q081Q712Q155Q526R680J0105
57931C83636J0101J0650J0555Q212M837K560P38k388n891p614p981q861r917r607
57917C79030q540q335q397p211n551n025m764l085r88m16l84J323L857M621L792
57902C39927L591L922K832O51k97P9l76j966k669j847j088j142j060n39k95j58
$$ y = [380758, 378843, 376167, 374072, 371954, 368259, 364221, 362512, 362666, 361873, 359920, 359147, 359866, 360085, 359625, 360303, 361975, 362554, 362106, 362942, 365415, 367555, 369005, 371329, 374238, 375597, 375564, 376654, 379103, 380103, 378365, 375718, 373396, 370386, 366365, 362784, 360044, 356761, 352662, 349238, 346896, 344467, 342008, 341034, 341559, 341974, 342197, 343732, 346267, 347578, 347260, 347179, 347750, 347244, 345362, 343948, 343355, 341616, 338144, 334845, 332519, 329605, 325671, 322801, 322045, 321640, 320244, 319115, 319677, 321617, 324803, 330377, 338458, 347170, 355325, 363851, 373531, 383636, 393737, 404387, 414942, 423154, 427991, 430551, 431289, 428901, 423010, 415396, 407415, 398554, 388637, 379030, 370490, 362155, 353758, 346547, 340996, 335971, 331207, 328122, 327134, 326718, 326334, 327657, 331514, 336135, 339927, 343518, 347440, 350272, 350923, 350626, 350705, 350329, 348363, 345694, 343847, 342759, 341617, 340557, 340018, 339723, 339565]
57886C39565O55J448Q41o88j507j559j970k515k174j564k104l377l946m061m898
57871C12146n829n335l919l225k984j727J25R16Q56J445K476K690K794M480O950
57856C11859P797P111P262Q726R469Q664P709P211O136M279K703J306j158m282
57842C84792o094o308o785q232r277r237r143r367q851p367o184n684m667k681
57828B84915r17j13M63J348K050K308K473K344J390J31m52q26k200m105m807m140
57812B79862l685m039m160l631l340l620l761l629l812m056l525k566k187j923
57798B31928n04J443J903Q11L35J460K773L192L458M185M656M440M316M768N258
57783B74422N562O154O926P152P034P539Q482Q606P775P084O688N550L664K306
$$ y = [339565, 340220, 341668, 342509, 341821, 340314, 338755, 336785, 334270, 332096, 330532, 328428, 325051, 321105, 317044, 312146, 306317, 300982, 297063, 293838, 290854, 289127, 289252, 290168, 291024, 292469, 294945, 297635, 300429, 304909, 311859, 319656, 326767, 334029, 342755, 352224, 360888, 368597, 375808, 381944, 386223, 388926, 390232, 389074, 384792, 378698, 372390, 365605, 357373, 348096, 338859, 329716, 320349, 311498, 304131, 297947, 292263, 287596, 284915, 283998, 283885, 284348, 285696, 287746, 290054, 292527, 294871, 296261, 296392, 295940, 295114, 292914, 288809, 284002, 279862, 276177, 272138, 267978, 264347, 261007, 257387, 253626, 249997, 246185, 242129, 238604, 236038, 233851, 231928, 231424, 232867, 234770, 235581, 235916, 237376, 240149, 243341, 246799, 250984, 255640, 260080, 264396, 269164, 274422, 279984, 286138, 293064, 300216, 307250, 314789, 323271, 331877, 339652, 346736, 353424, 358974, 362638, 364944]
57769C64944J702N53j539l275m016m882o637q299q827q625q496q349p746o702
57755B89806n483m497m399n238n792m976l582l023k905j767J95J334J338J483
57741B52494K140K342J942J932K299J859O70L48J458K664L012L029L075K642J838
57726B83744J564J749J282J62l21Q4J15o97j317j287j348j597j122k3M05jmM76
57708B81864m4j729k699k029j119j033q36K03J064R17N69P11P12L28N25J379J236
57691B80019n59k132j832o76m30r69j187r51n31N27K403M166N260O603Q957J1605
57675C10273J3890J6677K0876K5876L0837L6298M3157N1177N9682O8161P4540
57664G51444P4087O2123L7996N974k6903n3552o9480p4609p2214o5529n6225m6028
$$ y = [364944, 366646, 367199, 365660, 362385, 358369, 353487, 346850, 338551, 329724, 321099, 312603, 304254, 296508, 289806, 284323, 279826, 275427, 270189, 264397, 259421, 255839, 252816, 249911, 248144, 248339, 249673, 251011, 252494, 254634, 256976, 258918, 260850, 263149, 265008, 265678, 266026, 267484, 270148, 273160, 276189, 279264, 281906, 283744, 285308, 287057, 288339, 288501, 288180, 288264, 288379, 287682, 286365, 285078, 283730, 282133, 281011, 280988, 281393, 281392, 281388, 281864, 281820, 280091, 277392, 275363, 274244, 273211, 272375, 272578, 273642, 274559, 275128, 275839, 276551, 276879, 277404, 278783, 280019, 279460, 277328, 275496, 274820, 274390, 273421, 272234, 271283, 270752, 271279, 273682, 277848, 283108, 289711, 298668, 310273, 324163, 340840, 361716, 387592, 418429, 454727, 497884, 549061, 608743, 676904, 751444, 825531, 887654, 925650, 931624, 904721, 851169, 781689, 707080, 634866, 569337, 513112, 467084]
57652D67084l7374l1203k5939k0227j5104j2058j0424q510o116m243l146k368
57640B90372j870j811j763j365j019j028q45j52L19L8l66l88p08j790k613k136
57624B72875j107r35j612k032j712j040l61J01O8k77k16L77P19N23O41J527K223
57607B69762J801O93j85n52l10P94K118K206Q46l24k26J73j48m84rM78O4m14J61
57588B76444J058R18O3j49N25J371K274L407M134L789K984K749K953K865K545
57573C07930K344J891Q88R2J12K01l69p93k20L46m71j889j950n24P17R39Q70J110
57555C11224J421J744K313K832K850K848L622M781N131M371L210K117J137O39
57541C50240R63J680K279L115M508N572N281M141L294K535R30j017j683o88P52
$$ y = [467084, 429710, 398507, 372568, 352341, 337237, 325179, 314755, 306245, 300129, 295886, 292740, 290372, 288502, 286691, 284928, 283563, 282544, 281516, 280671, 280519, 280838, 280876, 280510, 280122, 279414, 277624, 275011, 272875, 271768, 270833, 269221, 267189, 265477, 264437, 264076, 264177, 264245, 263968, 263752, 264129, 264848, 265371, 266012, 267539, 269762, 271563, 272256, 272071, 271519, 271209, 272003, 274121, 276327, 277173, 276849, 276623, 276796, 276648, 276164, 276155, 276633, 276697, 276283, 276444, 277502, 278420, 278483, 278334, 278859, 280230, 282504, 285911, 290045, 293834, 296818, 299567, 302520, 305385, 307930, 310274, 312165, 313053, 313145, 313257, 313458, 313089, 312296, 312076, 312422, 311951, 310062, 308112, 307588, 308305, 309244, 310114, 311224, 312645, 314389, 316702, 319534, 322384, 325232, 328854, 333635, 338766, 343137, 346347, 348464, 349601, 350240, 351203, 352883, 355162, 358277, 362785, 368357, 373638, 377779, 381073, 383608, 384538, 383521, 381838, 381150, 381902]
57526C81902J853K927L946M104L250K415K459L205M194N235N967N944N384N044
57512D37829N106N071M760M571M593M372L749L245L318L791M115L898L150K313
57498D93881J871J779J684J720K352L219L211K207J553K101K942L035K851L176
57484E27582L485L028K551L241M639N304N035M774M737M264L322K591K177J624
57470E78354J093J221J870K269K324K577L054L332L598M414N533O038N652M926
57456F26255M309L925M028M669N213N072M642M624M947N184N430N837N979N671
57442F95785N584O011O036N233M937O237P865Q011P191P167P883P895P228P234
57428G90297P870P741O857O823P939Q612Q135P692P981Q022P231O614O901P247
$$ y = [381902, 383755, 386682, 390628, 394732, 397982, 400397, 402856, 406061, 410255, 415490, 421457, 427401, 432785, 437829, 442935, 448006, 452766, 457337, 461930, 466302, 470051, 473296, 476614, 480405, 484520, 488418, 491568, 493881, 495752, 497531, 499215, 500935, 503287, 506506, 509717, 511924, 513477, 515578, 518520, 521555, 524406, 527582, 531067, 534095, 536646, 539887, 544526, 549830, 554865, 559639, 564376, 568640, 571962, 574553, 576730, 578354, 579447, 580668, 582538, 584807, 587131, 589708, 592762, 596094, 599692, 604106, 609639, 615677, 621329, 626255, 630564, 634489, 638517, 643186, 648399, 653471, 658113, 662737, 667684, 672868, 678298, 684135, 690114, 695785, 701369, 707380, 713416, 718649, 723586, 729823, 737688, 745699, 752890, 760057, 767940, 775835, 783063, 790297, 798167, 805908, 812765, 819588, 827527, 836139, 844274, 851966, 859947, 867969, 875200, 881814, 888715, 895962]
57414H95962O874O439O747P417P805Q099Q674R356R976J0628J1010J0498R297
57401A008782Q345P874P308O810P372Q980J0247J0457J0507J1137J1666J1272
57389A120757J0311R555R268R625J0889J2493J3207J2821J2544J3034J3291J2345
57377A260140J0865J0133J0401J1079J1729J2064J1805J1226J1119J1568J1586
57366A383715J0620R597R777J1163J2628J3150J2531J1491J1234J2376J4090J5011
57354A527383J4903J4651J4760J5002J5364J6072J6611J6173J5240J5245J6359
57343A697763J7162J6867J6302J6216J6237J6128J6539J7657J8588J8886J9264
57332A887609K0013K0264J9685J9392K0033K0503J9851J9036J9353K0213K0118
$$ y = [895962, 902836, 909275, 916022, 923439, 931244, 939343, 948017, 957373, 967349, 977977, 988987, 999485, 1008782, 1017127, 1025001, 1032309, 1039119, 1046491, 1055471, 1065718, 1076175, 1086682, 1097819, 1109485, 1120757, 1131068, 1140623, 1149891, 1159516, 1170405, 1182898, 1196105, 1208926, 1221470, 1234504, 1247795, 1260140, 1271005, 1281138, 1291539, 1302618, 1314347, 1326411, 1338216, 1349442, 1360561, 1372129, 1383715, 1394335, 1403932, 1413709, 1424872, 1437500, 1450650, 1463181, 1474672, 1485906, 1498282, 1512372, 1527383, 1542286, 1556937, 1571697, 1586699, 1602063, 1618135, 1634746, 1650919, 1666159, 1681404, 1697763, 1714925, 1731792, 1748094, 1764310, 1780547, 1796675, 1813214, 1830871, 1849459, 1868345, 1887609, 1907622, 1927886, 1947571, 1966963, 1986996, 2007499, 2027350, 2046386, 2065739, 2085952, 2106070]
57321B106070J8962J7910J7719J8418J9970K1921K3045K2577K1346K0657K0673
57310B329268K0854K1232K2058K2765K2575K1742K1096K0823K0646K0838K1861
57299B565758K3348K4382K4572K4069K2982K1678K1102K1793K2932K3410K3431
57288B819457K4001K5075K5512K4883K4189K4462K5493K6358K6610K6645K7100
57277C099785K8095K8964K8853K7698K6395K5842K6125K6741K7278K7604K7764
57266C401144K7930K8144K8065K7371K6406K5918K6062K6308K6318K6196K5852
57255C695714K5048K4203K4206K5072K5769K5672K5215K4799K4162K3359K3184
57244C966403K3923K4695K4758K4596K4953K5729K6552K7552K8745K9509K9558
$$ y = [2106070, 2125032, 2142942, 2160661, 2179079, 2199049, 2220970, 2244015, 2266592, 2287938, 2308595, 2329268, 2350122, 2371354, 2393412, 2416177, 2438752, 2460494, 2481590, 2502413, 2523059, 2543897, 2565758, 2589106, 2613488, 2638060, 2662129, 2685111, 2706789, 2727891, 2749684, 2772616, 2796026, 2819457, 2843458, 2868533, 2894045, 2918928, 2943117, 2967579, 2993072, 3019430, 3046040, 3072685, 3099785, 3127880, 3156844, 3185697, 3213395, 3239790, 3265632, 3291757, 3318498, 3345776, 3373380, 3401144, 3429074, 3457218, 3485283, 3512654, 3539060, 3564978, 3591040, 3617348, 3643666, 3669862, 3695714, 3720762, 3744965, 3769171, 3794243, 3820012, 3845684, 3870899, 3895698, 3919860, 3943219, 3966403, 3990326, 4015021, 4039779, 4064375, 4089328, 4115057, 4141609, 4169161, 4197906, 4227415, 4256973]
57233D256973K9604L0202L0734L0494K9931K9812K9845K9258K8152K7205K6458
57222D578668K5462K4341K3709K3710K3938K4185K4574K5117K5651K6126K6536
57211D852017K6854K7235K7805K8116K7425K5736K3866K2243K0538J8762J7624
57200E118221J7296J7005J6413J6326J7221J8182J8204J7561J6956J6334J5517
57189E305236J5051J5276J5414J4717J3735J3316J3078J2047J0162Q112O211M460
57177E446815L136K264J192l95j748k288k694l760n005n700o307p526q747q922
57163E400315q421q457r088r281q598p441n947m006k104q81l9J112K377L082L337
57148E345960L593L325J512j799n580r303j3116j6994k0835k5032k9660l3628
$$ y = [4256973, 4286577, 4316779, 4347513, 4378007, 4407938, 4437750, 4467595, 4496853, 4525005, 4552210, 4578668, 4604130, 4628471, 4652180, 4675890, 4699828, 4724013, 4748587, 4773704, 4799355, 4825481, 4852017, 4878871, 4906106, 4933911, 4962027, 4989452, 5015188, 5039054, 5061297, 5081835, 5100597, 5118221, 5135517, 5152522, 5168935, 5185261, 5202482, 5220664, 5238868, 5256429, 5273385, 5289719, 5305236, 5320287, 5335563, 5350977, 5365694, 5379429, 5392745, 5405823, 5417870, 5428032, 5436144, 5442355, 5446815, 5449951, 5452215, 5453407, 5453012, 5451264, 5448976, 5446282, 5442522, 5437517, 5431817, 5425510, 5417984, 5409237, 5400315, 5391894, 5383437, 5374349, 5365068, 5356470, 5349029, 5343082, 5339076, 5336972, 5336091, 5336052, 5337164, 5339541, 5342623, 5345960, 5349553, 5352878, 5354390, 5352591, 5347011, 5337708, 5324592, 5307598, 5286763, 5261731, 5232071, 5198443]
57136E198443l5868l6830l7363l6821l4102l0016k6572k4022k0733j6235j2397
57125D887484j0991j1797j3658j5971j8405k0409k1570k1582j9567j4524o663
57114D712347K700J2658K2921L2704M0988M8262N6628O7857Q2556J01347J25242
57103E306210J54490J88831K29574K80081L43584M22125N18281O36097P79092
57094H858365R48689J145621J371201J625345J904180K200784K506781K811021
57086B3371987L097560L347001L539295L653157L664984L555560L322970K986396
57078E0538910K570240K081166J503258Q19848M2006p82942j587876k309816k904040
57069D9970754l346531l631385l766751l769664l661767l467682l213824k925267
$$ y = [5198443, 5162575, 5125745, 5088382, 5051561, 5017459, 4987443, 4960871, 4936849, 4916116, 4899881, 4887484, 4876493, 4864696, 4851038, 4835067, 4816662, 4796253, 4774683, 4753101, 4733534, 4719010, 4712347, 4715047, 4727705, 4750626, 4783330, 4824318, 4872580, 4929208, 4997065, 5079621, 5180968, 5306210, 5460700, 5649531, 5879105, 6159186, 6502770, 6924895, 7443176, 8079273, 8858365, 9807054, 10952675, 12323876, 13949221, 15853401, 18054185, 20560966, 23371987, 26469547, 29816548, 33355843, 37009000, 40673984, 44229544, 47552514, 50538910, 53109150, 55190316, 56693574, 57513422, 57555428, 56772486, 55184610, 52874794, 49970754, 46624223, 42992838, 39226087, 35456423, 31794656, 28326974, 25113150, 22187883]
57061B2187883k622533k321360k034041j769237j531074j320275j136447r78564
57053H474352q44121p29736o32736n51087m82159m23046l72016l28296k90669
57044C820486k57546k28203k02513j79776j59445j42747j31556j25355j21028
57035B272317j16034j10190j04071r7497r0415q3636p7711p2155o6522o1222n6672
57024A336192n2710m9290m6689m4567m1959l8659l5562l3186l1063k9037k7780
57013I05690k7394k6766k5148k3211k1799k0711j9527j8522j7863j6914j5281
57002F72554j3763j3281j3587j3831j3727j3358j2556j1216r769q594p497o235
56990E35140m967l715k117j67J577L011M935P783J0578J1793J0625P056J488n012
$$ y = [22187883, 19565350, 17243990, 15209949, 13440712, 11909638, 10589363, 9452916, 8474352, 7630231, 6900495, 6267759, 5716672, 5234513, 4811467, 4439451, 4111155, 3820486, 3562940, 3334737, 3132224, 2952448, 2793003, 2650256, 2518700, 2393345, 2272317, 2156283, 2046093, 1942022, 1844525, 1754110, 1670474, 1592763, 1520608, 1454086, 1392864, 1336192, 1283482, 1234192, 1187503, 1142936, 1100977, 1062318, 1026756, 993570, 962507, 933470, 905690, 878296, 851530, 826382, 803171, 781372, 760661, 741134, 722612, 704749, 687835, 672554, 658791, 645510, 631923, 618092, 604365, 591007, 578451, 567235, 557466, 548872, 541375, 535140, 530173, 526458, 524341, 524174, 525751, 528762, 533697, 541480, 552058, 563851, 574476, 581532, 583020, 578008]
56976E78008j0862j5012j7455j8393j7728j5839j3888j2581j1301r166o332l637
56964D25814j467M02K392N003Q458J2122J4893J6584J8062J9529J9508J6210R322
56951E66832j4j0071j8844k4421k6121k5003k2666j9897j6754j3284r654o058
56939C74045k830j45K468N575Q818J1462J3987J7792K2907K7302K8992K7455K2500
56926E60328J3512J010j2302k3454l1222l5442l5707l2274k7170k2712j9417j6538
56914C18612j3963j2104j0564q542o320n026m987n471n765n516m286k064ON81
56900B34591j23n41K27J590K623L243L987N322P274R389J1127J2693J5068J8714
56886C25184K2618K5249K6022K5065K2005J6119P740j371r216j4594j7091j6818
$$ y = [578008, 567146, 552134, 534679, 516286, 498558, 482719, 468831, 456250, 444949, 435783, 429451, 425814, 424347, 424749, 427141, 432144, 440602, 452724, 467617, 484201, 502263, 521792, 541300, 557510, 566832, 566818, 556747, 537903, 513482, 487361, 462358, 439692, 419795, 403041, 389757, 380103, 374045, 371215, 371070, 373538, 379113, 387931, 399393, 413380, 431172, 454079, 481381, 510373, 537828, 560328, 573840, 574850, 562548, 539094, 507872, 472430, 436723, 404449, 377279, 354567, 335150, 318612, 304649, 292545, 281981, 273439, 267119, 262093, 257106, 251635, 245870, 240354, 236068, 234004, 234010, 234591, 234468, 233927, 234154, 235744, 238367, 241610, 245597, 250919, 258193, 267582, 278709, 291402, 306470, 325184, 347802, 373051, 399073, 424138, 446143, 462262, 470002, 468631, 459415, 444821, 427730, 410912]
56874D10912j4473j1178p906m989k194Q30M137P485J0930J5100K0436K6405L2135
56861D87630L7680M3752N0126N5114N6574N2539M1159K2020j708k3858l9291m6900
56849G34837m8407m5652l9891l2448k4432j6220q022m02O510J3568K1620L0612
56837E91673M0201N0386O0863P0820P9955Q8197R3161Q9272P1488M0024Q90l7470
56825A239460o7637q5432r1196q8829q2232p2802o0870m8055l6500k6521j6903
56814E62483p171J994J0332J8434K6719L5277M4443N4164O2754O7269O4967N3851
56802I95516L3004M358k6225n1576o7549p4285p3912o8591o0406n1295m2317l3791
56790D82931k6133j9651j3826p847j733M043R684J5710K1777K7005L1073L3740
$$ y = [410912, 396439, 385261, 377355, 372366, 370172, 371002, 375139, 382624, 393554, 408654, 429090, 455495, 487630, 525310, 569062, 619188, 674302, 730876, 783415, 824574, 846594, 844886, 821028, 781737, 734837, 686430, 640778, 600887, 568439, 544007, 527787, 519765, 519363, 525873, 539441, 561061, 591673, 631874, 682260, 743123, 813943, 893898, 982095, 1075256, 1164528, 1236016, 1276040, 1276930, 1239460, 1171823, 1086391, 995195, 906366, 824134, 751332, 690462, 642407, 605907, 579386, 562483, 555312, 557306, 567638, 586072, 612791, 648068, 692511, 746675, 809429, 876698, 941665, 995516, 1028520, 1032878, 1006653, 955077, 887528, 813243, 739331, 670740, 610334, 559039, 516722, 482931, 456798, 437147, 423321, 415474, 413741, 417784, 427468, 443178, 464955, 491960, 523033, 556773]
56778E56773L3528K8394J7792L264j2720k7430l8128m3408m4313m2915l9957l5149
56766C55731k9248k4082k0495j7834j5530j3701j2080j0004p696o193n673n194
56754A88001m309l612l407l138k490j927j791j934k381l197l680k921j335l22
56740A51557l09m50l82p26j514j662p10K81K91k70m99l29k03j73N1N67J219J653
56722A48392J466Q20O69J592K676K578J452O55P25R99J084J242J289O26l86n63
56706A65316K89J054J108J011J094Q47K08K0N45Q56L58l24n84p58j120j156o02
56689A68162j47l30o76o40m94o13p00l98P9M80R39J414J503J153Q48P89P09P00
56671A72778J223K116K639K697K863K953K004R7j152o07J044K525L391L621L074
$$ y = [556773, 590301, 618695, 636487, 639751, 627031, 599601, 561473, 518065, 473752, 430837, 390880, 355731, 326483, 302401, 281906, 264072, 248542, 234841, 222761, 212757, 205061, 198868, 193195, 188001, 183692, 180080, 176673, 173535, 171045, 169118, 167327, 165393, 163012, 159815, 156135, 153214, 151879, 151557, 151248, 150798, 150416, 149690, 148176, 146514, 145804, 146085, 146376, 146106, 145607, 145278, 145075, 144902, 144953, 145520, 146739, 148392, 149858, 150678, 151347, 152939, 155615, 158193, 159645, 160300, 161025, 162024, 163108, 164350, 165639, 166265, 165879, 165316, 165605, 166659, 167767, 168778, 169872, 170719, 170927, 170947, 171492, 172348, 172706, 172382, 171798, 171040, 169920, 168764, 168162, 168015, 167685, 167009, 166369, 165875, 165262, 164562, 164164, 164243, 164723, 165662, 167076, 168579, 169732, 170580, 171369, 172078, 172778, 174001, 176117, 178756, 181453, 184316, 187269, 189273, 189370, 188218, 187611, 188655, 191180, 194571, 198192, 201266]
56656B01266K151J885K551L149K941K488K452K443J910J235R70Q16J97p17j415
56641B24322j852k251k616k989l599m286m435l865l173k835k627k191j462m29
56627A85712P24J225M36r33j417q23l53o24q77n51j99l20n90p72j179j670j518
56610A76271p34k68l70k72J09k20j353j848j027k23o01j362j379j133j519k003
56594A62068j544m25L34N85P46O64N6n49m50J71P80J340J802J608O32k12k45l6
56576A67325k35l71J84R65J222J114J092J032R40J512K975M300M724N012O068
56561A97859P324P901Q320R509J0832J0751Q866N967K587j012l874m927m449l728
56547B51926l395l081k579k204k106k073k037k108k191k071j667r64j35K04m93
$$ y = [201266, 203417, 205302, 207853, 211002, 213943, 216431, 218883, 221326, 223236, 224471, 225441, 226257, 226454, 225737, 224322, 222470, 220219, 217603, 214614, 211015, 206729, 202294, 198429, 195256, 192421, 189794, 187603, 186141, 185712, 186436, 187661, 188097, 187164, 185747, 184924, 184571, 183947, 183070, 182519, 182320, 182000, 181410, 180638, 179459, 177789, 176271, 175537, 175269, 174899, 174627, 174736, 174516, 173163, 171315, 170288, 170065, 169464, 168102, 166723, 165590, 164071, 162068, 160524, 160099, 160433, 161018, 161764, 162428, 162484, 161935, 161485, 161656, 162436, 163776, 165578, 167186, 167818, 167606, 167361, 167325, 167090, 166719, 166903, 167868, 169090, 170204, 171296, 172328, 173268, 174780, 177755, 182055, 186779, 191791, 197859, 205183, 213084, 221404, 230913, 241745, 252496, 261362, 267329, 269916, 268904, 265030, 260103, 255654, 251926, 248531, 245450, 242871, 240667, 238561, 236488, 234451, 232343, 230152, 228081, 226414, 225450, 225315, 225519, 225026]
56532B25026j689k240k054k107k546k246q36L76L98l0n3k19j131j984j887j440
56516B05338j615k107k188k149k470k570j823r46r41j501j739j609j336n63O24
56501A82405R68j37j276j018j68k58r30q18j13q6p33r27m97k56k74J10Q05J112
56483A77909J003Q38L09q13j496o88P92J307Q22N87R18J143J281J907K595K323
56467A90737J278N66L76O3k09K67J047Q59l18j181j078o20l30j47j95o80j052
56450A89383n63M81J208J568J983K127J453M98J87L28J39k46l15m90j228j600
56434A94913o13O36K56j423k328j774j046q82n95J44O32N18K53L7k17o9P90J378
56416A90610P18j97L59J941K525J687R66J030R43L67K17O39N40k77n65J38O67
$$ y = [225026, 223337, 221097, 219043, 216936, 214390, 212144, 211308, 211684, 212082, 212052, 211999, 211780, 210649, 208665, 206778, 205338, 203723, 201616, 199428, 197279, 194809, 192239, 190416, 189470, 188529, 187028, 185289, 183680, 182344, 181781, 182405, 183373, 183236, 181960, 180942, 180774, 180516, 179586, 178768, 178655, 178569, 177836, 176909, 176412, 176156, 175882, 175992, 176797, 177909, 178912, 179750, 180059, 179246, 177750, 177062, 177854, 179161, 179983, 180570, 181488, 182631, 183912, 185819, 188414, 190737, 192015, 192581, 192957, 193020, 192811, 193078, 194125, 194984, 194666, 193485, 192407, 191787, 191457, 191310, 191115, 190435, 189383, 188820, 189301, 190509, 192077, 194060, 196187, 197640, 198138, 198325, 198653, 198792, 198546, 198231, 197741, 196513, 194913, 194300, 194936, 195192, 193769, 191441, 189667, 188621, 187739, 187144, 187288, 187920, 188438, 188691, 188728, 188511, 188442, 189232, 190610, 191328, 191131, 191490, 193431, 195956, 197643, 198609, 199639, 200582, 200949, 201166, 201805, 202345, 202068, 201503, 201641, 202308]
56399B02308K38l68l00J98O92J185J434J027M21N72J306J532J159J218K033K781
56383B17436K975K829K175P45n36l08J065J914J804J777K048J564J45j007j232
56368B33394j127j011n27L7n8l30L87J616J626L76k00O69J521J346J061J444J729
56351B41953J285Q12Q73Q69L83K6J62K59J04K09N34L22l00k47O53J300J283J459
56333B51939K163K613K488K460K642K306J481J154J491J562J157J081J416J296
56319B77249O22J67r1p74j335o64N33M44p23r66J1M14j47J71K010L502L517L397
56301B87337M306N469O157O916P552O477L506Q71Q7Q6k83k90P03J630J610J452
56285C33586J862K163J938J986K538K660K378L094M859N775N155M746N501N961
$$ y = [202308, 202546, 202178, 201878, 202076, 202768, 203953, 205387, 206414, 206835, 207407, 208713, 210245, 211404, 212622, 214655, 217436, 220411, 223240, 225415, 226160, 225624, 225316, 226381, 228295, 230099, 231876, 233924, 235488, 235633, 234626, 233394, 232267, 231256, 230729, 230766, 230708, 230378, 230765, 232381, 234007, 234383, 234183, 234852, 236373, 237719, 238780, 240224, 241953, 243238, 244050, 244923, 245792, 246175, 246201, 246363, 246622, 246726, 246935, 247469, 247791, 247491, 247244, 247897, 249197, 250480, 251939, 254102, 256715, 259203, 261663, 264305, 266611, 268092, 269246, 270737, 272299, 273456, 274537, 275953, 277249, 277871, 278038, 277947, 277173, 275838, 275174, 275707, 276151, 275428, 274462, 274473, 274887, 274740, 274911, 276921, 280423, 283940, 287337, 291643, 297112, 303269, 310185, 317737, 324214, 327720, 328591, 328678, 328764, 328481, 328191, 328894, 330524, 332134, 333586, 335448, 337611, 339549, 341535, 344073, 346733, 349111, 352205, 357064, 362839, 367994, 372740, 378241, 384202]
56271C84202N245M879N988P223P360P407Q321R118R135R695J1583J3216J3393
56258D96765J3601J5493J8200K0312K2352K5262K8384L1040L4184L8494M2668
56247G86755M5595M8325N2040N5928N8880O1286O3413O4013O2336N9452N5902
56236A413925N0342M2207L3293K4734J5063L412q037j7143k4877l2728l9551m3714
56224A416926m6196m8649n0451n0341m9180m8366m7296m5004m2464m0771l8928
56213I09280l5959l3281l2303l1637k9394k6408k4434k2978k0723j8287j6816
56202F17060j5560j3524j1789j1410j0885q561n781m705m785m320l689l980m150
56189E13921k717q34m62j001o97K9j51m10Q22K633K991K194K035K627K970L397
$$ y = [384202, 389447, 394326, 400314, 407537, 414897, 422304, 430625, 439743, 448878, 458573, 470156, 483372, 496765, 510366, 525859, 544059, 564371, 586723, 611985, 640369, 671409, 705593, 744087, 786755, 832350, 880675, 932715, 988643, 1047523, 1108809, 1172222, 1236235, 1298571, 1358023, 1413925, 1464267, 1506474, 1539767, 1564501, 1579564, 1582976, 1574939, 1557796, 1532919, 1500191, 1460640, 1416926, 1370730, 1322081, 1271630, 1221289, 1172109, 1123743, 1076447, 1031443, 988979, 948208, 909280, 873321, 840040, 807737, 776100, 746706, 720298, 695864, 672886, 652163, 633876, 617060, 601500, 587976, 576187, 564777, 553892, 545331, 539550, 534845, 530060, 525740, 522051, 518071, 513921, 511204, 510370, 509908, 508907, 508210, 508239, 508088, 507678, 508500, 511133, 514124, 516318, 518353, 520980, 523950, 527347]
56173E27347M606N517M890L856M121N002M923M393M702N322N419O253Q983J1790
56159F07124J2335J1535J1767J2889J3333J3550J5043J7325J9094K1140K4852
56148G79987K9347L3192L7521M4217N2586O1046P0494Q2570R6069J08483J19395
56137A514907J28895J34239J31856J21590J06012Q7338O8241N3430M6243M4783
56127B437534M4634M3457L9922L1061J5461k801j7720k7475l3505l6358l7130
56116B457080m0632n1582o8724q7027j03848j18350j27256j26997j19059j08122
56106A505483r5927q1786o7359n5576m5973l6253k7351k1721j8097j3365q367
56095A033708o231o110m405j190L72K10J106L032L565L291M954P698Q118O579
$$ y = [527347, 531953, 537470, 542360, 546216, 550337, 555339, 560262, 564655, 569357, 574679, 580098, 586351, 595334, 607124, 619459, 630994, 642761, 655650, 668983, 682533, 697576, 714901, 733995, 755135, 779987, 809334, 842526, 880047, 924264, 976850, 1037896, 1108390, 1190960, 1287029, 1395512, 1514907, 1643802, 1778041, 1909897, 2031487, 2137499, 2224837, 2293078, 2346508, 2392751, 2437534, 2482168, 2525625, 2565547, 2596608, 2612069, 2609268, 2591548, 2564073, 2530568, 2494210, 2457080, 2416448, 2364866, 2296142, 2209115, 2105267, 1986917, 1859661, 1732664, 1613605, 1505483, 1409556, 1327770, 1260411, 1204835, 1158862, 1122609, 1095258, 1073537, 1055440, 1042075, 1033708, 1027477, 1021367, 1016962, 1015772, 1016144, 1016354, 1017460, 1020492, 1024057, 1027348, 1032302, 1040000, 1048118, 1054697]
56081A054697O646Q562R240Q414Q853J0588J0899R966J0714J3023J3919J3372
56069A178893J4139J6008J6055J4561J4819J7074J8408J8534J9893K2230K2865
56058A373479K2102K2696K4366K4485K3435K3514K3710K1697J9537K0712K3095
56047A622828K2120J9368K0170K3980K5486K4383K5399K9007L0878L0509L1787
56036A905915L4868L6051L5857L8592M3670M6106M5793M7440N1195N2452N1148
56025B389087N1876N4590N4728N2882N4466N9463O2413O2934O5943P1203P3363
56014C052948P2874P5821Q2385Q6698Q8556R3561J01145J04967J05799J11159
56004C975913J21101J27829J30596J37003J47975J55870J59513J66318J77297
$$ y = [1054697, 1061343, 1069905, 1079145, 1087559, 1096412, 1107000, 1117899, 1127865, 1138579, 1151602, 1165521, 1178893, 1193032, 1209040, 1225095, 1239656, 1254475, 1271549, 1289957, 1308491, 1328384, 1350614, 1373479, 1395581, 1418277, 1442643, 1467128, 1490563, 1514077, 1537787, 1559484, 1579021, 1599733, 1622828, 1644948, 1664316, 1684486, 1708466, 1733952, 1758335, 1783734, 1812741, 1843619, 1874128, 1905915, 1940783, 1976834, 2012691, 2051283, 2094953, 2141059, 2186852, 2234292, 2285487, 2337939, 2389087, 2440963, 2495553, 2550281, 2603163, 2657629, 2717092, 2779505, 2842439, 2908382, 2979585, 3052948, 3125822, 3201643, 3284028, 3370726, 3459282, 3552843, 3653988, 3758955, 3864754, 3975913, 4097014, 4224843, 4355439, 4492442, 4640417, 4796287, 4955800, 5122118, 5299415]
55995E299415J85201J90006K00344K16796K30126K39159K53397K74411K92479
55986G381334L05785L24583L51631L77194L98605M25567M60823M95397N28578
55977A1049497N71935O27699O84738P41685Q11297Q96054R84056J075589J187435
55968A8629985J324029J472833J636077J836669K084438K370054K702003L113809
55960C5169897L624751M233965M965012N871412O984526Q305926R866503J1738136
55952I0760128J3974158J6604086J9689287K3274025K7240375L1302253L5100052
55945B57944364L7983601L8506233L4519590K4512667R273806p911249k3000947
55938C71828065l3335257l8409128l9171276l7007118l3204742k8788701k4429136
$$ y = [5299415, 5484616, 5674622, 5874966, 6091762, 6321888, 6561047, 6814444, 7088855, 7381334, 7687119, 8011702, 8363333, 8740527, 9139132, 9564699, 10025522, 10520919, 11049497, 11621432, 12249131, 12933869, 13675554, 14486851, 15382905, 16366961, 17442550, 18629985, 19954014, 21426847, 23062924, 24899593, 26984031, 29354085, 32056088, 35169897, 38794648, 43028613, 47993625, 53865037, 60849563, 69155489, 79021992, 90760128, 104734286, 121338372, 141027659, 164301684, 191542059, 222844312, 257944364, 295927965, 334434198, 368953788, 393466455, 402740261, 394829012, 371828065, 338492808, 300083680, 260912404, 223905286, 190700544, 161911843, 137482707]
55931A37482707k0449159j6971452j4043952j1646563r689982q082904o775955
55924D9822740n725676m866879m147950l554012l072269k668852k318523k023597
55916B1444982j784574j581038j397641j240972j114871j004532q99544q08611
55908A1613199p37477o74520o11235n55939n14457m77033m36370m00134l74018
55899F832016l49855l21494k95878k78005k60750k39478k21478k11238k01051
55890D452789j85527j71276j63216j55067j42300j31193j26165j20959j11003
55881C146083j02265r9200r5975q8067q1029p9328p7638p1640o6806o7951p0204
55870B245980o8504o6352o7161o6439o0598n4508n2527n0646m5160m0544m1019
$$ y = [137482707, 117033548, 100062096, 86018144, 74371581, 64681599, 56598695, 49822740, 44097064, 39230185, 35082235, 31528223, 28455954, 25787102, 23468579, 21444982, 19660408, 18079370, 16681729, 15440757, 14325886, 13321354, 12421810, 11613199, 10875722, 10201202, 9589967, 9034028, 8519571, 8042538, 7606168, 7206034, 6832016, 6482161, 6160667, 5864789, 5586784, 5326034, 5086556, 4865078, 4653840, 4452789, 4267262, 4095986, 3932770, 3777703, 3635403, 3504210, 3378045, 3257086, 3146083, 3043818, 2944618, 2848643, 2760576, 2679547, 2600219, 2522581, 2450941, 2384135, 2316184, 2245980, 2177476, 2111124, 2043963, 1977524, 1916926, 1862418, 1809891, 1759245, 1714085, 1673541, 1632522]
55859A632522m2434m0132l7133l7137l6910l2982k8756k7898k7527k4680k2680
55848A274253k4431k6214k4739k3643k6301k8839k7057k3943k3555k3617k0959
55837A000955j8315j8888j9789j7598j5046j5540j6398j4115j1300j1720j3186
55826H29060j2007r949j0265j1185r770q124r457j1759j1667j0851j2500j4902
55814F96624j4569j2571j1995j2070j0381q014p130o343l617r60j179k664k259
55801F02872o24k3M17K501M721M816M050M532M945L219Q93N04J164P98J90Q42
55785F35817J336k97l196o028r709j4236j6320j4085j0646q951o781j227N552
55772E51229J0023J3066J6619J7713J1835K92j1167j9359k4466k5953k3059j8113
$$ y = [1632522, 1590088, 1549956, 1512823, 1475686, 1438776, 1405794, 1377038, 1349140, 1321613, 1296933, 1274253, 1249822, 1223608, 1198869, 1175226, 1148925, 1120086, 1093029, 1069086, 1045531, 1021914, 1000955, 982640, 963752, 943963, 926365, 911319, 895779, 879381, 865266, 853966, 842246, 829060, 817053, 807104, 796839, 785654, 775884, 767760, 758303, 746544, 734877, 724026, 711526, 696624, 682055, 669484, 657489, 645419, 635038, 627024, 619894, 613551, 609934, 608974, 607795, 605131, 602872, 602248, 602225, 602642, 605143, 609864, 614680, 618730, 623262, 628207, 631426, 632319, 632823, 633987, 634785, 634975, 635817, 637153, 636856, 633660, 627632, 617923, 603687, 587367, 573282, 562636, 553685, 546904, 545677, 551229, 561252, 574318, 590937, 608650, 620485, 620777, 609610, 590251, 565785, 539832, 516773, 498660]
55760D98660j4554j2445r879p342o567o697n789m736n613p555q171p610p430p048
55746C87224n175l178l084l761k963j462j298j653o30M75j011m295o315o622p067
55731C39185p673o873n113m307m429m055l479l879m467l849l033l662m528l400
55717B76438j060J80P16K542N068O017N621N905O488N076J687j328l081m497n313
55702C00459m354k530k132l345m520n427p014q491q004n953m494m119l598k845
55688B33633k758k801j754l74k63p18J76K018K844K746L413M624M595L429K804
55673B51614K537R60j444k275j243o23j442k299k246j972j692o74Q32J606J610
55658B43249J735J641L21j451j816p69J09N50J523K681K745K117K233K634J652
$$ y = [498660, 484106, 471661, 461782, 454440, 447873, 441176, 435387, 430651, 425038, 417483, 409312, 401702, 394272, 387224, 382049, 378871, 375787, 372026, 369063, 367601, 366303, 364650, 364020, 364495, 363484, 359189, 352874, 346252, 339185, 331512, 324639, 319526, 315219, 310790, 306735, 303256, 299377, 294910, 291061, 288028, 284366, 279838, 276438, 275378, 275558, 276274, 278816, 283884, 289901, 295522, 301427, 307915, 312991, 314678, 313350, 310269, 305772, 300459, 296105, 293575, 291443, 288098, 283578, 278151, 271137, 262646, 254642, 248689, 244195, 240076, 236478, 233633, 230875, 228074, 226320, 225946, 225683, 224965, 225141, 227159, 230003, 232749, 236162, 240786, 245381, 248810, 251614, 254151, 255111, 253667, 251392, 250149, 249526, 248084, 245785, 243539, 241567, 239875, 239201, 240033, 241639, 243249, 244984, 246625, 246946, 245495, 243679, 242910, 243019, 243569, 245092, 247773, 250518, 252635, 254868, 257502, 259154]
55643B59154k22p91lj67k132m282n605o776p803p559o270n738o394o607n513m131
55627A89161l194k222j207r54j273r93j62r3r43j359q29l24l86n70q94j839k847
55610A69072k828k146k030k264j619l46J17k50j56M59L52n36j029j044j547k243
55594A51962j825n60j57r14j487j403j421j441o19M80N01m2N83K134K734K331
55578A50856K672L753L682K450K458M431O139O179N862O156N765L770J486J14
55564B05773j071k739l974m135m183m828n296n140n274o121o579o008n311n048
55550A40066m350k824j605j433j431q30j90oK53P64Q15L83N29J368J602Q35M20
55533A34366J048J472P11k68k54M19Q47Q20K86q91j904j397K92J029k15k045l061
$$ y = [259154, 258932, 258141, 258138, 257971, 255839, 251557, 245952, 239176, 231373, 223814, 217544, 211806, 205412, 198805, 193292, 189161, 185967, 183745, 182538, 181584, 180311, 179318, 179156, 179063, 178120, 176761, 175932, 175608, 175222, 174652, 173758, 171919, 169072, 166244, 164098, 162068, 159804, 158185, 157839, 157956, 157706, 157550, 158009, 158361, 157825, 156796, 155752, 154205, 151962, 150137, 149577, 149420, 148506, 147019, 145616, 144195, 142754, 142135, 142615, 143116, 143074, 143657, 145791, 148525, 150856, 153528, 157281, 160963, 163413, 165871, 170302, 176441, 182620, 188482, 194638, 200403, 204173, 205659, 205773, 204702, 201963, 197989, 193854, 189671, 184843, 179547, 174407, 169133, 163012, 156433, 150425, 145114, 140066, 135716, 132892, 131287, 129854, 128423, 127593, 127403, 127397, 127650, 128414, 129229, 129612, 130141, 131509, 133111, 133946, 134366, 135414, 136886, 137597, 137329, 137075, 137494, 138341, 139161, 139447, 138556, 136652, 135255, 135547, 136576, 136361, 134316, 131255]
55516A31255l759m977o177o500o088n428m532l529k742j783M1K053K645J740R72
55501I3191J055R97M05K89Q80R19M4l20M74J078N93N7K99M01k97p40j74K76l68
55482I9059j077o16M27R17R88J097P71k22p91j02J004J459J496J563J118j37j181
55465A05773j222j001j274j320l96O36N78k23o59n95n81p00q07j058j314j004
55449I4833k78r7n24l50P94J521Q85m4j0N25N71L04K82K24j62k81K58P62O71M99
55429A00383O15M34k87p05m43l86r94j338q37k35J36J221L054L748K305N33M11
55412A07615J146Q93k18q70j065j610k165j920j391j549j863j141L42J307J435
55397I8946J248O46p27k202k739k399j826q85P63K337K629J628K75q19j369r61
$$ y = [131255, 127496, 122519, 116342, 109842, 103754, 98326, 93794, 90265, 87523, 85740, 85781, 87834, 90479, 92219, 93191, 94246, 95243, 95648, 95937, 96817, 97736, 97780, 97460, 97934, 99012, 99605, 99662, 99961, 100362, 100065, 99325, 99151, 99427, 99059, 97982, 97366, 97793, 98710, 99698, 100795, 101566, 101344, 100553, 100451, 101455, 102914, 104410, 105973, 107091, 106954, 105773, 104551, 103550, 102276, 100956, 100560, 101196, 101774, 101551, 100892, 100297, 99716, 99016, 98209, 97151, 95837, 94833, 94555, 94458, 93934, 93584, 94378, 95899, 96784, 96740, 96730, 97255, 97826, 98130, 98412, 98636, 98474, 98193, 98451, 99213, 99884, 100383, 100998, 101432, 101145, 100440, 99997, 99611, 98617, 97279, 96442, 96207, 96343, 97564, 100618, 104366, 106671, 107204, 107615, 108761, 109654, 109436, 108566, 107501, 105891, 103726, 101806, 100415, 98866, 97003, 95862, 96204, 97511, 98946, 100194, 100840, 100113, 97911, 95172, 92773, 90947, 90062, 90825, 93162, 95791, 97419, 97694, 96875, 95506, 94545]
55381I4545K26J006O51m8k15k90q21j098m80P0n77j718j921j242o62k00N87J030
55363H8843J91j219j595p74N1L74P63J393J765J761J668J385O64j23m74n56n95
55346I3522k15O22Q68j72j507j838j392j076p77pO67N09J36M87J002N95k32j58
55328I1034N87N57n03j343j239o60l4O17R55O09R6J87O19O16K88K53L28j3l62
55309I2592l6M82K21n73q67n66l29j26M85J055Q20J75N2K97K25J63O71Q63l82
55290I5222k060k127p84k73j260j856p59Q06J203N43j57n26n53n4P74J200R70
55273I0309O10L89p1q28j284j128p44m48j64J9j00k49n9P4m08r56n31N90J051
55254H6072N30J43N03P93L29k98k72K31N10L40j3j88Q3O73R01K97o18r11m67J40
$$ y = [94545, 94771, 95777, 96428, 96380, 96165, 95875, 95054, 93956, 93476, 93546, 92969, 91251, 89330, 88088, 87426, 87226, 87813, 88843, 89034, 87815, 86220, 85446, 85497, 85871, 86634, 88027, 89792, 91553, 93221, 94606, 95270, 95147, 94673, 94117, 93522, 93307, 93929, 94797, 94625, 93118, 91280, 89888, 88812, 88035, 88028, 88695, 89204, 89340, 89827, 90829, 91424, 91192, 91034, 91621, 92178, 91675, 90332, 89093, 88433, 88399, 89016, 89971, 90580, 90676, 90863, 91482, 92098, 92386, 92639, 92967, 92954, 92592, 92556, 93038, 93259, 92686, 91819, 91253, 90924, 90798, 91283, 92338, 93158, 93333, 93385, 93682, 93907, 94070, 94741, 95604, 95222, 93162, 91035, 90251, 89978, 88718, 86862, 86103, 86909, 88112, 88655, 88498, 87972, 87419, 87365, 88139, 89339, 90309, 90919, 91308, 91237, 90409, 89125, 87997, 87253, 86805, 86641, 86660, 86560, 86311, 86252, 86326, 85918, 84962, 84431, 85021, 86072, 86602, 86745, 87248, 88041, 88370, 88072, 87800, 88031, 88541, 88881, 88868, 88680, 88763, 89436, 90337, 90634, 90016, 89105, 88638, 88778]
55234H8778O24R84R22K83k46J3N46M24j07j36J63q6o35l58O59R88J22q12r36p08
55214I0482n80j87M93N42m43j367j056J38Q95N05o59j659j644m69J021J800J783
55197H9595J620J537J151L69m20r79j227q07L76J381J136M6n04j52J47j32m67
55180I2670n81r56j572j524m29P62J033N32rk74k97r9K09M29O58J130J638J691
55162I5011J280Q97P98Q51R07P09j88j663k535j890m96J29k33n58l17J40O14J090
55144I4546J011L0p96j37J374J789O46n57q06o16l95K49J097J098K19k28K09L19
55126I9052n08j054l69N20L33m06m66J11N11P67J432K182K103J093L9k68J52O26
55108A05850L84o47j397p50Q12J598R37pj39J24q0n75o74l63r0O0K08J96j19m91
$$ y = [88778, 89402, 90386, 91308, 91591, 91345, 91358, 91904, 92328, 92221, 92085, 92248, 92162, 91527, 91169, 91828, 92816, 92938, 92126, 91190, 90482, 89902, 89715, 90208, 90750, 90307, 88940, 87884, 88022, 88917, 89422, 88763, 87104, 85460, 84991, 86012, 87812, 89595, 91215, 92752, 93903, 94272, 93852, 92873, 91646, 90839, 91215, 92596, 93732, 93778, 93274, 93122, 93269, 93137, 92670, 92089, 91133, 89561, 88037, 87608, 88370, 89403, 89935, 89926, 89652, 89355, 89256, 89465, 89894, 90552, 91682, 93320, 95011, 96291, 97188, 97986, 98837, 99744, 100453, 100265, 98602, 96067, 94177, 93681, 93810, 93577, 93019, 92702, 92842, 93456, 94546, 95557, 95587, 94791, 94654, 96028, 97817, 98463, 97906, 97100, 96484, 96089, 96338, 97435, 98533, 98752, 98524, 98733, 99052, 98544, 97490, 97121, 97641, 97974, 97568, 97102, 97213, 97724, 98491, 99923, 102105, 104208, 105301, 105340, 105072, 105224, 105850, 106234, 105587, 104190, 103440, 104252, 105850, 106787, 106780, 106641, 106765, 106685, 106110, 105436, 105073, 104983, 105043, 105251, 105447, 105328, 104837]
55088A04837o55n83j80P04J700K047J560P60p8j106k024k023j058j19Q2j23l17
55071A03424o00q65n80J17K17o54j461j195j74O94J092J072N84j13l54J0L08K07
55053A01729K35O31O66j44j033j042m17j17m57r19r23k98O16J042N03m20o52n3
55035I8947N58P66Q79Q90M04k17n1O53N09p31j500q15J68O9o15n43L77J206J398
55016A02352J002J70o62q02k93j6k55j96L96M25o64j621j232k47q2o17p64l84
54998I6510j11N6N31J003R00N66P54J308J492J250J027Q26M60K71N75Q16L99k28
54980A08405l23j84n01r56p40l3L00K37M82J029J114N88J80K75M21K81J54L80
54962A11109Q01J041Q75M18J67N68J238J184J76p85q84n86o33p91n11r2r0k20
$$ y = [104837, 104182, 103599, 103419, 104123, 105823, 107870, 109430, 110190, 110112, 109006, 106982, 104959, 103901, 103782, 103864, 103741, 103424, 102824, 101959, 101379, 101496, 101713, 101059, 99598, 98403, 98229, 98923, 100015, 101087, 101671, 101558, 101204, 101214, 101522, 101729, 101964, 102595, 103261, 103117, 102084, 101042, 100625, 100508, 100051, 99132, 98209, 97911, 98527, 99569, 100072, 99652, 99000, 98947, 99505, 100271, 101150, 102040, 102444, 102227, 102176, 102829, 103338, 102607, 101107, 100292, 100460, 100529, 99914, 99371, 99748, 100954, 102352, 103354, 103524, 102862, 102060, 101767, 101751, 101496, 101300, 101696, 102121, 101457, 99836, 98604, 98357, 98275, 97658, 96894, 96510, 96399, 96455, 96986, 97989, 98889, 99455, 100209, 101517, 103009, 104259, 105286, 106112, 106572, 106843, 107418, 108234, 108633, 108405, 108082, 107898, 107397, 106441, 105701, 105668, 105968, 106205, 106687, 107716, 108830, 109418, 109598, 109873, 110294, 110575, 110729, 111109, 111910, 112951, 113826, 114244, 114411, 114979, 116217, 117401, 117577, 116792, 115908, 115322, 114689, 113898, 113387, 113295, 113205, 112985]
54944A12985N5M26K35l01m91l16j80K5N29P63Q6r01r80m3Q71J143J079R98R11
54925A16894J069J818K853L502L726M051M649N228N751O446P162P499P391O904
54911A84943N705L500P56j737l762n440o546o891o942p116o936n782m116k822
54897A36814j817n39N63L79r97k166k302j919j646j351q14k95rJ90L71M40O12
54880A25514J282K314L131L560L929M405M877N474O400P270P380O660N676M676
54866A92548L335J389j036l625n812o791o402n711n836o420o206m897l434k458
54852A38644j764j282j490k470l527m056m056l578k550j342n90l05R2N66K82r14
54836A11660j809j304Q8R04N40l18q03p78o07m28k9O29J026O27l00q55o28j20
$$ y = [112985, 113040, 113466, 113701, 113400, 112909, 112593, 112413, 112438, 112967, 113730, 113816, 112915, 111935, 111892, 112763, 113906, 114985, 115983, 116894, 117963, 119781, 122634, 126136, 129862, 133913, 138562, 143790, 149541, 155987, 163149, 170648, 178039, 184943, 190648, 194148, 194904, 193167, 189405, 183965, 177419, 170528, 163586, 156470, 149534, 143752, 139636, 136814, 134997, 134458, 135021, 135400, 134403, 132237, 129935, 128016, 126370, 125019, 124205, 123910, 123901, 124091, 124462, 124902, 125514, 126796, 129110, 132241, 135801, 139730, 144135, 149012, 154486, 160886, 168156, 175536, 182196, 187872, 192548, 195883, 197272, 196236, 192611, 186799, 180008, 173606, 167895, 162059, 155639, 149433, 144536, 141102, 138644, 136880, 135598, 134108, 131638, 128111, 124055, 119999, 116421, 113871, 112529, 111939, 111634, 111726, 112292, 112574, 111660, 109851, 108547, 108635, 109539, 110079, 109761, 108958, 108180, 107573, 107145, 107116, 107745, 108771, 109398, 109098, 108243, 107615, 107495]
54818A07495J69M04P48P29P8m38Q6J265J836J346N62K71M36O02N16K21LJ36M52
54799A16917L66k54o98l89K91O89P90P83L23p45j528j040K72R94N91k32p60q65
54781A15505n35J90Q06Q11N77R08J825K627L022L329L622L639L448L436L681M012
54765A50903M548N410O173O422O505O892P167O592N332L973K310j72k919m731
54751B04405n484o104o973p568p633p406o776n503m223l855m040l545k249j307
54737A31739j236j332j142j024j008n92K0n5p27p40M14J841K875L853M775M827
54721A42488M000L696M790O352P159P227P035O455N306L855J965j047m811p487
54707A86983p939p181o630o169n136m002l617l665l314k743k618k680k267j681
$$ y = [107495, 107664, 108068, 108816, 109545, 109623, 109185, 109271, 110536, 112372, 113718, 114280, 114551, 114987, 115589, 116105, 116326, 116329, 116465, 116917, 117283, 117029, 116331, 115942, 116233, 116922, 117712, 118495, 118818, 118073, 116545, 115505, 115777, 116771, 117362, 117130, 116370, 115505, 114970, 115160, 115966, 116777, 117354, 118262, 120087, 122714, 125736, 129065, 132687, 136326, 139774, 143210, 146891, 150903, 155451, 160861, 167034, 173456, 179961, 186853, 194020, 200612, 205944, 209917, 212227, 212055, 209136, 204405, 198921, 192817, 185844, 178276, 170643, 163237, 156461, 150958, 146735, 142880, 138840, 135295, 133046, 131739, 130503, 129171, 128029, 127005, 125997, 125405, 125425, 125370, 124643, 123903, 124317, 126158, 129033, 132886, 137661, 142488, 146488, 150184, 154974, 161326, 168485, 175712, 182747, 189202, 194508, 198363, 200328, 199281, 194470, 186983, 179044, 171863, 165233, 159064, 153928, 149926, 146309, 142644, 139330, 136587, 133969, 131289, 129022, 127341]
54693A27341j685j972j573n65j4k42m58k09n7m97j113j268r88p53q05r08o58O5
54675A13641Q27J024O44L49N15O31K2j152k041k065j281j08R39J387J131N83K25
54658A15271R7j16o02j152j296p55Q7M14ol54J47J053J385J142J074J159O10m53
54640A17705q07o4N41R6n08n3J047J439Q30R6j88k44l30l82l82m01l25m5K49L50
54620A18624L79M77M95L34K29K79J71k35m47k2O82R70P23L59J19p4k57l64m24
54601A22018n17o08o17m82j07M51P80N06q0l00RL92N66O77O72K94k76m82l01k36
54581A22359k38L24J413K017J603Q32L81L7m61p09m50j39l2M08J377J970J441
54564A32133L83j91k13j21J40O42P81Q8p50p62j02L83M98O15P49O29M13L79L32
$$ y = [127341, 125656, 123684, 122111, 121546, 121532, 121290, 120832, 120623, 120566, 120069, 118956, 117688, 116700, 115947, 115142, 114234, 113576, 113641, 114468, 115492, 116136, 116485, 117000, 117631, 117653, 116501, 114460, 112395, 111114, 111006, 111945, 113332, 114463, 115046, 115271, 115368, 115252, 114650, 113498, 112202, 111447, 111534, 111948, 111942, 111588, 111735, 112788, 114173, 115315, 116389, 117548, 118158, 117705, 116898, 116834, 117375, 117471, 116963, 116910, 117957, 119396, 120226, 120322, 120134, 119890, 119560, 119178, 118796, 118395, 118070, 118025, 118274, 118624, 119003, 119480, 119975, 120309, 120538, 120817, 120988, 120753, 120306, 120284, 120966, 121936, 122659, 123018, 123137, 123063, 122806, 122442, 122018, 121501, 120893, 120276, 119794, 119687, 120138, 120918, 121424, 121344, 121044, 121053, 121445, 122011, 122688, 123360, 123654, 123378, 122896, 122595, 122359, 122121, 122445, 123858, 125875, 127478, 128310, 128691, 128728, 128267, 127558, 127108, 126969, 126937, 127345, 128722, 130692, 132133, 132516, 132325, 132112, 131991, 132131, 132773, 133554, 133642, 132892, 132130, 132028, 132411, 132909, 133524, 134273, 134902, 135315, 135694, 136026]
54545A36026J12K06R40J586J318N97M82R31R98N02K11L96L86k54j030j293r64
54528A41150l27K33K54m20j206j303o75J3L04L04J99Jk84o36j074j395j239p59
54510A33140p35j372j576l51J512K189J146k63o07J33J028J352R74K32k83j68
54494A36351L59P18O82N51O62R53J092Q12K23j00L66J443K364K660K454J866Q09
54477A54265l33o35K10J325J753J574J376J302J240J321J516J369Q12N68J009
54462A68672J268M70q42j479j309j114j205j210j000q12o95o56j025j854k362
54447A54847j897j006o08n41q6N31M86p3j62L77O16J03n19o90o53p06o45k48L13
54428A49439Q02J115J161J036J145J603J765J075Rn76o26o52p00o01p24j321j619
$$ y = [136026, 136138, 136344, 137284, 138870, 140188, 140785, 141267, 142198, 143196, 143698, 143909, 144305, 144691, 144437, 143407, 142114, 141150, 140823, 141056, 141310, 140890, 139684, 138381, 137706, 137719, 138023, 138327, 138526, 138527, 138243, 137607, 136533, 135138, 133899, 133140, 132405, 131033, 129457, 129106, 130618, 132807, 133953, 133690, 133083, 133216, 134244, 135596, 136570, 136802, 136519, 136351, 136710, 137428, 138110, 138661, 139323, 140276, 141368, 142180, 142403, 142303, 142669, 144112, 146476, 149136, 151590, 153456, 154265, 153932, 153297, 153507, 154832, 156585, 158159, 159535, 160837, 162077, 163398, 164914, 166283, 167095, 167663, 168672, 169940, 170410, 169568, 168089, 166780, 165666, 164461, 163251, 162251, 161439, 160744, 160088, 159063, 157209, 154847, 152950, 151944, 151336, 150795, 150709, 151240, 151726, 151653, 151491, 151868, 152484, 152587, 152068, 151378, 150725, 150019, 149374, 149126, 149439, 150241, 151356, 152517, 153553, 154698, 156301, 158066, 159141, 159150, 158574, 157948, 157296, 156596, 155995, 155271, 153950, 152331]
54411A52331q19L59N47j09j97O15J221J103J038J409J481R57P67J453K092J690
54395A65938O27j33l75m15l18q1K3j01j51r0l57j036j479j264p61m66l70m05o72
54376A58114r01m18P92J751J733J206J019J255J370J006K37n41p68k21N19O64
54360A66817K52j2P8K06N10J400K345K206J101M68Q31R55J5r77r80p82j602k974
54342A69857l571l374l383l675l343k220j212q28o02j18L70N36L84q7q08j298
54326A46628j056l92q7j99l9N56Q44L83j57M7P50J044O69K83M24P37N30k29q90
54307A49846j006q34p54o41k85p8o02j533j706n85R35J568J039O6o17p87n91k92
54289A43143j19l9J95O16R04P81L11l21r50j240q23P3O08L61m8K15J025J519J266
$$ y = [152331, 151512, 151871, 152418, 152309, 152112, 152727, 153948, 155051, 156089, 157498, 158979, 159936, 160703, 162156, 164248, 165938, 166565, 166432, 166057, 165642, 165324, 165243, 165266, 165165, 165014, 164924, 164567, 163531, 162052, 160788, 160027, 159561, 159191, 158786, 158114, 157213, 156795, 157587, 159338, 161071, 162277, 163296, 164551, 165921, 166927, 167164, 166623, 165855, 165634, 166153, 166817, 167069, 167057, 167135, 167341, 167851, 169251, 171596, 173802, 174903, 175371, 176202, 177157, 177172, 176195, 175215, 174433, 172831, 169857, 166286, 162912, 159529, 155854, 152511, 150291, 149079, 148251, 147649, 147531, 147901, 148437, 148821, 148734, 147926, 146628, 145572, 145180, 145093, 144894, 144855, 145411, 146255, 146638, 146481, 146528, 147278, 148322, 148991, 149274, 149698, 150435, 150965, 150736, 149846, 148840, 148006, 147252, 146611, 146326, 146248, 145646, 144113, 142407, 141822, 142757, 144325, 145364, 145430, 144813, 144026, 143435, 143143, 143024, 142985, 143180, 143796, 144700, 145481, 145792, 145471, 144521, 143281, 142458, 142531, 143139, 143500, 143452, 143667, 144692, 146211, 147477]
54270A47477O79K16j71o40q70l44Q22J704J529P04M45J254K228K246J371N01J9
54253A59170l75o76m06L73P61J42r59j547j203k20P58R78L8j554k719k961k722
54236A46878k399j796q40j51k23o58p85n99m04m0P78J653J822J242O46N59P95
54219A46478R68R75Q20L93l55j241j973k349k301j837j012J0Q24R64L99k47l06
54202A40210J18L40O6l30m74m14k70j7J73p8o94j011o19M1K84M6k75m27m09k46
54182A36014j8J15K11N78J271J813J709J030K68j92k64r1O1J4r5j11k60q02j371
54163A39880j311p74o70j257j591q72L56J011Q65M56J14k32m98m80k91k22k48
54146A34236j21J44K67J22j92m98n40m7Q38J455J313O90K46L18Q42J606K205K108
$$ y = [147477, 148156, 148372, 148201, 147561, 146691, 146347, 147169, 148873, 150402, 151106, 151551, 152805, 155033, 157279, 158650, 159151, 159170, 158795, 158119, 157713, 158086, 158847, 158989, 158030, 156483, 155280, 155060, 155818, 156796, 156834, 155280, 152561, 149600, 146878, 144479, 142683, 141843, 141692, 141469, 140811, 140026, 139427, 139023, 138983, 139761, 141414, 143236, 144478, 145124, 145683, 146478, 147446, 148421, 149241, 149634, 149279, 148038, 146065, 143716, 141415, 139578, 138566, 138576, 139400, 140364, 140763, 140516, 140210, 140328, 140668, 140734, 140404, 139930, 139516, 139246, 139229, 139402, 139324, 138630, 137619, 137000, 137041, 137325, 137371, 137096, 136669, 136260, 136014, 135996, 136111, 136322, 136900, 138171, 139984, 141693, 142723, 142991, 142799, 142535, 142444, 142505, 142519, 142424, 142313, 142053, 141251, 139880, 138569, 137795, 137125, 135868, 134277, 133405, 133761, 134772, 135637, 136093, 136207, 135975, 135477, 134997, 134706, 134484, 134236, 134115, 134259, 134526, 134648, 134456, 133958, 133418, 133371, 134209, 135664, 136977, 137667, 137913, 138231, 139073, 140679, 142884, 144992]
54128A44992J237L04L7K92L75Q6j39l9O0j69m43k22M94J004P18k0k59K81P37L21
54108A49647m57m74K82P26L78O1N00J205J346R97P42N53m0r69j540j320n65J85
54090A51257O25Q20J082J574K000J951J607J674K453L468M231M816N405N777N581
54075A94321M661K876K22k574m275m442l945l702l580l048k277j845j823j867
54061A68702j808j649j323j026j204j699j595n32N08N97L21P82J728J919J120
54046A64841L74L46O20Q41J450K768M114M490L621K094P60K35O81J687K564K832
54030A94318K473J849J508J798K475K916K909K828K827K441J432L91j45o41j846
54015B17533l459m404m256l656l369l554l959m195l912l174k549k424k407j951
$$ y = [144992, 146229, 146533, 146570, 146862, 147237, 147323, 147184, 147145, 147205, 147036, 146593, 146371, 146865, 147869, 148587, 148567, 148308, 148589, 149326, 149647, 149190, 148716, 148998, 149724, 150102, 150163, 150663, 151868, 153214, 154211, 154953, 155506, 155466, 154497, 152957, 151637, 151072, 151257, 151882, 152702, 153784, 155358, 157358, 159309, 160916, 162590, 165043, 168511, 172742, 177558, 182963, 188740, 194321, 198982, 201858, 202080, 199506, 195231, 190789, 186844, 183142, 179562, 176514, 174237, 172392, 170569, 168702, 166894, 165245, 163922, 162896, 161692, 159993, 158398, 157866, 158374, 158971, 159292, 160074, 161802, 163721, 164841, 165215, 165561, 166181, 167022, 168472, 171240, 175354, 179844, 183465, 185559, 186319, 186554, 187235, 188922, 191486, 194318, 196791, 198640, 200148, 201946, 204421, 207337, 210246, 213074, 215901, 218342, 219774, 220165, 220020, 219379, 217533, 214074, 209670, 205414, 201758, 198389, 194835, 190876, 186681, 182769, 179595, 177046, 174622, 172215, 170264]
54001A70264j210p02m76k45j13l97r36j285j386j356r56q3N44J35q69j301r22
53984A58706n56n64l62L28Q00N20j9p0L30O52O45M33K17J69L18L69J01j27K19
53965A62109Q95J089O87M92Q77J128O28j7J86J195K070K249K060K000K143K326
53949A82117K481K665K939L338L909M709N796P106Q420R539J0558J1834J3580
53936B68991J5425J6249J4604R867L167l132p272r239r948r859q951p526o206
53923B66170n200m252l297k611k298k179k126k058j624n53P34J403J199O06J1
53908B43925o37j243j386r95o43q53j486k110k562k930l216l369l391l261k939
53893B12904k531k275k272k463k776l098l087k487j578r47q25r31j017j120j208
$$ y = [170264, 169054, 168352, 167876, 167631, 167518, 167121, 166185, 164900, 163514, 162158, 161202, 161119, 161663, 161798, 160929, 159628, 158706, 158150, 157586, 157224, 157552, 158352, 158872, 158853, 158783, 159113, 159765, 160410, 160843, 161060, 161229, 161547, 161916, 162017, 161890, 162109, 163004, 164093, 164780, 165272, 166149, 167277, 167905, 167888, 168074, 169269, 171339, 173588, 175648, 177648, 179791, 182117, 184598, 187263, 190202, 193540, 197449, 202158, 207954, 215060, 223480, 233019, 243577, 255411, 268991, 284416, 300665, 315269, 325136, 328303, 325171, 317899, 308660, 298712, 288853, 279902, 272376, 266170, 260970, 256718, 253421, 250810, 248512, 246333, 244207, 242149, 240525, 239972, 240706, 242109, 243308, 243914, 243925, 243288, 242045, 240659, 239664, 239021, 238168, 236682, 234572, 232010, 229080, 225864, 222495, 219104, 215843, 212904, 210373, 208098, 205826, 203363, 200587, 197489, 194402, 191915, 190337, 189390, 188565, 187634, 186617, 185497, 184289]
53878A84289j076p61o67j037j479j388o90m5j86j102j948k018j571j390j528j214
53862A66189j47P95P25Nl54j07J65J77J88L09L15J93K28M37N02L07M9j86m66p00
53842A68624p27o29n32k46L83R39Q73L25j13k58l25j86M79J374J694J176L84j23
53824A73112k67o2N49J258J475J077O23N79Q22R77R16Q01R34J463K033J929J021
53807A89240K01L92J384K251K499K227J553P70O03J436K489K768K468K390K393
53792B15064J672M12k66o6J47m6n5L37M17k08r34j281j559j932j954j620j752
53775B06376k576l002k129o43J06j96q84j374j546j475j388j533j708j463r08
53760A85657o79q57p79j96K58J71m6r7l55q97j016l29M70O58M44K58k4m01k59
$$ y = [184289, 183213, 182452, 181785, 180748, 179269, 177881, 177191, 177146, 176960, 175858, 173910, 171892, 170321, 168931, 167403, 166189, 166042, 166837, 167562, 167567, 167213, 167106, 167271, 167448, 167636, 167945, 168260, 168453, 168681, 169118, 169620, 169927, 169976, 169790, 169324, 168624, 167897, 167268, 166736, 166490, 166873, 167812, 168685, 169010, 168897, 168639, 168314, 168128, 168607, 169981, 171675, 172851, 173235, 173112, 172845, 172783, 173332, 174590, 176065, 177142, 177765, 178344, 179166, 180143, 181059, 181860, 182794, 184257, 186290, 188219, 189240, 189441, 189833, 191217, 193468, 195967, 198194, 199747, 200517, 201120, 202556, 205045, 207813, 210281, 212671, 215064, 216736, 217148, 216882, 216816, 216963, 216917, 216862, 217199, 217616, 217408, 216474, 215193, 213634, 211702, 209748, 208128, 206376, 203800, 200798, 198669, 198026, 198132, 197936, 197052, 195678, 194132, 192657, 191269, 189736, 188028, 186565, 185657, 184978, 184121, 183342, 183146, 183404, 183575, 183529, 183432, 183077, 182180, 181164, 180835, 181305, 181963, 182407, 182665, 182641, 182240, 181981]
53741A81981N73J145Q15M41J128K403K854K137J197P64O94O72O91P74R09J189
53725B00367J588J837J848J923K143K098J707J685K489L423L500K777K047J683
53711B31115J541J648K164K843L246L282L108K730K223J954K113K333K269K168
53697B64737K463L232M320N458N953N112L379K143J871J451P2j385j865j890k465
53682B92586l121k644j223k31j65k94k00k56n22n08j78j01m05o21n76n62n51l47
53664B80081l74j206k279k259r79K02K89j60k24M9J11k3M7L95P92J164J561J882
53646B79069J978J850J646J502J415J137M14m82p89j65P52J150J012Q34P88R05
53630B93016J546K883M157M434L885L463L490L530L465L649M031M201M350N142
$$ y = [181981, 182554, 183699, 184514, 184955, 186083, 188486, 191340, 193477, 194674, 195438, 196132, 196804, 197495, 198269, 199178, 200367, 201955, 203792, 205640, 207563, 209706, 211804, 213511, 215196, 217685, 221108, 224608, 227385, 229432, 231115, 232656, 234304, 236468, 239311, 242557, 245839, 248947, 251677, 253900, 255854, 257967, 260300, 262569, 264737, 267200, 270432, 274752, 280210, 286163, 291275, 294654, 296797, 298668, 300119, 300191, 298806, 296941, 295051, 292586, 289465, 286821, 285598, 285367, 285202, 284908, 284708, 284452, 283930, 283422, 283244, 283143, 282738, 282117, 281541, 280979, 280428, 280081, 279707, 278501, 276222, 273963, 272984, 273186, 273475, 273315, 273091, 273140, 273251, 273228, 273275, 273670, 274462, 275626, 277187, 279069, 281047, 282897, 284543, 286045, 287460, 288597, 289011, 288529, 287740, 287575, 288327, 289477, 290489, 291323, 292111, 293016, 294562, 297445, 301602, 306036, 309921, 313384, 316874, 320404, 323869, 327518, 331549, 335750, 340100, 345242]
53616C45242O405P121O910O575O717O859O370N375M219K877J502Q00J161J943
53602D10076K207J839J386J163J037P87L16l12p66o53o8L91L16j27o41j214j873
53585D13864k464k869l095k985k314j369r42j397k090k097j277l06R1k61j000
53570C89489j572j692j520j339j153q56n80m83k59N48J709K322J897R51L42L51
53554C88155O21P87Q78J230K036K911L143K557J863J729J915J885J947K896M597
53539D19150N933O291O277O674P464Q291R094R826J0197J0247J0627J1698J2850
53526E34619J3343J3449J4009J5096J5909J6004J5955J6510J7634J8784J9859
53515G11171K1308K3269K5063K5905K5911K5936K6482K7204K7637K7838K8028
$$ y = [345242, 351647, 358768, 365678, 372253, 378970, 385829, 392199, 397574, 401793, 404670, 406172, 406972, 408133, 410076, 412283, 414122, 415508, 416671, 417708, 418495, 418811, 418499, 417733, 417080, 417012, 417403, 417719, 417592, 416951, 415737, 413864, 411400, 408531, 405436, 402451, 400137, 398768, 397826, 396429, 394339, 392242, 390965, 390659, 390750, 390489, 389489, 387917, 386225, 384705, 383366, 382213, 381357, 380777, 380294, 380035, 380583, 382292, 384614, 386511, 387462, 387804, 388155, 388776, 389563, 390441, 391671, 393707, 396618, 399761, 402318, 404181, 405910, 407825, 409710, 411657, 414553, 419150, 425083, 431374, 437651, 444325, 451789, 460080, 469174, 479000, 489197, 499444, 510071, 521769, 534619, 547962, 561411, 575420, 590516, 606425, 622429, 638384, 654894, 672528, 691312, 711171, 732479, 755748, 780811, 806716, 832627, 858563, 885045, 912249, 939886, 967724, 995752]
53504I95752K8064K7720K7159K6614K5940K4985K4039K3407K2805K1803K0627
53493A268915J9851J9511J9228J8970J8893J8653J7823J6890J6867J7799J8619
53482A472019J8707J8511J8327J7493J5413J2551R736P163M678K476O88j249m059
53469A592454p619j1128j4052j6380j8043j8783j8620j8048j7661j7836j8761
53458A415523k0434k2516k4390k5494k5674k5175k4317k3264k2202k1578k1779
53447A158700k2389k2319k0928j8721j6438j3978j0885p547m985l516k457j321
53435A013216m67k92m03O2J641M229P125R385J0579J1204J2003J3068J4225J5844
53421A111419J8265K0638K1666K1678K2548K5118K8018K9761L0714L2029L3730
$$ y = [995752, 1023816, 1051536, 1078695, 1105309, 1131249, 1156234, 1180273, 1203680, 1226485, 1248288, 1268915, 1288766, 1308277, 1327505, 1346475, 1365368, 1384021, 1401844, 1418734, 1435601, 1453400, 1472019, 1490726, 1509237, 1527564, 1545057, 1560470, 1573021, 1582757, 1589920, 1594598, 1597074, 1597762, 1596513, 1592454, 1584835, 1573707, 1559655, 1543275, 1525232, 1506449, 1487829, 1469781, 1452120, 1434284, 1415523, 1395089, 1372573, 1348183, 1322689, 1297015, 1271840, 1247523, 1224259, 1202057, 1180479, 1158700, 1136311, 1113992, 1093064, 1074343, 1057905, 1043927, 1033042, 1025495, 1020510, 1016994, 1014537, 1013216, 1012749, 1012457, 1012054, 1012116, 1013757, 1017986, 1025111, 1034496, 1045075, 1056279, 1068282, 1081350, 1095575, 1111419, 1129684, 1150322, 1171988, 1193666, 1216214, 1241332, 1269350, 1299111, 1329825, 1361854, 1395584]
53410A395584L5196L6721L9037M1723M3571M4546M6038M8910N2382N5239N7231
53399A896178N8762N9915O0528O0843O1385O2254O2993O3150O2710O1802O0290
53388B570810N7936N4927N1911M9353M7101M4779M2363L9939L7064L3030K7854
53377C057067K2576J8203J4667J1035O518R72n447j2820k1486l1434m1699n0606
53365B967546n6979o0949o3427o5009o5796o5987o5905o5526o4536o2937o1023
53354B269472n8818n6151n3383n1338n0388n0167n0223n0326n0031m8813m6850
53343A702984m4917m3198m1019l8044l4901l2061k9057k5488k2017j9483j7613
53332A355186j5574j3355j1738j1083j1091j1602j2730j4133j4880j4325j2658
$$ y = [1395584, 1430780, 1467501, 1506538, 1548261, 1591832, 1636378, 1682416, 1731326, 1783708, 1838947, 1896178, 1954940, 2014855, 2075383, 2136226, 2197611, 2259865, 2322858, 2386008, 2448718, 2510520, 2570810, 2628746, 2683673, 2735584, 2784937, 2832038, 2876817, 2919180, 2959119, 2996183, 3029213, 3057067, 3079643, 3097846, 3112513, 3123548, 3130066, 3131038, 3125591, 3112771, 3091285, 3059851, 3018152, 2967546, 2910567, 2849618, 2786191, 2721182, 2655386, 2589399, 2523494, 2457968, 2393432, 2330495, 2269472, 2210654, 2154503, 2101120, 2049782, 1999394, 1949227, 1899004, 1848678, 1798647, 1749834, 1702984, 1658067, 1614869, 1573850, 1535806, 1500905, 1468844, 1439787, 1414299, 1392282, 1372799, 1355186, 1339612, 1326257, 1314519, 1303436, 1292345, 1280743, 1268013, 1253880, 1239000, 1224675, 1212017]
53321A212017j0502q390o689n574m816l846k264k72J485K561L196M039N346O662
53307A192953P547Q384R878J1939J3757J5035J6413J8371K0438K1985K3199K4685
53295A384584K6515K8279K9753L0945L1648L1466L0322K8554K6544K4478K2402
53284A695490K0378J8558J7042J5519J3209R592N140Q36k943o502r896j2740j5079
53271A748604j7611k0693k3844k6579k9028l1327l3108l4104l4618l4959l5024
53260A427709l4887l5075l5721l6102l5581l4368l2872l1089k9247k8216k8389
53249A066162k8902k8873k8685k9088k9710k9641k8931k8268k7554k6150k4249
53238G56111k2681k1350j9247j6233j3472j1756j0519r023p557o814o841p228
$$ y = [1212017, 1201515, 1193125, 1186436, 1180862, 1176046, 1172200, 1169936, 1169664, 1171149, 1173710, 1176906, 1180945, 1186291, 1192953, 1200500, 1208884, 1218762, 1230701, 1244458, 1259493, 1275906, 1294277, 1314715, 1336700, 1359899, 1384584, 1411099, 1439378, 1469131, 1500076, 1531724, 1563190, 1593512, 1622066, 1648610, 1673088, 1695490, 1715868, 1734426, 1751468, 1766987, 1780196, 1789788, 1794928, 1795764, 1792821, 1786319, 1776423, 1763683, 1748604, 1730993, 1710300, 1686456, 1659877, 1630849, 1599522, 1566414, 1532310, 1497692, 1462733, 1427709, 1392822, 1357747, 1322026, 1285924, 1250343, 1215975, 1183103, 1152014, 1122767, 1094551, 1066162, 1037260, 1008387, 979702, 950614, 920904, 891263, 862332, 834064, 806510, 780360, 756111, 733430, 712080, 692833, 676600, 663128, 651372, 640853, 631830, 624273, 617459, 610618, 603390]
53226F03390p799q544r285r938j0827j2232j3823j4862j4877j4007j2768j1681
53214D62747j0976j0530j0109r645r180q674q065p407o785o271o091o596p746
53201C54672q866r258q880q210p591p036o478n830n007m155l640l502l251k556
53187B70412j836j696k083k480k660k727k585k026j278r26j191j645j710j223
53173B44346o19o24j518k531k442j116J08j8j121j817j434m66L15N44K12m02q23
53156B30594q29o90o59o21n30o74r98q21J27R69Q65L04L02P27O62Q8m1O60J478
53137B30913J758J547J029K51m48n64j54K72N80R25J019M55k66j36P69J235P23
53120B39908J62M54J246J728J811J878J966J847J444P98k9p43r98r66j176j684
$$ y = [603390, 595591, 587047, 577762, 567824, 556997, 544765, 530942, 516080, 501203, 487196, 474428, 462747, 451771, 441241, 431132, 421487, 412307, 403633, 395568, 388161, 381376, 375105, 369014, 362418, 354672, 345806, 336548, 327668, 319458, 311867, 304831, 298353, 292523, 287516, 283361, 279721, 276219, 272968, 270412, 268576, 266880, 264797, 262317, 259657, 256930, 254345, 252319, 251041, 250115, 248924, 247279, 245569, 244346, 243727, 243103, 241585, 239054, 236612, 235496, 235604, 235586, 234465, 232648, 231214, 230748, 231063, 231607, 231819, 231417, 230594, 229765, 229075, 228416, 227795, 227265, 226591, 225593, 224772, 224899, 225868, 226733, 227037, 227339, 228066, 228728, 228816, 228775, 229435, 230913, 232671, 234218, 235247, 235498, 235050, 234486, 234332, 234604, 235184, 236109, 237128, 237583, 237317, 237181, 237950, 239185, 239908, 240070, 240524, 241770, 243498, 245309, 247187, 249153, 251000, 252444, 253242, 253213, 252470, 251472, 250506, 249330, 247646]
53104B47646k034k159k485l004l103k657k342k443k251j315m03m16j024j267j000
53089B19743p39m45M85K039L186L012J755M72j07j99n12j254j799j463m54K62
53073B23982L0r80k145k855k623j393J58J114J248R57L48q41k338l196k935k125
53057B06406j395o09N00J514J856J612J254Q86M05K4NR5j53n99o40j04N06O88
53039B12251M90K43R4o1k93m56l84k08k71o02p12k73L02L86J10J85P68J253J248
53020B14070J085J056Q47J92m88n99k72j19l72o49n65k41j00k84l19L46J418J709
53002B16715N23j212j903j253l99j60r8L55Q63Q83O65Q17J333J646J492J120Q58
52985B22245P95P86N79J36j53J54R01J468J626J693J759J455P28J76K47O78J057
$$ y = [247646, 245612, 243453, 240968, 237964, 234861, 232204, 229862, 227419, 225168, 223853, 223450, 223034, 222010, 220743, 219743, 219004, 218559, 219044, 221083, 224269, 227281, 229036, 229508, 229401, 229202, 228690, 227436, 225637, 224174, 223720, 223982, 224012, 223032, 220887, 218032, 215409, 214016, 214174, 215288, 216536, 217493, 217841, 217000, 214662, 211466, 208531, 206406, 205011, 204402, 204902, 206416, 208272, 209884, 211138, 212024, 212429, 212453, 212458, 212553, 212400, 211801, 211161, 211057, 211563, 212251, 212741, 212984, 213078, 213017, 212724, 212268, 211884, 211676, 211405, 210803, 210091, 209818, 210120, 210506, 210616, 210801, 211569, 212822, 214070, 215155, 216211, 217058, 217250, 216762, 216163, 215891, 215772, 215400, 214751, 214186, 213945, 213845, 213561, 213242, 213588, 215006, 216715, 217238, 216026, 214123, 212870, 212471, 212311, 212213, 212568, 213431, 214314, 214979, 215796, 217129, 218775, 220267, 221387, 222245, 223040, 223826, 224405, 224541, 224388, 224542, 225443, 226911, 228537, 230230, 231989, 233444, 234172, 234348, 234595, 235273, 236330]
52968B36330J417J859K104J825J051nj036j476r28N0K99m38j202j322j259j514
52952B35755j647j247r45j425k166k179j558j208j402j609j490j154n99K38R57
52937B18321J032O13K63P0l18q92j236j165p89j09P59J192O64l86j029j044r63
52920B14983j044j000p09l69j5M49O99L16l37l69L50Q95N55l08q77q18l35J53
52902B12219K19k32o77n09J23N17M60L91M99M20R5Q5O41J140R64L58j32n36j125
52883B14920j628j482p12P2N05P03P65O29M90P87J499J964J780J522K010K950
52867B26774L084J821J71m69k5L82N8n14o57m18k13j37j36l81r30j373j325j056
52849B24656j126j621k169k562k796k706k103j313j030j531k342k705k181r17
$$ y = [236330, 237747, 239606, 241710, 243535, 244586, 244581, 243545, 242069, 241141, 241191, 241490, 241052, 239850, 238528, 237269, 235755, 234108, 232861, 231916, 230491, 228325, 226146, 224588, 223380, 221978, 220369, 218879, 217725, 217126, 217364, 218321, 219353, 219966, 220229, 220299, 219981, 219089, 217853, 216688, 215899, 215790, 216549, 217741, 218405, 218019, 216990, 215946, 214983, 213939, 212939, 212230, 211861, 211846, 212295, 212994, 213310, 212973, 212604, 212954, 213849, 214404, 214096, 213219, 212401, 212066, 212219, 212438, 212206, 211529, 211020, 211143, 211660, 212120, 212511, 213010, 213430, 213525, 213610, 214251, 215391, 216355, 216713, 216581, 216045, 214920, 213292, 211810, 211098, 211170, 211675, 212378, 213143, 213772, 214262, 215049, 216548, 218512, 220292, 221814, 223824, 226774, 229858, 231679, 231850, 231381, 231356, 231738, 231796, 231282, 230625, 230207, 229994, 229857, 229721, 229340, 228410, 227037, 225712, 224656, 223530, 221909, 219740, 217178, 214382, 211676, 209573, 208260, 207230, 205699, 203357, 200652, 198471, 197554]
52835A97554L56P72K25l24J80J600K764K796J871O49m68j356j870j866j343n24
52819B01016J79M12K86L60Q91J351J109L98M4L06O24O03N68Q24R28K14j196k323
52801B06594k313j331m01l39q69r70k03O56O02k42p83m53J29J30l56n78k25K08
52783A99256J51k91n62m35l11n94j027r78l40K93M13J32k29o04r15p85qR92J530
52764A95688J323N22n29j232r29K20R84M56o49q36J83J202J212N17L2J99Q18J454
52746B00635J739J728K014L021M186M419L395J871O50p4k98J01R00J485J594J608
52730B28974J736J498M20j148k345k620k001r61k80n80j578k173j631m03N41Q03
52714B18252O21K34k77p71j081j184j095p90m77n65j055j329r23k00K14L67P25
$$ y = [197554, 197910, 198682, 198907, 198583, 198763, 200363, 203127, 205923, 207794, 208443, 207975, 206619, 204749, 202883, 201540, 201016, 201195, 201607, 201893, 202253, 203144, 204495, 205604, 206002, 206046, 206352, 206976, 207579, 208147, 208971, 209899, 210113, 208917, 206594, 204281, 202950, 202549, 202210, 201341, 200371, 200168, 200824, 201426, 201184, 200401, 199948, 200077, 200207, 199851, 199273, 199048, 199256, 199407, 199116, 198554, 198119, 197808, 197214, 196187, 195209, 194869, 195162, 195575, 195707, 195478, 194874, 193959, 193174, 193166, 194158, 195688, 197011, 197533, 197004, 195772, 194843, 195063, 196047, 196503, 195854, 195018, 195201, 196403, 197615, 198132, 198164, 198363, 199181, 200635, 202374, 204102, 206116, 209137, 213323, 217742, 221137, 223008, 223658, 223584, 223286, 223387, 224287, 225772, 227366, 228974, 230710, 232208, 232628, 231480, 229135, 226515, 224514, 223553, 223273, 222693, 221115, 218942, 217311, 216908, 217449, 218252, 218873, 219107, 218830, 218059, 216978, 215794, 214699, 213909, 213432, 212867, 211812, 210483, 209560, 209360, 209574, 209941, 210666]
52697B10666J228J278O89N5m1K99N98N93K98j84o38p35l95KM1k10l27j87j44m28
52677B12458o86m58P9K47j94o95p16m68m85p73q54m81K19J231K621L913M154L078
52659B22190J730J433K325L353L536K787J593M02n13j001j200j520k192k883k987
52644B27053k376j579j148j024p84l28j4r4l40l73q6L41O59O16J17m97n83J13
52626B19673J062J551J435J023M78k17q40j039q66p61q62q05k90M41R12R20N44
52609B22359m6n78o81j52O83J141P94k2m36R9J180J853J681J079N61J15l93o54
52591B28583l68O6m0o88j194j179r19o48j23P85J628J847J440Q78N26L80K27q3
52573B31118m78o99n88k50J42N55Q58O93q7j014j489j509j442j247o43P5K26j44
$$ y = [210666, 211894, 213172, 213861, 213916, 213875, 214174, 214772, 215365, 215663, 215479, 214841, 214106, 213711, 213713, 213754, 213544, 213217, 213030, 212886, 212458, 211772, 211314, 211393, 211640, 211446, 210751, 210035, 209567, 209082, 208309, 207455, 206974, 207193, 208424, 211045, 214958, 219112, 222190, 223920, 225353, 227678, 231031, 234567, 237354, 238947, 239349, 238836, 237835, 236635, 235115, 232923, 230040, 227053, 224677, 223098, 221950, 220926, 220142, 219814, 219800, 219706, 219366, 218993, 218907, 219248, 219907, 220523, 220640, 220143, 219560, 219673, 220735, 222286, 223721, 224744, 225222, 225005, 224165, 223126, 222260, 221499, 220637, 219832, 219542, 219983, 220895, 221815, 222359, 222313, 221735, 221054, 220902, 221585, 222726, 223520, 223498, 223062, 223161, 224341, 226194, 227875, 228954, 229515, 229630, 229237, 228583, 228215, 228281, 228241, 227553, 226359, 225180, 224261, 223613, 223490, 224275, 225903, 227750, 229190, 230068, 230594, 230974, 231201, 231118, 230640, 229941, 229353, 229103, 229245, 229800, 230658, 231351, 231264, 230250, 228761, 227252, 225810, 224563, 223920, 223995, 224221, 224077]
52555B24077j77M45Q96M69k84l89J01L59J36k5R5m9p54j319q19O30J862J890Q81
52536B28025j26k65N02J530K058J708O97l24q24q67r33j204j299q64j35L45L86
52519B28410K50J98K48K94L23N30J287K661L879L867K619J532J737K644K787J795
52503B55061N78j69p17j499k420l177l560l296k330j343j223j864k202j702r79
52488B29158o57m43J62R46J407J504J493J435J344J397J535J320O08o6k16r4j62
52471B40671l41l07j06O5M10J199K187K896L300L641L778L334K453J805J677J527
52455B68189O57r17k408l027k731k202k114k544l151l643l757l092j623j32M62
52440B37967K43M5J00p9m72k94N68J068N91L8M06J202J407J185J418J969J865
$$ y = [224077, 223900, 224345, 225241, 225710, 225426, 225037, 225138, 225497, 225633, 225608, 225703, 225654, 224900, 223581, 222762, 223392, 225254, 227144, 228025, 227899, 227634, 228136, 229666, 231724, 233432, 234129, 233805, 232981, 232114, 231181, 229977, 228678, 227814, 227679, 228024, 228410, 228660, 228858, 229106, 229400, 229723, 230253, 231540, 234201, 238080, 241947, 244566, 246098, 247835, 250479, 253266, 255061, 255639, 255470, 254753, 253254, 250834, 247657, 244097, 240801, 238471, 237128, 235905, 234041, 231839, 230137, 229158, 228501, 228058, 228220, 229166, 230573, 232077, 233570, 235005, 236349, 237746, 239281, 240601, 241209, 241143, 240927, 240833, 240671, 240330, 240023, 239917, 239982, 240392, 241591, 243778, 246674, 249974, 253615, 257393, 260727, 263180, 264985, 266662, 268189, 268846, 267929, 265521, 262494, 259763, 257561, 255447, 252903, 249752, 246109, 242352, 239260, 237637, 237505, 237967, 238210, 238255, 238355, 238276, 237804, 237510, 238078, 239146, 239737, 239775, 240181, 241383, 242790, 243975, 245393, 247362, 249227]
52423B49227R57J78P0K35M01Q76J697K298K439K677L459M470N317O187P309Q199
52407B95996P979O269L437J67k879n237o657p002o139m257k174q86o06p30p40
52392B76541p47q99q86m12K72P81J202J753K092J679Q02N44J395K517K835K496
52376B91965K580L507M479M663M308M195M495M779M815M695M306L484K608K350
52362C47229K638K661K120J731K099K776K983K644K157J713J528K226M128O416
52348C85049P887Q390Q760R417R897R923J0009J0705J1807J2804J3696J4869J6423
52335E29636J7995J9201J9954K0327K0362K0121J9885K0057K0725K1421K1571
52324G51255K1186K0800K0677K0441J9581J7935J5553J2599R652P573O527N552
$$ y = [249227, 250184, 250362, 250432, 250667, 251068, 251944, 253641, 255939, 258378, 261055, 264514, 268984, 274301, 280488, 287797, 295996, 303975, 310244, 313681, 313848, 310969, 305732, 299075, 292073, 285934, 281677, 279503, 278617, 278011, 277281, 276541, 275794, 274895, 274009, 273597, 273869, 274650, 275852, 277605, 279697, 281376, 282178, 282722, 284117, 286634, 289469, 291965, 294545, 298052, 302531, 307194, 311502, 315697, 320192, 324971, 329786, 334481, 338787, 342271, 344879, 347229, 349867, 352528, 354648, 356379, 358478, 361254, 364237, 366881, 369038, 370751, 372279, 374505, 378633, 385049, 392936, 401326, 410086, 419503, 429400, 439323, 449332, 460037, 471844, 484648, 498344, 513213, 529636, 547631, 566832, 586786, 607113, 627475, 647596, 667481, 687538, 708263, 729684, 751255, 772441, 793241, 813918, 834359, 853940, 871875, 887428, 900027, 909679, 917252, 923779, 929331]
52312I29331L658J081j104k407l295m257n148n601n640n652n954o457o629n972
52298H75954m644l360k501j723p54q5k43q07q47j14R26K128L937O526R367J1843
52282H95603J3807J5320J6318J6696J6442J5670J4705J4054J3858J3564J2523
52271A058560J0753Q670O332L672J275m6m75j171k753m621o096p373q895j0403
52257A047429j1300j1472j1273j0951j0619j0477j0537j0389r705q864q600r086
52245I24156r783j0169j0208j0080r717q877p538o042m812l907l027j964r03j83
52231H36946J81M47P83J171J623K159K608K784K905L428M418N359N821N960O126
52216H82719O304O249O053O112O531O774O211M857L423K598K470K683K964L193
$$ y = [929331, 932989, 934070, 932966, 930559, 927264, 923007, 917859, 912258, 906618, 900966, 895012, 888555, 881926, 875954, 871310, 867950, 865449, 863726, 862972, 862887, 862644, 861837, 860990, 860876, 861802, 863930, 867867, 874393, 883760, 895603, 909410, 924730, 941048, 957744, 974186, 989856, 1004561, 1018615, 1032473, 1046037, 1058560, 1069313, 1077983, 1084315, 1087987, 1089262, 1089216, 1088741, 1087570, 1084817, 1080196, 1074100, 1066727, 1057832, 1047429, 1036129, 1024657, 1013384, 1002433, 991814, 981337, 970800, 960411, 950706, 941842, 933242, 924156, 914373, 904204, 893996, 883916, 874199, 865322, 857784, 851742, 846930, 843023, 839996, 838032, 837129, 836946, 837127, 837574, 838357, 839528, 841151, 843310, 845918, 848702, 851607, 855035, 859453, 864812, 870633, 876593, 882719, 889023, 895272, 901325, 907437, 913968, 920742, 926953, 931810, 935233, 937831, 940301, 942984, 945948, 949141]
52202I49141L168K739K152J869J903J793J316Q29O97Q77J226J696J999J673R45
52187I74023P44J277J285l70k870m302m088l488l720m661n564o089o216n951n448
52172I24562m933m237k938j174L06J107J577K070K412K532K936M027N359O098
52158I39704O022N654N543N729N819N467M797M302M245M388M593N347P079R233
52144A017922J0727J1298J1664J2330J3019J3438J3781J4200J4493J4642J5025
52133A162539J5835J6815J7794J8846J9673J9737J9287J9398K0390K1089K0348
52122A371751J8633J7215J6334J5149J3188J0926Q939P166N118K432p81l888o228
52109A475954p935r923j2642j5262j6619j6616j6093j5550j4660j3000j0671q116
$$ y = [949141, 952309, 955048, 957200, 959069, 960972, 962765, 964081, 964910, 965607, 966484, 967710, 969406, 971405, 973078, 974023, 974767, 976044, 977329, 976959, 974089, 969787, 965699, 962211, 958491, 953830, 948266, 942177, 935961, 930010, 924562, 919629, 915392, 912454, 911280, 911586, 912693, 914270, 916340, 918752, 921284, 924220, 928247, 933606, 939704, 945726, 951380, 956923, 962652, 968471, 973938, 978735, 983037, 987282, 991670, 996263, 1001610, 1008689, 1017922, 1028649, 1039947, 1051611, 1063941, 1076960, 1090398, 1104179, 1118379, 1132872, 1147514, 1162539, 1178374, 1195189, 1212983, 1231829, 1251502, 1271239, 1290526, 1309924, 1330314, 1351403, 1371751, 1390384, 1407599, 1423933, 1439082, 1452270, 1463196, 1472135, 1479301, 1484419, 1486851, 1486070, 1482182, 1475954, 1468019, 1458096, 1445454, 1430192, 1413573, 1396957, 1380864, 1365314, 1350654, 1337654, 1326983, 1318867]
52097A318867n748l805k320j199m19j7K89J065K442L736M245M169M374N382P050
52082A338111R004J0986J2783J4297J5603J6638J6959J6239J4845J3551J2648
52071A491664J1720J0284Q319O113L849J446j302m378p353r731j1564j3421j5630
52058A470016j7858j9652k0995k2061k2777k2997k2804k2368k1841k1611k2203
52047A232849k3438k4186k3547k1967k0620j9966j9607j9171j8512j7146j4480
52036A010209j0761p124m372k385q22K22N90N01J85n09j673k903l822m735o215
52021I66386q050r255r285q788q767r282r552r294r331j0453j2234j3584j4227
52008H34284j4836j5740j6372j6258j5773j5423j5050j4386j3787j3720j3843
$$ y = [1318867, 1313119, 1309314, 1306994, 1305795, 1305376, 1305359, 1305648, 1306713, 1309155, 1312891, 1317136, 1321305, 1325679, 1331061, 1338111, 1347115, 1358101, 1370884, 1385181, 1400784, 1417422, 1434381, 1450620, 1465465, 1479016, 1491664, 1503384, 1513668, 1521987, 1528100, 1531949, 1533395, 1532093, 1527715, 1520362, 1510631, 1499067, 1485646, 1470016, 1452158, 1432506, 1411511, 1389450, 1366673, 1343676, 1320872, 1298504, 1276663, 1255052, 1232849, 1209411, 1185225, 1161678, 1139711, 1119091, 1099125, 1079518, 1060347, 1041835, 1024689, 1010209, 999448, 992324, 987952, 985567, 984745, 984967, 985557, 986058, 986243, 985734, 984061, 981158, 977336, 972601, 966386, 958336, 949081, 939796, 931008, 922241, 912959, 903407, 894113, 884782, 874329, 862095, 848511, 834284, 819448, 803708, 787336, 771078, 755305, 739882, 724832, 710446, 696659, 682939, 669096]
51997F69096j3427j2418j1313j0171q562o503m658l503k972l001l673m648n162
51984E79085n026m962n656o846p850q476q962r381r632r812j0087j0193r541p854
51970D64807n511l219j526n11K84J464L121M634N399N643O057O694O772N756M143
51955E04007K694J319o41l100n040n798n866n979n954n130l532j800o5K229N205
51940D72549Q038R937J1046J1909J2569J2698J2263J1465J0200Q186N504K645
51928E89009n5k552m720o166o582o022m767l101j313K66J384K065K496K554J476
51913E63972j609o507j1604j5160j6779j7183j6729j5049j2153q947o268m072
51901D31912k085m50Q07K235M014N115M316J764j283l988o276p987q692q428p729
$$ y = [669096, 655669, 643251, 631938, 621767, 613205, 606702, 602044, 598541, 595569, 592568, 588895, 584247, 579085, 574059, 569097, 563441, 556595, 548745, 540269, 531307, 521926, 512294, 502482, 492395, 482202, 472661, 464807, 459296, 456077, 454551, 454040, 454324, 455788, 458909, 463543, 468942, 474585, 480642, 487336, 494108, 499864, 504007, 506701, 508020, 507379, 504279, 499239, 493441, 487575, 481596, 475642, 470512, 466980, 465180, 465115, 467344, 472549, 480587, 490524, 501570, 513479, 526048, 538746, 551009, 562474, 572674, 580860, 586364, 589009, 588954, 586402, 581682, 575516, 568934, 562912, 558145, 555044, 553731, 553997, 555381, 557446, 559942, 562496, 563972, 562363, 555856, 544252, 529092, 512313, 495130, 478401, 463352, 451199, 442252, 435984, 431912, 429827, 429377, 430184, 432419, 436433, 441548, 445864, 447628, 446345, 442357, 436081, 428094, 419402, 410974, 403245]
51886D03245o713m979k607m77P32J292J873K757L876N105O172O730O777O682O579
51871D37044O156N186L888K518J073l68j489k282l305m961o801p915p798o536
51857D14410m453j989K01J590K164K223J857R94j58j114j675k128k740l384l868
51842D01930m353n106n864n918m967l615k729k452k161j346j67Q98J574J810J588
51827C69122J001K94l88j114j899k459k561k354k164k086j983j704j107p6J162
51812C51684K022K149J928K023K549L053L153K855K298J512M65q74k427l784m291
51797C64315l724k647j832j493j445j683k292k976l264l061k592j890r01N0N06
51782C35071N56O72Q97Q49N63O02J134J636J756J858K373L150L899M735N896P258
$$ y = [403245, 396532, 391553, 388946, 388469, 389201, 390493, 392366, 395123, 398999, 404104, 410276, 417006, 423783, 430465, 437044, 443200, 448386, 452274, 454792, 455865, 455497, 454008, 451726, 448421, 443460, 436659, 428744, 420946, 414410, 409957, 407968, 408169, 409759, 411923, 414146, 416003, 416997, 416839, 415725, 414050, 411922, 409182, 405798, 401930, 397577, 392471, 386607, 380689, 375722, 372107, 369378, 366926, 364765, 363419, 363252, 364150, 365724, 367534, 369122, 370123, 370417, 370029, 368915, 367016, 364557, 361996, 359642, 357478, 355392, 353409, 351705, 350598, 350522, 351684, 353706, 355855, 357783, 359806, 362355, 365408, 368561, 371416, 373714, 375226, 375691, 374817, 372390, 368606, 364315, 360591, 357944, 356112, 354619, 353174, 351491, 349199, 346223, 342959, 339898, 337306, 335416, 334515, 334565, 335071, 335627, 336299, 337196, 338045, 338608, 339210, 340344, 341980, 343736, 345594, 347967, 351117, 355016, 359751, 365647, 372905]
51766C72905Q513R586J0445J0829J0485R469P900N744L038J10k788n756q768j1204
51752D20508j2261j1795j0420q882p633o789o159n276l823k032m94M36R07J365
51738C47652K315M149O698Q897R401P938N782M486M238L946K996K185K470L286
51724D16439K872L08l460o704q431q647p776o340m791l224j620n18q95k751m470
51709C59992m418k791j074j4Q82K000K950L383L429L031J783p6j349j187j09Q36
51693C67268J352J715J851J312k4j766l394m450m622m086l530l432l454k967j944
51678C39829q95r1O56J530K566L859N498P149Q184Q435Q481Q906R494R391P951
51663D20943N149J357k813o315p846o878m359j905k13J113K083J667p14l778n505
$$ y = [372905, 381418, 391004, 401449, 412278, 422763, 432232, 440132, 445876, 448914, 449024, 446236, 440480, 431712, 420508, 408247, 396452, 386032, 377150, 369517, 362728, 356569, 351293, 347470, 345438, 344944, 345380, 346287, 347652, 349967, 354116, 360814, 369711, 379112, 387050, 392832, 397318, 401556, 405502, 408498, 410683, 413153, 416439, 419311, 419619, 416159, 409455, 401024, 392377, 384601, 378261, 373470, 370246, 368626, 368108, 367213, 364462, 359992, 355574, 352783, 351709, 351695, 352577, 354577, 357527, 360910, 364339, 367370, 369153, 369077, 367728, 366541, 366432, 367268, 368620, 370335, 372186, 373498, 373474, 371708, 368314, 363864, 359242, 355156, 351626, 348194, 344740, 341773, 339829, 338934, 338843, 339499, 341029, 343595, 347454, 352952, 360101, 368285, 376720, 385201, 394107, 403601, 412992, 420943, 426092, 427449, 424636, 418321, 410475, 403597, 399238, 397333, 397120, 398233, 400316, 401983, 401269, 397491, 391986]
51648C91986n473n016n138n328m770l708l023l082l594m217m700m739m204l387
51634C31607k725k328j965j371n00L15M99p9o49l04P28J285R00M52P68J419J601
51617C29653J486J780K315K092P81p69j597j648j394j001k75Q31J950K606K666
51602C39476K570L076M607O828Q782R404Q063M898Q26l003n869p632q333q043
51588C55650p059n819m458k839j162p0J93L55J395L423N674P455Q782J0073J1409
51573C83002J2243J1954J0817J0108J0863J2590J3756J3456J2037J0284Q934R063
51561E19107J1724J6512K1466K5136K7972L0822L2876L2344K8681K2931J6078
51550G85649Q470P47n941j1169j5708k0304k4648k7918k9745l0177k9391k7771
$$ y = [391986, 386513, 381497, 376359, 371031, 366261, 362553, 359530, 356448, 352854, 348637, 343937, 339198, 334994, 331607, 328882, 326554, 324589, 323218, 322718, 323033, 323532, 323453, 322804, 322500, 323228, 324513, 325413, 325865, 326633, 328052, 329653, 331139, 332919, 335234, 337326, 338107, 337338, 335741, 334093, 332699, 331698, 331423, 332254, 334204, 336810, 339476, 342046, 345122, 349729, 356557, 365339, 374743, 382806, 387704, 388530, 385527, 379658, 372026, 363693, 355650, 348591, 342772, 338314, 335475, 334313, 334243, 334436, 334791, 336186, 339609, 345283, 352738, 361520, 371593, 383002, 395245, 407199, 418016, 428124, 438987, 451577, 465333, 478789, 490826, 501110, 510044, 519107, 530831, 547343, 568809, 593945, 621917, 652739, 685615, 717959, 746640, 769571, 785649, 794119, 794866, 788925, 777756, 762048, 741744, 717096, 689178, 659433, 629256, 599865, 572094]
51538E72094k5926k4147k2209j9978j7812j5989j4165j1866r304p261o187n724
51526C91526n132l967k402r49Q1Q25J528K137K475K638K801K671J623l99k595
51511C92861m106m751m773m319l572k981k806k604j757n01J76k12j007j271q89
51496C57488m41l30n52j101j985k798k859k093j348j471k297k964l011k793k845
51481C28600l267l769m039l934l500k919k348j808j319r53o75l52m6l8l25m81
51465B98827k69k2M6M12J427K396K400J795J854K889L855L966L611L294K753J772
51449C31006R19P27Q39P19O24J221K652M570O487P568O842M433J908N82P2n57
51433C70612r74j98J333J803K40k391m511n399n089l926k587j892k007k246j873
$$ y = [572094, 546168, 522021, 499812, 479834, 462022, 446033, 431868, 420002, 410698, 403437, 397250, 391526, 386394, 382427, 380025, 379076, 379157, 379982, 381510, 383647, 386122, 388760, 391561, 394232, 395855, 395456, 392861, 388755, 384004, 379231, 374912, 371340, 368359, 365553, 362949, 361192, 360691, 360867, 360655, 359648, 358377, 357488, 357047, 356717, 356165, 355064, 353079, 350281, 347422, 345329, 343981, 342510, 340213, 337249, 334238, 331445, 328600, 325333, 321564, 317525, 313591, 310091, 307172, 304824, 303016, 301697, 300744, 300069, 299717, 299671, 299633, 299308, 298827, 298558, 298536, 298582, 298994, 300421, 302817, 305217, 307012, 308866, 311755, 315610, 319576, 323187, 326481, 329234, 331006, 331925, 332652, 333491, 334210, 334834, 336055, 338707, 343277, 349764, 357332, 364174, 368607, 370515, 371097, 371169, 370612, 369638, 369440, 370773, 372576, 372816, 370425, 365914, 360515, 355426, 351500, 348913, 347021, 345014, 342768, 340895]
51418C40895p70P35K256L396L877L732L104J877pj990l225l446l079k519j858
51403C42978j284j112j264j236o89K75J386K312K653K401K295L071M420N467O113
51388C67786P063Q464R654J0587J2428J6027K0606K4688K7789L0466L3129L5618
51376F04305L7645L8897L8779L6728L2847K7812K2178J6092R602K813m303j1778
51364H51617j9242k5994l1612l6132l9437m0864l9923l7258l4324l1840k9085
51353D85906k5182k0638j6924j4698j3184j1493r669q166p031o189n818n797n392
51340C35725m211l036k780l121l040k425k106k465l015l347l469l152k048o07
51326B96903J02j51l81R4O98O54K05J30N96J129J376J417J515J947K744L434L352
$$ y = [340895, 340125, 340860, 343116, 346512, 350389, 354121, 357225, 359102, 359095, 357105, 353880, 350434, 347355, 344836, 342978, 341694, 340582, 339318, 338082, 337393, 337668, 339054, 341366, 344019, 346420, 348715, 351786, 356206, 361673, 367786, 374849, 383313, 392967, 403554, 415982, 432009, 452615, 477303, 505092, 535558, 568687, 604305, 641950, 680847, 719626, 756354, 789201, 817013, 839191, 855283, 864885, 867698, 863395, 851617, 832375, 806381, 774769, 738637, 699200, 658336, 618413, 581155, 546831, 514991, 485906, 460724, 440086, 423162, 408464, 395280, 383787, 374118, 365952, 358921, 352732, 346914, 341117, 335725, 331514, 328478, 325698, 322577, 319537, 317112, 315006, 312541, 309526, 306179, 302710, 299558, 297510, 296903, 297005, 296854, 296473, 296567, 297265, 297919, 298124, 298254, 298850, 299979, 301355, 302772, 304287, 306234, 308978, 312412, 315764]
51309C15764K380J021l14j596k667l062k623j770r97n50o06j149j543j071n6L18
51293C01479l50j094j020m34j5L12R15J565J796J720J772K070K549L240L854L629
51277C21988K246M77p10j209j339r78J07J442K230K280J936J415R01Q30J312J645
51261C34573J187K88l62q14j381j589q24K62L41o77j598j871k190k867l015k030
51245C17433p97n70j412k464l089l055k206q03K19K14k95l63nm8o92j126p29J05
51227C00317O40P56Q04Q82P98N97O56J129J671J890J837J814J895J908J866K014
51211C21474K450K897L051K896K583K140J467N48m42j135j127l67N95R60L64r45
51195C37409k515l844m265l370j754p48r80j679j691p47O12J801K343J869O73
$$ y = [315764, 318144, 319165, 318851, 317255, 314588, 311526, 308903, 307133, 306136, 305586, 304980, 303831, 302288, 301217, 301161, 301479, 301129, 300035, 299015, 298581, 298566, 298878, 299793, 301358, 303154, 304874, 306646, 308716, 311265, 314505, 318359, 321988, 324234, 324711, 324001, 322792, 321453, 320475, 320582, 322024, 324254, 326534, 328470, 329885, 330786, 331616, 332928, 334573, 335760, 336048, 335686, 334872, 333491, 331902, 331078, 331340, 331681, 331004, 329406, 327535, 325345, 322478, 319463, 317433, 316636, 316066, 314654, 312190, 309101, 306046, 303840, 303037, 303256, 303470, 303175, 302812, 302807, 302759, 302067, 300941, 300212, 300317, 300957, 301713, 302517, 303399, 304197, 304794, 305450, 306579, 308250, 310140, 311977, 313791, 315686, 317594, 319460, 321474, 323924, 326821, 329872, 332768, 335351, 337491, 338958, 339506, 339064, 337929, 336802, 336435, 337030, 337990, 338354, 337409, 334894, 331050, 326785, 323415, 321661, 320913, 319933, 318254, 316563, 315816, 316428, 318229, 320572, 322441, 323114]
51180C23114j46K06J234J955K203K421K494J880P37q3k87m41q69j124q05j34O19
51163C32974J532K607L512M044M209L688K107Q5r37n36n6q02k214k792k236j614
51147C43571j669k083k378k600k836k865k575k236k048j795j184k10R16J953K590
51132C24551K557J913J053M00K22O86J678K603K819K417K134K393K778K715K271
51117C53190J900J708J427J010P85R75J372J558J321Q00L33J98L28L91K33J30
51101C67659M33R80J158N45o28j631j686m56J514K931K820J624Q12J201K093K361
51085C81730J886J404J244R11m6j256j882j517n62J16M6k98k7R68J720J543J155
51068C87135J739L205M371M773N222O377P862R307J1074J3094J3915J2208Q768
$$ y = [323114, 322968, 323174, 324408, 326363, 328566, 330987, 333481, 335361, 336098, 336015, 335728, 335287, 334418, 333294, 332489, 332355, 332974, 334506, 337113, 340625, 344669, 348878, 352566, 354673, 354758, 353821, 353285, 353229, 352427, 350213, 347421, 345185, 343571, 341902, 339819, 337441, 334841, 332005, 329140, 326565, 324329, 322281, 320486, 319302, 319092, 320008, 321961, 324551, 327108, 329021, 330074, 330474, 330696, 331382, 333060, 335663, 338482, 340899, 343033, 345426, 348204, 350919, 353190, 355090, 356798, 358225, 359235, 360020, 360995, 362367, 363925, 365246, 366046, 366379, 366577, 366905, 367296, 367529, 367659, 368092, 369072, 370230, 370775, 370147, 368516, 366830, 366374, 367888, 370819, 373639, 375263, 376075, 377276, 379369, 381730, 383616, 385020, 386264, 387175, 387129, 385873, 383991, 382474, 381912, 382028, 382074, 381776, 381749, 382717, 384437, 385980, 387135, 388874, 392079, 396450, 401223, 406445, 412822, 420684, 429991, 441065, 454159, 468074, 480282, 489050]
51055D89050N871M846N354O854R327J2161J3624J2384R072N609L261J781J36k410
51041E76920n705q731j0235r775q117o512n756o102p613j0019j2361j3408j2603
51028D59983j0383p559m760k417p55M88J948L815N352N652M843M090M313N252
51014D69862O034O297O417O800P341P738P981Q309Q851R481J0077J0734J1600
51001E77522J2499J2859J2249J0965R832R330R098Q475P315N983M740L571K606
50988F87044K285K942M401N985O842O392M883L425L038L625M305M878O375R874
50974G56294J5132K0786K5646K9564L3240L7466M2408M7444N1734N5019N7683
50963A172416O0188O2817O5837O9156P1747P2222P0361O7352O4002N9476N2674
$$ y = [489050, 494921, 499767, 505121, 511975, 521302, 533463, 547087, 559471, 568543, 574152, 577413, 579194, 579330, 576920, 571215, 562484, 552249, 542474, 534357, 527845, 522089, 515987, 508374, 498355, 485994, 472586, 459983, 449600, 442041, 437281, 434864, 434109, 434597, 436545, 440360, 445712, 451364, 456207, 460297, 464610, 469862, 475896, 482193, 488610, 495410, 502751, 510489, 518470, 526779, 535630, 545111, 555188, 565922, 577522, 590021, 602880, 615129, 626094, 635926, 645256, 654354, 662829, 670144, 676127, 680867, 684438, 687044, 689329, 692271, 696672, 702657, 709499, 715891, 720774, 724199, 727237, 730862, 735167, 740045, 746420, 756294, 771426, 792212, 817858, 847422, 880662, 918128, 960536, 1007980, 1059714, 1114733, 1172416, 1232604, 1295421, 1361258, 1430414, 1502161, 1574383, 1644744, 1712096, 1776098, 1835574, 1888248]
50952A888248M4142L5631K8089K1136J4417Q284L053j484n393q326j0395j2597
50940B004805j5640j8781k0445j9959j8190j6576j5867j6065j7165j9511k3184
50929A803422k7355l0887l3692l6855m1016m5272m8380n0482n2581n4555n4920
50918A327427n2910m9591m6353m3235l9563l5507l1926k9032k6214k3208k0499
50907I29389j8411j6538j4462j2474j1138j0476j0009r406q657p785o801n913
50895G97319n376m970m075k462p52K49M79M83N50M42O9r6N39K005L765N170N852
50878G99191N940O058O774Q005R216J0274J1603J3329J4878J5841J6729J8265
50866I36103K0328K2217K3768K5613K8372L2130L6517M0947M4919M8672N3307
$$ y = [1888248, 1932390, 1968021, 1996110, 2017246, 2031663, 2039947, 2043000, 2041516, 2036123, 2027797, 2017402, 2004805, 1989165, 1970384, 1949939, 1929980, 1911790, 1895214, 1879347, 1863282, 1846117, 1826606, 1803422, 1776067, 1745180, 1711488, 1674633, 1633617, 1588345, 1539965, 1489483, 1436902, 1382347, 1327427, 1274517, 1224926, 1178573, 1135338, 1095775, 1060268, 1028342, 999310, 973096, 949888, 929389, 910978, 894440, 879978, 867504, 856366, 845890, 835881, 826475, 817818, 810033, 803232, 797319, 791943, 786973, 782898, 780436, 779684, 779933, 780412, 780895, 781445, 781887, 781956, 781860, 782399, 784404, 788169, 793339, 799191, 805131, 811189, 817963, 825968, 835184, 845458, 857061, 870390, 885268, 901109, 917838, 936103, 956431, 978648, 1002416, 1028029, 1056401, 1088531, 1125048, 1165995, 1210914, 1259586, 1312893]
50855A312893N9683O7418P5543Q3823R2666J01949J10951J19457J27919J36276
50845B288578J43719J49890J55294J59863J62028J60087J53856J44142J31076
50836C648533J14028R3015O9367M4943K1301l32j9073l4605m7014n6086o1043
50825C773034o1215n6854m9185l9716k9616j9697j0959m913l126o311j3962k4856
50813C452624l7730n1541o5466p9012r1965j04068j14835j23644j29815j32581
50803B521967j31461j26884j20071j11989j02677r1859p9909o7760n6147m5356
50793A587854l5580k6937j9190j1938n280J36L855O122P427P881P313N755L513
50780A530931Q12k240n318p866r642j1021j2513j4126j5594j7111j9304k2351
$$ y = [1312893, 1372576, 1439994, 1515537, 1599360, 1692026, 1793975, 1904926, 2024383, 2152302, 2288578, 2432297, 2582187, 2737481, 2897344, 3059372, 3219459, 3373315, 3517457, 3648533, 3762561, 3855576, 3924943, 3969886, 3991187, 3990855, 3971782, 3937177, 3890163, 3834077, 3773034, 3711819, 3654965, 3605780, 3566064, 3536448, 3516751, 3505792, 3500879, 3497753, 3491442, 3477480, 3452624, 3414894, 3363353, 3297887, 3218875, 3126910, 3022842, 2908007, 2784363, 2654548, 2521967, 2390506, 2263622, 2143551, 2031562, 1928885, 1837026, 1757117, 1689357, 1633210, 1587854, 1552274, 1525337, 1506147, 1494209, 1488929, 1489065, 1492920, 1499042, 1506469, 1514350, 1521663, 1527418, 1530931, 1531743, 1529503, 1524185, 1516319, 1506677, 1495656, 1483143, 1469017, 1453423, 1436312, 1417008, 1394657]
50768A394657k5589k8274l0327l1930l2743l2205l0472k8406k6548k4541k1877
50757A081745j8729j5772j3387j1389r331o945m292j604J009L711O666R718J2545
50744A033945J5170J8063K1728K6264L1367L6565M1523M6302N1277N6657O2154
50733A441015O7328P2001P6080P9247Q1248Q2347Q2977Q3099Q2390Q0875P8666
50722B307273P5215O9665O2018N2978M2374K8867J1991o257k2829l6154m6408
50711B538733n3637n6892n5451n0086m2506l4026k5178j6356q242j501L581O857
50699B205296P829N666j07r069k0111l2000m3633n4044o2502o8570p1839p1854
50687A785062o8682o3277n6825m9768m1922l3353k4568j5908p361J042R238J7507
$$ y = [1394657, 1369068, 1340794, 1310467, 1278537, 1245794, 1213589, 1183117, 1154711, 1128163, 1103622, 1081745, 1063016, 1047244, 1033857, 1022468, 1013137, 1006192, 1001900, 1000296, 1001305, 1005016, 1011682, 1021400, 1033945, 1049115, 1067178, 1088906, 1115170, 1146537, 1183102, 1224625, 1270927, 1322204, 1378861, 1441015, 1508343, 1580344, 1656424, 1735671, 1816919, 1899266, 1982243, 2065342, 2147732, 2228607, 2307273, 2382488, 2452153, 2514171, 2567149, 2609523, 2638390, 2650381, 2644124, 2621295, 2585141, 2538733, 2485096, 2428204, 2372753, 2322667, 2280161, 2246135, 2220957, 2204601, 2196359, 2194858, 2198439, 2205296, 2213125, 2218791, 2218684, 2209615, 2189504, 2157504, 2113871, 2059827, 1997325, 1928755, 1856916, 1785062, 1716380, 1653103, 1596278, 1546510, 1504588, 1471235, 1446667, 1430759, 1423398, 1424440, 1433678, 1451185]
50675A451185K6158L4756M2379M8661N3762N7268N8067N5806N1544M6503M0959
50664A967048L4966K9307K4814K1350J8250J5438J3303J1821J0544R268Q022O654
50652B170785M982L309K259K204L242N426Q652J2605J7137K2300K7658L2151L5163
50639B347873L7127L8528L8924L7698L5161L1964K7957K2698J6828J1832Q497
50628B655087O202L432j937j2157k7679m5425o0195o8356o9589o5326n6953m5873
50616B211231l3927k2615j2430l408M215J0367J5361J9179K1004K0074J6548J0991
50604B256590L437o468j8590l1922m4949n6181o4703p0439p3814p5112p4470p2264
50592A671115o8933o4453n8704n2456m7085m3075l9582l5827l2124k9021k6349
$$ y = [1451185, 1477343, 1512099, 1554478, 1603139, 1656901, 1714169, 1772236, 1828042, 1879586, 1926089, 1967048, 2002014, 2031321, 2056135, 2077485, 2095735, 2111173, 2124476, 2136297, 2146841, 2156109, 2164131, 2170785, 2175767, 2179076, 2181335, 2183539, 2186781, 2192207, 2200859, 2213464, 2230601, 2252901, 2280559, 2312710, 2347873, 2385000, 2423528, 2462452, 2500150, 2535311, 2567275, 2595232, 2617930, 2634758, 2646590, 2655087, 2661289, 2664721, 2662784, 2650627, 2622948, 2577523, 2517328, 2448972, 2379383, 2314057, 2257104, 2211231, 2177304, 2154689, 2142259, 2138851, 2143066, 2153433, 2168794, 2187973, 2208977, 2229051, 2245599, 2256590, 2260027, 2253559, 2234969, 2203047, 2158098, 2101917, 2037214, 1966775, 1892961, 1817849, 1743379, 1671115, 1602182, 1537729, 1479025, 1426569, 1379484, 1336409, 1296827, 1261000, 1228876, 1199855, 1173506]
50581A173506k3746k1389j9399j7172j4205j1087q669o681m171j067J821M247
50569A051988O843R710J1890J2782J3339J5067J8282K2050K5558K8908L2553L6501
50557A285471M0312M3601M6346M8722N0787N2323N2946N2393N0741M8438M6061
50546A818141M3981M2264M0936M0307M0949M3294M7386N2892N9189O5475P1151
50535B365965P6260Q1322Q6649R1999R7054J01912J06909J12110J17243J21889
50525C359312J25526J27542J27532J25511J21481J14887J04905R1278P4597N5579
50515D428150L4498J1527j2627l6831o0197q2283j02558j20014j33571j42619
50505C783475j46916j46087j39748j28241j12835r4878p5054n3763l1921j0796
$$ y = [1173506, 1149760, 1128371, 1108972, 1091800, 1077595, 1066508, 1057839, 1051158, 1046987, 1045920, 1047741, 1051988, 1058831, 1068541, 1080431, 1093213, 1106552, 1121619, 1139901, 1161951, 1187509, 1216417, 1248970, 1285471, 1325783, 1369384, 1415730, 1464452, 1515239, 1567562, 1620508, 1672901, 1723642, 1772080, 1818141, 1862122, 1904386, 1945322, 1985629, 2026578, 2069872, 2117258, 2170150, 2229339, 2294814, 2365965, 2442225, 2523547, 2610196, 2702195, 2799249, 2901161, 3008070, 3120180, 3237423, 3359312, 3484838, 3612380, 3739912, 3865423, 3986904, 4101791, 4206696, 4297974, 4372571, 4428150, 4462648, 4474175, 4461548, 4424717, 4364520, 4282237, 4179679, 4059665, 3926094, 3783475, 3636559, 3490472, 3350724, 3222483, 3109648, 3014770, 2939716, 2885953, 2854032, 2843236]
50495B843236Q836K6855M2913N5856O4160O6622O2519N1496L3784J0426j6831
50484C249872m5750p3721r8152j17279j30614j38499j41433j39994j35100j27870
50474B101460j19249j09962j00688r1917q3660p5690o8100o1256n5175m9255m2915
50463A243593l6295l0124k5022k1135j8257j6072j4230j2446j0627q745o628m053
50451A039959j195J282K880L999N690Q588J2258J5554J7404J7159J4619J0207
50439A148404N149J101o71J58K970O596R940J2658J5286J8486K2112K5315K7503
50426A295007K8877K9922L0775L1384L2015L3155L4976L7192L9583M2346M5848
50415A681080N0138N4840N9480O3726O7370P0188P1967P2562P1866O9722O5993
$$ y = [2843236, 2852072, 2878927, 2921840, 2977696, 3041856, 3108478, 3170997, 3222493, 3256277, 3266703, 3249872, 3204122, 3130401, 3032249, 2914970, 2784356, 2645857, 2504424, 2364430, 2229330, 2101460, 1982211, 1872249, 1771561, 1679644, 1595984, 1520294, 1452194, 1390938, 1335763, 1286508, 1243593, 1207298, 1177174, 1152152, 1131017, 1112760, 1096688, 1082458, 1070012, 1059385, 1050640, 1044012, 1039959, 1038764, 1040046, 1042926, 1046925, 1052615, 1061203, 1073461, 1089015, 1106419, 1123578, 1138197, 1148404, 1153553, 1154654, 1153983, 1154141, 1157111, 1163707, 1173647, 1186305, 1201591, 1220077, 1242189, 1267504, 1295007, 1323884, 1353806, 1384581, 1415965, 1447980, 1481135, 1516111, 1553303, 1592886, 1635232, 1681080, 1731218, 1786058, 1845538, 1909264, 1976634, 2046822, 2118789, 2191351, 2263217, 2332939, 2398932]
50404B398932O0781N4436M7327L9615L1217K1828J0944j836j6354l1738m6831
50393B568321o0709p2751q2409q9174r2671r2711q9299q2765p3823o3394n2280
50382A716335m0982k9650j8208o706M274J3818K1323K6732K9982L0541K7767K1541
50370A796767J2281O91j2230k5155l6901m6862n4714n9974o2333o2243o0718n8523
50358A330086n5952n3241n0667m8204m5558m2574l9273l5501l1062k6130k1131
50347H80793j6114j0813n412p37K537M580O110P693R245R865Q196L689k340p489
50333H89803j0368j1450j1758j1471j0307q606p146o124m977l264j297K33R93
50320H04261J328J948L143M302M467L565K743L149M711O482P972R547J1497J3307
$$ y = [2398932, 2459713, 2514149, 2561476, 2601091, 2632308, 2654136, 2665080, 2663244, 2646890, 2615152, 2568321, 2507612, 2434861, 2352452, 2263278, 2170607, 2077896, 1988597, 1905832, 1832009, 1768615, 1716335, 1675353, 1645703, 1627495, 1620789, 1625063, 1638881, 1660204, 1686936, 1716918, 1747459, 1775226, 1796767, 1809048, 1809739, 1797509, 1772354, 1735453, 1688591, 1633877, 1573903, 1511570, 1449327, 1388609, 1330086, 1274134, 1220893, 1170226, 1122022, 1076464, 1033890, 994617, 959116, 928054, 901924, 880793, 864679, 853866, 848454, 847717, 850254, 854834, 860944, 868637, 877882, 887747, 895943, 899632, 897292, 889803, 879435, 867985, 856227, 844756, 834449, 825843, 818697, 812573, 807596, 804332, 803035, 803268, 804261, 805589, 807537, 810680, 814982, 819449, 823014, 825757, 828906, 833617, 840099, 848071, 857618, 869115, 882422]
50306H82422J4214J4236J4221J4740J5331J5139J4176J3364J3315J3617J3694
50295A038469J3646J3691J3332J2017J0306R282Q974Q558Q200R296J2421J6576
50283A174768K1186K7286L4807L9458L4690J7795o682k9987m5233n0795m9166
50272A168127m3719l6557k8664k1076j5010j0770p303l531L16L307N447P865J1412
50259A029844J5772K0082K3829K7125L0567L4963M0583M6585N1661N5327N8020
50248A434358N9861N9987N7469N2348M5416L7514K9536K2629J7660J4584J2697
50237A844059J1246R277N177k692j4529k8700m3087n6379o7812p6275q0577q0523
50225A419185p7076p1258o3561n4608m5670l7861l1298k5790k2073k1358k3564
$$ y = [882422, 896636, 910872, 925093, 939833, 955164, 970303, 984479, 997843, 1011158, 1024775, 1038469, 1052115, 1065806, 1079138, 1091155, 1101461, 1110743, 1119717, 1128275, 1136475, 1145771, 1158192, 1174768, 1195954, 1223240, 1258047, 1297505, 1332195, 1349990, 1343308, 1313321, 1268088, 1217293, 1168127, 1124408, 1087851, 1059187, 1038111, 1023101, 1012331, 1005028, 1001497, 1001813, 1005120, 1010567, 1018432, 1029844, 1045616, 1065698, 1089527, 1116652, 1147219, 1182182, 1222765, 1269350, 1321011, 1376338, 1434358, 1494219, 1554206, 1611675, 1664023, 1709439, 1746953, 1776489, 1799118, 1816778, 1831362, 1844059, 1855305, 1864582, 1869759, 1867067, 1852538, 1823838, 1780751, 1724372, 1656560, 1580285, 1499708, 1419185, 1342109, 1270851, 1207290, 1152682, 1107012, 1069151, 1037853, 1012063, 989990, 968632, 945068]
50214I45068k6739k8657k8488k6709k4051k0951j7691j4522j1737r742q812q660
50202G18309q631q436q299q255p844o843n772n247n320n744o416p056p069o269
50188F21108n308m799m494l938l417l426l602l135k035j051m98p1L01M36O74J653
50172E88398L148M117M209M300N124O250O928P200P566Q149Q839R769J0991J2103
50158F87091J2727J3122J3827J4945J6162J7213J7948J8261J8302J8511J9038
50147H67147J9471J9535J9732K0792K2786K5363K8638L3247L9507M7138N5862
50136A199218O5810P7027Q8882J00123J09407J15663J18090J16079J09497R9351
50126B199147Q8057P8385P1687O7325O3972O0947N7690N2511M2880K7298O385
$$ y = [945068, 918329, 889672, 861184, 834475, 810424, 789473, 771782, 757260, 745523, 735781, 726969, 718309, 709678, 701242, 692943, 684688, 676844, 670001, 664229, 658982, 653662, 647918, 641502, 634446, 627377, 621108, 615800, 611001, 606507, 602569, 599152, 595726, 592124, 588989, 586954, 585903, 585405, 585334, 585635, 586071, 586745, 588398, 591546, 595663, 599872, 604172, 609296, 615546, 622474, 629674, 637240, 645389, 654228, 663997, 674988, 687091, 699818, 712940, 726767, 741712, 757874, 775087, 793035, 811296, 829598, 848109, 867147, 886618, 906153, 925885, 946677, 969463, 994826, 1023464, 1056711, 1096218, 1143356, 1199218, 1265028, 1342055, 1430937, 1531060, 1640467, 1756130, 1874220, 1990299, 2099796, 2199147, 2287204, 2365589, 2437276, 2504601, 2568573, 2629520, 2687210, 2739721, 2782601, 2809899, 2816284]
50115B816284j7807m2901o6528q6516j01599j11851j18025j20582j19621j15445
50105A915409j08766j00418r1168q1627p2034o2267n2542m3965l7762l3889l0985
50094A199986k7860k4569k1715j9337j7054j4891j3206j1950j0684r390q657q866
50082A011807r689j0588j1443j2413j3537j4673j5612j6080j5892j5186j4269
50071H62425j3154j1669j0016q753p948o935n200l093j257J91J448K466L154L802
50057H05461M702N630O201O490O750O802O308N485M851M437L880L195K739K427
50043H75358J746N99n00j183j552j707j580j315j151q87r5J057J965K662L845
50028H77262N646P268Q265R229J0729J2457J4179J6570K0189K4318K7941L1482
$$ y = [2816284, 2798477, 2755576, 2689048, 2602532, 2500933, 2389082, 2271057, 2150475, 2030854, 1915409, 1806643, 1706225, 1615057, 1533430, 1461396, 1399129, 1346587, 1302622, 1264860, 1230971, 1199986, 1172126, 1147557, 1125842, 1106505, 1089451, 1074560, 1061354, 1049404, 1038720, 1029330, 1020673, 1011807, 1002118, 991530, 980087, 967674, 954137, 939464, 923852, 907772, 891880, 876694, 862425, 849271, 837602, 827586, 818833, 810885, 803950, 798750, 795657, 794400, 794591, 796039, 798505, 801659, 805461, 810163, 815793, 821994, 828484, 835234, 842036, 848344, 853829, 858680, 863117, 866997, 870192, 872931, 875358, 877104, 877703, 877203, 876020, 874468, 872761, 871181, 869866, 868715, 867828, 867733, 868790, 870755, 873417, 877262, 882908, 890176, 898441, 907670, 918399, 930856, 945035, 961605, 981794, 1006112, 1034053, 1065535]
50016A065535L6304M2635M9095N4470N8862O2617O4974O4437O0266N3120M4522
50005A656837L6069K9060K4387K2374K2540K3545K3517K0705J3946K761j2560
49994A863181l0721m9534o6606q0022q8519r1556q9646q4356p7521p0396o3620
49983A070684n7593n2466m7915m3470l9067l4968l1227k7644k4185k1113j8500
49972F72536j6016j3299j0419p905o430o245o787o960o152m904m229m319m348
49959E74523l542k010m16Q22J779K774M078N725P393Q528Q760Q187P290O596O309
49944F36796O052N179L554J956J274J361J145j36k327n098q490j2236j5159j6118
49930E97753j5351j4173j3277j2130j0199p914o022m611l389k499k202j995r69
$$ y = [1065535, 1101839, 1144474, 1193569, 1248039, 1306901, 1369518, 1434492, 1498929, 1559195, 1612315, 1656837, 1692906, 1721966, 1746353, 1768727, 1791267, 1814812, 1838329, 1859034, 1872980, 1875741, 1863181, 1832460, 1782926, 1716320, 1636298, 1547779, 1456223, 1366577, 1282221, 1204700, 1134304, 1070684, 1013091, 960625, 912710, 869240, 830173, 795205, 763978, 736334, 712149, 691036, 672536, 656520, 643221, 632802, 624897, 618467, 612222, 605435, 598475, 592323, 587419, 583190, 578871, 574523, 570981, 568971, 568555, 569377, 571156, 573930, 578008, 583733, 591126, 599654, 608414, 616601, 623891, 630487, 636796, 642848, 648027, 651581, 653537, 654811, 656172, 657317, 657181, 654854, 649756, 641266, 629030, 613871, 597753, 582402, 568229, 554952, 542822, 532623, 524709, 518687, 514076, 510687, 508188, 505986, 503991, 503022]
49917E03022Q78K426K832K538K473K853L280L651M216M931N393N473N519N862
49903E55347O477P249Q194R343J0541J1421J1381R888P169M390K608J615M24j214
49889F44833k538l120l663n013p052r077j0711j1909j2520j2512j2325j2336j2143
49876E29914j0982q795o404m579l380k460j548n94L03J000J466J856K299K784
49862E00880L365M227N340O379P194Q078R188J0076J0253R972R820R748R149P843
49848F11512O325M994L701K259Q90j57j003j993l283m800o297p447q009p995p460
49833E81237o355m847l604l178l197k760j664o52k63q2N42J572K499L152L839
49818E66239M881O259P576Q261Q053P388O967O810O282N169M160L793L495K359
$$ y = [503022, 503900, 506326, 509158, 511696, 514169, 517022, 520302, 523953, 528169, 533100, 538493, 543966, 549485, 555347, 561824, 569073, 577267, 586610, 597151, 608572, 619953, 629841, 637010, 641400, 644008, 645623, 646047, 644833, 642295, 639175, 635512, 630499, 623447, 614370, 603659, 591750, 579230, 566718, 554393, 542057, 529914, 518932, 510137, 503733, 499154, 495774, 493314, 491766, 491172, 491475, 492475, 493941, 495797, 498096, 500880, 504245, 508472, 513812, 520191, 527385, 535463, 544651, 554727, 564980, 574952, 584772, 594520, 603669, 611512, 617837, 622831, 626532, 628791, 629681, 629524, 628521, 626528, 623245, 618445, 612148, 604701, 596692, 588697, 581237, 574882, 570035, 566431, 563253, 560056, 557296, 555632, 554980, 554717, 554635, 555177, 556749, 559248, 562400, 566239, 571120, 577379, 584955, 593216, 601269, 608657, 615624, 622434, 628716, 633885, 638045, 641838, 645333, 647692]
$$ [...]
##END NTUPLES=NMR SPECTRUM
##END=
