
##TITLE=AC1226_COLAHDE102_6079957_XPojYAU1Wp
##JCAMPDX= 6.0         $$ Bruker NMR JCAMP-DX V2.0
##DATA TYPE= NMR SPECTRUM
##DATA CLASS= NTUPLES
##ORIGIN= BRUKER
##OWNER= Administrator
$$ 1.72 TOPSPIN		Version 2.1
$$ 2012-05-08 20:50:25.921 -0500  Administrator@TOPSPIN
$$ Compression mode = diff/dup
##.OBSERVE FREQUENCY= 400.13188235
##.OBSERVE NUCLEUS= ^1H
##.ACQUISITION MODE= SIMULTANEOUS (DQD)
##.ACQUISITION SCHEME= undefined
##.AVERAGES= 8
##.DIGITISER RES= 22
##SPECTROMETER/DATA SYSTEM= spect
##.PULSE SEQUENCE= zg30
##.SOLVENT NAME= COFFEE_meoh
##.SHIFT REFERENCE= INTERNAL, COFFEE_meoh, 1, 14.98061
##AUDIT TRAIL= $$ (NUMBER, WHEN, WHO, WHERE, PROCESS, VERSION, WHAT)
$$ ##TITLE= Audit trail, TOPSPIN		Version 2.1
$$ ##JCAMPDX= 5.01
$$ ##ORIGIN= Bruker BioSpin GmbH
$$ ##OWNER= Administrator
$$ $$ C:\Bruker\TOPSPIN/data/COFFEE/nmr/AC1226_COLAHDE102_6079957_XPojYAU1Wp/10/pdata/1/auditp.txt
$$ ##AUDIT TRAIL=  $$ (NUMBER, WHEN, WHO, WHERE, PROCESS, VERSION, WHAT)
(   1,<2012-05-08 20:50:18.968 -0500>,<Administrator>,<TOPSPIN>,<go>,<TOPSPIN 2.1>,
      <created by zg
	started at 2012-05-08 20:49:12.421 -0500,
	POWCHK enabled, PULCHK disabled,
       configuration hash MD5:
       AF F2 23 6B 01 CD 40 DD E5 A1 38 A0 06 EA F7 77
       data hash MD5: 64K
       D6 6F 5D 1E 76 A2 9E 43 5D D8 E9 AE D7 8B 46 0F>)
(   2,<2012-05-08 20:50:21.796 -0500>,<Administrator>,<TOPSPIN>,<proc1d>,<TOPSPIN 2.1>,
      <Start of raw data processing
       efp LB = 0 FT_mod = 6 PKNL = 1 PHC0 = 0 PHC1 = 0 SI = 32K 
       data hash MD5: 32K
       6A 39 81 61 7D 52 5A C3 92 DD 23 85 3B 18 0A 62>)
(   3,<2012-05-08 20:50:22.109 -0500>,<Administrator>,<TOPSPIN>,<proc1d>,<TOPSPIN 2.1>,
      <pk PHC0 = 212.2998 PHC1 = 0 
       data hash MD5: 32K
       A8 2A AC 94 DA B0 3E 67 BC D1 A4 BC F4 29 8D 18>)
(   4,<2012-05-08 20:50:22.187 -0500>,<Administrator>,<TOPSPIN>,<proc1d>,<TOPSPIN 2.1>,
      <abs ABSG = 1 
       data hash MD5: 32K
       E7 C7 3D C6 72 F7 33 71 C9 E8 BD 9A 65 92 F0 11>)
(   5,<2012-05-08 20:50:22.203 -0500>,<Administrator>,<TOPSPIN>,<proc1d>,<TOPSPIN 2.1>,
      <abs ABSG = 2 
       data hash MD5: 32K
       8D C3 28 E7 45 75 A9 C4 3B 58 F3 FE BC DA 5C 0C>)
(   6,<2012-05-08 20:50:22.234 -0500>,<Administrator>,<TOPSPIN>,<proc1d>,<TOPSPIN 2.1>,
      <abs ABSG = 3 
       data hash MD5: 32K
       60 0D 5C BA BD 5C 72 53 B8 03 AD 1D 9E F4 87 B4>)
(   7,<2012-05-08 20:50:22.265 -0500>,<Administrator>,<TOPSPIN>,<proc1d>,<TOPSPIN 2.1>,
      <abs ABSG = 4 
       data hash MD5: 32K
       CC 2C 54 FD 1B 97 9D 4F DC 17 76 D1 3E D1 09 5D>)
(   8,<2012-05-08 20:50:22.296 -0500>,<Administrator>,<TOPSPIN>,<proc1d>,<TOPSPIN 2.1>,
      <abs ABSG = 5 
       data hash MD5: 32K
       EA 93 82 BD 09 B4 49 0F 82 A3 00 B0 9A 19 FE E7>)
$$ ##END=
$$ 
$$ $$ hash MD5
$$ $$ 16 31 0B 8B 75 76 71 8A 3D BA 99 76 04 8E E0 FF
##$RELAX= 
##$RELAX= 
##$RELAX= 
##$RELAX= 
##$RELAX= 
##$RELAX= 
##$RELAX= 
$$ Bruker specific parameters
$$ --------------------------
$$ [...]
##$TP= (0..7)
150 150 150 150 150 150 150 150
##$TP07= 0
##$TPNAME0= <>
##$TPNAME1= <>
##$TPNAME2= <>
##$TPNAME3= <>
##$TPNAME4= <>
##$TPNAME5= <>
##$TPNAME6= <>
##$TPNAME7= <>
##$TPOAL= (0..7)
0.5 0.5 0.5 0.5 0.5 0.5 0.5 0.5
##$TPOFFS= (0..7)
0 0 0 0 0 0 0 0
##$TUNHIN= 0
##$TUNHOUT= 0
##$TUNXOUT= 0
##$USERA1= <user>
##$USERA2= <user>
##$USERA3= <user>
##$USERA4= <user>
##$USERA5= <user>
##$V9= 5
##$VALIST= <valist>
##$VCLIST= <CCCCCCCCCCCCCCC>
##$VD= 0
##$VDLIST= <DDDDDDDDDDDDDDD>
##$VPLIST= <PPPPPPPPPPPPPPP>
##$VTLIST= <TTTTTTTTTTTTTTT>
##$WBST= 1024
##$WBSW= 4
##$XGAIN= (0..3)
0 0 0 0
##$XL= 0
##$YL= 0
##$YMAX_a= 531636
##$YMIN_a= -640637
##$ZGOPTNS= <>
##$ZL1= 120
##$ZL2= 120
##$ZL3= 120
##$ZL4= 120
##$ABSF1= 14.98061
##$ABSF2= -5.57192
##$ABSG= 5
##$ABSL= 3
##$ALPHA= 0
##$AQORDER= 0
##$ASSFAC= 0
##$ASSFACI= 0
##$ASSFACX= 0
##$ASSWID= 0
##$AUNMP= <proc_prof1d_extract_pilot.lims>
##$AXLEFT= 0
##$AXNAME= <>
##$AXNUC= <1H>
##$AXRIGHT= 0
##$AXTYPE= 0
##$AXUNIT= <>
##$AZFE= 0.1
##$AZFW= 0.1
##$BCFW= 0
##$BC_mod= 0
##$BYTORDP= 0
##$COROFFS= 0
##$CY= 15
##$DATMOD= 1
##$DC= 0
##$DFILT= <>
##$DTYPP= 0
##$F1P= 0
##$F2P= 0
##$FCOR= 0.5
##$FTSIZE= 32768
##$FT_mod= 6
##$GAMMA= 0
##$GB= 0
##$INTBC= 1
##$INTSCL= 1
##$ISEN= 128
##$LB= 0
##$LEV0= 0
##$LPBIN= 0
##$MAXI= 10000
##$MC2= 0
##$MEAN= 0
##$ME_mod= 0
##$MI= 0
##$NCOEF= 0
##$NC_proc= -8
##$NLEV= 6
##$NOISF1= 0
##$NOISF2= 0
##$NSP= 0
##$NTH_PI= 0
##$NZP= 0
##$OFFSET= 14.98061
##$PC= 1
##$PHC0= 212.2998
##$PHC1= 0
##$PH_mod= 1
##$PKNL= yes
##$PPARMOD= 0
##$PPDIAG= 0
##$PPIPTYP= 0
##$PPMPNUM= 2147483647
##$PPRESOL= 1
##$PSCAL= 4
##$PSIGN= 0
##$PYNMP= <proc.py>
##$REVERSE= no
##$SF= 400.13
##$SI= 32768
##$SIGF1= 0
##$SIGF2= 0
##$SINO= 400
##$SIOLD= 32768
##$SPECTYP= <>
##$SREGLST= <1H.CDCl3>
##$SSB= 0
##$STSI= 32768
##$STSR= 0
##$SW_p= 8223.68421052632
##$SYMM= 0
##$S_DEV= 0
##$TDeff= 65536
##$TDoff= 0
##$TI= <>
##$TILT= no
##$TM1= 0
##$TM2= 0
##$TOPLEV= 0
##$USERP1= <user>
##$USERP2= <user>
##$USERP3= <user>
##$USERP4= <user>
##$USERP5= <user>
##$WDW= 1
##$XDIM= 32768
##$YMAX_p= 441602165
##$YMIN_p= -805345
##$CURPLOT= <Network HP LaserJet P1505>
##$CURPRIN= <$Network HP LaserJet P1505>
##$DFORMAT= <normdp>
##$LAYOUT= <+/1D_H.xwp>
##$LFORMAT= <normlp>
##$PFORMAT= <normpl>
##$SURQMSG= 1
$$ End of Bruker specific parameters
$$ ---------------------------------
##NTUPLES= NMR SPECTRUM
##VAR_NAME=  FREQUENCY,     SPECTRUM/REAL,   SPECTRUM/IMAG
##SYMBOL=    X,             R,               I
##VAR_TYPE=  INDEPENDENT,   DEPENDENT,       DEPENDENT
##VAR_FORM=  AFFN,          ASDF,            ASDF
##VAR_DIM=   32768,         32768,           32768
##UNITS=     HZ,            ARBITRARY UNITS, ARBITRARY UNITS
##FACTOR=    0.250966925370066, 1,           1
##FIRST=     8223.43324360095, -8358,        -203846
##LAST=      0,             -137292,         -71741
##MIN=       0,             -805345,         0
##MAX=       8223.43324360095, 441602165,    0
$$ Real data points
##PAGE= N=1
##DATA TABLE= (X++(R..R)), XYDATA
$$ [...]
19504f3218D8806J2718o85b20474l399O3842q5819o2193B34712l7657J24003b85969
19491b28442M1884h7774A5483R8573a47990F3613a34296K9565k41048a47354F14
19479A5387a80005L953k21251J92737A62242n8005f0599A15138a467F4533Q488
19468G3021a63639P9099j49141L8886e3290k77779a21278E9127N1050g6270j113
19457g7383C527b33405N1415N7880J1661A41855n6499b61889M0748d6207n5015
19446a01222n8026B85638a11081j28436L9445a0874k1164k17C83694a90806b7020
19434b4020j05555j10299f4755H223K5933a83530g0476B44286a49950m7742R5150
19423a02542j0358c7278A15367A8605a30150a8456k22136L7979K0679G5764d5765
$$ y = [-63218, 48806, 61524, 60839, -220474, -223873, -160031, -245850, -308043, 234712, 197055, 321058, -285969, -228442, -186558, -87774, 15483, 114056, -147990, 63613, -134296, -104731, -345779, -147354, 614, 15387, -180005, -176052, -397303, -204566, 162242, 104237, -60599, 115138, -1467, 64533, 73021, -163639, -84540, -233681, -194795, -53290, -331069, -121278, 59127, 110177, -76270, -77383, 3527, -233405, -181990, -124110, -112449, 141855, 85356, -261889, -221141, -46207, -101222, -159248, 285638, -111081, -239517, -200072, -10874, -32038, -32255, 383694, -190806, -27020, -24020, -129575, -239874, -64755, 8223, 34156, -183530, -70476, 244286, -149950, -197692, -102542, -112900, -37278, 115367, 18605, -130150, -18456, -240592, -202613, -181934, 75764, -45765]
19411F1502J1543b65931I8714a49196J0161B772b46333N9596B44992F5100d74588
19399A4716a28824j49654H6383k8729a57145g2152p8247A47510a35919p558C26219
19387b27697I1962O9486o7632d3787k88494b2292l1372j46445C6373a26405A31533
19375B24965a12424b2643B07219b56688k0686A58898C5544a72824A18648k3069
19365I5579i6456l99447i2744P906G7429a82035A05081b0476I2020J19961a96021
19353g4695a193l70283J26596B07728c93165B0714a03160L1139j55199D0441J1200
19342E1641N405J50828b82694A85685b26131M1184j43569E2282c8309B88973j05042
19331A83931e742j31917j38254b4558j18482m3407O9209B6921J29651e4384K6266
$$ y = [61502, 73045, -265931, 98714, -149196, -139035, 2772, -246333, -186737, 244992, 65100, -474588, 14716, -128824, -278478, 86383, 57654, -157145, -72152, -150399, 147510, -135919, -143477, 326219, -227697, 91962, 161448, 93816, -43787, -332281, -22292, -53664, -200109, 36373, -126405, 131533, 224965, -112424, -22643, 207219, -256688, -277374, 158898, 35544, -172824, 118648, 95579, -96456, -495903, -92744, -84838, 77429, -182035, 105081, -20476, 92020, 211981, -196021, -74695, -1193, -371476, -244880, 207728, -393165, 20714, -103160, -72021, -227220, 40441, 51641, 57046, 207874, -282694, 185685, -226131, -184947, -328516, 52282, -38309, 288973, 183931, -5742, -137659, -275913, -24558, -143040, -186447, -117238, 26921, 156572, -54384, -28118]
19320b8118j63057e8821A22308d64875g7227B10290b0262k30170C6442d65114
19309d27433J12229A03408B1658J7066a78507B65028o1642L5031c41256J53530
19299a87726A66466b9088A69856K2204J83299E0720d0000l31478J9466A2296f1294
19287g9328A12769a02436r1729c2563j35817b2207Q339j77416N9104p3250c3907
19275a99603A63134F6904M5299e3500o8070k15225K1729Q4401A9491d3424q8778
19264a32202b7866A67320b20654d599B1366R6660c09401a31687c0710k36934A46406
19252b86062B54048J30875b24892H6800b93150F6393a77740M6428j09520J7386
19242b23446f126j26003F5232g4440n9630f5854A62899l0988c04915R280o3844
$$ y = [-28118, -191175, -58821, 122308, -464875, -77227, 210290, -20262, -250432, 36442, -465114, -427433, -315204, 103408, 21658, 38724, -178507, 265028, 203386, 238417, -341256, -187726, 166466, -29088, 169856, 192060, 375359, 50720, -40000, -371478, -352012, 12296, -61294, -79328, 112769, -102436, -194165, -32563, -168380, -22207, -13868, -191284, -132180, -205430, -33907, -199603, 163134, 66904, 112203, -53500, -121570, -336795, -315066, -230665, 19491, -43424, -132202, -27866, 167320, -220654, -4599, 21366, 118026, -309401, -131687, -30710, -267644, 146406, -286062, 254048, 384923, -224892, 86800, -293150, 66393, -177740, -131312, -240832, -223446, -6126, -132129, 65232, -74440, -134070, -65854, 162899, 131911, -304915, -295635, -359479]
19231c59479H073a51986F5651b64609C5929j2586J2723c18004A86474a00262c9766
19219a02945I5405a46455j92207a49382G4725b98817H9865g258A30363a04315
19208B20345a84920J2192E29b36242A83845d8580C2762a82674o0600h8446j56472
19197b44918r8084h3727q6589e1154j49399h0083j53484B86780a25210L793M2121
19186g9296C72390b09485a03714d6401n29747A63603c8935j84484a06575A87876
19175c3453j4674D1869A0727a59577I8598a56544D4322b06205P642H1960a59408
19163d30449D07K24526b70396A71866b39199M7446I3629n536c18423g5838p8791
19152a54629p6020F4519J46276a53643F3845k7594a0882H9869j902b07565H870
$$ y = [-359479, 8073, -151986, 65651, -264609, 35929, 23343, 36066, -318004, 186474, -100262, -39766, -102945, 95405, -146455, -338662, -149382, 74725, -298817, 89865, -7258, 130363, -104315, 220345, -184920, -172728, 529, -236242, 183845, -48580, 32762, -182674, -243274, -88446, -244918, -343002, -83727, -170316, -51154, -200553, -80083, -233567, 286780, -125210, -121417, -79296, 372390, -209485, -103714, -46401, -576148, 163603, -38935, -223419, -106575, 187876, -33453, -48127, 41869, 10727, -159577, 98598, -156544, 44322, -206205, -198563, 81960, -159408, -430449, 407, 224933, -270396, 171866, -239199, -191753, 93629, 88093, -318423, -75838, -154629, -230649, 64519, 210795, -153643, 63845, 36251, -10882, 89869, 87967, -207565, 8870]
19140F1980Q0539i3343F864b57379f1701D27b12441B23026E1395b03558R2727
19129a10831A75829b420A39267J43196H9428a46816B34352a6802r4072k50892
19119c61766c0866k32985M3695a04952H6560d2974q6779J1690B47340c03381B01136
19107b47571N7748G6869a36069m42074b24996j0796B18561b59917b0727C3993
19096c24619f2723k64261A50087B348a7937B29729G8521K4084b4218j95718Q0129
19085a39807e2855C35716c12077a44086j63456J43720d885j4331m8345j32835
19075b00396B23190b20889F7922O2272B6743P3550J56187c22994A93351a30657
19064b1952k3962A50371n0094k8163f1364D44780k00343a61875f6617E4863Q8567
$$ y = [61980, 142519, -93343, 6864, -257379, -61701, 427, -212441, 223026, 51395, -203558, -110831, 175829, -2420, 139267, 282463, 89428, -146816, 234352, -16802, -110874, -361766, -30866, -263851, -220156, -104952, 86560, -42974, -129753, -118063, 247340, -303381, 201136, -247571, -189823, 76869, -136069, -578143, -224996, -235792, 218561, -259917, -20727, 33993, -324619, -62723, -326984, 150087, 2348, -17937, 229729, 78521, 102605, -24218, -219936, -139807, -52855, 335716, -312077, -144086, -307542, -163822, -4885, -19216, -67561, -200396, 223190, -220889, 67922, 130194, 26743, 100293, 256480, -322994, 193351, -130657, -21952, -45914, 150371, 100277, 72114, -61364, 444780, 244437, -161875, -66617, 54863, 143430]
19053A43430m4686a78819B8374L4584k9125c71392D0990K43796i9467d4822k79852
19042c24674J06538I0226b23432K3893A3089a4511I20a27433j07528A48138J89635
19031C37773B9740e12779F5724a98935D6786R3793a95102Q9524j2901A10934j5506
19020I5428j9057P1719l5099M3030g5387F8887J21594G7027c53449B83038c29502
19008a35237B45113a29996d7304A2110f7329g737A20365e5306j06311H0062J0898
18997I0960a46792G7798c3762j03665A00293a7435A00824K06796j0184D8152H699
18985A54136b22570j02321a42221A866J55570F779b53547P2723A67920f7426C55277
18973i368A75571b2224I9107b04005c5141C46644d49868A88495a29810e979A63334
$$ y = [143430, 98744, -178819, 28374, 62958, 33833, -371392, 40990, 284786, -99467, -44822, -324674, -218136, 90226, -223432, -199539, 13089, -14511, 920, -127433, -234961, 148138, 337773, 29740, -512779, 65724, -198935, 46786, 140579, -195102, -105578, -118479, 110934, 95428, 76371, 148090, 112991, 156021, -75387, 68887, 190481, 77027, -353449, 283038, -329502, -135237, 245113, -129996, -47304, 12110, -67329, -7737, 120365, -55306, -161617, 80062, 90960, -146792, 77798, -33762, -137427, 100293, -17435, 100824, 307620, 297436, 48152, 8699, 154136, -222570, -324891, -142221, 1866, 157436, 6779, -253547, -180824, 167920, -67426, 355277, -9368, 175571, -22224, 99107, -204005, -35141, 346644, -449868, 188495, -129810, -5979, 163334]
18961B52010q2417d63350e8143C2913c8641B78940c05434D8704h4402A98431b53991
18949c22891a30803h976p4746j16718A32113a42620l5408B10035a27494J4544
18939a12950O797B6628b0499p6786k41786A1701K00239c04597B22780N9257a86008
18927g801F876J39701b05379O6311m0511c313k47927A15366l9981e0780B67545
18915d0091A82514b41872C1491N3199b51681A70498c755j50988E786a58568B76388
18903c16220C45735h0470j50370J08408q4259B23637C2587f537A42661h4443B54879
18891a22003k41874k30145b09641C0331a74410N243I6509k1512g8141A80398n2658
18880A27740i4141m8033E1646a87176A50595g8561j84921a21044D0845a23152
$$ y = [252010, 169593, -463350, -58143, 32913, -38641, 278940, -305434, 48704, -84402, 198431, -253991, -322891, -130803, -8976, -83722, -200440, 132113, -142620, -178028, 210035, -127494, -112950, -106153, 26628, -20499, -97285, -339071, 11701, 211940, -304597, 222780, 282037, -186008, -7801, 6876, 146577, -205379, -139068, -179579, -3313, -251240, 115366, 75385, -50780, 267545, -40091, 182514, -241872, 31491, 84690, -251681, 170498, -3755, -154743, 5786, -158568, 276388, -316220, 345735, -80470, -230840, -122432, -206691, 223637, 32587, -6537, 142661, -84443, 254879, -122003, -363877, -594022, -209641, 30331, -174410, -169167, 96509, 74997, -78141, 180398, 127740, -94141, -142174, 51646, -187176, 150595, -78561, -263482, -121044, 40845, -123152]
18869c08981b636j36045D7660a1933B2176I965K5277G519b15244C13539b08558
18857h2412k08650b8947B6255K2880g7845A73160a22066j44366h8207B11614F7536
18845a75894n6658D5787J40663a0542k22837A58585i9717C17418A25936C3932
18834e9416C9699a73436D14874b37758I7398J94266l1274b23682B91463j08552
18824A82911m4877B1109b86883a07801D0226j5864b16923M4239C16292c0448k60593
18813b91041g3792H0304A3866b14541R7548m4236F0653A6293J99228q7840a09728
18801b13163A7042J4247K3532b40419c7209j10807D8538A6296L547L6838h725
18789b4257q6660K7415C5570a08863M2195j20679G9097h457F8463N20283A17237
$$ y = [-308981, -2636, -138681, 47660, -11933, 22176, 9965, 35242, 7519, -215244, 313539, -208558, -82412, -291062, -28947, 26255, 49135, -77845, 173160, -122066, -266432, -88207, 211614, 67536, -175894, -232552, 45787, 186450, -10542, -233379, 158585, -99717, 317418, 125936, 33932, -59416, 39699, -173436, 414874, -237758, 97398, 291664, 260390, -223682, 291463, 182911, 138034, 21109, -286883, -107801, 40226, 24362, -216923, -172684, 316292, -30448, -291041, -73792, 80304, 13866, -214541, -116993, -161229, 60653, 16293, 215521, 127681, -109728, -213163, 17042, 31289, 54821, -240419, -37209, -148016, 48538, 16296, 19843, 56681, -8725, -24257, -110917, -83502, 35570, -108863, -66668, -187347, 79097, -8457, 68463, 588746, 117237]
18777b44083j6165a12130r9166G3796d47440b5098j89410d8173j68854j4877a00088
18765a62820M6312j299I4797i9159K7961l44758A11209c79710L8681a20017k6961
18754a46978A05235a12978k3599f0995B7238a96493c676F0864a93723e6004A6726
18742I3699i9773b1218k26346e7518a3779e086l6062j72389A09666O5635b63128
18730I5577a46749o0691H8864h7672o4365D3792J7981a53528F9048f4990n7280
18719a22270c8066k9471B84372a73723A27732N5774f3210G2482Q7786a08373r6439
18708b04812F4791a64945D0027J48269a07717A4765J28522K4489k495a06160p179
18697a13339d0730p7982B52242G6025a43725L9822Q102h100B3103h9357d4596
$$ y = [-244083, -260248, -112130, -211296, 73796, -447440, -25098, -214508, -48173, -217027, -231904, -100088, -162820, -116508, -117807, 94797, -99159, -71198, -415956, 111209, -379710, -341029, -120017, -146978, 105235, -112978, -136577, -60995, 27238, -196493, -3676, 60864, -193723, -56004, 16726, 93699, -99773, -21218, -247564, -57518, -13779, -5086, -41148, -213537, 109666, 175301, -263128, 95577, -146749, -207440, 88864, -87672, -152037, 43792, 61773, -153528, 69048, -64990, -122270, -38066, -67537, 284372, -173723, 127732, 183506, -63210, 72482, 160268, -108373, -204812, 64791, -164945, 40027, 188296, -107717, 14765, 143287, 167776, 165281, -106160, -113339, -40730, -118712, 252242, 76025, -143725, -103903, -95801, -8100, 23103, -89357, -44596]
18685F4603a03522a3417r8272j63918Q1704B30456a52346k32276a08356j55099
18675b63455B50345d45504B8535J51594E667R8306a9808B23523c24144a48131
18664f464j66404D0641d8965l27266I9804I120N6756e5643a4131m6226j49981
18653b10338A33610h7950c2115r1958d0764O217b130k46244B42136r4352a45871
18641a12062A22775f3941j41048H7800b71405d3350a5182c32A05281K186a54979
18629a98478A16638a17587j67956a08363F8260I892i7403A61347b06143I6550
18618a18460C89280a433k63071g0216l25866F3014A8931c03643m7880i5565A06246
18606a94336A66308b14646B20302b79538J12574c6126m9848I0832k2297K04124
$$ y = [64603, -103522, -13417, -111689, -275607, -193903, 230456, -152346, -384622, -108356, -263455, 250345, -445504, 28535, 180129, 5667, 103973, -19808, 223523, -324144, -148131, -6464, -172868, 40641, -48965, -376231, 99804, 9120, 65876, -55643, -14131, -60357, -210338, 133610, -87950, -32115, -124073, -40764, -34547, -2130, -248374, 242136, 147784, -145871, -112062, 122775, -63941, -204989, 87800, -271405, -43350, -15182, -332, 105281, 107467, -154979, -198478, 116638, -117587, -285543, -108363, 68260, 9892, -97403, 161347, -206143, 96550, -118460, 389280, -1433, -264504, -70216, -396082, 63014, 18931, -303643, -351523, -95565, 106246, -194336, 166308, -214646, 220302, -279538, -166964, -36126, -85974, 90832, 68535, 272659]
18596B72659a66276d8544m5491E0013a31186M1828a350C64874c65636h7680A54635
18584d8131a5875B45006Q6101a38893C4304c338D3509I744b91836g7463r7261
18573a74724B56580M3016C4727e8438h715A36338a00170r0702j04848a47565m740
18562a52305P0949B62476A19480D0954K31609N5950a78208E3068e05413b46295
18551a15089r1647A17793a27998a3238p3261N187E350a44618m8949J0013d6653
18539c04036D7047a24994M9302I6758Q9275E8731a26462c2480A63899b6257B51387
18527C8382o48b25856i1683q8113j61732I3430a83198b7187A63586b71055E336
18515h30k01607A25084c64198B84885f4515P542B8989J8879h8958k20615J9072
$$ y = [272659, -166276, -48544, -94035, 50013, -131186, -89358, -1350, 364874, -365636, -87680, 154635, -48131, -15875, 245006, 331107, -138893, 34304, -3338, 43509, 9744, -291836, -77463, -174724, 256580, 299596, 34727, -58438, -8715, 136338, -100170, -190872, -295720, -147565, -152305, -81356, 262476, 119480, 40954, 272563, 328513, -178208, 53068, -505413, -246295, -115089, -206736, 117793, -127998, -13238, -86499, -81312, 5350, -144618, -193567, -183554, -46653, -304036, 47047, -124994, -75692, 96758, 186033, 58731, -126462, -32480, 163899, -26257, 251387, 38382, 37734, -225856, -91683, -179796, -341528, 93430, -183198, -27187, 163586, -271055, 5336, -830, -202437, 125084, -364198, 284885, -64515, -56973, 28989, 47868, -88958, -309573, -290501]
18504b90501R9103j31153a47762j13220d3603n9212A99842b3807C12989f2489
18493a29301l0994C7809J31585a92726r1844N2153A40567K645f1906a8088j11637
18482a29725j58557A62721a04335j81435e9099A54931d09019a62037A72422d2692
18471h3442j16547N4383A12580a25322J7834F8325e8982D20078e6719A7569b14875
18459D8341a34215k38574i0105j10233C05989a0051n2221H7849c3847A59431B8041
18447f679j9000p5312j56846D9689j6183f5204C3168a43398A082c72447A40979
18435b54686A51880b07265h9117B67600a61965A41837a08826A78201n8492a27541
18424a59144p284P8309a1076B08291f438A11812a50294m19c5596k27451h2679
$$ y = [-290501, -191398, -322551, -147762, -260982, -43603, -102815, 199842, -23807, 312989, -62489, -129301, -160295, 37809, 169394, -192726, -284570, -232417, 140567, 143212, -61906, -18088, -129725, -288282, 162721, -104335, -285770, -59099, 154931, -409019, -162037, 172422, -42692, -83442, -199989, -145606, 112580, -125322, -107488, 68325, -58982, 420078, -56719, 17569, -214875, 48341, -134215, -372789, -90105, -200338, 305989, -10051, -62272, 87849, -33847, 159431, 28041, -6679, -25679, -100991, -257837, 49689, 33506, -65204, 33168, -143398, 1082, -372447, 140979, -254686, 151880, -207265, -89117, 267600, -161965, 141837, -108826, 178201, 119709, -127541, -159144, -166428, -88119, -11076, 208291, -6438, 111812, -150294, -150713, -35596, -263047, -82679]
18412A10062C0461J06422b3255F9684a56038A16050b3636C60904a17167A12955
18401C23943k0562b06296J6704C32247i0791I8981l715a22457B64863a1706j66461
18390a78167H3709a60338f4133p0413D90460A65141P1843b25640H5440a115n058
18379f173k00681I9632b63219a26654A61099a65973f0362A81717i1183a3791E2763
18367a02163B01805p8255l6362J22372c2234A35425b4757A89767J59366i7759
18356c17909B47918p8737C5529P0531g3637n8979j09110B6747K24146j13425N045
18345A42513C9094d0595A7566N8656a08056F5404C2680e35450C1078b85913a05114
18333a201A11689c12051b0446j40213n1960C04869a42504l3473A40578b0363B58603
$$ y = [110062, 30461, 136883, -23255, 69684, -156038, 116050, -23636, 360904, -117167, 112955, 323943, 303381, -206296, -189592, 332247, -90791, 98981, 95266, -122457, 264863, -11706, -178167, 83709, -160338, -64133, -134546, 490460, 165141, 236984, -225640, 85440, -1115, -6173, -206854, 99632, -263219, -126654, 161099, -165973, -60362, 181717, -91183, -13791, 52763, -102163, 201805, 123550, 87188, 209560, -32234, 135425, -24757, 189767, 349133, -97759, -317909, 247918, 169181, 35529, 106060, -73637, -132616, -241726, 26747, 250893, 137468, 142513, 39094, -40595, 17566, 76222, -108056, 65404, 32680, -535450, 31078, -285913, -105114, -1201, 111689, -312051, -20446, -160659, -212619, 304869, -142504, -175977, 140578, -20363, 258603]
18321b50949i2338n7181B32743c95000B46574a24892n4696C038J9386c29958C51747
18309B11208A04118J98537j32356b0434k9500l42265B3845b35823a8550I4600
18298D1247b53810M3143B01033k0535a94303A78861F4561f3700j22832P8143j25234
18287b33623C2211a0736C1643K7637c78033E5128J54958b2689N87C8615J33938
18276A72553g6757a0044j41686B5922K4788b09158M3022i319A43056D4445O3590
18265A08035l7430G398a57328k02501c8181j46409A8932a33463j38941j03123
18255c75527a66363M9041j55613J29017A87096q5166c14291A18793h1797B14479
18244a81370L7328d033l57928a58739A17421j9251d8728D7559f6835A25341E996
$$ y = [-250949, -92338, -149519, 232743, -395000, 246574, -124892, -179588, 3038, 22424, -329958, 351747, 211208, 104118, 302655, 170299, -20434, -49934, -392199, 23845, -235823, -18550, 94600, 41247, -253810, -210667, 201033, 180498, -194303, 178861, 64561, -63700, -186532, -108389, -233623, 32211, -10736, 31643, 59280, -378033, 55128, 210086, -22689, -22102, 38615, 172553, -76757, -10044, -151730, 25922, 50710, -209158, -166136, -9319, 143056, 44445, 108035, 70605, 7398, -157328, -359829, -38181, -184590, 18932, -133463, -272404, -375527, -166363, -117322, -272935, -143918, 187096, 101930, -314291, 118793, -81797, 214479, -181370, -144042, -4033, -361961, -158739, 117421, 98170, -48728, 47559, -66835, 125341, 5996]
18232H956J24549j1967j6682b02653B12087m7764a67436M6592j05361N3545B4573
18220A10776J2689b49892B01752a94108H6473O2704e4937B5504h4140D5465b06240
18208i787p9232L8729j24164O5632M8692A05322J34399a07951A4771C70M1371
18197D1741a15829l964K3576A61992P3812a44194j28317h7537j28853G0169O3298
18186A33467C3611e2594k55964A85478m6428b5113j4630j0892A17927a72975j0345
18175a83320M2564I3495A0877K6646a29385C61726b82179C2983J15930c3685A3737
18163B7783J58878B9291B057K57985A13295a27332D762h1503p7803m3353a1097
18151d5867a3500j12131F4951c17212D9060a84410e3876A31952K06517A9088J72315
$$ y = [8956, 133505, 121538, 104856, -202653, 212087, 164323, -167436, -120844, -226205, -172660, 24573, 110776, 123465, -249892, 201752, -194108, 86473, 149177, -54937, 25504, -84140, 45465, -206240, -9787, -89019, -50290, -174454, -108822, -60130, 105322, 239721, -107951, 14771, 370, 41741, -115829, -119793, -96217, 161992, 235804, -144194, -272511, -87537, -216390, 70169, 133467, 33611, -52594, -308558, 185478, 139050, -25113, -39743, -50635, 117927, -172975, -183320, -140756, 93495, 10877, 37523, -129385, 361726, -282179, 32983, 148913, -33685, 13737, 27783, 186661, 29291, 2057, 260042, 113295, -127332, 4762, -81503, -159306, -202659, -11097, -45867, -13500, -125631, 64951, -317212, 49060, -184410, -53876, 131952, 338469, 19088, 191403]
18140A91403b08560C0755c73620B59043a50875k91631A55606h5128j28295A77956
18129E3662h4492A26315a80535g4005r366B3063a06156K8916A62545o6297A3175
18117D7814J42370a79675P167g9593A9607K6902N1469a82525r8535g7966J2355
18106f5611A75755e5501A9363b2543K142m5676j61337i7988F1836M8019a82603
18094a36613C2586L0647J078B5761J53169d12122J51760P9118F8613Q5277a72356
18082e4978p5400c5281D7929a87603C05617J5609a68766O5789A61566g1536C0864
18070b29230M3018o3381j93691D8461R801a02608P437B69327j433C5685l965J70967
18058B02687f3844C7548a48133A03945c9162j7114q8440A94820J19678b30936
$$ y = [191403, -208560, 30755, -373620, 259043, -150875, -442506, 155606, -85128, -213423, 177956, 53662, -84492, 126315, -180535, -74005, -83371, 23063, -106156, -77240, 162545, 96248, 13175, 47814, 190184, -179675, -172508, -79593, 19607, 46509, 97978, -182525, -281060, -77966, -65611, 175755, -55501, 19363, -22543, -20401, -66077, -227414, -97988, 61836, 109855, -182603, -136613, 32586, 63233, 64311, 25761, 178930, -412122, -260362, -181244, 68613, 153890, -172356, -54978, -130378, -35281, 47929, -187603, 305617, 321226, -168766, -102977, 161566, -71536, 30864, -229230, -186212, -249593, -443284, 48461, 58262, -102608, -95171, 269327, 267894, 35685, 31720, 202687, -63844, 37548, -148133, 103945, -39162, -56276, -144716, 194820, 314498, -230936]
18047b5150n9110K7662j50412G5827b20196a02799a8492B8563L0054c0076A95812
18035D2500K27336A18423b6538A58454b13306i6868B46924a4158k30993a0778
18024b96913E9475K2948c13824e4610E3236d0921D44468f5935B13291e0466j38974
18013a89440J9673k10405A12715c39199A81797m7652a93254J72b4987l9768m0743
18002a05498A18499j9581O9708a5583k25332a18786D3558K9480A7619d6370k1132
17991f7502J0394K3735r5561C30063a4237l2962j85515A65411c16487A99712h3832
17979I1330J08421C0998f644A18757a92589B62531n7621b94729a06028c6381j7349
17968e3730a0594B09429a13149J1458k32186A69574A1474c61489a5316j26908
$$ y = [-25150, -84260, -56598, -207010, 75827, -220196, -102799, -18492, 28563, 58617, -30076, 195812, 42500, 269836, 118423, -26538, 158454, -213306, -96868, 246924, -14158, -245151, -10778, -296913, 59475, 82423, -313824, -54610, 53236, -40921, 444468, -65935, 213291, -50466, -189440, -169767, -380172, 112715, -339199, 181797, 134145, -193254, -193082, -24987, -64755, -105498, 118499, 98918, 168626, -15583, -240915, -118786, 43558, 73038, 17619, -46370, -67502, -57108, -33373, -128934, 330063, -14237, -47199, -232714, 165411, -316487, 199712, -83832, 91330, 199751, 30998, -6644, 118757, -192589, 262531, 204910, -294729, -106028, -36381, -53730, -10594, 209429, -113149, -101691, -333877, 169574, 11474, -361489, -15316, -142224]
17958a42224F0232c78942E0985c571l7263k64576b1503p104A91451b05257E6054
17946h9729A85307a86352C39392k6542a04555A10600J74151a38801B08296i9123
17935a40143C38199B9269b48669d9122B7961a96994p4162g2907C94855E0355a69313
17923B41394b68110B20102p8129b29272B07797c8938H3750a12497M8512B9859
17912c0222A00626A2250K9225L00170a78957D4136a67164a6257k12461i0826F2233
17900I9240a21429I3991b92572B35576A15334a85796c2166A26560m5003A0955
17889F2959J60579j7226B7896J81723j3898p0560c30016a7863j02039E519i9690
17877a44345K5851F610L12021b4030A20520b01850I3680a9339B80963a19076j03280
$$ y = [-142224, 60232, -378942, 50985, -3571, -40834, -305410, -21503, -28607, 191451, -205257, 56054, -89729, 185307, -186352, 339392, 312850, -104555, 110600, 284751, -138801, 208296, -99123, -140143, 338199, 29269, -248669, -49122, 27961, -196994, -271156, -72907, 394855, 50355, -169313, 241394, -268110, 220102, 141973, -229272, 207797, -38938, 83750, -112497, -63985, 29859, -30222, 100626, 12250, 41475, 341645, -178957, 44136, -167164, -16257, -228718, -90826, 62233, 99240, -121429, 93991, -292572, 235576, 115334, -185796, -32166, 126560, 81557, 10955, 62959, 223538, 206312, 27896, 209619, 195721, 125161, -330016, -17863, -119902, 5519, -99690, -144345, -118494, 6610, 318631, -24030, 120520, -201850, 93680, -19339, 280963, -119076, -222356]
17866b22356d0744j89077A2347J4573J33121E5863a35369D9194a35241b8549n7986
17855h6535H700K08402E9915P5081c6119r306B08196O762O8072o1735C4465b13865
17842A64453J03304a69340L8628c2577B18939b64407A31887b65058E5281N2571
17832A07852K39802d0202j09656B01414a59032A86528N0433H435J2902e8610E3667
17820B3942c72794J60389F3064a31232f042n8609o6806q824b7408G6140K51698
17809C27838F7910b63590A80493a94841j9532B53194A10409k5652C784a17403
17798A02853b81979a27829b053A70658D7292a99792A64953b00511E258E19a93818
17786a988A56205J59202a50900k7024A28519a91152A70189k1256g2493j00731
$$ y = [-222356, -40744, -229821, 12347, 26920, 160041, 55863, -135369, 49194, -135241, -28549, -86535, 8700, 217102, 59915, 134996, -36119, -45425, 208196, 214958, 283030, 221295, 34465, -213865, 164453, 267757, -169340, -130712, -32577, 218939, -264407, 131887, -265058, 55281, 107852, 347654, -40202, -149858, 201414, -159032, 186528, 236961, 8435, 21337, -58610, 53667, 23942, -372794, -212405, 63064, -131232, -6042, -64651, -131457, -140281, -27408, 76140, 327838, 67910, -263590, 180493, -194841, -214373, 253194, 110409, 84757, 3784, -117403, 102853, -281979, -127829, -2053, 170658, 47292, -199792, 164953, -200511, 5258, 519, -193818, -1988, 156205, 315407, -150900, -177924, 128519, -191152, 170189, 148933, -72493, -173224]
17776a73224H091a36511l2368F3358a12358b260k89421H0768J18460o7543F0405
17764A2128J02946P5407i7642B15572G3841M0073i7961L0582Q883l3123H7475
17752G0J17326J27255b0283E99J80053G1374l165a6564A81703B255b1347B69378
17739B61901a94910A32476c9559l3816B66183j31706m2214J12094b97193d1575
17728E9364i9836G7692d5256k7596r106E5212Q0772a8295D13580A12991K40672
17717C53663K25623c85526a43924B14592l1712G4835K61744d9585j78660A77557
17706a28590r3710B7576g4983B99694e7146A60295a66310M7659A59825B063P9586
17695H1649l9995a43905H8861b23157d007A853a08999j8884a9652B15916I2202
$$ y = [-173224, 8091, -136511, -168879, 63358, -112358, -2260, -291681, 80768, 199228, 131685, 60405, 12128, 115074, 190481, -97642, 215572, 73841, 113914, -97961, -67379, -58496, -91619, 87475, 70, 117396, 244651, -20283, 599, 180652, 71374, 68209, -16564, 181703, 2255, -21347, 269378, 261901, -194910, 132476, -39559, -73375, 266183, 134477, 92263, 204357, -297193, -41575, 59364, -99836, 77692, -45256, -72852, -81958, 55212, 135984, -18295, 413580, 112991, 353663, 579286, -385526, -143924, 214592, 182880, 74835, 336579, -49585, -228245, 177557, -128590, -222300, 27576, -74983, 299694, -57146, 160295, -166310, -118651, 159825, 2063, 81649, 41654, -143905, 88861, -223157, -4007, 1853, -108999, -127883, -19652, 215916, 92202]
17683a20308K8922A62450J42659j16619a87041B06573r9684B5667R2830K85032
17673D03529j60097a20683K8840B19534p4178K21144I7336L6781E4865E754P2607
17662G8361b03731C32786A60089B4594c1797C15671g9822D8252J5744g1867l53018
17651d24885b4404c772o5989l5G18K24416d5032I1540J66659c4643H6133e7297
17638e9410l4023B03867p0523K293e1777A57690Q5503l1371c6616j4383C1967
17626D47094A37049m9222h206j30243F7879J07063b37124a02810F8945b6823H2023
17614e7511a1403j6079H7498d6609C32261F5703j1774K97731d8207C74189d3797
17602C0366i5990M5982A40263b7921A18820J33661A17439B7857M9563J0240a2875
$$ y = [-120308, -91386, 162450, 305109, 188490, -187041, 206573, 106889, 25667, 118497, 403529, 243432, -120683, -91843, 219534, 145356, 366500, 97336, 134117, 54865, 5754, 78361, -203731, 332786, 160089, 24594, -31797, 315671, -79822, 48252, 63996, -71867, -424885, -24404, -3772, -69761, -69796, 718, 225134, -45032, 91540, 258199, -34643, 86133, -57297, -59410, -93433, 203867, 133344, 135637, -51777, 157690, 243193, 211822, -36616, -50999, 31967, 447094, 137049, 87827, -8206, -138449, 67879, 174942, -237124, -102810, 68945, -26823, 82023, -57511, -11403, -27482, 87498, -46609, 332261, 65703, 53929, 351660, -48207, 374189, -43797, 30366, -95990, -50008, 140263, -27921, 118820, 252481, 117439, 27857, 77420, 87660, -12875]
17590a31004l2641A89163a15920B0237P3509a9747B70692H3659k0903J77732o3677
17579A76811j3968c49347E5490a45266A40914J11863a7083j51041D8062a14753
17568C44220l6226p5333D2548i3692E1623J14806E1811J26094a32401L5338l3114
17557a30177C99922e1501B2985K45546A20925b2443j35340B55643a29387A23705
17546e795A63012a58738B54900B248g1912B49074J14698i1246B4383L672J9540
17535D7595M68627H8576a36259A9510a85738A09479f645j70231B14878J9446j09734
17524A24590J32084m9148G0397L43019A2597J33410d554C71701E4493k6562a5998
17512A87932d2367l0451C90319A87748j3442J77484A17628b9809C50375J08382
$$ y = [-131004, -163645, 189163, -115920, 20237, 93746, -19747, 270692, 83659, 62756, 240488, 176811, 162843, -349347, 55490, -145266, 140914, 252777, -17083, -168124, 48062, -114753, 344220, 307994, 232661, 42548, -93692, 51623, 166429, 51811, 177905, -132401, -97063, -130177, 399922, -51501, 22985, 268531, 120925, -22443, -157783, 255643, -129387, 123705, -5795, 163012, -158738, 254900, 2248, -71912, 249074, 363772, -91246, 24383, 28055, 47595, 516222, 88576, -136259, 19510, -185738, 109479, -6645, -176876, 214878, 234324, 124590, 256674, 207526, 70397, 413416, 12597, 146007, -4554, 371701, 54493, 27931, -15998, 187932, -42367, -72818, 390319, 187748, 174306, 351790, 117628, -29809, 350375, 458757]
17502D58757L4729e1302C73863G151J34516J33958A23916l1874K19742l3115K41086
17491E19755j31068O5346j07543j15916m986A02387J7181j4370c93069A94581
17480b7460j4666A36826o6043F326Q2887K1825M54455G4967J87371g8921A77389
17468C04199H1977K47479p3653j12428K36886A42360F2664J76811R0017b61969
17457a6210C90046B4759F090M09147d4232C06745b4407B97769j37456L43906j70697
17446C33522G1829K09906E5241a37467I8528J39957E3152a06753B12685r785m99
17435B02401J9594J15784j58252m1496O4751J03411A13474K87427A06713Q4563
17425A91276I0044K95705j3505A39139K43390a53325b9709C66440f3896A12135
$$ y = [458757, 493486, -51302, 373863, 7151, 141667, 275625, 123916, 92042, 311784, 278669, 519755, 388687, 454033, 346490, 230574, 225588, 102387, 119568, 105198, -393069, 194581, -27460, -42126, 136826, 70783, 6326, 89213, 111038, 565493, 74967, 262338, -78921, 177389, 304199, 81977, 329456, 255803, 143375, 380261, 142360, 62664, 239475, 329492, -261969, -16210, 390046, 24759, 6090, 415237, -44232, 306745, -24407, 297769, 160313, 504219, 333522, 71829, 281735, 55241, -137467, 98528, 238485, 53152, -106753, 212685, 202900, 202401, 221995, 337779, 179527, 138031, 202782, 306193, 113474, 400901, 106713, 191276, 90044, 385749, 372244, 139139, 382529, -153325, -29709, 366440, -63896, 112135]
17414c7864C75767j83974q5332L10853G9703J35218N3060m970M5107m326C647
17402B15582I4879K4684L34610E3029L2840J00187a0411B5307K4537K75290i88
17390a75498J2010B0989R8555L26834F2342k5467K78077q2214E444K38032j03710
17379A39766o82K7862K18904j79119A2336c4190j06193F19650A85456q5466b5520
17367B23797J98399A70834j1538a38587C05847A36165J28851a80394C39657b47560
17356A6525J91931j0327a69363B90103m4023J24696c7557A59817g561j09036A80009
17344B21002n6667d5787A96703Q6054Q0423j50702n9471p3066M5550Q3115o7067
17333A41539Q8803b32218A92173o4543o974L0905J82812E9557K45584B2140e2199
$$ y = [-37864, 375767, 191793, 106461, 417314, 79703, 214921, 267981, 263011, 308118, 303792, 3647, 215582, 94879, 119563, 454173, 53029, 85869, 186056, -10411, 25307, 49844, 325134, -988, -175498, -163488, 20989, 119544, 446378, 62342, 36875, 314952, 232738, 5444, 243476, 139766, 139084, 166946, 385850, 206731, 12336, -34190, -140383, 619650, 185456, 99990, -25520, 223797, 422196, 170834, 159296, -138587, 305847, 136165, 265016, -180394, 339657, -247560, 16525, 208456, 198129, -169363, 290103, 246080, 370776, -37557, 159817, -7561, -116597, 180009, 221002, 164335, -45787, 196703, 282757, 363180, 212478, 153007, 79941, 125491, 208606, 141539, 230342, -232218, 192173, 127630, 120656, 151561, 334373, 59557, 305141, 22140, -52199]
17321E4743O3064C8746L42956A69414a93519b0679k05057A32485J49905O0196
17311C42586f8521C11632f2352B27588b52144P8849l276C45475A05225C493b7036
17299E90723g5436p4336B6576f5031B83613m8452K03329A7535L08573r7050L19498
17288E48556a73670B20574L05284j91298I1050m0175N88492l07641j59037K60206
17278D32895m3062B0451K52675J17254A8554J5601c22131I4330L1372a12998D34284
17266A43880P7J48450d1104B33809K3389d0626C89097g3979B71723G7658M9636
17255A27294L29792p6769J56483A70967k2178J45900d2130C09133E4146J30491
17245A84637J79531A76756q7660l2264O999P0171J67079a4221C13541f7323B70865
$$ y = [54743, 117807, 38746, 381702, 169414, -193519, -20679, -225736, 132485, 282390, 342586, -68521, 311632, -62352, 227588, -252144, -173295, -176571, 345475, 105225, 3493, -27036, 590723, -75436, -149772, 26576, -65031, 283613, 235161, 438490, 17535, 326108, 229058, 548556, -173670, 220574, 525858, 334560, 91050, 50875, 639367, 331726, 172689, 432895, 389833, 20451, 273126, 390380, 18554, 34155, -322131, 94330, 125702, -112998, 434284, 143880, 143957, 292407, -41104, 233809, 257198, -40626, 389097, -73979, 271723, 77658, 127294, 457086, 380317, 536800, 170967, 148789, 294689, -42130, 309133, 54146, 184637, 364168, 176756, 89096, 56832, 63831, 134002, 301081, -14221, 313541, -67323, 270865]
17233a47037A22541M0198K14873A08693M02662A95531H7063K36027r3573K01331
17223D30848j47625j40058Q4182R9243L5033N3133I9770J99584L1800E2219K1084
17212G3303M70744A57751k2132a221H6596L36631A77342J54210A52170J89525
17202C41695b1393A53306K57015A42234K03514A37982b7385C87839K5469I6950
17191E47770j43299R0643F4858L90943A50L31654j07362J2201q5094n1829a16101
17179B06589R7836k6965A08002R738N8960J69937j44323r640b10619c8142B93450
17167D65169j47686K2911L4706N541J34587a8177B46952b27553g7555D33069j85935
17156B47134f1114B69440Q4073A11793j5893Q2120k2492J38090a90498A98010
$$ y = [-147037, 122541, 162739, 377612, 108693, 511355, 195531, 87063, 323090, 229517, 430848, 283223, 143165, 227347, 326590, 361623, 414756, 99770, 299354, 331154, 52219, 73303, 544047, 157751, 135619, -1221, 86596, 423227, 177342, 331552, 152170, 341695, -21393, 153306, 410321, 142234, 345748, 137982, -27385, 387839, 413308, 96950, 547770, 404471, 495114, 64858, 455801, 150, 331804, 224442, 236643, 151549, 99720, -116101, 206589, 304425, 277460, 108002, 117740, 176700, 346637, 202314, 192674, -210619, -38142, 293450, 465169, 317483, 340394, 375100, 380641, 515228, -18177, 246952, -227553, -77555, 433069, 247134, -61114, 269440, 353513, 111793, 95900, 178020, 155528, 293618, -190498, 198010]
17145F56057k46377K03097k36203J10365f9973B69865b7464C29325A02352K90838
17135C93190j76914J87863j95722J32688P2839j63204N831J41676j35370A25328
17124E51476j42083O5223A46111Q7730Q0941j55408L25249k42b3228D15172I6897
17112B37172F4324K25619q8991k6581B2030R5163P3679L58010j41429l7690q2070
17101B87693j27766K29175K00069J48223A59573J46992j9190J51689j97960J52153
17091C93257M9280r7384j64580L96676j10219M3625M9795j66142A19202N6132
17081A75334C9607K70931L41882C24446O2070M5418I2739J72203q2572L59197
17071E41567j18917N3623j02791J00992A87121Q2094L7243j07626L68582n8192
$$ y = [656057, 409680, 612777, 376574, 486939, -69973, 269865, -27464, 329325, 102352, 393190, 216276, 404139, 208417, 341105, 413944, 250740, 256571, 398247, 262877, 125328, 551476, 409393, 474616, 146111, 233841, 314782, 159374, 484623, 484381, -23228, 415172, 96897, 237172, 64324, 289943, 200952, 174371, 22030, 117193, 190872, 548882, 407453, 369763, 287693, 159927, 389102, 589171, 737394, 159573, 306565, 287375, 439064, 241104, 393257, 442537, 345153, 180573, 577249, 467030, 510655, 560450, 394308, 119202, 175334, 39607, 310538, 652420, 324446, 386516, 431934, 92739, 264942, 182370, 541567, 422650, 476273, 373482, 474474, 187121, 269215, 306458, 198832, 567414, 509222]
17061E09222m0955j79495G4162N03142j90259K25299j74306J05051j93778O2509
17051D11820K84019C06674L45389q3362j12541n7371j744o6222j11407M09911
17041F29327K08543D04766J50285M1804r4696M2075J02103j31211k02315L531
17031C16342K32723p5621J01798n1110M557j01060J00061M5846k53331J58989
17021D79194o8824J04475K04397j52376J22098j69452M5971p0131K0256J06604
17011F22212j34469J89034K21110C14473L30853l0996B38441L39253K17590r0089
17001G05195C22980K48477J70571l22870K39681o8971k25813K49531p8040n3967
16991D81579K50740K45715m54915K0354J69559J58471K3585l33025R5434k00136
$$ y = [509222, 468267, 288772, 74162, 577304, 387045, 612344, 438038, 543089, 349311, 411820, 695839, 306674, 652063, 568701, 456160, 398789, 397045, 330823, 219416, 629327, 837870, 404766, 555051, 596855, 502159, 544234, 646337, 515126, 312811, 316342, 549065, 473444, 575242, 524132, 528689, 427629, 527690, 573536, 320205, 479194, 410370, 514845, 719242, 566866, 688964, 519512, 565483, 495352, 515608, 622212, 487743, 676777, 897887, 314473, 645326, 614330, 238441, 577694, 795284, 705195, 322980, 571457, 742028, 419158, 658839, 589868, 364055, 613586, 535546, 481579, 732319, 978034, 523119, 543473, 713032, 871503, 895088, 562063, 657497, 457361]
16981D57361J08118K42800m5001k18344J92631k59624J95643j0924P0284q2677
16971F50267l0721M54504l13505j55931j03943l1041K93292j38740Q601P3391
16961G06174J00208J51662k88556j73712N08068j38676j57628K87297k77080L50997
16951A068754k46718l63028N28532l88015J8038K12696L3850j2473K29314k97926
16941G83024K75049j79117m0066K74616K48088l12504j87310L00270l9155J18731
16931A241626m10066K38010r8336L27503l57041L81799k13606l1136j93800K22745
16921A107698J24687j23797p2317N8158l35402L55065j9587L51796k56830j3353
16911A176118J94503n04526M15221M79122o16419o59K76867l31285J67388M76
$$ y = [457361, 565479, 808279, 763278, 544934, 737565, 477941, 673584, 662660, 732944, 650267, 619546, 1074050, 760545, 604614, 500671, 469630, 762922, 624182, 632783, 706174, 806382, 958044, 669488, 495776, 1003844, 865168, 707540, 994837, 717757, 1068754, 822036, 459008, 987540, 599525, 617563, 830259, 864109, 851636, 1080950, 783024, 1058073, 878956, 838890, 1113506, 1361594, 1049090, 861780, 1162050, 1122895, 1241626, 831560, 1069570, 971234, 1298737, 941696, 1323495, 1109889, 1078753, 884953, 1107698, 1232385, 1108588, 1036271, 1094429, 759027, 1114092, 1094505, 1446301, 1189471, 1176118, 1370621, 866095, 1281316, 1760438, 1144019, 1143360, 1420227, 1088942, 1256330, 1256806]
16901A256806K1145J41128J58551k24399L37639r9188l22012K60066q9092L63003
16891A803647m63422R7604j62642K51399j08568K94171L25939l67553j2741J33436
16881A791270Q9283j36163q9227K09657L6558m3982r9888P4037K14811J76313
16871B222669k30833p0553K81205N798j13555K26238k32611L2280N7557J05197
16861B283392Q7996J5227j6932j25009L20212K14909k07472k03197J84405j04916
16851B448615J84995k82800L54021l45389K69739L6202M46334k25932q1647J54633
16841B958771O1009M5587j1150P4272L3850L52902K2661j82306l6379K73459K0247
16830C612923j33020L64260k48915O2983L4005K10268K07477J62605J23177j59049
$$ y = [1256806, 1277951, 1419079, 1577630, 1353231, 1690870, 1591682, 1269670, 1529736, 1440644, 1803647, 1340225, 1437829, 1275187, 1526586, 1418018, 1712189, 2038128, 1670575, 1657834, 1791270, 1880553, 1744390, 1655163, 1864820, 1901378, 1857396, 1757508, 1831545, 2046356, 2222669, 1991836, 1921283, 2202488, 2208286, 2094731, 2320969, 2088358, 2120638, 2178195, 2283392, 2371388, 2386615, 2369683, 2244674, 2564886, 2779795, 2572323, 2369126, 2553531, 2448615, 2633610, 2350810, 2704831, 2359442, 2629181, 2665383, 3111717, 2885785, 2804138, 2958771, 3019780, 3065367, 3054217, 3128489, 3162339, 3515241, 3537902, 3355596, 3319217, 3592676, 3612923, 3479903, 3844163, 3595248, 3658231, 3692236, 3902504, 4109981, 4272586, 4395763, 4236714]
16820D236714K59708k73490M04315L57913j67515j93576M12650L60650j48448
16811E248921K44176k18506O00494n11081K23986M79894L0572k00808K89409O49064
16801F836121j20966j84191M05503L30189j21680M79339J27033o7823L25912j94054
16791G815383N35088L40423K76850K50963O5254N58077Q1450j49025N94025M44348
16781A0812836K4508M12704L80225M74387N19155M8865Q36021J22016N15576J19878
16771A4266171L29821Q53692P49452J5510K07099J108687O67800L28931P84124
16762A9311287J031421M74759P21461Q02718J145582O41035R98352Q79145Q17457
16753B6823217J303143J334758O94615J346709J340558J145085J640339J589544
$$ y = [4236714, 4496422, 4222932, 4627247, 4985160, 4817645, 4624069, 5036719, 5397369, 5248921, 5493097, 5274591, 5875085, 5364004, 5587990, 6067884, 6098456, 5897648, 6187057, 6836121, 6715155, 6530964, 6936467, 7266656, 7144976, 7624315, 7751348, 7683525, 8009437, 7815383, 8350471, 8690894, 8967744, 9218707, 9283961, 9842038, 9923488, 9774463, 10368488, 10812836, 10837344, 11250048, 11630273, 12104660, 12623815, 12672680, 13508701, 13630717, 14146293, 14266171, 14595992, 15449684, 16199136, 16214646, 16421745, 17530432, 18198232, 18527163, 19311287, 20342708, 20817467, 21538928, 22341646, 23487228, 24128263, 25126615, 26005760, 26823217, 28126360, 29461118, 30155733, 31502442, 32843000, 33988085, 35628424, 37217968]
16745C7217968J450294J717162J892492K163069K128583J926288K576070K333973
16737E3405899K567003K372095L105591K900430L193006L387704L337736M084641
16729G8354105L687028M155507M539996M286706M153243N011621M756960M837043
16721A13782209M833641M912085M761549N090436M963563M157975M241012L440293
16713A50182763L296875K979302K298451J967529J142353M41206N552j103519
16705A61210512j661754k125551k793929k719033l934415m092192l876270m857784
16697A35149584m313437m875005m660043m681178m353720n144143m655648l952011
16689I8514399m273667m827850l980950l845394l328313l714137l336176l041225
$$ y = [37217968, 38668262, 40385424, 42277916, 44440985, 46569568, 48495856, 51071926, 53405899, 55972902, 58344997, 61450588, 64351018, 67544024, 70931728, 74269464, 78354105, 82041133, 86196640, 90736636, 95023342, 99176585, 104188206, 108945166, 113782209, 118615850, 123527935, 128289484, 133379920, 138343483, 142501458, 146742470, 150182763, 153479638, 156458940, 158757391, 160724920, 161867273, 162308479, 162314031, 161210512, 159548758, 157423207, 154629278, 151910245, 147975830, 143883638, 140007368, 135149584, 130836147, 125961142, 121301099, 116619921, 112266201, 107122058, 102466410, 98514399, 94240732, 89412882, 85431932, 81586538, 78258225, 74544088, 71207912, 68166687]
16681F8166687l410627k749575k609237k649600k223303k694942j797881k252211
16673D7779311k046916k063779j758141j765902j647857j214726j628603j375751
16665C4277636j271769j311920j169757j444621p99696r10130j107304q95370
16657B5367069r74671p07605q34169o35461r65799o19694o92258p55904o10635
16648A8570873l31697q85119k91259l90469n80825n33113m30392m48838k75454
16639A4403707m27199k67511m10465l86225o37351l83616l81932k04805l14112
16630A0990491j16909o54655L75346n32353k81552p03555J57129p9067l55226
16621H799649l52239Q6728n18343l16131L5585k97850N082k32280k6010o60219
$$ y = [68166687, 64756060, 62006485, 59397248, 56747648, 54524345, 51829403, 50031522, 47779311, 45732395, 43668616, 41910475, 40144573, 38496716, 37281990, 35653387, 34277636, 33005867, 31693947, 30524190, 29079569, 28279873, 27369743, 26262439, 25367069, 24392398, 23684793, 22850624, 22215163, 21249364, 20629670, 19937412, 19181508, 18570873, 18239176, 17354057, 17062798, 16672329, 16091504, 15558391, 15127999, 14679161, 14403707, 13976508, 13708997, 13298532, 12912307, 12274956, 11891340, 11509408, 11304603, 10990491, 10873582, 10218927, 10594273, 10061920, 9780368, 9076813, 9233942, 9154875, 8799649, 8447410, 8534138, 8015795, 7699664, 7735249, 7437399, 7442481, 7210201, 7184191, 6523972]
16611F523972M99173n32253N3814n38182K57931k97946j48087k86278P5212j34806
16601E472550l15445j0287J72691m62891R4807m51190L87814k06112j09962J09743
16591D681718n3476k95426k65328l17613K51106j60301J0993j92137L64472j12006
16581C912002k77948j95607Q8395L9672k88474N0665p6554j70667n7107j39127
16571B885250j70286N4545k50554N52281n63686L5690r521l43744J39912J48994
16561B478881m7692J33269j51942j21495p661m0903p590k31924L02915m71046
16551A834812L43017j16103J95219k07626j73967p0032N1174k2205J31217k75010
16541A690496K69825l33841J21995Q7463J12913k10051R8927l97049P05278p60149
$$ y = [6523972, 7023145, 6490892, 6544706, 6006524, 6264455, 5966509, 5818422, 5532144, 5607356, 5472550, 5157105, 5146818, 5319509, 4856618, 4951425, 4500235, 4888049, 4681937, 4571975, 4681718, 4628242, 4332816, 4067488, 3749875, 4000981, 3840680, 3851673, 3659536, 4024008, 3912002, 3634054, 3438447, 3526842, 3566514, 3278040, 3328705, 3252151, 3081484, 3024377, 2885250, 2714964, 2769509, 2518955, 3071236, 2507550, 2543240, 2533719, 2189975, 2329887, 2478881, 2431189, 2564458, 2412516, 2291021, 2283360, 2242457, 2234867, 2002943, 2305858, 1834812, 2177829, 2061726, 2256945, 2049319, 1875352, 1805320, 1856494, 1834289, 1965506, 1690496, 1960321, 1626480, 1748475, 1835938, 1948851, 1738800, 1837727, 1440678, 2145956, 1385807]
16531A385807K23647j21717L0941J16180m21507L63591q6676L8708N4825o9497
16521A514302r7462n76618L43137K34436l29887J57081L17332j25472k09015L46390
16511A574224k89441k90757L31602r500j63783J06336r7053l48901P95336n60875
16501A047188L92378n24905L90092j09484k5305m3212K79485P2937l36030j67895
16491I75249j62009M59106j41816j92899J25409k90721K03293k21035L13362o6095
16481A001844k07971J04778q2925K20640k60009J12223j10168J04278R1439L75335
16471A349464E22464M15437k62109K91904K28091k70141O7573L0142N3988m73186
16461F04163L08351k54275L15959j37046k24960M31641l47395j44645K14804L47022
$$ y = [1385807, 1609454, 1487737, 1518678, 1634858, 1213351, 1576942, 1490266, 1528974, 1583799, 1514302, 1416840, 840222, 1183359, 1417795, 1087908, 1244989, 1562321, 1436849, 1227834, 1574224, 1284783, 994026, 1325628, 1316128, 1152345, 1258681, 1161628, 812727, 1608063, 1047188, 1439566, 914661, 1304753, 1195269, 1169964, 1126752, 1406237, 1479174, 1143144, 975249, 813240, 1272346, 1130530, 937631, 1063040, 772319, 975612, 754577, 1067939, 1001844, 793873, 898651, 815726, 1036366, 776357, 888580, 778412, 882690, 974129, 1349464, 522464, 937901, 675792, 967696, 1195787, 925646, 993219, 1023361, 1077349, 604163, 912514, 658239, 974198, 837152, 612192, 1043833, 696438, 551793, 766597, 1113619]
16451A113619D88757K42990o4474L86095J40078l29523Q4982M6958D79237L19852
16441G99089R4587K8734j87384O9627j48574M01167l65909L55987j1089j52833
16431H83402r861C27066M42716j13230J30896k17351K75852o6115k3268J22843
16421H79409D11234J87255L52110l42101q600K3197B56374R5604P14558j74209
16411H92327m2454l81619K4755K18859j09786J38329k42192K04759o5665j71220
16401D66093J97757n8395K42942k47081K47001j23311k36980k8195K46008j13261
16391E92578k27224M7002P84142D09187J20094K21414j93673J29065C11495Q6543
16381C98038K36724n5699K95629m08983j51171J77415J35796k15705K21712j24874
$$ y = [1113619, 488757, 731747, 667273, 1053368, 1193446, 863923, 948905, 995863, 479237, 799089, 893676, 922410, 735026, 804653, 656079, 1057246, 691337, 1047324, 1036235, 883402, 873541, 327066, 769782, 656552, 787448, 570097, 845949, 779834, 756566, 879409, 411234, 598489, 950599, 608498, 599898, 623095, 256374, 351978, 1066536, 892327, 849873, 468254, 493009, 711868, 602082, 740411, 498219, 702978, 637313, 466093, 663850, 605455, 848397, 601316, 848317, 725006, 488026, 459831, 705839, 592578, 365354, 412356, 1196498, 409187, 529281, 750695, 557022, 686087, 311495, 398038, 634762, 579063, 874692, 465709, 314538, 491953, 627749, 412044, 633756, 508882]
16371E08882M7912p3097J92371Q0309o1825O7867R6440k63835r3652O0514J8370
16360E80256j372k78348K4988M25425k54390J79695k0324j74979M49K4403o4281
16349D41522K43053Q3675k49841n0455k194q6219M48094L48012E40587K12172
16339G52759L074l312o2853M4262l41069K49615j89719J56061l7590j39460K77707
16328G09475j09087L9782p4335J43210j54641j2698J05823k22176Q9929q6523
16318D28759J02880K5431O0338j76236L16639B77848O11318l46576M5257l3266
16308E54581k7665K12374N1809C83847J89441L88165j98192j34604K70056j97835
16298G00878k77585K90521j56348q6036n6107Q0398J3567L4262j13285R374M42250
$$ y = [508882, 556794, 483697, 676068, 756377, 694552, 762419, 858859, 595024, 501372, 561886, 580256, 578884, 300536, 325524, 750949, 496559, 676254, 655930, 480951, 481400, 505803, 441522, 684575, 768250, 518409, 467954, 465760, 379541, 827635, 1175647, 540587, 752759, 755833, 752521, 689668, 733930, 392861, 642476, 452757, 608818, 571228, 431768, 709475, 600388, 640170, 565835, 709045, 554404, 541706, 647529, 425353, 515282, 428759, 531639, 557070, 617408, 441172, 757811, 277848, 889166, 542590, 587847, 554581, 526916, 739290, 791099, 383847, 573288, 961453, 763261, 628657, 898713, 700878, 423293, 713814, 557466, 471430, 415323, 495721, 509288, 543550, 430265, 439639, 881889]
16287H81889j46095m2014j76955K43060q3115P19N5411n0534l23667L88185J94936
16276I41820m32772J26945Q6276R53k70221J05379J51593j23205L5142L14837
16266I36747l5018r1016p2336k35621J71651M1614n8896O7037R2366k46891P4168
16255F43805q78j07727M0433l6197K03798p890p2613M8222J19926j33122Q8709
16244G86466C31667J60232J28179R770j99982J23555N7072L14854q1876C31432
16233F72124J20946r6144J10106j60228p0698k57927L32910K5167J2526J31722
16223H20504l23492j75279L51979r5k20457k17824L48290k78766q503K51353p2005
16212D75705K89329k72919Q6j3668J81545N8317k30430q2343L31452l9139B68185
$$ y = [881889, 735794, 693780, 516825, 759885, 676770, 677489, 732900, 682366, 358699, 746884, 941820, 509048, 635993, 722269, 723222, 453001, 558380, 709973, 586768, 621910, 936747, 901729, 810713, 738377, 502756, 674407, 716021, 657125, 724162, 816528, 569637, 643805, 642927, 535200, 575633, 539436, 743234, 735344, 662731, 710953, 830879, 697757, 786466, 331667, 491899, 620078, 629848, 429866, 553421, 610493, 925347, 843471, 331432, 672124, 793070, 696926, 807032, 646804, 576106, 318179, 651089, 676256, 688782, 820504, 497012, 321733, 673712, 673617, 453160, 235336, 583626, 304860, 296357, 547710, 475705, 765034, 492115, 492201, 478533, 660078, 718395, 487965, 405622, 737074, 697935, 268185]
16200F01534j93965L44548j88204k50189P02j50511c9965C80198A45276L67051
16190E12327J5147n1975M33211m32370j47736q7439N6509O097K66287B73020k5407
16179B47613J36503j59234K61813n7585Q5561j59761j18901L49519B9048N69706
16169E98754m8662J03103B89752c1336B14362P0531O8923J8247q2107J01218A48062
16157B33752J6925L36736j48048k18794J72586J86129k3957j96571J31643j66205
16147C24196A20382L66971l4465e8432B8243J45457D1642L36059j41862k3417
16137B12422J6329J74625A39950Q6331J5702E1210M05088j52078q7093o043A7645
16125C95578J29416G5161K87236A27101Q3308J98695j41737l7082D0514K9374
$$ y = [601534, 407569, 752117, 563913, 313724, 314426, 163915, -39965, 380198, 145276, 512327, 527474, 475499, 908710, 476340, 328604, 241165, 297674, 303771, 570058, 273020, 247613, 384116, 224882, 486695, 429110, 514671, 354910, 236009, 585528, 29048, 598754, 550092, 653195, 289752, -31336, 214362, 284893, 353816, 372063, 289956, 391174, 148062, 233752, 250677, 587413, 439365, 220571, 393157, 579286, 555329, 358758, 490401, 324196, 120382, 487353, 452888, -58432, 28243, 173700, 41642, 377701, 235839, 212422, 228751, 403376, 139950, 226281, 241983, 51210, 456298, 304220, 217127, 211084, 17645, 395578, 524994, 75161, 362397, 127101, 210409, 409104, 267367, 230285, 40514, 69888]
16115F9888J67791d4151B90558j43983J80322q0613C3953M51621A24692J3225
16105A37917R3804G4805J23480J20882I2415K53216P0362n9868A0787f0607C42359
16093a24863C22692n655E7498K9810M8572O6354n9797j3199K34753F9489L153
16082G2642a45489j85161J38124e6871B53991I1963J64864K14308j83239q8669
16072A99227D734N9902J57138b88289E1327J38762j8348a06613c5836I8195i4381
16060B20901d8952C94572A51343F9674M2151a82264B37916K017k2412c26924c1448
16048c5911C19102a95184G9627K43713B8945K62217A38738d5656H5788J87382
16038B73170F2733C529Q9037a18898L2166j9033j42879I0212c42029G958P9521
$$ y = [69888, 237679, -44151, 290558, 146575, 326897, 246284, 33953, 485574, 124692, 137917, 231721, 74805, 198285, 319167, 92415, 345631, 415993, 356125, 10787, -60607, 342359, -124863, 322692, 317037, 57498, 87308, 135880, 202234, 142437, 129238, 363991, 69489, 72642, -145489, -330650, -192526, -56871, 253991, 91963, 256827, 471135, 287896, 199227, 4734, 64636, 221774, -288289, 51327, 190089, 171741, -106613, -35836, 98195, -94381, 220901, -48952, 394572, 151343, 69674, 111825, -182264, 237916, 239933, 217521, -326924, -31448, -35911, 319102, -195184, 79627, 323340, 28945, 291162, 138738, -45656, 85788, 273170, 62733, 3529, 92566, -118898, -86732, -105765, -248644, 90212, -342029, 7958, 87479]
16027H7479c668G9700N1526J4127b75448J31039A14794f7036A7511K32261d8976
16015c8833H5172m2150K26330b46569e8091A35002i9035A56297p5406l2535K07875
16004B56231H4250a22170I6413K78634h336A54545c9574A38575D9719O4871d30873
15992a0386C55941b40800L7575e9955B6974a08588J549B39594e6022C4042e2708
15980A3339a51977N5884A21778b6622h665j47850C59396i8495p9430B34216e4507
15968C44421J31224A88584K55360A77424e3723I2097i8825a9627A27291G1c5074
15956I8994c5350D6710i1019j56560F3286K76910c9410m9509j670j45229J1713
15945b24105D5350f441l4656j10407A12125C2893M5063c8129k26297J24856d9403
$$ y = [87479, -3668, 79700, 131226, 145353, -275448, -144409, 114794, -67036, 17511, 249772, -48976, -38833, 85172, 43022, 269352, -246569, -58091, 135002, -99035, 156297, 80891, 48356, 256231, 84250, -122170, 96413, 375047, -8336, 154545, -39574, 138575, 49719, 114590, -430873, -10386, 355941, -240800, -203225, -59955, 26974, -108588, -107039, 239594, -56022, 34042, -52708, 13339, -151977, -96093, 121778, -26622, -8665, -156515, 359396, -98495, -177925, 234216, -54507, 344421, 475645, 188584, 443944, 177424, -53723, 92097, -98825, -19627, 127291, 71, -35074, 98994, -35350, 46710, -91019, -247579, 63286, 340196, -39410, -88919, -90589, -235818, -224105, 45350, -6441, -41097, -151504, 112125, 32893, 77956, -38129, -264426, -139570, -49403]
15933A13994c1008D4082J40988b64053G9862f7068q3410E3265b640l23857L3271
15922b93226h2959j10905G3693K28515a91895A4662a2714C72082a2571k5108C800
15910c22286b4853k95084J28889N3677j04960A70870a11263A3029f6177I1398
15899B48549b41334A42266D6318L160d1424a1994A8511b99806n8486J74316e5707
15887h0797j6768B0027J7287K1696R0493b0093m7688j4920K6676B6092E636K41106
15875B46742a49684K7186A76262b7848l948n2068m17991d2173m3226j09316e8053
15863b47337A87768j0432a49495j06227j34186b8188j38508a4869M918j38519
15853a48470A10146a47827B83263F6277i8227j4552A43893n9835b98722k3576
$$ y = [113994, -31008, 44082, 185070, -264053, 79862, -67068, -150478, 53265, -2640, -326497, -293226, -82959, -193864, 73693, 302208, -191895, 14662, -12714, 372082, -12571, -37679, 3800, -322286, -24853, -319937, -191048, -137371, -242331, 170870, -111263, 13029, -66177, 91398, 248549, -241334, 142266, 46318, 49478, -41424, -11994, 18511, -299806, -358292, -183976, -55707, -80797, -97565, 20027, 37314, 59010, 149503, -20093, -67781, -82701, -56025, 26092, 5636, 246742, -149684, -122498, 176262, -27848, -31796, -83864, -501855, -42173, -85399, -194715, -58053, -247337, 187768, 177336, -149495, -255722, -389908, -28188, -166696, -14869, -9951, -148470, 110146, -147827, 283263, 66277, -98227, -112779, 143893, 84058, -298722, -322298]
15843c22298J31844A83004n6097b07408l022F4572a13173K8820I7974J0708C1902
15831a74625j08303j25739f7079k25953b8138A35763a01650M868c8705A4580N7339
15820G1919a15255I6119c12202f635k36928o2875k16731a98348N5171A33523i7839
15808g7777D4330K55886G4768a79159h5132C7611g7875j9439l5157D19181A2924
15796C6770d7773I5792B9115N315K7940m641g1469A58621a99538B09027i4733
15784c5570A63145h2064A55864d25061A01648a78586A508J65804E6111c44613
15773b38295g7755A26858a45340N6632k96324b0910l5727k75664m9690d1525k97459
15762c38984B7075i6864A08431b27469g1379n6540A81511P8050g6337A57292G2943
$$ y = [-322298, -190454, 183004, 126907, -207408, -210430, 64572, -113173, -84353, 97974, 108682, 31902, -174625, -282928, -408667, -67079, -293032, -28138, 135763, -101650, -96782, -38705, 14580, 71919, -115255, 96119, -312202, -6635, -243563, -306438, -523169, -198348, -143177, 133523, -97839, -77777, 44330, 300216, 74768, -179159, -85132, 37611, -77875, -97314, -132471, 419181, 12924, 36770, -47773, 95792, 29115, 34430, 62370, 57729, -71469, 158621, -199538, 209027, -94733, -35570, 163145, -82064, 155864, -425061, 101648, -178586, 1508, 167312, 56111, -344613, -238295, -77755, 126858, -145340, -88708, -385032, -20910, -56637, -332301, -381991, -41525, -338984, 27075, -96864, 108431, -227469, -71379, -127919, 181511, 259561, -76337, 157292, 72943]
15750D5164P9568j7947L9587N9292J7370I8859J31164J4693E5580J5288a42812
15738I6186b8468D31618E0611A7333a34467B62361G5192J44303G6613b99509F4879
15726C0277a33271c429l81371J06537a12163l03079a15693C75355r4956j25767
15716A54632a455D359g6487r0721o5439j9845e4746G8511h6207P767l08941A00362
15703i818j58872g7389B6093K97775b60921H5074Q5034b51165A1909c6359B23085
15691h0967k41773L97a28640A30357C2578c13739c0340A996a04474j55291e9465
15679a16170B5703a4775m6059E2058a69734A40768a67660A40152b26614A81399
15668b42486g9439L6991j08498a3235o1524B41062a83299B20536J25124c2070
$$ y = [45164, 124732, 106785, 146372, 205664, 223034, 98859, 230023, 244716, 55580, 70868, -142812, 96186, -28468, 431618, 50611, 17333, -134467, 262361, 75192, 219495, 76613, -299509, 64879, 30277, -133271, -3429, -384800, -278263, -112163, -415242, -115693, 375355, 280399, 154632, -1455, 4359, -76487, -167208, -232647, -252492, -54746, 78511, -86207, -78440, -387381, 100362, -9818, -168690, -77389, 26093, 323868, -260921, 85074, 170108, -251165, 11909, -36359, 223085, -80967, -322740, -322343, -128640, 130357, 32578, -313739, -30340, 1996, -104474, -259765, -59465, -116170, 25703, -14775, -60834, 52058, -169734, 140768, -167660, 140152, -226614, 181399, -242486, -79439, -42448, -150946, -13235, -74759, 241062, -183299, 220536, 345660, -32070]
15657a82524Q2807j73591A81610f7994D1439A6141a52597O6659j43149L9200B99141
15645A48282L8143M7334C6485a00169a5742k26276A02715a42058E7874k5046b27283
15633h2770j82902c1896e2B9233a51766I6204b7631r4156d7313G3609b42970Q2742
15621a60228j44055J50568j33900a36723A35832a36410c7836o6803q271A4345
15610A56012B0878f9962A93372d20931H1330a62640C689J65735C2731O7370b10668
15598c18789B71011m707d0767l4153c5736C8618l95K40297m6468a36343M5445
15587i0898n2401O6967j17199a7998p7186j21430G5805N6300b60844O4689C6189
15575B2138Q3186K74465A50216K8390C5892R7575b9215q1586B06240C6233g0976
$$ y = [-182524, -99717, -273308, 181610, -67994, 41439, 16141, -152597, -85938, -229087, -189887, 299141, 148282, 186425, 233759, 36485, -100169, -15742, -242018, 102715, -142058, 57874, 32828, -227283, -82770, -265672, -31896, -52, 29233, -151766, 96204, -27631, -121787, -47313, 73609, -242970, -160228, -304283, -153715, -287615, -136723, 135832, -136410, -37836, -104639, -112910, 14345, 156012, 20878, -69962, 193372, -420931, 81330, -162640, 3689, 169424, 32731, 100101, -210668, -318789, 271011, 266304, -40767, -74920, -35736, 38618, 38223, 278520, 232052, -136343, -90898, -143299, -76332, -193531, -17998, -95184, -216614, 75805, 132105, -260844, -196155, 36189, 22138, 105324, 379789, 150216, 178606, 35892, 133467, -29215, -110801, 206240, 36233, -70976]
15563A0809i5516B21128a07422B36442H9424b14033A51088f0017D28219f31274
15552A91173a35842J1255J8784l3323H4522K03592a48548j02092a21847e3150
15541b28716D3317J33436b76993k07345J86597g4798j03305c9372j51324B51209
15530h1411B0683L1441J77695C5602d3801H2406h6927l5719B44001G5027a72044
15518I9551Q867M9447f8422L0793n2907d0174r6233C2910a06756I2637J48178
15507B40815b35883C65660F0265a90989j25912A25758C9934b22519Q0876B88771
15496B55887H6726b01071f4207j7600J2680G6432a69098l0404B9494c04899C21893
15484C415J30455l898k224J03391a49425F0499L6749a5349j62271A31948J55730
$$ y = [10809, -95516, 221128, -107422, 236442, 89424, -214033, 151088, -60017, 428219, -631274, 191173, -135842, -124587, -105803, -139126, 84522, 288114, -148548, -250640, -121847, -53150, -228716, 43317, 176753, -276993, -484338, -297741, -74798, -178103, -39372, -190696, 251209, -81411, 20683, 52124, 229819, 35602, -43801, 82406, -86927, -122646, 244001, 75027, -172044, 99551, 108418, 157865, -68422, -37629, -90536, -40174, -136407, 32910, -106756, 92637, 240815, -235883, 365660, 60265, -190989, -316901, 125758, 39934, -222519, -141643, 288771, 255887, 86726, -201071, -64207, -81807, -69127, 76432, -169098, -199502, 29494, -304899, 321893, 3415, 133870, 129972, 127748, 231139, -149425, 60499, 97248, -15349, -177620, 131948, 287678]
15473B87678j05049g1748I1390Q9219a5242B80937a32790q4199b6394m20970A0330
15461c15509A40418c57700a19111B09745N7832a38393B81713a53089A8560c7927
15450h0814C149Q6389L2435a74520m25l4784F5782a1977H5364b12373A67322c0529
15437a72443A61351o0330c13669B2776J49112a42243j0123C8634D679L37061A52094
15425B88454B2906L23783A58158L19592B04881J09690c65317D6697b83522A70417
15414E3334c6814p4585A81549b6187A96823a87119q7978B66368q4122a73095A06987
15402B44699g1804G9153g0144A93513h8976D088O1401a45256k16644A00722B4567
15390A18632d71068c392j23233A27862J36834p0779q0703g4205k08401A29190
$$ y = [287678, 182629, -71748, 91390, 180609, -15242, 280937, -132790, -216989, -26394, -447364, 10330, -315509, 140418, -357700, -119111, 209745, 267577, -138393, 281713, -153089, 18560, -37927, -80814, 3149, 89538, 121973, -174520, -174945, -209729, 65782, -11977, 85364, -212373, 167322, -30529, -172443, 161351, 101021, -313669, 22776, 171888, -142243, -152366, 38634, 4679, 341740, 152094, 288454, 22906, 346689, 158158, 477750, 204881, 314571, -365317, 46697, -283522, 170417, 53334, -36814, -111399, 181549, -26187, 196823, -187119, -275097, 266368, 182246, -173095, 106987, 244699, -71804, 79153, -70144, 193513, -88976, 4088, 65489, -145256, -361900, 100722, 24567, 118632, -471068, -3392, -126625, 127862, 264696, 193917, 113214, -74205, -282606, 129190]
15379B04530b7838k30714a01428c466j31295A60477K6013D4820f6272b6966B0079
15367D0309b40240b3494B12319e8588A70285L9017J39829A0052Q4160D1528L4721
15356G6249f6524J5552j58985E6902E440K39008d49863i2311o4362Q303a3830
15344c45308A86657h1255I5119J34290F7923J2365e1270E8050f9610b0517C58136
15332b9855A46915D973b48532B14195f4364A5407L0912J43575B5243b5676B94397
15320g5536H2198g0790o5466B0628a9241j48460o7986B24817a43109b0332F8466
15308G3172b03983O6130e9087F812L03109l6044f399p5532n2923C97499H3142
15296d20327A66728n2763E6785K56145o7186I765J93907d42344D9567O3221J89630
$$ y = [204530, -27838, -258552, -101428, -3466, -134761, 160477, 186490, 44820, -66272, -26966, 20079, 40309, -240240, -23494, 212319, -58588, 170285, 209302, 349131, 10052, 94212, 41528, 76249, -66524, -50972, -209957, 56902, 5440, 244448, -449863, -92311, -156673, -148370, -13830, -345308, 186657, -81255, 95119, 229409, 67923, 80288, -51270, 58050, -69610, -20517, 358136, -29855, 146915, 4973, -248532, 214195, -64364, 15407, 46319, 189894, 25243, -25676, 294397, -75536, 82198, -70790, -136256, 20628, -19241, -167701, -235687, 224817, -143109, -20332, 68466, 73172, -203983, -137853, -59087, 6812, 309921, 273877, -6399, -81931, -134854, 397499, 83142, -420327, 166728, 113965, 56785, 312930, 245744, 9765, 203672, -442344, 49567, 112788, 302418]
15285C02418g0341c0365E7374J8565P3149F6938J23810C3319i1359a9957C2738
15273A18272a50170p5656h2797B08130B0472r660O2470a3983B98108j0703h6406
15261C12555g1965B21935g0540l34405A5107a60554e910A62997H0373R5685f8259
15249D62206A1116R8996n2320L8503a8064j19397A67697B6553a07398C84060A61665
15237C77941A17643a39083A01181K9949d4834A94518p2236L8791b88059B10831
15226A75433c08345B10932B7453K5315Q8710Q9268d3178B30114r0708J76447f270
15214a09907d5387D9134a17405C41522J71000d96769A55408f9803l726A19333
15203A73109L7039b34874A94611a44392A41717m5619K38965j38072a8459m0655
$$ y = [302418, -70341, -30365, 57374, 75939, 149088, 66938, 190748, 33319, -91359, -19957, 32738, 118272, -150170, -225826, -82797, 208130, 20472, 10812, 73282, -13983, 298108, 287405, -86406, 312555, -71965, 221935, -70540, -404945, 15107, -160554, -5910, 162997, 80373, 176058, -68259, 462206, 11116, 110112, 57792, 96295, -18064, -137461, 167697, 26553, -107398, 384060, 161665, 377941, 117643, -139083, 101181, 131130, -44834, 194518, 122282, 161073, -288059, 210831, 175433, -308345, 210932, 27453, 52768, 141478, 230746, -43178, 230114, 139406, 315853, -6270, -109907, -45387, 49134, -117405, 341522, 512522, -496769, 155408, -69803, -73529, 119333, 173109, 210148, -234874, 194611, -144392, 141717, 96098, 335063, 196991, -18459, -59114]
15193e9114j63108A46002C2306J46289B4734b11564P1311j17819C27840j9643
15183C08197H7817a36493C94838j75011c45530a39216B58245j05865b41404C09688
15172G0678N1100E8612J5147a66936A86834m3240L856C0216d3925B84141M2029
15161C26170I4971a62844B45185p215P4579C3442R5106L6635D3981c2678F5310
15149g8430A10290C5982K59512C4692N7272e1968H3054M3896J82559a02679A4988
15137C2084e5984G4686J06892c0733B18407c8185B45463J05097J51194B17489
15126f6685B14774J83310Q8002c15792E5965b45047A40835J45845b16124B28437
15115C28811b03505A26861e6680E4516J10938J67598g652B51478B8624L76248
$$ y = [-59114, -222222, 146002, 32306, 178595, 24734, -211564, -140253, -258072, 327840, 308197, 87817, -136493, 394838, 219827, -345530, -139216, 258245, 152380, -241404, 309688, 70678, 121778, 58612, 73759, -166936, 186834, 143594, 147450, 30216, -43925, 284141, 326170, 94971, -162844, 245185, 237970, 312549, 33442, 128548, 165183, 43981, -32678, 65310, -78430, 110290, 35982, 295494, 34692, 91964, -51968, 83054, 126950, 309509, -102679, 14988, 32084, -55984, 74686, 181578, -30733, 218407, -38185, 245463, 350560, 501754, 217489, -66685, 214774, 398084, 486086, -315792, 55965, -245047, 140835, 286680, -216124, 228437, 328811, -203505, 126861, -56680, 54516, 165454, 333052, -7652, 251478, 28624, 404872]
15105D04872D5980A4617L69237j34851F8422K60570N2831j82821b5487a2040D3585
15093f1835D2793J1621J13409G1260J64337k0793l2627c0754G0928D028K69535
15082B73563J98364b4366D49585a8238C10839A43692h7303o4111B21062r4729
15072A26333a50915A47192k1852R8003m8182B6544J57905D9126j5882L18699P579
15061C59522e4784C45250A52774R6387j17972A4230L53058q8872J88608B6261
15050b578a099C3971J14889R308a41914H1987K49178J78563A95237K1854r0082
15039A27009d0613B26119M2771j21124K00677a04465B78301A33297e4447G9195
15028D17772L5970D3367L41294j50313n7932G7136J35593j680A1036N6140L01696
$$ y = [404872, 45980, 14617, 383854, 249003, 68422, 328992, 381823, 199002, -25487, -12040, 43585, -61835, 42793, 54414, 167823, 71260, 235597, 214804, 182177, -30754, 70928, 4028, 273563, 471927, -24366, 449585, -18238, 310839, 143692, -87303, -151414, 221062, 126333, -150915, 147192, 125340, 223343, 175161, 26544, 184449, 49126, 33244, 351943, 359522, -54784, 345250, 152774, 249161, 131189, 14230, 367288, 278416, 467024, 26261, -2578, -1099, 33971, 148860, 158168, -141914, 81987, 331165, 509728, 195237, 217091, 127009, -40613, 226119, 268890, 147766, 348443, -104465, 278301, 133297, -54447, 79195, 417772, 453742, 43367, 384661, 234348, 176416, 77136, 212729, 211049, 11036, 67176, 368872]
15017C68872r9223R303j06300I108L09249l2992j13823N4065j10243L9477R7205
15006B52046A07223J38579F2946g4194D35220A53618n0762J55844Q1131K15462
14996E55293A30001K71733d8374C14126J42405K85247k33685A93422O654M36138
14986F36214B36146J31814j56113J63813N8426A02867M02524I4569j4463K93890
14976C73996J84418j94089m3727G8604K5246L39499B4715M30954A53356F2215
14965a7270A73866J33610l8302J40683M1439j35882j28616J58978O8108j47918
14955B65966J36172K5908D0963K54534a87508B34661F7362K3499J39772a9302
14944E24163B18212M382L15366q7791k00826P2263K34373A55461M51644B04921
$$ y = [368872, 269649, 278952, 172652, 9108, 318357, 285365, 171542, 225607, 115364, 154841, 252046, 107223, 245802, 62946, -74194, 435220, 153618, 102856, 258700, 339831, 555293, 130001, 401734, -48374, 314126, 456531, 741778, 508093, 193422, 200076, 636214, 236146, 367960, 211847, 375660, 434086, 102867, 505391, 94569, 80106, 373996, 558414, 364325, 320598, 78604, 103850, 443349, 24715, 455669, 153356, 62215, -17270, 173866, 307476, 269174, 409857, 451296, 315414, 186798, 345776, 413884, 265966, 402138, 428046, 40963, 295497, -187508, 234661, 67362, 90861, 230633, -19302, 524163, 218212, 222594, 537960, 450169, 249343, 321606, 555979, 155461, 607105, 204921]
14933C90256J30349j90739m1277J77660j95116J17158A84659L16068n2493A86823
14922E30040P6666A92109L72140k56473L74957b7550B61487J10566A78553L9164
14912B17717J18463J51422B37280K7725K01843K41346j70943m5536M64582C80063
14901G02362j65142J28188j1062j551j22119A33656M84267j19519J06078R6623
14891G01105k11218k2563K22781M0589A58213J12308M0455n5510p1777K23158
14881D06847q6707a8240F35984k43903A87597K84461J4993O64l1581J6235o1031
14870D11338c3005A97353J40016J95513B59187J14971J92993j42127k0908J46936
14860E51052j27833K15744A52385L27821J16197k29081K76823k72851k1444K85490
$$ y = [390256, 520605, 329866, 288589, 466249, 271133, 388291, 184659, 500727, 448234, 186823, 530040, 606706, 192109, 564249, 307776, 682733, -27550, 261487, 372053, 178553, 217717, 336180, 487602, 237280, 265005, 466848, 708194, 537251, 491715, 956297, 380063, 702362, 537220, 665408, 654346, 652795, 530676, 133656, 617923, 498404, 604482, 701105, 489887, 467324, 690105, 730694, 158213, 270521, 310976, 255466, 183689, 406847, 320140, -18240, 635984, 392081, 187597, 472058, 487051, 487715, 456134, 472369, 411338, -33005, 197353, 337369, 532882, 259187, 374158, 567151, 425024, 404116, 551052, 423219, 638963, 152385, 480206, 596403, 367322, 644145, 371294, 349850, 635340]
14850F35340k93779j02790A03742L44777k9779L14020k60973J32334Q7523k10233
14840D81411k9896m2925J05891L22735A93633m828K77994j30590M90145k66168
14830E60186j56922A69038J60588J92991j99611J95691Q5525k07123J43540j05936
14820D34703R3211K19537n4172j07683j71645K23378N3033j19038o8739K93212
14810G95797C89999R1268M6655j01504P4614j88919K87889o8059k34009K67912
14800E65846m7165q0945J60227K65105C92107K0191j5527K69738k48671K60238
14790F78076k01835j5858j43064O10702C98580K06168k13238m5397P2680k3023
14780C95770J41443K63859n5613k85073r2902l5814K60394J67578l28252j24159
$$ y = [635340, 341561, 238771, 103742, 448519, 418740, 732760, 471787, 604121, 691644, 481411, 451515, 408590, 514481, 837216, 193633, 188805, 466799, 336209, 826354, 560186, 403264, 169038, 329626, 522617, 323006, 518697, 604222, 397099, 540639, 434703, 527914, 747451, 693279, 585596, 413951, 637329, 690362, 571324, 502585, 795797, 389999, 481267, 527922, 426418, 501032, 312113, 600002, 531943, 297934, 565846, 518681, 437736, 597963, 863068, 392107, 412298, 396771, 666509, 417838, 678076, 476241, 460383, 317319, 928021, 398580, 604748, 391510, 346113, 418793, 395770, 537213, 801072, 745459, 460386, 367484, 331670, 592064, 759642, 431390, 307231]
14770C07231L41826N0162K84142l23344j70561O0927m5841m087q8331J86926q5205
14759E13845L3497K6085O766R4655O2193j04601k872O6619M2243J23410l26290
14748E35550J72552J22553o1234K8748k23385K59372L7200k03961n5330J35259
14738G47324k57319L12529k03705j29143J2004L24650j60653j46187K15572j28708
14728E86364O1766R5164M63505E70387M89203j59742l6936l88659M05015j15326
14718G63942q2744K54225j96714J08521r0591J16754k29409L64415n03472K79624
14708G84551J99368J03860m84625K03463J36577j37311j32127K45101j26080J22360
14698I15137J6708N815k18806R8659j11622K12559j3869q0808q9640R5464K92345
$$ y = [307231, 649057, 699219, 983361, 660017, 489456, 550383, 504542, 500455, 412124, 599050, 513845, 547342, 573427, 580193, 674848, 737041, 632440, 629568, 696187, 738430, 861840, 535550, 708102, 830655, 769421, 798169, 574784, 834156, 871356, 667395, 612065, 747324, 490005, 802534, 598829, 469686, 481690, 806340, 645687, 499500, 715072, 586364, 648130, 743294, 1206799, 570387, 1059590, 899848, 862912, 474253, 879268, 763942, 681198, 935423, 738709, 847230, 756639, 873393, 643984, 1008399, 504927, 784551, 983919, 1087779, 603154, 806617, 943194, 805883, 673756, 918857, 792777, 915137, 931845, 937660, 718854, 817513, 705891, 918450, 904581, 823773, 734133, 829597, 1121942]
14687A121942l36194k91787K77023K63080j36194q6762K67583j85904M924J67054
14677A064765k7460K56937r1030R5531j43841j66684p4852L90818n8264k51775
14667I94145J94626N6375l46995j23004K75696j80889L20708j77034O2215l34683
14657G41160M03712K71682m65078K20189l52272J88309J9324J2364K9431j35282
14647I33539J28686K03126R8359k31304j18607J6031r4467M03572q1470k27459
14637A030006K02980n64448R13659l96579J63958l63337N36180k54037J80332
14628A448714n8804P2276l02168J57403L1777n9582K65739j69957L92040q06321
14618I71117L11427L29620l18560m101j19769L90853k60191M28353n04021K89308
$$ y = [1121942, 785748, 493961, 770984, 1034064, 897870, 811108, 1078691, 892787, 897711, 1064765, 1037305, 1294242, 1203212, 1298743, 1154902, 988218, 913366, 1304184, 1245920, 994145, 1188771, 1245146, 898151, 775147, 1050843, 869954, 1190662, 1013628, 1075843, 741160, 1144872, 1416554, 951476, 1171665, 819393, 1007702, 1027026, 1039390, 1068821, 933539, 1062225, 1265351, 1363710, 1132406, 1013799, 1029830, 935363, 1338935, 1257465, 1030006, 1232986, 668538, 1582197, 1185618, 1349576, 986239, 1522419, 1268382, 1448714, 1389910, 1462186, 1160018, 1317421, 1349198, 1289616, 1555355, 1385398, 1777438, 971117, 1282544, 1612164, 1293604, 1289503, 1169734, 1560587, 1300396, 1728749, 1224728, 1514036]
14608A514036l10058R4707J22002L6748k1631R8870k1638l8185J41232j00684
14598A515399J49893m3874l34096O0353O7554J7427L70806j69927P6240j91312
14588A518463J40448l3749j26680J67452M9897Q6088M31247p69511L92862q1666
14578A774851k064L77374J19862l20361J7274q2005K35775j57918L6784L41635
14568B341207j32642M0558l50945L15740r7338p4833L43434m44714N7076K19608
14558B217151O5830k06198J94432M58381j09538k81415R5113j58222M88815j7505
14548B746844L14575Q1978n67308Q35459M8655r9720k7314Q08987N1722M72660
14538D666538L49302J045336J399355J873362J946444L675088M051387L380484
$$ y = [1514036, 1203978, 1298685, 1420687, 1457435, 1435804, 1534674, 1513036, 1474851, 1616083, 1515399, 1665292, 1621418, 1287322, 1347675, 1415229, 1432656, 1803462, 1633535, 1709775, 1518463, 1658911, 1625162, 1498482, 1665934, 1715831, 1801919, 2233166, 1463655, 1856517, 1774851, 1772787, 2150161, 2270023, 1949662, 1966936, 1884931, 2120706, 1962788, 1999572, 2341207, 2208565, 2249123, 1898178, 2213918, 2116580, 2041747, 2385181, 1940467, 1997543, 2217151, 2282981, 2076783, 2271215, 2729596, 2620058, 2338643, 2433756, 2275534, 2764349, 2746844, 3061419, 3143397, 2576089, 3411548, 3460203, 3360483, 3333169, 4142156, 4193878, 4666538, 5015840, 6061176, 7460531, 9333893, 11280337, 14955425, 19006812, 22387296]
14530B2387296j244305n186803n130263k991478j547907j479536o67820p4303
14522D064881p80678j93562m6813n33201L47830l41096O8957m5259j54954k90861
14512B095244M27252K35913l77919P9157k68072M52621K9059M1506n5062J74876
14502B834575j74875K40434k02422k85004K28834R5458m551K9003K79933J29903
14492C171288r1869j42109J5862J37740J86076l29171L80158l39490J22970K9607
14482C141062J97894L7968q4973K86082l82072N17526r1806K24508k88899L41517
14472C898807l48037J87131Q9646j53288J18108R533J82797K3589K24696J34368
14462D367350o2305p0606L76284j90633R4664k61312q9486M33360r0358k90155
$$ y = [22387296, 21142991, 15956188, 10825925, 7834447, 6286540, 4807004, 4139184, 4064881, 3284203, 3090641, 3043828, 2510627, 2858457, 2517361, 2586318, 2541059, 2386105, 2095244, 2522496, 2758409, 2380490, 2459647, 2191575, 2644196, 2673255, 2714761, 2659699, 2834575, 2659700, 2900134, 2697712, 2412708, 2641542, 2737000, 2732449, 2761452, 3041385, 3171288, 3079419, 2937310, 2953172, 3090912, 3276988, 2947817, 3327975, 2988485, 3111455, 3141062, 3338956, 3376924, 3291951, 3578033, 3195961, 3713487, 3621681, 3846189, 3557290, 3898807, 3550770, 3737901, 3827547, 3674259, 3792367, 3801900, 3984697, 4008286, 4232982, 4367350, 4305045, 4234439, 4610723, 4420090, 4514754, 4253442, 4163956, 4597316, 4506958, 4216803]
14452D216803M35176k7263R3199j96935L07313K7501J64500J08849l43855N07337
14442E292625k58456P5524K27985j60594K09422J93163j07655M56003K6157Q6998
14432F041172r0369j31700L67562j24591L05427J1184j75190K56741r3398K71936
14422F638774J47921j6865K44439k62730L75340o0026J12356j47001M97924K33041
14412G763173k27249K29763R3199L6749j7980K63177J75921L3309M59223j74468
14402H634817M7118K13198K69214l30814N56709K81342m34502M98566K25320r9409
14392I861559J92203L50570R9051L23461o3741j23616O29198J20705J96331L04093
14382A1889814l49017N17418L87449O7074K42629L96925L8242N2885L58888L23991
$$ y = [4216803, 4651979, 4624716, 4717915, 4520980, 4828293, 4855794, 5020294, 5129143, 4785288, 5292625, 5034169, 5109693, 5337678, 5177084, 5386506, 5579669, 5472014, 5928017, 5954174, 6041172, 5950803, 5819103, 6186665, 6062074, 6367501, 6378685, 6203495, 6460236, 6366838, 6638774, 6786695, 6769830, 7014269, 6751539, 7126879, 7066853, 7179209, 7032208, 7530132, 7763173, 7535924, 7765687, 7858886, 7895635, 7877655, 8140832, 8316753, 8350062, 8809285, 8634817, 8681935, 8895133, 9164347, 8833533, 9390242, 9671584, 9237082, 9735648, 9960968, 9861559, 10053762, 10404332, 10503383, 10826844, 10763103, 10639487, 11268685, 11389390, 11585721, 11889814, 11540797, 12058215, 12445664, 12512738, 12755367, 13152292, 13190534, 13243419, 13602307, 13926298]
14372A3926298K74685j33025M32704K72939K37861L95108N04232P3055J45614
14363A6129471M72119J71778M91387N76000k9631M16661M02836J52391O86008
14354A9469020O59521J43800O44659J93991M42994M29745M55805L93014O47515
14345B3480064R39249M01234N87205N77729M01287R89156M04552M40424M93790
14336B8714690J041168R09773N95000Q29267N87552J061562P40172J049101J254092
14327C6782377Q21846R93175R95753J490230R26271J345470J177759J644742J032072
14318D7209695R12242J767610J748475J582246J727394J921431J532272K248043
14310F0649408J800933K311911K224063K352642K260615K956699K390761K980096
$$ y = [13926298, 14200983, 14067958, 14500662, 14773601, 15011462, 15406570, 15910802, 15983857, 16129471, 16601590, 16773368, 17264755, 17840755, 17811124, 18227785, 18630621, 18783012, 19469020, 20128541, 20272341, 20917000, 21110991, 21553985, 21983730, 22439535, 22832549, 23480064, 24419313, 24820547, 25407752, 25985481, 26386768, 27375924, 27780476, 28220900, 28714690, 29755858, 30665631, 31260631, 32089898, 32677450, 33739012, 34479184, 35528285, 36782377, 37604223, 38597398, 39593151, 41083381, 42009652, 43355122, 44532881, 46177623, 47209695, 48121937, 49889547, 51638022, 53220268, 54947662, 56869093, 58401365, 60649408, 62450341, 64762252, 66986315, 69338957, 71599572, 74556271, 76947032, 79927128]
14302G9927128K851560L121621L249921L234599M010883L582052M317891L900118
14294A08195773M407281M967409M940301N281148N315776N799169O445943O477610
14286A51830410O829268O881611P967635Q083986Q389192R086799R367343J0065151
14278B18501395J0256734J0785218J1087002J1709054J2550603J2725360J2631953
14271C00247319J3392146J3218414J3129469J3148220J2819786J2369004J1375877
14264C89700235J0710685R609485Q962316P729915N801612M713727K639847J229128
14256D41096950N05215m62175k900360m901893o783826p927178q807131r626244
14248D00193358j0030447j0990489j1700677j1996129j2173024j2556579j2644802
$$ y = [79927128, 82778688, 85900309, 89150230, 92384829, 96395712, 99977764, 104295655, 108195773, 112603054, 117570463, 122510764, 127791912, 133107688, 138906857, 145352800, 151830410, 158659678, 165541289, 173508924, 181592910, 189982102, 199068901, 208436244, 218501395, 228758129, 239543347, 250630349, 262339403, 274890006, 287615366, 300247319, 313639465, 326857879, 339987348, 353135568, 365955354, 378324358, 389700235, 400410920, 410020405, 418982721, 426712636, 432514248, 437227975, 439867822, 441096950, 441602165, 441139990, 438239630, 433337737, 426553911, 418626733, 409819602, 400193358, 390162911, 379172422, 367471745, 355475616, 343302592, 330746013, 318101211]
14241C18101211j2342909j2274843j2241463j1743284j1990216j1259700j1208321
14234B35040475j1269445j0636936j0324964r865280r344025q474647q447498
14227A66677680p488662o921694p255875o355119n989493n601502n500609n076700
14219A16488026m932980m408435m059720m411572l774912l962698l441430l303705
14211H4192574l066094l148538k714818k551926k749416k283339k454641k252457
14203F2971345k116230k100448j711958j610399j732979j776332j319026j778163
14195D8825810j312126j321197j341631j257992j497336j095635j119107q72779
14187C9008007r12540j169905j119207q96378r19098r11917n30827j123774p41739
$$ y = [318101211, 305758302, 293483459, 281241996, 269498712, 257508496, 246248796, 235040475, 223771030, 213134094, 202809130, 192943850, 183599825, 175125178, 166677680, 159189018, 152267324, 145011449, 138656330, 132666837, 127065335, 121564726, 116488026, 111555046, 107146611, 103086891, 98675319, 94900407, 90937709, 87496279, 84192574, 81126480, 77977942, 75263124, 72711198, 69961782, 67678443, 65223802, 62971345, 60855115, 58754667, 57042709, 55432310, 53699331, 51922999, 50603973, 48825810, 47513684, 46192487, 44850856, 43592864, 42095528, 40999893, 39880786, 39008007, 38095467, 36925562, 35806355, 34909977, 33990879, 33078962, 32548135, 31424361, 30682622]
14178C0682622m32874r59631o64776q59235m12986q12570n69402l37384j022834
14169B4610930n03321o16843n48475k11316m76608o29156p53988j1599n29123
14160B0330501n52522n34335k70273K1794n04418m9416o19829m53855l98891l44816
14150A6623940k32830r7712o92576p0217k21770j13360n61139n0219k71563q73543
14140A3439011N08397n33879j56704L3343m54260k61261k4377j21709k93057l40466
14130A1795038r2739j49718k59859j72539j26976k37230k00882k12554N3528j79934
14120A0216135m75962j90368L22882o46331J04579r0284J16928k26674k89363
14111H841542j15553k12160j41145J28154k25532k58235J36734n64245N73906
$$ y = [30682622, 30249748, 29290117, 28625341, 27766106, 27353120, 26540550, 25971148, 25633764, 24610930, 24107609, 23490766, 22942291, 22730975, 22254367, 21625211, 20871223, 20859624, 20330501, 19777979, 19243644, 18973371, 18995165, 18490747, 18441331, 17821502, 17367647, 16968756, 16623940, 16391110, 16293398, 15600822, 15530605, 15308835, 15195475, 14634336, 14584117, 14312554, 13439011, 13947408, 13413529, 13256825, 13290168, 12835908, 12574647, 12550270, 12428561, 12135504, 11795038, 11702299, 11552581, 11292722, 11120183, 10993207, 10755977, 10555095, 10342541, 10396069, 10216135, 9740173, 9549805, 9872687, 9226356, 9330935, 9240651, 9357579, 9130905, 8841542, 8725989, 8513829, 8372684, 8500838, 8275306, 8017071, 8153805, 7589560, 8163466]
14102H163466k56026j25625k75239k15905L6226p6674j76605l5088J60377k87846
14092F911061k55488j5640Q472M2943j59551J65960l53459j71765L96230l32243
14082F236520J29370l94983j66584o3415K60787n15034l9687L95938l13596l66880
14072E162436O20676n58242K23397p6871o4294k0477m92752K67008J32717n0022
14062E143576o12218O3894O407k31912M13003j56026J13279k2072j47015j56707
14052D414209m8728k12299J24557L38190l15207Q9495J58848m01463j54608K14100
14042D207094L268J36660n4807k47981j96599O1976l2809p1025m7046k00152L02840
14031C861419l0281j98194j99145J65545k42900L42492o03363L06763j82270L5314
$$ y = [8163466, 7907440, 7781815, 7506576, 7290671, 7326897, 7250223, 7073618, 7038530, 7198907, 6911061, 6655573, 6639933, 6648405, 6691348, 6531797, 6697757, 6344298, 6172533, 6568763, 6236520, 6365890, 5970907, 5804323, 5740908, 6001695, 5486661, 5446974, 5842912, 5529316, 5162436, 5783112, 5224870, 5448267, 5371396, 5307102, 5286625, 4793873, 5060881, 5193598, 5143576, 4531358, 4595252, 4601659, 4369747, 4782750, 4626724, 4740003, 4717931, 4570916, 4414209, 4365481, 4153182, 4277739, 4615929, 4300722, 4390217, 4549065, 4147602, 3992994, 4207094, 4210362, 4347022, 4292215, 4044234, 3847635, 3909611, 3876802, 3805777, 3758731, 3558579, 3861419, 3831138, 3632944, 3433799, 3599344, 3356444, 3698936, 3095573, 3402336, 3220066, 3255380]
14021C255380J21140M9478j03525k42999M43730j15417k12261L6101k66481j2062
14011B953084Q3831k8185k05504L78643m35361M19846o29047L48417p3943n2354
14001B759427O2721m5422K5462k42785N0492l8544P7469J13017K10373l08105
13991B664105J24599k91561L41126k24029m8647J77003k77140K65592K51405j52457
13981B829996K00434O0878K57644L12577M32764J100689J011651K424869L140752
13972A1772254M535326M884938N57770l764659m451061l150082k403086j404097
13964F577303o85192r95912l59667j41291p35984o4500k41742j34088l1067j14139
13954C073721j31906k62617J91975m00855K15514k23027j00416p6860M3061r216
$$ y = [3255380, 3376520, 3425998, 3322473, 3079474, 3523204, 3407787, 3195526, 3231627, 2965146, 2953084, 3036915, 3008730, 2803226, 3181869, 2746508, 3166354, 2537307, 2885724, 2811781, 2759427, 2822148, 2776726, 2802188, 2559403, 2609895, 2571351, 2648820, 2761837, 2972210, 2664105, 2788704, 2497143, 2838269, 2614240, 2565593, 2742596, 2465456, 2731048, 2982453, 2829996, 3030430, 3091308, 3348952, 3661529, 4094293, 5194982, 6206633, 8631502, 11772254, 16307580, 21192518, 21750288, 17985629, 13534568, 10384486, 7981400, 6577303, 5892111, 4896199, 4536532, 4395241, 3659257, 3594757, 3353015, 3218927, 3187860, 3073721, 2941815, 2679198, 2871173, 2470318, 2685832, 2462805, 2362389, 2285529, 2328590, 2319374]
13944B319374j74794N3820N0842J93958j45791q4436n84300L65341L49395l63691
13934A979718m11684K36870J67121L06053k48285j45888o4211J29036q2793j23529
13924A742408Q6032K27662l84116M5768p694J76640P8297o613n88553L48468j32358
13913A585941J79193j85599M00540l14690j3520P1933l9815j86191J71676K06364
13903A875832n04008K07783j34657M86695m74611P0643j28045K26802N9948J81506
13893A867888n28824L25626n8105j82379j97843M32012j47470J17078j42816q9619
13883A395548k90899K06865J32361j51280J13910K41000o1365j66630k05389j40144
13873A073977K52212k54905p3332L72541j04132l1003j19836l75126L97176J90504
$$ y = [2319374, 2144580, 2198400, 2249242, 2443200, 2297409, 2212973, 1628673, 1994014, 2343409, 1979718, 1568034, 1804904, 1972025, 2278078, 2029793, 1883905, 1819694, 1948730, 1865937, 1742408, 1828440, 2056102, 1671986, 1717754, 1710060, 1886700, 1964997, 1958384, 1369831, 1718299, 1585941, 1765134, 1579535, 1980075, 1665385, 1651865, 1723798, 1683983, 1497792, 1669468, 1875832, 1371824, 1579607, 1444950, 1931645, 1457034, 1527677, 1399632, 1626434, 1686382, 1867888, 1339064, 1664690, 1606585, 1424206, 1226363, 1658375, 1510905, 1627983, 1485167, 1395548, 1104649, 1311514, 1443875, 1292595, 1406505, 1647505, 1586140, 1419510, 1214121, 1073977, 1326189, 1071284, 997952, 1370493, 1266361, 1235358, 1115522, 740396, 1137572, 1328076]
13863A328076k60012M6053J93017j91423L96376m45814L49640j94950J9274J23088
13853A363325N3825o44158P8008M8627J54132J12871M3871l9634l87337L79952
13843A163482k36217L01156j05722j03650j13266L37800K53401m57323j38258
13834I01403j75244M04983p3968L4349K9418l04539K56146J10997k02120J98324
13824A179749k96116k82036L47268p0283J80939K51721j65457k46176Q9430j98268
13814G90771K39221j61524K51995R8986j13175n8727l18482R6071J2712R3191
13804I31039r375k24790K88352j1805J7315m47191L04477K48956j90584k46816
13794F59578K04778j71314L43873k479l5942p4194l01387r1928N8418J02658K68282
$$ y = [1328076, 1068064, 1114117, 1307134, 1115711, 1512087, 1066273, 1415913, 1220963, 1240237, 1363325, 1417150, 772992, 851000, 899627, 1053759, 1166630, 1210501, 1170867, 783530, 1163482, 927265, 1228421, 1122699, 1019049, 905783, 1243583, 1496984, 1039661, 901403, 726159, 1131142, 1057174, 1091523, 1120941, 816402, 1072548, 1183545, 981425, 1179749, 883633, 601597, 948865, 878582, 1059521, 1311242, 1145785, 899609, 989039, 790771, 1029992, 868468, 1120463, 1219449, 1106274, 1047547, 729065, 825136, 837848, 931039, 921664, 696874, 985226, 973421, 990736, 543545, 848022, 1096978, 906394, 659578, 864356, 693042, 1036915, 1034436, 998494, 924300, 622913, 530985, 589403, 692061, 960343]
13783I60343j27527J50186j46002k41691K83071J65480l06173K56874j63694j53039
13773F77828L11343D88620J59096J96666q794J67884k16180j58959M28174k18738
13763H37769j36643Q1837j07807o7382k1459O5436O0552r9814L38001K41185l52841
13752H38834k19756L03265l58596J86598m9457l4518j17890n6168J17147L02191
13742I11650j94891j52535K3731J61878j60843J02652J78883A86163K74921N58504
13732A019588k05225k15305k6021k40226L14702J23084l5213J27841K12781j23909
13722I52097j70198C07953M20180j88195L85024l33855j03878M3911P0531j07695
13712D93976K8434k3944K41845j57546o9089O8067r4798o4355L5712J75365M2451
$$ y = [960343, 832816, 983002, 837000, 595309, 878380, 1043860, 737687, 994561, 830867, 677828, 989171, 488620, 647716, 844382, 835588, 1003472, 787292, 628333, 1056507, 837769, 701126, 782963, 675156, 607774, 586315, 651751, 712303, 612489, 950490, 1191675, 838834, 619078, 922343, 563747, 750345, 700888, 666370, 548480, 492312, 609459, 911650, 716759, 564224, 587955, 749833, 588990, 691642, 870525, 186163, 461084, 1019588, 814363, 599058, 573037, 332811, 647513, 770597, 735384, 863225, 1076006, 952097, 781899, 307953, 728133, 539938, 924962, 591107, 487229, 531140, 601671, 493976, 522410, 498466, 740311, 582765, 513676, 581743, 486945, 422590, 458302, 633667, 676118]
13701F76118J18926l18602L47896q3137k3923N1652l49879j60043M54731J08071
13691H21810j37031l00228j13532N48768l32790O5749M7539l9816L81784l95366
13681E46887J20136j08604k78871L21295j66677R3126Q823j74696J60672o9900
13671D52191n6974L21164j25437m532j00261K46417j29678j17622A55832O16859
13661G72691k88197l981Q6712m8790j09893L09941n5741l26129L06553C07062
13650C48981P1083M5970K47680J38670B07181J13853K40174j22192J62598k56833
13640C44781N6497K34297B83789N1790L49723p6437A76200K55890L14316j49713
13630E96693k35166J85060J3404j00349j42631K5953o2039J00662m159K00173
$$ y = [676118, 795044, 476442, 824338, 741201, 717278, 768930, 419051, 259008, 713739, 821810, 684779, 384551, 271019, 819787, 486997, 552746, 600285, 560469, 942253, 546887, 667023, 558419, 279548, 600843, 434166, 527292, 536115, 361419, 522091, 452191, 395217, 716381, 590944, 586412, 486151, 732568, 602890, 485268, 155832, 772691, 484494, 480513, 567225, 518435, 408542, 718483, 662742, 336613, 643166, 307062, 348981, 420064, 466034, 713714, 852384, 207181, 321034, 561208, 439016, 601614, 344781, 401278, 635575, 283789, 335579, 685302, 608865, 176200, 432090, 746406, 596693, 361527, 546587, 559991, 459642, 317011, 342964, 280925, 381587, 377428, 577601]
13620E77601j0728J1350k36988J12518j57615K70328N7718l00298K3976R8766
13610D46628J70667k22576j63273M21983k49897k00466H8444J82563L74679B65023
13599E48490j20081k1495J21718J6421K16016k60988k42496K44647o8592J95004
13589F28644k68761P3154K15293j72435r7155R6170j24457j29559O0541K55957
13579E37392k02326P5863A18984M22036q9757p2532A48888L07736M2578j93838
13569C05364J58555L8392A58417P8405J21504K16591j37954p7779P7012L7376
13559D73572J2455O3522j98712J57814L0609B60152J62126j88181J62483j47617
13549B48963o5740a02676B22325m5132J88809j36612l6500M92672B47586n7739
$$ y = [577601, 566873, 578223, 341235, 453753, 296138, 566466, 624184, 323886, 347862, 446628, 617295, 394719, 231446, 653429, 403532, 203066, 88444, 271007, 645686, 265023, 548490, 428409, 406914, 528632, 545053, 761069, 500081, 257585, 502232, 433640, 628644, 359883, 433037, 648330, 475895, 378740, 474910, 350453, 220894, 281435, 537392, 335066, 410929, 118984, 541020, 451263, 378731, 148888, 456624, 499202, 305364, 463919, 502311, 158417, 236822, 358326, 574917, 436963, 359184, 436196, 473572, 486027, 549549, 350837, 508651, 539260, 260152, 422278, 234097, 396580, 248963, 183223, -102676, 222325, 177193, 366002, 229390, 192890, 685562, 247586, 189847]
13539A89847K87924j40396O5195j92467q7812J50726F5837q656M11850A90493
13528C59329J9020j58101J86789j27713k1416R7946K3016o0259J81458j42020
13518C58049O8084J262j57003K57981B41507M4224Q0685O4921K3265A62248J12266
13507B74514L493j01057J81568P3208j03421j0840M01343B6919L35051j62565
13497A99405K76026o3871F5921J85928D5897P3649K05589R7341m6425j01276N0797
13486C25572A28237m4238K47250J74334B44615j16404K80712k02863N6174K14330
13476D76564M5972k3866A40262N7474L60007k64337F0833M45896j59790J1943
13466C58882j16270m60J19713K803j49090l332P2287b3008F5646N17035A39576
$$ y = [189847, 477771, 337375, 402570, 210103, 122291, 273017, 65837, 57181, 469031, 190493, 359329, 378349, 220248, 407037, 279324, 257908, 355854, 378870, 318611, 500069, 358049, 426133, 427395, 270392, 528373, 241507, 285731, 366416, 431337, 454602, 162248, 274514, 278007, 176950, 358518, 431726, 328305, 317465, 718808, 26919, 361970, 199405, 475431, 411560, 65921, 251849, 45897, 119546, 325135, 422476, 376051, 274775, 325572, 128237, 83999, 331249, 505583, 244615, 128211, 408923, 206060, 262234, 476564, 522536, 498670, 140262, 197736, 557743, 293406, 60833, 506729, 346939, 358882, 242612, 242152, 361865, 364668, 215578, 212246, 284533, -23008, 65646, 582681, 139576]
13454A59490L03591j90807n3127M14521A11822J60874M0464l9717n4780o7720
13444A50943l4684J81377A16603P8077P1945A09627C0294L96666A83806l1102
13434A52704k1941a93A35588R3111q0614D7224O16582A57637P3024q6648K15273
13423C59286q5825f746A78403K25736A14202G703a04099C08851k5763G0535B5637
13411C19896i2509E95627k76038j16286A2748K24041G3369J96546j9941A12686
13400A70187J79546j41449K34787J7159B9890L52005I4677J89124b3418B91708
13389a88312D20598l4738j22583j23706K24711k0639c2468m8683B95704O5761
13379C61465a26281B88000D3773L75573I5571M77089F7878K09865d3934B62515
$$ y = [159490, 463081, 272274, 219147, 633668, 111822, 272696, 313160, 273443, 218663, 150943, 116259, 297636, 116603, 194680, 266625, 109627, 30294, 426960, 183806, 152704, 130763, -193, 135588, 228699, 148085, 47224, 663806, 157637, 230661, 144013, 359286, 273461, -6746, 178403, 404139, 114202, 7703, -104099, 308851, 283088, 70535, 25637, 319896, -92509, 595627, 319589, 203303, 12748, 236789, 73369, 269915, 249974, 112686, 170187, 349733, 208284, 443071, 460230, 29890, 381895, 94677, 283801, -23418, 291708, -188312, 420598, 385860, 263277, 139571, 364282, 343643, -32468, -81151, 295704, 361465, -126281, 288000, 43773, 419346, 95571, 572660, 67878, 277743, -43934, 262515]
13368A90396c3424F07155B10825P526n7457N7730a01789A67614n010R38L29376
13357D92918A79218O0933H9298J96945n9633p5106M59128B23651j5493c5272k3157
13346e8429B77540E1758J29617k0895a40800B69082m3292G2195b6593j420A10102
13334C40128O9124J86080A79034M72143G4585L84322A87848P5801A22279l0159
13324I2120J220J83358o7441M4390H8269J75998j05807M4034Q3636m6612J35655
13313C75173j85012j6063C9255N7612j866J91900J25843A592J77518L02873e6902
13301B21973L48856k46802A47317K53460H4600k4849J58348d5697A53133R4044
13291B47177j04192L10861o9502C3923K18276d4386C9801b7821E80291k43030
$$ y = [190396, -33424, 607155, 210825, 218351, 160894, 218624, -101789, 167614, 162604, 163542, 492918, 179218, 240151, 89298, 286243, 226610, 151504, 610632, 223651, 208158, -35272, -58429, 277540, 51758, 181375, 160480, -140800, 269082, 225790, 72195, -26593, -28013, 110102, 340128, 409252, 595332, 179034, 651177, 74585, 458907, 187848, 263649, 122279, 92120, 93340, 276698, 209257, 253647, 88269, 264267, 158460, 202494, 286130, 239518, 375173, 190161, 174098, 39255, 96867, 95001, 286901, 412744, 1592, 179110, 481983, -56902, 221973, 570829, 324027, 147317, 400777, 84600, 59751, 218099, -45697, 153133, 247177, 142985, 453846, 384344, 33923, 252199, -44386, 39801, -27821, 580291, 337261]
13281C37261m873A38299L3212p7199M4444J4051a32411A49602F0597K00699c00520
13269B82303G1295K04468B8689K35328O368K7778L6753j33180I7108L79619A30901
13257C24052J5369J134F3061K31073B3691P0508a5308C48673a44983B42767g1175
13245B63897I4767a15284D75994A34858d2491f086A37883J72277A22672B862L56132
13234C58994A19786M2239J74380l4877j49953g5350C23879h603B38803B9171K20096
13223B49267L3951E4110L09211A49657O5971o4716E042f3360A1903J39677e8098
13211E8819a0261A86529j1928b35741A50766a07592C12265d1906A94618a14710
13200G2371L2561K6595o029R897P794m64a18210E23999b6761H223Q1694P3976
$$ y = [337261, 332388, 138299, 171511, 94312, 138756, 152807, -132411, 149602, 60597, 261296, -300520, 282303, 71295, 275763, 28689, 264017, 270385, 298163, 334916, 201736, 97108, 476727, 130901, 324052, 339421, 340555, 63061, 294134, 23691, 94199, -15308, 348673, -144983, 242767, -71175, 263897, 94767, -115284, 475994, 134858, -42491, -6086, 137883, 310160, 122672, 2862, 358994, 119786, 162025, 336405, 301528, 151575, -75350, 323879, -8603, 238803, 29171, 249267, 283218, 54110, 363321, 149657, 215628, 150912, 5042, -63360, 11903, 151580, -58098, 58819, -10261, 186529, 174601, -235741, 150766, -107592, 312265, -41906, 194618, -114710, 72371, 104932, 131527, 125498, 135395, 143189, 142725, -118210, 523999, -26761, 8223, 89917, 163893]
13188A63893I558L0391a13546j6180M1740A95091p9020b61020L5398A30069D8487
13176a33356H0171i3460C35383E6522a05452A4682a06410e505C50509G1396R8328
13165A69724J64252a28375c9531j51131c5335a464r267l00962A13206q719h8632
13153a74396B13578C7565O1460b92340B58979p068A12137k1510g4347j71890c3782
13141F7765M71894f0863E3321K54899l0203j07786g9975A84034F1182N8330P7841
13130A97353G969N6113c12004J34505A90777f756A44638L04629k21209f3660l05434
13119c69094a65637B03917I2626J27464b7950A27822a62634C4251J59733J70892
13109C64876A0553J67174G1288M16568k29535G909J83557o3331m9626k3291a32266
$$ y = [163893, 9558, 39949, -113546, -129726, -87986, 195091, 116071, -261020, -225622, 130069, 48487, -133356, 80171, -93460, 335383, 56522, -105452, 14682, -106410, -5505, 350509, 71396, 169724, 333976, -128375, -39531, -190662, -35335, -1464, -10731, -311693, 113206, 104487, -88632, -174396, 213578, 37565, 99025, -292340, 258979, 251911, 112137, 90627, -74347, -246237, -33782, 67765, 539659, -60863, 53321, 308220, 278017, 170231, -79975, 184034, 61182, 119512, 197353, 7969, 64082, -312004, -177499, 190777, -6756, 144638, 449267, 228058, -63660, -369094, -165637, 203917, 92626, 220090, -27950, 127822, -162634, 34251, 193984, 364876, 10553, 177727, 71288, 487856, 258321, 7909, 191466, 128135, 78509, 55218, -132266]
13097C21551q450d4100K0745B83676c859A26527E5012P6563L32567A22876n8955
13086F3921K74069a1219A21709N3281p6352O691E0122d11261A55889a77960H2817
13074A62993a1104F2768j6263J67991r5584K9788J4346K42302C8499O7433J37052
13063B42984K0559a94626A01161a30985e4622B10779o3054F0239L57415A07453
13052b42640c9880B27982A11722K44897b00981B61810E2283c3339a5179D4735
13041g128l3014E14877C7278K24177Q5947c32569C20263A21670Q1154n3167F6670
13029A96503Q9118j9634j24271d0956B76790a43177A54884N60Q4282j14536O8305
13018A93495c434B75368i7996B20959a14508k87345C4169J29639B1385M8409J36605
$$ y = [321551, 313101, -44100, -23355, 283676, -3859, 126527, 55012, 131575, 464142, 122876, 63921, 337990, -11219, 121709, 174990, 98638, 105329, 50122, -411261, 155889, -177960, 82817, 162993, -11104, 62768, 46505, 214496, 118912, 148700, 163046, 405348, 38499, 105932, 242984, 263543, -194626, 101161, -130985, -54622, 210779, 147725, 60239, 417654, 107453, -242640, -39880, 227982, 111722, 356619, -200981, 261810, 52283, -33339, -15179, 44735, -7128, -40142, 514877, 37278, 261455, 347402, -332569, 320263, 121670, 202824, 149657, 66670, 196503, 285621, 265987, 141716, -40956, 276790, -143177, 154884, 155444, 239726, 125190, 193495, -3434, 275368, -97996, 220959, -114508, -401853, 34169, 163808, 21385, 69794, 206399]
13007B06399B8464K54017B1912a887B81199J53880A30021b0739A30417K57543
12997C87960F6432f3449p1294A14315a09078b5817B22427P2361b14715e6815A39903
12985a16647A05235K53219g5577B01283D5779R264L5872D4582b2515o3194C17564
12973A32356h511j07567j60741A44052b33510A62082i0918B98316a31445L1362
12963a00083A27638a44421K3973B46014B9000R2721a12313K7323A16373m3234
12953G3139a53985F5704K5750a5176C4936J98451h1820L5886p747j21932B2622
12941d1343H720J28503a53014G9408n156K11387r3391b1518C56653d89607e3411
12929a9172p5581d1632F0571J4737K06646r2361d1446H9433a11948j45083J12066
$$ y = [206399, 28464, 282481, 21912, -1887, 281199, 435079, 130021, -20739, 130417, 387960, 66432, -63449, -134743, 114315, -109078, -25817, 222427, 294788, -214715, -56815, 139903, -116647, 105235, 358454, -75577, 201283, 45779, 55043, 90915, 44582, -22515, -85709, 317564, 132356, -8511, -116078, -276819, 144052, -233510, 162082, -90918, 298316, -131445, -100083, 127638, -144421, -120448, 246014, 29000, 121721, -112313, -84990, 116373, 73139, -153985, 65704, 91454, -15176, 34936, 233387, -81820, -45934, -53681, -175613, 22622, -41343, 8720, 137223, -153014, 79408, 74252, 285639, 192248, -21518, 356653, -489607, -53411, -19172, -94753, -41632, 60571, 75308, 281954, 189593, -41446, 89433, -111948, -257031, -144965]
12918a44965B55769I2159m2541a01494o1272B79516c4729F6210f008I858K9458
12907C9316g6487C094f1449A3753R519J12346K48607a57159f3407A89565c196
12895h6002C92963c6137l72644J63440Q8220A93070h2300A13731R4154a05828
12884f323A42896E1638K98898A31900M19399A63615G3694A4789a71259B01105
12873d0115B05890o5123o8445J4495b00898B5367J60121o4494J56499d7453A20437
12861a60546m7312A51313h6281A3416J85912c07756L6165j3509B49699r4755L989
12850A58933E6489K91691a44124B17632F1918A3095a34757A39231e042j2002j20494
12839a37538D29733A54185F9046c6491k3803a5500F8750d798E2446K13308N36
$$ y = [-144965, 255769, 92159, 49618, -101494, -162766, 279516, -34729, 66210, -6008, 9858, 39316, -76487, 3094, -61449, 13753, 23272, 135618, 384225, -157159, -63407, 189565, -3196, -86002, 392963, -36137, -408781, -245341, -157121, 193070, -82300, 113731, 207885, -105828, -6323, 142896, 51638, 350536, 131900, 551299, 163615, 73694, 14789, -171259, 201105, -40115, 205890, 140767, 72322, 86817, -200898, 25367, 185488, 120994, 277493, -47453, 120437, -160546, -207858, 151313, -86281, 13416, 199328, -307756, -271591, -285100, 249699, 154944, 158933, 56489, 348180, -144124, 217632, 61918, 13095, -134757, 139231, -5042, -17044, -137538, 429733, 154185, 69046, -36491, -60294, -15500, 68750, -4798, 52446, 265754, 266290]
12828B66290d8545B8302a09317b0137j9150B49150k0298G3640b55272B280c10290
12816A1760J67400m8791O4018e7061A03259J44332G4300a83034B38956H2560i3431
12804b00578C3314b1415j5816j13586N7235A46506b04682h2376c9633C19856a16389
12792d06413D34578A37444N3712o1186a1692q3779B25026D2835a61863A73442
12781A75837a48819B03868N003m1386i9900k64691D5238M4009G179K03664a82062
12769e3469k06787C9600i0994L5301g915B77121a62628e9065A93199n9841m890
12758A28468E3409i2975E8397J02443g5034l1311b0135r9523d1231A97661a41960
12746a16913A82774D0379g0087l90547I7351d29603a652k4854o8288b7873k07319
$$ y = [266290, -48545, 28302, -109317, -20137, -39287, 249150, 228852, 73640, -255272, 2280, -310290, 11760, 179160, 130369, 194387, -57061, 103259, 247591, 74300, -183034, 238956, 82560, -93431, -200578, 33314, -21415, -37231, -150817, -93582, 146506, -204682, -82376, -39633, 319856, -116389, -406413, 434578, 137444, 191156, 129970, -11692, -95471, 225026, 42835, -161863, 173442, 175837, -148819, 203868, 208871, 167485, -99900, -364591, 45238, 89247, 7179, 210843, -182062, -53469, -260256, 39600, -90994, -55693, -7915, 277121, -162628, -59065, 193199, 133358, 128468, 53409, -92975, 58397, 160840, -75034, -106345, -20135, -119658, -41231, 197661, -141960, -116913, 182774, 40379, -70087, -460634, 97351, -429603, -1652, -26506, -94794, -27873, -235192]
12735b35192I832J48411J3814a20540K7715B47488j12688i8877F6320K9531L247
12724I9098k5373J42885r2779D9460K37516N0589b98390a5784k87340B67068B2584
12712B0020L09281n1230h1838m937G4005J16216o4443J0741B1722K01672C6420
12700G2042b33726A10935d5794A04100D2872J81696E0707J1892m637h4669A88732
12688B10449J44904j24078e8946A3199K66615i3858H6477J48618g4381A79683
12677A7192E405J08052j9074O7932d6970G7922k140b71946a23171I8053J96883
12666B94936k1617E3940k5978M3179P5229n6869l1788O6527a17062A70396f6600
12654F9284a02920r0035k37349E5673J65996g2274A01781K57103G13K68784b6806
$$ y = [-235192, 9832, 158243, 172057, -120540, -92825, 247488, 134800, -98877, 66320, 95851, 99098, 73725, 216610, 123831, 49460, 286976, 337565, -298390, -15784, -303124, 267068, 22584, 20020, 329301, 278071, -81838, -86775, 74005, 190221, 125778, 136519, 21722, 223394, 36420, 72042, -233726, 110935, -45794, 104100, 42872, 224568, 50707, 62599, 57962, -84669, 188732, 210449, 355353, 231275, -58946, 13199, 279814, -93858, 86477, 235095, -74381, 179683, 17192, 5405, 113457, 94383, 162315, -46970, 77922, 75782, -271946, -123171, 98053, 294936, 273319, 53940, 27962, 71141, 146370, 89501, 57713, 124240, -117062, 170396, -66600, 69284, -102920, -192955, -430304, 55673, 221669, -72274, 101781, 358884, 713, 269497, -26806]
12642C89495m1780L599a41338D89459B15234i8575a8492A6311M0055a69367A29683
12630A27856O0371A6628J75055c53320J64605C0868a28422C58182D0391i6519
12619f3420k85859i2067L9415b1880A51547C1474K84321q3906K49555D76a97538
12607E87087B07605e5417B26450b4271B8894c56187e3879j36828D9670J7488J34591
12596B01749E879K13114a57983h640A50306b2154p633l97608H1916l8243a06441
12584G7853g5560E4500J5607Q036Q726k2927a74062E0389J73365f6884B62908
12572C4587K85675H9590O230J3060b02665A73760q4749i979A35357f8532E1729
12560A74689O7210a2509F2711f5229H2868a4657m22411a73145K2192C02110J07577
$$ y = [389495, 347715, 351314, -141338, 489459, 215234, -98575, -18492, 16311, 56366, -169367, 129683, 127856, 188227, 16628, 191683, -353320, -188715, 30868, -128422, 358182, 40391, -96519, -63420, -349279, -92067, -52652, -21880, 151547, 31474, 315795, 231889, 481444, 476, -197538, 587087, 207605, -55417, 226450, -24271, 28894, -356187, -53879, -190707, 49670, 67158, 201749, 5879, 218993, -157983, -8640, 150306, -22154, -29787, -427395, 81916, 43673, -106441, 77853, -75560, 54500, 70107, 78143, 86869, 63942, -174062, 50389, 223754, -66884, 262908, 34587, 320262, 89590, 95820, 108880, -202665, 173760, 89011, -9979, 135357, -68532, 51729, 174689, 241899, -12509, 62711, -65229, 82868, -14657, -437068, -173145, -150953, 302110, 409687]
12549D09687a38524e3005l306A34145A578c80325a2187j11954F8798N1437J41051
12538B61286f4690n93095f2341k04709a05698B00915c6664a5187p21H7101J55845
12527B42946f5591J1128j38929A62115a00407B20243P2999H9702K89765a14355
12516b34566D47819a60643H58a40952c9444k04000a0558e135B62826a38890A9918
12504d8441k54617J00880A69524a58560b4611J0918k3626j49437A20241J795a77762
12492A30843J4735b02719A23004J45986A17584a05829B045c34467A90422Q5236
12482B75658I534b49243B65267j08854d85270a18100a9115F0108a1868j86735
12472a98603H1725N3489b58581d9989B54852m4525i6939D17655A21060N5780F8060
$$ y = [409687, -138524, -53005, -56311, 134145, 1578, -380325, -12187, -124141, 68798, 120235, 261286, -64690, -657785, -62341, -267050, -105698, 200915, -36664, -15187, -15908, 87101, 242946, -65591, -54463, -193392, 162115, -100407, 220243, 293242, 89702, 379467, -114355, -234566, 447819, -160643, 858, -140952, -39444, -243444, -10558, -5135, 262826, -138890, 19918, -48441, -303058, -202178, 169524, -158560, -24611, -13693, -37319, -186756, 120241, 122036, -177762, 130843, 145578, -202719, 123004, 268990, 117584, -105829, 2045, -334467, 190422, 275658, 9534, -249243, 265267, 156413, -485270, -118100, -19115, 60108, -11868, -198603, 81725, 135214, -258581, -49989, 254852, 210327, -96939, 417655, 121060, 176840, 68060]
12460B0559d9393A29100j8056a56792d3574n2572j22288F7225a73318o618G1838
12448E1894a04687A26844c1510G1276C1633L05701A58452a16940A53209m792h4528
12436c31342H3685a6839k41755B67737C2025N3120a73821A5365J38010a87654
12425a07072B4917c55450A50707a10826o6020g0441B0075c47265H5334a11596
12414a66252A70406n5799a69723B30329e6121k96237C8820J97444E2789g846o3382
12403g1228A59525e1161l4895q1806A32605J9697n9946a276F7000a01686A02534
12391G6529a32155j13064A1180c09150f1886A44102j4011a87800B36426F9341
12380B7940c3641A93521I0263i7049A85853O1346a28671q1055B12633c50087a11772
$$ y = [20559, -49393, 129100, 111044, -156792, -43574, -96146, -218434, 67225, -173318, -179936, 71838, 51894, -104687, 126844, -31510, 71276, 31633, 337334, 158452, -116940, 153209, 148417, -84528, -331342, 83685, -16839, -258594, 267737, 32025, 85145, -173821, 15365, 153375, -187654, -107072, 24917, -355450, 150707, -110826, -176846, -70441, 20075, -347265, 85334, -111596, -166252, 170406, 114607, -169723, 230329, -56121, -352358, 38820, 236264, 52789, -7846, -71228, 159525, -51161, -86056, -167862, 132605, 152302, 92356, -1276, 67000, -101686, 102534, 76529, -132155, -245219, 11180, -309150, -61886, 144102, 130091, -187800, 236426, 69341, 27940, -33641, 193521, 90263, -97049, 185853, 247199, -128671, -209726, 212633, -350087, -111772]
12368h2437j15178E0953B5147c92412B32437g7029A52391A1132a1739p9860M569
12357h7030A62012H0898B5976Q7602b6439A00588g1422I3855C4825a92179Q2863
12346a09316B4377J46383P4416f2161j29994D7625q789O1620g9969m9574B03692
12334A39230C1828i6663K4987H0735b9128A56010F9007g7757B4877a12493A25279
12322a5983C6867h6982k38158J23798K0021B20848B4217a2010l27539b5735A46076
12310G0521a54712A43859K64360B1028B069P631J23448c45632C1024J10915b7110
12298c1951B6451a10135G340J24831M7919h5491k61716K4310f4345n5086F0035
12286A44791J2361J04932j22336R1759C1840a51308C11895a12670m3769N7475
$$ y = [-82437, -197615, 50953, 25147, -392412, 232437, -77029, 152391, 11132, -11739, -91599, -87030, 162012, 80898, 25976, 113578, -26439, 100588, -71422, 93855, 34825, -192179, -109316, 24377, 170760, 245176, -62161, -192155, 47625, 38836, 100456, -79969, -129543, 203692, 139230, 31828, -96663, -71676, 80735, -29128, 156010, 69007, -77757, 24877, -112493, 125279, -15983, 36867, -86982, -325140, -201342, -181321, 220848, 24217, -12010, -339549, -25735, 146076, 70521, -154712, 143859, 408219, 21028, 2069, 9700, 133148, -345632, 31024, 141939, -27110, -31951, 26451, -110135, 7340, 132171, 180090, -85491, -347207, -322897, -64345, -119431, 60035, 144791, 157152, 262084, 139748, 231507, 31840, -151308, 311895, -112670, -156439, -98964]
12276i8964A91446l7024H234J78124r0680C5273L31855C1112Q9599J13675P5161
12265C09547i9864j2805C97514B0201J26442f2394I7492c04711P7955A91372j7186
12254A74186a61895B91015b95070B3556P8630J36827a54766C15911j24050I2424
12243A36474k3169A9140J76227I0309d3720B62269H1644a4126j41980A6500a03852
12231C3933Q348i4472C07819A45484b03701C23302r8669j01549i987o2343C074
12219f2164k15005A97706k1872b54240A35186K08557j58021K6116p8243K5404
12209A58999K17345l8969J606L4112A19578J06349H1647j5300e3522k4966G9948
12197A51836b36738b8748C02635b89122F4207M12255H6791g7479E4322J93802
$$ y = [-98964, 191446, 154422, 8234, 186358, 95678, 35273, 367128, 31112, 120711, 234386, 309547, -99864, -112669, 397514, 20201, 146643, -62394, 97492, -304711, -226756, 191372, 174186, -161895, 291015, -295070, 23556, 102186, 239013, -154766, 315911, 191861, 92424, 136474, 113305, 19140, 195367, 90309, -43720, 262269, 81644, -14126, -156106, 16500, -103852, 33933, 42281, -94472, 307819, 145484, -203701, 323302, 224633, 123084, -9987, -72330, 3074, -62164, -277169, 197706, 175834, -254240, 135186, 343743, 185722, 211838, 133595, 158999, 376344, 337375, 338981, 373093, 119578, 225927, 81647, 66347, -53522, -78488, 79948, 151836, -236738, -28748, 302635, -289122, 64207, 476462, 86791, -77479, 54322, 248124]
12187B48124L38697E1426J83616B1973L14673j17378J01047J06479d594A63632
12176C07807q0154f5010B55983Q8647b24471d4230j9226j49562K3163B24935F282
12164B80129l3003a58181g3013A58613K05053E3109N11917I6021a82387B07058
12153E221J74255i2027B623J51807b3726E2916K58438L9935A72860D5397c29052
12141b5195A32868J85640n4773c7901j70178A802f3143c1508E6584a5225A65268
12129b94241A56265J55968A9867N2761g264k32534H1973R033a27520B24573G0474
12117H034K24526e6699j79788A34066Q5058c48017B44771j07243d12591h3852
12106b85612L6964D4459a52879K2897D029J22463j9350M2268a75739J1728L6372
$$ y = [248124, 586821, 51426, 235042, 21973, 336646, 219268, 320315, 426794, -4594, 163632, 307807, 227653, -65010, 255983, 344630, -224471, -44230, -63456, -213018, -189855, 224935, 6282, 280129, 247126, -158181, -73013, 158613, 363666, 53109, 565026, 96021, -182387, 207058, 5221, 179476, -92027, 2623, 154430, -23726, 52916, 311354, 351289, 172860, 45397, -329052, -25195, 132868, 318508, 263735, -37901, -208079, 1802, -63143, -31508, 56584, -15225, 165268, -294241, 156265, 312233, 19867, 72628, -7264, -239798, 81973, 91006, -127520, 224573, 70474, 8034, 232560, -56699, -236487, 134066, 219124, -348017, 244771, 137528, -412591, -83852, -285612, -248648, 44459, -152879, -129982, 4029, 126492, 107142, 149410, -175739, -164011, -127639]
12095a27639C62666H6849c0968B2651b60359A81379d3231k75463e2274B9581I531
12083C35197B1095J47072a5054r7978N4040p35B12189H1009K94386b45503D19362
12071A55314f235o5082j53113n0710I6754N4688l7891P5252p9140h4575A6178
12059f1652A4135h608B99741g1840C41450c26450c1922D7545a06796A40795F6216
12047A73756n2003g9971B67878A20631J2151c1535A90145n210a1505B73097g6190
12035a45733b5841l6900k83120B1555J55550b10583A77145p8621a162F4403c3701
12023a05875b1875F3425b46631A54840l7668M4146b53294c8496B29487p5792L26532
12012D80227j25850a76030B07954i896F3033c886q0636n2666B17399b29479G4667
$$ y = [-127639, 362666, 86849, -30968, 22651, -260359, 181379, -43231, -318694, -52274, 29581, 9531, 335197, 21095, 168167, -15054, -113032, -58992, -59727, 212189, 81009, 375395, -245503, 419362, 155314, -6235, -71317, -224430, -275140, 96754, 151442, 113551, 188803, 109663, -84575, 16178, -61652, 14135, -8608, 299741, -71840, 341450, -326450, -31922, 47545, -106796, 140795, 66216, 173756, 121753, -79971, 267878, 120631, 132782, -31535, 190145, 184935, -11505, 273097, -76190, -145733, -25841, -62741, -345861, 21555, 177105, -210583, 177145, 98524, -1162, 64403, -33701, -105875, -21875, 63425, -246631, 154840, 117172, 161318, -253294, -38496, 229487, 153695, 480227, 354377, -176030, 207954, -9896, 63033, -3886, -84522, -137188, 217399, -229479, 74667]
12000B70966a71626g5089m3541a7825k01815A9124a56574j0112l759E9763c35600
11988I537J99060I9855B0993M039a40718e49A77000f9583c1560k0471G5619J64013
11976B39632k7661f7248j9344j29224D4546M9865f5191p6383J2604A0085a03136
11964H3437k8545a53976D23086j90867d41588A19732a47997A65002F154g8116
11953b48822A29059c7260k70684a28319I3940b48680P7064A17516e9470l3161
11943i2631A11204g3360A78847J709O4949o2491a12820j53407a778I7711c3556
11931a1864E1546M7206L1090b11403O5693A63868e0183A04960K69167j04816P3692
11920C43003A1374a57511A1926g9188j33748i213A3959K00565a14819A04015C4751
$$ y = [270966, -171626, -75089, -118630, -17825, -219640, 19124, -156574, -166686, -170445, 59763, -335600, 9537, 208597, 99855, 20993, 25032, -140718, -549, 177000, -69583, -31560, -52031, 75619, 239632, 211971, -67248, -86592, -215816, 44546, 94411, -65191, -141574, -128970, 10085, -103136, 83437, 54892, -153976, 423086, 232219, -441588, 119732, -147997, 165002, 6154, -78116, -248822, 129059, -37260, -307944, -128319, 93940, -248680, -171616, 117516, -59470, -92631, 111204, -73360, 178847, 180556, 245505, 183014, -112820, -266227, -1778, 97711, -33556, -11864, 51546, 98752, 129842, -211403, -145710, 163868, -50183, 104960, 374127, 269311, 343003, 11374, -157511, 11926, -79188, -212936, -9213, 13959, 214524, -114819, 104015, 34751]
11908f017E4642b92423E6584c4147E6604K2932b91255a01476K0600o5218O9662
11897g6432m0881d6662k6400j64265J01120H1369C7484l361L9504b7686q4320
11886a12006a5789F6577a8439A93401k407a24850G3397f2570m4516D6900J94458
11875B41358A886J1941j51g0206j19480E8311L4910a7141B5595J06834c7572H7752
11862a48644j73474R1397d3676E5063g5855m6467K2789A65467k4738a98026l7961
11851b35987G6045k067g2223l23282N2039f9726k2936c2217k61019A2180J10517
11840A22697D2256B1006d63589a33168j58355r9147I9358A5968M550a7929k0714
11829c8643D672M4665b89636R8455K5897F4457N8418b2104k9104G622d93875b42987
$$ y = [-6017, 54642, -292423, 56584, -34147, 56604, 79536, -291255, -101476, -80876, -146094, -76432, -117313, -46662, -73062, -237327, -136207, 81369, 37484, 34123, 73627, -27686, -112006, -15789, 66577, -18439, 193401, 190994, -124850, 73397, -62570, -107086, 46900, 241358, 1886, 13827, 13676, -70206, -189686, 58311, 93221, -17141, 25595, 132429, -37572, 87752, -148644, -322118, -230721, -43676, 55063, -75855, -122322, -99533, 165467, 140729, -198026, -235987, 76045, 73978, -72223, -395505, -343466, -69726, -92662, -32217, -293236, 12180, 122697, 42256, 21006, -463589, -133168, -291523, -390670, 99358, 15968, 20518, -17929, -38643, 4672, 49337, -289636, -191181, -165284, 64457, 122875, -22104, -51208, 7622, -493875, -242987]
11816a28010A06521L8671h8429j31430k250A45999a03101a5101j78697c8765k3042
11805f1807K9155j56126E5834a08373A86115c7370k4534D0881a4372A88355F7087
11793D6725b97582d1579B18425a29281p7549f2099j33068A28021a26012a3781
11782B17867c5235A80494a49714A07621i9125L7014k62052A83921o665q707k7202
11771A41347a95926G2120c74208I4522K83865a97203i2221A31957a18255p978
11761a26233b2200G3203J7357J0934a38880C2619c92339A60697d8112j09257M9212
11750a08157K2890B3278d702B2145a7979C4869b11014D06243a4975F5767A449
11738A70847E2744c12800A44144k9835a75130D7304a91759A68685a77493g470
$$ y = [-128010, 106521, 145192, -88429, -219859, -222109, 145999, -103101, -15101, -193798, -38765, -61807, -32652, -188778, 55834, -108373, 186115, -37370, -61904, 40881, -14372, 188355, 67087, 46725, -297582, -41579, 218425, -129281, -206830, -62099, -195167, 128021, -126012, -13781, 217867, -35235, 180494, -149714, 107621, -99125, -62111, -324163, 183921, 177256, 168549, 141347, -195926, 72120, -374208, 94522, 378387, -197203, -92221, 131957, -118255, -126233, -22200, 73203, 90560, 101494, -138880, 32619, -392339, 160697, -48112, -157369, -108157, -85267, 23278, -4702, 22145, -17979, 34869, -211014, 406243, -14975, 65767, 1449, 170847, 52744, -312800, 144144, 114309, -175130, 47304, -191759, 168685, -177493, -7470]
11727B06488p0181n0820J06517G1660K5993a05591b9801j82918A2010b53644K8409
11716b25235B67853o5298f5260p3301M1433a9948D8657M7976K65732a45183A66281
11704D2926a34233A5174f906k14199G3135b48154E9380J2149a06012A53699f0907
11692a30887L2961l259A51880D9846a07358I9067i423k7610k16041B70339b01129
11680B520M6118J67820G5122B4464L0433L60710d0789I3539c11003H4600f077
11668E5238N2954J02380l6857p9128a25930j40353a08953k256A04095E1050a3405
11656A54008F0173K10740a40366B24128D5220j094a33198c8554A54973m2901P2932
11645A85004a91686B75139a320G2431C2538K15770J1608a54177O1752A63041a92470
$$ y = [206488, 136307, 85487, 192004, 71660, 97653, -105591, -29801, -212719, 12010, -253644, -225235, 267853, 202555, -65260, -138561, -97128, -19948, 48657, 96633, 362365, -145183, 166281, 42926, -134233, 15174, -6906, -221105, 73135, -248154, 59380, 71529, -106012, 153699, -60907, -130887, -97926, -101185, 151880, 49846, -107358, 99067, -9423, -37033, -253074, 270339, -201129, 2520, 48638, 216458, 75122, 24464, 54897, 415607, -40789, 93539, -311003, 84600, -6077, 55238, 108192, 210572, 173715, 94587, -125930, -266283, -108953, -111209, 104095, 51050, -13405, 154008, 60173, 270913, -140366, 224128, 45220, 44126, -133198, -38554, 154973, 112072, 185004, -191686, 275139, -1320, 72431, 32538, 248308, 259916, -154177, -92425, 163041, -192470]
11633f8047C1329J73867D1485c20690A13834L1446a0596C12887a52599A89701
11622A17697b54960D3994l092a4890A31154m7819C0320K5378B5192a65557F6367
11610C8473a60510f7907G5039h9852A80770a23863d6303o154m0492j70182C0428
11598a69040e7722a8166B55707f5651k26385F3427a8849A63947q1177b17936B51351
11586a90538A2313a03868C64562f4277j37598a0089o3774B85836F1955B9366K58236
11575B87602D7021J12419g5420J0059B04236O1177j28551a94589A35083b44963
11564a7165j5850E5417h1254B4308L84544M3487e9954E8008K04865d1894A19138
11552C5563f5116F6379k5109b47917B18109D3802O086J08037F9484a2248n5106
$$ y = [-68047, 31329, 205196, 41485, -320690, 113834, 145280, -10596, 312887, -152599, 189701, 117697, -254960, 43994, 40902, -14890, 131154, 83335, 30320, 55698, 25192, -165557, 66367, 38473, -160510, -67907, 75039, -89852, 180770, -123863, -46303, -52457, -92949, -263131, 30428, -169040, -57722, -18166, 255707, -65651, -292036, 63427, -18849, 163947, 82770, -217936, 251351, -190538, 12313, -103868, 364562, -64277, -201875, -10089, -73863, 285836, 61955, 29366, 287602, 47021, 159440, -75420, -65361, 204236, 265413, 136862, -194589, 135083, -244963, -17165, -33015, 55417, -81254, 24308, 408852, 452339, -59954, 58008, 262873, -41894, 119138, 35563, -65116, 66379, 41270, -247917, 218109, 43802, 49888, 157925, 69484, -12248, -67354]
11541f7354D4323q148K85860B3863J67708c06706L7322H4758J81650f1016A60724
11529a45937A43295n6462A819R303J77254J789M5545m0716L67784f1131r5379
11518a56510J8640M3227A95134L8594J8093E9934c0868l8230m7078j6478a8027
11506c8691A72482f9857A02261Q7556a14440c0511I3788j7613M5439Q4662R9407
11495C05683d15264A02092O7022L9780b0866A68733a84583O1586A28092n7520
11485G0572d3451A90427P4469M0727B2555P817i2556A04155k6211J96001c97536
11473B13585i6366F8815J63572N7329d9557l2398A04427K8809Q6419l35r3848
11462A25472J2482c04064C49296L9055d0689A63940c5931C07119H9599j532J15556
$$ y = [-67354, 44323, 36175, 322035, 23863, 191571, -306706, -269384, 84758, 266408, -61016, 160724, -145937, 143295, 86833, 1819, 11122, 188376, 190165, 235710, 194994, 562778, -61131, -156510, -137870, -94643, 195134, 233728, 251821, 59934, -30868, -69098, -116176, -132654, -18027, -38691, 172482, -69857, 102261, 189817, -114440, -30511, 93788, 76175, 121614, 206276, 305683, -415264, 102092, 169114, 208894, -20866, 168733, -184583, -122997, 128092, 70572, -43451, 190427, 264896, 305623, 22555, 30372, -92556, 104155, 77944, 273945, -397536, 213585, -96366, 68815, 232387, 289716, -49557, -81955, 104427, 133236, 219655, 219320, 125472, 137954, -304064, 349296, 388351, -40689, 163940, -35931, 307119, 89599, 88067, 203623]
11451B03623a26592K1672H2269J6543e671B53663l2523b67206G4399k2711Q7757
11440A39445a03029j03261L1414A41642F9062L7551L37914h8204E6861b51844
11429C6806d4224B04397k7473p2932K7090r769j9151K17095l2982A11485c0974
11417A00224J01018a83925R0256L1138H3754c94399B7965L24162h4916j29925
11407b14841B96766a17810A03381a20900j13864A83628D7677R4348b57917B70845
11396b13738E4943e7162j7684m6846B4153a23655A09881k0829N955J53996a7477
11384A20221D165J59573a23840b9942F4042f6842A90528I3616h3263H4679a72620
11372a74584o1984a17048j54820h7832A50131B8064J43604g3322k73145I9215
$$ y = [203623, -126592, -104920, 82269, 98812, -5671, 253663, 221140, -267206, 74399, 51688, 139445, -103029, -206290, -174876, 141642, 69062, 106613, 444527, -88204, 56861, -251844, 36806, -44224, 204397, 176924, 103992, 131082, 121313, 102162, 319257, 286275, 111485, -30974, 100224, 201242, -183925, -93669, -62531, 83754, -394399, 27965, 352127, -84916, -214841, 296766, -117810, 103381, -120900, -234764, 183628, 47677, 142025, -257917, 270845, -213738, 54943, -57162, -74846, -121692, 24153, -123655, 109881, 89052, 95007, 249003, -17477, 120221, 4165, 163738, -123840, -29942, 64042, -66842, 190528, 93616, -83263, 84679, -172620, -174584, -236568, -117048, -271868, -87832, 150131, 28064, 171668, -73322, -346467, 99215]
11361A85109J53623A53305n6898J98359A47321a5821k07753a6903k60453B63114
11350e4198j32428g920j61624A27266B1869b49365J12179o716n2579Q2341D6868
11338a85270C54027c38164G0936b41337A45389a22034A83859a29601e9212b2086
11327f2348B28565j1673R4742a4803j79759b4008k44843D03519A13931a41806
11316b86866L8163a24151j24276i6384A19709c85192d8363Q77k00505a22155C91474
11304g4359A14601a97506B77287a23614E8745d18079c6154A38366B1359a60704
11293g3588K8744j24583A74706e6234B12283a63666N8455L4126H351g3035p4885
11282a47920O7337K2298H3394h9748J8064k32611B09902a17291l2568j07868a18574
$$ y = [185109, 338732, 153305, 96407, 294766, 147321, -15821, -223574, -16903, -277356, 263114, -54198, -186626, -7920, -169544, 127266, 21869, -249365, -137186, -143902, -196481, -114140, 46868, -185270, 354027, -338164, 70936, -241337, 145389, -122034, 183859, -129601, -59212, -22086, -62348, 228565, 216892, 311634, -14803, -194562, -24008, -268851, 403519, 113931, -141806, -286866, -248703, -124151, -248427, -96384, 119709, -385192, -48363, -47486, -247991, -122155, 391474, -74359, 114601, -197506, 277287, -123614, 58745, -418079, -36154, 138366, 21359, -160704, -73588, -44844, -169427, 174706, -56234, 212283, -163666, -105211, -71085, 8351, -73035, -147920, -80583, -58285, 83394, -89748, -71684, -304295, 209902, -117291, -149859, -257727, -118574]
11270f1778j98516L2323A67421J34343E4327Q0801b41884I386a78865A15044d18068
11258a03116n00A57983b90419J39550A04379l6410a58038A87470F6518d7651j27719
11247a75370H694J7222f9295A47204l5030a99678F8133Q5171n8481b85863J28381
11236a57482j0593f7245j62816b2626H4191j9719h2063m3183c6186n439o6038
11225a07663l9775a1187k01323C7161J58072b2209j95661c0928j86651j9549r0658
11214c27786J04939N7273A04220b2544j65444c1958A37744a94532P5310o2246
11204a81468D2277A1320a02111A35730b01776c4573j30196C6439J36297c76880
11193B62623b61131A09790N4029A3962a45318M1305C9740J55675c3367K742j01575
$$ y = [-61778, -260294, -227971, 167421, 301764, 54327, 135128, -241884, 9386, -178865, 115044, -418068, -103116, -103616, 157983, -290419, -150869, 104379, 67969, -158038, 187470, 66518, -47651, -175370, 8694, 25916, -69295, 147204, 112174, -199678, 68133, 153304, 94823, -285863, -157482, -168075, -67245, -230061, -22626, 84191, 64472, -82063, -125246, -36186, -41625, -107663, -147438, -11187, -212510, 37161, 195233, -22209, -217870, -30928, -217579, -237128, -327786, -222847, -165574, 104220, -22544, -187988, -31958, 137744, -194532, -119222, -181468, 42277, 11320, -102111, 135730, -201776, -34573, -164769, 36439, 172736, -376880, 262623, -261131, 109790, 163819, 13962, -145318, -104013, 39740, 195415, -33367, -30625, -132200]
11182a32200O4993A83010g8746B3305a92115A56980i4331j04556A90372h553p0078
11171g8631A12777B7688f6343E3442a28798O742C3224d3221j36631h5690B50477
11159c56067A11885b01912C01736C4438r473c14686e9763k316I1549B8848e3542
11147C07028c0303k9874j78044F9594Q9128R303b15039B0202c52791R9116A71500
11135A93756b56797B22788O0314a25883B10622a29578J9120A67937c92600D8764
11124c2404j01202j983J4373k09508J31164B41835o4301a29102d5300n8001A02290
11112A13004F912g7985A4269N3742O0425b47367a04953N0853K2467A64086J50105
11101C14191H4271k2849j2154J35021J05279b47958A66964M2034g8391A50250
$$ y = [-132200, -67207, 183010, -78746, 23305, -192115, 156980, -94331, -198887, 190372, -8553, -78631, 112777, 27688, -66343, 53442, -128798, -122056, 33224, -43221, -179852, -85690, 250477, -356067, 111885, -201912, 301736, 34438, 24965, -314686, -59763, -62079, 91549, 28848, -53542, 307028, -30303, -60177, -238221, 69594, 158722, 168025, -215039, 20202, -352791, -253675, 171500, 193756, -256797, 222788, 283102, -125883, 210622, -129578, -110458, 167937, -392600, 48764, -32404, -133606, -135589, -121216, -330724, -199560, 241835, 177534, -129102, -45300, -103301, 102290, 113004, 6912, -77985, 14269, 68011, 128436, -247367, -104953, -54100, -31633, 164086, 314191, 84271, 61422, 49268, 184289, 289568, -247958, 166964, 208998, -78391, 150250]
11090B1545K01855i1715j14884B85469B2801K75500b6306G0992a02413A37458
11079B05872K6075j5071J06026F4501J14383d3170B41271b2434m0316C27168A25206
11067C12958H4784j6363l862g0684A53011J90337j32456M53925l17148D4724J34213
11056A78937K79979j70057K48696A75199n216J75242K46698k82526j47387n8486
11046A03524K29677K12890p0849j61459J97599O1393Q8232k99671K311K35808
11036E99455m1148j2743B38565J11348M08700L9191l45676K48780j24112J59614
11026G36410l53430K72271k03979J49014O5446K3287P4768l42734r7375L47845
11016F71523B68200J55316N18273k25501j78544J53915O4240C26912K43378o4476
$$ y = [21545, 223400, -91715, -206599, 285469, 22801, 298301, -26306, 70992, -102413, 137458, 205872, 231947, 216876, 322902, 64501, 178884, -43170, 241271, -22434, -62750, 327168, 125206, 312958, 84784, 68421, 64559, -70684, 153011, 343348, 210892, 664817, 347669, 44724, 178937, 458916, 288859, 537555, 175199, 169983, 345225, 591923, 309397, 162010, 103524, 333201, 546091, 475242, 313783, 511382, 572775, 661007, 361336, 363647, 599455, 558307, 545564, 238565, 349913, 758613, 797804, 452128, 700908, 576796, 736410, 382980, 655251, 451272, 600286, 665732, 689019, 763787, 421053, 323678, 671523, 268200, 423516, 941789, 716288, 537744, 691659, 755899, 326912, 570290, 505814]
11006E05814L5582J6651J04534j22958p8221n7731j39902J86585J78679j51321
10996D77712C8699L3602L03041M1659R5673J13504o6395K30032l14116Q073j28255
10985C55517q7675L98948J89085p2155l49210L97369B51487N70315j52407K7257
10975F96652k17128L40930n7691j18824K12534M04424l77847K73717k31499J26033
10965A051301J63313k53407L13680J20114J29511K70125j20164P52013j31972
10956B294514m40396l2874J94394l12501j83763k15879L89132l41827K05902n9459
10946A497243l85225K41141l15940K84972k83479K1254J21177K2638j79852j09521
10936I14408j56164J43388J4761D53197J12321K8282B87759K36674A16760k4539
$$ y = [505814, 541396, 558047, 662581, 539623, 461402, 403671, 263769, 450354, 629033, 477712, 38699, 72301, 375342, 417001, 512674, 626178, 559783, 789815, 475699, 483772, 355517, 267842, 666790, 855875, 783720, 434510, 831879, 251487, 821802, 669395, 696652, 479524, 820454, 762763, 643939, 856473, 1260897, 883050, 1156767, 925268, 1051301, 1214614, 961207, 1274887, 1395001, 1524512, 1794637, 1674473, 2426486, 2294514, 1854118, 1821244, 2015638, 1703137, 1519374, 1303495, 1692627, 1350800, 1556702, 1497243, 1112018, 1353159, 1037219, 1322191, 1038712, 1059966, 1181143, 1203781, 1023929, 914408, 758244, 901632, 916393, 453197, 565518, 593800, 287759, 524433, 116760, 92221]
10926I2221d2346H9959L49609p3013j82712d4016j22677B09433I1954b48493A14234
10914C6407a03926j12537N8622j14779A66969G2599Q9779B470g1453k17042e572
10902h7194A38683j3291a02816m2152L6235j4841l42059d5984I5940O6323b739
10890b4639j81633I909K7980m124J30219O8096E3640K36403A44844J92067c29670
10878a17148a4215r037E2936J34745b30347A16911K23102a49117A59448J33998
10868B93446H3866g1025b1303B4871b39123F0494k5693a21556A4529J03073b16970
10856C66702B2154N8606L5745d2639j10181E6891K06318a04315M0359A1721a77752
10844B729c00908K0241G4491g0668A63363m1049d15038a09039D7476C443a64230
$$ y = [92221, -42346, 89959, 439568, 366555, 183843, -44016, -166693, 209433, 91954, -248493, 114234, 36407, -103926, -216463, -157841, -272620, 166969, 72599, 162378, 2470, -71453, -288495, -5572, -87194, 138683, 125392, -102816, -144968, -108733, -123574, -465633, -45984, 95940, 162263, -2739, -24639, -206272, 9909, 37889, 33765, 163984, 232080, 53640, 290043, 144844, 336911, -329670, -117148, -14215, -23252, 52936, 187681, -230347, 116911, 340013, -149117, 159448, 293446, 83866, -71025, -21303, 24871, -239123, 60494, 34801, -121556, 14529, 117602, -216970, 366702, 22154, 80760, 116505, -42639, -152820, 56891, 263209, -104315, -63956, 11721, -177752, 2729, -300908, -280667, 74491, -70668, 163363, 122314, -415038, -109039, 47476, 3443, -164230]
10832d8951j55662B0071L07277a10686l2357q0659k0617G3040a43970B160a62515
10820B34136b76244J13325P9564B28778Q5457a13835A95823c1796j75126A66398
10809e48145a43228C7824i6855d7640G8040a68833f096H653f2109j19655J7524
10798a64240f8437M629H4100J95981d2093k875n1090B18423b65769G0349b66804
10786f1378B3881a0474E3705i4236j44891P3013O1715A37390a64081G2582J37045
10775B09627a01621B09916C1390i4193B28756c55611e7843B4285i5471C46308
10764a08094B00564J62529b76413A34616a26505f934l00972h3796A70285e0200
10753b33223p809a07691F9980i5351k29669b0080j94071c9773n1680B55668o9528
$$ y = [-48951, -204613, 20071, 327348, -110686, -143043, -223702, -244319, 73040, -143970, 2160, -162515, 234136, -276244, -162919, -83355, 228778, 314235, -113835, 195823, -31796, -206922, 166398, -548145, -143228, 37824, -96855, -47640, 78040, -168833, -6096, 8653, -62109, -181764, -164240, -68437, -63808, 84100, 280081, -42093, -44968, -96058, 218423, -265769, 70349, -266804, -61378, 23881, -10474, 53705, -94236, -239127, -166114, -104399, 137390, -164081, 72582, 209627, -101621, 209916, 31390, -94193, 228756, -355611, -57843, 24285, -95471, 346308, -108094, 200564, 363093, -276413, 134616, -126505, -6934, -307906, -83796, 170285, -50200, -233223, -241032, -107691, 69980, -95351, -325020, -20080, -214151, -39773, -91453, 255668, 186140]
10742A86140c9649J8485j33780c3105G9208K18448D7485K18709f333j5321F9943
10730A8392b37632G8919K72944b31558J2823j8123J4607E0277e77622a42851A677
10718B8778M67481d51291b17794J02125E3301a07717A6012R9584E4906A3125Q7733
10707A00858f5342B30725a15835q9834j54494J20146N9253A83202G0658K79486
10697C50144a17659e1589A53816c96896a26865B8187l7b4341C24119b93222d9224
10685a28709A24835j3643h3587A85404a78413B36967J0944A0281M2542a93867
10674A29852b0545H0490k0074a1618j44839n1943P8263j144j36329a02663q3688
10663a86351g4125l4742A4041c49901Q5688D4884i4792A50654b39493a7494r5635
$$ y = [186140, -39649, -21164, -154944, -33105, 79208, 297656, 47485, 266194, -6333, -21654, 69943, 18392, -237632, 78919, 351863, -231558, -218735, -236858, -222251, 50277, -577622, -142851, 1677, 28778, 496259, -451291, -217794, -115669, 53301, -107717, 16012, 115596, 54906, 13125, 100858, -65342, 230725, -115835, -205669, -360163, -240017, -180764, 183202, 70658, 350144, -117659, -51589, 153816, -396896, -126865, 28187, 28150, -24341, 324119, -293222, -49224, -128709, 124835, 111192, -83587, 185404, -178413, 236967, 247911, 10281, 52823, -193867, 129852, -20545, 80490, 60416, -11618, -156457, -208400, -130137, -131281, -267610, -102663, -186351, -74125, -108867, 14041, -349901, -264213, 44884, -94792, 150654, -239493, -17494, -113129]
10652a13129D8688A4840a33113d0854k27455J0770a10035g949j97846e8178j41158
10641a99336c7109j2547M678A14005a57684P1025k21430A63124C7863b56756g6193
10629a58290c0449C0959a59117r0085o8948h0266k05005C0148a64992k4444c6999
10617a67893B23715p3394b13j567G5007a19776e4777j5865k0321K4791A37026
10605a63698K3743j2817M8782A12351b34159c4152j10920G201J7998a79859f630
10593b68502C34755a35295B29519a8259j61935O7118j6390M5549j02472k479A53580
10581c59622N8115I3150b0700l7467b4573G9018a09746o1463F7083N2302r904
10570A09481J56416o191o9965h8890A28136c0243a4787j7724C48219b15675B67736
$$ y = [-113129, 48688, 14840, -133113, -40854, -268309, -257539, -110035, -7949, -205795, -58178, -199336, -37109, -49656, -44978, 114005, -157684, -86659, -308089, 163124, 37863, -256756, -76193, -158290, -30449, 30959, -159117, -249202, -318150, -80266, -285271, 30148, -164992, -189436, -36999, -167893, 223715, 150321, -213, -1780, 75007, -119776, -54777, -70642, -90963, -66172, 137026, -163698, -139955, -152772, -103990, 112351, -234159, -34152, -145072, 7201, 25199, -179859, -6630, -268502, 334755, -135295, 229519, -18259, -180194, -113076, -129466, -83917, -186389, -188868, 153580, -359622, -301507, 93150, -20700, -58167, -24573, 79018, -109746, -171209, 67083, 119385, 109481, 265897, 259706, 189741, -88890, 128136, -30243, -14787, -32511, 348219, -215675, 267736]
10558a79117m0068A82384i5583p4186M8226A58257o3058b82828A59448e219A5920
10546B6985J13194h1706P950q4950A50585e8910j1460j05047o4147R9127H6283
10534b03645B13665a81755A12954i838j98490B8270K5345f2270m1139K0193q9919
10523a73135K7461d6935D1426d6772b227p1475k38867A0179f4652K6968B0418
10511c54341A67358a04749d0013j98183l3392g8980B17106m5678m1084c29103
10500C90260B260b8113e505l01267p2350D53021i5069n2757K3894n7018c4393
10488H1041i28j13877B66994a24796a5646j62361P6807A74813B8075a90119F3901
10476a06524A72702a36002r5572b321B88281J00167j54447K94450l4785j59560
$$ y = [-179117, -219185, 182384, -95583, -169769, -121543, 158257, 95199, -282828, 159448, -5219, 15920, 26985, 140179, -81706, -73756, -158706, 150585, -58910, -70370, -175417, -239564, -140437, 86283, -203645, 213665, -181755, 112954, -9838, -208328, 28270, 53615, -62270, -103409, -83216, -173135, -145674, -46935, 41426, -46772, -2227, -73702, -312569, 10179, -64652, -37684, 20418, -354341, 167358, -104749, -40013, -238196, -271588, -78980, 217106, 171428, 130344, -329103, 390260, 2260, -28113, -5505, -306772, -379122, 453021, -95069, -147826, -123932, -180950, -34393, 81041, -928, -114805, 266994, -124796, -15646, -178007, -101200, 174813, 28075, -190119, 63901, -106524, 172702, -136002, -231574, -2321, 288281, 388448, 234001, 528451, 493666, 334106]
10466C34106k9068N4789a4400k3790C5906O1844b00121O6711B67273c05405B0508
10454a24850B79112G6620a05068R432n6830A38213a22369j08250a08140j11140
10444b19280E1421B1J92152a45810j36708N6648k02078C2545a27802A44300a50730
10432b2049F182a69348B48533E4258f299j15475j07368A89218h2609K7530C6247
10420b02139l29215e049B31050b36777h400k1017H8592a09514A32544L3413a52326
10408D9374f366k5979H50M6770a05585A15268b8066n9613B12673b2364j13609
10397a35973O1712q16j19828C87251b20835b2898A14523E0534J00415b38764h8266
10385i2872M2274A40878L6503C6989b53102J16548A41148C8478N7729f2396K3163
$$ y = [334106, 305038, 359827, -14400, -38190, 35906, 97750, -200121, -133410, 267273, -305405, 20508, -124850, 279112, 76620, -105068, -95636, -152466, 138213, -122369, -230619, -108140, -219280, 51421, 21, 192173, -145810, -282518, -225870, -427948, 32545, -127802, 144300, -150730, -22049, 6182, -169348, 248533, 54258, -6299, -121774, -229142, 189218, -82609, -55079, 36247, -202139, -531354, -5049, 231050, -236777, -8400, -29417, 88592, -109514, 132544, 165957, -152326, 49374, -6366, -32345, 850, 47620, -105585, 115268, -28066, -87679, 212673, -22364, -135973, -74261, -75077, -194905, 387251, -220835, -22898, 114523, 50534, 150949, -238764, -88266, -92872, -50598, 140878, 177381, 36989, -253102, -136554, 141148, 38478, 96207, -62396, -39233]
10374c9233b550A89776b23610I9359J09199G9108K28763E3229M4601J18129K9890
10363B45849b96534B81309n7402J7845p7740J45020j7060r4240q044H2068B7930
10351B40908A08448L346j9368K98491j83899g712A31943k3297K41107A31143J00614
10340B31757J77998j07369k6074m2752p3040K71726n8458J71811k05022p3926
10330B66651L32167i977C3844J538J72416J28927I8916O8267n1251l5933a00963
10318A78631G1226Q9642a9922D6630J52155a63635C08040a2743F7672A1378K15818
10307B27196a46246A83878G6235J40379p315K4914A02581J4975M481M606a25759
10295b9073j30317j1636e3526o5830b0240j03698E2248b13355k10099d5138A17001
$$ y = [-39233, -2550, 189776, -223610, 99359, 208558, 79108, 307871, 53229, 97830, 215959, 245849, -296534, 281309, 223907, 241752, 164012, 309032, 291972, 197732, 189688, 82068, 27930, 240908, 108448, 111794, 92426, 390917, 207018, -7712, 131943, 108646, 349753, 131143, 231757, 409755, 302386, 276312, 233560, 160520, 432246, 373788, 545599, 340577, 266651, 598818, -9977, 33844, 35382, 207798, 336725, 98916, 167183, 115932, 79999, -100963, 178631, 71226, 160868, -19922, 46630, 198785, -163635, 308040, -12743, 67672, 11378, 227196, -146246, 183878, 76235, 216614, 209299, 234213, 102581, 117556, 122037, 126643, -125759, -29073, -159390, -171026, -53526, -119356, -20240, -123938, 52248, -213355, -423454, -45138, 117001]
10283B1158f7536q5614J480C2466L03714a82336j17061B90017e7061J6958k6838
10272f6941A09620b85639E3327K6105b53100B58489b3493A69464d6463G2798J58757
10261B31555a87626l25797C84396G7568c85053L6278a1022p0401A31630a54508
10250C7488J66718I1940l6551P9160k7228J19434K7322j21198O8044a4710j07622
10239a22332b4505k12634B29832b9540j9959j59312k08693b7928p025j89987D787
10227c18078B24360a36425A17010A9212b32020N9811m01196E0112a13719b4471
10216A11110D6412b65306P1037C9905l464c0012A65510B1909a68013M5710A79481
10204h0285G903Q5856b6169k07244A53062c03400d9482q2742D12d5864o3916l4689
$$ y = [21158, -67536, -153150, -151670, 32466, 336180, -182336, -299397, 290017, -57061, -40103, -66941, 109620, -285639, 53327, 79432, -253100, 258489, -23493, 169464, -46463, 72798, 231555, -187626, -513423, 384396, 77568, -385053, -348775, -11022, -81423, 131630, -154508, 37488, 204206, 91940, 55389, 134549, 107321, 226755, 254077, 132879, 200923, -14710, -122332, -24505, -237139, 229832, -29540, -49499, -208811, -417504, -27928, -34953, -224940, 4787, -318078, 224360, -136425, 117010, 19212, -232020, -172209, -573405, 50112, -113719, -24471, 111110, 46412, -265306, -194269, 39905, 36441, -30012, 165510, 21909, -168013, -122303, 179481, -80285, 7903, 93759, -26169, -233413, 153062, -303400, -49482, -132224, 412, -45864, -109780, -144469]
10192a44469C0965a01365A1883J70864q2278J2733f5047A52876i2163k43174C99350
10180a14689j46510A0931i282B61592b6282j21389A9499g719m12229C97860B748
10168A88881C8053c432G5307J9338a70423B76801a56664R016K0997J528B26735
10156h932k18117N7571c2369m822A74423a5023B25919a41534j2095e8885A3748
10144A06984a37400B7345a57268k04254K6178i6079o9228j55124O2351A13205
10133a14403A26580e6445l8439A18151a1597k05246B4155R9251K2944h328D0882
10121b22135B4221M1574i0935B5459b444j65821A8592a75164k37171f2757k52618
10110c15375g8479k37366e2963j03642o1061j21552J379H8450a10399N0681A35363
$$ y = [-144469, 30965, -101365, 11883, 182747, 100469, 113202, -65047, 152876, -92163, -335337, 399350, -114689, -261199, 10931, -9282, 261592, -26282, -147671, 19499, -7719, -419948, 397860, 2748, 188881, 38053, -3432, 75307, 94645, -170423, 276801, -156664, -147648, -126651, -125123, 226735, -8932, -227049, -169478, -32369, -37191, 174423, -15023, 225919, -141534, -153629, -58885, 13748, 106984, -137400, 27345, -157268, -361522, -335344, -96079, -165307, -320431, -258080, 113205, -114403, 126580, -56445, -94884, 118151, -11597, -216843, 24155, 123406, 146350, -8328, 40882, -222135, 24221, 65795, -90935, 25459, -2444, -168265, 18592, -175164, -412335, -62757, -315375, -78479, -315845, -52963, -156605, -217666, -339218, -337839, 88450, -110399, -59718, 135363]
10098A95075a08430l40017a37004A23917L138M0801q2717L9657c42429a02719
10087A14614N1h4592r2411H3417a51966f4377C48384B3642d2586l50669a52855
10075i6915A80623Q2364H164c40285g4011c07A13806E3281b60457A71360i5122
10063b65115A39277l9081K68768C1064g5205L273k57583a62814A63444e547j65696
10052a71243G6192a57177M4668C9379a65094M712d2343C0929a24884B22326r7816
10041A24510a11716A39509c06172B14247e6999C4268i7676n7137j16147B57558
10030c7316k49402j76720b17568R6120o0069k52112a54243n9735K2817b6307p1539
10019i7846B31759b77258g2659k5776B53279E4055a70230j88019e981n0043k8715
$$ y = [195075, -108430, -448447, -137004, 123917, 127055, 167856, 85139, 124796, -342429, -102719, 114614, 114665, -84592, -177003, 83417, -151966, -64377, 348384, 23642, -42586, -393255, -152855, -96915, 180623, 262987, 8164, -340285, -74011, -307, 113806, 53281, -260457, 171360, -95122, -265115, 139277, 100196, 368964, 31064, -75205, -71932, -329515, -162814, 163444, -5547, -171243, 76192, -157177, -112509, 39379, -165094, -160382, -42343, 30929, -124884, 222326, 124510, -111716, 139509, -306172, 214247, -56999, 34268, -97676, -154813, -270960, 257558, -37316, -286718, -463438, -217568, -121448, -181517, -433629, -154243, -213978, -191161, -26307, -97846, 231759, -277258, -72659, -98435, 253279, 54055, -170230, -358249, -5981, -56024, -84739]
10008h4739k04296f2593A70935a32678E871a79509c2165j33404E9380O9057c0614
9996A30914g9221j43926A8945a89883k13224a08542G4385I992a69012Q4064b5488
9984d56041i8335A53251a62777F8853b6248k4267D1466C010c2838C5031a63134
9972a52237k78563a7242B15139a617j65935E1968h5753p1041B32496a78158c9867
9960c1816k60500G2607a90559a6382k01860J2574g2913j41716B43h6329i848H3024
9947a6879k0678D1368a4987b359l0575k64096A47010e2121J9053I6007a37481
9935a58666E9027J35175a09717D10985a79335B15449e3845k10164Q2719C38403
9924c44143A49110b20335D5a50613K3327e3423B05484B7270a34633A52614g3453
$$ y = [-84739, -289035, -62593, 170935, -132678, 5871, -179509, -32165, -165569, 59380, 128437, -30614, 130914, -79221, -223147, 18945, -189883, -403107, -108542, 74385, 9992, -169012, -84948, -25488, -456041, -98335, 153251, -162777, 68853, -26248, -50515, 41466, 3010, -32838, 35031, -163134, -152237, -430800, -17242, 215139, -1617, -167552, 51968, -85753, -156794, 232496, -178158, -39867, -31816, -292316, 72607, -190559, -16382, -218242, -205668, -72913, -214629, 243, -86329, -9848, 83024, -16879, -37557, 41368, -14987, -2359, -32934, -297030, 147010, -52121, -33068, 96007, -137481, -158666, 59027, 194202, -109717, 410985, -179335, 215449, -53845, -264009, -181290, 338403, -344143, 149110, -220335, 45, -150613, -127286, -53423, 205484, 27270, -134633, 152614, -73453]
9912i7142l21172f6610A76527J09155a38321L3843j02679j88952L3315b9410A4589
9900B2029k592b45329C7971p216O7989c28913A16818a59082r666l50959J08897
9889d10810a10223L7582k58140h8143L1166A32008D6030e7614K4900j56022f0260
9877G9230i6615h150H9253b13173B19906a67946k0331l46053J55473F5179R5609
9866A60788a33003C0478J08015a33541J0574l36589c2730l47554J78671G5828
9855B0249a98966A5122b49288j55623i1289D11697A87796p8027g614p0023A17182
9843A85458a59334k9417e2170l49367b7302A81961a81688Q2533l8262N8207m2674
9832a21884I6861B6486J30681Q3477B9219b54853j34325A32970a07715r9537A48823
$$ y = [-97142, -418314, -66610, 176527, 285682, -138321, -104478, -207157, -396109, -362794, -29410, 14589, 22029, 19437, -245329, 37971, 30755, 98744, -328913, 116818, -159082, -168748, -519707, -410810, -110223, -72641, -330781, -88143, -56977, 132008, 46030, -57614, -32714, -188736, -60260, 79230, -96615, -8150, 89253, -213173, 219906, -167946, -188277, -534330, -378857, 65179, 160788, -133003, 30478, 138493, -133541, -122967, -459556, -32730, -380284, -201613, 75828, 20249, -198966, 15122, -249288, -404911, -91289, 411697, 187796, 109769, -7614, -77637, 117182, 185458, -159334, -188751, -52170, -401537, -27302, 181961, -181688, -99155, -137417, -79210, -121884, 96861, 26486, 157167, 240644, 29219, -254853, -389178, 132970, -107715, -207252, 148823]
9820a2376j80735b4349D29380i1141k65864Q800a18255G6308f443A2383a00315
9808A69560a73629B74004a11273l02614h3974A72402a800n14238f1465k6970D5805
9796c79900J88134F0345a13482B35892E7463a60117q9141H8642b07060h2713j7339
9785a00052k90843A12915a53367c1790m7646H2228b34591A94501a65299k5291
9775a90590j02936h8778F3496J3938a64674n5690f1208j0121A41304Q6478i7923
9763h4368j36472l5710C13751h1679o7645o9727Q2467A76398d5655B54624b05291
9751d14192a06739n7795F1059a33124j10097C0067i9520M7819l21137a18732L9255
9740g9477b3648o3016A34838A8667e70373B2936f0442l54130e3692E6195j032
$$ y = [-12376, -193111, -24349, 429380, -91141, -357005, -348205, -118255, 76308, -6443, 12383, -100315, 169560, -173629, 274004, -111273, -413887, -83974, 172402, -1800, -516038, -61465, -88435, 45805, -379900, -191766, 60345, -113482, 235892, 57463, -160117, -249258, 88642, -207060, -82713, -100052, -390895, 112915, -153367, -31790, -79436, 82228, -234591, 194501, -165299, -190590, -293526, -88778, 63496, 77434, -164674, -220364, -61208, -71329, 141304, 227782, -97923, -84368, -220840, -256550, 313751, -81679, -149324, -219051, -136584, 176398, -45655, 254624, -205291, -414192, -106739, -164534, 61059, -133124, -243221, 30067, -99520, -51701, -372838, -118732, -79477, -23648, -86664, 134838, 18667, -570373, 22936, -60442, -414572, -53692, 56195, 55163]
9729E5163j7685d0536j62501b5815q5166J06L0505j01434A77611f6365E6118c77321
9716A35905f3768B5941a43023J7636l7015A28429d7982G6657h7246k20992C433
9704D1709a58099k9342A02545a11860J4950D1294J78255e7074a5814A65575a3959
9692a11190o9324L0004k54308J88068H8331l7376a30662q415N608O6621j04732
9681a71580a6841k5200r7875e8085k21978A1113J38444i1377D78578A10248C7914
9669b997A04708a00702C0839b91283O7891m6356N2388q4103f8545l9031k60762
9658c68338A13581J29637L1855b66671a18847d7539j50053G1028M5833E2716A1577
9646B922a64719k4913J9765L2818n3544g9193G9129j8814j7148A3420a18121e5125
$$ y = [55163, 37478, -40536, -203037, -25815, -110981, -110875, -80370, -181804, 177611, -66365, 56118, -377321, 135905, -63768, 25941, -143023, -125387, -162402, 128429, -47982, 76657, -87246, -308238, 3433, 41709, -158099, -187441, 102545, -111860, -96910, 41294, 219549, -57074, -15814, 165575, -13959, -111190, -180514, -150510, -404818, -216750, 88331, 50955, -130662, -139077, -133469, -66848, -171580, -16841, -42041, -139916, -58085, -280063, 11113, 149557, -91377, 478578, 110248, 37914, -2997, 104708, -100702, 30839, -291283, -223392, -269748, -217360, -301463, -68545, -107576, -368338, 113581, 243218, 275073, -266671, -118847, -47539, -197592, 71028, 116861, 52716, 11577, 2922, -164719, -189632, -169867, -137049, -190593, -79193, 79129, 60315, 43167, 13420, -118121, -55125]
9633d54960g6890K4841k21447H7114M4111b82416b784B14063b2705j39762A17850
9621A12542b917A68505c36983a50383f4123P339C63649g1256c4251G1475f0926
9609a64436H1687R3350D5232L47288b31198H994a81543n5395B52022c8646k25936
9598b64582a20960d4815k53540g8517o5480A857a21897H5759C0618b42579E9536
9586A28475a73971I7732e1288j58755O1651a9982B05710b93517B71771a0923k54528
9575b65451I2457C8418J82803a55230n4311B24268b35706j30932e3083e990A73074
9563d50044B28730I8796b09798P0971N6852A02536h8833k0608A46935a60505k95797
9552d56302h5569G6524a852p0353p5687k39040c4522a574k48631j3064A4406a75176
$$ y = [-454960, -76890, -52049, -273496, 87114, 131225, -282416, -2784, 214063, -22705, -162467, 117850, 112542, -2917, 168505, -336983, -150383, -64123, -56784, 363649, -71256, -34251, 71475, -60926, -164436, 81687, 175037, 45232, 392520, -231198, 8994, -181543, -236938, 252022, -38646, -264582, -120960, -44815, -298355, -78517, -143997, 1857, -121897, 85759, 30618, -242579, 59536, 128475, -173971, 97732, -51288, -210043, -148392, -19982, 205710, -293517, 271771, -10923, -265451, 92457, 38418, 221221, -155230, -209541, 224268, -235706, -366638, -53083, -5990, 173074, -450044, 228730, 98796, -209798, -138827, -81975, 102536, -88833, -109441, 146935, -160505, -456302, -85569, 76524, -1852, -72205, -147892, -386932, -34522, -1574, -250205, -263269, 14406, -175176]
9539a59836A57383o3649a84559k44646J82742B29679c0883n0993B2177a84859
9528g1372A42518b66686A30618O351a85372j6423M573F0439J3835d32247a58473
9516g0825C8924b23135i8430j98474J16496g6768K5803C0006i9023j5840A27884
9504e02850A76773l7106b81882h8198m00141C01596A43470e994l6493l55147E3765
9492b37130N6371B1869b02869p2669J31443d9389n9270B11941b20224I3704l8012
9481E5692r962a80773l0962B43752H7294c70883J77506A46654P9075c82l28597
9470c28979A30476a07110J0221A28879a71918b2193j2934A73590a25731k28105
9460c53836d3568C10612b66888h158j83470q9446q650A29810i3171j21864A68354
$$ y = [-159836, 157383, 93734, -184559, -429205, -246463, 229679, -30883, -81876, 22177, -184859, -71372, 142518, -266686, 130618, 136969, -185372, -201795, -197222, 60439, 74274, -432247, -158473, -70825, 38924, -223135, -98430, -296904, -180408, -76768, -50965, 30006, -99023, -114863, 127884, -502850, 176773, 139667, -281882, -88198, -488339, 301596, 143470, -5994, -42487, -397634, 53765, -237130, -180759, 21869, -202869, -275538, -144095, -49389, -108659, 211941, -220224, 93704, 55692, 45730, -180773, -211735, 243752, 87294, -370883, -193377, 146654, 225729, -382, -328979, 130476, -107110, -96889, 128879, -171918, -22193, -35127, 173590, -125731, -353836, -43568, 310612, -266888, -8158, -191628, -281074, -289724, 129810, -93171, -215035, 168354]
9448g2540i611E1088K33903a2724G0077c19108B03763a50342e1378o9872F8764
9436e2719f381G3387d557D4524b00806A81016k6898o6581J86771o8331B9094a21902
9423A17948h0193r579m4828o3682A63981j7254n1548c895j57701B59857B5710
9411A19592a28429k24003B47243c43678A87507a43995k571M4298j50520i8971
9400C1949b47363A85030E137c5381I7293d4145j28230a7754A03996Q4477p9024
9389A09449a57002j9317J6763e9218k07054o4185Q9357A1985a72839a6382G1092
9377a85597B8600R6013J2260a57384A30764c20002A64031b69669f9405D87a08811
9365B95708F5433J4371K72286b15809N7674C3457P3029b6167l67388a46921A1031
$$ y = [-72540, -9611, 51088, 284991, -12724, 70077, -319108, 203763, -150342, -51378, -121250, 68764, -52719, -6381, 73387, -4557, 44524, -200806, 181016, 154118, 87537, 274308, 205977, 29094, -121902, 117948, -80193, -89772, -134600, -198282, 163981, 146727, 95179, -3895, -161596, 259857, 25710, 119592, -128429, -352432, 247243, -343678, 187507, -143995, -146566, -102268, -252788, -98971, 31949, -247363, 185030, 5137, -35381, 97293, -44145, -172375, -17754, 103996, 188473, 109449, -157002, -176319, -159556, -59218, -266272, -330457, -241100, 11985, -172839, -16382, 71092, -185597, 28600, 124613, 136873, -157384, 130764, -320002, 164031, -269669, -69405, 487, -108811, 295708, 65433, 79804, 352090, -215809, -158135, 33457, 106486, -26167, -393555, -146921, 11031]
9353A66312e0868j77208e2399C19076h660k20249A52080e64190b7708k68911B01787
9341a31033b8381k7779o4184p5080M5218B6268a30905G766J45997o623a25850
9329a15480A06391b97982g4214m3826k63616B18610m0718q8365g9550n1651p4647
9318b05848A46668R3635a87969m35981A44700a38347K963o3965B1320n521E731
9306a95243o9300n7686h2759j5543k58856g485C9205a75861A84968a11984d2254
9294d774j77382D2330L8800c7759n953K1717m311m7343k2594B5245K34902c40098
9281a95736d1409k54551K5605A73231n0475b13545f6099j2498j93938J29544j64664
9270c07655a50065j39270A8970L756Q1133a3176p424p5198F004a88319K3197n8807
$$ y = [166312, -50868, -228076, -52399, 319076, -8660, -228909, 152080, -564190, -27708, -296619, 201787, -131033, -28381, -56160, -120344, -195424, -150206, 26268, -130905, 7766, 153763, 147140, -125850, -115480, 106391, -297982, -74214, -118040, -381656, 218610, 177892, 89527, -79550, -131201, -205848, 146668, 240303, -187969, -623950, 144700, -138347, -135384, -199349, 21320, 15799, 5731, -195243, -264543, -322229, -82759, -98302, -357158, -7485, 39205, -175861, 184968, -111984, -42254, -4774, -182156, 42330, 81130, -37759, -43712, -21995, -26306, -73649, -96243, 25245, 260147, -340098, -195736, -41409, -295960, -270355, 173231, 122756, -213545, -66099, -78597, -272535, -142991, -307655, -150065, -289335, 18970, 22726, 103859, -13176, -20600, -95798, 6004, -188319, -165122, -223929]
9258b23929A20406K6101j7072J3628P2394o3476E7917c42327E2704d2741A75433
9246a77241l4162E87408b50876B05254a42212j63567B21520A065K3129J11271
9236A35465e015n9224r3362j34215O9018A67588b30331l7803C3837P2025a0543
9224I4438b14835G1679c69455B43463c33784A19060a9768G3177i9055A14457d05860
9212A32317a48371A71801b2674l4886G5805a0436o874E4787i249j48824A2021
9200a25883c3394m63110b25404B15171C3397J35678i6669c6083n1811J7380n346
9189g5860A34170g4785A62952G419K73618a03607A33018a38254M2967j66359J13196
9178a48450L8281k46226a55056F4678a83624I4673i7003C9466h8903A83590b34168
$$ y = [-223929, 120406, 146507, 129435, 143063, 215457, 151981, 57917, -342327, 52704, -42741, 175433, -177241, -211403, 587408, -250876, 205254, -142212, -305779, 221520, 1065, 24194, 135465, -5015, -64239, -157601, -291816, -222798, 167588, -230331, -268134, 33837, 105862, -10543, 94438, -214835, 71679, -369455, 243463, -333784, 119060, -19768, 73177, -99055, 114457, -405860, 132317, -148371, 171801, -22674, -57560, 75805, -10436, -17310, 54787, -9249, -158073, 12021, -125883, -33394, -496504, -225404, 215171, 33397, 169075, -96669, -36083, -87894, -70514, -75860, 134170, -74785, 162952, 7419, 281037, -103607, 133018, -138254, -95287, -261646, -148450, -110169, -356395, -155056, 64678, -183624, 94673, -97003, 39466, -88903, 183590, -234168]
9166g86l17280B82127H9327c58849A54368f9271A75249e9322D189a57838M3648
9155a14190Q847j286b8195l3999j18660f1410k10705B18088B8719e6631k4397
9144h1028d313F3617k2780a78286g5547A23820K08908b22756E347a10407C98520
9132A72740d27098a75357a016q6511a9385j01140a5705H2733g4824A36931b45723
9120a17070M5653A00421l5959d00141A21068D7756b47715J13503K5067k1985B27334
9108a42930f4530o0910d1346Q21D316Q042a00824c5812B78263e4746h805n3188
9096f1993k36640A96428b11215O4954E2024a38490g457H2107b34425a12856j57735
9085b70591d2041j93624P1242M7000j70519r2474A28092C3608b0721k7903C3739
$$ y = [-786, -318066, 282127, 89327, -358849, 154368, -69271, 175249, -59322, 4189, -157838, -114190, -105343, -106629, -28195, -62194, -180854, -61410, -272115, 218088, 28719, -56631, -81028, -4313, 63617, 40837, -178286, -75547, 123820, 332728, -222756, 5347, -110407, 398520, 172740, -427098, -175357, -1016, -87527, -19385, -120525, -15705, 82733, -74824, 136931, -245723, -117070, -71417, 100421, 64462, -400141, 121068, 47756, -247715, -134212, -109145, -131130, 227334, -142930, -64530, -125440, -41346, -40525, 4316, 12358, -100824, -35812, 278263, -54746, -8805, -61993, -298633, 196428, -211215, -146261, 52024, -138490, -7457, 82107, -234425, -112856, -270591, -42041, -235665, -164423, -117423, -287942, -380416, 128092, 33608, -20721, -48624, 33739]
9073c34668g4213K0039A0917h3985A53789h634B86307a46317A22450D700a15400
9061D8382f0210F4127a79585j13955d1416m9049E235b79163A74883D0786K576
9050D3362a09385r8887j0749D9668L4209c51208g2487A5739i6815k46358i2208
9038A50734a49547K7884A13843i3100j21745l3409g1974o947K3796m58370a56782
9026a15119l5641A06954a92364j00119E6345h7164k11407B75511d2723j63121
9016b05844a0001D8192K59037f4343n6295d4524F0175c21600R9720h1243J5600
9005f5643F457a80930k9769D3236J23931a92784A71570b4484F8276a06722A90046
8993A45111a91496q4262l4859a19664A09857B4976i9927B4837e9075C47432b4779
$$ y = [-334668, -74213, -54174, 10917, -83985, 153789, -8634, 286307, -146317, 122450, 4700, -115400, 48382, -60210, 64127, -179585, -293540, -41416, -90465, 5235, -279163, 174883, 40786, 43362, -109385, -208272, -219021, 49668, 83877, -351208, -72487, 15739, -96815, -343173, -92208, 150734, -149547, -121663, 113843, -93100, -214845, -248254, -71974, -78921, -55125, -513495, -156782, -115119, -150760, 106954, -192364, -292483, 56345, -87164, -298571, 275511, -42723, -205844, -10001, 48192, 307229, -64343, -120638, -44524, 60175, -321600, -221880, -81243, -65643, 6457, -180930, -210699, 43236, 167167, -192784, 171570, -24484, 68276, -106722, 190046, 145111, -191496, -275758, -310617, -119664, 109857, 24976, -99927, 24837, -59075, 347432, -24779]
8981D45143A61498F2706E720h6273l9471j73473b5663A5052c82481a21914L1275
8970i0639B77085b42477c7513k23842E483b1477D0496K3108d3670A62149f8709
8958B03491b20129R8782C17481a14858k11712D9698b14163O9575B90604a63670
8947A29353e7049j48530i3442E4350b8404j80774b4870A6997f3074l2623M0709
8936e4988k88955a28516f3786j27366A03265a17530j35272A22708a94019A50645
8925c5886j72638a01899B62550b4245A10976m115M179J73721Q0060c8618A93399
8913C03349j01207k9410J31689N71100P35216Q37400J569320M180291K915741
8904A1113489D717971k169758A223364r1067m22321K00109C67818m037A23713
$$ y = [445143, 161498, 62706, 5720, -86273, -125744, -299217, -25663, 15052, -382481, -121914, -90639, 277085, -242477, -37513, -261355, 5483, -21477, 40496, 63604, -43670, 162149, -68709, 203491, -220129, -121347, 317481, -114858, -326570, 49698, -214163, -144588, 290604, -163670, 129353, -57049, -205579, -93442, 54350, -28404, -209178, -24870, 16997, -63074, -95697, -54988, -343943, -128516, -63786, -191152, 103265, -117530, -252802, 122708, -194019, 150645, -35886, -208524, -101899, 262550, -24245, 110976, 106861, 111040, 284761, 364821, -38618, 193399, 303349, 202142, 172732, 304421, 875521, 1610737, 2448137, 4017457, 8197748, 11113489, 4717971, 2548213, 1223364, 1132297, 709976, 910085, 367818, 363781, 123713]
8894D94984A00393K88399b2545A38210a01027D6084d2530A97575E52L09982h3680
8882D877g3789H3888e6115A70400q0552C628d12587J38750g8413I6558a48339
8870g6696j94111G1190M4559A4848i6097j57575A76159l1427o5855J02050C3716
8858a43172r5935A38919a80726A27457J80452B240b64360a10872A99509I0135
8847i5926E4506h8637b2051a0506A37516J8278b9415p0763j49908b5773A57530
8835I9785K19482I1195b9802k3951r8385i407l05234o7533A61610B1703i9859
$$ y = [494984, 100393, 388792, -22545, 138210, -101027, 46084, -42530, 197575, 552, 310534, -83680, 4877, -73789, 83888, -56115, 170400, 89848, 3628, -412587, -273837, -78413, 96558, -148339, -76696, -270807, 71190, 115749, 14848, -96097, -253672, 176159, 144732, 78877, 180927, 33716, -143172, -239107, 138919, -180726, 127457, 307909, 2240, -264360, -110872, 199509, 90135, -95926, 54506, -88637, -22051, -10506, 137516, 155794, -29415, -100178, -250086, -25773, 157530, 99785, 319267, 91195, -29802, -53753, -152138, -9407, -314641, -382174, 161610, 21703, -99859]
$$ [...]
##END NTUPLES=NMR SPECTRUM
##END=
