
##TITLE=AC1226_COLAHDE102_6079957_XPojYAU1Wp
##JCAMPDX= 6.0         $$ Bruker NMR JCAMP-DX V2.0
##DATA TYPE= NMR SPECTRUM
##DATA CLASS= NTUPLES
##ORIGIN= BRUKER
##OWNER= Administrator
$$ 1.72 TOPSPIN		Version 2.1
$$ 2012-05-08 21:03:29.953 -0500  Administrator@TOPSPIN
$$ Compression mode = diff/dup
##.OBSERVE FREQUENCY= 400.13188235
##.OBSERVE NUCLEUS= ^1H
##.ACQUISITION MODE= SIMULTANEOUS (DQD)
##.ACQUISITION SCHEME= undefined
##.AVERAGES= 64
##.DIGITISER RES= 22
##SPECTROMETER/DATA SYSTEM= spect
##.PULSE SEQUENCE= noesygpps1d.comp
##.SOLVENT NAME= COFFEE_meoh
##.SHIFT REFERENCE= INTERNAL, COFFEE_meoh, 1, 14.96687
##AUDIT TRAIL= $$ (NUMBER, WHEN, WHO, WHERE, PROCESS, VERSION, WHAT)
$$ ##TITLE= Audit trail, TOPSPIN		Version 2.1
$$ ##JCAMPDX= 5.01
$$ ##ORIGIN= Bruker BioSpin GmbH
$$ ##OWNER= Administrator
$$ $$ C:\Bruker\TOPSPIN/data/COFFEE/nmr/AC1226_COLAHDE102_6079957_XPojYAU1Wp/12/pdata/1/auditp.txt
$$ ##AUDIT TRAIL=  $$ (NUMBER, WHEN, WHO, WHERE, PROCESS, VERSION, WHAT)
(   1,<2012-05-08 21:03:25.140 -0500>,<Administrator>,<TOPSPIN>,<go>,<TOPSPIN 2.1>,
      <created by zg
	started at 2012-05-08 20:51:54.890 -0500,
	POWCHK enabled, PULCHK disabled,
       configuration hash MD5:
       AF F2 23 6B 01 CD 40 DD E5 A1 38 A0 06 EA F7 77
       data hash MD5: 64K
       2B 22 76 90 9E 79 5A 3E 40 44 3E 70 C7 2D B4 7F>)
(   2,<2012-05-08 21:03:27.875 -0500>,<Administrator>,<TOPSPIN>,<proc1d>,<TOPSPIN 2.1>,
      <Start of raw data processing
       efp LB = 0.3 FT_mod = 6 PKNL = 1 PHC0 = 0 PHC1 = 0 SI = 128K 
       data hash MD5: 128K
       8B 65 BD 3E 8F 11 14 F5 E4 5E 3D 8A A9 14 31 91>)
(   3,<2012-05-08 21:03:29.171 -0500>,<Administrator>,<TOPSPIN>,<proc1d>,<TOPSPIN 2.1>,
      <pk PHC0 = 34.14001 PHC1 = 0 
       data hash MD5: 128K
       8F FB 71 4C D2 C2 B7 BB FE 66 90 DC BB B1 92 C7>)
(   4,<2012-05-08 21:03:29.390 -0500>,<Administrator>,<TOPSPIN>,<proc1d>,<TOPSPIN 2.1>,
      <abs ABSG = 1 
       data hash MD5: 128K
       D9 8B 55 82 9D C2 85 27 33 38 78 A5 D2 FE BC 94>)
(   5,<2012-05-08 21:03:29.468 -0500>,<Administrator>,<TOPSPIN>,<proc1d>,<TOPSPIN 2.1>,
      <abs ABSG = 2 
       data hash MD5: 128K
       70 4C BD AE 8E E9 AF 33 69 DF 68 3D 46 EF 3F 96>)
(   6,<2012-05-08 21:03:29.531 -0500>,<Administrator>,<TOPSPIN>,<proc1d>,<TOPSPIN 2.1>,
      <abs ABSG = 3 
       data hash MD5: 128K
       18 99 8F 94 E2 01 AE 7F 5A 38 0A 9C 36 71 B8 93>)
(   7,<2012-05-08 21:03:29.812 -0500>,<Administrator>,<TOPSPIN>,<proc1d>,<TOPSPIN 2.1>,
      <abs ABSG = 4 
       data hash MD5: 128K
       BD 8C 5C E7 0E 4F B0 50 C7 87 5D E1 86 67 91 C7>)
(   8,<2012-05-08 21:03:29.859 -0500>,<Administrator>,<TOPSPIN>,<proc1d>,<TOPSPIN 2.1>,
      <abs ABSG = 5 
       data hash MD5: 128K
       92 21 0A 13 19 AA 00 E1 90 B3 9A C2 FD 41 70 B2>)
$$ ##END=
$$ 
$$ $$ hash MD5
$$ $$ A8 13 29 70 85 CC 17 8B 52 DA 19 04 81 BA FC FD
##$RELAX= 
##$RELAX= 
##$RELAX= 
##$RELAX= 
##$RELAX= 
##$RELAX= 
##$RELAX= 
##$RELAX= 
$$ Bruker specific parameters
$$ [...]
150 150 150 150 150 150 150 150
##$TP07= 0
##$TPNAME0= <>
##$TPNAME1= <>
##$TPNAME2= <>
##$TPNAME3= <>
##$TPNAME4= <>
##$TPNAME5= <>
##$TPNAME6= <>
##$TPNAME7= <>
##$TPOAL= (0..7)
0.5 0.5 0.5 0.5 0.5 0.5 0.5 0.5
##$TPOFFS= (0..7)
0 0 0 0 0 0 0 0
##$TUNHIN= 0
##$TUNHOUT= 0
##$TUNXOUT= 0
##$USERA1= <user>
##$USERA2= <user>
##$USERA3= <user>
##$USERA4= <user>
##$USERA5= <user>
##$V9= 5
##$VALIST= <valist>
##$VCLIST= <CCCCCCCCCCCCCCC>
##$VD= 0
##$VDLIST= <DDDDDDDDDDDDDDD>
##$VPLIST= <PPPPPPPPPPPPPPP>
##$VTLIST= <TTTTTTTTTTTTTTT>
##$WBST= 1024
##$WBSW= 4
##$XGAIN= (0..3)
0 0 0 0
##$XL= 0
##$YL= 0
##$YMAX_a= 10931611
##$YMIN_a= -5200256
##$ZGOPTNS= <>
##$ZL1= 120
##$ZL2= 120
##$ZL3= 120
##$ZL4= 120
##$ABSF1= 14.96687
##$ABSF2= -5.58566
##$ABSG= 5
##$ABSL= 3
##$ALPHA= 0
##$AQORDER= 0
##$ASSFAC= 0
##$ASSFACI= 0
##$ASSFACX= 0
##$ASSWID= 0
##$AUNMP= <proc_prof1d_extract.lims>
##$AXLEFT= 0
##$AXNAME= <>
##$AXNUC= <1H>
##$AXRIGHT= 0
##$AXTYPE= 0
##$AXUNIT= <>
##$AZFE= 0.1
##$AZFW= 0.1
##$BCFW= 0
##$BC_mod= 0
##$BYTORDP= 0
##$COROFFS= 0
##$CY= 15
##$DATMOD= 1
##$DC= 0
##$DFILT= <>
##$DTYPP= 0
##$F1P= 0
##$F2P= 0
##$FCOR= 0.5
##$FTSIZE= 131072
##$FT_mod= 6
##$GAMMA= 0
##$GB= 0
##$INTBC= 1
##$INTSCL= 1
##$ISEN= 128
##$LB= 0.3
##$LEV0= 0
##$LPBIN= 0
##$MAXI= 10000
##$MC2= 0
##$MEAN= 0
##$ME_mod= 0
##$MI= 0
##$NCOEF= 0
##$NC_proc= -3
##$NLEV= 6
##$NOISF1= 0
##$NOISF2= 0
##$NSP= 0
##$NTH_PI= 0
##$NZP= 0
##$OFFSET= 14.96687
##$PC= 1
##$PHC0= 34.14001
##$PHC1= 0
##$PH_mod= 1
##$PKNL= yes
##$PPARMOD= 0
##$PPDIAG= 0
##$PPIPTYP= 0
##$PPMPNUM= 2147483647
##$PPRESOL= 1
##$PSCAL= 4
##$PSIGN= 0
##$PYNMP= <proc.py>
##$REVERSE= no
##$SF= 400.130005497375
##$SI= 131072
##$SIGF1= 0
##$SIGF2= 0
##$SINO= 400
##$SIOLD= 131072
##$SPECTYP= <>
##$SREGLST= <1H.CDCl3>
##$SSB= 0
##$STSI= 131072
##$STSR= 0
##$SW_p= 8223.68421052632
##$SYMM= 0
##$S_DEV= 0
##$TDeff= 65536
##$TDoff= 0
##$TI= <>
##$TILT= no
##$TM1= 0
##$TM2= 0
##$TOPLEV= 0
##$USERP1= <user>
##$USERP2= <user>
##$USERP3= <user>
##$USERP4= <user>
##$USERP5= <user>
##$WDW= 1
##$XDIM= 131072
##$YMAX_p= 337801917
##$YMIN_p= -43853
##$CURPLOT= <Network HP LaserJet P1505>
##$CURPRIN= <$Network HP LaserJet P1505>
##$DFORMAT= <normdp>
##$LAYOUT= <+/1D_H.xwp>
##$LFORMAT= <normlp>
##$PFORMAT= <normpl>
##$SURQMSG= 1
$$ End of Bruker specific parameters
$$ ---------------------------------
##NTUPLES= NMR SPECTRUM
##VAR_NAME=  FREQUENCY,     SPECTRUM/REAL,   SPECTRUM/IMAG
##SYMBOL=    X,             R,               I
##VAR_TYPE=  INDEPENDENT,   DEPENDENT,       DEPENDENT
##VAR_FORM=  AFFN,          ASDF,            ASDF
##VAR_DIM=   131072,        131072,          131072
##UNITS=     HZ,            ARBITRARY UNITS, ARBITRARY UNITS
##FACTOR=    0.0627417313425165, 1,          1
##FIRST=     8223.62146879498, 156,          -98155
##LAST=      0,             335,             -99307
##MIN=       0,             -43853,          0
##MAX=       8223.62146879498, 337801917,    0
$$ Real data points
##PAGE= N=1
##DATA TABLE= (X++(R..R)), XYDATA
$$ [...]
61115A389934k7139k5064k2971k0834j8678j7150j6566j6197j5189j3666j2197
$$ 1389934 1362795 1337731 1314760 1293926 1275248 1258098 1241532 1225335 1210146 1196480 1184283
61104A184283j0873r582q749q960r971j0683j0147q451o727o215o917p373o379
$$ 1184283 1173410 1163828 1155079 1146119 1136148 1125465 1115318 1106867 1100140 1093925 1087008 1079635 1073256
61091A073256m692m008m491m733m301m445n582n928m115j593o56j143j151k75
$$ 1073256 1068564 1064556 1060065 1055332 1051031 1046586 1041004 1035076 1030961 1029368 1028712 1027569 1026418 1026143
61077A026143j6j082k315k481j483L94K738M308L694J242j050j909j758j148K3
$$ 1026143 1026127 1025045 1022730 1020249 1018766 1019160 1021898 1026206 1029900 1031142 1030092 1028183 1026425 1025277 1025300
61062A025300J269J384N30P41L086N887P064O888O898P351P483P322P375P222
$$ 1025300 1026569 1027953 1028483 1029224 1032310 1038197 1045261 1052149 1059047 1066398 1073881 1081203 1088578 1095800
61048A095800O209M830L665J598k718p979j1160j1534j1503j2993j5068j6029
$$ 1095800 1102009 1106839 1110504 1112102 1109384 1101405 1090245 1078711 1067208 1054215 1039147 1023118
61036A023118j5972j6072j6745j7727j8837j9576j8988j7038j5267j5025j5776
$$ 1023118 1007146 991074 974329 956602 937765 918189 899201 882163 866896 851871 836095
61025H36095j6027j5199j3616j1450q915o918o352o882p367p182o362m855k712
$$ 836095 820068 804869 791253 779803 770888 763970 757618 750736 743369 736187 729825 724970 722258
61012G22258q04k76j138k172k346j811j314j121p92J41J418K179K074J977K954
$$ 722258 721454 721178 720040 717868 715522 713711 712397 711276 710484 710625 712043 714222 716296 718273 721227
60997G21227M805O367P103P205O366M150J878K050M893P488P780P519R120J1445
$$ 721227 726032 732399 739502 746707 753073 757223 759101 761151 766044 773532 781312 788831 797951 809396
60983H09396J1498R308P878Q563R654R924J0558J2508J4596J5656J6478J8084
$$ 809396 820894 830202 838080 846643 856297 866221 876779 889287 903883 919539 936017 954101
60971I54101J9956K1469K3452K6714L0396L3640L7678M4308N3158O2317P1105
$$ 954101 974057 995526 1018978 1045692 1076088 1109728 1147406 1191714 1244872 1307189 1378294
60960A378294Q0533R1505J04305J19525J37878J59394J83934K11091K36330K47566
$$ 1378294 1458827 1550332 1654637 1774162 1912040 2071434 2255368 2466459 2702789 2950355
60950B950355K30414J80798J11807M5817l98k2476k3684q670J5644L6131L6040
$$ 2950355 3180769 3361567 3473374 3519191 3518793 3496317 3472633 3463963 3479607 3515738 3551778
60939C551778N179n1799j17650j73390k08195k21613k19468k08541j93459j76229
$$ 3551778 3556957 3505158 3387508 3214118 3005923 2784310 2564842 2356301 2162842 1986613
60929A986613j57522j38313j20224j04407r0678p8160o6503n6194m7893m1791
$$ 1986613 1829091 1690778 1570554 1466147 1375469 1297309 1230806 1174612 1126719 1084928
60919A084928l7342l3426k9111k4584k0932j8736j7387j6097j4858j3825j2519
$$ 1084928 1047586 1014160 985049 960465 939533 920797 903410 887313 872455 858630 846111
60908H46111j0610q961q656r143q668o720m929m970o418p453p107o151n810o267
$$ 846111 835501 826540 817884 808741 800073 793353 788424 783454 777036 769583 762476 756325 750515 744248
60894G44248o628o187n350n038n306n258m538m135m951o240o566n960n772o477
$$ 744248 737620 731433 726083 721045 715739 710481 705943 701808 696857 690617 684051 678091 672319 665842
60880F65842p075p013p225q442r733r851r142q758q666p851o401n856p081q822
$$ 665842 658767 651754 644529 636087 626354 616503 607361 598603 589937 582086 575685 569829 562748 553926
60866E53926q998o898l688j122q1j40k33J94P11O79J92q8J76Q18J736K931L956
$$ 553926 544928 538030 534342 533220 533139 532999 532766 532960 533671 534350 534542 534454 534630 535448 537184 540115 544071
60849E44071M029L018J683O93Rm69k84R93L027N031O327O215M093N98k061k162
$$ 544071 548100 551118 552801 553494 553503 553034 552750 553743 556770 561801 568128 574343 578436 579034 576973 574811
60833E74811o82j14j160k018j410o04j370l165m056l771l915n102n691m198j661
$$ 574811 574129 574015 572855 570837 569427 568823 567453 564288 560232 556461 552546 547444 541753 537555 535894
60818E35894m34j287k834l606l527l184k612j520k88J01o45j446r19J024L103
$$ 535894 535460 534173 531339 527733 524206 521022 518410 516890 516602 516703 516058 514612 513693 514717 517820
60803E17820M237M495M215L035P18j559k085q86J45p3k39J298L963N731N854N360
$$ 517820 522057 526552 530767 533802 534520 532961 530876 529990 530135 530062 529823 531121 535084 540815 546669 552029
60787E52029N048M585L851L705M616N653N692M855L907K978J845R82J102J778
$$ 552029 557077 561662 565513 569218 573834 579487 585179 590034 593941 596919 598764 599746 600848 602626
60773F02626J621P7j775k533j962r20k51j13j57j59m83j727l801n694o651p038
$$ 602626 604247 604324 602549 600016 598054 597134 596883 596770 596613 596454 595971 594244 590443 584749 578098 571060
60757E71060p460p503o428m885m553n850p302p634p168o532n406l695k655l262
$$ 571060 563600 556097 549669 544784 540231 534381 527079 519445 512277 505745 500339 496644 493989 490727
60743D90727m259l606j496k07q96k242k553j670k94J198K497K983K503J793J522
$$ 490727 486468 482862 481366 481159 480263 478021 475468 473798 473504 474702 477199 480182 482685 484478 486000
60728D86000J602J877K629L800M565M462M146M304M528M113L319K919L084L558
$$ 486000 487602 489479 492108 495908 500473 504935 509081 513385 517913 522026 525345 528264 531348 534906
60714E34906M364N392N753M738L157K635L578M670M540L260K109K226L402M128
$$ 534906 539270 544662 550415 555153 558310 560945 564523 569193 573733 576993 579102 581328 584730 588858
60700E88858L310J971K207M063M901K959P5q86l0L29l76m99L92M78j135k685k484
$$ 588858 592168 594139 596346 600409 605310 608269 608344 607458 607428 607757 607381 606882 607274 607752 606617 603932 601448
60683F01448j491j645l127m733n865o651o932o466n611m758l716k530k098k933
$$ 601448 599957 598312 595185 590452 584587 577936 571004 564538 558927 554169 550453 547923 545825 542892
60669E42892m041m125l300k566k205j873j638j709j500k51J551K513K100J117
$$ 542892 538851 534726 531426 528860 526655 524782 523144 521435 519935 519684 521235 523748 525848 526965
60655E26965M92L31K77J60K03Q58K153L130K703J314O80J293J598N42n02pR10
$$ 526965 527457 527788 528065 528225 528428 529286 531439 534569 537272 538586 539266 540559 542157 542699 542197 542190 543100
60638E43100R9k024l031k323j852k735l590l142k315k485l243l363k808k444k579
$$ 543100 543199 541175 538144 535821 533969 531234 527644 524502 522187 519702 516459 513096 510288 507844 505265
60623E05265k893l318l939m460m515m163l526k470j124j60O6J10N76J132J012
$$ 505265 502372 499054 495115 490655 486140 481977 478451 475981 474857 474697 474763 474873 475449 476581 477593
60608D77593K10l93j0J228K295K221J287R95K302M252N206N022M753M452L147
$$ 477593 477803 477410 477400 478628 480923 483144 484431 485426 487728 491980 497186 502208 506961 511413 514560
60593E14560J230R07L204O139P238O637O260O759O905N693L737K453K512L250
$$ 514560 515790 516697 519901 526040 533278 539915 546175 552934 559839 565532 569269 571722 574234 577484
60579E77484L381K613K333L753N592N252K662R10K081M397N054M027L088K567
$$ 577484 580865 583478 585811 589564 595156 600408 603070 603980 606061 610458 615512 619539 622627 625194
60565F25194J578M11J61N18L03j92K58J232J071k59j188j417k170l352l269j906
$$ 625194 626772 627183 627344 627862 628165 627973 628231 629463 630534 630275 629087 627670 625500 622148 618879 616973
60549F16973j621l505n550n907n521n902o459o016n111m753m439l444k607k720
$$ 616973 615352 611847 606297 600390 594869 588967 582508 576492 571381 566628 562189 558745 556138 553418
60535E53418k513n82J752K034M66m14M65J656J844J382J002R64J661L244M471
$$ 553418 550905 550323 552075 554109 554575 554161 554626 556282 558126 559508 560510 561474 563135 566379 570850
60520E70850L753J597K81Q73K376L904N635P199P439O715P270R954J2446J2319
$$ 570850 574603 576200 576481 577354 579730 583634 589269 596468 603907 610622 617892 627846 640292 652611
60506F52611J0349R069R297R955J0360J0896J1812J3014J4751J7176J9571K1322
$$ 652611 662960 672029 681326 691281 701641 712537 724349 737363 752114 769290 788861 810183
60494H10183K3208K6384L0492L4267L7773M2299M8011N3386N7283N9894O1060
$$ 810183 833391 859775 890267 924534 962307 1004606 1052617 1106003 1163286 1223180 1284240
60483A284240N9350N3910M5975L7124K6898J3654k386j8320l1031l9628m5102
$$ 1284240 1343590 1397500 1443475 1480599 1507497 1521151 1518765 1500445 1469414 1429786 1384684
60472A384684m8381m9309m7358m2839l7138l1701k6944k2311j7329j2281p771
$$ 1384684 1336303 1286994 1239636 1196797 1159659 1127958 1101014 1078703 1061374 1049093 1041322
60461A041322m021q44K074N152Q831J3081J7313K1244K5566L1017L6975M1950
$$ 1041322 1037301 1036457 1038531 1043683 1052514 1065595 1082908 1104152 1129718 1160735 1197710 1239660
60449A239660M5583M9086N3170N6464N6864N3739M7802L9441K8763J7116O840
$$ 1239660 1285243 1334329 1387499 1443963 1500827 1554566 1602368 1641809 1670572 1687688 1694528
60438A694528j017p224j1886j3016q972j153P371J5309K3620L2970M2574N1538
$$ 1694528 1693511 1686287 1674401 1661385 1652413 1651260 1658631 1673940 1697560 1730530 1773104 1824642
60426A824642N9523O5695O8524O7135O1522N0981L4112J1335j3996l8130n9438
$$ 1824642 1884165 1949860 2018384 2085519 2147041 2198022 2232134 2243469 2229473 2191343 2131905
60415B131905p7410r0696r7995j00081r9151r6463r2070q6390q0320p3866o6422
$$ 2131905 2054495 1963799 1865804 1765723 1666572 1570109 1478039 1391649 1311329 1237463 1171041
60404A171041n8458n1513m6245m1830l7638l4080l1488k9306k7037k4840k2795
$$ 1171041 1112583 1061070 1014825 972995 935357 901277 869789 840483 813446 788606 765811
60393G65811k0629j8610j7536j7248j6378j4282j2136j1200j1049j0556r599q692
$$ 765811 745182 726572 709036 691788 675410 661128 648992 637792 626743 616187 606588 597896
60381E97896p724o376n245n108n508n265m224l233k694k351k468l629n159n171
$$ 597896 590172 583796 578551 573443 567935 562670 558446 555213 552519 550168 547700 544071 538912 533741
60367E33741k947j65J010L74n67o66j44J43k22q78j040l03Q02J400J511K016L173
$$ 533741 530794 530629 531639 532013 531446 530780 530636 530779 530557 529679 528639 528336 529138 530538 532049 534065 537238
60350E37238L894L281K170K178L415M266L604K181J408J678K459L382M407N237
$$ 537238 541132 544413 546583 548761 552176 556442 560046 562227 563635 565313 567772 571154 575561 580798
60336E80798N362M731L814L148L188M338O344P794P258N177L652L901M809M823
$$ 580798 586160 590891 594705 597853 601041 605379 611723 619517 626775 631952 635604 639505 644314 649137
60322F49137M283M678O082O870O128M920M558M812M617L777K898K203J504J081
$$ 649137 653420 658098 664180 671050 677178 682098 686656 691468 696085 699862 702760 704963 706467 707548
60308G07548J484K272K086M95j069r76N05J620J402O02K24J78n2j18P53K340L439
$$ 707548 709032 711304 713390 713885 712816 711840 712345 713965 715367 715969 716193 716371 716319 716201 716954 719294 722733
60291G22733L477L135L052K807J918R77P99R49K63j308k502k536j970j508j033
$$ 722733 726210 729345 732397 735204 737122 738099 738898 739847 740110 738802 736300 733764 731794 730286 729253
60276G29253m37m79j783l515m164l456k643k771l480l865l899m342n367n998n296
$$ 729253 728816 728337 726554 723039 718875 715419 712776 710005 706525 702660 698761 694419 689052 683054 677758
60261F77758l821l199m092n203m824k959j185n97p57p17j45R25K481M019M328
$$ 677758 673937 670738 666646 661443 656619 653660 652475 651878 651121 650404 650259 651184 653665 657684 662012
60246F62012K758L25j330k021l132n532q254r707r616q974q400p417n638l872
$$ 662012 664770 665095 663765 661744 658612 653080 644826 635119 625503 616529 608129 600712 595074 591202
60232E91202l239l515l376k383j642j947k334j477J63R66N19j8J42O28J208K281
$$ 591202 587963 584448 581072 578689 577047 575100 572766 571289 571452 572418 572937 572919 573061 573689 574897 577178
60216E77178L502L479J879N19J070K611K965J819R95J832L652M978N148M471L717
$$ 577178 580680 584159 586038 586557 587627 590238 593203 595022 596017 597849 601501 606479 611627 616098 619815
60201F19815L648M530N846O910P685Q563R470R794R155P789O275N345N698P343
$$ 619815 623463 627993 633839 640749 648434 656997 666467 676261 685416 693205 699480 704825 710523 717866
60187G17866R226J0123R802R021Q622R202J1145J4043J6446J7170J6881J7398
$$ 717866 727092 737215 747017 756038 764660 773862 785007 799050 815496 832666 849547 866945
60175H66945J9291K1177K1675K1316K2030K5138L0261L5880M0732M4746M8593
$$ 866945 886236 907413 929088 950404 972434 997572 1027833 1063713 1104445 1149191 1197784
60164A197784N2369N5238N6655N7284N8073N8960N9391N9622O0269O0928O0345
$$ 1197784 1250153 1305391 1362046 1419330 1477403 1536363 1595754 1655376 1715645 1776573 1836918
60153A836918N7933N3979M8619M1932L4992K9194K4249J8412J1292M907J058r49
$$ 1836918 1894851 1948830 1997449 2039381 2074373 2103567 2127816 2146228 2157520 2162427 2163485 2162536
60141B162536l003n729q465j0602j1638j0731p664l681p2L614Q635J4777K0575
$$ 2162536 2159533 2153804 2145339 2134737 2123099 2112368 2104704 2101023 2100951 2104565 2113200 2127977 2148552
60128B148552K5676L1348L8274M5347N1291N6257O0937O5037O7720O8894O9001
$$ 2148552 2174228 2205576 2243850 2289197 2340488 2396745 2457682 2522719 2590439 2659333 2728334
60117B728334O7744O4170N8161N0866M3337L5433K6702J7610Q966L34r663k1061
$$ 2728334 2796078 2860248 2918409 2969275 3012612 3048045 3074747 3092357 3101323 3101657 3091994 3070933
60105C070933l1586l8853m2978m5869m8277m9039m7383m4478m1608l8098l2472
$$ 3070933 3039347 3000494 2957516 2911647 2863370 2814331 2766948 2722470 2680862 2642764 2610292
60094B610292k5106j7926j1506m306M511J3099J9083K2649K5773K8951L0716L0485
$$ 2610292 2585186 2567260 2555754 2551448 2555959 2569058 2588141 2610790 2636563 2665514 2696230 2726715
60082B726715K9783K9617K8470K4563J8921J4247J1295Q499N029K072O24J59M23
$$ 2726715 2756498 2786115 2814585 2839148 2858069 2872316 2883611 2892110 2897139 2899211 2899835 2899994 2900417
60069B900417K662P571J3450J8166K2041K7185L4547M3192N2041O0874O9820P9046
$$ 2900417 2903079 2910650 2924100 2942266 2964307 2991492 3026039 3069231 3121272 3182146 3251966 3331012
60057C331012Q8757R8449J06804J13502J20416J29349J39158J46967J51849J55103
$$ 3331012 3419769 3518218 3625022 3738524 3858940 3988289 4127447 4274414 4426263 4581366
60047D581366J57024J55750J49999J40776J29505J16223J00568Q2904O3474M1899
$$ 4581366 4738390 4894140 5044139 5184915 5314420 5430643 5531211 5614115 5677589 5719488
60037E719488J8599m638k6582m7661o8079q6133r9889j09466j16359j21422j24701
$$ 5719488 5738087 5733449 5706867 5659206 5591127 5504994 5405105 5295639 5179280 5057858 4933157
60026D933157j26292j26052j23173j17418j10026j02393r4551q6096p7544o9403
$$ 4933157 4806865 4680813 4557640 4440222 4330196 4227803 4133252 4047156 3969612 3900209
60016C900209o0868n1105m1184l3042k6979k1678j6300j1003n845r16K714L890
$$ 3900209 3839341 3788236 3747052 3714010 3687031 3665353 3649053 3638050 3632205 3631289 3634003 3637893
60004C637893L198K273J417l95l160n486o947r067j3233j8926k4643k9406l2987
$$ 3637893 3641091 3643364 3644781 3644386 3641226 3635740 3628793 3619726 3606493 3587567 3562924 3533518 3500531
59991C500531l5913l9597m5021n0772n3877n3291n1127m9632m8509m6354m3109
$$ 3500531 3464618 3425021 3380000 3329228 3275351 3222060 3170933 3121301 3072792 3026438 2983329
59980B983329l9362l4417k7177j8485j0616m227K419J0746J9828K7874L4662M1381
$$ 2983329 2943967 2909550 2882373 2863888 2853272 2849045 2851464 2862210 2882038 2909912 2944574 2985955
59968B985955M8587N5458O1170O5967P0391P3906P5105P3193O8666O2270N3952
$$ 2985955 3034542 3090000 3151170 3217137 3287528 3361434 3436539 3509732 3578398 3640668 3694620
59957C694620M3396L1209J8797P079m101j5243k6379l7088m6811n4966o1143o5383
$$ 3694620 3738016 3769225 3788022 3795101 3791000 3775757 3749378 3712290 3665479 3610513 3549370 3483987
59945C483987o8076o9396o9076o6762o2398n6343m9254m1674l3546k4483j4844
$$ 3483987 3415911 3346515 3277439 3210677 3148279 3091936 3042682 3001008 2967462 2942979 2928135
59934B928135n942J616R197J8648K9716M0314M9417N8239O7926P7425Q4729Q9300
$$ 2928135 2922193 2923809 2933006 2951654 2981370 3021684 3071101 3129340 3197266 3274691 3359420 3448720
59922C448720R2147R3902R3969R1396Q5681P6892O5785N3810M2183L0797J8603
$$ 3448720 3540867 3634769 3728738 3820134 3905815 3982707 4048492 4102302 4144485 4175282 4193885
59911D193885N159q764k2174l4792m6653n7271o5580p0563p1791o9632o5133n9321
$$ 4193885 4199044 4190280 4168106 4133314 4086661 4029390 3963810 3893247 3821456 3751824 3686691 3627370
59899C627370n2359m3701l3441k3066j4127o303K234J2198K1850K9145L4538M0333
$$ 3627370 3575011 3531310 3497869 3474803 3460676 3454373 3456607 3468805 3490655 3519800 3554338 3594671
59887C594671M7312N3558N7262N9357O2030O5370O7111O5710O2188N8382N4556
$$ 3594671 3641983 3695541 3752803 3812160 3874190 3939560 4006671 4072381 4134569 4192951 4247507
59876D247507M9768M4011L8794L5525L4007L2885L1195K9243K8166K8907L1594
$$ 4247507 4297275 4341286 4380080 4415605 4449612 4482497 4513692 4542935 4571101 4600008 4631602
59865D631602L5656M0353M5286N0579N6622O3527P0914P8175Q4768Q9957R2597
$$ 4631602 4667258 4707611 4752897 4803476 4860098 4923625 4994539 5072714 5157482 5247439 5340036
59854E340036R1762Q7693Q1523P3888O4268N2032L7599K2179O734q303k2610l5847
$$ 5340036 5431798 5519491 5601014 5674902 5739170 5791202 5828801 5850980 5857714 5849411 5826801 5790954
59842E790954m7915n8978o9272p8854q7227r3165r5528r4465r1308q6947q1090
$$ 5790954 5743039 5684061 5614789 5535935 5448708 5355543 5260015 5165550 5074242 4987295 4906205
59831D906205p3435o4786n6350m8638m1655l5377k9248k2106j3662n270J775P796
$$ 4906205 4832770 4767984 4711634 4662996 4621341 4585964 4556716 4534610 4520948 4515678 4517453 4525249
59819D525249J3310J7139J7916J6798J6328J6557J4654Q976J346n750j2334j9958
$$ 4525249 4538559 4555698 4573614 4590412 4606740 4623297 4637951 4646927 4648273 4642523 4630189 4610231
59807D610231k8963l8380m7712n7188o6471p4243p9266q1444q2001q2728q4457
$$ 4610231 4581268 4542888 4495176 4437988 4371517 4297274 4218008 4136564 4054563 3971835 3887378
59796C887378q6031q5393q2066p7759p4343p2051p0102o7996o5604o2832n9829
$$ 3887378 3801347 3715954 3633888 3556129 3481786 3409735 3339633 3271637 3206033 3143201 3083372
59785C083372n6709n2712m6885m0283l5971l5437l6179l4585l0501k7145k6711
$$ 3083372 3026663 2973951 2927066 2886783 2850812 2815375 2779196 2744611 2714110 2686965 2660254
59774B660254k7937k8257k6878k5034k4099k4158k4073k2653j9964j7359j5901
$$ 2660254 2632317 2604060 2577182 2552148 2528049 2503891 2479818 2457165 2437201 2419842 2403941
59763B403941j5105j3669j1112p991m846j888M17J401J112M43J37J00j11n13o31
$$ 2403941 2388836 2375167 2364055 2356064 2351218 2349330 2349747 2351148 2352260 2352703 2352840 2352940 2352829 2352316 2351685
59748B351685j51N14M04p95j855j138J167K938K891K463L842O931R679J0965J1527
$$ 2351685 2351534 2352048 2352452 2351657 2349802 2348664 2349831 2352769 2355660 2358123 2361965 2368896 2378575 2389540 2401067
59733B401067J2170J2689J3013J3944J5942J8054J8837J7945J6292J5119J5125
$$ 2401067 2413237 2425926 2438939 2452883 2468825 2486879 2505716 2523661 2539953 2555072 2570197
59722B570197J6020J6690J6357J5726J6349J8627K1275K3119K4644K7106L0793
$$ 2570197 2586217 2602907 2619264 2634990 2651339 2669966 2691241 2714360 2739004 2766110 2796903
59711B796903L5022L9430M4356M9956N5732O1255O6902P3561Q1663R0731R9923
$$ 2796903 2831925 2871355 2915711 2965667 3021399 3082654 3149556 3223117 3304780 3395511 3495434
59700C495434J08846J17763J27123J37105J47522J57545J65128J67180J60982
$$ 3495434 3604280 3722043 3849166 3986271 4133793 4291338 4456466 4623646 4784628
59691D784628J45525J21259Q9120N0778R706k9057o1004q3946r7873j03819j03229
$$ 4784628 4930153 5051412 5140532 5191310 5201016 5171959 5110955 5027009 4929136 4825317 4722088
59680D722088r7854q9442p9240o7720n4838m0745k6505j3733l086O529J6587K6996
$$ 4722088 4624234 4534792 4455552 4387832 4332994 4292249 4265744 4252011 4248925 4255454 4272041 4299037
59668D299037L6581M5283N4577O5220P5871Q5008R3377J03307J15799J29332J41639
$$ 4299037 4335618 4380901 4435478 4500698 4576569 4661577 4754954 4858261 4974060 5103392 5245031
59657E245031J51993J61731J73074J87360K03804K20008K34187K46972K60594
$$ 5245031 5397024 5558755 5731829 5919189 6122993 6343001 6577188 6824160 7084754
59648G084754K76264K92788L07753L19553L28021L33605L36244L35083L29200
$$ 7084754 7361018 7653806 7961559 8281112 8609133 8942738 9278982 9614065 9943265
59639I943265L18605L04180K86502K65264K40528K14103J88632J65235J43101
$$ 9943265 10261870 10566050 10852552 11117816 11358344 11572447 11761079 11926314 12069415
59630A2069415J21720J02449Q6992P5181O5355N6442M8550M1645L5065K8706K3657
$$ 12069415 12191135 12293584 12380576 12455757 12521112 12577554 12626104 12667749 12702814 12731520 12755177
59619A2755177K0700J8919J6704J4016J2738J4536J8903K3908K8623L4232M2406
$$ 12755177 12775877 12794796 12811500 12825516 12838254 12852790 12871693 12895601 12924224 12958456 13000862
59608A3000862N3076O4515P5619Q7100R9825J12847J24274J33669J42190J50250
$$ 13000862 13053938 13118453 13194072 13281172 13380997 13493844 13618118 13751787 13893977 14044227
59598A4044227J56470J59435J58970J54740J45017J28384J06030Q0612N3121K2298
$$ 14044227 14200697 14360132 14519102 14673842 14818859 14947243 15053273 15133885 15187006 15209304
59588A5209304j2955n2057r3763j36956j79794k19463k53866k82856l06939l25504
$$ 15209304 15196349 15144292 15050529 14913573 14733779 14514316 14260450 13977594 13670655 13345151
59578A3345151l37136l41239l38473l29946l16793l00433k82571k64821k48686
$$ 13345151 13008015 12666776 12328303 11998357 11681564 11381131 11098560 10833739 10585053
59569A0585053k36030k29272k30857k42004k61420k85234l08735l28316l41694
$$ 10585053 10349023 10119751 9888894 9646890 9385470 9100236 8791501 8463185 8121491
59560H121491l47083l43595l32571l17135k99730k80897k60727k40262k20678
$$ 8121491 7774408 7430813 7098242 6781107 6481377 6200480 5939753 5699491 5478813
59551E478813k02327j85545j71344j59896j49305j37446j24608j12922j03417
$$ 5478813 5276486 5090941 4919597 4759701 4610396 4472950 4348342 4235420 4132003
59542D132003r5187q7338q0186p4301o9599o5706o2258n8665n4614n0878m8533
$$ 4132003 4036816 3949478 3869292 3794991 3725392 3659686 3597428 3538763 3484149 3433271 3384738
59531C384738m7195m5374m2776m0841m0420m0392l9390l7580l5671l3516l1024
$$ 3384738 3337543 3292169 3249393 3208552 3168132 3127740 3088350 3050770 3015099 2981583 2950559
59520B950559k9340k9322k9572k7992k4957k2874k2358k1057j7212j2546r937
$$ 2950559 2921219 2891897 2862325 2834333 2809376 2786502 2764144 2743087 2725875 2713329 2703392
59509B703392r486q776o510l885k125m83K425O386R901J2218J4026J6312J9249
$$ 2703392 2693906 2685130 2678620 2674735 2672610 2672127 2674552 2680938 2690839 2703057 2717083 2733395 2752644
59496B752644K2386K5434K8703L2842L7929M2803M5865M6934M7751N0005N3321
$$ 2752644 2775030 2800464 2829167 2862009 2899938 2942741 2988606 3035540 3083291 3133296 3186617
59485C186617N6165N8287O1140O5845P1917P8003Q2586Q3518P8586O8038N5896
$$ 3186617 3242782 3301069 3362209 3428054 3499971 3577974 3660560 3744078 3822664 3890702 3946598
59474C946598M7212M3851M3614M3330M1824L9810L7873L5416L1470K5946J9757
$$ 3946598 3993810 4037661 4081275 4124605 4166429 4206239 4244112 4279528 4310998 4336944 4356701
59463D356701J3703P694J273n402j1659j7273k2558k7498l1436l3954l5399l6349
$$ 4356701 4370404 4378098 4379371 4373969 4362310 4345037 4322479 4294981 4263545 4229591 4194192 4157843
59451D157843l7057l7552l7532l6058l2363k7261k2684j9183j4937q139N50Q961
$$ 4157843 4120786 4083234 4045702 4009644 3977281 3950020 3927336 3908153 3893216 3885077 3885627 3894588
59439C894588J6173K3243L1523M1205N1315O0477O8020P4807Q2320R0488R7283
$$ 3894588 3910761 3934004 3965527 4006732 4058047 4118524 4186544 4261351 4343671 4434159 4531442
59428D531442J01276J03399J05073J05526J02619R5677Q5837P3977N9959M3859
$$ 4531442 4632718 4736117 4841190 4946716 5049335 5145012 5230849 5304826 5364785 5408644
59418E408644K6467Q520r373k6155m0979n4224o6481p6812q3612q7049q8840q9496
$$ 5408644 5435111 5443631 5434258 5408103 5367124 5312900 5246419 5169607 5085995 4998946 4910106 4820610
59406D820610q7737q3037p6865p0661o4188n6797m8933m1447l4701k9174k5689
$$ 4820610 4732873 4649836 4572971 4502310 4438122 4381325 4332392 4290945 4256244 4227070 4201381
59395D201381k4144k3197k2173k2132k4040k7035k9779l2635l6992m3019m9265
$$ 4201381 4177237 4154040 4131867 4109735 4085695 4058660 4028881 3996246 3959254 3916235 3866970
59384C866970n4366n8130o1245o4668o9053p3984p8000p9921q0019p9501p9091
$$ 3866970 3812604 3754474 3693229 3628561 3559508 3485524 3407524 3327603 3247584 3168083 3088992
59373C088992p8370p6320p2490o7941o4789o3946o3583o1061n6198n1198m7345
$$ 3088992 3010622 2934302 2861812 2793871 2729082 2665136 2601553 2540492 2484294 2433096 2385751
59362B385751m3715l9534l5519l1868k7159k0835j4711j0043n173J267O366N543
$$ 2385751 2342036 2302502 2266983 2235115 2207956 2187121 2172410 2162367 2157194 2158461 2164827 2170370
59350B170370j326r412j4607j6770j7103j5554j2093p922l654J782Q351J2624
$$ 2170370 2169044 2159632 2145025 2128255 2111152 2095598 2083505 2075583 2071929 2073711 2082062 2094686
59338B094686J0494J822r216j8015k2516k3066k1214j8826j6929j4776j0871n180
$$ 2094686 2105180 2107002 2097786 2079771 2057255 2034189 2012975 1994149 1977220 1962444 1951573 1946393
59326A946393M66M459P143R953J3550J7510K1413K5297K9040L2138L4454L6709
$$ 1946393 1946859 1951318 1958461 1968414 1981964 1999474 2020887 2046184 2075224 2107362 2141816 2178525
59314B178525L9803M3910M8595N3464N8231O2457O5900O9001P2416P6064P9426
$$ 2178525 2218328 2262238 2310833 2364297 2422528 2484985 2550885 2619886 2692302 2768366 2847792
59303B847792Q2801Q7407R3905J01485J08923J15907J22956J30575J39126J48911
$$ 2847792 2930593 3018000 3111905 3213390 3322313 3438220 3561176 3691751 3830877 3979788
59293C979788J59710J70587J80786J90586K00741K11368K21980K32267K42076
$$ 3979788 4139498 4310085 4490871 4681457 4882198 5093566 5315546 5547813 5789889
59284E789889K50737K57059K60119K59575K55184K46546K33427K16187J95776
$$ 5789889 6040626 6297685 6557804 6817379 7072563 7319109 7552536 7768723 7964499
59275G964499J73408J50112J26467J02760P9239N5815L1739O229k0342m6407p0586
$$ 7964499 8137907 8288019 8414486 8517246 8596485 8652300 8684039 8690268 8669926 8623519 8552933
59264H552933r2732j13629j34273j55298j76137j94788k09531k21024k31285k40331
$$ 8552933 8460201 8346572 8212299 8057001 7880864 7686076 7476545 7255521 7024236 6783905
59254F783905k45701k45987k42831k38073k31043k20785k09220j99205j90345
$$ 6783905 6538204 6292217 6049386 5811313 5580270 5359485 5150265 4951060 4760715
59245D760715j79788j66895j54202j43412j33460j23445j14661j08042j01716
$$ 4760715 4580927 4414032 4259830 4116418 3982958 3859513 3744852 3636810 3535094
59236C535094r3140q2546p2515o4939n9756n5855n1959m7149m1681l6791l2972
$$ 3535094 3441954 3359408 3286893 3221954 3162198 3106343 3054384 3007235 2965554 2928763 2895791
59225B895791k9110k4240j9161j5191j2120q849n406k747p77J805N458Q985J1120
$$ 2895791 2866681 2842441 2823280 2808089 2795969 2787120 2781714 2778967 2778190 2779995 2785453 2794438 2805558
59212B805558J1977J2481J3342J4882J7129J9427K0561J9730J7196J3834J0524
$$ 2805558 2817535 2830016 2843358 2858240 2875369 2894796 2915357 2935087 2952283 2966117 2976641
59201B976641Q015O542N141J970l962j1592j8768k4213k8193l1588l4934l8216
$$ 2976641 2984656 2991198 2996339 2998309 2994347 2982755 2963987 2939774 2911581 2879993 2845059 2806843
59189B806843m1071m3082m4379m5837m8163n0631n1447m9718m6615m4154m3186
$$ 2806843 2765772 2722690 2678311 2632474 2584311 2533680 2482233 2432515 2385900 2341746 2298560
59178B298560m3019m2634m1482l9414l6675l4000l1937k9861k6538k1939j7651
$$ 2298560 2255541 2212907 2171425 2132011 2095336 2061336 2029399 1999538 1973000 1951061 1933410
59167A933410j4982j3401j1599r344p360n768l838j229J482L819O078Q697J1556
$$ 1933410 1918428 1905027 1893428 1884084 1876724 1870956 1867118 1865889 1867371 1871190 1877268 1885965 1897521
59154A897521J4296J7014K0194K4237K9190L4692L9969M4179M7131M9652N3076
$$ 1897521 1911817 1928831 1949025 1973262 2002452 2037144 2077113 2121292 2168423 2218075 2271151
59143B271151N8245O4928P2117P8985Q5589R2629J00460J08686J16686J24178
$$ 2271151 2329396 2394324 2466441 2545426 2631015 2723644 2824104 2932790 3049476 3173654
59133C173654J30944J36545J40782J44133J47081J48985J48167J43246J34154
$$ 3173654 3304598 3441143 3581925 3726058 3873139 4022124 4170291 4313537 4447691
59124D447691J21807J07042Q9939P0146M7883K4360P70k2879m7097p0945r1820
$$ 4447691 4569498 4676540 4766479 4836625 4884508 4908868 4909638 4886759 4839662 4768717 4676897
59113D676897j07780j19246j27715j33724j37013j37773j36394j32664j26608
$$ 4676897 4569117 4449871 4322156 4188432 4051419 3913646 3777252 3644588 3517980
59104C517980j19660j13428j07638j00832r2993q5796q0038p4618o8482o2067
$$ 3517980 3398320 3284892 3177254 3076422 2983429 2897633 2817595 2742977 2674495 2612428
59094B612428n6261n1361m7637m5408m3753m0760l6084l1962l0443l0720l0522
$$ 2612428 2556167 2504806 2457169 2411761 2368008 2327248 2291164 2259202 2228759 2198039 2167517
59083B167517k9018k6873k4402k1491j8880j7746j7923j7960j7018j5559j4052
$$ 2167517 2138499 2111626 2087224 2065733 2046853 2029107 2011184 1993224 1976206 1960647 1946595
59072A946595j2267j0167q357p176o051m216j580J261L458M273L732L001L506
$$ 1946595 1934328 1924161 1915804 1908628 1902577 1898361 1896781 1898042 1901500 1905773 1909505 1912506 1916012
59059A916012N437P564Q656Q596Q000P412P082P015O836N963M290K488J398J247
$$ 1916012 1921449 1929013 1937669 1946265 1954265 1961677 1968759 1975774 1982610 1988573 1992863 1995351 1996749 1997996
59045A997996J553J654J238M66l26j111k139l333m001l571k392j363q81o55l28
$$ 1997996 1999549 2001203 2002441 2002907 2002581 2001470 1999331 1995998 1991997 1988426 1986034 1984671 1983790 1983135 1982807
59030A982807K57J405L379N688P236P603P649Q467J0136J1906J3230J4047J4347
$$ 1982807 1983064 1984469 1987848 1993536 2000772 2008375 2016024 2024491 2034627 2046533 2059763 2073810 2088157
59017B088157J4070J3435J2814J2223J1378J0234R078P943O419M248J808l05j978
$$ 2088157 2102227 2115662 2128476 2140699 2152077 2162311 2171389 2179332 2185751 2189999 2191807 2191502 2189524
59004B189524l637n806q764j2319j5699j8030j9400k1048k3904k7213k9328k9815
$$ 2189524 2185887 2180081 2171317 2158998 2143299 2125269 2105869 2084821 2060917 2033704 2004376 1974561
58992A974561k9829l0301l0750l0440k9801k9885l0869l1879l2019l0977k8925
$$ 1974561 1944732 1914431 1883681 1853241 1823440 1793555 1762686 1730807 1698788 1667811 1638886
58981A638886k6513k4706k4029k4062k4113k4048k3899k3234k1652j9520j7324
$$ 1638886 1612373 1587667 1563638 1539576 1515463 1491415 1467516 1444282 1422630 1403110 1385786
58970A385786j4794j1766r402r048r966r871q015o111n593n575m597l045k373
$$ 1385786 1370992 1359226 1349824 1340776 1330810 1320939 1312924 1306813 1301220 1295645 1291048 1288003 1285630
58957A285630k758l065k817k823l780n247o290o530o319o270o612o868o323m899
$$ 1285630 1282872 1279807 1276990 1274167 1270387 1265140 1258850 1252320 1246001 1239731 1233119 1226251 1219928 1215029
58943A215029l192j600j5J311J557N74m31l75J85l8j001j357k82J816M294O946
$$ 1215029 1211837 1210237 1210222 1211533 1213090 1213664 1213233 1212858 1213043 1213005 1212004 1210647 1210365 1212181 1216475 1223421
58927A223421R433J1158J2057J2855J4091J5479J6579J7548J8789K0294K1760
$$ 1223421 1232854 1244012 1256069 1268924 1283015 1298494 1315073 1332621 1351410 1371704 1393464
58916A393464K3058K4163K4839K4866K4448K4037K3687K2905K1230J8763J5974
$$ 1393464 1416522 1440685 1465524 1490390 1514838 1538875 1562562 1585467 1606697 1625460 1641434
58905A641434J3170J0437Q015O233M912L306J109q59j530j075p98j599l149m597
$$ 1641434 1654604 1665041 1673056 1679289 1684201 1687507 1688616 1687757 1686227 1685152 1684354 1682755 1679606 1675009
58891A675009n476n702n410n011m750m077k107J084M331O946R487J2480J5255
$$ 1675009 1669533 1663831 1658421 1653410 1648660 1644583 1642476 1643560 1647891 1654837 1664324 1676804 1692059
58878A692059J6766J6973J6711J6718J7406J9034K1472K4143K6731K9347L1699
$$ 1692059 1708825 1725798 1742509 1759227 1776633 1795667 1817139 1841282 1868013 1897360 1929059
58867A929059L3036L3444L4163L5709L6877L6772L6720L8624M2138M5261M7225
$$ 1929059 1962095 1995539 2029702 2065411 2102288 2139060 2175780 2214404 2256542 2301803 2349028
58856B349028M9014N1311N3787N6446N9865O3793O7130O9672P2438P5990P9861
$$ 2349028 2398042 2449353 2503140 2559586 2619451 2683244 2750374 2820046 2892484 2968474 3048335
58845C048335Q3815Q7969R1333R2223R0911Q9961R0907R2402R2984R3805R6660
$$ 3048335 3132150 3220119 3311452 3403675 3494586 3584547 3675454 3767856 3860840 3954645 4051305
58834D051305J00823J04164J06534J09603J13690J17215J19548J22161J26062
$$ 4051305 4152128 4256292 4362826 4472429 4586119 4703334 4822882 4945043 5071105
58825E071105J29890J31650J31159J29606J27709J25429J22929J20408J17134
$$ 5071105 5200995 5332645 5463804 5593410 5721119 5846548 5969477 6089885 6207019
58816F207019J11789J03954R4555Q4464P3318O0258M5500L0595J7020M895o758
$$ 6207019 6318808 6422762 6517317 6601781 6675099 6735357 6780857 6811452 6828472 6833367 6826609
58805F826609j8774l1194m3631n5726o7061p7112q5706r3382j00882j08187j14332
$$ 6826609 6807835 6776641 6733010 6677284 6610223 6533111 6447405 6354023 6253141 6144954 6030622
58794F030622j18354j20371j21544j22903j24259j24389j22524j19453j16872
$$ 6030622 5912268 5791897 5670353 5547450 5423191 5298802 5176278 5056825 4939953
58785D939953j15651j15024j13588j10697j06692j02150r7428r2764q8266q3665
$$ 4939953 4824302 4709278 4595690 4484993 4378301 4276151 4178723 4085959 3997693 3914028
58775C914028p8511p2894o7615o3285n9445n4911m9040m2287l5648k9907k5489
$$ 3914028 3835517 3762623 3695008 3631723 3572278 3517367 3468327 3426040 3390392 3360485 3334996
58764C334996k2339j9593j5925j0935n872k247J23K778O416R994J2343J3716J5259
$$ 3334996 3312657 3293064 3277139 3266204 3260332 3258085 3258208 3260986 3267402 3277396 3289739 3303455 3318714
58751C318714J7745K1353K5791K9887L1915L1391L0201L1007L4751M0319M6060
$$ 3318714 3336459 3357812 3383603 3413490 3445405 3476796 3506997 3538004 3572755 3613074 3659134
58740C659134N0862N4352N7281O1235O6849P2680P7144Q1012Q6256R2726R8087
$$ 3659134 3709996 3764348 3821629 3882864 3949713 4022393 4099537 4180549 4266805 4359531 4457618
58729D457618J01363J04312J08459J12715J15401J16969J18949J21202J22093
$$ 4457618 4558981 4663293 4771752 4884467 4999868 5116837 5235786 5356988 5479081
58720E479081J20916J18444J15218J10636J03937R5180Q4997P4045O2529M9876
$$ 5479081 5599997 5718441 5833659 5944295 6048232 6143412 6228409 6302454 6364983 6414859
58710F414859L5243J8894K519j2508k6494m0282n3559o5610p6969q8642j00000
$$ 6414859 6450102 6468996 6471515 6459007 6432513 6392231 6338672 6273062 6196093 6107451 6007451
58699F007451j09256j16157j22364j28689j33726j36191j37033j37944j38822
$$ 6007451 5898195 5782038 5659674 5530985 5397259 5261068 5124035 4986091 4847269
58690D847269j38243j35805j32601j29543j26442j22854j18863j14773j10731
$$ 4847269 4709026 4573221 4440620 4311077 4184635 4061781 3942918 3828145 3717414
58681C717414j06821j03070r9280r5283r1258q7413q3444p8952p4330p0461o7343
$$ 3717414 3610593 3507523 3408243 3312960 3221702 3134289 3050845 2971893 2897563 2827102 2759759
58670B759759o3910n9655n5724n3490n2449n0628m7225m3759m2027m1542m0010
$$ 2759759 2695849 2636194 2580470 2526980 2474531 2423903 2376678 2332919 2290892 2249350 2209340
58659B209340l6210l1470k7945k6182k5017k3412k1582k0260j9549j8964j8263
$$ 2209340 2173130 2141660 2113715 2087533 2062516 2039104 2017522 1997262 1977713 1958749 1940486
58648A940486j7887j8603k0803k4084k7540l0615l3672l7373m1416m4359m4949
$$ 1940486 1922599 1903996 1883193 1859109 1831569 1800954 1767282 1729909 1688493 1644134 1599185
58637A599185m3318m0601l7766l5274l3483l2480l1532k9608k6720k4111k2625
$$ 1599185 1555867 1515266 1477500 1442226 1408743 1376263 1344731 1315123 1288403 1264292 1241667
58626A241667k1633k0207j8657j7810j7130j4949j0938p151n732o385p153p290
$$ 1241667 1220034 1199827 1181170 1163360 1146230 1131281 1120343 1113192 1107460 1101075 1093922 1086632
58614A086632q078j0643j4004j6032j5802j4345j3218j2974j3074j2883j2391
$$ 1086632 1078554 1067911 1053907 1037875 1022073 1007728 994510 981536 968462 955579 943188
58603I43188j2014j1917j1667j0654q868p148o510p211q596r789j0326j0006q594
$$ 943188 931174 919257 907590 896936 888068 880920 874410 867199 858603 848814 838488 828482 819888
58590H19888o155l609k197k045j884q00K63k91k222l336k160K28J772J933J809
$$ 819888 813733 810124 807927 805882 803998 803198 803461 803170 800948 797612 795452 795680 797452 799385 801194
58575H01194K365L568N017O387P190P048O339N943O277P093Q280R864J1247J1436
$$ 801194 803559 807127 812144 818531 825721 832769 839108 845051 851328 858421 866701 876565 887812 899248
58561H99248J0551J0103J1034J2264J2139J0817J0057J0779J1963J2196J1456
$$ 899248 909799 919902 930936 943200 955339 966156 976213 986992 998955 1011151 1022607
58550A022607J0853J1189J2321J3656J4835J5931J7316J9125K0775K1325K0709
$$ 1022607 1033460 1044649 1056970 1070626 1085461 1101392 1118708 1137833 1158608 1179933 1200642
58539A200642K0254K1342K3631K5422K5982K6645K8938L2291L4639L5058L4675
$$ 1200642 1220896 1242238 1265869 1291291 1317273 1343918 1372856 1405147 1439786 1474844 1509519
58528A509519L4807L5244L5037L4146L3479L3581L3990L3823L2597L0462K7921
$$ 1509519 1544326 1579570 1614607 1648753 1682232 1715813 1749803 1783626 1816223 1846685 1874606
58517A874606K5158K1696J7124J2165Q165N305K183k145o745j0308j3057j5912
$$ 1874606 1899764 1921460 1938584 1950749 1958914 1964219 1966402 1964257 1957512 1947204 1934147 1918235
58505A918235j8557j9916k0174k0555k1249k1425k1383k2733k5712k8241k8696
$$ 1918235 1899678 1879762 1859588 1839033 1817784 1796359 1774976 1752243 1726531 1698290 1669594
58494A669594k8051k8048k8644k8870k9038l0195l1892l2447l1351k9871k9060
$$ 1669594 1641543 1613495 1584851 1555981 1526943 1496748 1464856 1432409 1401058 1371187 1342127
58483A342127k8571k7730k6581k5360k3920k2295k1013k0294j9546j8249j6860
$$ 1342127 1313556 1285826 1259245 1233885 1209965 1187670 1166657 1146363 1126817 1108568 1091708
58472A091708j6077j5546j4099j1444q989q543j0270j2335j2734j1169r004p645
$$ 1091708 1075631 1060085 1045986 1034542 1025553 1017010 1006740 994405 981671 970502 961498 953853
58460I53853p455p961q403q058o692n064m333m594m628l535k042j464j909k315
$$ 953853 946398 938437 930034 921976 915284 910220 905887 901293 896665 893130 891088 889624 887715 885400
58446H85400j920r11K24J121J416R92L34rl53j485l265m428m140k988k040j478
$$ 885400 883480 882569 882793 883914 885330 886322 886656 886647 886294 884809 881544 877116 872976 869988 867948 866470
58430H66470q13j0L18j31p84p98l0Q65J270J309J552K122K515K351J964J937K259
$$ 866470 865657 865647 865965 865834 865050 864252 864222 865087 866357 867666 869218 871340 873855 876206 878170 880107 882366
58413H82366K295J489j40j947k880k196l38J169J216K89l94m97n95q67q14m26
$$ 882366 884661 886150 886010 884063 881183 878987 878649 879818 881034 881323 880929 880432 879837 878970 878156 877730
58397H77730n55j599k693k818k130j471j122q91j020j866k734k131L33L022L960
$$ 877730 877175 875576 872883 870065 867935 866464 865342 864451 863431 861565 858831 856700 857033 860055 864015
58382H64015K949J476P64P27P70Q32J189J714J898J540J039J058K049L982O216
$$ 864015 866964 868440 869204 869931 870701 871533 872722 874436 876334 877874 878913 879971 882020 886002 892218
58367H92218P651P408N619L489K366K693L777M596M893N357O571Q027Q723Q629
$$ 892218 899869 907277 912896 916385 918751 921444 925221 929817 934710 940067 946638 954665 963388 972017
58353I72017Q672R044Q565O598M663M818O855Q635R105R319J0108J0392Q983O796
$$ 972017 980689 989733 998298 1004896 1009559 1014377 1021232 1029867 1038972 1048291 1058399 1068791 1077774 1084570
58339A084570N957P146R007R948R674Q942Q615R020R806J0333J0322R999R601
$$ 1084570 1090527 1097673 1106680 1116628 1126302 1135244 1143859 1152879 1162685 1173018 1183340 1193339 1202940
58326A202940R194R025R492J0431J1045J0801R878Q641P457P155Q601J1295J3496
$$ 1202940 1212134 1221159 1230651 1241082 1252127 1262928 1272806 1281447 1288904 1296059 1304660 1315955 1329451
58313A329451J4332J4681J5291J5399J4364J3278J3386J3886J3132J1382J0435
$$ 1329451 1343783 1358464 1373755 1389154 1403518 1416796 1430182 1444068 1457200 1468582 1479017
58302A479017J0914J1755J2322J3120J4298J5109J5280J5497J6175J7037J8003
$$ 1479017 1489931 1501686 1514008 1527128 1541426 1556535 1571815 1587312 1603487 1620524 1638527
58291A638527J9156J9773J8917J7382J7224J8903K0510K0572K0030K0535K2234
$$ 1638527 1657683 1677456 1696373 1713755 1730979 1749882 1770392 1790964 1810994 1831529 1853763
58280A853763K4252K6044K7108K6675K5009K3968K4851K6548K7170K6741K6795
$$ 1853763 1878015 1904059 1931167 1957842 1982851 2006819 2031670 2058218 2085388 2112129 2138924
58269B138924K7892K9069K9571K9673K9847L0240L1041L2385L3803L4640L5032
$$ 2138924 2166816 2195885 2225456 2255129 2284976 2315216 2346257 2378642 2412445 2447085 2482117
58258B482117L5729L6990L8326L9207L9465L9150L8719L9051M0618M2804M4768
$$ 2482117 2517846 2554836 2593162 2632369 2671834 2710984 2749703 2788754 2829372 2872176 2916944
58247B916944M6577M8542N0021N0214N0031N1502N5004N8386N9641N9218N8849
$$ 2916944 2963521 3012063 3062084 3112298 3162329 3213831 3268835 3327221 3386862 3446080 3504929
58236C504929N9101N9393N9750O1060O3552O6257O8371P0289P2767P5724P8543
$$ 3504929 3564030 3623423 3683173 3744233 3807785 3874042 3942413 4012702 4085469 4161193 4239736
58225D239736Q1088Q3612Q5926Q7485Q8545R0371R3803R8028J01422J03470J05361
$$ 4239736 4320824 4404436 4490362 4577847 4666392 4756763 4850566 4948594 5050016 5153486 5258847
58214E258847J08736J14109J20466J26171J30492J34470J39876J47128J54732
$$ 5258847 5367583 5481692 5602158 5728329 5858821 5993291 6133167 6280295 6435027
58205F435027J61269J67240J74088J82032J90058J97760K05809K14566K23684
$$ 6435027 6596296 6763536 6937624 7119656 7309714 7507474 7713283 7927849 8151533
58196H151533K33314K44327K56723K69085K80488K91966L05180L20420L36777
$$ 8151533 8384847 8629174 8885897 9154982 9435470 9727436 10032616 10353036 10689813
58187A0689813L53669L71221L89588M08667M28386M48980M71267M96527N25269
$$ 10689813 11043482 11414703 11804291 12212958 12641344 13090324 13561591 14058118 14583387
58178A4583387N56180N87583O20140O56414O97091P39511P81325Q23896Q70339
$$ 14583387 15139567 15727150 16347290 17003704 17700795 18440306 19221631 20045527 20915866
58169B0915866R21485R75997J033497J095112J161212J230951J304470J383739
$$ 20915866 21837351 22813348 23846845 24941957 26103169 27334120 28638590 30022329
58161C0022329J470721J566034J669929J783632J909425K049858K206596K379514
$$ 30022329 31493050 33059084 34729013 36512645 38422070 40471928 42678524 45058038
58153D5058038K567932K773527L000453L251244L524872L821617M148300M515641
$$ 45058038 47625970 50399497 53399950 56651194 60176066 63997683 68145983 72661624
58145G2661624M932486N406052N943182O540367P170608P792445Q384490Q970529
$$ 72661624 77594110 83000162 88943344 95483711 102654319 110446764 118831254 127801783
58137A27801783R603522J0323412J1131657J1999423J2887156J3751190J4537705
$$ 127801783 137405305 147728717 158860374 170859797 183746953 197498143 212035848
58130B12035848J5174531J5562055J5563232J5005270J3709640J1550790Q522345
$$ 212035848 227210379 242772434 258335666 273340936 287050576 298601366 307123711
58123C07123711M778869O25897l547781p369564j0567020j3002058j4656936j5597972
$$ 307123711 311902580 312528477 308980696 301611132 291044112 278042054 263385118 247787146
58115B47787146j5938803j5810086j5337284j4629052j3775101j2847378j1900329
$$ 247787146 231848343 216038257 200700973 186071921 172296820 159449442 147549113
58108A47549113j0971443j0084001r250970q478285p767392p116970o523441n981353
$$ 147549113 136577670 126493669 117242699 108764414 100997022 93880052 87356611 81375258
58100H1375258n485321n032168m620268m246809l907005l596433l312778l054586
$$ 81375258 75889937 70857769 66237501 61990692 58083687 54487254 51174476 48119890
58092D8119890k819604k605500k411168k235884k077491j932585j798493j674276
$$ 48119890 45300286 42694786 40283618 38047734 35970243 34037658 32239165 30564889
58084C0564889j559986j455612j360652j274034j194453j121173j054164r93099
$$ 30564889 29004903 27549291 26188639 24914605 23720152 22598979 21544815 20551716
58076B0551716r36619q83288q32855p85844p42286p01577o63378o27753n94633
$$ 20551716 19615097 18731809 17898954 17113110 16370824 15669247 15005869 14378116 13783483
58067A3783483n63890n35657n09720m84978m60594m37382m16762l98479l80896
$$ 13783483 13219593 12683936 12174216 11689238 11228644 10791262 10374500 9976021 9595125
58058I595125l63663l48179l34848l21688l07003k92015k79256k69245k60362
$$ 9595125 9231462 8883283 8548435 8226747 7919744 7627729 7348473 7079228 6818866
58049F818866k51408k42573k33927k24617k14008k02640j91620j81651j72793
$$ 6818866 6567458 6324885 6090958 5866341 5652333 5449693 5258073 5076422 4903629
58040D903629j64596j56385j47894j39632j32207j25555j19373j13908j09503
$$ 4903629 4739033 4582648 4434754 4295122 4162915 4037360 3917987 3804079 3694576
58031C694576j05614j01214r6129r1065q6329q1494p6536p2305o9457o7618o6000
$$ 3694576 3588962 3487748 3391619 3300554 3214225 3132731 3056195 2983890 2914433 2846815 2780815
58020B780815o4239o2274n9973n7324n4692n2638n1587n1556n1774n0858m8125
$$ 2780815 2716576 2654302 2594329 2537005 2482313 2429675 2378088 2326532 2274758 2223900 2175775
58009B175775m4660m2267m1359m0678l9157l7052l5127l3777l3270l3734l4377
$$ 2175775 2131115 2088848 2047489 2006811 1967654 1930602 1895475 1861698 1828428 1794694 1760317
57998A760317l3741l1463k8938k7534k6978k6195k5003k4023k3573k3458k3439
$$ 1760317 1726576 1695113 1666175 1638641 1611663 1585468 1560465 1536442 1512869 1489411 1465972
57987A465972k3212k2450k1417k0957k1197k1049j9747j8152j7570j7984j8480
$$ 1465972 1442760 1420310 1398893 1377936 1356739 1335690 1315943 1297791 1280221 1262237 1243757
57976A243757j8713j8774j8306j7049j5723j5031j4340j2882j1695j2471j4701
$$ 1243757 1225044 1206270 1187964 1170915 1155192 1140161 1125821 1112939 1101244 1088773 1074072
57965A074072j5965j5267j4039j3455j2787j1285r820r430r669r546q982q314
$$ 1074072 1058107 1042840 1028801 1015346 1002559 991274 981454 972024 962355 952809 943827 935513
57953I35513p483o691o594o864o031m022l260n385q233q356n711l300k617k114
$$ 935513 928030 921339 914745 907881 901850 897828 894568 889183 880950 872594 866883 863583 860966 858852
57939H58852n62P58L02j260k115j587j83J477K735K794J636L98M1K77M70O68R10
$$ 858852 858290 859048 859350 858090 855975 854388 854205 855682 858417 861211 862847 863245 863286 863563 864033 864701 865611
57922H65611N13p25j436k56K005L303L239L436M799O073N824M614M093M648N092
$$ 865611 866124 865399 863963 863707 865712 869015 872254 875690 880489 886562 892386 897000 901093 905741 910833
57907I10833M485L204K059J149kj537l008l966m523n225o498q391j0730j3251
$$ 910833 915318 918522 920581 921730 921728 920191 917183 913217 908694 903469 896971 888580 877850 864599
57893H64599j5488j6811j6863j5898j4436j2654j0450q187o882p185q311q455
$$ 864599 849111 832300 815437 799539 785103 772449 761999 753812 746930 739745 731434 722979
57881G22979o580l593j502j498l074m801n589n241m336l854m420n636o441o442
$$ 722979 716399 712806 711304 709806 706732 701931 696342 691101 686765 682911 678491 672855 666414 659972
57867F59972o385o895p373o961o160o343p654q640q255p230o787o879o441m884
$$ 659972 653587 646692 639319 632358 626198 619855 612201 603561 595306 588076 581289 574410 567969 563085
57853E63085k537j49J489J785R84K56N15J400K041K317K543K290O96k003m288
$$ 563085 560548 560399 561888 563673 564657 564913 565428 566828 568869 571186 573729 576019 576715 574712 570424
57838E70424n042m735m597n249o450p594q062p528o321n228m763m890n487o528
$$ 570424 565382 560647 556050 550801 544351 536757 528695 521167 514846 509618 504855 499965 494478 487950
57824D87950p582p698o395m418l072k892l302l448l014k284j817k111l299m916
$$ 487950 480368 472670 466275 461857 458785 455893 452591 449143 446129 443845 442028 439917 436618 431702
57810D31702o017n799m235k122l94N87J072J429J826K288K673K674K246K017K597
$$ 431702 425685 419886 415651 413529 413135 413722 414794 416223 418049 420337 423010 425684 427930 429947 432544
57795D32544L351K712K77k187k646j212K41M58j98r63j785k958m452n808o271
$$ 432544 435895 438607 438884 436697 434051 432839 433080 433538 433340 432377 430592 427634 423182 417374 411103
57780D11103n177k800o53j35r91j896k295k510k337j109N95J100J13m63P31K323
$$ 411103 405926 403126 402473 402338 401347 399451 397156 394646 392309 391200 391795 392895 393008 392545 393276 395599
57764C95599K088Nk014k772k623k145j519j154j535k263k446k142k351l292l851
$$ 395599 397687 397692 395678 392906 390283 388138 386619 385465 383930 381667 379221 377079 374728 371436 367585
57749C67585l173j832q37l10N5k1r46k045j885j06J801K137J069M67J673M080
$$ 367585 364412 362580 361743 361433 361488 361467 360521 358476 356591 356485 358286 360423 361492 361959 363632 367712
57733C67712O135P153P602P979Q219Q163P717O474L975P58j671k436k306k554
$$ 367712 373847 381000 388602 396581 404800 412963 420680 427154 431129 431887 430216 427780 425474 422920
57719D22920l354l948l908l585l527m128n477p016p582o560m785l764m128n372
$$ 422920 419566 415618 411710 408125 404598 400470 394993 387977 380395 373835 369050 365286 361158 355786
57705C55786o716p602p590o663n583n239n562n635m797l144j135O00J173J44j589
$$ 355786 349070 341468 333878 327215 321632 316393 310831 305196 300399 297255 296120 296720 297893 298037 296448
57690B96448k403j672l08N96R08R83Q14K93j07L94J907L523M123L557K880L168
$$ 296448 294045 292373 292065 292661 293569 294552 295366 295659 295552 295946 297853 301376 305499 309056 311936 315104
57674C15104M090M101K435K95n49P5Q79J208J743K967M081M213L877M293N520
$$ 315104 319194 323295 325730 326025 325476 325551 326430 327638 329381 332348 336429 340642 344519 348812 354332
57659C54332O172N130K929J031J18l82j007j173o6J780K754K285J575J782K391
$$ 354332 360504 365634 368563 369594 369712 369330 368323 367150 367084 368864 371618 373903 375478 377260 379651
57644C79651K343J937K301L465M291M221L861L897M638O416Q977J0471Q859M976
$$ 379651 381994 383931 386232 389697 393988 398209 402070 405967 410605 417021 425998 436469 445328 450304
57630D50304K487L796P349J0092J1316J2466J4250J5809J6547J7032J7840J8886
$$ 450304 452791 456587 463936 474028 485344 497810 512060 527869 544416 561448 579288 598174
57618E98174K0338K3037K7348L2271L6413L9577M2834M7239N2840N8861O4206
$$ 598174 618512 641549 668897 701168 737581 777158 819992 867231 920071 978932 1043138
57607A043138O7322O5766N7024M0747K0194N83j4199k3069k6509k5343k1054j5848
$$ 1043138 1110460 1176226 1233250 1273997 1294191 1294774 1280575 1257506 1230997 1205654 1184600 1168752
57595A168752j1110o472j245L973Q082J1106J3695J5608J6197J6107J6704J7715
$$ 1168752 1157642 1151170 1149925 1153898 1161980 1173086 1186781 1202389 1218586 1234693 1251397 1269112
57583A269112J7209J4536J1600J0252R652P539L218j903o214r076j0641j1701
$$ 1269112 1286321 1300857 1312457 1322709 1332361 1339900 1343118 1341215 1335001 1325925 1315284 1303583
57571A303583j3487j6493j9455k0682k0291j9989k0448k0313j8387j5648j4100
$$ 1303583 1290096 1273603 1254148 1233466 1213175 1193186 1172738 1152425 1134038 1118390 1104290
57560A104290j4400j5504j6149j5750j4228j2018j0102r118q434o855m286j911
$$ 1104290 1089890 1074386 1058237 1042487 1028259 1016241 1006139 997021 988587 981732 977446 975535
57548I75535o24q4N34J573L023M821O639P986Q927J0089J1593J2642J2781J2910
$$ 975535 974911 974827 975361 976934 979957 984778 991417 999403 1008330 1018419 1030012 1042654 1055435 1068345
57534A068345J4246J6678J9024K0639K1826K2683K2461K0591J7784J5593J4944
$$ 1068345 1082591 1099269 1118293 1138932 1160758 1183441 1205902 1226493 1244277 1259870 1274814
57523A274814J5286J5208J3795J1275Q405N446K154j437m778p544r998j2469j4981
$$ 1274814 1290100 1305308 1319103 1330378 1338783 1344229 1346383 1344946 1340168 1332624 1322626 1310157 1295176
57510A295176j7569k0250k2465k3395k3268k3402k4321k4831k3998k2931k3220
$$ 1295176 1277607 1257357 1234892 1211497 1188229 1164827 1140506 1115675 1091677 1068746 1045526
57499A045526k4360k4368k2678k0656j9343j8363j7344j6591j5831j3912j0741
$$ 1045526 1021166 996798 974120 953464 934121 915758 898414 881823 865992 852080 841339
57488H41339q127p607q415q671p747o311m820l331k379k545l141k620p69N96j98
$$ 841339 833212 825605 817190 808519 800772 794461 789641 786310 783931 781386 778245 775625 774856 775452 775254
57473G75254k407l594k407J27K198L301M136N014N375N042M878N559O435O399
$$ 775254 772847 769253 766846 766973 769171 772472 776608 781622 786997 792039 796917 802476 808911 815310
57459H15310N466M676M799N888P705R773J1229J1583J1441J1704J2343J2841J3361
$$ 815310 820776 825452 830251 836139 843844 853617 864846 876429 887870 899574 911917 924758 938119
57446I38119J4313J5147J4950J4159J4209J5547J7381J9281K1287K2413K1186
$$ 938119 952432 967579 982529 996688 1010897 1026444 1043825 1063106 1084393 1106806 1127992
57435A127992J8298J6705J8035K0546K1709K1182J9975J8289J5883J3447J1814
$$ 1127992 1146290 1162995 1181030 1201576 1223285 1244467 1264442 1282731 1298614 1312061 1323875
57424A323875J0506Q455N626K768K57j823l294m664p224j0954j3474j2762j0045
$$ 1323875 1334381 1342836 1348462 1351230 1351487 1349664 1346370 1341706 1334482 1323528 1310054 1297292 1287247
57411A287247q242q249q723q910r376j0003r616q035o642o226n911m900l802l311
$$ 1287247 1279005 1270756 1262033 1253123 1243747 1233744 1224128 1216093 1209451 1203225 1197314 1192414 1188612 1185301
57397A185301k751r51K098N219P270P930P683P425P744Q552R579J0923J2638J4189
$$ 1185301 1182550 1181599 1183697 1188916 1196186 1204116 1211799 1219224 1226968 1235520 1245099 1256022 1268660 1282849
57383A282849J5151J6000J7237J8152J7732J6649J6828J8863K1211K2363K2530
$$ 1282849 1298000 1314000 1331237 1349389 1367121 1383770 1400598 1419461 1440672 1463035 1485565
57372A485565K2540K2241K0973J8949J7239J6598J6699J6336J4230J0154N492
$$ 1485565 1508105 1530346 1551319 1570268 1587507 1604105 1620804 1637140 1651370 1661524 1667016
57361A667016K230J138J110L53k029n368p984q669q159q620j1057j3793j4459
$$ 1667016 1669246 1670384 1671494 1671847 1669818 1664450 1656466 1647797 1639638 1631018 1619961 1606168 1591709
57348A591709j2949j1086r844q516o754n659o071p031o840n056k875j859k444
$$ 1591709 1578760 1567674 1557830 1549314 1542560 1536901 1530830 1523799 1516959 1511903 1509028 1507169 1504725
57335A504725l378k799l66K199L396L926N089O205N723M480N173Q276J0959J0903
$$ 1504725 1501347 1498548 1498182 1500381 1503777 1507703 1512792 1518997 1524720 1529200 1534373 1542649 1553608 1564511
57321A564511Q957O987N428M394M895P061Q918R048Q970J0638J2945J3326J1916
$$ 1564511 1573468 1580455 1585883 1590277 1595172 1602233 1611151 1620199 1629169 1639807 1652752 1666078 1677994
57308A677994J1335J2562J3710J3263J2145J1788J2028J1926J1433J1173J1442
$$ 1677994 1689329 1701891 1715601 1728864 1741009 1752797 1764825 1776751 1788184 1799357 1810799
57297A810799J2042J2613J2769J2445J2265J2859J3867J4276J3811J3187J3077
$$ 1810799 1822841 1835454 1848223 1860668 1872933 1885792 1899659 1913935 1927746 1940933 1954010
57286A954010J3673J5111J7248J9049J9272J7991J6428J5283J4344J3808J4464
$$ 1954010 1967683 1982794 2000042 2019091 2038363 2056354 2072782 2088065 2102409 2116217 2130681
57275B130681J6117J7253J7062J6533J6682J6982J6614J6226J6917J8176J8408
$$ 2130681 2146798 2164051 2181113 2197646 2214328 2231310 2247924 2264150 2281067 2299243 2317651
57264B317651J7267J6063J5857J6356J6866J7155J7210J7044J7123J8070J9610
$$ 2317651 2334918 2350981 2366838 2383194 2400060 2417215 2434425 2451469 2468592 2486662 2506272
57253B506272K0682K0880K0871K1039K0707J9552J8689J9276K0711K1490K1443
$$ 2506272 2526954 2547834 2568705 2589744 2610451 2630003 2648692 2667968 2688679 2710169 2731612
57242B731612K1721K2722K3513K3586K3634K4095K4298K3932K4137K5846K7979
$$ 2731612 2753333 2776055 2799568 2823154 2846788 2870883 2895181 2919113 2943250 2969096 2997075
57231B997075K8721K8024K7439K7698K7973K7528K6772K6329K6184K6161K6324
$$ 2997075 3025796 3053820 3081259 3108957 3136930 3164458 3191230 3217559 3243743 3269904 3296228
57220C296228K6580K6680K6732K6834K6214K4105K1653K1342K3677K6043K6043
$$ 3296228 3322808 3349488 3376220 3403054 3429268 3453373 3475026 3496368 3520045 3546088 3572131
57209C572131K4559K3945K4367K4025K2353K0810K0308J9946J8771J7176J5732
$$ 3572131 3596690 3620635 3645002 3669027 3691380 3712190 3732498 3752444 3771215 3788391 3804123
57198C804123J4195J2673J2416J3919J5230J3814R923O583O018P400Q595R017
$$ 3804123 3818318 3830991 3843407 3857326 3872556 3886370 3896293 3902876 3908894 3916294 3924889 3933906
57186C933906R755J1555J3756J5323J6065J6569J7345J8437J9660K0864K1980
$$ 3933906 3943661 3955216 3968972 3984295 4000360 4016929 4034274 4052711 4072371 4093235 4115215
57175D115215K2964K3703K4051K4035K4037K4488K5378K6317K7137K8044K9019
$$ 4115215 4138179 4161882 4185933 4209968 4234005 4258493 4283871 4310188 4337325 4365369 4394388
57164D394388K9543K9255K8342K6935K4712K1900K0093K0756K2926K3701K1595
$$ 4394388 4423931 4453186 4481528 4508463 4533175 4555075 4575168 4595924 4618850 4642551 4664146
57153D664146J8333J6654J7107J7958J7572J5851J3598J1663J0901J1977J4641
$$ 4664146 4682479 4699133 4716240 4734198 4751770 4767621 4781219 4792882 4803783 4815760 4830401
57142D830401J7563J9365J9622J8686J7007J5054J3658J3663J4981J6396J6692
$$ 4830401 4847964 4867329 4886951 4905637 4922644 4937698 4951356 4965019 4980000 4996396 5013088
57131E013088J5836J4613J3334J1515Q996O647N482N465N660N234L872J641q70
$$ 5013088 5028924 5043537 5056871 5068386 5077382 5084029 5089511 5094976 5100636 5105870 5109742 5111383 5110513
57118E110513k617l062k948l364m185m216k941j127L93J704L242M951O345O945
$$ 5110513 5107896 5104834 5101886 5098522 5094337 5090121 5087180 5086053 5086446 5088150 5091392 5096343 5102688 5109633
57104E109633O594N854O002P690R732J0324R566R410J0735J2037J1875J1214J1867
$$ 5109633 5116227 5122081 5128083 5135773 5145505 5155829 5165395 5174805 5185540 5197577 5209452 5220666 5232533
57091E232533J3742J5142J5310J5055J5017J4824J4253J4068J5086J6905J8010
$$ 5232533 5246275 5261417 5276727 5291782 5306799 5321623 5335876 5349944 5365030 5381935 5399945
57080E399945J7159J4755J2732J2605J3505J3066J0604Q321Q503J0530J1952J1734
$$ 5399945 5417104 5431859 5444591 5457196 5470701 5483767 5494371 5502692 5511195 5521725 5533677 5545411
57068E545411J0864J0151R131P296M912K194j202n465j0331j5735k1847k8265
$$ 5545411 5556275 5566426 5575557 5582853 5587765 5589959 5588757 5583292 5572961 5557226 5535379 5507114
57056E507114l4172l9649m5745n2740n9302o4023o7031o9363p1414p2751p2959
$$ 5507114 5472942 5433293 5387548 5334808 5275506 5211483 5144452 5075089 5003675 4930924 4857965
57045D857965p1759o8538o2517n3424m1620k7662j2254L452J7840K9271L6365
$$ 4857965 4786206 4717668 4655151 4601727 4560107 4532445 4520191 4523643 4541483 4570754 4607119
57034D607119L8116L4104K4721J0900o731k8603n6135r0859j33509j83698k39897
$$ 4607119 4645235 4679339 4704060 4714960 4708229 4679626 4623491 4532632 4399123 4215425 3975528
57023C975528k98834l54649l99155m23747m21677l89378l26767k37119j26334
$$ 3975528 3676694 3322045 2922890 2499143 2077466 1688088 1361321 1124202 997868
57014I97868j817J28026K53653L65191M54869N18931N57098N70861N63042N38168
$$ 997868 996051 1124077 1377730 1742921 2197790 2716721 3273819 3844680 4407722 4945890
57004D945890N01574M57664M09484L59817L11594K66956K26623J90384J57622
$$ 4945890 5447464 5905128 6314612 6674429 6986023 7252979 7479602 7669986 7827608
56995G827608J27422R9047P2728M9473K9813J3160j455j4535k6081l5949m4070
$$ 7827608 7955030 8054077 8126805 8176278 8206091 8219251 8217796 8203261 8177180 8141231 8097161
56984H097161n0752n6845o3152o9683p5797q1069q5496q9046r1605r3411r4962
$$ 8097161 8046409 7989564 7926412 7856729 7780932 7699863 7614367 7525321 7433716 7340305 7245343
56973G245343r6550r8334j00567j03153j05294j06425j07211j08635j10346j11197
$$ 7245343 7148793 7050459 6949892 6846739 6741445 6635020 6527809 6419174 6308828 6197631
56963F197631j11239j11709j12937j13849j14072j14917j17431j20842j23967
$$ 6197631 6086392 5974683 5861746 5747897 5633825 5518908 5401477 5280635 5156668
56954E156668j26998j30605j34210j36568j37638j38641j40492j43072j45775
$$ 5156668 5029670 4899065 4764855 4628287 4490649 4352008 4211516 4068444 3922669
56945C922669j47866j48616j47947j46836j46279j45965j44656j41679j37427
$$ 3922669 3774803 3626187 3478240 3331404 3185125 3039160 2894504 2752825 2615398
56936B615398j32612j27660j22686j17456j11527j04889r8215r1991q5851p9422
$$ 2615398 2482786 2355126 2232440 2114984 2003457 1898568 1800353 1708362 1622511 1543089
56926A543089p3409o8879o5705o2672n9083n5417n2325m9636m6718m3254l9580
$$ 1543089 1469680 1400801 1335096 1272424 1213341 1157924 1105599 1055963 1009245 965991 926411
56915I26411l6466l4579l3772l3067l1650k9646k7602k5620k3610k1809k0174
$$ 926411 889945 855366 821594 788527 756877 727231 699629 674009 650399 628590 608416
56904F08416j7631j3215q000m607m303n438n462l865k397k681m388n883o291o325
$$ 608416 590785 577570 569570 564963 560660 555222 549760 545895 543498 540817 536429 530546 524255 517930
56890E17930o956p720p178n096l257l385m983o104n640l889j413J326L441M207
$$ 517930 510974 503254 496076 490980 487723 484338 479355 473251 467611 463722 462309 463635 467076 471283
56876D71283M305N152O823P861P476O428N315L511O58k204m069n292o407o810
$$ 471283 475588 480740 487563 495424 502900 509328 514643 518154 518812 516608 512539 507247 500840 494030
56862D94030o108n557o487q114q863r174j0668j2771j2729r635o181n203o244
$$ 494030 487922 482365 475878 467764 458901 449727 439059 426288 413559 403924 397743 392540 386296
56849C86296o899o174m967m116l703l772m251m332l204j386k87m40j113j676k349
$$ 386296 379397 373223 368256 364140 360437 356665 352414 348082 344878 343492 343205 342765 341652 339976 337627
56834C37627l311l871l008l51L364O441P000M459M48k434k944j938q03qN31O23
$$ 337627 334316 330445 327437 327086 330450 336891 343891 348350 348798 346364 343420 341482 340679 340671 341202 341825
56818C41825N1o85o36N79K343L653M040L992M478N962P913R502J0626J1859J3477
$$ 341825 341876 341191 340555 341134 343477 347130 351170 355162 359640 365602 373515 383017 393643 405502 418979
56803D18979J5078J6237J6992J7484J7504J6669J4723J1634P868M505K498J607
$$ 418979 434057 450294 467286 484770 502274 518943 533666 545300 553168 557673 560171 561778
56791E61778O82p38j790j633p14j3N13J873M531P643J0015J1498J3151J5984J9610
$$ 561778 562460 561722 559932 558299 557585 557572 558085 559958 564489 572132 582147 593645 606796 622780 642390
56776F42390K2475K3555K3390K2900K1643J8288J2724O520J045l745q205j1917
$$ 642390 664865 688420 711810 734710 756353 774641 787365 793885 794930 791185 782980 771063
56764G71063j4452j6144j7138j6616j4150j1174r670r636r093o577k639J135L742
$$ 771063 756611 740467 723329 706713 692563 681389 671719 662083 652990 646413 643774 644909 648651
56751F48651N225O250P385Q470Q690P539N330K525q52m630q051j0575j2524j4182
$$ 648651 653876 660126 667511 675981 684671 692210 697540 700065 699213 694583 686532 675957 663433 649251
56737F49251j5086j5073j5132j5967j6541j5501j3429j1926j0937q949n727k910
$$ 649251 634165 619092 603960 587993 571452 555951 542522 530596 519659 510710 504983 502073
56725E02073j543q64l1P09J147J722K114Q33k627o439q422q566q533r500j1452
$$ 502073 500530 499666 499635 500344 501491 503213 505327 506160 503533 497094 488672 480106 471573 462073 450621
56710D50621j3843j5877j6558j5492j3439j1574j0399r731r210q562p818p534
$$ 450621 436778 420901 404343 388851 375412 363838 353439 343708 334498 325936 318118 310584
56698C10584q099q767q407p313p006p753p745n611k548q02j031k262l519m246
$$ 310584 302485 293718 285311 277998 270992 263239 255494 249883 247335 246533 245502 243240 239721 235475
56684B35475l957k855k306l292m792m861l209j515j298k393l515l460j918J29
$$ 235475 231518 228663 226357 223065 218273 213412 210203 208688 207390 204997 201482 198022 196104 196233
56670A96233J010J03j255j264J54J537J883J554J372J669K257K678K445J630Q67
$$ 196233 197243 197346 196091 194827 194981 196518 198401 199955 201327 202996 205253 207931 210376 212006 212873
56655B12873L68m77j804k325q99J296J693m02k768k883p14J656K426J594M62R9
$$ 212873 213241 212764 210960 208635 207736 209032 210725 210323 207555 204672 203958 205614 208040 209634 210096 210195
56639B10195L50K96l87j043j115q76o88k81L48J81j478l319l240j138P96Q71k64
$$ 210195 210545 210841 210454 209411 208296 207420 206732 206451 206799 206980 205502 202183 198943 197805 198601 199472 199208
56622A99208q64k07J104K087K110J123l33j560k124j735j40K177L681L273J899
$$ 199208 198344 198137 199241 201328 203438 204561 204228 202668 200544 198809 198669 200846 204527 207800 209699
56607B09699J508K404K997K332J432J541K417L176L630L708K584j50l072m096
$$ 209699 211207 213611 216608 218940 220372 221913 224330 227506 231136 234844 237428 237278 234206 230110
56593B30110k942j241k47K61O64M78n46j389j021j78n75k240k965j110K034L742
$$ 230110 227168 225927 225680 225941 226605 227083 226537 225148 224127 223949 223374 221134 218169 217059 219093 222835
56577B22835L109J568M10n82j714k103r95P32J599J593J957L196M358M198K255
$$ 222835 225944 227512 227922 227340 225626 223523 222528 223260 224859 226452 228409 231605 235963 240161 242416
56562B42416j034m324n789m664k437j341j716j949j103k48o48j851k482k098j411
$$ 242416 241382 237058 231269 226605 224168 222827 221111 219162 218059 217811 217163 215312 212830 210732 209321
56547B09321j075j054r62n98k28m00j097j174N32L262M490K721n59k463j840k3
$$ 209321 208246 207192 206230 205632 205404 205004 203907 202733 203265 206527 211017 213738 213179 210716 208876 208853
56531B08853J111R25m4r87j298p61J48L77p24k439l082j773M67J884K116K369
$$ 208853 209964 210889 210845 209858 208560 207799 207947 208324 207600 205161 202079 200306 200773 202657 204773 207142
56515B07142L322L968L251J885J318J434R25k51l65J494L760M204K627Q40M70
$$ 207142 210464 214432 217683 219568 220886 222320 223245 222994 222629 224123 227883 232087 234714 235554 236024
56500B36024J503K710L012K490K138K454K571J559L23P51K765L774K023q39j879
$$ 236024 237527 240237 243249 245739 247877 250331 252902 254461 254784 255535 258300 262074 264097 263258 261379
56485B61379o78N89L72o14j044q26p49j166j640j526o25M40N95n09j807j943q95
$$ 261379 260701 261290 261662 261048 260004 259178 258429 257263 255623 254097 253472 253912 254507 253998 252191 250248 249353
56468B49353J12L41K48L54L75n5n51o09n49j053j990k490k184j691j695k094k394
$$ 249353 249465 249806 250054 250408 250783 250728 250177 249568 249019 247966 245976 243486 241302 239611 237916 235822 233428
56451B33428k521k797l223l225k300o92O70R99L90k86l33M4K11J69N84J574K142
$$ 233428 230907 228110 224887 221662 219362 218670 219340 220339 220729 220443 220110 220154 220365 220534 221118 222692 224834
56434B24834J475L07O5Q80J442R50J31n7L43R44J824K859L049J713q3n03P51K153
$$ 224834 226309 226616 226681 227561 229003 229953 230084 230027 230370 231314 233138 235997 239046 240759 240676 240173 240924 243077
56416B43077K296J332M00L69J179J834J184o24j787p64J699L470L738L565L776
$$ 243077 245373 246705 247105 247474 248653 250487 251671 251047 249260 248496 250195 253665 257403 260968 264744
56401B64744L737K786J609J297J831K317K160J398K65r12j696j913j806j659j487
$$ 264744 268481 271267 272876 274173 276004 278321 280481 281879 282144 281232 279536 277623 275817 274158 272671
56386B72671j298j207j112o79J95J214K017K351K103J543J251J203N00j075j921
$$ 272671 271373 270166 269054 268375 268570 269784 271801 274152 276255 277798 279049 280252 280752 279677 277756
56371B77756n55J721K098K71j046k67O79n00k854l758k716j500j200j158p42l55
$$ 277756 277201 278922 281020 281291 280245 279978 280657 280157 277303 273545 270829 269329 268129 266971 266229 265874
56355B65874n22j144j806k025j433m19j33r71j684j070J22L90r9Q4J088J504P19
$$ 265874 265352 264208 262402 260377 258944 258525 258392 257421 255737 254667 254789 255179 255080 255164 256252 257756 258475
56338B58475j21P7R91J810K237K176J590J159J843L319L990L121J806J194R48
$$ 258475 258354 258431 259422 261232 263469 265645 267235 268394 270237 273556 277546 280667 282473 283667 284615
56323B84615M08J49J231L456N442O069N203L429J912J897L548N403N809M571K788
$$ 284615 285023 285172 286403 289859 295301 301370 306573 310002 311914 313811 317359 322762 328571 333142 335930
56308C35930J435Q16R15J500J979J885J370P56P7m02K10K227M263M497L014J609
$$ 335930 337365 338181 339096 340596 342575 344460 345830 346586 346663 346261 346471 348698 352961 357458 360472 362081
56292C62081J240J117O19O25J958L641L984K799J304M07K39J058L053N165N563
$$ 362081 363321 364438 365057 365682 367640 371281 375265 378064 379368 379775 380014 381072 384125 389290 394853
56277C94853L977K342K302K981K409N40n39M90K386L069K336J881K812M187M424
$$ 394853 398830 401172 403474 406455 408864 409404 408865 409355 411741 414810 417146 419027 421839 426026 430450
56262D30450L573L232M237N340M823K797J082J019K346M088N573O387O412O297
$$ 430450 434023 437255 441492 446832 451655 454452 455534 456553 458899 462987 468560 474947 481359 487656
56248D87656O956Q077Q245P132O412P492R411J0332J0158J0088J0252R726Q656
$$ 487656 494612 502689 510934 518066 524478 531970 541381 551713 561871 571959 582211 591937 600593
56235F00593Q433R537J0919J1804J2549J3308J3593J3701J4919J7361J9213J9178
$$ 600593 609026 618563 629482 641286 653835 667143 680736 694437 709356 726717 745930 765108
56223G65108J8417J8824K0537K2373K3739K4820K5735K6829K8974L2250L4948
$$ 765108 783525 802349 822886 845259 868998 893818 919553 946382 975356 1007606 1042554
56212A042554L5342L4054L3425L4857L8020M2168M6820N1291N5033N8561O2928
$$ 1042554 1077896 1111950 1145375 1180232 1218252 1260420 1307240 1358531 1413564 1472125 1535053
56201A535053O8306P4023P9976Q6802R4643J02926J11415J20543J30422J40510
$$ 1535053 1603359 1677382 1757358 1844160 1938803 2041729 2153144 2273687 2404109 2544619
56191B544619J50371J59934J68831J76324J81952J85539J86569J84481J79468
$$ 2544619 2694990 2854924 3023755 3200079 3382031 3567570 3754139 3938620 4118088
56182D118088J71941J61247J46006J25926J02116P5595M6851J7282j0572l5223
$$ 4118088 4290029 4451276 4597282 4723208 4825324 4900919 4947770 4965052 4954480 4919257
56172D919257n7575p9133r9597j17317j31311j41820j49221j53545j55056j54471
$$ 4919257 4861682 4782549 4682952 4565635 4434324 4292504 4143283 3989738 3834682 3680211
56162C680211j52549j49805j46499j42563j37808j32556j27586j22921j17230
$$ 3680211 3527662 3377857 3231358 3088795 2950987 2818431 2690845 2567924 2450694
56153B450694j09374j00421r3126q9104q7115q4549q0055p4308o8545o3125n7613
$$ 2450694 2341320 2240899 2147773 2058669 1971554 1887005 1806950 1732642 1664097 1600972 1543359
56142A543359n1733m5705l9835l4368k9873k7174k6403k6352k5373k2945k0025
$$ 1543359 1491626 1445921 1406086 1371718 1341845 1314671 1288268 1261916 1236543 1213598 1193573
56131A193573j7771j6280j4756j2615j0081p792o155n238n081n555n834m575j384
$$ 1193573 1175802 1159522 1144766 1132151 1122070 1114278 1108123 1102885 1097804 1092249 1086415 1081840 1080456
56118A080456K186M002L731L002L061L459L593M174O075Q566J0066J0249J0152
$$ 1080456 1082642 1086644 1090375 1093377 1096438 1099897 1103490 1107664 1113739 1122305 1132371 1142620 1152772
56105A152772J0625J1747J3528J5872J7994J9146J9855K1265K3350K5126K6623
$$ 1152772 1163397 1175144 1188672 1204544 1222538 1241684 1261539 1282804 1306154 1331280 1357903
56094A357903K8944L2201L5183L7705M1505M7668N4706O0580O5532P1354P8661
$$ 1357903 1386847 1419048 1454231 1491936 1533441 1581109 1635815 1696395 1761927 1833281 1911942
56083A911942Q6314R2861R7034R7318R2890Q5238P7333P0848O5176N9456N4224
$$ 1911942 1998256 2091117 2188151 2285469 2378359 2463597 2540930 2611778 2676954 2736410 2790634
56072B790634N0490M8029M5476M1511L5462K7301J7908Q985J966l135p574j2791
$$ 2790634 2841124 2889153 2934629 2976140 3011602 3038903 3056811 3065796 3067762 3064627 3057053 3044262
56060C044262j9814k9218m0767n2953o3552p0907p4398p3834o9365o2389n5536
$$ 3044262 3024448 2995230 2954463 2901510 2837958 2767051 2692653 2618819 2549454 2487065 2431529
56049B431529n0623m6892m2202l5756k8708k2209j6231j0611o023l053j169N96
$$ 2431529 2380906 2334014 2291812 2256056 2227348 2205139 2188908 2178297 2172274 2169221 2168052 2168648
56037B168648K594M822P446J0174J2017J2711J3740J6487J9921K1668K1229K0622
$$ 2168648 2171242 2176064 2183510 2193684 2205701 2218412 2232152 2248639 2268560 2290228 2311457 2332079
56025B332079K1556K3497K5082K6146K7514K9617L2083L4202L5315L5335L5246
$$ 2332079 2353635 2377132 2402214 2428360 2455874 2485491 2517574 2551776 2587091 2622426 2657672
56014B657672L6403L8902M1243M2137M2056M2416M3662M4975M5815M6954M9531
$$ 2657672 2694075 2732977 2774220 2816357 2858413 2900829 2944491 2989466 3035281 3082235 3131766
56003C131766N3203N5853N5791N4082N3638N5754N8696O0478O1712O4051O7002
$$ 3131766 3184969 3240822 3296613 3350695 3404333 3460087 3518783 3579261 3640973 3705024 3772026
55992C772026O8536O8571O9330P1859P4500P5726P6419P8088Q0563Q2942Q5455
$$ 3772026 3840562 3909133 3978463 4050322 4124822 4200548 4276967 4355055 4435618 4518560 4604015
55981D604015Q8814R2796R6827J01007J05235J08476J10433J12877J17535J23463
$$ 4604015 4692829 4785625 4882452 4983459 5088694 5197170 5307603 5420480 5538015 5661478
55971E661478J28376J31997J35979J41019J46200J51359J57852J66270J75255
$$ 5661478 5789854 5921851 6057830 6198849 6345049 6496408 6654260 6820530 6995785
55962F995785J83427J91096J99200K07844K16831K26655K37808K49749K61528
$$ 6995785 7179212 7370308 7569508 7777352 7994183 8220838 8458646 8708395 8969923
55953H969923K73093K85199K98372L12580L27701L43679L60426L77873L96069
$$ 8969923 9243016 9528215 9826587 10139167 10466868 10810547 11170973 11548846 11944915
55944A1944915M14971M34559M55398M78726N05393N34910N65858N97358O29912
$$ 11944915 12359886 12794445 13249843 13728569 14233962 14768872 15334730 15932088 16562000
55935A6562000O64859P03132P44527P88114Q33372Q80831R31503R85933J044108
$$ 16562000 17226859 17929991 18674518 19462632 20296004 21176835 22108338 23094271 24138379
55926B4138379J106139J172524J243783J320483J403653J494556J593771J701171
$$ 24138379 25244518 26417042 27660825 28981308 30384961 31879517 33473288 35174459
55918C5174459J817419J945006K086998K244816K418021K606487K812148L038257
$$ 35174459 36991878 38936884 41023882 43268698 45686719 48293206 51105354 54143611
55910E4143611L287614L562459L866022M203346M580199N001789N472900N998468
$$ 54143611 57431225 60993684 64859706 69063052 73643251 78645040 84117940 90116408
55902I0116408O582720P227360P931151Q691471R505895J0372075J1286398J2242344
$$ 90116408 96699128 103926488 111857639 120549110 130055005 140427080 151713478 163955822
55894A63955822J3228251J4223766J5195086J6089272J6827555J7298363J7353635
$$ 163955822 177184073 191407839 206602925 222692197 239519752 256818115 274171750
55887B74171750J6815617J5503059J3281344J0126729O175981J727437k819555
$$ 274171750 290987367 306490426 319771770 329898499 336074480 337801917 334982362
55880C34982362p063084j0689202j3518761j5505219j6701909j7221090j7198716
$$ 334982362 327919278 317230076 303711315 288206096 271504187 254283097 237084381
55873B37084381j6769909j6055693j5158286j4160579j3126530j2102005j1117186
$$ 237084381 220314472 204258779 189100493 174939914 161813384 149711379 138594193
55866A38594193j0190156r330063q539377p816177p156641o556370o010324n513023
$$ 138594193 128404037 119073974 110534597 102718420 95561779 89005409 82995085 77482062
55858G7482062n059810m647478m273031l932603l622468l340393l084701k852376
$$ 77482062 72422252 67774774 63501743 59569140 55946672 52606279 49521578 46669202
55850D6669202k639598k444075k265601k104075j958103j825604j704449j592380
$$ 46669202 44029604 41585529 39319928 37215853 35257750 33432146 31727697 30135317
55842C0135317j487718j390617j302314j222643j149621j081841j019587r62885
$$ 30135317 28647599 27256982 25954668 24732025 23582404 22500563 21480976 20518091
55834B0518091r10125q59823q12280p68141p26728o87229o50368o17166n86971
$$ 20518091 19607966 18748143 17935863 17167722 16440994 15753765 15103397 14486231 13899260
55825A3899260n58332n30973n05252m80557m56078m32578m11403l92288l74059
$$ 13899260 13340928 12809955 12304703 11824146 11368068 10935490 10524087 10131799 9757740
55816I757740l57107l42941l31442l20779l10113l00136k90600k79745k67068
$$ 9757740 9400633 9057692 8726250 8405471 8095358 7795222 7504622 7224877 6957809
55807F957809k54480k43618k33760k23562k13189k03333j93562j83256j73170
$$ 6957809 6703329 6459711 6225951 6002389 5789200 5585867 5392305 5209049 5035879
55798E035879j64527j57214j50152j42865j35558j28269j21119j14867j10056
$$ 5035879 4871352 4714138 4563986 4421121 4285563 4157294 4036175 3921308 3811252
55789C811252j05983j01526r6647r2111q8105q4228q0463p7128p4092p1078o8529
$$ 3811252 3705269 3603743 3507096 3414985 3326880 3242652 3162189 3085061 3010969 2939891 2871362
55778B871362o6958o5585o2886n8760n5042n3340n3215n2903n1154m7946m4185
$$ 2871362 2804404 2738819 2675933 2617173 2562131 2508791 2455576 2402673 2351519 2303573 2259388
55767B259388m1285m0388m1246m2126m1422l9197l6681l4591l2710l0870k9424
$$ 2259388 2218103 2177715 2136469 2094343 2052921 2013724 1977043 1942452 1909742 1878872 1849448
55756A849448k8476k7424k5845k4300k3617k3674k3555k2780k1640k0341j8612
$$ 1849448 1820972 1793548 1767703 1743403 1719786 1696112 1672557 1649777 1628137 1607796 1589184
55745A589184j6510j4785j3993j3754j3495j3278j3247j2835j1501j0045j0011
$$ 1589184 1572674 1557889 1543896 1530142 1516647 1503369 1490122 1477287 1465786 1455741 1445730
55734A445730j1717j3789j4886j5044j4969j4832j4445j4000j3964j4501j5529
$$ 1445730 1434013 1420224 1405338 1390294 1375325 1360493 1346048 1332048 1318084 1303583 1288054
55723A288054j7109j9294k1715k3766k5078k5483k4698k2527j9352j6064j3403
$$ 1288054 1270945 1251651 1229936 1206170 1181092 1155609 1130911 1108384 1089032 1072968 1059565
55712A059565j1595j0625j0551j1312j2359j2815j2267j1351j1316j2620j4122
$$ 1059565 1047970 1037345 1026794 1015482 1003123 990308 978041 966690 955374 942754 928632
55701I28632j4074j2071r640q469q457q144o976o233p130q789r166p786o332o200
$$ 928632 914558 902487 892847 884378 875921 867777 860801 854568 847438 838649 829483 821697 815365 809165
55687H09165o844p259p874r385j0656r854p600o779q586j0765j0982j0133j0590
$$ 809165 802321 795062 787188 777803 767147 757293 749693 742914 734328 723563 712581 702448 691858
55674F91858j2381j3292j2241j0565r813r973j0207j0077r603r057q986r653j0266
$$ 691858 679477 666185 653944 643379 633566 623593 613386 603309 593706 584649 575663 566010 555744
55661E55744r675q004o703o879q229r641r945q251m769j437l94j573k945l464
$$ 555744 546069 538065 531362 524483 516254 506613 496668 488417 483648 482211 481817 480244 477299 473835
55647D73835m241o132p755p316n375m230m926o226o494n520m262l597l614l801
$$ 473835 469594 463462 455707 448391 443016 438786 433860 427634 421140 415620 411358 407761 404147 400346
55633D00346l736l658m104m930n172m283l033k613l120l471k725r82R10K180K515
$$ 400346 396610 392952 388848 383918 378746 374463 371430 368817 365697 362226 359501 358519 359429 361609 364124
55618C64124J924M47j822m350o059o133m899l448k396j511n83J47O32J289K133
$$ 364124 366048 366495 364673 360323 354264 348131 343232 339784 337388 335877 335294 335441 336073 337362 339495
55603C39495K279J051p63j476k96J894L499L673K775J672Q16J59k90l34k72r59
$$ 339495 341774 342825 342062 340586 340290 342184 345683 349356 352131 353803 354619 354778 354488 354154 353882 352923
55587C52923k518l609l050j736j586k693l172k163j265k017l466l589k224j040
$$ 352923 350405 346796 343746 342010 340424 337731 334559 332396 331131 329114 325648 322059 319835 318795
55573C18795j123j940k541k634k376k028j878j835j228L99K338L312K956J971
$$ 318795 317672 315732 313191 310557 308181 306153 304275 302440 301212 301611 303949 307261 310217 312188
55559C12188R80m8j057j432p09N78J214M29j398l157m101m436m702m782m096k747
$$ 312188 313168 313120 312063 310631 309922 310500 311714 312143 310745 307588 303487 299051 294349 289567 285471 282724
55543B82724j813k135l284m122l975k965j693j033j740l734n978p475q014p817
$$ 282724 280911 278776 275492 271370 267395 264430 262737 261704 259964 256230 250252 242777 234763 226946
55529B26946p052o094n648n909o180n836n217m961m985m797m276l376j707O74
$$ 226946 219894 213800 208152 202243 196063 190227 185010 180049 175064 170267 165991 162615 160908 161582
55515A61582K510K518J070k74q15j317k539m221n641o357o192n181l800k733k293
$$ 161582 164092 166610 167680 167406 166591 165274 162735 158514 152873 146516 140324 135143 131343 128610 126317
55500A26317k368k734k926k185m21J022O43j123k152j265L26O52p60k713l723
$$ 126317 123949 121215 118289 116104 115683 116705 117348 116225 114073 112808 113134 113786 113026 110313 106590
55485A06590l044r57J298K214J272o57k321l156l107k109m04J017J176M39L53
$$ 106590 103546 102589 103887 106101 107373 106716 104395 101239 98132 96023 95619 96636 97812 98251 98604
55470I8604J815L820M525L419J872J367J650J196p20l025m097l424j764k24M08
$$ 98604 100419 104239 108764 112183 114055 115422 117072 118268 117548 114523 110426 107002 105238 105014 105422
55455A05422j95j704l143l594k975j910j088r52j642k709l101k100k05J320J809
$$ 105422 105227 103523 100380 96786 93811 91901 90813 89861 88219 85510 82409 80309 80104 81424 83233
55440H3233J745J997K876L876M016K610J40j788j860l92J059J439J059R38J680
$$ 83233 84978 86975 89851 93727 97743 100353 100493 98705 96845 96453 97512 98951 100010 100948 102628
55425A02628L033M188M486M081L734L801L739K935J602L72n72j321j648j438j453
$$ 102628 105661 109849 114335 118416 122150 125951 129690 132625 134227 134599 134027 132706 131058 129620 128167
55410A28167k664m811o492o753n906m710l599k850k714l017l269l395l711m032
$$ 128167 125503 120692 114200 107447 101541 96831 93232 90382 87668 84651 81382 77987 74276 70244
55396G0244l634k414j368j394k196k795k675k074j639k020l280m364l876j866
$$ 70244 66610 64196 62828 61434 59238 56443 53768 51694 50055 48035 44755 40391 36515 34649
55382C4649j50j96j256j429k25R95J022K37k61j73p3l37o65o32k98j10l46r10
$$ 34649 34499 34303 33047 31618 31393 32388 33410 33647 33386 33213 33140 32803 32138 31506 31208 31098 30752 29842
55364B9842j492j744j406n52K41L58r4l96k81l92j231k165k127j033L12J438K372
$$ 29842 28350 26606 25200 24648 24889 25247 25153 24757 24476 24084 22853 20688 18561 17528 17840 19278 21650
55347B1650K716J802J17o93PO75l30k240k852j621k96k32o48k60N65O16Lk0O77
$$ 21650 24366 26168 26285 25592 25599 26274 25944 23704 20852 19231 18935 18703 18055 17795 18360 18976 18979 18959 19636
55328A9636O51q44k450k545j416m44J47J110K158J897J58j269j055j02J54l1L68
$$ 19636 20287 19443 16993 14448 13032 12588 12735 13845 16003 17900 18058 16789 15734 15632 15786 15755 16123
55311A6123Q88J46j555k015n9K690L749K596P27m43q31q77m97N56J631J288r57
$$ 16123 17011 17157 15602 13587 13528 16218 19967 22563 23290 22847 22016 21139 20642 21198 22829 24117 23160
55294B3160l403l627j274J440K293J285j44j041j271q70k32l19j478k544k250
$$ 23160 19757 16130 14856 16296 18589 19874 19730 18689 17418 16548 16316 15997 14519 11975 9725
55279I725j059l30k15J41P44Q15N01O58R99M30n33oJ913K426m3l228m057k604
$$ 9725 8666 8336 8121 8262 9006 9821 10322 10980 11979 12409 11876 11870 13783 16209 16166 12938 8881 6277
55261F277r78K61K129M343N055L577J415J56k04m39r32j777k877l480k637n57
$$ 6277 5299 5560 7689 12032 17087 20664 22079 22235 22031 21592 20660 18883 16006 12526 9889 9332
55245I332J318K026J983J858J448L70r49j736j865j669j080K03J742K304J167
$$ 9332 10650 12676 14659 16517 17965 18335 17386 15650 13785 12116 11036 11239 12981 15285 16452
55230A6452q65k113j671j98R18R29R5r65j794k020j419l33M64O26O12Q57J045
$$ 16452 15587 13474 11803 11605 12523 13452 13547 12582 10788 8768 7349 7016 7480 8106 8718 9575 10620
55213A0620O52j97r63j405j444q35K70P44k58j658j292J206L617L832K217N03
$$ 10620 11272 11075 10112 8707 7263 6428 6698 7442 7184 5526 4234 5440 9057 12889 15106 15609
55197A5609p02j895k873k640j264l31q39j768j620o48m19g84k145j217R57g33
$$ 15609 14907 13012 10139 7499 6235 5904 5065 3297 1677 1029 610 -784 -2929 -4146 -3189 -733
55180A208k1c40j182M78E34J076M1K48J800L122L270L013L142L018J759J9q91
$$ 1208 1187 -340 -1522 -1044 534 1610 1651 1899 3699 6821 10091 13104 16246 19264 21023 21042 20151
55163B0151j068j731k949l261k028p25j041k585A291a329n85c75B730L906L904
$$ 20151 19083 17352 14403 11142 9114 8389 7348 4763 1291 -1329 -1914 -375 2730 6636 10540
55148A0540L170J841J65j238j509m75P87Q98k06j188r62K7N66L06L5K91N38R8
$$ 10540 13710 15551 15716 14478 12969 12494 13281 14179 13973 12785 11823 11850 12416 12722 12757 13048 13586 13684
55130A3684o31p81n46r48j898j701M73K752K578J16j908j855r88j131j923j675
$$ 13684 13053 12272 11726 10778 8880 7179 7652 10404 12982 13098 11190 9335 8347 7216 5293 3618
55114C618l9J459J427O4j457k262F83d12B01K394L254K587R16m55p97o10n64l89
$$ 3618 3579 5038 6465 6529 5072 2810 683 -412 201 2595 5849 8436 9352 8897 8100 7490 6926 6537
55096F537M04J189P90o37j530j023R1Q83J591K508K778J490o54k057k197j844
$$ 6537 6941 8130 8920 8283 6753 5730 5821 6704 8295 10803 13581 15071 14417 12360 10163 8319
55080H319j559j176o54l72l55j64J64r7j224E23a869j182N41e13B295K887K495
$$ 8319 6760 5584 4930 4558 4203 4039 4203 4106 2882 523 -1869 -3051 -2510 -513 2295 5182 7677
55063G677K166K186K102J169n29j821j649m57K01n06j662j810p07P30J854K837
$$ 7677 9843 12029 14131 15300 14771 12950 11301 10844 11045 10539 8877 7067 6360 7090 8944 11781
55047A1781L762M127L636K784K208J883J403O12m94j909l134l048j156J289K270
$$ 11781 15543 19670 23306 26090 28298 30181 31584 32196 31702 29793 26659 23611 22455 23744 26014
55032B6014J285p1n2J257K310K112J284J061J684K175J611K44q56j014n70l45
$$ 26014 27299 27228 27176 28433 30743 32855 34139 35200 36884 39059 40670 40914 40058 39044 38474 38129
55016C8129p40j361j446p83p8q6m12J08J539K327J302n05j149k44R91J767K281
$$ 38129 37389 36028 34582 33799 33721 33635 33223 33331 34870 37197 38499 37994 36845 36601 37592 39359 41640
54999D1640K445J625j9j325j680j580j329n38N32O01q09k409k841k374j956j763
$$ 41640 44085 45710 45691 44366 42686 41106 39777 39239 39771 40372 39563 37154 34313 31939 29983 28220
54983B8220j595j669j956j636l92P07P14L30O28J134O39p27j789k133k171j776
$$ 28220 26625 24956 23000 21364 20972 21679 22393 22723 23351 24485 25124 24397 22608 20475 18304 16528
54967A6528n97N09J84j144j341N01K550K495M04j410j018J139K777K167m2j667
$$ 16528 15931 16440 16624 15480 14139 14640 17190 19685 20089 18679 17661 18800 21577 23744 23702 22035
54951B2035j683j152j124q72O27K552L176K348J326O59k6k94Q41K748L292J885
$$ 22035 20352 19200 18076 17204 17831 20383 23559 25907 27233 27892 27866 27572 28413 31161 34453 36338
54935C6338N68J048K217J913Pj771k276j913j422r31k82M56R91J012M37l67p72
$$ 36338 36906 37954 40171 42084 42091 40320 38044 36131 34709 33778 33496 33952 34943 35955 36392 36025 35253
54918C5253m72L50J378K326K758K270J051j89q86r68o51l64o22j317j403j92J248
$$ 35253 34781 35131 36509 38835 41593 43863 44914 44725 43839 42871 42220 41856 41234 39917 38514 38322 39570
54901C9570J167l74j391q02j3p83k567l240j924N6J004O58J4qO16J214J169N69
$$ 39570 40737 40363 38972 38170 38157 37374 34807 31567 29643 29699 30703 31361 31375 31367 31983 33197 34366 34935
54883C4935J60N90J605K106J206n10j184L19K679L330J594l10l5K073L815M029
$$ 34935 35095 35685 37290 39396 40602 40092 38908 39227 41906 45236 46830 46520 46485 48558 52373 56402
54867E6402L476L308L916N072O152O321N513M967N792P323Q006P535O771N875
$$ 56402 59878 63186 67102 72174 78326 84647 90160 95127 100919 108242 116248 123783 130554 136429
54853A36429M165J767l23j899l633n284n697n015m957o112o879o131n148n397
$$ 136429 140594 142361 142038 140139 136506 131222 125525 120510 115553 109441 102562 96431 91283 85886
54839H5886n988n090k892j308j203j542j209l37K45J4r44k076k793k963k690j681
$$ 85886 79898 74808 71916 70608 69405 67863 66654 66317 66562 66576 65632 63556 60763 57800 55110 53429
54823E3429M32L077N000N855O507P426Q030Q088Q401R209R278P671N246L269J638
$$ 53429 53861 56938 61938 67793 74300 81726 89756 97844 106245 115454 124732 132403 137649 140918 142556
54808A42556l15k315l841n334p211q525q144o659n578n224m872m348l823k673
$$ 142556 142241 139926 136085 130751 123540 115015 106871 100212 94634 89410 84538 80190 76367 73694
54794G3694m79J317P78j620l468l827m047m823m793l016r29l27p77n41P72J950
$$ 73694 73215 74532 75310 73690 70222 66395 62348 57525 52732 49716 48787 48460 47683 47142 47914 49864
54778D9864K193J963J795J285j64k061k830j473Q99J794Q1k548l506k254m16P30
$$ 49864 52057 54020 55815 57100 56936 54875 52045 50572 51471 53265 53346 50798 47292 45038 44622 45352
54762D5352J477K384L023K762J809P48k79j333k132k379k321k417k686k810k649
$$ 45352 46829 49213 52236 54998 56807 57555 57276 55943 53811 51432 49111 46694 44008 41198 38549
54747C8549k344k041j729j300o39K06R58J388J510J350O89m52j423j594j268j234
$$ 38549 36205 34164 32435 31135 30496 30702 31660 33048 34558 35908 36597 36145 34722 33128 31860 30626
54731C0626j510j258q5J383K385K824K957K962L101L637M239M032K735J247O88
$$ 30626 29116 27858 27773 29156 31541 34365 37322 40284 43385 47022 51261 55293 58028 59275 59963
54716E9963J178J947K334K391K641L438M325M138K349L51N32L571P349R243Q952
$$ 59963 61141 63088 65422 67813 70454 73892 78217 82355 84704 85055 85587 89158 96507 105750 114702
54701A14702Q216Q150P934O385L792J541L48l80j505l004m117m287l591k426j195
$$ 114702 122918 131068 139002 145387 149179 150720 151068 150688 149183 146179 142062 137775 134184 131758 130563
54686A30563l09l4k51o56j257k093k454j146J869M885O310O618P313Q389Q180
$$ 130563 130254 130220 129969 129313 128056 125963 123509 122363 124232 129117 135427 142045 149358 157747 165927
54671A65927N968L307K025J975J661M54r45j853k273k159j099P91K285K099L24
$$ 165927 171895 175202 177227 179202 180863 181317 180372 178519 176246 174087 172988 173779 176064 178163 178487
54656A78487j682k765k910k733k643k905l994o143q565r809r250p748o574o133
$$ 178487 176805 174040 171130 168397 165754 162849 158855 152712 144147 134338 125088 117340 110766 104633
54642A04633n994n726n161m207l024k172k127k681l191l311l075k477j439j15
$$ 104633 98639 92913 87752 83545 80521 78349 76222 73541 70350 67039 63964 61487 60048 59933
54628E9933J065J611J100m41k029k179m90J694K801K735K363J977J360Q80J239
$$ 59933 60998 62609 63709 63268 61239 59060 58570 60264 63065 65800 68163 70140 71500 72380 73619
54613G3619K231K950L159L180K676J036q70j105N87K096J806N27m73j582l200
$$ 73619 75850 78800 81959 85139 87815 88851 87981 86876 87463 89559 91365 91892 91419 89837 86637
54598H6637l603r47L051M113O66l882n149k591P57K281K067J631J730J891J410
$$ 86637 83034 82087 85138 89251 89917 86035 80886 78295 79052 81333 83400 85031 86761 88652 90062
54583I0062L55l86%J288K277K033J040Q75K600N626Q323R714J0238J0784J1325
$$ 90062 90417 90031 90031 91319 93596 95629 96669 97544 100144 105770 114093 123807 134045 144829 156154
54568A56154J1094R968Q967R134J0417J2049J3439J4007J2722Q886L489j299m352
$$ 156154 167248 177216 186183 195317 205734 217783 231222 245229 257951 266837 270326 269027 264675
54555B64675o606r261j1765j2525j1362j0002r904j0449j0028q281o378n332m929
$$ 264675 258069 248808 237043 224518 213156 203154 193250 182801 172773 164492 158114 152782 147853
54542A47853m594m444m962n930o373n629m140l080l237m198m659l733j988q68
$$ 147853 143259 138815 133853 127923 121550 115921 111781 108701 105464 101266 96607 92874 90886 90018
54528I0018r90j575j716j612j886k235j742m35M14j73j724l035l390k767j372
$$ 90018 89028 87453 85737 84125 82239 80004 78262 77827 78241 78068 76344 73309 69919 67152 65780
54513F5780L27J491J458N21k68j84M33O06k06j541k421k354j720j082m46M69J489
$$ 65780 66107 67598 69056 69577 69309 69125 69558 70164 69958 68417 65996 63642 61922 60840 60394 60863 62352
54496F2352K003J654O10q03k125k511j340N93J381J64j576j723j20J438J592P83
$$ 62352 64355 66009 66619 65816 63691 61180 59840 60433 61814 61978 60402 58679 58559 59997 61589 62372
54480F2372R3j85k56N3R64J899J893R31Q9J18O08R23J340K489M001M709M250L594
$$ 62372 62465 62280 62024 62077 63041 64940 66833 67764 67853 67971 68579 69502 70842 73331 77332 82041 86291 89885
54462H9885L558L509K348M46k81J567N272Q671J0133R681Q344O797M871K359q5
$$ 89885 93443 96952 99300 99746 99465 101032 106304 114975 125108 134789 143133 149930 154801 157160 157075
54447A57075j406j501j540k516l967m661m312l958m672o343p889q220o941m524
$$ 157075 155669 154168 152628 150112 146145 141484 137172 133214 128542 122199 114310 106090 99149 94625
54433I4625k062n90n05j565l271m906n419l997j078J531K091O36r60q73P64K041
$$ 94625 92563 91973 91468 89903 86632 81726 76307 72310 71232 72763 74854 75490 74530 73657 74421 76462
54417G6462J540K8o41n7K70q10k384k750j651l16K90L27K83K58P8l27o41p9J871
$$ 76462 78002 78030 77389 77332 77602 76792 74408 71658 70007 69691 69981 70308 70591 70849 70927 70600 69959 69880 71751
54398G1751M106M248J386k243l685k827j920j912j458K04J606J355K41k61j83
$$ 71751 75857 80105 81491 79248 75563 72736 70816 68904 67446 67650 69256 70611 70852 70591 70408
54383G0408k46j25P92J675J122n69j625j202r7R70K273L849M670L786J592o13
$$ 70408 70162 70037 70829 72504 73626 73057 71432 70230 70133 71103 73376 77225 81895 85681 87273 86660
54367H6660j803j654m36R37J296K50j202j611n69R11J591J309R04R69J069N72
$$ 86660 84857 83203 82767 83704 85000 85250 84048 82437 81868 82779 84370 85679 86583 87552 88621 89193
54351H9193k02l89K3J62K1R51L545N995O041M061K554K517K182nk705l440j941
$$ 89193 88991 88602 88625 88787 88808 89759 93304 99299 105340 109401 111955 114472 116654 116649 113944 110504 108563
54334A08563j76N87J036J868K193Q38j672l562l923l364k775k398k289k665l279
$$ 108563 108387 108974 110010 111878 114071 114909 113237 109675 105752 102388 99613 97215 94926 92261 88982
54319H8982l213k003m89J53q7k60J49P71J184J326J143O31K78O38J305J262N39
$$ 88982 85769 83766 83277 83430 83343 83083 83232 84003 85187 86513 87656 88287 88565 89203 90508 91770 92309
54302I2309M40J552K460J493q64k329j483Q07K558K617J378J52K3J003K155K554
$$ 92309 92749 94301 96761 98254 97390 95061 93578 94385 96943 99560 100938 101090 101113 102116 104271 106825
54286A06825K024R67j67j061j614k071k678l075k592j409o15o49n67L29R65j88
$$ 106825 108849 109816 109649 108588 106974 104903 102225 99150 96558 95149 94534 93885 93318 93647 94612 94424
54270I4424k767m701m661l179j413J1Q42R49O07J88n54j994l418l480k258j590
$$ 94424 91657 86956 82295 79116 77703 77714 78556 79505 80112 80300 79746 77752 74334 70854 68596 67006
54254F7006k665m375m851l655j568P60K802L610K753J390R75J197O17p52j209
$$ 67006 64341 59966 55115 51460 49892 50652 53454 57064 59817 61207 62182 63379 63996 63244 62035
54239F2035m0J294J356P05M56K32r15k271k048j33J432J149l2k87P09J835K281
$$ 62035 61995 63289 64645 65350 65806 66038 65123 62852 60804 60671 62103 63252 63220 62933 63642 65477 67758
54222F7758K170J717Q49k37r16r52r33j459k179k133r79N93J839K776L589L678
$$ 67758 69928 71645 72494 72257 71341 70389 69456 67997 65818 63685 62706 63299 65138 67914 71503 75181
54206G5181K256p5j442j050m24j256k781k856j262o5l45n50P59K179J250j846
$$ 75181 77437 77362 75920 74870 74446 73190 70409 67553 66291 66226 65881 65331 66090 68269 69519 67673
54190F7673m238l874j521P64J834J746J032L07K5J01J25k4j18r8j33k36l68p64
$$ 67673 63435 59561 58040 58804 60638 62384 63416 63723 63748 63849 63974 63950 63832 63734 63601 63365 62997 62233
54172F2233j592k372k413j809j347j454j756j571m22J540L103K599j33k909l426
$$ 62233 60641 58269 55856 54047 52700 51246 49490 47919 47497 49037 52140 54739 54606 51697 48271
54157D8271j895j88R85K294L507L254J458J3J22P13M51k34l38r4k12l26M21J883
$$ 48271 46376 46188 47173 49467 52974 56228 57686 57699 57821 58534 58985 58751 58413 58319 58107 57781 58202 60085
54139F0085L084L378K676J236k5M0J227J694L09j663k248j307k71l7l10n31l23
$$ 60085 63169 66547 69223 70459 70434 70474 71701 73395 73704 72041 69793 68486 68215 68178 67868 67337 67014
54122F7014M53J257J047k87j502j851k282l598m592l636j317J84j40j506k937
$$ 67014 67467 68724 69771 69484 67982 66131 63849 60251 55659 52023 50706 50890 50750 49244 46307
54107D6307l813l449j869n96q31j219N11L777N306L516N68p46l31R6k86r45j400
$$ 46307 42494 39045 37176 36580 35749 34530 35041 38818 44124 47640 48208 47462 47131 47227 46941 45996 44596
54090D4596j729j970j777p79J012K944L970L523K051L35j274k498k720j801o66
$$ 44596 42867 40897 39120 38341 39353 42297 46267 49790 51841 52176 50902 48404 45684 43883 43217
54075D3217p6M60J346J468q4j641o28K526M442L150K00j981k765k535j312N74
$$ 43217 43141 43601 44947 46415 46331 44690 44062 46588 51030 54180 54380 52399 49634 47099 45787 46361
54059D6361J948K108J668J364J216J358K110K670J487j131k602j472M85R15k2
$$ 46361 48309 50417 52085 53449 54665 56023 58133 60803 62290 61159 58557 57085 57570 58485 58463
54044E8463p83j066j399j375l89P14Q16O17J523K871K535K77j532j085O35J486
$$ 58463 57680 56614 55215 53840 53451 54165 54981 55598 57121 59992 62527 62804 61272 60187 60822 62308
54028F2308P54o28j613j961j990j803r79P85K708L309K210Q02M89R96J171P07
$$ 62308 63062 62434 60821 58860 56870 55067 54088 54873 57581 60890 63100 63902 64391 65387 66558 67265
54012F7265K2q26j762j886m75J341J526j90j887j894n09J014J980K213J616M95
$$ 67265 67287 66461 64699 62813 62338 63679 65205 65015 63128 61234 60725 61739 63719 65932 67548 68043
53996F8043k48RQ73J476J498J323J393J713J911J658J024L99L6j92m96q68j073
$$ 68043 67795 67804 68677 70153 71651 72974 74367 76080 77991 79649 80673 81072 81108 80916 80420 79552 78479
53979G8479p20N66K531L972L824K574J701J552J080Ml40P01J540N62j271j913
$$ 78479 77759 78325 80856 84828 88652 91226 92927 94479 95559 95563 95223 95924 97464 98026 96755 94842
53963I4842j387j465k558l176k549j792j951k550k705k331j633n95L82M95k07
$$ 94842 93455 91990 89432 86256 83707 81915 79964 77414 74709 72378 70745 70150 70532 71027 70820
53948G0820m92M30J815K476K153J332N27J95N83J123O93r50k710l438l017j875
$$ 70820 70328 70758 72573 75049 77202 78534 79061 79256 79839 80962 81655 80705 77995 74557 71540 69665
53932F9665l96P60P26m03j287r05K11Q86O60k16j301j797q58J023J965J048j66
$$ 69665 69269 70029 70755 70352 69065 68160 68371 69257 69917 69701 68400 66603 65745 66768 68733 69781 69615
53915F9615K07J527J604N9j165p59K63L97k66o65l62L94J500K851L719L256J592
$$ 69615 69822 71349 72953 73012 71847 71088 71351 71748 71482 70817 70455 70849 72349 75200 78919 82175 83767
53898H3767j01p59l55L32N48K72K65J242K889L924L405J713N1p51n46O79K767
$$ 83767 83666 82907 82552 82884 83432 83704 83969 85211 88100 92024 95429 97142 97193 96442 95896 96575 99342
53881I9342M692M807K558l63j313O84L973O050N917M562L537L524M053M079K809
$$ 99342 104034 108841 111399 111036 109723 110407 114380 120430 126347 130909 134446 137970 142023 146102 148911
53866A48911L52k147l264k486o95O60R69Q92J325K177K474J711N66o4l17r88k101
$$ 148911 149263 147116 143852 141366 140671 141331 142300 143192 144517 146694 149168 150879 151445 151381 151064 150076 147975
53849A47975k788k695k575k940l042k039o52m10j539k707k942k605k201j474m24
$$ 147975 145187 142492 139917 136977 133935 131896 131244 130834 129295 126588 123646 121041 118840 117366 116942
53834A16942k15j869m414n598m432k232r00r21j429j623j470j264j065p61l85
$$ 116942 116727 114858 110444 104846 100414 98182 97282 96361 94932 93309 91839 90575 89510 88749 88364
53819H8364j56k61p06j253j490j013K00J497J849P10j276k648k415j010J80K34
$$ 88364 88208 87947 87241 85988 84498 83485 83685 85182 87031 87741 86465 83817 81402 80392 80572 80806
53803H0806m35o92N0J345K442L063L396L550L401K864J974Q10m42j413j933k333
$$ 80806 80371 79679 79729 81074 83516 86579 89975 93525 96926 99790 101764 102574 102132 100719 98786 96453
53787I6453k912l161k277n42N47L8j258j897j576j034p04m20k79o57j375j714
$$ 96453 93541 90380 88103 87561 88108 88146 86888 84991 83415 82381 81677 81257 80978 80321 78946 77232
53771G7232j465j113p42K68K015L398L376K268J152M59o6m78n85n27n49m20J40
$$ 77232 75767 74654 73912 74180 76195 79593 82969 85237 86389 86848 86782 86304 85719 85192 84643 84223 84363
53754H4363N59J2j043j057M44J995K181J663K098L591M518L806K251J192Q17M33
$$ 84363 84922 84934 83891 82834 83278 85273 87454 89117 91215 94806 99324 103130 105381 106573 107390 107823
53738A07823k03n81k81M69J087J208R70Q58J090J205N80n87j361j366j360j962
$$ 107823 107620 107039 106758 107227 108314 109522 110492 111350 112440 113645 114225 113638 112277 110911 109551 107589
53722A07589k458j755j79P42K85n74o47j28j93j407k959l405k049K42J701J424
$$ 107589 105131 103376 103197 103939 104224 103650 103003 102875 102682 101275 98316 94911 92862 93104 94805 96229
53706I6229L00j97J82N27K75k96r92j824k120r31J262K568K233J763K480L306
$$ 96229 96529 96332 96514 97041 97316 97020 96028 94204 92084 91153 92415 94983 97216 98979 101459 104765
53690A04765K543P29j93P7J27l24J79K062L413K577N01p73p46k28O51K436M639
$$ 104765 107308 108037 107844 107921 108048 107724 107903 109965 113378 115955 116456 115683 114937 114709 115360 117796 122435
53673A22435N642M613K506P79j07m70m62jO58Q96M71K0N73K454M669N683M932
$$ 122435 128077 132690 135196 135975 135868 135398 134936 134935 135593 136489 136960 136980 137553 140007 144676 150359 155291
53656A55291L399K502K658L262L761M157M467M379L762K997K454K083J863K118
$$ 155291 158690 161192 163850 167112 170873 175030 179497 183876 187638 190635 193089 195172 197035 199153
53642A99153K849L251K785K353L249N010N608M115K001J076J280J454J326J440
$$ 199153 202002 205253 208038 210391 213640 218650 224258 228373 230374 231450 232730 234184 235510 236950
53628B36950J816J972J931J895J322k36j688j466p0K14j495l426l664k360o11
$$ 236950 238766 240738 242669 244564 245886 245650 243962 242496 242426 242640 241145 237719 234055 231695 231084
53613B31084J275L151L992K918N89j519k633k671j635m3Q87N93K3J48M39K6n59
$$ 231084 232359 235510 239502 242420 243009 241490 238857 236186 234551 234508 235395 235988 236011 236159 236598 236624 236065
53596B36065k46O43Q86L27j33k14l59m53O8R39J278J082J120J426J257O59O24
$$ 236065 235819 236462 237348 237675 237542 237328 236969 236516 236584 237523 238801 239883 241003 242429 243686 244345 244969
53579B44969J571K864L952M769M976M145K768J853J509J265J654L597O117O720
$$ 244969 246540 249404 253356 258125 263101 267246 270014 271867 273376 274641 276295 279892 286009 292729
53565B92729M809K843L063M666N450M845L903L301K853K489K487K969L904N228
$$ 292729 297538 300381 303444 308110 313560 318405 322308 325609 328462 330951 333438 336407 340311 345539
53551C45539O414O602N723M901N086N876O289N986N134L768K051O31N1J23L86
$$ 345539 351953 358555 364278 369179 374265 380141 386430 392416 397550 401318 403369 404000 404051 404174 404560
53536D04560P17J132J474J709J968K055J547N08o40j932l623n010m905l534k525
$$ 404560 405277 406409 407883 409592 411560 413615 415162 415670 415030 413098 409475 404465 399560 396026 393501
53521C93501k517k379j482r73j738k719k738k424k681k588q87J455K324J558Q03
$$ 393501 390984 388605 387123 386150 384412 381693 378955 376531 373850 371262 370375 371830 374154 375712 376515
53506C76515N86k73k112l330k584o65O92R51J049K078L961N321M807K901J803
$$ 376515 377101 376828 374716 371386 368802 368137 368829 369780 370829 372907 376868 382189 386996 389897 391700
53491C91700K858M737N245M290L822N077P268Q920R233Q158O397N489O718R504
$$ 391700 394558 399295 404540 408830 412652 417729 424997 433917 443150 451308 457705 463194 469912 479416
53477D79416J1812J2375J1799J1458J2162J3871J5810J6788J6393J5881J6866
$$ 479416 491228 503603 515402 526860 539022 552893 568703 585491 601884 617765 634631
53466F34631J9082K0669K0880K1128K2800K5179K6510K6359K5944K6394K7503
$$ 634631 653713 674382 695262 716390 739190 764369 790879 817238 843182 869576 897079
53455H97079K8367K8829K9999L3088L7633M1289M1898L9598L6527L4661L4372
$$ 897079 925446 954275 984274 1017362 1054995 1096284 1138182 1177780 1214307 1248968 1283340
53444A283340L4793L4915L4415L3869L3972L4366L3918L2508L1590L2116L2951
$$ 1283340 1318133 1353048 1387463 1421332 1455304 1489670 1523588 1556096 1587686 1619802 1652753
53433A652753L2604L1553L1144L1000K9718K7827K7632K9589L1083K9817K6628
$$ 1652753 1685357 1716910 1748054 1779054 1808772 1836599 1864231 1893820 1924903 1954720 1981348
53422A981348K3896K2533K1786K0773J8972J6079J2604R874Q413P024M371Q25
$$ 1981348 2005244 2027777 2049563 2070336 2089308 2105387 2117991 2127865 2136278 2143302 2147673 2148498
53410B148498k326m869p671j1095j4506j7245j9152k0093j9950j9257j9181k0393
$$ 2148498 2146172 2141303 2133632 2122537 2108031 2090786 2071634 2051541 2031591 2012334 1993153 1972760
53398A972760k2244k3430k3469k3254k3918k5285k5985k5213k3659k2280k1105
$$ 1972760 1950516 1927086 1903617 1880363 1856445 1831160 1805175 1779962 1756303 1734023 1712918
53387A712918j9996j9612k0168k0007j7290j2889r515p997o501l870j402k93L59
$$ 1712918 1692922 1673310 1653142 1633135 1615845 1602956 1593441 1585444 1578943 1575073 1573671 1573378 1573737
53374A573737J594K542K285K128L937P331J0597J3348J6122J8172J8284J7459
$$ 1573737 1575331 1577873 1580158 1582286 1586223 1593554 1604151 1617499 1633621 1651793 1670077 1687536
53362A687536J8296K1490K5179K8041L0694L3409L4847L4395L3851L5130L7699
$$ 1687536 1705832 1727322 1752501 1780542 1811236 1844645 1879492 1913887 1947738 1982868 2020567
53351B020567L9918M1800M4648M8594N2363N5350N8254O1527O4569O6921O9046
$$ 2020567 2060485 2102285 2146933 2195527 2247890 2303240 2361494 2423021 2487590 2554511 2623557
53340B623557P1281P3074P4042P5029P6989P9219P9876P8367P6205P5115P5021
$$ 2623557 2694838 2767912 2841954 2916983 2993972 3073191 3153067 3231434 3307639 3382754 3457775
53329C457775P4618P3336P1799P0419O8410O4621N8889N2172M5633L9864L4874
$$ 3457775 3532393 3605729 3677528 3747947 3816357 3880978 3939867 3992039 4037672 4077536 4112410
53318D112410L0374K5925K0838J4386O628j045o926j1107j5910k3347l2582m0913
$$ 4112410 4142784 4168709 4189547 4203933 4210561 4209516 4202590 4191483 4175573 4152226 4119644 4078731
53306D078731m7094n2403n8306o4397o9260p2248p3530p3316p2075p0967p0960
$$ 4078731 4031637 3979234 3920928 3856531 3787271 3715023 3641493 3568177 3496102 3425135 3354175
53295C354175p1586p1388o9473o6222o2787o0391n9762o0557o1463o1355o0123
$$ 3354175 3282589 3211201 3141728 3075506 3012719 2952328 2892566 2832009 2770546 2709191 2649068
53284B649068n8093n5304n1903m8673m6240m4170m1634l8727l6212l4241l2286
$$ 2649068 2590975 2535671 2483768 2435095 2388855 2344685 2303051 2264324 2228112 2193871 2161585
53273B161585l0147k8106k6125k3924k1888k0921k1255k2190k3181k4204k4895
$$ 2161585 2131438 2103332 2077207 2053283 2031395 2010474 1989219 1967029 1943848 1919644 1894749
53262A894749k4319k2189j9548j7614j6478j5402j3902j2004r852p722o057m951
$$ 1894749 1870430 1848241 1828693 1811079 1794601 1779199 1765297 1753293 1743441 1735719 1729662 1724711
53250A724711l724j558J508M543O764Q272R778J1858J4573J7632K0695K3477K5763
$$ 1724711 1720987 1719429 1720937 1725480 1732244 1740516 1750294 1762152 1776725 1794357 1815052 1838529 1864292
53237A864292K7502K8890L0140L1149L1676L1860L2113L2297L1595K9667K7405
$$ 1864292 1891794 1920684 1950824 1981973 2013649 2045509 2077622 2109919 2141514 2171181 2198586
53226B198586K5863K4747K2737J9215J4929J0921P490M328J021k732o930j1074
$$ 2198586 2224449 2249196 2271933 2291148 2306077 2316998 2324488 2328816 2329837 2327105 2320175 2309101
53214B309101j4552j7225j9166k0065j9794j9620k1634k6350l1646l4911l5781
$$ 2309101 2294549 2277324 2258158 2238093 2218299 2198679 2177045 2150695 2119049 2084138 2048357
53203B048357l6115l7564l9999m2093m2814m2107m0777l9819l9706m0073m0134
$$ 2048357 2012242 1974678 1934679 1892586 1849772 1807665 1766888 1727069 1687363 1647290 1607156
53192A607156l9318l7526l5034l2479l0707l0310l1151l2439l3232l2887l1233
$$ 1607156 1567838 1530312 1495278 1462799 1432092 1401782 1370631 1338192 1304960 1272073 1240840
53181A240840k8605k5671k3182k1785k1829k2954k4012k3922k2723k1298j9905
$$ 1240840 1212235 1186564 1163382 1141597 1119768 1096814 1072802 1048880 1026157 1004859 984954
53170I84954j7763j4656j2184j2257j4543j6583j6766j6035j6085j6940j7563
$$ 984954 967191 952535 940351 928094 913551 896968 880202 864167 848082 831142 813579
53159H13579j8219k0402k4097k6668k5656k1865j8397j7081j7102j7021j6630
$$ 813579 795360 774958 750861 724193 698537 676672 658275 641194 624092 607071 590441
53148E90441j6283j5744j4722j3720j3349j3230j2576j1576j1183j1603j1957
$$ 590441 574158 558414 543692 529972 516623 503393 490817 479241 468058 456455 444498
53137D44498j1613j0995j0816j1080j1335j1357j1237j0914j0034q245n633k939
$$ 444498 432885 421890 411074 399994 388659 377302 366065 355151 345117 336872 331239 328300
53125C28300j146o73j045j564k098k871l829m636n063m907l921k383j377j617
$$ 328300 327154 326481 325436 323872 321774 318903 315074 310438 305375 300468 296547 294164 292787 291170
53111B91170k221j607M23K425L165K730J690L48q13j001j57P23Q37M09k35j344
$$ 291170 288949 287342 287765 290190 293355 296085 297775 298123 297310 296309 296152 296875 297712 298121 297886 296542
53095B96542k740l117j608N46J116m73k687l840l464j820P37L417M925M398K293
$$ 296542 293802 290685 289077 289623 290739 290266 287579 283739 280275 278455 279192 282609 287534 291932 294225
53080B94225m4j538k022j953j792j785k186l214m408m444k530J07J200K07j131
$$ 294225 294181 292643 290621 288668 286876 285091 282905 279691 275283 270839 268309 268416 269616 269823 268692
53065B68692j510j988l962o492p332o059m299l067j808l12L01o94k291l139l166
$$ 268692 267182 265194 261232 254740 247408 241349 237050 233983 232175 231863 232164 231470 229179 226040 222874
53050B22874l053k989k877k920l067k530j016K12l27k108l011j969k00N19j31
$$ 222874 219821 216832 213955 211035 207968 205438 204422 204634 204307 202199 199188 197219 197019 197538 197407
53035A97407j178j845k099k133j996j871k086k552k586j760o60k49n29o14l55
$$ 197407 196229 194384 192285 190152 188156 186285 184199 181647 179061 177301 176641 176392 175863 175249 174894
53020A74894q57k667m317l961k022o99q96j240n15N38P63L93J88p1p00o70J081
$$ 174894 174037 171370 167053 163092 161070 160371 159475 158235 157720 158258 159021 159414 159602 159531 158831 158161 159242
53003A59242L269L151J28l164l924k160O4J199J187O33L4l33l90j72L17R56J279
$$ 159242 162511 165662 165790 162626 158702 156542 156606 157805 158992 159625 159659 159326 158936 158764 159081 160037 161316
52986A61316R66N57Q46J421P68j560l846m128k547q63p7K77P34R98O98J60n6K49
$$ 161316 162282 162839 163685 165106 165874 164314 160468 156340 153793 152930 152853 153130 153864 154862 155560 155720 155664 155913
52968A55913R99K050K960L103K278R49l76j563k455k533j495J12J330J767J790
$$ 155913 156912 158962 161922 165025 167303 168252 167876 166313 163858 161325 159830 159942 161272 163039 164829
52953A64829J866K007J920J395O03R5M00J445K441K603J897Q81N5l38r7P67J635
$$ 164829 166695 168702 170622 172017 172620 172715 173115 174560 177001 179604 181501 182382 182437 182099 182002 182769 184404
52936A84404J685R21K93M33P63L67o08j121o99O4O28J339K617L851L897K619J263
$$ 184404 186089 187010 187303 187736 188499 188866 188258 187137 186438 186502 187130 188469 191086 194937 198834 201453 202716
52919B02716J077K000K999L376L328L268L113K516J609J047J256J922K467K699
$$ 202716 203793 205793 208792 212168 215496 218764 221877 224393 226002 227049 228305 230227 232694 235393
52905B35393K678K207J074k86j036j128j536k899m442m904m058k675j352k54L06
$$ 235393 238071 240278 241352 241066 240030 238902 237366 234467 230025 225121 221063 218388 217036 216782 217088
52890B17088P6l58j05N01J12j428k296j077J023J591J49j429j394J65K213L973
$$ 217088 217164 216806 216701 217202 217314 215886 213590 212513 213536 215127 215276 213847 212453 212618 214831 218804
52874B18804M803M038J833l88j289j126j266k193k776j790K86J514P11r15r41
$$ 218804 223607 227645 229478 229090 227801 226675 225409 223216 220440 218650 218936 220450 221161 220246 219305
52859B19305J374L982M351K359Rj287j933k550k772k364k255l093l682k376K70
$$ 219305 220679 224661 229012 231371 231380 230093 228160 225610 222838 220474 218219 215126 211444 209068 209338
52844B09338J952J745J048R99P28o94k097j702J3Q66J94l49M08J273N62j440l089
$$ 209338 211290 213035 214083 215082 215810 215116 213019 211317 211330 212196 212390 212041 212449 213722 214284 212844 209755
52827B09755l619l451k830j557p2N61Q3n49n80m48p86j226j007k81R5o5M9J015
$$ 209755 206136 202685 199855 198298 198226 198787 198870 198321 197741 197293 196507 195281 194274 193993 194088 194023 194072 195087
52809A95087K212K518J717P67N64P59K06j435l131l853m007m690n856o174m807
$$ 195087 197299 199817 201534 202301 202865 203624 203830 202395 199264 195411 191404 186714 180858 174684 169877
52794A69877k425k42R95Q68o70k521k861j291L57M48k16P4J043Q35r02k292j818
$$ 169877 167452 167210 168205 169073 168403 165882 163021 161730 162087 162535 162319 162393 163436 164271 163369 161077 159259
52777A59259j17J293J698J113j41j141q09O11J449P17n69p51M96K199L214K897
$$ 159259 159142 160435 162133 163246 163105 161964 161155 161766 163215 163932 163363 162612 163108 165307 168521 171418
52761A71418J498M15R51K323K311N11p45j2O63j176m209n017l251j989k783l448
$$ 171418 172916 173331 174282 176605 178916 179427 178682 178670 179333 178157 173948 168931 165680 163691 160908 157460
52745A57460j955J65J58j847l300k829j473o24m86p10j285k305l548m569m882
$$ 157460 155505 155670 155828 153981 150681 147852 146379 145755 145269 144559 143274 140969 137421 132852 127970
52730A27970m053k131M5J343J339O00Nk6K74M08J77n2K22R29J425J215L97o83
$$ 127970 123917 121786 121831 123174 124513 125113 125118 125092 125366 125774 125951 125899 126121 127050 128475 129690 130087 129404
52712A29404j665j999j143N53J743J466L29k93L4O99J318K098K762K225J75j813
$$ 129404 127739 125740 124597 125150 126893 128359 128688 128395 128429 129128 130446 132544 135306 137531 137706 135893
52696A35893j802L4J555J367K65m59r39j803k205o59K201L531J759j294k792k199
$$ 135893 134091 134125 135680 137047 137312 136853 135914 134111 131906 131247 133448 136979 138738 137444 134652 132453
52680A32453r60R5J166J909J477K85o9Q63J588R15m29j140j101q31k80P36J561
$$ 132453 131493 131588 132754 134663 136140 136425 136356 137219 138807 139722 139293 138153 137052 136221 135941 136677 138238
52663A38238J329J90r16j296p39O98K353L121K753K383K949L764L706L103L092
$$ 138238 139567 139757 138841 137545 136806 137504 139857 142978 145731 148114 151063 154827 158533 161636 164728
52648A64728L563L229J678l9r21r46l32Q90K277L027K994K818K815K591J983J395
$$ 164728 168291 171520 173198 173159 172238 171292 170960 171850 174127 177154 180148 182966 185781 188372 190355 191750
52632A91750R52L65j12K56J138R85q01k529k282n60L60n82k091k385j242J84R29
$$ 191750 192702 193067 192955 193211 194349 195334 194533 192004 189722 189162 189522 188940 186849 184464 183222 183406 184335
52615A84335J162J587K284K512J796Q43O80J186J279N53l14r50j859l084l479
$$ 184335 185497 187084 189368 191880 193676 194519 195199 196385 197664 198217 197903 196953 195094 192010 188531
52600A88531k318o27J70K06N15J033P18n84j808k310k589l097l488l451l357l504
$$ 188531 186213 185586 185756 185962 186477 187510 188228 187644 185836 183526 180937 177840 174352 170901 167544 164040
52584A64040l344k124O1K250L459L404K588J770J246Q07M97Q53J850K192P81j421
$$ 164040 160696 158572 158633 160883 164342 167746 170334 172104 173350 174157 174654 175507 177357 179549 180330 178909
52568A78909k095m09J906K600J208j005k538k659j584j63Q82J596K275K611K093
$$ 178909 176814 176405 178311 180911 182119 181114 178576 175917 174333 174170 175052 176648 178923 181534 183627
52553A83627J212J068J691J928J298P38R57J320J148Q88J067J176O71N2k46r96
$$ 183627 184839 185907 187598 189526 190824 191562 192519 193839 194987 195875 196942 198118 198789 198841 198595 197599
52537A97599k721m077l437j523n66j059j266j16J246J428P56N17J241K461L396
$$ 197599 194878 190801 187364 185841 185275 184216 182950 182834 184080 185508 186264 186781 188022 190483 193879
52522A93879L369K323J197J039J543J457N84J92R95J964J848P84l86j365k001
$$ 193879 197248 199571 200768 201807 203350 204807 205391 205583 206578 208542 210390 211174 210788 209423 207422
52507B07422j618K9J755K118J298P31J059J489J196M68J83O81J397J385K94r95
$$ 207422 205804 205833 207588 209706 211004 211735 212794 214283 215479 215947 216130 216811 218208 219593 219887 218892
52491B18892j094K36J592J477q4j915l067l164k000J03J763J433q70l413m514
$$ 218892 217798 218034 219626 221103 221019 219104 216037 212873 210873 210976 212739 214172 213302 209889 205375
52476B05375m035l081k707l065l482l290k633k241k229j780n15N12J11j181j712
$$ 205375 201340 198259 195552 192487 189005 185715 183082 180841 178612 176832 176317 176829 176940 175759 174047
52461A74047j071o00j307k418k561j561l15N04R26J126R81K40j121k606l303k688
$$ 174047 172976 172376 171069 168651 166090 164529 164214 164718 165644 166770 167751 167991 166870 164264 160961 158273
52445A58273j353n40p42j255j242p22j72L26J020J878K529K706K417J749P82k92
$$ 158273 156920 156380 155638 154383 153141 152419 152247 152573 153593 155471 158000 160706 163123 164872 165654 165362
52429A65362j203j673j452n48M91Q70M45P0O76K043K882K206M20j170j698j482
$$ 165362 164159 162486 161034 160486 160977 161847 162292 162362 163038 165081 167963 170169 170589 169419 167721 166239
52413A66239j403j814k276k283j777q36O21K378L532L264J971R29P73Q72M64k08
$$ 166239 164836 163022 160746 158463 156686 155850 156471 158849 162381 165645 167616 168545 169318 170190 170654 170446
52397A70446l30L10J100J435J235O89q4q57j065j74J466K474J647m74j883j244
$$ 170446 170116 170426 171526 172961 174196 174885 174801 173944 172879 172705 174171 176645 178292 177818 175935 174691
52381A74691N61J615J329P56P57Q96N20J5J84Q58R11l59k324l536k923o67J929
$$ 174691 175252 176867 178196 178952 179709 180605 181125 181140 181324 182182 183093 182734 180410 176874 173951 173284 175213
52364A75213L525L866L655L338K570J198J11L27J445J899R00n50q89K60J951L083
$$ 175213 178738 182604 186259 189597 192167 193365 193476 193803 195248 197147 198047 197497 196608 196868 198819 201902
52348B01902L199K401J139K52N57J889K838K040j46j681q69J866M285M375K040
$$ 201902 205101 207502 208641 208893 209450 211339 214177 216217 216071 214390 213521 215387 219672 224047 226087
52333B26087q33j909l75K305L819L446K613K855L846M188L641L468M408N440N100
$$ 226087 225254 223345 222970 225275 229094 232540 235153 238008 241854 246042 249683 253151 257559 262999 268099
52318B68099L417J887J805L110M769N915O550P221Q111Q630Q115O794N594N078
$$ 268099 271516 273403 275208 278318 283087 289002 295552 302773 310884 319514 327629 334423 340017 345095
52304C45095N051N277N984P325Q712R220Q577P569P463Q980J1626J4013J5145
$$ 345095 350146 355423 361407 368732 377444 386664 395241 402810 410273 419253 430879 444892 460037
52291D60037J5435J6165J7974K0184K1737K2367K2694K3457K4830K6308K7134
$$ 460037 475472 491637 509611 529795 551532 573899 596593 620050 644880 671188 698322
52280F98322K7043K6706K7154K8730L0741L2152L2507L2224L2189L2858L3572
$$ 698322 725365 752071 779225 807955 838696 870848 903355 935579 967768 1000626 1034198
52269A034198L3075L1091K8918K7854K7521K6567K4673K2610K0488J7352J3117
$$ 1034198 1067273 1098364 1127282 1155136 1182657 1209224 1233897 1256507 1276995 1294347 1307464
52258A307464R600Q659R886J0930R850O556K303j589m490o223o460m902k385j029
$$ 1307464 1317064 1325723 1335609 1346539 1356389 1362945 1365248 1363659 1359169 1352946 1346486 1341584 1339199 1338170
52244A338170k221m798o401o441o279o524o004l885j034J570M172O860Q528Q597
$$ 1338170 1335949 1331151 1324750 1318309 1312030 1305506 1299502 1295617 1294583 1296153 1300325 1307185 1315713 1324310
52230A324310Q551J0141J3085J5953J8240K0010K0637J9890J9394K0787K2848
$$ 1324310 1332861 1343002 1356087 1372040 1390280 1410290 1430927 1450817 1470211 1490998 1513846
52219A513846K2799K0267J7635J6301J4992J2313Q824N540K364p02k447k159j457
$$ 1513846 1536645 1556912 1574547 1590848 1605840 1618153 1626977 1632517 1634881 1634179 1631732 1629573 1628116
52206A628116k875p005j2058j5902j7772j8327j8842k0125k1855k3167k3872k4361
$$ 1628116 1625241 1618236 1606178 1590276 1572504 1554177 1535335 1515210 1493355 1470188 1446316 1421955
52194A421955k4368k3000k0539j8951j9671k1592k2219k0346j6920j3764j2123
$$ 1421955 1397587 1374587 1354048 1335097 1315426 1293834 1271615 1251269 1234349 1220585 1208462
52183A208462j1987j2094j1032q852p036o423n961m348k048n75l77o39p87q95
$$ 1208462 1196475 1184381 1173349 1164497 1157461 1151038 1145077 1140729 1138681 1138106 1137729 1137090 1136303 1135408
52169A135408p01L55K048L384L958M404N199O074O808P694Q701R160Q828Q445
$$ 1135408 1134707 1135062 1137110 1140494 1144452 1148856 1154055 1160129 1166937 1174631 1183332 1192492 1201320 1209765
52155A209765Q529Q351P133N630N304O110O355N035L210K483K939L470L591L815
$$ 1209765 1218294 1226645 1233778 1239408 1244712 1250822 1257177 1262212 1265422 1267905 1270844 1274314 1277905 1281720
52141A281720M272M044K413M7j671k226k201k157j978j526j301j942l289m425
$$ 1281720 1285992 1290036 1292449 1292496 1290825 1288599 1286398 1284241 1282263 1280737 1279436 1277494 1274205 1269780
52127A269780m692m395m279m525m570m010l330l343m027m450l994l103k489k021
$$ 1269780 1265088 1260693 1256414 1251889 1247319 1243309 1239979 1236636 1232609 1228159 1224165 1221062 1218573 1216552
52113A216552j082K96J381J880K419L560M874N404M803L725L232L971N656P232
$$ 1216552 1215470 1215766 1217147 1219027 1221446 1225006 1229880 1235284 1240087 1243812 1247044 1251015 1256671 1263903
52099A263903P759P420P434Q688J0729J2389J3264J4092J5608J7505J8854J9365
$$ 1263903 1271662 1279082 1286516 1295204 1305933 1318322 1331586 1345678 1361286 1378791 1397645 1417010
52087A417010J9862K1394K4052K6776K8243K7972K6739K5927K6275K7094K7048
$$ 1417010 1436872 1458266 1482318 1509094 1537337 1565309 1592048 1617975 1644250 1671344 1698392
52076A698392K5782K4353K3759K3645K3104K2185K1439K0319J7591J3606J0518
$$ 1698392 1724174 1748527 1772286 1795931 1819035 1841220 1862659 1882978 1900569 1914175 1924693
52065A924693R326Q248N362J664k69m9J17j315l449m815n431o209p560r387j1524
$$ 1924693 1934019 1942267 1947629 1949293 1949024 1948975 1949092 1947777 1944328 1939513 1934082 1927873 1920313 1910926 1899402
52050A899402j3428j4218j3790j3263j3529j3926j3146j1070q906p691p240o502
$$ 1899402 1885974 1871756 1857966 1844703 1831174 1817248 1804102 1793032 1784126 1776435 1769195 1762693
52038A762693m561j348K267N292P664J0244J3544J6904J9316K0655K1594K2518
$$ 1762693 1758132 1756784 1759051 1764343 1772007 1782251 1795795 1812699 1832015 1852670 1874264 1896782
52026A896782K3108K3047K2738K2987K3917K4493K3540K1379J9754J9612J9591
$$ 1896782 1919890 1942937 1965675 1988662 2012579 2037072 2060612 2081991 2101745 2121357 2140948
52015B140948J7696J4026J0475P843M858M88m330q256j1507j4989j8471k1137
$$ 2140948 2158644 2172670 2183145 2190988 2195846 2196334 2192004 2183748 2172241 2157252 2138781 2117644
52003B117644k3349k6258k9778l2484l3704l4594l6616l9803m2889m4566m4304
$$ 2117644 2094295 2068037 2038259 2005775 1972071 1937477 1900861 1861058 1818169 1773603 1729299
51992A729299m2565m0500l9135l8597l8370l8142l7814l6895l4737l1592k8660
$$ 1729299 1686734 1646234 1607099 1568502 1530132 1491990 1454176 1417281 1382544 1350952 1322292
51981A322292k6634k4880k2534j9888j7998j7181j6570j5227j3211j1396j0504
$$ 1322292 1295658 1270778 1248244 1228356 1210358 1193177 1176607 1161380 1148169 1136773 1126269
51970A126269j0442j0461r920r054q954j0490j3121j5035j4869j3203j2010j2584
$$ 1126269 1115827 1105366 1095446 1086392 1077438 1066948 1053827 1038792 1023923 1010720 998710 986126
51958I86126j4287j5533j5651j5438j6092j8002k0587k2936k4462k5115k5156
$$ 986126 971839 956306 940655 925217 909125 891123 870536 847600 823138 798023 772867
51947G72867k4811k4360k4373k5277k6426k6232k3962k0978j9432j9884k0965
$$ 772867 748056 723696 699323 674046 647620 621388 597426 576448 557016 537132 516167
51936E16167k1259k0555j9232j7447j5381j3502j2144j1288j0984j1301j1657
$$ 516167 494908 474353 455121 437674 422293 408791 396647 385359 374375 363074 351417
51925C51417j1029r212p158n684m707m094m281n242n766m768k861j646j891l143
$$ 351417 340388 331176 324018 318334 313627 309533 305252 300010 294244 289476 286615 284969 283078 279935
51911B79935m739o155o750o091m603l159k145j550j587k457l610m143l890l488
$$ 279935 275196 269041 262291 256200 251597 248438 246293 244743 243156 240699 237089 232946 229056 225568
51897B25568l364l334l192l016k854k574k096j406n89j17n63j479j348M26K086
$$ 225568 222204 218870 215678 212662 209808 207234 205138 203732 203143 203026 202463 200984 199636 200062 202148
51882B02148J514p28j899p01J162J495K10j345k370k896k984k694k473k612k723
$$ 202148 203662 202934 201035 200334 201496 202991 203201 201856 199486 196590 193606 190912 188439 185827 183104
51867A83104k328j668j352j536j964k377k416j643l33L29l38j348j401r65j741
$$ 183104 180776 179108 177756 176220 174256 171879 169463 167820 167487 167816 167478 166130 164729 163764 162023
51852A62023l940n424m295j282J183J716P87o35k055k963k564p01J444K300J504
$$ 162023 158083 152659 148364 147082 148265 149981 150768 150133 148078 145115 142551 141850 143294 145594 147098
51837A47098O4r02j163j125j167j462k012k521k412j389NO17k35j979l163k806
$$ 147098 147162 146260 145097 143972 142805 141343 139331 136810 134398 133009 133014 133631 133396 131417 128254 125448
51821A25448j332J2O94J451K975M518M576K820N63r49j809k574k925k100l63R37
$$ 125448 124116 124128 124822 126273 129248 133766 138342 141162 141725 140776 138967 136393 133468 131368 131005 131942
51805A31942Q94j4o78n70J31J177K570M125N133M793L208J606J263K207L370L878
$$ 131942 132836 132822 132144 131574 131705 132882 135452 139577 144710 149503 152711 154317 155580 157787 161157 165035
51789A65035L725L144K119R05M07J338L233M841N357M956M292L898L937M185M325
$$ 165035 168760 171904 174023 174928 175335 176673 179906 184747 190104 195060 199352 203250 207187 211372 215697
51774B15697M494N254O781Q405R334R564R617R618R162Q018O522N190M090K660
$$ 215697 220191 225445 232226 240631 249965 259529 269146 278764 287926 295944 302466 307656 311746 314406
51760C14406J09l643p467r924j0704j0716j0617j0035q527o539m860l853l726
$$ 314406 314515 310872 303405 293481 282777 272061 261444 251409 242882 236343 231483 227630 223904
51747B23904m664o014o237m706k771j989j969j350k49k7q62j386r01m05q22j630
$$ 223904 219240 213226 206989 202283 199512 197523 195554 194204 193955 193928 193066 191680 190779 190374 189552 187922
51731A87922j929j695j264n47L60O03m32k035k920k750k314k335k676k629j645
$$ 187922 185993 184298 183034 182487 182847 183450 183018 180983 178063 175313 172999 170664 167988 165359 163714
51716A63714J81K128L435L816L289J864nr23L58L134M888L980J472k71k67N93
$$ 163714 163895 166023 169458 173274 176563 178427 178422 177499 177857 180991 185879 189859 191331 191060 190793 191386
51700A91386J274J793K528L221L244K483J424M65k43k59J044L246M449L233Q29
$$ 191386 192660 194453 196981 200202 203446 205929 207353 207818 207575 207316 208360 211606 216055 219288 220117
51685B20117MJ568L436L687L027L098L802L989L761M097M674M090K243O91M00
$$ 220117 220121 221689 225125 228812 231839 234937 238739 242728 246489 250586 255260 259350 261593 262284 262684
51670B62684Q07J247J696J730O22r91j255K24J415N92j396k658k811k666k563
$$ 262684 263491 264738 266434 268164 268786 267795 266540 266764 268179 268771 267375 264717 261906 259240 256677
51655B56677k416k731m033n647o200n250l563k126j521j756k059j372K55J306
$$ 256677 254261 251530 247497 241850 235650 230400 226837 224711 223190 221434 219375 218003 218258 219564
51641B19564N94j192k536k989l013k679j669k37J018K033K934L082J698o34k313
$$ 219564 220158 218966 216430 213441 210428 207749 206080 205843 206861 208894 211828 214910 216608 215974 213661
51626B13661k658k469k523k524j946j014k38L48R49J352J051oj103j287k06J571
$$ 213661 211003 208534 206011 203487 201541 200527 200289 200637 201586 202938 203989 203983 202880 201593 201387 202958
51610B02958L125M002M303M134L429K415J601J054K32j125k446l081l033k544
$$ 202958 206083 210085 214388 218522 221951 224366 225967 227021 227253 226128 223682 220601 217568 215024
51596B15024j598l89K92k2o18m53M42J195J385J351J337J223J022R44Q81N22n6
$$ 215024 213426 213037 213329 213307 212689 212236 212678 213873 215258 216609 217946 219169 220191 221135 222016 222538 222482
51579B22482m47n64o92q43o23K10J429K513K844J985K80j045j004k8O23N44O08
$$ 222482 222035 221471 220779 219936 219313 219523 220952 223465 226309 228294 228574 227529 226525 226497 227120 227664 228272
51562B28272J548K753K836J156j499l607m164l305j855m45N82O53q63l662o245
$$ 228272 229820 232573 235409 236565 235066 231459 227295 223990 222135 221690 222272 222925 222062 218400 212155
51547B12155p110n928l296j20K309K623O91j851l353l940m536m808l626j428k85
$$ 212155 205045 199117 195821 195701 198010 200633 201324 199473 196120 192180 187644 182836 179210 177782 177497
51532A77497j054j965j081R51J910J062k25q02j187k102k688j387J609M046M093
$$ 177497 176443 174478 173397 174348 176258 177320 177095 176293 175106 173004 170316 168929 170538 174584 178677
51517A78677K337P17J36N4j8R6K89j00j117j770j381o05l16j90O19J995K938K905
$$ 178677 181014 181731 181867 181921 181903 181999 182288 182188 181071 179301 177920 177315 176999 176809 177428 179423 182361 185266
51499A85266K231J473R63Q63J017R41N29M54J289K561L342L475L462L449L148
$$ 185266 187497 188970 189933 190796 191813 192754 193283 193737 195026 197587 200929 204404 207866 211315 214463
51484B14463K629K329K290K100J718J715K590M228N910O566N447L070J163R65
$$ 214463 217092 219421 221711 223811 225529 227244 229834 234062 239972 246538 251985 255055 256218 257183
51470B57183J846K350K193K319L114L594K681N95j346j992j393p33j100k225k932
$$ 257183 259029 261379 263572 265891 269005 272599 275280 275875 274529 272537 271144 270411 269311 267086 264154
51455B64154k856k985l954m921m899m264l823l293k065o91m0L90J551K736K402
$$ 264154 261298 258313 254359 249438 244539 240275 236452 233159 231094 230403 230363 230753 232304 235040 237442
51440B37442J025Q64K521L710K340p78l263l838k838j291m17j054k720l959m153
$$ 237442 238467 239331 241852 245562 247902 247124 243861 240023 237185 235894 235477 234423 231703 227744 223591
51425B23591m063m217m039l154k242j764j228n53p83k159k884j500N72P35j174
$$ 223591 219528 215311 211272 208118 205876 204112 202884 202331 201548 199389 196505 195005 195577 196312 195138
51410A95138k885k951k197j847k000k323k771k986k341j087m92j080j713j195
$$ 195138 192253 189302 187105 185258 183258 180935 178164 175178 172837 171750 171258 170178 168465 167270
51396A67270JM53k97j435k054j758n11J180J963P35j731l218k503n95R68K010
$$ 167270 167271 167724 167427 165992 163938 162180 161669 162849 164812 165547 163816 160598 158095 157500 158468 160478
51380A60478K950L139J638o50j456j99J052N32p64p14Q41K173K122J060k37j338
$$ 160478 163428 166567 168205 167555 166099 165900 166952 167484 166720 166006 166847 169020 171142 172202 171965 170627
51364A70627j815j393n69j10j9J80M23M55Q92K479M327M446K424J69n59j18K19
$$ 170627 168812 167419 166850 166740 166721 166901 167324 167779 168671 171150 175477 179923 182347 182516 181957 181839 182058
51347A82058K64P14J614K110J443k99k236l251k878j745q00j72N33J037M81j125
$$ 182058 182322 183036 184650 186760 188203 187904 185668 182417 179539 177794 176994 176822 177355 178392 178873 177748
51331A77748k595k915k077m92J407K719K491J071L3K48Q47N57q41k679m056m067
$$ 177748 175153 172238 170161 169669 171076 173795 176286 177357 177390 177638 178485 179042 178201 175522 171466 167399
51315A67399k556j080j696m203n882m869k411q41o25p17o54q06j250j788k528
$$ 167399 164843 163763 162067 157864 151982 147113 144702 143861 143236 142519 141865 141059 139809 138021 135493
51300A35493l322l249j796QQ06O70N23M40j34r84j326j178j244j502j163l4J084
$$ 135493 132171 128922 127126 127134 127940 128610 129133 129573 129439 128455 127129 125951 124707 123205 122042 122008 123092
51283A23092J399P66n28j878k471k088j517j384j096P4J401J485L59n32m54j12
$$ 123092 124491 125257 124729 122851 120380 118292 116775 115391 114295 114369 115770 117255 117614 117082 116628 116516
51267A16516r7L9O11R08K11q78j020J97J651J883O81o68q15R3O35q4j480k343
$$ 116516 116419 116458 117069 117977 118188 117310 116290 116487 118138 120021 120702 120034 119219 119312 119947 119863 118383 116040
51249A16040k042o72J154K304J928O84K92J244K109J800J206J422J713Q66l96
$$ 116040 113998 113326 114480 116784 118712 119396 119688 120932 123041 124841 126047 127469 129182 130048 129652
51234A29652l16J087J976J350L6r55j478j459m59J396L082L634K855J212l86j124
$$ 129652 129336 130423 132399 133749 133785 132830 131352 129893 129434 130830 133912 137546 140401 141613 141227 140103
51218A40103j231j733k483j668J298L779K952J9j213L82K139J883M63o49j541
$$ 140103 138872 137139 134656 132988 134286 138065 141017 141036 139823 140205 142344 144227 144690 144041 142500
51203A42500k374k091k79J476J697J037P89P99L80J5N18J454J964K363L409M695
$$ 142500 140126 138035 137756 139232 140929 141966 142755 143554 143934 143949 144467 145921 147885 150248 153657 158352
51187A58352N125M522L523K325Q49l51n89k65m06j238k151k796l269l378k738
$$ 158352 163477 167999 171522 173847 174696 174345 173756 173491 173085 171847 169696 166900 163631 160253 157515
51172A57515j590o70k61O3P68J876K956L229K088p0j945k656k502j946p53J180
$$ 157515 155925 155255 154994 155057 155825 157701 160657 163886 165974 165904 163959 161303 158801 156855 156102 157282
51156A57282K776K663Q37j345k605k552j463qR75J093O90K40o2J05J215K869L502
$$ 157282 160058 162721 163558 162213 159608 157056 155593 155585 156560 157653 158343 158583 158521 158626 159841 162710 166212
51139A66212K106l00j839j951j522j278j046m58M38J236J339N24l54QJ352J498
$$ 166212 168318 168018 166179 164228 162706 161428 160382 159924 160362 161598 162937 163461 163107 163115 164467 165965
51123A65965q62l960m944l423j389k20L60N65j2r31q02N72J529R28k73o99n77
$$ 165965 165103 161143 156199 152776 151387 151167 151527 152092 152080 151149 150347 150919 152448 153376 153103 152404 151827
51106A51827q30j208o82Q11K202K654K240J415N89P8q0j48j79J90J027J605J167
$$ 151827 150997 149789 149107 149918 152120 154774 157014 158429 159018 159096 159016 158868 158689 158879 159906 161511 162678
51089A62678j09j404k129j978o36J687L664L786K121M35K30J241K079J948J191
$$ 162678 162569 161165 159036 157058 156422 158109 161773 165559 167680 168115 168345 169586 171665 173613 174804
51074A74804N24K56K74L03P6m64r37p92k4O56O99N27R26J704J781P97j67o8O89
$$ 174804 175328 175584 175858 176161 176237 175773 174836 174044 174020 174676 175375 175902 176828 178532 180313 181110 180943 180875 181564
51055A81564J091J158J511J722N91j638k826j476J267L092L244K714K276J678
$$ 181564 182655 183813 185324 187046 187637 185999 183173 181697 182964 186056 189300 192014 194290 195968
51041A95968P56J46L70R74J156R01R24J680K782L460L444L214L370L799L753K858
$$ 195968 196724 196870 197240 198214 199370 200271 201195 202875 205657 209117 212561 215775 219145 222944 226697 229555
51025B29555J697J072R93Q56M82K70K63j79j312k243j881m01R80J505J458J255
$$ 229555 231252 232324 233317 234173 234655 234925 235188 235009 233697 231454 229573 229172 230152 231657 233115 234370
51009B34370Q26L12N08J809L132K922J299K24J061K743L088J570j47m53L90J113
$$ 234370 235196 235508 236016 237825 240957 243879 245178 245402 246463 249206 252294 253864 253717 253264 253654 254767
50993B54767J449K256L777M769M004K035O00L77K46r18k520l012j916k44J003
$$ 254767 256216 258472 262249 267018 271022 273057 273657 274034 274280 273362 270842 267830 265914 265670 266673
50978B66673J815K529L042L048K482J330m49k346l237k592j336o44k82Q20K436
$$ 266673 268488 271017 274059 277107 279589 280919 280470 278124 274887 272295 270959 270315 270033 270853 273289
50963B73289K790R53j544k265n20K318M669N923O086N340M355M148N091O364O871
$$ 273289 276079 277032 275488 273223 272703 275021 279690 285613 291699 297039 301394 305542 310633 316997 323868
50948C23868O518O194O667P825Q862R070Q467P914Q360R726J0791J0651J0055
$$ 323868 330386 336580 343247 351072 359934 369004 377471 385385 393745 403471 414262 424913 434968
50935D34968J0636J2791J5057J5858J5279J4741J5359J7145J9364K1186K2294
$$ 434968 445604 458395 473452 489310 504589 519330 534689 551834 571198 592384 614678
50924F14678K3428K5943L0146L4373L6681L7404L8946M2822M7985N2592N6437
$$ 614678 638106 664049 694195 728568 765249 802653 841599 884421 932406 984998 1041435
50913A041435O0659O5712P0801P5227P9340Q3899Q9060R4274R8800J02248J04788
$$ 1041435 1102094 1167806 1238607 1313834 1393174 1477073 1566133 1660407 1759207 1861455 1966243
50902A966243J06856J08436J08862J07623J05083J01795R7277R0181P9906O7495
$$ 1966243 2073099 2181535 2290397 2398020 2503103 2604898 2702175 2792356 2872262 2939757
50892B939757N4792M3093L2633K2855J2901K376q068j7144k4057k8902l1954l3349
$$ 2939757 2994549 3037642 3070275 3093130 3106031 3108407 3100339 3083195 3059138 3030236 2998282 2964933
50880B964933l3736l4337l5598l6362l5357l3228l2206l3806l7675m2643m7942
$$ 2964933 2931197 2896860 2861262 2824900 2789543 2756315 2724109 2690303 2652628 2609985 2562043
50869B562043n3216n8217o3065o8155p3304p7605q0567q2792q4814q5838q4555
$$ 2562043 2508827 2450610 2387545 2319390 2246086 2168481 2087914 2005122 1920308 1834470 1749915
50858A749915q0925p6354p2065o8133o4079n9660n4901m9992m5465m1802l8612
$$ 1749915 1668990 1592636 1520571 1452438 1388359 1328699 1273798 1223806 1178341 1136539 1097927
50847A097927l4838l0157k5634k2476k0550j8718j6272j3563j1344r933q972p731
$$ 1097927 1063089 1032932 1007298 984822 964272 945554 929282 915719 904375 894442 885470 877739
50835H77739n807l671k212j526o66J085L269N069O508Q030R460J0389J1256J2862
$$ 877739 871932 868261 866049 864523 863857 864942 868211 873280 879788 887818 897278 907667 918923 931785
50821I31785J4872J6070J6420J7572K0568K4042K5786K5565K5404K7257L1140
$$ 931785 946657 962727 979147 996719 1017287 1041329 1067115 1092680 1118084 1145341 1176481
50810A176481L5581L9174M1654M3901M7109N1682N6916O2004O7159P3390Q1106
$$ 1176481 1212062 1251236 1292890 1336791 1383900 1435582 1492498 1554502 1621661 1695051 1776157
50799A776157Q9526R7723J05997J15665J27386J40133J52276J63509J75071J87809
$$ 1776157 1865683 1963406 2069403 2185068 2312454 2452587 2604863 2768372 2943443 3131252
50789C131252K00696K11919K20977K28896K36450K42969K47029K47526K43869
$$ 3131252 3331948 3543867 3764844 3993740 4230190 4473159 4720188 4967714 5211583
50780E211583K35716K22835K04858J81303J52621J21126Q9702N9333K9159n58
$$ 5211583 5447299 5670134 5874992 6056295 6208916 6330042 6419744 6479077 6508236 6507678
50770F507678k7133m8253o4616p8063q8141r2698r1541q7228q1904p5505o7967
$$ 6507678 6480545 6432292 6367676 6289613 6201472 6108774 6017233 5930005 5848101 5772596 5704629
50759E704629o1384n8593o0616o6727p6111q8121j01553j15068j28237j41257
$$ 5704629 5643245 5584652 5524036 5457309 5381198 5293077 5191524 5076456 4948219 4806962
50749D806962j53738j64746j73892j81367j86791j88973j87159j81951j74779
$$ 4806962 4653224 4488478 4314586 4133219 3946428 3757455 3570296 3388345 3213566
50740C213566j66943j59148j51348j42777j32652j21202j09570r8664q8511p9016
$$ 3213566 3046623 2887475 2736127 2593350 2460698 2339496 2229926 2131262 2042751 1963735
50730A963735p0700o4239n9493n5390n0629m4538l7618l1508k7863k6829k6774
$$ 1963735 1893035 1828796 1769303 1713913 1663284 1618746 1581128 1549620 1521757 1494928 1468154
50719A468154k5941k4048k1979k0370j9048j7734j6562j5801j5381j4854j3736
$$ 1468154 1442213 1418165 1396186 1375816 1356768 1339034 1322472 1306671 1291290 1276436 1262700
50708A262700j2092j0897j1251j2841j3655j2005q491n023k278N99L805O072O779
$$ 1262700 1250608 1239711 1228460 1215619 1201964 1189959 1181468 1176445 1174167 1174766 1178571 1184643 1191422
50695A191422P551J0414J5100J9436K2033K3556K5515K8929L3955L9835M5173
$$ 1191422 1198973 1209387 1224487 1243923 1265956 1289512 1315027 1343956 1377911 1417746 1462919
50684A462919M9345N3692O0114O8256P5427Q0034Q3846Q9648R7608J05388J11482
$$ 1462919 1512264 1565956 1626070 1694326 1769753 1849787 1933633 2023281 2120889 2226277 2337759
50673B337759J16663J21876J26455J29386J31204J33006J34120J32397J27047
$$ 2337759 2454422 2576298 2702753 2832139 2963343 3096349 3230469 3362866 3489913
50664C489913J19712J12151J04021R3826Q0974O5623M7422K6236L958j6269l3007
$$ 3489913 3609625 3721776 3825797 3919623 4000597 4066220 4113642 4139878 4143836 4127567 4094560
50653D094560m7170n9330o8146p2350p2682p0436o5365n6809m6104l6118k8669
$$ 4094560 4047390 3988060 3919914 3847564 3774882 3704446 3639081 3582272 3536168 3500050 3471381
50642C471381k3863k1647k2342k5699l0884l7708m6605n7326o8728p9898r0280
$$ 3471381 3447518 3425871 3403529 3377830 3346946 3309238 3262633 3205307 3136579 3056681 2966401
50631B966401r8772j04078j06168j06108j04361j00663r5569r0358q4991p7984
$$ 2966401 2867629 2763551 2657383 2551275 2446914 2346251 2250682 2160324 2075333 1997349
50621A997349o9057o0190n3079m7100m0898l4439k8199k1785j4976r053n346l192
$$ 1997349 1928292 1868102 1815023 1767923 1727025 1692586 1664387 1642602 1627626 1618573 1613227 1610035
50609A610035q89J931M388O303Q476J1214J3979J6467J8830K0982K2744K4601
$$ 1610035 1609146 1611077 1615465 1621768 1630244 1641458 1655437 1671904 1690734 1711716 1734460 1759061
50597A759061K7251L0526L3730L6826M0370M4446M8646N2908N7509O2427O7505
$$ 1759061 1786312 1816838 1850568 1887394 1927764 1972210 2020856 2073764 2131273 2193700 2261205
50586B261205P2786P7813Q1202Q2188Q2157Q3159Q5176Q6146Q4545Q0527P4727
$$ 2261205 2333991 2411804 2493006 2575194 2657351 2740510 2825686 2911832 2996377 3076904 3151631
50575C151631O7586N9935N2593M5027L5949K5579J5871P984R83o159j2736j7448
$$ 3151631 3219217 3279152 3331745 3376772 3412721 3438300 3454171 3462155 3463138 3456979 3444243 3426795
50563C426795k0290k2225k3664k4222k3463k1207j7604j3436r708o436k456K832
$$ 3426795 3406505 3384280 3360616 3336394 3312931 3291724 3274120 3260684 3250976 3244540 3242084 3244916
50551C244916Q112J1209J1237R072N908J734m631j4127k6127l8846n1230o3586
$$ 3244916 3253028 3264237 3275474 3284546 3290454 3292188 3287557 3273430 3247303 3208457 3157227 3093641
50539C093641p5711q5542r1220r3871r6251r8792r9109r5830r0550q5084p9114
$$ 3093641 3017930 2932388 2841168 2747297 2651046 2552254 2453145 2357315 2266765 2181681 2102567
50528B102567p2063o5315o0536n7048n2987m8116m3567l9554l5443l1565k8856
$$ 2102567 2030504 1965189 1904653 1847605 1794618 1746502 1702935 1663381 1627938 1596373 1567517
50517A567517k6749k3443j8437j3054q184l271J991O614R781J2067J4400J6778
$$ 1567517 1540768 1517325 1498888 1485834 1477650 1474379 1476370 1482984 1492765 1504832 1519232 1536010
50505A536010J8770K0336K1548K2322K3005K4325K6193K7609K8436L0125L3523
$$ 1536010 1554780 1575116 1596664 1618986 1641991 1666316 1692509 1720118 1748554 1778679 1812202
50494A812202L6961L8139L7456L7761M0727M4911M7881M8965M9257M9920N1544
$$ 1812202 1849163 1887302 1924758 1962519 2003246 2048157 2096038 2145003 2194260 2244180 2295724
50483B295724N4570N9324O5683P3311Q2034R1408J00318J07908J14911J23090
$$ 2295724 2350294 2409618 2475301 2548612 2630646 2722054 2822372 2930280 3045191 3168281
50473C168281J33177J44166J54867J65186J75206J83893J89807J92680J93360
$$ 3168281 3301458 3445624 3600491 3765677 3940883 4124776 4314583 4507263 4700623
50464D700623J92358J89347J84014J76315J65657J50812J31172J07628Q1740N4489
$$ 4700623 4892981 5082328 5266342 5442657 5608314 5759126 5890298 5997926 6079666 6134155
50454F134155K6257k349l0170n6019p9266r9805j17414j31213j40090j43817j43263
$$ 6134155 6160412 6158063 6127893 6071874 5992608 5892803 5775389 5644176 5504086 5360269 5217006
50443E217006j39145j31196j19240j04431q8297p0992n1848l1614j2591L664J7165
$$ 5217006 5077861 4946665 4827425 4722994 4634697 4563705 4511857 4480243 4467652 4471316 4488481
50432D488481K7602L3323L3197K7998J8626M274j6016m0832o7133r2980j17705
$$ 4488481 4516083 4549406 4582603 4610601 4629227 4633501 4617485 4576653 4509520 4416540 4298835
50421D298835j39703j56145j65559j69301j69782j68166j64430j58649j51387
$$ 4298835 4159132 4002987 3837428 3668127 3498345 3330179 3165749 3007100 2855713
50412B855713j43065j33710j23347j12545j02415r3774q6056p7584o7634n7719
$$ 2855713 2712648 2578938 2455591 2343046 2240631 2146857 2060801 1983217 1915583 1857864
50402A857864m9873m3903l7627k9926k2299j6779j3359j0354o552k107K238N830
$$ 1857864 1807991 1764088 1726461 1696535 1674236 1657457 1644098 1633744 1627192 1625085 1627323 1633153
50390A633153Q209R542J0967J3675J7315K0098K0957K1020K2026K3678K3788K1407
$$ 1633153 1641362 1650904 1661871 1675546 1692861 1712959 1733916 1754936 1776962 1800640 1824428 1845835
50378A845835J8544J7683J8414J8144J6027J4322J5181J7696J9460J9909K0565
$$ 1845835 1864379 1882062 1900476 1918620 1934647 1948969 1964150 1981846 2001306 2021215 2041780
50367B041780K2446K4900K6906K8235K9248L0763L4115L9924M6612N1545N4310
$$ 2041780 2064226 2089126 2116032 2144267 2173515 2204278 2238393 2278317 2324929 2376474 2430784
50356B430784N7517O3549P1568P8809Q3889Q7577R0738R2950R3282R1451Q7785
$$ 2430784 2488301 2551850 2623418 2702227 2786116 2873693 2964431 3057381 3150663 3242114 3329899
50345C329899Q2607P5989O7949N8624M8226L6627K3140P155j0760k8906m5929
$$ 3329899 3412506 3488495 3556444 3615068 3663294 3699921 3723061 3730216 3719456 3690550 3644621
50334C644621o1813p6915r0506j00938j07045j08882j07352j03761r9354r4398
$$ 3644621 3582808 3505893 3415387 3314449 3207404 3098522 2991170 2887409 2788055 2693657
50324B693657q7720p8037o5803n2963m0752k8816j6908o311J490O784J0948J3997
$$ 2693657 2605937 2527900 2462097 2409134 2368382 2339566 2322658 2316347 2317837 2324621 2335569 2349566
50312B349566J4136J0055K546o705j6966k8166l9421m9173n6829o3265o9222p3951
$$ 2349566 2363702 2373757 2376303 2369598 2352632 2324466 2285045 2235872 2179043 2115778 2046556 1972605
50300A972605p6040p5160p2445o9255o6148o2950n9304n4957m9906m4590l9755
$$ 1972605 1896565 1821405 1748960 1679705 1613557 1550607 1491303 1436346 1386440 1341850 1302095
50289A302095l5816l2442k9017k5458k2230j9462j6528j2832q838n664l631j709
$$ 1302095 1266279 1233837 1204820 1179362 1157132 1137670 1121142 1108310 1099472 1093808 1090177 1088468
50277A088468J236N054Q499J0551J1142J0877J0516J0658J1408J2284J2729J2638
$$ 1088468 1089704 1094758 1103257 1113808 1124950 1135827 1146343 1157001 1168409 1180693 1193422 1206060
50265A206060J2129J1191J0084R729J0780J2444J3122J2319J0895R391P354M802
$$ 1206060 1218189 1229380 1239464 1249193 1259973 1272417 1285539 1297858 1308753 1318144 1325498 1330300
50253A330300L017K851L362L309L217M423O651Q054P723O670N999N481M417K837
$$ 1330300 1333317 1336168 1339530 1342839 1346056 1350479 1357130 1365184 1372907 1379577 1385576 1391057 1395474 1398311
50239A398311J075r57l282n148n700n201m983o132q480j0852j2151j2234j1792
$$ 1398311 1399386 1398429 1395147 1389999 1384299 1379098 1374115 1367983 1359503 1348651 1336500 1324266 1312474
50226A312474j1354j0673r491q496q777j0194j1152j0365q477p497q886j2342
$$ 1312474 1301120 1290447 1280956 1272460 1263683 1253489 1242337 1231972 1223495 1215998 1207112 1194770
50214A194770j6054j8089j7983j7123j7047j7374j6195j2806q963o701n791m494
$$ 1194770 1178716 1160627 1142644 1125521 1108474 1091100 1074905 1062099 1053136 1046435 1040644 1036150
50202A036150k285m94k34r82j574j692j633j247PJ955L192K076j583n918q454
$$ 1036150 1033865 1033371 1033137 1032155 1030581 1028889 1027256 1026009 1026016 1027971 1031163 1033239 1031656 1025738 1017284
50187A017284q511p825q342r830j0536j0053j0177j2359j5449j7181j7225j7366
$$ 1017284 1008773 1000948 992606 982776 972240 962187 952010 939651 924202 907021 889796 872430
50175H72430j8628j9670j8624j5617j2531j0729r932r315q775q730r128r275q751
$$ 872430 853802 834132 815508 799891 787360 776631 766699 757384 748609 739879 730751 721476 712725
50162G12725q011p772p935p549o033m065k937l220m392n561o049n462l916k282
$$ 712725 704714 696942 689007 681458 675425 671360 668423 665203 660811 655250 649201 643739 639823 637541
50148F37541j635k120k808k809k062j014k47n35k349m876o413o313n651n367m967
$$ 637541 635906 633786 630978 628169 626107 625093 624846 624311 621962 617086 610673 604360 598709 593342 588375
50133E88375m037l821n612q370r782r327q480p978o935m879k840j820j641j788
$$ 588375 584338 580517 574905 566535 556753 547426 538946 530968 524033 519154 516314 514494 512853 511065
50119E11065j864q66K187O229Q684Q891R185J1371J4070J5163J5122J5909J7824
$$ 511065 509201 508335 510522 516751 525435 534326 543511 554882 568952 584115 599237 615146 632970
50106F32970J9551K0550K1414K2457K3582K4963K6248K5895K3090J9601J7773
$$ 632970 652521 673071 694485 716942 740524 765487 791735 817630 840720 860321 878094
50095H78094J7373J6490J4847J3836J3628J2901J1498J0695J0421Q699M584m99
$$ 878094 895467 911957 926804 940640 954268 967169 978667 989362 999783 1008482 1013066 1012567
50083A012567n131r440j3470j6284j7697j8893k0106j9698j6902j3580j1766j1105
$$ 1012567 1007436 997996 984526 968242 950545 931652 911546 891848 874946 861366 849600 838495
50071H38495j0350r667r666r605q556p162o337n292l022r00j327m067o055n074
$$ 838495 828145 818478 808812 799207 790651 783489 777152 771860 768838 767938 766611 762544 756489 751415
50057G51415j919J207L039L706M137N291P223Q871R433R469R982J1037J2225J3656
$$ 751415 749496 750703 753742 757448 761585 766876 774099 782970 792403 801872 811854 822891 835116 848772
50043H48772J5359J6560J6938J7698J9662K1188K0136J7331J5636J5777J5668
$$ 848772 864131 880691 897629 915327 934989 956177 976313 993644 1009280 1025057 1040725
50032A040725J4248J3196J3801J4466J2949R508O252M458L850L587K728N22k627
$$ 1040725 1054973 1068169 1081970 1096436 1109385 1118893 1125145 1129603 1133453 1137040 1139768 1140290 1137663
50019A137663n124o000o111o714p680p899o669l831N13N361Q659R094P630O340
$$ 1137663 1132539 1126539 1120428 1113714 1106034 1098135 1091466 1087635 1088148 1093509 1102168 1111262 1118892 1125232
50005A125232O201P049Q915J1973J5457J8081J9676K1261K3351K5130K5633K5007
$$ 1125232 1131433 1138482 1147397 1159370 1174827 1192908 1212584 1233845 1257196 1282326 1307959 1332966
49993A332966K4339K4725K6549K9232L1582L2791L3022L2770L2143L1168L0139
$$ 1332966 1357305 1382030 1408579 1437811 1469393 1502184 1535206 1567976 1600119 1631287 1661426
49982A661426K8991K6859K3300J9471J6856J5267J3272J0445P711N507L177L16
$$ 1661426 1690417 1717276 1740576 1760047 1776903 1792170 1805442 1815887 1823598 1829105 1832282 1832598
49970A832598k897p097j3626k2123k9878l4881l8259m2215m6719n0002n1438n1975
$$ 1832598 1829701 1822604 1808978 1786855 1756977 1722096 1683837 1641622 1594903 1544901 1493463 1441488
49958A441488n1970n0641m7948m5284m3680m2590m1086l9185l7295l5320l3170
$$ 1441488 1389518 1338877 1290929 1245645 1201965 1159375 1118289 1079104 1041809 1006489 973319
49947I73319l1421l0600l0072k8510k5479k2114k0106k0113k1071k1140j9516
$$ 973319 941898 911298 881226 852716 827237 805123 785017 764904 743833 722693 703177
49936G03177j7062j5045j3665j2506j1773j1928j2375j2006j1148j1423j3108
$$ 703177 686115 671070 657405 644899 633126 621198 608823 596817 585669 574246 561138
49925E61138j4195j3011j0418q309p108o149n484n632o175o209n857n799n693
$$ 561138 546943 533932 523514 515205 508097 501948 496464 490832 484657 478448 472591 466792 461099
49912D61099m692l284k839l319l279k322j741k198k620k188j730k040k293j446
$$ 461099 456407 453123 450284 446965 443686 441364 439623 437425 434805 432617 430887 428847 426554 425108
49898D25108L1J159K075L155L485J987l86j336p7J966L299L897M353M713M751
$$ 425108 425139 426298 428373 431528 435013 437000 436614 435278 435201 437167 440466 444363 448716 453429 458180
49883D58180M558M563N298P101R414J0607R571P523P196R901J4235J8031K0578
$$ 458180 462738 467301 472599 479700 489114 499721 509292 516815 524011 533912 548147 566178 586756
49870E86756K2501K4390K6433K8778L1332L3421L4309L3910L2449K9745K5530
$$ 586756 609257 633647 660080 688858 720190 753611 787920 821830 854279 884024 909554
49859I09554K0434J5817J2501J0237Q725Q400R524J0874J0368P271K955j045n149
$$ 909554 929988 945805 958306 968543 977268 985668 995192 1006066 1016434 1023705 1026660 1025615 1020466
49846A020466j0925j8511k5928l1227l4307l6150l7199l7284l6475l4908l2194
$$ 1020466 1009541 991030 965102 933875 899568 863418 826219 788935 752460 717552 685358
49835F85358k8067k3527k0245j8698j7817j6590j5034j3340j1226q807p138o927
$$ 685358 657291 633764 613519 594821 577004 560414 545380 532040 520814 512007 504869 497942
49823D97942p174o272m188k576k634l717m487m639m857n419n633m810l246j819
$$ 497942 490768 484496 480308 477732 475098 471381 466894 462255 457398 451979 446346 441536 438290 436471
$$ [...]
##END NTUPLES=NMR SPECTRUM
##END=
