
##TITLE=AC1226_COLAHDE102_6540771_dcgXNF0Grt
##JCAMPDX= 6.0         $$ Bruker NMR JCAMP-DX V2.0
##DATA TYPE= NMR SPECTRUM
##DATA CLASS= NTUPLES
##ORIGIN= BRUKER
##OWNER= Administrator
$$ 1.72 TOPSPIN		Version 2.1
$$ 2012-07-18 02:13:40.859 -0500  Administrator@TOPSPIN
$$ Compression mode = diff/dup
##.OBSERVE FREQUENCY= 400.02188249412
##.OBSERVE NUCLEUS= ^1H
##.ACQUISITION MODE= SIMULTANEOUS (DQD)
##.ACQUISITION SCHEME= undefined
##.AVERAGES= 8
##.DIGITISER RES= 22
##SPECTROMETER/DATA SYSTEM= spect
##.PULSE SEQUENCE= zg30
##.SOLVENT NAME= COFFEE_meoh
##.SHIFT REFERENCE= INTERNAL, COFFEE_meoh, 1, 14.98509
##AUDIT TRAIL= $$ (NUMBER, WHEN, WHO, WHERE, PROCESS, VERSION, WHAT)
$$ ##TITLE= Audit trail, TOPSPIN		Version 2.1
$$ ##JCAMPDX= 5.01
$$ ##ORIGIN= Bruker BioSpin GmbH
$$ ##OWNER= Administrator
$$ $$ C:\Bruker\TOPSPIN/data/COFFEE/nmr/AC1226_COLAHDE102_6540771_dcgXNF0Grt/10/pdata/1/auditp.txt
$$ ##AUDIT TRAIL=  $$ (NUMBER, WHEN, WHO, WHERE, PROCESS, VERSION, WHAT)
(   1,<2012-07-18 02:13:34.000 -0500>,<Administrator>,<TOPSPIN>,<go>,<TOPSPIN 2.1>,
      <created by zg
	started at 2012-07-18 02:12:27.437 -0500,
	POWCHK enabled, PULCHK disabled,
       configuration hash MD5:
       6B 1B 68 BB D9 2E 58 E2 7F 35 AD 54 07 DF 0E 41
       data hash MD5: 64K
       47 B1 77 E9 1C F6 45 80 6B 0C 61 1D CD F3 C8 CE>)
(   2,<2012-07-18 02:13:36.656 -0500>,<Administrator>,<TOPSPIN>,<proc1d>,<TOPSPIN 2.1>,
      <Start of raw data processing
       efp LB = 0 FT_mod = 6 PKNL = 1 PHC0 = 0 PHC1 = 0 SI = 32K 
       data hash MD5: 32K
       B3 DC 52 ED 4E D4 FC 30 68 00 26 08 BD F5 19 11>)
(   3,<2012-07-18 02:13:37.046 -0500>,<Administrator>,<TOPSPIN>,<proc1d>,<TOPSPIN 2.1>,
      <pk PHC0 = 181.2469 PHC1 = 0 
       data hash MD5: 32K
       0F 46 96 D9 0F DE F9 86 63 66 39 CB E3 62 A1 86>)
(   4,<2012-07-18 02:13:37.171 -0500>,<Administrator>,<TOPSPIN>,<proc1d>,<TOPSPIN 2.1>,
      <abs ABSG = 1 
       data hash MD5: 32K
       A1 3F 59 A3 2F AD 57 FF 5D 3F BD BA 07 26 46 F5>)
(   5,<2012-07-18 02:13:37.203 -0500>,<Administrator>,<TOPSPIN>,<proc1d>,<TOPSPIN 2.1>,
      <abs ABSG = 2 
       data hash MD5: 32K
       C7 65 11 29 9A F2 87 88 F0 CF B6 D3 1C 89 1C A3>)
(   6,<2012-07-18 02:13:37.234 -0500>,<Administrator>,<TOPSPIN>,<proc1d>,<TOPSPIN 2.1>,
      <abs ABSG = 3 
       data hash MD5: 32K
       DF 7B D2 17 FE F2 DD A0 54 EB 34 59 5B 39 3C 96>)
(   7,<2012-07-18 02:13:37.265 -0500>,<Administrator>,<TOPSPIN>,<proc1d>,<TOPSPIN 2.1>,
      <abs ABSG = 4 
       data hash MD5: 32K
       1A 65 7D 21 F6 B0 5E 1F C0 9A 24 DC 82 BC DF 0B>)
(   8,<2012-07-18 02:13:37.296 -0500>,<Administrator>,<TOPSPIN>,<proc1d>,<TOPSPIN 2.1>,
      <abs ABSG = 5 
       data hash MD5: 32K
       F5 C6 06 65 75 50 99 8F 0D B0 C2 69 96 D0 43 F2>)
$$ ##END=
$$ 
$$ $$ hash MD5
$$ $$ 6F 8F 3C E1 17 C8 CA 72 32 25 4A AD 01 EE 24 D0
##$RELAX= 
##$RELAX= 
##$RELAX= 
##$RELAX= 
##$RELAX= 
##$RELAX= 
##$RELAX= 
$$ Bruker specific parameters
$$ --------------------------
$$ [...]
150 150 150 150 150 150 150 150
##$TP07= 0
##$TPNAME0= <>
##$TPNAME1= <>
##$TPNAME2= <>
##$TPNAME3= <>
##$TPNAME4= <>
##$TPNAME5= <>
##$TPNAME6= <>
##$TPNAME7= <>
##$TPOAL= (0..7)
0.5 0.5 0.5 0.5 0.5 0.5 0.5 0.5
##$TPOFFS= (0..7)
0 0 0 0 0 0 0 0
##$TUNHIN= 0
##$TUNHOUT= 0
##$TUNXOUT= 0
##$USERA1= <user>
##$USERA2= <user>
##$USERA3= <user>
##$USERA4= <user>
##$USERA5= <user>
##$V9= 5
##$VALIST= <valist>
##$VCLIST= <CCCCCCCCCCCCCCC>
##$VD= 0
##$VDLIST= <DDDDDDDDDDDDDDD>
##$VPLIST= <PPPPPPPPPPPPPPP>
##$VTLIST= <TTTTTTTTTTTTTTT>
##$WBST= 2048
##$WBSW= 25
##$XGAIN= (0..3)
0 0 0 0
##$XL= 0
##$YL= 0
##$YMAX_a= 509145
##$YMIN_a= -649963
##$ZGOPTNS= <>
##$ZL1= 120
##$ZL2= 120
##$ZL3= 120
##$ZL4= 120
##$ABSF1= 14.98509
##$ABSF2= -5.573092
##$ABSG= 5
##$ABSL= 3
##$ALPHA= 0
##$AQORDER= 0
##$ASSFAC= 0
##$ASSFACI= 0
##$ASSFACX= 0
##$ASSWID= 0
##$AUNMP= <proc_prof1d_extract_pilot.lims>
##$AXLEFT= 0
##$AXNAME= <>
##$AXNUC= <1H>
##$AXRIGHT= 0
##$AXTYPE= 0
##$AXUNIT= <>
##$AZFE= 0.1
##$AZFW= 0.1
##$BCFW= 0
##$BC_mod= 0
##$BYTORDP= 0
##$COROFFS= 0
##$CY= 15
##$DATMOD= 1
##$DC= 0
##$DFILT= <>
##$DTYPP= 0
##$F1P= 0
##$F2P= 0
##$FCOR= 0.5
##$FTSIZE= 32768
##$FT_mod= 6
##$GAMMA= 0
##$GB= 0
##$INTBC= 1
##$INTSCL= 1
##$ISEN= 128
##$LB= 0
##$LEV0= 0
##$LPBIN= 0
##$MAXI= 10000
##$MC2= 0
##$MEAN= 0
##$ME_mod= 0
##$MI= 0
##$NCOEF= 0
##$NC_proc= -8
##$NLEV= 6
##$NOISF1= 0
##$NOISF2= 0
##$NSP= 0
##$NTH_PI= 0
##$NZP= 0
##$OFFSET= 14.98509
##$PC= 1
##$PHC0= 181.2469
##$PHC1= 0
##$PH_mod= 1
##$PKNL= yes
##$PPARMOD= 0
##$PPDIAG= 0
##$PPIPTYP= 0
##$PPMPNUM= 2147483647
##$PPRESOL= 1
##$PSCAL= 4
##$PSIGN= 0
##$PYNMP= <proc.py>
##$REVERSE= no
##$SF= 400.02
##$SI= 32768
##$SIGF1= 0
##$SIGF2= 0
##$SINO= 400
##$SIOLD= 32768
##$SPECTYP= <>
##$SREGLST= <1H.CDCl3>
##$SSB= 0
##$STSI= 32768
##$STSR= 0
##$SW_p= 8223.68421052631
##$SYMM= 0
##$S_DEV= 0
##$TDeff= 65536
##$TDoff= 0
##$TI= <>
##$TILT= no
##$TM1= 0
##$TM2= 0
##$TOPLEV= 0
##$USERP1= <user>
##$USERP2= <user>
##$USERP3= <user>
##$USERP4= <user>
##$USERP5= <user>
##$WDW= 1
##$XDIM= 32768
##$YMAX_p= 467843177
##$YMIN_p= -695033
##$CURPLOT= <Network HP LaserJet P1505>
##$CURPRIN= <$Network HP LaserJet P1505>
##$DFORMAT= <normdp>
##$LAYOUT= <+/1D_H.xwp>
##$LFORMAT= <normlp>
##$PFORMAT= <normpl>
##$SURQMSG= 1
$$ End of Bruker specific parameters
$$ ---------------------------------
##NTUPLES= NMR SPECTRUM
##VAR_NAME=  FREQUENCY,     SPECTRUM/REAL,   SPECTRUM/IMAG
##SYMBOL=    X,             R,               I
##VAR_TYPE=  INDEPENDENT,   DEPENDENT,       DEPENDENT
##VAR_FORM=  AFFN,          ASDF,            ASDF
##VAR_DIM=   32768,         32768,           32768
##UNITS=     HZ,            ARBITRARY UNITS, ARBITRARY UNITS
##FACTOR=    0.250966925370066, 1,           1
##FIRST=     8223.43324360094, -67177,       157595
##LAST=      0,             -2522,           -108610
##MIN=       0,             -695033,         0
##MAX=       8223.43324360094, 467843177,    0
$$ Real data points
##PAGE= N=1
##DATA TABLE= (X++(R..R)), XYDATA
$$ [...]
19542c29959A309J40119g3265b2085k24382B73884A08555b06387A51607J4708
$$ -329959 1309 141428 -73265 -22085 -246467 273884 108555 -206387 151607 166315
19532A66315d0281a4262j1348h097B30658g0748J9966n4235c0814j73181O9691
$$ 166315 -40281 -14262 -25610 -8097 230658 -70748 -50782 -105017 -30814 -203995 -134304
19521a34304n120A10791a6743A09249M3943e2300k06386C0157N9524f4187k07601
$$ -134304 -139424 110791 -16743 109249 153192 -52300 -258686 30157 89681 -64187 -271788
19510b71788O8357A86848C3282J23302f4685A75991c26018J23500A29571b7590
$$ -271788 -203431 186848 33282 156584 -64685 175991 -326018 -202518 129571 -27590
19499c56279E36735c02244E0981i2089l27557g9154H8436J64421g2107M000p2310
$$ -356279 536735 -302244 50981 -92089 -419646 -79154 88436 252857 -72107 -68107 -140417
19488a40417I9855e0013j16272i124B00431A167K64018c9170j00100O0757l11404
$$ -140417 99855 -50013 -166285 -9124 200431 1167 265185 -39170 -139270 -78513 -389917
19477c89917a87663b4033A77602J33254A25812b04387K4552j38148M7588O8920
$$ -389917 -187663 -24033 177602 310856 125812 -204387 -179835 -317983 -270395 -201475
19467b01475G2639c51423a22522j95767G6040c0050k86773I0573B1891d7848j7995
$$ -201475 72639 -351423 -122522 -318289 76040 -30050 -316823 90573 21891 -47848 -65843
19456f5843K2833B095g0670o6219H4202b66328a19534A8708c59151G4724j7589
$$ -65843 -43010 2095 -70670 -136889 84202 -266328 -119534 18708 -359151 74724 57135
19445E7135a88000A51708l6558J8788a06395B43821e6697j28024A33330b3151
$$ 57135 -188000 151708 115150 133938 -106395 243821 -56697 -184721 133330 -23151
19434b32731B14820c97275I2962M7437E2378f7890A53248a12621k4056j61799
$$ -232731 214820 -397275 92962 140399 52378 -67890 153248 -112621 -136677 -298476
19424b98476M6315R4724H1383K5839b34369A56380h814A12020b12652j25350B57381
$$ -298476 -252161 -157437 81383 107222 -234369 156380 -8814 112020 -212652 -338002 257381
19412h7783L3097k31787a24717j0726o4523r2974h0568n7064F2904b64379h2371
$$ -87783 -54686 -286473 -124717 -135443 -199966 -292940 -80568 -137632 62904 -264379 -82371
19400B50168B9829b067F3503a25862d0418J6855A12811L7241N5252b02572g3650
$$ 250168 29829 -2067 63503 -125862 -40418 -23563 112811 150052 205304 -202572 -73650
19388d2433r8342A92422a3966j14467b5819l89318c0293j814m02874a57381j33906
$$ -42433 -140775 192422 -13966 -128433 -25819 -415137 -30293 -32107 -434981 -157381 -291287
19377b91287J40391q0774d8485J1535H0266C7564a22871d4291k27876J03504k50522
$$ -291287 -150896 -231670 -48485 -36950 80266 37564 -122871 -44291 -272167 -168663 -419185
19366d19185a79041e395D3969P3336m6127a23189K0254d5811k6330J9649k0687
$$ -419185 -179041 -5395 43969 117305 71178 -123189 -102935 -45811 -72141 -52492 -73179
19355g3179G5094l1290d0678k85275a60667H4251l4064M1906a06621B02278a70337
$$ -73179 75094 43804 -40678 -325953 -160667 84251 50187 92093 -106621 202278 -170337
19343b68009a21338a2774E5456J91022h2538n4245B18898b21092f5758A3599a01353
$$ -268009 -121338 -12774 55456 246478 -82538 -136783 218898 -221092 -65758 13599 -101353
19331b40829D2958C54K06655o7064N6922p2352A247b93647B07713a29931r2728
$$ -240829 42958 354 207009 139945 196867 124515 1247 -293647 207713 -129931 -222659
19320b22659R7111q1081a4475j44974f0562J7689j48141P8522m0796B04932a53391
$$ -222659 -125548 -206629 -14475 -159449 -60562 -42873 -191014 -112492 -153288 204932 -153391
19308d8532j17979H638J37814b10051B00574B018c31758a57814c0618j518j65944
$$ -48532 -166511 8638 146452 -210051 200574 2018 -331758 -157814 -30618 -32136 -198080
19297a98080C03985D5759O0711e8307l36127C2478c26037H5327A2905a55494C92061
$$ -198080 303985 45759 106470 -58307 -394434 32478 -326037 85327 12905 -155494 392061
19285A18302e5857p787j49784B435a1376A75292b76153N7994P2642L2814F9347
$$ 118302 -55857 -63644 -213428 2435 -11376 175292 -276153 -218159 -145517 -112703 69347
19273c71543J84980G696b42824h3410J4948q0638e7215h237k10090f2093n1193
$$ -371543 -186563 7696 -242824 -83410 -68462 -149100 -57215 -8237 -218327 -62093 -113286
19262a13286B11471i7709j4670j37011C203d2434r1556E7960b7800j41861j0776
$$ -113286 211471 -97709 -112379 -249390 3203 -42434 -133990 57960 -27800 -169661 -180437
19251a80437Q8924l9109E9162M465Q9120d3669k27519A8983a49389j30959A5998
$$ -180437 -91513 -130622 59162 63627 152747 -43669 -271188 18983 -149389 -280348 15998
19239a23751K8722k94315A05981K5979D0563b34832b2830p1880n0351A95598a63708
$$ -123751 -95029 -389344 105981 131960 40563 -234832 -22830 -94710 -145061 195598 -163708
19227H0805b7351r9711A21066a40803l7224H7410O6972o8711Q7768G1861h0081
$$ 80805 -27351 -127062 121066 -140803 -178027 87410 154382 85671 173439 71861 -80081
19215f8951A85806k7191g2173B33964d25588g9357J4215k153j06600P7806c3594
$$ -68951 185806 158615 -72173 233964 -425588 -79357 -65142 -67295 -173895 -96089 -33594
19203C80262a19298j0714j21182O0175k00717h7742G3156e1487n4302c173B83442
$$ 380262 -119298 -130012 -251194 -191019 -391736 -87742 73156 -51487 -105789 -3173 283442
19191B37048d81426b19789h4502l069A61985k0713b07580G4471g9815B45153B411
$$ 237048 -481426 -219789 -84502 -87571 161985 141272 -207580 74471 -79815 245153 2411
19179B38254b77182l0612b4332f2j63579n2792H2575G09d950B6221b06303O0182
$$ 238254 -277182 -307794 -24332 -62 -163641 -216433 82575 709 -4950 26221 -206303 -146121
19167a46121A64441a54630A2580K37856b18735I3173i0622J4970j08967J2762
$$ -146121 164441 -154630 12580 250436 -218735 93173 -90622 -75652 -184619 -171857
19157a71857L7589d6993j32595B0586b9069j55786f1647j67377p249A224i4288
$$ -171857 -134268 -46993 -179588 20586 -29069 -184855 -61647 -229024 -236273 1224 -94288
19145A02318L6658b3447j24830c0476B76691l7030f9866A12468a06691A91192
$$ 102318 138976 -23447 -148277 -30476 276691 239661 -69866 112468 -106691 191192
19134H6136C6025J7992a34563B29850a84082r0501j20900g2145p5255l2697n2116
$$ 86136 36025 54017 -134563 229850 -184082 -274583 -395483 -72145 -147400 -180097 -232213
19123b32213A3852L718O590c6484I820d708k89002H9430i5387B3097j1357K45457
$$ -232213 13852 17570 24160 -36484 9820 -4708 -293710 89430 -95387 23097 11740 257197
19111B57197A02264J81198E6599a60554n9097P1409C27987i084k21084K8359P652
$$ 257197 102264 283462 56599 -160554 -219651 -148242 327987 -9084 -230168 -201809 -194157
19100a94157A00807a1180A50829a8730k2175J9876H7695O7601b66939j07325A99793
$$ -194157 100807 -11180 150829 -18730 -40905 -21029 87695 155296 -266939 -374264 199793
19088C4541a19198m11382A01263b36596k42738d9377j35702j3234j5352M9849
$$ 34541 -119198 -530580 101263 -236596 -479334 -49377 -185079 -198313 -213665 -163816
19078a63816A78975N367a1807j2935B7722b41359J13132B118c0711j80353c8369
$$ -163816 178975 184342 -11807 -24742 27722 -241359 -128227 2118 -30711 -211064 -38369
19066i0119q5609A79075a79323B39348F5049J8481a24073B33448E9409J04761
$$ -90119 -175728 179075 -179323 239348 65049 83530 -124073 233448 59409 164170
19056A64170a51383O1169k45555a361n3857m9889B10510c3039c728m9900k1374
$$ 164170 -151383 -90214 -335769 -1361 -55218 -105107 210510 -33039 -3728 -53628 -75002
19045g5002o8333B24315E6513k2112J4733J78191d2964k91927A03462L6635b48536
$$ -75002 -143335 224315 56513 34401 49134 227325 -42964 -334891 103462 140097 -248536
19033B61465a97279A59921i4574D5778b00999B34817J02192A39507D6329L0371
$$ 261465 -197279 159921 -94574 45778 -200999 234817 337009 139507 46329 76700
19023G6700l389c0045n6893C1750F196a7592l09413B1530J9453K11372N757j01941
$$ 76700 73311 -30045 -86938 31750 6196 -17592 -327005 21530 40983 252355 258112 156171
19011A56171a50689A99503D2818e0107j63076F3504c0727A55659e3806A1568a77878
$$ 156171 -150689 199503 42818 -50107 -213183 63504 -30727 155659 -53806 11568 -177878
18999b82438C4236g6520F4584b14641J0328B6953J76560b52141B51040A0433J8087
$$ -282438 34236 -76520 64584 -214641 -204313 26953 203513 -252141 251040 10433 28520
18988B8520f0678k0936j19273L5938E9201b4455m00002e5357C76216c38259A1875
$$ 28520 -60678 -81614 -200887 -164949 59201 -24455 -424457 -55357 376216 -338259 11875
18976c40800B37920I6472J49288e7110K5701A75725K6630c34196J46137L0110
$$ -340800 237920 96472 245760 -57110 -31409 175725 202355 -334196 -188059 -157949
18966a57949H8133Q4468b65108J06381f2242C28938j07822H9299b24127A34324
$$ -157949 88133 172601 -265108 -158727 -62242 328938 221116 89299 -224127 134324
18955B3727H280b42729l7020e7428k50931A09044a13954K7312A08274b78286A93661
$$ 23727 8280 -242729 -279749 -57428 -308359 109044 -113954 -86642 108274 -278286 193661
18943d654m5758D4970A0730N5213a29305M9903k1089B84899I7001b06145R8367
$$ -4654 -50412 44970 10730 65943 -129305 -79402 -100491 284899 97001 -206145 -107778
18932a07778F4216Q386d26350F1439L09070b77846A96557d9849A11781a2365l60186
$$ -107778 64216 72602 -426350 61439 370509 -277846 196557 -49849 111781 -12365 -372551
18921c72551F7490A8666P6979Q6070p4281c09453C16498b48413E8458b28103C3073
$$ -372551 67490 18666 95645 181715 107434 -309453 316498 -248413 58458 -228103 33073
18909b78057q5980B37223b04517h6252m808K355F9721a58439G6995N473i9106
$$ -278057 -364037 237223 -204517 -86252 -91060 -88705 69721 -158439 76995 82468 -99106
18897A3892b25358K7362b9672m5191k79329J26538G8783b87677a41016j36301
$$ 13892 -225358 -197996 -29672 -74863 -354192 -227654 78783 -287677 -141016 -277317
18887b77317b3617m7329B18551a52586F7511B255K24811a80555m2301c4094l72049
$$ -277317 -23617 -70946 218551 -152586 67511 2255 227066 -180555 -222856 -34094 -406143
18876d06143A76852d3418j94826B0593C15h660j59516E0313J58975a35364H2029
$$ -406143 176852 -43418 -238244 20593 315 -8660 -168176 50313 209288 -135364 82029
18864D6409r219a07583B2389N3540a82010A80643G8787d4731B23692m8774l7405
$$ 46409 37190 -107583 22389 75929 -182010 180643 78787 -44731 223692 174918 137513
18853A37513m4047b90880a32283Q055A31247h3133E626b33580m521a16300A7902
$$ 137513 93466 -290880 -132283 -124228 131247 -83133 5626 -233580 -238101 -116300 17902
18841A29810j2852i6036j85644B24300m4275Q3826b3040l36168J63118l54671
$$ 129810 116958 -96036 -281680 224300 180025 263851 -23040 -359208 -196090 -550761
18831e50761h545q2690l01254A46880a65325j63048a43816B9016f3590k3037A63564
$$ -550761 -8545 -91235 -392489 146880 -165325 -328373 -143816 29016 -63590 -86627 163564
18819A13873C5510j45L79929A234N5365R4715F4265K38802g1358A1474c4559B54531
$$ 113873 35510 35365 415294 1234 56599 151314 64265 303067 -71358 11474 -34559 254531
18806a70538g9690k44373H4990K19059b71143h8966j33230J10282j18141E5564
$$ -170538 -79690 -324063 84990 304049 -271143 -88966 -222196 -111914 -230055 55564
18795C4399K16446l4788B420J48709b84581R9076j50721K5177a46010k4532K4448
$$ 34399 250845 216057 2420 151129 -284581 -185505 -336226 -311049 -146010 -170542 -146094
18784a46094A3132b7582j74111A21701c52718N4272R4619p7791a27421A39091
$$ -146094 13132 -27582 -201693 121701 -352718 -298446 -203827 -281618 -127421 139091
18773a73273r6347A28200J77113a7401E227d4794k53757A55070a2146o1937n6812
$$ -173273 -269620 128200 305313 -17401 5227 -44794 -298551 155070 -12146 -74083 -130895
18762a30895N3258A84348D9556a7978j80487N8692b7184q4460M4347p6366A7101
$$ -130895 -77637 184348 49556 -17978 -198465 -139773 -27184 -111644 -67297 -143663 17101
18750g4137k86526a08196d7014I3627O3041p6125d6163J7383B1002c88472E7875
$$ -74137 -360663 -108196 -47014 93627 156668 80543 -46163 -28780 21002 -388472 57875
18738f9414A0288O9576n835a70442k54766h5450j45616B96768H6214a95599P8306
$$ -69414 10288 79864 74029 -170442 -425208 -85450 -231066 296768 86214 -195599 -117293
18727a17293A95433j3200l4871c2813j87493f4658j29464m1498R6787A55020C7810
$$ -117293 195433 182233 147362 -32813 -220306 -64658 -194122 -235620 -138833 155020 37810
18715b09091H7556e325j87511A47860b4219j2253j82611E7749c06819J10658B23961
$$ -209091 87556 -5325 -192836 147860 -24219 -36472 -219083 57749 -306819 -196161 223961
18703B69354B1634c7188l44744F1452J09398a53694D84870a78343j06168B05499
$$ 269354 21634 -37188 -381932 61452 170850 -153694 484870 -178343 -284511 205499
18692a73683j02876C395g0558r3875M7991a4068B16941b09167J2288A33959j1994
$$ -173683 -276559 3395 -70558 -164433 -116442 -14068 216941 -209167 -196879 133959 121965
18681A21965a67917L9927j49062l935A9927e3733A52025G1921R561K99187o9454
$$ 121965 -167917 -127990 -277052 -280987 19927 -53733 152025 71921 81482 380669 311215
18670C11215a80532j1546B0833f0458L098j69260A40145a57661j84460A61718
$$ 311215 -180532 -192078 20833 -60458 -57360 -226620 140145 -157661 -342121 161718
18659e6112A35521a10108H9432g0710m8608d6810B66097c09709B15343m4365q0801
$$ -56112 135521 -110108 89432 -70710 -119318 -46810 266097 -309709 215343 170978 90177
18648I0177J34433j7212K13670d30933g1954A63867L3503d06032a6234B65054
$$ 90177 224610 207398 421068 -430933 -71954 163867 197370 -406032 -16234 265054
18637a12169K4652J2768F3620j027g2080e503j11590B49870q1539c66003a20065
$$ -112169 -87517 -74749 63620 62593 -72080 -5503 -117093 249870 168331 -366003 -120065
18625a00597A03714m7135a25093D6956d03360a65880C4332c6647j65865f0368
$$ -100597 103714 56579 -125093 46956 -403360 -165880 34332 -36647 -202512 -60368
18614H1883J26749k9879o7266L3216B8204a66851m1771h5495B12509a68395B66307
$$ 81883 208632 178753 111487 144703 28204 -166851 -208622 -85495 212509 -168395 266307
18602B62828a20633l5630k7708L7163A473c6460m42308C4748P5308M3900A5641
$$ 262828 -120633 -156263 -183971 -146808 1473 -36460 -478768 34748 110056 153956 15641
18590a48988A24422b81077a07244q0423k07291C4117b2848B23950f94C658d1931
$$ -148988 124422 -281077 -107244 -187667 -394958 34117 -22848 223950 -694 3658 -41931
18578a02823C5624b40791b4542k21363B0400b02831B20350o886b65590C18823
$$ -102823 35624 -240791 -24542 -245905 20400 -202831 220350 213464 -265590 318823
18567h5063j64185C76118b55111a27097A2077L04198b57349B70427a1824j68470
$$ -85063 -249248 376118 -255111 -127097 12077 316275 -257349 270427 -11824 -180294
18557a80294H8920d19765c0436A48655a32105L8382j19357m6372d3034k26153
$$ -180294 88920 -419765 -30436 148655 -132105 -93723 -213080 -259452 -43034 -269187
18547b69187E2502f028C4122b67574R0483k06967D4258K10980P5858c0157l6874
$$ -269187 52502 -6028 34122 -267574 -177091 -384058 44258 255238 331096 -30157 -67031
18536f7031G562J82858a25970r4394r0481J36393D8821a06714A57643a40796K3812
$$ -67031 7562 190420 -125970 -220364 -310845 -174452 48821 -106714 157643 -140796 -116984
18525a16984p3608B30769d68940a41545q51N7143f362B6419J34667a9073k02601
$$ -116984 -190592 230769 -468940 -141545 -142396 -85253 -6362 26419 161086 -19073 -221674
18514b21674a09483D0293a44711a6021B37441Q76A02552L09802c634k81461L421
$$ -221674 -109483 40293 -144711 -16021 237441 238317 102552 412354 -3634 -285095 -281674
18503b81674L7337k23152g2018L3758j63827b1850k21839j66684B9498b27341
$$ -281674 -244337 -467489 -72018 -38260 -202087 -21850 -243689 -410373 29498 -227341
18492C43183a00721a1410A8297M7389J59221g7096C06474b09303A68192k4566
$$ 343183 -100721 -11410 18297 65686 224907 -77096 306474 -209303 168192 143626
18482A43626c08657i2676E1141M4874c22528B31970L1078C5501d2040J6409j44942
$$ 143626 -308657 -92676 51141 96015 -322528 231970 263048 35501 -42040 -25631 -170573
18471a70573F9327b21966M9996e7842E34129a77051K4622M6567j30682B16413
$$ -170573 69327 -221966 -171970 -57842 534129 -177051 -152429 -105862 -236544 216413
18460A05540a92593a2809l3525A70524a34596j01347H817J92199d046A49675a69688
$$ 105540 -192593 -12809 -46334 170524 -134596 -235943 8817 201016 -4046 149675 -169688
18448A81846q485l1416h4221D18051H0865a30915M1769j5334b063j8850k95654
$$ 181846 173361 141945 -84221 418051 80865 -130915 -89146 -104480 -2063 -20913 -316567
18437c16567h9979m4201A10049h3620E662d8645B23212a34726d6056H0241b53856
$$ -316567 -89979 -134180 110049 -83620 5662 -48645 223212 -134726 -46056 80241 -253856
18425a36915H5061B7970b63444A82539r0349a20675A64192a89586D9842c62738
$$ -136915 85061 27970 -263444 182539 92190 -120675 164192 -189586 49842 -362738
18414a77026I9758b17308B97396H6594J13858l5440I162K97967D8634i3469F7297
$$ -177026 99758 -217308 297396 86594 200452 165012 9162 307129 48634 -93469 67297
18402c29294A0976g4578l7789n5634l381B15119E3214a5179A80819o1239a56506
$$ -329294 10976 -74578 -112367 -168001 -171382 215119 53214 -15179 180819 119580 -156506
18390b05434Q3308C30326A02127m9877B3595J78789p9032A9706J24948h4414J7774
$$ -205434 -122126 330326 102127 52250 23595 202384 123352 19706 144654 -84414 -66640
18379f6640A00332i2183j25570A72131h7820L8571C47787b2988j52238A45686
$$ -66640 100332 -92183 -217753 172131 -87820 -49249 347787 -22988 -175226 145686
18368A70692a05890k2815M8702B34342e4541k37023E4429h8322o2376c2054n4823
$$ 170692 -105890 -128705 -80003 234342 -54541 -291564 54429 -88322 -150698 -32054 -86877
18357h6877E561N923h7964j78859P6611j56446L7245A19190i4641j21181B768
$$ -86877 5561 11484 -87964 -266823 -190212 -346658 -309413 119190 -94641 -215822 2768
18345a78547c3759A39400c15275M2054H6272N0033a4019A06586A9900c14396H0889
$$ -178547 -33759 139400 -315275 -273221 86272 136305 -14019 106586 19900 -314396 80889
18333a46104j19838J29553O2876k5963A78771a70341h1988j39214M2088P3574
$$ -146104 -265942 -136389 -73513 -99476 178771 -170341 -81988 -221202 -179114 -105540
18323a05540G1580a52942c3946k12444J1795A97609P6667j30308n2993b42652
$$ -105540 71580 -152942 -33946 -246390 -234595 197609 274276 143968 90975 -242652
18312B26103b9135A80648c28348A35559b4387q5318A41855c56126a53227a7070
$$ 226103 -29135 180648 -328348 135559 -24387 -109705 141855 -356126 -153227 -17070
18301I832J03210J64242D5772L779h4591B06503A00316b55428d1589j3867J5012
$$ 9832 113042 277284 45772 49551 -84591 206503 100316 -255428 -41589 -55456 -40444
18290d0444A39530n9985c90559h3157N466E152h1441B96185a37420n5632A21315
$$ -40444 139530 79545 -390559 -83157 -77691 5152 -81441 296185 -137420 -193052 121315
18278A92356F5318d9187j66343h4527H8349J93391a56890n4316L9955g9595K9923
$$ 192356 65318 -49187 -215530 -84527 88349 281740 -156890 -211206 -171251 -79595 -49672
18267d9672l59376h7638c1633A3389J48304a54676d4854P982A45444d0576j93028
$$ -49672 -409048 -87638 -31633 13389 161693 -154676 -44854 -36872 145444 -40576 -233604
18256b33604B12463J16656F8747M701h9478E7714B4564b00582A63151b88935d3855
$$ -233604 212463 329119 68747 73448 -89478 57714 24564 -200582 163151 -288935 -43855
18244d1212A66865e3217B66591j09883F2866L7922e2636p0497E6735h7849j03148
$$ -41212 166865 -53217 266591 156708 62866 100788 -52636 -123133 56735 -87849 -190997
18233a90997B13054r3261E3801k0887b09346A7630O2870L3657O9355b91395E1597
$$ -190997 213054 119793 53801 32914 -209346 17630 80500 114157 183512 -291395 51597
18221b10149B1479J32708m00e9837k19106a10263l92910B05986J85691E7248a44570
$$ -210149 21479 154187 153787 -59837 -278943 -110263 -503173 205986 391677 57248 -144570
18209c06413a17237j4440C642a73156c6868r9671E8087b83657J37682C0817J23273
$$ -306413 -117237 -131677 3642 -173156 -36868 -136539 58087 -283657 -145975 30817 154090
18198A54090F8816c13831A10861G826a50811N8762B62972j17308f350l09287J17752
$$ 154090 68816 -313831 110861 7826 -150811 -92049 262972 145664 -6350 -315637 -197885
18187a97885m4941g4455H6123c4508j28452r1582F9104c8198C24242b66534A7111
$$ -197885 -242826 -74455 86123 -34508 -162960 -254542 69104 -38198 324242 -266534 17111
18175h154o4793F1404a44640q9772Q1225C0655A3554J09982e9977j4741a3150
$$ -8154 -72947 61404 -144640 -234412 -153187 30655 13554 123536 -59977 -74718 -13150
18163h8280H6662a63733C3533L1267i6398C571b80725A37316a98527h4697m9738
$$ -88280 86662 -163733 33533 64800 -96398 3571 -280725 137316 -198527 -84697 -134435
18152a34435j67520N5194I0510J15314E8014b73990j29192G2334d10348a68232
$$ -134435 -301955 -246761 90510 205824 58014 -273990 -403182 72334 -410348 -168232
18141C429a95966A86113M2369I3207A5951i7548A26995a54838j25301A37187J36081
$$ 3429 -195966 186113 228482 93207 15951 -97548 126995 -154838 -280139 137187 273268
18130B73268a29732j39458A925a30508m5319D5440h7026A80467G3686A5728J92040
$$ 273268 -129732 -269190 1925 -130508 -175827 45440 -87026 180467 73686 15728 207768
18119B07768L5237a7897o0508c2928j95174I1165c47175A82286E4656J02577d5067
$$ 207768 243005 -17897 -78405 -32928 -228102 91165 -347175 182286 54656 157233 -45067
18107B24426G3469d1044D0552b6098k31220C23075b2754p269C19809a0729k93320
$$ 224426 73469 -41044 40552 -26098 -257318 323075 -22754 -30023 319809 -10729 -304049
18096c04049B07484d8107B21002m3303c4785m0683G6279N2802P3993E4674c10646
$$ -304049 207484 -48107 221002 177699 -34785 -75468 76279 129081 203074 54674 -310646
18084a99990N7389N9604f266n617A98292h1465k15999B9480K21710c8441A22988
$$ -199990 -142601 -82997 -6266 -11883 198292 -81465 -297464 29480 251190 -38441 122988
18072c59105a12894j6110k9778P7208A72016a67731A8212J64885m8583g5347j74342
$$ -359105 -112894 -129004 -158782 -81574 172016 -167731 18212 183097 134514 -75347 -249689
18061b49689a21769A05751a43621A74896C3068p324g9740J1060q8176A09793b92807
$$ -249689 -121769 105751 -143621 174896 33068 25744 -79740 -68680 -156856 109793 -292807
18049F3627k9896a07647I6591E244a97885C89476A38548l0149a58370A11882e2994
$$ 63627 33731 -107647 96591 5244 -197885 389476 138548 108399 -158370 111882 -52994
18037D6174a30141j33144N7229M4929B12889b57118a09637A86051J27534l5867
$$ 46174 -130141 -263285 -206056 -161127 212889 -257118 -109637 186051 313585 277718
18027B77718i0097M380c8398l71036C78899j48906L559f7741A83945A4185a13102
$$ 277718 -90097 -85717 -38398 -409434 378899 229993 233552 -67741 183945 14185 -113102
18015d9591k9243j26801f2988p7089L1950b7800k7410A52594g8036j2975B33719
$$ -49591 -78834 -205635 -62988 -140077 -108127 -27800 -55210 152594 -78036 -91011 233719
18003B02516M3122J28532j71603a42248j02652A70464a1076k60947i617k62951
$$ 202516 245638 374170 202567 -142248 -244900 170464 -11076 -272023 -9617 -272568
17993b72568j2866A72015e1386D6158J84173n3868a09446p0927A2462R558J42940
$$ -272568 -285434 172015 -51386 46158 230331 176463 -109446 -180373 12462 22020 164960
17982A64960G712i3938F6861a22836D00170a18936r3606i0439n2842G2145l2696
$$ 164960 7712 -93938 66861 -122836 400170 -118936 -212542 -90439 -143281 72145 39449
17971C9449A8009J54531A1455O6370B0195a25868j26798B32513O4566a1423A0217
$$ 39449 18009 172540 11455 77825 20195 -125868 -252666 232513 297079 -11423 10217
17959D1136a9397k87456B12000p8959c33239d8902I2849f4284B4035c37669H498
$$ 41136 -19397 -306853 212000 133041 -333239 -48902 92849 -64284 24035 -337669 8498
17947C5043b8036A1004K97193a62815C0614J58569N2739l3677a66252B3796L11336
$$ 35043 -28036 11004 308197 -162815 30614 189183 241922 208245 -166252 23796 335132
17936C35132A65170F4053i8926A53855J9216a29512B1391J70781a14990B06356
$$ 335132 165170 64053 -98926 153855 173071 -129512 21391 192172 -114990 206356
17925B2763J13967b00517j31080c0181j1300j57954H4407R7808b13695C37661
$$ 22763 136730 -200517 -331597 -30181 -41481 -199435 84407 182215 -213695 337661
17914A61787b16846j08278a00975j92b6428k56418J25464J404E7580k7426c12531
$$ 161787 -216846 -325124 -100975 -101167 -26428 -282846 -157382 -155978 57580 30154 -312531
17902e782j02576B8115c74606Q8629I1763c47355a18951A45423J84654C9402d8071
$$ -5782 -108358 28115 -374606 -285977 91763 -347355 -118951 145423 330077 39402 -48071
17890a17029e845l17408P5986H2460b14620C8154J38238c8451n1839B41526c605
$$ -117029 -5845 -323253 -247267 82460 -214620 38154 176392 -38451 -90290 241526 -3605
17878b62235e3009p0467c9189A86304A9100L1622a6878A03825J00904c56433A56920
$$ -262235 -53009 -123476 -39189 186304 19100 50722 -16878 103825 204729 -356433 156920
17866d5629B69045a65804C37603c6019j93315b1836k52871J30299k0518B94327
$$ -45629 269045 -165804 337603 -36019 -229334 -21836 -274707 -144408 -164926 294327
17855A58818J19043h3633a7598A31529a00020q8992e0563p5093k7796A4598J32620
$$ 158818 277861 -83633 -17598 131529 -100020 -189012 -50563 -125656 -153452 14598 147218
17844A47218J5025J04872b17721i5744F4257J51879e7347A57369a16311j54870
$$ 147218 162243 267115 -217721 -95744 64257 216136 -57347 157369 -116311 -271181
17834b71181c1555A33092L8733j3623a5711p6702G3593k6887J12287p5647J18425
$$ -271181 -31555 133092 171825 158202 -15711 -92413 73593 46706 158993 83346 201771
17823B01771i0643j63376F9123J92350j00989B716a3480B55004h7919k0834B28961
$$ 201771 -90643 -254019 69123 261473 160484 2716 -13480 255004 -87919 -108753 228961
17811a48315D31b59677g6413H8565a34212B38345D6437J9378b53232h6177K141
$$ -148315 431 -259677 -76413 88565 -134212 238345 46437 65815 -253232 -86177 -84036
17800h4036A48935c0989k13990G4991l6187c0120P597B022b8037r3993N3670c893
$$ -84036 148935 -30989 -244979 74991 38804 -30120 -22523 2022 -28037 -122030 -68360 -3893
17787a06965m7464A42366f3536n3545j5698o6031A18782b2962k24165C61683D701
$$ -106965 -154429 142366 -63536 -117081 -132779 -198810 118782 -22962 -247127 361683 4701
17775C08569a81125B26689c9405A8011h2628A55674P6981a97595B4907a94670
$$ 308569 -181125 226689 -39405 18011 -82628 155674 232655 -197595 24907 -194670
17764C4176c98682B29828g84k70739J20973B03431B8146Q2087d49565J37099l6396
$$ 34176 -398682 229828 -784 -271523 -150550 203431 28146 110233 -449565 -312466 -348862
17753c48862a44252b3925B57901c16915a39524N4974K9642A33646g605k01650
$$ -348862 -144252 -23925 257901 -316915 -139524 -84550 -54908 133646 -7605 -209255
17743b09255C80211j59530a99712M0828b7248G3586b26559n376H6915B897e0645
$$ -209255 380211 220681 -199712 -158884 -27248 73586 -226559 -231935 86915 2897 -50645
17731a549A43684d7955A47056b41044j775A07595g6441B41137m7169b27924K3131
$$ -1549 143684 -47955 147056 -241044 -242819 107595 -76441 241137 193968 -227924 -204793
17720b04793C36287j51407a64648A14323A8049P0857b337E0037h1223j6852P892
$$ -204793 336287 184880 -164648 114323 18049 88906 -2337 50037 -81223 -98075 -90183
17709i0183d5062C0320r977d4557j17575A93273c2662A25453e7733r7482A0495
$$ -90183 -45062 30320 20343 -44557 -162132 193273 -32662 125453 -57733 -155215 10495
17697B6969K55199b75626j70365A67707A83a34734J5034C5148L39987c0478n5258
$$ 26969 282168 -275626 -445991 167707 183 -134734 -119700 35148 375135 -30478 -85736
17686h5736A4936c18923A7983K5673i4344A34176B601K31729C4596J15896d1141
$$ -85736 14936 -318923 17983 43656 -94344 134176 2601 234330 34596 150492 -41141
17674E6326M9382h6155A86934b02672A5408e6128A81717B7045J10699j7251g5318
$$ 56326 105708 -86155 186934 -202672 15408 -56128 181717 27045 137744 120493 -75318
17662A30003m3004d3463m2874C4395f0791j21016A14229i8880I5027K04562A41434
$$ 130003 86999 -43463 -86337 34395 -60791 -181807 114229 -98880 95027 299589 141434
17650B7593K73617a5860j55500c3596A40014a28312M538E25735h6505J39J0700
$$ 27593 301210 -15860 -171360 -33596 140014 -128312 -123774 525735 -86505 -86366 -75666
17639g5666l4022j99466Q8347K9408B16501l573G4444f8549A85515a93291F7031
$$ -75666 -109688 -309154 -220807 -191399 216501 212928 74444 -68549 185515 -193291 67031
17627b3063m0348B26919d83992a35443F7832c2358A99860D0135K11052G7577A1253
$$ -23063 -63411 226919 -483992 -135443 67832 -32358 199860 40135 251187 77577 11253
17615b40431c8500m47094C7291i0319A8137c7581a869E8609a44863j52860a28614
$$ -240431 -38500 -485594 37291 -90319 18137 -37581 -1869 58609 -144863 -297723 -128614
17603e2190C24953n7560f39j34779j38103C10598J16567a60384O9594G3346g2739
$$ -52190 324953 267393 -639 -135418 -273521 310598 427165 -160384 -90790 73346 -72739
17591A01465L31318d382A40421E0604K2997J45216C962P5799M465J08758d678
$$ 101465 432783 -4382 140421 50604 73601 218817 3962 79761 84226 192984 -4678
17579C5222J55097k0497r118r97G3328K70004A03275K72446A30532D0704J67194
$$ 35222 190319 169822 160704 159707 73328 343332 103275 375721 130532 40704 207898
17568B07898a94772j1789A23635d8062D18573A57173M6698K57397b02081o7691
$$ 207898 -194772 -206561 123635 -48062 418573 157173 203871 461268 -202081 -269772
17558b69772A1995a48044G3316d6418H2591P4063J18177a30860B27777e9067F4207
$$ -269772 11995 -148044 73316 -46418 82591 156654 274831 -130860 227777 -59067 64207
17546C40298F1975L294d1704j3545A12241D9689P3512c9117q4338D12899j49312
$$ 340298 61975 65269 -41704 -55249 112241 49689 123201 -39117 -123455 412899 263587
17535B63587a7560G5502g7599C65017a07999r658M2601A39511K23230j60511E2941
$$ 263587 -17560 75502 -77599 365017 -107999 -117657 -75056 139511 362741 202230 52941
17523b5235m2084A07622K03600C9241c35366B21718d2024F7529Q7096n9044J30846
$$ -25235 -67319 107622 311222 39241 -335366 221718 -42024 67529 154625 95581 226427
17512B26427c6156C39324a25235B96666c946A0362L41297c601D15292g5372A36199
$$ 226427 -36156 339324 -125235 296666 -3946 10362 351659 -3601 415292 -75372 136199
17500a49803A15931O7654J02931d7689A10602M619l2097K46841f2833C3616L65248
$$ -149803 115931 183585 286516 -47689 110602 115221 83124 329965 -62833 33616 398864
17489C98864C5324b00253B93117c83748B92879j09713m8579o1287a44409D72322
$$ 398864 35324 -200253 293117 -383748 292879 183166 134587 73300 -144409 472322
17478A51595L9476j1232a9596A60479m3220L07248i4238G3238J29949J20503A0517
$$ 151595 191071 179839 -19596 160479 117259 424507 -94238 73238 203187 323690 10517
17466c1999A62756L0164d362A27660e6619C38350a72943A71690a22759a8028B08191
$$ -31999 162756 192920 -4362 127660 -56619 338350 -172943 171690 -122759 -18028 208191
17454A65615N54501j91863k57122m2015F1297K44135a86990D03053C1457K66033
$$ 165615 720116 528253 271131 229116 61297 305432 -186990 403053 31457 297490
17444B97490P2240j70452m3242b4154A64401K09176J61288B03484o8427e7653
$$ 297490 369730 199278 156036 -24154 164401 373577 534865 203484 135057 -57653
17433F16492B64108E0606K91056B1798J81538G3008L9130M76141j65651F6829
$$ 616492 264108 50606 341662 21798 203336 73008 112138 588279 422628 66829
17422A30942J09563K09654a70510B51948L4703H0383L55013k02987j04366K55659
$$ 130942 240505 450159 -170510 251948 286651 80383 435396 232409 128043 383702
17412C83702j74614A01767K69890H8906m2601K63006K4134A196K67574Q4718j59869
$$ 383702 209088 101767 371657 88906 46305 309311 333445 1196 268770 353488 193619
17401A93619J00727i651B26864j9854m7386J80482R6463C1100a15335C5243a20751
$$ 193619 294346 -9651 226864 207010 159624 340106 436569 31100 -115335 35243 -120751
17389A17761a31524B69130b03073B2627O9262L53054a13388e511D04949a57737
$$ 117761 -131524 269130 -203073 22627 91889 444943 -113388 -5511 404949 -157737
17378D21887I2226b9152B66811j29217a36932B35195A7053a9848A71061K9977
$$ 421887 92226 -29152 266811 137594 -136932 235195 17053 -19848 171061 201038
17368B01038H1814a31905L5588D37924r1060B1782N5803J42530l4342Q2495J4133
$$ 201038 81814 -131905 -96317 437924 346864 21782 77585 220115 185773 268268 282401
17357B82401q6705L5740n6147J85218E3647K29817D9129q859J84290h817C57068
$$ 282401 195696 231436 175289 360507 53647 283464 49129 40270 224560 -8817 357068
17345B65637l7549j1958D9749K98770j25919K42619a05728F5563K91024J44739
$$ 265637 228088 216130 49749 348519 222600 465219 -105728 65563 356587 501326
17335E01326A76538d02669a54786C71348A52989L5747c3920A39224K97642A81012
$$ 501326 176538 -402669 -154786 371348 152989 188736 -33920 139224 436866 181012
17324B53892n2550a69430j23475A34695a12542B90982e9908A12572O1229j4285
$$ 253892 201342 -169430 -292905 134695 -112542 290982 -59908 112572 173801 159516
17314A59516J01767D6187a27757A54710m4324M8865N3468G7227J9687a89500A78345
$$ 159516 261283 46187 -127757 154710 110386 159251 212719 77227 96914 -189500 178345
17302E52012c2466G8561N5161K21478q4836a1732A93856j0897L1736H891j953
$$ 552012 -32466 78561 133722 355200 270364 -11732 193856 182959 214695 8891 6938
17291F938M41190j76110F0871N6594Q1122Q5126F2254J52670I5538R4821H2723
$$ 6938 448128 272018 60871 117465 198587 283713 62254 214924 95538 190359 82723
17279A35798F0181N4591f572B73648B8997N90754a03679B15359f2206A07644L37311
$$ 135798 60181 114772 -6572 273648 28997 619751 -103679 215359 -62206 107644 444955
17268D44955f7714j5285a854C08097k8021Q2738D9986J01618l3615C5279i0761
$$ 444955 -67714 -82999 -1854 308097 280076 362814 49986 151604 117989 35279 -90761
17256D37762j48100H0847L39726j41884A22730K14246o4195L8543j1101F5313
$$ 437762 289662 80847 420573 278689 122730 336976 272781 311324 300223 65313
17245E05036m6861B02299M708J28038a9812A71095F5017N9801B4238M48142j0426
$$ 505036 458175 202299 207007 335045 -19812 171095 65017 124818 24238 472380 461954
17234D61954a9591C91471j31694P143p1017J59316H6478a79696F15678F7334M86428
$$ 461954 -19591 391471 259777 266920 195903 355219 86478 -179696 615678 67334 553762
17223E53762j18591G0856d2015B41405G5067J21627o5378a15947C82286A83478
$$ 553762 435171 70856 -42015 241405 75067 196694 131316 -115947 382286 183478
17212C87713a4839C96699c27924A28546R9936f2496I5574j6565P5677L7987m6733
$$ 387713 -14839 396699 -327924 128546 228482 -62496 95574 79009 154686 192673 145940
17201A45940J67504a92742B21127J32259n4763r8265J14690G0598J44712J82493
$$ 145940 313444 -192742 221127 353386 298623 200358 315048 70598 215310 397803
17191C97803f8769B49430B7303M32451k07895q1490J66896J1374A49399L30826
$$ 397803 -68769 249430 27303 459754 251859 170369 337265 348639 149399 480225
17181D80225m5321j16633j9863o0093j13187Q4937J97223L9979j82885P6179L522
$$ 480225 434904 318271 298408 238315 125128 210065 407288 447267 264382 340561 344083
17170C44083r7008J61470D2855K23595R4466j70239Q1272A29717J71850J13441
$$ 344083 247075 408545 42855 266450 360916 190677 271949 129717 301567 415008
17160D15008n6657A10635K99671A00899K8555Q2992o746e1895C86400j47421J50396
$$ 415008 358351 110635 410306 100899 129454 212446 205700 -51895 386400 238979 389375
17149C89375A79429K89439j21253J5776M2014j06813o2700J0379j02084l8274
$$ 389375 179429 468868 347615 363391 405405 298592 235892 246271 144187 105913
17139A05913A3109M14438G8497P9911L63504D7498K44810J88080q4240A06437
$$ 105913 13109 427547 78497 158408 521912 47498 292308 480388 396148 106437
17128B60334o8257K20750k930j33849K01374O4963P288k49273M1151J4141b5019
$$ 260334 192077 412827 409897 276048 477422 542385 549673 300400 341551 355692 -25019
17116E00957k23898H5656L81991j04708H1039K32311j08676K16511A60951K18947
$$ 500957 277059 85656 467647 362939 81039 313350 204674 421185 160951 379898
17106C79898A23322M45582B57439j0459K50887A9276K42810o7244J79117j19990
$$ 379898 123322 568904 257439 246980 497867 19276 262086 194842 373959 253969
17096B53969K20443n3012n0239j36450J35486l2184K07745j73793K89531B36965
$$ 253969 474412 421400 371161 234711 370197 338013 545758 371965 661496 236965
17085D22652k9121P5339Q6935c4129F89712C11368m9057K66650j66650j54084
$$ 422652 393531 468870 555805 -34129 689712 311368 262311 528961 362311 208227
17075B08227L63814A60418M79778j48167j42842J18644j46411J03749K86251l29944
$$ 208227 572041 160418 640196 492029 349187 467831 321420 425169 711420 381476
17065C81476L5626j06253p846J61479m5126j67694J75398M2477J33724R4072r0446
$$ 381476 417102 310849 303003 464482 419356 251662 427060 469537 603261 697333 606887
17054F06887j13183K2196o0493A61003P3450J81735J09426P4626j01146M7830
$$ 606887 493704 515900 455407 161003 234453 416188 525614 600240 499094 546924
17044E46924J9029j59799K33168o5112J46457j8518j13828j44451K17558k41323
$$ 546924 565953 406154 639322 574210 720667 702149 588321 443870 661428 420105
17034D20105K23530m5170P4107k46067K44302K23914k52320l15833M72699B51591
$$ 420105 643635 598465 672572 426505 670807 894721 642401 326568 799267 251591
17023F06039L55227l26423J20493l61019j84676M40360k0869j65947M35324k22116
$$ 606039 961266 634843 755336 394317 209641 650001 629132 463185 898509 676393
17013F76393k08577J81678K29530O2737j49310l75903L24810k09430P2161M7335
$$ 676393 467816 649494 879024 941761 792451 416548 741358 531928 604089 651424
17003F51424j1425M76478l59790L454k38782J61113j52106K34208j1617K947k86933
$$ 651424 639999 1116477 756687 760141 521359 682472 530366 764574 752957 755904 468971
16992D68971M96076P6484l05181p6321K34771l5884j83198J41668J2302J18338
$$ 468971 965047 1041531 736350 660029 894800 858916 675718 817386 829688 948026
16982I48026p1641K76274l15889K05441j5853m06021K79390k93967P6598L25110
$$ 948026 876385 1152659 836770 1042211 1026358 620337 899727 605760 682358 1007468
16972A007468k85106J92800J19927j16300j68616m9333J24216N50533n47086J53068
$$ 1007468 722362 915162 1035089 918789 750173 700840 825056 1375589 828503 981571
16962I81571j37916n6070J53230J79415j76310j24096L20017p9578j36070O2383
$$ 981571 843655 787585 940815 1120230 943920 819824 1139841 1060263 924193 986576
16952I86576m8655J25743j27577J90398J33191j78171R4140j0422o7558j14778
$$ 986576 937921 1063664 936087 1126485 1259676 1081505 1175645 1165223 1097665 982887
16942I82887j22448r9183P37683j20177k57130p7347L15944l23075J40205K86184
$$ 982887 860439 761256 1498939 1378762 1121632 1044285 1360229 1037154 1177359 1463543
16932A463543j78055j39706R9396K08524j85846P7432j99178L74908l28341J16216
$$ 1463543 1285488 1145782 1245178 1453702 1267856 1345288 1146110 1521018 1192677 1308893
16922A308893K47023j79494j07998L76531k65612R7857n6624q4434J11880J09541
$$ 1308893 1555916 1376422 1268424 1644955 1379343 1477200 1420576 1336142 1448022 1557563
16912A557563J22093j54290K04456k13542K2218M5304R252o2233K17999j11431
$$ 1557563 1679656 1525366 1729822 1516280 1538498 1583802 1593054 1530821 1748820 1637389
16902A637389K8022j63640J19716k3944J1577K30455k41171L60964r3002L46719
$$ 1637389 1665411 1501771 1621487 1597543 1609120 1839575 1598404 1959368 1866366 2213085
16892B213085m41144J31943k12754K77701m26018M32138m11522N32848m05936
$$ 2213085 1771941 1903884 1691130 1968831 1542813 1974951 1563429 2096277 1690341
16883A690341N80500k0345r8508K1834k12570O8161m9071M00261n518j14987j0039
$$ 1690341 2270841 2250496 2151988 2173822 1961252 2029413 1980342 2380603 2375085 2260098 2250059
16872B250059L72752k67603j67794K3773K69288j18212o4466M50911j83111J21267
$$ 2250059 2622811 2355208 2187414 2211187 2480475 2362263 2297797 2748708 2565597 2686864
16862B686864M7734R7011o9687j16680L97721k32049L562K13835k78150R1884
$$ 2686864 2734598 2831609 2761922 2645242 3042963 2810914 2814476 3028311 2750161 2842045
16852B842045l4987L5049M49106K50648m4416l45483L08328j81434M12439m22698
$$ 2842045 2807058 2842107 3291213 3541861 3497445 3151962 3460290 3278856 3691295 3268597
16842C268597K28538J61718J32689k95090M24606n1445m9341L03125k09518J89841
$$ 3268597 3497135 3658853 3791542 3496452 3921058 3869613 3820272 4123397 3913879 4103720
16832D103720n4976L44770k04864p640J92420J55968K11313l3056K8153K46258
$$ 4103720 4048744 4393514 4188650 4181010 4373430 4529398 4740711 4707655 4735808 4982066
16822D982066k61530M40918l61226O72357k27771O67566m65504M50632j99844
$$ 4982066 4720536 5161454 4800228 5472585 5244814 5912380 5446876 5897508 5697664
16813E697664K46640K48417L4272o0287m8897M46126p9727K3347N44915K14499
$$ 5697664 5944304 6192721 6226993 6166706 6117809 6563935 6484208 6507555 7052470 7266969
16803G266969L7388L66227j23715J43189L19178Q0557K71709M39323N0087J07461
$$ 7266969 7304357 7670584 7546869 7690058 8009236 8089793 8361502 8800825 8850912 8958373
16793H958373J12529O93584j9386K5371J50148J61551N12231L82758N74786K64088
$$ 8958373 9070902 9764486 9745100 9770471 9920619 10082170 10594401 10977159 11551945 11816033
16783A1816033n9782M90175L49800K44564P78198L57210L77858M63151K65128
$$ 11816033 11756251 12246426 12596226 12840790 13618988 13976198 14354056 14817207 15082335
16774A5082335M65571N48307K56690Q54743Q84829J54109Q91299P67178N31151
$$ 15082335 15547906 16096213 16352903 17207646 18092475 18246584 19137883 19905061 20436212
16765B0436212O95313J345501M54320R47555J357251K62465J355261J245069J154338
$$ 20436212 21131525 22477026 22931346 23878901 25236152 25498617 26853878 28098947 29253285
16756B9253285J058786J261825J883068J296197J439114K312713J279881K273437
$$ 29253285 30312071 31573896 33456964 34753161 36192275 38504988 39784869 42058306
16748D2058306J964720K355021K560886K701964K630837K946421L364167L633658
$$ 42058306 44023026 46378047 48938933 51640897 54271734 57218155 60582322 64215980
16740F4215980L344561M218597M189990M560193N017649N163379N971460O148415
$$ 64215980 67560541 71779138 75969128 80529321 85546970 90710349 96681809 102830224
16732A02830224O641208O936771P430361P428481Q023713Q236526Q600260Q113113
$$ 102830224 109471432 116408203 123838564 131267045 139290758 147527284 156127544 164240657
16724A64240657Q681539P953567P404833O531875N784358M401359L156847J556375
$$ 164240657 172922196 180875763 188280596 194812471 200596829 204998188 208155035 209711410
16716B09711410J02865j517419l122483m362199n851613o531047p686843p956611
$$ 209711410 209814275 208296856 205174373 200812174 194960561 188429514 180742671 172786060
16708A72786060q418627q561638q670376q262595q136343q141071p381295p422616
$$ 172786060 164367433 155805795 147135419 138872824 130736481 122595410 115214115 107791499
16700A07791499o847010o123443n750266n658388n070882m741892m539419l634126
$$ 107791499 100944489 94821046 89070780 83412392 78341510 73599618 69060199 65426073
16692F5426073l761099m190296k896035l045159k531337k932397k366959k371088
$$ 65426073 61664974 57474678 54578643 51533484 49002147 46069750 43702791 41331703
16684D1331703k103862j625209j960807j811434j218259j943775j126301j421999
$$ 41331703 39227841 37602632 35641825 33830391 32612132 30668357 29542056 28120057
16676B8120057j043036j406922j019484j105109j491000j78548j159637n16829
$$ 28120057 27077021 25670099 24650615 23545506 22054506 21875958 20716321 20199492
16668B0199492p80331o46553r17115n72249o03810q00380k73204n34369j026583
$$ 20199492 19419161 18772608 17855493 17283244 16679434 15879054 15605850 15071481 14044898
16659A4044898N11904q00025n65011o63378J91964j071960k52187j0607n29165
$$ 14044898 14556802 13756777 13191766 12528388 12720352 11648392 11396205 11385598 10856433
16650A0856433n9930o63579k62373l36383l9541p03080M16264n51713n6807o03313
$$ 10856433 10796503 10132924 9870551 9534168 9494627 8791547 9207811 8656098 8599291 7995978
16640G995978k3558j85279l23170K8186l64964k41404j92359k7792k3943l91111
$$ 7995978 7972420 7787141 7463971 7492157 7127193 6885789 6693430 6665638 6641695 6250584
16630F250584L17474n38485j12113j37850k92522j45101k2989k52232J72021m8490
$$ 6250584 6568058 6029573 5917460 5779610 5487088 5341987 5318998 5066766 5238787 5190297
16620E190297m21773M1442o2267J10521l96432j68836r0854J82618J59834m17173
$$ 5190297 4768524 4809966 4747699 4858220 4461788 4292952 4202098 4384716 4544550 4127377
16610D127377m0918k85440J23493o37132L09840J85011p9853R7869j10221k02678
$$ 4127377 4086459 3801019 3924512 3287380 3597220 3782231 3702378 3800247 3690026 3487348
16600C487348P2053l82664M06996p90018N00063k80825m898j90503K10849l44383
$$ 3487348 3559401 3176737 3583733 2793715 3293778 3012953 3008055 2817552 3028401 2684018
16590B684018j81187J8244K33453O1801l79783l967K92832n11666J56248m3252
$$ 2684018 2502831 2521075 2754528 2816329 2436546 2432579 2725411 2213745 2369993 2326741
16580B326741k25740K00597r4450J5274K09111k99270n2987J11549m6848j15552
$$ 2326741 2101001 2301598 2207148 2222422 2431533 2132263 2079276 2190825 2143977 2028425
16570B028425J85290k26277k42311K61347j81645J42713P9541j03260r9704p3983
$$ 2028425 2213715 1987438 1745127 2006474 1824829 1967542 2047083 1943823 1844119 1770136
16560A770136q4727o5820L36520l19231o5688K21630j96636J51789m99604J81966
$$ 1770136 1685409 1619589 1956109 1636878 1571190 1792820 1596184 1747973 1248369 1430335
16550A430335K21921m89966N80641o15389M79570j1412P4949l1667k74139L03398
$$ 1430335 1652256 1162290 1742931 1127542 1607112 1595700 1670649 1638982 1364843 1668241
16540A668241o21466K94095Q3542p9745j37067M61915k32748k09398o5782m0167
$$ 1668241 1046775 1340870 1424412 1344667 1207600 1669515 1436767 1227369 1161587 1121420
16530A121420J46792o4457k60686M58264m94696K15495j75934J15382j05151M06635
$$ 1121420 1268212 1203755 943069 1401333 906637 1122132 946198 1061580 956429 1363064
16520A363064l79237j4679J83316J12212l83878Q8464r8408p2162L7863O0229
$$ 1363064 983827 969148 1152464 1264676 880798 969262 870854 798692 836555 896784
16510H96784j26570K14618p678j26023P471J0359l3017M2119n4273R9896K41734
$$ 896784 770214 984832 977154 851131 858602 868961 835944 878063 823790 923686 1165420
16499A165420k19635k37635j08557J75767k71605K89851k30829K01209k57363
$$ 1165420 945785 708150 599593 775360 503755 793606 562777 763986 506623
16490E06623J86695J43695j04829J06814K7687l69000K46281J7830j89803L59132
$$ 506623 693318 837013 732184 838998 866685 497685 743966 761796 571993 931125
16480I31125j80837R4881m12601J38626J84703j66477r8369j73888M58768j99695
$$ 931125 750288 845169 432568 571194 755897 589420 491051 317163 775931 576236
16470E76236j85449K8279L12936n1231B66246L69894k00460O2438K51834Q6337
$$ 576236 390787 419066 732002 680771 266246 636140 435680 498118 749952 836289
16460H36289k0119j28207j10257k65794K10188J36246j02518j5919r338k62195
$$ 836289 816170 687963 577706 311912 522100 658346 555828 539909 530571 268376
16450B68376N46151B96375Q6275j29121J76449M10763j30055j7934l10290J19482
$$ 268376 814527 296375 382650 253529 429978 840741 710686 692752 382462 501944
16440E01944j99535M76237l02356j91211O3248m989r2207N7818j3545K08605j98794
$$ 501944 302409 778646 476290 285079 348327 343338 251131 308949 295404 504009 305215
16429C05215j41010K80777j72699k566M87167A47870J36317K32312j99932J46492
$$ 305215 164205 444982 272283 269717 756884 147870 284187 516499 316567 463059
16419D63059A85699J66905m3189e9913C14310l3467J0115o1577L84358j85933
$$ 463059 185699 352604 309415 -59913 314310 280843 290958 229381 613739 427806
16409D27806j19925j08050J45607n1858l6713K78111k45037J38299j08860q7356
$$ 427806 307881 199831 345438 293580 256867 534978 289941 428240 319380 232024
16399B32024C2872J2200K59970N7973J51751j32825j1701j55873J28191p2319
$$ 232024 32872 45072 305042 363015 514766 381941 370240 214367 342558 270239
16389B70239P790j13589j0689J02636L2962j24222J47868R1296k2891b25593D09129
$$ 270239 278029 164440 153751 256387 289349 165127 312995 404291 381400 -225593 409129
16377C7364K54553J18739F447L56961I5078J72469L17076j14452A34918K5224
$$ 37364 291917 410656 6447 363408 95078 267547 584623 470171 134918 160142
16367A60142j8443k2625K04563H1697K19830A23412N87079B92640j01783C667
$$ 160142 141699 119074 323637 81697 301527 123412 710491 292640 190857 3667
16356A56835l9706K44975J42714A90844K58297d4416C01230j6582J61054m224
$$ 156835 117129 362104 504818 190844 449141 -44416 301230 284648 445702 441478
16346D41478p8843O1660H0280K76301k2868a1619A09950K01750c1809A73519K07133
$$ 441478 362635 424295 80280 356581 333713 -11619 109950 311700 -31809 173519 380652
16335C80652o6799M4562J34131k43697L3124j30956O2069j6914G5485M10457A59387
$$ 380652 313853 358415 492546 248849 281973 151017 213086 196172 75485 485942 159387
16323f4452C02457A22375Q6672J08005I9529P8215M5149J33396b39848B91914
$$ -64452 302457 122375 209047 317052 99529 177744 222893 356289 -239848 291914
16312B03361I1409m1335M62017I628i8907D84412A55811K55955D0779J6285c09824
$$ 203361 91409 50074 512091 9628 -98907 484412 155811 411766 40779 57064 -309824
16300E7015L4037i010C38362E7410b10040A63539L1245E8430J88172D0750M58655
$$ 57015 91052 -9010 338362 57410 -210040 163539 194784 58430 246602 40750 499405
16289D99405B10294n2317D0569N28007B24466Q153M6419A00745K59042j22462
$$ 499405 210294 157977 40569 568576 224466 232619 279038 100745 359787 237325
16279B37325M44143B79752J98169d79907b07360A81941L6573d7418A19038l1369
$$ 237325 681468 279752 477921 -479907 -207360 181941 218514 -47418 119038 87669
16269H7669i6179C09929a16213q1033A13524L94229b4227C4192K94391j52849
$$ 87669 -96179 309929 -116213 -197246 113524 507753 -24227 34192 328583 175734
16259A75734l2377D406L54934A61080f6923A24898J10774Q1745h8936C70523a37644
$$ 175734 143357 4406 359340 161080 -66923 124898 235672 317417 -88936 370523 -137644
16247b1055C42069a34142B47338J3341B3967a46431c804B57579j14443J0107E4721
$$ -21055 342069 -134142 247338 260679 23967 -146431 -3804 257579 143136 153243 54721
16235A91369l9833o3046K529l5640B5951K03622D3746K35167f7729A53391f9619
$$ 191369 151536 88490 91019 55379 25951 229573 43746 278913 -67729 153391 -69619
16223a339B1309a9835A21697J55797j23654j2429j4176g8006A37279L40452b66670
$$ -1339 21309 -19835 121697 277494 153840 141411 127235 -78006 137279 477731 -266670
16211a30224A65570a58569k6562f6188k0056p3564F6109a97150R6663j67424C8440
$$ -130224 165570 -158569 -185131 -66188 -86244 -159808 66109 -197150 -100487 -267911 38440
16199E468K24215p6821k0858B1010L1013J76741a34256E7742K33033c16897J42599
$$ 5468 229683 152862 132004 21010 52023 228764 -134256 57742 290775 -316897 -174298
16188a74298C28397g3526j53900E6971b70826f2014A08120c9175A56107l9927
$$ -174298 328397 -73526 -227426 56971 -270826 -62014 108120 -39175 156107 116180
16178A16180a62721N5742d5022j070j9319j1440p2339k9112A00532h0305A37974
$$ 116180 -162721 -106979 -45022 -46092 -65411 -76851 -149190 -178302 100532 -80305 137974
16166a06671b2881A46304M2281B5963r342L2350g3967B5056a93499c5939B91281
$$ -106671 -22881 146304 188585 25963 16621 48971 -73967 25056 -193499 -35939 291281
16154B26385a42624M7777D076L38810a69076l9784A99916c0666C8257J75900j02592
$$ 226385 -142624 -94847 4076 342886 -169076 -208860 199916 -30666 38257 214157 111565
16143A11565M6817b68618n5334a12422j46321J252I9825a18698F9459J21023R1302
$$ 111565 158382 -268618 -323952 -112422 -258743 -257491 99825 -118698 69459 190482 281784
16132B81784A20288b33483D18073G5384a04024c4966r444I6871K07004h168A01947
$$ 281784 120288 -233483 418073 75384 -104024 -34966 -44410 96871 303875 -8168 101947
16120E7939a32921k23981c700k1057I1981d4459j82545l4774B16083b74133B85865
$$ 57939 -132921 -356902 -3700 -24757 91981 -44459 -227004 -261778 216083 -274133 285865
16108b9733m19170a34212O1715L5551B21886J31230j57693n7229C0706K17521
$$ -29733 -448903 -134212 -72497 -36946 221886 353116 195423 138194 30706 248227
16098B48227q1692J6845a65046d6125j13228H0607d4064A10950D1298c96772e170
$$ 248227 166535 183380 -165046 -46125 -159353 80607 -44064 110950 41298 -396772 -5170
16086H4160M0897b61236k3064b3394A14927c45479d4835A20047h1297m2203m8609
$$ 84160 125057 -261236 -284300 -23394 114927 -345479 -44835 120047 -81297 -123500 -172109
16075a72109I4740e5617F0103O235a37823b6592C5142J00250m1144L57236a83879
$$ -172109 94740 -55617 60103 66338 -137823 -26592 35142 135392 94248 451484 -183879
16063c6619m9319n6935k48698J41483A27924a50349H9571l996m85K86260a12790
$$ -36619 -85938 -142873 -391571 -250088 127924 -150349 89571 85575 85090 371350 -112790
16051C3329c54575c2857C851K44021D2229i2096A27382e8665d704k45927D0999
$$ 33329 -354575 -32857 3851 247872 42229 -92096 127382 -58665 -4704 -250631 40999
16039A65779a07903o4205f7313k58165a31146C1741N198R1312O0673b46224a14011
$$ 165779 -107903 -172108 -67313 -325478 -131146 31741 36939 128251 188924 -246224 -114011
16027d7632J6092j75633b9615j69690d5174A33586a33567E8147R6023b52438B13726
$$ -47632 -31540 -207173 -29615 -199305 -45174 133586 -133567 58147 154170 -252438 213726
16015b27045I1177a48489l8447J0631P1770j11919O3978b6753B6579g3696B56563
$$ -227045 91177 -148489 -186936 -176305 -104535 -216454 -152476 -26753 26579 -73696 256563
16003b20736o6093A22167b77513o2708A79203C5445a537H0670l6980K23252c36134
$$ -220736 -286829 122167 -277513 -340221 179203 35445 -1537 80670 43690 266942 -336134
15991C382d06557C81443b18945L8854q042i1755C51132I8353B3796h6927C92035
$$ 3382 -406557 381443 -218945 -180091 -188133 -91755 351132 98353 23796 -86927 392035
15979F3290J12555M5885f2730B60630b02314M3040a6207O350m281k8699k04317
$$ 63290 175845 221730 -62730 260630 -202314 -159274 -16207 -9857 -14138 -42837 -247154
15968b47154A2261a40118G3413c22381A77795j0862f0576O496a4238k9265E2122
$$ -247154 12261 -140118 73413 -322381 177795 166933 -60576 -54080 -14238 -43503 52122
15956B48738A22348h7104c5724C5500a302j21096A88520C4704c5839E0166j7513
$$ 248738 122348 -87104 -35724 35500 -1302 -122398 188520 34704 -35839 50166 32653
15945C2653J6489c87069C5887b88015a20591E489Q2164l7984a56000j04083g0060
$$ 32653 49142 -387069 35887 -288015 -120591 5489 87653 49669 -156000 -260083 -70060
15933A49587a85398F6677L384a45148j92628N6866A91871J57788E5006a20354
$$ 149587 -185398 66677 70061 -145148 -337776 -280910 191871 349659 55006 -120354
15922h8934n1338J7271j41039f9891k30319l5151B73400a25572j0693F2925a2412
$$ -88934 -140272 -123001 -264040 -69891 -300210 -335361 273400 -125572 -136265 62925 -12412
15910A82268a10093J9740k19997M681a7073j28408B2649a88433h6407C49849f7045
$$ 182268 -110093 -90353 -310350 -305669 -17073 -145481 22649 -188433 -86407 349849 -67045
15898a8825l41621g2381E6919f7075n3515A90828c51595J06693A71128C8105N1176
$$ -18825 -360446 -72381 56919 -67075 -120590 190828 -351595 -244902 171128 38105 89281
15887H9281b91386a14769A27536B9870a35571j77067e6791A79129D5860a44570
$$ 89281 -291386 -114769 127536 29870 -135571 -312638 -56791 179129 45860 -144570
15876c28377I1063F036b18374p9184a45047D0211R2412a92534c3014l08854b7419
$$ -328377 91063 6036 -218374 -297558 -145047 40211 132623 -192534 -33014 -341868 -27419
15864A12738j2797C4979h5572p4255j20234j7683d6245l2520C2532J59043c8323
$$ 112738 99941 34979 -85572 -159827 -280061 -297744 -46245 -78765 32532 191575 -38323
15852D94440F9309a2750k15298I204K2340a07997B90250e53152B63510a28356
$$ 494440 69309 -12750 -228048 9204 31544 -107997 290250 -553152 263510 -128356
15841B7059O068J8287K4600i7676L1906r7262Q1359A40831c5884H8538J79333
$$ 27059 33127 51414 76014 -97676 -65770 -163032 -81673 140831 -35884 88538 267871
15830B67871a61370M4537K7226B21422b15930A82572j2689i4849m2430c9422B1449
$$ 267871 -161370 -116833 -89607 221422 -215930 182572 169883 -94849 -137279 -39422 21449
15818B16379j07155b65276J01132j30369e1426A34436O4855a91759d0855j79286
$$ 216379 109224 -265276 -164144 -294513 -51426 134436 199291 -191759 -40855 -220141
15808b20141a7523j51221B25732b42278f7984A19196K8346a83288M3229Q344J3942
$$ -220141 -17523 -168744 225732 -242278 -67984 119196 147542 -183288 -140059 -131715 -117773
15797a17773m9384j18966O0134o1766d377B40116n5321l8756j102a65080E9704
$$ -117773 -167157 -286123 -225989 -287755 -4377 240116 184795 146039 144937 -165080 59704
15785b0681C11175a10536j34038l8683c3341q0763L8745B11194e9604l9948b4921
$$ -20681 311175 -110536 -244574 -283257 -33341 -114104 -75359 211194 -59604 -99552 -24921
15773e6230j16990N5645j1185L9955A30638h6738a4652b195m0338L452H5124a35102
$$ -56230 -173220 -117575 -128760 -88805 130638 -86738 -14652 -2195 -42533 -39081 85124 -135102
15760B1164N6741a04330B06029r1614m1233a13713j55058J18043O0513F6993a9007
$$ 21164 77905 -104330 206029 114415 73182 -113713 -268771 -150728 -90215 66993 -19007
15748b67195B77302E5076j7856c7560D64786A43772a38557k1739A6544P9886a01028
$$ -267195 277302 55076 37220 -37560 464786 143772 -138557 -160296 16544 96430 -101028
15736c7471j10653L921E5614a02j78001e5280j05419R635e2397A68113K13662
$$ -37471 -148124 -144203 55614 -102 -178103 -55280 -160699 -151064 -52397 168113 381775
15725C81775a73970d1226q3167M4234o9384B8170a48519j2325l127B56173H9113
$$ 381775 -173970 -41226 -124393 -80159 -149543 28170 -148519 -160844 -163971 256173 89113
15713a22581R095l4861A47917a09428A29235h9608j27046q55o017L2091j12818
$$ -122581 -113486 -148347 147917 -109428 129235 -89608 -216654 -217509 -223526 -191435 -304253
15702c04253B2611a40669B30990G5236f03408F5711P0326d7129H1707L63078g8254
$$ -304253 22611 -140669 230990 75236 -603408 65711 136037 -47129 81707 444785 -78254
15690A52386a14129A54115a34129j0728F9406b33413D1610d6406l9044k57010
$$ 152386 -114129 154115 -134129 -144857 69406 -233413 41610 -46406 -85450 -342460
15680c42460M5632R1283e401D2647a37331F5999K79585J0725b32993D0993B0293
$$ -342460 -296828 -205545 -5401 42647 -137331 65999 345584 356309 -232993 40993 20293
15668C0833K58612E3003c34913J0987A89951i9242G4195a83724g4873j09666B45562
$$ 30833 289445 53003 -334913 -323926 189951 -99242 74195 -183724 -74873 -184539 245562
15656B061J2164J6256a02998M2552J0266A6662b45104A4648J08332i1750o565
$$ 2061 14225 30481 -102998 -60446 -50180 16662 -245104 14648 122980 -91750 -98315
15645i8315D8047J59100e3015r4489C166a27124J4220I8946J12916a2215k39040
$$ -98315 48047 207147 -53015 -147504 3166 -127124 -112904 98946 211862 -12215 -251255
15634b51255j25515c683p1850A20858b61269D2534e2257C4547g6613b1100f134
$$ -251255 -376770 -3683 -75533 120858 -261269 42534 -52257 34547 -76613 -21100 -6134
15622a09312J5040A23977Q349e11048A13839M278J826K07500q4036K6148A18254
$$ -109312 -94272 123977 132326 -511048 113839 118117 119943 327443 243407 269555 118254
15610b86735a10333o7579j67204G5216a52034d1466E4647h6656A28264a06395
$$ -286735 -110333 -177912 -345116 75216 -152034 -41466 54647 -86656 128264 -106395
15599I0715g9624r2951G4624h6192j34909D4294a0775j54115C3311K31711a24271
$$ 90715 -79624 -172575 74624 -86192 -221101 44294 -10775 -164890 33311 265022 -124271
15587F0496G294J11993C7729a27455G8354K48688A59144J70971a01936C04735
$$ 60496 7294 119287 37729 -127455 78354 327042 159144 330115 -101936 304735
15576c63845a198j95523B04557R8189D7328h7948o8667I5653b46378A10421L00353
$$ -363845 -1198 -196721 204557 302746 47328 -87948 -156615 95653 -246378 110421 410774
15565D10774A09011a09954A30265K32456j71522I2473L17039c9894j7380H4936
$$ 410774 109011 -109954 130265 362721 191199 92473 409512 -39894 -57274 84936
15554d9628k00565A73404a88876A46355c53112A30866c2497j58821j7304D053
$$ -49628 -250193 173404 -188876 146355 -353112 130866 -32497 -191318 -208622 4053
15543a70709l9569O2497B3184L14799c0990A2047a258A40286B5133a05139B00154
$$ -170709 -210278 -147781 23184 337983 -30990 12047 -1258 140286 25133 -105139 200154
15531B46231B138a93743B42625E9051J33955i8522d6254j04829M2017B07026a8115
$$ 246231 2138 -193743 242625 59051 193006 -98522 -46254 -151083 -109066 207026 -18115
15519E4510g4185A31573L4887C2458h5371A16501C3916a64439m7529g4640j54479
$$ 54510 -74185 131573 166460 32458 -85371 116501 33916 -164439 -211968 -74640 -229119
15508b29119C03815a0530r1583c6752C48079h8930p20k0992H780b45290B75768
$$ -229119 303815 -10530 -102113 -36752 348079 -88930 -89650 -110642 8780 -245290 275768
15496f5071p3040b3877D6821k3065a88242A30136a44422A9972a46073D50074b83751
$$ -65071 -138111 -23877 46821 23756 -188242 130136 -144422 19972 -146073 450074 -283751
15484f7696j45387d8616E8663M1849a63275H6258J74498F3694j6240L15149H7340
$$ -67696 -213083 -48616 58663 100512 -163275 86258 260756 63694 47454 362603 87340
15472B63677A03915A0790b3865r4706D1669J66431k9852b00880R1592a1274H4957
$$ 263677 103915 10790 -23865 -118571 41669 208100 178248 -200880 -109288 -11274 84957
15460B84556b76705H0670e7956q4111G9319l2429L7831N79669A36259F6315J8933
$$ 284556 -276705 80670 -57956 -142067 79319 46890 84721 664390 136259 66315 85248
15449H5248c017A6245J82852C8503b08681A96478O8334b06838R9245A08185C179
$$ 85248 -3017 16245 199097 38503 -208681 196478 264812 -206838 -107593 108185 3179
15437a92835e8817o3932J4797G779J55744A4204R7364h5059B60159b74284h8741
$$ -192835 -58817 -122749 -107952 7779 163523 14204 111568 -85059 260159 -274284 -88741
15425i3358B21642c44970N0291B43436b30267N5089A63523G571P1445j5495N9884
$$ -93358 221642 -344970 -294679 243436 -230267 -175178 163523 7571 79016 63521 123405
15414A23405l2747b68651A60412e9328f918k04481e3141K5669b07E8804a68231
$$ 123405 90658 -268651 160412 -59328 -6918 -211399 -53141 -27472 -207 58804 -168231
15402A03619a52300n3628B10810i102j00573B20439a23510l06073J74786d3133
$$ 103619 -152300 -205928 210810 -9102 -109675 220439 -123510 -429583 -254797 -43133
15391G1639J5404b25004I791J0849a58426A26578b0912A14676c3447B32924a29855
$$ 71639 87043 -225004 9791 20640 -158426 126578 -20912 114676 -33447 232924 -129855
15379e4881H471c3503B28978f8496A25685a47938k15944a9240A996h0425j15336
$$ -54881 8471 -33503 228978 -68496 125685 -147938 -363882 -19240 1996 -80425 -195761
15368a95761P8406l3761A36384a20201m6297I2379a46787A83998E4482i7183j9946
$$ -195761 -117355 -151116 136384 -120201 -166498 92379 -146787 183998 54482 -97183 -117129
15357a17129l886h772D19540I7250b21831A37739M29995j59759a70055A27061
$$ -117129 -121015 -8772 419540 97250 -221831 137739 567734 407975 -170055 127061
15346E0405g8156m6812K3062A06368a75333g7496j07672M4712C56058i705I6372
$$ 50405 -78156 -124968 -101906 106368 -175333 -77496 -185168 -140456 356058 -9705 96372
15334i8193A6041a391C2291J7473J59410h7124M1305l17265f9932m2639A15270
$$ -98193 16041 -1391 32291 49764 209174 -87124 -45819 -363084 -69932 -112571 115270
15322G7073a5508I0837P1099b0368C42213E956b40790g1764A99029E5786L05297
$$ 77073 -15508 90837 161936 -20368 342213 5956 -240790 -71764 199029 55786 361083
15311C61083c8995B98649G2282b32048I1344b61910f6446A27734J06906A01130
$$ 361083 -38995 298649 72282 -232048 91344 -261910 -66446 127734 234640 101130
15300b4008p5164D5278J02268d8849A4753a57253B79716c89807B85108A6533d3704
$$ -24008 -99172 45278 147546 -48849 14753 -157253 279716 -389807 285108 16533 -43704
15288A09605m3528a56745e4722B18092q4429k3575A796h9295l0900A9936L18527
$$ 109605 66077 -156745 -54722 218092 133663 110088 1796 -89295 -120195 19936 338463
15277C38463o5966H1548K38025a8485j8424j60175H0688c918j1498m57266a29518
$$ 338463 272497 81548 319573 -18485 -36909 -197084 80688 -3918 -15416 -472682 -129518
15265C8464i9303I7972C6942J37989Q9437n7946a70211E4255J84079P5582A54781
$$ 38464 -99303 97972 36942 174931 264368 206422 -170211 54255 238334 313916 154781
15253h0657B99783n2093K81219a8320A0356L90945A02383b3420q4103G7939Q8037
$$ -80657 299783 247690 528909 -18320 10356 401301 102383 -23420 -107523 77939 165976
15242A65976J62344G8042h5692H3095a91355G4015k9824a09035k39627C19611
$$ 165976 328320 78042 -85692 83095 -191355 74015 44191 -109035 -348662 319611
15231C13764a87817G330K29554C6403e3072j33256C55744i2637M1584I0610M67897
$$ 313764 -187817 7330 236884 36403 -53072 -186328 355744 -92637 -51053 90610 558507
15220E58507a50716C51892i371j63669B69931a75761O452P8621j63503A09588
$$ 558507 -150716 351892 -9371 -173040 269931 -175761 -169309 -90688 -254191 109588
15209A66599F3675J39142m1074b78923g7070B07783G0570b09643A56935p7597
$$ 166599 63675 202817 161743 -278923 -77070 207783 70570 -209643 156935 79338
15199G9338J54732B2664J249K46964n3226a25610C32505E2720J68916r3056f3009
$$ 79338 234070 22664 23913 270877 217651 -125610 332505 52720 221636 128580 -63009
15187a04522B83378A37393b1340m6646F5752k9290K4802J60874L71464A26445
$$ -104522 283378 137393 -21340 -67986 65752 36462 61264 222138 593602 126445
15176i3810B08994C9515L4901L18844j66889D8874k804K23971j06787p0761a41129
$$ -93810 208994 39515 74416 393260 226371 48874 46070 270041 163254 92493 -141129
15164d3939B95059J22794j04062j04362R2006m5367k561j8036D608a12239j6130
$$ -43939 295059 417853 313791 209429 301435 256068 253507 235471 4608 -112239 -128369
15153a28369C17347j38133a1832A73707P4339R3114a6074E3480r56b9276B09925
$$ -128369 317347 179214 -11832 173707 248046 341160 -16074 53480 52524 -29276 209925
15141C9605L0882K32767p5116J04834d3417j85508A29144R9636F8401M6396a84817
$$ 39605 70487 303254 228138 332972 -43417 -228925 129144 228780 68401 114797 -184817
15129A16297E3573I018P6340J11283I1791a9373A35544J85070j24983e8106C8716
$$ 116297 53573 9018 85358 196641 91791 -19373 135544 320614 195631 -58106 38716
15117b21700A04818K611h1984A45631o991C2173R8766b839B45032A2725M24967
$$ -221700 104818 107429 -81984 145631 138640 32173 130939 -2839 245032 12725 437692
15106D37692A04811n0645J4042k7380b37967B83579J27547c0707k22616E0572
$$ 437692 104811 54166 68208 40828 -237967 283579 411126 -30707 -253323 50572
15095C91938A29361O0827B648g8011A15055L15679a33481B27410j00770J0683
$$ 391938 129361 190188 2648 -78011 115055 430734 -133481 227410 126640 137323
15085A37323J99008M8405J08768A6352i7147E8337i9117B80828o7732J52311A3964
$$ 137323 336331 384736 493504 16352 -97147 58337 -99117 280828 213096 365407 13964
15073A39091K04019Q5067A83224a10904B23631C3207L56177j05541a23005B31569
$$ 139091 343110 428177 183224 -110904 223631 33207 389384 283843 -123005 231569
15062a60258A43531I177K3445h8184A00685i3091A46246a9103E0813c4296I56
$$ -160258 143531 9177 32622 -88184 100685 -93091 146246 -19103 50813 -34296 956
15050b86862A45460K38315b6871B88469L9006c18129c094B75592A07081b18663
$$ -286862 145460 383775 -26871 288469 327475 -318129 -3094 275592 107081 -218663
15039B6626L27247b787B62265n5670R6926J7591a10655B18555A6931J44830O491
$$ 26626 353873 -2787 262265 206595 303521 321112 -110655 218555 16931 161761 168252
15028A68252P088L7463D4959L47772A68684K45212G1548a02350H5918g646n9839
$$ 168252 175340 212803 44959 392731 168684 413896 71548 -102350 85918 -7646 -67485
15017f7485G1197i4010B9505M90052g92A48280g864C67706l6088L5100j03501
$$ -67485 71197 -94010 29505 519557 -792 148280 -7864 367706 331618 366718 263217
15006B63217K22497j89512m6134l357a04820B50773K13902A67893Q8647o3080
$$ 263217 485714 296202 250068 246711 -104820 250773 464675 167893 256540 193460
14996A93460J6796j04662b48573J09125B13527L41252B38681j05999Q7564o7274
$$ 193460 210256 105594 -248573 -139448 213527 554779 238681 132682 220246 152972
14986A52972M27610B40199L19j08298a90838C56940m5441D1096O1897J57511p2797
$$ 152972 580582 240199 240518 132220 -190838 356940 311499 41096 102993 260504 187707
14975A87707a57946B0869e6934C00777K24578k29058R09b30814E70108j63418
$$ 187707 -157946 20869 -56934 300777 525355 296297 297206 -230814 570108 406690
14965D06690P2413l4135B00612E5831O1545J51430K66203j06940j48350G548K11157
$$ 406690 479103 444968 200612 55831 117376 268806 535009 428069 279719 7548 218705
14954B18705K37968B12342K75486n6105m1789A90481L55436q0180q6148L5033
$$ 218705 456673 212342 487828 431723 389934 190481 545917 465737 379589 414622
14944D14622n3814A00126M68452j86209M6706j58892j24108L24204d4721D22648
$$ 414622 360808 100126 568578 382369 429075 270183 146075 470279 -44721 422648
14933D91329j70573L1357j03158J7409q1251B6394J93484Q3089I4355R6982B6202
$$ 491329 320756 352113 248955 266364 185113 26394 219878 302967 94355 191337 26202
14921C47855p4865L30201A06554N16825B86314k1057J30929a3782C58519l0621
$$ 347855 272990 603191 106554 623379 286314 265257 396186 -13782 358519 327898
14911C27898R6546p5270L90419b66324E22497j42993B4265b61926F69688C17100
$$ 327898 424444 349174 739593 -266324 522497 379504 24265 -261926 669688 317100
14900E56897j83485m5940l7667L93629B80850D612J17541L347Q0725l8905P7829
$$ 556897 373412 327472 289805 683434 280850 4612 122153 125500 206225 167320 245149
14889B45149K51291j98014J36926P997M2128o7168q6743j02722a2113m1508E9456
$$ 245149 496440 298426 435352 443349 485477 418309 331566 228844 -12113 -53621 59456
14877E22943r6079o9806L2608j11052J21422P9672Q8887q2815A10101l9212M10433
$$ 522943 426864 357058 389666 278614 400036 479708 568595 485780 110101 70889 481322
14866D81322R7246j10375A39810L76566j21480j81476K51793P3413M9035N0250
$$ 481322 578568 468193 139810 516376 394896 213420 465213 538626 587661 637911
14856F37911k26082j928j43301J54748j30896J70404r2586M19839l36247J52166
$$ 637911 411829 409901 266600 421348 290452 460856 368270 788109 451862 604028
14846F04028j79556j15358L83024k68545J74661K22133k51725m6145j66607l9488
$$ 604028 424472 309114 692138 423593 598254 820387 568662 522517 355910 316422
14836C16422m6768P3290I7777K60024N8387J82496j55558j33774K61844A72578
$$ 316422 269654 342944 97777 357801 416188 598684 443126 309352 571196 172578
14825E32302k50128J42651O3016J64475K3226B67632M60024q8163A15993N15234
$$ 532302 282174 424825 487841 652316 675542 267632 727656 639493 115993 631227
14815F31227B53424P6235O4142L84437L2812l821k10396B08133J20545L35518
$$ 631227 253424 329659 393801 778238 811050 807229 596833 208133 328678 664196
14805F64196J41205C51465J99747n5864J72030q8661k24009J35362J68714o9966
$$ 664196 805401 351465 551212 495348 667378 578717 354708 490070 658784 588818
14795E88818p1017j42013J72931P2215B67337R7072J7530L91413J48028k59725
$$ 588818 517801 375788 548719 620934 267337 364409 381939 773352 921380 661655
14785F61655j24794M1716j17214M48017N7003k78017M9653l6295k33974M34256
$$ 661655 536861 578577 461363 909380 966383 688366 738019 701724 467750 902006
14775I02006m26991k61N31737A97795P83273m07506Q5881B39455O14114p7635
$$ 902006 475015 474754 1006491 197795 981068 573562 659443 239455 853569 775934
14765G75934K75502l46947K11873k41697J1571K64647J2088n8627M6091m17274
$$ 775934 1051436 704489 916362 674665 686236 950883 962971 904344 950435 533161
14755E33161L24318K9465m22884J80604j64982K81144j40857N7906j21675M05156
$$ 533161 857479 886944 464060 644664 479682 760826 619969 677875 556200 961356
14745I61356q6411k46176J14502P8623l565M0940J09999j67194j33987J49845
$$ 961356 874945 628769 743271 821894 818329 859269 969268 802074 668087 817932
14735H17932m5309K56672D96178M92008j60984j61061K66737k55267J56488J7723
$$ 817932 772623 1029295 496178 988186 827202 666141 932878 677611 834099 851822
14725H51822q6777L81878k50572J46433l61224L75930j00406k29741K53674J12741
$$ 851822 765045 1146923 896351 1042784 681560 1057490 957084 727343 981017 1093758
14715A093758m83952J68553K18947l37888Q9968K78852l20804m1124J75530k0970
$$ 1093758 609806 778359 997306 659418 749386 1028238 707434 666310 841840 820870
14705H20870n3718K68528m4232m5626k35420K52996m7408k44418L42313m7261
$$ 820870 767152 1035680 991448 945822 710402 963398 915990 671572 1013885 966624
14695I66624j49553L82422k56828L4671j43112J75478K29749p0601k44757o3146
$$ 966624 817071 1199493 942665 977336 834224 1009702 1239451 1168850 924093 860947
14685H60947O619j02918J71822k27075N90091n63590K11066J65276j18202J7293
$$ 860947 867566 764648 936470 709395 1299486 735896 946962 1112238 994036 1011329
14675A011329L52445k90539L78168l62306k95541K74631N3865M8847j49530K90403
$$ 1011329 1363774 1073235 1451403 1089097 793556 1068187 1122052 1170899 1021369 1311772
14665A311772j78015O4999N02879G70942P08542o40823K12591l352j76218K61003
$$ 1311772 1133757 1198756 1701635 770942 1479484 838661 1051252 1047900 871682 1132685
14655A132685J03477j61474j813o7601J50485M1114K4110J31041m50530K40540
$$ 1132685 1236162 1074688 1072875 1005274 1155759 1196873 1220983 1352024 901494 1142034
14645A142034K71028m66394M65662j28847k5770m3396k7069Q5521j20017R8108
$$ 1142034 1413062 946668 1412330 1283483 1257713 1214317 1187248 1272769 1152752 1250860
14635A250860k0599o8407L41530K00360k53452k01122L65845k27457K25354q6227
$$ 1250860 1230261 1161854 1503384 1703744 1450292 1249170 1615015 1387558 1612912 1526685
14625A526685l76972L11371M6949j82213l4583L47072l62396M23163j80497J05256
$$ 1526685 1149713 1461084 1508033 1325820 1291237 1638309 1275913 1699076 1518579 1623835
14615A623835k38211J5838K20122K35560l12741K68142m17523J28820M9294P8179
$$ 1623835 1385624 1401462 1621584 1857144 1544403 1812545 1395022 1523842 1573136 1651315
14605A651315K10619k29390K4208k91884L05975O0142q1539k66825K97217r238
$$ 1651315 1861934 1632544 1656752 1364868 1670843 1730985 1649446 1382621 1679838 1670600
14595A670600O1886P2744j27145l3741R3020J44088K29296l18576K03583k04902
$$ 1670600 1732486 1805230 1678085 1644344 1737364 1881452 2110748 1792172 1995755 1790853
14585A790853K05455L48776k82698l40012p195L22723J34395j11255J28942l78280
$$ 1790853 1996308 2345084 2062386 1722374 1715179 2037902 2172297 2061042 2189984 1811704
14575A811704O59662p4778k00776J58196q5579j58879L70014n8956J75803r6170
$$ 1811704 2471366 2396588 2195812 2354008 2268429 2109550 2479564 2420608 2596411 2500241
14565B500241J2804K89481Q3637m36480K55245n6003J3706J37307N35441N806
$$ 2500241 2513045 2802526 2886163 2449683 2704928 2648925 2662631 2799938 3335379 3341185
14555C341185K66667j81921R41856l7921N44207J173556J877183L567779Q360953
$$ 3341185 3607852 3425931 4367787 4329866 4874073 6047629 7924812 11492591 19853544
14546A9853544J9410630N404849A8960987H462298l215567j670065n10971o95843
$$ 19853544 39264174 44669023 18960987 8462298 5246731 3576666 3065695 2369852
14538B369852l90380K40429n3585J33593K02978l92534K11993P898M374J07983
$$ 2369852 1979472 2219901 2166316 2299909 2502887 2110353 2322346 2330244 2334618 2442601
14528B442601n51169P41978j71110J21599k16024K27783K33232l17243k3607J99653
$$ 2442601 1891432 2633410 2462300 2583899 2367875 2595658 2828890 2511647 2488040 2687693
14518B687693J07219l71928K43063J68453o5014q2531q2415J52920L83446l82153
$$ 2687693 2794912 2422984 2666047 2834500 2769486 2686955 2604540 2757460 3140906 2758753
14508B758753N49648l61754O5050r1592N11691j80496j01782K24516l31852K85241
$$ 2758753 3308401 2946647 3011697 2920105 3431796 3251300 3149518 3374034 3042182 3327423
14498C327423J90192K103R9380n7380K10965l05921J9745p6303N12532J52900
$$ 3327423 3517615 3519718 3619098 3561718 3772683 3466762 3486507 3410204 3922736 4075636
14488D075636o56312M62143m0729N4080o9953K44071K0095J9311n3129J49065
$$ 4075636 3419324 3881467 3840738 3894818 3824865 4068936 4089031 4108342 4055213 4204278
14478D204278J67734j43477J72827l00994K11797p9621N09283k39300k2566J02231
$$ 4204278 4372012 4228535 4401362 4100368 4312165 4232544 4741827 4502527 4479961 4582192
14468D582192m5517R8413l7529J31051J45277L1103J83626r1577l7880N30725
$$ 4582192 4536675 4635088 4597559 4728610 4873887 4904990 5088616 4997039 4959159 5489884
14458E489884l61529J54361J85356j66355P4041J71055J012J20531J85378l90376
$$ 5489884 5128355 5282716 5468072 5301717 5375758 5546813 5547825 5668356 5853734 5463358
14448E463358j00221J86133K60852k6641K98147m6512J33377K50331j96892J62593
$$ 5463358 5363137 5549270 5810122 5783481 6081628 6035116 6168493 6418824 6221932 6384525
14438F384525L10036n0187J23931k21710L43628j74782L75979j64969J53817J0254
$$ 6384525 6694561 6644374 6768305 6546595 6890223 6715441 7091420 6926451 7080268 7090522
14428G090522J69118n2608N50664J13927k23085O06001o38674L90164M28471k00952
$$ 7090522 7259640 7207032 7757696 7871623 7648538 8254539 7615865 8006029 8434500 8233548
14418H233548M75649R8736J86404j19393M02883l0596q9996K77178Q7785M58407
$$ 8233548 8709197 8807933 8994337 8874944 9277827 9247231 9157235 9434413 9522198 9980605
14408I980605j08136q2329N92412p2692K15835n284J2773N75856n4511q1887M94433
$$ 9980605 9872469 9790140 10382552 10309860 10525695 10520411 10533184 11109040 11054529 10972642 11467075
14397A1467075K14394k36107M57104K14556K82398K22507j65835M41669M26117
$$ 11467075 11681469 11445362 11902466 12117022 12399420 12621927 12456092 12897761 13323878
14388A3323878J93347M26483R3827r7736N00698j8120O83360J88797K53374J61558
$$ 13323878 13517225 13943708 14037535 13939799 14440497 14422377 15105737 15294534 15547908 15709466
14378A5709466K04403N45592L3910N77983O54298P9372P34467j19255M5802P33659
$$ 15709466 15913869 16459461 16493371 17071354 17725652 17805024 18539491 18420236 18466038 19199697
14368A9199697L54478P50726j50573N99303K00977N94399N68772L82720P74226
$$ 19199697 19554175 20304901 20154328 20753631 20954608 21549007 22117779 22500499 23274725
14359B3274725M12525L22081J058912K06079R18141K54902N21744O61296Q10989
$$ 23274725 23687250 24009331 25068243 25274322 26192463 26447365 26969109 27630405 28441394
14350B8441394O14087Q31607L21063R89059O62518J141158O81076P84235J068057
$$ 28441394 29055481 29887088 30208151 31197210 31859728 33000886 33681962 34466197 35534254
14341C5534254R27043N59895J129374J097068J193205J188363J201132J275636
$$ 35534254 36461297 37021192 38150566 39247634 40440839 41629202 42830334 44105970
14333D4105970J259754J206197J723578J674325J242939J525709J620867J471170
$$ 44105970 45365724 46571921 48295499 49969824 51212763 52738472 54359339 55830509
14325E5830509K061942K293629J677727K354482J625875K738430J969642K783629
$$ 55830509 57892451 60186080 61863807 64218289 65844164 68582594 70552236 73335865
14317G3335865K701435K835907K436467L543065L355591L318433L641976L714973
$$ 73335865 76037300 78873207 81309674 84852739 88208330 91526763 95168739 98883712
14309I8883712L999892M619354M208270M702075N324683N310067N664206N917708
$$ 98883712 102883604 107502958 111711228 116413303 121737986 127048053 132712259 138629967
14301A38629967O482940O123143P337073P556446P997357Q381814Q783385R132554
$$ 138629967 145112907 151236050 158573123 166129569 174126926 182508740 191292125 200424679
14293B00424679R988902J0503352J0744030J1617095J1800644J2497446J3185285
$$ 200424679 210413581 220916933 231660963 243278058 255078702 267576148 280761433
14286B80761433J3654215J4214060J4258437J4476172J5110269J4878888J4549698
$$ 280761433 294415648 308629708 322888145 337364317 352474586 367353474 381903172
14279C81903172J4794263J4109709J3232550J2090571J1100535Q999147O300721
$$ 381903172 396697435 410807144 424039694 436130265 447230800 456229947 462530668
14272D62530668K890568J714240P07701m69804m446914o085371o926711p974772
$$ 462530668 465421236 467135476 467843177 467373373 462926459 456841088 449914377 441939605
14264D41939605r164158j0898514j2373602j3320695j4109794j4859810j5252909
$$ 441939605 432775447 421876933 409503331 396182636 382072842 367213032 351960123
14257C51960123j5158375j5097984j5112004j4230736j4220836j3679959j2912905
$$ 351960123 336801748 321703764 306591760 292361024 278140188 264460229 251547324
14250B51547324j2470529j1429502j1301396j0550260r702886r586159q396813
$$ 251547324 239076795 227647293 216345897 205795637 196092751 186506592 178109779
14243A78109779q276484p977847p625799p311584o357277n990248n371213o115386
$$ 178109779 169833295 161855448 154229649 146918065 140560788 134570540 129199327 123083941
14235A23083941n189226m907775m650137m376677l578816m487270l584929l903978
$$ 123083941 117894715 112986940 108336803 103960126 100381310 95894040 92309111 88405133
14227H8405133l233743l119859k968969l050470k464231k841273k207159k211639
$$ 88405133 85171390 82051531 79082562 76032092 73567861 70726588 68519429 66307790
14219F6307790k545344k149118j992573j977414j844588j554290j188068j777170
$$ 66307790 63762446 61613328 59620755 57643341 55798753 54244463 53056395 51279225
14211E1279225j698542j548435j400527j450997n70899j169732j574910j115620
$$ 51279225 49580683 48032248 46631721 45180724 44609825 43440093 41865183 40749563
14203D0749563j280050j114884q09127o74117j220793j092975r08170r58723m51345
$$ 40749563 39469513 38354629 37545502 36871385 35650592 34557617 33649447 32690724 32239379
14194C2239379j051216k84965j333669n93923o21940o64040n52986o71292r13755
$$ 32239379 31188163 30903198 29569529 28975606 28353666 27689626 27136640 26465348 25551593
14185B5551593k7498q10415p37016j63196q87610k88048o10755l52580l24724
$$ 25551593 25524095 24713680 23976664 23813468 22925858 22637810 22027055 21674475 21349751
14176B1349751l53443q23022k87890p01642j65857m06379n96207J53929o06906
$$ 21349751 20996308 20173286 19885396 19183754 19017897 18611518 18015311 18169240 17562334
14167A7562334k05292o29585k62012p4642q3992m70935m08439j68931q5072o69231
$$ 17562334 17357042 16727457 16465445 16390803 16306811 15835876 15427437 15258506 15173434 14504203
14157A4504203k06466n5785j17638n64838P506o68182J98571o7564k94485l35408
$$ 14504203 14297737 14241952 14124314 13559476 13566982 12898800 13097371 13029807 12735322 12399914
14147A2399914l6884k40960j74342l14959J12093k53597o6243n42531K44654k39372
$$ 12399914 12363030 12122070 11947728 11632769 11744862 11491265 11425022 10882491 11127145 10887773
14137A0887773l77043l90149J07709k02470P1507n9408n06776l9204l74139J91067
$$ 10887773 10510730 10120581 10228290 10025820 10097327 10037919 9531143 9491939 9117800 9308867
14127I308867m37717K20801j74103j84496j75733l30974j4139J87110k78503k15746
$$ 9308867 8871150 9091951 8917848 8733352 8557619 8226645 8212506 8399616 8121113 7905367
14117G905367M55685k39791m1610m78745R9513k37062j87664N222J01223p0800
$$ 7905367 8361052 8121261 8079651 7600906 7700419 7463357 7275693 7280915 7382138 7311338
14107G311338j40396k29206k2319j22335k1212m17001J51530K3594j39044j9397
$$ 7311338 7170942 6941736 6919417 6797082 6775870 6358869 6510399 6533993 6394949 6375552
14097F375552l76561L4329J13956k62004J06343k68915J74623l17869J02144k08956
$$ 6375552 5998991 6033320 6147276 5885272 5991615 5722700 5897323 5579454 5681598 5472642
14087E472642J18780K37052n48200k3938l2300J05889p7158n01659K07696j40438
$$ 5472642 5591422 5828474 5280274 5256336 5224036 5329925 5252767 4751108 4958804 4818366
14077D818366L67033n62663K38315K29678m59384o2867q0035j5750l0853L87781
$$ 4818366 5185399 4622736 4861051 5090729 4631345 4568478 4488443 4472693 4441840 4829621
14067D829621k74549r6047k72191n2413J15666J04044k65980L95317r6024J13291
$$ 4829621 4555072 4459025 4186834 4134421 4250087 4354131 4088151 4483468 4387444 4500735
14057D500735l39915J11200K5624l83716j26697K57924m2275k80421n1211L02622
$$ 4500735 4160820 4272020 4297644 3913928 3787231 4045155 4002880 3722459 3671248 3973870
14047C973870j01217j66365L76041p49594Q2666q5415L4983l66848L30341l5703
$$ 3973870 3872653 3706288 4082329 3332735 3415401 3329986 3364969 2998121 3328462 3292759
14037C292759P7981k87080J93112J86705k66567P6365M668j77992j920j5822J99638
$$ 3292759 3370740 3083660 3276772 3463477 3196910 3273275 3277943 3099951 3098031 3082209 3281847
14026C281847j88665K8357l0667P2144n16791K09098J13673j62172L19622k26841
$$ 3281847 3093182 3121539 3090872 3163016 2646225 2855323 2968996 2806824 3126446 2899605
14016B899605j05054r5476j85077k0360L3729k6736j16983L09697j07505J52794
$$ 2899605 2794551 2699075 2513998 2493638 2527367 2500631 2383648 2693345 2585840 2738634
14006B738634l49057P1430j24400o2836o3222K22836k9944K70598l50106j2650
$$ 2738634 2389577 2461007 2336607 2273771 2210549 2433385 2403441 2674039 2323933 2311283
13996B311283L29783l25817J61802l88376O52328k36899N44960N40407K925256
$$ 2311283 2641066 2315249 2477051 2088675 2741003 2504104 3049064 3589471 6514727
13987F514727O530445J9543664J5097124k2133714j1895970m237549k690820j381338
$$ 6514727 13045172 32588836 47685960 25552246 13656276 9418727 6727907 5346569
13979E346569p10823o30476r1122o13401K4118l38331p6997P8047O869k70189
$$ 5346569 4635746 4005270 3914148 3300747 3324865 2986534 2909537 2987584 2994453 2724264
13969B724264j22839J31208j96164O2141l02713k40206N24675j48743j7775M922
$$ 2724264 2601425 2732633 2536469 2598610 2295897 2055691 2580366 2431623 2413848 2418770
13959B418770K2909n10997O64347n58626K66050k93287M0114N1554L7599O1072
$$ 2418770 2441679 1930682 2595029 2036403 2302453 2009166 2049280 2100834 2138433 2199505
13949B199505k36800p4060j21081n7661q5144K30172N50518n41805K06966k4690
$$ 2199505 1962705 1888645 1767564 1709903 1624759 1854931 2405449 1863644 2070610 2045920
13939B045920r4124l14256J44014j11312j14470J89622r7724q561R0582M0929
$$ 2045920 1951796 1637540 1781554 1670242 1555772 1745394 1647670 1639109 1729691 1770620
13929A770620k37034K76311R6992p3812k75312N2732K03999j12447j53842L90320
$$ 1770620 1533586 1809897 1906889 1833077 1557765 1610497 1814496 1702049 1548207 1938527
13919A938527j76425J7438j34543P118j87029m64075O51965p9994j9065J11915
$$ 1938527 1762102 1779540 1644997 1652115 1465086 1001011 1652976 1572982 1553917 1665832
13909A665832q3082N5781K0799k44325L04605r4241q0783k6331k28744L03645
$$ 1665832 1582750 1638531 1659330 1415005 1719610 1625369 1544586 1518255 1289511 1593156
13899A593156k97951K13191k649M0109j67460k9417Q5429j3308q2249k48687N13613
$$ 1593156 1295205 1508396 1505747 1545856 1378396 1348979 1434408 1421100 1338851 1090164 1603777
13888A603777j34504k79123M07529n84092L9689L57756n3351k88024L95232l33614
$$ 1603777 1469273 1190150 1597679 1013587 1053276 1411032 1357681 1069657 1464889 1131275
13878A131275J21359J1543l37528M62270R809j36159K0358j47480J33487M4276
$$ 1131275 1252634 1264177 926649 1388919 1398728 1262569 1282927 1135447 1268934 1313210
13868A313210o325m33824L43898j91061L80544m14532J07808P5309o1975j11224
$$ 1313210 1306885 873061 1216959 1025898 1406442 991910 1099718 1175027 1113052 1001828
13858A001828L43212k33849J37694k25051L00867J63469n17392K88253m08940
$$ 1001828 1345040 1111191 1248885 1023834 1324701 1488170 970778 1259031 850091
13849H50091P0650K29979j83475L27687k79056k6862p6220R4073N1144l05001
$$ 850091 920741 1150720 967245 1294932 1015876 989014 912794 1006867 1058011 753010
13839G53010M7063o9075M91251m64620K03515M68138n13216l9979K40008k42579
$$ 753010 800073 730998 1222249 757629 961144 1429282 916066 876087 1116095 873516
13829H73516P1398k74493L92466L8532R1079m02203J6046N02402l57460j35509
$$ 873516 944914 670421 1062887 1101419 1192498 790295 806341 1308743 951283 815774
13819H15774L96782m50416K75319l1722n7543L812j34710R2640J13403J8917l27815
$$ 815774 1212556 762140 1037459 1005737 948194 952006 817296 909936 1023339 1042256 714441
13808G14441k0115M0561N63827n39444k35672J58430r4425M11244J45580l09686
$$ 714441 694326 734887 1298714 759270 523598 682028 587603 998847 1144427 834741
13798H34741R7525j2112J57030j80667j24810l5667K14134k15757p6597R7348
$$ 834741 932266 920154 1077184 896517 771707 736040 950174 734417 657820 755168
13788G55168N4428J58924k3465j99311J3207j8272j8052j76479J32145J73546
$$ 755168 809596 968520 945055 745744 758951 740679 722627 546148 678293 851839
13778H51839m10817M44671k13088j40812K74934p5792J62645N808j42166k1330
$$ 851839 441022 885693 672605 531793 806727 730935 893580 899388 757222 735892
13768G35892P9898L2134D21997P9701K8219L31893j5972D04947M17568p6656m6731
$$ 735892 815790 847924 421997 501698 529917 861810 845838 404947 822515 745859 699128
13757F99128q9122J90914k89639K33687k57164L02675J30568n4652l93857M40078
$$ 699128 610006 800920 511281 744968 487804 790479 921047 866395 472538 912616
13747I12616m13517J93623J08983l59970M73366D40663K14999j81571M50001l61858
$$ 912616 499099 692722 801705 441735 915101 440663 655662 474091 924092 562234
13737E62234J35429J23049C8227O02193J7427k11279L32462p122r1247p378k83412
$$ 562234 697663 820712 38227 640420 657847 446568 779030 771908 680661 673283 389871
13726C89871K57017l3790R9397j23664R0520j67214A80500K12554K63885p8005
$$ 389871 646888 613098 712495 588831 679351 512137 180500 393054 656939 578934
13716E78934N7683J18586j22497J3883j15820j6760j21544L7830j1161J76544
$$ 578934 636617 755203 632706 646589 530769 514009 392465 430295 419134 595678
13706E95678J84348l35420k8128K99107K66226m82480J50468q6733j73931L15235
$$ 595678 780026 444606 416478 715585 981811 499331 649799 563066 389135 704370
13696G04370k17909o1501N7776A17779L98397K66577l36242P6280r5808r0000
$$ 704370 486461 424960 482736 117779 516176 782753 446511 522791 426983 336983
13686C36983J35136M34792k14377k26721A43758M72020k7632q7083k2521M0549
$$ 336983 472119 906911 692534 465813 143758 615778 588146 501063 478542 519091
13676E19091k37226m7004q4217K46774K66881m5602k78696K37173k12559Q5770
$$ 519091 281865 234861 150644 397418 664299 618697 340001 577174 364615 450385
13666D50385j662L05148l11981k13225M3437J47848Q4711n6218L15356l73333
$$ 450385 448723 753871 441890 228665 272102 419950 504661 448443 763799 390466
13656C90466J51530l0708J38980j0052j45008B33384K08801K45603A72716L22379
$$ 390466 541996 511288 650268 640216 495208 233384 442185 687788 172716 495095
13646D95095p826J06511k20432K72715m249j17052k20947K62844J46782A98103
$$ 495095 487269 593780 373348 646063 641814 524762 303815 566659 713441 198103
13635A86495M54482B71750o5140J3054l1961K90090o6239N4840j70184o4201J82177
$$ 186495 640977 271750 206610 219664 187703 477793 411554 466394 296210 232009 414186
13624D14186O823R692A64707M00375q2898j6162B01892k9316L56990J86617l12574
$$ 414186 421009 430701 164707 565082 482184 466022 201892 172576 529566 716183 403609
13613D03609l2274k5838J57959j19107m2667j08006A01788L87230j98640J92977
$$ 403609 371335 345497 503456 384349 341682 233676 101788 489018 290378 483355
13603D83355A38594M37553J06484B37784J3339J12338J8188J50838j41426j46354
$$ 483355 138594 576147 682631 237784 251123 363461 381649 532487 391061 244707
13593B44707J53008A76623L66139B25580p752q1141M41763j32429j35022K71072
$$ 244707 397715 176623 542762 225580 217828 136687 578450 446021 310999 582071
13583E82071k83454J45066K13655l9706j07906n6175R2491K1461R7886C17540
$$ 582071 298617 443683 657338 617632 509726 453551 546042 567503 665389 317540
13572E36956j85936A01451J89024A8668Q20807l78527j7523p8086j16740j05116
$$ 536956 351020 101451 290475 18668 839475 460948 443425 365339 248599 143483
13562A43483K44361j60143L22637n7110q9903j33716A10781L98671N0652k72531
$$ 143483 387844 227701 550338 493228 403325 269609 110781 509452 560104 287573
13552B87573J74851K6136m7052Q7561j55346j2093K0590A60680J98675K6369K6709
$$ 287573 462424 488560 441508 529069 373723 361630 382220 160680 359355 385724 412433
13541D12433A74630M48042A68139L29353j28766r7028K09526j71773q1707L46678
$$ 412433 174630 622672 168139 497492 368726 271698 481224 309451 227744 574422
13531E74422k83783J03363A03932N68027C25007j1726A32095J06250K43954j48815
$$ 574422 290639 394002 103932 671959 325007 313281 132095 238345 482299 333484
13521C33484J1801B5253L53211m0601l8554L75907B56096n2344R331M6563J45660
$$ 333484 345285 25253 378464 337863 299309 675216 256096 203752 213083 259646 405306
13510D05306p154J70159j89669j36324L3232K55415k11429J43443j06983O9711
$$ 405306 398152 568311 378642 242318 275550 530965 319536 462979 355996 425707
13500D25707j37398k7145o5868J82501O46K53946B76353A2747L79741I3608j8536
$$ 425707 288309 261164 195296 377797 378443 632389 276353 12747 392488 93608 75072
13489G5072g791k4414B56309o3249K22743B9611L77831O494A87888R1248m5240
$$ 75072 -7791 -32205 256309 193060 415803 29611 407442 413936 187888 279136 233896
13478B33896B8094J46666K2324r7877J42925L5711N4925j13285J77924r3797M0341
$$ 233896 28094 174760 197084 99207 242132 277843 332768 219483 397407 303610 343951
13467C43951o555L8316j9j33076J10464b9551C56975K674n5731L21127B63291
$$ 343951 337396 375712 375693 242617 353081 -29551 356975 359649 303918 625045 263291
13455a42607C95304l0559A62242K7467J18202A27273M2361R2935j26915M25765
$$ -142607 395304 364745 162242 189709 307911 127273 169634 262569 135654 561419
13445E61419A30910J67445A46829g8073A23811e3585A70660a2519J883B49428
$$ 561419 130910 298355 146829 -78073 123811 -53585 170660 -12519 -10636 249428
13434B96618M1178q5309D2885J12458K51477R442H5162J89137J1130J67716A50262
$$ 296618 337796 252487 42885 155343 406820 416262 85162 274299 285429 453145 150262
13422D35083j25965p7225j12863O6361K8491l3317J56796B7475K34502r1197a10039
$$ 435083 309118 231893 119030 185391 213882 180565 337361 27475 261977 170780 -110039
13410C19653A1209J46514A0877K40392A1574L88771a2144C59613J49789N3565
$$ 319653 11209 157723 10877 251269 11574 400345 -12144 359613 509402 562967
13400E62967B06187a64718A81754d2138D74375j08255q4199e6862A94631L12848
$$ 562967 206187 -164718 181754 -42138 474375 366120 281921 -56862 194631 507479
13390E07479m7122j57099A35441K1629J65132j45374J1699G1973K28877K35673
$$ 507479 460357 303258 135441 157070 322202 176828 188527 71973 300850 536523
13380E36523A62414K19720a74412D25136C1007R0343D0570L35689J52406k48499
$$ 536523 162414 382134 -174412 425136 31007 121350 40570 376259 528665 280166
13370B80166N7290r1720a0074A74026b5769A28098a25702I3662L08586j43534
$$ 280166 337456 245736 -10074 174026 -25769 128098 -125702 93662 402248 258714
13360B58714G8093K892J89976a49250B25574j7138d3769C16872J02102A27629
$$ 258714 78093 80985 270961 -149250 225574 208436 -43769 316872 418974 127629
13349I044K84605B5952Q7528N787Q0393J1917m0358Q6915A0663N28659D4804J81414
$$ 9044 293649 25952 113480 119267 199660 211577 171219 258134 10663 539322 44804 226218
13337B26218J13616p2631i123A06574m2298P2061P8934g0829H0294M18844l4012
$$ 226218 339834 267203 -9123 106574 64276 136337 215271 -70829 80294 499138 465126
13326D65126r0443N1042j82886K10258j70981h2556A07323K92172L90424A193
$$ 465126 374683 425725 242839 453097 282116 -82556 107323 399495 789919 1193
13315B62708c3626E2933L62263J5970B01735H3428o511f6653A16237a63798D2957
$$ 262708 -33626 52933 415196 431166 201735 83428 76917 -66653 116237 -163798 42957
13303B87335D8024Q7708J64202A40408K24352A33460M02277A18894L71789A50900
$$ 287335 48024 135732 299934 140408 364760 133460 535737 118894 490683 150900
13292B95753n3682O4088P9876G5523A5651K76916C7087a4483A60117Q5093J10087
$$ 295753 242071 306159 386035 75523 15651 292567 37087 -14483 160117 245210 355297
13281C55297k4075L19987i9036A75593L6254J40052l6899H8003B9894K57681F5887
$$ 355297 331222 651209 -99036 175593 211847 351899 315000 88003 29894 287575 65887
13269B12860F9255J62949A13423n5257J29523q1991d4570A62346L9135m6238p1467
$$ 212860 69255 232204 113423 58166 187689 105698 -44570 162346 201481 155243 83776
13258H3776Q9978b1021m5436j6832k4630B94464G3763P1623J80447a39958F6757
$$ 83776 173754 -21021 -66457 -83289 -107919 294464 73763 145386 325833 -139958 66757
13246a83258C26548j51204a22405D79248B38429R8913H5295i5539C18024b14482
$$ -183258 326548 175344 -122405 479248 238429 337342 85295 -95539 318024 -214482
13235I9039d5470B71850J87124E0268J05275D8585K25641A01855J94565F9259
$$ 99039 -45470 271850 458974 50268 155543 48585 274226 101855 296420 69259
13224a08123C46831A26256R6930I0056a0801I6528F649M27052A43027O7169D8065
$$ -108123 346831 126256 223186 90056 -10801 96528 6649 433701 143027 210196 48065
13212A37008g3616A37234c72752D35342B14029k9573C276K06723e2940C12033
$$ 137008 -73616 137234 -372752 435342 214029 184456 3276 209999 -52940 312033
13201A44653K89438j32021j05794C9276R6247M2433J46095A55523c84772B39514
$$ 144653 434091 302070 196276 39276 135523 177956 324051 155523 -384772 239514
13190B71651E8360J76927A10242C6239k320K21756b43479A62433B392b0733A79218
$$ 271651 58360 235287 110242 36239 33919 255675 -243479 162433 2392 -20733 179218
13178A16831B2354M1471j7455N76c2060C72560C0653J67306b56444A47165h6966
$$ 116831 22354 63825 46370 46946 -32060 372560 30653 197959 -256444 147165 -86966
13166A39419a25830A02452L16541b49036A47811L03994j65834E9626Q8494J68197
$$ 139419 -125830 102452 418993 -249036 147811 451805 285971 59626 148120 316317
13156C16317A8238O2369O9688k8415K2002N5666K6012k171i076l17355B88745
$$ 316317 18238 80607 150295 121880 143882 199548 225560 223389 -9076 -326431 288745
13144A7329i9096A35818A5590O8862l5293p891J18985J91327e5804C7296e0327
$$ 17329 -99096 135818 15590 84452 49159 41268 160253 351580 -55804 37296 -50327
13132D46951j94111j22745C580N21464D4337K29490p8653L164J17910j10090L690
$$ 446951 252840 130095 3580 525044 44337 273827 195174 198338 316248 206158 209848
13121B09848c7751A7016a30535j36072E8350k6279N9380A0736L72227j19129j01315
$$ 209848 -37751 17016 -130535 -266607 58350 32071 91451 10736 382963 263834 162519
13110A62519a2196B39330F0395J80293q2753e3965A8332J3872K12556O1835c4665
$$ 162519 -12196 239330 60395 240688 157935 -53965 18332 32204 244760 306595 -34665
13098A44750a04061j32975C42630O5628A20544K71082j52837j17250J07978J9114
$$ 144750 -104061 -237036 342630 408258 120544 391626 238789 121539 229517 248631
13088B48631j7459J61781b58909A32894f3307A05947a04186b0651A0125K41208
$$ 248631 231172 392953 -258909 132894 -63307 105947 -104186 -20651 10125 251333
13078B51333J12938A17292K44605j13216K5911b22054a02079A69217C4743M7947
$$ 251333 364271 117292 361897 248681 274592 -222054 -102079 169217 34743 82690
13068H2690J11279b05925A93657b28023C27808A30513J47548N9734A26096A9870
$$ 82690 193969 -205925 193657 -228023 327808 130513 278061 337795 126096 19870
13057A50448N609K86081A44858F9926O684K59757k4144a75863A32585f8036j05601
$$ 150448 156057 442138 144858 69926 76610 336367 312223 -175863 132585 -68036 -173637
13046a73637D46742a44928F3298a61029a7447B61589C746J25832c3307A07338
$$ -173637 446742 -144928 63298 -161029 -17447 261589 3746 129578 -33307 107338
13035E1849J11071e263F4204J35416r6954f3548B08182b30312B24245q2001a54975
$$ 51849 162920 -5263 64204 199620 102666 -63548 208182 -230312 224245 142244 -154975
13023F7793b10978K2405B29771N3690P6069b19395A65034a8892B83763a04526
$$ 67793 -210978 -188573 229771 283461 359530 -219395 165034 -18892 283763 -104526
13012b30443J5114B17092a51081C6193a03625p4113A26281o681K64899j05874
$$ -230443 -215329 217092 -151081 36193 -103625 -177738 126281 119600 384499 278625
13002B78625a94433A63725C6758a17369A9310a87812B13767r9962E4865a50640
$$ 278625 -194433 163725 36758 -117369 19310 -187812 213767 113805 54865 -150640
12991C22422h5654k61500C04954E1863h612B45190g9470B69246I8209J50689J82208
$$ 322422 -85654 -347154 304954 51863 -8612 245190 -79470 269246 98209 248898 431106
12980D31106a79556j12102D57170i2987C9473K48593E4351a21390F0581j8274
$$ 431106 -179556 -291658 457170 -92987 39473 288066 54351 -121390 60581 42307
12970D2307b5371q3219j19498k8239A80692o1644b2127j78370A85291g7136j17164
$$ 42307 -25371 -108590 -228088 -256327 180692 119048 -22127 -200497 185291 -77136 -194300
12959a94300D5738J36755J6214a22945B9789L83675c44242D20R6184l7462J06656
$$ -194300 45738 182493 198707 -122945 29789 413464 -344242 420 96604 59142 165798
12948A65798P3967I014K0692L6288K6613J66824a60178k52419C49261j42099r5980
$$ 165798 239765 9014 29706 65994 92607 259431 -160178 -412597 349261 207162 111182
12937A11182C4919b68854A64118b09069J01196A88983F9712M2680O5036J94163
$$ 111182 34919 -268854 164118 -209069 -107873 188983 69712 112392 177428 371591
12927C71591F7225J8596b9506I6206N1273a35955A52233K823r461R4495P6430
$$ 371591 67225 85821 -29506 96206 147479 -135955 152233 155056 145595 240090 316520
12916C16520p3403a7117j49994B06020j9576b46825A5820b46424a22808k8981
$$ 316520 243117 -17117 -167111 206020 186444 -246825 15820 -246424 -122808 -151789
12906a51789B10864O461a46370A87445h9760j08965A42782Q272b09200P842D13805
$$ -151789 210864 217325 -146370 187445 -89760 -198725 142782 151054 -209200 -201358 413805
12894a86632g05A29707J02657C9091N2932a1469j46267G5826J33712F2712O9122
$$ -186632 -705 129707 232364 39091 92023 -11469 -157736 75826 209538 62712 131834
12883A31834k1471k5054L2430b60361A53781M1265J787d49272A23402g7279K9118
$$ 131834 110363 85309 117739 -260361 153781 195046 196833 -449272 123402 -77279 -48161
12872d8161p1482F7526O3219n8878K05705i1713l00541A60531c7444A87159K09657
$$ -48161 -119643 67526 130745 71867 277572 -91713 -392254 160531 -37444 187159 396816
12861C96816M5154g642A34848J85741d05936a76334H8969b2712F4410B8588P1906
$$ 396816 441970 -7642 134848 320589 -405936 -176334 88969 -22712 64410 28588 100494
12850A00494M6204A6130e3830C58283b5410A89609b0121k54017E4306b35813d1019
$$ 100494 146698 16130 -53830 358283 -25410 189609 -20121 -274138 54306 -235813 -41019
12838b04959K1456H5983D1497O6604l4411a71171A55958Q2282N9677d837I2769
$$ -204959 -183503 85983 41497 108101 73690 -171171 155958 238240 297917 -4837 92769
12826b5725j95793C47328b53703c6064k64406A36731n0081j3832I140K65110E8262
$$ -25725 -221518 347328 -253703 -36064 -300470 136731 86650 72818 9140 274250 58262
12814C83216a00812b7165C87303D0678a88015o8295J5726A75561A8277M0612b070
$$ 383216 -100812 -27165 387303 40678 -188015 -256310 -240584 175561 18277 58889 -2070
12802B22879a17062k3297E1084e0877K5280k6272A17931f1116A84464A4641c36280
$$ 222879 -117062 -140359 51084 -50877 -25597 -51869 117931 -61116 184464 14641 -336280
12790a32638b11A89639F2437h7589j11434Q4688A95601H2420J5436b6886G8866
$$ -132638 -211 189639 62437 -87589 -199023 -114335 195601 82420 97856 -26886 78866
12778e58799E9710g1106B0100J73738a14785b5090A02828m3989K60592j5634J1861
$$ -558799 59710 -71106 20100 193838 -114785 -25090 102828 58839 319431 303797 315658
12767C15658B839K80460a50196A16305L0578h9798F1508P4685j6644c11343B74004
$$ 315658 2839 283299 -150196 116305 146883 -89798 61508 136193 119549 -311343 274004
12755e9099m6664d2304j09789K6301A18940b55846F4058K12750f9833A33412f4923
$$ -59099 -105763 -42304 -152093 -125792 118940 -255846 64058 276808 -69833 133412 -64923
12743B540L51484j67216o3304m8082J82232a18190B11571J60563A07400m2488
$$ 2540 354024 186808 123504 75422 257654 -118190 211571 372134 107400 64912
12733F4912c1315q3649C27554K8281j67173J60200J64587F3047h5347j6795L5263
$$ 64912 -31315 -114964 327554 355835 188662 348862 513449 63047 -85347 -102142 -66879
12722f6879A30037L4540a41376e6667a2478A34708g3451B0594q389J558e6636
$$ -66879 130037 164577 -141376 -56667 -12478 134708 -73451 20594 12205 13763 -56636
12710d33635A72676N3860B5691K15270J44701j85495j6106H2542K68237D0015
$$ -433635 172676 226536 25691 240961 385662 200167 184061 82542 350779 40015
12699a40255N6533j81779a03906C55695a51939j74158C05254q5874N6420J06798
$$ -140255 -83722 -265501 -103906 355695 -151939 -326097 305254 219380 275800 382598
12689C82598I9692a36518C5454g4635p2693f5722n0664I5322P1742O8025J1136
$$ 382598 99692 -136518 35454 -74635 -147328 -65722 -116386 95322 167064 235089 246225
12678B46225J18578A758J19902L9937O8503G2447a2912G9325i5320H1305c024
$$ 246225 364803 1758 121660 161597 230100 72447 -12912 79325 -95320 81305 -3024
12666a28297F0805k7041a49906A65652E4076b4488k59279A28606j9742J35694
$$ -128297 60805 33764 -149906 165652 54076 -24488 -283767 128606 108864 244558
12656B44558J64934A4389J21424O4521f6546C75389A78938J33689b06527A18764
$$ 244558 409492 14389 135813 200334 -66546 375389 178938 312627 -206527 118764
12645f0262m8257B56382H2122K70712a28670I498J80357a84212A27619P798J05279
$$ -60262 -108519 256382 82122 352834 -128670 9498 189855 -184212 127619 135417 240696
12634B40696m0928K9549n1458K2360J0474M1833J83392k08589R3856k246A48160
$$ 240696 199768 229317 177859 200219 210693 252526 435918 227329 321185 318939 148160
12622f8310C7816a19333B54560I5947N7153a37765B50615H4207b85424g5781F2010
$$ -68310 37816 -119333 254560 95947 153100 -137765 250615 84207 -285424 -75781 62010
12610b40945B65134I5533e5946F5689J75165j818r1732J53825a16745p2818A64406
$$ -240945 265134 95533 -55946 65689 240854 239036 147304 301129 -116745 -189563 164406
12598A89893k9935K06604C5593d5015A94070J6381L0113a8352j01045B30285q520
$$ 189893 159958 366562 35593 -45015 194070 210451 240564 -18352 -119397 230285 221765
12587B21765b17575j5040g4507o3039j24581D567J61699M4835N49N9594A01534
$$ 221765 -217575 -232615 -74507 -137546 -262127 4567 166266 211101 211650 271244 101534
12575C36630j0079a17794I0953J5462d57951E8915c7924m6465A60641F822Q3878
$$ 336630 326551 -117794 90953 106415 -457951 58915 -37924 -84389 160641 6822 90700
12564I0700a01415n0740a1510B15019n0045J48780c58494F8110d54890b01232
$$ 90700 -101415 -152155 -11510 215019 164974 313754 -358494 68110 -454890 -201232
12553A69314a30234b3411D15331A03100C1111K57713a10795p8751c9601G7113
$$ 169314 -130234 -23411 415331 103100 31111 288824 -110795 -189546 -39601 77113
12542H503M17554a23571j67807B82279h5080l46167f619A34324J53959b36445
$$ 8503 426057 -123571 -291378 282279 -85080 -431247 -6619 134324 288283 -236445
12531a71754d0779n2615B80511b82302J35041B45351b44903B10906q5071A3796
$$ -171754 -40779 -93394 280511 -282302 -147261 245351 -244903 210906 125835 13796
12520c1831j63601B10872K10209e6249o47H1641A2824J011K6214A3199h1606j79835
$$ -31831 -195432 210872 421081 -56249 -56896 81641 12824 13835 40049 13199 -81606 -261441
12508b61441A08216f0748k01881I1257j349J30378A05666b00014j63723a20384
$$ -261441 108216 -60748 -262629 91257 89908 220286 105666 -200014 -363737 -120384
12497a6907j64852P3035j06968B02920f6794H2730J05369q0253c46483a39464
$$ -16907 -181759 -108724 -215692 202920 -66794 82730 188099 107846 -346483 -139464
12486a05467g710A32874a92772R4481b3472E4935a47721I9915J457I962g3136
$$ -105467 -7710 132874 -192772 -98291 -23472 54935 -147721 99915 101372 9962 -73136
12474A64904b56009H601i9632K8814M580A23714R0144o8600O8943J4080p8940
$$ 164904 -256009 8601 -99632 -70818 -66238 123714 213858 145258 214201 228281 149341
12463A49341g7918r2061o595I5577J28451b10033E1935a48353A71972b26615d2215
$$ 149341 -77918 -169979 -176574 95577 224028 -210033 51935 -148353 171972 -226615 -42215
12451a8012H1332a78323q9415b7604B14891h9275m8807k0851B07839b45932C0511
$$ -18012 81332 -178323 -267738 -27604 214891 -89275 -138082 -158933 207839 -245932 30511
12439B65069k4337a07708K4950A28163M246L4395b03022l08420b04596C3097L78157
$$ 265069 240732 -107708 -82758 128163 132409 166804 -203022 -511442 -204596 33097 411254
12428D11254A14506b24757A30654F0162J12984e5973p7532b3240q9419m5105c8301
$$ 411254 114506 -224757 130654 60162 173146 -55973 -133505 -23240 -112659 -157764 -38301
12416A07464Q2177l252D1427g1478B12650J23337j04576O6133A28543a39766j57735
$$ 107464 189641 186389 41427 -71478 212650 335987 231411 297544 128543 -139766 -297501
12405b97501a10455C21521a73927k5093A3626d25498C2400K7209N4432g696C52282
$$ -297501 -110455 321521 -173927 -199020 13626 -425498 32400 59609 114041 -7696 352282
12393E6794h6219l4136m5104B42226e0643G9773a25172A1431J19571a99227I0019
$$ 56794 -86219 -120355 -165459 242226 -50643 79773 -125172 11431 131002 -199227 90019
12381a93201A1088c11894G3210J22130i022k995q025C6885M2723b70673e5050
$$ -193201 11088 -311894 73210 195340 -9022 -12017 -20042 36885 79608 -270673 -55050
12369B92134A08662L6972C4284J25321B1256M5595L2577h2586M150l1557a1506
$$ 292134 108662 145634 34284 159605 21256 66851 99428 -82586 -78436 -109993 -11506
12357b18821N5625b3823j24843p9439D0054L06373A05961g9260l4349k74650A49791
$$ -218821 -163196 -23823 -148666 -228105 40054 346427 105961 -79260 -113609 -388259 149791
12345b10213k0438b7186B18562E0633N2338a23763A58003d5885C9045a38599L8885
$$ -210213 -230651 -27186 218562 50633 102971 -123763 158003 -45885 39045 -138599 -99714
12334i9714G5465J00532c5045E7009r926a3708j02803c4170J257E102h3416j92222
$$ -99714 75465 175997 -35045 57009 47083 -13708 -116511 -34170 -32913 5102 -83416 -275638
12322b75638e6981l4955E1790b2421r7786j26060C4581K09000c377A54831F8660
$$ -275638 -56981 -91936 51790 -22421 -120207 -246267 34581 243581 -3377 154831 68660
12310H447P9331m2194b28634f905n9713m8367C295h2683D2511d1588a5547C69065
$$ 8447 87778 45584 -228634 -6905 -66618 -114985 3295 -82683 42511 -41588 -15547 369065
12297C00006c15008A43539l1154N2521J6349b04113c9237k63826A94320d01425
$$ 300006 -315008 143539 112385 164906 181255 -204113 -39237 -303063 194320 -401425
12286a46404N9220D41454e862D8392d3266m01079d0330C0531e09240E4808J79483
$$ -146404 -87184 441454 -5862 48392 -43266 -444345 -40330 30531 -509240 54808 234291
12275B34291K10601k1912j54756N5691j15812G8112a8320j21097J6858A16754
$$ 234291 444892 422980 268224 323915 208103 78112 -18320 -139417 -122559 116754
12264C92509D4323P693h2391E2018P3274h8934A81553m5925K13763a01403B89317
$$ 392509 44323 52016 -82391 52018 125292 -88934 181553 135628 349391 -101403 289317
12252C63862M5818j54944g2393D31231a07512I9129c09799A29567O4368c96222
$$ 363862 409680 254736 -72393 431231 -107512 99129 -309799 129567 193935 -396222
12241A03476J06065a6345m5793H6236J96098d8962a7957I2138J81876D4650J96116
$$ 103476 209541 -16345 -62138 86236 282334 -48962 -17957 92138 274014 44650 240766
12230B40766A16462M37379B71859L5477j51811K25390R9501k31106a58837A27082
$$ 240766 116462 553841 271859 307336 155525 380915 480416 249310 -158837 127082
12219A15645L45197j44400j20309R1815A4368K1852K8229Q9935J39108m471J28884
$$ 115645 460842 316442 196133 287948 14368 36220 64449 154384 293492 289021 417905
12208D17905a0657A58305i5249A63705J46148F0293K19388K7323a21798F3051
$$ 417905 -10657 158305 -95249 163705 309853 60293 279681 307004 -121798 63051
12197D55481A43143m4078c3218m5539A76156F5617J65808f1303A20520J31079
$$ 455481 143143 99065 -33218 -78757 176156 65617 231425 -61303 120520 251599
12187B51599G7467g8046B64030G8210J29639G3338d9264j42472A36665g9305A3781
$$ 251599 77467 -78046 264030 78210 207849 73338 -49264 -191736 136665 -79305 13781
12175B78468f7226j82193A35843B1539J99879m7235p980j6053L41777A32063i296
$$ 278468 -67226 -249419 135843 21539 221418 174183 166203 150150 491927 132063 -9296
12163G7683K73004N8452d8492C16217E1249M98621A86939b03775D83908A67571
$$ 77683 350687 409139 -48492 316217 51249 549870 186939 -203775 483908 167571
12152a36510B30741A03233a16761b5786j53981A62945E6157a54606l9459B4403
$$ -136510 230741 103233 -116761 -25786 -179767 162945 56157 -154606 -194065 24403
12141A15025e2761k3759O616k45393C44877B4577K75948r6685i6878G1725d32327
$$ 115025 -52761 -76520 -69904 -315297 344877 24577 300525 203840 -96878 71725 -432327
12129h0490O232A3243g80A10915b80371B40700G8929L5992c0363m8344r9279j32300
$$ -80490 -74258 13243 -780 110915 -280371 240700 78929 114921 -30363 -78707 -177986 -310286
12117c10286J24886E6862J54567a37767N8954A02548J02286f6913N608J9765A14060
$$ -310286 -185400 56862 211429 -137767 -78813 102548 204834 -66913 -61305 -41540 114060
12105i3954m1235e2865A12310c42172A54253j2546F83J17959f1911C0580J27869
$$ -93954 -135189 -52865 112310 -342172 154253 141707 683 118642 -61911 30580 158449
12094A58449g6849C6132a14671c9914n0446c9142j28776h3541E3214Q6633M8056
$$ 158449 -76849 36132 -114671 -39914 -90360 -39142 -167918 -83541 53214 139847 187903
12083A87903Q7312E829k787L41904H926L15033Q27260J287722G66308k45127i4728
$$ 187903 275215 5829 3042 344946 8926 323959 1151219 2438941 766308 521181 -94728
12071B32105m1372E214a22736C42751E8593A8726g8495B8780K46516e5442A43587
$$ 232105 190733 5214 -122736 342751 58593 18726 -78495 28780 275296 -55442 143587
12059c74658A31917B6096L61560B5984M645a93911A63596G5083a24322a1698I3114
$$ -374658 131917 26096 387656 25984 30629 -193911 163596 75083 -124322 -11698 93114
12047b75240B06662I424J10566P8594b61176e8763B31310a0663j54676j1620A7596
$$ -275240 206662 9424 119990 198584 -261176 -58763 231310 -10663 -165339 -176959 17596
12035D840f8103j12710C11702F9783r660c9996l37835J22955g6552q1861r0610
$$ 4840 -68103 -180813 311702 69783 60123 -39996 -377831 -254876 -76552 -158413 -249023
12024b49023C6428J20131f1486j66339E3905q000a23457j8619E1703L4130a16837
$$ -249023 36428 156559 -61486 -227825 53905 45905 -123457 -142076 51703 85833 -116837
12012b02394I7307c41838e1553H2999K43190I4275a79054A58898O7044a73860
$$ -202394 97307 -341838 -51553 82999 326189 94275 -179054 158898 225942 -173860
12001c24209F4748a09726j66047a19120j7642H3384b23878I3887R7459b54201
$$ -324209 64748 -109726 -275773 -119120 -136762 83384 -223878 93887 191346 -254201
11990b89345D0893M4648R3930c1833Q707C31776F5887f9102k5940L2473j90689
$$ -289345 40893 85541 179471 -31833 -23126 331776 65887 -69102 -95042 -62569 -253258
11979b53258B44435n7438a50404c6963j67660A94226C5482J24011i6366C857e777
$$ -253258 244435 186997 -150404 -36963 -204623 194226 35482 159493 -96366 3857 -5777
11967b27142B02340h1207p6853B34280r2726a62597k1492k2104L4276G4298d6237
$$ -227142 202340 -81207 -158060 234280 141554 -162597 -184089 -206193 -171917 74298 -46237
11955d0759C3739a34872a3361B0411L07798j48642g648j5305H1494J02074D6881
$$ -40759 33739 -134872 -13361 20411 328209 179567 -7648 -22953 81494 183568 46881
11943a77622d1738A81808f337E8298J68576a66730j4371p9745G4489M3716A9375
$$ -177622 -41738 181808 -6337 58298 226874 -166730 -181101 -260846 74489 118205 19375
11931A23453k5089c7781k68827F3187J5931b28761d5572G1723b85009g2841G1191
$$ 123453 98364 -37781 -306608 63187 79118 -228761 -45572 71723 -285009 -72841 71191
11919B0857P2702a24731H37K85732G6895b07288M2921O6499A53789g1542A20117
$$ 20857 93559 -124731 837 286569 76895 -207288 -164367 -97868 153789 -71542 120117
11907a87546A80016E9534J30273a1944j5886A34659d82510A0615J97884C6363
$$ -187546 180016 59534 189807 -11944 -27830 134659 -482510 10615 208499 36363
11896A19852g2496A12525O188a70824P908E8225f6272l21765C807b7614G4089
$$ 119852 -72496 112525 118713 -170824 -162916 58225 -66272 -388037 3807 -27614 74089
11884d61223C16275a73442O4972C13157M5888c90390Q0387a15086e7158q8545
$$ -461223 316275 -173442 -108470 313157 359045 -390390 -310003 -115086 -57158 -145703
11874a45703D5761b41893b6433C97046j24617G1222c0982G4352a14433o5649A16849
$$ -145703 45761 -241893 -26433 397046 272429 71222 -30982 74352 -114433 -180082 116849
11862a84742e4222n0651j52669J26041j62786H6195Q7745B7339N6957J22832p4537
$$ -184742 -54222 -104873 -257542 -131501 -294287 86195 173940 27339 84296 207128 132591
11851A32591a04160D9997o415j5914M6991f9266I2425K74599g8047C46729G5941
$$ 132591 -104160 49997 43582 27668 74659 -69266 92425 367024 -78047 346729 75941
11839b31536r521M7775R1780b1059p4131E4829a08964o6759j73834a46404D16289
$$ -231536 -241057 -193282 -101502 -21059 -95190 54829 -108964 -175723 -349557 -146404 416289
11827a29196j5649q5897i2575A59465c34908A18639J178r713K7078c2004B34963
$$ -129196 -144845 -230742 -92575 159465 -334908 118639 119817 110104 137182 -32004 234963
11815B07623h6124C19823q7686J01433j00696b2647k59239b6510p2331n6011L6486
$$ 207623 -86124 319823 232137 333570 232874 -22647 -281886 -26510 -98841 -154852 -118366
11804a18366C77844k7021c1830b212A94361c4376l64300a9678A78352a10160I9240
$$ -118366 377844 350823 -31830 -2212 194361 -34376 -398676 -19678 178352 -110160 99240
11792C34672b57064H0555J16039d61360J83244d6196j92775A28592b39711A52249
$$ 334672 -257064 80555 196594 -461360 -278116 -46196 -238971 128592 -239711 152249
11781E6191a51190f828C79613A21231b68165d0070F65a02901D28415F704a32004
$$ 56191 -151190 -6828 379613 121231 -268165 -40070 665 -102901 428415 6704 -132004
11769A76478d2588A7596a39350L4096j10997A08148F866b3502B33819b67528Q3941
$$ 176478 -42588 17596 -139350 -105254 -216251 108148 6866 -23502 233819 -267528 -183587
11758a83587l21124G7282J40522a84317B40274A10729c19620C02583E8973B548
$$ -183587 -504711 77282 217804 -184317 240274 110729 -319620 302583 58973 2548
11747c3059j20056b3896k8246F3639J3563J55403a57746B6164K96041A08193h6519
$$ -33059 -153115 -23896 -52142 63639 77202 232605 -157746 26164 322205 108193 -86519
11735C0503a33793e9068k1371A3920K85910a35247O3782j02327n4225A20697M10841
$$ 30503 -133793 -59068 -80439 13920 299830 -135247 -71465 -173792 -228017 120697 531538
11724E31538B7953P316L2478C0312c77201a53356B71796f1612j25507F1812C0630
$$ 531538 27953 35269 67747 30312 -377201 -153356 271796 -61612 -187119 61812 30630
11712f1325B19849C2127h6163C56975D7700O8532Q6136i0020d410B67661a30311
$$ -61325 219849 32127 -86163 356975 47700 116232 202368 -90020 -4410 267661 -130311
11700C9950b65807A20877k3140F389a672B50041i3238G617K24570a78025f9285
$$ 39950 -265807 120877 97737 6389 -1672 250041 -93238 7617 232187 -178025 -69285
11688A88313D3606J81021C6825M5762l5746J91289G8717a79671A23995K84034
$$ 188313 43606 224627 36825 82587 46841 238130 78717 -179671 123995 408029
11678D08029E4593K166a11734D25029d0521a7797j6698J1609l5153R51C2181c2267
$$ 408029 54593 56759 -111734 425029 -40521 -17797 -34495 -22886 -58039 -57088 32181 -32267
11665a71705L7476F5522J2730B3622e1359B72233e2548j15093B93916A43561d19115
$$ -171705 -134229 65522 78252 23622 -51359 272233 -52548 -167641 293916 143561 -419115
11653C99738A19123n1673a94735B52009a48426H1757L7312A5325B455K09593r0302
$$ 399738 119123 67450 -194735 252009 -148426 81757 119069 15325 2455 212048 121746
11642A21746c3308m539B8210L2702g864F476J12795B5861b57608F6396f371j68304
$$ 121746 -33308 -37847 28210 60912 -7864 6476 119271 25861 -257608 66396 -6371 -174675
11630a74675I798e5625B00253f8595A28670c60797a64772b6818C43052a54554
$$ -174675 9798 -55625 200253 -68595 128670 -360797 -164772 -26818 343052 -154554
11619E4822a04495p1552e5128A15207c51314C2155a7H0125a37816d2748G467c0210
$$ 54822 -104495 -176047 -55128 115207 -351314 32155 -17 80125 -137816 -42748 7467 -30210
11606b02619A41698k2180R0052a95953D02674A48952O23R1799H8228N6879d6347
$$ -202619 141698 119518 209570 -195953 402674 148952 149575 241374 88228 145107 -46347
11594d0779E3086J01435o58l957h7827D0267L63173A59921o3203b73973C8069
$$ -40779 53086 154521 153863 149906 -87827 40267 403440 159921 96718 -273973 38069
11582A15585a54875A68g1104B76800a13979A2536P9543D2456P6521J43160a16585
$$ 115585 -154875 168 -71104 276800 -113979 12536 92079 42456 118977 262137 -116585
11570c56061B15191b3099I4027L00468h1658H3379l1079J74438F7861f9253i173
$$ -356061 215191 -23099 94027 394495 -81658 83379 52300 226738 67861 -69253 -9173
11558g6058K9995A28044a80962N9172q2202B56122r3246C5740K27596f5566D2153
$$ -76058 -46063 128044 -180962 -121790 -203992 256122 162876 35740 263336 -65566 42153
11546H5331a61929B86285B2693g0310I3140J10337n8916M37152f6875G4146a11464
$$ 85331 -161929 286285 22693 -70310 93140 203477 144561 581713 -66875 74146 -111464
11534C7337L3555C2404M36232b5877C01914h0312C85979d0939n887a4317B63834
$$ 37337 70892 32404 468636 -25877 301914 -80312 385979 -40939 -46826 -14317 263834
11522G968J80098B966K8166R7149J28680l5534a22160b4440C4576K95290j5359
$$ 7968 188066 2966 31132 128281 256961 221427 -122160 -24440 34576 329866 314507
11511C14507J3378A35473K4685N90177B84108M6408b05001C7554i8861H9971J86567
$$ 314507 327885 135473 160158 750335 284108 330516 -205001 37554 -98861 89971 276538
11500B76538A28066J03020a61124B00482o67R1759m2659k8493K9313a89062N8210
$$ 276538 128066 231086 -161124 200482 199815 291574 248915 220422 249735 -189062 -130852
11489a30852C81935r2712O7001b73935B91989A34306b94361C13590R8160C249
$$ -130852 381935 289223 356224 -273935 291989 134306 -294361 313590 411750 3249
11478A7225K67405c2070B5372K5611J55815l857g0458A35396K79479C6129K82655
$$ 17225 284630 -32070 25372 50983 206798 202941 -70458 135396 414875 36129 318784
11467C18784L4083A54835M08191i5682A73549G3300i5675J2210c6844C17201i6627
$$ 318784 352867 154835 563026 -95682 173549 73300 -95675 -83465 -36844 317201 -96627
11455I0052M9678i1325d0251P232j71455C32784g0199E2538a7126C65306a12427
$$ 90052 139730 -91325 -40251 -33019 -204474 332784 -70199 52538 -17126 365306 -112427
11443G8856O2768Q3899j2040j3066m1802J21667B795R1201j4858b01353C13936
$$ 78856 141624 225523 213483 200417 158615 280282 2795 93996 79138 -201353 313936
11431H6994J05673a13647H049a04833M4346D99525a35841K4495B15410B3678O4366
$$ 86994 192667 -113647 8049 -104833 -60487 499525 -135841 -111346 215410 23678 88044
11420H8044c3117j11308k4449B770K56632a64628A09469E906R9862g3789A13876
$$ 88044 -33117 -144425 -168874 2770 259402 -164628 109469 5906 105768 -73789 113876
11408E2571a26933B34405G1350g0440n9221A67366K0196J00827A18711a23430
$$ 52571 -126933 234405 71350 -70440 -129661 167366 187562 288389 118711 -123430
11397A3044R2457D3071b07127l0759A05337b9914o678B27964G7911K61230C9534
$$ 13044 105501 43071 -207127 -237886 105337 -29914 -36592 227964 77911 339141 39534
11385A60563e0644A07907a45668A01744Q4389R6175a19452n992h849q4223F0925
$$ 160563 -50644 107907 -145668 101744 186133 282308 -119452 -125444 -8849 -93072 60925
11373B59265b6841j10739H3874B6281b18902C4087c6211N695k45343G4475b6959
$$ 259265 -26841 -137580 83874 26281 -218902 34087 -36211 -30516 -275859 74475 -26959
11361h3334B68925a43852f4506J4047C7423J08612K8935a48825G1876J04885O9158
$$ -83334 268925 -143852 -64506 -50459 37423 146035 174970 -148825 71876 176761 245919
11350B45919F241K26283a34373l0108a1395B59567a26973A79978c8016J1010k29062
$$ 245919 6241 232524 -134373 -164481 -11395 259567 -126973 179978 -38016 -27006 -256068
11339b56068A07761L9819c25588J23643E2901a60520F1214K4609J14745F9939
$$ -256068 107761 147580 -325588 -201945 52901 -160520 61214 85823 200568 69939
11328f204p8529r7949j09634J44093A03896J2199e4317A8603b0313B75512a64099
$$ -6204 -84733 -182682 -292316 -148223 103896 116095 -54317 18603 -20313 275512 -164099
11316b2609k18632B03250p2237B1351L40376b09245g4041C40860b03317N6127
$$ -22609 -241241 203250 131013 21351 361727 -209245 -74041 340860 -203317 -147190
11306a47190k1603A9111h3865j42436P1158L2589A31549a17646j24214r4733B05725
$$ -147190 -168793 19111 -83865 -226301 -155143 -122554 131549 -117646 -241860 -336593 205725
11294A1847b60303B1773a17311B8319f8306A05805d7643L864D6448h5606r2511
$$ 11847 -260303 21773 -117311 28319 -68306 105805 -47643 -43779 46448 -85606 -178117
11283a78117I5628g6890C01670a62963C1647a54657f6670k39241A64640f7009
$$ -178117 95628 -76890 301670 -162963 31647 -154657 -66670 -305911 164640 -67009
11272C5239J41320B4636a05240a0128B16317H1040M4011c9711B80017b91719a28137
$$ 35239 176559 24636 -105240 -10128 216317 81040 125051 -39711 280017 -291719 -128137
11260A33718c32026b7828A60487b24741o6665E7221a09075A8300f6286G2668b33501
$$ 133718 -332026 -27828 160487 -224741 -291406 57221 -109075 18300 -66286 72668 -233501
11248F7845b93902B17613C2324a12873j38429n3400A80011O2303a19024M4592
$$ 67845 -293902 217613 32324 -112873 -251302 -304702 180011 242314 -119024 -74432
11238g4432l8129k1994a1536H0472a07521p8475A21581b39140j20922a1421B34003
$$ -74432 -112561 -134555 -11536 80472 -107521 -185996 121581 -239140 -360062 -11421 234003
11226H3788b62256d539m1103C159J72302c9598k17063r1531B24264B9770J51407
$$ 83788 -262256 -4539 -45642 3159 175461 -39598 -256661 -348192 224264 29770 181177
11215A81177E1019b04409B28511a04154A9970h2775A96455a27049C6410a25969
$$ 181177 51019 -204409 228511 -104154 19970 -82775 196455 -127049 36410 -125969
11204b010H2174c64578J50203B76250b44116G7675B2829Q7764N156a21959q407
$$ -2010 82174 -364578 -214375 276250 -244116 77675 22829 110593 115749 -121959 -130366
11193a30366B5933a34690A16868a01892d7174p9502d4822A71231b26201a1677
$$ -130366 25933 -134690 116868 -101892 -47174 -126676 -44822 171231 -226201 -11677
11182a70749N045K5307N9575l6000j7245J1116A81192a86517g6266c4965A83376
$$ -170749 -165704 -140397 -80822 -116822 -134067 -122951 181192 -186517 -76266 -34965 183376
11170B2067J83833I5111K03223B5444c7600j8790m7328C97380F6405d22739B610
$$ 22067 205900 95111 298334 25444 -37600 -56390 -103718 397380 66405 -422739 2610
11158a06337L5975A49789H005c90131A03727J60133D4853J09323d7536a8568I5947
$$ -106337 -70362 149789 8005 -390131 103727 263860 44853 154176 -47536 -18568 95947
11146B0815J31416J5016p166g6199j85062h0595e903m0336k46853B6762O7521
$$ 20815 152231 167247 160081 -76199 -261261 -80595 -5903 -46239 -293092 26762 94283
11135I4283D5624K01836h2105A51082b74581B33810D7252a10141H6882Q4488m6389
$$ 94283 45624 247460 -82105 151082 -274581 233810 47252 -110141 86882 171370 124981
11124A24981n6081M3277a18661A42729D6964Q2324L8150L5402P450H3797Q3757
$$ 124981 68900 112177 -118661 142729 46964 129288 167438 202840 210290 83797 167554
11113A67554p2828J43082A02578r7d2601G6691k6574R2409J85325K04800B45826
$$ 167554 94726 237808 102578 102481 -42601 76691 50117 142526 327851 532651 245826
11101B97118J78826i7326l3603G1006K42200A9539e613E15733j90442a20561L6669
$$ 297118 475944 -97326 -130929 71006 313206 19539 -5613 515733 325291 -120561 -83892
11090h3892j52235D62344K3130B09380C7402b3184F9474j4667O6050q745d2525
$$ -83892 -236127 462344 485474 209380 37402 -23184 69474 54807 120857 112112 -42525
11078a80101A57322a38353C01958j34724H3211L73156L2025j44005Q5145j39956
$$ -180101 157322 -138353 301958 167234 83211 456367 488392 344387 429532 289576
11068B89576k7168H8653L13931P3301j78986O8930J27018O6654J60441j82213
$$ 289576 262408 88653 402584 475885 296899 365829 492847 559501 719942 537729
11058E37729R7654K4479O7590r7119P1605J5418J01417j21107J10089j60577R859
$$ 537729 635383 659862 727452 630333 701938 717356 818773 697666 807755 647178 657037
11047F57037o6343R4669k14350L58575l63377M27428C70266K89299K1283N9946
$$ 657037 590694 685363 471013 829588 466211 893639 370266 659565 680848 740794
11037G40794j14231K98464D26898N78544k58081j70617K86105k82068j55928N17951
$$ 740794 626563 925027 426898 1005442 747361 576744 862849 580781 424853 942804
11027I42804C91022J71936J68123m9686r976N1416L042k61248R5779M4508B67370
$$ 942804 391022 562958 731081 681395 671419 722835 725877 464629 560408 604916 267370
11015F74674o6188M739m6348M5923J21982P3412j42142k20445j24792L02715J27637
$$ 674674 608486 613225 566877 612800 734782 808194 666052 445607 320815 623530 751167
11004G51167j56807J40739q1145P8072j0230Q6834j51577j18021j36570M24925
$$ 751167 594360 735099 653954 732026 721796 808630 657053 539032 402462 827387
10994H27387J3427j08612M4221J03644l91719K07454J73992r1018K72801J17983
$$ 827387 840814 732202 776423 880067 488348 695802 869794 778776 1051577 1169560
10984A169560K5044P718j36920M19736N1337k61053K94341M88888k26226P21484
$$ 1169560 1194604 1202322 1065402 1485138 1536475 1275422 1569763 2058651 1832425 2553909
10974B553909j41284K62138k00767j93791J8216m6952k20413m73057L9835J3675
$$ 2553909 2412625 2674763 2473996 2280205 2298421 2251469 2031056 1557999 1597834 1611509
10964A611509l8141k68476K92010O7002L56802k84143j65644P9617k92975j54461
$$ 1611509 1573368 1304892 1596902 1663904 2020706 1736563 1570919 1650536 1357561 1203100
10954A203100j60823l01325P6383l04448J50850B92126K05883C5009P2813K02909
$$ 1203100 1042277 740952 817335 512887 663737 292126 498009 35009 107822 310731
10944C10731I736M26002R4740B7252K41666r670A0102J3488J41962b85090A58315
$$ 310731 9736 435738 530478 27252 268918 259248 10102 23590 165552 -285090 158315
10932a11750B02911e7229n0510d6730A52872J14054d05105G9166R5981N5316G65
$$ -111750 202911 -57229 -107739 -46730 152872 266926 -405105 79166 175147 230463 765
10920A88611a602H6462D011a82435A22774g1044B03040a39683A95635c21980A06080
$$ 188611 -1602 86462 4011 -182435 122774 -71044 203040 -139683 195635 -321980 106080
10908A60106c3852j65011A84757h1967j15461P5648E3294h2891j7819F4058R2830
$$ 160106 -33852 -198863 184757 -81967 -197428 -121780 53294 -82891 -100710 64058 156888
10897A56888E8481B6768L55147d9247j01162A9550O3609Q8120A4470l411a22702
$$ 156888 58481 26768 381915 -49247 -150409 19550 83159 171279 14470 11059 -122702
10885B31567d07988c2252l6128j29037I5051M5802J21293b78888J3776D8368b28996
$$ 231567 -407988 -32252 -68380 -197417 95051 140853 262146 -278888 -265112 48368 -228996
10873a53030A43679e1631k01143A36384E1453b17169b6442E0326J24908a03986
$$ -153030 143679 -51631 -252774 136384 51453 -217169 -26442 50326 175234 -103986
10862a08862G8820g224A5671P8542b7156q2787o8263A87355L4877J28841a9741
$$ -108862 78820 -7224 15671 94213 -27156 -109943 -178206 187355 222232 351073 -19741
10850i9916a7103F1435Q8251c6154k11781J6744C3368g650q5099A79429f6539
$$ -99916 -17103 61435 149686 -36154 -247935 -231191 33368 -7650 -92749 179429 -66539
10838i9563B24692a13487k37700F0135L06961B4193g7660q329O925j82600M8973
$$ -99563 224692 -113487 -351187 60135 367096 24193 -77660 -85989 -79064 -261664 -212691
10827b12691H5866O149m3583a51560N8411L2813K5387o1304j48781g7946B53300
$$ -212691 85866 92015 48432 -151560 -93149 -60336 -34949 -96253 -245034 -77946 253300
10815A34017f9435r0591A1246K93080F4177b84065N2670a1798o4957j45046j69474
$$ 134017 -69435 -160026 11246 304326 64177 -284065 -231395 -11798 -76755 -221801 -391275
10804c91275D3410J738a55154j38168O4918h2681D2732J03685C5411L33078i4494
$$ -391275 43410 45148 -155154 -293322 -228404 -82681 42732 146417 35411 368489 -94494
10792c60164J64019G7088a79300C48098i2381G4702C6481b5199p7732J783n2352
$$ -360164 -196145 77088 -179300 348098 -92381 74702 36481 -25199 -102931 -101148 -153500
10781a53500B57157a47545A95240g5319k10816M4655a07383d6609j95267F1624
$$ -153500 257157 -147545 195240 -75319 -286135 -241480 -107383 -46609 -241876 61624
10770C09850j91g3181G2270b14556B51800O2707I2576L9676J48157a67342B14295
$$ 309850 309659 -73181 72270 -214556 251800 314507 92576 132252 280409 -167342 214295
10758a74011A58527c33894h0088A11554a53100M9076j19016b6023k05870j31897
$$ -174011 158527 -333894 -80088 111554 -153100 -104024 -223040 -26023 -231893 -363790
10748c63790a30876E3295K05919j11672c12249P3798l44561i8443L1741p2367
$$ -363790 -130876 53295 259214 147542 -312249 -238451 -583012 -98443 -66702 -139069
10738a39069A5912J0870a17599A75492d8810A12398b69872G8905b29465D27578
$$ -139069 15912 26782 -117599 175492 -48810 112398 -269872 78905 -229465 427578
10727d2523A27319c44350H9022O1995i890p3493D3827h1154D0956i3991n2301
$$ -42523 127319 -344350 89022 151017 -9890 -83383 43827 -81154 40956 -93991 -146292
10716a46292n4502F7864a45829e8665C80369A1446b35358B39709g4998j53698
$$ -146292 -200794 67864 -145829 -58665 380369 11446 -235358 239709 -74998 -228696
10706b28696B27919I0442a130k48249B81164A28953N4277b45562G0440e7689A5511
$$ -228696 227919 90442 -1130 -249379 281164 128953 183230 -245562 70440 -57689 15511
10694B58484p0896J29700r4472b23924A17685D9541J029f2649k30458j79082i9202
$$ 258484 187588 317288 222816 -223924 117685 49541 50570 -62649 -293107 -472189 -99202
10682A28598P9555c64361A59990a87699l250g4519C1976a12468A82389c49938
$$ 128598 208153 -364361 159990 -187699 -190949 -74519 31976 -112468 182389 -349938
10671A9035L54c4730j7574k42088I872e3371J6360j46190a4833B07746a96676
$$ 19035 19389 -34730 -52304 -294392 9872 -53371 -37011 -183201 -14833 207746 -196676
10659A2963h3627j48169J10594K274F7262J49146f7949A55326a10194k71894J06515
$$ 12963 -83627 -231796 -121202 -118928 67262 216408 -67949 155326 -110194 -382088 -275573
10648b75573M3077d2087I7703c95374d6032B37173a43258A91615c19803A14136
$$ -275573 -232496 -42087 97703 -395374 -46032 237173 -143258 191615 -319803 114136
10637c88198f4514l86398J29532F5796a43384F5298P7587F7227h3497B80642r1961
$$ -388198 -64514 -450912 -321380 65796 -143384 65298 142885 67227 -83497 280642 188681
10626A88681F8102c8489B69903a8181l1579B15075b36156B35849e0046q0561A35877
$$ 188681 68102 -38489 269903 -18181 -49760 215075 -236156 235849 -50046 -130607 135877
10614B25974a97708F6635K51757b10060B7200b22218b8112q7018B01365O5342
$$ 225974 -197708 66635 318392 -210060 27200 -222218 -28112 -115130 201365 266707
10604B66707j24238D7239J42508a68260N4264e0941A32514c19111J5946J15151
$$ 266707 142469 47239 189747 -168260 -113996 -50941 132514 -319111 -303165 -188014
10594a88014A98771D287e4430J1754A7395P6080g0372B23741a54111l4728j31542
$$ -188014 198771 4287 -54430 -42676 17395 93475 -70372 223741 -154111 -188839 -320381
10583c20381a07490O384n356M1696j69922e7858k2637E4979b08040A35091g7443
$$ -320381 -107490 -101106 -106462 -64766 -234688 -57858 -80495 54979 -208040 135091 -77443
10571c1276j70306A94770a85825G1385h611j54043l02218G2510J03518J21362
$$ -31276 -201582 194770 -185825 71385 -8611 -162654 -464872 72510 176028 297390
10561B97390g1863J983C30756f9116k60530J43907A740O8450c31991a65994j80046
$$ 297390 -71863 -69880 330756 -69116 -329646 -185739 1740 70190 -331991 -165994 -346040
10550c46040E607K58764C0477j4065J18319b28332p1043J28799r0656N2911D7647
$$ -346040 5607 264371 30477 16412 134731 -228332 -299375 -170576 -261232 -208321 47647
10538a16953J4470G5205h5885a4278C1071a5327e644k41514R2869b884j55596
$$ -116953 -102483 75205 -85885 -14278 31071 -15327 -5644 -247158 -154289 -2884 -158480
10527a58480k02335a1725k19983h8506j95445b0557p1036B5377b70638i367C3990
$$ -158480 -360815 -11725 -231708 -88506 -283951 -20557 -91593 25377 -270638 -9367 33990
10515A52346l1291i5329A1268e2724q3713e6308K0363I4827i1617A19545j0657
$$ 152346 121055 -95329 11268 -52724 -136437 -56308 -35945 94827 -91617 119545 108888
10504A08888H225a19912A39080J07888a22603A82005J4887J57974E4611b277E2808
$$ 108888 8225 -119912 139080 246968 -122603 182005 196892 354866 54611 -2277 52808
10492D38351c17038a47581A55251H115J74253B331M25642j23454m1120K85894
$$ 438351 -317038 -147581 155251 8115 182368 2331 427973 304519 263399 549293
10482E49293j34021l5874j48648o7337J58873c2856D5478L1345h410m8034M118
$$ 549293 415272 379398 230750 163413 322286 -32856 45478 76823 -8410 -56444 -52326
10471e2326A92059A2627J912d9088E9771N7146J4141n3206d1135m8102j19889
$$ -52326 192059 12627 14539 -49088 59771 116917 131058 77852 -41135 -89237 -209126
10460b09126M6074e9749B40998b52146A2033J94193a88391Q9155j27503e0051
$$ -209126 -163052 -59749 240998 -252146 12033 206226 -188391 -99236 -226739 -50051
10449b86412p045J31683o4548J08647A9022c43377A78387R6592A23948J62745
$$ -286412 -293457 -161774 -226322 -117675 19022 -343377 178387 274979 123948 286693
10439B86693b82073B0857K7832c6488a6285c272B5536b56848E4408C662J7726
$$ 286693 -282073 20857 48689 -36488 -16285 -3272 25536 -256848 54408 3662 21388
10428B1388q888K17434E9273a65231b6974C8867a65609j39092A32280b97828A56189
$$ 21388 12500 229934 59273 -165231 -26974 38867 -165609 -304701 132280 -297828 156189
10416h0887D06917a45301J446C28776f0940l2789j2551d3663J760m87753g0521
$$ -80887 406917 -145301 -143855 328776 -60940 -93729 -106280 -43663 -41903 -529656 -70521
10404b34150f7634j44213O9725O4284k95238C9331a49279K0642f0374A87409R7465
$$ -234150 -67634 -211847 -142122 -77838 -373076 39331 -149279 -128637 -60374 187409 284874
10393B84874j19746c9460j16775d8267B46421C3468K02124n7711a09583H613b53369
$$ 284874 165128 -39460 -156235 -48267 246421 33468 235592 177881 -109583 8613 -253369
10381A88302b7344A30113b98748A93902J08211g3091A07142N73184k02426A34023
$$ 188302 -27344 130113 -298748 193902 302113 -73091 107142 680326 477900 134023
10370D8619K07117J07588j16549P6971L75825k89992j23732M2829A3393M12683
$$ 48619 255736 363324 246775 323746 699571 409579 285847 328676 13393 426076
10360D26076H3297K41631a59357C95896E8618L11474j74705K26093L8111j20866
$$ 426076 83297 324928 -159357 395896 58618 370092 195387 421480 459591 338725
10350C38725j07810o4092P3061r1417K12103j35989K32009A46477o2992P4871
$$ 338725 230915 166823 239884 148467 360570 224581 456590 146477 83485 158356
10340A58356O5907O8172A30973b27716A04991G667K41626J52646b30390A81785
$$ 158356 224263 292435 130973 -227716 104991 7667 249293 401939 -230390 181785
10329C04616b74565C213J15697K36387A50613l4507K77577A38056a31594C31358
$$ 304616 -274565 3213 118910 355297 150613 116106 393683 138056 -131594 331358
10318a62516b5161A02138M9014d1600A52148o4445K08586a89341P2722c2428j0426
$$ -162516 -25161 102138 151152 -41600 152148 87703 296289 -189341 -116619 -32428 -42854
10307d2854B62066A0418O0576b15936a6639N795j84917P1137m9638A13710c52572
$$ -42854 262066 10418 70994 -215936 -16639 -10844 -195761 -124624 -174262 113710 -352572
10295b87219A86030E7411b97688R5306D9441i2961a8213l52913a22882F40380
$$ -287219 186030 57411 -297688 -202382 49441 -92961 -18213 -371126 -122882 640380
10284a57231d7585F8571K70349a83008Q5915p9381E5711M4272B1004O1100b80971
$$ -157231 -47585 68571 338920 -183008 -97093 -176474 55711 99983 21004 82104 -280971
10272b7067D8065b48455A15035g4650A26304L93784B50798A15664J62087N6154
$$ -27067 48065 -248455 115035 -74650 126304 520088 250798 115664 277751 333905
10262C33905j44039Q9911L8474j53020F813b06499F432N5057A0451q7g3269j9646
$$ 333905 189866 279777 318251 165231 6813 -206499 6432 61489 10451 10364 -73269 -92915
10250i2915I9012b72995G0068i3601d5984j4253q8020G1150b36065c1445j82286
$$ -92915 99012 -272995 70068 -93601 -45984 -60237 -148257 71150 -236065 -31445 -213731
10239b13731F909b15586I090g0902C54383a57682C7201c61216A82946b74938D84151
$$ -213731 6909 -215586 9090 -70902 354383 -157682 37201 -361216 182946 -274938 484151
10227h0495m5001K4849l8410l079m5441a0747I7276a28690a0850j07275j0497
$$ -80495 -125496 -100647 -139057 -142136 -187577 -10747 97276 -128690 -10850 -118125 -128622
10216a28622c66l0863k05108A43226a34218B70427a86402h7277k8458k08637a00703
$$ -128622 -366 -31229 -236337 143226 -134218 270427 -186402 -87277 -115735 -324372 -100703
10204B4563a55338K5762M2737l17261c6556j50412A365e5092B5849c49520F5169
$$ 24563 -155338 -129576 -86839 -404100 -36556 -186968 1365 -55092 25849 -349520 65169
10192a93033g3010b5868k13422M4967B9304h5305q3799j08233A19514Q6185l0301
$$ -193033 -73010 -25868 -239290 -194323 29304 -85305 -169104 -277337 119514 205699 175398
10181A75398b63876F3582J99244j0003C4416R8700a49770H0664a00506j95452
$$ 175398 -263876 63582 262826 252823 34416 133116 -149770 80664 -100506 -295958
10171b95958h4258A04686l3127L1783b48468R6842A1652h3207k08757i8219A74043
$$ -295958 -84258 104686 71559 103342 -248468 -151626 11652 -83207 -291964 -98219 174043
10159E6495b34446e6422C6327a11284J6765F3740h7632A6416a0506A68961G9659
$$ 56495 -234446 -56422 36327 -111284 -94519 63740 -87632 16416 -10506 168961 79659
10147A21344b80251A48757a96341J8828M3346a0083j57133A28335a31243j0414
$$ 121344 -280251 148757 -196341 -177513 -134167 -10083 -167216 128335 -131243 -141657
10137a41657j05250d9697j04496k8495O2694D4041J08278d0764a515C79050a37371
$$ -141657 -246907 -49697 -154193 -182688 -119994 44041 152319 -40764 -1515 379050 -137371
10125A90263h0840I832d2800k17301E5534a62123a3829B32685b21866B3046r326
$$ 190263 -80840 9832 -42800 -260101 55534 -162123 -13829 232685 -221866 23046 13720
10114A3720c25179p7808A21988a09006j17689g7342j42392L0882j4231g9616I0124
$$ 13720 -325179 -402987 121988 -109006 -226695 -77342 -219734 -188852 -203083 -79616 90124
10102h5795A87661k6479n8272D2627a78970P2507L4434g099A41263K32840b7220
$$ -85795 187661 161182 102910 42627 -178970 -106463 -72029 -7099 141263 374103 -27220
10090A56189a52742O2728D6704N3060a37470j54277b0771r0773A79561o6920G198
$$ 156189 -152742 -90014 46704 99764 -137470 -291747 -20771 -111544 179561 112641 7198
10078F3501g3455j09865a7344a075B12284g3688D2207a51586a127n0197p6222
$$ 63501 -73455 -183320 -17344 -1075 212284 -73688 42207 -151586 -1127 -51324 -127546
10067a27546j20238a00171E2619P8855e5250A56390c66553a631C7130r620J5994
$$ -127546 -247784 -100171 52619 131474 -55250 156390 -366553 -1631 37130 27510 43504
10056D3504a96414D4710a18450C9553b85105G686K22294a82354N8625B09754c69882
$$ 43504 -196414 44710 -118450 39553 -285105 7686 229980 -182354 -123729 209754 -369882
10044B36590b77878R3615h9467A2902b8978j24164l7273B36340a94950d5863A03835
$$ 236590 -277878 -184263 -89467 12902 -28978 -153142 -190415 236340 -194950 -45863 103835
10032b82882d6561j04421A30288b90089J08625O8790B87414a28515C555a71689
$$ -282882 -46561 -150982 130288 -290089 -181464 -112674 287414 -128515 3555 -171689
10021A14266a91976k05564J5914k4991a9521A6271a50093J5740A96580e4196l13927
$$ 114266 -191976 -397540 -381626 -406617 -19521 16271 -150093 -134353 196580 -54196 -368123
10010c68123A95874h5895k2075a5337l30576c2613B7993c47953e9742B75709a44033
$$ -368123 195874 -85895 -107970 -15337 -345913 -32613 27993 -347953 -59742 275709 -144033
9998A08121A6969f5249g963A50543c609m46643A15160l2396a61825d9916b0853
$$ 108121 16969 -65249 -7963 150543 -3609 -450252 115160 82764 -161825 -49916 -20853
9986A07930C9789J6851a94346P195A62245c44972a70482M4791E0510a54800j24506
$$ 107930 39789 56640 -194346 -187151 162245 -344972 -170482 -125691 50510 -154800 -279306
9975b79306A94090a97915O8702E3992J17390a23573F69K69130f2393j64146n0742
$$ -279306 194090 -197915 -129213 53992 171382 -123573 669 269799 -62393 -226539 -277281
9964b77281a0658E1713K30546h8992A7705c2765m4644c2940A11418B8516K2070
$$ -277281 -10658 51713 282259 -88992 17705 -32765 -77409 -32940 111418 28516 50586
9953E0586b72810K5113E8487a89887m6139P2647C9001b35553G8642a53265d2559
$$ 50586 -272810 -247697 58487 -189887 -236026 -163379 39001 -235553 78642 -153265 -42559
9941g8849b4417n0465B69405l3333R270b12106d6774l11927c116l83396k4070
$$ -78849 -24417 -74882 269405 236072 245342 -212106 -46774 -358701 -3116 -386512 -410582
9930d10582P7436r4373F4607a78909j34420i6375C4165b75203J00701d0990B76531
$$ -410582 -333146 -427519 64607 -178909 -313329 -96375 34165 -275203 -174502 -40990 276531
9918g7295k21899A3989a70727A65055a32791O5722r9483B89640a11334C8485N0780
$$ -77295 -299194 13989 -170727 165055 -132791 -67069 -166552 289640 -111334 38485 89265
9907H9265a91273A03810f5574E3752R4214b18484g2141j6244D0602b23210c9307
$$ 89265 -191273 103810 -65574 53752 147966 -218484 -72141 -88385 40602 -223210 -39307
9895d11643J54291J15468L1339B0052a76782B3951e3397H4900a03474E196J1956
$$ -411643 -257352 -141884 -110545 20052 -176782 23951 -53397 84900 -103474 5196 17152
9884A7152K1933b97107B00564q2362b80776A48971M2320a07472m5699A31851c2985
$$ 17152 39085 -297107 200564 118202 -280776 148971 191291 -107472 -153171 131851 -32985
9872b14523P9711A65179i2762c1221l00386A48219f5280H8519d2598o9543e5737
$$ -214523 -134812 165179 -92762 -31221 -331607 148219 -65280 88519 -42598 -112141 -55737
9860d9677j13197D5350h5342C0730J52628a32896m8805j92058A06411i6654j66797
$$ -49677 -162874 45350 -85342 30730 183358 -132896 -181701 -373759 106411 -96654 -263451
9849b63451i0665q2579c6323p0639j29684e7832m6679E397J21863N7741b29692
$$ -263451 -90665 -173244 -36323 -106962 -236646 -57832 -104511 5397 127260 185001 -229692
9837a43464j3251A40111J36043C3114a4295m86979e7267b1677l40345a77236l2581
$$ -143464 -156715 140111 276154 33114 -14295 -501274 -57267 -21677 -362022 -177236 -209817
9826b09817M5962Q1290l878d001E0899c33282h4759L2599r4668E0662a2935B9664
$$ -209817 -163855 -82565 -86443 -4001 50899 -333282 -84759 -52160 -146828 50662 -12935 29664
9813A899a8772C9059J10848a64988k8126B58656A0351g8619m6622l5291g2455
$$ 1899 -18772 39059 149907 -164988 -193114 258656 10351 -78619 -125241 -160532 -72455
9801A6529R93a33755H7091B1507J19726b6500D0890J2127a065q7418A21718b14387
$$ 16529 17522 -133755 87091 21507 141233 -26500 40890 53017 -1065 -88483 121718 -214387
9788c48782M384B20276a70138o4656d8411a0210A34267C4668a80919N5985a2143
$$ -348782 -344398 220276 -170138 -234794 -48411 -10210 134267 34668 -180919 -124934 -12143
9776A65088j3404a26052C30147j44175o5072b62627J09314k46575g698B0875a54199
$$ 165088 151684 -126052 330147 185972 120900 -262627 -153313 -399888 -7698 20875 -154199
9764B07740b50526a0235H5565J38291I8139b84844A32016a9333r1647j50955c2991
$$ 207740 -250526 -10235 85565 223856 98139 -284844 132016 -19333 -110980 -261935 -32991
9752A83692a15992J1368B12445c79350a04390J9972A81641C7238c82718J78415
$$ 183692 -115992 -104624 212445 -379350 -104390 -84418 181641 37238 -382718 -204303
9742b04303Q9652k4380J9051B05890i2850A67783K38086i1462E6743c409A17710
$$ -204303 -114651 -139031 -119980 205890 -92850 167783 405869 -91462 56743 -3409 117710
9730b51285h5378j89739b2144r4697j74910k0777B30271B0600d56766g4696K0742
$$ -251285 -85378 -275117 -22144 -116841 -291751 -312528 230271 20600 -456766 -74696 -53954
9719e3954A19109J5947C6694a28689e8101k01773N2251A56608f5530I8879A5957
$$ -53954 119109 135056 36694 -128689 -58101 -259874 -207623 156608 -65530 98879 15957
9707a99333A19700m0843L3e636o9184E9413c11592d6729j28365o8634H0561f1483
$$ -199333 119700 78857 78890 -5636 -74820 59413 -311592 -46729 -175094 -243728 80561 -61483
9694i1073G5593b37768Q6322F180K76940e2590k7921B27788A4580N993b11998
$$ -91073 75593 -237768 -151446 6180 283120 -52590 -80511 227788 14580 20573 -211998
9682d18621d2643k48203P2491Q904K5777P4108J0926k79372F4811b07665m7225
$$ -418621 -42643 -290846 -218355 -209451 -183674 -109566 -98640 -378012 64811 -207665 -254890
9671b54890B14283e0422b2031C4103i561G6788B2251e3394E9294a94875R121j84998
$$ -254890 214283 -50422 -22031 34103 -9561 76788 22251 -53394 59294 -194875 -185754 -370752
9659c70752f9796m6428f734k76396C26762G5557a40610k34093A86638n6658c1551
$$ -370752 -69796 -116224 -6734 -283130 326762 75557 -140610 -374703 186638 129980 -31551
9647a46415M4345j81712B7618b70859B44223B4413g860l52966J29349E0720a16091
$$ -146415 -102070 -283782 27618 -270859 244223 24413 -7860 -360826 -231477 50720 -116091
9635A27326h3877A73779A0808b57596B84037F514J24733a40958N1261j03197l5576
$$ 127326 -83877 173779 10808 -257596 284037 6514 131247 -140958 -89697 -192894 -228470
9624b28470E5207b91346A09334b12602Q7188A67259N9616h6052a7484B0130i9726
$$ -228470 55207 -291346 109334 -212602 -125414 167259 226875 -86052 -17484 20130 -99726
9612c5710J7084A96964c34858A62840G3449J54167b30168B69108d7461B57419
$$ -35710 -18626 196964 -334858 162840 73449 227616 -230168 269108 -47461 257419
9601c515F9196a29428e1724A39988f1706i136j25249I5757b39274o9330f1323
$$ -3515 69196 -129428 -51724 139988 -61706 -9136 -134385 95757 -239274 -308604 -61323
9589a9968o1967o4156B18774b72668b3351j674j87160R0141H2054g1103j07509
$$ -19968 -81935 -146091 218774 -272668 -23351 -25025 -212185 -122044 82054 -71103 -178612
9578a78612q6269a05869j96174B35144b90179j37778a26012h102q201A5117b22458
$$ -178612 -264881 -105869 -302043 235144 -290179 -427957 -126012 -8102 -16303 15117 -222458
9566i5211p0545P7575j39082j78434J66095d8181p5421I8638D9035i1591A3801
$$ -95211 -165756 -88181 -227263 -405697 -239602 -48181 -123602 98638 49035 -91591 13801
9554F4658L12026b62594Q0922C6778b45138l3717g9630k90201E6729O2396B6281
$$ 64658 376684 -262594 -181672 36778 -245138 -278855 -79630 -369831 56729 119125 26281
9542g4798D5476N7542h7781j63668g3354F867J54013i866k86364i7113j35116
$$ -74798 45476 103018 -87781 -251449 -73354 6867 160880 -9866 -296230 -97113 -232229
9531b32229k89800h1740L766A7465a49251c5973A76878a96398G1656c01378A50558
$$ -232229 -522029 -81740 -77974 17465 -149251 -35973 176878 -196398 71656 -301378 150558
9519B02447f9205D5847c01695J34609h771j35844B13408a09703k87746d8792C4302
$$ 202447 -69205 45847 -301695 -167086 -8771 -144615 213408 -109703 -397449 -48792 34302
9507a88756h9293C70194H6005a57042A61439C5449f3300q8440N5755j09131e6535
$$ -188756 -89293 370194 86005 -157042 161439 35449 -63300 -151740 -95985 -205116 -56535
9495a75978j8516F7070a71558k1277L327d9954M368j32501H2692a50561e1183
$$ -175978 -194494 67070 -171558 -192835 -189508 -49954 -45586 -178087 82692 -150561 -51183
9483d879k25507k2900H9052J04988d1250B09087a26185L7194r0354h5113j54446
$$ -4879 -230386 -253286 89052 194040 -41250 209087 -126185 -88991 -179345 -85113 -239559
9472b39559i2534H6660a84650F0834J0122e8284k5148o7639A47289L3818J19282
$$ -239559 -92534 86660 -184650 60834 70956 -58284 -83432 -151071 147289 181107 300389
9461C00389j14350O92m5150e3310j83182C0555i2413A96458m0868b26305p821
$$ 300389 186039 186731 141581 -53310 -236492 30555 -92413 196458 155590 -226305 -234126
9450b34126e0902G7991l114J47403b12106f0520m0179c522j43130J9673A61127
$$ -234126 -50902 77991 74877 222280 -212106 -60520 -100699 -3522 -146652 -126979 161127
9438B6724j2197Q638a57915B9086a15241c5564J2808A80327h8414o9017j31687
$$ 26724 14527 23165 -157915 29086 -115241 -35564 -22756 180327 -88414 -157431 -289118
9427b89118C56903b8055D2604d23964G7892a61277c1722j36344A64041b91296
$$ -289118 356903 -28055 42604 -423964 77892 -161277 -31722 -168066 164041 -291296
9416e7141j8164k54710A10824M5068a22930A25369a51218c2716m7978k8054c240
$$ -57141 -75305 -330015 110824 155892 -122930 125369 -151218 -32716 -80694 -108748 -3240
9404h3253D345J19761b30462B41988D0139a44079A15748r206a02866k11586a25133
$$ -83253 4345 124106 -230462 241988 40139 -144079 115748 106542 -102866 -314452 -125133
9392a98933A1154a83594C32235J5496b1163A78340e7944D0307a63495a1593r7163
$$ -198933 11154 -183594 332235 347731 -21163 178340 -57944 40307 -163495 -11593 -108756
9381a08756L5659j24477E4808a1837C82709a33627k606k90828f6951J3195j99135
$$ -108756 -73097 -197574 54808 -11837 382709 -133627 -136233 -427061 -66951 -53756 -252891
9370b52891D2116c9589j97749B65625H5713K6309n2087J65563a44068C658a39363
$$ -252891 42116 -39589 -237338 265625 85713 112022 59935 225498 -144068 3658 -139363
9358g838j96925e4658A9034L705K31551B2155K15466B700J70728k2839a29503
$$ -7838 -204763 -54658 19034 22739 254290 22155 237621 2700 173428 150589 -129503
9346A74099a32222p0175f1533b0080l44374g6072A37210c05752A9716b52478B91184
$$ 174099 -132222 -202397 -61533 -20080 -364454 -76072 137210 -305752 19716 -252478 291184
9334g718A90015e3734A41195a82372N7886k96849a99901F5095a2188j26282A08836
$$ -7718 190015 -53734 141195 -182372 -124486 -421335 -199901 65095 -12188 -138470 108836
9322h7252m22902i3116b4851E7836O8660K67207b19603L0403N0713j27637a2793
$$ -87252 -510154 -93116 -24851 57836 126496 393703 -219603 -189200 -138487 -266124 -12793
9310f8873o7123A36675c23743N8774a06851L4640k78857e3012k15917K1478a2831
$$ -68873 -135996 136675 -323743 -264969 -106851 -72211 -351068 -53012 -268929 -247451 -12831
9298a02661H8501d6779j75075Q7387n3553f8653k14598J35963A85489a4486p47
$$ -102661 88501 -46779 -221854 -134467 -188020 -68653 -283251 -147288 185489 -14486 -15233
9287a5233l9147J8303J5210A65957c96381B86828b4109p4148j08978c1326A02669
$$ -15233 -54380 -36077 -20867 165957 -396381 286828 -24109 -98257 -207235 -31326 102669
9275a74224G5142K07071C2860a53457A43005R5933a49917L618j01738A07093a88192
$$ -174224 75142 282213 32860 -153457 143005 238938 -149917 -146299 -248037 107093 -188192
9263A12122b56209l1052C7403e6104F0494D759f604j55252r8374F7587J7013A2279
$$ 112122 -256209 -287261 37403 -56104 60494 4759 -6604 -161856 -260230 67587 84600 12279
9250a62956B38150B1329b21549Q1198J2642K4188a7091j4686j30271e5628o8619
$$ -162956 238150 21329 -221549 -140351 -127709 -103521 -17091 -31777 -162048 -55628 -124247
9239a24247K4494o2070D2086a88930A09732b2896g003m510l1371j33838k4526
$$ -124247 -99753 -161823 42086 -188930 109732 -22896 -7003 -11513 -42884 -176722 -201248
9228b01248F229O5721d8384k31708J37597b1822B02248c35009a03349c9142A07242
$$ -201248 6229 71950 -48384 -280092 -142495 -21822 202248 -335009 -103349 -39142 107242
9216a99905G5189l7574c89823K8523D5222c969j61646d5334E21314A4977J97103
$$ -199905 75189 37615 -389823 -361300 45222 -3969 -165615 -45334 521314 14977 212080
9205B12080n7348p5644a27783A90454R7793a20200M7598M380n33922J64992b17815
$$ 212080 154732 79088 -127783 190454 288247 -120200 -72602 -68222 -602144 -437152 -217815
9193B42001i548j98321f3782k7370b1010m6396A41167a29674L4918j93910J14259
$$ 242001 -9548 -207869 -63782 -91152 -21010 -67406 141167 -129674 -94756 -288666 -174407
9182a74407A45657b25528A19946J23187c15844C9713b55988c2277k944A43962
$$ -174407 145657 -225528 119946 243133 -315844 39713 -255988 -32277 -35221 143962
9171c8987e351o1974A71546c28250A20167n1979M9541g9121k7489B11659r0037
$$ -38987 -5351 -67325 171546 -328250 120167 68188 117729 -79121 -106610 211659 121622
9160A21622c05244a10739l9602g3546D7530a0182A30294d066p8565D0684A8601
$$ 121622 -305244 -110739 -150341 -73546 47530 -10182 130294 -4066 -82631 40684 18601
9148h8291j00534E3126f8955k9747k33785f1245k14727A77120J73614c12860H1199
$$ -88291 -188825 53126 -68955 -98702 -332487 -61245 -275972 177120 350734 -312860 81199
9136D3980a89507D474J17339N3748c32289J58248l9919D2866J1109h4836M0367
$$ 43980 -189507 4474 121813 175561 -332289 -174041 -213960 42866 53975 -84836 -44469
9125d4469g393C10104j20568n4612O1773d696j98403i8255M1557j00544D1240
$$ -44469 -7393 310104 189536 134924 196697 -4696 -203099 -98255 -56698 -157242 41240
9113a21995l37787A48788c52777q5200D6917a71798o5316B36979r6641m9309K2306
$$ -121995 -459782 148788 -352777 -437977 46917 -171798 -237114 236979 140338 91029 113335
9102A13335e3G7759l7032b94012F7301A1558O7620a6684j0269r4472k80354e0731
$$ 113335 -53 77759 40727 -294012 67301 11558 79178 -16684 -26953 -121425 -401779 -50731
9089A21630b39798J02005A34696D3098J33290b09775H8917a2842B22723F9399
$$ 121630 -239798 -137793 134696 43098 176388 -209775 88917 -12842 222723 69399
9078c63219A7328d0966n1137j67699h5668A73808a99794G2415a35463d4047d247
$$ -363219 17328 -40966 -92103 -259802 -85668 173808 -199794 72415 -135463 -44047 -4247
9066A28033D5444c40477a30132B4168d0294C7362b05739P1349A13176b9967E3682
$$ 128033 45444 -340477 -130132 24168 -40294 37362 -205739 -134390 113176 -29967 53682
9054b69758J04233A23397e438k33084h4828B13082a49855e0953C6367b614j15560
$$ -269758 -165525 123397 -5438 -238522 -84828 213082 -149855 -50953 36367 -2614 -118174
9043a18174k012B11746h743B5760c24087R845E7162b97085J25321k46518A56459
$$ -118174 -120186 211746 -8743 25760 -324087 -314242 57162 -297085 -171764 -418282 156459
9031e6975C04154D6432d51583A12272b63955B30971b73653B9654c36872J58493
$$ -56975 304154 46432 -451583 112272 -263955 230971 -273653 29654 -336872 -178379
9021a78379A16204b56030b758k6750n6636A75037m5643A9600J43065b45395K0142
$$ -178379 116204 -256030 -2758 -29508 -86144 175037 129394 19600 162665 -245395 -225253
9010b25253A28351J22270b35963C00880a33852I9934a9477A46230J9632d905j62366
$$ -225253 128351 250621 -235963 300880 -133852 99934 -19477 146230 165862 -4905 -167271
8999a67271l7914d2361j77777I8204M9173n4246b21974C3544a80744h3298G6637
$$ -167271 -205185 -42361 -220138 98204 147377 93131 -221974 33544 -180744 -83298 76637
8987a13169G9622i7815M5523D5381a51982B29328c40596a17910k85337B27309
$$ -113169 79622 -97815 -52292 45381 -151982 229328 -340596 -117910 -403247 227309
8976b02A30019a1399j31921B12421a75847j06962D08409a05582r2066m9806g5403
$$ -202 130019 -11399 -143320 212421 -175847 -282809 408409 -105582 -197648 -247454 -75403
8964h6979j06251C80356d05599B79134a01306b4589j35297e2758k91525e139l76767
$$ -86979 -193230 380356 -405599 279134 -101306 -24589 -159886 -52758 -344283 -5139 -381906
8953c81906a51966B38060a31122q4913A19819g6260A01215K08257a64580e8158
$$ -381906 -151966 238060 -131122 -216035 119819 -76260 101215 309472 -164580 -58158
8942E2669a29385L5613l63944D2683a55461A69629F2076c8179j15222A5662c08920
$$ 52669 -129385 -93772 -457716 42683 -155461 169629 62076 -38179 -153401 15662 -308920
8930c4487l91800a43304I3257g584B72246A25661Q62189J760594N687701A599609
$$ -34487 -426287 -143304 93257 -7584 272246 125661 987850 2748444 8436145 1599609
8919D55101j26515Q2724b5976F7078E919b78278b9324A48168K51153j00276m5884
$$ 455101 328586 411310 -25976 67078 5919 -278278 -29324 148168 399321 299045 253161
8908B53161G4384R4662k2553b04049C7058M9763h6562D5538C431N4876P453a34265
$$ 253161 74384 169046 146493 -204049 37058 86821 -86562 45538 3431 58307 65760 -134265
8895A14550K4114a1770k6881A42823b84790F8344d6047q6990A21693A8787a13764
$$ 114550 138664 -11770 -38651 142823 -284790 68344 -46047 -133037 121693 18787 -113764
8883b54326G1811f1723K0725j0370H0604P2868G2999f2794i460A69363G2872a99946
$$ -254326 71811 -61723 -40998 -51368 80604 153472 72999 -62794 -9460 169363 72872 -199946
8870a02263I7884b73472O5905B28736a54989j66724P750F1941a35483F6295g4966
$$ -102263 97884 -273472 -207567 228736 -154989 -321713 -313963 61941 -135483 66295 -74966
$$ [...]
##END NTUPLES=NMR SPECTRUM
##END=
