
##TITLE=AC1227_VIERS11107_6074976_PiINvGLfJz
##JCAMPDX= 6.0         $$ Bruker NMR JCAMP-DX V2.0
##DATA TYPE= NMR SPECTRUM
##DATA CLASS= NTUPLES
##ORIGIN= BRUKER
##OWNER= Administrator
$$ 1.72 TOPSPIN		Version 2.1
$$ 2012-05-07 22:47:32.031 -0500  Administrator@TOPSPIN
$$ Compression mode = diff/dup
##.OBSERVE FREQUENCY= 400.13188235
##.OBSERVE NUCLEUS= ^1H
##.ACQUISITION MODE= SIMULTANEOUS (DQD)
##.ACQUISITION SCHEME= undefined
##.AVERAGES= 8
##.DIGITISER RES= 22
##SPECTROMETER/DATA SYSTEM= spect
##.PULSE SEQUENCE= zg30
##.SOLVENT NAME= COFFEE_meoh
##.SHIFT REFERENCE= INTERNAL, COFFEE_meoh, 1, 14.98061
##AUDIT TRAIL= $$ (NUMBER, WHEN, WHO, WHERE, PROCESS, VERSION, WHAT)
$$ ##TITLE= Audit trail, TOPSPIN		Version 2.1
$$ ##JCAMPDX= 5.01
$$ ##ORIGIN= Bruker BioSpin GmbH
$$ ##OWNER= Administrator
$$ $$ C:\Bruker\TOPSPIN/data/COFFEE/nmr/AC1227_VIERS11107_6074976_PiINvGLfJz/10/pdata/1/auditp.txt
$$ ##AUDIT TRAIL=  $$ (NUMBER, WHEN, WHO, WHERE, PROCESS, VERSION, WHAT)
(   1,<2012-05-07 22:47:24.843 -0500>,<Administrator>,<TOPSPIN>,<go>,<TOPSPIN 2.1>,
      <created by zg
	started at 2012-05-07 22:46:18.328 -0500,
	POWCHK enabled, PULCHK disabled,
       configuration hash MD5:
       AF F2 23 6B 01 CD 40 DD E5 A1 38 A0 06 EA F7 77
       data hash MD5: 64K
       F1 21 39 99 04 68 E8 14 58 EF 8D 6B 12 3E C2 32>)
(   2,<2012-05-07 22:47:27.687 -0500>,<Administrator>,<TOPSPIN>,<proc1d>,<TOPSPIN 2.1>,
      <Start of raw data processing
       efp LB = 0 FT_mod = 6 PKNL = 1 PHC0 = 0 PHC1 = 0 SI = 32K 
       data hash MD5: 32K
       F7 B3 87 FF 2F 48 06 B9 DC 80 40 90 46 7C 77 02>)
(   3,<2012-05-07 22:47:28.031 -0500>,<Administrator>,<TOPSPIN>,<proc1d>,<TOPSPIN 2.1>,
      <pk PHC0 = 211.3055 PHC1 = 0 
       data hash MD5: 32K
       1C 78 02 10 71 26 3F AA 41 13 21 EC 0F 73 5C 0D>)
(   4,<2012-05-07 22:47:28.078 -0500>,<Administrator>,<TOPSPIN>,<proc1d>,<TOPSPIN 2.1>,
      <abs ABSG = 1 
       data hash MD5: 32K
       EF C2 26 FD C5 45 5E 88 88 8D 69 FF 4A 35 18 B0>)
(   5,<2012-05-07 22:47:28.109 -0500>,<Administrator>,<TOPSPIN>,<proc1d>,<TOPSPIN 2.1>,
      <abs ABSG = 2 
       data hash MD5: 32K
       CB D9 59 37 7E 0E 17 E8 A5 2D 87 EC 52 69 8B 1A>)
(   6,<2012-05-07 22:47:28.140 -0500>,<Administrator>,<TOPSPIN>,<proc1d>,<TOPSPIN 2.1>,
      <abs ABSG = 3 
       data hash MD5: 32K
       8B 93 00 F3 63 BE C6 E2 AE F0 45 F3 B5 80 79 53>)
(   7,<2012-05-07 22:47:28.171 -0500>,<Administrator>,<TOPSPIN>,<proc1d>,<TOPSPIN 2.1>,
      <abs ABSG = 4 
       data hash MD5: 32K
       ED DC A3 67 33 38 8D 4A 99 76 D6 80 7F 16 F9 DB>)
(   8,<2012-05-07 22:47:28.203 -0500>,<Administrator>,<TOPSPIN>,<proc1d>,<TOPSPIN 2.1>,
      <abs ABSG = 5 
       data hash MD5: 32K
       9A 90 28 66 C4 DF 45 5E BB 27 8D 65 8E 2B B2 17>)
$$ ##END=
$$ 
$$ $$ hash MD5
$$ $$ BA BF 75 17 22 48 9E 2E 30 3A ED 5E 2A 62 7C CA
##$RELAX= 
##$RELAX= 
##$RELAX= 
##$RELAX= 
##$RELAX= 
##$RELAX= 
##$RELAX= 
$$ Bruker specific parameters
$$ --------------------------
$$ [...]
##$TP= (0..7)
150 150 150 150 150 150 150 150
##$TP07= 0
##$TPNAME0= <>
##$TPNAME1= <>
##$TPNAME2= <>
##$TPNAME3= <>
##$TPNAME4= <>
##$TPNAME5= <>
##$TPNAME6= <>
##$TPNAME7= <>
##$TPOAL= (0..7)
0.5 0.5 0.5 0.5 0.5 0.5 0.5 0.5
##$TPOFFS= (0..7)
0 0 0 0 0 0 0 0
##$TUNHIN= 0
##$TUNHOUT= 0
##$TUNXOUT= 0
##$USERA1= <user>
##$USERA2= <user>
##$USERA3= <user>
##$USERA4= <user>
##$USERA5= <user>
##$V9= 5
##$VALIST= <valist>
##$VCLIST= <CCCCCCCCCCCCCCC>
##$VD= 0
##$VDLIST= <DDDDDDDDDDDDDDD>
##$VPLIST= <PPPPPPPPPPPPPPP>
##$VTLIST= <TTTTTTTTTTTTTTT>
##$WBST= 1024
##$WBSW= 4
##$XGAIN= (0..3)
0 0 0 0
##$XL= 0
##$YL= 0
##$YMAX_a= 524297
##$YMIN_a= -630180
##$ZGOPTNS= <>
##$ZL1= 120
##$ZL2= 120
##$ZL3= 120
##$ZL4= 120
##$ABSF1= 14.98061
##$ABSF2= -5.57192
##$ABSG= 5
##$ABSL= 3
##$ALPHA= 0
##$AQORDER= 0
##$ASSFAC= 0
##$ASSFACI= 0
##$ASSFACX= 0
##$ASSWID= 0
##$AUNMP= <proc_prof1d_extract_pilot.lims>
##$AXLEFT= 0
##$AXNAME= <>
##$AXNUC= <1H>
##$AXRIGHT= 0
##$AXTYPE= 0
##$AXUNIT= <>
##$AZFE= 0.1
##$AZFW= 0.1
##$BCFW= 0
##$BC_mod= 0
##$BYTORDP= 0
##$COROFFS= 0
##$CY= 15
##$DATMOD= 1
##$DC= 0
##$DFILT= <>
##$DTYPP= 0
##$F1P= 0
##$F2P= 0
##$FCOR= 0.5
##$FTSIZE= 32768
##$FT_mod= 6
##$GAMMA= 0
##$GB= 0
##$INTBC= 1
##$INTSCL= 1
##$ISEN= 128
##$LB= 0
##$LEV0= 0
##$LPBIN= 0
##$MAXI= 10000
##$MC2= 0
##$MEAN= 0
##$ME_mod= 0
##$MI= 0
##$NCOEF= 0
##$NC_proc= -8
##$NLEV= 6
##$NOISF1= 0
##$NOISF2= 0
##$NSP= 0
##$NTH_PI= 0
##$NZP= 0
##$OFFSET= 14.98061
##$PC= 1
##$PHC0= 211.3055
##$PHC1= 0
##$PH_mod= 1
##$PKNL= yes
##$PPARMOD= 0
##$PPDIAG= 0
##$PPIPTYP= 0
##$PPMPNUM= 2147483647
##$PPRESOL= 1
##$PSCAL= 4
##$PSIGN= 0
##$PYNMP= <proc.py>
##$REVERSE= no
##$SF= 400.13
##$SI= 32768
##$SIGF1= 0
##$SIGF2= 0
##$SINO= 400
##$SIOLD= 32768
##$SPECTYP= <>
##$SREGLST= <1H.CDCl3>
##$SSB= 0
##$STSI= 32768
##$STSR= 0
##$SW_p= 8223.68421052632
##$SYMM= 0
##$S_DEV= 0
##$TDeff= 65536
##$TDoff= 0
##$TI= <>
##$TILT= no
##$TM1= 0
##$TM2= 0
##$TOPLEV= 0
##$USERP1= <user>
##$USERP2= <user>
##$USERP3= <user>
##$USERP4= <user>
##$USERP5= <user>
##$WDW= 1
##$XDIM= 32768
##$YMAX_p= 464936029
##$YMIN_p= -674493
##$CURPLOT= <Network HP LaserJet P1505>
##$CURPRIN= <$Network HP LaserJet P1505>
##$DFORMAT= <normdp>
##$LAYOUT= <+/1D_H.xwp>
##$LFORMAT= <normlp>
##$PFORMAT= <normpl>
##$SURQMSG= 1
$$ End of Bruker specific parameters
$$ ---------------------------------
##NTUPLES= NMR SPECTRUM
##VAR_NAME=  FREQUENCY,     SPECTRUM/REAL,   SPECTRUM/IMAG
##SYMBOL=    X,             R,               I
##VAR_TYPE=  INDEPENDENT,   DEPENDENT,       DEPENDENT
##VAR_FORM=  AFFN,          ASDF,            ASDF
##VAR_DIM=   32768,         32768,           32768
##UNITS=     HZ,            ARBITRARY UNITS, ARBITRARY UNITS
##FACTOR=    0.250966925370066, 1,           1
##FIRST=     8223.43324360095, 20160,        152067
##LAST=      0,             -714,            -111220
##MIN=       0,             -674493,         0
##MAX=       8223.43324360095, 464936029,    0
$$ Real data points
##PAGE= N=1
##DATA TABLE= (X++(R..R)), XYDATA
$$ [...]
$$ plain form
19523 282622 -58016 117763 66559 174829 60131 19555 186653 -61391 -219892 -227896 292844
19511 36136 42915 189767 196186 10551 -134119 123685 22387 -243828 -214794 -210771 47176
19499 64529 21122 -80609 24966 26450 -14824 23453 113700 89214 -142999 264107 19861
19487 105342 -205188 47711 -214199 -245278 -184643 -238687 -69454 -101785 -3829 316068 -156190
19475 -13740 203145 -95027 276838 52373 -192860 -223277 -194179 -72362 -89850 -100802 -112585
19464 -112585 209045 92968 462950 -53880 -151820 49548 224100 56360 -223014 197596
19453 99020 322921 311039 -63091 -182842 -123154 11328 274412 80351 402795 -469614 146751
19441 -165351 5960 -71473 53657 -484315 -62928 -146306 -10865 -279483 23473 -147303 196999
$$ packed form
19523B82622e8016A17763n1204J08270F0131A9555J67098f1391j58501q004B92844
19511C6136O779J46852O419A0551a34119A23685B2387b43828K9034M023D7176
19499F4529B1122h0609B4966J484a4824B3453R0247k4486a42999B64107A9861
19487A05342b05188D7711b14199l1079O0635n4044f9454l2331c829C16068a56190
19475a3740B03145i5027B76838E2373a92860l0417K9098g2362j7488j0952j1783
19464a12585B09045I2968L69982e3880r7940D9548J74552E6360b23014A97596
19453I9020K23901j1882f3091j19751N9688A1328K63084H0351L22444d69614A46751
19441a65351E960g1473E3657d84315f2928q3378a0865k68618B3473a47303A96999
$$ plain form
19429 146409 190614 280475 -205552 -148539 -263760 -272028 83072 -198445 -68709 -221202 -72771
19417 -261587 -234802 -34136 -145123 -113249 -214122 -142810 -285348 -203517 185352 -191632
19406 155726 -92620 -91309 -151988 55956 -7421 34253 131886 85836 -41484 168786 5034 -177356
19393 -140323 -202500 -192943 24576 -274075 -220880 40481 191907 -634 -186526 -361977 -110421
19381 -62282 342695 191168 -112592 16943 -47710 126401 -168057 -98766 145581 -201874
19370 -302593 -148394 -65452 10904 274799 -66291 -104859 21655 -360118 162028 -96797 -309982
19359 -309982 -159634 120159 94998 -34758 103488 386397 125015 140669 -449057 -433118
19349 -433118 -255827 -86641 228042 -239451 -113713 -118008 -37938 -155553 -50243 147396
$$ packed form
19429A46409M4205Q9861b05552N7013j15221q268H3072a98445f8709j52493g2771
19417b61587K6785c4136j10987L1874j00873P1312j42538Q1831A85352a91632
19406A55726i2620J311o0679E5956g421C4253R7633m6050d1484A68786E034a77356
19393a40323o2177R557B4576b74075N3195D0481J51426f34j85892j75451a10421
19381f2282C42695j51527a12592A6943d7710A26401a68057O9291A45581b01874
19370c02593a48394f5452A0904K63895f6291l8568B1655c60118A62028i6797k13185
19359c09982J50348A20159k5161c4758A03488K82909A25015J5654d49057J5939
19349d33118J77291h6641B28042b39451a13713m295c7938j17615e0243A47396
$$ plain form
19338 -188925 -111175 -353623 4235 235356 144399 -147191 -61255 -58188 -103049 -97611 130165
19326 80880 48921 -72402 -48721 231996 199974 -99378 -199727 75545 27662 -206416 -222604
19315 -222604 -183613 -207396 -122633 -184470 -49896 4557 -91435 242433 -175535 -157389 25600
19303 -157486 144850 -349547 -10788 -17429 75641 43135 -180698 47023 -87533 -200229 117193
19291 -151832 26445 -80472 21583 117308 -105309 -77656 -240400 -2650 -68900 152889 539651
19280 539651 -276209 8197 117937 105838 -72636 34268 -430269 15068 307915 -17729 -117112
19269 -117112 342394 -266596 -62581 275242 -66221 30679 58180 213426 -158379 389222
19258 -53107 -107872 271376 -132022 -200122 10048 -115778 -10355 -24591 57999 -239879 -241207
$$ packed form
19338a88925P7750k42448D235K31121r0957a47191f1255L067m4861N438A30165
19326H0880l1959g2402K3681B31996l2022i9378j00349G5545B7662b06416j6188
19315b22604L8991k3783Q4763o1837d9896D557i1435B42433a75535J8146B5600
19303a57486A44850c49547a0788o641G5641l2506a80698D7023h7533j12696A17193
19291a51832B6445h0472B1583R5725a05309K7653j62744b650o6250A52889L86762
19280E39651b76209H197J09740j2099g2636C4268d30269A5068K92847a7729r9383
19269a17112C42394b66596f2581B75242f6221C0679K7501J55246a58379C89222
19258e3107n4765B71376a32022o8100A0048a15778a0355j4236E7999b39879j328
$$ plain form
19247 -241207 84608 -249546 -148134 -181839 21556 311583 -4429 24447 -110322 37773 -3704
19235 -379124 -188292 -199004 -109239 -20379 -117169 -119323 -53186 -79787 -210258 35314 -93463
19223 -279631 -135444 -47711 -123006 -14474 -39110 -50832 -67295 124193 164107 -343 -94673
19212 -94673 -165083 32321 13608 -82286 213123 -314511 22749 17604 -131089 308633 -113922
19200 -135884 -58625 12298 -112157 -121196 38246 -404925 89525 123833 191520 -84679 -182562
19189 -182562 -447217 276030 280240 53320 12084 75040 78609 51102 59003 155759 -72618 -6267
19176 -161103 337406 -5243 -37993 -76825 -69457 -43063 -186979 -18380 -283505 -317703 448021
19164 154792 130461 -219422 -162741 47450 -102051 -144627 -415000 -28885 -176980 -18907 -206898
$$ packed form
19247b41207H4608b49546J01412l3705B1556K90027d429B4447a10322C7773c704
19235c79124a88292j0712Q9765b0379r6790k154e3186k6601j30471C5314i3463
19223b79631a35444d7711p5295a4474k4636j1722j6463A24193L9914c43r4330
19212i4673p0410C2321A3608h2286B13123c14511B2749n145a31089C08633a13922
19200a35884e8625A2298a12157r039C8246d04925H9525L4308O7687h4679r7883
19189a82562k64655B76030M210E3320A2084O2956L569k7507P901R6756g2618f267
19176a61103C37406e243l2750l8832P368K6394j43916a8380k65125l4198D48021
19164A54792k4331b19422N6681D7450a02051m2576k70373b8885j48095a8907j87991
$$ plain form
19153 -206898 83876 -259320 244349 -92517 113848 -240976 104889 275717 -154667 -91601
19143 -91601 -152761 108280 -162171 -228943 -26158 -50806 158706 57979 -108337 -213332 -25344
19131 -308601 -248091 -35634 -20141 -197050 168596 -34073 -117752 126974 -131909 -174565 -282597
19120 -282597 36790 -160419 -52544 -435097 238951 -448036 -311886 -120678 275724 -52910
19109 249003 110849 -288725 -82440 -359732 118623 60422 -503264 -66271 -248007 2907
19098 222490 -52990 -48616 25665 112614 -384505 85822 69222 -97549 -209601 -227846 -330414
19087 -330414 -30716 282756 -385938 -183452 -140980 98328 81454 -125191 189557 -180879
19076 120018 -101616 -101439 -156265 75050 -11285 -116319 -314980 -680 -323693 -208728 -99555
$$ packed form
19153b06898H3876b59320B44349i2517A13848b40976A04889J70828a54667O3066
19143i1601o1160A08280a62171o6772b6158k4648A58706E7979a08337j04995b5344
19131c08601O0510c5634J5493j76909A68596c4073q3679A26974a31909m2656j08032
19120b82597C6790a60419e2544l82553B38951d48036J36150a20678B75724e2910
19109B49003A10849b88725h2440k77292A18623n8201e03264f6271j81736B907
19098B22490e2990M374B5665Q6949c84505H5822j6600i7549j12052j8245j02568
19087c30414c0716B82756c85938a83452M2472I8328j6874a25191A89557a80879
19076A20018a01616J77n4826G5050a1285j05034j98661f80l23013J14965i9555
$$ plain form
19064 151831 43414 -130275 -10314 -72429 -154721 73235 29942 -34573 -97399 -97630 -57400 173040
19051 30035 -325623 39860 -92232 -145773 -59381 7661 -111060 -159198 -108785 -276632 262184
19039 237112 -14715 312980 -91007 -97631 269322 -130937 -166804 -190278 -126136 3144 124925
19028 124925 -135718 -157933 -152874 -147679 -118916 397735 264419 124370 -316076 -535034 81187
19016 -19404 -144313 330042 301635 68125 -104737 -175280 174169 -26290 81736 13068 -43994
19004 -342148 158431 183937 -144423 248770 -203539 -14952 -1655 67711 -59101 107204 -158107
18992 166192 -116081 -346317 -86587 -85392 33573 -28346 126126 54918 -33546 -335586 233584
18980 235423 -126083 177882 22651 181773 261167 -18698 -135846 -64927 -151756 -258523
$$ packed form
19064A51831D3414a30275a0314o2115q2292G3235B9942c4573o2826k31M0230A73040
19051C0035c25623C9860i2232n3541e9381G661a11060m8138N0413j67847B62184
19039B37112a4715C12980i1007o624B69322a30937l5867k3474O4142C144J21781
19028A24925a35718k2215N059N195K8763C97735j33316A24370c16076k18958H1187
19016a9404j24909C30042k8407F8125a04737p0543A74169b6290H1736A3068d3994
19004c42148A58431K5506a44423B48770b03539a4952a655F7711e9101A07204a58107
18992A66192a16081k30236h6587J195C3573b8346A26126E4918c3546l02040B33584
18980B35423a26083A77882B2651J59122P9394a8698j17148f4927q6829j06767
$$ plain form
18970 -258523 -288791 -87966 -192096 -147136 -44391 37252 -28795 -16939 -255078 -387379 183744
18958 52526 186802 211461 -304414 -151713 200192 -105068 -166630 -112841 -13231 25321 10693
18946 -280347 -67045 235567 33507 -128868 -143317 78986 223061 -127862 50425 -62582 -231696
18935 -231696 175069 88022 113583 -221581 -14650 -266641 -359324 6460 155924 63292 -54291
18923 11051 284590 181691 -48775 -125793 -48612 -81407 219761 54288 -167009 -163900 -308974
18912 -308974 15951 -177007 -185863 -40173 16274 -355600 -282558 218351 7483 -22161 -109789
18901 -109789 -14226 -82044 122926 42922 -205857 116947 -102015 -159407 118014 -291864
18890 -69785 -68190 -2661 40219 179401 62330 -40114 20165 -264541 -50983 -87558 -66069 -116517
$$ packed form
18970b58523l0268h7966j04130M4960d4391C7252b8795J1856k38139j32301A83744
18958E2526J34276K4659c04414a51713B00192a05068o1562N3789a3231B5321A0693
18946b80347f7045B35567C3507a28868j4449G8986J44075a27862E0425f2582j69114
18935b31696A75069q7047K5561b21581a4650k51991r2683F460J49464F3292e4291
18923A1051K73539j02899d8775p7018d8612l2795B19761E4288a67009L109j45074
18912c08974A5951a77007q856d0173A6274c55600P3042B18351G483b2161q7628
18901a09789a4226o7818A22926D2922b05857A16947a02015n7392A18014b91864
18890f9785J595b661D0219J39182F2330d0114B0165b64541e0983l6575K1489n0448
$$ plain form
18878 -116517 216903 109976 100109 -52948 191023 12536 -175652 19530 -121181 273046
18867 -12010 294414 -85774 -265514 -105474 31104 117329 -177097 -200017 144537 19621 -227484
18855 -48595 -62275 185714 -7696 -193224 8253 -128939 102579 -182590 -213484 -130542 2912
18843 76726 -71799 -124199 147629 -55001 35510 -270589 310689 -48492 -27612 -32226 168087
18831 -379539 -163764 13536 -24182 187886 -107385 -126451 -18296 -147727 236680 -256883
18820 -212115 99205 -155009 -189755 -243552 206630 -603977 -128091 51288 -62181 -197878
18810 -197878 42527 -81017 -128118 -279113 35026 -19002 -219579 110219 4478 2254 198487
18799 198487 -233858 168784 -21900 52939 197459 144156 11031 123414 -267067 -37378
$$ packed form
18878a16517B16903j06927r867e2948A91023A2536a75652A9530a21181B73046
18867a2010B94414h5774j79740a05474C1104Q6225a77097k2920A44537A9621b27484
18855d8595j3680A85714g696j85528H253a28939A02579a82590l0894Q2942B912
18843G6726g1799n2400A47629e5001C5510b70589C10689d8492K0880m614A68087
18831c79539a63764A3536b4182A87886a07385j9066a8296j29431B36680b56883
18820b12115I9205a55009l4746n3797B06630f03977a28091E1288f2181j35697
18810a97878D2527h1017m7101j50995C5026a9002k00577A10219D478k224J96233
18799A98487b33858A68784b1900E2939J44520n3303A1031J12383b67067c7378
$$ plain form
18788 -3816 109744 168723 -254188 53177 -56902 263035 93594 256713 -898 -56077 229623
18776 -183623 118015 -196563 -77070 -42237 -139899 -59148 -101294 140607 -243716 62464 25276
18764 -123831 -127554 -277093 118307 -68862 323417 155116 -65290 -219556 -157676 59479 -120642
18752 -152789 46945 113926 -273744 103899 81478 19656 -329879 -238946 -220806 85031 -275480
18740 160582 -71398 -452231 -171325 148382 12011 -337995 -57054 -56064 -15225 306122 107201
18728 146275 -446708 -98036 -45015 -29227 -182203 -106144 -277145 -343810 68216 -29613 -170871
18717 -170871 24972 147722 127607 -186165 -201586 22584 123668 -159891 -16287 36923 181976
18706 181976 -19883 57587 -211309 -196842 -44089 41788 -44480 -220604 -104437 -361271 47402
$$ packed form
18788c816A09744N8979b54188E3177e6902B63035I3594J63119h98n5179B29623
18776a83623A18015a96563g7070L4833r7662e9148m2146A40607b43716F2464B5276
18764a23831l723j49539A18307f8862C23417A55116f5290j54266O1880E9479a20642
18752a52789D6945O6981b73744A03899k2421A9656c29879R0933J8140H5031b75480
18740A60582g1398l80833a71325A48382A2011c37995e7054R90a5225C06122A07201
18728A46275d46708i8036d5015J5788j52976P6059j71001o6665F8216b9613j41258
18717a70871B4972J22750k0115a86165j5421B2584J01084a59891a6287C6923J45053
18706A81976a9883E7587b11309J4467d4089D1788d4480j76124a04437k56834D7402
$$ plain form
18694 -87475 -120584 -38838 73543 -48980 -122592 76792 -12750 99734 -64369 -38917 23903 -40614
18681 -273873 -112746 -210587 -37216 -23457 -280170 -224076 -31156 -163200 -62879 -316788 -360887
18670 -360887 -20061 -224165 95806 -308053 -75354 107910 -362066 -5545 71038 -380644 34246
18658 -289400 -129048 106355 -75216 -46948 -342789 119271 87525 -81922 -357153 -68365
18647 -64811 49533 -16541 239515 79029 154883 -35710 -92816 100459 -266054 152723 99253
18636 99253 -138114 134529 -70101 -107185 25423 -136113 236780 -223225 -8174 -198962 196711
18624 -117986 -218552 33341 36413 -22337 -178668 -136017 174063 395635 116862 165300 60984
18612 68988 -186905 56136 204224 7539 -14134 284021 118333 4809 76323 -104538 25848
$$ packed form
18694h7475l3109c8838G3543d8980p3612G6792a2750I9734f4369K5452B3903d0614
18681b73873a12746r7841c7216J3759k56713N6094c1156j32044f2879k53909m4099
18670c60887b0061k04104I5806c08053g5354A07910c62066e545G1038c80644C4246
18658b89400a29048A06355g5216K8268k95841A19271l1746h1922k75231f8365
18647f4811D9533a6541B39515G9029P5854c5710n7106A00459b66054A52723n3470
18636I9253a38114A34529g0101l7084B5423a36113B36780b23225h174j90788A96711
18624a17986j00566C3341L072b2337j56331M2651A74063K21572A16862M8438F0984
18612F8988a86905E6136J48088G539a4134B84021A18333D809P1514a04538B5848
$$ plain form
18600 -17281 -265810 -64962 -95344 -379219 -137211 145973 -34434 182082 -42041 -224354
18590 -224354 -77229 119269 -81810 -422484 -337854 220442 -84967 -176788 -31617 -146016 -66698
18578 -210450 302972 -129513 44127 -54989 -20733 66887 -442400 -110503 92545 -38939 122101
18566 120054 30778 100198 -234347 -91613 -153111 102091 -52903 -156746 206412 -173265
18555 137887 -119371 4808 -23680 44119 51297 100693 -132784 -92083 -208197 -274587 -102514
18543 -302620 22333 48449 -71842 46380 -143592 -359422 99403 -258898 -133622 -42690 52444
18531 126404 -368447 211007 -169284 -276996 -203140 21068 289495 -107856 -9080 -364659
18521 -364659 -7578 -155606 -49349 -190336 83353 -59466 -164920 -420805 -69073 -82960 31865
$$ packed form
18600a7281k48529f4962l0382k83875a37211A45973c4434A82082d2041j82313
18590b24354g7229A19269h1810l40674Q4630B20442h4967r1821c1617j14399f6698
18578b10450C02972a29513D4127e4989b0733F6887d42400a10503I2545c8939A22101
18566A20054C0778O9420b34347i1613o1498A02091e2903j03843B06412a73265
18555A37887a19371D808b3680D4119P178M9396a32784M0701j16114o6390a02514
18543c02620B2333K6116g1842D6380a43592k15830I9403b58898J25276d2690E2444
18531A26404c68447B11007a69284j07712P3856B1068K68427a07856i080l55579
18521c64659g578j48028d9349j40987H3353e9466j05454k55885f9073j3887C1865
$$ plain form
18509 -333388 -180284 -28550 -150216 -24740 -2920 -368941 -144131 -99458 -138880 96254 -255786
18497 -109270 49121 270620 284174 53103 -169991 34862 18698 -133768 -84940 -475154 38551
18485 -38419 -8834 74482 309198 -109928 -100592 -189565 167014 262210 -116833 72372 -17305
18473 18861 32920 -102889 -73429 -157262 10599 100261 83041 -32903 140938 -25070 -130951
18462 -130951 -9428 -52598 110734 71081 -119356 -199642 -163509 -104380 96264 181502 184423
18451 184423 40502 164143 30021 -197408 -161689 101612 -215192 -242428 -105486 -37647
18440 -76894 -71752 64063 144511 -348510 -5416 7401 -143809 132 105969 -92592 -82729 -77326
18428 -77326 -415 -6549 306619 28040 -437928 -36792 147845 -106206 -140381 -53312 -364863
$$ packed form
18509c33388J53104b8550j21666b4740b920l66021a44131M4673l9422I6254b55786
18497a09270D9121K21499J3554E3103a69991C4862j6164a33768M8828l90214C8551
18485c8419h834G4482K34716a09928R336q8973A67014R5196a16833G2372a7305
18473A8861J4059a02889K9460q3833A0599Q9662j7220c2903A40938b5070j05881
18462a30951i428m3170A10734l9653a19356q0286L6133N9129I6264Q5238K921
18451A84423D0502J23641C0021a97408L5719A01612b15192k7236a05486c7647
18440g6894N142F4063Q0448c48510e416G401a43809A32J05837i2592R863N403
18428g7326d15o134C06619B8040d37928c6792A47845a06206l4175e3312l11551
$$ plain form
18417 -364863 -386494 -66299 -22830 -135666 -272519 2304 -174330 87218 49926 387601 272878
18406 272878 -31465 288509 91862 -444384 -256957 3501 -300349 -238775 21037 -108842 -133618
18395 -133618 231399 -168518 81605 -122696 -155018 -299898 -81129 305301 80513 25916
18384 19940 -67942 274818 -91837 139785 -12196 -80314 -102734 81947 -197614 57456 244417
18373 244417 40667 -161551 -126747 -24366 183239 -93809 -225174 -142766 -142669 -114774 -3850 -110359
18361 -110359 -329318 -317929 -177896 -179663 -84518 -144489 -136409 170309 83635 -267429 -16216
18349 -290633 -187350 -87957 61100 164061 -366279 -210184 -83797 -107942 -143266 -405383
18339 -405383 46885 -30392 74917 54152 17871 89506 137910 -67629 -174102 -245517 -7477
$$ packed form
18417c64863k1631f6299b2830j12836j36853B304a74330H7218l7292L37675j14723
18406B72878c1465B88509I1862d44384J87427C501c00349O1574B1037a08842k4776
18395a33618B31399a68518H1605a22696l2322j44880h1129C05301H0513B5916
18384A9940f7942B74818i1837A39785a2196o8118k2420H1947a97614E7456J86961
18373B44417D0667a61551L4804b4366A83239i3809j31365Q2408R7K7895c850j06509
18361a10359k18959J1389J40033j767h4518n9971Q080A70309H3635b67429a6216
18349b90633J03283h7957F1100J02961c66279J56095h3797k4145l5324k62117
18339d05383D6885c0392G4917k0765A7871P1635M8404f7629j06473p1415g477
$$ plain form
18327 344512 83330 106760 -130013 -63227 -290109 -173295 376357 -192772 125703 38699
18316 248821 -75075 144455 -189749 91991 -27768 -109055 181214 260970 -7840 260925 -5855
18304 -115827 113603 50069 8821 -89740 -122168 -162188 61598 -36974 465280 -186201 -117721
18293 -117721 -314539 -137122 -95709 -327242 72821 -246418 201637 93477 -9377 161669
18282 139963 -105902 222764 14781 -145901 199854 -232931 -74643 -160949 123798 -363140
18271 11815 -279206 339516 43116 -10487 -13763 -209505 -38753 -253294 -102632 76565 -4058
18259 -140374 -88099 266887 -293623 -74121 96507 -9208 -426197 172013 117113 -158159 28925
18247 -137884 -226013 -318207 87199 -132994 10853 -148554 95681 -12613 -157007 104631 91848
$$ packed form
18327C44512H3330K3430a30013f3227k26882J16814C76357a92772A25703C8699
18316B48821g5075A44455a89749I1991b7768q1287A81214P9756g840B60925e855
18304a15827A13603E0069H821h9740l2428m0020F1598c6974D65280a86201O8480
18293a17721j96818a37122M1413k31533G2821b46418B01637I3477i377A61669
18282A39963a05902B22764A4781a45901A99854b32931g4643q6306A23798c63140
18271A1815b79206C39516D3116a0487l276j95742c8753k14541a02632G6565d058
18259a40374N2275B66887b93623g4121I6507i208m16989A72013n4900a58159B8925
18247a37884q8129r2194H7199a32994A0853a48554I5681a2613j44394A04631j2783
$$ plain form
18236 91848 353764 150210 -73333 -94766 51949 -102245 16372 79706 149603 -229844 149423
18224 51044 124166 -142222 158239 -179489 -41963 194332 106898 38561 -260723 58523 283226
18213 283226 -74244 -266346 -109248 -81613 -196458 -74269 119531 -12124 24643 160685
18203 160685 -466020 -45492 225513 123798 -35115 185663 30445 104101 299362 336919
18193 336919 -154066 -10607 270317 -102545 -74821 122083 -41927 -172958 -441805 100679
18182 55597 -367889 45254 221300 -117149 -59323 -166130 -2592 -35495 157622 -117306 39640
18170 73835 -123575 -33140 -96463 118871 73126 -107560 109563 -255127 -79198 36282 74865
18159 74865 31846 -322608 -25348 -372123 50065 90369 131269 114154 107505 264517 143456
$$ packed form
18236I1848K61916A50210g3333k1433E1949a02245A6372O3334O9897b29844A49423
18224E1044P3122a42222A58239a79489d1963A94332q7434C8561b60723E8523K24703
18213B83226g4244j92102a09248K7635j14845g4269A19531a2124B4643J36042
18203A60685d66020d5492B25513j01715c5115A85663C0445P3656J95261L7557
18193C36919a54066a0607B70317a02545K7724A22083d1927j31031k68847A00679
18182E5597c67889D5254J76046a17149N7826j06807b592l2903A57622a17306C9640
18170G3835a23575c3140o3323A18871m5745a07560A09563b55127g9198C6282L8583
18159G4865C1846c22608b5348l46775E0065M0304M0900j7115o649J57012j21061
$$ plain form
18148 143456 271949 183907 -41681 -327046 -171857 293053 -24188 -228657 163394 -156749
18137 -115727 -397417 -190931 -388446 221630 -87406 -61376 178683 79481 13549 132218
18127 132218 59189 79710 173218 -185337 87608 -506395 -16161 -194893 -70243 -100167 181034
18115 -179049 -184744 -65113 114556 194506 -183795 240626 -37836 83639 -19977 -14187 228537
18103 -22109 63857 272819 -35960 -151915 24671 3756 -18490 28765 -129737 -69457 -163675
18092 -163675 -216913 -142748 -60233 37710 204139 174289 -190441 81848 -23205 216977 -110096
18080 -273111 -74732 60347 -270971 -364718 83619 -190145 313862 474 139714 -180039 -41488
18068 131379 -291801 104329 -272590 -138511 368666 -246006 8345 -131520 -14491 -108002
$$ packed form
18148A43456J28493q8042d1681k85365J55189B93053b4188k04469A63394a56749
18137a15727k81690a90931j97515B21630h7406K6030A78683G9481A3549J18669
18127A32218E9189K0521R3508a85337H7608e06395a6161j78732g0243k9924A81034
18115a79049n695f5113A14556P9950a83795B40626c7836H3639a9977N790B28537
18103b2109F3857K08962c5960j15955B4671C756a8490B8765a29737O0280r4218
18092a63675n3238P4165f0233C7710J66429k9850a90441H1848b3205B16977a10096
18080b73111g4732F0347b70971r3747H3619a90145C13862D74J39240a80039d1488
18068A31379b91801A04329b72590J34079C68666b46006H345a31520a4491r3511
$$ plain form
18058 -108002 4086 -101946 205529 -240385 -11583 -7284 -207595 -205593 -166620 190692 -68895
18046 -147808 212522 -297081 85687 173049 218293 -195517 135783 -334822 80005 -215406
18035 133026 45013 138839 -31523 -159776 -152592 -1945 -15860 22648 39716 194175 79546
18023 -76276 158226 -72088 -76733 228629 189120 -96417 40996 73376 50846 163577 -275442
18011 24203 -246151 85788 109111 -103731 237687 -130116 -171554 113931 170668 -153082
18000 -189021 -237896 163578 -201182 157255 -200712 -52612 115638 -265701 82009 -44623
17989 205506 574 -32885 -118304 63479 -188152 -200385 -309554 1579 -260925 230954 -36307
17977 119567 180833 -506399 -187082 355857 -176895 -300202 455285 237727 -79626 85022
$$ packed form
18058a08002D086a01946B05529b40385a1583M299k00311K002L8973A90692f8895
18046a47808B12522b97081H5687Q7362M5244a95517A35783c34822H0005b15406
18035A33026D5013R3826c1523j28253P184a945j3915B2648J7068J54459G9546
18023g6276A58226g2088m645B28629l9509i6417D0996L2380k2530J12731b75442
18011B4203b46151H5788K3323a03731B37687a30116m1438A13931N6737a53082
18000a89021m8875A63578b01182A57255b00712e2612A15638b65701H2009d4623
17989B05506E74c2885q5419F3479a88152j2233j09169A579b60925B30954c6307
17977A19567O1266e06399a87082C55857a76895j23307D55285k17558g9626H5022
$$ plain form
17966 -326374 284547 -179394 -54849 96907 294023 136740 68484 -13033 227367 -100702
17955 6179 298847 -130460 38500 168476 -68534 -202155 -181208 110434 -278720 -155509
17945 -155509 -131766 -63868 138891 16307 33849 -15225 186878 204319 311734 -59862 48900
17933 -74264 -35533 211051 -240156 -105087 -85664 -12635 -182808 -380169 -181555 108552
17922 118060 -150335 156743 10035 -175271 79850 24456 -94719 72294 196344 187561 -156575
17910 -265856 -146706 -54393 -141430 62349 -45645 79931 -102396 -89797 -118131 -151386 -64607
17898 -260902 -216770 -24421 -117505 -82262 247436 114008 28480 392856 -223561 -20589 -17422
17887 -17422 103354 90867 103725 -225687 -475148 -188452 -132470 -363443 131499 -232444
$$ packed form
17966c26374B84547a79394e4849I6907J97116A36740o8256a3033B27367a00702
17955F179K92668a30460C8500J29976f8534j33621K0947A10434b78720J23211
17945a55509K3743f3868A38891A6307J7542a5225A86878J7441J07415e9862D8900
17933g4264c5533B11051b40156a05087J9423a2635j70173j97361a81555A08552
17922A18060a50335A56743A0035a75271G9850B4456i4719G2294J24050q783a56575
17910b65856J19150e4393q7037F2349d5645G9931a02396J2599k8334l3255f4607
17898b60902M4132b4421r3084L5243B47436A14008B8480L64376b23561b0589L167
17887a7422A03354j2487J2858b25687k49461a88452N5982k30973A31499b32444
$$ plain form
17876 429890 109919 -61778 36071 265964 29414 -154575 238840 37136 -83724 -294706
17866 -294706 -105886 -4927 70257 167931 62074 -170772 -337606 154043 105587 -48409 143914
17854 -126808 110738 64842 236553 55306 -165933 -122137 -170582 -151602 -41473 -126218 -144240
17843 -144240 -10716 -133194 -88690 230 -88419 201013 114506 310624 47803 -117899 -93503
17832 -93503 -315882 41748 -279448 184158 -12489 -206589 27875 49994 -165342 126126
17821 -83069 101903 181951 58730 -117582 217230 -459668 386401 18906 -502707 -31366
17810 -51010 -220762 51417 139021 -125394 -103442 -165233 -132442 -73204 120267 57235 -167654
17798 -103683 -189187 308544 -69634 1727 136752 -235117 228 5469 -229922 -260286 115155
$$ packed form
17876D29890A09919f1778C6071K29893B9414a54575B38840C7136h3724k10982
17866b94706a05886d927G0257R7674F2074a70772j66834A54043m8456d8409A43914
17854a26808A10738m5896J71711E5306a65933M3796m8445J8980d1473q4745j8022
17843a44240a0716j22478M4504B30h8419B01013q6507J96118D7803a17899K4396
17832i3503k22379D1748b79448A84158a2489j94100B7875K2119a65342A26126
17821h3069A01903Q0048E8730a17582B17230d59668C86401A8906e02707c1366
17810e1010j69752E1417Q7604a25394K1952o1791L2791N9238A20267E7235a67654
17798a03683q5504C08544f9634A727J35025b35117B28N241b29922l0364A15155
$$ plain form
17786 25222 69550 117624 -100894 20315 150668 239456 -102273 140880 71108 178054 7749
17774 -128987 105647 -130240 -167387 -226615 170797 16490 69835 95811 -291810 -57490 1577
17762 161429 304742 -137116 166421 -84762 -357914 -255660 250190 158310 167903 208029
17752 208029 152023 -64204 -50717 -240743 -192631 -236451 -25263 85786 -253312 -35277 -47234
17741 -47234 -104827 -45231 154256 40657 -49464 24809 -212643 -5095 -193799 375290 88682
17729 206629 -204824 237194 105192 71353 -32565 64003 85672 -41490 -64274 311487 -27749
17717 231410 -354132 39274 166879 -90906 132171 34494 297151 77849 42855 -83925 -34478
17705 31069 162870 212058 -189345 -2369 -77907 275173 461578 373331 183275 -405 94105
$$ packed form
17786B5222M4328M8074a00894B0315J30353Q8788a02273A40880o9772J06946G749
17774a28987A05647a30240l7147n9228A70797A6490N3345K5976b91810e7490A577
17762A61429J43313a37116A66421h4762k73152J02254B50190r1880R593M0126
17752B08029n6006f4204J3487j90026M8112m3820b5263H5786b53312c5277j1957
17741d7234n7593d5231A54256D0657d9464B4809b12643e095j88704C75290H8682
17729B06629b04824B37194A05192l3839c2565F4003K1669d1490k2784C11487b7749
17717B31410c54132C9274J27605i0906A32171C4494K62657G7849l4994h3925c4478
17705C1069J31801M9188a89345b369p5538B75173J86405q8247A83275d05I4105
$$ plain form
17693 97622 70353 -114393 280337 -46772 -249263 -41955 110707 -51530 255197 1786 -328139
17681 275642 154442 -8180 17511 48956 -180322 104988 185464 116395 -12057 -32358 95819
17669 135234 90060 -124227 27917 68287 -146596 -148589 -245425 142164 -140776 -264226 172591
17657 111462 -97497 -95166 -97068 174708 -184089 78032 -21715 -172115 256896 394778 38836
17645 497 -241033 -253570 170535 -279342 -205577 -60584 17881 -37934 76623 -16375 -181467
17634 -181467 269708 -50381 -1757 125005 -59874 135892 113524 -41358 -112863 14689 47173
17623 47173 82929 27326 338051 -9577 -133658 187143 28076 -68577 -42986 24840 172058
17612 172058 -142207 -133278 -220355 98595 170395 6412 176157 -179791 -127834 122515 307401
$$ packed form
17693I7622k7269a14393B80337d6772k02491d1955A10707e1530B55197A786c28139
17681B75642j21200h180A7511L1445a80322A04988Q0476o9069a2057k0301I5819
17669A35234m5174a24227B7917M0370a46596j993r6836A42164a40776j23450A72591
17657A11462i7497K331j902A74708a84089G8032b1715j50400B56896J37882C8836
17645D97b41033j2537A70535b79342P3765f0584A7881c7934G6623a6375j65092
17634a81467B69708e0381a757A25005e9874A35892k2368d1358p1505A4689L2484
17623D7173L5756B7326L10725i577j24081A87143B8076f8577K5591B4840J47218
17612A72058a42207Q929q7077I8595P1800F412J69745a79791N1957A22515J84886
$$ plain form
17601 307401 205691 -242054 -6713 3779 3396 -139171 -43493 -246293 204642 322457 -41415
17589 199062 -164534 177726 164221 246510 269655 222194 92720 -261548 -10505 189050 133396
17578 133396 206891 279025 100114 -3579 209206 112798 136023 -26134 73323 140584 187797
17567 187797 -127177 72865 -305370 -141747 -105630 41933 31775 -8871 -27155 -20467 -108290
17556 -108290 -65608 -130302 -80637 -50297 157054 -39311 60844 -87680 226279 -37568 -46018
17545 -46018 14061 313403 -231933 100397 92826 23130 430908 301664 -165289 97700 21017
17533 56344 96184 -68886 -28220 -106025 58625 176199 46489 206901 76992 -49233 234570
17521 -225056 -54183 54560 -9158 -102923 143682 -150116 105292 -183809 42059 -20240 137906
$$ packed form
17601C07401j01710b42054f713C779l83a39171d3493k02800B04642J17815d1415
17589A99062a64534A77726j3505Q2289K3145m7461I2720b61548a0505A89050n5654
17578A33396P3495P2134A00114c579B09206r6408K3225b6134G3323O7261M7213
17567A87797a27177G2865c05370a41747L6117D1933j0158h871j8284O688q7823
17556a08290M2682o4694M9665L0340A57054c9311F0844h7680B26279c7568q450
17545d6018A4061K99342b31933A00397p571B3130M07778j29244a65289I7700B1017
17533E6344L9840f8886b8220p7805E8625J17574D6489J60412G6992d9233B34570
17521b25056e4183E4560i158r3765A43682a50116A05292a83809D2059b0240A37906
$$ plain form
17509 -32131 -212943 266221 369109 -34833 255895 241879 -163592 109951 -7620 8593 42390
17498 42390 220972 134136 -463060 281022 157903 183476 164177 -240236 -284519 210420
17487 -40750 151364 103527 56597 184345 162545 75951 150865 57577 346793 -56975 -388603
17476 -388603 38057 63683 124886 19337 -29971 -38041 34424 -40014 84690 223659 -1459 -166800
17464 -166800 -24765 97278 278669 110474 -22362 197913 218495 122542 82540 178494 259714
17453 259714 412245 139692 258661 -12248 153388 -15197 162913 132954 275514 99212
17442 198631 451049 185823 331001 222521 130795 199078 248492 407000 239923 251372
17432 251372 135167 65414 181697 106842 466374 -163757 296154 331395 -10118 345262
$$ packed form
17509c2131j80812B66221J02888c4833B55895j4016a63592A09951g620H593L3797
17498D2390J78582q6836d63060B81022j23119K5573j9299b40236m4283B10420
17487d0750A51364m7837m6930J27748k1800G5951P4914E7577K89216e6975l31628
17476c88603C8057K5626O1203A9337b9971q070C4424d0014H4690J38969a459j65341
17464a66800b4765I7278J81391A10474b2362A97913K0582r5953m0002R5954Q1220
17453B59714J52531A39692J18969a2248A53388a5197A62913k9959J42560I9212
17442A98631K52418A85823J45178j08480r1726O8283M9414J58508j67077J1449
17432B51372j16205F5414J16283p4855L59532a63757B96154L5241a0118C45262
$$ plain form
17421 360996 186390 456619 184337 485988 141660 330904 -63017 2037 85419 38857
17410 273549 314553 229791 353164 122286 104483 172230 265697 668551 389779 534983
17400 534983 225717 52212 151013 309552 -133683 120623 -268601 364335 58401 -95352
17389 235514 143982 90940 -83972 125234 -144632 73576 246241 -105608 -307525 153157
17378 -42354 -27488 -5560 133554 204465 94802 365371 288133 347091 -162469 127071 76672
17367 76672 217494 131243 39223 -147167 195325 84498 35996 203099 496555 26230 35815
17356 35815 -89006 285730 -14639 -111171 88709 54512 211869 217512 136767 177586 199234
17345 199234 -31853 158675 -164087 221315 118121 -222063 -151603 269882 -27878 416514
$$ packed form
17421C60996j74606K70229A84337L01651A41660J89244f3017B037Q3382C8857
17410B73549M1004q4762J23373A22286j7803O7747R3467M02854k78772J45204
17400E34983B25717E2212R8801J58539a33683A20623b68601C64335E8401i5352
17389B35514r1532n3042h3972A25234a44632G3576J72665a05608k01917A53157
17378d2354J4866e560A33554P0911I4802K70569p7238N8958a62469A27071n0399
17367G6672J40822q6251C9223a47167A95325H4498C5996J67103K93456B6230R585
17356C5815h9006B85730a4639r6532H8709l4197J57357N643q0745M0819K1648
17345A99234c1853A58675a64087B21315j03194b22063P0460B69882b7878D16514
$$ plain form
17334 84223 252395 208363 254200 573793 509266 12689 66990 130298 161453 -48359 -89560
17323 -89560 302626 147358 -19273 391674 -68360 -95308 107594 51957 285112 -282395
17312 -58588 76971 275058 -2788 128118 264341 243156 184532 -47174 260697 128026 242150
17301 242150 43132 85036 -55633 138502 -189878 296433 12451 340234 94053 73619 19653
17289 -169506 395346 79852 174839 -135093 113748 104737 229895 271996 254515 340553 -148146
17277 -120322 253944 261740 610595 207244 29712 45399 518628 -268473 -19796 219801
17266 149888 426276 251386 239047 297929 204024 64577 294048 107082 34988 239703
17256 239703 269526 132643 -17083 -100455 317778 375008 115350 339768 230571 348970
$$ packed form
17334H4223J68172m4032M5837L19593o4527A2689N4301O3308L1155d8359m1201
17323h9560C02626A47358a9273C91674f8360k6948A07594E1957K33155b82395
17312e8588G6971J98087b788A28118J36223k1185n8624d7174B60697A28026J14124
17301B42150D3132M1904e5633A38502a89878B96433A2451L27783I4053k0434A9653
17289a69506C95346G9852R4987a35093A13748r011J25158M2101j7481Q6038a48146
17277a20322B53944P796L48855B07244B9712J5687M73229b68473a9796B19801
17266A49888K76388j74890j2339N8882r3905F4577K29471A07082C4988K04715
17256B39703K9823A32643a7083q3372C17778N7230A15350K24418j09197J18399
$$ plain form
17246 348970 330084 24490 132591 123923 52024 197697 130214 309911 474158 -31229 -9998
17234 262841 -38012 340888 273808 515778 182429 87835 4474 132237 520597 42661 -77724
17222 30450 14815 169205 45831 105276 -77225 177046 719900 281413 375510 91265 155009
17211 155009 33477 238550 76869 306618 209689 219480 20551 -117671 72218 76669 511313
17200 511313 121927 418581 171696 -31434 -316853 188166 139005 3846 351180 694468
17190 694468 345525 116802 181285 77023 126311 540197 312273 331864 311432 182898
17180 182898 -101913 511155 526222 305841 -63031 331486 547258 506285 -68853 192201
17169 97949 272318 62589 317868 31680 287618 495206 319859 342298 66829 70769 301579
$$ packed form
17246C48970j8886B4490J08101q668E2024J45673o7483J79697J64247c1229i998
17234B62841c8012C40888o7080K41970A82429H7835D474J27763L88360D2661g7724
17222C0450A4815J54390D5831N9445g7225A77046N42854B81413R4097I1265O3744
17211A55009C3477K05073G6869K29749r6929R791B0551a17671G2218M451M34644
17200E11313A21927K96654A71696c1434k85419A88166m9161C846L47334L43288
17190F94468C45525A16802O4483G7023M9288M13886k27924J9591k0432j28534
17180A82898a01913E11155J5067k20381f3031C31486K15772m0973f8853A92201
17169I7949J74369F2589K55279C1680K55938K07588j75347K2439F6829L940K30810
$$ plain form
17158 301579 -19038 385488 326306 -110321 399088 -108605 -4318 378142 529824 372117
17148 372117 32450 382475 288489 69167 38306 43262 77365 385047 311758 -30000 390603
17136 193344 89630 420187 225712 273566 242712 453242 118452 223748 425048 1820
17125 116330 99455 312915 294617 316068 284933 44467 485121 201057 285957 190774 636166
17114 636166 457429 157875 94266 249918 275372 186757 -31143 317390 312064 348269 681954
17103 681954 120349 236954 326517 240254 475432 695301 264415 352166 338404 416291
17093 416291 368378 73253 136838 114961 481094 350353 286372 15698 563109 159147 163660
17082 163660 338590 422430 130833 319069 497440 84838 499252 382339 548460 369827
$$ packed form
17158C01579a9038C85488n9182a10321C99088a08605d318C78142J51682j57707
17148C72117C2450L50025r3986F9167l0861M956L4103L07682p3289c0000C90603
17136A93344H9630L30557j94475M7854l0854K10530A18452J05296K01300A820
17125A16330j6875K13460j8298K1451l1135D4467M40654B01057Q4900r5183M45392
17114F36166j78737A57875o3609J55652K5454q8615c1143C17390n326L6205L33685
17103F81954A20349J16605Q9563q6263K35178K19869B64415Q7751j3762P7887
17093D16291m7913G3253O3585k1877L66133j30741o3981A5698N47411A59147M513
17082A63660J74930Q3840A30833J88236J78371H4838M14414j16913J66121j78633
$$ plain form
17072 369827 285204 439760 404679 -50845 495549 68609 293025 578003 443909 643733
17062 643733 838416 570290 207799 301205 365904 341151 191017 242314 175550 575203
17052 575203 408015 369486 155269 440616 340676 583566 591548 86474 380843 710495
17042 710495 654042 590398 554375 336935 305319 648034 349501 344655 653819 590566 995144
17031 995144 616847 132946 406660 396089 219854 532255 688068 432474 310363 616044
17021 616044 585425 584076 223616 318613 643032 581627 393854 703479 534388 671781
17011 671781 523647 300413 807446 982431 877873 591801 487873 618863 582895 615597
17001 615597 473727 554685 765251 174476 588939 543998 600360 744962 499666 880481
$$ packed form
17072C69827q4623J54556l5081e0845D95549F8609K24416K84978j34094J99824
17062F43733J94683k68126B07799R3406O4699k4753j50134N1297o6764L99653
17052E75203j67188l8529A55269K85347r9940K42890P982H6474K94369L29652
17042G10495n6453o3644l6023k17440l1616L42715k98533m846L09164o3253M04578
17031I95144l78297A32946K73714j0571j76235L12401J55813k55594j22111L05681
17021F16044l0619j349B23616R4997L24419o1405j87773L09625j69091J37393
17011F71781j48134k23234N07033J74985j04558k86072j03928J30990l5968L2702
17001F15597j41870Q0958K10566A74476M14463m4941N6362J44602k45296L80815
$$ plain form
16991 880481 409668 544952 985182 441383 640355 767612 655519 455000 746782 628283
16981 628283 557816 548224 726038 769341 709303 678666 790281 705430 914733 526966 705924
16970 705924 653956 864149 739092 605079 974895 624918 751051 623445 788024 932511
16960 932511 728133 753483 746310 878007 831012 920864 659713 830512 1284482 910977
16950 910977 928948 679123 941983 908473 708548 957679 758226 563286 1120880 742544
16940 742544 846977 1040423 984496 1093399 1142901 1075644 1074667 889882 927785 1013834 1092729
16929 1092729 1011236 1019458 1325634 996580 776899 927086 1352078 783048 1411895 1335278
16919 1335278 1155848 1206434 1230252 1245438 1163894 1332723 1019285 1200744 1422702 1092664
$$ packed form
16991H80481D09668J35284M40230D41383J98972J27257j12093k00519K91782j18499
16981F28283p0467r592J77814M3303o0038l0637J11615q4851K09303l87767J78958
16970G05924n1968K10193j25057j34013L69816l49977J26133j27606J64579J44487
16960I32511k04378K5350p173J31697m6995Q9852k61151J70799M53970l73505
16950I10977J7971k49825K62860l3510j99925K49131j99453j94940N57594l78336
16940G42544J04433J93446n5927J08903M9502o7257r77j84785L7903Q6049P8895
16929A092729q1493Q222L06176l29054k19681J50187M24992n69030O28847p6617
16919A335278j79430N0586K3818J5186q1544J68829l13438J81459K21958l30038
$$ plain form
16909 1092664 1290893 1305706 1375446 1124501 1396864 1334972 1595195 1283240 1630108 1244078
16899 1244078 1085534 1163066 1584712 1524373 1267342 1430564 1703038 1331474 1776369 1798099
16889 1798099 1965121 1456433 1985757 1728814 1634360 1408004 1659718 1813182 1812382 1919539
16879 1919539 1755475 2027068 1652846 1648026 2123897 1737730 1516725 1963029 2089928 2107894
16869 2107894 1870200 1815876 1797531 1999894 2114695 1948241 2075212 2342925 2141206 2043336
16859 2043336 2374019 2207000 2403877 2442864 2408120 2797181 2095237 3103931 2465316 2573417
16849 2573417 2536117 2812391 2839431 2802201 2635180 2666623 2634172 2777725 2719568 2941164
16839 2941164 2776956 3121598 3263357 2817033 3237328 3114256 2874030 3235902 3380115
$$ packed form
16909A092664J98229J4813O9740k50945K72363o1892K60223l11955L46868l86030
16899A244078j58544P7532M21646o0339k57031J63222K72474l71564M44895K1730
16889A798099J67022n08688N29324k56943r4454k26356K51714J53464q00J07157
16879A919539j64064K71593l74222m820M75871l86167k21005M46304J26899J7966
16869B107894k37694n4324j8345K02363J14801j66454J26971K67713k01719r7870
16859B043336L30683j67019J96877L8987l4744L89061p01944J008694o38615J08101
16849B573417l7300K76274K7040l7230j67021L1443l2451J43553n8157K21596
16839B941164j64208L44642J41759m46324M20295j23072k40226L61872J44213
$$ plain form
16830 3380115 3217985 3274706 3541380 3650031 3707512 3737044 3961252 3794916 4170516 4147292
16820 4147292 3831040 4253898 4059146 4152655 4324992 4208434 4577610 4707147 4463860 4877912
16810 4877912 4600962 4974856 4935841 5012247 4941378 5413329 5455935 5305690 5443554 5352271
16800 5352271 5746943 5597662 6170749 5877138 6176842 6203037 6361772 6275550 6793526 6572418
16790 6572418 6929487 7583517 7288215 7271931 7777922 7805620 7775397 8082132 8168718 8556899
16780 8556899 8843523 9137917 8989891 9614199 9569299 10172850 9866330 10625211 10665034 10936422
16770 10936422 11339161 11557105 11973752 12330185 12616259 12695251 13492954 13672516 14143844
16761 14143844 14636025 15122649 15583865 16185362 16662917 17185608 17943182 18550463 19294021
$$ packed form
16830C380115j62130N6721K66674J08651N7481K9532K24208j66336L75600k3224
16820D147292l16252M22858j94752R3509J72337j16558L69176J29537k43287M14052
16810D877912k76950L73894l9015P6406p0869M71951M2606j50245J37864r1283
16800E352271L94672j49281N73087k93611K99704K6195J58735q6222N17976k21108
16790F572418L57069O54030k95302j6284N05991K7698l0223L06735Q6586L88181
16780H556899K86624K94394j48026O24308m4900O03551l06520P58881L9823K71388
16770A0936422M02739K17944M16647L56433K86074P8992P97703J79562M71328
16761A4143844M92181M86624M61216O01497M77555N22691P57574O07281P43558
$$ plain form
16752 19294021 19803470 20834947 21132404 22053750 22879551 23621616 24793425 25779194 26708631
16743 26708631 27598943 28942431 30578391 31690768 32985965 34449466 35758082 37692536
16735 37692536 39703293 41361581 43637416 45657205 47900162 50544217 53450748 56152540
16727 56152540 59434635 62749465 66543148 70526409 74689754 79359228 83788524 89041506
16719 89041506 94332040 100310178 106641507 112918948 120315408 127428937 135046000 142565112
16711 142565112 150275636 158204123 165661970 173402746 179982623 186061985 191030791 195235155
16703 195235155 198122815 200091625 200040105 199104614 196243575 192583371 187445830 181928253
16695 181928253 175087283 167814986 160381299 152384334 144181292 136436716 128639390 121445869
$$ packed form
16752A9294021N09449J031477K97457R21346Q25801P42065J171809R85769R29437
16743B6708631Q90312J343488J635960J112377J295197J463501J308616J934454
16735C7692536K010757J658288K275835K019789K242957K644055K906531K701792
16727E6152540L282095L314830L793683L983261M163345M669474M429296N252982
16719H9041506N290534N978138O331329O277441P396460P113529P617063P519112
16711A42565112P710524P928487P457847P740776O579877O079362M968806M204364
16703A95235155K887660J968810n1520r35491k861039l660204n137541n517577
16695A81928253o840970p272297p433687p996965q203042p744576p797326p193521
$$ plain form
16687 121445869 114188482 107453120 100900157 94518079 88916399 83692674 78586348 73809387
16679 73809387 69401535 64975038 61337334 57850228 54580773 51371903 48785681 46062253
16671 46062253 44081393 41212192 38934542 37267166 35340913 33478306 32002967 30553985
16663 30553985 29005414 27628261 26809417 25374586 24697622 23578211 22133345 21384533
16655 21384533 20518778 19952353 18957899 18207759 17547708 17162625 16285255 15846154 15102162
16646 15102162 14605740 14161821 13833869 13002609 12892444 12375393 12141863 11826258 11316633
16637 11316633 11292888 10869131 10192326 10124236 9578163 9477790 9153406 9113425 8723703 8751039
16627 8751039 8409055 8054460 7817535 7749814 7617409 7392573 6872130 6994813 6490010 6448156
$$ packed form
16687A21445869p257387o735362o552963o382078n601680n223725n106326m776961
16679G3809387m407852m426497l637704l487106l269455l208870k586222k723428
16671D6062253j980860k869201k277650j667376j926253j862607j475339j448982
16663C0553985j548571j377153q18844j434831o76964j119411j444866p48812
16655B1384533q65755n66425r94454p50140o60051l85083q77370m39101p43992
16646A5102162m96422m43919l27952q31260j10165n17051k33530l15605n09625
16637A1316633k3745m23757o76805o8090n46073j00373l24384l9981l89722K7336
16627H751039l41984l54595k36925o7721j32405k24836n20443J22683n04803m1854
$$ plain form
16617 6448156 6067048 6269194 6140854 5929874 5881945 5455964 5680532 5161938 5465852 5346645
16607 5346645 4938221 5187039 4652219 4791848 4716848 4838703 4749577 4308727 4504336 4026706
16597 4026706 4050920 4007864 3974058 3994599 3835197 3703011 3600333 3400069 3266598 3399250
16587 3399250 3226050 3639642 3064522 3296080 3020439 3394447 3229322 3057620 2960332 3001010
16577 3001010 2389462 2798238 2978827 2850189 2813530 2638533 2305176 2602895 2395702 2635720
16567 2635720 2564347 2465380 2433260 2163999 2486657 1951359 1947162 2497791 1943227 2018414
16557 2018414 2126526 1866743 2014134 2249127 2347444 2248579 2146593 2130566 1608734 1529604
16547 1529604 2017875 1869426 1591085 1592932 1706939 1754476 1842406 1654943 1873006 1574412
$$ packed form
16617F448156l81108K02146j28340k10980m7929m25981K24568n18594L03914j19207
16607E346645m08424K48818n34820J39629p5000J21855q9126m40850J95609m77630
16597D026706K4214m3056l3806K0541j59402j32186j02678k00264j33471J32652
16587C399250j73200M13592n75120K31558k75641L74008j65125j71702r7288M0678
16577C001010o11548M08776J80589j28638l6659j74997l33357K97719k07193K40018
16567B635720p1373r8967l2120k69261L22658n35298m197N50629n54564P5187
16557B018414J08112k59783J47391K34993R8317r8865j01986j6027n21832p9130
16547A529604M88271j48449k78341J847J14007M7537Q7930j87463K18063k98594
$$ plain form
16537 1574412 1457360 1516974 1405942 1558559 1371672 1625904 1218480 1364332 1256184 1606381
16527 1606381 1274593 1374080 1607086 1523105 1407974 1170228 1391343 1316391 1212997 1227541
16517 1227541 1070672 1265481 1114992 1227545 1195064 1310019 1265690 1098558 855045 1072881
16507 1072881 1242430 1243903 1202410 990343 1324389 743217 883674 911579 847387 1196990
16497 1196990 949156 767117 1122834 1133706 1216541 962825 978721 1019502 1179509 1165095
16487 1165095 904608 868924 957396 794933 745822 1073581 660723 924332 859953 746458
16477 746458 908109 581120 798486 725549 706917 757222 672488 683025 801002 735100 766458
16466 766458 832025 875105 433184 441549 595624 809720 711856 806171 934124 547761 763004
$$ packed form
16537A574412j17052N9614j11032J52617j86887K54232m07424J45852j08148L50197
16527A606381l31788R9487K33006q3981j15131k37746K21115p4952j03394J4544
16517A227541j56869J94809j50489J12553l2481J14955m4329j67132k43513K17836
16507A072881J69549J473m1493k12067L34046n81172J40457K7905o4192L49603
16497A196990k47834j82039L55717J0872Q2835k53716J5896M0781J60007j4414
16487A165095k60487l5684Q8472j62463m9111L27759m12858K63609o4379j13495
16477G46458J61651l26989K17366p2937j8632N0305q4734J0537J17977o5902L1358
16466G66458O5567M3080D33184Q365J54075K14096r7864R4315J27953l86363K15243
$$ plain form
16455 763004 625418 593813 515657 560647 558203 519936 523911 412976 1007225 704317 765039
16444 765039 668577 691835 351349 748457 333269 660833 407602 253817 453785 932710
16434 932710 679680 478376 390663 881420 538463 657952 468686 392557 226728 374457
16424 374457 493540 882767 268613 779889 480412 445150 479570 454899 821036 628656
16414 628656 656289 706672 478383 549671 493509 500297 183810 368632 500776 395827 164713
16402 412506 242599 526639 671277 519418 206197 631333 387044 489948 506813 473938
16392 473938 435462 415517 337748 372483 345577 248984 212387 282763 279921 138204 465686
16381 465686 482028 384242 513790 406169 534515 68659 647804 259309 456148 362569
$$ packed form
16455G63004j37586l1605p8156M4990k444l8267L975j10935N94249l02908O0722
16444G65039r6462K3258l40486L97108C33269L27564k53231j53785J99968M78925
16434I32710k53030k01304q7713M90757l42957J19489j89266p6129j65829J47729
16424C74457J19083L89227B68613N11276k99477l5262L4420k4671L66137j92380
16414F28656K7633N0383k28289P1288n6162O788A83810J84822J32144j04949A64713
16402D12506j69907K84040J44638j51859B06197M25136k44289J02904J6865l2875
16392D73938l8476j9945p7769L4735k6906r6593l6597P0376k842A38204L27482
16381D65686J6342r7786J29548j07621J28346F8659N79145B59309J96839r3579
$$ plain form
16371 362569 425464 318010 543357 540388 321543 82215 329832 191127 490985 334043
16361 334043 192002 170978 425981 387327 218728 52388 257516 323408 532103 344618
16351 344618 403201 489844 60580 327314 217814 331207 317342 279629 177000 295457
16341 295457 443688 199530 392841 219654 458844 217120 130224 253837 214651 446968
16331 446968 202751 105715 252182 397864 435954 130787 365554 379608 226033 121316
16321 121316 574141 281752 191809 607040 304093 181458 343468 465864 523925 89624
16310 307359 178047 326863 38167 163621 279619 267717 356784 447745 214050 215842 90152
16298 380567 595897 134884 456724 -181824 245717 362994 197018 225352 395703 437380
$$ packed form
16371C62569O2895j07454K25347k969k18845H2215K47617j38705K99858j56942
16361C34043j42041k1024K55003l8654j68599E2388K05128O5892K08695j87485
16351C44618N8583Q6643F0580K66734j09500J13393j3865l7713j02629J18457
16341B95457J48231A99530J93311j73187K39190B17120q6896J23613l9186K32317
16331D46968B02751r7036J46467J45682L8090A30787K34767J4054j53575j04717
16321A21316M52825B81752q9943M15231l02947j22635J62010J22396N8061H9624
16310C07359j29312J48816C8167J25454J15998j1902Q9067R0961B14050J792I0152
16298C80567K15330A34884L21840a81824B45717J17277j65976K8334J70351M1677
$$ plain form
16288 437380 270507 165514 146738 162454 439985 202193 -13249 183458 -28903 -49480
16278 -49480 186029 282589 134275 209791 -89649 271926 160338 263359 367666 45250
16267 448219 257484 325764 441070 296415 44440 522023 -115030 506920 342696 76271
16256 -131812 201531 281175 247423 308561 211182 112216 -65420 136773 325935 443622 24434
16244 73154 244620 368241 458969 201304 21883 94360 129062 -134619 297642 166062
16234 166062 171929 207554 -329663 420359 109727 -65033 199693 414199 319461 103941
16223 -124738 330269 -90070 -63112 249260 -131415 20684 123087 124093 -3511 159357 -188911
16211 320898 46294 -155532 317619 176957 -201804 344692 47475 -114178 -294474 105198
$$ packed form
16288D37380j66873j04993j8776J5716K77531B02193a3249A83458b8903k0577
16278d9480A86029R6560A34275P5516h9649B71926j11588J03021J04307D5250
16267D48219j90735O8280J15306j44655D4440M77583a15030E06920j64224G6271
16256a31812B01531P9644l3752O1138r7379r8966f5420A36773J89162J17687B4434
16244G3154J71466J23621R0728B01304B1883P2477L4702a34619B97642j31580
16234A66062N867L5625c29663D20359A09727f5033A99693K14506r4738A03941
16223a24738C30269i0070K6958B49260a31415B0684J02403J006c511A59357a88911
16211C20898D6294a55532C17619j40662b01804C44692D7475a14178j80296A05198
$$ plain form
16200 75648 -180541 -119272 -14809 387789 -216728 424724 247815 180974 233530 -250943
16189 -252732 -37502 -56395 -159502 118145 138475 157256 132402 231019 -349231 2491 115687
16178 115687 -147267 -114612 198844 224272 -131507 -121554 233384 -110619 62356 309693
16168 309693 113514 246665 95632 122654 36752 -322704 82603 456417 110969 93139
16158 93139 92890 248666 -206472 -232299 -37385 460210 256 135396 -18930 120057 314652
16147 314652 295548 300388 124448 256166 58728 84106 107577 -56853 -463431 39535 -145836
16135 -109532 -167094 156754 110736 206602 142469 84388 53824 -79010 51603 100328 190402
16124 190402 13190 22935 4546 -150149 201607 -130614 201873 -164608 221574 89327 -95414
$$ packed form
16200G5648a80541O1269a4809C87789b16728D24724j76909o6841N2556b50943
16189b52732c7502j8893j03107A18145K0330J8781k4854R8617c49231B491J13196
16178A15687a47267L2655A98844K5428a31507R953B33384a10619F2356K47337
16168C09693A13514J33151I5632K7022C6752c22704H2603L73814A10969j7830
16158I3139k49J55776b06472k5827c7385D60210B56J35140a8930A20057J94595
16147C14652j9104M840A24448J31718E8728K5378K3471e6853m06578C9535a45836
16135a09532n7562A56754m6018R5866o4133n8081l0564g9010E1603M8725R0074
16124A90402A3190R745D546a50149B01607a30614B01873a64608B21574H9327i5414
$$ plain form
16112 127148 -283631 -221765 -255485 28111 -50009 49498 67649 260878 350593 23883 59574
16101 59574 -86885 414075 -60232 164262 -98051 -169502 -368301 -63069 59919 72356 120640
16090 120640 31071 14116 64877 174982 170034 246384 -250311 419 263348 324714 31720
16078 -225141 -22715 -180088 41354 -39801 -77307 -230782 22529 35194 321127 22733 -349799
16066 -71341 146459 -77155 81289 145656 -81249 304076 -14166 185585 352002 -77680 -71457
16055 -71457 -287204 -393318 -41881 213974 -195282 184785 -18798 -33368 25130 -317751
16044 22872 29942 306119 -149696 244368 115522 208787 14973 163513 1583 31824 -290989
16032 38517 -169324 -53297 113054 -77182 -1719 -96552 106893 57816 142792 -312746 -162324
$$ packed form
16112A27148b83631O1866l3720B8111e0009D9498J8151J93229Q9715B3883L5691
16101E9574h6885D14075f0232A64262i8051p1451j98799f3069E9919J2437M8284
16090A20640C1071A4116N0761J10105m948P6350b50311D19K62929O1366C1720
16078b25141b2715j57373D1354c9801l7506j53475B2529J2665K85933B2733c49799
16066g1341A46459g7155H1289O4367h1249C04076a4166A85585J66417g7680O223
16055g1457k15747j06114d1881B13974a95282A84785a8798j4570B5130c17751
16044B2872P070K76177a49696B44368A15522R3265A4973J48540A583L0241b90989
16032C8517a69324e3297A13054g7182a719r4833A06893m9077Q4976c12746J50422
$$ plain form
16021 -162324 -49469 -6814 114984 -38433 -66387 415838 -1124 -204790 57320 104189 -30875
16009 123373 162025 29769 72837 -49766 -6975 -122935 -152452 -139398 37252 242703 -257035
15997 -76314 -296731 -72153 -210621 181792 43881 101185 -108248 -25307 193061 -292380
15986 94885 -376907 100674 -141644 95647 -78554 -120146 16633 -75694 -103784 -257959 261142
15974 58546 -5752 359304 -28846 224960 -111415 77271 253131 98219 509503 246620 -81178
15962 103661 -146029 615389 6231 -125614 310495 255784 -59141 75314 216038 154521 135584
15951 135584 182585 -158551 93870 378779 -144162 88997 162292 -160743 -234335 -12233 65597
15939 -244169 134496 230265 -170654 -179597 -103095 -273851 -8108 83908 -84674 50491 -248659
$$ packed form
16021a62324d9469f814A14984c8433k7954D15838a124k03666E7320M6869c0875
16009A23373L8652B9769M3068d9766f975j15960k9517J3054C7252K05451b57035
15997g6314k20417g2153j38468A81792D3881N7304a08248b5307A93061b92380
15986I4885c76907A00674a41644I5647g8554m1592A6633g5694k8090j54175B61142
15974E8546e752C59304b8846B24960a11415G7271J75860I8219M11284B46620h1178
15962A03661a46029F15389F231a25614C10495n4711e9141G5314J40724o1517j8937
15951A35584M7001a58551I3870K84909a44162H8997P3295a60743p3592a2233F5597
15939b44169A34496R5769a70654q943P6502j70756h108H3908h4674E0491b48659
$$ plain form
15927 -95751 -136200 115100 92003 222000 155054 107396 29478 -234887 309004 -273430 200023
15915 232901 -58447 -99401 224699 -137218 235921 -258063 -105381 -39531 56153 -256099
15904 255506 -169079 21393 41754 -148791 -119287 168288 -15664 174854 -15183 -475313
15894 -475313 105631 -52920 -66178 77964 -32917 55694 -110941 112422 35161 -215560 -219406
15883 -219406 -139648 -135825 232068 444002 316 129171 221610 -40701 -35842 170923 -61109
15871 -425556 -111844 -20840 235310 -192842 171067 -114182 -118744 -5870 -12128 -82256 200242
15859 -236440 -72311 89694 170697 -74766 -218441 -137541 -41481 -555555 -10087 -32760 -399166
15848 -399166 -155296 66949 -327624 125790 -64609 -10679 -232864 -132801 -164348 131491
$$ packed form
15927i5751m0449A15100k3097J29997o6946m7658B9478b34887C09004b73430B00023
15915B32901e8447m0954B24699a37218B35921b58063a05381c9531E6153b56099
15904B55506a69079B1393K0361a48791K9504A68288a5664A74854a5183m60130
15894d75313A05631e2920j3258G7964c2917E5694a10941A12422C5161b15560l846
15883b19406P9758L823B32068K11934C16J28855R2439d0701M859A70923f1109
15871d25556a11844b0840B35310a92842A71067a14182m562e870o258p0128B00242
15859b36440g2311H9694Q1003g4766j43675Q0900d1481n14074a0087k2673l66406
15848c99166a55296F6949c27624A25790f4609a0679k22185J00063l1547A31491
$$ plain form
15837 265817 10642 -210749 131399 -186505 162419 47253 -50882 -147095 50499 -128462
15826 50560 104356 -213914 -24915 76338 -421206 -200570 111790 -161452 -154169 51177 -18682
15814 90015 -15560 91009 -202509 -194747 72508 46782 224847 183117 -542778 -27911 -281602
15803 -281602 -120990 -138120 114152 168767 129766 -160376 -133536 90153 -92428 -230482 22803
15791 -78041 -172588 -9730 -26147 132337 -88906 100223 -116486 173164 -321040 -118874 -109838
15780 -109838 -100328 -56756 84824 -174484 -100223 -366017 -57399 -70604 -37506 35355 62254
15769 62254 250670 -205009 -53553 -16948 37482 345076 -235560 -87787 26660 -128045 -197406
15758 -197406 304259 80831 78500 41814 76270 -70373 58985 -71045 321497 -241673 -115989
$$ packed form
15837B65817A0642b10749A31399a86505A62419D7253e0882r6213E0499a28462
15826E0560N3796b13914b4915G6338d21206b00570A11790a61452P283E1177a8682
15814I0015a5560I1009b02509P762G2508k5726J78065m1730e42778b7911k53691
15803b81602a20990j7130A14152N4615l9001a60376K6840I0153i2428j38054B2803
15791g8041r4547i730j6417A32337h8906A00223a16486A73164c21040a18874R036
15780a09838R510M3572H4824a74484P4261k65794e7399j3205L3098C5355K6899
15769F2254J88416b05009e3553a6948C7482L07594b35560h7787B6660a28045o9361
15758a97406C04259H0831k331l6686L4456g0373E8985g1045C21497b41673a15989
$$ plain form
15746 10639 -54447 -449097 -136713 -22614 322192 -359761 110826 75618 89256 -119988
15735 26964 27723 66389 -38711 -128863 65582 -511624 -275276 -188812 65901 73495 165550 -229446
15722 -195473 76382 387817 -25734 -69657 -36420 103027 -150981 -87424 213214 67769 10395
15710 -89367 -197168 -5475 236697 -93294 -138605 26428 59427 -68956 -102590 227191 -37128
15698 340647 -307692 10043 -51141 -30224 36760 123963 160033 -91177 40054 -250635 -256040
15687 -256040 1685 -70380 -201437 -61551 -145797 205312 -117874 -59334 -325763 14759 58587
15676 58587 -19491 37580 -89288 -141922 267401 -95024 -30480 -71734 -91656 -56583 124347
15664 -87695 -14810 39351 165689 -362984 -186862 -171765 -73541 115905 -213617 -127221 159113
$$ packed form
15746A0639e4447l94650a36713b2614C22192c59761A10826l5208J3638a19988
15735B6964P59L8666c8711r0152F5582e11624K36348Q6464F5901P594R2055b29446
15722a95473G6382L11435b5734m3923L3237A03027a50981O3557B13214F7769A0395
15710h9367j07801e475B36697i3294m5311B6428L2999f8956l3634B27191c7128
15698C40647c07692A0043e1141K0917C6760Q7203L6070i1177D0054b50635n405
15687b56040A685g0380j31057f1551q4246B05312a17874N8540k66429A4759M3828
15676E8587a9491C7580h9288n2634B67401i5024c0480m1254j9922L5073A24347
15664h7695a4810C9351J26338c62984J76122J5097g3541A15905b13617Q6396A59113
$$ plain form
15652 -270492 -198364 -7837 -72008 -152993 -81689 -124921 -94836 -171552 -26037 56281 40745 -243553
15639 -39861 67596 -200944 -177659 -14817 -27060 -40186 37707 215304 -14062 -238009 298207
15627 148829 83628 163058 -88376 -286905 291635 -94562 53162 245897 -16441 -40231 272524
15615 71833 -116127 -12007 48798 265581 20861 -468746 56281 -147537 -272816 -49924 -281396
15604 -281396 117643 -117774 326450 -235452 -4751 429696 248684 -38010 -233655 -97624
15593 128486 -226563 -69012 55769 -9062 121925 -42962 -190080 -48440 -74005 -110039 -261205
15582 -261205 -24100 -205108 -360917 78263 -384271 75576 -236201 36156 -304923 -405566
15572 -405566 163892 259617 268755 -73806 -202442 -51317 123087 109725 169876 -34929 -139675
$$ packed form
15652b70492P2128g837o4171q0985P1304m3232L0085p6716b6037E6281j5536b43553
15639c9861F7596b00944K3285a4817j2243j3126C7707J77597a4062k23947B98207
15627A48829o5201P9430h8376j98529B91635i4562E3162J92735a6441k3790B72524
15615G1833a16127a2007D8798K16783B0861d68746E6281a47537j25279d9924k31472
15604b81396A17643a17774C26450b35452d751D29696j81012c8010j95645i7624
15593A28486b26563f9012E5769i062A21925d2962j47118d8440k5565l6034j51166
15582b61205b4100j81008j55809G8263c84271G5576b36201C6156c04923j00643
15572d05566A63892R5725R138g3806j28636e1317A23087j3362O0151c4929j04746
$$ plain form
15561 -139675 -157707 327333 195904 190520 -50695 -213049 -161921 158196 -251477 -255982 -183447
15550 -183447 382931 -108088 119544 -153486 -18996 75938 51740 -7518 72716 178423 -305268
15538 -224077 138468 -154678 -115002 -178858 185508 -241712 7767 -414947 -156910 178747
15527 74400 -257223 -71123 118876 168324 -247891 324393 86178 -259032 -274200 -25873 -136537
15516 -136537 -51757 121598 -112542 67400 -406593 -321247 135061 -81529 49651 173370
15506 173370 155467 -61883 -163907 -283693 -110465 -178922 105435 27053 186297 -14945
15495 272561 -68020 74447 -69553 -120537 36644 44203 -138547 -3173 53869 -25374 59521 -176213
15482 -79874 58853 392724 -18488 121609 139744 -80779 -225236 -164431 23833 -38474 -87072
$$ packed form
15561a39675j8032C27333j31429n384e0695j62354N1128A58196b51477m505P2535
15550a83447C82931a08088A19544a53486a8996G5938k4198g518G2716J05707c05268
15538b24077A38468a54678L9676o3856A85508b41712G767d14947a56910A78747
15527G4400b57223g1123A18876M9448b47891C24393H6178b59032j5168b5873j10664
15516a36537e1757A21598a12542F7400d06593Q5346A35061h1529D9651J23719
15506A73370j7903f1883j02024j19786a10465o8457A05435B7053J59244a4945
15495B72561f8020G4447f9553n0984C6644P559a38547c173E3869b5374E9521a76213
15482g9874E8853L33871a8488A21609J8135h0779j44457O0805B3833c8474m8598
$$ plain form
15471 -87072 143898 -143581 13078 11154 153645 -149737 101025 95753 -44590 -189232 -115370
15460 -115370 -24377 7609 -241407 165558 -47330 -221783 -14146 77285 -57364 -84802 11818
15448 242584 -121050 -160838 -496874 159164 205499 -133087 345779 202605 8355 -200350
15437 122214 317135 -217750 109837 -65921 -67214 -40935 92895 -21117 -98743 56931 71859
15426 71859 -138752 -6884 9156 -70205 -21706 -101473 17664 53194 -58745 54237 117034 194481
15414 194481 -232959 47510 288015 218459 -183242 119657 -55672 100855 312606 4727
15403 -168129 -345142 181067 387029 -150878 -113928 30897 129215 95863 106251 -79387 -4123
15391 -25318 88948 75365 -14594 -54219 267825 48468 14860 206458 -30921 -193194 -150835
$$ packed form
15471h7072A43898a43581A3078j924J42491a49737A01025n272d4590j44642P3862
15460a15370b4377G609b41407A65558d7330j74453a4146G7285e7364k7438A1818
15448B42584a21050l9788l36036A59164M6335a33087C45779j43174H355b00350
15437A22214J94921b17750A09837f5921j293K6279I2895b1117p7626E6931J4928
15426G1859a38752f884I156g0205b1706p9767A7664L5530e8745E4237O2797P7447
15414A94481b32959D7510K40505o9556a83242A19657e5672A00855K11751D727
15403a68129j77013A81067K05962a50878L6950C0897R8318l3352J0388g9387d123
15391b5318H8948j3583a4594l9625B67825D8468A4860J91598c0921j62273M2359
$$ plain form
15380 -150835 -33632 97560 140451 204398 60933 -103313 116805 -39636 224815 -44441 65348
15368 -72228 290027 -113065 -121866 140588 -89637 110576 81515 52533 74961 -213178 -160637
15357 -160637 239870 13774 23744 107931 -58783 184342 129435 -17163 52918 -257645 -181735
15346 -181735 61323 29846 -414485 -23023 21039 172101 -150831 18665 -178241 334688
15335 593 80781 -94381 -31725 -196025 33170 -49682 -129192 -80477 139951 -158746 -133822
15324 -133822 252945 2575 46701 -317288 384835 317313 58717 268778 186624 -171522 -114472
15313 -114472 283375 -97154 -43645 -191691 179827 -262463 300541 -128718 219431 28917
15302 -38305 135595 -186271 38533 2407 235119 149028 -78084 -42655 -79196 51691 -152718
$$ packed form
15380a50835c3632I7560M2891O3947F0933a03313A16805c9636B24815d4441F5348
15368g2228B90027a13065q801A40588h9637A10576k9061k8982K2428b13178N2541
15357a60637B39870A3774R970Q4187e8783A84342n4907a7163E2918b57645P5910
15346a81735F1323B9846d14485b3023B1039J51062a50831A8665a78241C34688
15335E93Q0188i4381c1725j64300C3170d9682p9510M8715A39951a58746K4924
15324a33822B52945B575M4126c17288C84835o7522E8717K10061q2154a71522N7050
15313a14472B83375i7154d3645j48046A79827b62463C00541a28718B19431B8917
15302c8305A35595a86271C8533B407K32712q6091g8084L5429l6541E1691a52718
$$ plain form
15290 -299165 -164503 197851 -107979 31958 223469 137077 29310 -19650 -64164 -73051 162073
15278 -56167 -232478 -97168 9158 54639 305638 -82011 -6011 68675 -88263 280252 -50897
15266 -133235 43598 -75255 35005 -104325 28348 -145096 -93453 57146 241894 -133400 -100
15254 230088 57730 188972 4527 164568 89383 70828 164186 89588 -193530 313828 397525
15243 397525 -77639 -140280 629668 399194 253719 283606 471360 621862 375758 1434595
15233 1434595 1626191 1197169 1336643 1309937 641800 473309 284962 226627 -140116 138500
15222 -151870 -54702 -125877 73893 90757 29786 27805 -76782 -110911 -193224 137090 -126811
15210 -120921 -114763 -50415 -17337 -256567 72671 108563 -81186 93946 43929 -47683 -320118
$$ packed form
15290b99165J34662A97851a07979C1958J91511q6392B9310a9650m4514q887A62073
15278e6167j76311i7168I158M5481K50999h2011f011F8675h8263B80252e0897
15266a33235D3598g5255C5005a04325B8348a45096N1643E7146J84748a33400a00
15254B30088E7730J31242D527J60041p5185j8555R3358p4598a93530C13828Q3697
15243C97525g7639o2641F29668k30474j45475K9887J87754J50502k46104J058837
15233A434595J91596m29022J39474k6706F41800j68491j88347n8335a40116A38500
15222a51870e4702p1175G3893J6864B9786j981g6782l4129q2313A37090a26811
15210a20921O158e0415a7337k39230G2671L5892h1186I3946D3929d7683k72435
$$ plain form
15199 -320118 -104329 -435474 36583 -19962 40778 312837 -72814 -46331 195131 -49627 -36938
15188 -36938 256213 373235 56469 -48532 121150 -221404 -63768 -37458 100618 10738 -204663
15176 25621 -379394 -1341 -125748 375731 -19949 166213 -77718 240155 -210907 359659
15165 181487 65969 208955 102527 123549 85381 -60165 344502 14952 -24367 350258 -134551
15153 118977 3304 31265 -18888 54467 281976 -223483 150339 87210 326409 363007 -89208
15141 379334 -356314 109965 247142 -152538 63967 414340 263766 331519 402747 165296
15130 -118880 271491 -1377 241181 261012 74867 168258 -7136 211696 -209831 66073 379662
15119 379662 -90376 254020 -271867 -30882 271003 325981 183584 228581 41413 249664
$$ packed form
15199c20118a04329l31145C6583a9962D0778K72059g2814K6483A95131d9627J2689
15188c6938B56213J17022E6469d8532A21150b21404f3768K6310A00618A0738b04663
15176B5621c79394a341j24407C75731a9949A66213g7718B40155b10907C59659
15165A81487F5969J42986A02527K1022l8168f0165C44502A4952b4367C50258a34551
15153A18977C304K7961a8888E4467K27509b23483A50339o3129K39199L6598h9208
15141C79334c56314A09965J37177a52538F3967L50373j50574O7753P1228A65296
15130a18880B71491a377B41181J9831G4867R3391g136B11696b09831F6073L13589
15119C79662i0376B54020b71867c0882B71003N4978j42397M4997D1413K08251
$$ plain form
15109 249664 -43282 98458 205288 531300 265415 237836 235780 -104250 524956 -69208 231266
15097 26947 344211 292286 -150960 -158328 -711 -22476 201444 75632 44811 93097 -86242 173946
15084 283390 -114668 14313 -252089 343822 41123 47473 270970 274851 211392 -355616 339076
15072 42560 378545 273554 464823 400490 -115506 343892 34014 395264 256527 109353
15061 210229 348774 127078 148685 361585 -226542 472738 444600 108935 -39179 -25192
15051 -25192 21801 135972 -170869 295627 124423 375038 490133 315838 373066 46079
15040 250240 13351 163024 49113 143710 379928 192997 -145691 133459 62770 34733
15030 34733 -35648 155127 28567 90688 80205 179051 327241 359698 194020 -100186 -92581
$$ packed form
15109B49664d3282I8458J06830L26012B65415k7579k056a04250E24956f9208B31266
15097B6947L17264n1925a50960p368g11k1765B01444G5632l0821M8286h6242A73946
15084B83390a14668A4313b52089C43822D1123O350K23497L881o3459c55616C39076
15072D2560L35985j04991J91269o4333a15506C43892C4014L61250j38737A09353
15061B10229J38545A27078K1607K12900b26542D72738k8138A08935c9179J3987
15051b5192B1801J14171a70869B95627A24423K50615J15095j74295N7228D6079
15040B50240A3351J49673D9113R4597K36218j86931a45691A33459F2770k8037
15030C4733c5648A55127B8567O2121j0483R8846J48190L2457j65678a00186P605
$$ plain form
15019 -92581 -35584 367971 160891 219348 245092 -13663 264057 118573 -325134 244517
15008 237651 270284 620057 408509 486352 -117301 111367 34168 477774 464805 287659
14998 287659 151583 120279 270612 355069 138487 101888 464715 -33267 300166 -272901
14987 357602 374835 161645 265506 33671 237498 5904 168729 346450 228713 357367
14977 357367 212341 289123 117548 566899 336551 108741 108070 333841 270667 391580
14967 391580 255401 195796 295337 -37114 224257 259143 74860 288740 223443 243871 131260
14956 131260 436460 112638 433787 170688 178923 203661 179255 314087 148759 399293
14946 399293 302551 645653 394576 331559 452702 352709 156384 224984 130490 479938
$$ packed form
15019i2581c5584C67971A60891N8457K5744a3663B64057A18573c25134B44517
15008B37651L2633L49773k11548P7843a17301A11367C4168M43606j2969j77146
14998B87659j36076l1304J50333Q4457A38487l6599L62827c3267C00166b72901
14987C57602J7233A61645J03861C3671K03827E904J62825J77721j17737J28654
14977C57367j45026P6782A17548M49351k30348A08741o71K25771o3174J20913
14967C91580j36179n9605R9541c7114B24257L4886G4860K13880o5297K0428j12611
14956A31260L05200A12638L21149A70688Q235K4738k4406J34832A48759K50534
14946C99293r6742L43102k51077o3017J21143r9993A56384O8600r4494L49448
$$ plain form
14936 479938 42942 498625 -11422 412442 313408 221098 191400 291252 99037 412553 99976
14924 476744 365913 297350 461658 -37631 427915 237402 252693 69553 -85795 430729
14913 230702 12184 316931 36291 17216 101192 134823 398058 346370 398312 454331 583383
14902 583383 -76067 400701 226666 407111 216864 217398 320364 213376 468044 29016
14891 364147 703019 17409 390353 197084 648045 536018 369081 503570 228438 120866
14881 120866 121192 261286 188026 244875 391418 429130 664170 247596 110597 222727 289735
14870 289735 270012 234503 300582 -77416 159086 133725 252537 661732 120343 197574 429969
14859 429969 378424 271341 125796 328533 542670 453562 454911 372777 541107 9608 269325
$$ packed form
14936D79938D2942M55683a1422D12442r9034r2310k9698R9852I9037L13516I9976
14924D76744j10831o8563J64308c7631D27915j90513J5291F9553h5795D30729
14913B30702A2184L04747C6291A7216Q3976L3631K63235n1688N1942N6019J29052
14902E83383g6067D00701j74035J80445j90247N34J02966j06988K54668B9016
14891C64147L38872A7409L72944j93269M50961j12027j66937J34489B28438j07572
14881A20866L26J40094p3260N6849J46543L7712K35040B47596A10597J12130O7008
14870B89735j9723l5509O6079g7416A59086k5361J18812M09195A20343P7231K32395
14859D29969n1545j07083A25796K02737K14137q9108J349q2134J68330I608K59717
$$ plain form
14848 269325 373604 202295 261342 341350 200081 504430 252470 214338 189814 507651
14838 507651 564061 504224 53688 300772 403641 -40080 443685 503746 512646 637787 255086
14826 709134 275889 503220 403168 263984 672117 404392 116168 606426 484290 397368
14816 397368 606866 978554 315640 458986 742932 586600 440457 494109 323732 564881
14806 564881 608346 109638 358262 631827 206252 639967 276754 414321 543639 323643
14796 323643 330444 142784 188971 243872 773537 569869 382329 572431 438995 152938
14785 555763 290503 220431 409838 295607 349066 802488 662238 912145 895852 431971
14774 592940 710727 796134 581287 573270 448541 517816 595997 715344 1076663 864437
$$ packed form
14848B69325J04279j71309N9047Q0008j41269L04349k51960l8132k4524L17837
14838E07651N6410n9837E3688K47084J02869d0080D43685O0061Q900J25141B55086
14826G09134B75889K27331j00052j39184M08133k67725A16168M90258j22136q6922
14816C97368K09498L71688C15640J43346K83946j56332j46143N3652j70377K41149
14806E64881M3465A09638K48624K73565B06252M33715B76754J37567J29318k19996
14796C23643O801A42784M6187N4901N29665k03668j87540J90102j33436A52938
14785E55763k65260p0072J89407j14231N3459M53422j40250K49907j6293D31971
14774E92940J17787Q5407k14847q017j24729O9275P8181J19347L61319k12226
$$ plain form
14764 864437 647466 778419 972978 217081 198891 832338 817825 740127 499373 707136
14754 707136 268620 586731 474785 589927 715671 614856 681678 667351 694250 708689
14744 708689 920330 752789 370229 825596 777175 743380 752426 529444 680929 893495
14734 893495 624589 398809 647434 1046249 682621 373913 861810 544783 1175209 886748
14724 886748 797902 769379 594508 774641 758000 871376 627662 781217 1051898 749471
14714 749471 909640 414807 908491 741947 548316 777381 1147549 884957 798737 934517
14704 934517 970962 666153 1329100 656975 818576 508251 1065563 863990 693050 671053
14694 671053 579905 758542 921439 481161 952258 831779 1089081 727857 768695 573747
$$ packed form
14764H64437k16971J30953J94559B17081j8190O33447j4513p7698k40754K07763
14754G07136B68620L18111j11946J15142J25744j00815O6822j4327K6899J4439
14744G08689K11641j67541C70229M55367m8421l3795R046k22982J51485K12566
14734H93495k68906k25780K48625L98815l63628l08708M87897l17027O30426k88461
14724H86748q8846k8523j74871J80133j6641J13376k43714J53555K70681l02427
14714G49471J60169D14807M93684j66544j93631K29065L70168k62592q6220J35780
14704I34517L6445l04809O62947F56975J61601l10325N57312k01573j70940k1997
14694F71053r1148J78637J62897m40278M71097j20479K57302l61224M0838j94948
$$ plain form
14684 573747 901296 1119672 1029574 821424 786231 935273 1012714 1091013 671766 1073151
14674 1073151 1363347 864984 791016 1362385 768384 1045180 980971 1112121 696227 1258514
14664 1258514 1054046 1139383 868076 955875 1294930 948470 1344483 1098674 1125257 855863
14654 855863 1074283 1119149 1111778 1131154 891833 1218749 1060976 1283422 1255476 1120937
14644 1120937 1335387 1182524 1132683 974986 1205680 1186308 1044428 1331558 1219317 991134
14634 991134 1122660 1608552 1214239 1160719 1180314 1592879 1190868 1311993 1672132 1128889
14624 1128889 1339290 1514303 1457553 1797661 1374729 1439010 1196197 1125701 1358399 1328059
14614 1328059 1438890 1179931 1381745 1318896 921576 1351934 1817943 1295446 1476214 1436155
$$ packed form
14684E73747L27549K18376r0098k08150l5193J49042P7441P8299m19247M01385
14674A073151K90196m98363p3968N71369n94001K76796o4209J31150m15894N62287
14664A258514k04468Q5337k71307Q7799L39055l46460L96013k45809K6583k69394
14654H55863K18420M4866p371J9376k39321L26916j57773K22446k7946j34539
14644A120937K14450j52863m9841j57697K30694j9372j41880K87130j12241k28183
14634I91134J31526M85892l94313n3520J9595M12565m02011J21125L60139n43243
14624A128889K10401J75013n6750L40108m22932O4281k42813p0496K32698l0340
14614A328059J10831k58959K01814o2849l97320M30358M66009n22497J80768m0059
$$ plain form
14604 1436155 1906325 1328390 1742541 1324928 1419827 1567681 1460750 1613652 1793830 1382977
14594 1382977 1575950 1446776 1489457 1290199 1573628 1713265 1626836 1539017 1834879 1768679
14584 1768679 1404456 2195758 1579379 1830596 1853071 1807265 1711971 2159412 1769369 1864824
14574 1864824 1647069 1681444 2145585 1692617 2066659 2134783 2228664 2032336 2181312 2078728
14564 2078728 2124497 2027067 2202742 2024876 2188374 2503857 2250612 2007939 2172665 2331709
14554 2331709 2219181 2436857 2571941 2547749 2405252 2509199 2709936 2731862 2929207 3087610
14544 3087610 3220557 3240343 3638083 3892104 4063605 4362619 4968577 5780621 6817682
14535 6817682 8264012 10988457 15170434 21697715 31163139 28009065 18206627 10605687
$$ packed form
14604A436155M70170n77935M14151m17613R4899J47854j06931J52902J80178m10853
14594A382977J92973j29174M2681j99258K83429J39637q6429q7819K95862o6200
14584A768679l64223P91302o16379K51217K2475m5806r5294M47441l90043R5455
14574A864824k17755L4375M64141m52968L74042O8124R3881j96328J48976j02584
14564B078728M5769r7430J75675j77866J63498L15483k53245k42673J64726J59044
14554B331709j12528K17676J35084k4192j42497J03947K00737K1926J97345J58403
14544C087610J32947J9786L97740K54021J71501K99014O05958Q12044J037061
14535F817682J446330K724445M181977O527281R465424l154074r802438p600940
$$ plain form
14527 10605687 6852503 4600041 4316663 3467242 3054079 2845297 2750200 2434331 2407536
14518 2407536 2162745 2340244 2569714 2593797 2645918 2156146 2438672 2510302 2588810 2603244
14508 2603244 2615080 2809576 2355569 2501495 2680030 2724910 2663366 2533022 2750858 3150906
14498 3150906 2815919 2751516 2920396 2703744 2975882 3043214 3037573 3174817 3143071 3324311
14488 3324311 3205776 3158308 3656815 3326633 3264933 3020143 3161311 3418973 3431282 3394656
14478 3394656 3448737 3753533 3764845 3476159 4012081 3667983 3658882 3715452 3820010 3847382
14468 3847382 3998281 4146033 4071243 3879388 3936943 4065720 4187531 4341042 4104250 4213022
14458 4213022 4234005 4208369 4445048 4544968 4403454 4683923 4584248 4803027 4540589 4897923
$$ packed form
14527A0605687l753184k252462k83378q49421m13163k08782r5097l15869k6795
14518B407536k44791J77499K29470K4083N2121m89772K82526P1630P8508J4434
14508B603244J1836J94496m54007J45926J78535M4880o1544j30344K17836M00048
14498C150906l34987o4403J68880k16652K72138O7332n641J37244l1746J81240
14488C324311j18535m7468M98507l30182o1700k44790J41168K57662J2309l6626
14478C394656N4081L04796J1312k88686N35922l44098r101N6570J04558K7372
14468C847382J50899J47752p4790j91855N7555J28777J21811J53511k36792J08772
14458D213022K0983k5636K36679R9920j41514K80469r9675K18779k62438L57334
$$ plain form
14448 4897923 4775826 5030073 4964688 4892021 4955434 5168904 5443886 5324847 5606680 5283457
14438 5283457 5489509 5636905 5456332 5786195 5673532 5801142 5624346 6123606 6236420
14429 6236420 6271461 6176807 6619343 6176066 6348336 6282831 6533945 6581349 6797284 6823165
14419 6823165 6990722 6660523 6867841 7290381 7394691 7507548 7516883 7588801 7402886 7543589
14409 7543589 7971646 7938700 8092683 8146590 8159380 8420316 8834675 8812296 9315623 9025860
14399 9025860 9129283 9120718 9528462 9593299 9740577 10007506 10133776 10311717 10157898 10651816
14389 10651816 10673363 10779800 10905810 10948604 10975136 11433568 11588951 11796255 11986682 12094809
14379 12094809 12643555 12531269 12582459 13139275 13155297 13615860 14047409 13980413 14126644 14541736
$$ packed form
14448D897923j22097K54247o5385p2667O3413K13470K74982j19039K81833l23223
14438E283457K06052J47396j80573L29863j12663J27610j76796M99260J12814
14429F236420L5041r4654M42536m43277J72270o5505K51114M7404K15935K5881
14419F823165J67557l30199K07318M22540J04310J12857R335P1918j85915J40703
14409G543589M28057l2946J53983N3907J2790K60936M14359k2379N03327k89763
14399I025860J03423q565M07744O4837J47278K66929J26270J77941j53819M93918
14389A0651816K1547J06437J26010M2794K6532M58432J55383K07304J90427J08127
14379A2094809N48746j12286N1190N56816J6022M60563M31549o6996J46231M15092
$$ plain form
14369 14541736 14947707 14976501 15122055 15545452 15550714 15969733 16828427 16861435 17028354 17506029
14359 17506029 17643136 18322074 18451271 18724261 19286666 19587501 20130665 20345740 20773935
14350 20773935 21134305 21652188 22159249 22395599 22971960 23845305 24109190 24569038 25068414
14341 25068414 25846861 26329259 26948306 27493120 28501332 28956804 29407052 30597145 31157619
14332 31157619 32080961 32680509 33257817 34026906 35229930 36399565 37409221 38388540 39271115
14323 39271115 40480818 41787016 42668949 44253942 45376548 46485328 48044544 49494040
14315 49494040 51284427 52496812 54200691 55849465 57758054 59823303 61945066 63879575
14307 63879575 66032995 68625914 70725414 73322160 76013084 79011909 81800768 84801731
$$ packed form
14369A4541736M05971K8794J45554M23397N262M19019Q58694L3008J66919M77675
14359A7506029J37107O78938J29197K72990N62405L00835N43164K15075M28195
14350B0773935L60370N17883N07061K36350N76361Q73345K63885M59848M99376
14341B5068414P78447M82398O19047N44814J008212M55472M50248J190093N60474
14332C1157619R23342N99548N77308P69089J203024J169635J009656R79319Q82575
14323C9271115J209703J306198Q81933J584993J122606J108780J559216J449496
14315D9494040J790387J212385J703879J648774J908589K065249K121763J934509
14307F3879575K153420K592919K099500K596746K690924K998825K788859L000963
$$ plain form
14299 84801731 88247592 91750023 95311801 99118650 103507956 107499071 112087224 116781906
14291 116781906 122071210 127059493 133005087 138885167 145092206 152345247 159329735 166521255
14283 166521255 174784068 183394658 192533798 202210728 212327355 223120466 234411232
14276 234411232 246193994 258820190 271952395 285921351 300007414 314780211 329985872
14269 329985872 345173278 360649978 375943092 389984263 402598037 414822437 425769489
14262 425769489 435653389 444605617 452675429 458350752 461659429 463096265 464399513 464936029
14254 464936029 461836071 453936228 445038620 435068781 423422865 411161744 398153999
14247 398153999 384656972 370040768 356481822 341998398 327360361 312820382 299192875
$$ packed form
14299H4801731L445861L502431L561778L806849M389306L991115M588153M694682
14291A16781906N289304M988283N945594N880080O207039P253041O984488P191520
14283A66521255Q262813Q610590R139140R676930J0116627J0793111J1290766
14276B34411232J1782762J2626196J3132205J3968956J4086063J4772797J5205661
14269C29985872J5187406J5476700J5293114J4041171J2613774J2224400J0947052
14262D25769489R883900Q952228Q069812N675323L308677J436836J303248N36516
14254D64936029l099958p899843q897608r969839j1645916j2261121j3007745
14247C98153999j3497027j4616204j3558946j4483424j4638037j4539979j3627507
$$ plain form
14240 299192875 285822722 273003546 259727878 247216094 234574368 222326526 210751204
14233 210751204 199806612 189511014 179928328 170518791 162286756 154210877 146678814 139904827
14225 139904827 133010586 126907157 121376103 115859906 110789372 105927432 101447130 97095136
14217 97095136 93439916 89587500 85939829 82662648 79342708 76671280 73474881 70492422
14209 70492422 68114746 65744796 63229034 61352860 59507339 57220623 55061487 53533669
14201 53533669 52124501 50104561 48782514 47588736 45977662 44337768 42998573 41675832
14193 41675832 40868849 39831034 38828360 37868704 36405069 35242913 34478776 33849833 33052373
14184 33052373 32124834 31140001 30447292 29591245 28811748 28416890 27296582 26677324 25872641
$$ packed form
14240B99192875j3370153j2819176j3275668j2511784j2641726j2247842j1575322
14233B10751204j0944592j0295598r582686r409537q232035q075879p532063o773987
14225A39904827o894241o103429n531054n516197n070534m861940m480302m351994
14217I7095136l655220l852416l647671l277181l319940k671428l196399k982459
14209G0492422k377676k369950k515762j876174j845521k286716k159136j527818
14201E3533669j409168k019940j322047j193778j611074j639894j339195j322741
14193D1675832q06983j037815j002674r59656j463635j162156p64137o28943p97460
14184C3052373r27539r84833o92709q56047p79497l94858j120308o19258q04683
$$ plain form
14175 25872641 25558626 24840926 24159711 23731052 22898722 22760186 22112322 21464385 21349837
14166 21349837 21001395 20388964 19757116 19438610 19112450 18616256 18175909 18016180 17484228
14157 17484228 17040548 16917024 16465013 16032435 16056769 15723650 15451603 15028035 14591791
14148 14591791 14428820 14123830 13854850 13904888 13305323 13046403 12969025 12745555 12745144 12507024
14138 12507024 12162940 11992732 11766718 11586302 11077834 11098122 10871499 10810382 10867694 10549025
14128 10549025 10250466 10183315 10120371 9818351 9822444 10014789 9533247 9367382 9328630 9217341
14118 9217341 9132524 8710652 8622096 8598777 8664244 8502069 8077129 8260404 8268158 8241125 7876508
14107 7876508 7878387 7607380 7608305 7421543 7436674 7212778 7558838 7123338 7138500 6994203 6776631
$$ packed form
14175B5872641l14015p17700o81215m28659q32330j38536o47864o47937j14548
14166B1349837l48442o12431o31848l18506l26160m96194m40347j59729n31952
14157A7484228m43680j23524m52011m32578K4334l33119k72047m23568m36244
14148A4591791j62971l04990k68980N0038n99565k58920p7378k23470m11k38120
14138A2507024l44084j70208k26014j80416n08468K0288k26623o1117N7312l18669
14128A0549025k98559o7151o2944l02020M093J92345m81542j65865l8752j11289
14118I217341q4817m21872q8556k3319O5467j62175m24940J83275P754k7033l64617
14107G876508J879k71007R25j86762J5131k23896L46060m35500J5162j44297k17572
$$ plain form
14096 6776631 6742554 6628361 6344806 6377019 6722398 6266359 6290756 6103271 6295303 5835513
14086 5835513 5641876 6005899 5705598 5638816 5487853 5572512 5393710 5698881 5291952 5135826
14076 5135826 5140569 4768089 5190693 5563078 4857224 5469306 4794372 4804700 4938859 5180726
14066 5180726 4457063 4744107 4809535 4558694 4821361 4383962 4369493 4566848 4484349 4682528
14056 4682528 4190381 4204802 3999538 4244113 4132404 3826675 3865033 4012179 3734748 3924169
14046 3924169 3881167 3808712 3771205 3850649 3649632 3658886 3462186 3630535 3415864 3429511 3266792
14035 3266792 3504994 3465084 3364680 3282927 3620087 3174444 3214205 2891704 3327364 2967992
14025 2967992 3251409 3289305 3257555 3101337 3324913 2639963 2944722 2882045 3217901 3025763
$$ packed form
14096F776631l4077j14193k83555L2213L45379m56039K4397j87485J92032m59790
14086E835513j93637L64023l00301o6782j50963Q4659j78802L05171m06929j56126
14076E135826M743l72480M22604L72385p05854O12082o74934J0328J34159K41867
14066E180726p23663K87044O5428k50841K62667m37399j4469J97355q2499J98179
14056D682528m92147J4421k05264K44575j11709l05729L8358J47146k77431J89421
14046C924169m3002p2455l7507P9444k01017R254j96700J68349k14671J3647j62719
14035C266792K38202l9910j00404q1753L37160m45643L9761l22501M35660l59372
14025B967992K83417L7896l1750j56218K23576o84950L04759o2677L35856j92138
$$ plain form
14015 3025763 3155082 3028808 2727603 2816343 2794462 2906824 2898138 3191815 2726413 2528866
14005 2528866 2894823 2391850 2666927 2691139 2813960 2814717 2756852 2670161 2598690 2312630 2431837
13994 2431837 2482270 2529786 2480480 2567582 2351375 2369759 2352243 2280655 2525092 2549731 2298896
13983 2298896 2500200 2247042 2541074 2854209 2795354 2997960 3619439 4277618 5152621 7528454
13973 7528454 11144963 17123191 27167558 28362529 18645717 12303820 8506202 6845373
13965 6845373 5700933 4976310 4250829 3886544 3723825 2840799 3143976 2639898 2700961
13956 2700961 3038296 2562264 2451789 2495230 2627752 2276286 2433500 2240786 1952371 2103746
13946 2103746 2171697 2076472 2125576 1837948 2006521 1914879 1795719 2148832 2056261 1781143
$$ packed form
14015C025763J29319j26274l01205Q8740k1881J12362q686K93677m65402j97547
14005B528866L65957n02973K75077K4212J22821P57n7865q6691p1471k86060J19207
13994B431837N0433M7516m9306Q7102k16207J8384j7516p1588K44437K4639k50835
13983B298896K01304k53158K94032L13135n8855K02606O21479O58179Q75003K375833
13973G528454L616509N978228J0044367J194971r716812o341897l797618j660829
13965F845373j144440p24623p25481l64285j62719q83026L03177n04078O1063
13956B700961L37335m76032j10475M3441J32522l51466J57214j92714k88415J51375
13946B103746O7951r5225M9104k87628J68573r1642j19160L53113r2571k75118
$$ plain form
13936 1781143 1881337 1519474 1776959 1659099 1721888 1808218 1635395 1784405 1887009 1776010
13926 1776010 1655937 1811123 1763501 1639491 2011033 1652088 1943827 1882771 1498284 1529636
13916 1529636 1893309 1866065 1799117 1587702 1406074 1537442 1601683 1514256 1446681 1744758
13906 1744758 1614548 1747766 1265630 1545653 1600866 1699080 1211792 1313221 1269792 1146530
13896 1146530 1222569 1714306 1589109 1333165 1569734 1412803 1623391 1336587 1092259 1226701
13886 1226701 1234663 1167236 1064464 1560983 1588319 1220499 1376354 1428197 1329177 1271141 1047939
13875 1047939 1320003 1070502 1174592 1388615 1314173 1353867 1149214 942991 1292392 948225
13865 948225 1361241 794873 1201766 1006309 1224201 1259272 1049088 937052 1266354 1099350
$$ packed form
13936A781143J00194l61863K57485j17860O2789Q6330j72823J49010J02604j10999
13926A776010j20073J55186m7622j24010L71542l58945K91739o1056l84487L1352
13916A529636L63673k7244o6948k11415j81628J31368O4241q7427o7575K98077
13906A744758j30210J33218m82136K80023N5213R8214m87288J01429m3429j23262
13896A146530P6039M91737j25197k55944K36569j56931K10588k86804k44328J34442
13886A226701P962o7427j02772M96519K7336l67820J55855N1843r9020n8036k23202
13875A047939K72064k49501J04090K14023p4442L9694k04653k06223L49401l44167
13865I48225M13016n66368M06893j95457K17892L5071k10184j12036L29302j67004
$$ plain form
13855 1099350 1256899 843172 1033234 1157655 1220833 1046831 1063886 1315159 898746 1139400
13845 1139400 1122327 920875 980981 803261 1250863 862447 825054 989609 925105 1042688
13835 1042688 894377 1082223 1066183 838436 1004642 1047518 796184 874618 823178 657982
13825 657982 706447 1141691 798390 740183 573802 1203008 1004084 992117 921243 1084303
13815 1084303 1218816 1007680 1029525 916470 912240 923957 702893 726459 882467 843166
13805 843166 802129 992197 660558 834509 1105717 670771 1002285 532990 1151818 837094
13795 837094 1086687 747610 720969 815139 915151 878369 896880 644143 715044 1023020
13785 1023020 781702 582724 976800 659569 830865 804625 663325 871595 991615 602439
$$ packed form
13855A099350J57549m13727J90062J24421O3178j74002J7055K51273m16413K40654
13845A139400j7073k01452O0106j77720M47602l88416l7393J64555o4504J17583
13835A042688j48311J87846j6040k27747J66206M2876k51334P8434n1440j65196
13825F57982M8465M35244l43301n8207j66381O29206j98924j1967p0874J63060
13815A084303J34513k11136K1845j13055m230J1717k21064K3566J56008l9301
13805H43166m1037J90068l31639J73951K71208m34946L31514m69295O18828l14724
13795H37094K49593l39077k6641R4170J00012l6782J8511k52737P0901L07976
13785A023020k41318j98978L94076l17231J71296k6240j41300K08270J20020l89176
$$ plain form
13775 602439 703809 506306 635877 757437 452831 785862 934250 869929 816514 729761
13765 729761 1084802 1045550 865195 632314 468132 566982 771037 874224 951813 565182
13755 565182 556068 966687 871037 464484 513094 638365 534998 673931 688520 451748
13745 451748 538460 323449 658334 718119 573406 738316 703735 723312 468501 594732
13735 594732 409555 733493 570007 407368 783525 502634 659241 536871 429397 671363
13725 671363 661298 478330 387495 591028 -13874 833123 641256 494242 722080 847480
13715 847480 594959 477993 714081 804891 448571 602840 298866 518391 789530 677443
13705 677443 704131 729648 760174 487050 522426 762496 558835 409080 226293 454038
$$ packed form
13775F02439J01370j97503J29571J21560l04606L33031J48388o4321n3415q6753
13765G29761L55041l9252j80355k32881j64182R8850K04055J03187P7589l86631
13755E65182r114M10619r5650m06553M8610J25271j03367J38933J4589k36772
13745D51748Q6712k15011L34885N9785j44713J64910l4581J9577k54811J26231
13735E94732j85177L23938j63486j62639L76157k80891J56607j22370j07474K41966
13725F71363j0065j82968r0835K03533a3874H33123j91867j47014K27838J25400
13715H47480k52521j16966K36088R0810l56320J54269B98866K19525K71139j12087
13705F77443K6688K5517L0526k73124L5376K40070k03661j49755j82787K27745
$$ plain form
13695 454038 418254 772269 599526 440982 718642 776864 452365 311945 475296 678137
13685 678137 381414 439727 539442 535814 280316 433143 372706 620122 327922 350642 284231
13674 284231 414642 409803 391429 521550 332652 544529 759806 516901 490667 347992
13664 347992 218697 559673 301101 754880 337979 546814 592450 464733 561985 374054
13654 374054 480833 809529 470821 491803 580450 468025 293522 408408 548290 698790
13644 698790 369809 546785 206159 299681 301975 262073 534141 464994 407659 416373 243028
13633 243028 247680 354185 604569 648956 583848 630244 71961 532503 131264 560774 271008
13621 306812 324429 190189 276488 575052 164679 710017 256690 427959 434840 666082
$$ packed form
13695D54038l5784L54015j72743j58544K77660N8222l24499j40420J63351K02841
13685F78137k96723N8313R9715l628k55498J52827o0437K47416k92200K2720o6411
13674B84231J30411m839j8374J30121j88898K11877K15277k42905k6234j42675
13664C47992j29295L40976k58572M53779C37979K08835M5636j27717R7252j87931
13654C74054J06779L28696l38708K0982Q8647j12425j74503J14886J39882J50500
13644F98790l28981J76976B06159R3522K294l9902K72068o9147n7335Q714j73345
13633B43028M652J06505K50384M4387o5108M6396G1961M60542A31264M29510B71008
13621C06812J7617j34240Q6299K98564A64679N45338B56690J71269O881K31242
$$ plain form
13611 666082 573273 455208 -40683 391150 191100 525481 450732 202282 631132 203560
13600 331447 415971 281652 327411 94046 484475 539055 182605 256089 363928 386399 309513
13589 309513 323314 178881 -16462 545782 277513 408570 156866 420579 331139 434136
13579 434136 475184 336881 44385 81963 169715 245045 -279 229276 411173 202885 633954
13568 633954 579504 508559 438337 446123 284187 361176 420179 389427 382646 312348 90048 194698
13556 194698 516408 265164 480090 637530 487942 41215 353797 172928 342972 364756
13546 364756 454870 373034 178283 853940 219371 113385 231173 293360 199155 374074
13536 374074 214011 302663 467611 631711 373932 193409 359070 428322 187133 452969
$$ packed form
13611F66082r2809j18065d0683C91150A91100L34381p4749B02282M28850B03560
13600C31447Q4524j34319M5759I4046L90429N4580A82605P3484J07839K2471p6886
13589C09513J3801j44433a6462E45782k68269J31057A56866K63713q9440J02997
13579D34136M1048j38303D4385L7578Q7752P5330b79B29276J81897B02885M31069
13568F33954n4450p0945p0222P786j61936P6989N9003l0752o781p0298I0048J04650
13556A94698L21710k51244K14926J57440j49588D1215L12582A72928J70044K1784
13546C64756R0114q1836A78283O75657B19371j05986J17788O2187r4205J74919
13536C74074j60063Q8652J64948J64100k57779j80523J65661O9252A87133K65836
$$ plain form
13526 452969 104520 99411 360678 502075 356800 538985 328314 180906 -3927 232465
13515 560174 458695 468858 -64892 457648 162063 394736 329172 108230 291262 370117
13505 370117 416298 77494 538680 13736 295267 424708 23209 516603 712697 203294
13494 227990 -122236 272416 151598 146564 84028 166235 160727 250192 369951 277184 420008
13483 420008 62102 271487 49723 399105 -1175 348334 218548 425961 478661 475938 353366
13472 353366 326019 234588 429601 185182 308654 -68526 411655 254588 146377 190685
13462 190685 65507 275040 369191 254573 227416 30675 178836 156611 80572 120280 -44971
13450 204851 124798 326102 -108198 619723 527073 363868 239699 150706 416194 178768
$$ packed form
13526D52969A04520n109K61267J41397j45275J82185k10671j47408c927B32465
13515E60174j01479J0163f4892D57648A62063K32673o5564A08230J83032P8855
13505C70117M6181G7494M61186A3736K81531J29441B3209M93394J96094B03294
13494B27990a22236B72416j20818n034o2536Q2207n508Q9465J19759r2767J42824
13483D20008F2102K09385D9723L49382a175C48334j29786K07413N2700k723j22572
13472C53366k7347r1431J95013A85182J23472f8526D11655j57067j08211M4308
13462A90685F5507K09533R4151j14618k7157C0675J48161k2225p6039L9708d4971
13450B04851q0053K01304a08198F19723r2650j63205j24169q8993K65488A78768
$$ plain form
13439 488735 139182 163907 155926 152306 39732 36135 220839 451195 -30374 -108864 175981
13427 -126811 598262 246273 275509 250850 361647 -12717 345568 -246991 180533 -11543
13416 -26961 139379 -55177 39688 -22298 203340 146730 161484 325999 81893 27029 394431
13405 394431 200576 42004 228920 87501 125119 -109881 660134 455156 149687 228535
13395 228535 -104975 283636 72015 62652 197902 202324 296120 150870 -43527 233192 117706
13384 117706 348986 -43912 198560 -58817 123216 619781 247607 78390 260773 213354
13374 213354 65449 446634 262470 135721 167330 328188 12964 -29776 109099 206593
13364 206593 -16510 118085 85793 309967 25428 529574 137089 264148 296648 262598
$$ packed form
13439D88735A39182K4725p981l620C9732l597J84704K30356c0374p8490A75981
13427a26811E98262B46273K9236k4659J10797a2717C45568b46991A80533a1543
13416b6961A39379e5177C9688b2298B03340n6610J4754J64515H1893B7029L67402
13405C94431j93855D2004J86916H7501L7618a09881F60134k04978A49687P8848
13395B28535a04975B83636G2015r363J35250M422R3796j45250d3527B33192j15486
13384A17706K31280d3912A98560e8817A23216M96565B47607G8390J82383m7419
13374B13354F5449L81185j84164j26749L1609J60858A2964b9776A09099R7494
13364B06593a6510A18085l2292K24174B5428N04146A37089J27059L2500l4050
$$ plain form
13354 262598 241207 43488 252109 452716 323047 498469 -22577 -133317 57092 299944
13344 299944 525178 293178 475634 244458 228619 83582 229304 372447 111843 68648
13334 68648 346633 149430 486456 251463 418702 412168 210632 294224 398332 236318
13324 236318 255155 172963 513068 193034 182884 278819 156766 188622 115412 68891 113098
13313 113098 -88520 183277 101692 239986 11394 217302 245608 262037 511241 90489 499479
13302 499479 -95649 271849 101354 173862 423520 68325 116581 -172235 63712 243907
13292 243907 378387 239221 89417 9598 22230 26077 180346 552396 178847 23050 55481
13281 55481 411727 379887 12533 -39994 236888 172386 110388 68503 -168530 58329 197450
$$ packed form
13354B62598k1391D3488K08621K00607j29669J75422b2577j10740E7092K42852
13344B99944K25234k32000J82456k31176j5839H3582J45722J43143A11843m3195
13334F8648K77985A49430L37026k34993J67239o534k01536Q3592J04108j62014
13324B36318J8837q2192L40105A93034j0150R5935j22053L1856p3210m6521M4207
13313A13098h8520A83277q1585J38294A1394K05908K8306J6429K49204I0489M08990
13302D99479i5649B71849A01354P2508K49658F8325M8256a72235F3712J80195
13292B43907J34480j39166H9417I598J2632L847J54269L72050A78847B3050L2431
13281E5481L56246l1840A2533c9994B36888o4502o1998m1885a68530E8329J39121
$$ plain form
13270 197450 169916 91052 187681 296647 434567 396279 13778 281044 -112814 205408
13259 279117 155494 122511 245181 124148 -61515 -25434 157715 76683 215153 195271
13249 195271 -222727 -188015 21714 -132898 -85501 355057 -192869 227822 118559 179644
13239 179644 167103 -99085 103278 -162318 257950 79479 543139 201526 181184 -93577
13228 53143 170232 225751 456668 77183 -41451 90035 243132 172305 313444 59026 328790
13217 328790 39587 185866 342519 -205531 112667 248195 -47137 -161165 51980 131537
13207 131537 470873 208432 182319 45830 -29512 -163183 134546 178961 -109452 229661
13196 -41563 292793 -3087 -109362 -65033 -63019 -52351 138559 -105893 54058 45756 704521
$$ packed form
13270A97450k7534p8864R6629J08966J37920l8288A3778K67266a12814B05408
13259B79117j23623l2983J22670j21033f1515b5434A57715G6683J38470j9882
13249A95271b22727L4712B1714a32898M7397C55057a92869B27822j09263O1085
13239A79644j2541i9085A03278a62318B57950G9479M63660B01526k0342i3577
13228E3143J17089N5519K30917G7183d1451I0035J53097p0827J41139E9026K69764
13217C28790C9587J46279J56653b05531A12667J35528d7137j14028E1980P9557
13207A31537L39336B08432k6113D5830b9512j33671A34546M4415a09452B29661
13196d1563B92793c087j06275M4329K014J0668A38559a05893E4058q302O58765
$$ plain form
13185 704521 55496 177230 93187 317916 -57878 -29565 92850 334746 357885 39237 -41076
13173 308976 27749 -170463 -225066 315402 378091 233002 230306 -7050 -6684 -213968 199330
13161 -157371 -87966 193739 239939 472648 150775 269742 86370 -54755 259976 279827
13151 279827 53422 306819 36222 18316 230074 -60284 -172558 -54647 -144998 242683 349343
13140 349343 235525 61633 231928 -68287 178856 94943 -76616 -184796 213389 209323 350484
13129 350484 215752 -288 318057 112045 459659 65618 174175 -60108 72044 124810 95508
13118 95508 12415 416797 100197 46842 -146887 160369 -24497 -168908 -12528 133976
13107 80212 -46890 -80984 191825 -20203 83579 -66044 37172 -8650 115009 111837 382021
$$ packed form
13185G04521E5496J21734q4043K24729e7878K8313I2850K41896K3139C9237d1076
13173C08976B7749a70463n4603C15402O2689j45089k696g050L66k07284A99330
13161a57371O9405A93739M6200K32709A50775J18967H6370e4755B59976J9851
13151B79827E3422K53397C6222j7906K11758f0284j12274e4647r0351B42683J06660
13140C49343j13818F1633J70295f8287A78856q3913g6616j08180B13389m066J41161
13129C50484j34732b88C18057A12045L47614F5618J08557f0108G2044N2766k9302
13118I5508A2415M04382A00197D6842a46887A60369b4497j44411a2528A33976
13107H0212d6890l4094A91825b0203H3579f6044C7172h650A15009l172K70184
$$ plain form
13096 382021 -90055 128353 -119449 -302330 11783 298574 63663 356201 44369 -103557
13085 723 507999 -229765 114209 279067 201615 97215 -69425 326243 202831 -23651 -33652
13074 -33652 -296225 -26029 -19220 -45402 -66863 -127792 -66113 40509 183168 147144 118991
13063 118991 246711 389802 263199 -93199 143451 54215 211475 3450 88311 110300 13025
13051 285054 -39868 328271 -86988 -33936 -178914 295079 157787 -32348 74019 14541 103572
13040 103572 -329112 193017 76118 -115903 -21828 -193353 103780 348746 -174847 307171
13029 -136360 -97904 310725 79347 103932 297687 -17169 231689 -157183 -31059 -22174 58807
13017 106698 -4620 -67838 -10285 330370 -14694 22363 393526 -23205 210799 317992 -64537
$$ packed form
13096C82021i0055A28353a19449j82881A1783K86791F3663K92538D4369a03557
13085G23N07276b29765A14209J64858p7452I7215f9425C26243j23412b3651j0001
13074c3652k62573b6029O809k6182k1461o0929O1679D0509J42659l6024k8153
13063A18991J27720J43091j26603i3199A43451E4215J57260C450Q4861K1989A3025
13051B85054c9868C28271h6988c3936j44978B95079j37292c2348G4019A4541Q9031
13040A03572c29112A93017G6118a15903b1828j71525A03780K44966a74847C07171
13029a36360L8456C10725G9347K4585J93755a7169B31689a57183c1059Q885E8807
13017A06698d620o3218a0285C30370a4694B2363L71163b3205B10799J07193f4537
$$ plain form
13005 313849 208352 182380 120291 -167246 25496 88993 168441 -23993 436947 -107264 11471
12993 -23579 -84205 -34670 -18473 120300 -134891 252720 244654 366770 -149636 106847 -6716
12981 245561 191429 46945 441178 92675 258450 11137 12369 348037 297504 327571 43106
12969 70220 187651 155628 228754 -101866 241965 -10855 112462 366009 28475 -179494
12958 141373 132246 74075 255457 86129 234228 271610 -110853 73103 -72505 235808 179830
12947 179830 119505 -203525 -238282 216437 -29520 -59197 324016 11212 -124008 -15880 48738
12935 202059 5438 -33992 -230688 -92515 172451 420185 -14957 43514 -180679 -411529 78588
12923 223565 -12949 442657 293044 -4602 -117182 7785 21419 -163726 223093 302462 233951
$$ packed form
13005C13849j05497k5972o2089a67246B5496O3497P9448b3993D36947a07264A1471
12993b3579o0626c4670J6197A20300a34891B52720q066J22116a49636A06847f716
12981B45561n4132D6945L94233I2675J65775A1137J232L35668n0533L0067D3106
12969G0220J17431l2023P3126a01866B41965a0855A12462K53547B8475a79494
12958A41373r127n8171J81382H6129J48099L7382a10853G3103g2505B35808n5978
12947A79830o0325b03525l4757B16437b9520k9677C24016A1212a24008a5880D8738
12935B02059E438c3992j96696i2515A72451K47734a4957D3514a80679k30850G8588
12923B23565a2949D42657j49613d602j12580G785J3634a63726B23093P9369o8511
$$ plain form
12912 233951 65832 43564 212316 59015 84181 181524 -200250 195444 104176 248827 260285
12901 260285 -182446 48996 56055 17981 338795 -190469 223745 -225152 230430 24251
12890 -124545 38132 -96110 239312 -40094 -58083 42657 262744 412515 -62858 -15245 151387
12878 -135210 101015 69635 17819 236362 -213249 68274 -163876 -113405 315641 -13826
12867 57685 -130870 101929 286211 -69121 -28174 -326578 -210337 -254090 89299 -126216
12856 -79551 -90298 -46531 -124162 180008 -384167 60250 -99133 -119848 -84856 -75528 269340
12844 21686 10079 240362 13177 -113454 130881 -77603 102465 212985 96207 102229 141819
12833 141819 404808 104648 -166145 36814 85888 164458 -107912 91781 198653 80454
$$ packed form
12912B33951F5832k2268J68752E9015K5166R7343b00250A95444r1268J44651J1458
12901B60285a82446D8996P059A7981L20814a90469B23745b25152B30430B4251
12890a24545C8132i6110B39312d0094j7989D2657K20087J49771f2858a5245A51387
12878a35210A01015l1380A7819K18543b13249F8274a63876N0471C15641a3826
12867E7685a30870A01929J84282f9121b8174k98404J16241m3753H9299a26216
12856g9551j0747M3767p7631A80008c84167F0250i9133k0715L4992R328B69340
12844B1686A0079K30283A3177a13454A30881g7603A02465J10520I6207O022L9590
12833A41819K62989A04648a66145C6814M9074P8570a07912I1781J06872H0454
$$ plain form
12822 67590 70839 -161446 268269 19588 160504 57018 -129144 108859 7686 311392 155283
12810 167963 8535 -162795 -27699 -19423 -141386 -143482 -136866 7795 -95242 -60540 226717 -136863
12797 -234003 -34490 -153494 -99129 56657 141521 281171 -3755 97453 32178 -50273 133312
12785 159259 46045 10026 -172768 -171108 523716 492057 -88054 -45103 -58662 49738 106947
12774 106947 144470 -68779 -113996 167693 95339 136110 353212 -124608 -58446 96592 5906
12762 3051 28283 -93289 -92725 -120484 -343422 3877 137829 255200 -60803 159749 418569
12751 418569 65230 -177045 -74320 100130 -162077 13472 -26263 184908 -163868 346110
12740 2045 188969 -454020 -125767 43017 10244 -256756 -40984 131454 -49810 258523 121384
$$ packed form
12822F7590L249a61446B68269A9588J40916E7018a29144A08859G686L03706A55283
12810A67963H535a62795b7699Q276j21963k096O616G795i5242L4702B26717a36863
12797b34003c4490j19004N4365E6657Q4864J39650c755I7453C2178e0273A33312
12785A59259D6045A0026a72768J660E23716l1659h8054M2951j3559D9738N7209
12774A06947L7523f8779m5217A67693p2354M0771K17102a24608e8446I6592E906
12762C051K5232i3289N64k7759k22938C877J33952J17371f0803A59749K58820
12751D18569F5230a77045g4320A00130a62077A3472b6263A84908a63868C46110
12740B045J86924d54020a25767D3017A0244b56756d0984A31454d9810B58523A21384
$$ plain form
12728 192608 66367 26997 -32017 10983 179112 -268456 90514 -61061 97555 -102844 111490
12716 -10961 -7025 47241 158625 21332 35435 10983 77805 214555 250218 32639 -401763
12704 218824 164524 -37530 -19552 187116 232052 -319631 169861 183552 133921 -238283 152755
12692 81887 43854 337904 40204 -140040 -48934 156716 -44456 307384 198331 106610 62944
12681 62944 198347 -47281 -5629 203505 -35605 75898 -60692 90577 137369 -209056 55300
12669 -187769 88285 46315 243848 -147658 88125 51476 -3829 57276 -61760 -242441 309035
12657 -208903 245807 277028 -22021 4177 -24143 85520 253942 -162193 -120895 -46980 144057
12645 71192 -48447 72620 262474 101370 471167 142286 -161077 92734 91375 183171 157706
$$ packed form
12728A92608F6367B6997c2017A0983J68129b68456I0514f1061I7555a02844A11490
12716a0961L936D7241J11384B1332J4103A0983O6822J36750L5663C2639d01763
12704B18824n4300c7530J7978A87116M4936c19631A69861J3691m9631b38283A52755
12692H1887l8033K94050D0204a40040d8934A56716d4456C07384j09053r1721m3666
12681F2944J35403d7281e629B03505c5605G5898f0692I0577M6792b09056E5300
12669a87769H8285m1970J97533a47658H8125l6649c829E7276f1760j80681C09035
12657b08903B45807L1221b2021D177b4143H5520J68422a62193M1298d6980A44057
12645G1192d8447G2620J89854A01370L69797A42286a61077I2734j359R1796k5465
$$ plain form
12634 157706 -9940 -61316 8993 -280355 -150465 81098 -130878 5780 37212 -271461 -110218
12622 273290 -146861 -163831 123555 137171 137967 196451 72422 21677 221861 534953 386796
12611 386796 199794 339643 91635 177903 264982 -214098 -13919 318035 -180965 84777
12600 -40561 387913 -12161 155550 365241 113342 -317902 -8035 -64715 -14166 184821 206669
12589 206669 68594 -19047 76441 336973 101411 91660 90834 337549 -82672 7998 68656 308334
12577 308334 50306 -212806 -225221 96789 285305 107052 -204454 114946 -53509 134276
12566 127776 44109 189386 -461816 347880 155208 -86415 1626 65953 5016 -1803 6943
12554 222936 120374 225844 116761 205418 -28837 30401 2132 293631 -104691 165315
$$ packed form
12634A57706i940n1376H993b80355J29890H1098a30878E780L1432b71461a10218
12622B73290a46861j6970A23555J3616P96N8484G2422B1677K00184L13092j48157
12611C86796j87002J39849I1635Q6268Q7079b14098a3919C18035a80965H4777
12600d0561C87913a2161A55550K09691A13342c17902h035n6680a4166A84821K1848
12589B06669F8594a9047G6441K60532A01411r751q26K46715h2672G998O0658K39678
12577C08334E0306b12806j2415I6789J88516A07052b04454A14946e3509A34276
12566A27776D4109J45277d61816C47880A55208h6415A626O4327E016a803F943
12554B22936j02562J05470j09083Q8657b8837C0401B132K91499a04691A65315
$$ plain form
12543 34094 171194 -141447 -178972 3116 167479 6647 191984 104442 -44250 -38876 170347
12531 -179069 45650 109885 -99227 -345697 161160 -47977 -64652 211897 -172230 240427
12520 126110 -8321 40586 174026 -296218 -342338 213706 57705 -17633 141032 -158037 -31391
12508 147354 209771 -292149 80451 -3633 -207434 -161351 908 -81555 -263882 35298 73306
12497 73306 141984 221382 -101843 226503 250446 332296 197046 167360 -30799 10753 122340
12486 122340 53557 95991 120274 -166815 1252 -45978 -81406 47516 -272672 -104475 401497
12474 165364 -136227 102992 16901 206320 214116 21901 -115865 126445 -298100 32612
12463 186628 128142 31953 -113886 -2222 -131593 -47596 -29839 202958 -283591 347876 126854
$$ packed form
12543C4094J37100a41447l7525C116J64363F647J85337q7542d4250N374A70347
12531a79069D5650O4235i9227k46470A61160d7977j6675B11897a72230B40427
12520A26110h321D0586J33440b96218m6120B13706E7705a7633A41032a58037c1391
12508A47354O2417b92149H0451c633k03801M6083I08h1555j82327C5298L8008
12497G3306O8678P9398a01843B26503K3943Q1850j35250k9686c0799A0753J11587
12486A22340E3557M2434K4283a66815A252d5978l5428D7516b72672a04475D01497
12474A65364a36227A02992A6901J89419P796B1901a15865A26445b98100C2612
12463A86628n8486C1953a13886b222j29371d7596J7757B02958b83591C47876A26854
$$ plain form
12451 -207144 -141535 -154697 295 167225 240243 -80524 98815 -229277 253407 235940 185254
12440 185254 105532 -57297 130640 -128452 -295655 124346 -12124 -60357 -179801 -166420
12430 -166420 141099 188483 -5949 -44327 -178272 221855 -205616 -304856 292797 -382803
12419 61547 37276 -232520 -274542 63361 343216 81699 88298 -111575 16312 -81215 119547
12407 -154470 -92646 -14253 143447 -97641 -184054 141093 10606 102336 -159203 -55449 -67923
12396 -67923 -106400 78671 14716 -138014 205414 -23561 359204 -38078 -262785 -121615 -222531
12385 -222531 -86481 -95015 -405387 5830 302025 10977 125510 -228167 -169997 -72980 111832
12373 -115457 -59618 109609 -337680 -24624 -97994 -275610 426650 127222 -227592 -78182
$$ packed form
12451b07144O5609j3162B95J66930P3018h0524I8815b29277B53407j7467n0686
12440A85254p9722e7297A30640a28452j67203A24346a2124m8233j19444J3381
12430a66420A41099M7384e949l8378j33945B21855b05616r9240B92797c82803
12419F1547k4271b32520m2022F3361K79855H1699O599a11575A6312h1215A19547
12407a54470O1824a4253A43447i7641q6413A41093A0606R1730a59203e5449j2474
12396f7923l8477G8671A4716a38014B05414b3561C59204c8078k24707a21615j00916
12385b22531h6481q534l10372E830K96195A0977J14533b28167N8170g2980A11832
12373a15457N5839A09609c37680b4624p3370j77616D26650A27222b27592g8182
$$ plain form
12362 -104213 115204 399292 -10617 97782 -313096 29132 -311515 168373 -76947 -182720
12352 -182720 -130495 -156769 -42902 -250578 96374 131727 240964 179670 -17126 293547 -22487
12340 -127917 -96195 -20031 -36337 132758 -127098 -146977 -79564 -147612 -170125 -171438 297084
12328 224502 148869 144894 -44823 -36699 -117212 -33868 -95170 54940 -119786 132114 33309
12316 -4772 320027 63475 21762 -59295 42191 85093 -54392 198479 -114213 239235 -142090
12304 -280106 -7383 -238807 -51616 -286485 -40218 -323673 188737 49590 226992 -158354
12293 113965 -47363 -180669 -459379 313899 -166587 -94022 180230 -299443 36461 -73673
12282 172919 -45004 -85729 41198 26936 -259963 -73320 -133377 118733 261901 270836 -34657
$$ packed form
12362a04213A15204K84088a0617I7782c13096B9132c11515A68373g6947j05773
12352a82720N2225k6274d2902k07676I6374L5353J09237o1294a7126B93547b2487
12340a27917L1722b0031j6306A32758a27098j9879O7413o8048k2513j313B97084
12328B24502p5633l975d4823Q124q0513c3868o1302E4940a19786A32114C3309
12316d772C20027F3475B1762e9295D2191M2902e4392A98479a14213B39235a42090
12304b80106g383k31424e1616k34869d0218k83455A88737D9590J77402a58354
12293A13965d7363j33306k78710C13899a66587P2565A80230b99443C6461g3673
12282A72919d5004m0725D1198j4262b59963g3320o0057A18733J43168Q935c4657
$$ plain form
12270 -59364 -57786 152096 292719 263543 217431 48078 194016 223529 241149 291377 349420
12259 349420 251219 164563 251557 170411 -106967 -115128 -206839 238949 -187991 -130166 121094
12247 10382 76167 69800 5895 124368 319292 140850 247875 -12164 59617 -119795 -31350
12235 360114 -130178 7960 285251 -214948 31147 167552 73724 -21954 211246 328722
12225 328722 196349 198793 248241 -177525 123009 153173 -102035 78010 181350 -22527 178464
12213 313458 344689 -39591 253517 178478 22920 263034 331238 167246 10326 -61080 198748
12201 -74861 -3735 180542 29650 39023 -119707 -233291 136609 235588 390320 -6216 23435
12189 -191020 181441 94742 14625 386474 -147241 296377 157535 386058 262751 270712
$$ packed form
12270e9364J578A52096J40623k9176m6112D8078J45938K9513J7620N0228N8043
12259C49420r8201q6656Q6994q1146a06967q161r1711B38949a87991N7825A21094
12247A0382O5785o367E895J18473J94924A40850J07025a2164E9617a19795c1350
12235C60114a30178G960K77291b14948C1147J36405G3724b1954B11246J17476
12225C28722j32373K444M9448a77525A23009L0164a02035G8010J03340b2527A78464
12213C13458L1231c9591B53517p5039B2920K40114O8204j63992A0326f1080A98748
12201g4861c735A80542B9650R373a19707j13584A36609R8979J54732f216B3435
12189a91020A81441q6699A4625L71849a47241B96377j38842K28523j23307P961
$$ plain form
12179 270712 160164 -7181 308007 195081 39694 -14371 419555 270709 65187 -28162 409717
12167 -6502 205823 -116737 86680 -121594 62078 487068 89581 122887 144176 42359 16062
12155 -149101 -33013 -22651 -93855 320574 138230 108377 353173 -14019 -4222 -97579 -10642
12143 172645 -145930 -293627 27664 201028 -69210 158826 -59396 -64589 81089 186041 152991
12132 152991 -110718 56196 -188376 -157210 -278940 145938 150212 249045 -104561 -84249 -79557
12121 -79557 165904 -198294 428072 273125 83522 -148897 -9818 32886 62044 -14192 -625
12109 -219642 38041 -212017 281366 24285 -162002 -143284 -112529 101550 356901 94599
12098 -45076 87438 34280 84734 135520 -144068 -57869 -209325 77972 286162 141261 278660
$$ packed form
12179B70712j10548g181C08007j12926C9694a4371D19555j48846F5187b8162D09717
12167f502B05823a16737H6680a21594F2078M24990H9581L3306K1289D2359A6062
12155a49101c3013J0362p1204C20574A38230k9853K44796a4019d222r3357a0642
12143A72645a45930j47697B7664J73364f9210A58826e9396n193H1089J04952l3050
12132A52991a10718E6196a88376L1166j21730A45938M274R8833a04561K0312M692
12121g9557A65904a98294D28072j54947H3522a48897i818C2886K9158a4192f25
12109b19642C8041b12017B81366B4285a62002J8718L0755A01550K55351I4599
12098d5076H7438C4280N0454N0786a44068e7869j51456G7972K08190A41261J37399
$$ plain form
12087 278660 318302 264409 -196933 -409307 43760 -333308 -10099 -165825 62912 329337
12077 329337 75520 306439 -190005 231845 -229101 -34574 25276 -118380 150520 -165386
12066 32214 -2855 74582 326649 202587 13056 -214938 -216935 165604 17867 83187 137046
12055 137046 -15025 70195 223215 -77289 189046 -17766 -111256 11410 113791 -121375 120514
12043 246402 93336 171207 539343 326107 863865 770088 115562 -106832 259963 304415
12033 304415 13966 -114324 89710 98066 182190 -167702 121930 89696 25149 68890 41414
12022 41414 -86687 111533 297552 -28944 -81639 -125301 -76115 -134243 -16854 -36016 -265213
12011 -265213 -128660 67731 -21530 -141697 -71755 -100400 75852 -27354 -54304 126367 -49078
$$ packed form
12087B78660L9642n3893a96933k12374D3760c33308a0099j55726F2912K66425
12077C29337G5520K30919a90005B31845b29101c4574B5276a18380A50520a65386
12066C2214b855G4582K52067j24062A3056b14938j997A65604A7867O5320N3859
12055A37046a5025G0195J53020g7289A89046a7766r3490A1410J02381a21375A20514
12043B46402I3336P7871L68136k13236N37758r3777A15562a06832B59963M4452
12033C04415A3966a14324H9710Q356Q4124a67702A21930l2234B5149M3741k7476
12022D1414h6687A11533J86019b8944n2695m3662M9186n8128a6854j9162k29197
12011b65213a28660F7731b1530j20167O9942k8645G5852b7354k6950A26367d9078
$$ plain form
11999 -177803 64557 130509 -242999 403950 527146 145070 24706 8960 301238 24671 -120942
11987 -115838 3476 -93929 -326653 199880 145862 -260307 -20842 298072 -53658 -280509 -8130
11975 -169643 242123 -13875 -142809 63467 -481658 -266714 190341 -161819 -3255 17569
11964 352025 -130015 156270 277667 181556 -111886 171085 -65694 92749 97771 213135
11954 213135 -435727 229639 -174547 60874 -58874 -13015 -163886 -45309 321519 4748 -110300
11942 -278591 -164074 -272504 -58852 -249434 159938 195350 -39607 292965 374919 38724
11931 117301 61357 -230749 -261632 -27645 90722 -14274 -189404 101273 -44123 108142 -78653
11919 -28051 -137714 8970 -252896 -103058 117901 47006 -137681 -52591 -124671 20033 1999
$$ packed form
11999a77803F4557O5952b42999D03950J23196A45070B4706H960K92278B4671a20942
11987a15838C476i3929k32724A99880n4018b60307b0842B98072e3658k26851h130
11975a69643B42123a3875j28934F3467d81658K14944A90341a61819c255A7569
11964C52025a30015A56270J21397r6111a11886A71085f5694I2749N022J15364
11954B13135d35727B29639a74547F0874e8874a3015j50871d5309C21519D748a10300
11942b78591J14517j08430e8852j90582A59938L5412c9607B92965Q1954C8724
11931A17301n5944b30749l0883b7645I0722a4274j75130A01273d4123A08142g8653
11919b8051j09663H970b52896a03058A17901D7006a37681e2591p2080B0033A999
$$ plain form
11907 -130135 -294559 -180574 221233 118944 -233089 35506 -193919 254637 14271 -36279
11896 -59407 -131170 241758 129610 73856 -19299 -178096 -67341 -204205 -118284 202627 -252823
11884 -139413 -165532 5113 -117213 -122036 68622 55401 260312 125420 111292 98720 86945
11873 86945 240444 -5794 -47298 311179 11718 -117811 244467 44206 -35065 16800 -205555
11861 53581 39731 -23377 66918 -59058 158158 -176518 34912 96318 -39709 125715 209771
11850 209771 -36518 -218114 300653 -169526 123727 258860 -286418 -241273 -400973 -88453
11839 -141302 105151 -80458 -321752 137123 57828 83596 16542 -178944 -132906 -138856 320945
11827 157066 -67711 -142126 216607 35260 129424 -139005 146687 179356 -37891 20710 -221322
$$ packed form
11907a30135j64424J13985B21233j02289b33089C5506a93919B54637A4271c6279
11896e9407p1763B41758j12148n5754a9299j58797f7341j36864Q5921B02627b52823
11884a39413k6119E113a17213m823F8622j3221K04911A25420j4128j2572j1775
11873H6945J53499e794m1504C11179A1718a17811B44467D4206c5065A6800b05555
11861E3581j3850b3377F6918e9058A58158a76518C4912O1406c9709A25715Q4056
11850B09771c6518j81596C00653a69526A23727J35133b86418M5145j59700h8453
11839a41302A05151h0458k41294A37123E7828K5768A6542a78944M6038n950C20945
11827A57066f7711p4415B16607C5260R4164a39005A46687L2669c7891B0710b21322
$$ plain form
11815 -100848 49273 29375 -181117 145992 -455875 265130 17944 -41400 -102947 29368 37257
11804 37257 -171800 -163734 -157519 -96076 -538642 13154 57908 -137403 -111416 90492 43388
11792 -226842 -173395 167879 66409 -21109 9919 -49572 47242 14190 123652 -60100 36949
11780 164996 -378447 252374 -157943 -329262 -211379 -254080 -107598 163757 -155771 398364
11769 144415 -66724 -29094 18824 -251021 -110959 -39343 -8115 -208636 -44761 5232 191275
11758 191275 -163186 -126979 12936 122948 60251 64332 -23386 -81790 57055 278206 -3609
11746 -236016 131383 118854 -37594 -315216 -31457 -314552 54361 -337883 -78618 18992 -307642
11734 201065 7582 -54492 -272999 -147253 -68882 -282255 -24051 102792 67745 24127 -30036
$$ packed form
11815a00848D9273j9898a81117A45992d55875B65130A7944d1400o1547B9368P889
11804C7257a71800Q066O215O1443m42566A3154M4754a37403K5987I0492D3388
11792b26842N3447A67879F6409b1109I919d9572D7242A4190J09462f0100C6949
11780A64996c78447B52374a57943j71319J17883m2701a07598A63757a55771C98364
11769A44415f6724b9094A8824b51021a10959c9343h115k00521d4761E232J86043
11758A91275a63186L6207A2936J10012F0251M081b3386n8404E7055K21151c609
11746b36016A31383j2529c7594k77622c1457k83095E4361c37883g8618A8992c07642
11734B01065G582e4492k18507J25746f8882k13373b4051A02792l5047B4127c0036
$$ plain form
11722 47545 315419 111496 -386077 214232 84346 -100363 159719 133762 -325749 -103636
11711 15778 224106 123582 12098 -3622 325093 -36417 -152263 -24178 149025 -12778 -194500
11700 -194500 -201676 156695 -23470 -17329 -282890 205757 86857 34814 7875 318142 119767
11688 -112667 -126882 -62947 -49793 -95712 -106337 40524 9402 -246979 144884 -202298 32036
11676 -201782 310489 -127252 171170 275427 94747 -162548 103766 -55238 -98710 96629
11665 25737 -36365 233787 57405 74699 300573 -243278 115914 285643 191149 -127625
11654 146948 131918 -254605 86220 -536753 -50067 -169368 -86674 -232362 91180 -18236 -62150
11643 -62150 54979 -146330 223198 -133905 -31297 148759 196223 -154480 79134 108288 -301697
$$ packed form
11722D7545K67874A11496c86077B14232H4346a00363A59719k5957c25749a03636
11711A5778K08328j00524A2098c622C25093c6417j15846b4178A49025a2778j81722
11700a94500p176A56695b3470O141k65561B05757H6857C4814G875L10267A19767
11688a12667j4215f2947J3154m5919j0625D0524I402b46979A44884b02298C2036
11676b01782C10489a27252A71170J04257I4747a62548A03766e5238m3472I6629
11665B5737c6365B33787E7405J7294K25874b43278A15914J69729r4494a27625
11654A46948j5030b54605H6220e36753e0067j19301Q2694j45688I1180a8236m3914
11643f2150E4979a46330B23198a33905c1297A48759M7464a54480G9134K9154c01697
$$ plain form
11631 8533 -61796 366850 10997 -102371 9672 -127233 -169972 39163 168778 -107637 -159576
11620 -159576 -17126 202812 -217864 97423 72148 213502 -241767 -118868 -305159 -316265
11610 -316265 -133783 -146661 321750 -129207 111222 -122730 62209 -100339 -204260 222416
11599 -53144 199490 -895 9975 26644 -158586 -4385 133736 -69569 -57918 -211296 75296 83549
11587 83549 -51801 -31792 -236238 4566 -91705 -64641 75829 175630 242670 176761 -77240 186088
11574 -170502 -418740 -86962 -82307 72522 238159 -26801 332759 -365933 -99713 100089 -334514
11562 104045 -87203 -6080 -198015 167501 151984 9872 9688 -268284 74874 -39670 -206609
11551 -206609 -164261 127297 -191080 -45079 146522 -158429 -31858 -81572 109819 88479
$$ packed form
11631H533f1796C66850A0997a02371I672a27233m2739C9163J29615a07637n1939
11620a59576a7126B02812b17864I7423k5275J41354b41767a18868j86291j1106
11610c16265a33783j2878C21750a29207A11222a22730F2209a00339j03921B22416
11599e3144A99490h95I975J6669a58586d385A33736f9569J1651j53378G5296Q253
11587H3549e1801K0009k04446D566i1705K7064G5829R9801O7040o5909g7240A86088
11574a70502k48238h6962M655G2522J65637b6801C32759c65933i9713A00089c34514
11562A04045h7203f080j91935A67501j5517I872j84b68284G4874c9670j66939
11551b06609M2348A27297a91080d5079A46522a58429c1858m9714A09819k1340
$$ plain form
11541 88479 189733 -231344 -120748 -29198 271586 -89763 -39722 83302 -125181 -12627 -115557
11530 -115557 -93393 292940 -75393 57866 165958 -164945 221103 -115761 61913 46476
11520 46476 17742 -45434 -91788 131068 347929 305018 -70123 -80320 58949 299115 414460
11509 414460 37664 242003 189946 -190671 -62180 574027 -25962 65314 -76749 575614 87937
11497 -16659 -186361 47650 -56322 -97502 -9408 268987 324398 90256 160259 48010 -292454
11485 -139783 128654 -27471 -257417 -174605 290991 167797 -200180 -50988 220043 -185021
11474 -161872 -58881 52464 -32136 -20336 388887 -249671 263183 -14805 154592 93819 115900
11463 115900 228190 228228 392600 -94176 -9771 290518 260342 178616 312292 -33991 -12342
$$ packed form
11541H8479J01254b31344J10596b9198B71586h9763c9722H3302a25181a2627j02930
11530a15557K2164B92940g5393E7866J08092a64945B21103a15761F1913j5437
11520D6476A7742d5434m6354A31068K16861m2911g0123j0197E8949K40166J15345
11509D14460C7664K04339n2057a90671f2180E74027b5962F5314g6749E75614H7937
11497a6659j69702D7650e6322m1180i408B68987N5411I0256P0003D8010b92454
11485a39783A28654b7471k29946Q2812B90991j23194b00180e0988B20043a85021
11474a61872e8881E2464c2136J1800C88887b49671B63183a4805A54592o0773K2081
11463A15900J12290L8J64372i4176i771B90518l0176q1726J33676c3991a2342
$$ plain form
11451 165231 182843 76272 37512 -22454 -22597 -6283 190694 181680 160495 67390 87356 288647
11439 288647 158976 -144201 -74475 -105031 -34788 -220117 52578 -148891 142477 94894
11429 94894 174089 142711 143296 34638 348401 -232823 51852 -354805 257749 -96486 -40472
11417 -135887 -253300 381754 92128 115527 -41588 21467 -310457 -227412 231710 330114 -212644
11405 34210 6823 80991 -108740 182415 -9368 13559 -121865 92194 137766 10483 -80995
11393 174145 -72175 -316461 -5286 -282259 111252 -123500 -5786 104434 -177331 17302 -145825
11381 -306416 84719 18188 -171420 -117154 -209682 25869 -219131 -111995 -162739 -49605 116171
11369 -8990 -114943 -64034 150426 -129151 86797 -16918 -327618 75536 22829 -110148 5954
$$ packed form
11451A65231J7612G6272C7512b2454j43f283A90694r014k1185F7390J9966K01291
11439B88647j29671a44201O9726l0556c4788j85329E2578a48891A42477m7583
11429I4894P9195l1378N85C4638L13763b32823E1852c54805B57749i6486d0472
11417a35887j17413C81754I2128K3399d1588B1467c10457Q3045B31710R8404b12644
11405C4210F823P4168a08740A82415i368A3559a21865I2194M5572A0483h0995
11393A74145g2175k44286e286k76973A11252a23500e786A04434a77331A7302a45825
11381c06416H4719A8188a71420N4266r2528B5869b19131J07136n0744d9605A16171
11369h990j05953N0909A50426a29151H6797a6918l10700G5536B2829a10148E954
$$ plain form
11357 -55408 -24931 -34672 -289178 44222 -156613 181141 48586 -402504 -162618 141584 -78243
11345 -127904 5312 71041 61519 -40830 -9944 -2190 -95576 36274 -56255 -161648 18366 -200937
11332 -174811 -188299 -19801 -224585 -40282 -44484 136526 -193560 164395 -175543 100245
11321 -363450 -95149 -265457 44801 -4777 -104079 71161 -138636 -239640 -230164 76881 -171086
11309 36760 337483 -75457 -457286 61097 53872 -101490 -76279 157037 -55475 -408 -142520
11298 -142520 119729 244820 -20075 228864 -23842 -148025 14331 -59301 263977 -293254
11287 66538 290056 169200 -69853 212032 304137 -151505 139551 -90433 107285 39314
11276 213584 374065 -130917 -5561 21554 -389659 -5353 294807 -241982 -24320 -20416 -82921
$$ packed form
11357e5408b4931r741k54506D4222a56613A81141D8586d02504a62618A41584g8243
11345a27904E312O5729r522d0830i944b190r3386C6274e6255j05393A8366b00937
11332a74811j3488a9801k04784d0282m202A36526a93560A64395a75543A00245
11321c63450i5149j70308D4801d777r9302G1161a38636j01004R476G6881a71086
11309C6760L00723g5457l81829F1097p225a01490K5211A57037e5475d08j42112
11298a42520A19729J25091b0075B28864b3842j24183A4331e9301B63977b93254
11287F6538K23518j20856f9853B12032R2105a51505A39551i0433A07285C9314
11276B13584J60481a30917e561B1554c89659e353B94807b41982b4320L904o2505
$$ plain form
11265 -82921 -163511 166785 245345 -233463 163053 30744 16432 -112508 -306310 149580
11254 57841 306514 -94991 -249290 -4067 170298 228058 -124249 -260395 275155 -199380
11243 105926 -312505 90825 -170365 191790 -355964 188556 261554 -10330 -223314 -102280
11232 -156096 -60990 -253203 -13814 76978 173554 -105929 -160388 -22328 -105470 -41065 259811
11220 -46437 -159815 -64193 26601 -170934 -58698 -6865 -108355 142206 2655 -52568 -65443
11209 -65443 38960 -234982 206312 -52003 63962 -240786 282380 29078 -150684 -47933 -9676
11197 -150076 82658 81904 222452 113823 -118479 -271305 211031 -237510 68675 29420 -141874
11185 -12703 -508359 -89910 -367939 98562 -9761 -45110 253035 207018 -259087 72175 20215
$$ packed form
11265h2921q0590A66785P8560b33463A63053C0744j4312a12508j93802A49580
11254E7841K48673i4991j54299d067A70298N7760a24249j36146B75155a99380
11243A05926c12505I0825a70365A91790c55964A88556P2998a0330k12984a02280
11232a56096f0990j92213a3814G6978R6576a05929n4459b2328q3142d1065B59811
11220d6437j13378f4193B6601a70934e8698f865j01490A42206B655e2568j2875
11209f5443C8960b34982B06312e2003F3962b40786B82380B9078a50684d7933i676
11197a50076H2658p54J40548j08629a18479j52826B11031b37510F8675B9420a41874
11185a2703m95656h9910k78029I8562i761l5349B53035m6017b59087G2175B0215
$$ plain form
11173 -2729 -85884 256859 13028 75714 -11579 122821 26682 -295971 36819 11138 -132202
11161 -169895 37222 21191 -44504 -80653 -3054 -345405 -164093 140660 -288365 -291464 39803
11149 193742 -67727 22680 115864 45527 -99035 209839 127066 34750 233807 -201747 -28056
11137 -161431 126944 -254267 80818 -4145 -37718 210801 73495 246715 -48416 -243573 -93027
11125 -162300 332208 -230650 -83730 142498 -121766 -144243 -156945 246491 -123138 -74112
11115 -74112 88407 -55554 14822 -233930 166563 -349545 -39275 1942 38266 -104682 68846
11103 4592 -148815 -58135 10708 260677 -40487 -203428 49662 116674 -71420 -156746 441704
11091 412027 -5961 -46829 275540 -6490 302719 172699 -153842 252935 402005 224034
$$ packed form
11173b729q3155B56859A3028O2686a1579A22821B6682b95971C6819A1138a32202
11161a69895C7222j6031d4504l6149c054l42351a64093A40660b88365l099C9803
11149A93742f7727B2680R3184D5527i9035B09839q2773C4750J99057b01747b8056
11137a61431A26944b54267H0818d145l3573B10801G3495J73220d8416j95157i3027
11125a62300C32208b30650h3730A42498a21766k2477j2702B46491a23138M9026
11115g4112H8407e5554A4822b33930A66563c49545c9275A942L6324a04682F8846
11103D592a48815e8135A0708K49969d0487j62941D9662O7012g1420q5326D41704
11091D12027e961m0868B75540f490C02719j30020a53842B52935J49070j77971
$$ plain form
11081 224034 -270261 -114107 425720 -95324 -50147 78702 259673 274966 242189 170966 228498
11070 228498 88472 -206770 -77903 3277 52393 414547 289049 191044 345092 283825 58724
11058 -67319 214656 115242 100126 220431 286178 394072 31740 73274 245168 815566 62929
11046 368502 127484 626342 492548 270969 238298 598702 339410 555328 694998 218659
11035 724660 552072 386180 359496 415894 315464 397543 905296 569715 626022 543948
11025 543948 697199 665219 863964 689680 810070 481859 678745 345155 269901 575480
11015 575480 230203 592065 690058 471883 355161 374714 897353 569679 490630 457329
11005 457329 492627 407154 392679 506487 422507 633560 303127 178706 381283 471020
$$ packed form
11081B24034b70261a14107D25720i5324M5177G8702J80971J5293l2777p1223N7532
11070B28498H8472b06770g7903C277M9116L62154j25498r8005J54048o1267E8724
11058f7319B14656r9414j5116J20305O5747J07894C1740M1534J71894N70398F2929
11046C68502A27484M98858j33794k21579l2671L60404k59292K15918J39670B18659
11035G24660j72588j65892k6684N6398j00430Q2079N07753l35581N6307q2074
11025E43948J53251l1980J98745j74284J20390l28211J96886l33590p5254L05579
11015E75480B30203L61862R7993k18175j16722J9553N22639l27674p9049l3301
11005D57329L5298q5473j4475J13808q3980K11053C03127j24421K02577Q9737
$$ plain form
10995 471020 837532 490552 445516 361400 307723 489123 484916 470315 645255 834963 224410
10983 485331 571528 559394 751140 731153 387912 347875 630167 774193 541035 562924
10973 562924 596925 876989 1238835 889892 736415 1278911 702849 909597 844537 1290679
10963 1290679 1346287 1561976 1627184 1801172 1946245 2295400 2336251 2054522 2121184 1885159
10953 1885159 1589537 1914750 1562430 1398685 1057072 912204 1413933 706688 604108
10944 604108 804111 695964 893148 970609 634672 294901 43984 435322 677479 77021
10933 387852 246524 233719 76813 233701 -239752 6968 7684 285978 147503 -46715 135782
10921 104485 120894 -156823 222073 55856 -142474 219105 177771 -224172 268087 84770
$$ packed form
10995D71020L66512l46980m5036q4116n3677J81400m207j4601J74940J89708B24410
10983D85331Q6197j2134J91746j9987l43241m0037K82292J44026k33158K1889
10973E62924L4001K80064L61846l48943j53477N42496n76062K06748o5060M46142
10963A290679N5608K15689O5208J73988J45073L49155M0851k81729O6662k36025
10953A885159k95622L25213l52320j63745l41613j44868N01729G06688j02580
10944F04108K00003j08147J97184P7461l35937B94901D3984L91338K42157G7021
10933C87852j41328j2805G6813J56888b39752F968P16K78294j38475d6715A35782
10921A04485J6409a56823B22073E5856a42474B19105m1334b24172B68087H4770
$$ plain form
10910 -17406 569310 109923 -105104 -294087 -11881 37066 14346 -39023 -18686 169994 -49303
10898 -323398 135688 -22977 -200029 131965 -298587 25445 296459 -36493 -131679 -134493 343369
10886 117399 169953 -343894 98499 -168872 -30400 146488 -152247 429978 -106254 109834
10875 -147998 -89646 -217968 -65511 -186320 -84530 270453 102303 -24314 -18527 373369 94537
10863 27659 -174085 -208664 -187919 -183477 32986 52334 86411 85591 48629 -70813 22943 -37743
10850 -36682 -324172 41980 -321078 -21607 -279417 21655 -361511 906 19402 -15174 -51033
10839 -51033 65093 -86279 -36453 52437 42165 -17025 -282528 -188361 6992 264764 -17431
10827 -177423 32832 10128 -225710 25172 -9621 -51847 -265400 -310192 -133517 -344362 118892
$$ packed form
10910a7406E69310A09923a05104j88983a1881C7066A4346c9023a8686A69994d9303
10898c23398A35688b2977j77052A31965b98587B5445K71014c6493r5186k814C43369
10886A17399N2554c43894I8499a68872c0400A46488a52247D29978a06254A09834
10875a47998N8352j28322f5511j20809h4530B70453A02303b4314N787C73369I4537
10863B7659a74085l4579K0745M442C2986J9348L4077q20l6962g0813B2943c7743
10850c6682k87490D1980c21078b1607k57810B1655c61511I06J8496a5174l5859
10839e1033F5093h6279c6453E2437j0272a7025k65503R4167F992K57772a7431
10827a77423C2832A0128b25710B5172i621m2226k13553m4792a33517k10845A18892
$$ plain form
10815 -109733 39502 88804 37309 -70792 -118904 -140001 34616 -317660 54099 13856 -48485
10803 -55820 -72588 -29775 -109773 134083 -87020 -208449 114328 49726 260694 -79819 -236512
10792 -236512 -158257 -311514 200974 -257654 -167878 -104302 -147036 35076 81541 -217965 -12890
10780 -201769 -179618 -7228 293416 -40762 -88639 -29130 -242385 -255065 -320801 -137922 27950
10768 270609 -16056 -404604 -110292 142942 -143940 154155 112656 8716 -79005 14312 -36950
10756 371483 -70470 23842 39107 114355 42807 12996 58406 29955 -14889 -86046 24124
10744 202654 -55791 146779 -179682 248715 -15682 -74523 -192555 -42388 287538 -87090
10733 -9581 -68561 93789 -242073 -13529 36558 -133668 -300599 -58062 -294019 243985 -8529
$$ packed form
10815a09733C9502M9302C7309g0792m8112k1097C4616c17660E4099A3856d8485
10803e5820j6768b9775p9998A34083h7020j21429A14328D9726K10968g9819j56693
10792b36512P8255j53257B00974b57654Q9776O3576m2734C5076M6465b17965a2890
10780b01769K2151g228B93416d0762m7877b9130k13255j2680o5736a37922B7950
10768B70609a6056l88548a10292A42942a43940A54155m1499H716g9005A4312c6950
10756C71483g0470B3842J5265P5248D2807A2996M5410k8451a4889p1157B4124
10744B02654e5791A46779a79682B48715a5682n8841j18032d2388B87538h7090
10733i581n8980I3789b42073a3529C6558a33668j66931e8062k35957B43985h529
$$ plain form
10721 -115742 -218138 -180165 -30506 -99926 -74599 116634 78827 -15694 -2324 -192433 114909
10709 -115360 351642 134202 5450 354624 7924 2690 146374 5003 -123341 426264 337669
10698 337669 -152555 -353560 -420979 -320457 208333 -329319 -153555 -107770 -111930 -76145
10688 -76145 -12790 306909 -128543 122190 -60872 141662 9839 -256126 -78038 267302 30743
10676 243871 42586 -98411 -143653 -57251 -203562 -161055 69583 -394810 34431 12394 -336017
10664 175033 -109203 -205878 -158323 -357618 -163614 -73637 -117942 -330780 -135784 57103
10653 -77095 113437 80147 90950 -72987 90690 -235206 3295 15063 -47342 81131 -148420
10641 -256562 72460 -313208 70612 -148910 -102377 -129690 -41228 -191055 142285 -148477
$$ packed form
10721a15742j02396L7973c0506o9420K5327A16634l7807a5694b324j90109A14909
10709a15360C51642A34202E450L49174G924B690J43684E003a23341D26264q8595
10698C37669a52555k01005o7419J00522B08333c29319a53555M5785m160L5785
10688g6145a2790C06909a28543A22190f0872A41662I839b56126g8038B67302C0743
10676B43871D2586i8411m5242e7251j46311M2507F9583c94810C4431A2394c36017
10664A75033a09203r6675M7555j99295a63614g3637m4305k12838a35784E7103
10653g7095A13437l3290J0803g2987I0690b35206C295J1768d7342H1131a48420
10641b56562G2460c13208G0612a48910M6533k7313d1228j49827A42285a48477
$$ plain form
10630 -48602 -101036 -42508 195772 -51935 -27846 20667 -26429 -25166 -264799 -70068 134387
10618 -185703 268438 320323 -113067 -245835 -490611 -7265 160273 68189 191736 -74535
10607 -159081 -287544 -109377 -49278 -13676 -292694 -9668 -59474 -57295 -81024 -22720 -188883
10596 -188883 -170414 -250384 137209 -162585 -245915 56681 105888 -170379 36480 -83379 -134076
10585 -134076 -1970 -25943 -245732 147355 180455 -314599 -255289 169867 -66660 96808 123292
10574 123292 84078 162219 -322177 10683 131310 -64708 365108 56252 -341565 -303721 -227309
10563 -227309 89893 213561 35246 169711 -30955 -209613 76267 -190151 -49391 -17114 -89769
10552 -89769 -84386 165466 34346 -125897 -80134 242129 28928 -172451 52262 80975 -72390
$$ packed form
10630d8602n2434d2508A95772e1935K4089B0667b6429J263k39633g0068A34387
10618a85703B68438N1885a13067j32768k44776g265A60273F8189J23547g4535
10607a59081j28463a09377d9278a3676k79018i668m9806K179k3729b2720j66163
10596a88883J8469p9970A37209a62585q3330E6681M9207a70379C6480h3379n0697
10585a34076a970k3973k19789A47355L3100c14599N9310A69867f6660I6808K6484
10574A23292l9214P8141c22177A0683J20627f4708C65108E6252c41565L7844P6412
10563b27309H9893J23668C5246J34465c0955j78658G6267a90151d9391a7114p2655
10552h9769N383A65466C4346a25897M5763B42129B8928a72451E2262K8713g2390
$$ plain form
10540 82517 -2063 -89579 -264131 195756 121638 -179300 -180306 188925 229478 -33387 182716
10528 -151850 -102600 86591 34185 -88105 74276 -176972 -78331 -50481 231356 -86356 -149897
10517 -149897 -83817 -309148 -39923 -129390 -410171 -80234 115388 -87378 -255207 -262672 -49070
10505 -188729 -167726 27831 -124494 216947 88811 -120613 27028 -58242 140183 -428132
10494 -222221 -51842 59959 -335460 -460165 -239776 -175792 123655 -158545 -101610 -30945
10483 -130891 312512 116930 10258 -61302 154809 105839 59316 384082 -449734 -278633
10473 -278633 31134 -31936 -173480 -66987 -162420 142094 -11114 339922 -57083 301482 -179674
10461 73250 43191 341695 -211413 118360 -102919 18430 82483 -104778 -239360 196480
$$ packed form
10540H2517b063q7516j74552A95756p4118a79300j006A88925M0553c3387A82716
10528a51850M9250H6591C4185h8105G4276a76972g8331K7850B31356h6356o3541
10517a49897O6080k25331c9923q9467k80781h0234A15388h7378j67829p465d9070
10505a88729K1003B7831a24494B16947H8811a20613B7028e8242A40183d28132
10494b22221e1842E9959c35460j24705K20389O3984A23655a58545N6935c0945
10483a30891C12512A16930A0258f1302A54809m8970m6523L24766d49734J71101
10473b78633C1134c1936j41544f6987r5433A42094a1114C39922e7083C01482a79674
10461G3250l0059K98504b11413A18360a02919A8430O4053a04778j34582A96480
$$ plain form
10450 -294637 -983 -176106 -154445 -119831 244563 -76681 -205494 14472 288019 -279796 -277904
10439 -277904 197404 313121 199074 -16029 -97584 122863 123140 -58891 176103 6300 247580
10428 247580 96885 86405 198308 134898 354325 55881 -25826 420198 181182 -145438
10417 -32558 -7198 -143314 -472491 251757 64584 145935 216266 186124 29091 103253 37509
10405 -68202 42421 -39772 -31142 140378 63409 -324113 -103954 -93187 144178 185701 258230
10394 258230 -304100 414 369971 -318354 98396 -223176 41095 -4418 -44623 77729 216893
10383 216893 -35594 41281 127222 50048 70178 344155 113704 78254 273916 95046 -55995
10371 -96346 111128 90555 -63368 -238435 25315 -176156 140818 466019 272110 112014
$$ packed form
10450b94637i83j75123K1661L4614B44563g6681j28813A4472K73547b79796J892
10439b77904A97404J15717j14047a6029q1555A22863K77e8891A76103F300K41280
10428B47580I6885j0480J11903o3410K19427E5881b5826D20198A81182a45438
10417c2558g198j36116l29177B51757F4584Q1351P0331l0142B9091P4162C7509
10405f8202D2421c9772Q630A40378F3409c24113a03954J0767A44178M1523P2529
10394B58230c04100D14L69557c18354I8396b23176D1095d418m0205G7729J39164
10383B16893c5594D1281Q5941E0048K0130K73977A13704l5450J95662I5046e5995
10371i6346A11128k0573f3368j75067B5315a76156A40818L25201j93909A12014
$$ plain form
10360 138354 499635 395073 316477 251818 459716 -56247 110685 216507 437540 576115
10350 576115 776586 78413 104086 113673 334589 -145828 -196372 85675 55382 381017 29368
10338 269577 172106 281755 201774 246365 191047 52907 40503 224830 -26531 371700 126750
10326 -44915 14825 -17394 -109498 281734 -78827 -90375 226678 311896 -16186 -271808 -25735
10314 143490 117872 131157 -31516 334016 218177 108551 -249930 127039 90883 118076
10304 118076 157793 154306 80704 78276 33671 105755 53327 -356319 -167539 -82266 -48042
10293 -48042 61256 77477 -269090 -317706 -83758 95980 -12227 -316163 95794 -106274 141505
10281 -59916 -154750 59513 -31097 53108 14269 -353783 -94867 -295867 -83979 -134827 183301
$$ packed form
10360A38354L61281j04562p8596o4659K07898e6247A10685J05822K21033J38575
10350E76115K00471G8413K5673R587K20916a45828n0544H5675l0293L25635B9368
10338B69577r7471J09649p9981M4591n5318E2907j2404J84327b6531C71700A26750
10326d4915A4825a7394r2104B81734g8827j1548B26678Q5218a6186k55622b5735
10314A43490k5618J3285c1516C34016j15839A08551b49930A27039l6156K7193
10304A18076L9717l487p3602k428C3671P2084n2428c56319a67539h2266L4224
10293d8042F1256J6221b69090m8616h3758I5980a2227l03936I5794a06274A41505
10281e9916r4834E9513c1097E3108A4269c53783i4867k01000h3979n0848A83301
$$ plain form
10269 1802 167083 -119014 178889 -19633 101900 189839 -85513 -107179 -62333 230001 156239
10258 156239 -196565 -10427 -66743 102942 -192706 79040 -179336 81803 -29840 -11408 -20522
10247 -20522 -245814 -36919 -176830 136845 95293 -42405 101513 102308 82788 -99522 5420
10235 15485 -114347 30859 543996 -129155 65708 30254 105075 -36887 161768 -300373 43733
10223 70371 49290 -6290 -27341 -52350 69856 -50743 -4363 -55458 -234847 202938 80305 347250
10211 347250 -64154 123932 -10675 75154 -168892 -346238 -25776 3416 50738 -116109 -252716
10200 -252716 -143488 126972 -88715 136238 -321214 187927 52275 130739 185315 -103680
10189 77933 -205464 -252992 162468 436345 -224732 215770 89581 43738 -192894 -107829
$$ packed form
10269A802J65281a19014A78889a9633A01900Q7939h5513k1666M4846B30001p3762
10258A56239a96565a0427n6316A02942a92706G9040a79336H1803b9840a1408r114
10247b0522k25292c6919j39911A36845m1552d2405A01513P95j9520i9522E420
10235A5485a14347C0859N13137a29155F5708C0254P4821c6887A61768c00373D3733
10223G0371k1081f290k1051k5009F9856e0743d363n1095j79389B02938H0305K66945
10211C47250f4154A23932a0675G5154a68892j77346b5776C416M7322a16109j36607
10200b52716J09228A26972h8715A36238c21214A87927E2275P8464N4576a03680
10189G7933b05464m7528A62468K73877b24732B15770H9581D3738a92894Q5065
$$ plain form
10179 -107829 46713 -368270 -234802 -191035 -64330 -133720 -62868 71840 -69845 294354 259440
10168 259440 -187598 -80313 -71066 -46486 -47380 -199690 -94123 -192727 -59082 160037 -152359
10156 -321565 229499 63927 -96524 -147347 60256 197489 -33378 -251080 113958 -217468
10145 -258680 -467157 224948 -179334 -66506 -237653 181191 -181458 91074 358746 -13011
10134 -371142 -252247 -236713 60647 -78144 -53460 -187005 -76784 -276714 -8643 -25344 63931
10122 -255544 -38688 -285119 -251903 -163308 -101466 107356 -85546 -156596 -166865 -35380 197586
10110 94617 50734 263743 -216707 87892 86125 197320 6116 200608 -128808 -151829 -39594
10098 -154547 -376107 -108551 -304200 -14406 138123 29722 -375543 -24722 -152388 -217647
$$ packed form
10179a07829D6713c68270J33468M3767f4330o9390f2868G1840f9845B94354l4914
10168B59440a87598h0313R247K4580q94j52310i4123r8604e9082A60037a52359
10156c21565B29499F3927i6524n0823F0256J37233c3378k17702A13958b17468
10145b58680k08477B24948a79334f6506j71147A81191a81458I1074K67672a3011
10134c71142J18895J5534F0647g8144K4684j33545g6784j99930h643j6701F3931
10122b55544c8688k46431L3216Q8595O1842A07356h5546p1050j0269c5380A97586
10110I4617m3883K13009b16707H7892j767J11195F116J94492a28808k3021c9594
10098a54547k21560a08551j95649a4406A38123B9722c75543b4722j27666o5259
$$ plain form
10088 -217647 -104511 417786 87710 153743 9926 -114225 23962 -112121 59669 155204 70396
10076 34746 221179 241569 -352736 -90480 -361021 -125477 -21758 -227619 -264801 -210990 161785
10064 48774 -409581 -73680 90864 -65502 124836 38173 -138343 163201 215556 -32006 -442240
10053 -442240 -95599 -119103 -453931 15623 108920 -11011 -165954 -156557 -267923 415172 122704
10041 -65556 221695 54005 -93322 -186497 -65583 222907 88076 10440 -66923 -35684 -174384
10030 -174384 -316280 45463 -16323 -400848 -79036 -244766 142291 -96777 472496 4272 -147470
10018 7681 66916 389762 -129778 -17838 -196893 -97584 -209529 122529 -125482 -116508 -32743
10006 -31199 -112952 181787 -322935 -566022 -237628 97182 -372981 42897 -53613 54968 -65289
$$ packed form
10088b17647a04511D17786H7710O6033I926a14225B3962a12121E9669R5535G0396
10076C4746J86433K0390c52736i0480k70541a25477b1758k05861l7182N3811A61785
10064D8774d09581g3680I0864f5502A24836C8173a38343A63201N2355c2006m10234
10053d42240i5599k3504l34828A5623R3297a1011j54943R397j11366D15172A22704
10041f5556B21695E4005i3322r3175f5583B22907H8076A0440f6923L1239j38700
10030a74384j41896D5463a6323l84525g9036j65730A42291i6777D72496D272a47470
10018G681N9235L22846a29778a7838j79055i7584j11945A22529a25482Q974c2743
10006c1199q1753A81787c22935k43087b37628I7182c72981D2897e3613E4968f5289
$$ plain form
9994 -211397 219114 -78412 369499 113282 -317237 -276970 -160871 -3199 7087 -167908 -183484
9983 -183484 31107 -173884 137830 -335681 141041 114821 348419 -163181 22425 -258773
9972 -489018 47952 -84367 -469502 17501 205741 -457515 199533 6595 -115492 -399113 392799
9960 -138198 -179558 -32873 -188012 -195204 -121797 -199037 17961 -73475 -130618 -177539 -94464 100039
9947 -65311 -41605 -24561 108781 -151524 89927 -152200 242794 -294970 14905 -55932 163715
9935 71312 6805 -19279 -225203 93601 -566598 -77753 -96386 -197297 -180813 -138048 -145204 -302464
9923 -302464 78715 -83059 154777 83977 -161039 -35889 -34523 125807 -74686 -94424 330213
9911 -36347 -214727 -112336 -137527 161800 21821 13896 56116 -125991 -261608 63090 -196136
$$ packed form
9994b11397B19114g8412C69499A13282c17237M0267J16099c199G087a67908j5576
9983a83484C1107a73884A37830c35681A41041k6220K33598a63181B2425b58773
9972d89018D7952h4367l85135A7501J88240d57515A99533F595a15492k83621C92799
9960a38198m1360c2873j55139p192P3407p7240A7961g3475n7143m6921Q3075A00039
9947f5311K3706J7044A08781a51524H9927a52200B42794b94970A4905e5932A63715
9935G1312F805a9279k05924I3601e66598g7753j8633j00911J6484M2765p156j57260
9923c02464G8715h3059A54777p0800a61039c5889J366A25807g4686j9738C30213
9911c6347j78380J02391k5191A61800B1821p925M2220a25991j35617F3090a96136
$$ plain form
9899 203044 -328839 -310415 -494097 -159875 -99590 -97354 60950 -28272 48667 -264296 -50648
9887 70237 119817 146998 11575 -67215 166486 80407 203680 -387212 -15691 -49855 79656
9875 -48217 8428 -101284 -83207 30833 203119 77237 -41943 84735 -297254 -168238 44545
9863 -157667 19004 59861 -205419 -73911 -99087 -39026 -229203 -52193 -39395 -266048 -145436
9852 -145436 140212 28763 77134 -337978 -45488 60268 -215398 92690 133357 242660 108043
9840 -50833 -123933 109415 -270086 -91271 196502 199454 159352 -163259 101487 -47497 -938
9828 -196001 3231 69984 -237061 -101690 -234994 130159 60342 251847 -354020 -185965
9818 -185965 -215261 -22298 -43513 -304116 -14716 79152 -246334 53551 -135790 -363106 -88498
$$ packed form
9899B03044c28839J8424j83682a59875O0285K236F0950b8272D8667b64296e0648
9887G0237M9580K7181A1575f7215A66486H0407J23273c87212a5691l4164G9656
9875d8217H428a01284J8077C0833J72286G7237d1943H4735b97254J29016D4545
9863a57667A9004M0857b05419g3911k5176c9026j90177e2193J2798k26653J20612
9852a45436A40212B8763M8371c37978d5488F0268b15398I2690M0667J09303A08043
9840e0833p3100A09415b70086i1271A96502K952m0102a63259A01487d7497i38
9828a96001C231O6753b37061a01690j33304A30159F0342J91505c54020J68055
9818a85965k9296b2298k1215k60603a4716G9152b46334E3551a35790k27316h8498
$$ plain form
9806 -164928 -81335 -224934 -223285 -64997 22582 -164884 -139254 -134699 135566 -191104 -200817
9795 -200817 38140 -51818 -38850 -131834 -26340 68396 -66503 -26783 -21607 -5811 74463 -281911
9782 -57669 235441 -137415 -97615 -20350 -505186 376873 -116358 12585 -342943 -71777 -194419
9771 -194419 149859 81824 -94734 -89578 -47930 -113376 -221471 -30707 -155527 -194142 -223969
9760 -223969 -33510 -72504 -246531 11653 52832 -325116 59003 157229 90985 -32642 -71836
9749 -71836 -158187 54975 36751 -35131 -98617 70066 -135582 16567 -83715 -178706 -367050
9738 -367050 -55860 -118205 32125 -170126 -153099 -197128 -109449 22946 -149219 4616 849 95004
9726 95004 46582 -45900 -98946 -251751 63264 -261651 -15146 -329193 -254839 -116908 -120348
$$ packed form
9806a64928h1335j43599J649f4997B2582a64884K5630M555A35566a91104r713
9795b00817C8140e1818J2968r2984b6340F8396f6503b6783N176e811G4463b81911
9782e7669B35441a37415L9800b0350m84836C76873a16358A2585c42943g1777j22642
9771a94419A49859o8035i4734N156M1648o5446j08095c0707j24820l8615k9827
9760b23969c3510l8994j74027A1653M1179c25116E9003R8226o6244c2642l9194
9749g1836q6351E4975j8224c5131o3486G0066a35582A6567h3715r4991j88344
9738c67050e5860o2345C2125a70126J7027m4029Q7679B2946a49219D616H49R4155
9726I5004D6582d5900n3046j52805F3264b61651a5146l14047P4354a16908l440
$$ plain form
9715 -120348 125124 -57432 -123440 -264823 -327035 -119480 170033 -339577 -19838 74152 283453
9704 283453 -258602 -12208 -127355 88461 -138232 -64549 -498204 -67499 -259338 -151473
9694 -151473 -69290 -206587 -94362 -68473 -96200 2488 -12372 -347559 -213217 69707 212883
9683 212883 -233558 41405 223584 40157 -53149 -162854 231726 -121666 -3220 200070 22167
9671 -351945 -203713 -193140 186380 -32616 -27468 -68402 -97094 -8373 -137421 -140021 26864 -103071
9658 -186412 -155127 -159803 -92846 -365926 -396603 -66488 79014 -145738 -285585 -125681 -198689
9647 -198689 -33769 -92081 90977 -177613 294729 289046 221357 363804 -5525 -59186 -256356
9636 -256356 -138226 -106055 -185235 74546 41370 -187030 -91863 134778 -23518 -187610 -3620
$$ packed form
9715a20348A25124e7432o6008j41383o2212a19480A70033c39577a9838G4152K09301
9704B83453b58602a2208j15147H8461a38232f4549m33655f7499j91839J07865
9694a51473f9290j37297i4362K5889k7727B488a2372l35187J34342F9707J43176
9683B12883b33558D1405J82179D0157e3149j09705B31726a21666c220B00070B2167
9671c51945J48232J0573A86380c2616N148m0934k8692h373j29048k600B6864a03071
9658a86412L1285m676O6957k73080l0677f6488G9014a45738j39847a25681p3008
9647a98689c3769n8312I0977a77613B94729n683o7689J42447e525n3661j97170
9636b56356J18130L2171p9180G4546l3176a87030i1863A34778b3518j64092c620
$$ plain form
9624 -225938 7923 -334872 -451979 27573 164377 84514 -235979 -202620 43981 -87491 -166321
9613 -166321 42403 62337 -114172 -32894 -7152 56039 214744 77756 -118469 453564 3871
9601 -221925 11008 -166362 -7635 -254636 -104394 -275540 240086 -41890 48283 66306 116852
9590 116852 -44463 -179859 -77716 50537 -150873 16438 -367964 184924 266232 18595 241609
9579 241609 75486 98538 125051 -177489 82760 -89359 -86012 -106781 259722 -91507 63562
9567 -13364 179496 12365 -158564 36245 -117448 242305 171995 -152826 -24868 -18314 40710
9555 34716 19987 -196906 -153559 -136679 -36231 -246241 -60133 -172813 -104465 -85831 52379
9543 -68344 -295683 -113881 -214226 -19924 94521 45362 -359675 -55133 -153050 207804 -122639
$$ packed form
9624b25938G923c34872j17107B7573J36804p9863b35979L3359D3981h7491p8830
9613a66321D2403J9934a14172c2894g152E6039J58705G7756a18469D53564C871
9601b21925A1008a66362g635k47001a04394j71146B40086d1890D8283J8023N0546
9590A16852d4463j35396g7716E0537a50873A6438c67964A84924Q1308A8595K23014
9579B41609G5486K3052K6513a77489H2760h9359L347k0769B59722i1507F3562
9567a3364A79496A2365a58564C6245a17448B42305p0310a52826b4868O554D0710
9555C4716j4729a96906M3347J6880c6231k10010f0133j12680O8348J8634E2379
9543f8344k27339a13881j00345a9924I4521D5362c59675e5133r7917B07804a22639
$$ plain form
9531 -43385 -126370 -50006 -130500 -188723 40172 -100213 -209386 -84617 -292341 -34677 -195946
9520 -195946 -159034 165739 261587 -255903 -83295 -77040 -149088 92005 -223513 -278649 192978
9508 103693 -152361 -369054 344594 -294939 51059 157413 -243925 152398 -92078 -114850
9498 -114850 2913 137780 -173778 -205395 -82795 192959 -28879 -380037 -90295 -96028 169353
9486 -110982 -42722 161087 62873 -207041 66406 131920 -74802 -176102 -411075 -49969 -60358
9475 -60358 -214454 -218589 242958 -37721 -45960 137700 47206 51693 85124 -61119 -235545 -192218
9463 -192218 116357 -125717 134427 234186 -215487 -91827 -309567 -221947 248580 162672
9453 162672 121859 -156330 -83638 -197292 75286 40286 62387 -39707 -64806 -121139 -56006
$$ packed form
9531d3385q2985e0006q0494n8223D0172a00213j09173h4617k07724c4677j61269
9520a95946L6912A65739R5848b55903h3295O255p2048I2005b23513n5136A92978
9508A03693a52361k16693C44594b94939E1059J06354b43925A52398i2078k2772
9498a14850B913J34867a73778l1617h2795A92959b8879l51158i0295n733A69353
9486a10982d2722A61087F2873b07041F6406O5514g4802j01300k34973d9969j0389
9475f0358j54096m135B42958c7721q239A37700D7206M487L3431f1119j74426M3327
9463a92218A16357a25717A34427R9759b15487i1827k17740Q7620B48580q5908
9453A62672m0813a56330P2692j13654G5286l5000K2101c9707k5099n6333e6006
$$ plain form
9441 -210152 -63453 74420 -103166 118134 -261659 1542 -515643 307993 2996 286400 -8915
9429 -133962 -78846 223820 -152531 124503 -172188 -197385 -117224 65868 -51756 -91922 232181
9417 72025 56390 -115423 -144156 52187 -151999 213754 -207222 77477 -43266 -21949 -262248
9406 -262248 -270561 123194 -18890 -298958 -406597 171805 46178 -14447 67219 -91850 -40057
9394 106630 104600 135842 51116 289791 114215 30601 255802 93487 -123096 137543 106559
9383 106559 -214313 -176552 289569 -34444 217099 189854 -153919 -171401 -11631 -140426 148324
9371 -357526 -147120 27060 -217772 -157900 -189510 100404 258505 161716 40041 -114864 -438802
9360 -438802 -15325 -252145 -116815 -56072 202291 -83117 -99938 88171 -122029 308306 -6443
$$ packed form
9441b10152f3453G4420a03166A18134b61659A542e15643C07993B996K83404h915
9429a33962N5116B23820a52531A24503a72188k5197Q0161F5868e1756m0166B32181
9417G2025j5635a15423k8733E2187a51999B13754b07222G7477d3266K1317k40299
9406b62248q313A23194a8890k80068j07639A71805D6178a4447F7219i1850d0057
9394A06630k030L1242E1116K38675A14215C0601K25201I3487a23096A37543l0984
9383A06559b14313L7761B89569c4444B17099k7245a53919j7482a1631j28795A48324
9371c57526a47120B7060b17772N9872l1610A00404J58101r6789D0041a14864l23938
9360d38802a5325k36820a16815e6072B02291h3117j6821H8171a22029C08306f443
$$ plain form
9348 -50931 50373 -54163 73434 -1666 -87198 -59671 219815 -51853 -81565 -43858 5616 -119218
9335 37950 -72600 -338150 116908 48568 -14018 -236800 22236 -128713 -101707 -270691 -12946
9323 -41410 -13241 473388 67436 -225632 209830 -15536 -135201 276962 84693 158508 -4835
9311 -144572 156810 -97989 -111452 -39873 139202 16233 37651 -194774 -262505 -206697 -201196
9300 -201196 -225182 -20782 187411 -133152 -16794 -9140 64542 -253296 -36875 -182145 -63808
9288 88303 -101604 -313332 -68029 -184325 -201802 -394714 279131 -75204 -47772 -149054 -359320
9277 -359320 -115494 -136103 -75101 -179799 -23620 93287 236933 -93904 -275238 -99742 94441
9265 149654 -120334 -107044 9296 84087 -40992 -290038 -49367 -166085 208216 41019 -163097
$$ packed form
9348e0931E0373e4163G3434a666q5532K7527B19815e1853k9712L7707E616a19218
9335C7950g2600k65550A16908D8568a4018k22782B2236a28713K7006j68984a2946
9323d1410a3241D73388F7436b25632B09830a5536j19665B76962H4693P3815d835
9311a44572A56810i7989j3463c9873A39202A6233K1418a94774o7731N5808N501
9300b01196k3986b0782A87411a33152a6794P654F4542b53296c6875j45270f3808
9288H8303a01604k11728f8029j16296j7477j92912B79131g5204K7432j01282k10266
9277c59320a15494k0609O1002j04698b3620I3287J43646i3904j81334i9742I4441
9265A49654a20334J3290I296P4791d0992k49046d9367j16718B08216D1019a63097
$$ plain form
9253 272872 136560 236770 -195834 -33343 -221389 290438 -304096 -124548 -131471 -67991
9243 -67991 -36003 114456 -349281 -201550 -168409 -36097 -235118 118258 -181148 -1813 -372820
9232 -372820 -202761 93652 366241 -54299 -63577 -107235 -47156 -280063 322056 -2247 -117841
9221 -117841 -39204 43411 -72318 -160052 24019 -476640 159733 85742 -308936 46053 -371631
9209 -14021 -407567 242263 -103710 -241106 -100444 -48397 14104 31128 239738 -255480
9198 -113932 66842 33410 36521 -46637 48592 -81508 -262921 -102905 -99845 188849 -106525
9186 -167545 52732 -363005 -136712 -229334 -215449 -122286 27175 -275218 -224382 119017 39233
9174 41210 -240241 -50542 -68638 -137889 -303125 -124163 -91966 94728 -186242 -248514 -237240
$$ packed form
9253B72872j36312J00210a95834c3343j88046B90438c04096a24548o923O3480
9243f7991L1988A14456c49281J47731L3141c6097j99021A18258a81148a813l71007
9232c72820J70059I3652K72589e4299r278m3658d7156k32907C22056b247j15594
9221a17841c9204D3411g2318q7734B4019d76640A59733p3991c08936D6053c71631
9209a4021l93546B42263a03710j37396a00444d8397A4104J7024K08610b55480
9198a13932F6842C3410L111d6637D8592h1508j81413a02905L060A88849a06525
9186a67545E2732c63005a36712r2622J3885R3163B7175b75218N0836A19017C9233
9174D1210b40241e0542j8096o9251j65236a24163L2197I4728a86242o2272J1274
$$ plain form
9163 -237240 -240842 -389086 -83795 183036 14347 42892 -198829 120834 -247047 118275 -45328
9151 115323 -11366 187122 -41792 139599 -221851 16760 14890 -324069 252651 -16773 -97633
9140 -97633 -40292 -196585 -61857 -298723 -66336 -147266 47967 -414235 -227837 -155979 -20907
9128 2031 -105468 -127359 180267 -178833 -155093 71861 -22487 -281184 -3225 108491 -190719
9116 -128493 -49363 151966 441521 198054 -433467 136377 -114528 -70676 -321744 337450
9105 165588 51800 250595 -183476 92083 -137397 -25832 -243882 -167258 162261 193408 -185221
9093 18733 20627 -181288 -244719 -207769 182732 61846 -224505 -231454 -48787 -297014 -243713
9082 -243713 -50377 -242236 -411886 -126302 -367831 -329311 7356 -617685 166256 112986 85921
$$ packed form
9163b37240l602j48244h3795A83036A4347K8545a98829A20834b47047A18275d5328
9151A15323a1366A87122d1792A39599b21851A6760j870c24069B52651a6773q0860
9140i7633d0292j56293f1857k36866f6336q0930D7967d14235J86398P1858b0907
9128B031a05468k1891A80267a78833K3740G1861b2487k58697c225A08491a90719
9116a28493d9363A51966K89555A98054d33467A36377a14528M3852k51068C37450
9105A65588E1800J98795a83476I2083a37397b5832k18050P6624A62261L1147a85221
9093A8733J894a81288o3431L6950A82732F1846b24505o949d8787k48227N3301
9082b43713e0377j91859j69650a26302k41529L8520G356f17685A66256n3270k7065
$$ plain form
9071 85921 -20088 -153419 -203246 -61746 43255 243195 20330 163122 -146838 -189583 -226255
9060 -226255 -83881 59382 10099 -115804 -180507 150764 14773 -79643 -33147 137828 249921
9049 249921 -148300 78294 -5470 -115236 -282844 -65240 -147787 -210983 53426 -44562 -184562
9038 -184562 -4669 113676 57326 -26023 -22917 120444 -65425 82386 23184 -280285 -170724
9027 -170724 -105516 12616 -208313 -84414 43058 84427 76014 333470 16754 63918 -58251
9015 -52327 131185 -87223 75426 -327324 -208015 -186427 -242610 -191988 165370 -339705 16118
9003 76300 -79805 -329029 183218 131098 -341576 -372039 -123375 101152 -241392 -106258
8992 -78528 -250281 -25961 -35177 -26089 -8904 -164911 70860 133369 -213101 -56034 -120826 20097
$$ packed form
9071H5921b0088j33331m9827f1746D3255J99940B0330J42792a46838m2745l6672
9060b26255h3881E9382A0099a15804o4703A50764A4773g9643c3147A37828J12093
9049B49921a48300G8294e470j09766j67608f5240q2547o3196E3426d4562j40000
9038a84562d669A13676n6350b6023L106A20444f5425H2386B3184b80285J09561
9027a70724O5208A2616b08313h4414D3058M1369q413K57456A6754M7164e8251
9015e2327A31185h7223G5426c27324J19309K1588n6183N0622A65370c39705A6118
9003G6300g9805k49224A83218n2120c41576l0463a23375A01152b41392a06258
8992g8528j71753b5961r216R088h904j56007G0860O2509b13101e6034o4792B0097
$$ plain form
8979 -233935 -458209 -165352 -145446 34434 -4376 -136799 83232 296734 -57885 -22869 -296080
8968 -296080 -109393 -451863 -68326 -112977 -30715 -105554 431043 18108 -99663 -280574 -277899
8957 -277899 25709 -21244 63049 82249 140961 -30536 117070 62893 -23009 -85483 82571
8945 8786 124567 -340223 159538 24107 140889 -291477 -159490 -99979 -192150 -198005 90747
8933 78687 73151 -207072 -85010 -91745 81115 85502 -42021 183145 -23631 -100540 80417 78392
8921 78392 193211 -355111 340441 17878 -54484 319588 -255969 103534 39256 -15168 157388
8909 96589 273128 600590 1236372 2451296 1574524 491605 189785 187981 387958 22222
8898 -163835 324908 27515 74891 -82590 -311894 -170191 120716 -61814 -74347 -9167 249505
$$ packed form
8979b33935k24274a65352J9906C4434d376j32423H3232K13502e7885b2869k73211
8968b96080a09393l42470f8326m4651c0715p4839D31043A8108i9663j80911K675
8957b77899B5709b1244F3049J9200N8712c0536A17070n4177b3009o2474H2571
8945H786J15781c40223A59538B4107J16782b91477J31987N9511r2171n855I0747
8933G8687n536b07072h5010o735H1115M387d2021A83145b3631p6909H0417k025
8921G8392J14819c55111C40441A7878e4484C19588b55969A03534C9256a5168A57388
8909I6589J76539L27462O35782J214924q76772D91605A89785j804J99977B2222
8898a63835C24908B7515M7376h2590k29304J41703A20716f1814j2533i167B49505
$$ plain form
8886 -67396 166329 -18660 -139647 38954 47315 -289057 -145617 -110900 49931 -163404 -161197
8875 -161197 -276457 -7613 56577 111619 82000 -138107 -241820 -281817 146467 -138046 -121915
8864 -121915 -85705 -31776 -286756 -193626 39083 97008 -536583 173216 -292740 104912 -92392
8852 -179893 91799 162470 -135930 380381 -233068 -13345 -371424 47791 97208 -214010 99553
8840 106165 406109 16379 -184101 132729 -356078 124258 9306 196016 -101043 -90523
$$ packed form
8886f7396A66329a8660j20987C8954Q361b89057J43440L4717D9931a63404K207
8875a61197j15260g613E6577N5042k9619a38107j03713l9997A46467a38046J6131
8864a21915L6210c1776k54980R3130C9083N7925e36583A73216b92740A04912i2392
8852a79893I1799P0671a35930C80381b33068a3345l58079D7791M9417b14010I9553
8840A06165K99944A6379a84101A32729c56078A24258I306J86710a01043J0520
$$ [...]
##END NTUPLES=NMR SPECTRUM
##END=
