
##TITLE=AC1227_VIERS11107_6074976_PiINvGLfJz
##JCAMPDX= 6.0         $$ Bruker NMR JCAMP-DX V2.0
##DATA TYPE= NMR SPECTRUM
##DATA CLASS= NTUPLES
##ORIGIN= BRUKER
##OWNER= Administrator
$$ 1.72 TOPSPIN		Version 2.1
$$ 2012-05-07 23:00:36.187 -0500  Administrator@TOPSPIN
$$ Compression mode = diff/dup
##.OBSERVE FREQUENCY= 400.13188235
##.OBSERVE NUCLEUS= ^1H
##.ACQUISITION MODE= SIMULTANEOUS (DQD)
##.ACQUISITION SCHEME= undefined
##.AVERAGES= 64
##.DIGITISER RES= 22
##SPECTROMETER/DATA SYSTEM= spect
##.PULSE SEQUENCE= noesygpps1d.comp
##.SOLVENT NAME= COFFEE_meoh
##.SHIFT REFERENCE= INTERNAL, COFFEE_meoh, 1, 14.96655
##AUDIT TRAIL= $$ (NUMBER, WHEN, WHO, WHERE, PROCESS, VERSION, WHAT)
$$ ##TITLE= Audit trail, TOPSPIN		Version 2.1
$$ ##JCAMPDX= 5.01
$$ ##ORIGIN= Bruker BioSpin GmbH
$$ ##OWNER= Administrator
$$ $$ C:\Bruker\TOPSPIN/data/COFFEE/nmr/AC1227_VIERS11107_6074976_PiINvGLfJz/12/pdata/1/auditp.txt
$$ ##AUDIT TRAIL=  $$ (NUMBER, WHEN, WHO, WHERE, PROCESS, VERSION, WHAT)
(   1,<2012-05-07 23:00:30.968 -0500>,<Administrator>,<TOPSPIN>,<go>,<TOPSPIN 2.1>,
      <created by zg
	started at 2012-05-07 22:49:00.593 -0500,
	POWCHK enabled, PULCHK disabled,
       configuration hash MD5:
       AF F2 23 6B 01 CD 40 DD E5 A1 38 A0 06 EA F7 77
       data hash MD5: 64K
       B4 ED 07 AB E4 23 04 3F FB B7 CA 9B 18 7E B8 30>)
(   2,<2012-05-07 23:00:33.734 -0500>,<Administrator>,<TOPSPIN>,<proc1d>,<TOPSPIN 2.1>,
      <Start of raw data processing
       efp LB = 0.3 FT_mod = 6 PKNL = 1 PHC0 = 0 PHC1 = 0 SI = 128K 
       data hash MD5: 128K
       33 B7 81 52 98 FE 4D 66 56 18 40 58 B1 22 49 CC>)
(   3,<2012-05-07 23:00:35.140 -0500>,<Administrator>,<TOPSPIN>,<proc1d>,<TOPSPIN 2.1>,
      <pk PHC0 = 33.5907 PHC1 = 0 
       data hash MD5: 128K
       DF C9 C2 3A A6 BE 97 57 1B 98 17 D4 57 3E 1C 75>)
(   4,<2012-05-07 23:00:35.812 -0500>,<Administrator>,<TOPSPIN>,<proc1d>,<TOPSPIN 2.1>,
      <abs ABSG = 1 
       data hash MD5: 128K
       25 65 2A C2 AB B1 7F CD 59 10 A6 F0 91 8C B4 56>)
(   5,<2012-05-07 23:00:35.906 -0500>,<Administrator>,<TOPSPIN>,<proc1d>,<TOPSPIN 2.1>,
      <abs ABSG = 2 
       data hash MD5: 128K
       59 7C E5 AC 23 97 CD A6 52 06 CE ED 0B F2 16 15>)
(   6,<2012-05-07 23:00:35.968 -0500>,<Administrator>,<TOPSPIN>,<proc1d>,<TOPSPIN 2.1>,
      <abs ABSG = 3 
       data hash MD5: 128K
       AF A6 01 23 83 61 02 D5 03 F3 53 C9 A6 27 CE 3D>)
(   7,<2012-05-07 23:00:36.031 -0500>,<Administrator>,<TOPSPIN>,<proc1d>,<TOPSPIN 2.1>,
      <abs ABSG = 4 
       data hash MD5: 128K
       F2 40 68 0B DC 9C 4F 54 0B 5A 2E F5 96 03 58 51>)
(   8,<2012-05-07 23:00:36.093 -0500>,<Administrator>,<TOPSPIN>,<proc1d>,<TOPSPIN 2.1>,
      <abs ABSG = 5 
       data hash MD5: 128K
       9A 73 32 11 66 11 75 47 F0 31 97 7E 8D 68 97 B4>)
$$ ##END=
$$ 
$$ $$ hash MD5
$$ $$ 92 10 87 68 B0 0B 62 D3 29 E2 89 B8 53 B2 7F 74
##$RELAX= 
##$RELAX= 
##$RELAX= 
##$RELAX= 
##$RELAX= 
##$RELAX= 
##$RELAX= 
##$RELAX= 
$$ Bruker specific parameters
$$ [...]
150 150 150 150 150 150 150 150
##$TP07= 0
##$TPNAME0= <>
##$TPNAME1= <>
##$TPNAME2= <>
##$TPNAME3= <>
##$TPNAME4= <>
##$TPNAME5= <>
##$TPNAME6= <>
##$TPNAME7= <>
##$TPOAL= (0..7)
0.5 0.5 0.5 0.5 0.5 0.5 0.5 0.5
##$TPOFFS= (0..7)
0 0 0 0 0 0 0 0
##$TUNHIN= 0
##$TUNHOUT= 0
##$TUNXOUT= 0
##$USERA1= <user>
##$USERA2= <user>
##$USERA3= <user>
##$USERA4= <user>
##$USERA5= <user>
##$V9= 5
##$VALIST= <valist>
##$VCLIST= <CCCCCCCCCCCCCCC>
##$VD= 0
##$VDLIST= <DDDDDDDDDDDDDDD>
##$VPLIST= <PPPPPPPPPPPPPPP>
##$VTLIST= <TTTTTTTTTTTTTTT>
##$WBST= 1024
##$WBSW= 4
##$XGAIN= (0..3)
0 0 0 0
##$XL= 0
##$YL= 0
##$YMAX_a= 9884653
##$YMIN_a= -4518136
##$ZGOPTNS= <>
##$ZL1= 120
##$ZL2= 120
##$ZL3= 120
##$ZL4= 120
##$ABSF1= 14.96655
##$ABSF2= -5.58598
##$ABSG= 5
##$ABSL= 3
##$ALPHA= 0
##$AQORDER= 0
##$ASSFAC= 0
##$ASSFACI= 0
##$ASSFACX= 0
##$ASSWID= 0
##$AUNMP= <proc_prof1d_extract.lims>
##$AXLEFT= 0
##$AXNAME= <>
##$AXNUC= <1H>
##$AXRIGHT= 0
##$AXTYPE= 0
##$AXUNIT= <>
##$AZFE= 0.1
##$AZFW= 0.1
##$BCFW= 0
##$BC_mod= 0
##$BYTORDP= 0
##$COROFFS= 0
##$CY= 15
##$DATMOD= 1
##$DC= 0
##$DFILT= <>
##$DTYPP= 0
##$F1P= 0
##$F2P= 0
##$FCOR= 0.5
##$FTSIZE= 131072
##$FT_mod= 6
##$GAMMA= 0
##$GB= 0
##$INTBC= 1
##$INTSCL= 1
##$ISEN= 128
##$LB= 0.3
##$LEV0= 0
##$LPBIN= 0
##$MAXI= 10000
##$MC2= 0
##$MEAN= 0
##$ME_mod= 0
##$MI= 0
##$NCOEF= 0
##$NC_proc= -3
##$NLEV= 6
##$NOISF1= 0
##$NOISF2= 0
##$NSP= 0
##$NTH_PI= 0
##$NZP= 0
##$OFFSET= 14.96655
##$PC= 1
##$PHC0= 33.5907
##$PHC1= 0
##$PH_mod= 1
##$PKNL= yes
##$PPARMOD= 0
##$PPDIAG= 0
##$PPIPTYP= 0
##$PPMPNUM= 2147483647
##$PPRESOL= 1
##$PSCAL= 4
##$PSIGN= 0
##$PYNMP= <proc.py>
##$REVERSE= no
##$SF= 400.130005625799
##$SI= 131072
##$SIGF1= 0
##$SIGF2= 0
##$SINO= 400
##$SIOLD= 131072
##$SPECTYP= <>
##$SREGLST= <1H.CDCl3>
##$SSB= 0
##$STSI= 131072
##$STSR= 0
##$SW_p= 8223.68421052632
##$SYMM= 0
##$S_DEV= 0
##$TDeff= 65536
##$TDoff= 0
##$TI= <>
##$TILT= no
##$TM1= 0
##$TM2= 0
##$TOPLEV= 0
##$USERP1= <user>
##$USERP2= <user>
##$USERP3= <user>
##$USERP4= <user>
##$USERP5= <user>
##$WDW= 1
##$XDIM= 131072
##$YMAX_p= 435308072
##$YMIN_p= -98256528
##$CURPLOT= <Network HP LaserJet P1505>
##$CURPRIN= <$Network HP LaserJet P1505>
##$DFORMAT= <normdp>
##$LAYOUT= <+/1D_H.xwp>
##$LFORMAT= <normlp>
##$PFORMAT= <normpl>
##$SURQMSG= 1
$$ End of Bruker specific parameters
$$ ---------------------------------
##NTUPLES= NMR SPECTRUM
##VAR_NAME=  FREQUENCY,     SPECTRUM/REAL,   SPECTRUM/IMAG
##SYMBOL=    X,             R,               I
##VAR_TYPE=  INDEPENDENT,   DEPENDENT,       DEPENDENT
##VAR_FORM=  AFFN,          ASDF,            ASDF
##VAR_DIM=   131072,        131072,          131072
##UNITS=     HZ,            ARBITRARY UNITS, ARBITRARY UNITS
##FACTOR=    0.0627417313425165, 1,          1
##FIRST=     8223.62146879498, 2158,         -74539
##LAST=      0,             2625,            -75180
##MIN=       0,             -98256528,       0
##MAX=       8223.62146879498, 435308072,    0
$$ Real data points
##PAGE= N=1
##DATA TABLE= (X++(R..R)), XYDATA
$$ [...]
67269 527561 528264 530245 531901 531758 529686 526576 523572 522089 523585 528058 533138 536049 536580 536903 538236
67254 538236 539218 538441 537137 537779 540663 543623 545025 545426 546029 547193 549145 552646 557657 562345 564871
67239 564871 565578 566049 566505 565835 564119 563148 563787 564415 563216 560897 559728 560544 562132 563358 564520 566306
67223 566306 568518 570328 571202 571180 570700 570456 571138 573074 576193 580012 583321 584415 582707 579976 578858 579893
67207 579893 581243 581623 582066 583883 586199 587015 586008 584680 584056 583763 583419 583413 583898 584321 584525 585252 586804
67190 586804 588126 588103 587195 586895 587882 589517 590957 592016 592858 593404 593285 592242 590592 589269 589139 590110 591175
67173 591175 591527 591325 591207 591418 591698 591669 591098 590138 589563 590306 592402 594791 596578 598083 600228 603307 606778
67156 606778 609849 611699 611644 609860 607743 606808 607242 607997 608065 607245 606100 605736 607145 609915 612022 611870 610233
67139 610233 609199 609590 610701 612278 615022 618850 622337 624647 626655 629265 631803 633123 633333 633291 633152
67124 633152 632502 631381 630085 628494 626664 625507 625650 625975 624731 622078 620224 620823 623333 626145 628169
67109 628169 628938 628416 627555 628182 631230 635314 637928 638061 637126 637253 639163 641814 643729 644235 643420 641394
67093 641394 638191 634515 631983 631975 634265 637167 639069 639653 639756 640458 642266 644860 647564 650165 653061 656386
67077 656386 659314 660698 660170 658133 655054 651493 648648 647841 649130 651184 652898 654525 656845 659798 662492
67062 662492 664172 664624 663929 662421 660835 660061 660607 662398 664946 667552 669599 671056 672610 674950 677850
67047 677850 680277 681484 681727 681710 681598 681038 680088 679468 679487 679225 677605 675155 673799 674732 677317 680412 683799
67030 683799 687622 691310 694162 696409 698505 699736 698916 696554 695030 696215 699734 703839 707158 709358
67016 709358 710967 712941 715714 718473 720041 720508 720992 721722 721709 720812 720767 723217 727659 732279 736009 738798
67000 738798 740671 741649 742148 742503 742555 742513 743597 746788 751405 755954 759948 763788 767265 769498 770266 770258 770029
66983 770029 769777 770074 771604 774039 776258 777932 779879 782660 785844 789025 792568 796829 801466 806011 810463
66968 810463 814908 819259 823803 829311 836020 843069 849401 854788 859443 863142 865377 866189 866378 866885 868117
66953 868117 869744 871133 872267 874084 877463 882065 886898 891950 898158 905493 912214 916792 919728 922671
66939 922671 926418 930731 935605 941535 948625 956387 964500 973012 981679 989809 996999 1003492 1009574 1015083
66925 1015083 1019917 1024723 1030630 1038202 1046807 1055172 1062556 1069237 1075839 1082497 1089130 1096261 1104814 1114953
66911 1114953 1125812 1136742 1148099 1160204 1172106 1182306 1190552 1198200 1206880 1217434 1230056 1244537
66899 1244537 1260147 1275904 1291362 1306710 1321952 1336588 1350411 1364063 1378295 1393195 1408789
66888 1408789 1425947 1445610 1467065 1487968 1506663 1523957 1542064 1562272 1584258 1607299 1631193
66877 1631193 1655938 1681356 1707423 1734393 1762242 1790439 1818668 1847389 1877359 1908984 1942298
66866 1942298 1976979 2011983 2046010 2079085 2113058 2149572 2188018 2226549 2264697 2303704 2344465
66855 2344465 2386612 2429822 2474551 2520910 2568101 2615789 2665074 2717250 2772320 2829372 2887664
66844 2887664 2946679 3005995 3065914 3127503 3191179 3255960 3320952 3386676 3453816 3521532 3588541
66833 3588541 3655453 3724370 3796204 3869693 3943171 4015949 4087810 4158551 4228554 4298716 4369239
66822 4369239 4439400 4508990 4578952 4649883 4720683 4789424 4854982 4917237 4976275 5032128 5084750
66811 5084750 5133623 5177842 5217309 5253216 5286388 5315422 5337639 5351961 5359995 5363997 5364647 5361243
66799 5361243 5353337 5341222 5324905 5303383 5275472 5241233 5202354 5161028 5118383 5073847 5025873
66788 5025873 4973316 4916312 4855968 4793228 4728092 4660013 4588918 4515560 4440877 4365474 4289890
66777 4289890 4214781 4140210 4065057 3987950 3908971 3829940 3752774 3677875 3604258 3530887 3457642
66766 3457642 3385262 3314695 3246474 3180570 3116690 3054501 2993372 2932238 2870292 2807929 2746623
66755 2746623 2687710 2631446 2577144 2523808 2470635 2417433 2364724 2313050 2262150 2211361 2160917
66744 2160917 2112129 2065893 2021706 1978702 1937006 1897228 1859011 1821138 1783147 1745960 1710587
66733 1710587 1676857 1643771 1610653 1577586 1545108 1513953 1484872 1458105 1432918 1407945 1382242
66722 1382242 1356038 1330514 1306769 1284778 1263179 1240318 1215804 1191016 1167757 1146465 1126042
66711 1126042 1105373 1084452 1063725 1043020 1021904 1000945 981729 965278 950920 936988 922223
66700 922223 906277 889488 872858 857933 845842 836156 826967 816237 803121 788365 773805 761096
66688 761096 750273 739618 727585 714811 703556 695014 687977 680420 671680 662451 653292 644068 634661
66675 634661 625320 616067 606385 595995 585707 577060 570987 566901 563099 557980 550963 542491 533505 524917
66661 524917 517234 510339 503697 497034 490763 485539 481414 477736 473830 469539 465070 460595 456121 451616
66647 451616 447253 443578 441104 439345 436575 431338 424267 417678 413087 409739 405916 400966 395459 389935
66633 389935 384354 378601 372823 367229 362154 358283 356189 355495 354957 353605 351446 348956 346318 343463 340513
66618 340513 337735 335117 332319 329103 325615 322175 318957 315979 313303 311070 309306 307800 306231 304340
66604 304340 301976 299176 296296 293832 291864 289802 287003 283593 280337 277750 275731 274075 272868 272095
66590 272095 271224 269579 267011 264062 261615 260438 260724 261710 261974 260430 257101 252861 248662 245209 242987
66575 242987 242085 241933 241674 240971 240273 240149 240515 240709 240257 239318 238234 236822 234561 231543 228750 226931 225529
66558 225529 223400 220516 218150 217093 216371 214348 210853 207601 206465 207568 209132 209119 207041 204146 201846
66543 201846 200326 199073 198270 198674 200075 200943 200189 198466 197023 195946 194440 192462 191029 190831 191276 191091
66527 191091 189513 186828 184085 182289 181571 181122 180050 178128 175746 173647 172894 174354 177573 180681 182118
66512 182118 182046 181418 180273 177962 174705 171644 169394 167680 166542 166747 168561 171099 173454 175607 177552
66497 177552 178335 176971 174024 171320 170007 169508 168622 167159 166048 165936 166247 166020 165379 165412 166518 167688
66481 167688 167859 167206 166436 165609 164643 164220 164756 164914 162902 159262 156581 155992 155784 154352 152743 152764 153892
66464 153892 154036 152775 151896 152569 153630 153260 151293 149134 147964 147702 147576 147240 147019 147043 146484 144286 140743
66447 140743 137665 136563 137227 138535 139967 141568 143019 143790 144054 144449 144908 144524 142700 139875 137037 135024
66431 135024 134198 134245 134302 133753 132825 131908 130670 128656 126515 125604 126308 127687 128913 130084 131347 132165 131940
66414 131940 130668 128674 126484 125149 125714 127828 129844 130881 131755 133158 134148 133728 132911 133474 135199 136187
66398 136187 135908 135992 137489 139061 138917 137214 135335 133786 132219 130922 130728 131542 132311 132645 133220 134191 134343
66381 134343 132660 129913 127771 126786 126276 125963 126606 128703 131397 133319 134072 134267 134304 133844 132659 131437
66365 131437 131232 132216 133419 133824 133433 133037 133154 133569 133826 133702 133070 131751 129914 128280 127434 127099 126584
66348 126584 125967 126218 127943 130412 132147 132211 130711 128411 126219 124813 124304 124231 124117 123952 123990 124243 124479
66331 124479 124510 124224 123519 122652 122441 123445 124890 125182 123902 122695 123519 126365 129458 131564 133164 135032
66315 135032 136582 136572 135010 133334 132485 131769 130162 127942 126152 124869 123229 121272 120528 122015 124440
66300 124440 125482 124584 123513 124054 125984 127734 128328 127966 127001 125232 122476 119329 116934 116052 116691 118544
66284 118544 121335 124549 127194 128279 127513 125309 122251 118927 116133 114584 114146 113800 112806 111672 111617 113207
66268 113207 115808 118319 120222 121946 124267 127211 129601 130113 128950 127874 128200 129290 129658 129093 128743
66253 128743 129257 129892 129696 128723 127671 126999 126920 127710 129320 130940 131606 131208 130413 129660 128733 127447 126228
66236 126228 125585 125266 124468 123006 121790 121799 122838 123870 124458 125154 126346 127556 128409 129473 131217 132679
66220 132679 132396 130539 128917 128718 129318 129647 129587 129430 129044 128447 128421 129511 130926 131455 131130 131002 131601 132642
66202 132642 134021 135892 137625 137951 136643 135056 134344 133962 132806 131248 130864 132176 133697 133704 132364 131415
66186 131415 131911 133000 133218 132479 132100 132913 134063 134030 132383 130041 128160 127348 127776 129376 131741 134246
66170 134246 136421 138001 138740 138558 137759 136604 134795 132070 129327 128304 129717 132329 134301 134931 134645
66155 134645 133972 133289 133204 134217 136048 137915 139442 140627 141037 140003 137942 136694 137881 141265 145197
66140 145197 148423 150908 153173 155476 157712 159578 160676 160919 161016 162039 164011 165293 164058 160391 156309
66125 156309 153557 152070 151006 150483 151248 152794 153093 150872 147487 145700 146846 149807 152660 154538 155736
66110 155736 156733 157707 158729 159860 161005 162006 162886 163733 164300 164068 162964 161836 161857 163409 165646 167150
66094 167150 166901 164792 161606 158654 157058 157087 158231 159950 162056 164219 165602 165537 164380 163196 162635 162585
66078 162585 162820 163384 164317 165569 167290 169529 171533 172180 171531 171120 172122 173895 175170 175937 176984 177917
66062 177917 177109 173967 170098 167592 166896 167097 167687 169136 171812 175120 178015 180063 181679 183391 185059
66047 185059 186017 185928 185193 184373 183530 182459 181291 180421 180017 180143 181200 183533 186474 188490 188559 187018 184982
66030 184982 183572 183846 186541 191152 195769 198625 199635 199914 200020 199304 197007 193460 190089 188428 189090
66015 189090 191399 193923 195490 195735 194934 193683 192655 192016 190983 188604 185285 182884 182823 184732 187344
66000 187344 189914 192034 192959 192399 191524 191833 193092 193631 192748 191526 190990 190752 190148 189688 190451 192646 195592
65983 195592 198701 201759 204547 206926 209218 211933 215050 217881 219706 220336 220146 219710 219375 219210 219412 220560
65967 220560 223014 226188 229041 231403 234202 238121 242587 246459 249238 251184 252667 253942 255307 256952
65953 256952 258745 260380 261692 262664 263299 263584 263389 262531 261415 261489 264217 269346 274913 279369 282998 286889
65937 286889 291413 296403 301978 308105 313874 318279 321450 324121 326180 326849 326276 325795 326308 327300 327754 327303
65921 327303 326091 324125 321228 317297 312366 306759 301375 297446 295682 295637 295888 294898 292186 288981 287219
65906 287219 287291 287370 285789 283527 283049 284898 286986 287517 287113 287323 288343 289290 289796 290138 290442 290932 292747
65889 292747 297327 304868 314125 323704 332791 340630 346210 349099 350328 351998 355848 361989 368877 374618
65875 374618 378539 381491 384692 388596 392887 397011 400313 402206 402886 403701 406137 410389 415265 419399 422149
65860 422149 423593 424436 426000 429523 434952 440829 445823 450094 454697 459808 464224 466793 467809 468454 469104
65845 469104 468954 467470 465472 464214 463879 463711 463304 462714 461296 457646 451359 444106 438144 434029 430316
65830 430316 425231 418151 409794 401519 394341 388270 382685 377342 372430 367503 361426 354155 347591 343430
65816 343430 340762 337256 332469 328370 326422 325850 325436 325470 326776 328833 330230 330442 329929 328825 326759 324045
65800 324045 321975 321614 322886 325011 327245 329075 330344 331485 333178 335550 338043 340178 341899 342926
65786 342926 342465 340245 337485 336187 337432 340791 345127 349274 351919 351854 349158 345787 344148 344934 346744
65771 346744 347952 348467 349487 351982 355894 360561 365339 369716 373415 376820 381016 386872 394013 401034
65757 401034 406869 411512 415196 417407 417512 416174 415102 414951 414304 411507 407020 403005 400810 399876 399131
65742 399131 398314 397555 396634 395393 394208 393348 392415 391095 389923 389506 389491 389321 389727 392334 397764 405095 413328
65725 413328 422399 432489 443345 454799 467144 480444 494110 507682 521349 535106 548099 559541
65713 559541 569609 578444 584788 586845 584463 579339 572943 565248 555777 544868 533325 521622 510205
65700 510205 499992 491895 486316 483788 485478 491986 501849 512465 522737 533901 547604 564212 583469
65687 583469 605474 629885 654932 678662 700987 723214 745476 765897 782593 795317 804482 809714
65675 809714 810297 806220 797697 784239 765552 743078 719267 695068 669340 641209 612004 584103
65663 584103 558571 534752 511856 490117 470364 453059 437905 424194 411463 399906 390051 381936
65651 381936 374847 368073 361672 356205 351875 348295 345005 341801 338546 335067 331491 328478 326815 326688
65637 326688 327420 327948 327599 326546 325639 325803 327407 330088 333181 336378 339916 344117 348968 354337 360358
65622 360358 367206 374721 382897 392649 405160 420183 436012 451832 469175 489891 513366 537290
65610 537290 560991 586356 615102 646634 679382 712916 747539 782532 816069 846614 873504
65599 873504 896363 914852 929088 939724 947497 952966 956477 958118 957923 956389 954372 952232 949750
65586 949750 947277 946081 946556 946725 943716 936465 925862 912432 895247 873445 847731 819838 791099
65573 791099 761840 731586 699732 666633 634043 603763 575804 548811 522315 497378 474777
65562 474777 453956 434489 417228 402864 390421 378563 367698 359149 352612 346052 338415 331000
65550 331000 325671 322706 320972 319288 316922 313519 309468 306080 304577 304896 305871 306509 306719 306839 306948 306834
65534 306834 306517 306633 308140 311411 315624 319437 322579 326454 332696 341208 350205 358376 366508 376604
65520 376604 389726 405209 421881 439509 458901 481004 506175 533990 563408 593231 622715
65509 622715 651668 679743 705864 728719 747701 762963 774587 782141 785016 782709 774652 760339
65497 760339 740028 715082 687360 658416 629298 600648 572718 545580 519652 495775 474494
65486 474494 455501 438003 421431 405633 390739 377078 364924 354051 343912 334526 326706 321044
65474 321044 317106 314069 311558 309274 306446 302602 298491 295203 292541 289270 284898 280138 275596 271225
65460 271225 267341 264911 264161 263805 262394 259742 256481 253079 250075 248497 248925 250428 251359 251044 250093 249382
65444 249382 249434 250379 251534 251321 248661 244622 241766 241634 243535 245882 247882 249639 251479 253879 257550
65429 257550 262851 269139 275066 279549 282346 283946 285203 286966 289666 292925 295623 296672 296070 294977
65415 294977 294322 293494 291226 287819 285262 284445 283423 279879 274582 270602 269158 268043 264692 259220 253599
65400 253599 249197 246306 245057 245308 245998 245839 244630 243184 242226 242107 243116 245073 246884 247639 248117 250082
65384 250082 253902 257867 260238 261081 261674 262989 265415 269143 273826 278208 281114 282806 284621 287123 289433
65369 289433 290713 291558 293086 294977 295455 293530 290461 288328 287628 287134 285978 284878 284997 286369 288083
65354 288083 289563 291032 292902 295226 297713 299870 301155 301363 300922 300568 300632 300707 300034 298361 296599 296376
65338 296376 298417 301475 303593 304467 305729 308568 312102 314664 315730 315657 314495 312317 310118 308925 308350
65323 308350 307408 306591 307553 310578 313841 315584 315721 314891 313426 312024 312063 314067 316796 319036 321493 325632
65307 325632 331217 336411 340243 343705 348192 353766 359391 364279 368647 373409 379406 386904 395818 406221
65293 406221 418163 430883 442807 452670 460234 465679 469093 471109 473099 475510 476439 473281 466046 457908
65279 457908 451937 447975 443312 435904 426199 415888 405613 394470 381787 368848 358217 351317 347226
65266 347226 344071 341031 338606 337469 337676 338637 339261 338387 335669 331866 327789 323320 318081 312613 308011
65251 308011 304570 301703 299153 297291 296030 294344 291297 287003 282292 277963 274571 272412 271360 271091
65237 271091 271692 273641 277069 281385 285702 289230 291271 291492 290379 288932 287786 287068 286957 287535 288027 287257
65221 287257 285359 284131 284956 287106 288851 289642 290254 291268 292542 294105 296483 299752 302987 305171 306325
65206 306325 307375 308968 310657 311307 310307 308338 306776 306297 306381 306346 306432 307343 308947 310161 310438 310844 313062
65189 313062 317289 321522 323242 321706 318329 314975 312354 310171 308075 305839 302972 299073 294595 290488
65175 290488 287007 283621 280360 278440 278951 281396 284087 285621 285596 284416 283083 282801 283911 285176 284763
65160 284763 282145 278584 275687 273885 272602 271491 270983 271496 272484 272732 271666 269980 268636 267680 266647
65145 266647 265810 266066 267440 268747 269158 269238 269766 270308 269857 268415 266988 266276 266178 266347 266371 265572 263681 261802
65127 261802 261779 264197 267637 270226 271421 272021 272960 274504 276296 277814 278929 280129 282025 284542 286872
65112 286872 288282 288665 288274 287308 285971 284730 284302 285295 287630 290179 291388 290775 289562 289300 290093 290921
65096 290921 291481 292684 295120 298098 300772 303440 306969 311391 315775 319280 321850 324120 327077 331569
65082 331569 337723 345052 353314 362685 372633 381388 387589 392137 397321 404134 411526 418481 425591 433813
65068 433813 442553 450049 455412 459493 463760 468986 475024 481204 486743 491239 495014 498591 501639 502812
65054 502812 500985 496384 490143 483055 475253 466963 458804 451046 443098 434341 425193 416720 409088 401028
65040 401028 391289 380256 369590 360395 352408 345069 338509 332815 326970 319804 312116 306737 305777 308437
65026 308437 312062 314709 315836 315207 312579 308592 304729 301902 299910 298685 299130 301951 306263 310194 312572
65011 312572 313420 313092 311673 309182 305880 302321 299300 297510 297015 297373 298467 300689 303868 306705 307960
64996 307960 307811 307349 307128 306882 306211 304639 301484 296824 292420 290412 290950 292113 292315 291728 291176 290742 290044
64979 290044 288973 287653 286358 285657 285749 285439 282985 278572 274750 273495 273885 273689 272217 270285 268209 265650
64963 265650 263257 262761 264923 268480 271473 272808 272355 270567 268569 267851 269105 271580 273952 275669 277309
64948 277309 279886 283905 288861 293659 297800 301949 306923 312363 317195 321298 325713 330896 335684 338634
64934 338634 339767 340280 341030 342076 343412 345283 347723 350404 353127 356054 359372 363163 367612 372849 378428
64919 378428 383517 387890 392184 396584 399688 399575 396007 390713 385214 379206 371752 363370 355808 349936
64905 349936 344977 340074 335563 332134 329540 327019 324509 322519 320890 318630 315191 311325 308311 306719
64891 306719 306192 306186 306532 307169 307489 306350 303233 299331 296816 296625 297474 297544 296627 295853 295846 296258 297010 298652 301081
64872 301081 303008 303408 302798 302335 302293 302230 302188 302706 303670 304001 302689 299694 295796 292104 289757 289460 290921
64855 290921 293029 294868 296400 298066 300056 302258 304680 307554 311046 315098 319569 324374 329417 334621
64841 334621 340137 346423 353891 362371 371126 379610 388229 398179 410326 424241 438393 451381 463083
64828 463083 474617 487103 500444 513493 525523 537172 549383 561426 570593 574313 572408 566975
64816 566975 560292 553171 545163 535791 525310 514517 504162 494609 486005 478579 472560 467736 463382
64803 463382 458791 453808 448746 444085 440325 437646 435146 430816 423154 413014 403163 395689 390205 384838
64789 384838 378435 371375 364689 358970 354073 349391 344442 339406 334968 331471 328531 325760 323444 322036
64775 322036 321285 320459 319202 317602 315672 313520 311926 311908 313608 316212 318940 321367 322917 323193 323010 323890
64759 323890 326094 328346 330158 333076 338552 345688 352483 358390 364079 369307 373030 375592 378937 384209
64745 384209 390548 396684 402387 407694 411954 414529 415685 416116 416197 416045 415587 414242 411414 407587 403941
64730 403941 400643 396848 392871 390748 391584 393766 395199 396116 398128 401459 404900 407802 410217 411565 411228
64715 411228 410427 411495 414976 419259 423538 429221 437483 447049 455649 462533 468394 473841 479404 486354
64701 486354 495958 507856 520279 532107 543864 556522 570073 583683 596761 609247 620969 631303
64689 631303 639898 647569 655826 665180 674177 680413 682325 679799 673617 664895 654705 643453 630765
64676 630765 616588 602196 589336 578503 568862 559812 551731 545095 539686 535073 531383 529456 530404
64663 530404 534516 540047 543919 544845 545196 548170 553514 558076 560604 563587 569579 577889 586228 593661 600245
64648 600245 605324 608144 609221 609319 607841 603847 597752 590192 579967 565316 547043 528380 511657
64635 511657 496863 483504 471889 462073 453226 444881 437610 431860 427204 423299 420489 418848 417633
64622 417633 416330 415435 415599 416744 418459 420555 422834 425097 427855 432166 438204 444715 450401 455218 459834
64607 459834 464524 469108 473232 476048 476371 473877 469727 465434 461625 458438 456309 455380 454619 452629 449342
64592 449342 446165 444425 444294 445219 446764 448820 451391 454462 458038 462288 467611 474320 482120 490200 498068
64577 498068 506041 514717 524195 534049 543854 553501 563099 572727 582150 590738 597805 602941 605788 605772 602599
64562 602599 596938 589926 582004 572916 562749 552066 540886 528701 515931 504234 494632 486312 478227
64549 478227 471033 466210 463837 462516 461241 460062 458909 456980 453752 449845 446531 444863 445397 448086
64535 448086 452203 456803 461517 466530 471728 476397 480022 483089 486813 492232 499649 508811 519525 532078
64521 532078 546942 564010 582413 601239 620105 638813 656832 673544 688703 702372 714681
64510 714681 725964 736478 745413 750676 750534 745194 736114 724161 709469 692823 675902 659910 644887
64497 644887 630613 617304 605110 593787 583341 574169 566109 558129 549598 541209 533950 527791 522244
64484 522244 517796 515681 516210 518233 520500 522789 525150 526602 525443 520964 514236 506818 499197 491077
64470 491077 482929 476145 471299 467174 462292 456792 451876 447977 444622 441942 440779 440989 440871 439029 435877
64455 435877 432640 429716 426907 424602 423650 424364 426454 429707 433932 438498 442842 447389 453100 460064 467377
64440 467377 474608 482540 491938 502153 511578 519340 526045 532830 539982 546720 552325 557174 562199 567332
64426 567332 571219 573118 574541 577998 584110 590957 596547 600869 604853 608273 609975 609770 608769 607623
64412 607623 605603 602045 597809 594487 592727 592338 593686 597717 604301 611681 618295 624474 631458 639083
64398 639083 645502 649293 650997 652192 653711 655354 656991 659131 662302 666406 671141 676899 684790 695590
64384 695590 708900 723666 739518 757221 777709 801014 826469 853764 883358 915893 951602
64373 951602 990519 1033066 1080231 1133082 1192052 1256759 1326709 1402208 1484394 1574432 1673136
64362 1673136 1781439 1900345 2029660 2167144 2309669 2454887 2600974 2745023 2882915
64353 2882915 3011022 3127226 3230109 3318101 3389735 3443776 3478524 3491903 3483014 3453126 3404626
64342 3404626 3339529 3259325 3165173 3057303 2935082 2798970 2652169 2499436 2344733 2191094
64332 2191094 2042167 1902063 1773194 1655397 1547553 1449155 1360043 1279732 1207774 1144065
64322 1144065 1088184 1038959 995239 956617 922915 893416 867165 843580 822291 802730 784440
64311 784440 767423 751610 736105 719542 701241 681784 662511 644606 628379 613136 597851
64300 597851 582213 566810 552207 538298 524824 512127 500924 491735 484978 481177 480366 481449 482805
64287 482805 483626 484260 485393 487294 489581 491083 490207 486229 480252 474196 468868 463857 459165 455711 453787
64272 453787 452201 449698 446420 443224 440476 438569 438726 441764 446342 450019 452185 454589 458681 463757
64258 463757 468353 472215 475984 479876 483675 487273 490167 491023 488990 485107 481173 477306 471885 463951
64244 463951 454438 444737 435279 426087 417648 410329 403698 397306 391644 387415 384219 380831 376659 372209
64230 372209 368173 364785 362236 361137 362287 366038 371734 377663 381985 384184 385414 387093 389553 392568
64216 392568 396508 401909 408190 414024 419228 425141 432636 440612 447154 451589 454755 457735 461007 464529
64202 464529 467885 470328 471221 470630 469322 468223 467894 468201 468287 467178 464731 461693 458534 454642 449192 442568
64186 442568 436312 431731 429124 428270 428903 430351 431376 431152 430428 431165 434708 440454 446581 451994 457258
64171 457258 463670 471972 482284 494650 508657 522574 534052 542376 549445 557862 568345 579514
64159 579514 589786 598728 606699 613886 619786 623234 622999 618826 611781 603134 593125 581495 568922
64146 568922 556932 546303 536603 527588 519895 513564 506845 497775 486715 476226 468391 463108 459150
64133 459150 456012 454189 454167 455743 458168 460654 462980 465988 471214 479453 489498 498690 504923 507938
64119 507938 508540 506995 502724 495498 486299 476785 468285 461459 456259 451567 445342 436163 424863 413983
64105 413983 405424 399188 394439 390765 387831 384719 380747 376553 373303 370985 368629 366298 365586 367494
64091 367494 370762 373309 374818 376873 380679 385609 390317 394574 399496 406122 414010 421081 424858 424343
64077 424343 420988 417610 415957 415367 413946 410729 406363 402051 398589 396473 396067 397057 398289 398904 399452
64062 399452 401169 404300 407932 411548 415765 421073 426763 431896 436735 442320 449092 456938 466265 477650
64048 477650 490297 502064 511506 518809 524227 526953 526722 525501 525990 528700 531987 534976 538907 545106
64034 545106 552820 559865 564560 566234 564610 559814 552839 545091 537292 529134 519986 509595 498384 487459
64020 487459 478034 470305 463131 455472 447959 442267 439025 437265 436079 435655 436074 436089 434293 431190 428927
64005 428927 428893 430462 432249 433598 434369 434191 432975 431830 432437 435307 439381 443541 447840 452741 457694
63990 457694 461275 462795 463236 464342 466998 470600 473755 475396 475449 474826 474861 476459 479413 482522 484585 485463
63974 485463 486013 486953 488038 488644 488874 489579 491309 493857 496945 500694 504997 509005 511887 513822 515640
63959 515640 517757 520115 522853 526072 528931 529929 528475 525439 521854 517864 513475 509564 507191 506197 505345
63944 505345 503824 501988 500570 499689 498791 497254 495085 493298 493551 496905 502754 509189 514532 518516 522115
63929 522115 526496 532109 538525 545132 552027 560187 570615 583418 597742 612471 626887 640882 654647
63916 654647 668128 680998 693505 706995 722688 739872 756431 771700 787733 806893 829077
63905 829077 852396 875937 900580 927657 958224 993368 1033629 1078083 1125491 1176402 1232550
63894 1232550 1293995 1358887 1427019 1501833 1587462 1685039 1793419 1912502 2043972 2189129
63884 2189129 2347656 2518500 2700465 2891639 3089496 3292037 3498026 3705663 3911564
63875 3911564 4111307 4300572 4475620 4633220 4770388 4884152 4971782 5031542 5062871 5065301
63865 5065301 5037598 4978740 4889498 4772304 4629966 4465719 4284363 4091735 3892253 3687977
63855 3687977 3480779 3274387 3073164 2879396 2693109 2514571 2345963 2190240 2048954
63846 2048954 1921605 1806705 1702943 1609437 1525466 1450439 1384111 1326407 1276739 1233576 1194977
63835 1194977 1159652 1127401 1098581 1073247 1050747 1029976 1010154 991583 975580 963416 955274
63824 955274 950219 946933 944288 941663 939307 938347 939936 944318 951023 959911 971536 986529 1005014 1026665
63810 1026665 1050920 1077171 1105262 1135832 1169711 1206912 1246729 1288799 1333382 1380398 1428809
63799 1428809 1477280 1524898 1570945 1614566 1655071 1692102 1725187 1753762 1778086 1799361 1817989
63788 1817989 1832034 1838354 1835297 1823600 1804777 1779664 1748888 1713911 1676513 1637258 1595114 1548957
63776 1548957 1499259 1447975 1396831 1346141 1295457 1244886 1195287 1147424 1101639 1058305 1017808
63765 1017808 979838 943518 908758 876846 848991 824745 802617 781912 762981 745708 728817
63754 728817 711141 692912 675261 658802 643296 628501 614772 602629 592065 582517 573416 564515
63742 564515 555699 546809 537870 529231 521091 512982 504185 494765 485727 477918 471159 464796 458785 453836
63728 453836 450578 448882 447928 446738 444780 442224 439511 436664 433327 429501 425789 422691 420081 417650
63714 417650 415334 413023 410399 407616 405602 404987 405144 405091 405017 406006 408314 410706 411563 410017 406192 401214
63698 401214 397075 395628 397248 400791 404708 407714 408808 407864 406350 406287 408098 410449 412475 414950 418580
63683 418580 422494 425570 428344 432172 436989 441314 444358 446894 449902 453495 457387 461475 465530 469077
63669 469077 472074 475213 479235 484358 490580 497955 506179 514364 521662 527833 532992 537219 540788 544244
63655 544244 547629 549903 549840 547477 544043 540412 536354 531635 527071 523719 521325 518559 514928 511538 509456
63640 509456 508141 506441 504743 504879 507700 511850 515483 518337 521335 524871 528657 532953 538694 546013
63626 546013 553461 559216 562646 564396 565381 566068 566526 566852 567605 569824 574265 580547 587375 593774 599723
63611 599723 605439 610585 614669 617920 621170 624905 628729 631704 632950 632034 629230 625436 621533 617663
63597 617663 613378 608548 603877 600195 597418 594559 590938 587194 584808 584692 586578 589781 594108 599704
63583 599704 606496 614296 623134 632855 642668 651979 661656 673383 687446 702098 715695 728598 742304
63570 742304 757575 774443 793285 814395 836670 858196 878482 899135 922042 947869 976691
63559 976691 1008958 1044951 1083917 1124610 1166520 1210081 1255926 1304338 1355101 1407457 1460455
63548 1460455 1513609 1566802 1619067 1667807 1709760 1742603 1765393 1777984 1780819 1775300 1763735 1748665
63536 1748665 1732131 1715161 1697463 1677789 1655038 1628925 1599447 1566195 1528820 1487986 1445303
63525 1445303 1402427 1360710 1321442 1285663 1253623 1224930 1199349 1177068 1158241 1142737 1130392
63514 1130392 1121151 1115017 1112191 1113018 1117271 1123767 1131482 1140942 1153659 1170026 1188589 1207732 1227386
63501 1227386 1248615 1272028 1297170 1323374 1351017 1381967 1418476 1461158 1508206 1557212 1607562
63490 1607562 1660295 1716020 1774367 1835511 1900260 1967238 2030773 2082919 2117627 2133002 2130851
63479 2130851 2115310 2091292 2062735 2031877 2000284 1969724 1941171 1913614 1884959 1853752 1819126
63468 1819126 1779759 1734450 1683759 1629784 1574274 1518086 1462455 1409163 1358860 1310520 1263366
63457 1263366 1218394 1177139 1139778 1105390 1073519 1044458 1018217 994134 971584 950422 930708
63446 930708 912468 895854 881103 868103 856243 844913 834100 824234 815320 806524 797084 787537
63434 787537 779299 772787 766818 760565 755242 752579 752024 750962 747885 744080 741816 742108 744850 749865 756685
63419 756685 763953 770122 774647 777970 780740 783504 786605 789669 791512 791151 788717 785157 781576 779134
63405 779134 778756 780213 782116 783518 784958 787330 790616 794656 800158 807423 814659 819367 821469 823686
63391 823686 828684 837206 849097 864459 883033 903691 925497 948505 973022 999105 1027566 1060369
63379 1060369 1098966 1142885 1191060 1243952 1303025 1368060 1435812 1501252 1559544 1607369 1643786
63368 1643786 1670502 1690773 1707625 1723284 1740055 1760836 1788226 1823277 1865217 1912140 1962014
63357 1962014 2013544 2066227 2119178 2169738 2213685 2247202 2268524 2277768 2275801 2263887 2244008 2218666
63345 2218666 2189996 2159311 2127459 2094980 2061496 2025331 1984556 1938695 1889076 1837317 1783816
63334 1783816 1728117 1670584 1613187 1558455 1507941 1461846 1419810 1381698 1347645 1317721 1291900
63323 1291900 1270382 1253683 1241981 1234383 1229316 1226116 1225971 1230769 1241023 1255496 1272873 1293094
63311 1293094 1316679 1343365 1372128 1402367 1434522 1469602 1508510 1551659 1598705 1648568 1700156
63300 1700156 1753316 1808909 1867840 1929960 1993608 2055832 2113269 2163397 2205151 2238144 2261405
63289 2261405 2273300 2272809 2260643 2239222 2211932 2182150 2151996 2121484 2089192 2054041 2016040 1975200
63277 1975200 1930582 1881153 1827311 1770889 1713816 1657288 1602042 1548675 1497699 1449854 1406415
63266 1406415 1368508 1335946 1307426 1282379 1262196 1248903 1242307 1238447 1230897 1213970 1185548 1147651
63254 1147651 1104645 1060781 1019005 981111 947952 919233 893690 869984 847405 825795 805305
63243 805305 786396 769492 754203 739328 724099 709117 695622 684101 674082 664925 656191 647504
63231 647504 638897 631203 625229 620350 614748 607423 599300 591834 585210 578656 572089 566422 562185 558739
63217 558739 555278 552031 549838 548786 547892 546225 543840 541418 539427 538065 537725 538834 541133 543674 545819
63202 545819 547874 550495 553817 557472 561056 564111 565999 566422 565934 565433 565246 565224 565463 566204 567086 567399 567239
63185 567239 567569 568852 570492 572085 574322 577845 581900 585167 587602 590436 594382 598818 602964 607103
63171 607103 612254 619131 627702 637299 646825 655228 662190 668193 673650 678304 681842 684854 688522 693172
63157 693172 697580 700100 700453 700158 701195 704351 708811 713008 715732 716690 716363 715408 714096 712333 710264
63142 710264 708606 708130 708968 710656 712765 715248 718426 722984 729686 738524 748422 758541 769732 783578
63128 783578 799810 815807 829415 841386 854071 868296 882636 895561 907173 918618 930512
63117 930512 942296 952844 961576 969088 976557 984287 991180 995902 998113 998104 995796 990937 983932 975550
63103 975550 965893 954416 940866 925432 908186 889376 870197 852085 834942 817177 798018 778927
63091 778927 762170 748683 737840 728595 720216 712430 705504 699880 695406 691385 687623 684825 683586
63078 683586 683604 684210 684953 685360 685144 685285 687757 693189 699768 705656 711557 719250 728245 735993 741497 746740
63062 746740 753878 762556 771001 778563 786129 794770 804938 816471 828572 840289 851653 863888 877830
63049 877830 892692 907138 921048 935229 949838 964241 978327 992819 1008111 1023773 1039472
63038 1039472 1055395 1071313 1086131 1099073 1110617 1121361 1130347 1135504 1135809 1132311 1126876 1120483 1112845
63025 1112845 1103140 1090766 1075795 1059146 1042276 1026395 1011905 998551 986002 974288 963886
63014 963886 955426 949039 943888 938700 933050 927834 924120 921720 919404 916554 914156 913946 916939 922934
63000 922934 931063 940314 949675 958468 966999 976662 988805 1003284 1018371 1032439 1045709 1060070 1077128
62987 1077128 1096675 1117136 1137193 1156698 1176225 1196135 1216203 1235920 1255026 1273748 1292538
62976 1292538 1311548 1330383 1348275 1364238 1377078 1385702 1389855 1390417 1388674 1385392 1380789 1375080 1368485
62963 1368485 1360802 1351533 1340569 1328364 1315422 1302156 1289347 1278138 1269216 1262435 1257589 1255150
62951 1255150 1255753 1259357 1265544 1274445 1286603 1301704 1318062 1333790 1348350 1362723 1378191 1395151
62939 1395151 1412896 1430200 1446022 1459888 1471919 1482715 1493196 1504269 1516187 1527940 1537524
62928 1537524 1543323 1545430 1545329 1544053 1540900 1534246 1523336 1508747 1491238 1470828 1447213 1420497 1391226
62915 1391226 1360172 1328514 1297747 1268855 1241730 1215734 1190542 1166175 1142723 1120557 1100406
62904 1100406 1082562 1066370 1051079 1036763 1023625 1010858 997253 982746 968304 954374 940467
62893 940467 926260 911955 897512 882775 868551 856272 846158 836914 827597 818430 809256 798943
62881 798943 787368 776471 767835 760406 752242 743610 736493 731611 727747 723831 719895 715919 711418 706564
62867 706564 702364 699303 696923 694935 693625 692881 692059 691187 691151 692233 693587 694667 696085 698478 701600
62852 701600 705252 710011 716120 722498 727921 732521 737147 741751 745439 747758 749031 749804 751010 754349
62838 754349 761164 770673 780351 788551 796072 804581 814046 822464 827906 830193 830350 829015 825966 821101
62824 821101 815153 808974 802555 795359 787481 779742 772579 765481 757774 749412 740779 732199 723920 716098
62810 716098 708500 700699 692892 686005 680635 676346 672472 669079 666577 664815 663243 661667 660126 658238
62796 658238 655427 651862 648546 646306 645116 644496 644138 643899 643521 642677 641408 640441 640835 642879 645311 646139
62780 646139 644593 641943 640058 639609 640072 640907 641910 642726 642991 643000 643383 643996 644012 643497 644055 647051 651636 655386
62762 655386 656893 656994 657285 658160 658961 659578 660862 663115 665034 664996 663129 661356 661427 663617 667290 671699
62746 671699 675873 678762 680357 682028 684876 688164 690231 690637 690558 691294 693376 697002 702208 708384 714498
62731 714498 720193 725978 732253 739020 746911 757420 771327 787591 804667 822436 841946 863535
62719 863535 886137 908374 929506 949240 967536 984886 1001969 1018300 1031740 1040340 1044669 1047472
62707 1047472 1050604 1052841 1051272 1044403 1033063 1018585 1001402 982001 962081 943436 925933 907761
62695 907761 887841 867116 847278 829046 812047 795603 779194 762784 747204 733677 722441
62684 722441 712351 702301 692453 683456 675232 667504 661019 656875 654747 652983 650688 648478 646841 645057
62670 645057 642644 640877 641577 644794 648814 652313 655524 659260 663815 669084 674958 681157 687376 693989
62656 693989 701956 711521 721686 731821 743309 758489 777897 799547 821300 843116 866437 892048
62644 892048 919465 948185 978491 1010691 1044284 1078522 1113490 1149935 1187897 1226076 1262917
62633 1262917 1297961 1331574 1363384 1391570 1413945 1429416 1438164 1440890 1438359 1431214 1419453 1402099
62621 1402099 1378130 1347938 1313372 1276364 1238214 1200174 1163423 1127644 1090664 1050906 1009952
62610 1009952 971564 938271 909940 885453 864114 844839 825583 805039 784400 766213 751698
62599 751698 739981 729669 720010 710546 700924 691516 683254 676097 668418 658886 648541 639921 634098
62586 634098 629562 624342 618356 612969 608857 605351 601811 598621 596318 594476 592278 590026 589284 591221
62572 591221 595170 599022 600874 600159 597517 593916 589904 585459 580507 575613 572072 571114 572823 575844 578295
62557 578295 579280 579662 581186 584607 588820 592185 594530 597200 600965 604627 606311 605724 604489 604499 606634
62542 606634 610930 617011 624038 631041 637821 645033 652979 660940 668275 675588 683849 692645 700353 706096
62528 706096 710606 714915 718990 722067 723576 723224 720812 716675 711779 706652 700580 692730 683755 675300
62514 675300 667868 660202 651108 641020 631218 622233 613860 606345 600640 597338 595917 595135 593811 591169
62500 591169 587121 582637 579510 579024 580656 582433 582792 581857 580770 580192 580066 580559 582225 584888 587230 588255
62484 588255 588596 589497 590929 591933 592762 595318 600890 608505 616207 623134 629445 635023 639517 643431 647968
62469 647968 653660 660054 666964 675173 685438 697369 709797 721952 734058 747102 762276 780270
62457 780270 800759 822726 845495 869154 893787 918670 942660 965223 986721 1007766 1028655
62446 1028655 1049350 1069459 1087972 1103385 1114626 1121985 1126920 1130784 1133801 1135254 1134442 1131346 1126764
62433 1126764 1122304 1120153 1122190 1128947 1139632 1153359 1170072 1190123 1213410 1239315 1267236 1296668
62421 1296668 1326917 1357238 1387288 1417149 1446836 1475885 1503166 1526778 1544465 1554819 1558187
62410 1558187 1555980 1548943 1536326 1516742 1489544 1455513 1416599 1374980 1331926 1287470 1241411 1194428
62398 1194428 1147826 1102413 1058349 1016112 976863 941626 910656 883734 860497 840267 822236
62387 822236 806188 792587 781707 773186 766568 761480 756969 751617 745011 738352 732875 728410 724373
62374 724373 721376 720487 721257 721794 720759 718118 714071 708703 702985 698602 695978 693588 690036 685874 682426
62359 682426 679752 677011 674286 672646 672525 673191 673822 674056 673452 671677 669633 669257 671449 674917 677756 679566
62343 679566 681267 683432 685724 687689 689219 690341 691401 693463 697644 703880 711069 718628 727158 737237
62329 737237 748458 760215 772746 786503 800898 814644 827395 840339 855033 872197 891783
62318 891783 913640 937683 963635 991043 1019717 1050131 1083218 1119568 1158790 1199953 1242787
62307 1242787 1288155 1337313 1391192 1450640 1516586 1589244 1667598 1750515 1837977 1930192 2025702
62296 2025702 2121522 2215129 2305034 2389140 2464029 2526821 2576707 2613707 2636922 2645362 2639878 2622736
62284 2622736 2595329 2557607 2509811 2453482 2390301 2321053 2246459 2168330 2089150 2010986 1935345
62273 1935345 1863634 1796928 1735404 1678628 1626434 1579000 1536026 1496314 1458477 1421880 1386743
62262 1386743 1353419 1321699 1290733 1259637 1228330 1197754 1168993 1142072 1115902 1089670 1064031
62251 1064031 1040487 1019736 1001260 984552 969932 957626 946743 936084 925736 916849 909879 904042
62239 904042 898817 894909 893057 892626 892308 891769 891746 892864 895313 899505 905991 914454 923663 932838 942498
62224 942498 953595 966332 980233 994830 1009729 1024357 1038310 1051947 1066271 1082174 1100039
62213 1100039 1119978 1142141 1166768 1194231 1225094 1259963 1299155 1342644 1390440 1442933 1500783
62202 1500783 1564439 1633873 1708851 1789365 1875494 1966679 2061249 2156865 2251275 2342400 2427768
62191 2427768 2504289 2568770 2618617 2652177 2668824 2668996 2654046 2625808 2586088 2536170 2476427 2406520
62179 2406520 2326548 2238372 2145614 2052162 1960605 1871915 1786112 1703136 1623644 1549332 1482128
62168 1482128 1422605 1369469 1320919 1276225 1235452 1198177 1163464 1131256 1102795 1079079 1059393
62157 1059393 1041900 1025414 1010054 996294 983898 971923 959561 946992 935507 926601 920653 916643
62145 916643 913423 911102 910750 912826 916428 920253 923873 927846 932982 939889 949040 960777 975047 991222
62131 991222 1008231 1025010 1041063 1056700 1072600 1089093 1106057 1123547 1142217 1162947 1186143
62120 1186143 1211428 1237646 1263240 1287313 1310831 1336329 1365819 1399244 1435527 1474827 1518961
62109 1518961 1569689 1627310 1690898 1758953 1829444 1900007 1968667 2033931 2093781 2145190 2185327
62098 2185327 2213045 2228810 2233575 2228261 2213865 2191113 2159830 2119318 2069705 2012667 1950729 1886218
62086 1886218 1820992 1756657 1694527 1635299 1579077 1525887 1476169 1430796 1390616 1355913 1326173
62075 1326173 1300315 1277255 1256521 1238477 1223826 1212760 1204669 1198774 1194807 1192986 1193684 1197483 1205125
62062 1205125 1216774 1231602 1248852 1269127 1293499 1321092 1348548 1372482 1391839 1407473 1420390
62051 1420390 1431240 1440768 1449580 1457551 1464063 1468436 1469448 1465109 1454192 1437993 1419592 1401303 1383611
62038 1383611 1366376 1349902 1334598 1320740 1309131 1301177 1297605 1297670 1300187 1305030 1313164 1325452 1341688
62025 1341688 1360510 1380203 1400161 1421856 1447821 1479266 1515015 1553016 1592435 1633935 1678561
62014 1678561 1726873 1778780 1833553 1890091 1947534 2005416 2063070 2119544 2174745 2230094 2287022
62003 2287022 2344745 2400145 2449814 2491424 2523232 2543445 2551020 2546713 2532598 2510523 2481342 2445308
61991 2445308 2402485 2352702 2295771 2232344 2164323 2094044 2023103 1952314 1882654 1815545 1751871
61980 1751871 1691184 1632470 1575622 1521757 1472047 1426564 1384417 1344834 1308007 1274943 1246422
61969 1246422 1221998 1200110 1179308 1159260 1140394 1122824 1106005 1089398 1073054 1057434 1042834
61958 1042834 1029018 1015292 1001100 986790 973709 963310 956223 952193 950382 949388 947667 944883 942618
61945 942618 942811 945547 949172 952459 955569 958861 962044 964963 967941 970520 970976 968268 963794 959951 957216
61930 957216 953695 947496 938544 928016 916868 905311 893217 880736 868611 857818 848664 840416
61918 840416 832071 823189 813674 803334 792391 782103 774043 768788 765864 764601 764199 763307 760904 757824
61904 757824 756247 757184 759425 761509 763600 766530 769901 772567 774665 777824 783156 790166 798090 807395
61890 807395 819176 833535 849340 865536 882113 899688 918666 939150 961362 985651 1012047
61879 1012047 1040167 1069748 1100957 1133842 1167557 1200496 1231262 1259243 1284325 1306536 1326155
61868 1326155 1343630 1358797 1370498 1377691 1380966 1382212 1382434 1380523 1374734 1365084 1353740 1343291 1335300
61855 1335300 1330342 1328459 1329117 1331333 1334544 1339285 1346709 1357542 1371606 1387969 1405202 1421715 1436153
61842 1436153 1447389 1454143 1455181 1450240 1440255 1426173 1408109 1386306 1362257 1337761 1313031 1286912
61830 1286912 1259023 1230647 1203381 1178000 1154904 1134331 1115375 1095965 1075053 1054227 1036060
61819 1036060 1021203 1008116 995308 982621 970317 958162 946067 934923 926156 920571 917880 917166
61807 917166 917671 919370 922906 928875 937263 947785 960649 976582 996126 1019338 1046237 1077045 1111659
61794 1111659 1149291 1189112 1231208 1276393 1324917 1375692 1427119 1478416 1529539 1579656 1626451
61783 1626451 1667470 1701736 1729429 1750401 1764031 1770525 1771220 1767280 1759049 1747292 1734175 1722165
61771 1722165 1712456 1705175 1700607 1699386 1701835 1707880 1717162 1728394 1739094 1747157 1752571 1756426 1758171
61758 1758171 1755034 1744505 1726398 1702075 1672655 1638634 1600383 1558124 1512007 1463173 1414405
61747 1414405 1368710 1327190 1288950 1253051 1219797 1189898 1163191 1138753 1115908 1094583 1074952
61736 1074952 1057348 1042378 1030403 1020647 1011508 1002230 993758 987343 982625 977839 971730 964418 956482
61723 956482 948221 940089 932773 926127 918767 909583 899248 889494 881233 874114 867696 862221 858206 855735
61709 855735 854333 853289 852211 851360 851143 851176 850478 848814 847085 845869 844481 842344 840484 840420 841986 843507
61693 843507 844006 844078 844737 846543 849805 854385 859037 862122 863363 864027 865163 866697 868528 871328 875588
61678 875588 880642 885338 889131 892175 894923 897923 901347 904568 907012 909572 914016 920530 926986 931431
61664 931431 934216 936845 939786 942762 946490 952445 960841 969985 977916 983913 988308 991702 994803 998503
61650 998503 1003476 1009609 1015940 1021297 1025154 1027911 1030161 1031693 1031577 1029308 1025546 1021578 1018357 1016037
61636 1016037 1014039 1011508 1008165 1004607 1001253 997207 991157 983506 976400 971126 966529 960679 953182 944995
61622 944995 936911 929395 923300 919401 917279 915587 913368 910450 906798 902368 897576 893196 889625 886604
61608 886604 883469 879469 874348 869086 865366 863562 861976 859129 856130 855342 857002 858855 859299 859331 860771
61593 860771 863924 867955 872485 877622 882837 887000 889567 891100 892625 894931 898405 902938 907859 912327
61579 912327 915990 919053 921638 923341 923647 922524 920232 916577 910948 903433 895465 888775 883931 880361
61565 880361 877427 874564 870559 864218 856334 849890 847279 847919 849392 850191 850332 849843 848115 844885 840791
61550 840791 836606 832481 828137 823415 818533 813984 809917 805367 798721 789628 779987 772245 766993 762968
61536 762968 758862 754142 748509 741823 734495 726908 718675 709717 701771 697081 695245 693094 688478 682733
61522 682733 678366 675510 671994 666181 658494 650545 643811 638891 635091 630883 625571 620365 617017 615512
61508 615512 613958 610823 606455 602022 597681 592590 586641 581340 578359 577519 577002 575737 574706 575235 576737
61493 576737 577288 576132 574409 573406 573314 573901 575088 576290 576383 575102 573579 572725 572022 570776 569626 569663 570738
61476 570738 571881 572886 574177 575441 575763 575105 574441 574360 574642 575331 576876 578699 578771 575477 569378 562639
61460 562639 557303 554500 554373 555855 556955 556357 554688 553618 553857 554672 555140 554883 553549 550800 547448 545550
61444 545550 546171 547529 546791 543765 541463 542434 545804 548867 550465 551289 551581 550583 548488 547019 547168 547703
61428 547703 547012 545322 543836 542543 540488 537858 536149 536105 536840 537343 537649 537998 537979 537405 537270 538812 541890
61411 541890 545042 547009 547614 547276 546469 545765 545848 547049 548982 550892 552310 553331 554303 555268 555759 555252 553857
61394 553857 552355 551442 551090 550787 550160 549048 547184 544391 541271 539325 539966 543305 547905 551712 553499
61379 553499 553878 554997 558766 565033 571771 577238 581467 585301 588657 590743 591725 593035 595620 598778 601274
61364 601274 602997 604909 607774 611503 615460 618962 621775 624464 627776 631270 633286 633050 632209 633117 635838
61349 635838 638050 637870 635552 632220 628226 623427 618133 612900 607890 603089 598719 594862 591087 587098
61335 587098 583492 581367 581313 583093 585965 588934 590979 591607 591156 590320 589542 589027 588964 589370 590004 590746 591885
61318 591885 593839 596849 601011 606098 611146 614911 617140 618910 621263 624118 626997 630071 633699 637420
61304 637420 640368 642427 644232 646336 649144 653283 659028 665574 671927 678450 686365 695579 704229 710960
61290 710960 716803 724111 734117 746062 758312 769924 781408 794203 809042 824727 839019 850861
61278 850861 861012 870251 877869 882668 884788 885570 885927 885686 884415 881993 878238 872808 866003 859235 854193
61263 854193 851577 850820 850890 851085 851121 850817 850067 849179 848989 850322 853248 857024 860817 864362 867934 871970 876863
61246 876863 882884 890048 898175 907173 917049 927445 937489 946569 955105 963947 972823 979850 982987 981848
61232 981848 977861 972890 967928 962886 957132 950262 942691 935604 929972 925570 921370 917080 913789 912658
61218 912658 913307 914113 914041 913693 914498 917374 922452 929689 939263 951253 965046 979242 992409 1004170
61204 1004170 1015437 1027364 1040243 1053646 1067315 1081288 1095253 1108509 1120838 1132876 1145330
61193 1145330 1158261 1171322 1184149 1196047 1205768 1212201 1215226 1215580 1214102 1211354 1207635 1202877 1196701
61180 1196701 1188954 1180153 1171148 1162517 1154487 1147195 1140789 1135571 1132255 1131610 1133381 1135960 1137739 1138663
61166 1138663 1139968 1142678 1146852 1152049 1157786 1163531 1168899 1174029 1179372 1185102 1191019 1196849 1202207 1206529
61152 1206529 1209656 1212423 1215944 1220284 1224429 1227606 1229998 1232084 1234074 1236274 1239344 1243702 1249120 1255260
61138 1255260 1262234 1270346 1279730 1290571 1303318 1318387 1336062 1356919 1381631 1409717 1439002 1467193
61126 1467193 1493805 1519678 1544662 1566855 1584596 1598500 1610848 1623414 1636583 1650240 1664378
61115 1664378 1678443 1690871 1700017 1705388 1707507 1706789 1703129 1696490 1687231 1675702 1662046 1646682 1630484
61102 1630484 1614062 1597075 1578673 1558547 1537343 1516095 1495407 1475216 1455425 1436778 1420646
61091 1420646 1407439 1395653 1383408 1370916 1360384 1353320 1349077 1346489 1345546 1346383 1347638 1347299 1344745
61078 1344745 1340686 1335516 1329112 1322137 1316052 1311429 1307421 1303381 1300194 1299465 1302019 1307615 1315728 1326225
61064 1326225 1339512 1356125 1376029 1398519 1423131 1450279 1480446 1513183 1547670 1583861 1622053
61053 1622053 1661617 1701382 1741242 1782212 1824633 1867395 1909109 1949034 1986729 2021992 2055473
61042 2055473 2088142 2119629 2148155 2172634 2193667 2211759 2225650 2233367 2234182 2228689 2217646 2201562
61030 2201562 2180873 2155899 2127198 2096442 2066008 2036818 2007243 1975036 1939858 1903418 1868028
61019 1868028 1835789 1808053 1784234 1761706 1738317 1714879 1694157 1677686 1664739 1654097 1645484
61008 1645484 1639181 1635421 1634490 1636571 1641227 1647774 1656273 1667422 1681359 1697406 1715212 1735430 1758936
60995 1758936 1785950 1816088 1848664 1882787 1917944 1954993 1996013 2042645 2094870 2151880 2213808
60984 2213808 2281927 2357114 2438695 2525173 2615864 2711539 2813635 2923288 3041100 3167292
60974 3167292 3301748 3444339 3595503 3756120 3926595 4106723 4296833 4497932 4709715
60965 4709715 4929650 5155876 5390489 5638144 5902087 6184180 6488793 6823370 7193786
60956 7193786 7601612 8047455 8534811 9069537 9658967 10314677 11054195 11897136 12860984
60947 12860984 13962261 15218224 16643837 18251123 20057800 22094302 24396411 26995289
60939 26995289 29921645 33199637 36782963 40452440 43791769 46335949 47819348 48320060
60931 48320060 48179574 47793584 47465650 47386661 47635346 48112905 48487491 48287500 47138569
60922 47138569 44965318 41996982 38602008 35109908 31734072 28584375 25704263 23099450
60914 23099450 20760044 18675487 16835686 15224181 13816899 12588237 11515228 10576643
60906 10576643 9752486 9025872 8383380 7812911 7302883 6843644 6427881 6049341 5702660
60897 5702660 5384703 5094451 4830983 4592438 4376790 4181940 4004375 3838949 3681057
60888 3681057 3528795 3382775 3244282 3113709 2990271 2872859 2761275 2656437 2559202 2469274
60878 2469274 2385525 2306811 2231994 2159904 2090066 2022923 1958532 1895700 1833508 1773154 1716843
60867 1716843 1664961 1615713 1567645 1521178 1477200 1435427 1395073 1356440 1320764 1288451 1258047
60856 1258047 1227417 1196129 1166428 1141206 1120825 1102756 1084841 1067983 1054544 1044814 1036518 1027607
60844 1027607 1018118 1009121 1001185 994314 988420 983391 979428 977516 978601 981958 985268 986788 986683 985927
60830 985927 984863 983404 981738 979932 977426 973648 968677 962665 955167 945892 935803 926596 919108 912743
60816 912743 906292 898762 889641 879155 868447 858885 850972 844176 837940 832419 827967 824285 820564 816466
60802 816466 812580 809716 808045 807233 807156 807884 808929 809319 808943 809301 812241 818164 825896 833887 840788 845337
60786 845337 846957 846705 846763 848611 852192 856803 861903 866951 871468 875661 880061 884148 886382 886230 885100
60771 885100 884418 883767 882060 879724 878201 877672 876822 874929 872768 871142 869719 867877 865663 863234 860115
60756 860115 855746 850308 844323 837869 830811 823433 816157 808813 800906 792574 784644 777616 771033 764085
60742 764085 756530 748913 742161 737125 734116 732558 731217 729046 725709 721209 715378 708242 700817 694845
60728 694845 691378 689937 689291 688763 688447 688560 689253 690920 693906 697623 700706 702630 704886 709778 717931
60713 717931 727337 735167 740458 744966 751451 761133 772741 783948 793530 801963 810134 818117 825542 832581
60699 832581 839909 847775 855781 863615 871326 878530 883979 886658 887158 887383 888886 891960 896263 901478 906872
60684 906872 910854 911923 910061 906598 902614 897973 892013 884534 875749 865882 855379 845166 836038 827888
60670 827888 820105 812642 806113 800797 796181 791770 787880 785279 784238 784234 784469 784574 784860 785866 787605 789437
60654 789437 791018 793205 797476 804390 813036 822148 831322 841057 852098 864936 879465 894832 910062
60641 910062 925095 940745 957393 974314 990794 1007342 1025091 1044379 1064547 1084899 1105145
60630 1105145 1125090 1144699 1164425 1184838 1205884 1227060 1248312 1270109 1292613 1315480 1338636
60619 1338636 1362520 1387222 1411889 1435317 1456694 1475512 1491374 1504275 1514565 1522076 1525671 1524231
60607 1524231 1517803 1507222 1492835 1474375 1452130 1427497 1402004 1376162 1349653 1322356 1294751
60596 1294751 1267409 1240619 1214812 1190959 1170048 1152038 1135692 1119587 1103093 1086233 1069091
60585 1069091 1051907 1035523 1020997 1008572 997420 986544 975572 964614 953912 943972 935670 929727
60573 929727 926166 924369 923441 922459 920896 919137 918197 918470 919102 919049 918429 918212 918842 919831 920753 921772 922864
60556 922864 923011 920836 916147 910633 906754 905670 906091 905379 901970 896552 890787 885333 879644 873327 866896
60541 866896 861073 855939 851066 846125 841175 836573 832731 829759 827356 825272 823715 822978 822897 823161 823924
60526 823924 825427 827221 828783 830992 835880 844335 854854 865160 874392 883215 892705 904064 918667
60513 918667 937045 957954 979519 1001334 1024668 1050739 1079579 1110375 1141741 1171522 1197483
60502 1197483 1218696 1235426 1247327 1252761 1250659 1242275 1230363 1217189 1204193 1192922 1184993 1181060
60490 1181060 1180841 1184424 1192726 1206325 1224491 1245908 1269979 1296991 1327384 1361285 1398286 1436811
60478 1436811 1473763 1505827 1531573 1551610 1566137 1573225 1570799 1560173 1546272 1533802 1524116 1516248
60466 1516248 1509640 1504496 1500217 1495469 1490144 1485877 1483912 1483487 1483254 1483684 1486958 1494489 1505285 1517069
60452 1517069 1528756 1541741 1558813 1581815 1610259 1642169 1676136 1712578 1753566 1802016 1860740
60441 1860740 1931178 2012533 2102511 2199136 2301507 2408806 2519238 2630127 2738295 2839893
60431 2839893 2930373 3004973 3058854 3086955 3085093 3052176 2990757 2904879 2798299 2675588 2543595
60420 2543595 2409872 2279496 2154336 2035059 1922585 1817826 1721425 1633965 1555419 1484394
60410 1484394 1419130 1359291 1305600 1257695 1213890 1173384 1136954 1104712 1074762 1045403 1017531
60399 1017531 993503 974320 959097 946419 934840 922695 909082 895001 882303 871579 862112
60388 862112 853499 845844 838464 830151 821222 813807 809352 806919 804698 802022 798903 794610 788172 779992
60374 779992 771798 765079 760284 757225 755139 752466 747835 741692 736044 732131 729145 725789 722241 719520
60360 719520 717456 714650 710671 707129 705857 706745 708259 709586 711108 712717 713051 711225 708564 707456 708688
60345 708688 710802 712007 711700 710007 707100 703788 701846 702472 704637 706011 705546 704266 703516 703495 703833 704561
60329 704561 705707 706671 706953 707187 708547 711257 714451 717424 720162 722600 724306 725360 726832 729757 733931
60314 733931 738127 741112 742142 741080 738803 737229 737993 740827 743739 744993 744589 743858 744167 746238 750067
60299 750067 754807 758892 760969 761099 760943 762471 766314 771237 775225 777246 778105 779620 782973 787856 793148
60284 793148 798140 802865 807325 810879 812846 813577 814327 815759 817044 817087 816309 816343 817891 819870 821182 822399
60268 822399 824737 828019 830941 833253 836383 841483 847939 854530 861264 869173 878645 888887 899050 909298
60254 909298 920664 934233 950565 969605 991010 1014636 1040631 1069045 1099815 1133444 1171097
60243 1171097 1212964 1256295 1295829 1326762 1347044 1356583 1355028 1341371 1315787 1280961 1241147 1200300
60231 1200300 1161349 1126304 1095891 1069044 1043885 1019779 997962 979770 964927 952225 941248
60220 941248 932295 924766 916918 907726 898152 889880 883323 877513 871564 865517 859890 855139 851530 848966
60206 848966 846721 843854 840129 836155 832351 828163 822861 817017 812570 810927 811206 810837 808214 804497 802412
60191 802412 803313 805830 807599 807889 807999 809193 810967 811850 811494 811160 812002 813599 814791 815439 816445 818164
60175 818164 819968 821741 824713 829910 836406 842143 846121 848813 850804 852334 854129 857247 861512 865201
60161 865201 866982 867430 868035 869497 871653 874245 876890 878973 880607 883162 887721 893326 897925 900931 903739
60146 903739 907646 912441 917355 922298 927520 932803 937678 942000 945854 949296 952600 956289 960451 964394
60132 964394 967491 969974 972296 974057 974341 973076 971371 970269 969679 968787 967152 965122 963394 962340 961484
60117 961484 959494 955168 948933 943050 939677 938783 938654 938414 939019 941251 943776 944379 942799 941148 941437 943769
60101 943769 947204 951212 955517 959388 962244 964716 968118 972732 977264 980224 981475 982277 984096 987519
60087 987519 992181 997476 1003124 1009054 1015079 1021149 1027755 1035523 1044477 1054354 1065469 1078126 1090907
60074 1090907 1100833 1106187 1108382 1110051 1111963 1112806 1111381 1107763 1102716 1097306 1092942 1090446 1088926 1086702
60060 1086702 1083558 1081077 1080636 1082094 1084712 1088208 1092415 1096825 1101071 1105329 1110004 1115549 1122421 1130158
60046 1130158 1136446 1138560 1136292 1132274 1128817 1125718 1121961 1118061 1115225 1113167 1110491 1106944 1103845 1102332
60032 1102332 1102336 1103342 1105101 1107480 1110413 1114097 1118546 1123011 1126619 1129611 1133137 1137691 1142384 1145887 1147480
60017 1147480 1147069 1144763 1140670 1134784 1127018 1117639 1107522 1097569 1088066 1079041 1070836 1063588 1056404 1047947
60003 1047947 1037829 1026754 1015500 1004755 995709 989413 985156 980638 974383 967103 960183 953936 948092
59990 948092 942986 939024 935643 932056 928701 926704 926025 925365 924084 923054 923166 923966 924571 925269 927315 931255
59974 931255 936119 940342 943099 944669 945770 946694 946978 945794 942712 938026 932382 926206 919521 912155 903958
59959 903958 894948 885398 875830 866821 858882 852496 847918 844573 840946 835744 829445 824219 821830 821861 822443
59944 822443 822477 822505 823384 824908 826274 827379 828938 831411 834391 837205 839633 841873 844141 846662 849819
59929 849819 853876 858536 862966 866438 868979 871476 875011 879682 883885 885178 882500 877601 873782 873041
59915 873041 874761 877155 879276 881066 882132 881549 879028 875519 872376 870386 869818 870817 873280 876661 880376
59900 880376 884208 888046 891436 893682 894230 892877 890083 887279 886056 886329 885852 882565 877188 872546 870411
59885 870411 870003 869657 868793 867773 866819 865939 865412 865593 866377 867270 867775 867477 866154 864230 862732 862294 862337 861665
59867 861665 859696 856846 853914 851433 849581 848483 848586 850575 854540 859288 863161 865768 868338 872061
59853 872061 876687 881209 885264 889176 893040 896562 899592 902216 904426 906207 907847 909726 911987 914756
59839 914756 918396 923019 928002 932517 936451 940394 944887 950015 955454 960608 965115 969682 975865 984393
59825 984393 994148 1003509 1012278 1021417 1031272 1041105 1050233 1058618 1066222 1072622 1077404 1080304 1080995 1079373
59811 1079373 1075980 1071565 1066517 1061423 1057553 1055488 1053604 1049524 1043275 1037556 1034596 1034167 1035082 1036902
59797 1036902 1039238 1040975 1041762 1043369 1048119 1056329 1066398 1077019 1088330 1101167 1116019 1132314 1147865
59784 1147865 1159400 1164697 1164191 1160048 1154199 1148031 1143132 1140709 1140166 1139342 1136389 1130660 1121936 1110030
59770 1110030 1095566 1080152 1065211 1051157 1038028 1026248 1016109 1006903 997134 985723 972930 960206
59758 960206 948994 939400 930141 920110 909792 900617 893170 886791 880888 875657 871178 866614 861010
59745 861010 854495 848217 843319 840253 838652 837400 835148 831365 826841 822853 819895 817480 815007 812433
59731 812433 810170 808609 807739 807070 806023 804546 803117 801854 799951 796521 791933 787741 785163 784075 783587
59716 783587 783050 782222 781020 779722 779043 779238 779275 777745 774753 772082 771083 771126 770768 769870 769534 770284 771492
59699 771492 772784 774881 778355 782350 785434 787360 789087 791246 793483 795529 798067 801948 806928 811836
59685 811836 815894 819365 822829 826357 829751 833169 836879 840427 842733 843365 843282 843853 845421 847248 848604
59670 848604 849270 849179 848326 847103 846007 844804 842641 839361 836106 834179 833808 834401 835434 836469 836895 836615
59654 836615 836832 839157 843623 848174 850520 850257 848997 848708 850136 852622 855136 857343 859655 862400 865243
59639 865243 867585 869308 870970 873452 877534 883420 890212 896030 899215 899626 898579 897500 896789 895992 894880
59624 894880 894202 895221 898314 902154 904728 905282 904929 905185 906348 907499 907578 906019 902832 898663 894506 890790
59608 890790 886960 882413 877574 873488 870594 868518 866890 865623 864422 862758 860568 858533 857439 857495 858329
59593 858329 859483 861035 863819 868582 874583 879667 882413 883774 885732 888779 891702 893532 894401 894436 893183
59578 893183 890596 887565 884922 882638 880305 877655 874453 870939 868681 869704 873986 878898 882037 883726
59564 883726 885723 888489 891082 893071 894895 896357 896213 893532 888548 882041 874871 868352 864042 862567
59550 862567 863158 864711 866821 869501 872528 875554 878488 881329 883810 885511 886237 886064 885206 883954 882616
59535 882616 881410 880543 880365 881175 882737 884171 884402 882656 878805 873678 868965 866101 864873 863513 860549
59520 860549 856281 852080 848521 844804 840017 834420 829237 825408 822827 820663 818211 815448 812961 811484
59506 811484 811419 812682 814862 817472 820117 822618 825025 827415 829623 831416 833061 835386 838821 842553 845398
59491 845398 847719 851686 858974 868666 878226 886287 893645 901619 910500 919941 930032 941424 954954
59478 954954 971642 992263 1015835 1038579 1055345 1062744 1061133 1053863 1044858 1036596 1029614 1023509 1018311
59465 1018311 1014947 1014489 1017326 1023113 1031082 1040090 1048816 1056483 1063288 1069667 1075280 1079168 1080844 1080678
59451 1080678 1079095 1075859 1070424 1062821 1054038 1045516 1038228 1032049 1025927 1018664 1009548 998564 986548
59438 986548 975199 966243 959973 954943 949631 944148 939803 937358 936443 936485 937274 938453 939396 940121 941751
59423 941751 945495 951433 958739 966850 975879 985957 996705 1007598 1018634 1030180 1041975 1052549
59411 1052549 1060169 1064594 1067474 1070618 1074143 1076804 1077919 1078296 1079291 1081677 1085657 1091398 1099115 1108974
59397 1108974 1121250 1136295 1153955 1173165 1192536 1211501 1230857 1252284 1277163 1305401 1335023
59386 1335023 1362979 1386559 1404107 1414562 1416878 1410434 1396148 1376897 1356305 1336626 1317631 1297712
59374 1297712 1276134 1253992 1233007 1214004 1196918 1181689 1168484 1157411 1148722 1143018 1140477 1140167
59362 1140167 1141069 1143739 1150018 1161176 1177248 1197943 1222693 1249826 1277759 1307880 1344144 1387627
59350 1387627 1432222 1467597 1486482 1488425 1477820 1460499 1441790 1425086 1410903 1398457 1388655 1383956
59338 1383956 1384229 1384048 1375750 1355051 1323074 1283798 1240966 1197408 1155752 1118551 1087448 1062299
59326 1062299 1041244 1022036 1003650 986621 971876 959680 949854 942402 937317 934041 931683 929646
59314 929646 927605 925071 921614 917648 914513 913517 915016 918375 922600 926873 930730 933987 936693 939303
59300 939303 942747 947940 954948 962840 970589 978009 985759 994752 1005764 1019171 1034601 1051034 1067816
59287 1067816 1085536 1105488 1128272 1153242 1179268 1205593 1231885 1257868 1283088 1306878 1328535
59276 1328535 1347708 1364512 1379016 1390788 1399349 1404893 1407879 1407923 1403785 1394803 1381870 1366660 1350263
59263 1350263 1332864 1314337 1294731 1274548 1254994 1237691 1223599 1212199 1202090 1192369 1183347 1176198
59251 1176198 1172113 1171411 1172948 1174655 1175239 1175279 1176267 1178864 1182961 1189221 1199285 1213849 1231538 1250630
59237 1250630 1271171 1293837 1316608 1333978 1340494 1334727 1319353 1298169 1274142 1249896 1228211 1210798
59225 1210798 1197136 1185499 1175126 1166794 1161446 1159069 1159028 1160714 1163464 1166516 1169777 1174449 1182178 1193318
59211 1193318 1206335 1219149 1231055 1243245 1257469 1274207 1292232 1309803 1325894 1340048 1351599
59200 1351599 1359769 1364433 1366012 1364438 1358944 1349138 1335701 1319710 1301907 1282967 1263731 1244618
59188 1244618 1225535 1207041 1190864 1178256 1168286 1158832 1149069 1140084 1133236 1128926 1126766 1125925 1125297
59175 1125297 1124392 1124004 1124970 1126423 1126764 1126460 1128056 1132650 1137897 1140643 1140290 1138307 1135531 1131593 1126338
59160 1126338 1120107 1112662 1103216 1091650 1078689 1064883 1050426 1035950 1022337 1009560 996830 984256
59148 984256 973439 965799 960945 957195 953267 949062 945175 942104 939826 937944 936260 935030 934355 933642
59134 933642 932315 931012 931373 934465 939887 946366 952608 957650 961394 965132 970768 979024 988892 999085
59120 999085 1009180 1018957 1027673 1034993 1042041 1050439 1060411 1070721 1080380 1089651 1099331 1109863 1121283
59107 1121283 1133384 1145690 1157795 1170007 1183189 1197712 1213028 1228494 1244059 1259554 1273756
59096 1273756 1284968 1292603 1297542 1300669 1301627 1299380 1293584 1284878 1274045 1261638 1248438 1235560 1223682
59083 1223682 1212548 1201558 1190515 1179463 1168259 1156875 1145895 1136125 1127842 1120871 1115167 1110705
59071 1110705 1106978 1103558 1101225 1101565 1104946 1109694 1113941 1117816 1123154 1131418 1142574 1155675 1169703
59058 1169703 1183869 1197950 1212632 1228978 1247171 1266096 1284375 1301436 1317281 1331635 1343963
59047 1343963 1354286 1363433 1372267 1380996 1389423 1397409 1404682 1410415 1413615 1414036 1412343 1409304 1405209 1400158
59033 1400158 1394434 1388329 1381902 1375171 1368221 1360972 1353251 1345240 1337292 1329055 1319499 1308261 1296173
59020 1296173 1283786 1270266 1254903 1239004 1224780 1212484 1200132 1186278 1171787 1158555 1147610
59009 1147610 1138845 1131464 1124177 1115982 1107346 1099781 1093937 1089024 1084353 1080130 1076312 1072307 1068727 1067793
58995 1067793 1070478 1074418 1076308 1075562 1073970 1072557 1070706 1068071 1065356 1063056 1061024 1059527 1059247 1059916 1060360
58980 1060360 1060357 1061189 1063829 1067559 1070863 1072830 1073518 1074025 1076424 1082341 1091031 1099959 1107774 1115511 1124326
58965 1124326 1133600 1142436 1151784 1163448 1177601 1192763 1207976 1223574 1239754 1255616 1270014 1282447
58953 1282447 1292678 1300203 1304818 1307565 1310514 1315247 1321510 1327500 1331742 1334555 1337474 1341520 1346608 1352535
58939 1352535 1359641 1368167 1377675 1387551 1397615 1407878 1418196 1428440 1438400 1447229 1453773 1457986 1461292
58926 1461292 1464875 1468229 1470006 1469554 1466785 1461325 1452996 1442827 1432538 1423227 1415386 1409720 1406692 1405504
58912 1405504 1404830 1404651 1406312 1410746 1417745 1426890 1437791 1449156 1459243 1468071 1477965 1490926 1506203
58899 1506203 1521247 1534178 1544366 1551371 1554674 1554319 1550832 1544465 1535061 1522562 1507122 1488998 1468923
58886 1468923 1448350 1428674 1410306 1392980 1376676 1361589 1347496 1333950 1321041 1309154 1297914
58875 1297914 1286286 1274064 1262618 1253629 1247336 1242381 1237265 1231733 1226818 1223583 1221933 1220912 1220185
58862 1220185 1220626 1222918 1226148 1228687 1230262 1232095 1234968 1238322 1241711 1246143 1253071 1262630 1273628 1285009
58848 1285009 1296690 1309246 1323350 1339256 1356268 1372965 1388579 1404002 1420847 1439676 1459703
58837 1459703 1479964 1499902 1518836 1536007 1551619 1567246 1584594 1604329 1626481 1651511 1680239
58826 1680239 1712861 1748689 1786814 1826420 1866214 1904085 1937845 1966290 1989197 2006315 2016768
58815 2016768 2019713 2015266 2004352 1987660 1965286 1937551 1905689 1871336 1835630 1799179 1762510 1725987
58803 1725987 1689524 1653168 1617957 1585441 1556010 1528219 1500140 1471092 1441889 1413850 1387819
58792 1387819 1363645 1340168 1316110 1291531 1268280 1248410 1232177 1217881 1203691 1189246 1175411
58781 1175411 1162882 1151395 1140267 1129336 1119014 1109442 1100079 1090503 1081269 1073349 1066884 1061223 1056237
58768 1056237 1052702 1051003 1050261 1049365 1048280 1047570 1047034 1045776 1043648 1041897 1042067 1044520 1048187 1051728 1054961
58753 1054961 1059047 1064899 1071458 1076243 1077845 1077191 1076019 1075042 1074261 1074045 1074598 1074910 1073642 1070835 1067565
58738 1067565 1064135 1059993 1055385 1051486 1048581 1045629 1042272 1039846 1039497 1040494 1041494 1042476 1044241 1046804 1049638
58723 1049638 1053055 1057974 1064478 1071746 1079306 1087195 1094843 1101086 1105765 1110277 1115772 1121406 1125081 1125599
58709 1125599 1123489 1119975 1115779 1111098 1106126 1101136 1096128 1090939 1085981 1082547 1081811 1083471 1085876 1087717
58695 1087717 1089163 1091068 1093583 1096150 1098669 1101972 1107018 1113958 1122127 1130661 1139073 1147526 1156716 1167338
58681 1167338 1179464 1192375 1205075 1217122 1229063 1241932 1256094 1270665 1284297 1296444 1307514
58670 1307514 1317916 1327528 1336232 1344417 1352717 1361717 1371984 1383708 1396004 1407301 1416917 1425644 1434301
58657 1434301 1442541 1449825 1456757 1464304 1472221 1479514 1486188 1493112 1500131 1505783 1509313 1511681 1513794 1514660
58643 1514660 1512218 1505346 1494291 1479586 1461482 1440295 1416562 1390658 1362657 1332774 1301983 1272191
58631 1272191 1245512 1222769 1202701 1183279 1163981 1146166 1131078 1118362 1106999 1096665 1087291
58620 1087291 1078081 1068235 1058290 1049529 1042191 1035508 1029632 1026228 1026663 1030506 1036324 1043051 1049981 1056416
58606 1056416 1062353 1069042 1077851 1088813 1100984 1113850 1127326 1140531 1151695 1159680 1164836 1168137
58594 1168137 1170127 1170996 1170893 1169760 1167441 1164437 1161947 1160600 1159594 1157598 1154038 1148984 1142422 1134601
58580 1134601 1126814 1120811 1117338 1115845 1115575 1116226 1117538 1119046 1120488 1121944 1123484 1125102 1126952 1129032
58566 1129032 1130723 1131389 1131453 1132015 1133313 1134517 1135292 1136546 1139145 1142894 1147424 1153213 1160863 1170133 1180560
58551 1180560 1192471 1206389 1221768 1237100 1250919 1262016 1269272 1272381 1272507 1271295 1269364 1266561 1263297
58538 1263297 1260486 1258267 1255922 1253156 1250475 1248153 1245845 1243496 1241698 1240882 1241093 1242910 1247651 1255981
58524 1255981 1267011 1279337 1292435 1306499 1321446 1336773 1352011 1366732 1380284 1392123 1402387
58513 1402387 1411859 1421383 1431460 1442146 1453187 1464463 1476473 1490158 1506056 1523842 1542813 1562724
58501 1562724 1584095 1607743 1633739 1660528 1685448 1706788 1725149 1742111 1757752 1770425 1778966
58490 1778966 1783894 1785984 1784826 1779732 1771421 1761843 1752426 1742918 1731667 1716845 1698025 1677076 1656966
58477 1656966 1639059 1622031 1603813 1583869 1563007 1541947 1521402 1503023 1488698 1478610 1470998
58466 1470998 1464071 1457377 1451202 1445702 1441205 1438586 1438549 1440763 1444133 1447744 1451171 1454102 1456119 1456994 1457056
58451 1457056 1457101 1457815 1459198 1460709 1462068 1463603 1465524 1467252 1468078 1468347 1469156 1470616 1471202 1469460 1466018 1463175
58435 1463175 1462466 1463165 1463283 1461627 1458577 1455275 1452647 1451273 1451656 1454109 1458362 1463551 1468681 1473164 1477115
58420 1477115 1481337 1486834 1494060 1502785 1512870 1524851 1539127 1554612 1568847 1579724 1586811 1590957
58408 1590957 1593218 1594340 1594654 1593880 1591349 1586906 1581466 1576347 1572242 1569111 1566873 1565902 1566860 1570125 1575192
58393 1575192 1580691 1585459 1589638 1594169 1599094 1603221 1605810 1607719 1610110 1612721 1614345 1614492 1613544 1611583
58379 1611583 1608224 1603629 1598777 1594637 1591817 1590988 1592698 1596677 1602156 1608960 1617299 1626366 1634389 1640739
58365 1640739 1646990 1655060 1665007 1675522 1685980 1696890 1708580 1720402 1731354 1740815 1748627 1755060
58353 1755060 1760719 1765940 1770235 1772899 1774238 1775598 1777930 1780817 1783173 1784429 1784638 1783871 1782096 1779547
58339 1779547 1776768 1774281 1772480 1771737 1772286 1774032 1776698 1780024 1783441 1785868 1786517 1785966 1785733 1786518 1787511 1787849
58323 1787849 1788062 1789440 1792515 1797015 1803023 1811234 1822051 1835120 1849738 1864985 1879549 1892411 1904119
58310 1904119 1916651 1931671 1949299 1968617 1988566 2008199 2027068 2045912 2066201 2088384 2111199
58299 2111199 2133244 2154503 2175693 2196871 2217570 2237754 2257652 2276959 2295000 2311418 2326029
58288 2326029 2338521 2349251 2359945 2372584 2387708 2404623 2422851 2442179 2461623 2479932 2497485
58277 2497485 2516382 2538114 2562113 2587078 2612669 2639153 2666261 2693362 2720310 2747311 2774230
58266 2774230 2800768 2827124 2853875 2881246 2908974 2936784 2964506 2991657 3017377 3041142 3063527
58255 3063527 3086088 3110391 3137051 3165703 3195769 3227062 3259742 3294154 3330840 3370136 3411372
58244 3411372 3453087 3494700 3537537 3583384 3632243 3682361 3732285 3781962 3831963 3882711 3934585
58233 3934585 3987687 4041270 4094542 4148492 4205739 4267733 4333075 4399531 4466893 4536602 4609154
58222 4609154 4683361 4758292 4834726 4914176 4997288 5083717 5173029 5265067 5359607 5456229 5554687
58211 5554687 5655280 5758812 5866366 5979097 6097941 6223105 6353738 6488443 6626463
58202 6626463 6768433 6915921 7070420 7232919 7404063 7584129 7772725 7968907 8171870
58193 8171870 8381488 8598267 8822870 9055767 9297332 9548601 9812072 10091295 10389086
58184 10389086 10706272 11042664 11399254 11779048 12185756 12622251 13090628 13593491 14134756
58175 14134756 14718877 15349060 16026130 16749181 17517205 18330105 19188987 20096794 21058814
58166 21058814 22081252 23168563 24322957 25547131 26846557 28228266 29698452 31262733
58158 31262733 32928329 34704651 36601667 38628691 40794990 43111380 45592036 48256453
58150 48256453 51130987 54249467 57653047 61389015 65508142 70062547 75106758 80701174
58142 80701174 86914742 93827334 101534519 110152405 119817378 130681840 142910244 156671864
58134 156671864 172125207 189403289 208613791 229849534 253194594 278716512 306395747
58127 306395747 335870822 365956050 394223194 417211138 431529901 435308072 428922770
58120 428922770 414449759 394370747 370617103 344487801 317067679 289488681 262820555
58113 262820555 237844987 214973042 194313908 175784086 159203549 144374755 131126737
58106 131126737 119312717 108790154 99417833 91067183 83626046 76992273 71069681 65769622
58098 65769622 61012620 56729059 52860505 49358951 46182419 43291660 40650952 38229345
58090 38229345 35999719 33938621 32027957 30254609 28607074 27073914 25645587 24315078
58082 24315078 23075673 21920247 20843368 19841470 18909716 18040824 17227861 16465784 15749181
58073 15749181 15071312 14427270 13815944 13237081 12688206 12165954 11668431 11194386 10741996
58064 10741996 10310430 9900734 9512824 9143188 8788116 8447961 8125438 7820514 7529887
58055 7529887 7251246 6985180 6732548 6492471 6263710 6045892 5838267 5638945 5446710
58046 5446710 5262554 5088147 4923309 4766030 4614633 4469166 4330673 4199766 4076171
58037 4076171 3959447 3849688 3747036 3650556 3558360 3469405 3384713 3306145 3234227 3167767 3105233
58026 3105233 3045712 2988744 2934209 2882532 2834301 2789532 2747805 2709003 2673119 2639311 2606051
58015 2606051 2572547 2539285 2506856 2475027 2443464 2412673 2383459 2355910 2329693 2305009 2282311
58004 2282311 2261077 2239868 2218161 2197432 2179610 2164597 2150077 2133938 2116182 2098066 2080036
57993 2080036 2061457 2042210 2023438 2006234 1990269 1974407 1958244 1942276 1926704 1910871 1894147
57982 1894147 1876974 1860691 1846370 1833830 1821791 1809269 1796970 1786848 1779827 1774394 1768070 1759996
57970 1759996 1751167 1742351 1732973 1722425 1711356 1700936 1691609 1683292 1676009 1669288 1661534 1651367 1639557
57957 1639557 1628483 1619481 1611732 1603991 1596172 1588621 1580975 1572991 1565903 1561547 1560143 1560056 1560034 1560640 1562924
57942 1562924 1566476 1569768 1572119 1574413 1577685 1581740 1585618 1589058 1592801 1597354 1602018 1605649 1608272 1611415
57928 1611415 1616617 1623871 1631797 1639110 1645582 1651731 1657997 1664365 1670441 1675736 1679961 1683104 1685148 1685855
57914 1685855 1685137 1683628 1682460 1682300 1682865 1683445 1683560 1682994 1681652 1679746 1677777 1675952 1673863 1671187 1668459
57899 1668459 1666571 1665621 1664852 1663781 1662788 1662290 1661841 1660545 1658149 1655314 1652797 1650669 1648455 1645895 1643471
57884 1643471 1642063 1642032 1642819 1643747 1645173 1648355 1653979 1661232 1668777 1676322 1684701 1694522 1705348 1716335
57870 1716335 1727054 1737373 1746984 1755461 1762563 1768116 1771851 1773736 1774212 1773616 1771534 1767355 1761361 1754577
57856 1754577 1747478 1739694 1731319 1723551 1717229 1711380 1704245 1695572 1686882 1679497 1673375 1668154 1664315 1662454
57842 1662454 1661899 1660954 1658498 1654914 1651419 1648836 1647040 1645330 1643264 1641185 1639856 1639573 1639884 1640372 1641441
57827 1641441 1643959 1648192 1653415 1658632 1663489 1668316 1673341 1678075 1681800 1684741 1688292 1693524 1699674 1704887
57813 1704887 1708512 1711760 1715716 1719736 1722693 1725164 1729011 1734923 1741538 1747263 1751915 1756063 1759804 1763130
57799 1763130 1767008 1772885 1781064 1790391 1799887 1810012 1821686 1834440 1846322 1855870 1863686 1871596 1880509
57786 1880509 1889626 1897747 1904753 1911336 1917581 1922432 1924780 1924774 1923841 1923462 1924022 1924801 1924961 1924483 1924223 1925216 1927961
57769 1927961 1932127 1936744 1940834 1944195 1947572 1951787 1956794 1961983 1967301 1973445 1980896 1989439 1998854 2009234
57755 2009234 2020115 2030116 2038375 2045743 2053430 2060673 2065026 2065190 2062593 2059836 2058440 2058448 2059310 2060303 2060654
57740 2060654 2060224 2059988 2061231 2064260 2068295 2072509 2076715 2081066 2085548 2089804 2093145 2094813 2094746 2094240 2095279
57725 2095279 2098728 2103471 2107849 2111797 2116907 2124215 2132678 2140384 2146737 2152630 2158801 2165187 2172053 2180483
57711 2180483 2190944 2202210 2212741 2222564 2232667 2242819 2251299 2256991 2260686 2263936 2267423 2270909 2274097
57698 2274097 2276947 2279517 2281819 2283584 2284172 2283372 2282428 2283484 2287561 2293647 2300022 2305762 2310649 2314658 2318405
57683 2318405 2323261 2329883 2337105 2343353 2348849 2355220 2363065 2371194 2378556 2385753 2394018 2403467 2413052 2421826
57669 2421826 2429721 2437359 2445483 2454343 2463367 2471670 2479106 2486658 2495554 2506194 2517914 2529462 2539596
57656 2539596 2547796 2554756 2561909 2570126 2579196 2588729 2598969 2610054 2620919 2629949 2636989 2643952 2652972
57643 2652972 2664299 2676419 2687972 2699019 2710451 2722760 2735751 2749309 2763973 2780529 2798978
57632 2798978 2817857 2834745 2847871 2857697 2866899 2878341 2892870 2909198 2925738 2941991 2958152 2974464
57620 2974464 2991731 3011803 3036322 3065058 3096492 3130133 3167205 3208822 3254701 3304396 3358765
57609 3358765 3419135 3485434 3555584 3625571 3688736 3736105 3760034 3758731 3736628 3700511 3656503
57598 3656503 3610289 3567301 3530596 3499453 3471699 3446947 3426467 3410723 3398649 3389150 3381812 3376144
57586 3376144 3371557 3368382 3367730 3369995 3374456 3380531 3388270 3397192 3405969 3413986 3422288 3432187 3443683 3456005
57572 3456005 3468882 3482349 3495935 3509015 3521592 3533900 3545678 3556704 3567636 3579318 3591467
57561 3591467 3603001 3613591 3623938 3634590 3645344 3655993 3666893 3678564 3691286 3705214 3720332
57550 3720332 3736157 3751910 3767024 3781209 3794304 3806595 3819033 3832489 3846996 3862356 3879016
57539 3879016 3897272 3915859 3932677 3947222 3961173 3976203 3992108 4007470 4021259 4033384 4044585
57528 4044585 4056265 4069513 4083728 4097061 4108845 4120706 4134546 4150263 4166355 4181999 4197459
57517 4197459 4212958 4228361 4243829 4259803 4276265 4292727 4308922 4324957 4340837 4356385 4371584
57506 4371584 4386607 4401721 4417436 4434237 4451629 4468028 4482537 4496494 4512266 4530626 4550193
57495 4550193 4569390 4587899 4606007 4623623 4640609 4657496 4675207 4694259 4714493 4735292 4755778
57484 4755778 4775148 4793233 4810728 4828637 4847430 4866721 4885690 4903838 4921347 4938600 4955409
57473 4955409 4971034 4985167 4998707 5013324 5030351 5049916 5070690 5090479 5107794 5123230 5138766
57462 5138766 5155520 5172935 5190452 5208749 5228447 5248762 5268807 5289449 5312143 5336354 5359928
57451 5359928 5381945 5403405 5424785 5444939 5463281 5481353 5500865 5521313 5541010 5559751 5579076
57440 5579076 5600130 5622368 5644322 5664867 5683852 5702169 5721064 5740783 5760166 5778062 5794822
57429 5794822 5811660 5828963 5846140 5863012 5880297 5898512 5917174 5935467 5953148 5970539 5988083
57418 5988083 6006209 6025197 6044811 6064342 6083374 6102359 6122216 6143503 6166157 6189794 6213833
57407 6213833 6237442 6259894 6281327 6302824 6325250 6348146 6370325 6391616 6413246 6436067 6459162
57396 6459162 6481114 6502167 6523831 6546417 6568462 6589194 6610198 6633307 6657691 6680558 6700662
57385 6700662 6719714 6740022 6761868 6783913 6805314 6826476 6847949 6869494 6890494 6910877 6931326
57374 6931326 6952606 6974817 6997314 7019414 7041106 7062966 7085314 7107602 7128899 7148988 7168704
57363 7168704 7188912 7209302 7228640 7246297 7263057 7280116 7297692 7315228 7332675 7350769 7369941
57352 7369941 7389713 7409454 7429030 7448329 7466849 7484531 7502487 7522046 7543168 7564540 7585134
57341 7585134 7604879 7623817 7641564 7657991 7673674 7689150 7704300 7719065 7734216 7750473 7767088
57330 7767088 7782368 7795868 7809235 7824395 7841570 7859657 7877934 7896330 7914239 7930307 7943966
57319 7943966 7956419 7969469 7983761 7998689 8013597 8028374 8043092 8057714 8072109 8085921 8098530
57308 8098530 8109597 8119475 8128666 8137317 8145945 8156159 8169364 8184765 8199867 8213290 8225844 8238349
57296 8238349 8249857 8259147 8266955 8275230 8284751 8294855 8305255 8316564 8328876 8341244 8353087 8364922
57284 8364922 8376950 8387870 8396248 8402657 8409321 8417630 8426881 8435681 8443775 8451863 8460146 8467929 8474622
57271 8474622 8480348 8485300 8489264 8492414 8495958 8501000 8506916 8511909 8515390 8518911 8524265 8531406 8538856 8545510
57257 8545510 8551304 8556494 8561065 8564831 8567696 8569872 8572107 8575288 8579526 8584098 8588715 8594270 8601644 8610309
57243 8610309 8618988 8627310 8635811 8644480 8652443 8659265 8665571 8671990 8678173 8683315 8687225 8690547 8694074 8697913
57229 8697913 8701112 8702335 8701236 8698811 8695892 8691800 8685481 8677641 8670561 8665715 8662786 8661312 8662035 8665926
57215 8665926 8672850 8682033 8693206 8706544 8722009 8739412 8758627 8779055 8799255 8817829 8834521 8850002
57203 8850002 8864847 8879061 8892122 8903018 8910636 8914795 8916708 8917974 8919223 8919998 8919484 8916981 8912189
57190 8912189 8905686 8898808 8892501 8886486 8880027 8873157 8866668 8861294 8857536 8855911 8856623 8859185 8863114 8868838
57176 8868838 8877264 8888580 8902187 8917751 8935612 8956254 8980009 9007217 9037826 9070734 9104319
57165 9104319 9137957 9172436 9208585 9245959 9283135 9318886 9352754 9384788 9415064 9443430 9469744
57154 9469744 9494422 9518398 9542071 9564450 9583915 9599852 9613063 9624601 9634656 9642433 9646518 9645540
57142 9645540 9639384 9630001 9620295 9611867 9604278 9596465 9588011 9578781 9568448 9557129 9545828 9535416 9525575
57129 9525575 9515335 9504131 9491560 9476572 9457914 9435342 9409438 9380128 9346200 9306620 9261711
57118 9261711 9212655 9160398 9105393 9047890 8987758 8924113 8855753 8782138 8703649 8620855 8533883
57107 8533883 8442596 8347072 8247855 8146259 8044740 7946293 7852707 7763776 7679153 7600756 7531978
57096 7531978 7474062 7424479 7379759 7339007 7303539 7273690 7247385 7221649 7194234 7163514 7127757
57085 7127757 7084903 7032700 6969360 6895059 6812904 6727769 6644165 6565671 6495530 6435864 6385916
57074 6385916 6342465 6302577 6264951 6228402 6190640 6149405 6103520 6051509 5989915 5914138 5820647
57063 5820647 5707887 5575842 5425632 5258900 5076470 4877582 4660589 4423771 4165000
57054 4165000 3881370 3569668 3226619 2848396 2430833 1970370 1463558 905213 288596
57044 -391938 -1140351 -1962033 -2865584 -3859648 -4949518 -6139041 -7435450 -8851991 -10408972
57035 -10408972 -12135480 -14068464 -16246022 -18700066 -21454998 -24529186 -27932315 -31661834
57027 -31661834 -35708993 -40077048 -44802970 -49968869 -55683665 -62016051 -68891262 -76015437
57019 -76015437 -82898489 -88976669 -93756458 -96901825 -98256528 -97838316 -95821676 -92496292
57011 -92496292 -88201451 -83264654 -77967907 -72537452 -67141892 -61893919 -56857153 -52056187
57003 -52056187 -47487938 -43136091 -38986875 -35038623 -31301544 -27792808 -24531965 -21535934
56995 -21535934 -18813434 -16362819 -14174277 -12231662 -10512102 -8987930 -7632498 -6424073
56987 -6424073 -5344153 -4375172 -3502181 -2714958 -2006130 -1368435 -795507 -283508 170891
56977 573797 933437 1257071 1550411 1819285 2069413 2304570 2526996 2739582 2945815 3147628
56967 3147628 3345679 3542507 3742933 3948364 4149641 4325842 4451377 4507265 4489717 4410874
56957 4410874 4291668 4152265 4006237 3860199 3716338 3575072 3436701 3301585 3169314
56948 3169314 3038567 2908457 2779654 2653482 2530316 2409688 2291647 2176934 2065728
56939 2065728 1957056 1849762 1743649 1639639 1539203 1443575 1353045 1266984 1184809 1106742
56929 1106742 1033389 965070 902002 844587 792812 745767 702488 662836 626647 592525 558651
56918 558651 524669 491488 459151 426246 392062 358217 327300 300375 276603 254904 235231
56907 235231 218221 204210 192959 184169 177954 174488 173259 173098 173316 174491 177647 182660 187839 191040
56893 191040 190921 187271 180606 171706 161373 150460 139826 129896 120313 110561 101141 93626 89244 87924
56879 87924 89077 92763 99539 109551 122333 137238 153737 171674 191378 212719 233575 250202
56867 250202 259979 263214 261581 255883 246491 234905 222961 210793 197326 182813 169257 158078
56855 158078 148843 140716 133746 128107 123245 118618 114450 111173 108833 107527 107620 108888 110017 109545 107050
56840 107050 103268 99557 97294 97037 97978 98845 99490 100883 103398 106015 107619 108324 109177 111226 115289 121851
56824 121851 130600 140312 149429 156494 160399 161131 160277 159845 160466 161735 164187 169491 178256 189074 200458
56809 200458 212574 226350 242050 259642 279548 302089 326886 353560 382137 412063 441768
56798 441768 469871 495533 516717 529684 532115 526026 515949 504658 492140 478202 464298 452627
56786 452627 444830 441698 443133 448219 456238 467634 483345 503584 528223 557929 593654 635046
56774 635046 680254 726753 771057 808105 832915 843498 841143 827905 805257 775451 742324 709548
56762 709548 678761 650086 623754 600650 581843 568008 558865 553180 550155 550941 557754 571322 590177
56749 590177 612627 637916 664853 690723 712609 728699 737300 735941 723289 701471 674898 646763
56737 646763 617841 588337 559279 531751 506209 483349 464644 451040 441622 434511 429028 426373
56725 426373 428016 433865 442155 450854 458874 465981 471853 475515 475650 471216 461804 447812 430472 411419
56711 411419 391807 371892 351631 331499 312332 294435 277333 260579 244494 229798 216708
56700 216708 204695 193138 181936 171433 161997 153838 147069 141655 137347 133804 130778 128052 125361
56687 125361 122595 119974 117671 115351 112525 109362 106597 104469 102365 99839 97477 96297 96709 98501
56673 98501 101298 104396 106564 106875 105696 104203 103074 102343 102282 103453 105800 108567 111385 114619 118267
56658 118267 121333 122834 122900 122319 121424 119970 117767 114969 111930 109172 107175 105800 104179 101690 98829
56643 98829 96681 95688 95449 95566 96074 96925 97606 97653 97266 97077 97350 97676 97553 97060 96752 96869 96986 96632 95982
56624 95982 95453 94775 93142 90523 88245 87714 88915 90676 92175 93530 94913 95866 95894 95259 94631 94169 93508
56607 93508 92622 92103 92280 92491 91729 89876 87862 86657 86621 87843 90344 93449 95541 95289 93151 91097
56591 91097 90776 92403 95419 99493 104442 109710 114702 119606 125233 131768 138035 142467 144756 146084 147575
56576 147575 149011 149649 149958 151522 154901 158471 160255 160439 161089 163447 166456 168217 168071 166825 165672
56561 165672 165537 166947 169646 172358 173685 173448 172766 172769 173589 174694 175656 176303 176604 176965 178297 181052 184169
56544 184169 185713 184897 182900 181339 180532 179864 179196 178916 178832 178132 176596 174885 173396 171808 170120 169128
56528 169128 169244 169743 169948 170347 171630 173395 174964 176811 179785 183198 185230 185444 185667 187938 192488 198096
56512 198096 203539 208320 212727 217701 224044 231340 238064 242980 246029 247934 249785 253154 259518 268821
56498 268821 279122 288214 295174 300012 302569 302611 300653 297964 295761 294706 294917 296041 297447 298668 299560
56483 299560 299918 299356 297819 295865 294054 292303 290168 287521 284634 281754 278895 275957 272927 270101 268057
56468 268057 267063 266477 265097 262275 258367 254151 250292 247290 245240 243401 240749 237384 234790 234255 235460
56453 235460 236990 237705 237299 236174 235379 236143 238716 241798 243619 243466 241957 240220 239121 238894 239072 239108
56437 239108 239291 240511 242809 244804 245057 243465 240925 238437 237140 238259 241746 245462 246939 245856 243852
56422 243852 242192 240837 239737 239649 241022 242983 244094 243707 242206 240355 238887 238494 239786 242985 247486
56407 247486 251712 253976 254044 253532 254211 256053 257488 257374 256105 254991 255240 257311 260311 262105 261083 258133
56391 258133 256010 256459 258792 261580 264619 268431 272710 276462 279280 281390 282513 281788 279144 275969 273876
56376 273876 273253 273435 273964 275056 276941 279295 281534 283293 284344 284403 283521 282650 283263 286076 290276 294184
56360 294184 296628 297658 298201 299148 300629 302069 303077 304188 306288 309293 311967 313390 314005 314685 315323
56345 315323 315159 314287 313817 314409 315507 316445 317581 319603 322062 323397 322602 320455 318889 319332 321775 325107
56329 325107 328027 329720 330159 329979 329803 329501 328395 326494 325136 325758 328258 331288 334124 337265 340852
56314 340852 343577 344110 343102 342708 344206 346933 349670 352179 354977 358139 361012 363079 364709 366825 369877
56299 369877 373282 375969 377356 377650 377311 376673 376232 376823 379059 382639 386528 389830 392394 394684 397148
56284 397148 399697 401787 403162 404400 406393 409337 412618 415739 418825 422060 425113 427504 429189 430501
56270 430501 431814 433468 435682 438272 440746 442931 445243 448173 451800 455852 459832 463013 464961 466259
56256 466259 468126 471024 474159 476604 478240 479274 479727 480003 481377 485065 490969 497670 503355 506771 508184
56241 508184 509845 514524 522699 531722 538421 541955 543619 544849 546451 549002 552686 556901 560949 564906
56227 564906 569096 573165 576580 579700 583482 588417 594498 601820 610404 619825 629846 640955 653484
56214 653484 666782 680165 693941 708280 721814 732939 742253 752265 764854 780303 798477 819223
56202 819223 841543 863995 886415 910143 936304 965022 996371 1030683 1067560 1105918 1145598
56191 1145598 1187942 1234377 1285364 1341017 1401519 1466246 1533355 1601002 1668560 1736341 1804559
56180 1804559 1872563 1938381 1999037 2052148 2097285 2135050 2164991 2185460 2195420 2195221 2185486 2166447
56168 2166447 2138644 2103181 2060992 2012831 1960178 1905097 1848942 1792164 1735539 1680430 1627588
56157 1627588 1576775 1527855 1481195 1436721 1393726 1351973 1312102 1274812 1240582 1210066 1183431
56146 1183431 1159278 1135727 1112800 1092228 1074792 1059499 1045606 1033506 1023090 1013336 1004432 998199
56134 998199 995084 992554 988086 982334 977699 975011 973367 972320 972364 973583 975288 976932 978570 980632 983739
56119 983739 988040 992376 995201 996947 1000153 1006273 1013669 1019990 1025312 1031459 1039257 1048151 1057808 1068370
56105 1068370 1079380 1090019 1100402 1111623 1124580 1139524 1156373 1174638 1193383 1212037 1230964
56094 1230964 1250742 1271485 1293405 1317174 1343007 1370298 1398980 1430318 1465377 1503684 1544561
56083 1544561 1588919 1638379 1693236 1752516 1815598 1882734 1954698 2033086 2120290 2217626 2323484
56072 2323484 2434175 2546159 2656483 2761818 2858721 2945293 3021947 3090659 3153768 3212792
56062 3212792 3267360 3315218 3353438 3379326 3390639 3386694 3370116 3346142 3319012 3289561 3256460
56051 3256460 3218020 3171873 3115012 3046238 2967875 2883901 2797563 2711959 2631108 2558119 2493139
56040 2493139 2434879 2383293 2338930 2300822 2267350 2238708 2216289 2199834 2187151 2176598 2168252
56029 2168252 2162720 2160301 2161094 2164582 2169513 2175474 2183844 2195594 2209051 2221837 2234454 2249713 2268834
56016 2268834 2290296 2312567 2335793 2360345 2385626 2411137 2437429 2465271 2494690 2525211 2556522
56005 2556522 2588833 2622930 2659449 2697758 2736436 2775363 2816139 2859593 2904422 2949507 2995950
55994 2995950 3045129 3096148 3147201 3198184 3249920 3302005 3353702 3405989 3460403 3516635 3573455
55983 3573455 3631208 3691172 3753270 3816744 3882253 3951028 4022696 4096305 4172561 4252627 4335642
55972 4335642 4420054 4506573 4597114 4691709 4789235 4890224 4995945 5105674 5218235 5335441
55962 5335441 5460469 5593214 5730797 5872294 6019430 6172957 6332242 6498457 6674310
55953 6674310 6860187 7054061 7255528 7466430 7687423 7917667 8158430 8413348 8684605
55944 8684605 8972348 9278198 9605573 9956052 10329208 10726645 11152513 11609566 12098657
55935 12098657 12622717 13186909 13793478 14439887 15122939 15841507 16595194 17384786 18215221
55926 18215221 19094522 20029167 21023723 22084274 23217265 24424867 25706864 27068000
55918 27068000 28518758 30068554 31723368 33490506 35380231 37402406 39567877 41894880
55910 41894880 44409782 47142475 50127504 53409135 57037827 61061690 65529064 70499648
55902 70499648 76046425 82250330 89205260 97028269 105853218 115814612 127049136 139709864
55894 139709864 153962933 169972225 187901781 207916959 230135835 254545076 280917802
55887 280917802 308655655 336447618 361930738 381859910 393067317 393750208 384183565
55880 384183565 366390140 343148961 317079423 290193539 263837588 238810789 215540063
55873 215540063 194240616 175002351 157807662 142545179 129049304 117135650 106613811
55866 106613811 97298275 89026933 81667320 75105261 69237881 63978582 59256395 55005359
55858 55005359 51161817 47673555 44502445 41615377 38980136 36571423 34371494 32360875
55850 32360875 30514974 28812278 27238847 25781741 24424606 23153245 21960167 20840492
55842 20840492 19788247 18799579 17874827 17014016 16213425 15468442 14776060 14132681 13533201
55833 13533201 12974183 12454629 11972227 11522351 11102042 10711299 10349131 10012209 9699050
55824 9699050 9411732 9151610 8916687 8704648 8514213 8340684 8173253 7999624 7811407
55815 7811407 7603760 7373332 7119791 6847551 6563239 6272321 5979308 5689203 5406697
55806 5406697 5134982 4876530 4633576 4406861 4195449 3998680 3816719 3648586 3491734
55797 3491734 3344593 3207651 3081076 2963346 2853327 2751691 2658864 2573237 2492658 2416232
55787 2416232 2343615 2274180 2208011 2146187 2088880 2034508 1981714 1930932 1883201 1838861 1798046
55776 1798046 1760856 1726282 1692642 1659855 1629512 1601847 1574679 1546622 1519393 1495294 1473953
55765 1473953 1453258 1432317 1411754 1391832 1371847 1351010 1329022 1306329 1284513 1265569 1249936
55754 1249936 1235934 1221770 1207262 1193047 1179174 1165291 1151396 1137720 1124563 1112653 1102780
55743 1102780 1094720 1087505 1080992 1076021 1072679 1069802 1066625 1063582 1060975 1058330 1055678 1053949 1053270 1052308
55729 1052308 1050133 1047323 1044355 1040377 1034654 1027847 1020608 1012041 1000637 985728 967076 944413 918777
55716 918777 893224 870729 851913 835797 821861 810153 800203 791195 782751 774593 766014 756793 748137
55703 748137 741648 737623 734964 732284 728547 723308 717091 711018 705627 700725 696635 694314 693554 692373
55689 692373 689212 684647 679867 674529 667459 658615 648987 639136 629182 619755 611626 604655 598118 591842
55675 591842 586082 580578 574636 568012 561063 554296 548281 543430 539278 534590 528715 522143 515135 506923
55661 506923 497303 488111 481776 478827 477868 477435 476721 474981 471746 467726 464442 462768 462465 463015 464199
55646 464199 465815 467361 468037 466986 463845 459121 453457 446542 437760 427997 419355 412549 406106 399038
55632 399038 392649 388363 385259 381520 377136 373283 370019 366734 364241 364096 366016 368056 369338 370461
55618 370461 371084 369399 364825 359336 355040 351789 348202 343872 339539 335923 333294 331629 330449 329057
55604 329057 327495 326714 327270 328412 329025 328994 329085 329815 330935 331794 331918 331479 331434 332861 335814 339079 341390
55587 341390 342850 344940 349026 354781 360102 362880 362976 362181 362093 362473 361977 359920 356786 353419 350295 347242
55571 347242 343371 337842 331366 326249 323929 322882 320227 315208 309824 306040 303786 302109 300869 300326
55557 300326 299847 298156 294760 290493 286577 283456 280659 277694 274878 272956 271870 270515 268223 265942
55543 265942 265135 265749 266122 264885 262180 258973 255956 253354 251170 249369 248128 247885 248721 249793 250047 249442
55527 249442 248882 248878 248965 248520 247572 246615 246195 246874 249179 253280 258780 264744 269977 273905 277580 283034 290783
55510 290783 298657 304226 307791 311473 315638 318131 317410 314548 311223 307355 302226 296819 293160 291368
55496 291368 288899 283201 274416 265033 257369 251863 247654 244177 241639 240006 238351 235853 232963 230692
55482 230692 228872 226151 221886 217177 213558 211401 210110 209260 208926 209155 209736 210442 211210 212064 212847 212928 211428
55465 211428 208230 204624 202289 201668 201999 202819 204331 206020 206175 203739 199943 197050 195772 194815 192837
55450 192837 189918 186899 184037 180958 177750 175448 175086 176424 178011 178612 178133 176995 175241 172897 170725
55435 170725 169743 170101 171191 172712 174694 176481 176779 175139 172675 170997 171037 172920 175989 178669 179363 178138
55419 178138 176831 176944 178147 179235 179609 179176 177788 175825 174602 175168 177066 179175 181166 183117 184250
55404 184250 183492 181295 179581 179555 180531 181275 181615 182119 182875 183381 183501 183873 185154 187038 188307 187999 186402
55387 186402 184725 183910 184165 185483 187843 190628 192632 193213 192909 192273 190659 187083 182029 177467 174992
55372 174992 174573 175085 175428 175102 174394 174170 175012 176509 177861 179021 180474 181890 182047 180601 179087 179270
55356 179270 180885 181910 181066 179194 177820 177093 175936 174039 172728 173319 175228 176589 176609 176317 176739 177321
55340 177321 176950 175868 175451 176199 176934 176257 174167 171930 170786 171048 172034 172615 172114 170957 170239 170460 170947
55323 170947 170698 169648 168808 169229 170966 173109 174716 175657 176449 177421 178336 178984 179703 180923 182402 183499
55307 183499 184078 184603 185225 185323 184270 182346 180603 179934 180337 180913 180651 179596 179213 181048 184893 188744 190808
55290 190808 190951 189944 188196 186024 184500 184718 186195 187118 186450 184900 183482 182113 180365 178813 178565
55275 178565 179678 180967 181401 180963 180129 179250 178682 178926 180234 182317 184572 186250 186504 184909 182192 179964
55259 179964 179404 180518 182689 185303 187624 188896 189232 189798 191407 193287 194013 193347 192358 191918 191820 191410 190369
55242 190369 188818 187220 186261 186284 186723 186557 185465 184178 183657 184155 184995 185030 183695 181990 181954 184465 187924
55225 187924 189919 189740 188325 186272 183449 180535 179131 179615 180295 179602 178111 177493 178390 180261 182483 184448
55209 184448 185233 184472 183299 183278 184437 185307 184943 184026 183804 184689 186131 187370 187970 187892 187275 186259 185178
55192 185178 184816 185856 187845 189323 189466 189015 188970 188983 187995 186138 184883 185149 186108 186211 184905 183059 181948
55175 181948 182019 182528 182509 182122 182589 184371 185975 185455 183013 181188 182135 185347 188400 189468 188588 186716 184295
55158 184295 181262 178230 176800 178112 181400 184800 187432 189756 191796 192380 190907 188823 188152 189101 190131
55143 190131 190049 188969 187482 186080 185478 186426 188852 191826 194576 197051 199439 201605 203019 202906 200740
55128 200740 197099 193647 191552 190306 188950 187999 188904 191767 194934 197034 198140 198542 197800 195868 194186
55113 194186 194517 196964 199863 201423 201063 199468 197846 197098 197416 198501 199941 201181 201654 201572 202199 204406
55097 204406 207172 208635 208533 208281 208392 207389 204153 200131 198003 198825 201517 204693 207877 211021 213716
55082 213716 215036 213876 209700 203364 196960 192506 190923 192178 195533 199284 201261 200596 198600 197143
55068 197143 196611 196244 195926 196412 197791 198803 198124 195839 193365 192242 193023 195031 197108 198699 200090 201477
55052 201477 202273 201741 199991 197903 196345 195881 196838 199010 201496 203482 205070 206778 208507 209765 210824
55037 210824 212738 215852 218950 220320 219408 217157 214982 213601 212801 212143 211703 211894 212581 212938 212540 212074
55021 212074 212331 212843 212376 210715 209085 208589 208934 209108 208756 208318 208144 208027 207659 207067 206427 205629 204392 202892
55003 202892 201932 202073 202673 202397 200831 199070 198390 198876 199769 200624 201506 202474 203559 204896 206108 205957 203668
54986 203668 200441 198542 198790 200042 201339 203196 206065 208747 209574 208623 207563 207498 207942 207881 206943 205307
54970 205307 203268 201323 200256 200707 202646 205301 207517 208438 208249 208170 209198 210787 211357 210293 208855 208618
54954 208618 209468 209865 209023 207983 208130 209125 208965 206187 201586 197504 195588 195616 196457 197754 200209 204281
54938 204281 209095 212874 214304 213411 211467 210305 211217 213810 216081 216390 215422 215484 217565 220014 220745 219960
54922 219960 219671 220932 222740 223714 223696 223281 222675 221787 221006 221154 222657 225062 227348 228655 228908 228768 228783
54905 228783 228755 228358 228168 229300 231893 234716 236532 237099 236506 234480 231145 227863 226345 227138 229468 232154
54889 232154 234097 234458 233383 232380 233052 235460 238322 240607 242086 242519 241446 239084 236555 234753 233576
54874 233576 232573 231801 231736 232803 235290 239282 244384 249890 255449 261187 267015 272271 276380 279506 282390
54859 282390 285837 290514 296752 304239 312209 320128 327852 335014 340833 344859 347460 349094 349465 347759
54845 347759 343475 336792 328608 320611 314685 311405 309216 305823 300489 294505 289491 285816 282723 279356
54831 279356 275327 270721 266043 262083 259603 259002 260100 262028 263605 264367 265293 267888 272288 276923 280508
54816 280508 283732 288136 293806 299436 304695 311078 319617 328804 335965 340154 342497 344053 344655 343830 341377
54801 341377 336724 329173 319606 310638 303958 298368 291718 284020 277129 271775 266714 260999 255521 251614
54787 251614 249281 247528 245588 243093 239755 235754 232097 229873 229306 229865 230926 231962 232527 232590 232552 232456
54771 232456 231584 229404 226581 224357 223095 222160 221165 220612 221114 222561 224278 225568 225910 225067 223497 222426
54755 222426 223033 225401 228364 230455 231063 230805 230863 231776 232759 232373 230112 227219 225547 225613 226295 226657 227346
54738 227346 229413 232176 233493 232368 230247 229136 229373 230096 231078 232812 235210 237542 239645 241863 243592
54723 243592 243274 240532 237255 235672 236076 237313 238826 241051 244079 247192 250041 253387 258047 263492 268142
54708 268142 271182 273723 277784 284206 291955 299622 307065 315070 323799 332465 340381 347451 353495 358018
54694 358018 360943 362632 362747 359956 353597 344958 336171 328335 321410 315373 310416 306234 302139 297945
54680 297945 294093 290914 288363 286419 285053 283743 281690 278730 275689 273666 273183 273965 275222 276275 277203
54665 277203 278806 281629 285282 289048 292873 297302 302673 308867 315602 322499 329063 335095 340873 346366
54651 346366 350626 352590 352153 349749 345324 338765 331123 324169 318540 313385 308049 302979 298504 293774
54637 293774 287690 280295 272681 266067 261438 259324 259117 259017 257388 254082 250131 246561 244010 242927 243237
54622 243237 243867 243416 241570 239493 238657 239525 241487 243693 245605 246683 246003 242871 238112 234190 233249 235059
54606 235059 237429 238540 238129 236600 234319 232285 232257 234953 238690 241056 241782 242810 245288 247597 247019
54591 247019 242852 237167 232686 230548 230284 231219 233102 235432 237150 237727 238139 239854 242809 245177 245268 242946
54575 242946 239066 234503 230369 228271 229217 232397 235751 237769 238264 237705 236478 234857 233175 231814 231142
54560 231142 231305 231930 232358 232466 232892 234137 235849 237451 238917 240368 241340 241298 240548 239864 239449 239054 238830
54543 238830 239021 239005 237833 235941 235152 236493 238933 240848 241955 243202 245301 248002 250406 251571 251207
54528 251207 250085 249345 249150 248539 246794 244250 241508 238871 237080 237513 240516 244290 246603 247171 247213 247135
54512 247135 246134 244043 242061 241180 240990 240618 240021 239788 240306 241569 243236 244566 244912 244618 244680 245191 244978
54495 244978 243475 242039 242493 244916 247918 250627 253209 255554 256726 256087 254102 251688 249484 248140 248565
54480 248565 251152 254996 258364 260014 260067 259851 260837 263306 265955 267187 266771 265687 264500 262909 261206
54465 261206 260926 262968 265801 266868 265652 264194 264451 266185 267785 268183 267351 265670 263685 262245 262167 263653
54449 263653 266349 269764 273187 275384 275131 272415 268837 266420 265975 266776 267631 267937 267612 266512 264529 262222
54433 262222 260719 260607 261286 261861 262356 263462 265277 267010 268111 269006 270296 271661 272069 270970 268961 267325
54417 267325 267098 268568 271420 275227 279638 284066 287626 289833 291171 292436 293683 294540 295515 297860 301650
54402 301650 305019 306176 305529 304939 305433 306747 308636 311217 313933 315496 315365 314301 313024 311229 308538
54387 308538 305577 303287 301751 300526 299703 299727 300317 300390 299104 296414 292677 288452 284749 282775 283025 284972
54371 284972 287709 290455 292287 292172 289962 287115 285752 286858 289641 292572 294594 295269 294439 292401 290386
54356 290386 290071 291993 294607 295571 294293 292768 293403 296248 298980 299557 298160 296296 294861 293844 293419
54341 293419 294145 295930 297723 298642 298827 298724 298168 296894 295512 295086 295863 297216 298892 301384 304752 307880
54325 307880 309539 309736 309483 309556 310013 310637 311304 312076 313287 315199 317124 317417 315186 311708 309275 308788 309445
54308 309445 310477 311692 312153 310152 305624 301211 299366 299238 298053 295163 292877 293136 295123 296784 297295
54293 297295 297091 296601 296086 296069 296798 297610 297711 297329 297221 297307 296764 295396 293974 293003 291999 290332 288229 286524
54275 286524 285814 286037 286546 286457 285361 283853 283009 283240 284111 285243 286695 288281 289310 289445 289103 288494 287012
54258 287012 284319 281422 279720 279425 279911 281247 284103 288099 291535 293288 294102 295505 298120 301465 304702
54243 304702 307039 307938 307562 306704 305929 305168 304389 303922 303627 302570 300360 298138 297131 296634 294704 290869
54227 290869 286896 284603 283972 283965 284195 285007 286481 288294 290247 292073 292841 291559 288713 286481 286671 288592
54211 288592 289664 288260 285376 283167 282421 282190 281576 280774 280063 278889 276708 274095 272124 271071 270639 271093
54195 271093 273096 276452 280078 283297 286173 288401 289002 287671 285497 283686 282253 280563 278522 276596
54181 276596 275212 274687 275109 275720 275150 273151 271350 271258 272135 272075 270746 269533 269064 268335 266697 265176 264970
54164 264970 265796 266741 267773 269260 270681 271146 270915 271094 271782 271761 270402 268766 268139 268243 267840 266686 265787
54147 265787 265659 265380 263969 262037 261182 261928 263131 263618 263637 264183 265489 266922 268087 269230 270515 271550
54131 271550 271946 271851 271745 272065 273130 274894 276468 276499 274596 272043 270533 270359 270460 270118 269853 270467 271832
54114 271832 273005 273210 272380 271099 270346 270982 272928 274970 275865 275683 275612 276405 277517 277996 277683 277089 276452
54097 276452 275549 274365 273357 272989 273374 274418 275831 276926 276995 276175 275453 275399 275345 274359 272699 271629 271800
54080 271800 272399 272062 270286 267842 266055 265724 266520 267364 267567 267564 268395 270530 273409 275956 277229 276833 275170
54063 275170 273331 272329 272395 273222 274674 276768 279141 281151 282600 283759 284643 284899 284545 284103 283748 283060
54047 283060 282040 281621 282445 283652 283715 282234 280163 278431 277121 276052 275385 275316 275679 276271 277296 279045
54031 279045 281160 282599 282585 281500 280667 281136 282848 285027 287018 288504 289193 288948 288184 287638 287680 288353 289942
54014 289942 292702 295931 298286 299535 301130 304383 308744 312544 314811 315481 314566 312359 310158 309474 310352
53999 310352 311443 311860 311978 312165 311800 310219 307990 306531 306716 308308 310527 312808 315053 317366 319632
53984 319632 321570 323402 326119 330456 335654 339948 342519 344511 347864 353463 360481 367150 372044 374992
53970 374992 376943 378810 380654 382354 384613 388369 393167 397107 398829 398946 399182 400711 403656 407390 410692
53955 410692 412065 410753 407518 404076 401684 400270 398638 395529 390764 385345 380245 375421 370558 366296
53941 366296 363653 362381 361118 359298 357626 356343 354510 351695 348970 347199 345610 343288 340983 340034
53927 340034 340394 341314 343223 346997 351639 354565 354551 352970 351823 351798 352494 353265 353393 352526 351457 351528 352822
53910 352822 353832 353401 352094 351256 351593 353236 356378 361061 366734 372595 378125 383139 387859 393106 399814
53895 399814 408073 417204 426957 437903 450448 464308 479350 495997 514106 532079 547642 558988
53883 558988 564812 564252 557738 547336 535379 523078 511084 500666 493148 488374 484883 481799 479700
53870 479700 479223 479479 478501 475296 471086 468170 467535 468076 468527 469483 472444 477086 481054 482949 484200 487010
53854 487010 491533 496257 500370 504339 508527 512677 516804 521421 526516 531014 533501 533105 529850 524692
53840 524692 519085 513895 508841 503448 498172 493980 491186 489437 488390 487518 485611 481618 475915 469853
53826 469853 464186 458872 454089 450182 446681 442688 438344 434687 431935 429256 426426 424258 422929 421446
53812 421446 419405 417782 417036 415878 413106 409492 406466 403913 400767 396933 393040 388834 383587 377960
53798 377960 373886 372441 373064 374856 377228 379134 379153 377037 374177 371947 370408 369065 367897 366881 365324
53783 365324 362666 359629 357774 358061 360301 363763 367642 370959 372644 372087 369548 366004 362605 360127 358691
53768 358691 357898 357197 356182 354810 353620 353579 355282 358138 360646 361591 360839 359017 356732 354268 351811 349788
53752 349788 348940 349946 352863 357128 362310 368569 375917 383343 389338 393351 396198 399075 402760 407700
53738 407700 413928 420543 426030 429708 432470 435770 440308 445921 451957 457200 460202 460701 460374 461373 464302
53723 464302 468375 473227 479480 487416 496068 504138 511231 517879 524819 532642 541657 551476 560578 566536
53709 566536 566973 560831 549136 534399 518899 503629 489090 476448 466921 460147 454220 447614 440268
53696 440268 432625 424653 416373 408418 401311 394942 389533 386326 386067 387318 387604 386231 384769 384618 385333
53681 385333 385741 385559 385187 384810 384686 385733 388715 392959 396742 399018 400077 400404 399797 398120 396375 396184
53665 396184 398183 401505 404939 408007 410505 411628 410520 407808 405703 406041 408612 411826 414520 416526
53651 416526 418143 420027 423378 429070 436327 443174 448428 452385 455336 456692 456378 456056 457737 461714 466909
53636 466909 472755 479403 486316 492155 496408 499961 503616 507111 510211 513755 518622 524217 528898 531671
53622 531671 532703 532394 530809 528041 524402 520031 514841 509091 503618 499141 495532 492012 488000 483609
53608 483609 479436 476061 473701 472059 470313 467358 462562 456588 451260 448098 446913 446303 445600 445727 447722
53593 447722 450985 453752 455070 455473 455620 455175 453556 451168 449173 448177 447791 447497 447390 447874 449063 450817
53577 450817 453106 455982 459291 462733 466204 469856 473842 478176 482715 486967 490066 491561 492339 494157
53563 494157 497801 502236 506064 509277 512726 516278 518848 520492 523185 528637 536036 542861 547505 550270
53549 550270 552165 553888 555949 558700 561798 564439 566643 569637 574345 579906 584339 586447 586514 585432 583816
53534 583816 582008 580239 578561 576991 575874 575600 575733 574840 571740 566835 561923 558777 558056 559252 561204
53519 561204 562683 563013 562390 561461 560591 559780 559257 559607 560954 562281 562059 559635 555878 552534 551088 552067
53503 552067 555029 558938 562672 565472 567243 568677 570886 574512 579057 583465 587531 592319 598833 606661
53489 606661 614438 621386 627833 634428 641559 649524 658506 668098 677473 686451 696002 707364 720965 736431
53475 736431 753210 770893 789253 808427 828803 850424 872718 895079 917458 940183 963593
53464 963593 988148 1014413 1042376 1071126 1099867 1129051 1159935 1193162 1228417 1265412 1304442
53453 1304442 1345694 1388456 1431322 1473014 1513026 1551772 1590090 1628308 1665828 1702016 1737248
53442 1737248 1772440 1807402 1840413 1869879 1896108 1921072 1946652 1973455 2001147 2029438 2058400
53431 2058400 2087921 2117201 2145248 2171910 2197950 2223842 2248852 2271644 2291398 2307906 2321125
53420 2321125 2331413 2339833 2347224 2353008 2355772 2354932 2350947 2344020 2333837 2320713 2305652 2288819 2269264
53407 2269264 2246750 2222521 2197393 2170462 2140943 2109979 2078948 2046954 2012049 1974500 1936782
53396 1936782 1900383 1864757 1829849 1797460 1768884 1742736 1716536 1689613 1663319 1639137 1617743
53385 1617743 1599309 1583513 1569475 1556606 1545318 1536159 1528743 1522458 1517864 1516265 1518094 1522888 1530786
53372 1530786 1542780 1559073 1578391 1599532 1622657 1648324 1676115 1705245 1736070 1769920 1807521
53361 1807521 1848393 1891741 1937101 1984018 2032002 2081162 2132225 2185472 2240323 2296522 2355156
53350 2355156 2417644 2483913 2552519 2622578 2694761 2770233 2849445 2932349 3018766 3107652 3196588
53339 3196588 3283222 3367325 3450670 3534768 3619402 3703480 3786484 3868562 3949618 4028765 4104534
53328 4104534 4175480 4240900 4301105 4356622 4407046 4451081 4487886 4517795 4541452 4558837 4569553
53317 4569553 4573449 4570307 4559431 4540299 4513346 4479361 4438339 4389664 4333282 4269792 4199456 4122044
53305 4122044 4037962 3948780 3856263 3761404 3664695 3566833 3468734 3371168 3274652 3179446 3085518
53294 3085518 2992904 2902189 2814243 2729376 2647208 2567495 2490514 2416465 2345127 2276479 2211107
53283 2211107 2149570 2091786 2037376 1986183 1938108 1892871 1850319 1810550 1773544 1739209 1708000
53272 1708000 1680586 1656466 1633938 1612277 1593079 1578396 1568294 1561427 1557179 1555637 1555925 1556609 1557975
53259 1557975 1562079 1569881 1579778 1589769 1599817 1611137 1624329 1639391 1656886 1677862 1702853 1731670
53247 1731670 1763817 1798372 1833873 1869120 1904052 1939476 1976246 2014958 2055803 2098205 2141223
53236 2141223 2184823 2230036 2277104 2324224 2369112 2411137 2450810 2487652 2519988 2546804 2568612
53225 2568612 2586391 2600685 2611736 2619379 2622577 2620055 2611753 2598887 2582434 2562491 2539280 2513659
53213 2513659 2486060 2455781 2422042 2385161 2346027 2304880 2261167 2214441 2165138 2114725 2065008
53202 2065008 2016673 1968385 1918013 1864854 1809947 1754255 1697799 1641044 1585778 1533504 1483748
53191 1483748 1435010 1386845 1340071 1295507 1253505 1214237 1177292 1141336 1105301 1069743 1035986
53180 1035986 1004124 973140 942977 915052 890290 867780 846001 824493 803677 783845 765190
53169 765190 748240 733290 719535 705586 691023 677002 665226 656501 650274 645161 639692 632715
53157 632715 623556 612280 599894 587918 577346 568077 559539 551571 544333 537626 530912 523983 517092
53144 517092 510474 504274 498936 494867 491542 487640 482560 477320 473490 471576 470881 470525 470017 469036 467299
53129 467299 464809 461941 459160 456697 454375 451652 448063 443883 440170 437862 436855 436211 435218 434012 433239
53114 433239 433387 434494 436248 438184 439815 440758 440886 440472 440070 440111 440586 441130 441309 440793 439520 437933 436850
53097 436850 436748 437310 437979 438761 440015 441691 443364 444904 446314 446864 445306 441493 437237 435030 436102
53082 436102 439759 444041 446837 447093 445523 443733 442457 441182 439597 438345 437829 437380 436537 436134 436875 437599
53066 437599 436489 433634 430791 428834 427049 425120 424071 424593 425801 426533 426883 427656 429131 431017 432777
53051 432777 433340 431421 427152 422689 420152 419440 418875 417386 415012 411884 408189 405020 403780 404348 404939
53036 404939 404226 402782 401891 401700 401142 399256 395987 392006 388257 385471 383678 382260 380762 379522 379217
53021 379217 379897 380803 381137 380756 380058 379469 379303 379959 381809 384550 386854 387265 385681 383669 382983 383887 385099
53004 385099 385100 383263 380082 376839 374906 374705 375207 374924 373564 372328 372364 373404 374218 374172 373907 374533 376518
52987 376518 379418 382498 385272 387355 388094 386861 383902 380371 377217 374495 372284 371674 373600 376673 377559
52972 377559 374344 368781 364314 362426 361908 361319 360820 361231 362383 363294 363530 363644 364307 365497 366579 366813
52956 366813 365841 364118 362939 363530 365741 367879 368193 366503 364089 362176 360903 359720 358239 356451 354519
52941 354519 352759 351699 351786 352957 354540 355528 355071 353065 350391 348291 347421 347767 349334 352137 355299 357195
52925 357195 357245 356816 357361 358303 357982 356264 354665 353873 352849 350945 349401 349738 351737 354160 356666 359703
52909 359703 362918 365056 365619 365667 366532 368165 369163 368451 366912 366962 369971 374194 376192 374563 371310 369068
52893 369068 368150 367204 365630 363848 361791 358806 355032 351530 348893 346819 345158 344321 344403 344817 344922 344280
52877 344280 342440 339561 337146 336823 338292 339792 340772 342390 344899 346412 345468 343379 342522 343395 344860
52862 344860 346308 347867 349034 349063 348580 349007 350173 350147 347980 345217 343956 344486 345689 346797 347680 348058
52846 348058 347597 346771 346708 347869 349288 349397 347518 344550 342236 341640 342211 342420 341315 339302 337413 336271
52830 336271 336001 336743 338644 341343 343917 345609 346385 346656 346727 346804 347324 348770 350939 352787 353327 352597 351497
52813 351497 350853 350937 351705 353087 355001 357436 360491 363967 367048 368914 369759 370558 371716 372608 372824 373173
52797 373173 374793 377605 380244 381317 380387 378124 375946 375148 375668 375939 374629 372405 371257 372062 373462
52782 373462 373288 370555 365934 360919 356959 355002 355191 356731 358222 358517 357631 356832 357445 359411 361440 362761
52766 362761 364142 366620 369648 371285 370285 367459 364874 363923 364152 363910 362326 360603 360753 362980 365332
52751 365332 366385 367032 368603 370433 371024 370856 371935 374674 377323 378837 380200 381967 382379 379373 373287
52736 373287 366231 359715 354204 350204 348157 347467 346835 345594 344011 342547 341532 341204 341275 340773 339074 336697
52720 336697 334422 332183 329700 327591 326703 326782 327003 327502 329041 331363 333266 334383 335443 336479 336206 333828
52704 333828 330391 327695 326684 327331 329213 331586 333711 335664 338061 340664 342245 342353 342114 342434 342579
52689 342579 341647 340529 340947 343083 345543 347281 348226 348323 347590 347092 348270 350936 353348 354714 356118 358239
52673 358239 359704 359043 357218 356537 357551 358616 358495 357950 358334 359642 360548 359783 357094 353419 350474 349661
52657 349661 350910 352773 353793 353469 351885 349177 345792 342667 340498 339151 338284 338139 338997 340133 340277
52642 340277 339242 338291 338487 339311 339434 338512 337556 337578 338369 338848 338344 337200 336110 335203 334200 333429 334074 336945
52624 336945 341241 345125 347521 348830 349770 350184 349475 347817 346287 345746 345997 346176 345825 345452 346009 347816
52608 347816 350091 351771 352734 353895 355984 358629 360922 362456 363345 363551 362969 362153 362102 362931 363463 362843 362268
52591 362268 364157 369414 376155 381503 384190 384875 384372 382443 378541 373077 367586 363838 362919 364712 367887
52576 367887 370699 372233 372748 372722 372112 371061 370751 372571 376534 381353 386168 391251 396748 401680 404768
52561 404768 405617 404507 401684 397680 393819 391315 389789 387553 383632 378930 375096 372736 371167 369705
52547 369705 368636 368718 369929 371124 371237 370620 370651 371876 373150 373150 372292 372310 373929 375785 376030 374505 372815
52530 372815 372557 374034 376616 379657 382648 384919 385940 386077 386420 387439 388164 387241 384605 381520 379144
52515 379144 377827 377766 379257 381745 383512 383240 381537 380169 380011 380422 380412 379677 378559 377749 378104 380044 382846
52498 382846 384984 385389 384153 382084 380102 378982 379061 379862 380454 380454 380421 381167 382994 385585 388193 389847 389934
52481 389934 388850 387688 387046 386558 385753 384771 383821 382509 380381 377951 376503 376857 378702 381074 383069 384057
52465 384057 383808 382664 381386 380590 380430 380905 382238 384696 388095 391717 394783 396955 398318 399088 399577 400348
52449 400348 402053 404834 408076 411053 413726 416566 419526 421627 421850 420247 417820 415411 413076 410605
52435 410605 408211 406338 404974 403590 401807 399767 397811 396238 395565 396477 398913 401540 402887 403031 403543
52420 403543 405747 409636 414472 419628 424539 428712 432341 436240 440537 443994 445328 444811 443894 443611 443973
52405 443973 444553 444899 444702 444366 445017 447054 448978 448828 446700 444637 443865 443349 441603 438864 436611 435612
52389 435612 435260 434534 432879 430250 426845 423073 419692 417782 418094 420065 421871 422130 421353 421002 421381 421462
52373 421462 420765 420162 420367 420748 420425 419768 419937 421253 422598 422317 419557 415192 411525 410369 411157 411660 410759
52356 410759 409598 409585 410556 411746 413582 417248 423073 430460 438977 448387 457900 466532 474199 481535 488635
52341 488635 494675 498667 499924 498127 493877 489056 485610 483719 481839 478651 474328 469819 465570 461234
52327 461234 456379 451429 447947 447434 449525 452138 454008 456145 459701 463335 464538 463172 461719 461902 463037
52312 463037 464261 466359 470134 474597 478253 481151 484171 487135 489256 490873 493025 495379 496235 494964
52298 494964 493101 492373 492585 492206 490404 487745 485204 483176 481583 480556 480813 483240 487934 493628 498326
52283 498326 500828 501667 502564 504943 508895 513360 517220 520308 523416 527369 532244 537619 543457 550278 558286
52268 558286 566762 574905 583204 593217 605467 618099 628568 636695 645079 655922 668134 678412
52256 678412 684865 688707 692419 697197 702587 707863 712999 718402 724258 730358 736391 742192 747657 752539
52242 752539 756591 759983 763234 766465 769063 770554 771588 773547 777191 782078 787179 791575 794674 796365
52228 796365 797005 796796 795358 792596 789833 789067 790819 793573 795666 796937 798187 799999 802771 807049 812887
52213 812887 819310 825211 830385 835094 839227 842724 846250 850403 854738 858740 863425 870501 879781 888728
52199 888728 895012 898546 900717 902898 906350 912335 920993 930560 938862 945554 952112 959664 967545 974160
52185 974160 978805 982351 986282 991064 995515 998027 998380 997834 997347 996506 994763 992979 992841 995077 999021
52170 999021 1003581 1007688 1010205 1010696 1010379 1011115 1013213 1015357 1016867 1018619 1021200 1023830 1026338 1030690 1038617
52155 1038617 1048503 1056672 1061653 1065340 1069855 1075223 1080659 1086322 1092694 1099540 1106621 1114273 1122119 1128207
52141 1128207 1130934 1131210 1131376 1132525 1134226 1136348 1139344 1142757 1145302 1146949 1149422 1153831 1159034 1163266
52127 1163266 1166414 1169536 1172737 1174749 1174554 1172643 1170596 1169847 1170722 1172250 1172914 1171771 1168719 1163784 1156905
52112 1156905 1148828 1141391 1136087 1132633 1129722 1126796 1124235 1122118 1119960 1117902 1117087 1118329 1121097 1124297
52098 1124297 1127532 1131063 1135020 1139207 1143443 1147547 1151180 1154187 1156911 1159677 1162162 1163837 1164958 1166464
52084 1166464 1168709 1170931 1172320 1173160 1174425 1176492 1178760 1180517 1181738 1182878 1184140 1185339 1186557 1188679
52070 1188679 1192794 1198808 1205089 1210244 1215140 1222306 1233003 1245846 1259051 1273166 1290312 1311016
52058 1311016 1333153 1354209 1373435 1391380 1408386 1424299 1438968 1452232 1463761 1473328 1480859 1485953
52046 1485953 1488097 1487801 1486714 1485903 1484688 1482042 1478535 1475845 1474788 1474855 1475375 1476055 1476576 1476895 1478003 1481277
52030 1481277 1486786 1493086 1498756 1503206 1505775 1505217 1500761 1493089 1483868 1474775 1467147 1461727 1458291 1456051
52016 1456051 1454681 1454378 1454788 1454771 1453700 1452199 1450963 1449535 1447012 1443551 1440403 1438497 1437462 1436065 1433544
52001 1433544 1430618 1428974 1429300 1430087 1429161 1426282 1423124 1420675 1418049 1414388 1410464 1407403 1404918 1402055 1398933
51986 1398933 1396538 1395220 1394443 1393544 1391862 1388754 1384579 1381047 1379293 1378122 1375683 1372597 1371612 1374050 1378339
51971 1378339 1382695 1387622 1394643 1403655 1412892 1421044 1428297 1435383 1442479 1449144 1454806 1459146 1462344 1465092
51957 1465092 1468096 1471453 1474655 1477338 1479893 1482975 1486360 1488694 1488888 1487469 1485769 1483684 1479169 1470354
51943 1470354 1457448 1442060 1425397 1407848 1389550 1370315 1349368 1326104 1300849 1274119 1245721
51932 1245721 1215839 1186627 1161170 1140627 1123547 1108088 1093599 1079757 1065804 1051650 1038647
51921 1038647 1028094 1019471 1011071 1001849 991789 980835 968597 955304 942324 931256 922569 915190
51909 915190 907522 899051 891071 885692 884155 886273 891201 898164 906469 915579 925491 936543 948553 960666
51895 960666 972342 983942 995820 1007089 1015766 1020198 1020307 1017629 1014149 1010838 1007283 1002917 998336
51882 998336 995025 994125 996112 1001344 1009879 1020760 1032616 1045236 1059487 1075317 1090929 1104507 1115714
51869 1115714 1124781 1131178 1134095 1133299 1128370 1117947 1101164 1079490 1055877 1032291 1009122 986639
51857 986639 965430 945305 925200 904803 885392 868589 855095 844890 837689 832599 828241 824122
51845 824122 821345 821107 822884 824962 826700 829431 834955 843761 854990 867567 880815 894137 906716
51832 906716 917744 926624 932565 934098 929610 918797 903550 887164 872595 861418 853898 849357 846438
51819 846438 843889 841899 842438 847524 856959 868300 879352 890221 902554 917324 934047 951670 968979
51806 968979 984051 994687 1000217 1002032 1001560 998533 992210 983491 974321 965486 956566 948034 941638 938317
51792 938317 937357 938288 942038 949109 957864 966050 973215 980174 986513 990025 988617 981873 970911 957491
51778 957491 943057 927744 910535 891271 872211 856473 844912 835617 826714 818703 813599 812412
51766 812412 813899 815492 815320 813581 811826 810716 809031 805495 800883 797163 794937 793186 791474 790808 791815
51751 791815 793587 795198 797264 800978 806378 812537 818717 824293 828018 828584 825839 820657 813767 805495
51737 805495 796462 787586 779254 771210 763424 756415 750527 745378 740288 734825 728872 722693 717154 713299
51723 713299 711241 709887 708294 707042 707578 710169 713140 714506 713977 712981 713011 714441 716836 719780 723226
51708 723226 727516 733315 741106 750436 760026 769057 778015 787966 799345 811911 825274 838545 849732
51695 849732 856601 858382 855959 850310 841773 831128 820280 810934 803121 795766 788409 781769 776945 774647
51681 774647 774889 776877 779578 783079 789054 799081 812643 827736 843437 860735 880334 900524 918062
51668 918062 930963 939824 946643 952945 959188 965386 971704 978133 983551 985495 981569 971653 958625 946436
51654 946436 937233 930430 924437 918656 913324 907896 900651 890493 878651 867988 860619 856638 855041
51641 855041 855192 857015 860180 863649 866139 866866 865878 863767 861221 858964 858149 860278 865995 873839 880712
51626 880712 884044 883438 880225 875875 871110 866189 861546 858034 856636 857899 861731 867895 876404 886915
51612 886915 898025 908230 917764 928448 941160 954533 966935 978743 991287 1004257 1015743 1024528
51600 1024528 1030554 1032868 1028982 1017404 999800 979679 959609 940523 922987 907910 896060 887685
51588 887685 882673 880557 880341 880659 880073 877210 871082 861570 849273 834720 818251 800875 784340 769650
51574 769650 756145 742800 729790 717843 706712 695550 684524 674740 666587 659485 653502 649843
51562 649843 649117 650108 650925 650624 649191 646858 644272 642567 642257 642432 641890 640792 640412 641436 643220 644561
51546 644561 644557 642905 640201 638011 637868 639888 642811 645629 648770 653511 660553 669526 679830 691617 705644
51531 705644 721948 738885 753992 766023 775741 784562 792914 800289 806408 811813 817646 825289 835777
51518 835777 849064 864334 881624 902588 928729 959262 991718 1024441 1057472 1091312 1126255
51507 1126255 1163010 1202406 1243720 1284367 1322083 1356793 1389957 1423108 1457863 1496418 1540873
51496 1540873 1592293 1650908 1716408 1786794 1857321 1921819 1975441 2015790 2041912 2053416 2050765
51485 2050765 2035384 2008652 1970954 1922017 1862196 1793467 1719292 1643377 1568240 1494931 1424174
51474 1424174 1357518 1297091 1244348 1199106 1159467 1122566 1086086 1049815 1015780 986458 962803
51463 962803 943917 928011 913317 898635 883803 869511 856309 844010 832451 822255 814159 807869
51451 807869 802360 797078 792080 787176 781756 775471 768348 760337 751536 742853 735423 729165 722810 715790
51437 715790 709292 704879 702629 701229 699547 697610 696213 696015 696905 698005 698421 698184 698304 699653 701795
51422 701795 703126 702350 699901 697676 696930 696569 694242 689321 683855 679966 677260 673883 669428 665273 662324
51407 662324 659967 657416 654738 652224 650053 648936 649755 651955 653598 653854 654329 656947 661506 666362 670686
51392 670686 674886 679595 685532 693807 704835 717098 728381 738429 749276 762758 778726 796105
51380 796105 814666 834902 856412 877038 893872 905285 912107 916713 920765 924150 926211 927102 926940
51367 926940 924003 915234 899216 878119 856332 837470 822818 811870 803587 797071 791587 786434 781136
51354 781136 775855 771560 769583 770906 775604 782672 790408 797451 803695 809951 816645 823332 829559 835516
51340 835516 841429 847139 852973 860305 870174 881629 892568 902243 911916 922930 935141 947739 960847
51327 960847 975678 993493 1014946 1040375 1070385 1105995 1147955 1195797 1248016 1303895 1364958
51316 1364958 1433873 1511704 1596744 1685896 1776237 1864831 1948026 2021922 2083588 2131389 2164322
51305 2164322 2181501 2182309 2166860 2136133 2091487 2033987 1964516 1885012 1799301 1711898 1625751 1541636
51293 1541636 1459858 1381843 1309697 1244779 1187135 1135937 1090108 1048918 1012339 980430 952114
51282 952114 925220 898404 872585 849750 830612 814085 798770 784095 770021 756626 744312
51271 744312 733718 724995 717553 710857 705019 700225 695992 691466 686279 680638 674790 668891 663354 658829
51257 658829 655757 654260 654412 656011 658002 658847 658045 656849 656935 658544 660477 661574 661494 660208 657795 655060
51241 655060 653572 654444 657409 661380 665460 669021 671369 671970 670789 668045 663931 658890 653638 648495 643320
51226 643320 638662 636227 637146 640290 643423 645695 647765 649806 651072 651650 652967 655757 658798 660619 661389
51211 661389 662147 663105 663978 665276 667904 671666 675365 678282 680644 682755 684780 687308 691010 695428 699145
51196 699145 701539 703480 705749 707608 707706 705817 702736 698722 693010 685176 676318 668316 662024 656649 651124
51181 651124 645748 641995 640590 640374 639519 637504 635236 633469 632057 630896 630533 631150 631664 630802 628760 626881
51165 626881 625804 624889 623575 622336 621940 622595 624336 627462 631773 635994 638947 641003 643410 646431 649339
51150 649339 652187 656140 661447 666347 668983 669637 670062 671335 673488 676651 681072 686054 690340 693855 697940
51135 697940 703462 709708 715516 720344 723597 724202 722056 719104 717546 717210 715977 712833 709371 707875 708821
51120 708821 710758 712120 712619 713070 714220 715709 716198 714612 711287 707608 704636 702422 700570 698989 697953
51105 697953 697768 698519 699870 701120 701763 702029 702460 702986 702971 702197 701125 699945 698131 695506 692968 691331
51089 691331 689892 687215 683154 678982 675373 671458 666446 661270 657682 656230 655987 655898 655437 654161 651781
51074 651781 649058 647693 648638 650968 652916 653660 653595 653272 652860 652722 653818 657056 662327 668394 673890 678492
51058 678492 683116 688750 695154 700991 705293 708388 711240 714360 717702 721127 724434 727202 729278 731283
51044 731283 734191 738522 744291 751288 758661 764567 767373 767437 766900 767302 767985 767050 763341 757245 750196 743765
51028 743765 738769 735000 732130 730777 731813 734478 736280 735431 732676 730070 728733 728503 728986 729838 730605
51013 730605 731444 733690 738513 745124 751462 756687 761895 768244 775548 783148 791045 799500 808443 818139
50999 818139 829761 844176 860272 875326 887164 895482 901228 905477 909239 913786 920404 929603 940734
50986 940734 952566 964280 975920 987901 1000144 1011783 1021800 1030026 1037515 1045802 1055591 1066125
50974 1066125 1075864 1083587 1088533 1089661 1085545 1075537 1060787 1043600 1025774 1007756 989289 970520
50962 970520 952404 936217 922692 911628 902508 895449 891090 889469 889630 890726 892857 896259 900287
50949 900287 904129 908176 913623 920822 929043 937908 947902 959066 970190 980014 988620 997029 1005863 1014867
50935 1014867 1023316 1030502 1036367 1042117 1049595 1059340 1069700 1078585 1085807 1092971 1101400 1111130 1121988
50922 1121988 1134716 1150529 1169839 1191536 1213226 1232233 1247003 1257867 1266233 1273059 1278434 1282466
50910 1282466 1285787 1288841 1291326 1292843 1293586 1293730 1292483 1288648 1282285 1275304 1270175 1268392 1270193 1275106
50896 1275106 1282407 1291545 1302723 1316713 1333565 1351669 1368841 1384420 1399715 1416337 1434706 1454397
50884 1454397 1475184 1497243 1520871 1546633 1575360 1607054 1639679 1669608 1693592 1710263 1719959
50873 1719959 1723563 1721675 1714769 1704004 1691496 1679147 1666984 1653363 1637145 1618952 1599712 1578965
50861 1578965 1555794 1530758 1505417 1480178 1454183 1427322 1400697 1374827 1349241 1324614 1303436
50850 1303436 1287030 1273114 1258048 1240878 1223675 1208411 1195092 1182803 1171008 1159517 1148265
50839 1148265 1137507 1127528 1118134 1109141 1101113 1094669 1089257 1083775 1078362 1074242 1071598 1069085 1065924 1063010
50825 1063010 1061053 1059011 1055763 1052404 1051279 1052966 1055669 1057651 1059013 1060616 1062364 1063416 1063658 1064114
50811 1064114 1065796 1068599 1071716 1074948 1079185 1085365 1093371 1102461 1112508 1123994 1136720 1149609 1162342
50798 1162342 1176275 1192752 1211088 1229489 1247862 1268431 1293157 1321458 1351111 1380767 1410895
50787 1410895 1442642 1476586 1512616 1550484 1590157 1631772 1675376 1720743 1767393 1814628 1861329
50776 1861329 1905879 1946895 1984430 2020079 2055350 2089964 2122266 2151403 2178519 2205521 2233113
50765 2233113 2260703 2288011 2315939 2345593 2377167 2410450 2445895 2484062 2523788 2561743 2594455
50754 2594455 2620441 2640020 2653444 2659861 2658040 2647505 2628928 2603782 2573663 2539639 2502075 2461258
50742 2461258 2418106 2374008 2330167 2287512 2247117 2210126 2177096 2147913 2122500 2101038 2083252
50731 2083252 2068189 2055337 2045559 2040139 2039000 2040423 2042552 2044551 2046276 2047600 2048521 2049412 2050377 2050455 2048048
50716 2048048 2042295 2033549 2022400 2008784 1992538 1974377 1955518 1936262 1915608 1892475 1866697 1838550
50704 1838550 1808093 1775698 1742677 1710378 1678834 1647235 1615729 1585776 1558577 1534123 1512054
50693 1512054 1492358 1474777 1458650 1444196 1432963 1425919 1421934 1419362 1418447 1420713 1426493 1434771 1445425
50680 1445425 1459754 1478266 1499509 1521820 1544982 1569344 1594590 1620403 1647384 1676139 1706127
50669 1706127 1736412 1766755 1796896 1825572 1851732 1876317 1901336 1927348 1953198 1978171 2002741
50658 2002741 2026784 2048578 2066439 2080494 2092043 2101789 2109356 2114134 2116195 2116944 2119109 2125363 2136318
50645 2136318 2150352 2165772 2182543 2201468 2222502 2244823 2268176 2293249 2320715 2350344 2380757
50634 2380757 2409631 2434538 2454344 2469749 2482177 2492545 2501577 2510601 2520983 2532855 2545259 2557453
50622 2557453 2569428 2581358 2593542 2606930 2622677 2640927 2660880 2682482 2707344 2737578 2774135
50611 2774135 2816474 2863211 2912752 2963927 3016301 3069440 3121829 3171524 3218150 3263302 3308359
50600 3308359 3352944 3396416 3439775 3484683 3531138 3577600 3623333 3669235 3716228 3764113 3812430
50589 3812430 3861521 3912282 3965627 4022491 4083543 4148527 4216690 4288312 4364866 4446924 4532456
50578 4532456 4617909 4700648 4779807 4855264 4926451 4991882 5049376 5097073 5134686 5163330 5183804
50567 5183804 5195901 5200156 5199099 5194777 5184705 5161743 5119099 5055478 4975625 4887074 4797025 4711365
50555 4711365 4634881 4571108 4521559 4485343 4460016 4442959 4431687 4422931 4412450 4396576 4373436
50544 4373436 4341830 4299480 4243692 4173839 4092098 4001451 3903692 3799455 3689284 3574532 3458072
50533 3458072 3344163 3236407 3135463 3039888 2949524 2866544 2792467 2725759 2663964 2607271 2558295
50522 2558295 2518718 2487675 2463282 2444320 2430256 2420920 2416714 2418396 2426173 2439391 2457188 2478989
50510 2478989 2504322 2532591 2562960 2594076 2624134 2651769 2676790 2699674 2720806 2740965 2762087
50499 2762087 2786554 2815717 2849834 2889106 2933777 2983364 3037046 3095042 3158651 3228692 3304750
50488 3304750 3385979 3471488 3559628 3648146 3735929 3824048 3914619 4009173 4108467 4213125 4323944
50477 4323944 4442062 4569040 4706192 4853704 5011262 5179627 5360413 5553840 5757872
50468 5757872 5970285 6190440 6418091 6651490 6887927 7125382 7362233 7595475 7820257
50459 7820257 8030909 8221562 8386287 8520061 8619947 8684649 8713046 8703920 8657027 8573687 8456561
50448 8456561 8309832 8139655 7953444 7758293 7560417 7365705 7179701 7006844 6850639
50439 6850639 6714979 6604474 6522863 6471199 6447547 6447750 6466182 6496387 6531545 6564327 6586439
50428 6586439 6589168 6565153 6509911 6421918 6301876 6152165 5976664 5780617 5570421 5353010
50418 5353010 5134560 4919243 4709282 4506174 4311540 4126801 3952703 3789555 3637689
50409 3637689 3497347 3368300 3249866 3141189 3041232 2948572 2861646 2779510 2702432 2631457
50399 2631457 2567227 2509329 2457067 2410618 2370808 2337617 2309481 2284432 2261532 2240925 2223064
50388 2223064 2208388 2197210 2189248 2183626 2180002 2179274 2182360 2188643 2196609 2205790 2216982 2230498 2245413
50375 2245413 2261004 2278015 2297918 2321524 2348789 2379357 2412794 2448747 2487455 2529868 2576855
50364 2576855 2628461 2684120 2743334 2806016 2872600 2944093 3021734 3106372 3198234 3297241 3403157
50353 3403157 3515547 3634165 3759259 3890718 4026803 4164485 4301279 4435925 4567073
50344 4567073 4692417 4809809 4918292 5017058 5103928 5175667 5229314 5262483 5273156 5260519 5225779
50333 5225779 5170831 5096088 5000938 4886956 4759883 4627801 4497694 4373863 4258612 4153399
50323 4153399 4059352 3977429 3908543 3853591 3813244 3787408 3774429 3770703 3771379 3771837 3768581 3758951 3740425
50310 3740425 3710534 3667352 3609927 3538566 3455026 3362225 3263006 3158831 3050057 2937974 2826187
50299 2826187 2719055 2618545 2523311 2431367 2342950 2260122 2184248 2115027 2051653 1993435 1939101
50288 1939101 1887095 1837599 1793090 1755556 1723761 1694599 1666776 1641652 1620261 1601161 1582162
50277 1582162 1563255 1546538 1533435 1523030 1513381 1503669 1494382 1485742 1476863 1466788 1455812 1445138
50265 1445138 1435454 1426610 1418761 1413029 1410497 1410987 1413338 1416447 1419492 1421562 1422094 1421801 1422431 1425164 1429603
50250 1429603 1434611 1439836 1446085 1454339 1464699 1476298 1488035 1499180 1509223 1517507 1523608 1528249 1533296
50237 1533296 1540223 1548681 1556953 1563750 1569160 1574009 1578862 1583718 1588192 1591810 1594558 1597437 1602135 1609699
50223 1609699 1619526 1629929 1639861 1650110 1662831 1680034 1702562 1730388 1763064 1798838 1833092 1858772
50211 1858772 1869726 1864146 1844862 1816844 1784903 1752820 1722754 1694598 1666715 1638163 1610050
50200 1610050 1584433 1562372 1543525 1527135 1512753 1500193 1489487 1480898 1474428 1469218 1463896 1457738
50188 1457738 1451242 1445539 1441565 1439896 1440859 1444346 1449566 1455392 1460982 1465910 1469709 1471701 1471585 1470058
50174 1470058 1468429 1467432 1466536 1464562 1460776 1455110 1447492 1437469 1424828 1410410 1395916 1382780 1371285
50161 1371285 1360736 1350315 1339651 1328770 1317764 1306650 1295540 1284967 1275995 1269626 1265682 1262436
50149 1262436 1258087 1252991 1249791 1250664 1254787 1259408 1263280 1268011 1275734 1286476 1298485 1310410 1322322
50136 1322322 1335153 1350148 1368667 1391537 1418404 1448305 1480778 1515731 1552329 1589017 1624875
50125 1624875 1660120 1694875 1728131 1758397 1784754 1806892 1825019 1840500 1855865 1872839 1890337
50114 1890337 1905298 1915566 1921132 1922500 1918968 1909185 1892824 1870904 1844776 1815511 1784222 1752385
50102 1752385 1721624 1693413 1668978 1649132 1634097 1623688 1617648 1615614 1616948 1621114 1628105 1637684
50090 1637684 1647894 1655167 1656670 1652192 1643063 1629765 1611755 1589448 1564936 1540057 1514731 1488052
50078 1488052 1460435 1433815 1410024 1389791 1373177 1360160 1350688 1344680 1342007 1342038 1343227 1343742 1342738
50065 1342738 1340713 1338602 1336895 1335589 1334422 1332999 1331066 1328939 1327333 1326619 1326509 1326576 1326821 1327659 1329582
50050 1329582 1332912 1337483 1342371 1346284 1348669 1350501 1353836 1360359 1370036 1381005 1391024 1399429 1407624
50037 1407624 1417461 1429366 1442322 1455213 1467526 1479095 1490085 1501265 1513403 1526332 1539502
50026 1539502 1553620 1570651 1591659 1615677 1641460 1669436 1700960 1736435 1775431 1818164 1865363
50015 1865363 1916560 1969785 2023451 2077724 2133627 2191473 2250640 2310204 2369058 2425681 2478478
50004 2478478 2526593 2570259 2610430 2648145 2684090 2718519 2751288 2781565 2807191 2824676 2830619
49993 2830619 2823574 2804337 2774428 2734737 2685939 2629675 2568606 2505225 2441011 2376836 2313876
49982 2313876 2253753 2197752 2146086 2098087 2053139 2011338 1973281 1939449 1909960 1884789 1863960
49971 1863960 1847375 1834483 1824158 1814953 1805698 1796018 1786173 1776305 1766060 1755122 1743892 1733244
49959 1733244 1723637 1714694 1705593 1695568 1684121 1671206 1657354 1643245 1628833 1613026 1594469 1572660
49947 1572660 1548347 1522960 1497739 1473292 1449862 1427868 1407999 1390771 1376413 1365409 1358752
49936 1358752 1357141 1360255 1367399 1378517 1393523 1410560 1426176 1437961 1446257 1452653 1457624 1460692 1462175
49923 1462175 1463272 1464274 1463904 1460873 1455113 1447082 1436760 1424179 1410392 1396984 1384688 1373090 1361795
49910 1361795 1351478 1343682 1339664 1339268 1340868 1342818 1345298 1350383 1359864 1373336 1389032 1406215 1425904
49897 1425904 1449298 1476561 1507589 1543055 1583768 1629364 1678531 1730577 1786065 1845629 1908559
49886 1908559 1972726 2035488 2094356 2147301 2193205 2232286 2265661 2294235 2318095 2336975 2350712
49875 2350712 2358644 2358786 2348305 2324971 2287765 2236347 2171242 2095297 2013935 1932557 1853777 1778078
49863 1778078 1706686 1642156 1585872 1536567 1492330 1453057 1419888 1392965 1370810 1351463 1333311
49852 1333311 1315413 1298225 1283739 1273701 1267760 1264415 1263481 1266084 1272111 1279389 1286211 1293393 1302866
49839 1302866 1315199 1329606 1345514 1362892 1381357 1400102 1418497 1435809 1450480 1460683 1465738
49828 1465738 1466359 1463626 1458397 1451462 1443171 1432701 1418595 1400329 1378678 1354422 1327605 1298506
49816 1298506 1268510 1239308 1211734 1186038 1162815 1142888 1126318 1112145 1099186 1086897 1075683
49805 1075683 1066676 1060994 1058826 1059339 1061682 1065686 1071289 1077864 1084856 1092826 1102972 1115629 1130004
49792 1130004 1145489 1162405 1181217 1201767 1223608 1246289 1268701 1288892 1305370 1318236 1328274
49781 1328274 1335346 1338676 1338599 1336814 1334459 1330695 1323760 1312990 1299379 1284559 1269697 1255114 1240534
49768 1240534 1225803 1211619 1199378 1189975 1182946 1177124 1172001 1168149 1166428 1167230 1170511 1176173 1184199
49755 1184199 1194552 1207188 1222208 1239819 1259927 1281654 1303432 1323802 1341965 1357451 1369661
49744 1369661 1378364 1384413 1389092 1392631 1394117 1392983 1389574 1383927 1375202 1363147 1349035 1333998 1317271
49731 1317271 1297495 1275177 1252287 1229727 1206996 1184441 1164014 1147142 1133308 1121559 1112093
49720 1112093 1105333 1100465 1096079 1091624 1087326 1083382 1080349 1079656 1082385 1087622 1093177 1098144 1103939 1112645
49706 1112645 1124893 1139508 1154716 1169522 1184191 1199479 1215273 1230163 1242460 1251466 1257734 1262594
49694 1262594 1267479 1272845 1277118 1277312 1271468 1260226 1245683 1229372 1211994 1194257 1176819 1159676
49682 1159676 1142648 1126334 1111782 1099411 1089062 1080783 1074661 1070175 1066795 1064961 1065335 1067219 1069019
49669 1069019 1070374 1072537 1076377 1081157 1085675 1089529 1092867 1096034 1100043 1106474 1116236 1129083 1144592
49656 1144592 1162616 1182419 1202534 1222139 1241436 1259817 1274783 1283898 1287242 1286932 1284882 1281980
49644 1281980 1278649 1274815 1269540 1261918 1252323 1242016 1231715 1221493 1211762 1203163 1195369 1186954 1176764
49631 1176764 1164973 1152844 1142033 1133923 1128803 1125681 1123459 1122212 1122754 1125340 1129656 1135772 1144007
49618 1144007 1153940 1164770 1176763 1191234 1208849 1229013 1251110 1274909 1299031 1320391 1336484
49607 1336484 1347603 1355840 1362491 1367549 1371213 1374417 1377708 1380680 1382932 1384861 1386999 1388931 1389174 1385884
49593 1385884 1377492 1362951 1341866 1314780 1283585 1251518 1222084 1197324 1177006 1159670 1144206
49582 1144206 1130227 1117479 1105759 1095466 1087375 1081461 1076458 1071111 1065556 1060998 1058170 1056558 1055009
49569 1055009 1052614 1048908 1043721 1037180 1029732 1021981 1014563 1008178 1003318 999659 995987 991187 985295 979259
49555 979259 973817 969146 965469 963227 962218 961210 959086 956201 954093 953996 955906 958882 961750 963734 964980
49540 964980 966473 968986 972182 975077 977237 979000 980764 982761 985350 988587 991479 992753 992715 993350 995905
49525 995905 999219 1001283 1001799 1002248 1003849 1006424 1009057 1011040 1012309 1013763 1017114 1023615 1032847 1043329
49511 1043329 1054099 1065016 1075763 1085839 1095737 1106998 1120454 1135162 1149647 1163600 1177761
49500 1177761 1192644 1207798 1221726 1232139 1237190 1237322 1235259 1233170 1230361 1224919 1217203 1210125 1205810
49487 1205810 1203405 1200842 1197561 1194567 1192789 1192545 1194104 1197388 1201197 1203815 1204587 1204213 1203561 1203277 1204633
49472 1204633 1209201 1216771 1224749 1231021 1236779 1244973 1256268 1268370 1279640 1291471 1305901 1322366
49460 1322366 1338493 1353350 1367968 1382791 1396465 1407759 1417395 1427120 1437815 1449198 1460760 1472368
49448 1472368 1484496 1498341 1514915 1533269 1550151 1562241 1568376 1569003 1564199 1553458 1537212 1517273
49436 1517273 1495542 1473161 1451079 1430505 1412230 1396122 1381738 1369082 1358339 1349167 1340685 1332179
49424 1332179 1323692 1315907 1309367 1303813 1298605 1293955 1291126 1290769 1291669 1291971 1291372 1291024 1291466 1291996 1292201 1292736
49408 1292736 1294100 1295939 1298322 1302462 1309021 1316646 1323491 1329610 1336455 1344285 1351471 1356464 1359292 1360841
49394 1360841 1361549 1361363 1360332 1358733 1356799 1354485 1351360 1346845 1340913 1334478 1328657 1323703 1319074 1314465
49380 1314465 1310305 1307196 1305335 1304690 1305509 1308510 1314499 1323716 1335672 1350081 1367919 1390801 1419049
49367 1419049 1451239 1486193 1524661 1568512 1619201 1677799 1745427 1822756 1910358 2010377 2124480
49356 2124480 2245520 2351680 2414666 2418212 2368641 2287205 2194487 2102746 2018261 1944727 1883273
49345 1883273 1832578 1791012 1757966 1732980 1714988 1702958 1696256 1693988 1694847 1697860 1702662 1708987 1716608
49332 1716608 1725562 1735538 1745082 1752320 1756424 1757578 1755820 1751174 1744708 1737822 1730171 1719760 1705776
49319 1705776 1690030 1674846 1660723 1647052 1634257 1623979 1617611 1615504 1617168 1621434 1626745 1632085
49307 1632085 1637569 1643767 1650772 1658207 1665372 1670793 1672439 1669384 1662961 1655576 1648800 1643202 1639131 1636260
49293 1636260 1632782 1626658 1617927 1608604 1600067 1591726 1582687 1573543 1565738 1559887 1555473 1551645 1547632 1542857
49279 1542857 1537474 1532594 1529251 1527069 1524331 1519428 1512036 1503075 1493868 1485275 1477335 1469746 1462657 1456665
49265 1456665 1451823 1447142 1441669 1435880 1431359 1429000 1428031 1427110 1426028 1425954 1428008 1431895 1436021 1438876 1440234
49250 1440234 1441102 1442681 1445424 1448913 1452426 1455659 1458975 1462871 1466984 1469907 1470476 1469387 1469118 1471965 1478340
49235 1478340 1486976 1496296 1505301 1513628 1521435 1529262 1537672 1546860 1556572 1566160 1574676 1581408 1586681 1591816
49221 1591816 1597806 1604292 1610200 1615015 1618863 1621710 1623412 1624657 1627102 1632149 1639873 1649149 1658440 1666611
49207 1666611 1673790 1681632 1692070 1705502 1720798 1737290 1755919 1777801 1802320 1827577 1852504 1877744
49195 1877744 1904534 1933573 1965277 2000435 2039810 2082970 2127901 2172095 2213981 2252850 2287177
49184 2287177 2313564 2328172 2329301 2318117 2297084 2268603 2235307 2200362 2166363 2134306 2104381
49173 2104381 2077452 2054947 2037433 2023927 2012619 2001820 1990311 1977334 1962462 1945544 1927196
49162 1927196 1909395 1894667 1883926 1875558 1867339 1858614 1849767 1840334 1829341 1817505 1807560 1801834 1800512
49149 1800512 1802629 1807587 1814913 1823548 1832528 1842059 1853052 1865649 1878841 1891526 1903485 1915207
49137 1915207 1927022 1938634 1949564 1959871 1969937 1979351 1986627 1990752 1992662 1994281 1996353 1998157 1999205
49124 1999205 1999966 2000808 2001665 2003311 2007644 2015680 2026078 2036633 2046707 2057541 2070875 2088099 2110109
49111 2110109 2137047 2168622 2205412 2249059 2299768 2353723 2403927 2443546 2467967 2474775 2464049
49100 2464049 2439357 2407033 2373155 2341198 2312498 2287962 2268583 2254708 2245486 2239127 2233683 2227958
49088 2227958 2221951 2216318 2211346 2206607 2201491 2195679 2189058 2181597 2173572 2165661 2158614 2152839 2148351 2145031
49074 2145031 2143031 2142941 2145381 2150270 2156843 2164669 2174381 2187072 2203078 2221631 2241424 2261161 2279978
49061 2279978 2298024 2316706 2337829 2362291 2389758 2419447 2451033 2484897 2521844 2562534 2607244
49050 2607244 2656490 2711856 2775452 2848256 2929916 3020813 3123085 3237772 3360708 3482575
$$ [...]
##END NTUPLES=NMR SPECTRUM
##END=
