
##TITLE=AC1227_VIERS11107_6074976_PiINvGLfJz
##JCAMPDX= 6.0         $$ Bruker NMR JCAMP-DX V2.0
##DATA TYPE= NMR SPECTRUM
##DATA CLASS= NTUPLES
##ORIGIN= BRUKER
##OWNER= Administrator
$$ 1.72 TOPSPIN		Version 2.1
$$ 2012-05-08 21:56:47.937 -0500  Administrator@TOPSPIN
$$ Compression mode = diff/dup
##.OBSERVE FREQUENCY= 400.13188235
##.OBSERVE NUCLEUS= ^1H
##.ACQUISITION MODE= SIMULTANEOUS (DQD)
##.ACQUISITION SCHEME= undefined
##.AVERAGES= 8
##.DIGITISER RES= 22
##SPECTROMETER/DATA SYSTEM= spect
##.PULSE SEQUENCE= zg30
##.SOLVENT NAME= COFFEE_meoh
##.SHIFT REFERENCE= INTERNAL, COFFEE_meoh, 1, 14.98061
##AUDIT TRAIL= $$ (NUMBER, WHEN, WHO, WHERE, PROCESS, VERSION, WHAT)
$$ ##TITLE= Audit trail, TOPSPIN		Version 2.1
$$ ##JCAMPDX= 5.01
$$ ##ORIGIN= Bruker BioSpin GmbH
$$ ##OWNER= Administrator
$$ $$ C:\Bruker\TOPSPIN/data/COFFEE/nmr/AC1227_VIERS11107_6074976_PiINvGLfJz/20/pdata/1/auditp.txt
$$ ##AUDIT TRAIL=  $$ (NUMBER, WHEN, WHO, WHERE, PROCESS, VERSION, WHAT)
(   1,<2012-05-08 21:56:41.203 -0500>,<Administrator>,<TOPSPIN>,<go>,<TOPSPIN 2.1>,
      <created by zg
	started at 2012-05-08 21:55:34.203 -0500,
	POWCHK enabled, PULCHK disabled,
       configuration hash MD5:
       AF F2 23 6B 01 CD 40 DD E5 A1 38 A0 06 EA F7 77
       data hash MD5: 64K
       51 19 D8 4C 94 B3 1F DC C7 A6 B3 01 36 AD 85 8C>)
(   2,<2012-05-08 21:56:43.828 -0500>,<Administrator>,<TOPSPIN>,<proc1d>,<TOPSPIN 2.1>,
      <Start of raw data processing
       efp LB = 0 FT_mod = 6 PKNL = 1 PHC0 = 0 PHC1 = 0 SI = 32K 
       data hash MD5: 32K
       3D 3F 06 4E 46 BE 2E 45 8E 11 39 E4 AF 65 D1 EF>)
(   3,<2012-05-08 21:56:44.250 -0500>,<Administrator>,<TOPSPIN>,<proc1d>,<TOPSPIN 2.1>,
      <pk PHC0 = 211.3934 PHC1 = 0 
       data hash MD5: 32K
       AB 7B 90 58 C2 31 CC A9 93 55 0C 3B BE 96 BD B7>)
(   4,<2012-05-08 21:56:44.343 -0500>,<Administrator>,<TOPSPIN>,<proc1d>,<TOPSPIN 2.1>,
      <abs ABSG = 1 
       data hash MD5: 32K
       61 6D 8C 74 E2 77 DA E3 72 C1 AA 98 C5 74 ED 9F>)
(   5,<2012-05-08 21:56:44.375 -0500>,<Administrator>,<TOPSPIN>,<proc1d>,<TOPSPIN 2.1>,
      <abs ABSG = 2 
       data hash MD5: 32K
       8A 36 BC A7 FF 3E 55 40 61 6A 9D 86 14 BC F7 EC>)
(   6,<2012-05-08 21:56:44.406 -0500>,<Administrator>,<TOPSPIN>,<proc1d>,<TOPSPIN 2.1>,
      <abs ABSG = 3 
       data hash MD5: 32K
       54 3E 3E F9 CF 99 CD 24 67 99 83 94 25 8D FD 89>)
(   7,<2012-05-08 21:56:44.437 -0500>,<Administrator>,<TOPSPIN>,<proc1d>,<TOPSPIN 2.1>,
      <abs ABSG = 4 
       data hash MD5: 32K
       24 F8 24 B0 1C 34 A8 3D 2F AB 7A 8A 88 37 42 BB>)
(   8,<2012-05-08 21:56:44.468 -0500>,<Administrator>,<TOPSPIN>,<proc1d>,<TOPSPIN 2.1>,
      <abs ABSG = 5 
       data hash MD5: 32K
       16 84 5E AA E3 2B BF A6 29 C4 2B E9 F4 63 B6 85>)
$$ ##END=
$$ 
$$ $$ hash MD5
$$ $$ 9C 44 B4 89 14 C2 1A A5 85 38 88 ED BD CD 68 3D
##$RELAX= 
##$RELAX= 
##$RELAX= 
##$RELAX= 
##$RELAX= 
##$RELAX= 
##$RELAX= 
$$ Bruker specific parameters
$$ --------------------------
$$ [...]
150 150 150 150 150 150 150 150
##$TP07= 0
##$TPNAME0= <>
##$TPNAME1= <>
##$TPNAME2= <>
##$TPNAME3= <>
##$TPNAME4= <>
##$TPNAME5= <>
##$TPNAME6= <>
##$TPNAME7= <>
##$TPOAL= (0..7)
0.5 0.5 0.5 0.5 0.5 0.5 0.5 0.5
##$TPOFFS= (0..7)
0 0 0 0 0 0 0 0
##$TUNHIN= 0
##$TUNHOUT= 0
##$TUNXOUT= 0
##$USERA1= <user>
##$USERA2= <user>
##$USERA3= <user>
##$USERA4= <user>
##$USERA5= <user>
##$V9= 5
##$VALIST= <valist>
##$VCLIST= <CCCCCCCCCCCCCCC>
##$VD= 0
##$VDLIST= <DDDDDDDDDDDDDDD>
##$VPLIST= <PPPPPPPPPPPPPPP>
##$VTLIST= <TTTTTTTTTTTTTTT>
##$WBST= 1024
##$WBSW= 4
##$XGAIN= (0..3)
0 0 0 0
##$XL= 0
##$YL= 0
##$YMAX_a= 533630
##$YMIN_a= -655162
##$ZGOPTNS= <>
##$ZL1= 120
##$ZL2= 120
##$ZL3= 120
##$ZL4= 120
##$ABSF1= 14.98061
##$ABSF2= -5.57192
##$ABSG= 5
##$ABSL= 3
##$ALPHA= 0
##$AQORDER= 0
##$ASSFAC= 0
##$ASSFACI= 0
##$ASSFACX= 0
##$ASSWID= 0
##$AUNMP= <proc_prof1d_extract_pilot.lims>
##$AXLEFT= 0
##$AXNAME= <>
##$AXNUC= <1H>
##$AXRIGHT= 0
##$AXTYPE= 0
##$AXUNIT= <>
##$AZFE= 0.1
##$AZFW= 0.1
##$BCFW= 0
##$BC_mod= 0
##$BYTORDP= 0
##$COROFFS= 0
##$CY= 15
##$DATMOD= 1
##$DC= 0
##$DFILT= <>
##$DTYPP= 0
##$F1P= 0
##$F2P= 0
##$FCOR= 0.5
##$FTSIZE= 32768
##$FT_mod= 6
##$GAMMA= 0
##$GB= 0
##$INTBC= 1
##$INTSCL= 1
##$ISEN= 128
##$LB= 0
##$LEV0= 0
##$LPBIN= 0
##$MAXI= 10000
##$MC2= 0
##$MEAN= 0
##$ME_mod= 0
##$MI= 0
##$NCOEF= 0
##$NC_proc= -8
##$NLEV= 6
##$NOISF1= 0
##$NOISF2= 0
##$NSP= 0
##$NTH_PI= 0
##$NZP= 0
##$OFFSET= 14.98061
##$PC= 1
##$PHC0= 211.3934
##$PHC1= 0
##$PH_mod= 1
##$PKNL= yes
##$PPARMOD= 0
##$PPDIAG= 0
##$PPIPTYP= 0
##$PPMPNUM= 2147483647
##$PPRESOL= 1
##$PSCAL= 4
##$PSIGN= 0
##$PYNMP= <proc.py>
##$REVERSE= no
##$SF= 400.13
##$SI= 32768
##$SIGF1= 0
##$SIGF2= 0
##$SINO= 400
##$SIOLD= 32768
##$SPECTYP= <>
##$SREGLST= <1H.CDCl3>
##$SSB= 0
##$STSI= 32768
##$STSR= 0
##$SW_p= 8223.68421052632
##$SYMM= 0
##$S_DEV= 0
##$TDeff= 65536
##$TDoff= 0
##$TI= <>
##$TILT= no
##$TM1= 0
##$TM2= 0
##$TOPLEV= 0
##$USERP1= <user>
##$USERP2= <user>
##$USERP3= <user>
##$USERP4= <user>
##$USERP5= <user>
##$WDW= 1
##$XDIM= 32768
##$YMAX_p= 458891898
##$YMIN_p= -771955
##$CURPLOT= <Network HP LaserJet P1505>
##$CURPRIN= <$Network HP LaserJet P1505>
##$DFORMAT= <normdp>
##$LAYOUT= <+/1D_H.xwp>
##$LFORMAT= <normlp>
##$PFORMAT= <normpl>
##$SURQMSG= 1
$$ End of Bruker specific parameters
$$ ---------------------------------
##NTUPLES= NMR SPECTRUM
##VAR_NAME=  FREQUENCY,     SPECTRUM/REAL,   SPECTRUM/IMAG
##SYMBOL=    X,             R,               I
##VAR_TYPE=  INDEPENDENT,   DEPENDENT,       DEPENDENT
##VAR_FORM=  AFFN,          ASDF,            ASDF
##VAR_DIM=   32768,         32768,           32768
##UNITS=     HZ,            ARBITRARY UNITS, ARBITRARY UNITS
##FACTOR=    0.250966925370066, 1,           1
##FIRST=     8223.43324360095, 36565,        -186013
##LAST=      0,             33267,           -223128
##MIN=       0,             -771955,         0
##MAX=       8223.43324360095, 458891898,    0
$$ Real data points
##PAGE= N=1
##DATA TABLE= (X++(R..R)), XYDATA
$$ [...]
19483b35035g6721j10542N8908A99117b84181Q4115b4561G7702a43460b7833j34630
19472a62463L6585k01478I1260b40109f6219D4619a26544p8496A63191b42715
19461a15190k5775I7170M698e82218b4683A17010C1628J77753b04549h7348k8675
19450a16023e1105j92743n5804b6040q4315D9885j322N9275a6610l73400a91710
19438D0406i0839E6428L05098f5447c1337B71265C6784a06694N394r1482C7817
19426g5652N627l6698d9425j01722B36572c2404l62113J81285j95516A27203F0239
19414D212h4862K0975l7253A6790a35348j56334f1505l69489a78017j7160j64953
19403c60130h4052F5456i7107H9538A6345b12866e5197k47689a20293p652A30062
$$ y = [-235035, -76721, -187263, -128355, 199117, -284181, -200066, -24561, 77702, -143460, -27833, -162463, -125878, -327356, 91260, -240109, -66219, 44619, -126544, -205040, 163191, -242715, -115190, -140965, 97170, 101868, -582218, -24683, 117010, 31628, 209381, -204549, -87348, -116023, -51105, -243848, -299652, -26040, -110355, 49885, 48563, 107838, -16610, -390010, -191710, 40406, -90839, 56428, 361526, -65447, -31337, 271265, 36784, -106694, -101300, -192782, 37817, -75652, -70025, -106723, -49425, -151147, 236572, -32404, -394517, -213232, -408748, 127203, 60239, 4212, -84862, -63887, -101140, 16790, -135348, -291682, -61505, -430994, -178017, -195177, -360130, -84052, 65456, -97107, 89538, 16345, -212866, -55197, -302886, -120293, -127945, 130062]
19391a45866B15490c49561a26254E2850j8830n9a2186m7217r0512E9896c59584
19379B14699n7699i3350k28787L6870B15402b76925c6482F8050a24813j04500
19369b29313K5838k6902M9257Q6379L5377q0258E0341a1119m28646a29271c9991
19357b09986A1900J82046b86697j72765A4013F323K0821b2861A29433a98960d0652
19345B04006b38254C3627b69058I4472f2206m22107a54037r5011J23687A33462
19334I2861g055I262N976a48967C01097d55943a78530G1460P7579c17322L8035
19323b79287a15146G5585K1725h2158D4528h9316B29235b8134C3070h7798k08481
19312b96279a23712n15269h4630M71A44109K37098b39603F6990O8702Q6208i2474
$$ y = [-145866, 215490, -349561, -126254, 52850, 34020, 33961, -12186, -59403, -149915, 59896, -359584, 214699, 157000, -93350, -322137, -285267, 215402, -276925, -36482, 68050, -124813, -229313, -203475, -230377, -181120, -94741, -59364, -139622, 50341, -11119, -439765, -129271, -39991, -209986, 11900, 193946, -286697, -459462, 14013, 6323, 27144, -22861, 129433, -198960, -40652, 204006, -238254, 33627, -269058, 94472, -62206, -484313, -154037, -249048, -125361, 133462, 92861, -7055, 9262, 15238, -148967, 301097, -455943, -178530, 71460, 149039, -317322, -279287, -115146, 75585, 97310, -82158, 44528, -89316, 229235, -28134, 33070, -87798, -296279, -123712, -638981, -84630, -84159, 144109, 381207, -239603, 66990, 135692, 221900, -92474]
19300a80433D78412F0634N89a37146A00155a32589L16a8346j89824N5304n3534
19289b06400C18K60449h2397l4712j38084a12008B1610i876A35017D6010a28218
19277b50658M6685A44994g3346l10122H7596f9624B094K28157a15772A74144a64832
19265A8220c6597n0534J0551E9710a97466N1268m0460G4573Q0878b87907B90742
19253c63319o3950a3772j0179D54100A21337d16414a04326k97262B3497R1002
19243A14499N035K5063c28940f2066J1193m60755a63107b1042A8155c08148g7037
19231F2184K79079a69616H457b11843C8862b10221i2024l3362M0421r1080l2148
19220b08193E2869d4138a0534D8188L0274b66711G383e592B66036c1162A34923
$$ y = [-180433, 478412, 60634, 61223, -137146, 100155, -132589, -132273, -18346, -208170, -152866, -206400, 318, 260767, -82397, -117109, -255193, -112008, 21610, -9876, 135017, 46010, -128218, -250658, -203973, 144994, -73346, -383468, 87596, -69624, 2094, 230251, -115772, 174144, -164832, 18220, -36597, -87131, -76580, 59710, -197466, -146198, -186658, 74573, 155451, -287907, 290742, -363319, -427269, -13772, -23951, 454100, 121337, -416414, -104326, -401588, 23497, 114499, 119534, 144597, -328940, -62066, -50873, -511628, -163107, -21042, 18155, -308148, -77037, 62184, 341263, -169616, 8457, -211843, 38862, -210221, -92024, -125386, -84965, -176045, -208193, 52869, -44138, -10534, 48188, 78462, -266711, 7383, -5592, 266036, -31162, 134923]
19208a16350A87781j573c35689C622d18383a64600O2670B7700M06451a53925p9514
19197b33439C8002c33905J42723F5621b91416J43121n4153e4813o7234A49284
19186a32754k32907J19820R1540k0223f7097a2506A8042a47169B07998F4206c38526
19174d2255f078k93806i5387j40115k392D9943J08127a02179N793d6230B51578
19162I9699e27044D1931p916P2425J09555f2339k33638J14615M9921A01509a92008
19150g3176H5241l9091a87744K8189j53227J26467P6083k01238P7440a4891j86542
19139b01433a4169k99029J44058N2720l1249C632d24668a41045J1909m7658c6007
19127b77601A00586B6399g8758l39006A4908Q2300J17315b26755A79833d4238
$$ y = [-116350, 187781, 186208, -335689, 3622, -418383, -164600, -101930, 27700, 434151, -153925, -233439, 38002, -333905, -191182, 65621, -291416, -148295, -202448, -54813, -122047, 149284, -132754, -365661, -245841, -154301, -174524, -67097, -12506, 18042, -147169, 207998, 64206, -338526, -42255, -6078, -299884, -95387, -235502, -237894, 49943, 158070, -102179, -96386, -46230, 251578, 99699, -527044, 41931, 34015, 106440, 215995, -62339, -295977, -181362, -131441, 101509, -192008, -73176, 85241, 46150, -187744, -159555, -312782, -186315, -110232, -311470, -234030, -14891, -201433, -14169, -313198, -169140, -116420, -147669, 3632, -424668, -141045, -129136, -176794, -36007, -277601, 100586, 26399, -78758, -417764, 14908, 97208, 214523, -226755, 179833, -44238]
19116A28885b63610a4195q6361j25944b5059J0566j18489a10k17478j6359k18582
19105d52529a9200k03386d6882o8646j07750a8245E7086J0931b9372A00333D1943
19093a4698A1720K12915A04816a37206k6421A31259a1071r7945C26373A40813
19082E5729c65986a73970m7711q1951C90533L6244h7521j03521P9915O950j32249
19071b36426A25943H36L02697a57165B03334A7946d2671A41201J1106c38602A25421
19059c0477j71646d3688a866n4189H4030f0662G7259b09183A08643b15658P7314
19048a38344A38335c65298A54960c29856b2586A38629i1139A95449R7966b80158
19037a09383e1311A16574K76431a29998e7091A34600a00183k42061E3881j3740
$$ y = [128885, -263610, -14195, -100556, -226500, -25059, -14493, -132982, -110, -217588, -233947, -452529, -19200, -222586, -46882, -115528, -223278, -18245, 57086, 68017, -29372, 100333, 41943, -14698, 11720, 224635, 104816, -137206, -163627, 131259, -11071, -109016, 326373, 140813, 55729, -365986, -173970, -221681, -303632, 390533, 426777, -87521, -191042, -111127, -104177, -236426, 125943, 836, 303533, -157165, 203334, 17946, -42671, 141201, 152307, -338602, 125421, -30477, -202123, -43688, -1866, -56055, 84030, -60662, 77259, -209183, 108643, -215658, -138344, 138335, -365298, 154960, -329856, -22586, 138629, -91139, 195449, 293415, -280158, -109383, -51311, 116574, 393005, -129998, -57091, 134600, -100183, -342244, 53881, 40141]
19027D0141Q5394B4233b6232j69792f8793D7806b31005a7900j97890B54795a00934
19015b13000H0476a89983B00652a05215F9857J81037a84421e452j84785M0427
19005a49810C15117A47505C4059J5027a19909j69653a37034K1860A26737D0934
18994I5946b27945O8950d7937B65428b25299L1051A71806m3239a67088A20734
18983a36400F8932a92862A10729J18225E6725d46414A68032B5075K2892e7311
18972b50812f5215B56684C902a15337C5163c8033G3331J53165b62436B04822a77108
18960b91978R1765A6548K72614a80581H2009k3106L00096b12204b7840j72040
18950a99880A30460J32541j17723J07676F5803J0951b20627f1946j25199b4530
$$ y = [40141, 125535, 24233, -26232, -196024, -68793, 47806, -231005, -17900, -215790, 254795, -100934, -213000, 80476, -189983, 200652, -105215, 69857, 250894, -184421, -5452, -190237, -149810, 315117, 147505, 34059, 49086, -119909, -289562, -137034, -115174, 126737, 40934, 95946, -227945, -158995, -47937, 265428, -225299, -194248, 171806, 128567, -167088, 120734, -136400, 68932, -192862, 110729, 228954, 56725, -446414, 168032, 25075, 47967, -57311, -250812, -65215, 256684, 3902, -115337, 35163, -38033, 73331, 226496, -262436, 204822, -177108, -291978, -200213, 16548, 289162, -180581, 82009, 58903, 358999, -212204, -27840, -199880, 130460, 263001, 145278, 252954, 65803, 76754, -220627, -61946, -187145, -24530]
18939A9663a05630K8179G8654K6297A484J42639c03319F1157b42368B38534I7349
18927f444A00339a73020B6180c72677G3210g7568p7951B74184a79611A98454b34006
18915E2487b39846a09000A29835g5549l0383M201a6186E3520R3126B6764g6465
18903B64J29551b86798B51453f3294k98604E8911a97480l5751E7343k6517J80072
18892B10898j05392a72792l15085A91355J22274k5959R0608K63606A22618K01646
18882C24264a7510l1085C07294j36275p3416a93324h7881c5459l16802b032l8392
18871d0424C92909E8869b02340m6824G5072J51226b874k90900b0804B61042F2176
18859C053f1416A19877a1885j6937j33785b8092B05897g9202B5334M9175K17452
$$ y = [19663, -105630, -77451, 78654, 104951, 1484, 144123, -303319, 61157, -242368, 238534, 97349, -6444, 100339, -173020, 26180, -372677, 73210, -77568, -155519, 274184, -179611, 198454, -234006, 52487, -239846, -109000, 129835, -75549, -105932, -101731, -16186, 53520, 146646, 26764, -76465, 264, 129815, -286798, 251453, -63294, -361898, 58911, -197480, -233231, 57343, 30826, 210898, 105506, -172792, -487877, 191355, 313629, 287670, 378278, 641884, 122618, 324264, -17510, -48595, 307294, 171019, 97603, -193324, -87881, -35459, -352261, -2032, -40424, 392909, 58869, -202340, -249164, 75072, 226298, -2874, -293774, -20804, 261042, 62176, 3053, -61416, 119877, -11885, -28822, -162607, -28092, 205897, -79202, 25334, 74509, 291961]
18848B91961M5164a89331b5450r8916N9987K3744l17017a2593n8917D669J16252
18837A20921a30970l5936P2722n2244A19885d07159J51618B14747b48022B3134
18826a01915k98782A32625b6753l44220C8779e2430a513j68018b4330k32267a3771
18814f6001A0828P07K22459D6176b02219H0831K8661d7124j63912R0612A2874
18802A79283a0345A2955K33380p4118g717o4203B3122b29877e029k6609l12514
18791c44152O6965j1897B46472h088B15703a86298c57m08101G8325a34848k3477
18780a58325B51409h4197A89146q7120i4744l3166B5966a82254n7700Q7354b7280
18768E7239a92444i1719j67886C0845b94401a28342k5383D496M16662i2273A17921
$$ y = [291961, 337125, -189331, -25450, -124366, -64379, -40635, -357652, -12593, -71510, 4669, 120921, -130970, -166906, -94184, -146428, 119885, -407159, -255541, 214747, -248022, 23134, -101915, -400697, 132625, -26753, -370973, 38779, -52430, -1513, -169531, -24330, -256597, -13771, -66001, 10828, 11535, 233994, 46176, -202219, 80831, 109492, -47124, -211036, -120424, 12874, 179283, -10345, 12955, 246335, 172217, -7717, -71920, 23122, -229877, -5029, -31638, -344152, -277187, -289084, 246472, -8088, 215703, -186298, -357, -408458, 78325, -134848, -158325, 251409, -84197, 189146, 102026, -94744, -127910, 25966, -182254, -239954, -152600, -27280, 57239, -192444, -91719, -259605, 30845, -294401, -128342, -153725, 4496, 421158, -92273, 117921]
18756b59555J06800M6157d2469m771l501l6440B62432g8269l4471A00720D8464
18744G9548a55744k0949K548B4700f6568A8426a19901B15150a48743A84916b08927
18732B25200g176j53256M9961m7047k18629J78464b8342r8131A03695a571j7551
18721a9122B70143a65318N3290k0335A24696c01641A06289a48m20423J82106A18130
18709A57609c42300l592D2b99706o0031l3553B14080b04828M7429I249a81312
18697d18262O3426B8714i545o1271k15839C25827G1547a3077H0839o866b5511
18685C5175a60660A92630a48051g0804r9715q4913M4499J3957P3139a4591l63504
18674c78095f0731A03076i9835a4483A34799b93904b8867j84131Q9369d2587k67053
$$ y = [-259555, -152755, -106598, -42469, -47240, -50741, -87181, 262432, -78269, -112740, 100720, 48464, 79548, -155744, -176693, -174145, 24700, -66568, 18426, -119901, 215150, -148743, 184916, -208927, 225200, -7176, -160432, -110471, -157518, -376147, -197683, -28342, -126473, 103695, -1571, -19122, 270143, -165318, -112028, -132363, 124696, -301641, 106289, -148, -420571, -238465, 118130, 157609, -342300, -345892, 42, -299706, -359737, -393290, 214080, -204828, -157399, 9249, -181312, -418262, -354836, 28714, -9545, -70816, -286655, 325827, 71547, -13077, 80839, 73973, -25511, 35175, -160660, 192630, -148051, -70804, -170519, -255432, -210933, -196976, -123837, -14591, -378095, -60731, 103076, -99835, -14483, 134799, -293904, -28867, -212998, -123629, -42587, -309640]
18663c09640d4386A19416a67261c6473A09315h2602B50852A08333c40429A20846
18652A28790C6081e3220k03871K1254e4027F5046P857d12406A5965K3655b3249
18640d8148P699r9673e0635k20667g0920c1255k78286J14860B40317a92257d7780
18628c1257N646c558j38115b7110l8688j36166A4421C662J543a11115N1662o225
18616f5678H5689a5287A20727a722A74120Q1119b7770j04521k7915A18231f1205
18604c85712J60099j43485Q0496N3681C3572j2646a56377C2718J18429J7202C5673
18592b9088F8110c11645a40368B6797a52729o0063l5719K2262A94036J4284d4748
18580i2591p1527j2142A93594b18404C7374L6933d7684I7174K5864c6500A80280
$$ y = [-309640, -44386, 119416, -167261, -36473, 109315, -82602, 250852, 108333, -340429, 120846, 128790, 36081, -53220, -257091, -235837, -54027, 65046, 72903, -412406, 15965, 39620, -23249, -48148, -40449, -140122, -50635, -271302, -70920, -31255, -309541, -194681, 240317, -192257, -47780, -31257, -25611, -3558, -141673, -27110, -65798, -201964, 14421, 3662, 5205, -111115, -59453, -65678, 85689, -15287, 120727, -1722, 174120, 255239, -27770, -132291, -160206, 118231, -61205, -385712, -225613, -369098, -288602, -234921, 33572, 20926, -156377, 32718, 151147, 168349, 35673, -29088, 68110, -311645, -140368, 26797, -152729, -212792, -248511, -226249, 194036, 208320, -44748, -92591, -164118, -176260, 193594, -218404, 37374, 74307, -47684, 97174, 123038, -36500, 180280]
18568c66228B91992a28810A8702p577L17473A6950a71168I5389h4827F4876b5682
18556b61589d1725J8736A27464B0611a56931P2759C36952b08602A35244a72984
18545A90451c76843a69614d07A86930F2404a92650K0902A24638M7724F6368K0631
18534H6999b98917J38490k504k15765i1614M0123a0661B11153c1515B62620H372
18522a7278j22751I8477m1684N3307a41646p0122A5224b11231D8695g0146B29028
18510a44205F8746b0099k59044a17770n3280A83564b32763A1489D467b72203B2874
18498b13679q2852f6780p2547j27189C7150p536N3549b54017j84581a03466A93097
18486C0418A4180R8042i6774m1388d1797B8849b10513N0639D0095a33197r3282
$$ y = [-366228, 291992, -128810, 18702, 11125, 328598, 16950, -171168, 95389, -84827, 64876, -25682, -261589, -41725, -22989, 127464, 20611, -156931, -84172, 336952, -208602, 135244, -172984, 190451, -376843, -169614, -407, 186930, 62404, -192650, -171748, 124638, 172362, 66368, 86999, -298917, -160427, -162931, -378696, -91614, -51491, -10661, 211153, -31515, 262620, 8372, -17278, -140029, 98477, 56793, 110100, -141646, -211768, 15224, -211231, 48695, -70146, 229028, -144205, 68746, -20099, -279143, -117770, -171050, 183564, -232763, 11489, 4467, -272203, 22874, -213679, -296531, -66780, -139327, -266516, 37150, 29614, 83163, -254017, -438598, -103466, 193097, 30418, 14180, 112222, -96774, -138162, -41797, 28849, -210513, -159874, 40095, -133197, -226479]
18475b26479a11143k06801A87094b75147A50331a60192r9937i8959a9302k68230
18465b87532A12541b14870f9156H9927d08644J97197j90559J52630a00077b2390
18454e7878l23236J06245A45043c44763J69472P3883d2390j8115C4216L57961
18444C92177a66303e2357j40453f7414H4095a55045k0657K6511A2433K88449o0099
18433B40783f4125g785B68476B1582c60042J60549G2856K22178A36957k2865a61059
18421F0838O7162a71050B02a71262D9342b24457g7245k28508C25261D9309a78184
18409A2893h3710r2915Q0914r5953M2195C57429d7530m6252L3697q6512A84923
18397a23131A68413N5581N1555E655B753J57679b64112H9153e3712j17263k5461
$$ y = [-226479, -111143, -317944, 187094, -275147, 150331, -160192, -260129, -98959, -19302, -287532, 112541, -214870, -69156, 89927, -408644, -211447, -402006, -249376, -100077, -22390, -57878, -381114, -274869, 145043, -344763, -175291, -101408, -42390, -60505, 34216, 392177, -166303, -52357, -192810, -67414, 84095, -155045, -175702, -149191, 12433, 300882, 240783, -64125, -7785, 268476, 21582, -360042, -199493, 72856, 295034, 136957, 114092, -161059, 60838, 128000, -171050, 202, -171262, 49342, -224457, -77245, -305753, 325261, 49309, -178184, 12893, -83710, -176625, -95711, -191664, -149469, 357429, -47530, -93782, -60085, -146597, 184923, -123131, 168413, 223994, 275549, 5655, 2753, 160432, -264112, 89153, -53712, -170975, -196436]
18386a96436c474l7119p1471H7482a24799j38146Q5122f2701n4498A3277c41448
18374d48963G1657b30366d1193k32497J07430B32362a80351P6920H2561C9302
18363d2193k2144m65j3750i475A47756d6747A71865c6221E1693b77486J08776
18352a68710k13208e6366m4044D4752c49098b0902B00091q8374h9709B09834f8826
18340C68072a84394j28030M3466A3397J43068b96396o783L2066Q6864A12896a32053
18328B01311r1453N8032d03884g1181a0237B60445p8570L35021G6744a10624G3887
18316b70372g3001A41883c7145B33096j5265c04487G8532C1557a29194B5501l506
18305B1995f0066C53522g2570P292F9985O2422b13021A3458M4669a22045A19483
$$ y = [-196436, -3474, -40593, -112064, 87482, -124799, -262945, -177823, -62701, -117199, 13277, -341448, -448963, 71657, -230366, -41193, -273690, -166260, 232362, -180351, -103431, 82561, 39302, -42193, -64337, -64802, -78552, -9475, 147756, -46747, 171865, -36221, 51693, -277486, -168710, -381918, -56366, -100410, 44752, -349098, -20902, 200091, 111717, -89709, 209834, -68826, 368072, -184394, -312424, -268958, 13397, 156465, -296396, -303179, -271113, -184249, 112896, -132053, 201311, 109858, 167890, -403884, -71181, -10237, 260445, 181875, 516896, 76744, -110624, 73887, -270372, -73001, 141883, -37145, 233096, 217831, -304487, 78532, 31557, -129194, 25501, 21995, -60066, 353522, -72570, -65278, 69985, 132407, -213021, 13458, 58127, -122045, 119483]
18293b34412c6419G2317f875a948j96291f2434C83352a54447a0897D0679A9171
18281c24533H2212a07039l53789a39686N5408A4455a07218M9826I6049f6824a9273
18269B23565a08153D9706a16626j7726f0909a3978B23730a21850F20K5464c2215
18257D7732a91654O1645P555j26714O8291Q5828k84073a23926o7802d4024G7875
18245A84194c01717I1646D521J92020a12225A8004b47126d4896j83870R6250H439
18233A5272M392c32954a25514C20820c1394p9344B2198L17061b44669B27760O4418
18222B92178G0537a47595m6705l7643A35089a45599D14587H9413d2437O794o2939
18211i8582E1702Q9321o0614B354a0518B32945B2464a59965A35433B3591a81718
$$ y = [-234412, -36419, 72317, -6875, -1948, -198239, -62434, 383352, -154447, -10897, 40679, 19171, -324533, 82212, -107039, -460828, -139686, -84278, 14455, -107218, -57392, 96049, -66824, -19273, 223565, -108153, 49706, -116626, -134352, -60909, -13978, 223730, -121850, 620, 26084, -32215, 47732, -191654, -130009, -122454, -249168, -180877, -95049, -379122, -123926, -191728, -44024, 77875, 184194, -301717, 91646, 4521, 196541, -112225, 18004, -247126, -44896, -228766, -132516, 8439, 15272, 19664, -332954, -125514, 320820, -31394, -110738, 22198, 339259, -244669, 227760, 292178, 70537, -147595, -194300, -231943, 135089, -145599, 414587, 89413, -42437, -35643, -98582, 51702, 141023, 80409, 2354, -10518, 232945, 22464, -159965, 135433, 23591, -181718]
18199b19910h8888A34009b85929C25400E111g8572E7291J01518a72065A53255
18188b87118d1563n4248k6488R143k6174M087i839j23337n6915F0785i3999L5489
18176e8510E657e152I981a31572C35749G9388c42029A25292P3096K5350a50872
18164H4208f2518a3146j43460B07104b9585j57342P9551M4547k23139L1792B4325
18152A21291a64977C2267K11214A06008g2629j17662L0810E9830J09367k7604
18142A41593E8994b99484F7928L1815J25640a23143D8294b51417B70131H5661
18131B7698a90057P7846K2778m1901j99632A13944a08341M7655C43674i043F5000
18119a91458p6752N5820A32370b10743C10735b49645J06773F647h6808D9688a47110
$$ y = [-219910, -88888, 134009, -285929, 325400, 5111, -78572, 57291, 158809, -172065, 153255, -287118, -41563, -95811, -122299, -113156, -139330, -135243, -9839, -133176, -190091, 60785, -93999, -58510, 5657, -5152, 9981, -131572, 335749, 79388, -342029, 125292, 198388, 223738, -150872, 84208, -62518, -13146, -156606, 207104, -29585, -186927, -107376, -62829, -285968, -254176, 24325, 121291, -164977, 32267, 243481, 106008, -72629, -190291, -159481, 59830, 169197, 141593, 58994, -299484, 67928, 99743, 225383, -123143, 48294, -251417, 270131, 85661, 27698, -190057, -112211, -89433, -131334, -330966, 113944, -108341, -60686, 343674, -9043, 65000, -191458, -268210, -212390, 132370, -210743, 310735, -249645, -142872, 6647, -86808, 49688, -147110]
18107A1886a19497l2169D9612g9606B25433d5204I9670b9639m1758b8943k14792
18096b43735K1185C77413a22229b6483n0983J3834o276G1670b66737O8740N0926
18085a47071j3632B81922a56695P915C879c0100k9416B05829c0200k97111A9516
18073a36961B60542J0060b2893D7831K41322b7849A59392g2334k09247J26861
18063a54720j01020A22338c30360a06718A1708c36791A16366C1838d82288b8250
18052b04300A65219a5847D05010d3150o5667j24147e8903k80584B06382d10370
18041B61942D7583a85665K7455a8645P756j55920A66540G526b58024D853O3067
18030F7920b22969r7628g4282j94661Q0634a0403B685Q5140b60911B37634h7717
$$ y = [11886, -119497, -151666, 49612, -79606, 225433, -45204, 99670, -29639, -71397, -28943, -243735, -222550, 377413, -122229, -26483, -77466, -63632, -69908, 71670, -266737, -197997, -147071, -160703, 281922, -156695, -148780, 3879, -30100, -59516, 205829, -30200, -327311, 19516, -136961, 260542, 270602, -22893, 47831, 289153, -27849, 159392, -72334, -281581, -154720, -255740, 122338, -330360, -106718, 11708, -336791, 116366, 31838, -482288, -28250, -204300, 165219, -15847, 405010, -43150, -108817, -232964, -58903, -339487, 206382, -410370, 261942, 47583, -185665, -158210, -18645, -10889, -166809, 166540, 7526, -258024, 4853, 67920, -222969, -320597, -74282, -268943, -188309, -10403, 2685, 87825, -260911, 237634, -87717]
18018f2515A7508K47682G2939J47584f1167A21115b77144N0219d7694o7095A04688
18006F51M0341a15806E7939d5740j6117o9994B00382J37131c1311G7339d7195
17994G0019N6165g0841A59587G528c3009j81676A76940i3529B5946j730a4158
17982E369a09988q9581A23940a092A96045e7763k56513J35734H9864a41130B78572
17970a1128p8211E9695J98346g2949j05969C20620q6845B2374H900d7209r1800
17959a39009I7066b00739K4776b4857k36329A45453N7265J7879G7778P4454b3121
17947c10107J49715O265C7923K9637b49775i8001B01277a04876D2650Q0889B9514
17935a18081k30422a31262A84172O9492K9302n3305C2536a79628K2766D9681K48032
$$ y = [-62515, 17508, 265190, 72939, 220523, -61167, 121115, -277144, -226925, -47694, -114789, 104688, 651, 40992, -115806, 57939, -45740, -61857, -131851, 200382, 337513, -31311, 77339, -47195, 70019, 126184, -70841, 159587, 7528, -33009, -214685, 176940, -93529, 25946, 24216, -14158, 5369, -109988, -199569, 123940, -1092, 196045, -57763, -314276, -178542, 89864, -141130, 278572, -11128, -89339, 59695, 258041, -72949, -178918, 320620, 233775, 22374, 8900, -47209, -139009, 97066, -200739, -175963, -24857, -261186, 145453, 202718, 220597, 77778, 152232, -23121, -310107, -160392, -154127, 37923, 67560, -249775, -98001, 201277, -104876, 42650, 123539, 29514, -118081, -348503, -131262, 184172, 253664, 282966, 229661, 32536, -179628, -156862, 49681, 297713]
17924B97713d3856k57036A77211a74089B99939A11211a68401k0637A60098N8286
17914B18384P715a8148G5741O7862n9759l2186b61693a17918M4146j84138c8916
17902B79463H1653L2350A2997M2274J49516E4698k654d5759k09254F8428B691
17890a19174j20842R9445B08103D6816O576J36908b06019C7509L21959B3041a68454
17878A22103f9102a3058n5729A20515Q822a92132A30293I408c21100E2877h1959
17866G5248B8696p355b28719L3024A74835b3632k18600C47281H4511K47772a47991
17854H3647e8918l86106f2382B42004g1832H3748K3419K67443E1790J28167l4998
17843A44959h9561E6767f5276B33698A7031F49N6637J51132k5853B1001K33002
$$ y = [297713, -43856, -300892, 177211, -174089, 299939, 111211, -168401, -189038, 160098, 218384, 226099, -18148, 75741, 143603, 83844, 51658, -261693, -117918, -73772, -257910, -38916, 279463, 81653, 114003, 12997, 55271, 204787, 54698, 52044, -45759, -255013, 68428, 2691, -119174, -240016, -140571, 208103, 46816, 53392, 190300, -206019, 37509, 359468, 23041, -168454, 122103, -69102, -13058, -68787, 120515, 129337, -192132, 130293, 9408, -321100, 52877, -81959, 75248, 28696, 21341, -228719, -195695, 174835, -23632, -242232, 347281, 84511, 332283, -147991, 83647, -58918, -445024, -62382, 242004, -71832, 83748, 107167, 374610, 51790, 179957, 144959, -89561, 56767, -65276, 233698, 17031, 649, 57286, 208418, 182565, 21001, 254003]
17832B54003n3817H9164J54498B2299b22955A93527c08973h9143p3219r8143i2563
17820c16511O1728e1686m0455r2651A32194C6225L749N08894c0940A95937a50998
17808a10573A29330J16165N3590j05019p7545P2916H0785i9191A03817a82846
17797D941a67277a6213A66319J09333b59536A81978J24299a7833F9320J40831
17787B10151a24889J1511J4128A22543J2258a06679j20903C69568i8356G5567
17776B04601B3674K02913e24671a59932c7712j8077n7393E0495J23712b05262
17765E4788a03909B72071h334A6000a86598P8638N1289n2806A09630J52754a12987
17753A9751J67601b82925k3941H6266b15435E5103K80132n5004a17318A01349
$$ y = [254003, 200186, 89164, 243662, 22299, -222955, 193527, -308973, -89143, -162362, -260505, -92563, -316511, -254783, -51686, -92141, -184792, 132194, 36225, 39974, 548868, -30940, 195937, -150998, -110573, 129330, 245495, 299085, 194066, 116521, 189437, 80785, -99191, 103817, -182846, 4941, -167277, -16213, 166319, 275652, -259536, 181978, 306277, -17833, 69320, 210151, -124889, -113378, -99250, 122543, 134801, -106679, -227582, 369568, -98356, 75567, 204601, 23674, 226587, -524671, -159932, -37712, -55789, -113182, 50495, 174207, -205262, 54788, -103909, 272071, -8334, 16000, -186598, -107960, -56671, -109477, 109630, 262384, -112987, 19751, 187352, -282925, -306866, 86266, -215435, 55103, 335235, 280231, -117318, 101349]
17742a44359l0384N9056k918F9877e652j46512f0337A60034h1313A10683m3744
17731F6939N086J15472J66821A27353h8307A62407C6348a75373a8910A76700E6659
17719A2515J58464m2832a0692B16505H3738D917g7839A7104O373L2362L4061h3566
17706H4315i1234j36888d8787B7259K40718b12037H8196b62996j53239F5898e455
17694a37929A74409J0411a36616C28829A8112N1083a0468j11165A13588K4488
17684A38076M3222N5771p6586b30818d6083j83027e9014A57230a7569j44214B1912
17672d3032B10855a67209B57385I3521c5646B26384a2147A36606P0521o3308e7638
17660B2665L11058d1983D37997A97710a37906B12287I9103J08388j01801a3591
$$ y = [-144359, -174743, -115687, -118605, 69877, -5652, -152164, -60337, 160034, -81313, 110683, 66939, 72025, 187497, 354318, 127353, -88307, 162407, 36348, -175373, -18910, 176700, 56659, 12515, 170979, 128147, -10692, 216505, 83738, 4917, -77839, 17104, 23477, 55839, 89900, -83566, 84315, -91234, -228122, -48787, 27259, 267977, -212037, 88196, -262996, -416235, 65898, -5455, -137929, 174409, 184820, -136616, 328829, 18112, 69195, -10468, -121633, 113588, 138076, 181298, 237069, 160483, -230818, -46083, -229110, -59014, 157230, -17569, -161783, 21912, -43032, 210855, -167209, 257385, 93521, -35646, 226384, -12147, 136606, 207127, 143819, -57638, 22665, 333723, -41983, 437997, 197710, -137906, 212287, 99103, 207491, 105690, -13591]
17649F6650f1009A25037j857a03427d7682D5578b30204a9919C04490j48516a37527
17637A82347C9765J55922M2545q2329a80406A48388J6889K33929m8644A2481K37078
17626B49559j16095J33182j25510a91592A87037r0944m3651j7262F270O2886h4336
17614A18619i048D60931G5925h4941k7492j75700e4970A16614J41668F8041k0710
17603D7331K58615q0931c15561O3650C36524a6751j03512k26569R9706A07087
17592i0305J0251F2636K20994A10698Q6052E6247a90723I1641d1058A01762C4011
17580G6753a62137O1200B51724m6123l8807J61104o9080h5714q3464C46990A25602
17568A11558M43235a26231A80102j7225a67863B61461C1919J28264L71960k38137
$$ y = [66650, -61009, 125037, 123180, -103427, -47682, 45578, -230204, -19919, 304490, 155974, -137527, 182347, 39765, 195687, 238232, 155903, -180406, 148388, 165277, 399206, 350562, 12481, 249559, 133464, 266646, 141136, -191592, 187037, 96093, 52442, 35180, 6270, 69156, -84336, 118619, -9048, 460931, 75925, -84941, -112433, -288133, -54970, 116614, 258282, 68041, 47331, 305946, 225015, -315561, -251911, 336524, -16751, -120263, -346832, -247126, 107087, -90305, -80054, 62636, 283630, 110698, 196750, 56247, -190723, 91641, -41058, 101762, 34011, 76753, -162137, -100937, 251724, 205601, 166794, 327898, 258818, -85714, -169178, 346990, 125602, 111558, 554793, -126231, 180102, 162877, -167863, 261461, 31919, 160183, 532143, 294006]
17558B94006j14159G2382l0713J20449D5097J46106C2292L86137A21925Q8981
17548B10906D9327a02228A32380o3940J18821c3132B0757L0498J8704N2045D6870
17536B48512p7075M18056l0291j96890r3137A24848J25122a28412E7829Q9100
17526A46929A9088K16371c6215B45142h4801d1109C67780a22043B76583A31296
17515C28532b8391B15225J41861J17231P8110A50955a15813C90721o1727A04801
17504B14453k1144J34332q2787I3971K89788M4996r2335J60783j49862L13030
17494F60371k35968n8214A76673f6679D96042A95062H5415b67124F70748k65415
17484D05333i5332D48296G8826J99319I8658K35589N1024j86450J23900l240D9398
$$ y = [294006, 179847, 72382, 41669, 162118, 45097, 191203, 32292, 418429, 121925, 210906, 49327, -102228, 132380, 68440, 187261, -33132, 20757, 51255, 69959, 122004, 46870, 248512, 171437, 589493, 559202, 362312, 269175, 124848, 249970, -128412, 57829, 146929, 19088, 235459, -36215, 245142, -84801, -41109, 367780, -122043, 276583, 131296, 328532, -28391, 215225, 357086, 474317, 552427, 150955, -115813, 390721, 328994, 104801, 214453, 193309, 327641, 244854, 93971, 383759, 428755, 336420, 497203, 347341, 660371, 424403, 366189, 176673, -66679, 496042, 195062, 85415, -267124, 670748, 405333, -95332, 448296, 78826, 278145, 98658, 334247, 385271, 198821, 322721, 319481, 49398]
17472A72004M47264H7891l6023L31647b9283D63622k24284G3260R5044c4333C25553
17460H5331A7162L30130J22824o601j66830K49925j35365A07605n1102J39993
17450A96496K73196A61917J65244P551A65365O1876j6383m499J0462m9241J101
17439A68681Q7275j24002J65212j43451d0589D67830k13896A11831D149M29041
17429D33190K27395j02923j98034K2276L30367l13407j67011M43077B43488q639
17419B34849r234p3518K96491L3974j27397P2059k11967K8177L1084C4149K50961
17408B85110L793A27987O9069K47372K3332A48064M29963A57035N9810F3349L65787
17397D29136j17346A29342K12173j15049d4309q0005D62460k7329A37424n7525
$$ y = [172004, 619268, 87891, 51868, 383515, -29283, 463622, 239338, 73260, 168304, -34333, 325553, 85331, 17162, 347292, 470116, 463515, 296685, 546610, 411245, 107605, 56503, 196496, 469692, 161917, 327161, 334712, 165365, 227241, 210858, 206359, 216821, 167580, 168681, 255956, 131954, 297166, 153715, -40589, 467830, 253934, 111831, 4149, 433190, 660585, 557662, 359628, 381904, 712271, 398864, 231853, 674930, 243488, 234849, 225615, 152097, 448588, 482562, 355165, 427224, 215257, 243434, 274518, 34149, 285110, 288903, 127987, 197056, 444428, 467760, 148064, 578027, 157035, 216845, 63349, 429136, 311790, 129342, 341515, 226466, -44309, -124314, 462460, 435131, 137424, 79899]
17387G9899J5061A9531K04401o3657J17894J37678A1605J53149M8491G3410J49515
17376B22925k3705D9531L36091d5740B26483p6312J64782E0149J93391J22326
17366C65866F6892J72794A19013J05217R3156E0636L3129C5781J26273J77999
17356C40053J87352m2536r5952B8809K25606p7865N3533m5275M4255J24226f4228
17344C56552A50865K17130A45801p375K73437A90092R4613J02222M5194C074O27169
17333F30243B04691H870K55790A0487M83203Q385B11507q7587J46978L44093A50992
17321A27089A7213J00035K34597K3806f4154C40096A66953K41483A20056B693
17310g2248K4107C08893A16263J6553L3633K90452A01604b5127D1681M24157j44459
$$ y = [79899, 94960, 19531, 223932, 160275, 278169, 415847, 11605, 164754, 213245, 73410, 222925, 199220, 49531, 385622, -45740, 226483, 150171, 314953, 50149, 243540, 365866, 66892, 239686, 119013, 224230, 317386, 50636, 83765, 35781, 162054, 340053, 527405, 484869, 388917, 28809, 254415, 176550, 230083, 184808, 229063, 353289, -64228, 356552, 150865, 367995, 145801, 138426, 411863, 190092, 284705, 386927, 432121, 3074, 630243, 204691, 8870, 264660, 10487, 493690, 502075, 211507, 123920, 270898, 614991, 150992, 127089, 17213, 117248, 351845, 375651, -64154, 340096, 166953, 408436, 120056, 2693, -72248, -48141, 308893, 116263, 132816, 166449, 456901, 101604, -25127, 41681, 465838, 321379]
17299C21379A34345R79Q3827L37010j67119b39577A29858J57676p4775C3133L73808
17288D06941F0746N8396D1082N70970B88308D8186M21374J15635B32354d809n5370
17277f0179B77957J6502K17302A55513J36398k7568d3421C66971j72335o4016
17267A30620J41561P0706a7332C15506A34432E7116J44463C1010M02215A91910
17256C60114K5173Q985M5437A80636F4223P0904L4636J8649J39266j16492m8456
17245A62730O3988M4619l442J17789j39081R3653R8609F0625P0013f7768B46029
17233D02401A74000K78969j89635k3536L0477K35784k07282O4361A12021K476
17223A14497M59268k59365R7059j94655J6625P345j10315J4102K00109J9700k6924
$$ y = [321379, 134345, 135324, 219151, 556161, 389042, -239577, 129858, 287534, 212759, 33133, 406941, 60746, 119142, 41082, 612052, 288308, 48186, 469560, 585195, 232354, -4809, -60179, 277957, 294459, 511761, 155513, 291911, 264343, -43421, 366971, 194636, 130620, 272181, 342887, -17332, 315506, 134432, 57116, 201579, 31010, 433225, 191910, 360114, 385287, 394272, 439709, 180636, 64223, 135127, 169763, 188412, 327678, 211186, 162730, 226718, 271337, 267895, 385684, 246603, 340256, 438865, 60625, 130638, -67768, 246029, 402401, 174000, 452969, 263334, 239798, 270275, 506059, 298777, 363138, 112021, 114497, 573765, 314400, 411459, 216804, 233429, 240774, 130459, 144561, 344670, 364370, 337446]
17212C37446A41313J9939J68895J139K06802B59437J31440J70511j37741j31359
17202B92288j25442d3255C79477K3917j23046A37300P224J87171Q6462A04833
17191H4069N09830B36912J19197A77802K02317J10624k20665K46774k14100J70255
17181D73007A39720J61672A21726L98826k11341j00890L80294F0478A1538M31448
17171D42986N0450K50387j15139j74348Q2850J51562A63578K33452K41588B24350
17160E58655J0923B63380J52325K56585B50529K9083L61973B49828J63217j33466
17150B79579J44157K32610B51661J31516o4098L21879j11060j50487J56529k59261
17140B76679k9025L96642q4499L3437k72156L24408j80574B16188K22325L09521
$$ y = [337446, 141313, 161252, 330147, 331286, 538088, 259437, 390877, 561388, 423647, 292288, 166846, -43255, 379477, 403394, 280348, 137300, 144524, 331695, 418157, 104833, 84069, 593899, 236912, 356109, 177802, 380119, 490743, 270078, 516852, 302752, 473007, 139720, 301392, 121726, 520552, 309211, 208321, 588615, 60478, 11538, 442986, 493436, 743823, 628684, 454336, 537186, 688748, 163578, 397030, 638618, 224350, 558655, 569578, 263380, 415705, 672290, 250529, 279612, 641585, 249828, 413045, 279579, 423736, 656346, 251661, 383177, 319079, 640958, 529898, 379411, 535940, 276679, 247654, 644296, 559797, 593234, 321078, 645486, 464912, 216188, 438513, 748034]
17130G48034o6686J48957k81840O0074m6338B46387M60641j10647k07475j49622
17120B39284J36734J86168r2633n2951J10286M6826r6056k31590J54316A98266
17109B30656L4000J33294L40521l55862L23296k65085J6214k20077K15462j47717
17099C04702L79618O3396j16812k74185N40372C59249A75107K31549l8357L05810
17089F74109J30174j28807J21445C41573M28873j82709J15727j39218j43832J82933
17079F03347L3812k53575J44298j5166Q1864n0652K98213l59545K10781k58986
17069D34391J12644J0106B57485J75287P971J1513K80057r5208r7331M31767m75824
17058D95717L08798l07428J83223J6198p1107j33451M28567K3257j48202j75655
$$ y = [748034, 681348, 830305, 548465, 608539, 562201, 246387, 707028, 596381, 388906, 239284, 376018, 562186, 469553, 416602, 526888, 573714, 477658, 246068, 400384, 198266, 230656, 264656, 397950, 738471, 382609, 705905, 440820, 457034, 236957, 452419, 304702, 684320, 747716, 630904, 356719, 897091, 359249, 175107, 406656, 368299, 674109, 804283, 675476, 796921, 341573, 770446, 587737, 703464, 564246, 420414, 603347, 637159, 383584, 527882, 512716, 594580, 543928, 842141, 482596, 693377, 434391, 547035, 557141, 257485, 432772, 440743, 452256, 732313, 637105, 539774, 971541, 495717, 804515, 497087, 680310, 696508, 625401, 491950, 920517, 943774, 795572, 619917]
17048F19917L94141m6833m55279j52251K91705j45309K26445m8829r1570j14189
17038D77948L47365n3454j65955K44457J91920k94297k60236M59713k09596o7821
17028F70044O2781J62996k23342L98314l80831O764M84668m70668J08285l84758
17018D34253O15664J6975r3702J99050k13803o5132R4488L8565J46255j57597
17008A015016L27399l42111J48082k366j76943k7501l3722J52868n4913k9021
16998I76788J15681m08918K33086n6076J54032n5562p7480P533M7154J7015J62035
16987A115288r9590O1843K28922l51637M31o0529J17624k81409O53249l3485l84575
16976I66132j31604M42638J6061j28916J29468j45231J30585k85374J50965K15487
$$ y = [619917, 1014058, 967225, 511946, 359695, 651400, 506091, 732536, 683707, 592137, 477948, 825313, 771859, 605904, 850361, 1042281, 747984, 487748, 947461, 737865, 670044, 732825, 895821, 672479, 1070793, 689962, 696726, 1181394, 710726, 819011, 434253, 1049917, 1066892, 973190, 1172240, 958437, 893305, 987793, 1026358, 1172613, 1015016, 1342415, 1000304, 1148386, 1146020, 969077, 941576, 907854, 1060722, 1005809, 976788, 1092469, 683551, 916637, 860561, 1014593, 959031, 881551, 889084, 936238, 953253, 1115288, 1015698, 1077541, 1306463, 954826, 955257, 894728, 1012352, 730943, 1384192, 1350707, 966132, 834528, 1277166, 1293227, 1164311, 1293779, 1148548, 1279133, 993759, 1144724, 1360211]
16966A360211j75179J12837j01440k23678K42514K85742k48683K9580j7136J49238
16956A414006J183J58834l01850K23037m8955O7117k48074J39680m2269L50910
16946A713619j67053j02844K31518q6651J8974k69284J5669j01380M07275j35234
16936A524609J89225k95416J80039Q2784j31924J14725P0636j80731K25983l07240
16926A472690L71411m1718p3654k2253m0905M9763o5300K84360L1232J1316j79872
16915A797070K50459k35815L85122m85132J45762L80671n0877q3973o3921Q528
16905B047894L56046m21612j17938L70769j77461O201J74425K58039l65068R5813
16895B227108J1615K84519J91164k55172j57772j70706N75468M2046n2977k80005
$$ y = [1360211, 1185032, 1297869, 1196429, 972751, 1215265, 1501007, 1252324, 1281904, 1264768, 1414006, 1415189, 1574023, 1272173, 1495210, 1446255, 1513372, 1265298, 1404978, 1362709, 1713619, 1546566, 1443722, 1675240, 1588589, 1607563, 1338279, 1353948, 1252568, 1659843, 1524609, 1713834, 1418418, 1598457, 1681241, 1549317, 1664042, 1734678, 1553947, 1779930, 1472690, 1844101, 1802383, 1728729, 1706476, 1665571, 1715334, 1650034, 1934394, 1965626, 1976942, 1797070, 2047529, 1811714, 2196836, 1711704, 1857466, 2238137, 2187260, 2103287, 2039366, 2047894, 2403940, 1982328, 1864390, 2235159, 2057698, 2063899, 2238324, 2496363, 2131295, 2227108, 2238723, 2523242, 2714406, 2459234, 2301462, 2130756, 2706224, 2748270, 2695293, 2415288]
16885B415288M3510L59895r1503j08313K05347J0389j2j98886O35687l75839M7668
16874B943231J83839m8239j39982k05037N92445q0176k37453M80102j55585J74212
16864C507357J4561k09453Q12286l65381l21052K03355J54354j03597J27465R8239
16854C918134m57168K10255J33507J97631K42565L5902k06328K86461L97673l05134
16844D453498K47744j86945j8484K76340Q9696k22921K38222J58113j0211M33054
16834E458106n21784N14821M057J48338O3868K35955j09901J1630L12748j48846
16824E968992o0348J93292L40806o7388O36109m00902M64445j43493N02599j39210
16814G294902p0232K42477J95500N29119k91569k66239P89736M5536j85042M87895
$$ y = [2415288, 2458798, 2818693, 2727190, 2618877, 2824224, 2834613, 2834601, 2635715, 3271402, 2895563, 2943231, 3127070, 3078831, 2938849, 2733812, 3326257, 3246081, 3008628, 3488730, 3333145, 3507357, 3521918, 3312465, 4124751, 3759370, 3438318, 3641673, 3796027, 3692430, 3819895, 3918134, 3460966, 3671221, 3804728, 4002359, 4244924, 4280826, 4074498, 4360959, 4758632, 4453498, 4701242, 4514297, 4495813, 4772153, 4861849, 4638928, 4877150, 5035263, 5025052, 5458106, 4936322, 5451143, 5455200, 5603538, 5667406, 5903361, 5793460, 5805090, 6117838, 5968992, 5908644, 6101936, 6442742, 6375354, 7011463, 6610561, 7075006, 6931513, 7434112, 7294902, 7224670, 7467147, 7662647, 8191766, 7900197, 7633958, 8423694, 8469230, 8284188, 8772083]
16804H772083K42791p9522L26727K59449N2386M15387l4579L97247L69955K5117
16794A0747041K60430o2386N96247K92810R9527L73065L87069L21768J47788M45235
16784A3608594M23279M25512K88409L36426O28069L20828N48844L87835J47349
16775A7115145N64253N01877M13428M84652O17051P87669O98138M87617L08458
16766B1978288J238748L94391P77730O97153Q05288P86026J099043R95142R90820
16757B9762629Q85263J031098J140891J018060J429938J108836J184312J669294
16749C9230321J485859J524524J592891J818650J887674J770639J739428K066865
16741E3116851K143879K492414K291238K401801K828437K654324L078866L000824
$$ y = [8772083, 9014874, 8935352, 9262079, 9521528, 9573914, 9989301, 9954722, 10351969, 10721924, 10747041, 11007471, 10945085, 11541332, 11834142, 11933669, 12306734, 12693803, 13015571, 13163359, 13608594, 14031873, 14457385, 14745794, 15082220, 15710289, 16031117, 16579961, 16967796, 17115145, 17679398, 18181275, 18594703, 19079355, 19696406, 20484075, 21182213, 21669830, 21978288, 23217036, 23611427, 24389157, 25086310, 25891598, 26677624, 27776667, 28771809, 29762629, 30647892, 31678990, 32819881, 33837941, 35267879, 36376715, 37561027, 39230321, 40716180, 42240704, 43833595, 45652245, 47539919, 49310558, 51049986, 53116851, 55260730, 57753144, 60044382, 62446183, 65274620, 67928944, 71007810, 74008634]
16733G4008634K918120L230382L126880L443451L483637L703078L647321L693505
16725A01255008L884299L763388L697450L555877L520047L567769L311809L181377
16717A29737024K641198K534819K253872J768625J435908P40302R56574j84934
16709A41883388q18696n80393j495242j785720j935948k466153k713854l391941
16701A26695441k799460l528170l632106l689255l810522l785650l850340l530210
16693I8069728l887375l572376l782801l350190l237549l469380k991628l390356
16685G0388073k857223k123318k994129k647644k304224k163865k266832k160865
16677E0869973j906353k135956j859926j626973j582353j455052j973951j197904
$$ y = [74008634, 76926754, 80157136, 83284016, 86727467, 90211104, 93914182, 97561503, 101255008, 105139307, 108902695, 112600145, 116156022, 119676069, 123243838, 126555647, 129737024, 132378222, 134913041, 137166913, 138935538, 140371446, 141111748, 142068322, 141883388, 141064692, 140484299, 138989057, 137203337, 135267389, 132801236, 130087382, 126695441, 123895981, 120367811, 116735705, 113046450, 109235928, 105450278, 101599938, 98069728, 94182353, 90609977, 86827176, 83476986, 80239437, 76770057, 73778429, 70388073, 67530850, 65407532, 62413403, 59765759, 57461535, 55297670, 53030838, 50869973, 48963620, 46827664, 44967738, 43340765, 41758412, 40303360, 38329409, 37131505]
16669C7131505j443585j440712j182108r24387j265831p71148j574541k44961
16661B8284232j201154o45301j081505r62020o62004r98407j60519q96284n50002
16652B1127036r49450k45177n77934p30950m00840j052587J72659l09163p00923
16643A6332671k82874n83428n73488l29922l18314j41692p60860J71463p68077
16634A2745479j40214l83260n03667j51410k99875k6340m60850K1449m58567k39152
16624A0103593j33721l99521M0870k99226m30999R9829l21031r9694k00376J92683
16614H552407m47614j63062l5245k8383l78914n3222k83826r0552n7730n08247
16604F505612N18979l89938q1533j868K2526l96894k82199L78008m46799j95863
$$ y = [37131505, 35687920, 34247208, 33065100, 32140713, 30874882, 30103734, 28529193, 28284232, 27083078, 26437777, 25356272, 24394252, 23732248, 22733841, 22573322, 21677038, 21127036, 20177586, 19932409, 19354475, 18623525, 18222685, 17170098, 17342757, 17033594, 16332671, 16049797, 15466369, 14892881, 14562959, 14244645, 14102953, 13342093, 13513556, 12745479, 12605265, 12222005, 11718338, 11566928, 11267053, 11240713, 10779863, 10801312, 10342745, 10103593, 9969872, 9570351, 9611221, 9311995, 8880996, 8980825, 8659794, 8560100, 8359724, 8552407, 8104793, 7941731, 7906486, 7878103, 7499189, 7445967, 7162141, 7071589, 7013859, 6505612, 7024591, 6634653, 6553120, 6551252, 6573778, 6176884, 5894685, 6272693, 5825894, 5630031]
16594E630031J02253m36189K40455l37076J19454r9140o9012j71068l3751J75877
16584E121834l68733p2290L56588o51505K77949l8727l13879j33019J96893k39299
16574D135812l1377j28176j02795Q8452m128K409J73537m92036j36897L73122
16564C877923r6773K9284l35510K2320N2778M06251n94302K65076m61703J71404
16554C336748p6655m51784j85169O39390j69265J52063j12164k6716P1837r2277
16544C086008m06847L60147m42272j00141J13165K12606L2109l36909J16760o8780
16534B565846J13030m59510M14858j90615k5913k8859j22657K01431k16323K26519
16524B477807J31966n54566N1312K28131n1941k10272k2623N1952j84556K04766
$$ y = [5630031, 5732284, 5296095, 5536550, 5199474, 5318928, 5219788, 5150776, 4979708, 4945957, 5121834, 4753101, 4680811, 5037399, 4385894, 4663843, 4625116, 4311237, 4178218, 4375111, 4135812, 4104435, 3976259, 3873464, 3961916, 3957788, 3960197, 4133734, 3641698, 3504801, 3877923, 3781150, 3810434, 3474924, 3497244, 3550022, 3956273, 3361971, 3627047, 3165344, 3336748, 3260093, 2808309, 2623140, 3262530, 3093265, 3245328, 3133164, 3106448, 3178285, 3086008, 2679161, 3039308, 2597036, 2496895, 2610060, 2822666, 2854775, 2517866, 2634626, 2565846, 2678876, 2219366, 2634224, 2443609, 2417696, 2388837, 2266180, 2467611, 2251288, 2477807, 2609773, 2055207, 2106519, 2334650, 2282709, 2072437, 2049814, 2101766, 1917210, 2121976]
16514B121976N4395j71821K028l01498M94968k19996l5930K2752n1721m19839
16504A495314N63378k21241P4882n0298j33923K69926m83880K21723r4036J49279
16494A791124o7936J16149j52718j51357J6106J90880j00700j72733P8982J46799
16484A694596k10926J23950k79600J89564o2933K14276k76287K36689q4761k08042
16474A336526J59076p4803K44899n63637K93401K30047m0572k83726k5256L04507
16464A580462n16429J81752J74208k55387J24698j62057J74822k0162P6621j61242
16454A197286Q8296j76569r9982J51620M2247j21188Q8930k70914K52489l16738
16444H35477L03987k0813K38573k5254m3253p8720l08920J98129J53391k1216
$$ y = [2121976, 2176371, 2004550, 2006578, 1705080, 2200048, 1980052, 1944122, 1966874, 1915153, 1495314, 2058692, 1837451, 1912333, 1862035, 1728112, 1998038, 1514158, 1735881, 1641845, 1791124, 1723188, 1839337, 1686619, 1535262, 1551368, 1742248, 1641548, 1468815, 1547797, 1694596, 1483670, 1607620, 1328020, 1517584, 1454651, 1668927, 1392640, 1629329, 1544568, 1336526, 1495602, 1420799, 1665698, 1102061, 1395462, 1625509, 1584937, 1301211, 1275955, 1580462, 1064033, 1245785, 1419993, 1164606, 1289304, 1127247, 1302069, 1281907, 1358528, 1197286, 1285582, 1109013, 1009031, 1160651, 1202898, 1081710, 1170640, 899726, 1152215, 835477, 1139464, 1118651, 1357224, 1331970, 1288717, 1209997, 901077, 1099206, 1252597, 1231381]
16434A231381N1501j66887l01992O6453L27123n2505k48607N13779m25754J55449
16424A149941l1631r0104l64305L38449p5666R217m0213k46192L51838Q6773Q5116
16413A173223K05521k90376L2172l15452r1094O0598R3184J96237j10596P987
16403I61404r6839L97056m55343J42108l26734K81286j97891J88495J7865k35976
16393F75431o1865M67140l26595P603q1322K08109r080q3045M23627n51437O4389
16382G32955j14134L23473r1785j76912j15704K1783L89696k45251l13853K79605
16372F89873J15044O6003j00037j54210J22788L8380N9743k15434J63964l9916
16362G46198J70907j83081n3616j53458j7229K08783q9543m7354M0427O602J98704
$$ y = [1231381, 1282882, 1115995, 814003, 880456, 1207579, 1155074, 906467, 1420246, 994492, 1149941, 1118310, 1028206, 663901, 1002350, 926684, 935901, 895688, 649496, 1001334, 1088107, 1173223, 1378744, 1088368, 1120540, 805088, 713994, 774592, 867776, 1064013, 953417, 961404, 864565, 1261621, 806278, 948386, 621652, 902938, 705047, 893542, 911407, 675431, 613566, 1080706, 754111, 761714, 680392, 888501, 879421, 796376, 1220003, 668566, 732955, 618821, 942294, 850509, 673597, 557893, 579676, 969372, 724121, 410268, 689873, 804917, 870920, 770883, 616673, 739461, 777841, 837584, 622150, 786114, 746198, 917105, 734024, 680408, 526950, 509721, 718504, 628961, 581607, 622034, 628636, 827340]
16351H27340j28509J08661M580j37228L4405m2744J17951k01730Q3142j18160
16341E47708j15008K27473Q0217k3368k87154L44908j85564P1311j26549O1782
16331E95756Q5076j99900K58729j29512J91473A84469O24002k67713L2157Q8694
16321F61609m0396A68599P23548m27010o8601K67239k35680L94990k41419J9619
16311F01285k45306k8308J17421O1068K59106j63778j4680j90210K50634I168
16300C23184K43347B53959K9399A40037P98912C00744J74493J69498j12504j71657
16290C60574N0659Q4611J0568j72788j2381j01957J60068M03464l41011j32323
16280C09484K88100r4328B25715j7944L33555k19235A50056M78050k61352J70658
$$ y = [827340, 698831, 807492, 812072, 674844, 709249, 666505, 784456, 582726, 665868, 547708, 432700, 660173, 740390, 717022, 429868, 774776, 589212, 660523, 533974, 595756, 680832, 480932, 739661, 610149, 801622, 184469, 808471, 540758, 572915, 661609, 621213, 168599, 892147, 465137, 396536, 663775, 428095, 823085, 581666, 601285, 355979, 327671, 445092, 506160, 765266, 601488, 586808, 396598, 647232, 9168, 323184, 566531, 253959, 283358, 140037, 938949, 300744, 475237, 644735, 532231, 360574, 411233, 495844, 506412, 333624, 321243, 219286, 379354, 782818, 441807, 309484, 597584, 503256, 225715, 207771, 541326, 322091, 150056, 628106, 366754, 537412]
16270E37412n4311j37428J32983K9039k24212K30359j26352J44259j52423O1111
16260D40437r4887A22385M04027B60479K26384A84310n0236J21380n1190O4812
16250B69076j33661J65614L25767A97891L04000j83944G5526J41650L57820j71290
16240D03706l636p2444r8270L84092B90676J6688A14904L40010A72851J11008
16230B83859P702L73596k49431C4616e6877D48485j53149k2610k0470K73159C1123
16218C54523l8719r9431K53599j1518J15629j23417J77481j46328A12586K713
16208A15299K80775M3030j44594L60777j37364B51039L17584j44537j24614m6842
16198B52630J86148j84729j0708i2975D95716n3869B09983j1013K88881A18938
$$ y = [537412, 483101, 345673, 478656, 507695, 283483, 513842, 387490, 531749, 379326, 440437, 345550, 122385, 526412, 260479, 486863, 184310, 134074, 255454, 204264, 269076, 135415, 301029, 626796, 197891, 501891, 317947, 75526, 217176, 574996, 403706, 400070, 327626, 229356, 613448, 290676, 307364, 114904, 454914, 172851, 283859, 291561, 665157, 415726, 34616, -56877, 448485, 295336, 272726, 252256, 525415, 31123, 354523, 315804, 216373, 469972, 458454, 574083, 450666, 628147, 481819, 112586, 115299, 396074, 439104, 294510, 655287, 517923, 251039, 568623, 424086, 299472, 252630, 438778, 254049, 243341, -92975, 495716, 441847, 209983, 198970, 487851, 118938]
16187a6464k3631D20023p7717E6682Q7157M8744k7946L5032J83890A75346N2811
16176B28157b7461A50420N0049K70257i1949B1428M67302A83724K47806d4843
16165C30179j08092K02279A52915L9620J79874A25168J96795q4113j07664K93012
16155D23198a07953D21024j02157G5783J06262q9114L3366M2874M12896j65999
16145D16068n3348d0409A90399G2883J34878A02545K47482j15089o1921j4612
16135A58405E3377Q9623O7617j1759O0842L0103J9303J22888A07240m7161a33111
16123C63740A1915L68092A58520J92041j73079J13266q6605d27188B05640M4086
16113B49726K4791P5009p2192j35767j5504M97498B9927d6539D3955K03114e4307
$$ y = [-16464, -40095, 420023, 342306, 56682, 143839, 192583, 164637, 199669, 383559, 175346, 228157, -27461, 150420, 200469, 470726, -91949, 21428, 488730, 183724, 431530, -44843, 330179, 222087, 424366, 152915, 192535, 372409, 125168, 321963, 237850, 130186, 423198, -107953, 421024, 318867, 75783, 182045, 92931, 126297, 169171, 582067, 416068, 362720, -40409, 190399, 72883, 207761, 102545, 350027, 234938, 173017, 158405, 53377, 143000, 210617, 198858, 259700, 289803, 309106, 431994, 107240, 60079, -133111, 363740, 11915, 380007, 158520, 350561, 177482, 290748, 204143, -427188, 205640, 249726, 274517, 349526, 277334, 141567, 126063, 623561, 29927, -46539, 43955, 247069, -54307]
16101A10868K09040J9908A23918k9924J13612G7430n23N2326J03331K8138d6391
16089C0323J21727Q5500c17079J41350B01227H7564J54522F9502i0776A39040
16078B70461a1981l9074B00090h2197B04977N1071c78048B36844D872M48354B7706
16066A21067K93149a83130j12377a23794b0801C64777a12275C0346c11608A69122
16055a35117B949e7185q1650B10904F0948b89589A41161J7376e7713B2214a40575
16043A21990a59032B5639L64868A34550l4240O5842K26236a8518E24871A9676
16032f5103k183A1870J66157L394g753j09858l0752e1232A58415c8884A11146
16020a4317d973C42876j45378h1802A21620J41665q0783h3824A54825e7537K0529
$$ y = [110868, 319908, 339816, 123918, 93994, 207606, 77430, 76907, 129233, 232564, 260702, -46391, 30323, 152050, 237550, -317079, -175729, 201227, 87564, 242086, 69502, -90776, 139040, 270461, -11981, -51055, 200090, -82197, 204977, 256048, -378048, 236844, 4872, 453226, 27706, 121067, 414216, -183130, -295507, -123794, -20801, 364777, -112275, 30346, -311608, 169122, -135117, 2949, -57185, -138835, 210904, 60948, -289589, 141161, 158537, -57713, 22214, -140575, 121990, -159032, 25639, 390507, 134550, 100310, 166152, 392388, -18518, 524871, 19676, -65103, -67286, 11870, 178027, 181421, -7753, -117611, -148363, -51232, 158415, -38884, 111146, -14317, -4973, 342876, 197498, -81802, 121620, 263285, 182502, -83824, 154825, -57537, -37008]
16009c7008F5805J84480d8835j63805A47177a71742J9367E5191R4500J84943a19453
15997F9921Q1784a9100r9644b1918E2829J74075o1919f3241G4529J04904p3940
15986A05493a25634C68734i645A86352o8164L5126f7688C606N3938f3973r2528
15975a56501A78167a7856C13888b1064A84980n1577A9349K27606K92292k23480
15965C15767P5894J10381J27242l0242A44869k7802B1490Q9019b7634B38327q8660
15954A49667L4349d8293C6666J79667k3860l2397l9323a94321F728f0402A29630
15942d3612D1265A8655g2607A20571n6998O5937F804a12965B03432J3332H3552
15930h9506I540O0971b23557q6683D2167K68521h1670k30705B7234J78816Q5405
$$ y = [-37008, 65805, 250285, -48835, -212640, 147177, -171742, -152375, 55191, 149691, 334634, -119453, 69921, 151705, -19100, -118744, -21918, 52829, 226904, 164985, -63241, 74529, 179433, 105493, -125634, 368734, -9645, 186352, 118188, 153314, -67688, 3606, 57544, -63973, -156501, 178167, -17856, 313888, -21064, 184980, 133403, 19349, 246955, 539247, 315767, 391661, 502042, 629284, 599042, 144869, 117067, 21490, 110509, -27634, 238327, 149667, 184016, -48293, 36666, 216333, 192473, 160076, 120753, -194321, 6728, -60402, 129630, -43612, 41265, 18655, -72607, 120571, 63573, 129510, 6804, -112965, 203432, 216764, 83552, -89506, 9540, 70511, -223557, -310240, 42167, 310688, -81670, -312375, 27234, 206050, 291455]
15919B91455d5216A89294j8339n8089k9217a73737r3949M3266E5716d92211A0812
15907A03428a61016A0207c8688A75256A6200J47650a41413p3128C6970d5153k59461
15896c04614A27192a40126C4134J23272b67357A86828J4275C1589J27177h5732
15885a10218A83273C2889R3350E0698a96491k12679h622j41690G0884B8909O107
15874C5016a83018p7104H7831J28694l1706f8596K5413k02458h2204K3927j26516
15863a84793N1376f3558k0671m1240N4670j14384h6509c8608a2650A09615f2692
15851a13521a7196B27929a47912A16248h73m2596D3828b23380P9534d7696A64178
15839a7071n0857B14792l7740d9662B33813p7058e19E9155M840b90547A33369
$$ y = [291455, -45216, 189294, 170955, 112866, 83649, -173737, -267686, -224420, 55716, -492211, 10812, 103428, -161016, 10207, -38688, 175256, 16200, 163850, -141413, -214541, 36970, -45153, -304614, 127192, -140126, 34134, 157406, -267357, 186828, 201103, 31589, 158766, -85732, -110218, 183273, 32889, 126239, 50698, -196491, -409170, -8622, -150312, 70884, 28909, 35016, -183018, -260122, 87831, 216525, 184819, -68596, -43183, -245641, -82204, -58277, -184793, -133417, -63558, -84229, -125469, -70799, -185183, -86509, -38608, -12650, 109615, -62692, -113521, -17196, 227929, -147912, 116248, -873, -43469, 43828, -223380, -143846, -47696, 164178, -17071, -67928, 214792, 177052, -49662, 233813, 156755, -519, 59155, 63995, -290547, 133369]
15827a51823B01933d6174D1696J96038F2057m941J0253J22427m0696a54439e1317
15815D4020k1971b9115l575k3229A64880a71110A56634M0099H6771a21659B10824
15803b72240G7830b72354f6417D1804h4722k62376d0932J4473j913D5085b93982
15791c70889H4595a71646h0876l1080o1439I6918l4088d8966B13248J34598i6647
15779c84098m2283a3933B42982c18078R0549A43152b00139m5057A21860b4315
15768B1300c34785A66078P717b78793f8736j26841H5383a48860o210L67A71011
15756I9859c06314L9889A61155K09898a08974D4367h2725A40175c66489h9343
15745d6764j80086A41150c6264D8592h2306H1838g8031k36634J52931d1657n77
$$ y = [-151823, 201933, -46174, 41696, 237734, 62057, 57116, 67369, 189796, 149100, -154439, -51317, 44020, 22049, -29115, -32690, -55919, 164880, -171110, 156634, 196733, 86771, -121659, 210824, -272240, 77830, -272354, -66417, 41804, -84722, -347098, -40932, -26459, -28372, 45085, -293982, -370889, 84595, -171646, -80876, -111956, -173395, 96918, 62830, -48966, 213248, 347846, -96647, -384098, -426381, -13933, 242982, -318078, -227529, 143152, -200139, -245196, 121860, -24315, 21300, -334785, 166078, 173795, -278793, -68736, -195577, 85383, -148860, -155070, -154703, 171011, 99859, -306314, -266425, 161155, 371053, -108974, 44367, -82725, 140175, -366489, -89343, -46764, -226850, 141150, -36264, 48592, -82306, 81838, -78031, -314665, -161734, -41657, -42234]
15734d2234o3106c1889j71289I0437a26409o7210A17038b8588k10152c1740A27590
15722a09254C0306L1107L1300k5676c37309P8280a1142l01154C449b9829B19292
15710b8061H7443e4208j57961f6897j79989A47018C8504b09628I3765e39323a77375
15698e76948A61226a68963a8457I4577A0805d6244j7675B32754b58846g5288K301
15687g2987K9456r0199E970M4689J77468J78363j95072f7612D2066a01507L6912
15676f4595b7326C1899J19711h6353n8305A5769P6768h3055I7554a13093A625
15664A27252M7834e1706j9705A56060b83648j01773a04781c9656B44768R1918
15654C36686A62615c81621F9671c58765J78504F3627d4006m0679G5469R406e8610
$$ y = [-42234, -105340, -31889, -203178, 90437, -126409, -193619, 117038, -28588, -238740, -31740, 127590, -109254, 30306, 61413, 92713, 67037, -337309, -259029, -11142, -312296, 3449, -29829, 219292, -28061, 87443, -54208, -212169, -66897, -246886, 147018, 38504, -209628, 93765, -539323, -177375, -576948, 161226, -168963, -18457, 94577, 10805, -46244, -63919, 232754, -258846, -75288, -72987, -43531, -133730, 5970, 50659, 228127, 406490, 211418, -67612, 42066, -101507, -64595, -27326, 31899, 151610, -86353, -144658, 15769, 92537, -83055, 97554, -113093, 1625, 127252, 175086, -51706, -71411, 156060, -283648, -385421, -104781, -39656, 244768, 336686, 162615, -381621, 69671, -358765, -180261, 63627, -44006, -84685, 75469, 84875, -58610]
15642a59106j73565J31658b1579m85957i7355k12442C53227a54992k4528l04649
15632d84169a8231I9176J88436a179p9872q2591E3873j3760H748Q8398d19657
15620i8198H9085P8397L9031p0755E673O3440o457h7713j46391a06789C058a46673
15607F1809B1338b41062j3813D0991J13303a15467c1575E7283a91575j09174E6740
15595E477b25559f920E9569K65796b14184a05159K3732q6196p6589A2028e6695
15583a722k1580q2140D6319K90545q9254A08296d3967B0511a46388j07076C560
15571a33288d7248l776D03272q9157c44671J30166l5396J6988q6678h0075b3298
15559E5469P8446N6900d51228P0396B81435b52557o8299B60652a21289B62351
$$ y = [-159106, -332671, -201013, -21579, -507536, -97355, -309797, 353227, -154992, -179520, -484169, -18231, 99176, 287612, -1179, -81051, -163642, 53873, 40113, 8748, 97146, -419657, -98198, 89085, 167482, 206513, 135758, 5673, 69113, 62656, -87713, -234104, -106789, 3058, -146673, 61809, 21338, -241062, -254875, 40991, 154294, -115467, -31575, 57283, -191575, -300749, 56740, 5477, -225559, -6920, 59569, 325365, -214184, -105159, -81427, -167623, -244212, 12028, -56695, -1722, -23302, -105442, 46319, 336864, 247610, 108296, -43967, 20511, -146388, -253464, 3560, -133288, -47248, -51024, 403272, 314115, -344671, -214505, -249901, -232913, -319591, -80075, -23298, 55469, 133915, 190815, -451228, -380832, 281435, -252557, -320856, 260652, -121289, 262351]
15548A79302C4331K26199A1230J45851C3759J329J16502a44560o4153I4919c9504
15536a5913r431A82510J47164F3707a4891j02602B39205o4219F1566f4257B34234
15524B95289j09450k5250j0870c34341A56959a57202e4577k3456m1719F0372H759
15512F0431K313K01833c9406k06797D1034J90570A06214C2095K87448j20347C213
15500C06748a4871A44229J20986A05916a28667N3509A74114b6286A71135G4524
15489A50858o8683K1183L28945I6041N8093F609i639A79132G1449A7208e6700
15477B10000b17042C32025A4687b57361F4397a0015C26229a15559K739J3258D06855
15465G6727b266j32929p6775a9342G0509J33616n9047E2908B0212P2685j8778
$$ y = [179302, 34331, 260530, 11230, 157081, 33759, 35088, 151590, -144560, -208713, 94919, -39504, -15913, -25344, 182510, 329674, 63707, -14891, -117493, 239205, 174986, 61566, -64257, 234234, 295289, 185839, 160589, 149719, -334341, 156959, -157202, -54577, -78033, -119752, 60372, 8759, 60431, 62744, 264577, -39406, -246203, 41034, 231604, 106214, 32095, 319543, 199196, 3213, 306748, -14871, 144229, 265215, 105916, -128667, -75158, 174114, -26286, 171135, 74524, 150858, 82175, 103358, 432303, 96041, 154134, 6609, -9639, 179132, 71449, 17208, -56700, 210000, -217042, 332025, 14687, -257361, 64397, -10015, 326229, -115559, -112820, -99562, 406855, 76727, -2266, -135195, -211970, -19342, 70509, 204125, 145078, 52908, 20212, 92897, 74119]
15454G4119K51533F9475c5991G1683a36948j29303d428B12339F7225g5959A5152
15442B66365H0751g1479A20909b91871B72935C9142a33187A09217k0701N0855
15432A39371J31680A26512k2043b96662J20004A73636G7714L98930B23873K20232
15422D44105C0728a74683H5674f2995A13310B0045b2125q0991A14739b02733A58919
15410A57846c44675e5349B34787e8484j02444d6543B25253e7771B22113b284j38087
15399a40371e4955j70942N5650P1689A42859O4451c19012B15927b95288O0652
15389b34636c984B1278M8603C3227d59478a00494J2694o7591B95290a38075B5517
15377a17352c7214B57670n1969B0163K19475a67583N6152D2921a464o093G1365
$$ y = [74119, 325652, 69475, -35991, 71683, -136948, -266251, -4428, 212339, 67225, -75959, 15152, 266365, 80751, -71479, 120909, -291871, 272935, 39142, -133187, 109217, 88516, 139371, 271051, 126512, 104469, -296662, -176658, 173636, 77714, 476644, 223873, 444105, 30728, -174683, 85674, -62995, 113310, 20045, -22125, -103116, 114739, -202733, 158919, 157846, -344675, -55349, 234787, -58484, -160928, -46543, 225253, -57771, 222113, -2284, -140371, -54955, -225897, -170247, -98558, 142859, 207310, -319012, 215927, -295288, -234636, -3984, 21278, 69881, 33227, -459478, -100494, -87800, -155391, 295290, -138075, 25517, -117352, -37214, 257670, 205701, 20163, 239638, -167583, -111431, 42921, -1464, -7557, 71365]
15365e0826p1742k50563d2666B07716a61988f2120F2724D753K26164D0279J07956
15354A48235a4286l65050H8835j4207a2603C71098a27668J9453E9789g9556C07132
15342F2742e085k63359B53504A08590J29722a6191A65093a08811l456b018l45479
15331c47497h1905A99198a92048D4754P089k4433K4131k631b43673A75520l0309
15320A45211J14994F2000h591m0571A47464i2094L9129C09259b34561h1797A43148
15308a25731q6157B49478b4500B75150b46956m7463B45644j9677H0983J2324d2947
15296A29738R6816d5359l34416A11841a95302E775K18754l7728q885J16407a30209
15284A26558d4357H1662c30097a03809B34491k6394b3843E0858J0612J999J64319
$$ y = [-50826, -122568, -373131, -42666, 207716, -161988, -62120, 62724, 4753, 230917, 40279, 148235, -14286, -379336, 88835, 74628, -12603, 371098, -127668, -108215, 59789, -79556, 307132, 62742, -5085, -268444, 253504, 108590, 238312, -16191, 165093, -108811, -112267, -2018, -347497, -81905, 199198, -192048, 44754, 51843, 27410, 51541, 48910, -243673, 175520, 145211, 260205, 62000, -8591, -49162, 147464, -92094, -52965, 309259, -234561, -81797, 143148, -125731, -211888, 249478, -24500, 275150, -246956, -294419, 245644, 225967, 80983, 93307, -42947, 129738, 226554, -45359, -379775, 111841, -195302, 5775, 224529, 186801, 177916, 294323, -130209, 126558, -44357, 81662, -330097, -103809, 234491, 208097, -23843, 50858, 61470, 63469, 227788]
15273B27788J28503j01186e6867k49415c0980E33168a60712B48981H8731K38420
15263C27151c0317A78691a41957C16612c5292k01479B24023a85426D15427B01548
15252D14633C3511J04391J00540A08668M5715k8344L9950a6775A79034F6893M4168
15241A11061f5922F3500b8330k8737D99498B3458J35510B9589L13402B0019h8823
15229B06583O2988J19435d4699D22185N75627L48533J286257n45834k13824L05615
15219B178559I26529n2535B38001k0120J00168J19427i6036G4863J04587l2707
15209A46743R7708r3005Q4264b80861A55841c601E6091j5174O1452d14470A0983
15197B31851b5015j04339A11709a35519c9063C8447M9240a00893F9546L14868
$$ y = [227788, 356291, 255105, -56867, -306282, -30980, 533168, -160712, 248981, 88731, 327151, -30317, 178691, -141957, 316612, -35292, -236771, 224023, -185426, 415427, 201548, 414633, 33511, 137902, 238442, 108668, 154383, 126039, 165989, -16775, 179034, 66893, 111061, -65922, 63500, -28330, -57067, 499498, 23458, 158968, 29589, 342991, 20019, -88823, 206583, 269571, 389006, -44699, 422185, 997812, 1346345, 2632602, 2086768, 1872944, 2178559, 926529, 873994, 238001, 217881, 318049, 437476, -96036, 74863, 179450, 146743, 244451, 151446, 235710, -280861, 155841, -3601, 56091, 40917, 102369, -414470, 10983, 231851, -25015, -129354, 111709, -135519, -39063, 38447, 87687, -100893, 69546, 384414]
15187C84414K4740B4498d287j82712A37375k9798N0063d3383H582L971K19189
15176B31742e8969A6770L8764a86851D7852J46715i9463j316B28382I7962P8211
15165A76173G8072a29455k5907L870A31796c1988A32525D3594i9862A11325c47051
15153A1674N0820j2996J18722m8752l939b0510j27139A92589B2431d6107B41815
15141C9888N9252L6131f8165A91393C7696M81661q3843o9050A50039C2301J77518
15130B09819M2566a40114A1240K28107l8824a24821A33495L16446a30674m9279
15120a79953A5529K51047A10164R5877k5464f4627A62784F1905Q2267N6295L29225
15109E29692I7994b0071A82465O4077q2875J57734D0359L93520j23287q5041l7511
$$ y = [384414, 409154, 24498, -4287, -186999, 137375, 107577, 157640, -43383, 8582, 12553, 231742, -58969, 16770, 55534, -186851, 47852, 194567, -99463, -100779, 228382, 97962, 176173, 78072, -129455, -155362, -151492, 131796, -31988, 132525, 43594, -99862, 111325, -347051, 11674, 62494, 49498, 168220, 119468, 115529, -20510, -147649, 192589, 22431, -46107, 241815, 39888, 99140, 135271, -68165, 191393, 37696, 519357, 435514, 366464, 150039, 32301, 209819, 252385, -140114, 11240, 239347, 200523, -124821, 133495, 449941, -130674, -179953, 15529, 266576, 110164, 206041, 180577, -64627, 162784, 61905, 144172, 200467, 529692, 97994, -20071, 182465, 246542, 163667, 321401, 40359, 433879, 310592, 225551, 188040]
15098A88040M9865J80988K15951l10438E4719L25554b17631A74040o7555b1316
15087A2020K66590q1314C7384K3928C758K22718a82987j17111A2663K0330K25562
15076B58555Q2276b51441B25865j01514n4113N05471A25247j1945P6940H5565
15065D3506C622K74882e2140B35836c9039J8358A58031k787E1238M56854A02155
15053B33240K26646E4087O775a21460B68374a52985B31899G2163j4351a61565
15042A23203I611m153J98833J01447A35524l6514P9347A960J98309J16083H4327
15030A06942m5094L19609J16642A59709J94747A22710q7J49191A30333m0653P89
15019I0469K48504Q0242Q6510A09078K16639d6262C32275j82P9826l2970j19167
$$ y = [188040, 237905, 418893, 634844, 324406, 54719, 380273, -217631, 174040, 106485, -21316, 12020, 278610, 197296, 37384, 61312, 3758, 226476, -182987, -300098, 12663, 32993, 258555, 340831, -251441, 225865, 124351, 70238, 575709, 125247, 113302, 190242, 85565, 43506, 3622, 278504, -52140, 235836, -39039, -20681, 158031, 155244, 51238, 508092, 102155, 233240, 459886, 54087, 60862, -121460, 268374, -152985, 231899, 72163, 57812, -161565, 123203, 9611, 5458, 204291, 305738, 135524, 99010, 178357, 1960, 200269, 316352, 84327, 106942, 61848, 381457, 498099, 159709, 354456, 122710, 122623, 271814, 130333, 89680, 90469, 338973, 419215, 505725, 109078, 325717, -46262, 332275, 332093, 411919, 378949, 259782]
15008B59782r9627C9320J62951L13990B18509F2761K19273I8995K6976J21658
14998B47629P1983K3949O3431D2895L81678A83385r0006N86523A01259m5492Q6906
14987A42673R4961E2969L09708J32741A1212Q1704K76961o5903j28731M63913
14977F39156a83243B56638J36863f572C64295L6237r5642r9444q4974L16680k1807
14966D15345q2921j60066J32310J15900j05577N5664M54615B51188k4843j10146
14956A16199N03268B41659L06827k67137L16836e8405r4881C16579j08954K13949
14946D21574A14943J14421l5484L6874A9555M00084j09302J54489C686M62768
14936D66454B26000L01300j60740O3627l0365n5936J97317j5453j97898J69606
$$ y = [259782, 160155, 39320, 202271, 516261, 218509, 62761, 282034, 98995, 125971, 247629, 319612, 343561, 406992, 42895, 424573, 183385, 93379, 679902, 101259, 55767, 142673, 237634, 52969, 362677, 495418, 11212, 92916, 369877, 303974, 175243, 639156, -183243, 256638, 393501, -6572, 364295, 400532, 304890, 205446, 120472, 437152, 415345, 332424, 172358, 304668, 420568, 314991, 370655, 825270, 251188, 226345, 116199, 619467, 241659, 548486, 281349, 598185, -58405, -153286, 316579, 207625, 421574, 114943, 229364, 193880, 230754, 19555, 419639, 310337, 464826, 3686, 466454, 226000, 527300, 366560, 430187, 399822, 343886, 541203, 525750, 327852, 497458]
14926D97458B38874K83238j74820j63866q0149K99123b2882E38905K53716l63578
14916D29043l2894M12358B63890q8260M04052r7645L5029q0067j5268L83131k76349
14905E28513L48177j12873N9769j99818k10278N18926n9068l05906L16299k92132
14895E91609n5676K73365k71655A14953q978J47469J99986m7973K17528k08812
14885D14173Q4258j50767O9027o5970j0257F7390A0733M85723L9886A62458K11398
14874C73856j59673K45606J91644B11777L44009j67880n0553K35712j81397j14487
14864B77181q7389J87489q0819N6650p2797M758K00495A09537M99855j74035J4091
14853D49448k20772J24258J41620J16638r5691J13499P166l9297k81947J75514
$$ y = [497458, 238874, 522112, 347292, 183426, 103277, 402400, -22882, 538905, 792621, 429043, 396149, 808507, 263890, 175630, 579682, 482037, 517066, 436999, 421731, 804862, 528513, 876690, 763817, 823586, 623768, 413490, 932416, 873348, 567442, 883741, 591609, 535933, 809298, 537643, 114953, 105975, 253444, 453430, 405457, 622985, 414173, 498431, 347664, 416691, 350721, 340464, 67390, 10733, 496456, 536342, 162458, 373856, 214183, 459789, 651433, 211777, 555786, 387906, 337353, 573065, 391668, 277181, 189792, 377281, 296462, 353112, 280315, 285073, 485568, 109537, 609392, 435357, 449448, 228676, 352934, 494554, 611192, 515501, 629000, 636166, 596869, 314922, 490436]
14843D90436k44537J40672K03153k28987J41556M5923J6622A15012J67341K3042
14833C05395J09918L39440B13845J88851K40601j37316A46633L05089J73545J39021
14823G64288j32768k1608K21424O6335J00978l29276o0749l4946K5330B87204
14812F66658Q748J35465l49297J64416N6652j15503k713J46410j10341L673K03885
14801H08053k03013J03276j69290B01644N32578k01933J13916J58889l96233l5121
14791C73740K30465R6742m1147k62332L71953k461J55667k77428k30423K80648
14781F95424O516L56268n05396j9098k4092B27360M27855N0690K05639D26302
14770G95759p4138l9086q5247M69995l95164J02525C71776P21357E21472P4295
$$ y = [490436, 245899, 386571, 589724, 360737, 502293, 548216, 564838, 115012, 282353, 305395, 415313, 754753, 213845, 402696, 643297, 505981, 146633, 451722, 625267, 764288, 631520, 609912, 831336, 897671, 998649, 669373, 608624, 573678, 599008, 287204, 666658, 675406, 810871, 461574, 625990, 682642, 567139, 564426, 710836, 600495, 604168, 808053, 605040, 708316, 539026, 201644, 734222, 532289, 646205, 805094, 408861, 373740, 604205, 700947, 659800, 397468, 769421, 766960, 922627, 645199, 414776, 695424, 701940, 1058208, 552812, 533714, 509622, 227360, 655215, 705905, 911544, 426302, 795759, 721621, 682535, 597288, 1067283, 672119, 774644, 371776, 1093133, 521472, 595767]
14760E95767J88536j32638L5885K19632l35629m4946J08955j23263L4358M8930
14750E95587J20141k16296L99029m18518J91664l5111O6848J21278k49114J11676
14740F87184K30566l77618n0373K14435n2069J06851j72581J70017j72496J64643
14730G48559j77129m0163M1082K96750J04853k79315L30834m2825k59118J22665
14720H46193k47046J55366k47960m3187K45025J85629M8296O4972N5258j53129
14710I09417j00390J69062J63349J44770o6015n39747L20902j19086J05805o8598
14700I19469k45291j31908L05910N4788o2245P9063p8434m10695L90140K71066
14690A091863k5216k87344N49280m56155J07886k27694L20462j74086N60534n09583
$$ y = [595767, 784303, 651665, 687550, 907182, 571553, 526607, 635562, 512299, 546657, 595587, 715728, 499432, 898461, 479943, 671607, 636496, 703344, 824622, 575508, 687184, 917750, 540132, 489759, 704194, 652125, 758976, 586395, 756412, 583916, 748559, 571430, 531267, 572349, 869099, 973952, 694637, 1025471, 982646, 723528, 846193, 599147, 754513, 506553, 463366, 708391, 894020, 942316, 1007288, 1062546, 909417, 809027, 978089, 1141438, 1286208, 1220193, 680446, 1001348, 882262, 988067, 919469, 674178, 542270, 848180, 902968, 840723, 919786, 841352, 430657, 820797, 1091863, 1066647, 779303, 1328583, 872428, 980314, 752620, 1073082, 898996, 1459530, 949947]
14680I49947J07251k7598r3544k32909j3816K09016o0819j07731N16092k10695
14670A035194R5329l25933J07141n4857K35287l05292J37851K60936p5396k4228
14660A086032L40599n93820j59405M26303J65815k75513k32607L18098L65555
14651A441057j16208o1688j16591J56513k04812J65436k50676r3588J61131j7358
14641A063216j09379J81418j22279j0339K93192J29167k52819p399m6916K10561
14631A328423j6405r997R0882n12042K41897L94176k97971j26801J84051J15636
14621A391849J40896l68458P3004q6557K3284Q3736K50979k14941J72756N8129
14611A524677m35428J47776J32168P5392O9729j91869L16431p2410k3710K3701
$$ y = [949947, 1057198, 1029600, 936056, 703147, 689331, 898347, 837528, 729797, 1245889, 1035194, 1130523, 804590, 911731, 856874, 1092161, 786869, 924720, 1185656, 1110260, 1086032, 1426631, 832811, 673406, 1099709, 1265524, 990011, 757404, 1075502, 1441057, 1324849, 1263161, 1146570, 1303083, 1098271, 1263707, 1013031, 919443, 1080574, 1063216, 953837, 1135255, 1012976, 1002637, 1295829, 1424996, 1172177, 1164778, 1117862, 1328423, 1312018, 1302021, 1392903, 880861, 1122758, 1516934, 1218963, 1092162, 1276213, 1391849, 1532745, 1164287, 1237291, 1150734, 1174018, 1257754, 1508733, 1293792, 1466548, 1524677, 1089249, 1237025, 1369193, 1444585, 1514314, 1322445, 1638876, 1566466, 1542756, 1566457]
14601A566457P8002M3336m7839j74387J59354j76707J15502q516L31223m46172
14591A440253K92811L1438j26490j7422M9791L87515k30545m0236L8655J10622
14581A936392l02744L29306j13164l21340j6592N01421p3190J41001j47455k31168
14571A702467L26458J10939M0230k12842l3299K71030j4l41289J01287R3938J29300
14560B188205K19125l12830l782K32765R118J53772k03504N6644L89149j18285
14550B610377j6274M2418q254K84146l5751J73066J0051J10064L48932K12671
14540C731446J52111M86960O93525O42853J354300J348901L277575L929136O064553
14531B1681360R756463p91660j3923262p118299l186125k011100o05092m13761
$$ y = [1566457, 1644459, 1687795, 1639956, 1465569, 1624923, 1448216, 1563718, 1555202, 1886425, 1440253, 1733064, 1764502, 1638012, 1620590, 1670381, 2057896, 1827351, 1787115, 1825770, 1936392, 1633648, 1962954, 1849790, 1528450, 1511858, 2013279, 1940089, 2081090, 1933635, 1702467, 2028925, 2139864, 2180094, 1967252, 1933953, 2204983, 2204969, 1863680, 1964967, 2058905, 2188205, 2407330, 2094500, 2090718, 2323483, 2332601, 2486373, 2282869, 2339513, 2728662, 2610377, 2594103, 2636521, 2628267, 2912413, 2876662, 3049728, 3059779, 3169843, 3518775, 3731446, 3883557, 4370517, 5064042, 5706895, 7061195, 8410096, 11687671, 15616807, 21681360, 31437823, 30646163, 16722901, 9604602, 6418477, 4407377, 3802285, 3388524]
14523C388524l20137R3544O32620O4539P52132J831049j626454j321893m48227
14514C045697m15146k971L51249n59501k37299N22290l09395L52338m04278J66903
14504B509887J42039M0869Q968O0742R2573K3411J54490k25830j12182M81373
14494C176340j60276q3144p8292P43706n02671o3116J80422j53553o4307K78027
14484C273136J89605J40672k59044Q3843K08527m6794J6941L03666k99771J24517
14474C735298J79903K791k85623K78594k66293K05095J80593p430O4018R8929
14464D185875l0511j45701J83823O26098k51238l96773N2770K24903M37800l61625
14454D525421K01201l00733L01550J44806J5833J05193p8958J00490q4317L8920
$$ y = [3388524, 3068387, 3161931, 3794551, 3859090, 4611222, 6442271, 4815817, 3493924, 3045697, 2630551, 2627580, 2978829, 2419328, 2182029, 2704319, 2394924, 2747262, 2342984, 2509887, 2651926, 2692795, 2701763, 2762505, 2855078, 2878489, 3032979, 2807149, 2694967, 3176340, 3016064, 2932920, 2854628, 3598334, 3095663, 3032547, 3212969, 3059416, 2995109, 3273136, 3462741, 3603413, 3344369, 3428212, 3636739, 3589945, 3606886, 3910552, 3610781, 3735298, 3915201, 3917992, 3632369, 3910963, 3644670, 3849765, 4030358, 4022928, 4086946, 4185875, 4155364, 4009663, 4193486, 4819584, 4568346, 4171573, 4224343, 4449246, 4887046, 4525421, 4726622, 4425889, 4727439, 4872245, 4888078, 4993271, 4914313, 5014803, 4930486, 4969406]
14444D969406J26764J37997K56527j76311K61245j21050l6109K06298L84208K9261
14434F038236j61305L01435l12736P3960J01386M3882J40653k513j79327L19752
14424F363423J85341K30253q9178L16261j30401L40749J6039J59198L34927j91068
14414G535544J87863J71463k32473K62172p7873L55826m7604r5391O29804m9618
14404H639713L26582j30520J07753L74213l00558O61451m11877N73954r3831j84982
14394I561898L08972L85795n7473L44563Q7969O21611o0314K5876L80684m1351
14384A1558230K00854N18741l76120N30929m7821M92528n0538K36305M75626k57719
14374A3281015M66269J45525K80595K35828L08085M14151K58373J69863O94711
$$ y = [4969406, 5096170, 5234167, 5490694, 5314383, 5575628, 5454578, 5418469, 5624767, 6008975, 6038236, 5876931, 6178366, 5865630, 5939590, 6040976, 6084858, 6225511, 6222998, 6043671, 6363423, 6548764, 6779017, 6689839, 7006100, 6875699, 7216448, 7232487, 7391685, 7726612, 7535544, 7723407, 7894870, 7662397, 7924569, 7846696, 8202522, 8154918, 8059527, 8689331, 8639713, 8966295, 8835775, 8943528, 9317741, 9017183, 9678634, 9266757, 9840711, 9746880, 9561898, 9870870, 10256665, 10199192, 10543755, 10631724, 11253335, 11193021, 11218897, 11599581, 11558230, 11759084, 12277825, 11901705, 12432634, 12384813, 12877341, 12826803, 13063108, 13538734, 13281015, 13747284, 13892809, 14173404, 14409232, 14717317, 15131468, 15389841, 15559704, 16254415]
14365A6254415K634M57468k10416O68703M27263L48611J14641L37683M69840O57399
14355A9528241k10728Q43697O52275R7006L75851P38240L76421J73469K48125
14346B2822597R47367M10699O95626M69583N72319O68417P31085N15561O89576
14337B8522830N60151P45514N32051R45964P56372R77467O39296J045539O25932
14328C5351116Q29311J388154J001485Q46470J330540J115278J121885J402924
14320D4387163J091547J291765J381242J639712J318678J859217J395612J897748
14312E6262684K136615J442299K124562K039156K545152K123380K365133K642209
14304G3681190K886312K508202K970123L267528L218278L223352L500038L884662
$$ y = [16254415, 16257049, 16714517, 16504101, 17172804, 17600067, 17948678, 18063319, 18401002, 18870842, 19528241, 19317513, 20161210, 20813485, 20910491, 21286342, 22024582, 22401003, 22574472, 22822597, 23769964, 24180663, 24876289, 25345872, 25918191, 26586608, 27317693, 27833254, 28522830, 29082981, 29828495, 30360546, 31306510, 32062882, 33040349, 33679645, 34725184, 35351116, 36180427, 37568581, 38570066, 39416536, 40747076, 41862354, 42984239, 44387163, 45478710, 46770475, 48151717, 49791429, 51110107, 52969324, 54364936, 56262684, 58399299, 59841598, 61966160, 64005316, 66550468, 68673848, 71038981, 73681190, 76567502, 79075704, 82045827, 85313355, 88531633, 91754985, 95255023, 99139685]
14296I9139685M178681M300039M505027M898837M422098N674412N253827N979136
14288A38351742O268379O739643O957757P455759P735811Q154830R124014R116051
14280A99903986R871939J0170220J1017355J1417027J1966681J2505228J3686594
14273B80539030J3786619J4249945J4765205J5089279J4767723J4484332J2730444
14266C80412577J1651556J1011103J0405933R635756Q778492Q353906P549957
14259D47799280N226386J625420M84782J092026K664004j780139o101011q200611
14251D42810137q647280r003656j1225503j3108077j3743546j3818908j3225660
14244C60037507j4122256j3664461j3166386j3586620j3882212j2937965j2501069
$$ y = [99139685, 103318366, 107618405, 112123432, 117022269, 121444367, 127118779, 132372606, 138351742, 144620121, 151359764, 158317521, 165773280, 173509091, 181663921, 190787935, 199903986, 209775925, 219946145, 230963500, 242380527, 254347208, 266852436, 280539030, 294325649, 308575594, 323340799, 338430078, 353197801, 367682133, 380412577, 392064133, 403075236, 413481169, 423116925, 431895417, 440249323, 447799280, 453025666, 454651086, 455135868, 456227894, 458891898, 457111759, 451010748, 442810137, 434162857, 425159201, 413933698, 400825621, 387082075, 373263167, 360037507, 345915251, 332250790, 319084404, 305497784, 291615572, 278677607, 266176538]
14237B66176538j2240224j1182478j1202947j0740574j0754445r973784r084385
14230A90997701q965692p208751q222090q351429p914748o886467o777183n898653
14222A30772688n580743n730330n179267m772083m860088l749424l773500m176695
14214I2950558l489987l580788l181046l373289k880810k303320k934362k488489
14206F8718467k265625k135939k056948k260754k019889j849746j555432j548628
14198E3025506j319551k063024j203979j348651j513191j065339j208242j229999
14190D2073530j329023j301092o17078j296005o35998j031818r31648r87618r60276
14181C2982974r69974n64528o65735n05327j054289p33104k69379q90864o71586
$$ y = [266176538, 253936314, 242753836, 231550889, 220810315, 210055870, 200082086, 190997701, 182032009, 174823258, 166601168, 158249739, 150334991, 143448524, 136671341, 130772688, 125191945, 119461615, 114282348, 109510265, 104650177, 100900753, 97127253, 92950558, 89460571, 85879783, 82698737, 79325448, 76444638, 74141318, 71206956, 68718467, 66452842, 64316903, 62259955, 59999201, 57979312, 56129566, 54574134, 53025506, 51705955, 49642931, 48438952, 47090301, 45577110, 44511771, 43303529, 42073530, 40744507, 39443415, 38826337, 37530332, 36894334, 35862516, 34930868, 33943250, 32982974, 32013000, 31448472, 30782737, 30277410, 29223121, 28490017, 28220638, 27329774, 26658188]
14172B6658188o69933n05012q42880n7000r49856l13419o10373n04293m81248
14163B1724174m40409l50291m50338l57103l39266n59674j65547l67674l51403
14154A8342469p75669O362j72155o80596j94767k54522k68913j69622l92227k9673
14144A5410687l17131m88131k9224m12505J1638k91744k07611n41777K06426p02668
14134A2637960j88689m5833N4387m57396O5685k17586m27804J93219m53475l07198
14124A0853270M578l9199m36520K78048l97742J24612l88567j96469k25750L6563
14114I612824j01845j81794j61157m27201M43643m72130j32215K07620m92746
14105H294999j04022o0144j33059K10849j58260q9210j41348n2003j84112k43016
$$ y = [26658188, 25988255, 25483243, 24640363, 24583363, 23633507, 23320088, 22709715, 22205422, 21724174, 21283765, 20933474, 20483136, 20126033, 19786767, 19227093, 19061546, 18693872, 18342469, 17566800, 17573162, 17401007, 16720411, 16525644, 16271122, 16002209, 15832587, 15440360, 15410687, 15093556, 14605425, 14576201, 14163696, 14175334, 13883590, 13675979, 13134202, 13340628, 12637960, 12449271, 12403438, 12457825, 12000429, 12066114, 11848528, 11420724, 11613943, 11160468, 10853270, 10857848, 10818649, 10382129, 10660177, 10262435, 10387047, 9998480, 9802011, 9576261, 9612824, 9510979, 9329185, 9168028, 8740827, 9184470, 8712340, 8580125, 8787745, 8294999, 8190977, 8130833, 7997774, 8208623, 8050363, 7961153, 7819805, 7767802, 7583690, 7340674]
14095G340674o9750j16858L05395l87924j18964j12328j0230l48880J42992m2977
14085F581150q6281l30140K96310l32232J99196j30930J59812m78943J51676J95696
14075F225314o25131K02996k69162K38425k09028k2296q5740j78572K01571O750
14065E485127O5081m43161P8395k2369m4721l75892o656K39271k13855K04755
14055D965975k17362J38600l28034K32878j91697j65909j72900j00145M30416
14046D591822j48711N6241l49135K65998j01433k08439J33423k05642M1515k26277
14036C849362J40578J55150l20364m27195K64091j8301k68866N30678n10423J71053
14026C565763J96696m0057l27073L3996l6388K60521k90635r8793K00198m40557
$$ y = [7340674, 7270924, 7154066, 7459461, 7071537, 6952573, 6840245, 6830015, 6481135, 6624127, 6581150, 6494869, 6164729, 6461039, 6128807, 6328003, 6197073, 6356885, 5877942, 6029618, 6225314, 5600183, 5803179, 5534017, 5772442, 5563414, 5541118, 5455378, 5276806, 5478377, 5485127, 5550208, 5107047, 5185442, 5163073, 5118352, 4742460, 4735804, 4975075, 4761220, 4965975, 4748613, 4887213, 4559179, 4792057, 4600360, 4434451, 4261551, 4161406, 4591822, 4443111, 4499352, 4150217, 4416215, 4314782, 4106343, 4239766, 4034124, 4075639, 3849362, 3989940, 4145090, 3824726, 3397531, 3661622, 3643321, 3374455, 3905133, 3394710, 3565763, 3762459, 3722402, 3395329, 3429325, 3392937, 3653458, 3362823, 3264030, 3464228, 3023671]
14016C023671K09445N0887K078l39024K83546j24703J24057j27615j43607O5923
14006C024658N9725J60127j41311j23811m6195l26025M75440j03052J4636j66865
13996B827327k47134L64399o04358K09885k34149K58925O2812l14769P2351J11802
13986B507091L2616L44414l54631k1096R3949P0092J56431J62065L77554L72958
13976C741443O75432R57018K371004L881886M960909J0469151N836286j1587430
13968B1305699p582184l940046k732509j416781n53633o00009k29036o65635o4778
13959C521088n51051L31343k52078J7340m36364Q2969M0809K1909k62191j26374
13949B387400K92396k72492J18886l65195L95899l74243j8884J56369j01254P2190
$$ y = [3023671, 3233116, 3284003, 3286081, 2947057, 3230603, 3105900, 3229957, 3102342, 2958735, 3024658, 3084383, 3244510, 3103199, 2979388, 2933193, 2607168, 3082608, 2979556, 2994192, 2827327, 2580193, 2944592, 2340234, 2550119, 2315970, 2574895, 2637707, 2322938, 2395289, 2507091, 2539707, 2884121, 2529490, 2508394, 2602343, 2672435, 2828866, 2990931, 3368485, 3741443, 4416875, 5373893, 7744897, 11626783, 16587692, 27056843, 32893129, 21305699, 13723515, 9783469, 7050960, 5634179, 5080546, 4480537, 4251501, 3585866, 3521088, 2970037, 3301380, 3049302, 3066642, 2630278, 2713247, 2754056, 2775965, 2513774, 2387400, 2679796, 2407304, 2526190, 2160995, 2556894, 2182651, 2163767, 2320136, 2218882, 2291072]
13939B291072O1269l69808K858L46930q6989j28088j70300R8639p7891J83768
13929B151460p9946m7009m0365k03254K31408j77632J60461j87508r0723J85055
13919A901947K3639j8226k35454p4835K71201m3071P6471P5627k38900J12085
13909A850484j48899J60218J25084j503m10783L5291J87886l36834K83585j82458
13899A562071L76532l01772j11417L09860k89445j1754j13520M24071l21500p8786
13889A444340L00336j06942M4005j17647K1052l70217r539j39826M88832J47389
13879A701783l34623K4020J4864J42017k08928P6545P7129j49004M8073j82743
13869A209133J12866J20916O5225j23123l09216M68955p4231l93059J58006R4046
$$ y = [2291072, 2352341, 1982533, 1985391, 2332321, 2245332, 2117244, 1946944, 2045583, 1967692, 2151460, 2071514, 2024505, 1984140, 1780886, 2012294, 1834662, 1995123, 1807615, 1716892, 1901947, 1925586, 1907360, 1671906, 1597071, 1868272, 1825201, 1901672, 1977299, 1738399, 1850484, 1701585, 1861803, 1986887, 1985384, 1574601, 1609892, 1797778, 1460944, 1744529, 1562071, 1938603, 1636831, 1525414, 1835274, 1545829, 1534075, 1420555, 1844626, 1523126, 1444340, 1744676, 1637734, 1681739, 1564092, 1585144, 1214927, 1205388, 1065562, 1554394, 1701783, 1367160, 1391180, 1406044, 1548061, 1339133, 1415678, 1492807, 1343803, 1391876, 1209133, 1321999, 1442915, 1508140, 1385017, 1075801, 1544756, 1470525, 1077466, 1235472, 1329518]
13859A329518J74184k89112J1002j92063J47898N8996k67678N40094m05094O3340
13849A171085Q3028m9632J8281k98155M65687l85323K92486k95377L0144K63071
13839A295295l54074L14813r3143K98424n03986J74624j87425K90028n75916O67049
13829A325689D68477P66558q5240j16110M95132n75334K45245l59994M36923l69572
13819I06085K56797N4790j48590m08931M97324k12019j20755J67808J78625j99033
13809I72101p5185K57792j94525j13207N0229n985n2798r6709K05948o6044Q9520
13798I71137l37417L72569j25837j15562j64293O79956k00993O1046j27419n8977
13788I54210n9786L26939l53415j79055n6638K73786m09890O89377m13531J11103
$$ y = [1329518, 1503702, 1214590, 1225592, 1033529, 1181427, 1240423, 972745, 1512839, 1107745, 1171085, 1254113, 1204481, 1222762, 924607, 1390294, 1004971, 1297457, 1002080, 1032224, 1295295, 941221, 1256034, 1162891, 1461315, 957329, 1131953, 944528, 1234556, 658640, 1325689, 468477, 1235035, 1149795, 1033685, 1528817, 953483, 1198728, 838734, 1275657, 906085, 1162882, 1217672, 1069082, 660151, 1157475, 945456, 824701, 992509, 1171134, 972101, 896916, 1154708, 960183, 846976, 897205, 891220, 838422, 741713, 947661, 881617, 971137, 633720, 1006289, 880452, 764890, 600597, 1280553, 1079560, 1140606, 1013187, 954210, 894424, 1221363, 867948, 688893, 632255, 906041, 496151, 1185528, 771997, 883100]
13778H83100L9295n4734M3015j24130J05800k13021L1239J40539J23600j8415
13768I56288j61108M2116N9654k87753j42657L44385N9619j46814L44137l48564
13758G19303r2139J37111l65840N76167k47462J04186J2045K2630D17730K99081
13748G16811L02909k88365M9497j83660K29486K66124k01261l32165L02168C84194
13737G65519l33184K47331J96477N8334l31169K70045l26670J89782k5745J41318
13727H52038k07461m0023p2904K65524j50586K07507k31789p2500K74873q6304
13717G38375j70521K30463j21715J9198l9350J49143C82584J55128L35353l83804
13707D89261L50331l4835k91702k865J59149p1695p5246J33072k327N3650P5514
$$ y = [883100, 922395, 867661, 910676, 786546, 892346, 679325, 710564, 851103, 974703, 956288, 795180, 837296, 896950, 609197, 466540, 810925, 870544, 723730, 1067867, 719303, 627164, 764275, 398435, 974602, 727140, 831326, 843371, 866001, 417730, 716811, 1019720, 731355, 780852, 597192, 826678, 1092802, 891541, 559376, 861544, 384194, 765519, 432335, 679666, 876143, 934477, 603308, 873353, 546683, 736465, 710720, 852038, 644577, 604554, 531650, 797174, 646588, 854095, 622306, 549806, 824679, 738375, 567854, 798317, 676602, 695800, 656450, 805593, 382584, 537712, 873065, 489261, 839592, 804757, 513055, 510190, 669339, 597644, 522398, 655470, 653143, 706793, 782307]
13696G82307k39302k18679L92251M540k98388L53431j98891o8831M7327J17104
13686F72869j29978L53559l71478k11989K24544o5618K00679l6056B19339H9378
13675E43462A85902K31236r4389K72249n2549K7647P2956j25432L405N4415K38860
13664H14300M1150j94466r201j36916K6735o5788B15998O19510A37956O07116
13654G45072l14602O2278B14049L94536k17680M77509k68370k54740L13565k44654
13644D14215M14396k62199p964B60348K82747M6196P9657J9267B48431K44465
13634D92896j68136J68395O4982A04022M79685B77839o5426L82723R0869k66468
13624D19537K86094j23484B10811q6124N25318K2830n3558j25854o7712L3507
$$ y = [782307, 543005, 324326, 716577, 721117, 422729, 776160, 577269, 508438, 555765, 672869, 542891, 896450, 524972, 312983, 537527, 471909, 672588, 636532, 219339, 89378, 543462, 185902, 417138, 322749, 594998, 542449, 570096, 643052, 517620, 521025, 575440, 814300, 855450, 660984, 651783, 514867, 541602, 475814, 215998, 835508, 137956, 745072, 430470, 492748, 214049, 608585, 390905, 868414, 600044, 345304, 658869, 414215, 828611, 566412, 558448, 260348, 543095, 589291, 668948, 688215, 248431, 492896, 324760, 493155, 558137, 104022, 583707, 277839, 212413, 595136, 686005, 419537, 705631, 582147, 210811, 124687, 650005, 672835, 619277, 493423, 425711, 459218]
13614D59218c3194C31973K46365j32961A37399M85244k33829j43970L3189J65882
13604D43915P368G8652P98045D14136j86821M5404A22314N95448l25126j49201
13594B43435K77643M6378j63258Q6527j84707O1342J47473J28105n7850j91473
13584C93615J44272K1529J1472B36027M50034k44186k07499J7622K97525k28834
13574C20689L68194j07413k15609j29236m2891L38756j76788J78541B33894N800
13564B39694L59302A91942O41923I8500D0008N77524k29139j05659L32451j46130
13554D69055H2972K95904L0374a56470A56506P15621A59150J9772K17750A67055
13543A34656K85129j91353K8401m8280J44588P6302P7187J42400k09897A50526
$$ y = [459218, -33194, 331973, 578338, 445377, 137399, 622643, 388814, 244844, 278033, 443915, 451283, 78652, 876697, 414136, 227315, 272719, 122314, 717762, 392636, 243435, 521078, 567456, 404198, 490725, 306018, 367360, 514833, 642938, 585088, 393615, 537887, 559416, 570888, 236027, 686061, 441875, 234376, 251998, 549523, 320689, 688883, 581470, 365861, 236625, 193734, 532490, 355702, 534243, 233894, 239694, 598996, 191942, 833865, 98500, 40008, 617532, 388393, 282734, 615185, 469055, 82972, 378876, 409250, -156470, 156506, 872127, 159150, 178922, 396672, 167055, 134656, 419785, 228432, 256833, 208553, 353141, 429443, 506630, 649030, 439133, 150526]
13532B82997J45786K57552B85144J77276r9876L02418l12928n6766m5487L79641
13522F29422B71634K10526J46954n5164I5216O41764k46489B39891J61072A75884
13511E35677D7605J82073K46748k16088N2975J89716A30238N22332B12300L1190
13501B43490K77628N4863a03505l58337B75036J72907E0810M21185H8327J70682
13491B59009J17560j61647J46703j16309j02999M86047B63458A07103l4820f4752
13480i6775D94998n0193j26306H1705J20793J39157L32208C30623J0864p6981
13470B64506K63638A71353L28616k5149B08408k1691L9368K44181K7554q1928
13460D15892I7285R7696J51447J41393k31178Q3364j0247j14646J70783l2370
$$ y = [282997, 428783, 686335, 285144, 462420, 362544, 664962, 352034, 295268, 249781, 629422, 271634, 482160, 629114, 573950, 95216, 736980, 490491, 239891, 400963, 175884, 535677, 47605, 229678, 476426, 260338, 313313, 503029, 130238, 652570, 212300, 243490, 521118, 575981, -103505, -461842, 275036, 447943, 50810, 471995, 88327, 259009, 376569, 214922, 361625, 245316, 142317, 628364, 263458, 107103, 72283, -64752, -96775, 494998, 444805, 318499, 81705, 202498, 341655, 673863, 330623, 341487, 264506, 528144, 171353, 499969, 474820, 208408, 186717, 226085, 470266, 497820, 415892, 97285, 194981, 346428, 487821, 256643, 340007, 329760, 215114, 385897, 353527]
13450C53527G2577J95041m7691O4759O2826J77468P541k39633H7040K028L36782
13439D25850A97835k5192K81434C4114B481J01396R3879Q6676J05592q5741M4754
13428C49037L4888A87419J16659J85521P1898A20817K28675I4591K46440j06208
13418B34823B5683M53524j39143j05701K4116e2360D06932o7492o8357H8434Q939
13407I7373M56341A1811K88819k5460O2781q8022M2574J2685p784k517p7672Q3706
13395C00921A25796K25771l0302D4324K84333n7492j05543R332P2906J85847B00829
13383B54880j23754B5742R2965J50924A14126J6734O951p259R2851r1863k026
13372A29514D4073K97782A14282J19787j10774L50135a16116C2540K80654d3800
$$ y = [353527, 72577, 267618, 219927, 284686, 347512, 524980, 532521, 292888, 87040, 89068, 425850, 197835, 172643, 454077, 34114, 2481, 103877, 197756, 284432, 390024, 304283, 349037, 383925, 187419, 304078, 489599, 561497, 120817, 349492, 94591, 341031, 234823, 25683, 479207, 340064, 234363, 258479, -52360, 406932, 339440, 271083, 88434, 97373, 553714, 11811, 300630, 275170, 337951, 249929, 292503, 305188, 297404, 294887, 217215, 300921, 125796, 351567, 321265, 44324, 328657, 271165, 165622, 174954, 247860, 433707, 200829, 254880, 131126, 25742, 118707, 269631, 114126, 130860, 137811, 130552, 223403, 131540, 129514, 44073, 341855, 114282, 234069, 123295, 473430, -116116, 32540, 313194, -43800]
13361b66161A32573J6340M0852N26963A13847C082K07752L26544B47591E4036
13350F0497K40158j04641E7853M9587J94481L5096L567m8496J4540I6682K03514
13339C00196N1302E3033K42669j27750L4659L44512j60112L3467A10853K97709
13329D08562m2818e395E23021j61656A65144m5336L00994m6175Q6652N9827j81934
13318C39172A33940i3570D4543L67813A80911K9628J62562G1917J17359M8318
13308B37594r1303N1672J5546A4133J65115J23358J09364A50116B757K19806a01866
13296C00542a6979I2999R5920P0711A03961f6898B70068j08470o3641k2200c6512
13284D93931H5353L46555B07924o794l5479B8776J39857a41245B13092M2695e8323
$$ y = [-266161, 132573, 148913, 189765, 716728, 113847, 3082, 210834, 537378, 247591, 54036, 60497, 300655, 196014, 57853, 107440, 301921, 337017, 340584, 292088, 306628, 96682, 300196, 351498, 53033, 295702, 167952, 202611, 547123, 387011, 420478, 110853, 408562, 365744, -5395, 523021, 361365, 165144, 119808, 420802, 374627, 461279, 521106, 339172, 133940, -93570, 44543, 412356, 180911, 210539, 373101, 71917, 189276, 237594, 146291, 197963, 213509, 14133, 179248, 302606, 411970, 150116, 2757, 222563, -101866, 300542, -16979, 92999, 188919, 259630, 103961, -66898, 270068, 161598, 97957, 75757, -36512, 493931, 85353, 431908, 207924, 201130, 165651, 28776, 168633, -141245, 213092, 255787, -58323]
13272B06359l9635K70024e556C7528L02456Q7842j71807c2296B29931o6498a8759
13260A76979l8539o4744Q4344J8344o6894A8121J2124L44863j09569D4622a36471
13248C98805d2583A61863a22008B70493j17586o8812l2293J47094n2344G2321
13237A92311I460R6569J75356j09070r398J92139B0259P4147B2505J42992n3888
13226A11609J02404a6610g303B16593a71825J4993B12449g4004B27638D0257J7177
13215E7434J37937G8173a68003f0721A73852d3611D7453L51630A94788m6715C3345
13203A67153a04695K5129B72602r7340J88328C8423J54578P6544a97006K0846
13193a76160A82935D4155a37296I8168R488l3102P1364Q9747f6612A22296h376
$$ y = [206359, 166724, 436748, -5556, 37528, 339984, 427826, 256019, -32296, 229931, 163433, -18759, 176979, 138440, 73696, 158040, 176384, 109490, 18121, 30245, 375108, 265539, 44622, -136471, 398805, -42583, 161863, -122008, 270493, 152907, 84095, 51802, 198896, 146552, 72321, 192311, 9460, 106029, 281385, 172315, 162917, 355056, 20259, 94406, 22505, 165497, 111609, 214013, -16610, -7303, 216593, -171825, -156832, 212449, -74004, 227638, 40257, 57434, 195371, 78173, -168003, -60721, 173852, -43611, 47453, 399083, 194788, 148073, 33345, 167153, -104695, -79566, 272602, 175262, 363590, 38423, 193001, 269545, -197006, -176160, 182935, 44155, -137296, 98168, 107656, 74554, 145918, 235665, -66612, 122296, -8376]
13181a07419M2151D77981A45439c2807J1184D6330J47633I2045c16678d5798C33504
13169a5489A56320M0775H6220l7174a18763c5132A47174E2041J79199K38854A71294
13157b6030B08920A0696J22410m0456L35438A01467N5194a58169A14209K15195
13147C29404j17386d3702r2553A45268N2062D6481D524J84155b1068A98110a10393
13135A32236M33745A81378A9920K4227a62259H6231Q5726J64762C7911O0356J22840
13124B21107m0313h5470B32105l4853e7925B00187B0632K453d7490j53904A8314
13112A72206a39789G6033J05571Q6902B1514q300K5239M46771b6731B23829K4513
13101B48342b22982E9779R8340i8923B62093g5309o0089B62035e6634E57477k53972
$$ y = [-107419, -65268, 477981, 145439, -32807, -21623, 46330, 193963, 92045, -316678, -45798, 333504, -15489, 156320, 197095, 86220, 49046, -118763, -35132, 147174, 52041, 231240, 470094, 171294, -26030, 208920, 10696, 133106, 92650, 428088, 101467, 156661, -158169, 114209, 329404, 212018, -43702, -136255, 145268, 197330, 46481, 4524, 188679, -21068, 198110, -110393, 132236, 565981, 181378, 19920, 44147, -162259, 86231, 171957, 336719, 37911, 98267, 221107, 180794, -85470, 232105, 197252, -57925, 200187, 20632, 23085, -47490, -201394, 18314, 172206, -139789, 76033, 181604, 268506, 21514, 13214, 38453, 485224, -26731, 223829, 248342, -222982, 59779, 158119, -98923, 262093, -75309, -135398, 262035, -56634, 557477, 303505]
13090C03505a01164F19151k88389a25480M6760B91642j6130i0772A79322E5961
13079A19984N5296L4190p8700M5229l8760n7681j8791J95502B2455L2914J62084
13068B17453q7480P5809D7006J40493I696J22004K0862a10188r360B18845J52524
13057C71369b58892B4918d2205A89370q6064K6574l1939k0696k8022c68742A09778
13045c8403C2446f5351C46009c5831j92867A5411K58537E104L56903j67747K19896
13034D14156e8755B47741K6076a40919j5946I3296d1879a0521C42056D941J28495
13023A33436a42839A77402c107A62986B8697f732k16284A77222G9539A5849J25068
13012A40917g8897j72933A74330J18767j01614a77495f3501k94931B22408q6350
$$ y = [303505, -101164, 619151, 330762, -125480, -78720, 291642, 275512, -90772, 179322, 55961, 119984, 175280, 209470, 130770, 175999, 137239, 79558, 60767, 256269, 22455, 55369, 217453, 129973, 205782, 47006, 187499, 9696, 131700, 152562, -110188, -119548, 218845, 371369, -258892, 24918, -42205, 189370, 103306, 129880, 97941, 77245, 49223, -368742, 109778, -38403, 32446, -65351, 346009, -35831, -228698, 15411, 273948, 5104, 362007, 194260, 414156, -58755, 247741, 273817, -140919, -156865, 93296, -41879, -10521, 342056, 4941, 133436, -142839, 177402, -3107, 162986, 28697, -6732, -223016, 177222, 79539, 15849, 140917, -78897, -251830, 174330, 293097, 191483, -177495, -63501, -358432, 222408, 136058]
13002A36058B1975J04023E8517L4832I044J32392R8013B3032c9938n9014I8499
12990a1856A6190K98512a64772D8890K66151m4675q6002b33074C11089A7714M8659
12979F6373f4866G4069H586L440M9295a47963r06D3567K86526A5016c17175A42001
12966C8277c69080B37213o0076H2869J96602c9541a5976F1440a02136A87937f3256
12954a55043A03905J8622m4123L6039n7099a15588I8949c2519B47671j16117m0619
12943I0935b1013I9457a2181B80467A7799L8429q907g6684C1592h5148I6382a07219
12930g7287B74039a93508A85874q0500J03552h3113b233r6450M2322h963C81761
12918A61392B0297R6936B2249L200J45726h6075q5681K1093c5252j42541h2339
$$ y = [136058, 21975, 125998, 58517, 93349, 9044, 141436, 239449, 23032, -39938, -98952, 98499, -11856, 16190, 314702, -164772, 48890, 315041, 270366, 184364, -233074, 311089, 17714, 66373, -64866, 74069, 8586, 12026, 61321, -147963, -148869, 43567, 330093, 15016, -317175, 142001, 38277, -369080, 237213, 177137, 82869, 279471, -39541, -15976, 61440, -102136, 187937, -63256, -155043, 103905, 122527, 78404, 114443, 57344, -115588, 98949, -32519, 247671, 131554, 90935, -21013, 99457, -12181, 280467, 17799, 56228, 47321, -76684, 31592, -85148, 96382, -107219, -77287, 274039, -193508, 185874, 105374, 208926, -83113, -2233, -98683, -56361, -8963, 381761, 161392, 20297, 117233, 22249, 25449, 171175, -86075, -171756, -150663, -35252, -177793, -82339]
12906D12070a50769I8259K613b7949m9335A7364K05287F7009K32378b1488j50480
12895a71968a1541m0213j35740H8588M2717a04362m945A09368P0574E8087i93
12883A41289g3135k53255A01587A7291a38514B2635g5087E1232h0264B97830L2489
12872C30319j00131C4152g0374D9277M023P2009K0138a40400B6522a48233A55324
12860C7844D221L0843a46453M1611C94222j77595a46211N3810b1844D8483a89470
12848H1601K35375h087H0682J1435K22409B8542n692Q3828J02912e0402a6075
12836A06465j5053d1959A4178K32485a03022A0727M50161A1560a1607p3453p1064
12825a56124L9873l3932d956B36471a17447j02639A75854M0125I516J33795C2347
$$ y = [412070, -150769, 98259, 100872, -27949, -77284, 17364, 222651, 67009, 299387, -21488, -171968, -11541, -51754, -187494, 88588, 131305, -104362, -109307, 109368, 179942, 58087, -993, 141289, -73135, -326390, 101587, 17291, -138514, 22635, -75087, 51232, -80264, 297830, 330319, 230188, 34152, -70374, 49277, 53300, 125309, 145447, -140400, 26522, -148233, 155324, 37844, 4221, 35064, -146453, -104842, 394222, 216627, -146211, -92401, -21844, 48483, -189470, 81601, 316976, -8087, 80682, 92117, 314526, 28542, 22850, 106678, 209590, -50402, -16075, 106465, 91412, -41959, 14178, 246663, -103022, 10727, 460888, 11560, -11607, -85060, -156124, -116251, -150183, -4956, 236471, -117447, -220086, 175854, 215979, 9516, 143311, 32347]
12813a67241A38089p556j6075b20346A1665b72066A91671J85738j16986c07512
12802A43501C0831K56850A01069K69975j47605d2148j29757j6629A79432B3633
12791D02163e6219B49907I2520g8992B78539E2307O3516J25537c12338d9810C43578
12779a1024n874B12866F5236b19808B5768a54718d6161H5136a93686l3550A373
12767b6844J2136j88059b9457a3388A42585e0279G6112c274m3632A55890a07220
12755H0174O2898a04135C17719A46942c42779O3313a24757E1622A7497a11678
12744a74814B1004c42425g7408B2147I280b73325C46840a47023c5553k34964h8094
12732A47098c0294C7036b98337B32934c4561j7163B79149a4797o6466B560b49863
$$ y = [-167241, 138089, 130533, 114458, -220346, 11665, -272066, 191671, 377409, 260423, -307512, 143501, 30831, 287681, 101069, 371044, 223439, -42148, -171905, -188534, 179432, 23633, 402163, -56219, 249907, 92520, -78992, 278539, 52307, 115823, 241360, -312338, -49810, 343578, -11024, -16898, 212866, 65236, -219808, 25768, -154718, -46161, 85136, -193686, -227236, 1373, -26844, -14708, -202767, -29457, -13388, 142585, -50279, 76112, -3274, -46906, 155890, -107220, 80174, 143072, -104135, 317719, 146942, -342779, -279466, -124757, 51622, 17497, -111678, -174814, 21004, -342425, -77408, 22147, 9280, -273325, 346840, -147023, -35553, -270517, -88094, 147098, -30294, 37036, -298337, 232934, -34561, -51724, 279149, -14797, -81263, 2560, -249863]
12720C43292d23466G3135e6933b543o4754A857K8721f6757C79395F6960a40738
12708a7588B11259a10786e4406B16997J15760E0959K40173A05012K248a2662j70821
12697a83483A72664K31984g7292k49596f104Q59p5978A79732c6781p8110I8334
12685B29789a3299A35360M8734b04144B55830G9045a66091I5929J0943K00293
12675C07165b16944c5904A33691a18781H2792o064g8148j4463k65881J48704F7229
12663a28838G0060h0643a0845B42347L5883B8746a75997A30650c23368B71756
12652A16266n2202a32708H9577l7849Q0312D9037a92308A61641I293c564D7657
12640c0538B79899j33064F7871L52530D7836M4046P1741K18051A3315f8525p8302
$$ y = [343292, -423466, 73135, -56933, -2543, -67297, 1857, 30578, -66757, 379395, 66960, -140738, -17588, 211259, -110786, -54406, 216997, 332757, 50959, 291132, 105012, 107260, -12662, -183483, 172664, 404648, -77292, -326888, -6104, -5245, -81223, 179732, -36781, -114891, 98334, 229789, -13299, 135360, 184094, -204144, 255830, 79045, -166091, 95929, 106872, 307165, -216944, -35904, 133691, -118781, 82792, 76728, -78148, -92611, -358492, -209788, 67229, -128838, 70060, -80643, -10845, 242347, 278230, 28746, -175997, 130650, -323368, 271756, 116266, 64064, -132708, 89577, 51728, 132040, 49037, -192308, 161641, 9293, -3564, 47657, -30538, 279899, 146835, 67871, 420401, 47836, 91882, 163623, 381674, 13315, -68525, -146827]
12629a46827I2621a9667A3074B967d9374A73914a03334j4902B29713j12790h8487
12617B64872Q405A21359K65500A85209d6945B99529Q1414j81939a4566B30277
12606B41996j1428k955a536C71626a70786I1466o566g1473F0977J21615f1000
12594B2966b44629C60052g2947A33849a40667C2938e9766A03533K36609p5173
12584B64969m8313J53132D2008a40899D67219n4660b38444A7582g7648B98037
12573B54390a07805k87750b7720A74802l0330g1366D1935b86905A45165a00806
12562e9134A8752a0463B17348o9015m2247e1804B52498b68081i0778B34478q4300
12551A50178f09705a30175C04409n9706B5733i3086p6420j1659i0488j42428A7289
$$ y = [-146827, 92621, -19667, 13074, 2967, -49374, 173914, -103334, -118236, 229713, 116923, -88487, 264872, 273277, 121359, 386859, 185209, -46945, 299529, 380943, 199004, -14566, 230277, 241996, 230568, 227613, -1536, 371626, -170786, 91466, 84900, -71473, 60977, 182592, -61000, 22966, -244629, 360052, -72947, 133849, -140667, 32938, -59766, 103533, 340142, 264969, 216656, 369788, 42008, -140899, 467219, 412559, -238444, 17582, -77648, 298037, 254390, -107805, -395555, -27720, 174802, 144472, -71366, 41935, -286905, 145165, -100806, -59134, 18752, -10463, 217348, 148333, 106086, -51804, 252498, -268081, -90778, 234478, 150178, -609705, -130175, 304409, 244703, 25733, -93086, -169506, -181165, -90488, -232916, 17289]
12539a38866R249k4476b1458A53763c2019H8588b36016e2548A04381f8439H2932
12527A29324d7719A28439a08878B87913b78725a6971C54462A398a18006N0601
12517f7405j58834A70952d7848A76807F5375c1061H7365L4781a27986F2292O3516
12506A25808J00647a58926O3921a6502D0178d577B9686a13044K1940k1328r4695
12495b07127A4391J59950p6406k8018J05087H4318J84953a16796m4081D54371
12484c5308E1140b61260A0281K00200h434B37253f594k71242C8145f148B00062
12472g2075H1832i9068h010B20489G6461J8107J59040d75036A58799C8763L5373
12461G4136J52406I4089O9227k3399F5768a38234D5768J72366a09724E4785d6459
$$ y = [-138866, -129617, -154093, -21458, 153763, -32019, 88588, -236016, -52548, 104381, -68439, 82932, 129324, -47719, 128439, -108878, 287913, -278725, -16971, 354462, 1398, -118006, -67405, -226239, 170952, -47848, 176807, 65375, -31061, 87365, 122146, -127986, 62292, 125808, 226455, -158926, -95005, -16502, 40178, -4577, 29686, -113044, -91104, -112432, -207127, 14391, 174341, 97935, 69917, 175004, 84318, 269271, -116796, -160877, 454371, -35308, 51140, -261260, 10281, 210481, -8434, 237253, -6594, -277836, 38145, -6148, 200062, -72075, 81832, -99068, -8010, 220489, 76461, 94568, 253608, -475036, 158799, 38763, 74136, 226542, 94089, 163316, 139917, 65768, -138234, 45768, 218134, -109724, 54785, -46459]
12449A56771o7870Q6295b07882A04863f6809A27764i5194B31119h3082A29408
12438A99089f291D0921P0504f729j5841G2315c9274M845I3548a9265B11865I3526
12425A36272A8173J75260a34325E3189K19125A33119c66303c2806A08200c3475
12414A67133m9454a16632A69567c02789B36847c76879F784B450J81271J8022i1830
12402A07772b99694F9693b8630B44619K4684O2290I570b8316n3271G2735a19521
12390A40795c8634j28532A38438b7349a2114r4794L4883B01790r2333n3800K221
12379E7878P6030C6886m257K9564a49694J322K247P7e0909o9923a1069A55627
12366C40277A17977a9527k14635J1200P0256A29374L4519h7513D2473a50974A46556
$$ y = [156771, 88901, 175196, -207882, 104863, -66809, 127764, -95194, 231119, -83082, 129408, 199089, -6291, 40921, 111425, -6729, -22570, 72315, -39274, -34429, 93548, -19265, 211865, 93526, 136272, 18173, 193433, -134325, 53189, 272314, 133119, -366303, -32806, 108200, -33475, 167133, 117679, -116632, 169567, -302789, 236847, -376879, 6784, 2450, 183721, 201743, -91830, 107772, -299694, 69693, -28630, 244619, 269303, 331593, 9570, -28316, -81587, 72735, -119521, 140795, -38634, -167166, 138438, -27349, -12114, -106908, -72025, 201790, 109457, 55657, 57878, 133908, 36886, 32629, 62193, -149694, -148372, -146125, -146048, -50909, -120832, -11069, 155627, 340277, 117977, -19527, -234162, -222962, -152706, 129374, 163893, -87513, 42473, -150974, 146556]
12354a71662B29290J28933c9760k2517G294J51054B8353K74060a77042j38086
12344c15128a13478j29792c5272A53207b21776i1718B13621C3631K21157G3109
12333A93161b11769A83207a84956F3660O174a44026a1810C40985c48343i0867
12322a41769C3676J82783K5560b27265B48694m1461J0769F7319K23481n646b3986
12310C30057L9921f655j1708j33861H4087J4017b3378A84230J93674o3815A01943
12298B07456J8142M4667d7373A17455J13623Q2473m1432j31837f0194B1994i8940
12286B12042D9349a54243B99359I9330H132b44722B21643k3453k410a56384f1678
12274A4525J68291a16786q6397A2707a92198A72678a10821n852J7720H6500B5673
$$ y = [-171662, 229290, 358223, -39760, -62277, 7294, 158348, 28353, 302413, -177042, -315128, -113478, -243270, -35272, 153207, -221776, -91718, 213621, 33631, 254788, 73109, 193161, -211769, 183207, -184956, 63660, 69834, -144026, -11810, 340985, -348343, -90867, -141769, 33676, 216459, 242019, -227265, 248694, 207233, 218002, 67319, 290800, 285154, -23986, 330057, 369978, -6655, -18363, -152224, 84087, 98104, -23378, 184230, 377904, 314089, 101943, 207456, 225598, 270265, -47373, 117455, 231078, 313551, 272119, 140282, -60194, 21994, -98940, 212042, 49349, -154243, 299359, 99330, 8132, -244722, 221643, 198190, 195780, -156384, -61678, 14525, 182816, -116786, -203183, 12707, -192198, 172678, -110821, -116673, -98953, 86500, 25673]
12262C14145g982A92018a43858A39776a90413j8458B46731A4797J19094J16708
12252B50599F3709A8894J27632a8015j38133B61481d415A85014c47658h7764A0930
12240d7498k65491g8993l2122A12874m6918K17052p8437h1737B88889b44501C27601
12228A73187J82784j74826D0366c0908A16568J29006H2084a69983c7266j8319
12218e5585B57313i5564d2305A58643a3876f457A56786b85471B13275J76899C7498
12206B95923n1656J41858C0886c6106A57119K28177j62063j00156K0741K25326
12196C69144o0706a1891B69599n5342a05699B38191k8719b97413H7711J92840
12186B80551q3956J23363B3948R6679d0527E7411J21645K23451K1678J37766A4161
$$ y = [314145, -7982, 192018, -143858, 139776, -190413, -208871, 246731, 14797, 133891, 250599, 63709, 18894, 146526, -18015, -156148, 261481, -4415, 185014, -347658, -87764, 10930, -47498, -312989, -78993, -111115, 112874, 65956, 283008, 204571, -81737, 288889, -244501, 327601, 173187, 355971, 181145, 40366, -30908, 116568, 245574, 82084, -169983, -37266, -55585, 257313, -95564, -42305, 158643, -13876, -6457, 156786, -285471, 213275, 390174, 37498, 295923, 244267, 386125, 30886, -36106, 157119, 385296, 223233, 123077, 143818, 369144, 308438, -11891, 269599, 214257, -105699, 238191, 209472, -297413, 87711, 280551, 196595, 319958, 23948, 120627, -40527, 57411, 179056, 402507, 424185, 561951, 14161]
12174C56680o3303a21081B17732K25906m025j12713J22243o9120j22303A24962
12163h9552C49172j19378M7920a80714C50203h5863G9478J27334O1014o2237J96344
12152D01933f5262I8533b65257A3087R3807J91536j15108L3101J8943L06495b32459
12140B51002A3016L3387b29658E3368b9728p6732A70537o9404J03998a38248B76005
12128I6906J2223Q4099r4118c4986B41736K8217I8934J13961C1606L8088R1897
12117A61591L3174J01364j257J8215A45440a60040B99584j32884J8748O5808p6599
12106A74657O0135h7980D64577a06581A77981o6921n1767K30820h655q7314R014
12095h6955A69495D2276r090K44030C2231J8923b48481A06405f5006B18236J11224
$$ y = [356680, 293377, -121081, 217732, 443638, 439613, 326900, 449143, 380023, 257720, 124962, -89552, 349172, 229794, 277714, -180714, 350203, -85863, 79478, 206812, 267826, 205589, 401933, -65262, 98533, -265257, 13087, 106894, 298430, 183322, 216423, 235366, 541861, -232459, 251002, 13016, 46403, -229658, 53368, -29728, -106460, 170537, 101133, 205131, -138248, 276005, 96906, 109129, 193228, 99110, -34986, 241736, 269953, 98934, 212895, 31606, 69694, 161591, 194765, 296129, 294872, 313087, 145440, -160040, 299584, 166700, 185448, 251256, 174657, 234792, -87980, 464577, -106581, 177981, 111060, 59293, 290113, -8655, -95969, -86955, 169495, 42276, 33186, 277216, 32231, 51154, -248481, 106405, -65006, 218236, 329460]
12084C29460c22972F0075L25877j5367b207A97932g7940j92107E2742P3125k491
12073A23376B699J45330E9972c3087C11449A39185N4530O487a66938A9239c18639
12061E8274d2047r6941A49623k9472C7560k346a11085A28190n3400C2894a07735
12049G1933c1534j72104B74163q2624B8008a27491c390q6271H2125e2208A3790
12037A22828F0170K4211g7812q338A15187b11060g9653E6904a39022a2574n4133
12026f6707A56209a98959B47109a48219A99322b43865i727q7766k17961B1692
12015A34568b44289B37528C1655C139g6490J6124A18113K08973H606j967L24389
12004C31028I48a47582d961A1415b5456p9720I5473i485A71950i464A90753D0569
$$ y = [329460, -322972, 60075, 385952, 370585, -2207, 197932, -77940, -270047, 52742, 125867, 123376, 2699, 148029, 59972, -33087, 311449, 139185, 193715, 200202, -166938, 19239, -318639, 58274, -42047, -138988, 149623, 120151, 37560, 35214, -111085, 128190, 74790, 32894, -107735, 71933, -31534, -203638, 274163, 191539, 28008, -127491, -3390, -89661, 82125, -52208, 13790, 122828, 60170, 84381, -77812, -86150, 115187, -211060, -79653, 56904, -139022, -12574, -66707, 156209, -198959, 247109, -148219, 199322, -243865, -9727, -97493, -315454, 21692, 134568, -244289, 237528, 31655, 3139, -76490, -60366, 118113, 327086, 8606, 6639, 331028, 948, -147582, -4961, 11415, -25456, -105176, 95473, -9485, 171950, -9464, 190753, 40569]
11991b35275h3159H4349a80094C1940O0903K14356b13741J02042A63929f8853
11980E7773J36498b89718A6919b33297O2080e5912m4252H4301b16998B0682a22817
11968e1763q1419B5087M967a44880A00730a73462p7040B09461E8661a89721q8744
11957b78465A04041a68502j7617B71764E569b33436C5967R8679a54871B92833
11946G6006j5760a00301j1067G2374b13697A25023a26403A07128J01075f1100
11935A70268c19022a32537d9362k12481A47825F6528i1145q3504A04082q77j8429
11924H4776g8437A35694c5186r6953E0320c956l05280B91755b25146G9890a81649
11912i5719k79173b4566j0712p0831B9021J37543C8125L1376R8765g6673j56066
$$ y = [-235275, -83159, 84349, -180094, 31940, 92843, 307199, -213741, -111699, 163929, -68853, 57773, 194271, -289718, 16919, -233297, -171217, -55912, -100164, 84301, -216998, 20682, -122817, -51763, -133182, 25087, 30054, -144880, 100730, -173462, -250502, 209461, 58661, -189721, -278465, 104041, -168502, -186119, 271764, 5569, -233436, 35967, 134646, -154871, 292833, 76006, 60246, -100301, -111368, 72374, -213697, 125023, -126403, 107128, 208203, -61100, 170268, -319022, -132537, -49362, -261843, 147825, 66528, -91145, -174649, 104082, 103205, 84776, -78437, 135694, -35186, -132139, 50320, -3956, -309236, 291755, -225146, 79890, -181649, -95719, -374892, -24566, -35278, -106109, 29021, 166564, 38125, 69501, 168266, -76673, -232739]
11901b32739m2628A16042b35510Q323A92230q7584d2228m4452q5097A87631a07456
11889I6890a37792A18075B3242J09490A9441a16784r7232D2384M2718b31395P3499
11878a57896h564j1969k43762J01807N0943B6283b26753j3978B21349d18383a67527
11866a0932j11570P397A00627A4138O948a57458p3238I2020c57850A96722D1679
11854h9641B12479b62423J25591M6079C73068a49001r8580C32351r6690c25223
11843b22479D0935j9897a75847A00839M723a81972b9435o0937A7512b0132k40185
11832b60317e9784A01200a60680A41443R9963a29316K7601B90926d5946j53128
11822a99074B8494i1593M1234k70716a8630B24021a67838k07000B9733J50817
$$ y = [-232739, -275367, 116042, -235510, -227187, 192230, 104646, -42228, -86680, -171777, 187631, -107456, 96890, -137792, 118075, 23242, 132732, 19441, -116784, -214016, 42384, 85102, -231395, -157896, -8564, -20533, -264295, -162488, -111545, 26283, -226753, -240731, 221349, -418383, -167527, -10932, -122502, -115105, 100627, 14138, 21086, -157458, -230696, 92020, -357850, 196722, 41679, -89641, 212479, -262423, -136832, -90753, 373068, -149001, -247581, 332351, 235661, -325223, -222479, 40935, 21038, -175847, 100839, 105562, -181972, -29435, -90372, 17512, -20132, -260317, -59784, 101200, -160680, 141443, 241406, -129316, -101715, 290926, -45946, -199074, 28494, -91593, -50359, -321075, -18630, 224021, -167838, -374838, 29733, 180550]
11812A80550P2892l9439a23435I9955g5095N63r0421o0375A9850c49478b1461
11800a02077J0077K498b3141A05221J50183c714n05896A02262A3539b53790A91295
11788C55609a34156A51216b63469R7882G113O4847b34801R7816o2057h9144D3302
11776a21077m23994D6655b219A1619h67A31934b34132G0686B8008a5052B41203
11764H7193C7562b26197J6454L3312o5936i7636B189L91250j93861a93654h7969
11752a62340B17768r6554B8179b93864B9194d9700r494m1832k4697I4481A1182
11740D0085a00543k5861M3186A78450b138o0042l91443I1093a36041I341b38415
11728A9980g3036r3678F3950B1516a89512c5807H8864a00972C60848b8023B4312
$$ y = [180550, 253442, 214003, -123435, 99955, -75095, -74532, -164953, -225328, 19850, -349478, -21461, -102077, -92000, -89502, -23141, 105221, 255404, -3714, -509610, 102262, 13539, -253790, 191295, 355609, -134156, 151216, -263469, -165587, 7113, 71960, -234801, -136985, -199042, -89144, 43302, -121077, -545071, 46655, -2219, 11619, -867, 131934, -234132, 70686, 28008, -15052, 241203, 87193, 37562, -226197, -209743, -176431, -242367, -97636, 2189, 393439, 199578, -193654, -87969, -162340, 217768, 121214, 28179, -293864, 29194, -49700, -59194, -101026, -125723, 94481, 11182, 40085, -100543, -126404, -83218, 178450, -2138, -62180, -453623, 91093, -136041, 9341, -238415, 19980, -73036, -166714, 63950, 21516, -189512, -35807, 88864, -100972, 360848, -28023, 24312]
11716A46242O7122i8366A94790h7208l9245B25725E1428d8844A09179E656N253
11705A0909J69295b47605h3044K1785n87j0673j81216a5649j96882G2969J11246
11694A84215a37967J44b4223A90252B5691L6706h1342j3107j70162D9981i8193
11682B9118J05704a31111G1092b68335A6749a0267j14976j70541a01505C8329
11671c69853a16146r658M8928A24997a16585B51434l7859a68320H1138c90292
11660A31993b13930a04270B97016b22214A52528c40913a2804j69816F9044c8105
11649b25064B3631b31630A7427b11093A60294J60664a18940j877L2504k2169j74883
11638b85365R1304C66010b27604r9639o3766i0591A92905K6491C2801f2964k22944
$$ y = [146242, 213364, -98366, 194790, -87208, -126453, 225725, 51428, -48844, 109179, 5656, 10909, 180204, -247605, -83044, -61259, -61846, -72519, -253735, -15649, -212531, 72969, 184215, -137967, -137823, -24223, 190252, 25691, 62397, -81342, -94449, -264611, 49981, -98193, 29118, 134822, -131111, 71092, -268335, 16749, -10267, -125243, -295784, -101505, 38329, -369853, -116146, -125804, -76876, 124997, -116585, 251434, 213575, -168320, 81138, -390292, 131993, -213930, -104270, 297016, -222214, 152528, -340913, -12804, -182620, 69044, -38105, -225064, 23631, -231630, 17427, -211093, 160294, 320958, -118940, -120817, -88313, -110482, -285365, -194061, 366010, -227604, -327243, -391009, -90591, 192905, 219396, 32801, -62964, -285908]
11627b85908a3841j47042F4909O8746c5952G703K48906A17723J12000b68786j15228
11616c84014A39169o6387J77387J5578A686b4687q7569j08924i8264D7078a97097
11604a99550d7715E1806e2355k42935l535a11924E0314a18529j0800L5213m6333
11593a40449j02496Q9218k40004J82421A12878e4537b0971j40063o3690j56278
11583c81002f3908k96893R6644E0183A9299c7424l13761B87922f5998a2926A70060
11571h9846a4329j55063B01601b7869A25213a65569F094J87269h4663A86032a65770
11559C0907L5757a9374j08058F5140c6236j36422a4854A91812a43347k21362G7688
11547I6314a17222E8748k8297f6387A1968a13481M4789L0786k6918B87128j3919
$$ y = [-285908, -13841, -160883, 64909, 133655, -35952, 7703, 256609, 117723, 229723, -268786, -384014, 139169, 72782, 250169, 265747, 1686, -24687, -112256, -221180, -98264, 47078, -197097, -199550, -47715, 51806, -52355, -295290, -298825, -111924, 50314, -118529, -129329, -94116, -140449, -242945, -153727, -393731, -211310, 112878, -54537, -20971, -161034, -224724, -381002, -63908, -360801, -264157, 50183, 19299, -37424, -351185, 287922, -65998, -12926, 170060, -89846, -14329, -169392, 201601, -27869, 125213, -165569, 6094, 193363, -84663, 186032, -165770, 30907, 66664, -19374, -127432, 65140, -36236, -172658, -14854, 191812, -143347, -364709, 77688, 96314, -117222, 58748, 30451, -66387, 11968, -113481, -68692, -37906, -64824, 287128, 273209]
11536B73209E5030B5795I104J52149j9578F4700a31345d2012G2573i5062p788
11525a02850A805K2144d78170D8176J69103b15636G3177h7124C90916c6589B3878
11513C61273A1861g3433b5272j30658A23545M8017a3168A08358i3774M0922A04854
11501A54409b4244j45813B49040g9595E0233J63938D6991g2763K7333l2522H2296
11489a31757A54474o1375N6235R0963C3650L3604N6996h0801H3148m0901J50035
11478A92282r1277g1787D25200l4557j52055R7485r1799j16884C9766a57645C37200
11466A04967J83780a00530b182A78580o2542P4632D3826K24715f8865a1928o0739
11455g2667G3211J27732m5695J84282j68452e5624C16423j54183G837J1184a26540
$$ y = [273209, 55030, 25795, 9104, 161253, 141675, 64700, -131345, -42012, 72573, -95062, -102850, 1805, 23949, -478170, 48176, 217279, -215636, 73177, -87124, 390916, -36589, 23878, 361273, 11861, -73433, -25272, -155930, 123545, 171562, -13168, 108358, -93774, -52852, 104854, 154409, -24244, -170057, 249040, -79595, 50233, 214171, 46991, -72763, -45430, -77952, 82296, -131757, 154474, 93099, 149334, 240297, 33650, 67254, 124250, -80801, 83148, 42247, 192282, 101005, -71787, 425200, 390643, 238588, 336073, 244274, 127390, 39766, -157645, 337200, 104967, 288747, -100530, -2182, 178580, 116038, 190670, 43826, 268541, -68865, -11928, -72667, 73211, 200943, 155248, 339530, 171078, -55624, 316423, 162240, 7837, 19021, -126540]
11443A92389P400R4965P3018A72833B4635d472j08118q0201F6784N2984f9060
11431B99754I6892M06721H0647A8739K24671h1414n8747B14297j993c0828C37233
11419h13o8049a1282F010c83905f9422n5104A07043a34176G7171c5861F1565J0612
11407G2177d3865A02923m9454a61171B09994f3802o1676N0406C2440L3333L12352
11396C78125a32631K2408j06486C12043a21604C19252i1985p8176j1057A18503
11385a87702h9823B0813N8449d52446A67198E703a20889I3430a85863f0018j61310
11374b21328K6762j16044a30659A03214m0385g7823r162k6129A8750a51137B97292
11362I6420d26412a338A38659b70143B4173c2310k47693I5679a34114j62916A86523
$$ y = [192389, 199789, 294754, 367772, 172833, 24635, -4472, -112590, -192791, 66784, 119768, -69060, 299754, 96892, 503613, 80647, 18739, 243410, -81414, -140161, 214297, 212304, -30828, 337233, -813, -68862, -11282, 6010, -383905, -69422, -124526, 107043, -134176, 77171, -35861, 61565, 72177, -43865, 102923, 53469, -161171, 209994, -63802, -125478, -75072, 32440, 65773, 378125, -132631, -110223, -216709, 312043, -121604, 319252, -91985, -170161, -181218, 118503, -187702, -89823, 20813, 79262, -452446, 167198, 5703, -120889, 93430, -185863, -60018, -221328, -194566, -310610, -130659, 103214, 62829, -77823, -86985, -113114, 18750, -151137, 297292, 96420, -426412, -1338, 138659, -270143, 24173, -32310, -280003, 95679, -134114, -297030, 186523]
11350a26986A14360J1078h5322c4027p611A85895A4399c2776B38933E890b15631
11338A8709p338c27475a26919l24625a68191P3551A54235d5917k71997a00755
11327d2261J0601l51522O9646A06497j7450k1864b90869a22610c2375A31404i1794
11315A37679a67735j4126C35203B4356a10952D19254b83900E4460J021d2381j04943
11304a47324j52826A19783n8346a21018e4500j75818L9559q2820A18772f61A02173
11292D6911L9136e4140B14811a95307c3173j63838k6405D9085a05287b0158B70112
11280i1634k7075A21309e791F7318a0678l775J817j75218d1318A25011l4889K41412
11268C31534b60069K8199i9019F5551d14048i835J184l6952j59029b987C722b979
$$ y = [-126986, 114360, 125438, -85322, -34027, -41638, 185895, 14399, -32776, 238933, 5890, -215631, 18709, 11371, -327475, -126919, -451544, -168191, -94640, 154235, -45917, -317914, -100755, -42261, -31660, -383182, -313536, 106497, 89047, 67183, -290869, -122610, -32375, 131404, -91794, 137679, -167735, -181861, 335203, 24356, -110952, 419254, -283900, 54460, 55481, -42381, -147324, -300150, 119783, 61437, -121018, -54500, -230318, -190759, -273579, 118772, -661, 102173, 46911, 86047, -54140, 214811, -195307, -33173, -197011, -223416, 49085, -105287, -20158, 270112, -91634, -118709, 121309, -5791, 67318, -10678, -14453, -12636, -187854, -41318, 125011, 90122, 331534, -260069, -231870, -99019, 65551, -414048, -9835, -8651, -45603, -204632, -2987, 3722, -2979]
11255b79179e2769j89658O5794O2385A17514l9252a8795B46721b66015b6843j70425
11244a97268C68582a46144A00576a08128K5957j54385b9214k16695C02988a60192
11233i3748i184H6978l9121b22663L1784k16267a83082f3322j55705A47652L123
11222A50775K0215b43083g5568n9808C53980A25421a30631B02304a45350e7573
11211i9856k36716A35348b92177P7384A09249a52596B3836c46753J25436B49505
11200E4586J32358p6460f6273A48735b842I9126C834c24940j66391b41373B10972
11188b40864A12441B0299c29692J34535l02637B05097j1629a06910j65518f1378
11177a54852j06817N9414d047j82956C4974A3253a83162j00586a40396r4196f1042
$$ y = [-279179, -52769, -242427, -176633, -114248, 117514, 78262, -18795, 246721, -266015, -26843, -197268, 368582, -146144, 100576, -108128, -82171, -236556, -29214, -245909, 302988, -160192, -93748, -9184, 86978, 47857, -222663, -190879, -407146, -183082, -63322, -219027, 147652, 150775, 170990, -243083, -75568, -135376, 353980, 125421, -130631, 202304, -145350, -57573, -99856, -336572, 135348, -292177, -214793, 109249, -152596, 23836, -346753, -221317, 249505, 54586, 186944, 110484, -66273, 148735, -2842, 99126, 3834, -324940, -491331, -241373, 210972, -240864, 112441, 20299, -329692, -195157, -497794, 205097, 193468, -106910, -272428, -61378, -154852, -261669, -202255, -4047, -187003, 34974, 13253, -183162, -283748, -140396, -234592, -61042]
11165b28568j74628J00643k1011A01819N6987b11153Q7403L5752A07628a04071
11154b91207B20361e56145b3242j42398H2429a26425k92479h7028B16698H7821
11143a4337j16118c00A1006h8758E8161d1256l77788b9631a53j91505G3399O4174
11131A37573c05579A32387b38936B26616j07959f3234j00359A31841P1781n9211
11121A44411b24819L1043e4389B43387a60920j91168A58815f7510B26259J6493
11111B42752a65327A11393c67413B27145G6039k2709a01793j1427L0908k333d492
11099A51094c9195I9622d16329a50339r5546M8388L2841K1178D3140J3046K1416
11088G7602K00869b36601a4940D827L4919M0446J10583q6519m2139a35233G1639
$$ y = [-228568, -403196, -302553, -323564, 101819, 158806, -211153, -123750, -87998, 107628, -104071, -291207, 220361, -556145, -23242, -165640, 82429, -126425, -418904, -87028, 216698, 87821, -14337, -130455, -300, 11006, -88758, 58161, -41256, -419044, -29631, -153, -191658, 73399, 137573, -305579, 132387, -238936, 226616, 118657, -63234, -163593, 131841, 203622, 144411, -224819, -193776, -54389, 243387, -160920, -352088, 158815, -67510, 226259, 242752, -165327, 111393, -367413, 227145, 76039, 53330, -101793, -113220, -82312, -84645, -4492, 151094, -39195, 99622, -416329, -150339, -245885, -197497, -164656, -143478, 43140, 56186, 77602, 278471, -236601, -14940, 4827, 39746, 80192, 190775, 104256, 62117, -135233, 71639]
11076B11067p1378k7450Q7981K60449e3762A86523N6679j06309Q4941N4565n0592
11065B25807p9171J07033j04530m3910K62552j16200j25201M2579J15071A30574
11054D31059I7056K69810O1546j37172K35509A62536Q0948K84805j82658j66851
11044A78780K42615j87821J79360j23334O9590K18742r021k69217L08464J45792
11034G53950r7942j55785M44633m7361l02189O5805o0426L77718j68630k40314
11024E69459m844J9555L9937J35501p3634J06513J68649k57225O2505j69034L69701
11013I67083k72229j62402J92413n5709J40946j17592j91580P7904j7147J84280
11003G45967R7853j13371k10855o1252M3031J10609J10241K3914j58827J92735
$$ y = [211067, 139689, 112239, 200220, 460669, -53762, 186523, 243202, 136893, 221834, 276399, 225807, 146636, 253669, 149139, 105229, 367781, 251581, 126380, 168959, 284030, 130574, 431059, 97056, 366866, 428412, 291240, 526749, 162536, 243484, 528289, 345631, 178780, 421395, 233574, 412934, 289600, 359190, 577932, 568911, 299694, 608158, 753950, 656008, 500223, 944856, 897495, 595306, 661111, 600685, 978403, 809773, 569459, 564615, 584170, 624107, 759608, 685974, 792487, 961136, 703911, 766416, 597382, 967083, 694854, 532452, 724865, 669156, 810102, 692510, 500930, 578834, 561687, 745967, 843820, 730449, 519594, 458342, 501373, 611982, 722223, 746137, 587310, 780045]
10993G80045j29032o4684J41088J35595l49000j140J35251M1809k17942j29945
10983C42045L43235J07753k20594J05676L09826B56417M87221q9307J51154A99496
10972F71601J04927K74631l51354l00922L60246j95730J55676R4078J96869J44762
10962A154784n2360K99377o6505q217L11858K05645K00418N9256J50629M79049
10952B733934q0398L9678J39718p7156l80186k88339k87740k45226l70300k17313
10942I66672k01674L37777l14346l3174j19213n7394P9227k19802M865A40797
10931C66111j284j5994R7287a48103D76082a0465H5986m995e141j689G0892L9410
10919A10302L93532a2795F7439J54324E0724a15815a7548E9603o488K13415G2982
$$ y = [780045, 651013, 586329, 727417, 863012, 514012, 512872, 648123, 689932, 471990, 342045, 685280, 793033, 572439, 678115, 987941, 256417, 743638, 654331, 805485, 199496, 671601, 776528, 1051159, 699805, 398883, 759129, 563399, 719075, 813153, 1010022, 1154784, 1102424, 1401801, 1335296, 1327079, 1638937, 1844582, 2045000, 2104256, 2254885, 2733934, 2653536, 2693214, 2832932, 2755776, 2375590, 2087251, 1799511, 1554285, 1183985, 966672, 764998, 1102775, 788429, 755255, 636042, 578648, 657875, 438073, 442938, 140797, 366111, 364827, 348833, 446120, -148103, 476082, -10465, 85986, 80991, -5141, -6830, 70892, 110302, 503834, -12795, 67439, 221763, 50724, -115815, -17548, 59603, 53115, 266530, 72982]
10907a5585l31840F8125Q005a28690e7908A85045k1844m02D536R1926a953n0380
10895e2333k04472H6868J24142a83812M6410A84644q0463b44361m4389h2030l1785
10884a13815B7808J58241B17a95685B16645a14959a7427k91212c3890o6712L0786
10873f9816I056J1022h7416l3965q0288A3657f4485b948j47561j41931k32878
10862e25318b6621A88721M4246b63511h776F8196b46262E8161P6869c1459A48791
10850A65390p8130b02397C1920K74844b54536c9094r9473B09368d723l2912n1584
10839h9219B71077A0149M1434J10365E3182b1126q3862A16766k5411a11325j15165
10828b26490b1553k31670p2551J04717c6135H7879c39610J41104g4009k04292
$$ y = [-15585, -347425, 68125, 76130, -128690, -57908, 185045, 163201, 162799, 4536, 96462, -1953, -52333, -256805, 86868, 211010, -183812, -137402, 184644, 104181, -244361, -288750, -82030, -113815, 27808, 186049, 217, -195685, 216645, -114959, -17427, -308639, -33890, -100602, -69816, 9056, 20078, -87416, -121381, -201669, 13657, -64485, -2948, -150509, -292440, -525318, -26621, 188721, 232967, -263511, -8776, 68196, -246262, 58161, 135030, -31459, 148791, 165390, 87260, -202397, 31920, 306764, -254536, -39094, -138567, 209368, -4723, -37635, -89219, 271077, 10149, 51583, 161948, 53182, -21126, -104988, 116766, 91355, -111325, -226490, -21553, -253223, -325774, -221057, -36135, 87879, -339610, -198506, -74009, -278301]
10818b78301B02156N0992N3395A31778g5291l8193k69688C07938b4930H7766i9198
10806G9503K8444D2879J22889l2231B3010a42974A350J8970O3258l3595K03958
10795B53941f3640a4958k23566F9961B435b4802A80975a66160D4855f6860B3520
10783A12352e38k7170m0117C24431a5956j3732A1247a11322J0732o4011M6196
10772a18405e0170r1256A53118E4547M8326R0857a7542B63h9352G6421a53762
10760I5182q226a67135H173b70171J28198A4614P8082f5079L074B16737a56123
10748b65452E0916A9477K645a89051q4224J19577j08756a9215p4791M2375j5822
10737f7453a7430A8351Q4880J05043i9741M373I9751J38756q9582o5499e3037
$$ y = [-278301, 202156, 253148, 306543, 131778, -75291, -113484, -383172, 307938, -24930, 87766, -99198, 79503, 107947, 42879, 165768, 133537, 23010, -142974, 1350, 20320, 83578, 49983, 253941, -63640, -14958, -238524, 69961, 2435, -24802, 180975, -166160, 44855, -66860, 23520, 112352, -538, -27708, -67825, 324431, -15956, -29688, 11247, -111322, -100590, -164601, -118405, -50170, -141426, 153118, 54547, 102873, 193730, -17542, 263, -89352, 76421, -153762, 95182, 86956, -167135, 8173, -270171, -141973, 14614, 92696, -65079, -62005, 216737, -156123, -265452, 50916, 19477, 22122, -189051, -273275, -153698, -262454, -19215, -94006, -51631, -67453, -17430, 18351, 103231, 208274, -99741, -95368, 99751, 238507, 148925, 83426, -53037]
10725b3101j14736q8308k03227J60987a2813A61524c9460J8074k21086j00638
10715c43110Q5292J15567F9947h4037c6436J5418B635M3645b59836P9549e1802
10703c09040a18680M0448j4584M0895B48657a64331B10747m6665F543Q0380g1195
10691A4425K22198D5461A2829a31788d4109p2340A24661D9387b10089A76910e4773
10679B7243b20738B41744c8143l26142h1941o2785j72081b9960m0892p2261m4713
10668a87826A24305D283i8196m8870A16674a19981m4448A14779d3842A22635a78553
10656a52473j518a1160j50861D7688R5514c9864o1670d5767j71389o2254Q9880
10645a89530m0053f9418I6951a90220J7438E6606c73580J67288P3563A90484c46241
$$ y = [-23101, -137837, -226145, -429372, -268385, -12813, 161524, -39460, -21386, -242472, -343110, -257818, -142251, 69947, -84037, -36436, -21018, 2635, 46280, -259836, -180287, -51802, -309040, -118680, -78232, -92816, -51921, 248657, -164331, 210747, 164082, 6543, 86923, -71195, 14425, 236623, 45461, 12829, -131788, -44109, -116449, 124661, 49387, -210089, 176910, -54773, 27243, -220738, 241744, -38143, -364285, -81941, -144726, -316807, -29960, -70852, -143113, -187826, 124305, 4283, -98196, -147066, 116674, -119981, -164429, 114779, -43842, 122635, -178553, -152473, -153991, -11160, -162021, 47688, 143202, -39864, -101534, -45767, -217156, -279410, -189530, -229583, -69418, 96951, -190220, -172782, 56606, -373580, -206292, -132729, 190484, -346241]
10633g1979G6368N7197i9731H888R8125b1829B4511R7098i0293a8539j35678p2582
10621b26799I1653a39993e7369p9940n8947j78188a73590g4271H0209e3305m13630
10610d66935F7619d2636A96403B1016b73749l713C2286J16040a16441L3539j14491
10599a97393A34323a75999k57420G5014g7287k15553D633K14213r0013a67166
10588E907d4545B00095J26651b9628B32996j09473c0145j93983O4687C13288a365
10576B06547F7794b73572A52519a37883G8919e6213p9929J727A30021a12517A35150
10564e6183k05343B1472e5851G9421b19695l5992J6648C01941a44037M7098k5310
10553a22249B43874G1265C0141g2347k7432o415k02095H1210a29561o5901J4788
$$ y = [-71979, 76368, 133565, -99731, 8888, 107013, -21829, 24511, 121609, -90293, -18539, -154217, -226799, 91653, -139993, -57369, -137309, -196256, -374444, -173590, -74271, 80209, -53305, -466935, 67619, -42636, 196403, 21016, -273749, -277462, 32286, 148326, -116441, -82902, -197393, 134323, -175999, -433419, 75014, -77287, -292840, 4633, 218846, 128833, -167166, 5907, -44545, 200095, 326746, -29628, 232996, 123523, -30145, -224128, -159441, 313288, -1365, 206547, 67794, -273572, 152519, -137883, 78919, -56213, -136142, -134415, 130021, -112517, 135150, -56183, -261526, 21472, -55851, 79421, -219695, -255687, -239039, 301941, -144037, -96939, -122249, 243874, 71265, 30141, -72347, -99779, -106194, -308289, 81210, -129561, -195462, -180674]
10542a80674J878E2407h3162A28887b11179f7366j6323p7123l3519A72684D8783
10530i6972A03841a34906K2535q4459H7206A7359e8604J8748p6954B34672m7166
10519A87506Q5759A22018B2422a76908d8303r1891a1316A18473i2586L3304j47821
10508b07103F6273a13377G5598f3062a9977A33777e1025A58374g0818j82141R1628
10497a61331B4535J80325a75496J3452A70086i9159b3156j73099A7320J76310
10487A93630a04576J369B94630b18485i6464d7997o5382A49429o972a39174q5511
10476b24685A54637a35225e2162l46l37036J90259j24303J27h8200A18159A7682
10464A08551b61203E8402J73430a42035k10337a32997E6534a84539A9084b843
$$ y = [-180674, -178796, 52407, -83162, 128887, -211179, -67366, -83689, -160812, -194331, 172684, 48783, -96972, 103841, -134906, -112371, -196830, 87206, 17359, -58604, -39856, -116810, 234672, 187506, 273265, 122018, 22422, -176908, -48303, -140194, -11316, 118473, -92586, -59282, -207103, 66273, -113377, 75598, -63062, -19977, 133777, -51025, 158374, -70818, -252959, -161331, 24535, 204860, -175496, -162044, 170086, -99159, -23156, -196255, 17320, 193630, -104576, -103207, 294630, -218485, -96464, -47997, -113379, 149429, 142457, -139174, -224685, 154637, -135225, -52162, -52508, -389544, -199285, -323588, -323461, -88200, 118159, 17682, 108551, -261203, 58402, 231832, -142035, -352372, -132997, 56534, -184539, 19084, -2843]
10453d3633l5064J9318C023b30732g926j4141m12836A07649m5247R6789h7506
10441f0920k90652B12892q3612a49717j88497R8367e2893H1414K8181B2801a55087
10429A58687h4738M0045p5234l54665a08367N342d5750m0407j9987k89b5135A7579
10416B07418g7807o4150m3932j52943a43234H5850J72029f5594l1742d6804I5787
10404H7287a08867N1482j68652n6745J01499A02258a48331o8092L1386l5172B154
10392b48878I4451i4676B06355b03409A07774b9750q7671b5285j28167b0368A58814
10380a1218A66062b79060A84740b24797A26879R0609J1253K17584i7475l8741
10370a36216O769A63013c4669C25434j45920J63044A56453b6683k96294B51873
$$ y = [-43633, -78697, -59379, 3023, -230732, -7926, -22067, -434903, 107649, 62402, 159191, -87506, -60920, -351572, 212892, 129280, -149717, -338214, -239847, -52893, 81414, 109595, 22801, -155087, 158687, -84738, -44693, -119927, -474592, -108367, -103025, -45750, -86157, -106144, -106433, -25135, 17579, 207418, -77807, -141957, -185889, -338832, -143234, 85850, 257879, -65594, -97336, -46804, 95787, 87287, -108867, -57385, -226037, -282782, -181283, 102258, -148331, -216423, -185037, -220209, 2154, -248878, 94451, -94676, 206355, -203409, 107774, -29750, -117421, -25285, -153452, -20368, 158814, -11218, 166062, -279060, 184740, -224797, 126879, 217488, 228741, 446325, -97475, -136216, -129447, 163013, -34669, 325434, 179514, 342558, 156453, -26683, -322977, 251873]
10359A75156H6624L2195B0602J60753a32144A04276O3671J56683n545I6798N31013
10348F27811E7380B0697L70982j37967J32267K530j00723l9054I7019K00235g598
10336B49617K30317j9658m5205j07704N01446A58962M99010k90176H2515q309
10326G4206J02316c5371B95163j09911c55148B49477A02230K35780q4842e1591
10315D11079H3061K47725A0572d1867F4013L57117A44908K16989a52229B76819
10304G3605Q7607F7338B9299p538J10450f3640D28306l5465F5265B9743a73264
10292a15791C4086a12843O752r0593Q5364j29338j802A48088N6211g4620j07027
10281a81647p8010M0474A15519a49345c6610I0319A0810k959M8166g1259K9811
$$ y = [175156, 86624, 118819, 20602, 181355, -132144, 104276, 167947, 324630, 319085, 96798, 627811, 57380, 20697, 391679, 253712, 385979, 388509, 287786, 248732, 97019, 297254, -7598, 249617, 479934, 460276, 415071, 307367, 808813, 158962, 657972, 367796, 82515, 74206, 176522, -35371, 295163, 185252, -355148, 249477, 102230, 338010, 253168, -51591, 411079, 83061, 330786, 10572, -41867, 64013, 421130, 144908, 361897, -152229, 276819, 73605, 161212, 67338, 29299, 21761, 132211, -63640, 428306, 392841, 65265, 29743, -173264, -115791, 34086, -112843, -106091, -196684, -111320, -240658, -242460, 148088, 204299, -74620, -181647, -259657, -219183, 115519, -149345, -36610, 90319, 10810, 7851, 56017, -71259, -41448]
10270d1448l47491N4287h9527g049j96762Q2364A14295a95176B1995K7234b4094
10258A57289R1956r5158C9483L4867f4041A67243E9195J19440A1377J55736D6679
10246b58654D0988b8913B76745F2899b72397J03003c2283B22860a81789f2754
10235a46053B17146K3756c6472n4851G421K37861G2130a40788f2281C27366a51768
10223d0402A32769P6281a59217a5336j04121I7176d9763A18507n038a05819H7303
10211a84585A61967C8404h9482k10106Q4785B3650b72187D6120J87160b57966
10200a00624B587a80965A54193N6232b18686i9666b9238j42598N3504K8697C0410
10188A1031i6654c7437m1240A91195b13512q9521H7936K2673c42339J28700D5409
$$ y = [-41448, -388939, -334652, -89527, -7049, -203811, -121447, 114295, -195176, 21995, 49229, -24094, 157289, 249245, 154087, 39483, 74350, -64041, 167243, 59195, 178635, 11377, 167113, 46679, -258654, 40988, -28913, 276745, 62899, -272397, -169394, -32283, 222860, -181789, -62754, -146053, 217146, 240902, -36472, -91323, 7421, 245282, 72130, -140788, -62281, 327366, -151768, -40402, 132769, 209050, -159217, -15336, -119457, 97176, -49763, 118507, 113469, -105819, 87303, -184585, 161967, 38404, -89482, -299588, -214803, 23650, -272187, 46120, 233280, -257966, -100624, 2587, -180965, 154193, 210425, -218686, -99666, -29238, -171836, -118332, -89635, 30410, 11031, -96654, -37437, -78677, 191195, -213512, -303033, 87936, 110609, -342339, -213639, 45409]
10176d5772j49086J1164H7982a40631k7583m4299G4608a0298B57047a22657e1066
10164b1556j53812O7637C0120c94397Q5304B6798a86992B4784a76404H9505P4465
10153A63970c714l10909E1213e5876j78179k54452g691k80068a13089H7088f3378
10141B8406a36924r3084c4337j69164B3490b42734h984l1376j481I170h2184A59143
10128b0787r1660B1071a15824C7107J61526a57663j00835A45820K6016J52249
10118C24085b24663k22617h6234b0554j0586A67177h0388B17367e6611p3118A1365
10106b01988a7971A13969c15899A94084B0088M6947e4947r5297A96775b92092
10095b27937A4158O4527K59147c76828J66909D6511i6679H3893L1453i9451O506
$$ y = [-45772, -194858, -183694, 87982, -140631, -168214, -212513, 74608, -10298, 257047, -122657, -51066, -21556, -175368, -107731, 30120, -394397, -309093, 26798, -186992, 24784, -176404, 89505, 163970, -3714, -314623, 51213, -55876, -234055, -488507, -7691, -287759, -113089, 87088, -63378, 28406, -136924, -230008, -34337, -203501, 23490, -242734, -8984, -40360, -41841, 9170, -82184, 159143, -20787, -112447, 21071, -115824, 37107, 198633, -157663, -258498, 145820, 171836, 324085, -224663, -447280, -86234, -20554, -31140, 167177, -80388, 217367, -56611, -129729, 11365, -201988, -17971, 113969, -315899, 194084, 20088, 67035, -54947, -150244, 196775, -292092, -227937, 14158, 78685, 337832, -376828, -209919, 46511, -96679, 83893, 115346, -99451, -92945]
10084i2945k36510A66531a27079j82555a24637j22379Q2959j14315c1783l3379
10074f5162j59073e0446A13171c61063g4919c4966l11199A67774c3864n781H812
10062b32917B2765e5104j59696M6444p9589a19942B3366J85283d194o03887B13482
10050H2564c79959A0152J8326a78770B27502j03702C3369c57073k6276B19414
10039a57373f8065F6131J47213D1843b4512k95892J52161r692j14268C56369p9955
10028B76414h5754j22990A75403a69155I2484k5831h7096b4305B45740a65920
10017a27699A2008c1603A17543a70202A95183n4539B4096J4138b3803m9143m3177
10006a16123n66474b6851j61394m2335i2041A56063O7781B4036K68389b32549
$$ y = [-92945, -329455, 166531, -127079, -309634, -124637, -247016, -164057, -278372, -31783, -65162, -224235, -50446, 113171, -361063, -74919, -34966, -346165, 167774, -33864, -39645, 8812, -232917, 22765, -55104, -214800, -168356, -247945, -119942, 23366, 208649, -4194, -608081, 213482, 82564, -379959, 10152, 28478, -178770, 227502, 123800, 33369, -357073, -383349, 219414, -157373, -68065, 66131, 213344, 41843, -24512, -320404, -168243, -177935, -292203, 356369, 276414, -85754, -208744, 175403, -169155, 92484, 66653, -87096, -24305, 245740, -165920, -127699, 12008, -31603, 117543, -170202, 195183, 140644, 24096, 38234, -23803, -72946, -116123, -682597, -26851, -188245, -230580, -92041, 156063, 223844, 24036, 292425, -232549]
9995e6961A78991a83777K1439a2102K062B79039a23063L7274n4572c5714j22882
9984a58596q7048D0396a65916j05074G2160N6903a57453N6316G7087N9788a71536
9972c07436A07275f8664j14753q5537J09159A04621M656a06004M6331K5093A77065
9960d06113D5076e45m3810j28483A66685D6700a26142j67651A73945D1691a24167
9948H4759N6373c5881j78210D7839f3518b5016A00836i7442M3934m19047A26055
9936a52311M5883H8312a72844j55255h0960F3048a40331E132L42477a02228B05655
9924a54447j3009B84669H1533Q0991i2561n3436B48368E2521a1803M305A78685
9912D4216b019I105b27789B29497a11409k73832a59957C90496j17644J73175d1197
$$ y = [-56961, 178991, -183777, -162338, -12102, -10040, 279039, -123063, -85789, -140361, -35714, -158596, -245644, 40396, -165916, -270990, 72160, 129063, -157453, -101137, 77087, 136875, -171536, -307436, 107275, -68664, -183417, -268954, -159795, 104621, 109277, -106004, -59673, -34580, 177065, -406113, 45076, -545, -44355, -172838, 166685, 46700, -126142, -293793, 173945, 41691, -124167, 84759, 141132, -35881, -214091, 47839, -63518, -25016, 100836, -97442, -53508, -472555, 126055, -152311, -106428, 88312, -172844, -328099, -80960, 63048, -140331, 5132, 347609, -102228, 205655, -154447, -167456, 284669, 81533, 162524, -92561, -145997, 248368, 52521, -11803, -7498, 178685, 44216, -2019, 9105, -227789, 229497, -111409, -385241, -159957, 390496, 272852, 446027, -41197]
9900a3115B3848a25208l9538N5342l6632f9095G0664c12406d1919j2290p1563
9889a25772B37995k4489b12241A50010h9635k44036J56299A0175J4950R032K61394
9878B95551D3570g6258l6229d0830F0730a16939I1333a01779C246b78081J22788
9867a55293k01025a68794N8271b6468k12377H2257a72876N1217o5842d7872r2703
9856a40575b8235H3162A8831a84254G1073e3203k05838a10552r8691A11145j6170
9845I4975a20371J2968r9952H1520a48570q0183A36900a22327n1985d6361j55621
9834b01982L3273a796o856n2128N108G9869B0446c60075J06350a8279A28841K4689
9822A53530a56423A44487B6672a1816k05409i3303F416b68603Q0022k07415a21486
$$ y = [-13115, 23848, -125208, -164746, -109404, -146036, -69095, 70664, -312406, -41919, -54209, -125772, 237995, 213506, -212241, 150010, -89635, -333671, -177372, 10175, 25125, 34157, 295551, 43570, -76258, -112487, -40830, 60730, -116939, 91333, -101779, 3246, -278081, -155293, -356318, -168794, -110523, -26468, -238845, 82257, -172876, -121659, -187501, -47872, -140575, -28235, 83162, 18831, -184254, 71073, -53203, -259041, -110552, -209243, 111145, 94975, -120371, -107403, -207355, 81520, -148570, -228753, 136900, -122327, -174312, -46361, -201982, -168709, -1796, -8652, -60780, -55672, 79869, 20446, -360075, -253725, -18279, 128841, 153530, -156423, 144487, 26672, -11816, -217225, -93303, 6416, -268603, -188581, -395996, -121486]
9810A60226h6985k49061J16075R9681A59812k1729P8962g4200E33098A30273J75197
9799C05470a90390Q6758j88132B15213b39124I9200a05219A51341c0452C75116
9788a27729A07402b95153P2954B286M8524i2599B42632d80450A41611b96203j0166
9777c06369c719I0365J82405a22307k82595F2478c07516c0450r5131A47910b59662
9765A08966h7668k88243A88235e7305Q544B46801n1521i3860l8562A98583b4148
9753b59534h2133k98809F0862j9713J18049B0427J86842c6399I3789g2872o4807
9742a37679K097M4834K0981F2316c94989A84926b47703c9501A37780a45928c1470
9730a63476L3513o7591r7617A09866h0043B59813j22189c96650C1965a67835k9052
$$ y = [160226, -86985, -336046, -219971, -120290, 159812, 138083, 217045, -74200, 533098, 130273, 305470, -190390, -103632, -291764, 215213, -239124, 99200, -105219, 151341, -30452, 375116, -127729, 107402, -295153, -222199, 2286, 50810, -92599, 242632, -480450, 141611, -296203, -306369, -3719, 90365, 272770, -122307, -404902, 62478, -307516, -30450, -125581, 147910, -259662, 108966, -87668, -375911, 188235, -57305, -48761, 246801, 195280, -93860, -132422, 198583, -24148, -259534, -82133, -380942, 60862, 41149, 159198, 20427, 207269, -36399, 93789, -72872, -137679, -135582, -90748, -69767, 62316, -394989, 184926, -247703, -39501, 137780, -145928, -31470, -163476, -129963, -197554, -295171, 109866, -80043, 259813, 137624, -396650, 31965, -167835, -196887]
9719a96887E5564b67284C41030i7598p0946B289N1442d0577A98303b18324A64933
9707d9784K0449I9622b49271M8748m8908B31513q2736h5294j11571C5342b9889
9695c08017d1319r8197l6969g0238j06584L4438C58b34302O20A3181a6137I5360
9682H434c66255a68474A14271h9587A8282a99218D3932M06602c76933B57032a77491
9670g0345k14745A3208d9625p4139N3197A44657a19268l1107L3206B19654a75879
9658c02778P2276C6556K03194a17469o7431q7767B50676b2481A14437b10294O4737
9647a45557k6937I3044J02309a83527k33792A23306g634H37J08495a64337K6576
9636a37761O6596H376a97228o812b6058m26958f0427B0512e742n4629D65374d1085
$$ y = [-196887, 55564, -267284, 341030, -97598, -168544, 2289, 53731, -40577, 198303, -218324, 164933, -49784, -29335, 99622, -249271, -200523, -249431, 231513, 148777, -85294, -196865, 35342, -29889, -308017, -41319, -139516, -176485, -70238, -176822, -142384, 358, -234302, -233682, 13181, -16137, 95360, 8434, -366255, -168474, 114271, -89587, 18282, -199218, 43932, 450534, -376933, 257032, -177491, -70345, -285090, 13208, -49625, -123764, -70567, 144657, -119268, -150375, -117169, 219654, -175879, -302778, -230502, 36556, 239750, -117469, -184900, -272667, 250676, -22481, 114437, -210294, -145557, -172494, 93044, 195353, -183527, -417319, 123306, -7634, 837, 109332, -164337, -137761, -71165, 8376, -197228, -204040, -26058, -453016, -60427, 20512, -5742, -60371, 465374, -41085]
9623A40675C4239i9724p796o1281D39582A17960g9992I2492a5903l7958A15101
9611A6914b3778p682A63582c09839q7106J72076A42651k0801d6998p1541n4194
9600a72733C3287I098Q9906d6186p5953c2923K984B6369A2588d9722j08961B43815
9587a18619B00991C2077a61637G2254a3856B22670b30222a10011A1588f1758j04869
9576a66627d5016I1612a14340r3501Q8620j11452A15356Q5063b82131B071J89160
9565A91231g7145C4658e5176H1142c66344b3216A10351a82213j4750g9672A77052
9553A63273a06795l27622A57917J44149f9157A06033D8852A02J05810D1946R8546
9542A40492m467k1100l12e68320B68665j08927G7488b15160J04274q9821A12346
$$ y = [140675, 34239, -99724, -107520, -168801, 439582, 117960, -79992, 92492, -15903, -53861, 115101, 16914, -23778, -31460, 163582, -309839, -396945, -224869, 142651, 121850, -46998, -118539, -172733, 33287, 9098, 99004, -46186, -122139, -32923, -29939, 26369, 12588, -49722, -158683, 243815, -118619, 200991, 32077, -161637, 72254, -13856, 222670, -230222, -110011, 11588, -61758, -166627, -45016, 91612, -114340, -207841, -119221, -230673, 115356, 200419, -282131, 2071, 191231, -77145, 34658, -55176, 81142, -366344, -23216, 110351, -182213, -196963, -79672, 177052, 163273, -106795, -434417, 157917, 302066, -69157, 106033, 48852, 102, 105912, 41946, 140492, 136025, 114925, 114613, -568320, 268665, 159738, 77488, -215160, -110886, -200707, 112346]
9530A54513b74627p9675D6522b66189P3555Q2813r911I0682Q1733J27064c15828
9518C7340a17803c9568J2653l6208o8281k24675a31585D170N1715f9786K6058
9507d3728n1633l29187A08373a94249P9679D29204b50364b6087E8457a89358k9599
9496b18957L6294j27966a53307A50817b97338H2436b19480g6695j27123c3337
9485a69560j13057h4129c446k8843B0777a2796p0568l2835H2522c6300q4158j43961
9473b64419B59244a76345l6362G1792a46008c5993j30138m9418H6626d6592A61598
9461B24683g5095a5346m6374C3295j0203a57306g0067J331k23008A66536a03040
9449B8683b85422F7652f0192I9217E682K18854D5668b79396a39211j0148o2690
$$ y = [154513, -274627, -354302, 46522, -266189, -192634, -109821, -119732, 90682, 172415, 299479, -315828, 37340, -117803, -39568, -26915, -63123, -131404, -356079, -131585, 4170, 55885, -69786, -43728, -95361, -424548, 108373, -194249, -114570, 429204, -250364, -26087, 58457, -189358, -218957, -182663, -310629, -153307, 150817, -297338, 82436, -219480, -76695, -203818, -33337, -169560, -282617, -84129, -3446, -32289, 20777, -12796, -83364, -116199, 82522, -36300, -120458, -264419, 259244, -176345, -212707, 71792, -146008, -35993, -166131, -215549, 86626, -46592, 161598, 224683, -75095, -15346, -61720, 33295, 23092, -157306, -70067, -68736, -291744, 166536, -103040, 28683, -285422, 67652, -60192, 99217, 5682, 224536, 45668, -279396, -139211, -149359, -212049]
9438b12049a4914j56041p1345F8219a43812E9982b29114A22411o0692c03250D4174
9426c82053A88190n3911b75810I3619J08722a09609F9568a53643G2783h6716C5143
9414B01043h7722j62077C2013b60984m3982h3821H698a06436o3171j52653A87683
9402E0343i9566A17523b68198F9118J73821j18937J38965g7943J8196j17126k7453
9391b04326N5329n8833b0653A01770a0946H1646d7891n0169r2890h1064F4807
9379d76465A22790i5660j32830j8859F5591J84878c0304l23803a48421j4829d08
9367i5477K7716A01457b08882b4175A32734a52388G9605a51753q2014j5851f2657
9355f1560j19706k93638B8107j0109E35a58695A11592c3207k4062k28043A16197
$$ y = [-212049, -14914, -170955, -242300, 68219, -143812, 59982, -229114, 122411, 61719, -303250, 44174, -382053, 188190, 134279, -275810, 93619, 202341, -109609, 69568, -153643, 72783, -86716, 35143, 201043, -87722, -249799, 32013, -260984, -304966, -83821, 8698, -106436, -169607, -322260, 187683, 50343, -99566, 117523, -268198, 69118, 242939, 124002, 262967, -77943, -59747, -176873, -204326, -148997, -207830, -20653, 101770, -10946, 81646, -47891, -98060, -190950, -81064, 64807, -476465, 122790, -95660, -228490, -247349, 65591, 250469, -30304, -354107, -148421, -163250, -408, -95477, -67761, 101457, -208882, -24175, 132734, -152388, 79605, -151753, -233767, -249618, -62657, -61560, -181266, -474904, 28107, 17998, 535, -158695, 111592, -33207, -57269, -285312, 116197]
9343b0759j78571j75970h0394p8708A41728g8796d223j37902A5280N2277K07120
9332B74677c57430C0013b70760a17295a3170q9908j01965K8332j63920e1951n8919
9321a10870r4970A40747R607i1184B85581a96193l28549d0776q7641d7071A30086
9309b7837A67965d3379k82977A87269a29220A55184m4548R5139a23077l5628k19041
9298c77746E3905A1208a60712E1829O8148b18732A14584m7493L07484F682P8283
9287H4965b16085a07553B29106E0698b64851k8737H2443K79491E2346a45571h054
9275A03618f6107A01146f5633r907j98723a12580n5135K0663l7599J3156n6181
9264b27676A14517K0039b05828D3187P8157P1613K5942f9096A0479b39037E91786
$$ y = [-20759, -199330, -375300, -80394, -159102, 141728, -78796, -4223, -142125, 15280, 67557, 274677, -357430, 30013, -270760, -117295, -13170, -103078, -205043, -176711, -340631, -51951, -110870, -205840, 140747, 150354, -91184, 285581, -196193, -524742, -40776, -128417, -47071, 130086, -27837, 167965, -43379, -326356, 187269, -129220, 155184, 110636, 205775, -123077, -158705, -377746, 53905, 11208, -160712, 51829, 119977, -218732, 114584, 67091, 374575, 6682, 84965, -216085, -107553, 229106, 50698, -264851, -293588, 82443, 361934, 52346, -145571, -8054, 103618, -66107, 101146, -65633, -75540, -274263, -112580, -167715, -147052, -184651, -171495, -227676, 114517, 134556, -205828, 43187, 121344, 192957, 218899, -69096, 10479, -239037, 591786]
9252G6600K413B3048L23522a27551j1138A59122a20722C35890j63533n5359J08551
9241B25549c5605l11346J52453j46920K0080a45144f067B583J39872F9927c71630
9229a2258j29935C08176g0065B75367b13881p1808R0429Q0963m3722k2524C49112
9217b84609i49B9449c74758A6357j112a43402l7803L7049J4266K1543b4300j46457
9205a70757J7759O8971B13564a0886j35946A14397M00946H3311b99476J16694
9195a82782B33991f7032L2648j14217A12249h1694A16625K9375G233h4146B49337
9183b17417i8785j38797L9866O7455c7525j55338A57353i6885A38264c04745H3313
9171D6440a04771A02812i4118A23493a37640f2481o4469j19721K7195E4572R3847
$$ y = [76600, 79013, 23048, 346570, -127551, -138689, 159122, -120722, 335890, 172357, 116998, 225549, -35605, -346951, -194498, -341418, -321338, -145144, -6067, 2583, 142455, 69927, -371630, -12258, -142193, 308176, -70065, 275367, -213881, -285689, -195260, -114297, -158019, -180543, 349112, -284609, -949, 29449, -374758, 16357, 15245, -143402, -181205, -144156, -129890, -108347, -24300, -170757, -152998, -84027, 213564, -10886, -146832, 114397, 515343, 83311, -299476, -182782, 233991, -67032, -34384, -148601, 112249, -81694, 116625, 146000, 7233, -84146, 249337, -217417, -98785, -237582, -197716, -130261, -37525, -192863, 157353, -96885, 138264, -304745, 83313, 46440, -104771, 102812, -94118, 123493, -137640, -62481, -126950, -246671, -219476, 54572, 148419]
9160A48419b11990i0839j72803M8688j33272D3114b2850B848f0782q6407e4801
9148E4821i7698a9669N791j25018m4059K4838k1746A42053a6092A42007C5563
9136d4867B46964i4317j26110A11836J71860i701j84872P1726B28576a00622B48708
9124A75267h3686q2703A18636f967A83287b20694Q9314M9294D5048a71185A94645
9112A9063c91487P6239R1131A54297a17264j77844J08111E0334L9094J30332b07465
9100A37488k5369P1158N8190a29150L4894A14343b65472B78255r4476d0917j16827
9089a57744j15445J01679J5728P5812B24247i8018j17991A20550a09969B18486
9078A6390b21568A07928m86c61813a35064h832k36205a2968B15546J12050A56333
$$ y = [148419, -211990, -90839, -263642, -214954, -348226, 43114, -22850, 2848, -60782, -147189, -54801, 54821, -97698, -19669, -13878, -138896, -182955, -158117, -179863, 142053, -16092, 142007, 35563, -44867, 246964, -94317, -220427, 111836, 283696, -9701, -194573, -122847, 228576, -100622, 248708, 175267, -83686, -166389, 118636, -6967, 183287, -220694, -131380, -82086, 45048, -171185, 194645, 19063, -391487, -315248, -224117, 154297, -117264, -295108, -186997, 50334, 89428, 219760, -207465, 137488, 112119, 183277, 241467, -129150, -94256, 114343, -265472, 278255, 183779, -40917, -157744, -273189, -171510, -155782, -79970, 224247, -98018, -216009, 120550, -109969, 218486, 16390, -221568, 107928, 107442, -361813, -135064, -8832, -245037, -12968, 215546, 327596, 156333]
9066a36736j76223E2415n132J0205K33062c6015l49104J41883p6062c41j81107
9055a81448A13120a20764A7495c09639h8357q4260e6783j6063j3458q8999N0326
9044a24977j67126g5913D3786a95196A77689a91545h8618l4087K4819n7546A01230
9032A17246a36429b1399l5981K6454k09045o593D07989c0681A57066E512a01662
9020a16031j21527B27721a48431B8660a10178R207L8649j33580D28585g0244r9521
9009a69765B03444A8849b12044b8933l6244A6505L60555a99102m0629f5750j61750
8998b27500b3606A66681b57463I9376a20363A83486J14722a90786A01493c9200
8987a5973j57706B4864b19596J1022f9415k7755B3348i5252j22951J09081j94235
$$ y = [-136736, -312959, 52415, 47283, 57488, 290550, -36015, -385119, -243236, -319298, -341, -181448, 113120, -120764, 17495, -309639, -88357, -172617, -56783, -72846, -86304, -175303, -124977, -292103, -75913, 43786, -195196, 177689, -191545, -88618, -122705, -97886, -155432, 101230, 117246, -136429, -21399, -57380, -30926, -239971, -246564, 407989, -30681, 157066, 5512, -101662, -116031, -237558, 227721, -148431, 28660, -110178, -100971, -62322, -195902, 428585, -70244, -169765, 203444, 18849, -212044, -28933, -65177, 16505, 377060, -199102, -239731, -65750, -227500, -23606, 166681, -257463, 99376, -120363, 183486, 298208, -190786, 101493, -39200, -15973, -173679, 24864, -219596, -208574, -69415, -97170, 23348, -95252, -218203, -109122, -303357]
8976c03357J39839j13799A25628f0659A10209M0801e8430k60573c43o7633n8647
8965a26623K7184A5591L39250j42364c59001g382A31290o4083a03836n1663C1582
8953b36217D1339j5025e1313k80564J28215P2769G6256p062J8361g3904q4417
8942a58321A01375a56998B035J37909a21609e0537A14138c52917d942n4366D4426
8930b30422a10001c95j83268M1275p0842G2345g7625k09683R6912Q3393B9235
8918I8825A2216L51930J12557B14057J11087A16102J01299b0609A07582M65346
8908E72928k27811M98151R81083R86553J856266N797303D622688B138645q25821
8899A312824F26023k37160N8150j73374M1970b3777E08651E8609J93493K162D7908
$$ y = [-303357, -163518, -277317, 125628, -60659, 110209, 151010, -58430, -319003, -343, -67976, -126623, -99439, 15591, 354841, 212477, -359001, -7382, 131290, 67207, -103836, -155499, 31582, -236217, 41339, 26314, -51313, -331877, -203662, -130893, 76256, 69194, 87555, -73904, -158321, 101375, -156998, 2035, 139944, -121609, -50537, 114138, -352917, -4942, -59308, 44426, -230422, -110001, -395, -183663, -142388, -213230, 72345, -77625, -287308, -190396, -107003, 29235, 98825, 12216, 364146, 476703, 214057, 325144, 116102, 217401, -20609, 107582, 572928, 345117, 843268, 1824351, 2810904, 4667170, 10464473, 4622688, 2138645, 1312824, 626023, 388863, 447013, 273639, 315609, -23777, 508651, 58609, 252102, 254264, 47908]
8887B042N6349a75620l9418N3802E8642Q1915j1183a48869A81354d00882a57788
8875A13274D5975i7644A36900o3118a10467o0978j312A79315c1425j51133B4285
8863C26016A52439c10295j01936e6028G6227J45350d4888G1161F599a41629c6707
8851b15353B39215D2198a70065m1259h0300k9221p4506a440B54083a46938M5127
$$ y = [2042, 58391, -175620, -215038, -161236, 58642, 140557, 129374, -148869, 181354, -400882, -157788, 113274, 45975, -97644, 136900, 73782, -110467, -171445, -172757, 179315, -31425, -182558, 24285, 326016, 152439, -310295, -412231, -56028, 76227, 221577, -44888, 71161, 6599, -141629, -36707, -215353, 239215, 42198, -170065, -211324, -80300, -109521, -184027, -1440, 254083, -146938, -101811]
$$ [...]
##END NTUPLES=NMR SPECTRUM
##END=
