
##TITLE=AC1227_VIERS11107_6074976_PiINvGLfJz
##JCAMPDX= 6.0         $$ Bruker NMR JCAMP-DX V2.0
##DATA TYPE= NMR SPECTRUM
##DATA CLASS= NTUPLES
##ORIGIN= BRUKER
##OWNER= Administrator
$$ 1.72 TOPSPIN		Version 2.1
$$ 2012-05-08 22:09:52.046 -0500  Administrator@TOPSPIN
$$ Compression mode = diff/dup
##.OBSERVE FREQUENCY= 400.13188235
##.OBSERVE NUCLEUS= ^1H
##.ACQUISITION MODE= SIMULTANEOUS (DQD)
##.ACQUISITION SCHEME= undefined
##.AVERAGES= 64
##.DIGITISER RES= 22
##SPECTROMETER/DATA SYSTEM= spect
##.PULSE SEQUENCE= noesygpps1d.comp
##.SOLVENT NAME= COFFEE_meoh
##.SHIFT REFERENCE= INTERNAL, COFFEE_meoh, 1, 14.96837
##AUDIT TRAIL= $$ (NUMBER, WHEN, WHO, WHERE, PROCESS, VERSION, WHAT)
$$ ##TITLE= Audit trail, TOPSPIN		Version 2.1
$$ ##JCAMPDX= 5.01
$$ ##ORIGIN= Bruker BioSpin GmbH
$$ ##OWNER= Administrator
$$ $$ C:\Bruker\TOPSPIN/data/COFFEE/nmr/AC1227_VIERS11107_6074976_PiINvGLfJz/22/pdata/1/auditp.txt
$$ ##AUDIT TRAIL=  $$ (NUMBER, WHEN, WHO, WHERE, PROCESS, VERSION, WHAT)
(   1,<2012-05-08 22:09:47.187 -0500>,<Administrator>,<TOPSPIN>,<go>,<TOPSPIN 2.1>,
      <created by zg
	started at 2012-05-08 21:58:17.000 -0500,
	POWCHK enabled, PULCHK disabled,
       configuration hash MD5:
       AF F2 23 6B 01 CD 40 DD E5 A1 38 A0 06 EA F7 77
       data hash MD5: 64K
       9B CC FC 98 53 F4 6E 1F 21 CB 0E AE 4C A0 A2 9A>)
(   2,<2012-05-08 22:09:50.078 -0500>,<Administrator>,<TOPSPIN>,<proc1d>,<TOPSPIN 2.1>,
      <Start of raw data processing
       efp LB = 0.3 FT_mod = 6 PKNL = 1 PHC0 = 0 PHC1 = 0 SI = 128K 
       data hash MD5: 128K
       F7 2C 3D 35 E9 DE FF 0E 6D F8 D7 78 C5 14 1F 6E>)
(   3,<2012-05-08 22:09:51.234 -0500>,<Administrator>,<TOPSPIN>,<proc1d>,<TOPSPIN 2.1>,
      <pk PHC0 = 33.70056 PHC1 = 0 
       data hash MD5: 128K
       48 7C 9C 3C 5B 16 26 F9 AF F1 4D 40 44 51 AC F9>)
(   4,<2012-05-08 22:09:51.734 -0500>,<Administrator>,<TOPSPIN>,<proc1d>,<TOPSPIN 2.1>,
      <abs ABSG = 1 
       data hash MD5: 128K
       5E 50 09 43 78 1C 03 A7 C2 EA 68 1A BA 51 47 C1>)
(   5,<2012-05-08 22:09:51.796 -0500>,<Administrator>,<TOPSPIN>,<proc1d>,<TOPSPIN 2.1>,
      <abs ABSG = 2 
       data hash MD5: 128K
       34 5B C8 0E 6B 73 13 DB 02 E8 6E 6E 2D AC 7D 63>)
(   6,<2012-05-08 22:09:51.843 -0500>,<Administrator>,<TOPSPIN>,<proc1d>,<TOPSPIN 2.1>,
      <abs ABSG = 3 
       data hash MD5: 128K
       87 4D F8 94 E8 22 4F A6 C6 16 49 7B B9 BE F1 78>)
(   7,<2012-05-08 22:09:51.906 -0500>,<Administrator>,<TOPSPIN>,<proc1d>,<TOPSPIN 2.1>,
      <abs ABSG = 4 
       data hash MD5: 128K
       5E AA E7 80 32 2E 2C 21 33 34 B8 06 5A 85 54 43>)
(   8,<2012-05-08 22:09:51.968 -0500>,<Administrator>,<TOPSPIN>,<proc1d>,<TOPSPIN 2.1>,
      <abs ABSG = 5 
       data hash MD5: 128K
       6C F7 56 71 90 6A 14 E6 FE C4 FB 00 78 3D CC 74>)
$$ ##END=
$$ 
$$ $$ hash MD5
$$ $$ C2 50 61 D2 2D FB C8 14 CF 61 F4 91 9D 78 6E 9E
##$RELAX= 
##$RELAX= 
##$RELAX= 
##$RELAX= 
##$RELAX= 
##$RELAX= 
##$RELAX= 
##$RELAX= 
$$ Bruker specific parameters
$$ [...]
##$TP07= 0
##$TPNAME0= <>
##$TPNAME1= <>
##$TPNAME2= <>
##$TPNAME3= <>
##$TPNAME4= <>
##$TPNAME5= <>
##$TPNAME6= <>
##$TPNAME7= <>
##$TPOAL= (0..7)
0.5 0.5 0.5 0.5 0.5 0.5 0.5 0.5
##$TPOFFS= (0..7)
0 0 0 0 0 0 0 0
##$TUNHIN= 0
##$TUNHOUT= 0
##$TUNXOUT= 0
##$USERA1= <user>
##$USERA2= <user>
##$USERA3= <user>
##$USERA4= <user>
##$USERA5= <user>
##$V9= 5
##$VALIST= <valist>
##$VCLIST= <CCCCCCCCCCCCCCC>
##$VD= 0
##$VDLIST= <DDDDDDDDDDDDDDD>
##$VPLIST= <PPPPPPPPPPPPPPP>
##$VTLIST= <TTTTTTTTTTTTTTT>
##$WBST= 1024
##$WBSW= 4
##$XGAIN= (0..3)
0 0 0 0
##$XL= 0
##$YL= 0
##$YMAX_a= 11759373
##$YMIN_a= -5516564
##$ZGOPTNS= <>
##$ZL1= 120
##$ZL2= 120
##$ZL3= 120
##$ZL4= 120
##$ABSF1= 14.96837
##$ABSF2= -5.58416
##$ABSG= 5
##$ABSL= 3
##$ALPHA= 0
##$AQORDER= 0
##$ASSFAC= 0
##$ASSFACI= 0
##$ASSFACX= 0
##$ASSWID= 0
##$AUNMP= <proc_prof1d_extract.lims>
##$AXLEFT= 0
##$AXNAME= <>
##$AXNUC= <1H>
##$AXRIGHT= 0
##$AXTYPE= 0
##$AXUNIT= <>
##$AZFE= 0.1
##$AZFW= 0.1
##$BCFW= 0
##$BC_mod= 0
##$BYTORDP= 0
##$COROFFS= 0
##$CY= 15
##$DATMOD= 1
##$DC= 0
##$DFILT= <>
##$DTYPP= 0
##$F1P= 0
##$F2P= 0
##$FCOR= 0.5
##$FTSIZE= 131072
##$FT_mod= 6
##$GAMMA= 0
##$GB= 0
##$INTBC= 1
##$INTSCL= 1
##$ISEN= 128
##$LB= 0.3
##$LEV0= 0
##$LPBIN= 0
##$MAXI= 10000
##$MC2= 0
##$MEAN= 0
##$ME_mod= 0
##$MI= 0
##$NCOEF= 0
##$NC_proc= -3
##$NLEV= 6
##$NOISF1= 0
##$NOISF2= 0
##$NSP= 0
##$NTH_PI= 0
##$NZP= 0
##$OFFSET= 14.96837
##$PC= 1
##$PHC0= 33.70056
##$PHC1= 0
##$PH_mod= 1
##$PKNL= yes
##$PPARMOD= 0
##$PPDIAG= 0
##$PPIPTYP= 0
##$PPMPNUM= 2147483647
##$PPRESOL= 1
##$PSCAL= 4
##$PSIGN= 0
##$PYNMP= <proc.py>
##$REVERSE= no
##$SF= 400.130004899367
##$SI= 131072
##$SIGF1= 0
##$SIGF2= 0
##$SINO= 400
##$SIOLD= 131072
##$SPECTYP= <>
##$SREGLST= <1H.CDCl3>
##$SSB= 0
##$STSI= 131072
##$STSR= 0
##$SW_p= 8223.68421052632
##$SYMM= 0
##$S_DEV= 0
##$TDeff= 65536
##$TDoff= 0
##$TI= <>
##$TILT= no
##$TM1= 0
##$TM2= 0
##$TOPLEV= 0
##$USERP1= <user>
##$USERP2= <user>
##$USERP3= <user>
##$USERP4= <user>
##$USERP5= <user>
##$WDW= 1
##$XDIM= 131072
##$YMAX_p= 466532515
##$YMIN_p= -164493513
##$CURPLOT= <Network HP LaserJet P1505>
##$CURPRIN= <$Network HP LaserJet P1505>
##$DFORMAT= <normdp>
##$LAYOUT= <+/1D_H.xwp>
##$LFORMAT= <normlp>
##$PFORMAT= <normpl>
##$SURQMSG= 1
$$ End of Bruker specific parameters
$$ ---------------------------------
##NTUPLES= NMR SPECTRUM
##VAR_NAME=  FREQUENCY,     SPECTRUM/REAL,   SPECTRUM/IMAG
##SYMBOL=    X,             R,               I
##VAR_TYPE=  INDEPENDENT,   DEPENDENT,       DEPENDENT
##VAR_FORM=  AFFN,          ASDF,            ASDF
##VAR_DIM=   131072,        131072,          131072
##UNITS=     HZ,            ARBITRARY UNITS, ARBITRARY UNITS
##FACTOR=    0.0627417313425165, 1,          1
##FIRST=     8223.62146879498, 4066,         -84848
##LAST=      0,             7036,            -85375
##MIN=       0,             -164493513,      0
##MAX=       8223.62146879498, 466532515,    0
$$ Real data points
##PAGE= N=1
##DATA TABLE= (X++(R..R)), XYDATA
$$ [...]
63272A351629l6297l6363l4618l1494k8817k7573k7073k6087k4050k1334j8866
$$ 1351629 1315332 1278969 1244351 1212857 1184040 1156467 1129394 1103307 1079257 1057923 1039057
63261A039057j7358j6593j5677j4250j2981j2435j2063j1052r777r372j0004j0581
$$ 1039057 1021699 1005106 989429 975179 962198 949763 937700 926648 916871 907499 897495 886914
63249H86914j0312r618r057q290o898n631n781p389q877q836p562o576o902q111
$$ 886914 876602 866984 857927 849637 842739 837108 831327 823938 815061 806225 798663 792087 785185 777074
63235G77074q901q392o941n783n828o797p773q335q724q874q141o354m548l929
$$ 777074 768173 759781 752840 747057 741229 734432 726659 718324 709600 700726 692585 686231 681683 677754
63221F77754m418m969n103n335o065o868p116o684n811m772m027m107m891n426
$$ 677754 673336 668367 663264 657929 651864 644996 637880 631196 625385 620613 616586 612479 607588 602162
63207F02162m870l408j937j110r83j261j523j493j467k126l515m540m039k239
$$ 602162 597292 593884 591947 590837 589854 588593 587070 585577 584110 581984 578469 573929 569890 567651
63193E67651n91k27r55j696j516l05J073J294k75k823m722m888l359q10J939M047
$$ 567651 567060 566833 565878 564182 562666 562361 563434 564728 564453 561630 556908 552020 548661 547851 549790 553837
63177E53837N007N106N095N224N078M490L940L678K969J036j492k867k138k73
$$ 553837 558844 563950 569045 574269 579347 583837 587777 591455 594424 595460 593968 591101 588963 588690
63163E88690R86J018O90R54J661K008J868K122L445N108N490L908J519J05J93
$$ 588690 589676 590694 591384 592338 593999 596007 597875 599997 603442 608550 614040 617948 619467 619572 619765
63148F19765P96Q96O04O40J215J898K327K473K347K045K087L019M495N407N147
$$ 619765 620561 621457 622061 622701 623916 625814 628141 630614 632961 635006 637093 640112 644607 650014 655161
63133F55161M220L334K663K413L099M494N267M801M538O013Q137Q416O689N531
$$ 655161 659381 662715 665378 667791 670890 675384 680651 685452 689990 696003 704140 712556 719245 724776
63119G24776O468Q021Q516Q766J0196J1856J1520R078O842O565P713Q710Q567
$$ 724776 731244 739265 747781 756547 766743 778599 790119 799197 806039 812604 820317 829027 837594
63106H37594P343O081O183P760Q921P855N296L419K690J707J27m89N17J299J8
$$ 837594 844937 851018 857201 864961 873882 881737 887033 890452 893142 894849 894976 894487 895004 896303 896321
63091H96321k518m226m676n132o311p620q301q089o841m629k348j402k426m621
$$ 896321 893803 889577 884901 879769 873458 865838 857537 849448 842607 837978 835630 834228 831802 827181
63077H27181o363o370m596k331j061r99j133q41o38q99r03m8P59K15j260j787
$$ 827181 820818 814448 809852 807521 806460 805461 804328 803487 802849 801950 801047 800999 801758 801973 800713 798926
63061G98926m02J854L406L748L367K893K696K844L097L122K829K325J754J435
$$ 798926 798524 800378 803784 807532 810899 813792 816488 819332 822429 825551 828380 830705 832459 833894
63047H33894J807K744L358L174L082M161N814O266N025L652L548M053L546J798
$$ 833894 835701 838445 841803 844977 848059 852220 858034 864300 869325 872977 876525 880578 884124 885922
63033H85922L15M43J859L049K970K059J593K101K837L017L021L627M518M629L982
$$ 885922 886237 886680 888539 891588 894558 896617 898210 900311 903148 906165 909186 912813 917331 921960 925942
63018I25942L824M589N013M115K908K949L847L722J891k29j076o85m8L24N09M40
$$ 925942 929766 934355 939368 943483 946391 949340 953187 956909 958800 958571 957495 956810 956762 957086 957595 958035
63002I58035k11j436k742l634m028m099l887l154j737k8J087R38k51j489j827
$$ 958035 957824 956388 953646 950012 945984 941885 937998 934844 933107 933079 934166 935104 934853 933364 931537
62987I31537j047K79J338J795K039K606L393L742L371K777K483K402K316K574
$$ 931537 930490 930769 932107 933902 935941 938547 941940 945682 949053 951830 954313 956715 959031 961605
62973I61605L579M847N248M278K599J263Q73J342J979J782L34j524k525k546k637
$$ 961605 965184 970031 975279 979557 982156 983419 984292 985634 987613 989395 989729 988205 985680 983134 980497
62958I80497l299l658k809j275l47n09j258k077k736k767j604N88K828M305M980
$$ 980497 977198 973540 970731 969456 969109 968600 967342 965265 962529 959762 958158 958746 961574 965879 970859
62943I70859N105M657L637K654K749M445O962Q665Q535P216O169N761M904K916
$$ 970859 975964 980621 984258 986912 989661 994106 1001068 1009733 1018268 1025484 1031653 1037414 1042318 1045234
62929A045234R02M13J329K148K128J911J901J421n8j860l117m062n535p723j0130
$$ 1045234 1046136 1046549 1047878 1050026 1052154 1054065 1055966 1057387 1057329 1055469 1052352 1048290 1042755 1035032 1024902
62914A024902j2385j4450j6285j7919j9551k1069k1885k1701k1109k0732k0335
$$ 1024902 1012517 998067 981782 963863 944312 923243 901358 879657 858548 837816 817481
62903H17481j9497j8747j8916j9600j9363j7540j4834j2049r374p210o459p176
$$ 817481 797984 779237 760321 740721 721358 703818 688984 676935 667561 660351 653892 646716
62891F46716p880p103n182l591l020l002l100l342l522l114k276k040l053m640
$$ 646716 638836 631733 626551 622960 619940 616938 613838 610496 606974 603860 601584 599544 596491 591851
62877E91851n616n616n103m552m197m310n002n792o122o313p254q811r436p979
$$ 591851 586235 580619 575516 570964 566767 562457 557455 551663 545541 539228 531974 523163 513727 505748
62863E05748n320l346k740k635k225j612j067n41k39o60j527j670o14N30N39l52
$$ 505748 500428 497082 494342 491707 489482 487870 486803 486262 486023 485363 483836 482166 481552 482082 482621 482269
62847D82269j185j686j897j264M08J659Q94r86j367L75J899J380J36M95K483M267
$$ 482269 481084 479398 477501 476237 476645 478304 479198 478212 476845 477220 479119 480499 480635 481130 483613 487880
62831D87880M890M800M206K811J252J048K559M209M460L699L442M335N743O871
$$ 487880 492770 497570 501776 504587 505839 506887 509446 513655 518115 521814 525256 529591 535334 542205
62817E42205P445P298O181M417L273L896N758O756N360K400J54k76J79K09k01
$$ 542205 549650 556948 563129 567546 570819 574715 580473 587229 592589 594989 595143 594867 595046 595255 595054
62802E95054l07N3M30N95N66J80n82r84k11J459K915L777M798O471P989Q158O857
$$ 595054 594747 594800 595230 595825 596391 596571 595989 595005 594794 596253 599168 602945 607743 614214 622203 630361 637218
62785F37218N219M566N378O967Q017P718O574N781N844O224O361O291O061N347
$$ 637218 642437 647003 652381 659348 667365 675083 681657 687438 693282 699506 705867 712158 718219 723566
62771G23566M242L726M535N814N859M075J587j90q35p19k94k3m46j744l407m704
$$ 723566 727808 731534 736069 741883 747742 751817 753404 753214 752379 751660 751366 751343 750897 749153 745746 741042
62755G41042n332n397n183n241o316q497j0719j1776j1831j2058j2800j2996j1852
$$ 741042 735710 730313 725130 719889 713573 705076 694357 682581 670750 658692 645892 632896 621044
62742F21044j0147r140q958q947r016r436r668q788p083n890n625n320m535m302
$$ 621044 610897 601757 592799 583852 574836 565400 555732 546944 539861 533971 528346 523026 518491 514189
62728E14189n188n805m651k595j882l073m603n266n522n908n662l842r72J368
$$ 514189 509001 503196 498545 495950 494068 490995 486392 481126 475604 469696 464034 460192 459220 460588
62714D60588K192J768R96O90J265K588M016M822M625L606K543K458L635N103N601
$$ 460588 462780 464548 465544 466234 467499 470087 474103 478925 483550 487156 489699 492157 495792 500895 506496
62699E06496N140M922N548O094N425L770K333J724J455Q31k40j330k010k174k034
$$ 506496 511636 516558 522106 528200 533625 537395 539728 541452 542907 543738 543498 542168 540158 537984 535950
62684E35950j777j339p28n59j657l879n813o180n335m937o155q499j0316j0255
$$ 535950 534173 532834 532106 531547 529890 526011 520198 514018 508683 503746 497591 489092 478776 468521
62670D68521q474o545n960o593o950o023m312k844j868j121o60o01n07j4K13p08
$$ 468521 460047 453502 447542 440949 433999 427976 423664 420820 418952 417831 417171 416570 416063 416049 416262 415554
62654D15554k245k806j836l35R99K741N011O168M781K204J490L666O600P934P850
$$ 415554 413309 410503 408667 408332 409331 412072 417083 423251 428032 430236 431726 435392 441992 449926 457776
62639D57776Q103R352J0580J0823J0381J0246J1034J2598J4266J5399J6080J7089
$$ 457776 465879 475231 485811 496634 507015 517261 528295 540893 555159 570558 586638 603727
62627F03727J8745K0014J9467J7120J4505J2751J1436R745P773N949L888Q40l041
$$ 603727 622472 642486 661953 679073 693578 706329 717765 727510 735283 741232 745120 745960 742919
62614G42919o787r810j2156j3765j4542j5077j6191j7550j7822j6593j5110j4453
$$ 742919 736132 726322 714166 700401 685859 670782 654591 637041 619219 602626 587516 573063
62602E73063j4071j2963j1450j0553j0228r515q397q084r098j0105r316o551l336
$$ 573063 558992 546029 534579 524026 513798 504283 495886 487802 478704 468599 459283 452732 449396
62589D49396j280p79j083j237q90m78n43r96j161n52N45J382J469R09K36L3O05
$$ 449396 448116 447337 446254 445017 444127 443649 443106 442110 440949 440397 440942 442324 443793 444702 444938 444971 445576
62572D45576J778K925L255K400Q87j09J48J104J552J173Q80J393K156K166J381
$$ 445576 447354 450279 453534 455934 456821 456712 456860 457964 459516 460689 461569 462962 465118 467284 468665
62557D68665N65J43N3M97J778L417M404M556M715N306N713N594N718O752Q030
$$ 468665 469230 469373 469426 469923 471701 475118 479522 484078 488793 494099 499812 505406 511124 517876 525906
62542E25906Q549Q534Q828R174Q501O893N943O665Q183R087R230R365R650R591
$$ 525906 534455 542989 551817 560991 569492 576385 582328 588993 597176 606263 615493 624858 634508 644099
62528F44099R159R000R263Q974P156M378K643L368N621O803N363K536Q29J062
$$ 644099 653258 662258 671521 680495 687651 692029 694672 698040 703661 710464 715827 718363 719192 720254
62514G20254J669R96p08k205l233m499o029o722n821m025k818l146m845o908q117
$$ 720254 721923 722919 722211 720006 716773 712274 706245 699523 693702 689677 686859 683713 678868 671960 663843
62499F63843p933p029o560o870p403p782q186q413p652n796m222m362n982p731
$$ 663843 655910 648881 642321 635451 628048 620266 612080 603667 596015 590219 585997 581635 575653 567922
62485E67922q939r860j0473j0240r178q085p350o399m759l094k617l848o142q030
$$ 567922 558983 549123 538650 528410 519232 511147 503797 497398 492639 489545 486928 483080 476938 468908
62471D68908q046n844k828j053j167j982k173j664r19J30J564K657K578J667J103
$$ 468908 460862 455018 452190 451137 449970 447988 445815 444151 443232 443362 444926 447583 450161 451828 452931
62456D52931J512K626M101N698O881P169P034P594R204J1069J2330J2783J2460
$$ 452931 454443 457069 461170 466868 473749 480918 487952 495546 504750 515819 528149 540932 553392
62443E53392J1362J0026R519J0320J1737J2726J2660J1010P334K475j079j347
$$ 553392 564754 574780 584299 594619 606356 619082 631742 642752 650086 652561 651482 650135
62431F50135P17K025P12k121m127m373l815l732m375n041n105m775m831n620o547
$$ 650135 650852 652877 653589 651468 647341 642968 639153 635421 631046 626005 620900 616125 611294 605674 599127
62416E99127o776o188n231m027k331n33R3j264l602m750l449n29K047L055K865
$$ 599127 592351 586163 580932 576905 574574 574041 574134 572870 569268 564518 561069 560540 562587 565642 568507
62401E68507K713L359M546N534N887N691N233M777M499M408M313M147M210M857
$$ 568507 571220 574579 579125 584659 590546 596237 601470 606247 610746 615154 619467 623614 627824 632681
62387F32681N925O903P644Q446R246R211P638N007K655J398P91j28j563k752l061
$$ 632681 638606 645509 653153 661599 670845 680056 687694 692701 695356 696754 697545 697417 695854 693102 690041
62372F90041l104m202o456p911o526k867J87P08l53r94p53l94N9J415L601N419
$$ 690041 686937 682735 676279 668368 661842 658975 659162 659870 659517 658523 657770 657376 657435 658850 662451 667870
62356F67870O236O723P470Q004P741P087O951P804R553J1690J3155J2996J1705
$$ 667870 674106 680829 688299 696303 704044 711131 718082 725886 735439 747129 760284 773280 784985
62343G84985J1104J2228J4089J5188J5359J5233J4841J4074J3812J5063J7152
$$ 784985 796089 808317 822406 837594 852953 868186 883027 897101 910913 925976 943128
62332I43128J8134J7086J4795J2323J0094Q594Q424R211R560Q762P629P167P285
$$ 943128 961262 978348 993143 1005466 1015560 1024154 1032578 1041789 1051349 1060111 1067740 1074907 1082192
62319A082192P425P683Q583J0200J2038J3481J4192J4754J6876K1893K8703L4364
$$ 1082192 1089617 1097300 1105883 1116083 1128121 1141602 1155794 1170548 1187424 1209317 1238020 1272384
62307A272384L7399L9424M2741M7516N2415N6886O1232O5140O7961P0234P3215
$$ 1272384 1309783 1349207 1391948 1439464 1491879 1548765 1609997 1675137 1743098 1813332 1886547
62296A886547P6701P8792P8177P5337P0928O4268N4488M2467L0565K0365J1336
$$ 1886547 1963248 2042040 2120217 2195554 2266482 2330750 2385238 2427705 2458270 2478635 2489971
62285B489971J817q935j9889k9392l7022m3848n0840n7665o3405o7731p0572p1290
$$ 2489971 2491788 2482853 2462964 2433572 2396550 2352702 2301862 2244197 2180792 2113061 2042489 1971199
62273A971199o9314o5392o1095n7222n3557n0007m6720m3310l9319l5556l3399
$$ 1971199 1901885 1836493 1775398 1718176 1664619 1614612 1567892 1524582 1485263 1449707 1416308
62262A416308l2460l0612k6939k3079k0684j9133j7080j4700j2785j0704p367
$$ 1416308 1383848 1353236 1326297 1303218 1282534 1263401 1246321 1231621 1218836 1208132 1200765
62251A200765l509r92o7P89K363L919N024O206P282O856M504J987J161J795K523
$$ 1200765 1197256 1196264 1196197 1196986 1199349 1203268 1208292 1214498 1221780 1228636 1233140 1235127 1236288 1238083 1240606
62236A240606K917L414M034M480M939N622N895N143M130M195N224N801N554N996
$$ 1240606 1243523 1246937 1250971 1255451 1260390 1266012 1271907 1277050 1281180 1285375 1290599 1296400 1301954 1307950
62222A307950Q451J2214J5481J7424J8538J9458K0303K1081K2093K3799K6518
$$ 1307950 1316401 1328615 1344096 1361520 1380058 1399516 1419819 1440900 1462993 1486792 1513310
62211A513310L0168L4112L7453L9868M2043M5012M9053N3513N7702O1601O5525
$$ 1513310 1543478 1577590 1615043 1654911 1696954 1741966 1791019 1844532 1902234 1963835 2029360
62200B029360O9436P2908P5795P8536Q1532Q4373Q5957Q5296Q1945P5630O6124
$$ 2029360 2098796 2171704 2247499 2326035 2407567 2491940 2577897 2663193 2745138 2820768 2886892
62189B886892N3816M0105K6690J4552L766o015j5263k4338l2939l9974m4657m7573
$$ 2886892 2940708 2980813 3007503 3022055 3025821 3019806 3004543 2980205 2947266 2907292 2862635 2815062
62177B815062m9942n1937n2649n1660m9631m7068m3679l9443l5227l1433k7032
$$ 2815062 2765120 2713183 2660534 2608874 2559243 2512175 2468496 2429053 2393826 2362393 2335361
62166B335361k1084j4667r988p824o928n768l742q54K531N399O833P484R205J2674
$$ 2335361 2314277 2299610 2289622 2281798 2274870 2269102 2265360 2264506 2267037 2272436 2279269 2286753 2295958 2308632
62152B308632J6310J8283J8837J9728K1914K4699K6964K8345K9181K9970L1132
$$ 2308632 2324942 2343225 2362062 2381790 2403704 2428403 2455367 2483712 2512893 2542863 2573995
62141B573995L2933L5457L8656M2359M6181M9609N2343N4484N6372N8543O1780
$$ 2573995 2606928 2642385 2681041 2723400 2769581 2819190 2871533 2926017 2982389 3040932 3102712
62130C102712O6575P2308P7334Q0305Q1079Q0207P8059P4819P0738O5793N9565
$$ 3102712 3169287 3241595 3318929 3399234 3480313 3560520 3638579 3713398 3784136 3849929 3909494
62119C909494N2197M5088L9776L6368L4060L3027L4600L9160M5021N0308N5122
$$ 3909494 3961691 4006779 4046555 4082923 4116983 4150010 4184610 4223770 4268791 4319099 4374221
62108D374221O0745O7091P2287P5069P6355P7631P8487P6837P1503O3621N5253
$$ 4374221 4434966 4502057 4574344 4649413 4725768 4803399 4881886 4958723 5030226 5093847 5149100
62097E149100M7430M0006L2788K6001J9750J3745P659J575l949q144j0671j2110
$$ 5149100 5196530 5236536 5269324 5295325 5315075 5328820 5336479 5338054 5334105 5325961 5315290 5303180
62085E303180j3411j4576j4519j2746j0307q327o247k932J007L719M919O350Q919
$$ 5303180 5289769 5275193 5260674 5247928 5237621 5229294 5223047 5220115 5221122 5224841 5229760 5236110 5245029
62072E245029J1198J1747J1398J1797J2838J3121J2404J1979J2853J4686J6401
$$ 5245029 5256227 5267974 5279372 5291169 5304007 5317128 5329532 5341511 5354364 5369050 5385451
62061E385451J6916J5548J2806J0522J0258J1631J2968J3288J2748J1676J0469
$$ 5385451 5402367 5417915 5430721 5441243 5451501 5463132 5476100 5489388 5502136 5513812 5524281
62050E524281J0069J1134J2668J2801J1092Q924P533O866O553O635O973P172P570
$$ 5524281 5534350 5545484 5558152 5570953 5582045 5590969 5598502 5605368 5611921 5618556 5625529 5632701 5640271
62037E640271R101J1693J3962J5055J5623J6436J7351J8432K0737K4768K9225
$$ 5640271 5649372 5661065 5675027 5690082 5705705 5722141 5739492 5757924 5778661 5803429 5832654
62026E832654L2637L5395L8800M2829M6368M9269N2508N6388N9956O2297O3031
$$ 5832654 5865291 5900686 5939486 5982315 6028683 6077952 6130460 6186848 6246804 6309101 6372132
62015F372132O1227N5262M4562L0787J6696M417m986j1136j4342j5685j6633j8756
$$ 6372132 6433359 6488621 6533183 6563970 6580666 6585083 6580097 6568961 6554619 6538934 6522301 6503545
62003F503545k3676l2381m3981n5801o5481p2815p9043q4843q9810r3579r6383
$$ 6503545 6479869 6447488 6403507 6347706 6282225 6209410 6130367 6045524 5955714 5862135 5765752
61992E765752r8422r9634j00459j01861j04057j05886j06198j05276j04050j02449
$$ 5765752 5667330 5567696 5467237 5365376 5261319 5155433 5049235 4943959 4839909 4737460
61982D737460r9709r6044r2572q9404q5228p9444p3493o9093o6142o3489o0981
$$ 4737460 4637751 4541707 4449135 4359731 4274503 4195059 4121566 4052473 3986331 3922842 3861861
61971C861861n9341n8398n6924n4346n1478m9348m8253m7989m8190m8179m7360
$$ 3861861 3802520 3744122 3687198 3632852 3581374 3532026 3483773 3435784 3387594 3339415 3292055
61960C292055m5927m4485m3032m1067l8709l6644l4945l3043l1001k9532k8482
$$ 3292055 3246128 3201643 3158611 3117544 3078835 3042191 3007246 2974203 2943202 2913670 2885188
61949B885188k6605k3455k0183j7708j5304j1980q226n220l139j465l76o71k574
$$ 2885188 2858583 2835128 2814945 2797237 2781933 2769953 2761727 2756507 2753368 2751903 2751527 2750856 2748282
61936B748282n554r099j3022j7474k3196l1024m0257m8312n3145n5478n7562o0241
$$ 2748282 2742728 2733629 2720607 2703133 2679937 2648913 2608656 2560344 2507199 2451721 2394159 2333918
61924B333918o2387o2762o1100n7687n3198m8868m5625m3019m0094l6982l4530
$$ 2333918 2271531 2208769 2147669 2089982 2036784 1987916 1942291 1899272 1859178 1822196 1787666
61913A787666l2626l0343k7695k5616k4172k2382k0138j8572j7901j6604j3728
$$ 1787666 1755040 1724697 1697002 1671386 1647214 1624832 1604694 1586122 1568221 1551617 1537889
61902A537889j0593r028q962q978q305p005m919j940J030K761L352M271O623J0150
$$ 1537889 1527296 1518268 1509306 1500328 1492023 1485018 1480099 1478159 1479189 1481950 1485302 1489573 1496196 1506346
61888A506346J3954J7428K0348K2678K4517K6030K7388K8892L0866L3173L5156
$$ 1506346 1520300 1537728 1558076 1580754 1605271 1631301 1658689 1687581 1718447 1751620 1786776
61877A786776L6480L7658L9243M0862M1545M0872L9276L7494L6242L6034L6675
$$ 1786776 1823256 1860914 1900157 1941019 1982564 2023436 2062712 2100206 2136448 2172482 2209157
61866B209157L7041L6187L4560L3515L3704L4816L6838M0620M6810N4897O3743
$$ 2209157 2246198 2282385 2316945 2350460 2384164 2418980 2455818 2496438 2543248 2598145 2661888
61855B661888P2547Q0916Q8702R6354J04937J15144J26422J37587J48107J58298
$$ 2661888 2734435 2815351 2904053 3000407 3105344 3220488 3346910 3484497 3632604 3790902
61845C790902J68474J78555J88485J98466K08517K18217K26943K34110K39033
$$ 3790902 3959376 4137931 4326416 4524882 4733399 4951616 5178559 5412669 5651702
61836E651702K40798K38201K29435K11930J83353J43306R3951L8784j8738p5367
$$ 5651702 5892500 6130701 6360136 6572066 6755419 6898725 6992676 7031460 7012722 6937355
61826F937355j27849j73673k11931k42663k65484k79647k85442k84542k78629
$$ 6937355 6809506 6635833 6423902 6181239 5915755 5636108 5350666 5066124 4787495
61817D787495k68510k55012k39780k24265k08353j91159j73040j55824j40861
$$ 4787495 4518985 4263973 4024193 3799928 3591575 3400416 3227376 3071552 2930691
61808B930691j27638j14862j02225r0444p9835o9689n9268m8796l9011l0022k1333
$$ 2930691 2803053 2688191 2585966 2495522 2415687 2345998 2286730 2237934 2198923 2168901 2147568
61797B147568j2930n576M04N873J1595J6635J9259J9502J9605K1301K3526K3754
$$ 2147568 2134638 2129062 2129466 2135339 2146934 2163569 2182828 2202330 2221935 2243236 2266762 2290516
61785B290516K1049J6893J3196J0295O926J789m841j0769j3509j2698j0546r394
$$ 2290516 2311565 2328458 2341654 2351949 2358875 2360664 2355823 2345054 2331545 2318847 2308301 2298907
61773B298907r246q417n977k550J096M847Q377J0531J0299P892M406P37l036p442
$$ 2298907 2289661 2281244 2275267 2272717 2273813 2278660 2287037 2297568 2307867 2315759 2320165 2320902 2317866 2310424
61759B310424j3003j9395k5312k9515l1903l2993l2745l0787k7690k4693k1857
$$ 2310424 2297421 2278026 2252714 2223199 2191296 2158303 2125558 2094771 2067081 2042388 2020531
61748B020531j7808j1978n980j665J435N437J1262J7638K3021K7461L2175L7859
$$ 2020531 2002723 1990745 1984765 1983100 1984535 1989972 2001234 2018872 2041893 2069354 2101529 2139388
61736B139388M3890M9142N3359N7561O2932O9439P6004Q2068Q8275R5446J03644
$$ 2139388 2183278 2232420 2285779 2343340 2406272 2475711 2551715 2633783 2722058 2817504 2921148
61725B921148J12730J23041J34811J47514J60652J74675J90285K07335K25426
$$ 2921148 3033878 3156919 3291730 3439244 3599896 3774571 3964856 4172191 4397617
61716D397617K45027K66608K89073L10808L32318L55829L81512M05858M25087
$$ 4397617 4642644 4909252 5198325 5509133 5841451 6197280 6578792 6984650 7409737
61707G409737M38619M47449M50060M42006M19185L79680L22516K47074J55123
$$ 7409737 7848356 8295805 8745865 9187871 9607056 9986736 10309252 10556326 10711449
61698A0711449N2278n3764j56002k48920l28041l90400m35378m64072m77985m78926
$$ 10711449 10763727 10709963 10553961 10305041 9977000 9586600 9151222 8687150 8209165 7730239
61688G730239m69744m53820m33555m10051l84307l57910l32245l07694k84069
$$ 7730239 7260495 6806675 6373120 5963069 5578762 5220852 4888607 4580913 4296844
61679D296844k61382k39886k19618k00293j81659j63931j47959j34585j23501
$$ 4296844 4035462 3795576 3575958 3375665 3194006 3030075 2882116 2747531 2624030
61670B624030j13127j02241r1433q2107p4385o7166o0233n4846n1685m9513m6787
$$ 2624030 2510903 2408662 2317229 2235122 2160737 2093571 2033338 1978492 1926807 1877294 1830507
61659A830507m3623m1186l9962l9701m0470m2397m4603m5533m4477m1951l8759
$$ 1830507 1786884 1745698 1705736 1666035 1625565 1583168 1538565 1493032 1448555 1406604 1367845
61648A367845l5491l2884l1521l0965k9904k7652k4963k3079k2291k1735k0455
$$ 1367845 1332354 1299470 1267949 1236984 1207080 1179428 1154465 1131386 1109095 1087360 1066905
61637A066905j8591j7333j7584j8723j9310j8885j8234j7713j6580j4681j3472
$$ 1066905 1048314 1030981 1013397 994674 975364 956479 938245 920532 903952 889271 875799
61626H75799j4013j4967j4194j1737r485q436q139q672j0876j4082j5612j3703
$$ 875799 861786 846819 832625 820888 811403 802967 794828 786156 775280 761198 745586 731883
61614G31883r631o045m257l970m444m845m335k946j873k104l233m271m952n466
$$ 731883 722252 716207 711950 707980 703536 698691 694356 691410 689537 687433 684200 679929 674977 669511
61600F69511n491m333j920R11L064L985M174M871O625Q241Q055O253M852N173
$$ 669511 664020 659687 657767 658678 661742 665727 669901 674772 681397 689638 697693 703946 708798 713971
61586G13971O437P204O928N685L852K590L137M714M763K407J41N25K678L910L609
$$ 713971 720408 727612 734540 740225 744077 746667 749804 754518 759281 761688 761829 762354 765032 768942 772551
61571G72551L304L752M286M797N909P124O957N451M570N404O510N884L246l57
$$ 772551 775855 779607 783893 788690 794599 801723 808680 814131 818701 824105 830615 836499 839745 839388
61557H39388m022p206r496j1023j2496j4161j5361j5582j5186j4674j3998j3114
$$ 839388 835366 828160 818664 807641 795145 780984 765623 750041 734855 720181 706183 693069
61545F93069j2439j2112j1500j0042q037o049m136k285r81n06j42J025K737L868
$$ 693069 680630 668518 657018 646976 638939 632890 628754 626469 625488 624982 624840 625865 628602 632470
61531F32470M024L977M349M671M174L181K997M385O465P503O835N737O020P866
$$ 632470 636494 640471 644820 649491 653665 656846 659843 664228 670693 678196 685031 690768 696788 704654
61517G04654R477R105P130N722O538R046J1272J1918J1457J1310J2347J4330J6475
$$ 704654 714131 723236 730366 736088 742626 751672 762944 774862 786319 797629 809976 824306 840781
61504H40781J8079J8777J8585J7784J6567J5055J3794J3777J5116J6157J5027
$$ 840781 858860 877637 896222 914006 930573 945628 959422 973199 988315 1004472 1019499
61493A019499J2174J0147J0414J1624J1669J0405R225Q809Q635Q282P917P492
$$ 1019499 1031673 1041820 1052234 1063858 1075527 1085932 1095157 1103966 1112601 1120883 1128800 1136292
61481A136292O530M849K832J034q6k72%m47k101l733l725k186p07j15L94J789
$$ 1136292 1142822 1147671 1150503 1151537 1151451 1151179 1151179 1150732 1148631 1144898 1141173 1138987 1138280 1138165 1138559 1140348
61465A140348L918O135Q324J0855J3987J7682K1674K5583K9188L2570L5767L8682
$$ 1140348 1144266 1150401 1158725 1169580 1183567 1201249 1222923 1248506 1277694 1310264 1346031 1384713
61453A384713M1662M5610N0931N6869O2641O8578P5142Q1520Q6583R0795R5489
$$ 1384713 1426375 1471985 1522916 1579785 1642426 1711004 1786146 1867666 1954249 2045044 2140533
61442B140533J00436J03839J04959J04856J03974J00691R3231Q1707O7313N0641
$$ 2140533 2240969 2344808 2449767 2554623 2658597 2759288 2852519 2934226 3001539 3052180
61432C052180L1995J2461o437k3662l8446m9922n7945o3717o8543p2253p3636
$$ 3052180 3084175 3096636 3090199 3066537 3028091 2978169 2920224 2856507 2787964 2715711 2642075
61421B642075p2159o8496o3629n8273n2996m8216m3845l9363l4272k8439k2212
$$ 2642075 2569916 2501420 2437791 2379518 2326522 2278306 2234461 2195098 2160826 2132387 2110175
61410B110175j6443j1993q930o401l384O24N615J1074J5977J9468K1888K4494
$$ 2110175 2093732 2081739 2072809 2066408 2063024 2063648 2069263 2080337 2096314 2115782 2137670 2162164
61398B162164K7827L0961L2705L2978L2554L2096L1916L2160L2706L3166L3329
$$ 2162164 2189991 2220952 2253657 2286635 2319189 2351285 2383201 2415361 2448067 2481233 2514562
61387B514562L3287L3039L2442L1675L1040L0160K8176K5005K1524J8255J4858
$$ 2514562 2547849 2580888 2613330 2645005 2676045 2706205 2734381 2759386 2780910 2799165 2814023
61376B814023J1378Q761P319N710K657j115l773m693m809n125n997p550r533j0972
$$ 2814023 2825401 2834162 2841481 2847191 2849848 2848733 2844960 2840267 2835458 2830333 2824336 2816786 2807253 2796281
61362B796281j1036j0421j0859j3001j5607j7094j7181j6731j6446j6197j5437
$$ 2796281 2785245 2774824 2763965 2750964 2735357 2718263 2701082 2684351 2667905 2651708 2636271
61351B636271j3988j2459j1795j2425j3867j5201j5688j5023j3433j1620j0205
$$ 2636271 2622283 2609824 2598029 2585604 2571737 2556536 2540848 2525825 2512392 2500772 2490567
61340B490567r089p769o152m360j809K486Q341J4286J9496K4749L0928L7696M4705
$$ 2490567 2481478 2473709 2467557 2463197 2461388 2463874 2472215 2486501 2505997 2530746 2561674 2599370 2644075
61327B644075N2821O2675P2817Q0937Q6646R1622R7217J03208J08753J13095J15224
$$ 2644075 2696896 2759571 2832388 2913325 2999971 3091593 3188810 3292018 3400771 3513866 3629090
61316C629090J14119J09765J02851R3278Q0060O3024M3620K3613L905j4922l1913
$$ 3629090 3743209 3852974 3955825 4049103 4129163 4192187 4235807 4259420 4263325 4248403 4216490
61305D216490m6403n8787p0022q0630r0526r9176j05548j08476j07950j05703
$$ 4216490 4170087 4111300 4041278 3960648 3870122 3770946 3665398 3556922 3448972 3343269
61295C343269j03636j01745r8231r1911q3910p6436p0320o4503n8000n1477m6182
$$ 3343269 3239633 3137888 3039657 2947746 2863836 2787400 2717080 2652577 2594577 2543100 2496918
61284B496918m2007l7750l3263l0063k9150k9251k8100k5001k1073j7268j3178
$$ 2496918 2454911 2417161 2383898 2353835 2324685 2295434 2267334 2242333 2221260 2203992 2190814
61273B190814q076k372K471N395O913Q722J1952J5870J8659J9483J9227J9063
$$ 2190814 2182738 2180366 2182837 2188232 2195145 2203867 2215819 2231689 2250348 2269831 2289058 2308121
61261B308121J9045J8536J7385J6031J4811J3701J2447J0579P807M832L198L780
$$ 2308121 2327166 2345702 2363087 2379118 2393929 2407630 2420077 2430656 2438463 2443295 2446493 2450273
61249B450273N753P493P935O882M811L044L092M848O128N027K192l41k001m186
$$ 2450273 2456026 2463519 2471454 2478336 2483147 2486191 2489283 2494131 2500259 2505286 2507478 2507137 2505136 2500950
61235B500950q257j4120k0601k6181k9618l0849l1138l1517l1417k9735k6703
$$ 2500950 2492693 2478573 2457972 2431791 2402173 2371324 2340186 2308669 2277252 2247517 2220814
61224B220814k3604k1015j8689j6739j5466j4188j1855q973p342p449p617o304
$$ 2220814 2197210 2176195 2157506 2140767 2125301 2111113 2099258 2090285 2082943 2075494 2067877 2061573
61212B061573l991j962k09K453O623J1453J5478J8081K0058K2593K5569K7587
$$ 2061573 2057582 2055620 2055411 2057864 2064487 2075940 2091418 2109499 2129557 2152150 2177719 2205306
61200B205306K8097K8601L0742L4011L6744L8674M0806M3139M4427M4220M3251
$$ 2205306 2233403 2262004 2292746 2326757 2363501 2402175 2442981 2486120 2530547 2574767 2618018
61189B618018M1532L8038L2878K7961K4532K1454J6850J0121J567q670k0158l1643
$$ 2618018 2659550 2697588 2730466 2758427 2782959 2804413 2821263 2831384 2832951 2824281 2804123 2772480
61177B772480m1878n0306n6381n9400n9736n9033n8281n6779n3882n0465m7525
$$ 2772480 2730602 2680296 2623915 2564515 2504779 2445746 2387465 2330686 2276804 2226339 2178814
61166B178814m4465m0401l6234l3655l2471l0673k7333k4031k2891k3973k5169
$$ 2178814 2134349 2093948 2057714 2024059 1991588 1960915 1933582 1909551 1886660 1862687 1837518
61155A837518k4270k0922j6712j3496j1730j0525q997o942m356j274J658L362
$$ 1837518 1813248 1792326 1775614 1762118 1750388 1739863 1730866 1723924 1719568 1718294 1719952 1723314
61143A723314L551L121K950L036L199L782N011O384P247P489P207O352N246M772
$$ 1723314 1726865 1729986 1732936 1735972 1739171 1742953 1747964 1754348 1761595 1769084 1776291 1782643 1787889 1792661
61129A792661N460O707P252N966K224l590r754j4303j6879j8667k0370k1432k1526
$$ 1792661 1798121 1804828 1812080 1818046 1820270 1816680 1806926 1792623 1775744 1757077 1736707 1715275 1693749
61116A693749k1396k1603k1880k2385k4107k7012k9347l0000l0086l0715l0716
$$ 1693749 1672353 1650750 1628870 1606485 1582378 1555366 1526019 1496019 1465933 1435218 1404502
61105A404502k8575k5446k3827k3751k2796j9880j6778j5183j4250j2165q892
$$ 1404502 1375927 1350481 1326654 1302903 1280107 1260227 1243449 1228266 1214016 1201851 1192959
61094A192959o040m617l993l006j321N35K126L740N919Q651J1414J3680J4870
$$ 1192959 1186919 1182302 1178309 1175303 1173982 1174517 1176643 1180383 1186302 1194953 1206367 1220047 1234917
61081A234917J3991J0413N120K22l102n268o802p485p371p211o992n469k207J008
$$ 1234917 1248908 1259321 1264441 1264663 1261561 1256293 1249491 1242006 1234635 1227424 1220432 1214963 1212756 1213764
61067A213764K112J146l89j564k184j936r09k63r16k088k466k229k553l646m628
$$ 1213764 1215876 1217022 1216633 1215069 1212885 1210949 1210040 1209777 1208861 1206773 1204307 1202078 1199525 1195879 1191251
61052A191251m903m375k843o16Q10K42j353j926j018N2L51J80o9m22o85o21q88
$$ 1191251 1186348 1181973 1179130 1178514 1179324 1179566 1178213 1176287 1175269 1175321 1175672 1175852 1175783 1175361 1174676 1174055 1173167
61035A173167k605n881r613j2621j4202j4120j3039j2361j2562j2470j1408j0884
$$ 1173167 1170562 1164681 1155068 1142447 1128245 1114125 1101086 1088725 1076163 1063693 1052285 1041401
61023A041401j2291j3862j2437p981l900k651l326l944l882l200j606P66K818
$$ 1041401 1029110 1015248 1002811 994830 990930 988279 984953 981009 977127 973927 972321 973087 975905
61010I75905L754L848L529K843K266K695M093N245N475N504O087O915P391P453
$$ 975905 979659 983507 987036 989879 992145 994840 998933 1004178 1009653 1015157 1021244 1028159 1035550 1043003
60996A043003P188O513N752N648O355P255Q002Q960J0365J1869J3104J3881J3811
$$ 1043003 1050191 1056704 1062456 1068104 1074459 1081714 1089716 1098676 1109041 1120910 1134014 1147895 1161706
60983A161706J2615J0930R928J0094J1058J2506J4372J6301J7841J8980J9807
$$ 1161706 1174321 1185251 1195179 1205273 1216331 1228837 1243209 1259510 1277351 1296331 1316138
60972A316138K0083K0041K0856K3201K5986K7748K8514K9025K9254K9264L0291
$$ 1316138 1336221 1356262 1377118 1400319 1426305 1454053 1482567 1511592 1540846 1570110 1600401
60961A600401L2859L4981L4633L3187L3664L6366L9082M1108M3866M7650N1059
$$ 1600401 1633260 1668241 1702874 1736061 1769725 1806091 1845173 1886281 1930147 1977797 2028856
60950B028856N3892N7515O2031O6099O9916P5333Q2491Q9363R5326J02006J10012
$$ 2028856 2082748 2140263 2202294 2268393 2338309 2413642 2496133 2585496 2680822 2782828 2892840
60939B892840J18020J25895J35505J47467J60222J73182J87532K03122K18079
$$ 2892840 3010860 3136755 3272260 3419727 3579949 3753131 3940663 4143785 4361864
60930D361864K32491K48812K67433K85578L01702L17225L32877L47875L63966
$$ 4361864 4594355 4843167 5110600 5396178 5697880 6015105 6347982 6695857 7059823
60921G059823L85496M13692M45761M81435N24784N77145O34290O93698P58646
$$ 7059823 7445319 7859011 8304772 8786207 9310991 9888136 10522426 11216124 11974770
60912A1974770Q32250R14848J011437J133124J284902J459648J650602J860275
$$ 11974770 12807020 13721868 14733305 15866429 17151331 18610979 20261581 22121856
60904B2121856K089326K329754K583165K873611L224310L635978M113928M689991
$$ 22121856 24211182 26540936 29124101 31997712 35222022 38858000 42971928 47661919
60896D7661919N341030N853541N844351N031584L527990J824107M43548l76077
$$ 47661919 53002949 58856490 64700841 69732425 73260415 75084522 75528070 75151993
60888G5151993o76270n59259j02666M98069Q34756M84711o48089k224503l722326
$$ 75151993 74475723 73916464 73813798 74311867 75146623 75631334 74983245 72758742 69036416
60879F9036416m782999n335675n479211n333444m996320m558440m094665l643757
$$ 69036416 64253417 58917742 53438531 48105087 43108767 38550327 34455662 30811905
60871C0811905l217486k825216k477432k174162j906762j670580j466569j292745
$$ 30811905 27594419 24769203 22291771 20117609 18210847 16540267 15073698 13780953
60863A3780953j142953j012896r00419q01489p12201o33394n67599n12827m64392
$$ 13780953 12638000 11625104 10724685 9923196 9210995 8577601 8010002 7497175 7032783
60854G032783m20897l83173l49289l16469k86694k64577k50232k39213k28918
$$ 7032783 6611886 6228713 5879424 5562955 5276261 5011684 4761452 4522239 4293321
60845D293321k19815k10726j98352j82323j66284j53077j42352j33260j25783
$$ 4293321 4073506 3862780 3664428 3482105 3315821 3162744 3020392 2887132 2761349
60836B761349j18897j10871j02085r4621q8855q3312p7865p3831p0728o6345o0432
$$ 2761349 2642452 2531581 2429496 2334875 2246020 2162708 2084843 2011012 1940284 1873939 1813507
60825A813507n5291n2065m9436m6483m4059m2595m1167l9336l7534l5325l1838
$$ 1813507 1758216 1706151 1656715 1610232 1566173 1523578 1482411 1443075 1405541 1370216 1338378
60814A338378k8214k6891k7999k9099k8867k8280k7722k5950k2817k0097j8546
$$ 1338378 1310164 1283273 1255274 1226175 1197308 1169028 1141306 1115356 1092539 1072442 1053896
60803A053896j6843j4562j3354j3757j3556j1069p845o215o192o526o916p266
$$ 1053896 1037053 1022491 1009137 995380 981824 970755 962910 956695 950503 943977 937061 929795
60791I29795o472m039j692j375k606l566l806m038m016k670k84J186L55k133m626
$$ 929795 923323 919284 917592 916217 913611 910045 906239 902201 898185 895515 895231 896417 896772 894639 890013
60776H90013o295p514q753r520q787o499l965k269q70J206L420M219L224J571
$$ 890013 883718 876204 867451 857931 849144 842645 838680 836411 835541 836747 840167 844386 847610 849181
60762H49181K62m42j79J298K943L164K080J407J795J882O72q21j095n7J376K418
$$ 849181 849443 849001 848822 850120 853063 856227 858307 859714 861509 863391 864063 863242 862147 862090 863466 865884
60746H65884K498J407J01K69K295M586N541N320N170N922P533R130R304P448M999
$$ 865884 868382 869789 869890 870159 872454 877040 882581 887901 893071 898993 906526 915656 924960 932408 937407
60731I37407M047M532M357K625Q58M02N31J22n78j208k564m989o842o439m659
$$ 937407 941454 945986 950343 952968 953826 954228 954759 954881 954303 953095 950531 945542 938700 932261 927602
60716I27602l848m618n432n105m169l751m178n003n585n491m659l328j762l88
$$ 927602 923754 919136 913704 908599 904430 900679 896501 891498 885913 880422 875763 872435 870673 870285
60702H70285J9r63k422k772j652j89Q35J885L256M107L783L049K971L468L877
$$ 870285 870304 869341 866919 864147 862495 862306 863141 865026 868282 872389 876172 879221 882192 885660 889537
60687H89537M278N195O500P487P681O983N428L397J656O43J06m03j074k019l146
$$ 889537 893815 899010 905510 912997 920678 927661 933089 936486 938142 938785 938891 938488 937414 935395 932249
60672I32249l880l909m138n765q270r777r670r414j0221j1538j2502j3331j4244
$$ 932249 928369 924460 920322 914557 906287 896510 886840 877426 867205 855667 843165 829834 815590
60659H15590j4430j3205j1155r194p534o370o329p324q181q257q180q243p627
$$ 815590 801160 787955 776800 767606 760072 753702 747373 740049 731868 723611 715431 707188 699561
60646F99561o247n649o718q031q010p198o910p043o893o688o586n560l257j481
$$ 699561 693314 687665 680947 672916 664906 657708 650798 643755 636862 630174 623588 618028 614771 613290
60632F13290j727k536j707M8L22j004j765j038J24J187K649L987L846K678K746
$$ 613290 611563 609027 607320 607368 607690 606686 604921 603883 604007 605194 607843 611830 615676 618354 621100
60617F21100M829P088P853P644P689Q204Q796R140Q683P189N856O316Q198R345
$$ 621100 625929 633017 640870 648514 656203 664407 673203 682343 691026 698215 704071 710387 718585 727930
60603G27930Q853Q153Q569R541J0004R932R764R597R781J0911J2693J3960J4305
$$ 727930 736783 744936 753505 763046 773050 782982 792746 802343 812124 823035 835728 849688 863993
60590H63993J4382J4352J3663J2805J3396J5692J7725J7902J6744J5066J2300
$$ 863993 878375 892727 906390 919195 932591 948283 966008 983910 1000654 1015720 1028020
60579A028020Q088L966J674Q64J49o16q32j070k561n004o706o906o605o892p661
$$ 1028020 1036108 1040074 1041748 1042612 1042761 1042145 1041313 1040243 1037682 1032678 1025972 1019066 1012461 1005569 997908
60564I97908q228q322q059p503o563n165l519k228j766j696r79O10K071K607K732
$$ 997908 989680 981358 973299 965796 959233 954068 950549 948321 946555 944859 943880 944490 946561 949168 951900
60549I51900L269M044M482N034O888J0291J4010J6592J7641J7754J7687J7715
$$ 951900 955169 959213 963695 968729 975617 985908 999918 1016510 1034151 1051905 1069592 1087307
60537A087307J7642J7281J6775J6227J5220J3283J0796Q677P022M916J975p29
$$ 1087307 1104949 1122230 1139005 1155232 1170452 1183735 1194531 1203208 1210230 1215146 1217121 1216392
60525A216392k000k062k040k298k203j397o34j141l356o252q058p900o758o347
$$ 1216392 1214392 1212330 1210290 1207992 1205789 1204392 1203758 1202617 1199261 1193009 1184951 1177051 1170293 1163946
60511A163946p094p935q047p809p680p300o368n483n212m959l820k009n21K17
$$ 1163946 1156852 1148917 1140870 1133061 1125381 1118081 1111713 1106230 1101018 1096059 1092239 1090230 1089709 1089926
60497A089926M46K01n60j089k76J864M048N347O220P566R393J0937J1777J2348
$$ 1089926 1090372 1090573 1090013 1088924 1088648 1090512 1094560 1099907 1106127 1113693 1123086 1134023 1145800 1158148
60483A158148J3419J5317J7664J9723K1054K1948K3283K5879K9768L4113L8049
$$ 1158148 1171567 1186884 1204548 1224271 1245325 1267273 1290556 1316435 1346203 1380316 1418365
60472A418365M1844M6859N3979O2288O9990P6541Q3105R0876R9777J09042J18213
$$ 1418365 1460209 1507068 1561047 1623335 1693325 1769866 1852971 1943847 2043624 2152666 2270879
60461B270879J26917J34278J39235J41019J38763J31205J17674R9196P8009N6157
$$ 2270879 2397796 2532074 2671309 2812328 2951091 3082296 3199970 3299166 3377175 3433332
60451C433332L5188J6865K979o164j2374j8133k4585l1298l7722m4173n1012n7313
$$ 3433332 3468520 3485385 3488364 3482200 3469826 3451693 3427108 3395810 3358088 3313915 3262903 3205590
60439C205590o1078o0985n7425n1471m3389l2787j9973o196P542K1246L5186M9079
$$ 3205590 3144512 3083527 3026102 2974631 2931242 2898455 2878482 2872286 2879828 2901074 2936260 2985339
60427B985339O2379P4890Q6675R7477J06456J12201J13061J08080R8021Q5133
$$ 2985339 3047718 3122608 3209283 3306760 3413216 3525417 3638478 3746558 3844579 3929712
60417C929712P1673N8963M8136M1201M0637M7774O1848Q0735J02596J26981J54474
$$ 3929712 4001385 4060348 4108484 4149685 4190322 4238096 4299944 4380679 4483275 4610256 4764730
60406D764730J85422K19310K55436K93659L34065L76314M20071M65722N13794
$$ 4764730 4950152 5169462 5424898 5718557 6052622 6428936 6849007 7314729 7828523
60397G828523N63623O13285O60632P03303P37141P55051P47705P05581O21707
$$ 7828523 8392146 9005431 9666063 10369366 11106507 11861558 12609263 13314844 13936551
60388A3936551M94641L29936J38501o6209k69225m54171o06170p16872p86196
$$ 13936551 14431192 14761128 14899629 14833420 14564195 14110024 13503854 12786982 12000786
60379A2000786q18849q20649p98349p60111p13087o60987o05636n50241m98939
$$ 12000786 11181937 10361288 9562939 8802828 8089741 7428754 6823118 6272877 5773938
60370E773938m53240m11130l70373l31272k95567k63985k36008k11182j89439
$$ 5773938 5320698 4909568 4539195 4207923 3912356 3648371 3412363 3201181 3011742
60361C011742j70392j53244j37623j23795j11877j01340r1765q3658p7781p3679
$$ 3011742 2841350 2688106 2550483 2426688 2314811 2213471 2121706 2038048 1960267 1886588
60351A886588o9668o4683n9341n4600n0224m5710m1941m0299m0153l9052l5820
$$ 1886588 1816920 1752237 1692896 1638296 1588072 1542362 1500421 1460122 1419969 1380917 1345097
60340A345097l1978k9312k7536k5449k3169k1715k1083k0270j8916j7643j6667
$$ 1345097 1313119 1283807 1256271 1230822 1207653 1185938 1164855 1144585 1125669 1108026 1091359
60329A091359j5219j2750r995q430q708r858j0207r200q055q121r021r304q552
$$ 1091359 1076140 1063390 1053395 1044965 1036257 1026399 1016192 1006992 998937 990816 981795 972491 963939
60316I63939p624o783n300l289k242k796l557l362l323n013p721r296r091q422
$$ 963939 956315 949532 944232 940943 938701 935905 932348 928986 925663 920650 912929 903633 894542 886120
60302H86120q408q834r021q574p425o163n941p109q364q283p104n927m952l974
$$ 886120 877712 868878 859857 851283 843858 837695 831754 824645 816281 807998 800894 794967 790015 786041
60288G86041l772n101o714o444m209k069j174o69L7K2j193k208j450P80L026M430
$$ 786041 782269 777168 770454 764010 759801 757732 756558 755889 755926 755948 754755 752547 751097 751877 754903 759333
60272G59333M806L993K312J160J939M501P324R039R400Q989Q612Q846R853J1391
$$ 759333 764139 768132 770444 771604 773543 778044 785368 794407 803807 812796 821408 830254 840107 851498
60258H51498J2903J3521J2435R848P371O572P067O807M494J068j541k536k720
$$ 851498 864401 877922 890357 900205 907576 914148 921215 928022 932516 933584 932043 929507 926787
60245I26787l305m653o118o778o269m956l385j949j099j368k823m870o867q502
$$ 926787 923482 918829 912711 905933 899664 894708 891323 889374 888275 886907 884084 879214 872347 863845
60231H63845r352q919p588o723p083p878q041p505o465m521j896k17m41r10N37
$$ 863845 854493 845574 837986 831263 824180 816302 808261 800756 794291 789770 787874 787657 787216 786306 786843
60216G86843L313N054N391O199Q135R537R336Q620Q453Q238P515P396Q797J0605
$$ 786843 790156 795210 800601 806800 814935 824472 833808 842428 850881 859119 866634 874030 882827 893432
60202H93432J1074R992Q382P121O791P815R724J1283J2199J3596J5930J7795J8029
$$ 893432 904506 914498 922880 930001 936792 944607 954331 965614 977813 991409 1007339 1025134 1043163
60189A043163J7794J9127K2342K6244L0031L3568L6489L8541M0469M3189M6413
$$ 1043163 1060957 1080084 1102426 1128670 1158701 1192269 1228758 1267299 1307768 1350957 1397370
60178A397370M9117N0932N2068N2519N2590N3414N5544N7529N7649N6616N6661
$$ 1397370 1446487 1497419 1549487 1602006 1654596 1708010 1763554 1821083 1878732 1935348 1992009
60167A992009N7824N7175N2443M4775L6927K9982K3192J6268J0243N943K679q69
$$ 1992009 2049833 2107008 2159451 2204226 2241153 2271135 2294327 2310595 2320838 2326781 2329460 2328591
60155B328591m886q175r720r950r974r907q737n769j401L732R418J5154J9822
$$ 2328591 2323705 2315530 2305810 2295860 2285886 2275979 2267242 2261473 2260072 2263804 2273222 2288376 2308198
60142B308198K3058K6318L1395L8123M4634M9787N4230N8887O3385O6495O7502
$$ 2308198 2331256 2357574 2388969 2427092 2471726 2521513 2575743 2634630 2698015 2764510 2832012
60131B832012O6645O4485O1196N6377M9548M1009L2124K4339J7897J1812N138
$$ 2832012 2898657 2963142 3024338 3080715 3130263 3171272 3203396 3227735 3245632 3257444 3262582
60120C262582k068r056j5169k0066k3513k5265k5098k2765j8087j1420l917L164
$$ 3262582 3260514 3251458 3236289 3216223 3192710 3167445 3142347 3119582 3101495 3090075 3086158 3089322
60108C089322R809J7560K7757L9566N0519N9335O7151P5325Q2849Q7269Q7615
$$ 3089322 3099131 3116691 3144448 3184014 3234533 3293868 3361019 3436344 3519193 3606462 3694077
60097C694077Q4921P9842P1310N8244M1426K3041N203j0508k3002l2129l8664
$$ 3694077 3778998 3858840 3930150 3988394 4029820 4052861 4058064 4047556 4024554 3992425 3953761
60086C953761m3132m5212m4776m2818m0388l7064l1536k3564j4475n639K917J2233
$$ 3953761 3910629 3865417 3820641 3777823 3737435 3700371 3668835 3645271 3630796 3625157 3628074 3640307
60074C640307K3086L5261M7977O0945P4650Q9357J04228J18146J31163J44194
$$ 3640307 3663393 3698654 3746631 3807576 3882226 3971583 4075811 4193957 4325120 4469314
60064D469314J57303J69320J79433J87972J95091J99715K00585J97570J91042
$$ 4469314 4626617 4795937 4975370 5163342 5358433 5558148 5758733 5956303 6147345
60055F147345J80773J66247J47563J25344J00178P2799M4118J4540j6051m6967
$$ 6147345 6328118 6494365 6641928 6767272 6867450 6940249 6984367 6998907 6982856 6935889
60045F935889p6308j02635j26073j46741j63141j73452j77732j77397j73245j65528
$$ 6935889 6859581 6756946 6630873 6484132 6320991 6147539 5969807 5792410 5619165 5453637
60035E453637j55387j44323j32283j17987j01237q3439o5721m8248l1611j7102
$$ 5453637 5298250 5153927 5021644 4903657 4802420 4718981 4653260 4605012 4573401 4556299
60025D556299m820O881J8946K9820L7354M1613M4553M7309M8969M7929M3736L7547
$$ 4556299 4551479 4558360 4577306 4607126 4644480 4686093 4730646 4777955 4826924 4874853 4918589 4956136
60013D956136L1327K6525K3136K0146J6996J4271J2736J2177J1660J0651R352
$$ 4956136 4987463 5013988 5037124 5057270 5074266 5088537 5101273 5113450 5125110 5135761 5145113
60002E145113Q160P098N600K627k626r786j7473k4878l2702m1871n1571n9611
$$ 5145113 5153273 5160371 5165971 5168598 5165972 5156186 5138713 5113835 5081133 5039262 4987691 4928080
59990D928080o4675o7232o7934o6375o2160n6241m9914m2948l4105k3494j3112
$$ 4928080 4863405 4796173 4728239 4661864 4599704 4543463 4493549 4450601 4416496 4393002 4379890
59979D379890m695J886P605J2685J6607J8690J7983J3707O751m07o606j3795k4124
$$ 4379890 4375195 4377081 4384686 4397371 4413978 4432668 4450651 4464358 4471109 4470702 4464096 4450301 4426177
59966D426177l6082m5814n2197n8143o6262p5273q1901q4667q4459q2567p9602
$$ 4426177 4390095 4344281 4292084 4233941 4167679 4092406 4010505 3925838 3841379 3758812 3679210
59955C679210p5659p0346o3084n4179m5070l6795k8783j9857r818O24J0848K0549
$$ 3679210 3603551 3533205 3470121 3415942 3370872 3334077 3305294 3285437 3275619 3276243 3287091 3307640
59943C307640K9618L8407M7504N6721O4999P1793P7618Q2711Q6211Q7303Q6075
$$ 3307640 3337258 3375665 3423169 3479890 3544889 3616682 3694300 3777011 3863222 3950525 4036600
59932D036600Q2495P5781O5892N4386M2583K9910J5514N06j3008k4387l4504m3928
$$ 4036600 4119095 4194876 4260768 4315154 4357737 4387647 4403161 4403667 4390659 4366272 4331768 4287840
59920D287840n2547o0292o6690p0288p0069o7030o2830n7484n0049m0963l1789
$$ 4287840 4235293 4175001 4108311 4038023 3967954 3900924 3838094 3780610 3730561 3689598 3657809
59909C657809k2886j3355l188O411J4953K3180L1496L9495M7036N4125N9804O3006
$$ 3657809 3634923 3621568 3618380 3624791 3639744 3662924 3694420 3733915 3780951 3835076 3894880 3957886
59897C957886O4490O5874O6657O4659N9882N5306N2678M9938M4479L6967L0018
$$ 3957886 4022376 4088250 4154907 4219566 4279448 4334754 4387432 4437370 4481849 4518816 4548834
59886D548834K4643K0221J6936J5969J7566K0812K5332L1786M0524N0894O2073
$$ 4548834 4573477 4593698 4610634 4626603 4644169 4664981 4690313 4722099 4762623 4813517 4875590
59875D875590P3773Q6027R8895J12442J26458J40225J52850J63648J71850J76350
$$ 4875590 4949363 5035390 5134285 5246727 5373185 5513410 5666260 5829908 6001758 6178108
59865F178108J76317J71700J62532J47961J26702R8571O5003K8071j0490m9051
$$ 6178108 6354425 6526125 6688657 6836618 6963320 7061891 7126894 7154965 7144475 7095424
59855G095424q5303j16633j41627j60872j75542j85315j88597j85147j77409j68337
$$ 7095424 7010121 6893488 6751861 6590989 6415447 6230132 6041535 5856388 5678979 5510642
59845E510642j58605j47051j33309j18560j03759q8556p2468n5967l9927k4603
$$ 5510642 5352037 5204986 5071677 4953117 4849358 4760802 4688334 4632367 4592440 4567837
59835D567837r662N179J9716L3054M3986N2032N7831O1920O3551O1640N6279M8095
$$ 4567837 4558175 4563354 4583070 4616124 4660110 4712142 4769973 4831893 4895444 4957084 5013363 5061458
59823E061458L6579K0705J193j9562m0029o0444q0809r9613j15299j27515j36256
$$ 5061458 5098037 5118742 5119935 5100373 5060344 4999900 4919091 4819478 4704179 4576664 4440408
59812D440408j41203j42798j42678j41964j40064j36145j30794j25220j19612
$$ 4440408 4299205 4156407 4013729 3871765 3731701 3595556 3464762 3339542 3219930
59803C219930j13285j05807r7215q7745p8105o9180o0897n2237m3009l4665k8458
$$ 3219930 3106645 3000838 2903623 2815878 2737773 2668593 2607696 2555459 2512450 2477785 2449327
59792B449327k3775j9252j4646j0599p381n015l933m240m838m439l117j914j301
$$ 2449327 2425552 2406300 2391654 2381055 2373674 2368659 2364726 2360486 2355648 2351209 2348092 2346178 2344877
59779B344877j026j067j713k936m449o118p711q794r630j1467j4936j8779k1231
$$ 2344877 2343851 2342784 2341071 2338135 2333686 2327568 2319857 2311063 2301433 2289966 2275030 2256251 2235020
59766B235020k2161k2701k3239k2993k1314j8241j4054r503o113m784m149j819
$$ 2235020 2212859 2190158 2166919 2143926 2122612 2104371 2090317 2080814 2074701 2069917 2065768 2063949
59754B063949K609P244J0908J4787K0294K6794L2686L7730M2716M7147M8895M6607
$$ 2063949 2066558 2073802 2084710 2099497 2119791 2146585 2179271 2217001 2259717 2306864 2355759 2402366
59742B402366M1506L6234L2491L0420K9625K9759K9966K8724K4976J9062J2076
$$ 2402366 2443872 2480106 2512597 2543017 2572642 2602401 2632367 2661091 2686067 2705129 2717205
59731B717205M745k444q431j1842j2049r356m259K616J0181J7648K5665L5369
$$ 2717205 2721950 2719506 2711075 2699233 2687184 2677828 2673569 2676185 2686366 2704014 2729679 2765048
59719B765048M6153N5909O4055P2727Q3843R6281J07435J16580J25176J34432
$$ 2765048 2811201 2867110 2931165 3003892 3087735 3184016 3291451 3408031 3533207 3667639
59709C667639J44221J53995J62983J69239J69802J62218J45131J17675Q0037L5369
$$ 3667639 3811860 3965855 4128838 4298077 4467879 4630097 4775228 4892903 4972940 5008309
59699E008309j0149n0433q2545j06323j21890j28787j27377j19834j08991r6668
$$ 5008309 4998160 4947727 4865182 4758859 4636969 4508182 4380805 4260971 4151980 4055312
59689D055312q3609p0462n7755m5060l1451j7324m596N792J5456K6290L7496M6905
$$ 4055312 3971703 3901241 3843486 3798426 3766975 3749651 3745055 3750847 3766303 3792593 3830089 3876994
59677C876994N4851O4288P6610Q9640J00896J10851J21479J33300J45745J59166
$$ 3876994 3931845 3996133 4072743 4162383 4263279 4374130 4495609 4628909 4774654 4933820
59667D933820J74328J90574K06504K22159K38673K56051K73186K90115L08272
$$ 4933820 5108148 5298722 5505226 5727385 5966058 6222109 6495295 6785410 7093682
59658G093682L28063L47668L64978L79302L90569L98044M00817L98766L92182
$$ 7093682 7421745 7769413 8134391 8513693 8904262 9302306 9703123 10101889 10494071
59649A0494071L81116L65914L48057L29699L12539K97494K85179K75991K69612
$$ 10494071 10875187 11241101 11589158 11918857 12231396 12528890 12814069 13090060 13359672
59640A3359672K64707K59342K51683K40499K25191K05605J81898J54501J23951
$$ 13359672 13624379 13883721 14135404 14375903 14601094 14806699 14988597 15143098 15267049
59631A5267049R0806N6100K1860r384l5848n6953p2464q1770q4331q0293p0244
$$ 15267049 15357855 15413955 15435815 15426431 15390583 15333630 15261166 15179396 15095065 15014772 14944528
59620A4944528n4704l4149r147J9872N2365Q6963J21757J55809J89704K24004
$$ 14944528 14889824 14855675 14846528 14866400 14918765 15005728 15127485 15283294 15472998 15697002
59610A5697002K57775K89174L16634L38531L52453L56074L48449L29357K97547
$$ 15697002 15954777 16243951 16560585 16899116 17251569 17607643 17956092 18285449 18582996
59601A8582996K50696J87387J08669J8013p9554j78401k73296l59716m33404m90690
$$ 18582996 18833692 19021079 19129748 19147761 19068207 18889806 18616510 18256794 17823390 17332700
59591A7332700n30195n53598n63712n62195n49941n29002n02523m73039m42233
$$ 17332700 16802505 16248907 15685195 15123000 14573059 14044057 13541534 13068495 12626262
59582A2626262m12419l86935l68808l60025l61818l73862l92432m10903m23381
$$ 12626262 12213843 11826908 11458100 11098075 10736257 10362395 9969963 9559060 9135679
59573I135679m27626m24234m14237l98435l78194l55312l30947l05559k80001
$$ 9135679 8708053 8283819 7869582 7471147 7092953 6737641 6406694 6101135 5821134
59564E821134k55942k34594k15389j96487j76848j57533j40625j26902j15069
$$ 5821134 5565192 5330598 5115209 4918722 4741874 4584341 4443716 4316814 4201745
59555D201745j03430r1864q1762p4290o9121o4721n9728n4133m9291m6465m5398
$$ 4201745 4098315 4006451 3924689 3850399 3781278 3716557 3656829 3602696 3553405 3506940 3461542
59544C461542m4694m3767m3625m5405m8791n2453n5389n7219n7694n6810n5155
$$ 3461542 3416848 3373081 3329456 3284051 3235260 3182807 3127418 3070199 3012505 2955695 2900540
59533B900540n3411n1627m9404m6533m2987l8682l3877k9377k5757k2619j9173
$$ 2900540 2847129 2795502 2746098 2699565 2656578 2617896 2584019 2554642 2528885 2506266 2487093
59522B487093j5188j0821o034q87L879P320R230J0246J1261J3028J5762J8660
$$ 2487093 2471905 2461084 2455050 2454163 2458042 2465362 2474592 2484838 2496099 2509127 2524889 2543549
59510B543549K0423K0750K0683K1087K1699K2246K3392K5559K7935K9844L2178
$$ 2543549 2563972 2584722 2605405 2626492 2648191 2670437 2693829 2719388 2747323 2777167 2809345
59499B809345L6045M0781M4861M8196N1963N6663O2016O8344P6138Q4369R1150
$$ 2809345 2845390 2886171 2931032 2979228 3031191 3087854 3149870 3218214 3294352 3378721 3469871
59488C469871R6317J01654J08131J14613J19938J24588J29299J33258J34995J34424
$$ 3469871 3566188 3667842 3775973 3890586 4010524 4135112 4264411 4397669 4532664 4667088
59478D667088J32767J30575J26792J20293J11804J03350R5215Q4268O7021M4545
$$ 4667088 4799855 4930430 5057222 5177515 5289319 5392669 5487884 5572152 5639173 5683718
59468E683718K2594N843o479j7840k9061l7877m2744m4449m4115m2034l8731l4903
$$ 5683718 5706312 5712155 5705676 5687836 5658775 5620898 5578154 5533705 5489590 5447556 5408825 5373922
59456E373922k9764k1274q855N583J9981L4189M9134O5002Q0720R4367J03875
$$ 5373922 5344158 5322884 5314029 5319612 5339593 5373782 5422916 5487918 5568638 5663005 5766880
59445E766880J08260J08202J04371R5488P9448N6263K8370j926l3536o5128r4719
$$ 5766880 5875140 5983342 6087713 6183201 6262649 6318912 6347282 6345356 6311820 6246692 6151973
59434F151973j21297j45036j65225j79695j87113j88324j84859j77676j68010
$$ 6151973 6030676 5885640 5720415 5540720 5353607 5165283 4980424 4802748 4634738
59425D634738j57557j46661j33952j18886j03285q9190p6627o4578n2676m0659
$$ 4634738 4477181 4330520 4196568 4077682 3974397 3885207 3808580 3744002 3691326 3650667
59415C650667k7562j3158Q40J2628K2653L2641M3019N2778O1380O9250P6532Q2653
$$ 3650667 3623105 3609947 3610787 3623415 3646068 3678709 3721728 3774506 3835886 3905136 3981668 4064321
59403D064321Q7196R0246R1710R0937Q7072P9537O8380N4356L8304K0406O02k0258
$$ 4064321 4151517 4241763 4333473 4424410 4511482 4591019 4659399 4713755 4752059 4772465 4773067 4752809
59391D752809m0634n9734p7692r4031j07331j16968j23957j29301j32707j33815
$$ 4752809 4712175 4652441 4574749 4480718 4373387 4256419 4132462 4003161 3870454 3736639
59381C736639j33386j32051j28923j22857j14416j05434r7072q9401q2301p5688
$$ 3736639 3603253 3471202 3342279 3219422 3105006 2999572 2902500 2813099 2730798 2655110
59371B655110o9228o2800n6888n1654m6114l9289l1846k5633k1623j9088j6644
$$ 2655110 2585882 2523082 2466194 2414540 2368426 2329137 2297291 2271658 2250035 2230947 2214303
59360B214303j3353q868l305K739Q358J2713J5438J7013J8778K2163K7722L4865
$$ 2214303 2200950 2192082 2188777 2191516 2199874 2212587 2228025 2245038 2263816 2285979 2313701 2348566
59348B348566M1939M6136M4296L5639K3716J4237J0517J1934J6387K2509K9382
$$ 2348566 2390505 2436641 2480937 2516576 2540292 2554529 2565046 2576980 2593367 2615876 2645258
59337B645258L6337M3730N1981N8922O0401N5096M7128M2102M1862M4742M9460
$$ 2645258 2681595 2725325 2777306 2836228 2896629 2951725 2998853 3040955 3082817 3127559 3177019
59326C177019N6261O4832P3559Q1347Q8785R7156J07189J18700J30744J42263
$$ 3177019 3233280 3298112 3371671 3453018 3541803 3638959 3746148 3864848 3995592 4137855
59316D137855J53222J64709J77467J91004K04852K19743K36626K55138K74142
$$ 4137855 4291077 4455786 4633253 4824257 5029109 5248852 5485478 5740616 6014758
59307F014758K93048L11651L29255L45081L58966L70645L78694L81289L77761
$$ 6014758 6307806 6619457 6948712 7293793 7652759 8023404 8402098 8783387 9161148
59298I161148L68837L55798L39963L22279L02746K80908K57495K34548K13234
$$ 9161148 9529985 9885783 10225746 10548025 10850771 11131679 11389174 11623722 11836956
59289A1836956J92607J71426J49653J26984J01362P0815L5857j717m1592q4411
$$ 11836956 12029563 12200989 12350642 12477626 12578988 12649803 12685660 12683943 12642351 12557940
59279A2557940j29014j72200k11332k45555k74502k97387l13618l23257l26872
$$ 12557940 12428926 12256726 12045394 11799839 11525337 11227950 10914332 10591075 10264203
59270A0264203l25820l22202l17160l09710k98600k84984k71604k59490k47221
$$ 10264203 9938383 9616181 9299021 8989311 8690711 8405727 8134123 7874633 7627412
59261G627412k33545k19071k04924j91300j77931j64863j52055j39076j25804
$$ 7627412 7393867 7174796 6969872 6778572 6600641 6435778 6283723 6144647 6018843
59252F018843j12833j00823q9920p9939p0694o1992n3736m5948l8400l0598k2636
$$ 6018843 5906010 5805187 5715267 5635328 5564634 5502642 5448906 5402958 5364558 5333960 5311324
59241E311324j5592j0341o343k324K148O481J0092J3008J5777J9233K3657K7679
$$ 5311324 5295732 5285391 5279048 5276724 5278872 5285353 5295445 5308453 5324230 5343463 5367120 5394799
59229E394799K9160K7990K6868K7946K9792K9381K6241K2623J9977J7392J3645
$$ 5394799 5423959 5451949 5478817 5506763 5536555 5565936 5592177 5614800 5634777 5652169 5665814
59218E665814Q962M294K83k657m441n856q008j1065j4347j7548k0952k4659k8860
$$ 5665814 5674776 5679070 5679353 5676696 5672255 5666399 5658391 5647326 5632979 5615431 5594479 5569820 5540960
59205E540960l4593m2828n2685o1998o9775p6855q3974r0507r5412r8087r7894
$$ 5540960 5506367 5463539 5410854 5348856 5279081 5202226 5118252 5027745 4932333 4834246 4736352
59194D736352r4079q7006p8773p2198o9610p2254p9576q8742r5977r9024r7909
$$ 4736352 4642273 4555267 4476494 4404296 4334686 4262432 4182856 4094114 3998137 3899113 3801204
59183C801204r3454q6131p6508o5729n4983m5026l6293k8699k1268j2935l921
$$ 3801204 3707750 3621619 3545111 3479382 3424399 3379373 3343080 3314381 3293113 3280178 3276257
59172C276257M439J1501J8141K5556L3889M2341N0111N7108O4231P2866Q3535
$$ 3276257 3280696 3292197 3310338 3335894 3369783 3412124 3462235 3519343 3583574 3656440 3739975
59161C739975R5125J06171J16739J28234J41360J55227J68645J81497J94355K07338
$$ 3739975 3835100 3941271 4058010 4186244 4327604 4482831 4651476 4832973 5027328 5234666
59151E234666K19758K30831K40276K47845K52148K50582K41344K25407K05233
$$ 5234666 5454424 5685255 5925531 6173376 6425524 6676106 6917450 7142857 7348090
59142G348090J81511J52680J18203Q0478M2402M800l2134o6256r4493j15728j30859
$$ 7348090 7529601 7682281 7800484 7880962 7923364 7928164 7896030 7829774 7735281 7619553 7488694
59131G488694j40635j45235j45406j42113j35441j25514j14187j04042r5965q9209
$$ 7488694 7348059 7202824 7057418 6915305 6779864 6654350 6540163 6436121 6340156 6250947
59121F250947q3363p8607p4518p0584o7571o6526o6820o7073o7533o9270p1451
$$ 6250947 6167584 6088977 6014459 5943875 5876304 5809778 5742958 5675885 5608352 5539082 5467631
59110E467631p2043p1242p1513p3693p5622p5364p3478p1098o7992o3771n9308
$$ 5467631 5395588 5324346 5252833 5179140 5103518 5028154 4954676 4883578 4815586 4751815 4692507
59099D692507n5582n2332m8692m4243l8949l3277k8491k5333k2368j7417j0783
$$ 4692507 4636925 4584593 4535901 4491658 4452709 4419432 4390941 4365608 4343240 4325823 4315040
59088D315040m994j047K688P203J1080J3312J5546J9796K5547L0831L4781L7636
$$ 4315040 4310046 4308999 4311687 4318890 4329970 4343282 4358828 4378624 4404171 4435002 4469783 4507419
59076D507419L9448M0350M1070M1948M2264M1571M0589L9766L8107L4617K9919
$$ 4507419 4546867 4587217 4628287 4670235 4712499 4754070 4794659 4834425 4872532 4907149 4937068
59065D937068K5405K1607J8296J5200J1739P228K236j414l006m074o171q684j0088
$$ 4937068 4962473 4984080 5002376 5017576 5029315 5036543 5038779 5037365 5034359 5030285 5024114 5015430 5005342
59052E005342j0299j0337j0596j0754j0807j1063j1719j3256j6343k0371k3074
$$ 5005342 4995043 4984706 4974110 4963356 4952549 4941486 4929767 4916511 4900168 4879797 4856723
59041D856723k2835k0559j8145j5856j2411p105o37N637J0238J1792R793M836
$$ 4856723 4833888 4813329 4795184 4779328 4766917 4759812 4759175 4764812 4775050 4786842 4796635 4801471
59029D801471k566j2924k6837m3741o2297q1344r9642j15493j27730j36682j43356
$$ 4801471 4798905 4785981 4759144 4715403 4653106 4571762 4472120 4356627 4228897 4092215 3948859
59018C948859j47929j49809j48747j45150j39623j32783j25312j17772j10573
$$ 3948859 3800930 3651121 3502374 3357224 3217601 3084818 2959506 2841734 2731161
59009B731161j04095r8345r2535q5894p8917p2742o7334o1562n5257m9619m5218
$$ 2731161 2627066 2528721 2436186 2350292 2271375 2198633 2131299 2069737 2014480 1964861 1919643
58998A919643m1145l6785l2762k9369k5798k1937j9176j8088j6938j4116j0586
$$ 1919643 1878498 1841713 1808951 1779582 1753784 1731847 1712671 1694583 1677645 1663529 1652943
58987A652943q214o859n114k892j203l7J498L327M752O504J0281J5957K1072K3916
$$ 1652943 1644729 1637870 1632756 1629864 1628661 1628624 1630122 1633449 1638201 1644705 1654986 1670943 1692015 1715931
58973A715931K5657K8560L3047L7450M0095M0745M0104L8596L6040L2355K8118
$$ 1715931 1741588 1770148 1803195 1840645 1880740 1921485 1961589 2000185 2036225 2068580 2096698
58962B096698K3959J9694J4672R055L999L70k101m080n575n971m684j514L116
$$ 2096698 2120657 2140351 2155023 2164078 2168077 2168447 2166346 2162266 2156691 2150720 2146036 2144522 2147638
58949B147638Q111J2270J4979J6193J5897J4241J1775Q750M485j563q505j4964
$$ 2147638 2155749 2168019 2182998 2199191 2215088 2229329 2241104 2249854 2254339 2252776 2244271 2229307
58937B229307k1032k7806l5052m0883m3999m4941m4928m4722m4622m4180m1997
$$ 2229307 2208275 2180469 2145417 2104534 2060535 2015594 1970666 1925944 1881322 1837142 1795145
58926A795145l7386l2160k8875k7316k4859k0484j6028j2881r910n792j267K156
$$ 1795145 1757759 1725599 1696724 1669408 1644549 1624065 1608037 1595156 1585246 1579454 1578187 1580343
58914A580343M019M430L634L052M805R078J3618J6675J8576J9554J8540J5499
$$ 1580343 1584362 1588792 1592426 1595478 1600283 1609361 1622979 1639654 1658230 1677784 1696324 1711823
58902A711823J2688J1805J1753J0770Q933P026N082L641M344P350J0179J1104
$$ 1711823 1724511 1736316 1748069 1758839 1767772 1774798 1779880 1783521 1787865 1795215 1805394 1816498
58890A816498J1730J4157J7634K0329K2414K4931K7331K8748L0125L2516L4725
$$ 1816498 1828228 1842385 1860019 1880348 1902762 1927693 1955024 1983772 2013897 2046413 2081138
58879B081138L5271L5257L6548L8549L9677M0710M3544M7665N1004N3579N7237
$$ 2081138 2116409 2151666 2188214 2226763 2266440 2307150 2350694 2398359 2449363 2502942 2560179
58868B560179O2233O7118P1607P6708Q2254Q7158R1975R8438J06521J14504J21909
$$ 2560179 2622412 2689530 2761137 2837845 2920099 3007257 3099232 3197670 3304191 3418695 3540604
58857C540604J29832J38496J47079J55940J66447J78406J90155K01399K13560
$$ 3540604 3670436 3808932 3956011 4111951 4278398 4456804 4646959 4848358 5061918
58848E061918K27187K41329K55496K69876K83411K94199L02103L08680L14298
$$ 5061918 5289105 5530434 5785930 6055806 6339217 6633416 6935519 7244199 7558497
58839G558497L17509L17295L13249L03372K84678K56991K23448J86192J43946
$$ 7558497 7876006 8193301 8506550 8809922 9094600 9351591 9575039 9761231 9905177
58830I905177R5088M1015j4907o9863j21686j68098k07607k40298k66761k86928
$$ 9905177 10000265 10041280 10026373 9956510 9834824 9666726 9459119 9218821 8952060 8665132
58820H665132l00553l07904l09559l06424l00160k92430k83493k72701k60448
$$ 8665132 8364579 8056675 7747116 7440692 7140532 6848102 6564609 6291908 6031460
58811F031460k48190k36482k24499k11885j99583j88347j77707j66848j55519
$$ 6031460 5783270 5546788 5322289 5110404 4910821 4722474 4544767 4377919 4222400
58802D222400j43965j32961j23804j16965j10986j04059r6483q9929q4554p8833
$$ 4222400 4078435 3945474 3821670 3704705 3593719 3489660 3393177 3303248 3218694 3139861
58792C139861p2247o6047o0992n6219n0964m5575m0250l4392k7951k1976j7098
$$ 3139861 3067614 3001567 2940575 2884356 2833392 2787817 2747567 2713175 2685224 2663248 2646150
58781B646150j2668p970l142J508N982J0102J3663J7214K1570K6490L1109L5528
$$ 2646150 2633482 2625512 2622370 2623878 2629860 2639962 2653625 2670839 2692409 2718899 2750008 2785536
58769B785536M0598M6124N0985N5164N9963O5909P1995P7405Q2663Q8635R5616
$$ 2785536 2826134 2872258 2923243 2978407 3038370 3104279 3176274 3253679 3336342 3424977 3520593
58758C520593J03551J11983J19832J26516J33288J42006J52681J63682J74224
$$ 3520593 3624144 3736127 3855959 3982475 4115763 4257769 4410450 4574132 4748356
58749D748356J84916J95955K06705K17304K28908K41925K55400K68342K80218
$$ 4748356 4933272 5129227 5335932 5553236 5782144 6024069 6279469 6547811 6828029
58740F828029K89929K95983K97861K95864K89484K77305K58443K32816K00240
$$ 6828029 7117958 7413941 7711802 8007666 8297150 8574455 8832898 9065714 9265954
58731I265954J60851J15990O7235J5149l9196r2402j40826j83938k23065k57414
$$ 9265954 9426805 9542795 9610030 9625179 9585983 9493581 9352755 9168817 8945752 8688338
58721H688338k84232l02603l13983l19185l18061l12337l05097k96869k85781
$$ 8688338 8404106 8101503 7787520 7468335 7150274 6837937 6532840 6235971 5950190
58712E950190k72307k59918k49636k37985k22729k06989j94695j84792j73324
$$ 5950190 5677883 5417965 5168329 4930344 4707615 4500626 4305931 4121139 3947815
58703C947815j59383j45630j34096j24389j15535j07086r8524q9443q0277p1724
$$ 3947815 3788432 3642802 3508706 3384317 3268782 3161696 3063172 2973729 2893452 2821728
58693B821728o3770n6145m9098m2908l7404l2650k9167k6758k4180k0686j6988
$$ 2821728 2757958 2701813 2652715 2609807 2572403 2539753 2510586 2483828 2459648 2438962 2421974
58682B421974j3994j1690r866q773q412q244q214q942j0593j2720j5382j8878
$$ 2421974 2407980 2396290 2386424 2377651 2369239 2360995 2352781 2343839 2333246 2320526 2305144 2286266
58670B286266k2278k4031k4384k5215k6915k7567k6129k4363k4449k6504k9605
$$ 2286266 2263988 2239957 2215573 2190358 2163443 2135876 2109747 2085384 2060935 2034431 2004826
58659B004826l3525l8082m2148m4732m6141m7151m7969m8527m8703m7878m5507
$$ 2004826 1971301 1933219 1891071 1846339 1800198 1753047 1705078 1656551 1607848 1559970 1514463
58648A514463m2459m0386l9545l8620l6669l3777l0103k6219k3903k4084k4334
$$ 1514463 1472004 1431618 1392073 1353453 1316784 1283007 1252904 1226685 1202782 1178698 1154364
58637A154364k1402j6060j2172j0841r402o832n754p491r353r165q676r753j0667
$$ 1154364 1132962 1116902 1104730 1093889 1084487 1077655 1071901 1064410 1055057 1045892 1037216 1027463 1016796
58624A016796r337p356p184p773o453l508j395o58K45J975L853N616P402Q796
$$ 1016796 1007459 1000103 992919 985146 978693 975185 973790 973132 973377 975352 979205 984821 992223 1001019
58610A001019R780J1489J4209J5961J5063J2702J0942R644P518M866K907J483
$$ 1001019 1010799 1022288 1036497 1052458 1067521 1080223 1091165 1100809 1108327 1113193 1116100 1117583
58598A117583m43l082o400j1067j6785k1116k2151k1055j9882j8314j4958j0559
$$ 1117583 1117140 1114058 1107658 1096591 1079806 1058690 1036539 1015484 995602 977288 962330 951771
58586I51771p225n422m179l350l194k603l48K477L649L185L253N061P816J0521
$$ 951771 944546 939124 934945 931595 928401 925798 925450 927927 931576 934761 938014 943075 950891 961412
58572I61412J2919J4812J6119J7407J9125K0722K1604K2220K3127K4028K4904
$$ 961412 974331 989143 1005262 1022669 1041794 1062516 1084120 1106340 1129467 1153495 1178399
58561A178399K6808L0186L3802L6794M0265M5047M9567N2026N3303N5383N8184
$$ 1178399 1205207 1235393 1269195 1305989 1346254 1391301 1440868 1492894 1546197 1601580 1659764
58550A659764O0326O2104O5246P0246P5969Q1322Q5568Q7829Q8140Q8116Q8752
$$ 1659764 1720090 1782194 1847440 1917686 1993655 2074977 2160545 2248374 2336514 2424630 2513382
58539B513382Q8425Q4841P7987O9310N9126M6783L2449J6756l46j8437l5292m8664
$$ 2513382 2601807 2686648 2764635 2833945 2893071 2939854 2972303 2989059 2988713 2970276 2934984 2886320
58527B886320n8561o5970p0672p2249p1991p1503p0402o7511o3188n8332n2386
$$ 2886320 2827759 2761789 2691117 2618868 2546877 2475374 2404972 2337461 2274273 2215941 2163555
58516B163555m4842l7531l2750k9882k6495k2139j8550j6686j5983j6027j6613
$$ 2163555 2118713 2081182 2048432 2018550 1992055 1969916 1951366 1934680 1918697 1902670 1886057
58505A886057j6519j4535j1389q745o881n322m977p397j2339j8128k3958l0002
$$ 1886057 1869538 1855003 1843614 1834869 1827988 1822666 1817689 1810292 1797953 1779825 1755867 1725865
58493A725865l5715l9901m1962m1795l9411l5969l3766l3490l3185l1711l1053
$$ 1725865 1690150 1650249 1608287 1566492 1527081 1491112 1457346 1423856 1390671 1358960 1327907
58482A327907l2813l4554l2962k8879k5837k4744k3581k1523j9798j8823j7746
$$ 1327907 1295094 1260540 1227578 1198699 1172862 1148118 1124537 1103014 1083216 1064393 1046647
58471A046647j6644j6281j5973j4409j2193j0950j0393r033p119o089n620m229
$$ 1046647 1030003 1013722 997749 983340 971147 960197 949804 940771 933652 927563 921943 917714
58459I17714k334j771k622l284l314l438l249j818r1K97J08J359L627M812N130
$$ 917714 915380 913609 910987 907703 904389 900951 897702 895884 895793 896090 896198 897557 901184 905996 911126
58444I11126O813R805J1366J0362Q666P830P461P474Q866J1362J3005J2964J2526
$$ 911126 917939 927744 939110 949472 958138 965968 973429 980903 989769 1001131 1014136 1027100 1039626
58431A039626J2742J3342J4285J6031J7729J7380J4442J0520P147M580K714J263
$$ 1039626 1052368 1065710 1079995 1096026 1113755 1131135 1145577 1156097 1163244 1167824 1170538 1171801
58419A171801q09m294q343j1565j3870j5606j6031j4809j3768j4606j5906j5157
$$ 1171801 1170992 1166698 1158355 1146790 1132920 1117314 1101283 1086474 1072706 1058100 1042194 1027037
58407A027037j2668j0602r242p452n920o466q447r151p575n018k369L37K236K482
$$ 1027037 1014369 1003767 994525 987073 981153 974687 966240 957089 949514 944496 942127 942464 944700 947182
58393I47182K214K931L861L747L909O100Q666Q832P640Q434J1224J3019J3149
$$ 947182 949396 952327 956188 959935 963844 969944 978610 987442 995082 1003516 1014740 1027759 1040908
58380A040908J3771J5191J5379J4260J4201J5794J7187J7788J8685J9216J7392
$$ 1040908 1054679 1069870 1085249 1099509 1113710 1129504 1146691 1164479 1183164 1202380 1219772
58369A219772J3867J1346R870O939K515o54k061m140p236q531p078n437n136m675
$$ 1219772 1233639 1244985 1254855 1261794 1264309 1263655 1261594 1257454 1250218 1241687 1234609 1229172 1224036 1219361
58355A219361l274k425k446j362J372L762N013O795R744J2215J3446J4507J5439
$$ 1219361 1216087 1213662 1211216 1209854 1211226 1214988 1220001 1226796 1236540 1248755 1262201 1276708 1292147
58342A292147J5037J3954J4168J4967J3411R340N751L764J616p84j025J066K332
$$ 1292147 1307184 1321138 1335306 1350273 1363684 1373024 1378775 1382539 1384155 1383371 1382346 1383412 1385744
58329A385744J288K5J58Q62J713L449N212N198M318M853N606L507q6n55K128L086
$$ 1385744 1387032 1387057 1387215 1388077 1389790 1393239 1398451 1403649 1407967 1412820 1418426 1421933 1421847 1421292 1423420 1426506
58313A426506R77J51K732N272N574O362R168J0699Q721O319O880R483J2157J4950
$$ 1426506 1427483 1427634 1430366 1435638 1441212 1447574 1456742 1467441 1476162 1482481 1489361 1498844 1511001 1525951
58299A525951J7198J6726J4339J4140J6908J8496J7348J7783K2444K7223K7710
$$ 1525951 1543149 1559875 1574214 1588354 1605262 1623758 1641106 1658889 1681333 1708556 1736266
58288A736266K5644K4775K4798K3601K1606K0092J8466J6268J4579J3274J0643
$$ 1736266 1761910 1786685 1811483 1835084 1856690 1876782 1895248 1911516 1926095 1939369 1950012
58277A950012P530P321J0048J1523J0289R921J2284J4396J4572J5616J8912K1397
$$ 1950012 1957542 1964863 1974911 1986434 1996723 2006644 2018928 2033324 2047896 2063512 2082424 2103821
58265B103821K1629K2828K6469K8993K8417K8142L0555L2964L3594L5177L8748
$$ 2103821 2125450 2148278 2174747 2203740 2232157 2260299 2290854 2323818 2357412 2392589 2431337
58254B431337M0594L9449L9812M3485M5093M1220L6892L7019L8184L5422L0869
$$ 2431337 2471931 2511380 2551192 2594677 2639770 2680990 2717882 2754901 2793085 2828507 2859376
58243B859376K8933K8578K7142K6609K9477L3169L4780L6592M1017M5055M5699
$$ 2859376 2888309 2916887 2944029 2970638 3000115 3033284 3068064 3104656 3145673 3190728 3236427
58232C236427M5738M8370N1236N1785N3025N7788O2600O3582O3297O5659O9373
$$ 3236427 3282165 3330535 3381771 3433556 3486581 3544369 3606969 3670551 3733848 3799507 3868880
58221C868880P2304P6603Q3354Q8173Q8533Q9411R5162J02092J05698J08534J13761
$$ 3868880 3941184 4017787 4101141 4189314 4277847 4367258 4462420 4564512 4670210 4778744 4892505
58210D892505J17864J17473J16721J19903J23334J22461J20286J20755J20986
$$ 4892505 5010369 5127842 5244563 5364466 5487800 5610261 5730547 5851302 5972288
58201E972288J18458J18447J25292J33659J37834J42098J52087J63857J72052
$$ 5972288 6090746 6209193 6334485 6468144 6605978 6748076 6900163 7064020 7236072
58192G236072J81087J96947K15465K30381K45594K67380K91907L13011L35128
$$ 7236072 7417159 7614106 7829571 8059952 8305546 8572926 8864833 9177844 9512972
58183I512972L65516M00739M34020M68876N11807N58776O02800O47376O97688
$$ 9512972 9878488 10279227 10713247 11182123 11693930 12252706 12855506 13502882 14200570
58174A4200570P46482P84407Q16883Q54565Q94997R30689R67320J015528J072179
$$ 14200570 14947052 15731459 16548342 17402907 18297904 19228593 20195913 21211441 22283620
58165B2283620J128596J189628J264627J347279J425426J503580J594059J693821
$$ 22283620 23412216 24601844 25866471 27213750 28639176 30142756 31736815 33430636
58157C3430636J793106J898642K023416K161860K301851K452971K634518K844758
$$ 33430636 35223742 37122384 39145800 41307660 43609511 46062482 48697000 51541758
58149E1541758L073512L336044L659581M044663M477497M972321N560263O245344
$$ 51541758 54615270 57951314 61610895 65655558 70133055 75105376 80665639 86910983
58141H6910983P018311P905026Q946328J0135653J1436401J2854674J4424119
$$ 86910983 93929294 101834320 110780648 120916301 132352702 145207376 159631495
58134A59631495J6122757J7888173J9716888K1664134K3777910K6178606K9121077
$$ 159631495 175754252 193642425 213359313 235023447 258801357 284979963 314101040
58127C14101040L2545565L5254196L4824120K9009644J7646780L151170j0961960
$$ 314101040 346646605 381900801 416724921 445734565 463381345 466532515 455570555
58120D55570555k2076963k9299541l2962035l3847246l2809211l0643001k7954169
$$ 455570555 433493592 404194051 371232016 337384770 304575559 273932558 245978389
58113B45978389k5107377k2324251j9769780j7524492j5564391j3835418j2314568
$$ 245978389 220871012 198546761 178776981 161252489 145688098 131852680 119538112
58106A19538112j0976794r763600q630479p586405o650029n804110n027998m336940
$$ 119538112 108561318 98797718 90167239 82580834 75930805 70126695 65098697 60761757
58098F0761757l748337l239967k781535k378573k043055j747373j452951j161117
$$ 60761757 57013420 53773453 50991918 48613345 46570290 44822917 43369966 42208849
58090D2208849q87613o09666k93355M5003L66378O84736J048124J453697J857390
$$ 42208849 41321236 40711570 40418215 40463218 40829596 41514332 42562456 44016153 45873543
58081D5873543K259999K690122L111326L493009M006563M930851O153622O876628
$$ 45873543 48133542 50823664 53934990 57427999 61434562 66365413 72519035 79395663
58073G9395663O116707L620869J76954l030547n268298o472864o895276o776903
$$ 79395663 85512370 89133239 89310193 86279646 81011348 74538484 67643208 60866305
58065F0866305o315063n698837n058244m436516l853862l350054k944525k610139
$$ 60866305 54551242 48852405 43794161 39357645 35503783 32153729 29209204 26599065
58057B6599065k316838k063922j850183j652053j455325j276835j132571j010999
$$ 26599065 24282227 22218305 20368122 18716069 17260744 15983909 14851338 13840339
58049A3840339q97185p97896p22940o63354o07013n57210n18752m82870m41934
$$ 13840339 12943154 12145258 11422318 10758964 10151951 9594741 9075989 8593119 8151185
58040H151185m03401l74305l46648l12291k78265k53826k35684k18793k08408
$$ 8151185 7747784 7373479 7026831 6714540 6436275 6182449 5946765 5727972 5519564
58031E519564k08363k09825k04605j98035j96492j94022j83896j72102j66382
$$ 5519564 5311201 5101376 4896771 4698736 4502244 4308222 4124326 3952224 3785842
58022C785842j62281j52890j42385j37080j32437j22029j10759j06079j04010
$$ 3785842 3623561 3470671 3328286 3191206 3058769 2936740 2825981 2719902 2615892
58013B615892r6976q8132q4763q3924p7859o8339o2914o1427n8203n3682n2244
$$ 2615892 2518916 2430784 2346021 2262097 2184238 2115899 2052985 1991558 1933355 1879673 1827429
58002A827429n2038m7811m1014l7111l5880l3736l2156l4471l7576l6095l1772
$$ 1827429 1775391 1727580 1686566 1649455 1613575 1579839 1547683 1513212 1475636 1439541 1407769
57991A407769k9865k9545k6623k2517k1524k2273k0652j8276j9292k1672k0504
$$ 1407769 1377904 1348359 1321736 1299219 1277695 1255422 1234770 1216494 1197202 1175530 1155026
57980A155026j7264j7063j9115j8646j6091j5718j6910j5421j1738j0039j0275
$$ 1155026 1137762 1120699 1101584 1082938 1066847 1051129 1034219 1018798 1007060 997021 986746
57969I86746r197p772r622j3334j4230j2739j3263j5656j5509j2301r954r589
$$ 986746 977549 969777 960155 946821 932591 919852 906589 890933 875424 863123 853169 843580
57957H43580q652o891o564p141o137m552n319p204o406l378j882k254j782n67
$$ 843580 834928 828037 821473 814332 808195 803643 798324 791120 784714 781336 779454 777200 775418 774851
57943G74851p52j136R90L784L303P98P71K726K042j683m376n342p938j2070j3217
$$ 774851 774099 772963 773953 777737 781040 781838 782609 785335 787377 785694 781318 775976 768038 755968 742751
57928G42751r969o205m696m352m473n991p786p350n635n891p556o952m087k793
$$ 742751 732782 726577 721881 717529 713056 707065 699279 691929 686294 680403 672847 665895 661808 659015
57914F59015l803l792j929j216k426k654j046k58r37k94K441M425M387M330M831
$$ 659015 655212 651420 649491 648275 645849 643195 642149 641891 640954 640660 643101 647526 651913 656243 661074
57899F61074L771J023o47p06j995n363p979q371q459r232r010p346o195n926m661
$$ 661074 664845 665868 665221 664515 662520 657157 649178 640807 632348 623116 614106 606760 600565 594639 589978
57884E89978k582k219l443k950QK311K594L248N337O703O882Q689J2710J5248
$$ 589978 587396 585177 581734 578784 578792 581103 583697 586945 592282 598985 605867 614556 627266 642514
57870F42514J4332J2983J3758J4450J2395R055P002N696L331J73k614m985o869
$$ 642514 656846 669829 683587 698037 710432 719487 726489 732185 735516 735689 733075 728090 721221
57857G21221p528p772r926j4007j6887j6750j5364j4448j3219j1297j0520j1758
$$ 721221 713693 705921 695995 681988 665101 648351 632987 618539 605320 594023 583503 571745
57845E71745j2940j2322j0877r633p656m527j867n29R36L155M249L080J444J045
$$ 571745 558805 546483 535606 525973 518317 513790 511923 511394 512330 515485 519734 522814 524258 525303
57831E25303J119R11J692M224O775P644P410P063O273N074M726N419N511M383
$$ 525303 526422 527333 529025 533249 540024 547668 555078 562141 568414 573488 578214 583633 589144 593527
57817E93527L355K749J102j474k522j530j387l595n522m852l399l685m782m582
$$ 593527 596882 599631 600733 599259 596737 595207 593820 590225 584703 579851 576452 572767 567985 563403
57803E63403l629l496l498k093J40J727K894M568O224P061P872R560J1179J1469
$$ 563403 559774 556278 552780 550687 550827 552554 555448 560016 566240 573301 581173 590733 601912 613381
57789F13381J0898J0389R517P734N932N046M619M143M182M736M355K377J76j238
$$ 613381 624279 634668 644185 651919 657851 662897 667516 671659 675841 680577 684932 687309 687485 686247
57775F86247k730m658n365m010k652l335n117o123o548p363p797o604m320k117
$$ 686247 683517 678859 673494 669484 666832 663497 658380 652257 645709 638346 630549 623945 619625 617508
57761F17508J71K839M655M491L247K186Q26j445l252l027j631j018j301j352j246
$$ 617508 617679 620518 625173 629664 632911 635097 635923 634478 631226 628199 626568 625550 624249 622897 621651
57746F21651k006l621n173o315p067o962n857m740m372m090l167k163j690j063
$$ 621651 619645 616024 610851 604536 597469 590507 584650 579910 575538 571448 568281 566118 564428 563365
57732E63365M53K326L927N729Q042R999J1084J2186J3769J4600J3788J2446J1787
$$ 563365 563818 566144 570071 575800 583842 593841 604925 617111 630880 645480 659268 671714 683501
57719F83501J1191R802Q402P881P441O204N137N271N497M294K512K253L747N372
$$ 683501 694692 704494 712896 720777 728218 734422 739559 744830 750327 754621 757133 759386 763133 768505
57705G68505N996N549L998J480j032k653l632m502n090n299n711o316n954m215
$$ 768505 774501 780050 784048 785528 784496 781843 778211 773709 768619 763320 757609 751293 745339 741124
57691G41124k515j978j636r4K319M271N048M424K436M04L92K478M301M453M239
$$ 741124 738609 736631 734995 734901 737220 741491 746539 750963 753399 753803 754195 756673 760974 765427 769666
57676G69666M830N238M831N220P372R176Q550O827O483P354P877Q232R280J0057
$$ 769666 774496 779734 784565 789785 797157 806333 814883 821710 828193 835547 843424 851656 860936 870993
57662H70993R480R124J1141J4470J6306J6402J6813J8083J8877J9020J9738K0981
$$ 870993 880473 889597 900738 915208 931514 947916 964729 982812 1001689 1020709 1040447 1061428
57650A061428K1299K0485J9966K0524K1788K3789K6920L0507L3477L6184L9713
$$ 1061428 1082727 1103212 1123178 1143702 1165490 1189279 1216199 1246706 1280183 1316367 1356080
57639A356080M3837M7591N1246N5615N9837O1837O0450N5258M5431L1210J5869
$$ 1356080 1399917 1447508 1498754 1554369 1614206 1676043 1736493 1791751 1837182 1868392 1884261
57628A884261L521m731j0423j4199j5226j3495r955m517L526J3153K2154K9995
$$ 1884261 1887782 1883051 1872628 1858429 1843203 1829708 1819753 1815236 1818762 1831915 1854069 1884064
57616A884064L7972M6630N5383O4518P5127Q6935R8371J08847J19065J29317J39546
$$ 1884064 1922036 1968666 2024049 2088567 2163694 2250629 2349000 2457847 2576912 2706229 2845775
57605B845775J50452J61770J69425J66869J49615J17029P1125J6922l6512p9687
$$ 2845775 2996227 3157997 3327422 3494291 3643906 3760935 3832060 3848982 3812470 3732783
57595C732783j08980j27305j38421j43306j42360j37684j31307j23474j14128
$$ 3732783 3623803 3496498 3358077 3214771 3072411 2934727 2803420 2679946 2565818
57586B565818j04444r5775q8421q2023p5760o8201n8862m9879m3823l9875l4764
$$ 2565818 2461374 2365599 2277178 2195155 2119395 2051194 1992332 1942453 1898630 1858755 1823991
57575A823991k7650k1092j6662j2795q187m210k127n96K074N240P522R256J1543
$$ 1823991 1796341 1775249 1758587 1745792 1737605 1733395 1731268 1730672 1732746 1737986 1745508 1754764 1766307
57562A766307J4317J6965J9484K1645K2637K2968K4974K9783L5261L8773M0616
$$ 1766307 1780624 1797589 1817073 1838718 1861355 1884323 1909297 1939080 1974341 2013114 2053730
57551B053730M2806M5804M8574N0979N3890N7147N9317N9424N7621N4226M9240
$$ 2053730 2096536 2142340 2190914 2241893 2295783 2352930 2412247 2471671 2529292 2583518 2632758
57540B632758M2653L4295K3604J0537l617j7135k9348m0448n0214n7876o3085
$$ 2632758 2675411 2709706 2733310 2743847 2740230 2723095 2693747 2653299 2603085 2545209 2482124
57529B482124o6134o7282o6541o4246o1178n7976n4637n0759m6266m1766l8157
$$ 2482124 2415990 2348708 2282167 2217921 2156743 2098767 2044130 1993371 1947105 1905339 1867182
57518A867182l5644l3468l0758k7398k3870k0642j8068j6308j4860j2829j0267
$$ 1867182 1831538 1798070 1767312 1739914 1716044 1695402 1677334 1661026 1646166 1633337 1623070
57507A623070q486q148p946o352l902k317j901j439k81J052K204L406M507M976
$$ 1623070 1614584 1606436 1598490 1592138 1588236 1585919 1584018 1582579 1582298 1583350 1585554 1588960 1593467 1598443
57493A598443M854M641M581N137P335J1047J3771J3243J0724R467J0342J1517
$$ 1598443 1603297 1607938 1612519 1617656 1624991 1636038 1649809 1663052 1673776 1683243 1693585 1705102
57481A705102J2157J3485J5794J7445J7639J7564J7790J7125J5337J4521J6125
$$ 1705102 1717259 1730744 1746538 1763983 1781622 1799186 1816976 1834101 1849438 1863959 1880084
57470A880084J8726K0319K1021K1852K2679K3041K3579K4958K6648K8274L0755
$$ 1880084 1898810 1919129 1940150 1962002 1984681 2007722 2031301 2056259 2082907 2111181 2141936
57459B141936L4500L7833L9048L9051M0318M3868M8645N3114N6098N6766N5160
$$ 2141936 2176436 2214269 2253317 2292368 2332686 2376554 2425199 2478313 2534411 2591177 2646337
57448B646337N2357M9194M5309M0051L3461K5601J6123N366n161j4310k2313k9390
$$ 2646337 2698694 2747888 2793197 2833248 2866709 2892310 2908433 2913799 2908638 2894328 2872015 2842625
57436B842625l4679l7546l8770l9302l9018l7777l6317l4772l1613k5762j8852
$$ 2842625 2807946 2770400 2731630 2692328 2653310 2615533 2579216 2544444 2512831 2487069 2468217
57425B468217j3763j1595j1311j1486j0979q789m899r05J611K890M249O194Q354
$$ 2468217 2454454 2442859 2431548 2420062 2409083 2400294 2395395 2394490 2396101 2398991 2403240 2409434 2417788
57412B417788J0568J2830J4769J6195J7534J9011K0286K1661K4169K7486K9475
$$ 2417788 2428356 2441186 2455955 2472150 2489684 2508695 2528981 2550642 2574811 2602297 2631772
57401B631772K9443L0075L3863L9046M1790M1560M1479M3603M6673M8831M9991
$$ 2631772 2661215 2691290 2725153 2764199 2805989 2847549 2889028 2932631 2979304 3028135 3078126
57390C078126N0722N0881N0312M9267M7211M2653L5049K5786J6465P238k350j1766
$$ 3078126 3128848 3179729 3230041 3279308 3326519 3369172 3404221 3430007 3446472 3453710 3451360 3439594
57378C439594j9763k5865l0755l5246l9126m1235m0668l8026l5005l2553l0052
$$ 3439594 3419831 3393966 3363211 3327965 3288839 3247604 3206936 3168910 3133905 3101352 3071300
57367C071300k6846k3773k2108k1459k0050j7004j3291j0228q123o583n281l960
$$ 3071300 3044454 3020681 2998573 2977114 2957064 2940060 2926769 2916541 2908418 2901835 2896554 2892594
57355B892594k306l17J523K801L778N214P498R935J1099J0327Q810Q656J0656
$$ 2892594 2890288 2889971 2891494 2894295 2898073 2903287 2910785 2920720 2931819 2942146 2950956 2959612 2970268
57342B970268J3522J5370J5407J4109J2616J2170J3244J4778J5073J3809J2366
$$ 2970268 2983790 2999160 3014567 3028676 3041292 3053462 3066706 3081484 3096557 3110366 3122732
57331C122732J1940J2360J3070J3960J4715J4695J4196J4517J5896J6732J5868
$$ 3122732 3134672 3147032 3160102 3174062 3188777 3203472 3217668 3232185 3248081 3264813 3280681
57320C280681J4270J3335J2890J2214J1731J2017J2319J1773J1204J1927J3442
$$ 3280681 3294951 3308286 3321176 3333390 3345121 3357138 3369457 3381230 3392434 3404361 3417803
57309C417803J4063J3326J2168J1318J0964J1482J2849J3917J3754J3153J3350
$$ 3417803 3431866 3445192 3457360 3468678 3479642 3491124 3503973 3517890 3531644 3544797 3558147
57298C558147J3885J3479J2331J1809J2267J2975J3784J5035J6244J6696J6964
$$ 3558147 3572032 3585511 3597842 3609651 3621918 3634893 3648677 3663712 3679956 3696652 3713616
57287C713616J7891J8510J7094J4090J1831J1423J2041J3273J5686J8631J9948
$$ 3713616 3731507 3750017 3767111 3781201 3793032 3804455 3816496 3829769 3845455 3864086 3884034
57276C884034J8789J6958J6548J7723J9368K0442K0106J8100J5628J4511J4986
$$ 3884034 3902823 3919781 3936329 3954052 3973420 3993862 4013968 4032068 4047696 4062207 4077193
57265D077193J5609J5510J5213J5017J4479J3953J4655J6419J7333J6560J5650
$$ 4077193 4092802 4108312 4123525 4138542 4153021 4166974 4181629 4198048 4215381 4231941 4247591
57254D247591J5917J6233J5053J3162J2623J3768J4994J5090J4446J4028J4209
$$ 4247591 4263508 4279741 4294794 4307956 4320579 4334347 4349341 4364431 4378877 4392905 4407114
57243D407114J4743J5280J5753J6329J6911J6935J6226J5721J6468J8007J8797
$$ 4407114 4421857 4437137 4452890 4469219 4486130 4503065 4519291 4535012 4551480 4569487 4588284
57232D588284J8348J7830J8398J9779K0800K0532J8999J7385J7323J9030K0711
$$ 4588284 4606632 4624462 4642860 4662639 4683439 4703971 4722970 4740355 4757678 4776708 4797419
57221D797419K0929K0809K2176K4191K4234K1991K0165K0554K1833K2081K1315
$$ 4797419 4818348 4839157 4861333 4885524 4909758 4931749 4951914 4972468 4994301 5016382 5037697
57210E037697K0416J9375J7954J6562J5338J3624J1321R354P760N023N30l657
$$ 5037697 5058113 5077488 5095442 5112004 5127342 5140966 5152287 5161641 5169401 5174424 5174954 5171297
57198E171297n003l520j342j93l49j333k273k136n70J725L783N100N486N160N068
$$ 5171297 5166294 5162774 5161432 5161239 5160890 5159557 5157284 5155148 5154578 5156303 5160086 5165186 5170672 5175832 5180900
57183E180900O070P618Q538R066J0521J2818J4175J3847J3329J4187J6269J8637
$$ 5180900 5186970 5194588 5203126 5212192 5222713 5235531 5249706 5263553 5276882 5291069 5307338 5325975
57171E325975K0588K1293K0379J9270J9838K1122J9983J5940J2568J2654J4475
$$ 5325975 5346563 5367856 5388235 5407505 5427343 5448465 5468448 5484388 5496956 5509610 5524085
57160E524085J4707J2654R650O463L462J499N36r63l478n190n042m830o185p848
$$ 5524085 5538792 5551446 5561096 5567559 5571021 5572520 5573056 5572093 5568615 5563425 5558383 5553553 5547368 5539520
57146E539520q523r968j4086j8760k0189j7958j4553j0956o367j522J421K408
$$ 5539520 5530997 5521029 5506943 5488183 5467994 5450036 5435483 5424527 5418160 5416638 5418059 5420467
57134E420467L786O803J0284J2994J5024J6774J8463K0514K2598K2888K0200J6234
$$ 5420467 5424253 5431056 5441340 5454334 5469358 5486132 5504595 5525109 5547707 5570595 5590795 5607029
57122E607029J3508J1888R497O264L874K726J534j89j652k539l156l269k833l104
$$ 5607029 5620537 5632425 5641922 5648186 5652060 5654786 5656320 5656131 5654479 5651940 5648784 5645515 5642682 5639578
57108E639578m828o288n522l386j875o58J602L731L407J138q31k896p425j4068
$$ 5639578 5634750 5628462 5622940 5619554 5617679 5617021 5618623 5622354 5625761 5626899 5626068 5623172 5615747 5601679
57094E601679j9827k3810k7910l2564l5837l7199l8277l9148l7725l3514k8341
$$ 5601679 5581852 5558042 5530132 5497568 5461731 5424532 5386255 5347107 5309382 5275868 5247527
57083E247527k2647j4901n611J848N527O538N739K503k213n422o084o433q939
$$ 5247527 5224880 5209979 5204368 5206216 5211743 5218281 5224020 5226523 5224310 5218888 5212804 5206371 5197432
57070E197432j5507k9577n4224q7313j23198j60123k00976k45910k90128l31055
$$ 5197432 5181925 5152348 5098124 5010811 4887613 4727490 4526514 4280604 3990476 3659421
57060C659421l72073m16621m63913n13216n67050o26945H810g48691q29768r09507
$$ 3659421 3287348 2870727 2406814 1893598 1326548 699603 8810 -748691 -1578459 -2487966
57050b487966r95487j087736j189061j299571j415516j536135j665370j804175
$$ -2487966 -3483453 -4571189 -5760250 -7059821 -8475337 -10011472 -11676842 -13481017
57042a3481017j948076k095287k249430k411100k576076k747014k939004l170017
$$ -13481017 -15429093 -17524380 -19773810 -22184910 -24760986 -27508000 -30447004 -33617021
57034c3617021l454178l803228m217395m671514n129811n575665n994601o328130
$$ -33617021 -37071199 -40874427 -45091822 -49763336 -54893147 -60468812 -66463413 -72791543
57026g2791543o521865o689865p174761q291960r924058j1414450j1952380j1108906
$$ -72791543 -79313408 -86003273 -93178034 -101469994 -111394052 -122808502 -134760882 -145869788
57018a45869788r035320o228075l175318j85012K587190N047619P101388Q637270
$$ -145869788 -154905108 -161133183 -164308501 -164493513 -161906323 -156858704 -149757316 -141120046
57010a41120046R566620R891067R731445R279392Q714679Q156079P659961P237337
$$ -141120046 -131553426 -121662359 -111930914 -102651522 -93936843 -85780764 -78120803 -70883466
57002g0883466O871097O533803O200862N852564N473349N058010M616879M168910
$$ -70883466 -64012369 -57478566 -51277704 -45425140 -39951791 -34893781 -30276902 -26107992
56994b6107992L730166L311515K922819K572316K262105J988717J748137J537532
$$ -26107992 -22377826 -19066311 -16143492 -13571176 -11309071 -9320354 -7572217 -6034685
56986f034685J353483J192102J050740R27375f91774C2166O41214N70711N10163
$$ -6034685 -4681202 -3489100 -2438360 -1510985 -691774 32166 673380 1244091 1754254
56977A754254M56977M10291L69302L31487K95012K61331K32702K08288J85574
$$ 1754254 2211231 2621522 2990824 3322311 3617323 3878654 4111356 4319644 4505218
56968D505218J64586J47575J34893J24105J13317J02957R3927Q6096P8991P2189
$$ 4505218 4669804 4817379 4952272 5076377 5189694 5292651 5386578 5472674 5551665 5623854
56958E623854O4691N5543M5507L6685K9977K4157J7659J0124J838p059j6334k5528
$$ 5623854 5688545 5744088 5789595 5826280 5856257 5880414 5898073 5908197 5910035 5902976 5886642 5861114
56946E861114l4494m3212n0898n6362n9695o2372o5079o6361o4410n9358n2792
$$ 5861114 5826620 5783408 5732510 5676148 5616453 5554081 5489002 5422641 5358231 5298873 5246081
56935E246081m5723l8133k9907k0665r262M676J8933L1108M3157O0114Q2830J06547
$$ 5246081 5200358 5162225 5132318 5111653 5102391 5107067 5126000 5157108 5200265 5260379 5343209 5449756
56923E449756J30653J64363K12239K52955K43728J55973N198j59426k93101l79478
$$ 5449756 5580409 5744772 5957011 6209966 6453694 6609667 6614865 6455439 6162338 5782860
56913E782860m23983m36860m26989m03193l72545l37888l00513k63710k30796
$$ 5782860 5358877 4922017 4495028 4091835 3719290 3381402 3080889 2817179 2586383
56904B586383k01590j74172j48916j27723j10196r3701p7139o2215n0985m4137
$$ 2586383 2384793 2210621 2061705 1933982 1823786 1730085 1652946 1590731 1539746 1495609
56894A495609m1534m2311m4312m5242m4754m4112m3824m2948m0772l7734l4566
$$ 1495609 1454075 1411764 1367452 1322210 1277456 1233344 1189520 1146572 1105800 1068066 1033500
56883A033500l1615k9073k6777k3844j9556j4552j0108o467k898Q10M260P542
$$ 1033500 1001885 972812 946035 922191 902635 888083 877975 871508 868610 869420 873680 881222
56871H81222J0906J3295J2724Q501J812o034j4491k2509k8082l0101k9723k8889
$$ 881222 892128 905423 918147 926648 928460 922426 907935 885426 857344 827243 797520 768631
56859G68631k8221k7099k5196k3025k1366k0758k1118k1332j9726j5729j0859
$$ 768631 740410 713311 688115 665090 643724 622966 601848 580516 560790 545061 534202
56848E34202p462o510p049p535p218o219m806k983p86J335K763L416L867M607
$$ 534202 526740 520230 513181 505646 498428 492209 487403 484420 483634 484969 487732 491148 495015 499622
56834D99622N565O599P905R431J0493J0827J1605J4154J7763J9974J9412J7133
$$ 499622 505187 511786 519691 529122 539615 550442 562047 576201 593964 613938 633350 650483
56822F50483J4698J2057Q312L826L38j055j092j353k518l766l732j843J167M091
$$ 650483 665181 677238 685550 689376 689714 688659 687567 686214 683696 679930 676198 674355 675522 679613
56808F79613O328Q006R377J0632J2259J4815J8153K1422K3986K5732K6238K4353
$$ 679613 685941 693947 703324 713956 726215 741030 759183 780605 804591 830323 856561 880914
56796H80914J9233J1415K479n921j2475j6383j7766j7597j6611j4639j1436p611
$$ 880914 900147 911562 914041 908120 895645 879262 861496 843899 827288 812649 801213 793602
56784G93602l938k62L967Q301J1617J3993J7115K2123K7869L2238L4756L6686
$$ 793602 789664 789402 793369 801670 813287 827280 844395 866518 894387 926625 961381 998067
56772I98067L8283L6999K9512J5610p57j4662k3936k9446l2522l3365l1911k8893
$$ 998067 1036350 1073349 1102861 1118471 1117714 1103052 1079116 1049670 1017148 983783 951872 922979
56760I22979k5297k1434j7330j3506j0555q090m899k42N278J0199J3428J5140
$$ 922979 897682 876248 858918 845412 834857 826767 821868 821626 826904 837103 850531 865671
56748H65671J6587J8610K0255J9452J5224Q573Q80p454j6045k3335k7738k9466
$$ 865671 882258 900868 921123 940575 955799 964372 965252 957798 941753 918418 890680 861214
56736H61214k9850k9160k6584k2240j7778j4590j2591j1110r830q490o709m507
$$ 861214 831364 802204 775620 753380 735602 721012 708421 697311 687481 678991 672282 667775
56724F67775k124R10N333J0360J3548J3134R544M113k379r132j4658j8027j9884
$$ 667775 665651 666561 671894 682254 695802 708936 718480 722593 720214 711082 696424 678397 658513
56711F58513k1110k1294j9806j7501j5881j5069j4147j3032j2438j2175j1193
$$ 658513 637403 616109 596303 578802 562921 547852 533705 520673 508235 496060 484867
56700D84867r504q455q680r106q589p466o729o520o178n243l828k403j585j711
$$ 484867 475363 466908 458228 449122 440533 433067 426338 419818 413640 408397 404569 402166 400581 398870
56686C98870k320k400j482k31K64m47j826k817k734j971j685k481l712m515m872
$$ 398870 396550 394150 392668 392437 392701 392254 390428 387611 384877 382906 381221 378740 375028 370513 365641
56671C65641m922l951j426J255J752k25k356k756k181k314l061k868j202N90R69
$$ 365641 360719 356768 355342 356597 358349 358124 355768 353012 350831 348517 345456 342588 341386 341976 342945
56656C42945m2r87n81J027K511K899K452J785P42j028k726k900j404L48J268J633
$$ 342945 342903 341916 341335 342362 344873 347772 350224 352009 352751 351723 348997 346097 344693 345041 346309 347942
56640C47942J909J809J233R58J529K323K502K179J858J544J130Q55O50j86j777
$$ 347942 349851 351660 352893 353851 355380 357703 360205 362384 364242 365786 366916 367771 368421 368235 366458
56625C66458k998k922k138j675j482j095r67j690k526k170o61Q49J880K775L254
$$ 366458 363460 360538 358400 356725 355243 354148 353181 351491 348965 346795 346134 346983 348863 351638 354892
56610C54892K540R69j3J36M07r6j049j942k968m122m560l660k068r03m93o43j513
$$ 354892 357432 358401 358388 358524 358931 358835 357786 355844 352876 348754 344194 340534 338466 337563 337070 336427 334914
56593C34914l314n429o725o879o761p159p609o934m934k997k534l075k667m32
$$ 334914 331600 326171 319446 312567 305806 298647 291038 284104 279170 276173 273639 270564 267897 267465
56579B67465K195L305K946K723L462M456M907M926M794M257L161K073J629J664
$$ 267465 269660 272965 275911 278634 282096 286552 291459 296385 301179 305436 308597 310670 312299 313963
56565C13963J576J257J219J874L080M265M829M550L802L273L217L057K069M63
$$ 313963 315539 316796 318015 319889 322969 327234 332063 336613 340415 343688 346905 349962 352031 352494
56551C52494m88K20J955K855J864J0p43L67K389L942M216K994P92r09p77N89J067
$$ 352494 352006 352226 354181 357036 358900 358910 358167 358534 360923 364865 369081 372075 372867 371958 371181 371770 372837
56534C72837k07j579j220M11J548J621J333J012M67K12J144K914L976L607K693
$$ 372837 372630 371051 369831 370242 371790 373411 374744 375756 376223 376435 377579 380493 384469 388076 390769
56519C90769K202J941J328N71N28J796M167O524P404O323M559L837M275M510L888
$$ 390769 392971 394912 396240 396811 397339 399135 403302 409826 417230 423553 428112 431949 436224 440734 444622
56504D44622L425M122N326N663N006M728N873P782Q786Q245P449Q076R959J1142
$$ 444622 448047 452169 457495 463158 468164 472892 478765 486547 495333 503578 511027 519103 529062 540204
56490E40204J0455Q959Q089P413N568K947J683K700M218L882J488j082k134j770
$$ 540204 550659 559618 567707 575120 580688 583635 585318 588018 592236 596118 597606 596524 594390 592620
56476E92620j466k454m459o125o682o798p320p829p338o080n562o724q819j0206
$$ 592620 591154 588700 584241 578116 571434 564636 557316 549487 542149 536069 530507 523783 514964 504758
56462E04758r670p125l868k018k765n066o726o763n952n238m675m120l887m169
$$ 504758 495088 487963 484095 482077 479312 474246 467520 460757 454805 449567 444892 440772 436885 432716
56448D32716m523m337l496k401j644j711k461k964k397j126m91j417l456n045
$$ 432716 428193 423856 420360 417959 416315 414604 412143 409179 406782 405656 405165 403748 400292 395247
56434C95247m628k073P77J694N82m81r4P31N40l31q21j087j642j624n2J985K486
$$ 395247 390619 388546 389323 391017 391599 391118 391024 391755 392295 391964 391143 390056 388414 386790 386738 388723 391209
56417C91209J449N69M72M98P79K029L403L142J611J162K504L810L978M127M941
$$ 391209 392658 393227 393699 394197 394976 397005 400408 403550 405161 406323 408827 412637 416615 420742 425683
56402D25683N103L778K429K673M129N703P202Q423Q411P061N842N638N521M879
$$ 425683 430786 434564 436993 439666 443795 449498 456700 465123 473534 480595 486437 492075 497596 502475
56388E02475M939O584Q329Q209O341M079K015L16l61J12O51P05J250K629L116
$$ 502475 507414 513998 522327 530536 536877 540956 542971 543287 542926 543038 543689 544394 545644 548273 551389
56373E51389J485p52j637j731k527l514l449l272m830p449q668p952o868n896
$$ 551389 552874 552122 550485 548754 546227 542713 539264 535992 531162 523713 515045 507093 500225 494329
56359D94329m046j795j365l226m943m631l509l698n123o029n401l689j765j44
$$ 494329 490283 488488 487123 483897 478954 474323 470814 467116 461993 455964 450563 446874 445109 444965
56345D44965J083J989K411J882M67p16o65J20L54j12k57M24J268J501Q86o02k583
$$ 444965 446048 448037 450448 452330 452797 452081 451416 451536 451890 451778 451521 451945 453213 454714 455600 454998 452415
56328D52415l911l718k747k455k768k250n55Q96J168J207K112L359L855L740L880
$$ 452415 448504 444786 442039 439584 436816 434566 434011 434907 436075 437282 439394 442753 446608 450348 454228
56313D54228M107L365J528o9k82L60M50l95j079n70P39J722K099K529L208L326
$$ 454228 458335 461700 463228 463159 462877 463237 463687 463292 462213 461643 462382 464104 466203 468732 471940 475266
56297D75266K272N98o51r36j88J476L408M518M462M167M530N115M947M074L530
$$ 475266 477538 478136 477485 476549 476361 477837 481245 485763 490225 494392 498922 504037 508984 513058 516588
56282E16588L989N166O332O819O175M552K807J872J974K652L159K848J673M11
$$ 516588 520577 525743 532075 538894 545069 549621 552428 554300 556274 558926 562085 564933 566606 567017
56268E67017j47j08J40J187L804O930Q278P542P060Q285R451Q362N862M515M932
$$ 567017 566870 566762 566902 568089 571893 578823 587101 594643 601703 609988 619439 627801 633663 638178 643110
56253F43110N645N876O299P128P539P186O867P265Q215R275R949R405P144M158
$$ 643110 648755 654631 660930 668058 675597 682783 689650 696915 705130 714405 724354 733759 740903 745061
56239G45061K377K736M378N795O046N022L382K221K149K712L174L600M538N908
$$ 745061 747438 750174 754552 760347 766393 771415 774797 777018 779167 781879 785053 788653 793191 799099
56225G99099O915O944O149N343N568P279R546J0801J0806J1069J2757J5002J6154
$$ 799099 806014 812958 819107 824450 830018 837297 846843 857644 868450 879519 892276 907278 923432
56212I23432J5988J5755J6569J8518K1000K3322K5295K7556L0734L4217L6708
$$ 923432 939420 955175 971744 990262 1011262 1034584 1059879 1087435 1118169 1152386 1189094
56201A189094L8216M0219M3494M7216N0865N5313O1012O6532P0218P2185P3564
$$ 1189094 1227310 1267529 1311023 1358239 1409104 1464417 1525429 1591961 1662179 1734364 1807928
56190A807928P4888P6266P7866P9051P8239P4849P0195O5413N9726N1928M2213
$$ 1807928 1882816 1959082 2036948 2115999 2194238 2269087 2339282 2404695 2464421 2516349 2558562
56179B558562L1374J9658P692l016j1931k0231k8357l4575l7673l9301m1649m4461
$$ 2558562 2589936 2609594 2617286 2614270 2602339 2582108 2553751 2519176 2481503 2442202 2400553 2356092
56167B356092m6414m7682m8875m8988m6985m4225m2783m2535m2315m2513m3889
$$ 2356092 2309678 2261996 2213121 2164133 2117148 2072923 2030140 1987605 1945290 1902777 1858888
56156A858888m4918m3469m0390l8555l8708l8932l7922l6219l4501l3002l2240
$$ 1858888 1813970 1770501 1730111 1691556 1652848 1613916 1575994 1539775 1505274 1472272 1440032
56145A440032l2216l1387k8603k5339k3634k2759k0618j7709j6531j7418j7937
$$ 1440032 1407816 1376429 1347826 1322487 1298853 1276094 1255476 1237767 1221236 1203818 1185881
56134A185881j6627j4582j3013j1783j0571r369p594m684j697m10r28j871k524
$$ 1185881 1169254 1154672 1141659 1129876 1119305 1109936 1102342 1097658 1095961 1095551 1094623 1092752 1090228
56121A090228k989k814j544j7Q34J695L357M579L913K617L104N287P227Q452R791
$$ 1090228 1087239 1084425 1082881 1082864 1083698 1085393 1088750 1093329 1097242 1099859 1102963 1108250 1115477 1123929 1133720
56106A133720J0761J0293R475J0436J2965J5245J7269K0248K3226K3872K2539
$$ 1133720 1144481 1154774 1164249 1174685 1187650 1202895 1220164 1240412 1263638 1287510 1310049
56095A310049K1977K3054K3989K3947K4108K4995K5864K6913K8990L1181L1774
$$ 1310049 1332026 1355080 1379069 1403016 1427124 1452119 1477983 1504896 1533886 1565067 1596841
56084A596841L1616L3262L6750L9472M0459M1529M4029M7502N1779N7379O3796
$$ 1596841 1628457 1661719 1698469 1737941 1778400 1819929 1863958 1911460 1963239 2020618 2084414
56073B084414P0210P7748Q8055J00192J12213J25031J41048J59513J77199J93032
$$ 2084414 2154624 2232372 2320427 2420619 2532832 2657863 2798911 2958424 3135623 3328655
56063C328655K07649K18718K21521K14552K00216J79905J53250J22907R5255P4788
$$ 3328655 3536304 3755022 3976543 4191095 4391311 4571216 4724466 4847373 4942628 5017416
56053E017416O1337N2955M7172L9266K4679M846j3586k6582l5887m4061n1524
$$ 5017416 5078753 5131708 5178880 5218146 5242825 5247671 5234085 5207503 5171616 5127555 5076031
56042E076031n9875p3099r3088j17331j42385j65837j84174j93246j92537j85285
$$ 5076031 5016156 4943057 4849969 4732638 4590253 4424416 4240242 4046996 3854459 3669174
56032C669174j73584j57434j38888j21989j07451r2420p6767o4413n6803n0243
$$ 3669174 3495590 3338156 3199268 3077279 2969828 2877408 2800641 2736228 2679425 2629182
56022B629182m1857l3406k7204k2771j9508j8101j7519j5009j0725p852o949m989
$$ 2629182 2587325 2553919 2526715 2503944 2484436 2466335 2448816 2433807 2423082 2415230 2408281 2403292
56010B403292j268J271K009M158Q390J0920J0268J0165J3105J6606J8529K0583
$$ 2403292 2402024 2403295 2405304 2409462 2417852 2428772 2439040 2449205 2462310 2478916 2497445 2518028
55998B518028K3686K5322K4589K4676K7410L0385L2047L4426L8227M0709M1081
$$ 2518028 2541714 2567036 2591625 2616301 2643711 2674096 2706143 2740569 2778796 2819505 2860586
55987B860586M2491M5980M8184M7680M7806N0464N3101N4552N7642O3134O7315
$$ 2860586 2903077 2949057 2997241 3044921 3092727 3143191 3196292 3250844 3308486 3371620 3438935
55976C438935O8602P0197P3538P5722P6193P8750Q3943Q7057Q6945Q8974R5570
$$ 3438935 3507537 3577734 3651272 3726994 3803187 3881937 3965880 4052937 4139882 4228856 4324426
55965D324426J01836J04572J07403J12667J16639J17726J20911J28958J37297
$$ 4324426 4426262 4530834 4638237 4750904 4867543 4985269 5106180 5235138 5372435
55956E372435J42778J49133J58527J66518J71056J77756J90350K04698K17999
$$ 5372435 5515213 5664346 5822873 5989391 6160447 6338203 6528553 6733251 6951250
55947F951250K34631K56626K78144K96172L17064L45296L75585M03716M35231
$$ 6951250 7185881 7442507 7720651 8016823 8333887 8679183 9054768 9458484 9893715
55938I893715M75233N19049N60894O02147O43564O79742P09274P39876P75647
$$ 9893715 10368948 10887997 11448891 12051038 12694602 13374344 14083618 14823494 15599141
55929A5599141Q10441Q41539Q77426R23593R73891J024748J083515J152935J222796
$$ 15599141 16409582 17251121 18128547 19052140 20026031 21050779 22134294 23287229 24510025
55920B4510025J288135J360066J446840J540722J636026J742315J865806J996331
$$ 24510025 25798160 27158226 28605066 30145788 31781814 33524129 35389935 37386266
55912C7386266K128165K275053K449240K646359K867795L135025L462751L842074
$$ 37386266 39514431 41789484 44238724 46885083 49752878 52887903 56350654 60192728
55904F0192728M270636M773036N369776O056544O839026P752760Q817642J0009860
$$ 60192728 64463364 69236400 74606176 80662720 87501746 95254506 104072148 114082008
55896A14082008J1312622J2752055J4346882J6079995J7970181K0104041K2529774
$$ 114082008 125394630 138146685 152493567 168573562 186543743 206647784 229177558
55889B29177558K5195496K8040837L0917592L3095868L2921727K8498675J9189904
$$ 229177558 254373054 282413891 313331483 346427351 379349078 407847753 427037657
55882D27037657O501183o675045j7748730k5503073k9951977l1672450l1378349
$$ 427037657 433538840 426863795 409115065 383611992 353660015 321987565 290609216
55875B90609216k9779792k7472970k4857383k2181038j9625911j7309920j5262008
$$ 290609216 260829424 233356454 208499071 186318033 166692122 149382202 134120194
55868A34120194j3463504j1901570j0557210r380448q321676p368442o523375
$$ 134120194 120656690 108755120 98197910 88817462 80495786 73127344 66603969
55861F6603969n770167n089810m487236l972470l532644l147221k813797k535653
$$ 66603969 60833802 55743992 51256756 47284286 43751642 40604421 37790624 35254971
55853C5254971k299643k088594j901871j743803j605010j473883j353907j251811
$$ 35254971 32955328 30866734 28964863 27221060 25616050 24142167 22788260 21536449
55845B1536449j160320j069498r83901r12420q51725p94764p45029p07223o73696
$$ 21536449 20376129 19306631 18322730 17410310 16558585 15763821 15018792 14311569 13637873
55836A3637873o34956n94860n61571n32107m99235m65517m37254m12026l84689
$$ 13637873 13002917 12408057 11846486 11314379 10815144 10349627 9912373 9500347 9115658
55827I115658l58632l39134l22309l02012k81132k65285k51880k36054k20845
$$ 9115658 8757026 8417892 8095583 7793571 7512439 7247154 6995274 6759220 6538375
55818F538375k11020k03020j91280j78485j69674j62150j51032j38871j30153
$$ 6538375 6327355 6124335 5933055 5754570 5584896 5422746 5271714 5132843 5002690
55809E002690j22048j10268r8415r2089q9267q6000q5881r3865j05804j14131
$$ 5002690 4880642 4770374 4671959 4579870 4490603 4404603 4318722 4224857 4119053 4004922
55799D004922j19368j26171j32406j32346j27222j22808j19467j13716j06793
$$ 4004922 3885554 3759383 3626977 3494631 3367409 3244601 3125134 3011418 2904625
55790B904625j02523r9197r2364q3618p8149p5466p0671o3227n6590n0579m1786
$$ 2904625 2802102 2702905 2610541 2526923 2448774 2373308 2302637 2239410 2182820 2132241 2090455
55779B090455l0819k2265j8115j6993j8733k3922l0193l4211l6138l7608l7457
$$ 2090455 2059636 2037371 2019256 2002263 1983530 1959608 1929415 1895204 1859066 1821458 1784001
55768A784001l4097k9593k6602k3946j9831j6327j5741j5925j4456j3908j7416
$$ 1784001 1749904 1720311 1693709 1669763 1649932 1633605 1617864 1601939 1587483 1573575 1556159
55757A556159k2360k4413k4616k6477k9026k8994k7147k6391k5978k3545k0340
$$ 1556159 1533799 1509386 1484770 1458293 1429267 1400273 1373126 1346735 1320757 1297212 1276872
55746A276872j8722j7025j2768q230o685n776j060O185J1125J3215J5395J7346
$$ 1276872 1258150 1241125 1228357 1220127 1213442 1207666 1206606 1212791 1223916 1237131 1252526 1269872
55734A269872J6290J3081J1176J0577Q663N747M049K636o57l682k545J467L562
$$ 1269872 1286162 1299243 1310419 1320996 1329659 1335406 1339455 1342091 1341434 1337752 1335207 1336674 1340236
55721A340236L089L331M693M261J724m28k364o896j4037k1043k7573l5322m2720
$$ 1340236 1343325 1346656 1351349 1355610 1357334 1356906 1354542 1347646 1333609 1312566 1284993 1249671 1206951
55708A206951m5611m3531m0205l7748l5227l2723l1662l0978k8230k4642k4057
$$ 1206951 1161340 1117809 1077604 1039856 1004629 971906 940244 909266 881036 856394 832337
55697H32337k6497k7856k6386k4660k4463k4445k3655k2843k1425j7451j1641
$$ 832337 805840 777984 751598 726938 702475 678030 654375 631532 610107 592656 581015
55686E81015p478o434o677o983q133r828j0101q746p993r018j0583j1558j1859
$$ 581015 573537 567103 560426 553443 545310 535482 525381 516635 508642 499624 489041 477483 465624
55673D65624j0880p949m496k911l353m196m922n803n885m550l935o157r233r653
$$ 465624 454744 446795 442299 439388 436035 431839 426917 421114 415229 410679 406744 400587 391354 381701
55659C81701p872p042p368o362m132l476m848n829n658n807n959m154j252n67
$$ 381701 373829 366787 359419 353057 348925 345449 340601 334772 329114 323307 317348 313194 311942 311375
55645C11375k303k911r19R61P63J03O44J360Q47p54l192o441q928q509n916m068
$$ 311375 309072 306161 305242 306203 306966 307069 307713 309073 309920 309166 305974 299533 290605 282096 276180 272112
55629B72112l533k056R22K957K685J714J417J166Q73K039M947P511Q202P699O937
$$ 272112 268579 266523 267445 270402 273087 274801 276218 277384 278257 280296 285243 292754 300956 308655 315592
55614C15592N971N203N117M398J118l813p146p675p267p290o960n827m801m167
$$ 315592 321563 326766 331883 336281 337399 333586 326440 318765 311498 304208 297248 291421 286620 282453
55600B82453l282k730l904o048o590m980l383l221l658l892m138m055k983j866
$$ 282453 279171 276441 272537 266489 259899 254919 251536 248315 244657 240765 236627 232572 229589 227723
55586B27723k173k941j896N71J722P18p07j640k553k704q10J630J593o75k113
$$ 227723 225550 222609 220713 221284 223006 223724 223017 221377 218824 216120 215310 216940 218533 217858 215745
55571B15745k083k757m013l073j32Q64j181k248J87K887K261q7o42M94P60n13
$$ 215745 213662 210905 206892 203819 203687 204551 203370 201122 201309 204196 206457 206370 205728 206222 206982 206469
55555B06469j972k740k668j597j69L60K28J038K687L031J719J298L039M732M418
$$ 206469 204497 201757 199089 197492 197323 197683 197911 198949 201636 204667 206386 207684 210723 215455 219873
55540B19873L475M005N710P320Q634R358Q440O407N858P751R691R762R480J0833
$$ 219873 223348 227353 233063 240383 249017 258375 266815 273222 279080 286831 296522 306284 315764 326597
55526C26597J2941J4028J4441J5325J6224J6286J6217J7139J9097K2182K7115
$$ 326597 339538 353566 368007 383332 399556 415842 432059 449198 468295 490477 517592
55515E17592L3198L7986M0875M4603N1165N8590O4152O8470P3741P9712Q4186
$$ 517592 550790 588776 629651 674254 725419 784009 848161 916631 990372 1070084 1154270
55504A154270Q6023Q4885P9268O7523N0202K9290N995j8729m2399o2007p6439
$$ 1154270 1240293 1325178 1404446 1471969 1522171 1551461 1557456 1538727 1496328 1434321 1357882
55493A357882q6247r1715r2764r0190q5459p9571p3178o7091o1662n6269n0390
$$ 1357882 1271635 1179920 1087156 996966 911507 831936 758758 691667 630005 573736 523346
55482E23346m4483l9266l4921l1451k8793k6233k2976j9553j7227j5802j3828
$$ 523346 478863 439597 404676 373225 344432 318199 295223 275670 258443 242641 228813
55471B28813j1193r429q963q489p602p645q864r386q189o714o168n652m505m000
$$ 228813 217620 208191 199228 190739 183137 175492 166628 157242 149053 142339 136171 130519 126014 122014
55457A22014m870n419m184k454k037k241j295P49K456L075K499O00j769k580j171
$$ 122014 117144 111725 107541 105087 103050 100809 99514 100263 102719 105794 108293 108893 107124 104544 103373
55442A03373N05O44R8L71R57N95k38l18jm97j641k238j956j342p57n81j580l752
$$ 103373 103878 104522 104620 104991 105948 106543 106305 105987 105986 105489 103848 101610 99654 98312 97555 96974 95394 91642
55424I1642n549n479l721j430N00J282K95j663k599j702l26J81M8j83p06j289
$$ 91642 86093 80614 76893 75463 75963 77245 77540 75877 73278 71576 71250 71431 71479 71296 70590 69301
55408F9301r29K93P80j25j144j451j922k982l438k662j692r34P28L143L887J842
$$ 69301 68372 68665 69445 69320 68176 66725 64803 61821 58383 55721 54029 53095 53823 56966 60853 62695
55392F2695o93j414r88p47j22J264J656Rj589j140j40p12j565k35K400L389K318
$$ 62695 62002 60588 59600 58853 58731 59995 61651 61660 60071 58931 58791 58079 56514 56279 58679 62068 64386
55375F4386J223Q73L89j53J46P52M18k39L94J923K411J533P80P81Q16P83J341
$$ 64386 65609 66482 66871 66718 66864 67616 68034 67795 68189 70112 72523 74056 74836 75617 76433 77216 78557
55358G8557K179K171J207J61n94j015l62J745L820L981K549J471J653K529L556
$$ 78557 80736 82907 84114 84275 83681 82666 82304 84049 87869 91850 94399 95870 97523 100052 103608
55343A03608M414M338K979J366M72k78j579k465j862q62j328l010m068l726k608
$$ 103608 108022 112360 115339 116705 117177 116899 115320 112855 110993 110131 108803 105793 101725 97999 95391
55328I5391j205J06L97o90j925k219k249k744k681j289k61j395l365l536j945
$$ 95391 94186 94292 94689 93999 92074 89855 87606 84862 82181 80892 80631 79236 75871 72335 70390
55313G0390o96l93j1M81K62j08N31J422R50j56L02K178K939J570l06j373k113
$$ 70390 69694 69301 69290 69771 70033 69925 70456 71878 72828 72672 72974 75152 78091 79661 79355 77982 75869
55296G5869k957l416l494l859m161l096n27K083L429L172J379j146k563j877n62
$$ 75869 72912 69496 66002 62143 57982 54886 54359 56442 59871 63043 64422 63276 60713 58836 58274
55281E8274n76j559j963j805j837j183J222L655L345P14j212j302r52n40J025
$$ 58274 57698 56139 54176 52371 50534 49351 50573 54228 57573 58287 57075 55773 54821 54281 55306
55266E5306L001K826K81j747j630r99j326j645j048n41q25p46L69J139M44n56
$$ 55306 58307 61133 61414 59667 58037 57038 55712 54067 53019 52478 51653 50907 51276 52415 52859 52303
55250E2303l01R58K010K144R19j656l878l338k68K078J602r2n59R5K90k74p96
$$ 52303 52002 52960 54970 57114 58033 56377 52499 49161 48893 50971 52573 52481 51922 52017 52307 52033 51237
55233E1237r90r83n08M11R38O99O67J676L001L323K369P53r50k214k571k229j877
$$ 51237 50247 49264 48756 49167 50105 50804 51471 53147 56148 59471 61840 62593 61643 59429 56858 54629 52752
55216E2752j494l92J227K057J627J100J430J899J370l4j324j857j486m14N17K75
$$ 52752 51258 50866 52093 54150 55777 56877 58307 60206 61576 61542 60218 58361 56875 56461 56978 57253
55200E7253j009j927j585o98l75o83q60l67P78J971K187Q40j276k561k296j092
$$ 57253 56244 54317 52732 52034 51659 50976 50116 49749 50527 52498 54685 55525 54249 51688 49392 48300
55184D8300K19J325K097K359K050J146l29j657j511L06K069K146J009l1r31k038
$$ 48300 48519 49844 51941 54300 56350 57496 57167 55510 53999 54305 56374 58520 59529 59498 58567 56529
55168E6529k290o04J609J907M18n85n51j142k680l038j029J653L068L366L359
$$ 56529 54239 53635 55244 57151 57569 56984 56433 55291 52611 49573 48544 50197 53265 56631 59990
55153E9990K770J315r0m92k13K0M2k34j081k039j939m74J288K317K499K022J097
$$ 59990 62760 64075 63985 63493 63280 63300 63342 63108 62027 59988 58049 57575 58863 61180 63679 65701 66798
55136F6798L37N6n69k121l240k325m79k98j793k361j087o3n87j136k99R18J279
$$ 66798 67135 67191 66622 64501 61261 58936 58457 58159 56366 54005 52918 52855 52268 51132 50833 51751 53030
55119E3030J355J750J528J25j096r69l71m01m71J78Q07P31Q05J636J955O53j107
$$ 53030 54385 56135 57663 57788 56692 55723 55352 54951 54480 54658 55465 56196 57001 58637 60592 61245 60138
55102F0138j734j791k629l715l516k164j067m78M40J511J434r9j703j886m58J561
$$ 60138 58404 56613 53984 50269 46753 44589 43522 43044 43484 44995 46429 46330 44627 42741 42283 43844
55086D3844K701K079K83j128j471j545j961j936n97J398K500K084Q40j51k31M42
$$ 43844 46545 48624 48907 47779 46308 44763 42802 40866 40269 41667 44167 46251 47091 46940 46709 47151
55070D7151R70P80N78J357K570K621J232j52m64kQ48K088L061K893K322L001M523
$$ 47151 48121 48901 49479 50836 53406 56027 57259 57107 56643 56641 57489 59577 62638 65531 67853 70854 75377
55053G5377M480K335N97J006K027J806J167J654K690K864K372J994J220m11j468
$$ 75377 79857 82192 82789 83795 85822 87628 88795 90449 93139 96003 98375 100369 101589 101178 99710
55038I9710m65J485K011P19q61j757k147k181j957j968k182j533J76J095k27k362
$$ 99710 99245 100730 102741 103460 102599 100842 98695 96514 94557 92589 90407 88874 89050 90145 89918 87556
55022H7556k881j709n34J21R65J749J449M07J79J135K010J877J016j21j330k061
$$ 87556 84675 82966 82432 82553 83518 85267 86716 87123 87302 88437 90447 92324 93340 93219 91889 89828
55006H9828j761q79m66r25j879k839l183k257n00M06l21j258q01N54J392J570
$$ 89828 88067 87188 86722 85797 83918 81079 77896 75639 75139 75545 75224 73966 73165 73719 75111 76681
54990G6681J598J070k48q59N53K501K462P47j23M34M73o88j069O06K609K736J269
$$ 76681 78279 79349 79101 78242 78795 81296 83758 84505 84382 84816 85289 84601 83532 84138 86747 89483 90752
54973I0752k0l61p3P28K037L124L070J964Q12L58M39M22%m21j50P68J264M62r66
$$ 90752 90732 90371 90298 91026 93063 96187 99257 101221 102033 102391 102830 103252 103252 102831 102681 103449 104713 105175 104209
54954A04209j354M3K209L582L627K956K262J496K97r87j214J57K064K956K654
$$ 104209 102855 102898 105107 108689 112316 115272 117534 119030 119327 118340 117126 117283 119347 122303 124957
54939A24957K239K347K666K916L032K436O53j230j463l00J04r54j632p18L24p0
$$ 124957 127196 129543 132209 135125 138157 140593 141246 140016 138553 138253 138357 137403 135771 135053 135377 135307
54923A35307q82l96R00J332Q07M28K72m45j529j970j597j091p89p66j405k595
$$ 135307 134425 134029 134929 136261 137068 137496 137768 137323 135794 133824 132227 131136 130347 129581 128176 125581
54907A25581l091k029l59M93N43N67N49K33J58O64Q97L87L10J467K414J769R81
$$ 125581 122490 120461 120102 120595 121138 121705 122254 122487 122645 123309 124206 124593 124903 126370 128784 130553 131534
54890A31534K252M773N867N126M535M892N192N465P060R650J0902J0047R186R936
$$ 131534 133786 138559 144426 149552 154087 158979 164171 169636 176696 186346 197248 207295 216481 226417
54876B26417J1082J0947J0158J0468J2008J3181J2531R901O289L072P83j561n215
$$ 226417 237499 248446 258604 269072 281080 294261 306792 316693 322982 326054 326837 325276 320061
54863C20061r832j3563j5075j4550j2953j1273j0330j0246j0231r657q931q413
$$ 320061 310229 296666 281591 267041 254088 242815 232485 222239 212008 202351 193420 185007
54851A85007p386n436l908m100m791l673r35R72J057R61K072L647M541M948N571
$$ 185007 177621 172185 168277 164177 159386 155713 154778 155750 156807 157768 159840 163487 168028 172976 178547
54836A78547O523P665Q816R341Q767Q020Q668J0655J2311J2646J2054J0601P593
$$ 178547 185070 192735 201551 210892 219659 227679 236347 247002 259313 271959 284013 294614 302207
54823C02207L346m35k927n269q492j1701j3333j3118j1929j0549r345q493p939
$$ 302207 305553 305118 302191 296922 288430 276729 263396 250278 238349 227800 218455 209962 202023
54810B02023p523p260o959n873l656j338j37L63J501L251M270M190M143M798N554
$$ 202023 194500 187240 180281 174408 170752 169414 169277 169640 171141 174392 178662 182852 186995 191793 197347
54795A97347N885O052O049N397M378M000M335M186K832P48j541l957n958o696
$$ 197347 203232 209284 215333 220730 225108 229108 233443 237629 240461 241209 239668 235711 229753 223057
54781B23057o522o892q266r333q864p195n564m975n809p500q624q351p427o629
$$ 223057 216535 209643 201377 192044 183180 175985 170421 165446 159637 152137 143513 135162 127735 121106
54767A21106n137k251J92l48l226n198m783l365j999k17J589J792M89j54M07P4
$$ 121106 115969 113718 113910 113562 110336 105138 100355 96990 94991 94774 96363 98155 98644 98490 98897 98971
54751I8971j908l088j725L77J083J260K451L638L168K007K177L389L899L601L589
$$ 98971 97063 93975 92250 92627 93710 94970 97421 101059 104227 106234 108411 111800 115699 119300 122889
54736A22889L648K808J727K000L436M280M003L877M919O928R346J1509J2382J1573
$$ 122889 126537 129345 131072 133072 136508 140788 144791 148668 153587 160515 169861 181370 193752 205325
54722B05325J0406J0506J1800J3132J4239J5482J6258J5455J3355J1351R785P557
$$ 205325 215731 226237 238037 251169 265408 280890 297148 312603 325958 337309 347094 354651
54710C54651L954l26m027o257o842o631p130q816j0250r830p786n427l320j441
$$ 354651 358605 358279 354252 347995 341153 334522 327392 318576 308326 298496 290710 285283 281963 280522
54696B80522k24K20J173L721O605P614O844O564P876R498J0114R877R168P710
$$ 280522 280298 280518 281691 285412 292017 299631 306475 313039 320915 330413 340527 350404 359572 367282
54682C67282N662M003L046K010P44M74J850L594M149L608K849J773k81l056n704
$$ 367282 372944 376947 379993 382003 382747 383221 385071 388665 392814 396422 399271 401044 400763 397707 392003
54667C92003q175j1099j4275j6531j7233j6979j6602j6185j5419j4284j2989j1748
$$ 392003 383828 372729 358454 341923 324690 307711 291109 274924 259505 245221 232232 220484
54655B20484j0884j0724j0974j0778r773q601p795o803n034l384l350m588m870
$$ 220484 209600 198876 187902 177124 167351 158750 150955 144152 139118 135734 132384 127796 122926
54642A22926l016n70L38l42j143j264q41K37K111L854M136L005J808J299J090
$$ 122926 119910 119340 119678 119336 118193 116929 116088 116325 118436 122290 126426 129431 131239 132538 133628
54627A33628R76J396K316K930K866K673K747K752K486K331K547K889L161L300
$$ 133628 134604 136000 138316 141246 144112 146785 149532 152284 154770 157101 159648 162537 165698 168998
54613A68998K957K003J423K450M606N898N222L442J822P20J40J46K55k46r08m21
$$ 168998 171955 173958 175381 177831 182437 188335 193557 196999 198821 199541 199681 199827 200082 199836 198928 198507
54597A98507J275K671L018L337M301M886M326L876N157P775J0010J1030J1326
$$ 198507 199782 202453 205471 208808 213109 217995 222321 226197 231354 239129 249139 260169 271495
54584B71495J1648J2599J4518J6916J8696J9638K0777K2526K3692K3148K1262
$$ 271495 283143 295742 310260 327176 345872 365510 386287 408813 432505 455653 476915
54573D76915J8572J4340P891L79o276j1397j5259j7626j8140j7536j6974j6583
$$ 476915 495487 509827 517718 518097 511821 500424 485165 467539 449399 431863 414889 398306
54561C98306j5866j4996j4376j3452j1460r103q028q691r891j0402j0056r249
$$ 398306 382440 367444 353068 339616 328156 319053 311025 302334 292443 282041 271985 262736
54549B62736q423q084q467r062r110q495p706p128o833o752o536n634l964k198
$$ 262736 254313 246229 237762 228700 219590 211095 203389 196261 189428 182676 176140 170506 166542 164344
54535A64344j006m22l12p65j639k378k750l111l546l522k695j392jJ167J355L7
$$ 164344 163338 162916 162604 161839 160200 157822 155072 151961 148415 144893 142198 140806 140805 141972 143327 143364
54519A43364j661j782k92O48j59j342j469j117j127p80N01J315L61j006o04J194
$$ 143364 141703 139921 139629 140277 140118 138776 137307 136190 135063 134283 134784 136099 136460 135454 134850 136044
54503A36044K109J354K43k21k56r0M09R66J269J833L104M165L886K916K805L618
$$ 136044 138153 139507 139750 139529 139273 139183 139592 140558 141827 143660 146764 150929 154815 157731 160536 164154
54487A64154M036L594L131L122L047K418J274q4q39K13K983N431N974N757O711
$$ 164154 168190 171784 174915 178037 181084 183502 184776 184692 183853 184066 187049 192480 198454 204211 210922
54472B10922Q376Q759P722P037P484Q273R186J0721J1884J0471O259J727j197
$$ 210922 219298 228057 235779 242816 250300 258573 267759 278480 290364 300835 307094 308821 307624
54459C07624l147n303p408q801r728j0497j0629r924r182q917q511p483o553o432
$$ 307624 304477 299174 291766 282965 273237 262740 252111 242187 233005 224088 215577 208094 201541 195109
54445A95109o478n623l961k529j903j701j246k47R39J500R33l60j583k447l145
$$ 195109 188631 183008 179047 176518 174615 172914 171668 171421 172360 173860 174793 174433 172850 170403 167258
54430A67258l556l219k032m22J112K162K436K207K301L073L847L940L610L196
$$ 167258 163702 160483 158451 158029 159141 161303 163739 165946 168247 171320 175167 179107 182717 185913
54416A85913K220L65j419j972j383k92J382L617N098M582K798J358N27k05k27
$$ 185913 188133 188498 187079 185107 183724 183432 184814 188431 193529 198111 200909 202267 202794 202589 202362
54401B02362J216K807K410L40j107j302j711k557j976N78K774K623J127L41N49
$$ 202362 203578 206385 208795 209135 208028 206726 205015 202458 200482 201060 203834 206457 207584 207925 208474
54386B08474Q35R10Q65K31j309k977l688l262k237j178n80o59r17p95p54j630
$$ 208474 209309 210219 211084 211315 210006 207029 203341 200079 197842 196664 196084 195425 194508 193713 192959 191329
54370A91329k912l160k253j719k419l444l728l224k065j89J633J993R11J77R38
$$ 191329 188417 185257 183004 181285 178866 175422 171694 168470 166405 166216 167849 169842 170753 170930 171868
54355A71868K386L456M223M776M368K812J434J475K586L699M306M186L169J954
$$ 171868 174254 177710 181933 186709 191077 193889 195323 196798 199384 203083 207389 211575 214744 216698
54341B16698J793K628K871J892J126J689K479J950L74r58j645j972j904j512j427
$$ 216698 218491 221119 223990 225882 227008 228697 231176 233126 233500 232542 230897 228925 227021 225509 224082
54326B24082j702j438o40r62l141n021m120j206O87L03p55p73R5P67P10Q6o40
$$ 224082 222380 220942 220302 219340 216199 211178 207058 205852 206539 206842 206087 205314 205409 206176 206886 206972 206332
54309B06332r41o55j96R1M08Q62Q46j97j774k849k962k292r89P42K266K935K782
$$ 206332 205391 204736 204540 204631 205039 205901 206747 206550 204776 201927 198965 196673 195684 196426 198692 201627 204409
54292B04409K314J795J176M47j47j57P78K265L117K694K008K339K974J880j153
$$ 204409 206723 208518 209694 210141 209994 209837 210615 212880 215997 218691 220699 223038 226012 227892 226739
54277B26739l732l978k844k405l153m117m646m850m912m991n245n433n058m315
$$ 226739 223007 219029 216185 213780 210627 206510 201864 197014 192102 187111 181866 176433 171375 167060
54263A67060l962l938l327k147j768k789l923l891l094k372j503j45R26Q14j88
$$ 167060 163098 159160 155833 153686 151918 149129 145206 141315 138221 135849 134346 134201 135127 135941 135753
54248A35753j318k310k696j550P66K036R00j076j700j286j636k815l163k057o47
$$ 135753 134435 132125 129429 127879 128645 130681 131581 130505 128805 127519 125883 123068 119905 117848 117201
54233A17201L9J22o3m73r24j170j335j466j183m92k37p44r80k58L80n3m69N54
$$ 117201 117240 117362 117299 116826 115902 114732 113397 111931 110748 110256 110019 109275 108295 108037 108417 108364 107895 108449
54215A08449J943J393q80k067p83J027Q98j012k571k332p69N69O48m2j33Q13J685
$$ 108449 110392 111785 110905 108838 108055 109082 109980 108968 106397 104065 103296 103865 104513 104471 104338 105151 106836
54198A06836J492Q09P07J067J218J366J996K399J510j94j133q76l90k85k40j58
$$ 106836 108328 109137 109844 110911 112129 113495 115491 117890 119400 119206 118073 117197 116807 116522 116282 116124
54182A16124l49m82J92J404J868J011l98j415j719j258k10P33J050J187J712J980
$$ 116124 115775 115293 115485 116889 118757 119768 119370 117955 116236 114978 114768 115501 116551 117738 119450 121430
54166A21430J001p11j603j293q17o83l58J48p3j153j890j525q19p27j137j527
$$ 121430 122431 121720 120117 118824 118007 117324 116966 117114 117041 115888 113998 112473 111654 110927 109790 108263
54150A08263j889k323k627k765l002l154k553j175m1m0r75j986k389j999j220
$$ 108263 106374 104051 101424 98659 95657 92503 89950 88775 88734 88694 87719 85733 83344 81345 80125
54135H0125q19r22n17J070K511J747j036l142k578j94J837K443J789K10j821l270
$$ 80125 79306 78384 77867 78937 81448 83195 82159 79017 76439 76245 78082 80525 82314 82524 80703 77433
54119G7433l123j501L17R42M1j275j363K20K096K677K007J186N65k67r82n97O91
$$ 77433 74310 72809 73126 74068 74109 72834 71471 71691 73787 76464 78471 79657 80222 79955 78973 78376 79067
54102G9067J346O82r9J34P10L62p11j164m61M68M32p14k004k256j092P50K149
$$ 79067 80413 81095 80996 81130 81840 82202 81491 80327 79866 80334 80766 80052 78048 75792 74700 75450 77599
54085G7599K525J978Q75l14j116j477j761j822p76J504L421L395K065J265J238
$$ 77599 80124 82102 82977 82663 81547 80070 78309 76487 75711 77215 80636 84031 86096 87361 88599
54070H8599O11q88j692r07K32L12k44j86N63J079Q77K45m20q30p93m54k49k76
$$ 88599 89210 88322 86630 85723 85955 86267 86023 85837 86400 87479 88356 88601 88181 87351 86558 86104 85855 85579
54052H5579j95Q4K17J29K08N85R49J254J770K261K037J112L68K46K26J2J64R79
$$ 85579 85384 85468 85685 85814 86022 86607 87556 88810 90580 92841 94878 95990 96358 96604 96830 96842 97006 97985
54034I7985J727J659R32l1j199k234k190q29N38N31m49q70j20J006J632J788J938
$$ 97985 99712 101371 102303 102272 101073 98839 96649 95820 96358 96889 96440 95570 95450 96456 98088 99876 101814
54017A01814K165J959P15j373k993k734n98J957L488L583K519Q41n34p05K48J342
$$ 101814 103979 105938 106653 105280 102287 99553 98955 100912 104400 107983 110502 111343 110809 110104 110352 111694
54001A11694J863J818J218M9p94l2J989L108K090L52j16O31J260J496K064K845
$$ 111694 113557 115375 116593 116642 115848 115816 117805 120913 123003 123355 123239 123870 125130 126626 128690 131535
53985A31535K780J569R9q68j221p58Q24K952M335M564M700N682O880O892N368
$$ 131535 134315 135884 135983 135115 133894 133136 133960 136912 141247 145811 150511 156193 163073 169965 175333
53970A75333L418K349K497L299M093M623M940N175N447N822O111N964N332M652
$$ 175333 178751 181100 183597 186896 190989 195612 200552 205727 211174 216996 223107 229071 234403 239055
53956B39055M233L723K636J182k4q24j337j112M80K786L960L023J011n02j265
$$ 239055 243288 247011 249647 250829 250805 249981 248644 247532 248012 250798 254758 257781 258792 258290 257025
53941B57025j996k836l217l038l129m280o189p526p105n158l274k705k956k743
$$ 257025 255029 252193 248976 245938 242809 238529 232340 224814 217709 212551 209277 206572 203616 200873
53927B00873k104k344l693m376k926l44J122O85o06j626k119k181j969j958k464
$$ 200873 198769 196425 192732 188356 185430 185086 186208 186893 186287 184661 182542 180361 178392 176434 173970
53912A73970k808j879L02K336L057K597J583J18j705k900k259l6J999K596K551
$$ 173970 171162 169283 169585 171921 174978 177575 179158 179276 177571 174671 172412 172376 174375 176971 179522
53897A79522L430N227O284N594M093L198L047L047L316M254N131M553K483N95
$$ 179522 182952 188179 194463 200057 204150 207348 210395 213442 216758 221012 226143 230696 233179 233774
53883B33774K89J361K897M342N298N266M394L683L795M195M167L990M442N480
$$ 233774 234063 235424 238321 242663 247961 253227 257621 261304 265099 269294 273461 277451 281893 287373
53869B87373O176N784M437K910J919J542J221O44L79J084K272K774K422K213K584
$$ 287373 293549 299333 303770 306680 308599 310141 311362 312006 312385 313469 315741 318515 320937 323150 325734
53854C25734K713K049J336J389J919K536L892O564R336R981P785M404K143K022
$$ 325734 328447 330496 331832 333221 335140 337676 341568 348132 357468 367449 375234 379638 381781 383803
53840C83803L444N122O184O684O965O638M726J136k620m682m534l173k059k188
$$ 383803 387247 392369 398553 405237 412202 418840 423566 424702 422082 417400 412866 409693 407634 405446
53826D05446l594n283o005n530m816m795n502o520p578q494r168r842j0603j0680
$$ 405446 401852 396569 390564 385034 380218 375423 369921 363401 355823 347329 338161 328319 317716 307036
53812C07036r273p155n995n817m812k494j112k576n546p321p397p180p157o519
$$ 307036 297763 290608 284613 278796 273984 271490 270378 267802 262256 254935 247538 240358 233201 226682
53798B26682n271m495m452m150l139k209k042k458l212m318n247n083l882k740
$$ 226682 221411 216916 212464 208314 205175 202966 200924 198466 195254 190936 185689 180606 176724 173984
53784A73984k154j308M53K279K768J719L64n9M16P27K59j86N71K168K797J623
$$ 173984 171830 170522 170975 173254 176022 177741 178105 178046 178462 179189 179448 179262 179833 182001 184798 186421
53768A86421J2n16l50n98q94j14J302J740R29K56M37O60L36R2L61N85L90L70R48
$$ 186421 186433 185917 185567 184969 184075 183961 185263 187003 187932 188188 188625 189285 189621 189713 190074 190659 191049 191419 192367
53749A92367J609J831J753J475Q56N47J779M427O589O967O348N720M478K043n0
$$ 192367 193976 195807 197560 199035 199891 200438 202217 206644 213233 220200 226548 232268 236746 238789 238739
53734B38739K70K571M493N102N636O735P092N668L589K619K881L322L586L994
$$ 238739 239009 241580 246073 251175 256811 263546 270638 276306 279895 282514 285395 288717 292303 296297
53720B96297M225L501K086J169J055P45j21l45Q67K101J362j140l321m053l891
$$ 296297 300522 304023 306109 307278 308333 309078 308957 308612 309479 311580 312942 311802 308481 304428 300537
53705C00537l155j288J148J966K07j940j880j59O00l76j325j075o35j142k065
$$ 300537 297382 296094 297242 299208 299415 297475 295595 295436 296036 295660 294335 293260 292625 291483 289418
53690B89418k476k726l665n008n669n359m886m944n190m695l055j056n2n34j551
$$ 289418 286942 284216 280551 275543 269874 264515 259629 254685 249495 244800 241745 240689 240637 240103 238552
53675B38552j961j815j897k225k105j557j392j708j543n48J93k91j435k101k079
$$ 238552 236591 234776 232879 230654 228549 226992 225600 223892 222349 221801 221994 221703 220268 218167 216088
53660B16088j810j382q04o07j135j641j143Q0R57J287J887L058L980L925L080
$$ 216088 214278 212896 212092 211485 210350 208709 207566 207646 208603 209890 211777 214835 218815 222740 225820
53645B25820J949P33l27p62m87j23j87n15q10j101j219m42J436L190L344K157
$$ 225820 227769 228502 228175 227413 226926 226803 226616 226101 225291 224190 222971 222529 223965 227155 230499 232656
53629B32656J374J933K964L393L406L581L520K539J178P64J512K346K639K976
$$ 232656 234030 235963 238927 242320 245726 249307 252827 255366 256544 257308 258820 261166 263805 266781
53615B66781L717M031L174J853J274J359J044J66n9J210L067L802K959J839J887
$$ 266781 270498 274529 277703 279556 280830 282189 283233 283399 283340 284550 287617 291419 294378 296217 298104
53600B98104K893L211J835l39j682j851j851k293k720k785k991l596l767k756
$$ 298104 300997 304208 306043 305704 304022 302171 300320 298027 295307 292522 289531 285935 282168 279412
53586B79412j283q33j820l188l549k274J20K097K202O50p10n87K95O33M27L11
$$ 279412 278129 277296 275476 272288 268739 266465 266585 268682 270884 271534 270824 270237 270532 271165 271592 271903
53570B71903N4o58o36J531M810O317M953K592J198O58L81J095L482O148O821N202
$$ 271903 271957 271299 270663 272194 277004 283321 288274 290866 292064 292722 293103 294198 297680 303828 310649 315851
53554C15851L246K689L432M387M923N147N350N578N592N099M106L049K540K843
$$ 315851 319097 321786 325218 329605 334528 339675 345025 350603 356195 361294 365400 368449 370989 373832
53540C73832L552L741K812J429J214K998N716P532P769P076O138N253M880N375
$$ 373832 377384 381125 383937 385366 386580 389578 395294 402826 410595 417671 423809 429062 433942 439317
53526D39317O051N648M059K573K139K385K586K470J734M1j865k257o45J156J181
$$ 439317 445368 451016 455075 457648 459787 462172 464758 467228 468962 469003 467138 464881 464236 465392 466573
53511D66573j73r53k83R67J770K034K002J479n3k655n290o182m556k068j303k462
$$ 466573 466400 465447 465164 466131 467901 469935 471937 473416 473363 470708 465418 459236 454680 452612 451309 448847
53495D48847k901q95J678J872k10j847j667j009j201j546p95Q75K365L144L445
$$ 448847 445946 445051 446729 448601 448391 446544 444877 443868 442667 441121 440326 441201 443566 446710 450155
53480D50155L638M059M924N862O161N824N733O270O607O079N595O656R232J1585
$$ 450155 453793 457852 462776 468638 474799 480623 486356 492626 499233 505312 510907 517563 526795 538380
53466E38380J2341J1966J1946J3037J4602J5478J5211J4550J4817J6672J9389
$$ 538380 550721 562687 574633 587670 602272 617750 632961 647511 662328 679000 698389
53455F98389K1483K2142K1980K2335K4007K6665K9291L0885L0997L0057K9393
$$ 698389 719872 742014 763994 786329 810336 837001 866292 897177 928174 958231 987624
53444I87624L0442L3426L6908L9188M0073M0910M2686M4710M5550M4869M3800
$$ 987624 1018066 1051492 1088400 1127588 1167661 1208571 1251257 1295967 1341517 1386386 1430186
53433A430186M3539M4080M4532M4324M3784M3582M3977M4694M5346M5582M5013
$$ 1430186 1473725 1517805 1562337 1606661 1650445 1694027 1738004 1782698 1828044 1873626 1918639
53422A918639M3573M2066M1742M2832M4025M4023M3191M2743M2628M1482L8739
$$ 1918639 1962212 2004278 2046020 2088852 2132877 2176900 2220091 2262834 2305462 2346944 2385683
53411B385683L5514L2919L0723K8387K6313K4899K3263K0295J6561J3699J2105
$$ 2385683 2421197 2454116 2484839 2513226 2539539 2564438 2587701 2607996 2624557 2638256 2650361
53400B650361J0583Q386O117M110J369k911p660j1002j2538j3615j5524j8462
$$ 2650361 2660944 2669330 2675447 2679557 2680926 2678015 2670355 2659353 2646815 2633200 2617676 2599214
53388B599214k2055k5992k9794l2894l5352l7862m0568m2482m2748m2059m1867
$$ 2599214 2577159 2551167 2521373 2488479 2453127 2415265 2374697 2332215 2289467 2247408 2205541
53377B205541m2381m2371m1234m0116m0230m0955m0697l9216l7736l6638l4508
$$ 2205541 2163160 2120789 2079555 2039439 1999209 1958254 1917557 1878341 1840605 1803967 1769459
53366A769459l0199k4956k1404k0615k1048k0288j7243j2593p720l571k69K676
$$ 1769459 1739260 1714304 1692900 1672285 1651237 1630949 1613706 1601113 1593393 1589822 1589553 1592229
53354A592229N911R964J4955K0289K4814K7834L0002L2675L6221L9708M2458M5135
$$ 1592229 1598140 1608104 1623059 1643348 1668162 1695996 1725998 1758673 1794894 1834602 1877060 1922195
53342A922195M8578N2321N5185N7000N8709O0974O3664O6633O9935P3146P5622
$$ 1922195 1970773 2023094 2078279 2135279 2193988 2254962 2318626 2385259 2455194 2528340 2603962
53331B603962P7697Q0494Q4002Q6706Q7925Q9391R3011R7788J00787J01067J00965
$$ 2603962 2681659 2762153 2846155 2932861 3020786 3110177 3203188 3300976 3401763 3502830 3603795
53320C603795J02911J06326J08594J08191J05841J03071J00674R8482R5912R2540
$$ 3603795 3706706 3813032 3921626 4029817 4135658 4238729 4339403 4437885 4533797 4626337
53310D626337Q8466Q4065P9277P3439O6135N7804M9133M0361L1786K4353J8813
$$ 4626337 4714803 4798868 4878145 4951584 5017719 5075523 5124656 5165017 5196803 5221156 5239969
53299E239969J4473R731L733l389j1696k1434l1699m0493m7001n2870o0357o9910
$$ 5239969 5254442 5264173 5267906 5264517 5252821 5231387 5199688 5159195 5112194 5059324 4998967 4929057
53287D929057q0339r0494r9766j07532j13301j17293j19975j21274j21105j20309
$$ 4929057 4848718 4758224 4658458 4550926 4437625 4320332 4200357 4079083 3957978 3837669
53277C837669j20006j19995j18912j16132j12633j09768j07808j05979j03328
$$ 3837669 3717663 3597668 3478756 3362624 3249991 3140223 3032415 2926436 2823108
53268B823108r9547r5391r2277r0687q9152q5659q0124p4421o9884o5791o0805
$$ 2823108 2723561 2628170 2535893 2445206 2356054 2270395 2190271 2115850 2045966 1980175 1919370
53257A919370n4835m8878m3707l9345l5335l0983k5877k0526j6015j2656r538
$$ 1919370 1864535 1815657 1771950 1732605 1697270 1666287 1640410 1619884 1603869 1591213 1581675
53246A581675n809j669K219N546Q031R247R531J0179J1906J3826J4956J6027J8444
$$ 1581675 1575866 1574197 1576416 1581962 1589993 1599240 1608771 1618950 1630856 1644682 1659638 1675665 1694109
53233A694109K1995K5112K7261K9552L2768L6226L9093M1541M3871M5580M6249
$$ 1694109 1716104 1741216 1768477 1798029 1830797 1867023 1906116 1947657 1991528 2037108 2083357
53222B083357M6593M7592M9033M9918M9988M9963N0230N0106M8728M6084M2918
$$ 2083357 2129950 2177542 2226575 2276493 2326481 2376444 2426674 2476780 2525508 2571592 2614510
53211B614510L9881L6996L3887L0489K7460K5436K3639J9984J3516O436K318J968
$$ 2614510 2654391 2691387 2725274 2755763 2783223 2808659 2832298 2852282 2865798 2872234 2874552 2876520
53199B876520K203n15o263j2413j7184k0875k4146k7066l0172l4692m0706m6396
$$ 2876520 2878723 2878208 2871945 2859532 2842348 2821473 2797327 2770261 2740089 2705397 2664691 2618295
53187B618295n0316n3340n7113o1372o4384o5628o6476o8098p0081p1428p1722
$$ 2618295 2567979 2514639 2457526 2396154 2331770 2266142 2199666 2131568 2061487 1990059 1918337
53176A918337p0829o8642o5729o3356o2020o0678n8162n4856n2102n0423m9282
$$ 1918337 1847508 1778866 1713137 1649781 1587761 1527083 1468921 1414065 1361963 1311540 1262258
53165A262258m8406m8235m8785m8888m7265m4065m0679l8016l5569l2600k9662
$$ 1262258 1213852 1165617 1116832 1067944 1020679 976614 935935 897919 862350 829750 800088
53154H00088k8073k7785k6819k3599j9180j6122j5354j5271j4169j2394j1419
$$ 800088 772015 744230 717411 693812 674632 658510 643156 627885 613716 601322 589903
53143E89903j1549j1599j0723r661r739j1063j2217j1862j0223q626p730o909
$$ 589903 578354 566755 556032 546371 536632 525569 513352 501490 491267 482641 474911 468002
53131D68002n586m485m780o346p699p700o759o093o287o772o554n370m167m143
$$ 468002 462416 457931 453151 446805 439106 431406 424647 418554 412267 405495 398941 393571 389404 385261
53117C85261n236o019n577m776m989o021o330n175l564k954l729n009n378l975
$$ 385261 380025 374006 368429 363653 358664 352643 346313 341138 337574 334620 330891 325882 320504 316529
53103C16529j552k28j342l735n087m731l959l793l825l522l212l253l427l652
$$ 316529 314977 314749 313407 309672 304585 299854 295895 292102 288277 284755 281543 278290 274863 271211
53089B71211m235m891m617l181j643q56m29J33L74j78j012j469j751k196k359
$$ 271211 266976 262085 257468 254287 252644 251788 251359 251492 251866 251688 250676 249207 247456 245260 242901
53074B42901j855j350j656k300k115r28L69J181J792K545L178L110K071N18n04
$$ 242901 241046 239696 238040 235740 233625 232697 233066 234247 236039 238584 241762 244872 246943 247461 246957
53059B46957l01O76J326J122K24j340l416m673l466l36J822J053j432l301m006
$$ 246957 246656 247332 248658 249780 250004 248664 245248 240575 237109 236773 238595 239648 238216 234915 230909
53044B30909m346m380l587k480k385l645n186n766m799k424K89J602P21j177k353
$$ 230909 226563 222183 218596 216116 213731 210086 204900 199134 194335 191911 192200 193802 194523 193346 190993
53029A90993k503k426k332j771q73l39k01J87R71J531J526J356J536K117K714
$$ 190993 188490 186064 183732 181961 181088 180749 180548 180735 181706 183237 184763 186119 187655 189772 192486
53014A92486K654J525L5k85J122K918L526L006K448K269K232K487L300M181M403
$$ 192486 195140 196665 196700 196415 197537 200455 203981 206987 209435 211704 213936 216423 219723 223904 228307
52999B28307M093L787L471K968K617K396J259j256l498l489j791p97j570l153
$$ 228307 232400 236187 239658 242626 245243 247639 248898 247642 244144 240655 238864 238067 236497 233344
52985B33344m688o139o914n899l415j502j579l062m640n565n471m347l016k434
$$ 233344 228656 222517 215603 209704 206289 204787 203208 200146 195506 189941 184470 180123 177107 174673
52971A74673k274j559p47j452l819n877o200n443m558l270j531q48k469n132o167
$$ 174673 172399 170840 170093 168641 164822 158945 152745 147302 142744 139474 137943 137095 134626 129494 123327
52956A23327m552j772J35N47L19M69R46P69n19k015k699k940l568l975k784l77
$$ 123327 118775 117003 117138 117685 118004 118473 119419 120188 119669 117654 114955 112015 108447 104472 101688 101311
52940A01311J157J005P07J370J679L3k679m020k969o11J553K674K423J092j37
$$ 101311 102468 103473 104180 105550 107229 107262 104583 100563 97594 96983 98536 101210 103633 104725 104588
52925A04588m2J233K226J738J05j100o83Q28J637P32q68j540j191r50j169j082
$$ 104588 104546 105779 108005 109743 109848 108748 108065 108893 110530 111262 110394 108854 107663 106713 105544 104462
52909A04462n04k98p83j083n80J93P20J304J927J650J02j452j616p22j45l21l65
$$ 104462 103958 103660 102877 101794 101214 101407 102127 103431 105358 107008 107110 105658 104042 103320 103175 102854 102489
52892A02489P05K916N142N663L641M58j229l47J467J970P24j082k277k460j897
$$ 102489 103194 106110 111252 116915 120556 121014 119785 119438 120905 122875 123599 122517 120240 117780 115883
52877A15883j345j413j745j477o53j11J34R60K279K785K265K300L562M256K867
$$ 115883 114538 113125 111380 109903 109250 109139 109273 110233 112512 115297 117562 119862 123424 127680 130547
52862A30547Q89Q04K466L713L728L580L680L076J566O06J351L091M360M685M570
$$ 130547 131436 132240 134706 138419 142147 145727 149407 152483 154049 154655 156006 159097 163457 168142 172712
52847A72712M394L868K496L25j767k796k765k498k243j409j51j22k487n916p810
$$ 172712 177106 180974 183470 183795 182028 179232 176467 173969 171726 170317 170166 170044 167557 161641 153831
52832A53831p198n322l669k577j769j218j072j311j768k325l161m616o301o580
$$ 153831 146633 141311 137642 135065 133296 132078 131006 129695 127927 125602 122441 117825 111524 104944
52818A04944m094r2K219J417m19p31J19P8j194k082j692q61n17o19p87p24K2J579
$$ 104944 100850 100758 102977 104394 103975 103244 103363 103441 102247 100165 98473 97612 97095 96476 95689 94965 94987 96566
52800I6566K995L099K090J289J356J720J711J238M72k94n90l76l76r39j133j00
$$ 96566 99561 102660 104750 106039 107395 109115 110826 112064 112536 112242 111652 111276 110900 109961 108828 108728
52784A08728J305J660J296J866L705N221M998L153O09j628k516j871j181k006
$$ 108728 110033 111693 112989 114855 118560 123781 128779 131932 132541 130913 128397 126526 125345 123339
52770A23339l555l587j826m37p08j323q50N7J76j77j70j22o13q94P6J695K357
$$ 123339 119784 116197 114371 113934 113226 111903 111053 111110 111286 111109 110939 110817 110204 109310 109386 111081 113438
52753A13438J660N66l39j363k438k693j765n77l03r33j330n64J028K173K021J071
$$ 113438 115098 115664 115325 113962 111524 108831 107066 106489 106186 105253 103923 103359 104387 106560 108581 109652
52737A09652N47J012K043L098M020M654M776M654M939N612N732M709L120J803
$$ 109652 110199 111211 113254 116352 120372 125026 129802 134456 139395 145007 150739 155448 158568 160371
52723A60371Q36K3l43k5L25j67j394k461k855k724k249j572j169j445j998k120
$$ 160371 161207 161230 160887 160862 161187 161020 159626 157165 154310 151586 149337 147765 146596 145151 143153 141033
52707A41033j984k421l383l664k577j019j73q7k46q90k529m465n159m203k838
$$ 141033 139049 136628 133245 129581 127004 125985 125812 125725 125479 124589 122060 117595 112436 108233 105395
52692A05395k160j888j415r21o44j1J274K041J040q75j505k65J089J098L94L17
$$ 105395 103235 101347 99932 99011 98367 98356 99630 101671 102711 101836 100331 100066 101155 102253 102647 102964
52676A02964Q86J136N79n17j691k393k247j650j477j602q11J145K573K042N74
$$ 102964 103850 104986 105565 105048 103357 100964 98717 97067 95590 93988 93177 94322 96895 98937 99511
52661I9511J87R46J104j83j777k263j496k28P82J094P78L84L08L91N61J172K012
$$ 99511 99698 100644 101748 101565 99788 97525 96029 95801 96583 97677 98455 98839 99147 99538 100099 101271 103283
52644A03283J836K8j972k352j410q34j003q23m4K86q1L5J215K407K598K057J218
$$ 103283 105119 105147 103175 100823 99413 98579 97576 96753 96709 96995 96914 96949 98164 100571 103169 105226 106444
52627A06444j96k079l220k748j398n26n84j170j733j618l73J389K276J805R22
$$ 106444 106248 104169 100949 98201 96803 96277 95693 94523 92790 91172 90799 92188 94464 96269 97191
52612I7191M07m4n30j75J312K494K018P39O13J934L065K701J269O2j17N57J206
$$ 97191 97598 97554 97024 96849 98161 100655 102673 103412 104025 105959 109024 111725 112994 113056 112939 113496 114702
52595A14702R94O1n47j30Q82J754K408K999L245K903K393K246K319K255K224K545
$$ 114702 115696 115757 115210 115080 115962 117716 120124 123123 126368 129271 131664 133910 136229 138484 140708 143253
52579A43253L019L351L709M182M221L446K461J903J292j81k073l111k979k518
$$ 143253 146272 149623 153332 157514 161735 165181 167642 169545 170837 170656 168583 165472 162493 159975
52565A59975k199j532j68J303J943J263o56l051m637m556l385k483k478k974l580
$$ 159975 157776 156244 156076 157379 159322 160585 159929 156878 152241 147685 144300 141817 139339 136365 132785
52550A32785m263m714m444l709l398l707l854l370k711k121r39J141K930K875
$$ 132785 128522 123808 119364 115655 112257 108550 104696 101326 98615 96494 95555 96696 99626 102501
52536A02501J014j018j745r74N06J700J956J408P99O12M94Ln46n46k09k60o49
$$ 102501 103515 102497 100752 99778 100284 101984 103940 105348 106147 106759 107253 107256 106710 106164 105955 105695 105046
52519A05046n05M09J095O67m28j169j350j399j278m73R19J955J983J390R05O66
$$ 105046 104541 104950 106045 106712 106284 105115 103765 102366 101088 100615 101534 103489 105472 106862 107767 108433
52503A08433L46m8L7J027K511L343K582N68j247j731j202p52q10r56q80o42o0
$$ 108433 108779 108731 108768 109795 112306 115649 118231 118799 117552 115821 114619 113867 113057 112101 111221 110579 110519
52486A10519J162K508K789J636J04o93p33n07k26k37j093k358k367l90J845K170
$$ 110519 111681 114189 116978 118614 118718 118025 117292 116785 116559 116322 115229 112871 110504 110114 111959 114129
52470A14129Q43n3L62J008R09L68r0m37m70J87J156J545J343J302J280K38j732
$$ 114129 114972 114919 115281 116289 117198 117566 117476 117039 116569 116756 117912 119457 120800 122102 123382 123620 121888
52453A21888k991k683j861j449o81J066K477K096Q71Q79K047K166K13k136k747
$$ 121888 118897 116214 114353 112904 112223 113289 115766 117862 118733 119612 121659 123825 124038 121902 119155
52438A19155j439M32J700J993J256m19k546m160m093j753J953M731M797K727Q86
$$ 119155 117716 118148 119848 121841 123097 122678 120132 115972 111879 110126 112079 116810 121607 124334 125220
52423A25220P13J198M76j554k923j954O11K373J978N11j17M40R32O72N33J397
$$ 125220 125933 127131 127607 126053 123130 121176 121787 124160 126138 126649 126532 126972 127904 128576 129109 130506
52407A30506K501K318P28o90n97N47J201N75o58j292q52J40R20J126P59j04j166
$$ 130506 133007 135325 136053 135363 134766 135313 136514 137089 136431 135139 134287 134427 135347 136473 137232 137128 135962
52390A35962j728j202J74J447J769R95l77j437j340j06J077J008j43j091j018
$$ 135962 134234 133032 133206 134653 136422 137417 137040 135603 134263 134157 135234 136242 136099 135008 133990
52375A33990j85Q94J979K735K744K142J408L27j770m416n752m687k462j167j309
$$ 133990 133805 134699 136678 139413 142157 144299 145707 146034 144264 139848 134096 129409 126947 125780 124471
52360A24471j681j210n1R07J028N51N01J579K977L005J275o94j520j596j750j504
$$ 124471 122790 121580 121529 122436 123464 124015 124516 126095 129072 132077 133352 132658 131138 129542 127792 126288
52344A26288j12J433J296m52j658r95L57O28j29l85P02K294K849J605p83k776
$$ 126288 126176 127609 128905 128453 126795 125800 126157 126785 126656 126271 126973 129267 132116 133721 132938 130162
$$ [...]
##END NTUPLES=NMR SPECTRUM
##END=
