
##TITLE=AC1227_VIERS11107_6524403_KjY33rWw5b
##JCAMPDX= 6.0         $$ Bruker NMR JCAMP-DX V2.0
##DATA TYPE= NMR SPECTRUM
##DATA CLASS= NTUPLES
##ORIGIN= BRUKER
##OWNER= Administrator
$$ 1.72 TOPSPIN		Version 2.1
$$ 2012-07-14 21:14:18.156 -0500  Administrator@TOPSPIN
$$ Compression mode = diff/dup
##.OBSERVE FREQUENCY= 400.02188249412
##.OBSERVE NUCLEUS= ^1H
##.ACQUISITION MODE= SIMULTANEOUS (DQD)
##.ACQUISITION SCHEME= undefined
##.AVERAGES= 64
##.DIGITISER RES= 22
##SPECTROMETER/DATA SYSTEM= spect
##.PULSE SEQUENCE= noesygpps1d.comp
##.SOLVENT NAME= COFFEE_meoh
##.SHIFT REFERENCE= INTERNAL, COFFEE_meoh, 1, 14.96086
##AUDIT TRAIL= $$ (NUMBER, WHEN, WHO, WHERE, PROCESS, VERSION, WHAT)
$$ ##TITLE= Audit trail, TOPSPIN		Version 2.1
$$ ##JCAMPDX= 5.01
$$ ##ORIGIN= Bruker BioSpin GmbH
$$ ##OWNER= Administrator
$$ $$ C:\Bruker\TOPSPIN/data/COFFEE/nmr/AC1227_VIERS11107_6524403_KjY33rWw5b/12/pdata/1/auditp.txt
$$ ##AUDIT TRAIL=  $$ (NUMBER, WHEN, WHO, WHERE, PROCESS, VERSION, WHAT)
(   1,<2012-07-14 21:14:13.171 -0500>,<Administrator>,<TOPSPIN>,<go>,<TOPSPIN 2.1>,
      <created by zg
	started at 2012-07-14 21:02:42.875 -0500,
	POWCHK enabled, PULCHK disabled,
       configuration hash MD5:
       6B 1B 68 BB D9 2E 58 E2 7F 35 AD 54 07 DF 0E 41
       data hash MD5: 64K
       6B BF E5 4F DC 65 95 46 94 DB 54 34 FB 27 3F E4>)
(   2,<2012-07-14 21:14:16.000 -0500>,<Administrator>,<TOPSPIN>,<proc1d>,<TOPSPIN 2.1>,
      <Start of raw data processing
       efp LB = 0.3 FT_mod = 6 PKNL = 1 PHC0 = 0 PHC1 = 0 SI = 128K 
       data hash MD5: 128K
       79 5B 6B 10 61 1F D5 5A 6B 50 E3 DA 83 38 EB 2B>)
(   3,<2012-07-14 21:14:17.390 -0500>,<Administrator>,<TOPSPIN>,<proc1d>,<TOPSPIN 2.1>,
      <pk PHC0 = -2.070923 PHC1 = 0 
       data hash MD5: 128K
       EC EE 89 2D D0 53 79 7A AD 92 C4 40 3D 45 ED B9>)
(   4,<2012-07-14 21:14:17.625 -0500>,<Administrator>,<TOPSPIN>,<proc1d>,<TOPSPIN 2.1>,
      <abs ABSG = 1 
       data hash MD5: 128K
       8B 65 FD 1C AB AB 4D C8 F1 2C 91 69 EF 0C A2 86>)
(   5,<2012-07-14 21:14:17.703 -0500>,<Administrator>,<TOPSPIN>,<proc1d>,<TOPSPIN 2.1>,
      <abs ABSG = 2 
       data hash MD5: 128K
       B9 33 7A AB 83 BF 04 7D 39 5A 73 59 05 89 A3 39>)
(   6,<2012-07-14 21:14:17.812 -0500>,<Administrator>,<TOPSPIN>,<proc1d>,<TOPSPIN 2.1>,
      <abs ABSG = 3 
       data hash MD5: 128K
       91 9F E2 0D BA EA 92 FB 71 91 DF 40 88 72 CA 2A>)
(   7,<2012-07-14 21:14:18.000 -0500>,<Administrator>,<TOPSPIN>,<proc1d>,<TOPSPIN 2.1>,
      <abs ABSG = 4 
       data hash MD5: 128K
       B5 FF 0C 63 80 20 BC 2A 7B 39 83 11 53 D8 0E 46>)
(   8,<2012-07-14 21:14:18.062 -0500>,<Administrator>,<TOPSPIN>,<proc1d>,<TOPSPIN 2.1>,
      <abs ABSG = 5 
       data hash MD5: 128K
       97 3E B5 CB 1F 6B 95 E9 0B 7F 88 5C AA AE BD E1>)
$$ ##END=
$$ 
$$ $$ hash MD5
$$ $$ A7 8E 0A 87 91 F6 FC AF 37 6B C2 ED 3E A7 FF 63
##$RELAX= 
##$RELAX= 
##$RELAX= 
##$RELAX= 
##$RELAX= 
##$RELAX= 
##$RELAX= 
##$RELAX= 
$$ Bruker specific parameters
$$ [...]
##$TP07= 0
##$TPNAME0= <>
##$TPNAME1= <>
##$TPNAME2= <>
##$TPNAME3= <>
##$TPNAME4= <>
##$TPNAME5= <>
##$TPNAME6= <>
##$TPNAME7= <>
##$TPOAL= (0..7)
0.5 0.5 0.5 0.5 0.5 0.5 0.5 0.5
##$TPOFFS= (0..7)
0 0 0 0 0 0 0 0
##$TUNHIN= 0
##$TUNHOUT= 0
##$TUNXOUT= 0
##$USERA1= <user>
##$USERA2= <user>
##$USERA3= <user>
##$USERA4= <user>
##$USERA5= <user>
##$V9= 5
##$VALIST= <valist>
##$VCLIST= <CCCCCCCCCCCCCCC>
##$VD= 0
##$VDLIST= <DDDDDDDDDDDDDDD>
##$VPLIST= <PPPPPPPPPPPPPPP>
##$VTLIST= <TTTTTTTTTTTTTTT>
##$WBST= 2048
##$WBSW= 25
##$XGAIN= (0..3)
0 0 0 0
##$XL= 0
##$YL= 0
##$YMAX_a= 9863477
##$YMIN_a= -7380225
##$ZGOPTNS= <>
##$ZL1= 120
##$ZL2= 120
##$ZL3= 120
##$ZL4= 120
##$ABSF1= 14.96086
##$ABSF2= -5.597322
##$ABSG= 5
##$ABSL= 3
##$ALPHA= 0
##$AQORDER= 0
##$ASSFAC= 0
##$ASSFACI= 0
##$ASSFACX= 0
##$ASSWID= 0
##$AUNMP= <proc_prof1d_extract.lims>
##$AXLEFT= 0
##$AXNAME= <>
##$AXNUC= <1H>
##$AXRIGHT= 0
##$AXTYPE= 0
##$AXUNIT= <>
##$AZFE= 0.1
##$AZFW= 0.1
##$BCFW= 0
##$BC_mod= 0
##$BYTORDP= 0
##$COROFFS= 0
##$CY= 15
##$DATMOD= 1
##$DC= 0
##$DFILT= <>
##$DTYPP= 0
##$F1P= 0
##$F2P= 0
##$FCOR= 0.5
##$FTSIZE= 131072
##$FT_mod= 6
##$GAMMA= 0
##$GB= 0
##$INTBC= 1
##$INTSCL= 1
##$ISEN= 128
##$LB= 0.3
##$LEV0= 0
##$LPBIN= 0
##$MAXI= 10000
##$MC2= 0
##$MEAN= 0
##$ME_mod= 0
##$MI= 0
##$NCOEF= 0
##$NC_proc= -2
##$NLEV= 6
##$NOISF1= 0
##$NOISF2= 0
##$NSP= 0
##$NTH_PI= 0
##$NZP= 0
##$OFFSET= 14.96086
##$PC= 1
##$PHC0= -2.070923
##$PHC1= 0
##$PH_mod= 1
##$PKNL= yes
##$PPARMOD= 0
##$PPDIAG= 0
##$PPIPTYP= 0
##$PPMPNUM= 2147483647
##$PPRESOL= 1
##$PSCAL= 4
##$PSIGN= 0
##$PYNMP= <proc.py>
##$REVERSE= no
##$SF= 400.020009692123
##$SI= 131072
##$SIGF1= 0
##$SIGF2= 0
##$SINO= 400
##$SIOLD= 131072
##$SPECTYP= <>
##$SREGLST= <1H.CDCl3>
##$SSB= 0
##$STSI= 131072
##$STSR= 0
##$SW_p= 8223.68421052631
##$SYMM= 0
##$S_DEV= 0
##$TDeff= 65536
##$TDoff= 0
##$TI= <>
##$TILT= no
##$TM1= 0
##$TM2= 0
##$TOPLEV= 0
##$USERP1= <user>
##$USERP2= <user>
##$USERP3= <user>
##$USERP4= <user>
##$USERP5= <user>
##$WDW= 1
##$XDIM= 131072
##$YMAX_p= 370414136
##$YMIN_p= -11720
##$CURPLOT= <Network HP LaserJet P1505>
##$CURPRIN= <$Network HP LaserJet P1505>
##$DFORMAT= <normdp>
##$LAYOUT= <+/1D_H.xwp>
##$LFORMAT= <normlp>
##$PFORMAT= <normpl>
##$SURQMSG= 1
$$ End of Bruker specific parameters
$$ ---------------------------------
##NTUPLES= NMR SPECTRUM
##VAR_NAME=  FREQUENCY,     SPECTRUM/REAL,   SPECTRUM/IMAG
##SYMBOL=    X,             R,               I
##VAR_TYPE=  INDEPENDENT,   DEPENDENT,       DEPENDENT
##VAR_FORM=  AFFN,          ASDF,            ASDF
##VAR_DIM=   131072,        131072,          131072
##UNITS=     HZ,            ARBITRARY UNITS, ARBITRARY UNITS
##FACTOR=    0.0627417313425164, 1,          1
##FIRST=     8223.62146879497, 903,          -46860
##LAST=      0,             709,             -47230
##MIN=       0,             -11720,          0
##MAX=       8223.62146879497, 370414136,    0
$$ Real data points
##PAGE= N=1
##DATA TABLE= (X++(R..R)), XYDATA
$$ [...]
63920D095861N197k5696n7250q8355j17298j42865j64448j81507j93598k00842
63910B929199k03804k02980j98880j92322j84045j74093j62223j48838j34853
63901A327161j20689j06197r1633p7994o6116n6131m8031m1948l7456l3397k9029
63890F18540k4889k1844j9796j7998j6248j4971j4215j3442j2337j1234j0466
63879D41100r813q865p536o005m364k670j194k93Q3N52J804L870O084P821R160
63864D29734J0612J2411J4374J6315J8216J9949K1344K2607K4218K6234K8085
63853F44099K9315L0146L0987L1812L2313L2337L1780L0392K8048K5023K1636
63842I67888J7862J3634R260N036P24m088r120j3495j6776j9548k2716k6440k9909
$$ y = [4095861, 4101058, 4075362, 4018112, 3929757, 3812459, 3669594, 3505146, 3323639, 3130041, 2929199, 2725395, 2522415, 2323535, 2131213, 1947168, 1773075, 1610852, 1462014, 1327161, 1206472, 1100275, 1008642, 930648, 864532, 808401, 760370, 718422, 680966, 647569, 618540, 593651, 571807, 552011, 534013, 517765, 502794, 488579, 475137, 462800, 451566, 441100, 431287, 422422, 414886, 408881, 404517, 401847, 400653, 400360, 400443, 400995, 402799, 406669, 412753, 420574, 429734, 440346, 452757, 467131, 483446, 501662, 521611, 542955, 565562, 589780, 616014, 644099, 673414, 703560, 734547, 766359, 798672, 831009, 862789, 893181, 921229, 946252, 967888, 985750, 999384, 1008644, 1013680, 1014404, 1010316, 1001196, 987701, 970925, 951377, 928661, 902221, 872312]
63829H72312l2170l3071l3282l3374l3174l2276l0931k9722k8530k6620k3894
63818E35268k1311j9693j8847j8316j8148j8310j8081j6889j5217j3912j2990
63807C43554j1912j0597r332q088o796n911n782n780n071l903l174k950k610k176
63793B59472k299k913l215l031k961l101k875k387k526l310l508k532j388j072
63779B22354j181r53n89o08q18q86j062j506j647j159p08q11p82O9R61O64n40
63762B10798j254r10j87L19N92N81J36m72q51j141j519j421l14J058J407P27J79
63745B07728K76M38L66M93Q43Q10M14M98J211J568J129Q62J522K261J948J021
63729B23388Q79J901L189M026M627N406O282O863O901O467N905N525N254M813
$$ y = [872312, 840142, 807071, 773789, 740415, 707241, 674965, 644034, 614312, 585782, 559162, 535268, 513957, 494264, 475417, 457101, 438953, 420643, 402562, 385673, 370456, 356544, 343554, 331642, 321045, 311713, 303625, 296829, 290918, 285136, 279356, 274285, 270382, 267208, 264258, 261648, 259472, 257173, 254260, 251045, 248014, 245053, 241952, 239077, 236690, 234164, 230854, 227346, 224814, 223426, 222354, 221173, 220220, 219631, 219023, 218205, 217319, 216257, 214751, 213104, 211945, 211237, 210426, 209644, 209713, 210674, 211338, 210798, 209544, 208634, 208447, 208766, 209358, 209939, 210075, 209603, 208752, 207611, 206092, 204671, 204357, 205415, 206822, 207549, 207728, 208004, 208442, 208808, 209301, 210144, 210954, 211368, 211866, 213077, 214645, 215774, 216636, 218158, 220419, 222367, 223388, 224267, 226168, 229357, 233383, 238010, 243416, 249698, 256561, 263462, 269929, 275834, 281359, 286613, 291426]
63715B91426M275L991L829L105J574p2j130j791k613l563m219m509m630m512m001
63700B77160l330k854k469j856j101n24q7M74J043J304J400J776K368K611K359
63685B78274K133K210K104J319J93m98n23l37l48m06j54M61J217K121L466N217
63669B96449O590O774O002N333N191M823L577K063J273J056L66j079k459l236
63655C32723l936n062o045o021n164m517m650n071n014m327l423k676k053j299
63641B73465k54R77K125K927L200K910K343K078K530L474M216M346M184M397N259
63626C18177O340O885O561N859N647O295P458Q722J0121J1714J3043J3672J4028
63613D34522J5107J7296K0049K2764K5333K7746K9775L1415L3038L4728L5891
$$ y = [291426, 295701, 299692, 303521, 306626, 308200, 308128, 306998, 305207, 302594, 299031, 294812, 290303, 285673, 281161, 277160, 273830, 270976, 268507, 266651, 265550, 265026, 264939, 265413, 266456, 267760, 269160, 270936, 273304, 275915, 278274, 280407, 282617, 284721, 286040, 286233, 285735, 285212, 284875, 284527, 284121, 283967, 284428, 285645, 287766, 291232, 296449, 303039, 309813, 315815, 321148, 326339, 331162, 334739, 336802, 338075, 339131, 339497, 338418, 335959, 332723, 328787, 323725, 317680, 311659, 306495, 301978, 297328, 292257, 287243, 282916, 279493, 276817, 274764, 273465, 273211, 274188, 276313, 279240, 282440, 285350, 287693, 289771, 292301, 295775, 299991, 304337, 308521, 312918, 318177, 324517, 331402, 337963, 343822, 349469, 355764, 363222, 371944, 382065, 393779, 406822, 420494, 434522, 449629, 466925, 486974, 509738, 535071, 562817, 592592, 624007, 657045, 691773, 727664]
63602G27664L5906L4716L2359K8450K2748J5961R310L374k030o873j0434j2086
63590H79065j2207j2050j2667j4099j5643j6974j8708k1485k4647k6577k6517
63579F77491k5318k4038k2541k0164j7152j4464j2528j1029r647q142n989l021
63567E03458k54J031J164J867L978O411P841Q254Q283Q012P296O563O452P142
63553E77498Q625J1041J4091J6839J8854K1011K4248K8184L1902L5577M0006M4716
63541H72592M7805M7737M4343L7985K8895J7771O175m120j1886j6481j7924j7185
63529A035707j5708j4421j3565j3462j4615j6946j9737k2601k5742k9098l1972
63518H17840l3872l4857l4739l2976k9893k7030k5382k4040k1604j8274j5537
$$ y = [727664, 763570, 798286, 830645, 859095, 881843, 897804, 907114, 910488, 908458, 901585, 891151, 879065, 866858, 854808, 842141, 828042, 812399, 795425, 776717, 755232, 730585, 704008, 677491, 652173, 628135, 605594, 585430, 568278, 553814, 541286, 530257, 520610, 512468, 506479, 503458, 503204, 504235, 505399, 507266, 511244, 517655, 525496, 533750, 542033, 550045, 557341, 563904, 570356, 577498, 586123, 597164, 611255, 628094, 646948, 667959, 692207, 720391, 752293, 787870, 827876, 872592, 920397, 968134, 1012477, 1050462, 1079357, 1097128, 1103303, 1099183, 1087297, 1070816, 1052892, 1035707, 1019999, 1005578, 992013, 978551, 963936, 946990, 927253, 904652, 878910, 849812, 817840, 783968, 749111, 714372, 681396, 651503, 624473, 599091, 575051, 553447, 535173, 519636]
63507E19636j4088j3285j2445j1614j0941j0202r204q046o835n659m857m741m991
63494D02728m923m447m146m284m388l975l156k264j356m38K99P74J249J875K340
63479C75888K316K062K217L020M058M759M934M788M509L978K914J253p22k608
63465D13366m054m756m654m264m419n281n934n433m015k783k365k438k463k218
63451C58289j661q38r9J77J81M99J307K248L240M668O513P976Q476Q479Q932J0215
63435D18602J2218J4935J8523K2873K7566L2031L5472L6939L5903L2532K7266
63424G14860K0607J3710Q478O259O648Q312J0747J4432J9451K4897K9861L4173
63412I12435L7802M0118M0231L7741L2850K6105J8304J0366K952l670r278j3494
$$ y = [519636, 505548, 492263, 479818, 468204, 457263, 447061, 437857, 429811, 422976, 417317, 412460, 407719, 402728, 397805, 393358, 389212, 384928, 380540, 376565, 373409, 371145, 369789, 369351, 369650, 370424, 371673, 373548, 375888, 378204, 380266, 382483, 385503, 389561, 394320, 399254, 404042, 408551, 412529, 415443, 416696, 415974, 413366, 409312, 404556, 399902, 395638, 391219, 385938, 380004, 374571, 370556, 367773, 365408, 362970, 360507, 358289, 356628, 355790, 355691, 355868, 356049, 356548, 357855, 360103, 363343, 368011, 374524, 382500, 390976, 399455, 408387, 418602, 430820, 445755, 464278, 487151, 514717, 546748, 582220, 619159, 655062, 687594, 714860, 735467, 749177, 757655, 763914, 770562, 778874, 789621, 804053, 823504, 848401, 878262, 912435, 950237, 990355, 1030586, 1068327, 1101177, 1127282, 1145586, 1155952, 1158904, 1155234, 1145956, 1132462]
63400A132462j6219j7885j9049j9951k0746k1948k4077k7007k9952l2253l3802
63389H69573l4694l4832l4074l2536l0498k8113k5427k2605j9842j7056j4074
63378E75822j1176r034p816o656m564j713P56K248L426N208P586R875J1666J3008
63364E88636J3989J4763J5908J8048K1072K4113K6473K8211K9844L1821L4314
63353H47192L7090L9482M0810M0878L9766L7182L2554K5870J7968R778J822n314
63341A165078j0708j3860j5433j6625j8021j9453k0770k2141k3686k5439k7691
63330I51251l0768l4278l7001l7834l6697l4366l1653k8841k5697k1843j7317
63319F14956j2783q956n756k519O74K372J053l027p922j1944j5041j7922k0426
$$ y = [1132462, 1116243, 1098358, 1079309, 1059358, 1038612, 1016664, 992587, 965580, 935628, 903375, 869573, 834879, 800047, 765973, 733437, 702939, 674826, 649399, 626794, 606952, 589896, 575822, 564646, 555612, 547796, 541140, 536576, 534863, 535619, 537867, 541293, 546501, 554087, 563962, 575628, 588636, 602625, 617388, 633296, 651344, 672416, 696529, 723002, 751213, 781057, 812878, 847192, 884282, 923764, 964574, 1005452, 1045218, 1082400, 1114954, 1140824, 1158792, 1168570, 1170392, 1165078, 1154370, 1140510, 1125077, 1108452, 1090431, 1070978, 1050208, 1028067, 1004381, 978942, 951251, 920483, 886205, 849204, 811370, 774673, 740307, 708654, 679813, 654116, 632273, 614956, 602173, 593217, 587461, 584942, 585616, 587988, 589041, 586014, 578092, 566148, 551107, 533185, 512759]
63306E12759k1377k0078j7294j4542j2620j1237r839q447p526p292p398p282o678
63293C61149n774m922m308l914l692l674l814l870l567k923k266j920j959k262
63279C12284k680l062l213k986k400j653j026p90r98j308j194n29J55K20l37r22
63263B89561j074q71o31m98m33l76k45K6L46M89M04K81K13L8k38j93M37J140J133
63244B89509L67l39k96L64J054J324R94J67o07o65m8L92J13l50j77N06R45J014
63226B94267J286J872K075J545J020J383K462L299L292K557J494N20J24N51J446
63211C19193K175K519K712K853K691K075J246N74L10N78J321K114K362J900J206
63196C45829R31J344K228L134L684L874M163N013O295P411Q079Q655R532J0549
$$ y = [512759, 491382, 471304, 454010, 439468, 426848, 415611, 405772, 397325, 389799, 382507, 375109, 367827, 361149, 355375, 350453, 346145, 342231, 338539, 334865, 331051, 327181, 323614, 320691, 318425, 316505, 314546, 312284, 309604, 306542, 303329, 300343, 297943, 296290, 295264, 294474, 293476, 292168, 290974, 290445, 290600, 290820, 290483, 289561, 288487, 287616, 286985, 286487, 286054, 285678, 285433, 285459, 285805, 286294, 286698, 286979, 287192, 287230, 286992, 286799, 287236, 288376, 289509, 289876, 289537, 289241, 289605, 290659, 291983, 292977, 293144, 292537, 291872, 291824, 292216, 292329, 291979, 291802, 292308, 293253, 294267, 295553, 297425, 299500, 301045, 302065, 303448, 305910, 309209, 312501, 315058, 316552, 317072, 317196, 317747, 319193, 321368, 323887, 326599, 329452, 332143, 334218, 335464, 336038, 336348, 336926, 338247, 340361, 342723, 344623, 345829, 346760, 348104, 350332, 353466, 357150, 361024, 365187, 370200, 376495, 383906, 391985, 400640, 410172, 420721]
63182D20721J1231J1430J1431J1633J2263J3210J3931J3822J2910J1945J1504
63171E56031J1318J0865J0252R927R662Q628O566M207K293O82j179l423n768q004
63157F12057r999j1524j2558j3558j4920j6312j7025j6949j6613j6259j5418j3699
63145D37223j1538r803q827q145p072n382l500k080j329p57J43J107J373P95J77
63130C82385K09O29Q63J032J682K797L759M259M591M983N249N277N333N635O022
63115D34705O270O390O390O135N720N564N881O329O503O379O006N208M088L443
63101E15011L942N037N464M939M629N584P272Q230P936P404P809Q972R584Q787
63087F10600P120N734N048M496L399J565r44l944o857q771r310r118r070r289
$$ y = [420721, 431952, 443382, 454813, 466446, 478709, 491919, 505850, 519672, 532582, 544527, 556031, 567349, 578214, 588466, 598393, 608055, 616683, 623249, 627456, 629749, 630431, 629252, 625829, 620061, 612057, 602058, 590534, 577976, 564418, 549498, 533186, 516161, 499212, 482599, 466340, 450922, 437223, 425685, 415882, 407055, 398910, 391838, 386456, 382956, 380876, 379547, 378790, 378933, 380040, 381413, 382208, 382385, 382594, 383223, 384086, 385118, 386800, 389597, 393356, 397615, 402206, 407189, 412438, 417715, 423048, 428683, 434705, 440975, 447365, 453755, 459890, 465610, 471174, 477055, 483384, 489887, 496266, 502272, 507480, 511568, 515011, 518953, 523990, 529454, 534393, 539022, 544606, 551878, 560108, 568044, 575448, 583257, 592229, 601813, 610600, 617720, 623454, 628502, 632998, 636397, 637962, 637018, 633074, 626217, 617446, 608136, 599018, 589948, 580659]
63073E80659r345r120q931q871q566p644o128m509l614m073n415n998m614j974
63059D91857PL96n0k61j2M91J200J956K344K406K909M373O308P843Q724R215R485
63042E49191R582R618R523R024Q335Q271R121R871R376P877O572O011N753N381
63028F63506M936M385L580K754K232J588K4k307m261n208n753o563p377p671p509
63013F36356p126o320m939l422k153p02J494M041O011P291Q707J0790J3116J5016
62999F78160J6329J7279J8039J8661J9083J9065J8363J7151J6032J5543J5791
62988H69496J6528J7358J7809J7530J6533J5082J3274J0976Q135M905J387k492
62976A006521o690j0904j4827j8342k1370k3761k5520k6901k7985k8303k7290
$$ y = [580659, 571314, 562194, 553263, 544392, 535826, 528182, 522054, 517545, 513931, 509858, 504443, 498445, 493831, 491857, 491864, 492260, 492210, 491949, 491937, 492428, 493628, 495584, 497928, 500334, 503243, 507616, 513924, 521767, 530491, 539706, 549191, 558773, 568391, 577914, 586938, 595273, 603544, 612665, 622536, 631912, 639789, 646361, 652372, 658125, 663506, 668442, 672827, 676407, 679161, 681393, 682981, 683005, 680698, 676437, 671229, 665476, 658913, 651536, 643865, 636356, 629230, 622910, 617971, 614549, 612396, 611694, 613188, 617229, 623240, 630531, 639238, 650028, 663144, 678160, 694489, 711768, 729807, 748468, 767551, 786616, 804979, 822130, 838162, 853705, 869496, 886024, 903382, 921191, 938721, 955254, 970336, 983610, 994586, 1002721, 1007626, 1009013, 1006521, 999831, 988927, 974100, 955758, 934388, 910627, 885107, 858206, 830221, 801918, 774628]
62965G74628k5052k2480k0440j9076j7945j6638j5119j3643j2547j2098j2249
62954E87341j2527j2369j1750j1258j1352j1695j1551j0848j0343j0511j0732
62943D62405j0063q615p565p657q253q235p454o713o457o144n132l698k676k384
62929C71359k343k096j741j538j439j284j137j090r75o78n03p60j146j086o52
62914C52891m86p41p63j43N91P99P08Q85J205J128P70P83J149J059K86j47Q03
62897C60777K847M856O257P295Q168Q651Q623Q332P950P334O460N692N309M989
62883D53540M123K562Q20n02j268j804k509l485m477n173n551n913o521p264p781
62868D08797p836p425o641n644m815m563m834n051m753m102l505k971k232j405
$$ y = [774628, 749576, 727096, 706656, 687580, 669635, 652997, 637878, 624235, 611688, 599590, 587341, 574814, 562445, 550695, 539437, 528085, 516390, 504839, 493991, 483648, 473137, 462405, 452342, 443727, 436162, 428505, 420252, 412017, 404563, 397850, 391393, 385249, 380117, 376419, 373743, 371359, 369016, 366920, 365179, 363641, 362202, 360918, 359781, 358691, 357716, 357038, 356535, 355775, 354629, 353543, 352891, 352405, 351664, 350901, 350758, 351349, 352148, 352856, 353741, 354946, 356074, 356844, 357627, 358776, 359835, 360121, 359974, 360777, 363624, 368480, 374737, 382032, 390200, 398851, 407474, 415806, 423756, 431090, 437550, 443242, 448551, 453540, 457663, 460225, 461045, 460543, 459275, 457471, 454962, 451477, 447000, 441827, 436276, 430363, 423842, 416578, 408797, 400961, 393536, 386895, 381251, 376436, 371873, 367039, 361988, 357235, 353133, 349628, 346657, 344425, 343020]
62854C43020r90j127j352j315j293j567j742j150J00J089J119L86m51j014j261
62839C32452j171p40k00O8m4j85R2P68J311J262P81M46M93N42K17k75m03j4N66
62820C35966J035J381J674J845J748J255L44p24j424j449j116r65j057j060r07
62805C36546q50q70o26j41M0k94o23m74j01P6K16O12Q90M39m84q86l54L70M20
62786C33906j13l97J12J182K171K696K912L269L981M795N399N839O356O925P274
62771C86307P335P350P500P599P217N975L825J250q77j956k140j962j722j512
62757D24189j638k419l587m476m895n309n991o566o676o530o414o126n401m617
62743C53544m454m968n452n302m603l874l485l422l395l104k485j706r27j91M29
$$ y = [343020, 342030, 340903, 339551, 338236, 336943, 335376, 333634, 332484, 332584, 333673, 334792, 335178, 334727, 333713, 332452, 331281, 330541, 330341, 330409, 330365, 330180, 330272, 331040, 332351, 333613, 334394, 334840, 335333, 335875, 336092, 335817, 335414, 335400, 335966, 337001, 338382, 340056, 341901, 343649, 344904, 345248, 344524, 343100, 341651, 340535, 339570, 338513, 337453, 336546, 335696, 334826, 334200, 334059, 334099, 333805, 333182, 332708, 332607, 332683, 332899, 333511, 334401, 334840, 334356, 333470, 333116, 333486, 333906, 333793, 333396, 333508, 334690, 336861, 339557, 342469, 345738, 349719, 354514, 359913, 365752, 372108, 379033, 386307, 393642, 400992, 408492, 416091, 423308, 429283, 433108, 434358, 433481, 431525, 429385, 427423, 425701, 424189, 422551, 420132, 416545, 412069, 407174, 401865, 395874, 389308, 382632, 376102, 369688, 363562, 358161, 353544, 349090, 344122, 338670, 333368, 328765, 324891, 321406, 317984, 314589, 311485, 309000, 307294, 306367, 306176, 306605]
62728C06605P84Q64Q60Q67P49N19N80J206J982K231J915J700K066K736L224L627
62712C32515M467N868P191P702P481P412Q256R926J1770J3368J4754J6100J7532
62699D64342J9267K1464K3888K6073K7932K9761L1584L3006L3930L4774L5548
62688G81569L5355L3532L0779K8308K6040K2612J7220J0607L956k414q894j5601
62676I63069k2064k7559l1516l3871l5186l6106l6580l6048l4510l2818l1539
62665F05272l0138k7880k5085k2776k1273j9866j7916j5579j3315j1265r401p892
62653C82886o970o571o392o136n598m732l821l380l651m267m600m356l654k751
62639C16007j930j502j528j542r96kP93J147J463J832J557J83j463k151j867j603
$$ y = [306605, 307389, 308253, 309113, 309980, 310729, 311248, 311828, 313034, 315016, 317247, 319162, 320862, 322928, 325664, 328888, 332515, 336982, 342850, 350041, 357743, 365224, 372636, 380892, 390818, 402588, 415956, 430710, 446810, 464342, 483609, 505073, 528961, 555034, 582966, 612727, 644311, 677317, 711247, 746021, 781569, 816924, 850456, 881235, 909543, 935583, 958195, 975415, 986022, 989978, 987564, 978670, 963069, 941005, 913446, 881930, 848059, 812873, 776767, 740187, 704139, 669629, 636811, 605272, 575134, 547254, 522169, 499393, 478120, 458254, 440338, 424759, 411444, 400179, 390778, 382886, 375916, 369345, 362953, 356817, 351219, 346487, 342666, 339286, 335635, 331368, 326768, 322412, 318758, 316007, 314077, 312575, 311047, 309505, 308509, 308507, 309300, 310447, 311910, 313742, 315299, 315482, 314019, 311868, 310001, 308398]
62623C08398j664j338m59q1r05k049k289j756j375j190n32M89R69O94M43N92N43
62606B98490m9n11k49L17N32N41Q28J220J193P35L11J65K60O31J278J906K235
62589C09833K319K274K007J616J664K429L260L307K589J730R64J27n99q39q10
62574C31871j165j961k565k654k593k671k672k474k372k540k732k742k716k686
62560B97328k431j970j696j683j428o32L48J106J729K206J978P32p85j452j075
62545B92275l70P9K73L58M10O02J045J469J558J537J855K344K314J631J015J096
62529C09491J623J995K049K030K059K109K335K998M154N547O868P967Q876R769
62515C69870J0797J1936J3107J4422J6064J7851J9229J9933K0356K0988K1733
$$ y = [308398, 306734, 305396, 304937, 304856, 303951, 301902, 299613, 297857, 296482, 295292, 294760, 295249, 296218, 296912, 297355, 297947, 298490, 298441, 297930, 297681, 297998, 298530, 299071, 299899, 301119, 302312, 303047, 303358, 303523, 303783, 304414, 305692, 307598, 309833, 312152, 314426, 316433, 318049, 319713, 322142, 325402, 328709, 331298, 333028, 333992, 334119, 333520, 332681, 331871, 330706, 328745, 326180, 323526, 320933, 318262, 315590, 313116, 310744, 308204, 305472, 302730, 300014, 297328, 294897, 292927, 291231, 289548, 288120, 287488, 287836, 288942, 290671, 292877, 294855, 295587, 294802, 293350, 292275, 291905, 291984, 292257, 292615, 293025, 293627, 294672, 296141, 297699, 299236, 301091, 303435, 305749, 307380, 308395, 309491, 311114, 313109, 315158, 317188, 319247, 321356, 323691, 326689, 330843, 336390, 343258, 351225, 360101, 369870, 380667, 392603, 405710, 420132, 436196, 454047, 473276, 493209, 513565, 534553, 556286]
62504E56286K2066K1713K0808J9391J7209J4126J0435O636L101Jk600m706o262
62491F78204p005o697n606m440l511k191L53M002P638J0442J2744J5426J8623
62478G17982K1515K3273K3867K3786K3151K1461J8213J3625Q598L928l87n005
62466H94007j0447j6436k2085k6634k9988l2512l4425l5519l5535l4627l3277
62455E82522l1705k9641k6825k3542k0413j7718j5236j2777j0547q811p460o123
62443C71724m597l024j670o79K9O86J391J889J820J264P92P78R27P85M01R9k10
62426C72405r49k097l028l319l242l276l440l384k901k085j205o58p73j426j989
62411C38633j965j520j159j060j042j017j024r26n21K1K57J52J90O50J129J176
$$ y = [556286, 578352, 600065, 620873, 640264, 657473, 671599, 682034, 688670, 691771, 691772, 689172, 684466, 678204, 671199, 664502, 658896, 654456, 650945, 648754, 649107, 653109, 660747, 671189, 683933, 699359, 717982, 739497, 762770, 786637, 810423, 833574, 855035, 873248, 886873, 895471, 899399, 899012, 894007, 883560, 867124, 845039, 818405, 788417, 755905, 721480, 685961, 650426, 615799, 582522, 550817, 521176, 494351, 470809, 450396, 432678, 417442, 404665, 394118, 385307, 377847, 371724, 367127, 364103, 362433, 361754, 361783, 362469, 363860, 365749, 367569, 368833, 369625, 370403, 371330, 372115, 372516, 372615, 372405, 371456, 369359, 366331, 363012, 359770, 356494, 353054, 349670, 346769, 344684, 343479, 342821, 342048, 340622, 338633, 336668, 335148, 333989, 332929, 331887, 330870, 329846, 328920, 328399, 328420, 328677, 328829, 329019, 329669, 330798, 331974]
62395C31974R85J130J738K461L090L705M223M338M076L937M186M470M531M838
62381C79682N906P230P665P009O461P171Q851J0280J0879J1193J1925J3051J4009
62368E01312J4421J4447J4620J5407J6916J8939K1288K4041K7432L1620L6558
62357G37001M1899M6983N1234N4764N8247O1900O4786O5558O3694N9570N3529
62346A359165M5493L5668K4996J4576M830m446j3386k1586k8410l3734l8242m2731
62334A302193m6966m9669m9983m8554m6611m4359m1141l7024l3187l0461k8410
62323H45828k6318k4274k2762k1823k1280k1197k1528k1711k1316k0662k0134
62312F02823j9381j7955j6332j5360j4870j3922j2308j0839r924q949p411n780
$$ y = [331974, 332959, 334089, 335827, 338288, 341378, 345083, 349306, 353644, 357720, 361657, 365843, 370313, 374844, 379682, 385588, 392818, 400483, 407492, 413953, 421124, 429975, 440255, 451134, 462327, 474252, 487303, 501312, 515733, 530180, 544800, 560207, 577123, 596062, 617350, 641391, 668823, 700443, 737001, 778900, 825883, 877117, 931881, 990128, 1052028, 1116814, 1182372, 1246066, 1305636, 1359165, 1404658, 1440326, 1465322, 1479898, 1484728, 1480282, 1466896, 1445310, 1416900, 1383166, 1344924, 1302193, 1255227, 1205558, 1155575, 1107021, 1060410, 1016051, 974910, 937886, 904699, 874238, 845828, 819510, 795236, 772474, 750651, 729371, 708174, 686646, 664935, 643619, 622957, 602823, 583442, 565487, 549155, 533795, 518925, 505003, 492695, 481856, 471932, 462983, 455572, 449792]
62300D49792m708m048l281k394j718j305r45n47l4Q43K101L139L312K769K325
62285D45301K536L295M220N051N562N515M883L991L318L185L570M067M169L714
62271E02377L107L038L949N773P997J0040J1794J3856J6893K0701K4290K7177
62259F50992L0082L3931L8658M3584M8597N4047N9623O4253O7301O8915O8860
62248A228843O6025N9740N0911M0977L0307J8581O360m917j4581k3293l1653l9233
62236A388067m5461n0637n5293n9116o1290o1595o0470n8199n4769n0443m5756
62225G85038m0977l6070l1301k7204k3900k1011j8395j6329j4770j3055j0791
62214E31235q543p126o558o228n836n559n446n192m616l885l192k477j670r35
$$ y = [449792, 445084, 441036, 437755, 435361, 433643, 432338, 431393, 430846, 430812, 431655, 433756, 436895, 440207, 442976, 445301, 447837, 451132, 455352, 460403, 465965, 471480, 476363, 480354, 483672, 486857, 490427, 494494, 498663, 502377, 505484, 508522, 512471, 518244, 526241, 536281, 548075, 561931, 578824, 599525, 623815, 650992, 681074, 715005, 753663, 797247, 845844, 899891, 959514, 1023767, 1091068, 1159983, 1228843, 1294868, 1354608, 1405519, 1446496, 1476803, 1495384, 1501744, 1496827, 1482246, 1458953, 1427300, 1388067, 1342606, 1291969, 1236676, 1177560, 1116270, 1054675, 994205, 936006, 881237, 830794, 785038, 744061, 707991, 676690, 649486, 625586, 604575, 586180, 569851, 555081, 542026, 531235, 522692, 515566, 509008, 502780, 496944, 491385, 485939, 480747, 476131, 472246, 469054, 466577, 464907, 463972]
62200D63972m66j76K82J102K009K494K412K298K852M176N708O907P695Q230Q644
62185E18139R136R925J0852J1380J1289J1039J1088J1230J0936J0099Q970P701
62173F41784O439N712O110P724J0272J3617J7654K1933K6095L0583L6054M2070
62161H66047M7118N0129N1204N0595M7874M2703L5780K8179K0139J1320K073o363
62149A246798j3145j8705k4024k9400l4275l8070m0759m2514m3185m2432m0334
62138H79955l7534l4599l1520k7992k4002j9876j5987j2646j0088q175o346m313
62126F46877k591j750j357l75J371K948L758M373N573P190Q555R466J0173J0772
62112G04983J1270J1993J3239J4686J5612J5510J4152J1311P067K246k050n305
$$ y = [463972, 463506, 463330, 463612, 464714, 466723, 469217, 471629, 473927, 476779, 480955, 486663, 493570, 501265, 509495, 518139, 527275, 537200, 548052, 559432, 570721, 581760, 592848, 604078, 615014, 625113, 634083, 641784, 648223, 653935, 660045, 667769, 678041, 691658, 709312, 731245, 757340, 787923, 823977, 866047, 913165, 963294, 1014498, 1065093, 1112967, 1155670, 1191450, 1219629, 1239768, 1251088, 1253161, 1246798, 1233653, 1214948, 1190924, 1161524, 1127249, 1089179, 1048420, 1005906, 962721, 920289, 879955, 842421, 807822, 776302, 748310, 724308, 704432, 688445, 675799, 665711, 657536, 651190, 646877, 644286, 642536, 641179, 640804, 642175, 645123, 648881, 653254, 658827, 666017, 674572, 684038, 694211, 704983, 716253, 728246, 741485, 756171, 771783, 787293, 801445, 812756, 819823, 822069, 820019, 814714]
62100H14714p534q560q037o364m859m662n836p707r693j1420j2412j2182j0716
62087G04732q525o128l601p62K341N311P847J0125J2540J5139J7536J9451K1034
62074G97040K2606K4265K5962K7691K9432L1006L2175L2791L2821L2479L2385
62063A120653L3216L4882L6344L6611L5751L4547L3223L0906K6449J9625J1469
62052A453676L564l100q704j4106j9782k5423l0399l4354l7272l9435m1397m3558
62040A159710m5529m6359m5607m3766m1394l8448l4929l1508k8803k6489k3864
62029G53014k0942j8222j5750j3287j1137r869r253q448p286o466o394o755p316
62016F11889q170q908q672p508o698p073p766p412n873l981k186m08J172K163
$$ y = [814714, 807180, 798620, 790583, 784219, 779360, 774698, 768862, 761155, 751462, 740042, 727630, 715448, 704732, 696207, 690079, 686478, 685716, 688057, 693368, 701215, 711340, 723880, 739019, 756555, 776006, 797040, 819646, 843911, 869873, 897564, 926996, 958002, 990177, 1022968, 1055789, 1088268, 1120653, 1153869, 1188751, 1225095, 1261706, 1297457, 1332004, 1365227, 1396133, 1422582, 1442207, 1453676, 1457240, 1454140, 1445436, 1431330, 1411548, 1386125, 1355726, 1321372, 1284100, 1244665, 1203268, 1159710, 1114181, 1067822, 1022215, 978449, 937055, 898607, 863678, 832170, 803367, 776878, 753014, 732072, 713850, 698100, 684813, 673676, 663807, 654554, 646106, 638820, 632354, 625960, 619205, 611889, 603719, 594811, 586139, 578631, 571933, 564860, 557094, 549682, 543809, 539828, 537642, 537234, 538406, 540569]
62002E40569K706L365M294N182N954O782P380P043N594L758K326J380N50m26j623
61987E94834l106m788o331p472q315r128r956j0624j1027j1123j0753r749q333
61974D84129p124o525o249n747n052m723m929m965m098k632j613j606k162k495
61960D24209k307j817j346j036p92m24N0L74N43J096K462M220N502O156O849Q051
61944D51790R564J1168J2964J4815J6243J7291J8698K0727K2472K3054K2865K2882
61932F64533K3178K3058K2252K1105J9798J8240J6586J5023J3109J0195O487K818
61920H56382o29m376q266j1134j2326j2598j2859j2758j1344q591n434k498M33
61907G54002L734P383J1109J4530J7093J8277J8060J6840J4830J1810P635K754
$$ y = [540569, 543275, 546640, 550934, 556116, 562070, 568852, 576232, 583275, 588869, 592627, 594953, 596333, 596883, 596457, 594834, 591728, 586940, 580609, 573137, 564822, 555694, 545738, 535114, 524087, 512964, 502211, 492462, 484129, 477005, 470480, 464231, 458484, 453432, 448709, 443780, 438815, 434717, 432085, 430472, 428866, 426704, 424209, 421902, 420085, 418739, 417703, 416911, 416487, 416537, 416911, 417454, 418550, 421012, 425232, 430734, 436890, 443739, 451790, 461354, 472522, 485486, 500301, 516544, 533835, 552533, 573260, 595732, 618786, 641651, 664533, 687711, 710769, 733021, 754126, 773924, 792164, 808750, 823773, 836882, 847077, 853564, 856382, 855753, 851377, 843111, 831977, 819651, 807053, 794194, 781436, 770092, 761501, 756067, 753569, 754002, 757736, 765119, 776228, 790758, 807851, 826128, 844188, 861028, 875858, 887668, 895303, 898057]
61895H98057k017o206r968j3648j7164j9972k1616k2146k1915k1206k0197j9134
61883G02868j8130j6958j5394j3798j2894j2889j3250j3487j3698j4088j4373
61872E43909j4083j3138j1739r943p742n428l407j767l34R78K277L913O036Q046
61858D97578R182R786J1288J4560J8783K2398K4828K6788K9122L1945L4871L7497
61846G68626L9516M0696M1021M0686L9764L7964L4854L0290K4551J8089J1188
61835A127245L954l322r845j4672j7513j8943j9438j8553j5543j0707n402n24
61823I96737M246R273J3706J6216J6606J5801J4317J1547O782K45p145j4495k1105
61810A062731k6407l0231l2848l4508l5280l5451l5523l5415l4287l1694k8408
$$ y = [898057, 896040, 889834, 879866, 866218, 849054, 829082, 807466, 785320, 763405, 742199, 722002, 702868, 684738, 667780, 652386, 638588, 625694, 612805, 599555, 586068, 572370, 558282, 543909, 529826, 516688, 504949, 495006, 487264, 481836, 478429, 476662, 476328, 477306, 479583, 483496, 489532, 497578, 506760, 516546, 527834, 542394, 561177, 583575, 608403, 635191, 664313, 696258, 731129, 768626, 808142, 848838, 889859, 930545, 970309, 1008273, 1043127, 1073417, 1097968, 1116057, 1127245, 1131199, 1127877, 1118032, 1103360, 1085847, 1066904, 1047466, 1028913, 1013370, 1002663, 997261, 996737, 1000983, 1010256, 1023962, 1040178, 1056784, 1072585, 1086902, 1098449, 1105231, 1105476, 1098331, 1083836, 1062731, 1036324, 1006093, 973245, 938737, 903457, 868006, 832483, 797068, 762781, 731087, 702679]
61799G02679k5484k2881j9917j6699j4131j2509j1151r649q560q323q349p805
61787E37221o811o094n880n775n525n200m776m155l593l504l772l836l488l184
61773D71628l302l580l529l043k353j714j395j602k075k049j111J46P96Q01J014
61758D48632J955L199M071M399M290L767L068K794L197L635L392K776K639K970
61744D94784K864K003J226J202J393R18j07q11p30q8P64J540J893J782J799K429
61728E12861L144L007K079J396J525J980K318K802L603M176M185M293N243O563
61714E59175P047O306N059L955K924J760O08l57j187j887k306k531k927l501l678
61699E68460l111k404k457l281l987l972l595l523l895m410m886n234n108m194
$$ y = [702679, 677195, 654314, 634397, 617698, 603567, 591058, 579907, 570258, 561698, 553375, 545026, 537221, 530410, 524316, 518436, 512661, 507136, 501936, 497160, 493005, 489412, 485908, 482136, 478300, 474812, 471628, 468326, 464746, 461217, 458174, 455821, 454107, 452712, 451110, 449035, 446986, 445875, 446021, 446817, 447618, 448632, 450587, 453786, 457857, 462256, 466546, 470313, 473381, 476175, 479372, 483007, 486399, 489175, 491814, 494784, 497648, 499651, 500877, 502079, 503472, 504390, 504283, 503472, 502742, 502654, 503418, 504958, 506851, 508633, 510432, 512861, 516005, 519012, 521091, 522487, 524012, 525992, 528310, 531112, 534715, 538891, 543076, 547369, 552612, 559175, 566222, 572528, 577587, 581542, 584466, 586226, 586834, 586477, 585290, 583403, 581097, 578566, 575639, 572138, 568460, 565349, 562945, 560488, 557207, 553220, 549248, 545653, 542130, 538235, 533825, 528939, 523705, 518597, 514403]
61685E14403k856j960j860k023j902j690j824k162k287k334k780l468l610k951
61671D80696k211k054k204k024j487j024p69m81j09R8J8j62j78J17O73J231J529
61654D71659J665J961K296K079J231P20J455L014M159M481M649N128N497N311
61640E15305M855M613M510M143L350K229Q98m49j535k368l247m179m687m515m089
61625E14834l862l597k902k081j791j941j697p08K95M03m49j569k317k504k234
61610D87880j732j382j661k874m760o415o979o575o260o687p127o411m679l377
61596D20961l396m008m073l582l347l606l787l535l243l379l823m104l923l330
61582C69825k580j968j637j478j382j514k025k596k687k344k288k954l844m108
$$ y = [514403, 511547, 509587, 507727, 505704, 503802, 502112, 500288, 498126, 495839, 493505, 490725, 487257, 483647, 480696, 478485, 476431, 474227, 472203, 470716, 469692, 468923, 468442, 468333, 468431, 468449, 468287, 468109, 468226, 468899, 470130, 471659, 473324, 475285, 477581, 479660, 480891, 481611, 483066, 486080, 490239, 494720, 499369, 504497, 509994, 515305, 520160, 524773, 529283, 533426, 536776, 539005, 539903, 539454, 537919, 535551, 532304, 528125, 523438, 518923, 514834, 510972, 507375, 504473, 502392, 500601, 498660, 496963, 496255, 496550, 496953, 496504, 494935, 492618, 490114, 487880, 486148, 484766, 483105, 480231, 475471, 469056, 462077, 455502, 449242, 442555, 435428, 429017, 424338, 420961, 417565, 413557, 409484, 405902, 402555, 398949, 395162, 391627, 388384, 385005, 381182, 377078, 373155, 369825, 367245, 365277, 363640, 362162, 360780, 359266, 357241, 354645, 351958, 349614, 347326, 344372, 340528, 336420]
61568C36420l515k562j837j578j676j824j705j256p42l80j16J39K02j66q38j396
61552C17170j487r88k1R97J534J484J329J459J566J158M07j6J24M18N13N09N77
61535C26733P56J123J659J933J515Q02O97J269J461N65p56j450j434j312j279
61520C32282j161j158j652k364k601k267j946j879j693j189p36n73m14r7j9m49
61504C12084r21q19k40J63L6l50n06j44N71J020N81n54j314r41j5K11n54j297
61486C07011j079j95M01L42K7k43o75j410k005j866j010l6N75Q42R58R17O28J39
61468C03321l88p39o10J99J323J921J559Q35O64J125J465J132K84o42j294j281
61452C08874m01P67J131L77n36o09r5Q6k22l46J9L29J03l25k96L48J276K200L078
$$ y = [336420, 332905, 330343, 328506, 326928, 325252, 323428, 321723, 320467, 319725, 319345, 319229, 319368, 319570, 319404, 318566, 317170, 315683, 314695, 314674, 315671, 317205, 318689, 320018, 321477, 323043, 324201, 324608, 324592, 324716, 325134, 325647, 326156, 326733, 327489, 328612, 330271, 332204, 333719, 334521, 335218, 336487, 337948, 338513, 337757, 336307, 334873, 333561, 332282, 331121, 329963, 328311, 325947, 323346, 321079, 319133, 317254, 315561, 314372, 313636, 313063, 312649, 312552, 312533, 312084, 311163, 310344, 310104, 310267, 310303, 309953, 309447, 309303, 309874, 310894, 311475, 310921, 309607, 308666, 308651, 308862, 308308, 307011, 305932, 305737, 306138, 306480, 306507, 306264, 305589, 304179, 302174, 300308, 299298, 299262, 299837, 300679, 301637, 302554, 303182, 303321, 302933, 302194, 301584, 301783, 303106, 305027, 306586, 307421, 308085, 309210, 310675, 311807, 312091, 311449, 310155, 308874, 308473, 309240, 310371, 310748, 310212, 309603, 309508, 309594, 309372, 309026, 309045, 309374, 309477, 309152, 308856, 309204, 310480, 312680, 315758]
61433C15758L872M394M433L968L305K856K684K358J568O84L57N72O87N06P69K065
61417C50836L743M496L940K956K482K465K289J770J252Q86K76r43k403l233l082
61402C67730k703l090m105m452l364j794j298j989k474j862r00p34j264j545j223
61387C34933o40R6J171K157K157J098N2j96r4k94m29K45J469K196K036J632J582
61370C49171J714J608J204O36j4n55o32j46N50J062J365J678K109K556K767K541
61354C67614K077K073L082M734O019O437O459O774P554Q645R918J1125J1827J1885
61340D66223J1615J1174J0162Q328O214M574L469K495J659J283J132M56r83k497
61326E25304l324l429l309l396l856m548n006m765l929l102k633k216j484n96
$$ y = [315758, 319630, 324024, 328457, 332425, 335730, 338586, 341270, 343628, 345196, 345880, 346237, 346809, 347496, 348002, 348771, 350836, 354579, 359075, 363015, 365971, 368453, 370918, 373207, 374977, 376229, 377115, 377391, 376448, 374045, 370812, 367730, 365027, 361937, 357832, 353380, 350016, 348222, 346924, 344935, 342461, 340599, 339699, 338965, 337701, 336156, 334933, 334293, 334389, 335560, 337717, 339874, 340972, 341024, 340828, 340734, 340440, 340011, 340256, 341725, 343921, 345957, 347589, 349171, 350885, 352493, 353697, 354333, 354319, 353764, 353132, 352986, 353536, 354598, 355963, 357641, 359750, 362306, 365073, 367614, 369691, 371764, 374846, 379580, 385599, 392036, 398495, 405269, 412823, 421468, 431386, 442511, 454338, 466223, 477838, 489012, 499174, 507502, 513716, 518290, 521759, 524254, 525913, 527196, 528328, 528784, 527801, 525304, 521980, 518551, 515242, 511846, 507990, 503442, 498436, 493671, 489742, 486640, 484007, 481791, 480307, 479711]
61312D79711jJ50M9o6L9O09J674K949M168N330O419P184P552Q000Q991J0165J0579
61295E53502R791Q144N996L270M9k974n109o418p347p942p955p547p238p087o534
61280E14601n255l682k431j650j272j351j628j257M11K837M817N877O587P383
61266E23987P932P882P592P584P767P747P598P777Q421R245J0089J1082J2285
61253F36988J3519J4605J5458J5931J5725J4551J2264Q988N224J670j338m012
61241G49573o505q473r623j0308j0983j1324j0627r022p434o282n034l377j965
61228F48616j437j398j072n11l08m36j79P67J895K671L114L420L481L131K465
61213F64219J673P73k39j154j661j665j303q19m48l71o15j017j331j402j202p95
$$ y = [479711, 479710, 479860, 479909, 479843, 479882, 480491, 482165, 485114, 489282, 494612, 501031, 508215, 515767, 523767, 532758, 542923, 553502, 563293, 571437, 577433, 580703, 580752, 577778, 572669, 566251, 558904, 550962, 543007, 535460, 528222, 521135, 514601, 509346, 505664, 503233, 501583, 500311, 498960, 497332, 496075, 496486, 499323, 504140, 510017, 516604, 523987, 531919, 539801, 547393, 554977, 562744, 570491, 578089, 585866, 594287, 603532, 613621, 624703, 636988, 650507, 665112, 680570, 696501, 712226, 726777, 739041, 748029, 753253, 754923, 753585, 749573, 743068, 734595, 724972, 714664, 703681, 692357, 681730, 672708, 665274, 658992, 653958, 650581, 648616, 647179, 645781, 644709, 644198, 643890, 643454, 643275, 644042, 645937, 648608, 651722, 655142, 658623, 661754, 664219, 665892, 666665, 666426, 665272, 663611, 661946, 660643, 659824, 659376, 659005, 658390, 657373, 656042, 654640, 653438, 652643]
61197F52643k26O14J944L845O047Q109R825J1378J3118J5275J7782K0202K1860
61184G82416K2257K1443J9857J7735J4973J1618Q300N855M608M241M286M450M407
61171I26446L683K069K8j669k745l646m903o524q134r539j0882j2346j3871j5150
61157H42817j5818j5712j5073j4341j3716j3042j2203j1351j0524r396p761n980
61145F97900m439k837o80J688L288L837L920L670K244p63m212o562p559q015q322
61130F73158q180p534o714n655l921j651L07J522K556M137O402R144J2131J4826
61116F90528J6490J7135J7845J9594K2036K3983K4802K4821K4638K4542K4558
61105I30972K4579K4420K3983K3305K2320K0767J8624J6385J4530J2836J0520
$$ y = [652643, 652417, 653031, 654975, 658820, 664867, 672976, 682801, 694179, 707297, 722572, 740354, 760556, 782416, 804673, 826116, 845973, 863708, 878681, 890299, 898599, 904454, 909062, 913303, 917589, 922039, 926446, 930129, 932198, 932226, 930557, 927812, 924166, 919263, 912739, 904605, 895066, 884184, 871838, 857967, 842817, 826999, 811287, 796214, 781873, 768157, 755115, 742912, 731561, 721037, 711641, 703880, 697900, 693461, 690624, 689944, 691632, 694920, 698757, 702677, 706347, 708591, 707828, 703616, 697054, 689495, 681480, 673158, 664978, 657444, 650730, 645075, 641154, 639503, 639810, 641332, 643888, 648025, 654427, 663571, 675702, 690528, 707018, 724153, 741998, 761592, 783628, 807611, 832413, 857234, 881872, 906414, 930972, 955551, 979971, 1003954, 1027259, 1049579, 1070346, 1088970, 1105355, 1119885, 1132721, 1143241]
61094A143241O965K133l505r154j3974j7625k0455k2932k4999k6268k6623k6298
61082I60506k5562k4682k3978k3463k2597k0893j8648j6637j5156j3914j2790
61071G42186j2019j1574j0945r815q434p071n580l825k196j224q97p18k85M39
61057F68042J341K372L513M685N732O464O843P089P485Q134R011J0168J1602J3057
61043G65538J4354J5826J7990K0720K3203K4854K5841K6541K6996K7247K7800
61032A016910K9217L1363L3429L4681L5070L5245L6100L8110M0908M3646M5856
61021A420535M7750M9715N1824N3904N5728N7053N7924N9044O1459O5769P2005
61010B052710Q0291R0913J03618J17616J32623J49223J67988J89484K15892K51766
$$ y = [1143241, 1150206, 1152339, 1148834, 1139680, 1125706, 1108081, 1087626, 1064694, 1039695, 1013427, 986804, 960506, 934944, 910262, 886284, 862821, 840224, 819331, 800683, 784046, 768890, 754976, 742186, 730167, 718593, 707648, 697833, 689399, 682328, 676748, 672923, 670727, 669503, 668606, 667888, 667603, 668042, 669383, 671755, 675268, 679953, 685685, 692149, 698992, 706081, 713566, 721700, 730711, 740879, 752481, 765538, 779892, 795718, 813708, 834428, 857631, 882485, 908326, 934867, 961863, 989110, 1016910, 1046127, 1077490, 1110919, 1145600, 1180670, 1215915, 1252015, 1290125, 1331033, 1374679, 1420535, 1468285, 1518000, 1569824, 1623728, 1679456, 1736509, 1794433, 1853477, 1914936, 1980705, 2052710, 2133001, 2223914, 2327532, 2445148, 2577771, 2726994, 2894982, 3084466, 3300358, 3552124]
61000C552124L02119L70146M57339N65277O97015Q58150J057002J301326J592954
60991A0753452J926846K294401K677820L028802L254217L242778K929659K347001
60983C2454976J613527Q77678K69187j16331k28408r3803J59509L37324K71224
60974C5544883r9346p15465j449310k161812k733714l081073l172601l039199
60966A9092363k756761k408398k054305j726195j436971j189356r79844q02720
60958E737813o54159n32595m36037l60898l03215k59466k25993j99181j76671
60949B589598j57598j41344j26835j13241j00523q8951p8712p0166o3918o0178
60939A588132n8504n8270n8997o0003o0277n9098n6589n3436n0230m7173m4178
$$ y = [3552124, 3854243, 4224389, 4681728, 5247005, 5944020, 6802170, 7859172, 9160498, 10753452, 12680298, 14974699, 17652519, 20681321, 23935538, 27178316, 30107975, 32454976, 34068503, 34946181, 35215368, 35099037, 34870629, 34776826, 34936335, 35273659, 35544883, 35445537, 34730072, 33280762, 31118950, 28385236, 25304163, 22131562, 19092363, 16335602, 13927204, 11872899, 10146704, 8709733, 7520377, 6540533, 5737813, 5083654, 4551059, 4115022, 3754124, 3450909, 3191443, 2965450, 2766269, 2589598, 2432000, 2290656, 2163821, 2050580, 1950057, 1861106, 1782394, 1712228, 1648310, 1588132, 1529628, 1471358, 1412361, 1352358, 1292081, 1232983, 1176394, 1122958, 1072728, 1025555, 981377]
60928I81377m1052l7767l4510l1477k8648k5966k3535k1398j9323j7238j5616
60917F84847j4928j4771j4114j2489j0463q820p680o553n031l203j596o75k92
60904E84232J65Q92J281Q66K72M81J424K095K048J817J768J451N11n79j259j752
60888E95713k614l782m693n064n125n201n464n964o656p522q660j0024j1121j1408
60874E02415j0974j0323r464p995o174n042n070n435n214m493l694k592q94P70
60860D25821J498J411J420J879K379K715L175L886M677N573O651P402P109N994
60846D81590N165N226N687N964O193O618O811O098M360K054l14k317l571l941
60832E25623l685l197k746k465k321k054j475q40o10p81r72j133j595k306k780
$$ y = [981377, 940325, 902558, 868048, 836571, 807923, 781957, 758422, 737024, 717701, 700463, 684847, 669919, 655148, 641034, 628545, 618082, 609262, 601582, 595029, 589998, 586795, 585199, 584524, 584232, 584397, 585289, 586570, 587436, 587708, 588189, 589613, 591708, 593756, 595573, 597341, 598792, 599303, 598724, 597465, 595713, 593099, 589317, 584624, 579560, 574435, 569234, 563770, 557806, 551150, 543628, 534968, 524944, 513823, 502415, 491441, 481118, 471654, 463659, 457485, 452443, 447373, 441938, 436724, 432231, 428537, 425945, 425051, 425821, 427319, 428730, 430150, 432029, 434408, 437123, 440298, 444184, 448861, 454434, 461085, 468487, 475596, 481590, 486755, 491981, 497668, 503632, 509825, 516443, 523254, 529352, 533712, 535766, 535452, 533135, 529564, 525623, 521938, 518741, 515995, 513530, 511209, 509155, 507680, 506840, 506230, 505449, 504477, 503344, 501749, 499443, 496663]
60817D96663l040l889n670p487q248q043p735p630p323o671o058n691n401n165
60803D08612n168n183m631l459k428k120k146j759q79n1L58M22K12l87j309k081
60787C78003k169j461l38O83J293J550J736K076K508K774K701K426K350K794L665
60772D00591M476M809M795N008N779O805P480P545P189O666O031N309M639M166
60758D81288L904L781L736L664L472L231L055K756J901M96o76q19j53L27J08l43
60742E09728m88n91j222k314l249l834m640o150p946q999q696p413o062n163m423
60727D38538l306j882q85q16j228j166k08J143K079K308K261K640L743N153O139
60712D54513O485O739P516Q699R694J0321J1102J2552J4496J6252J7241J7384
$$ y = [496663, 493623, 489734, 484064, 476577, 468329, 460286, 452551, 444921, 437598, 430927, 424869, 419178, 413777, 408612, 403444, 398261, 393630, 390171, 387743, 385623, 383477, 381718, 380839, 380788, 381146, 381568, 381780, 381393, 380084, 378003, 375834, 374373, 374035, 374718, 376011, 377561, 379297, 381373, 383881, 386655, 389356, 391782, 394132, 396926, 400591, 405067, 409876, 414671, 419679, 425458, 432263, 439743, 447288, 454477, 461143, 467174, 472483, 477122, 481288, 485192, 488973, 492709, 496373, 499845, 503076, 506131, 508887, 510788, 511284, 510608, 509789, 509636, 509963, 510071, 509728, 509240, 508649, 507427, 505113, 501864, 498030, 493390, 487240, 479294, 470295, 461599, 454186, 448124, 442961, 438538, 435232, 433350, 432465, 431649, 430421, 429255, 429047, 430190, 432269, 434577, 436838, 439478, 443221, 448374, 454513, 460998, 467737, 475253, 483952, 493646, 503967, 515069, 527621, 542117, 558369, 575610, 592994]
60700E92994J7095J6985J7398J8064J8392J8144J7701J7564J7778J7943J7608
60689G87666J6551J4849J2831J0825Q864O673M070J208j622m315o902r332j1481
60676H29885j3370j5163j6946j8543j9555j9646j8892j7863j7146j6772j6253
60665F39736j5315j4333j3886j4044j4342j4315j3771j2705j1255r795q689p880
60653D89406o936n682m467l679l187k594j863j312r86m65N30J606K045J543M22
60638D64381p82j691k114k023j533q05Q0J017J768K179K430K841L406L848M094
60623D77096M300M353L813K615J358N25j77j224k350k909l025l542m715n626n373
60608D65119m360l780m088m533m260l361k581k281k147j834j506j500j772j985
$$ y = [592994, 610089, 627074, 644472, 662536, 680928, 699072, 716773, 734337, 752115, 770058, 787666, 804217, 819066, 831897, 842722, 851586, 858259, 862329, 863537, 861915, 857600, 850698, 841366, 829885, 816515, 801352, 784406, 765863, 746308, 726662, 707770, 689907, 672761, 655989, 639736, 624421, 610088, 596202, 582158, 567816, 553501, 539730, 527025, 515770, 505975, 497286, 489406, 482470, 476788, 472321, 468642, 465455, 462861, 460998, 459686, 458700, 458235, 458765, 460371, 462416, 463959, 464381, 463599, 461908, 459794, 457771, 456238, 455433, 455513, 456530, 458298, 460477, 462907, 465748, 469154, 473002, 477096, 481396, 485749, 489562, 492177, 493535, 494060, 493883, 492659, 490309, 487400, 484375, 480833, 476118, 470492, 465119, 460759, 456979, 452891, 448358, 444098, 440737, 438156, 435875, 433728, 431894, 430388, 428888, 427116, 425131]
60594D25131k031k111k254k176j722j092m98M4M40M22Q8Q7P84J582J610R38M97
60577D19739Q92J818K725L468M209N059O070P248Q525R970J1913J4524J7307J9517
60563E32984K1133K2880K5178K7451K8598K7799K4801J9906J3848P376Q38n474
60551G47318j0800j4295j5931j6317j5578j3247r456n251j349K567O860J1127
60539F65648J5169J9769K5515L1428L5886L8472L9725L9411L6466L0687K3227
60528A001403J5055O175l110j1217j6556j9203k0488k1187k0898j9127j6312j3616
60516H60919j1985j1473j1268j0424q753o918n521m239k244O52L636N905P663
60503H05950R791J2710J6068J9646K4044L0090L7784M6409N5541O5355P5791Q6007
$$ y = [425131, 423100, 420989, 418735, 416559, 414837, 413745, 413247, 413291, 413731, 414153, 414241, 414328, 415112, 416694, 418304, 419242, 419739, 420631, 422449, 425174, 428642, 432851, 437910, 443980, 451228, 459753, 469723, 481636, 496160, 513467, 532984, 554117, 576997, 602175, 629626, 658224, 686023, 710824, 730730, 744578, 751954, 752792, 747318, 736518, 722223, 706292, 689975, 674397, 661150, 651694, 646443, 645094, 647661, 654521, 665648, 680817, 700586, 726101, 757529, 793415, 831887, 871612, 911023, 947489, 978176, 1001403, 1016458, 1022633, 1019523, 1008306, 991750, 972547, 952059, 930872, 909974, 890847, 874535, 860919, 848934, 837461, 826193, 815769, 807016, 800098, 794577, 790338, 788094, 788746, 792382, 798287, 805950, 815741, 828451, 844519, 864165, 888209, 918299, 956083, 1002492, 1058033, 1123388, 1199179, 1285186]
60491A285186R5016J02382J07873J10744J09956J04946R5768Q2667O5918M6058
60481B206514K3828o3k4743m8813p0593q8882j03198j13367j19254j20827j18230
60470A422372j11867j02780r2687q3095p4232o5456n6715m8992m2996l8151l3383
60459F72018k8525k4294k1050j8336j5686j3331j1740j0811r952q894p927p265
60447D94207o570n480m358l953m379m882m773m042k869j171Q45K167J899N09n93
60432D56557q42j058k039l298l723l029k014j567j890k651l435l929l978l651
60418D19453l189k767k324j683q66j95L9q1k38k98l65l86r8N20J040J114Q97O88
60400D11261M52L4l37k54L15R78J397J467J241R10P88R47J062R28Q01Q99R09N57
$$ y = [1285186, 1380202, 1482584, 1590457, 1701201, 1811157, 1916103, 2011871, 2094538, 2160456, 2206514, 2230342, 2230279, 2205536, 2156723, 2086130, 1997248, 1894050, 1780683, 1661429, 1540602, 1422372, 1310505, 1207725, 1115038, 1031943, 957711, 892255, 835540, 786548, 743552, 705401, 672018, 643493, 619199, 598149, 579813, 564127, 550796, 539056, 528245, 518293, 509399, 501472, 494207, 487637, 482157, 477799, 473846, 469467, 464585, 459812, 455770, 452901, 451730, 452575, 454742, 456641, 457150, 456557, 455715, 454657, 452618, 449320, 445597, 442568, 440554, 438987, 437097, 434446, 431011, 427082, 423104, 419453, 416264, 413497, 411173, 409490, 408624, 408429, 408468, 408387, 408149, 407851, 407486, 407100, 407002, 407522, 408562, 409676, 410573, 411261, 411713, 411747, 411410, 411156, 411471, 412449, 413846, 415313, 416554, 417464, 418252, 419199, 420261, 421189, 421990, 422889, 423798, 424355]
60382D24355K70O01J259J464J166J003J224J464J660K144K629K179O32p94r14
60367D40342N8J129J856K454L032L433L540L292K623J779J260J114P22k32j134
60352D65268j272r38r87j608k172k144j578q23k09R1K92Q86J980K929L069K548
60336D65332K012J779J806K134K721L027K519J508Q32P25O50K98O6K87O08M86
60320D86790o0n02l82L54J361K019J851J072N94J261L065N224O989Q338R899J2248
60304E40121J5390J8998K2998K7540L2307L6365L8835L9431L7964L3663K5640
60293H69252J4090P37j2028k2372k9677l4370l7111l7959l6416l2447k7167k2169
60281E92363j8281j5230j2442r798p591o092n198m521l858l535l954m776n046
$$ y = [424355, 424625, 425226, 426485, 427949, 429115, 430118, 431342, 432806, 434466, 436610, 439239, 441418, 442050, 441256, 440342, 440400, 441529, 443385, 445839, 448871, 452304, 455844, 459136, 461759, 463538, 464798, 465912, 466634, 466402, 465268, 463996, 463058, 462071, 460463, 458291, 456147, 454569, 453746, 453537, 453628, 453920, 454806, 456786, 459715, 462784, 465332, 467344, 469123, 470929, 473063, 475784, 478811, 481330, 482838, 483670, 484395, 485045, 485343, 485409, 485696, 486304, 486790, 486730, 486228, 485846, 486200, 487561, 489580, 491431, 492503, 493097, 494358, 497423, 502647, 509636, 517974, 527873, 540121, 555511, 574509, 597507, 625047, 657354, 693719, 732554, 771985, 809949, 843612, 869252, 883342, 884079, 872051, 849679, 820002, 785632, 748521, 710562, 674146, 641699, 614532, 592363, 574082, 558852, 546410, 536612, 529021, 522929, 517731, 513210, 509352, 505817, 501863, 497087, 492041]
60268D92041m384l522l211l116k422j166k14l6k75m98o67p79o32j95K50M89N07
60251D72170K69k60q28j074j047j091j205r63k16O05R88Q34L14l70r58j221j179
60234D64768r47m56M03J322J805J828J906K400L182L980M583M675M028K998K326
60219D98801K226K115J453M38k86k84M75J662K698L170L236L308L399L204K852
60204E28467K852L207L266K759K274K339K607K423J743R76L57j21m25n64o36n63
60188E50961j61K41j51j473k673k654j643q03q22j434k080k473k607k700k982
60173E26546l256k891j682l48L16L76L57L42J46P0N69J295J433J002R32J628K329
60156E29164K289J887J956K556L076L247L426L878M300M243L681K911K081J088
$$ y = [492041, 487657, 484135, 480924, 477808, 475386, 474220, 474006, 473970, 473695, 473197, 472530, 471751, 471119, 470924, 471174, 471663, 472170, 472439, 472179, 471351, 470277, 469230, 468139, 466934, 465971, 465755, 466360, 467348, 468182, 468496, 468126, 467168, 465947, 464768, 463821, 463365, 463768, 465090, 466895, 468723, 470629, 473029, 476211, 480191, 484774, 489449, 493477, 496475, 498801, 501027, 503142, 504595, 505033, 504747, 504463, 504938, 506600, 509298, 512468, 515704, 519012, 522411, 525615, 528467, 531319, 534526, 537792, 540551, 542825, 545164, 547771, 550194, 551937, 552913, 553270, 553149, 552724, 552160, 551524, 550961, 550800, 551041, 550890, 549417, 546744, 544090, 542447, 541644, 540822, 539388, 537308, 534835, 532228, 529528, 526546, 523290, 520399, 518717, 518369, 518685, 519061, 519418, 519760, 519906, 519976, 520545, 521840, 523273, 524275, 525207, 526835, 529164, 531453, 533340, 535296, 537852, 540928, 544175, 547601, 551479, 555779, 560022, 563703, 566614, 568695, 569783]
60142E69783N2m09K57J743L071L663L885M281M771M985M983N077N120M634L527
60127F19423K178P88p30k199l144l459l519l444k788j315L93J437J440O35m48
60112F05248j119p43O98K448L704M345M666M756M518M072L709L518L416L322L029
60097F49587K102M11j438k697l440m295n284n562m599k936j459l64P11J920L126
60082F25783M237N077N131M050K391J233R24P03k52j877l527m777n627o202o602
60067F20665o827o681o004n139m780n094n439n323n183n596o212o211n625n247
60053E41304n334n333n042n027n481n599m731l483k788k458j561n4R80Q58K77
60038D96528M10J552L025M137M763N063N023M459L391K208J327P58K08m90j211
$$ y = [569783, 569835, 569426, 569683, 571426, 574497, 578160, 582045, 586326, 591097, 596082, 601065, 606142, 611262, 615896, 619423, 621601, 622389, 621659, 619460, 616316, 612857, 609338, 605894, 603106, 601791, 602184, 603621, 605061, 605696, 605248, 604129, 603386, 604084, 606532, 610236, 614581, 619247, 624003, 628521, 632593, 636302, 639820, 643236, 646558, 649587, 651689, 652100, 650662, 647965, 644525, 640230, 634946, 629384, 624785, 621849, 620390, 620026, 620737, 622657, 625783, 630020, 635097, 640228, 644278, 646669, 647902, 648826, 649529, 649277, 647400, 643873, 639096, 633469, 627267, 620665, 613838, 607157, 601153, 596014, 591234, 586140, 580701, 575378, 570195, 564599, 558387, 552176, 546551, 541304, 535970, 530637, 525595, 520568, 515087, 509488, 504757, 501274, 498486, 496028, 494467, 494413, 495393, 496251, 496528, 496938, 498490, 501515, 505652, 510415, 515478, 520501, 524960, 528351, 530559, 531886, 532644, 532852, 532362, 531151]
60023E31151j839k420l008l587m215m958n686o189o562o988p167o531n200l971
60009D62830l117j898M3J649J684N30k99j47L36O31J066J858K533K766K933L302
59993D76700L392K786J978J783K244K790L147L414L456K923J920J100R38J211
59979E09782J344R99K70m86r18r41q28r28j303j712j918j915j804j604j269q78
59963D95891o69p49p75j97J058K310K879K918L044L278K978J953J043J038J556
59948E17556J566P87r0m60m10k15R3L33l8j259k738l649l921m033m084l676k815
59931D92947k233k402k776k554j791j153p82j68P94J425J277Q77R48J406J645
59916D87460J529J473J703J997K159K258K388K549K756K942K878K555K475K988
$$ y = [531151, 529312, 526892, 523884, 520297, 516082, 511124, 505438, 499249, 492687, 485699, 478532, 472001, 466801, 462830, 459713, 457815, 457858, 459507, 461191, 461721, 461422, 461275, 461611, 462242, 463308, 465166, 467699, 470465, 473398, 476700, 480092, 482878, 484856, 486639, 488883, 491673, 494820, 498234, 501690, 504613, 506533, 507633, 508571, 509782, 511126, 512125, 512395, 511909, 510991, 510050, 509222, 508294, 506991, 505279, 503361, 501446, 499642, 498038, 496769, 495891, 495222, 494473, 493698, 493501, 494559, 496869, 499748, 502666, 505710, 508988, 511966, 513919, 514962, 516000, 517556, 519122, 519909, 519819, 519359, 518949, 518734, 518827, 519160, 519122, 517863, 515125, 511476, 507555, 503522, 499438, 495762, 492947, 490714, 488312, 485536, 482982, 481191, 480038, 479256, 479088, 479882, 481307, 482584, 483461, 484409, 485815, 487460, 488989, 490462, 492165, 494162, 496321, 498579, 500967, 503516, 506272, 509214, 512092, 514647, 517122, 520110]
59902E20110L457K853J249L3K39J328K031J931J616J642J967K300K475K509K572
59887E48312L006M024N402O591P136O886N951M639L334K277J569J361J802K629
59873F04919L147K954K372J815J040m19k232l372l367k923l042l878m789n231
59859E86994n150m675l823k729j848j600j819j780r85K32J032J033P22R11K016
59844E68531L919O167Q159R440J0156J1017J2389J3529J3163J0850P463M306K094
59831F81183Q90N53Q88J527J970J748M89j960n277q698j1591j3935j6023j7685
59817F14079j8230j7201j5026j2663j0778r413q320p316o332n365m494l821l312
59804D91808k837k342j876j436j019q36j201j983k561k562k404k675l189l199
$$ y = [520110, 523567, 526420, 527669, 527702, 527941, 529269, 531300, 533231, 534847, 536489, 538456, 540756, 543231, 545740, 548312, 551318, 555342, 560744, 567335, 574471, 581357, 587308, 591947, 595281, 597558, 599127, 600488, 602290, 604919, 608066, 611020, 613392, 615207, 616247, 615828, 613596, 610224, 606857, 603934, 600892, 597014, 592225, 586994, 581844, 577169, 573346, 570617, 568769, 567169, 565350, 563570, 562585, 562817, 563849, 564882, 565604, 566515, 568531, 572450, 578617, 586776, 596216, 606372, 617389, 629778, 643307, 656470, 667320, 674783, 679089, 681183, 682073, 682626, 683514, 685041, 687011, 688759, 689248, 687288, 682011, 673313, 661722, 647787, 631764, 614079, 595849, 578648, 563622, 550959, 540181, 530768, 522448, 515132, 508800, 503435, 498941, 495120, 491808, 488971, 486629, 484753, 483317, 482298, 481462, 480261, 478278, 475717, 473155, 470751, 468076, 464887, 461688]
59790D61688k489j661j267j206j195j269j464j508j311j366k085k951k952j888
59776D37076o15M1P6j43n56j254j986k258j857j039k84K5j90n73n72n3M57L79
59758D26674q8j39O66J916K948L574L985M223M166L951L907M040L912L326K731
59743D69792K715L183L455L095K288J427O28j61q78j356j469j191n77J03M24J50
59727D81628n10j152j566j752j693j365r50p51q15q53p10o72r74j221p30M14J169
59710D67497P32l12o00L71J785K703L098L392L574L338K760K274K042J915J960
59695D96529K509L605M810N603N632M671K851R71nJ2J84j33o81r25q46o63k94
59678E23830L90J038J118N83j08o01r30j309j875k594l256l631l769l897l946
$$ y = [461688, 459199, 457538, 456271, 455065, 453870, 452601, 451137, 449629, 448318, 446952, 444867, 441916, 438964, 437076, 436461, 436502, 436578, 436435, 435879, 434625, 432639, 430381, 428524, 427485, 427201, 427226, 427036, 426463, 425891, 425838, 426295, 426674, 426586, 426447, 427113, 429029, 431977, 435551, 439536, 443759, 447925, 451876, 455783, 459823, 463735, 467061, 469792, 472507, 475690, 479145, 482240, 484528, 485955, 486583, 486422, 485544, 484188, 482719, 481528, 480951, 481054, 481478, 481628, 481118, 479966, 478400, 476648, 474955, 473590, 472640, 471889, 471074, 470221, 469511, 468839, 467865, 466644, 465914, 466328, 467497, 468229, 467917, 467317, 467688, 469473, 472176, 475274, 478666, 482240, 485578, 488338, 490612, 492654, 494569, 496529, 499038, 502643, 507453, 513056, 518688, 523359, 526210, 527181, 527176, 527188, 527372, 527239, 526558, 525633, 524787, 524124, 523830, 524220, 525258, 526376, 526959, 526851, 526250, 525320, 524011, 522136, 519542, 516286, 512655, 508886, 504989, 501043]
59663E01043l585k857k307k093j617n23M30L19m32m20R38K765M008M502M553M227
59647E08951L495K655K069J772J557J189L75j112k976m427m936m731m341l897
59633D95643l221k311j441q56n82n06m38l18l66p83j206q41N46K081K608J895
59617D89904P06k25q66j522k182k448k065j339r30j138j461j176k54N79P92O33
59601D77008N60N18K11k01j82M58J311J792J507M17j001j801j325oR88R75L24
59584D81553k74o41j009j522k129k702k981k651j744q61o76j300k326l329m062
59569D53346m332m018l295k511j774q88K13J144J405R76M25L54P62J082Q38J63
59553D43890m23o09m39O4R69K067K766K700K193J847J914K349L225M633O329P979
$$ y = [501043, 497458, 494601, 492294, 490201, 488584, 488061, 488491, 488810, 488378, 487958, 488896, 491661, 495669, 500171, 504724, 508951, 512446, 515101, 517170, 518942, 520499, 521688, 522063, 520951, 517975, 513548, 508612, 503881, 499540, 495643, 492422, 490111, 488670, 487814, 487232, 486726, 486288, 485970, 485604, 484821, 483615, 482774, 483320, 485401, 488009, 489904, 490610, 490385, 489519, 487997, 485815, 483367, 481302, 479963, 479033, 477895, 476434, 475258, 475004, 475583, 476375, 477008, 477568, 478086, 478297, 478096, 477914, 478372, 479683, 481475, 482982, 483399, 482398, 480597, 479272, 479266, 480254, 481229, 481553, 481279, 480638, 479629, 478107, 475978, 473276, 470295, 467644, 465900, 465039, 464363, 463063, 460737, 457408, 453346, 449014, 444996, 441701, 439190, 437416, 436528, 436741, 437885, 439290, 440266, 440691, 441045, 441807, 442889, 443727, 443890, 443467, 442858, 442419, 442483, 443452, 445519, 448285, 450985, 453178, 455025, 456939, 459288, 462513, 467146, 473475, 481454]
59537D81454R769J2173J5041J7396J8317J7567J5269J1448O336P05m423q241j0120
59524E82691r635p061l564l96K019L976N676O884P223O497M901L111J848J032
59510F05202k08k294m449n796o658p963r650j0733j0731j0067q974p242n293m356
59496E10788m859n591n157l687k348j791j802k037k255k073j284k82L11L25L9
59481D78297k26mJ280L524N528O185N835N748O391P030O974O265N053L220J023
59466E42123o61j193r05n84n86p22o81k20P55K038L320M664O489Q894J1277J2970
59450E86978J3948J4678J5395J5927J6111J6062J5877J5106J2853Q601L074k103
59438G32507n850q576j1360j4418j6783j7507j6669j5147j3767j2773j1805j0360
$$ y = [481454, 491223, 503396, 518437, 535833, 554150, 571717, 586986, 598434, 604770, 605475, 601052, 592811, 582691, 573056, 565995, 562431, 562035, 564054, 568030, 573706, 580590, 587813, 594310, 599211, 602322, 604170, 605202, 604994, 602700, 598251, 592455, 585797, 577834, 568184, 557451, 546720, 536653, 527679, 520437, 515144, 510788, 505929, 500338, 495181, 491494, 489146, 487355, 485553, 483516, 481261, 479188, 477904, 477622, 477933, 478258, 478297, 478071, 478067, 479347, 482871, 488399, 494584, 500419, 506167, 512558, 519588, 526562, 532827, 537880, 541100, 542123, 541462, 540269, 539364, 538780, 538194, 537472, 536791, 536571, 537326, 539364, 542684, 547348, 553837, 562731, 574008, 586978, 600926, 615604, 630999, 646926, 663037, 679099, 694976, 710082, 722935, 731536, 734610, 732507, 726657, 718081, 706721, 692303, 675520, 658013, 641344, 626197, 612430, 599657, 587852, 577492]
59426E77492q453o740n650m569k482O61L839O285Q249J0263J2379J4504J6859
59413F22637J9601K2416K4946K7161K8759K8575K5336J8945J0584J686o670j3520
59401H10456j7932j9387j7968j4139q733l192O38J390j170o281j2675j8927k3770
59388F68310k6504k7120k5975k3427j9957j6372j3465j1307r235o738m197k463
59376D81550j820j769j760j648j362o68L54J107J241J248J727K417K601K244J943
59361D87405J889J755J599J976K848L316K938K517L042M444O011P513R148J0824
59347E47225J2251J3547J5064J6711J8069J9043J9831K0359K0342J9893J9409
59336G41744J8835J7539J5161J2117R075O295L592O74k623o130r262j1382j2373
$$ y = [577492, 569039, 562299, 556649, 552080, 549598, 550259, 554098, 560383, 568632, 578895, 591274, 605778, 622637, 642238, 664654, 689600, 716761, 745520, 774095, 799431, 818376, 828960, 830646, 823976, 810456, 792524, 773137, 755169, 741030, 732297, 729105, 729743, 731133, 729963, 723682, 711007, 692080, 668310, 641806, 614686, 588711, 565284, 545327, 528955, 515490, 504183, 494948, 488210, 484013, 481550, 479730, 477961, 476201, 474553, 473191, 472523, 472877, 473984, 475225, 476473, 478200, 480617, 483218, 485462, 487405, 489294, 491049, 492648, 494624, 497472, 500788, 503726, 506243, 509285, 513729, 519740, 527253, 536401, 547225, 559476, 573023, 588087, 604798, 622867, 641910, 661741, 682100, 702442, 722335, 741744, 760579, 778118, 793279, 805396, 814471, 820766, 824358, 825032, 822409, 816279, 807017, 795635, 783262]
59323G83262j2700j2933j3327j3779j3931j3330j1861j0019q453p286o196n133
59311F54314m470m303m119l496k776k578k894l092k826k406k107j514lK211L980
59296F23921M400L891L821N178P842J1076J4379J7699K1055K4101K5968K5510
59284G88841K1969J5553P339j310r096j4848j7884j8491j7515j5329j1706o951
59272G20572k387R09L371O148R360J1937J3124J3290J3141J2833J2156J0973R193
59259H34620O634L295n34m545q553j2214j4970j6525j7129j7222j6970j6341j5410
59246G04136j4436j3677j3147j2454j0974q506n777l877l128k762j912m80J048
59233F14054K280L124L583L737L752L656L280K603J928J351L23j807m746p248
$$ y = [783262, 770562, 757629, 744302, 730523, 716592, 703262, 691401, 681382, 672929, 665643, 659447, 654314, 649844, 645541, 641422, 637926, 635150, 632572, 629678, 626586, 623760, 621354, 619247, 617733, 617730, 619941, 623921, 628321, 632212, 636033, 641211, 649053, 660129, 674508, 692207, 713262, 737363, 763331, 788841, 810810, 826363, 833702, 832392, 823296, 808448, 790564, 772073, 754558, 739229, 727523, 720572, 718185, 719094, 722465, 728613, 737973, 749910, 763034, 776324, 789465, 802298, 814454, 825427, 834620, 841254, 844549, 844015, 839470, 830917, 818703, 803733, 787208, 770079, 752857, 735887, 719546, 704136, 689700, 676023, 662876, 650422, 639448, 630942, 625165, 621288, 618160, 615398, 613486, 613006, 614054, 616334, 619458, 623041, 626778, 630530, 634186, 637466, 640069, 641997, 643348, 643671, 641864, 637118, 629870]
59219F29870q303q076p600p734q557r531r969r530q496p531o979o446n345l793
59205E21980k646k469k842k916k400j652j036o23m07l26j03M92J205J588J782
59190E09627K376L452M412M939N439O118O388N865N225N336O024O520O625O601
59176E84947O294N428M528M415M887N000M690M811N533O012O062O766Q709J0781
59162F68863J1712J1718J1657J1468J0661R656R227Q993P791N424K820M83j952
59149G68521m591o849q441r754j0877j1282j0849j0323j0179r920r104q213p792
59136F50347p415o457n307m843m924m507l144j445L9J482L086M519N458O161P005
59121F40055P927Q777R902J1788J4162J5956J6303J5442J4550J4637J5541J6043
$$ y = [629870, 621567, 613491, 605891, 598157, 589600, 580069, 570100, 560570, 552074, 544543, 537564, 531118, 525773, 521980, 519334, 516865, 514023, 511107, 508707, 507055, 506019, 505396, 504989, 504663, 504560, 505052, 506257, 507845, 509627, 512003, 515455, 519867, 524806, 530245, 536363, 542751, 548616, 553841, 559177, 565201, 571721, 578346, 584947, 591241, 596669, 601197, 605612, 610499, 615499, 620189, 625000, 630533, 636545, 642607, 649373, 658082, 668863, 680575, 692293, 703950, 715418, 726079, 735735, 744962, 753955, 761746, 767170, 769990, 770473, 768521, 763930, 757081, 748640, 738886, 728009, 716727, 705878, 695555, 685376, 675456, 666352, 658139, 650347, 642932, 636475, 631168, 626325, 621401, 616894, 613750, 612305, 612344, 613826, 616912, 621431, 626889, 633050, 640055, 647982, 656759, 666661, 678449, 692611, 708567, 724870, 740312, 754862, 769499, 785040, 801083]
59109H01083J5189J3437J2118J1697J1106R168O204L636K266J627R78J06r92k551
59095H85072m593o499p552p753p696p786p928p786p057n708m376m237n874q327
59081G91900r972j0418j0820j2080j3517j3930j3319j2768j2845j3067j2895j2402
59069F43867j1696j0468q644o951o078n671m839l499k556k564k974k986k605k368
59055E69968k392k321k059j999k375k808k716k004j126o23p15j179j487j127p2
59040E44965J056J449R20J78J26R04J796K217K397K866L499L691L425L553M706
59025E77748O456P999R182J0348J1448J2006J1881J1559J1552J1892J2168J1752
59013G05991J0183P690N144L123J279p68k404k743k157j916k270k091p42R10J987
$$ y = [801083, 816272, 829709, 841827, 853524, 864630, 873798, 880002, 883638, 885904, 887531, 888509, 888615, 887623, 885072, 880479, 873980, 866428, 858675, 850979, 843193, 835265, 827479, 820422, 814714, 810338, 806101, 800227, 791900, 781928, 771510, 760690, 748610, 735093, 721163, 707844, 695076, 682231, 669164, 656269, 643867, 632171, 621703, 613059, 606108, 600030, 594359, 589520, 586021, 583465, 580901, 577927, 574941, 572336, 569968, 567576, 565255, 563196, 561197, 558822, 556014, 553298, 551294, 550168, 549545, 548830, 547651, 546164, 545037, 544965, 546021, 547470, 548390, 548568, 548694, 549598, 551394, 553611, 556008, 558874, 562373, 566064, 569489, 573042, 577748, 584204, 592203, 601385, 611733, 623181, 635187, 647068, 658627, 670179, 682071, 694239, 705991, 716174, 723864, 729008, 732131, 733410, 732642, 730238, 727495, 725338, 723422, 721152, 719061, 718319, 719229, 721216]
58998G21216K984M728O809Q073Q145P525O581N366M076K833J300o50k277k937
58984G73772l384n003p760j0088j0856j0500r949r436q788q021p071n514l124
58971F74278m09J872L497M815O261P963R674J1076J2231J3540J4958J5610J4749
58958G90115J2859J1043R512P583N007K223q05m795r668j3954j6365j7228j7617
58945G57910j7750j7112j5663j4017j2618j1373j0021q380o443m606l453l003
58933F33471k530j681j217j949l347m058l622k866k587k679k774k990l601m407
58919E93163m840m606l915l067k066p14Q34J889J927J372J284K103L252M133M908
58904E95657N899O812P329P946R452J1704J3766J5150J6079J6552J6118J4890
$$ y = [721216, 724200, 728928, 735737, 743810, 751955, 759480, 766061, 771427, 775503, 778336, 779636, 778986, 776709, 773772, 770388, 765385, 757625, 747537, 736681, 726181, 716232, 706796, 698008, 689987, 682916, 677402, 674278, 673869, 675741, 679238, 684053, 690314, 698277, 707951, 719027, 731258, 744798, 759756, 775366, 790115, 802974, 814017, 823529, 831112, 836119, 838342, 837537, 832742, 823074, 809120, 792755, 775527, 757910, 740160, 723048, 707385, 693368, 680750, 669377, 659356, 650976, 644533, 639927, 636474, 633471, 630941, 629260, 628043, 626094, 622747, 618689, 615067, 612201, 609614, 606935, 604161, 601171, 597570, 593163, 588323, 583717, 579802, 576735, 574669, 573955, 574789, 576678, 578605, 579977, 581261, 583364, 586616, 590749, 595657, 601556, 608368, 615697, 623643, 633095, 644799, 658565, 673715, 689794, 706346, 722464, 737354]
58892G37354J3843J3625J3809J3935J4658J6968K0576K3951K6030K7121K7899
58881I49769K8122K6832K3570J8979J4193R857N770J339l690q894j3475j6849
58869A035523j8964k0155k0875k1443k1829k1621k0457j8576j6726j5388j4402
58858H25087j3607j3406j4154j5282j5764j5450j5116j5069j4557j3115j1648
58847F67919j1306j1774j1611j0171q310p124o719o498o040n378m776m471m485
58834E69256m604m661m671m538l916k825k040k235k982l293k972k585k257j481
58820E24196k97M41L38P9L23Q35J219J727K627L462L704L667L964M500M646M147
58804E59578L159J778J96r44j127p55o83j101j548j893k514l476m202m210l648
$$ y = [737354, 751197, 764822, 778631, 792566, 807224, 824192, 844768, 868719, 894749, 921870, 949769, 977891, 1004723, 1028293, 1047272, 1061465, 1071322, 1077092, 1078431, 1074741, 1065847, 1052372, 1035523, 1016559, 996404, 975529, 954086, 932257, 910636, 890179, 871603, 854877, 839489, 825087, 811480, 798074, 783920, 768638, 752874, 737424, 722308, 707239, 692682, 679567, 667919, 656613, 644839, 633228, 623057, 614747, 607623, 600904, 594406, 588366, 582988, 578212, 573741, 569256, 564652, 559991, 555320, 550782, 546866, 544041, 542001, 539766, 536784, 533491, 530519, 527934, 525677, 524196, 523899, 524340, 524678, 524757, 525080, 525915, 527134, 528861, 531488, 534950, 538654, 542321, 546285, 550785, 555431, 559578, 562737, 564515, 564711, 563767, 562640, 561885, 561202, 560101, 558553, 556660, 554146, 550670, 546468, 542258, 538610]
58789E38610k890k019r69J63J188K028K733L414M276N457O768P673P677O764N475
58774E86348M456L931L525K735J461m3j628l326m966o109o451o058n185m165l431
58759E61094l228l263l010k385j672r00J42J181J605J483J717K773M008M665M906
58744E69116N233N628N845O131O910Q049R055R707J0060J0158J0196J0566J1241
58731F77895J1531J1012J0282J0120J0297R961Q969Q046P692P577P082N978M591
58718G91033L596L547M323N222N785O300P258Q634R940J0578R972P917N015K207
58704H81327m57l826q104j2160j4937j6729j8395k0066k1463k2675k3712k3939
58692F94864k2893k1155j9514j7903j6010j4243j3046j1947j0344q687p707p099
$$ y = [538610, 535720, 533701, 532732, 532895, 534083, 536111, 538844, 542258, 546534, 551991, 558759, 566432, 574109, 580873, 586348, 590804, 594735, 598260, 600995, 602456, 602413, 600785, 597459, 592493, 586384, 579933, 573875, 568690, 564525, 561094, 557866, 554603, 551593, 549208, 547536, 546636, 546778, 547959, 549564, 551047, 552764, 555537, 559545, 564210, 569116, 574349, 579977, 585822, 591953, 598863, 606912, 615967, 625674, 635734, 645892, 656088, 666654, 677895, 689426, 700438, 710720, 720840, 731137, 741098, 750067, 758113, 765805, 773382, 780464, 786442, 791033, 794629, 798176, 802499, 807721, 813506, 819806, 827064, 835698, 845638, 856216, 866188, 874105, 879120, 881327, 880870, 877044, 868940, 856780, 841843, 825114, 806719, 786653, 765190, 742515, 718803, 694864, 671971, 650816, 631302, 613399, 597389, 583146, 570100, 558153, 547809, 539122, 531415, 524316]
58680E24316o224n415n267n212m305k998k490k667k320j168J6J064K492L973M630
58665D98425M957O473R191J1306J1849J1724J1524J0319P557M457K253N47j365
58652E89217k882l168k803k969l727m298m423m390m274m082m191m807n486n781
58638E31936n768n344l902j436Q06J764J978K632L848M812N066M687L650K025
58624E46754M66l65p07j223j867j971j270j53J035K371M050O052P999R261R533
58609E79965R329R306R073P543M777K343J277O95o76k532l666l883m008m381m522
58594F00640m159l589l012k304j391k67J252L141M791N682O248P380R151J0761
58580F34324J1621J1861J1736J1132R888Q222O659N655N243N020M680M509N054
$$ y = [524316, 518092, 512677, 507410, 502198, 497893, 494895, 492405, 489738, 487418, 486250, 486266, 487330, 489822, 493795, 498425, 503382, 509855, 519046, 530352, 542201, 553925, 565449, 575768, 583325, 587782, 590035, 590582, 589217, 586335, 583167, 580364, 577395, 573668, 569370, 564947, 560557, 556283, 552201, 548010, 543203, 537717, 531936, 526168, 520824, 516922, 515486, 516292, 518056, 520034, 522666, 526514, 531326, 536392, 541079, 544729, 546754, 547220, 546855, 546148, 544925, 543058, 541087, 539817, 539664, 540699, 543070, 547120, 553172, 561171, 570432, 579965, 589294, 598600, 607673, 615216, 619993, 622336, 623613, 624308, 623632, 621100, 617434, 613551, 609543, 605162, 600640, 596481, 592892, 589880, 587576, 586185, 585918, 587170, 590311, 595102, 600784, 607032, 614412, 623563, 634324, 645945, 657806, 669542, 680674, 690562, 698784, 705443, 711098, 716341, 721361, 726041, 730550, 735604]
58567G35604O327P860R538J1678J4190J6466J8409K0497K2503K3160K1822J9520
58555I27574J7499J5567J2863R444N929K239j978o094q959j0549j1902j3447j4485
58542I23701j4511j4029j3764j3856j4196j4854j5827j6696j6885j6157j4820
58531G58106j3606j3093j3047j2574j1201r405p730n940l662j361J70R56J713
58518F69326K652L237L126K620K123J714J395J251J265J284J308J489J833K133
58504F96756K158J825J256P67O32O80N03P4j88j88m39j349k644l795m540m709
58488F86799m114k903j611m95O07J663K350K813L700N130O416P312Q472J0147
58474G26286J1416J1467J0717R769Q257N710K766L05j888m429o872q168q226p823
$$ y = [735604, 741931, 749791, 759329, 771007, 785197, 801663, 820072, 840569, 863072, 886232, 908054, 927574, 945073, 960640, 973503, 982947, 988876, 991115, 989137, 983043, 974084, 963535, 951633, 938186, 923701, 909190, 895161, 881397, 867541, 853345, 838491, 822664, 805968, 789083, 772926, 758106, 744500, 731407, 718360, 705786, 694585, 685180, 677450, 671510, 667848, 666487, 666657, 667613, 669326, 671978, 675215, 678341, 680961, 683084, 684798, 686193, 687444, 688709, 689993, 691301, 692790, 694623, 696756, 698914, 700739, 701995, 702762, 703394, 704074, 704577, 704651, 704463, 704275, 703836, 702487, 699843, 696048, 691508, 686799, 682685, 679782, 678171, 677676, 678283, 679946, 682296, 685109, 688809, 693939, 700355, 707667, 716139, 726286, 737702, 749169, 759886, 769655, 777912, 783622, 786388, 786693, 784805, 780376, 773504, 765336, 757110, 749287]
58460G49287p292o422n322m364l412k097o26N62J677L178M847O075O773P044O400
58445G56308M364J565q23k462l743m662m823m390l895l284k077l84J186K400L335
58430G38615L818L810L968M797N695N859N723O330P701R016J0024J0961J1451
58417H27768J0915R846R211Q728P241M699K258M17j424l389m727n289n968p176
58403H53110q184q376q001p298o060m471l271k620j856p42Q5L61P60J745K756
58388H07938L099K874K508K051J342L91o10j258r94K14J421J729J533J867K779
58373H26884L424L594L947M718N431N974O805P901Q629Q820Q994R359R688J0129
58359I24297J1099J2247J2726J2479J2164J1775J0659Q928P447O292M707K839
$$ y = [749287, 741995, 735573, 730251, 725887, 722475, 720378, 719752, 720314, 721991, 725169, 730016, 736091, 742864, 749908, 756308, 760672, 762237, 761414, 758952, 755209, 750547, 745724, 741334, 737439, 734155, 732078, 731694, 732880, 735280, 738615, 742433, 746243, 750211, 755008, 760703, 766562, 772285, 778615, 786316, 795332, 805356, 816317, 827768, 838683, 848529, 857740, 866468, 873709, 878408, 880666, 881083, 879659, 876270, 871543, 866254, 860286, 853110, 844926, 836550, 828549, 821251, 815191, 810720, 807449, 804829, 802973, 802231, 802316, 802677, 803437, 805182, 807938, 811037, 813911, 816419, 818470, 819812, 820203, 819593, 818335, 817341, 817555, 818976, 820705, 822238, 824105, 826884, 830308, 833902, 837849, 842567, 847998, 853972, 860777, 868678, 877307, 886127, 895121, 904480, 914168, 924297, 935396, 947643, 960369, 972848, 985012, 996787, 1007446, 1016374, 1023821, 1030113, 1034820, 1037659]
58347A037659K051K947M418N219N419N725O471P683R216J0470J0827J0653J0903
58334A129661J1671J2197J2328J2763J3668J4323J4392J4301J4121J3364J2188
58323A274977J1473J1374J1026J0058R148Q720Q328P799P755Q488R340R637R377
58310A397500Q831Q353Q588R886J1546J2727J3804J5536J7297J7746J7061J6743
58298A555618J7251J7665J7645J7815J8055J7438J6201J5827J6775J7898J8485
58287A746673J9076J9986K0823K1704K3134K4490K4714K4610K6195K9419L1996
58276B012820L2928L3771L5654L7574L8607L9530M1201M3229M5235M7486M9705
58265B457740N1155N2469N5197N9081O2147O3911O5929O8597P0314P0613P1263
$$ y = [1037659, 1039710, 1042657, 1047075, 1052294, 1057713, 1063438, 1069909, 1077592, 1086808, 1097278, 1108105, 1118758, 1129661, 1141332, 1153529, 1165857, 1178620, 1192288, 1206611, 1221003, 1235304, 1249425, 1262789, 1274977, 1286450, 1297824, 1308850, 1318908, 1328056, 1336776, 1345104, 1352903, 1360658, 1369146, 1378486, 1388123, 1397500, 1406331, 1414684, 1423272, 1433158, 1444704, 1457431, 1471235, 1486771, 1504068, 1521814, 1538875, 1555618, 1572869, 1590534, 1608179, 1625994, 1644049, 1661487, 1677688, 1693515, 1710290, 1728188, 1746673, 1765749, 1785735, 1806558, 1828262, 1851396, 1875886, 1900600, 1925210, 1951405, 1980824, 2012820, 2045748, 2079519, 2115173, 2152747, 2191354, 2230884, 2272085, 2315314, 2360549, 2408035, 2457740, 2508895, 2561364, 2616561, 2675642, 2737789, 2801700, 2867629, 2936226, 3006540, 3077153, 3148416]
58254C148416P3137P4825P5431P6034P7330P8602Q0104Q3401Q8284R2362R5088
58243D043014R8998J05542J12899J19417J26046J33666J41367J49047J58489J69985
58233E358470J81281J91543K02970K16667K30659K44087K59465K78398K98871
58224G462411L19362L41887L68328L97502M28478M63064N02363N44860N90660
58215A1418915O43463P05528P75021Q51339R38518J040342J157061J290560J447951
58206B0268698J636386J859583K123693K442043K830959L307443L895848M630686
58198D2995339N547008O672907Q037046R680361J1656883J4023333J6817887K0025620
58190A35456384K3544414K7163262L0522418L3031414L3839560L2028352K7029199
$$ y = [3148416, 3221553, 3296378, 3371809, 3447843, 3525173, 3603775, 3683879, 3767280, 3855564, 3947926, 4043014, 4142012, 4247554, 4360453, 4479870, 4605916, 4739582, 4880949, 5029996, 5188485, 5358470, 5539751, 5731294, 5934264, 6150931, 6381590, 6625677, 6885142, 7163540, 7462411, 7781773, 8123660, 8491988, 8889490, 9317968, 9781032, 10283395, 10828255, 11418915, 12062378, 12767906, 13542927, 14394266, 15332784, 16373126, 17530187, 18820747, 20268698, 21905084, 23764667, 25888360, 28330403, 31161362, 34468805, 38364653, 42995339, 48542347, 55215254, 63252300, 72932661, 84589544, 98612877, 115430764, 135456384, 159000798, 186164060, 216686478, 249717892, 283557452, 315585804, 342615003]
58183C42615003J8991880Q807253k202968j2655469k1346650k7414190l0493456
58176B76301403l0788023k8940066k5748817k1913976j7930068j4128394j0781376
58169A26070683q161477o487556n805662n937839o563883p349908q013900q340366
58161F9410092q217111p679499o881743n995925n134861m352177l672249l098753
58153B4377774k616143k207059j865727j588174j361131j170691j013063q87512
58145A1668274p86437p00966o29817n74403n30510m91942m57568m28219m00946
58136F667466l72230l43090l15719k88828k61051k35143k13969j95878j78490
58127D263068j63698j54387j49285j45285j42059j40412j38658j34573j28683
$$ y = [342615003, 361606883, 370414136, 368211168, 355555699, 334209049, 306794859, 276301403, 245513380, 216573314, 190824497, 168910521, 150980453, 136852059, 126070683, 117909206, 111421650, 105615988, 99678149, 93114266, 85764358, 77750458, 69410092, 61192981, 53513482, 46631739, 40635814, 35500953, 31148776, 27476527, 24377774, 21761631, 19554572, 17688845, 16100671, 14739540, 13568849, 12555786, 11668274, 10881837, 10180871, 9551054, 8976651, 8446141, 7954199, 7496631, 7068412, 6667466, 6295236, 5952146, 5636427, 5347599, 5086548, 4851405, 4637436, 4441558, 4263068, 4099370, 3944983, 3795698, 3650413, 3508354, 3367942, 3229284, 3094711, 2966028]
58118B966028j22325j14803j05580r6789r0375q5061p9000p3070o8715o5042o0907
58107B004361n7479n5878n4577n1972m9193m7659m6188m3436m0805l9914l9391
58096A477869l7224l4319l2617l1554k9503k7101k5992k5681k4613k3178k2748
58085A163339k2897k2216k0944k0194j9638j8372j7091j7032j7739j8105j8561
58074I50550j9951k1367k1396k0574k0285k0237j9301j7875j7096j6523j5012
58063G40933j3084j2094j1738j0690r141q466q779r027r043r414r737r103q051
58050F12566p956q698q921q397q150q349q036o925n779m937m117l658m265n485
58036E18893n973n463n030n299n789o151o712p567q279q662q886q800q155p413
$$ y = [2966028, 2843703, 2728900, 2623320, 2526531, 2436156, 2351095, 2272095, 2199025, 2130310, 2065268, 2004361, 1946882, 1891004, 1836427, 1784455, 1735262, 1687603, 1641415, 1597979, 1557174, 1517260, 1477869, 1440645, 1406326, 1373709, 1342155, 1312652, 1285551, 1259559, 1233878, 1209265, 1186087, 1163339, 1140442, 1118226, 1097282, 1077088, 1057450, 1039078, 1021987, 1004955, 987216, 969111, 950550, 930599, 909232, 887836, 867262, 846977, 826740, 807439, 789564, 772468, 755945, 740933, 727849, 715755, 704017, 693327, 684186, 675720, 666941, 657914, 648871, 639457, 629720, 620617, 612566, 604610, 595912, 586991, 578594, 570444, 562095, 554059, 547134, 541355, 536418, 532301, 528643, 524378, 518893, 512920, 507457, 502427, 497128, 491339, 485188, 478476, 470909, 462630, 453968, 445082, 436282, 428127, 420714]
58022D20714p301p582p295o202n111m678m760m964n039m722l896k877k116j726
58008C52445j678k004k403k196j239k76J33L34O22N48n2l01M79J638K261K576
57992C50887L148L600L358K848K715K577J880J296J737K628K668J893J406J365
57978C84006R15k9m28K48J377K217K504K038P93n41j197j398j902k631k883k686
57962C80403k782l262l395k884k327k252k582l067l517l702l661l935m769n452
57948C32816n260m544m007l448k374j281r51r79l57P57J405J753K961N143P037
57933C28671P942Q427Q849Q745Q155Q030Q647Q952Q227P188O657O225N147L607
57919D33469K150O37j343l494n173o359p532q810r867j0506j0867j1105j1210
$$ y = [420714, 413413, 405831, 398536, 392334, 387223, 382545, 377785, 372821, 367782, 363060, 359164, 356287, 354171, 352445, 350767, 348763, 346360, 344164, 342925, 342649, 342782, 343116, 343738, 344286, 344234, 343933, 344412, 346050, 348311, 350887, 354035, 357635, 360993, 363841, 366556, 369133, 371013, 372309, 374046, 376674, 379342, 381235, 382641, 384006, 384921, 384892, 384464, 384712, 386089, 388306, 390810, 392848, 393641, 393100, 391903, 390505, 388603, 385972, 383089, 380403, 377621, 374359, 370964, 368080, 365753, 363501, 360919, 357852, 354335, 350633, 346972, 343037, 338268, 332816, 327556, 323012, 319005, 315557, 313183, 311902, 310951, 309972, 309615, 310372, 311777, 313530, 316491, 321634, 328671, 336613, 345040, 353889, 362634, 370789, 378819, 387466, 396418, 404645, 411833, 418490, 424715, 429862, 433469, 435619, 436256, 434913, 431419, 426246, 419887, 412355, 403545, 393678, 383172, 372305, 361200, 349990]
57906C49990j1083j0624r906r282r070r095q889q347p817p494p223o864o474o010
57892B31812n275m285l259k249j156r0O73J131J566K072K517K883L276L580L546
57877B36742L227K884K525J948J209N99J71l06r63j744k598l312l400k595j389
57862B32998o00n18q54j186j027J64K275M166M834M761N241O499P474P511P188
57847B78926P140P068O494N812N820O501O902O145M284K132M16q72k184l620m759
57832C26205n436o115p096p831p661o881o331o141n723m815l774k765j513q1Q29
57817B54871P44J15j29N36J870L106L520L097K576K612K994L043K457J418J9j808
57801B81041l893n776p046p436o816n504m312l879m150m734n365n625m917l381
$$ y = [349990, 338907, 328283, 318377, 309095, 300025, 290930, 282041, 273694, 265877, 258383, 251160, 244296, 237822, 231812, 226537, 222252, 218993, 216744, 215588, 215498, 216171, 217302, 218868, 220940, 223457, 226340, 229616, 233196, 236742, 239969, 242853, 245378, 247326, 248535, 249134, 249305, 248999, 248036, 246292, 243694, 240382, 236982, 234387, 232998, 232398, 231880, 231026, 229840, 228813, 228977, 231252, 235418, 240252, 245013, 250254, 256753, 264227, 271738, 278926, 286066, 293134, 299628, 305440, 311260, 317761, 324663, 330808, 335092, 337224, 337640, 336768, 334584, 330964, 326205, 320769, 314654, 307558, 299727, 292066, 285185, 278854, 272713, 266990, 262175, 258401, 255636, 254123, 254042, 254871, 255615, 255730, 255601, 256137, 258007, 261113, 264633, 267730, 270306, 272918, 275912, 278955, 281412, 282830, 282849, 281041, 277148, 271372, 264326, 256890, 250074, 244570, 240258, 236379, 232229, 227495, 222130, 216505, 211588, 208207]
57787B08207k225k333l068l286k966k824k827k367j575j145r13j5J535K676K925
57772A89799L038L662M556N371O196O873O773N845M943M572M065K594L61j773
57758B46875l336m416n165n626n806n697n397n188n218n205m921m642m543m006
57744A77709k424m68N10K57k48m68q45j494j707j261j005j452j815j266k58K41
57728A64006J90K60O72J081J290J399J361J007M00j22k26J57O98Q63N29K75N58
57711A74398Q59L64o92j221q39k27J07L97P37P14L23K60Q35J536K088K981M331
57694A86951N236M996M165L626L275K469J147k63j573k774l571l611k874j459
57680A95740O14L058N315P289R592J2792J6950K2143K8693L6552M5310N5041O6040
$$ y = [208207, 205982, 203649, 200581, 197295, 194329, 191505, 188678, 186311, 184736, 183591, 182678, 182663, 184198, 186874, 189799, 192837, 196499, 201055, 206426, 212622, 219495, 226268, 232113, 237056, 241628, 245693, 248287, 248648, 246875, 243539, 239123, 233958, 228332, 222526, 216829, 211432, 206244, 201026, 195821, 190900, 186258, 181715, 177709, 175285, 174817, 175327, 175584, 175336, 174868, 174023, 172529, 170822, 169561, 168556, 167104, 165289, 164023, 163765, 164006, 164196, 164456, 165128, 166209, 167499, 168898, 170259, 171266, 171666, 171544, 171318, 171475, 172173, 173036, 173565, 173840, 174398, 175257, 175621, 174929, 173708, 172869, 172642, 172749, 173146, 173883, 174597, 174920, 175180, 176015, 177551, 179639, 182620, 186951, 192187, 197183, 201348, 204974, 208249, 210718, 211865, 211602, 210029, 207255, 203684, 200073, 197199, 195740, 196354, 199412, 204727, 212016, 221608, 234400, 251350, 273493, 302186, 338738, 384048, 439089, 505129]
57667E05129P7198Q5677Q8925Q5977P6180N8230L2077J061k9375n4867p3278q3709
57655G69225q6183q2263p4526o5108n5320m6246l8514l1744k5360j9891j6305
57644B27765j4205j1980r000o364n071m566l793k714k037j939j906j558r92m19
57630A61221R2M18L50j52q04j221j299j319j575j982k207k168k125k256k397k297
57614A40279j901j318q04o76r46j020l63N96Q65K94k23j85j98q04j452j403r56
57597A29785r32j414j835j952j949j834j485j114j067j305j590j985k563k946
57583A05814k738k183j870j924k022j986j858j673j624k112l077l697l337k460
57569G3253j947j915j857j590j215o05K54O71jj142j379l59Q08R67R2j029j548
$$ y = [505129, 582327, 668004, 756929, 842906, 919086, 977316, 1009393, 1010454, 981079, 926212, 852934, 769225, 683042, 600779, 526253, 461145, 405825, 359579, 321065, 289321, 263961, 244070, 227765, 213560, 201580, 192580, 186216, 181145, 176579, 172786, 170072, 168035, 166096, 164190, 162632, 161640, 161221, 161313, 161731, 162081, 161929, 161125, 159904, 158605, 157286, 155711, 153729, 151522, 149354, 147229, 144973, 142576, 140279, 138378, 137060, 136256, 135580, 134634, 133614, 133251, 133847, 134712, 135006, 134783, 134598, 134400, 133596, 132144, 130741, 129785, 128853, 127439, 125604, 123652, 121703, 119869, 118384, 117270, 116203, 114898, 113308, 111323, 108760, 105814, 103076, 100893, 99023, 97099, 95077, 93091, 91233, 89560, 87936, 85824, 82747, 79050, 75713, 73253, 71306, 69391, 67534, 65944, 64729, 64124, 64378, 65049, 65048, 63906, 62527, 62168, 62976, 63943, 64035, 63006, 61458]
57552F1458r94L58J504J648J139Q76J032J079R23R54J039N00o29j251o17O90J591
57535G1300J762J590J460J445J396R83J0j134j738j605j228r52n33K84J162J507
57519G5709J116K60n23o81n6P95J080P28M52P16J120J103P18L49oo51j500k021
57501G8708j884j381j071j163j422j617j813k070k103j640j049j095j821k279
57487E6300j720o11Q5K30M17Q09Q73K79n82j088r42j73R07J680J563N70p43j881
57469E5973k676l050k974k568j916r40J83P13R1j097j549p48N39J317J385J154
57453D3837R81R20Q25M67j59o91q03o46n03k17M41J009O82m42j257j062m20j97
57435D2765l52k03M27R58Q78M12K00M89P67L76n63j140p38J68O33L78q2k40j4
$$ y = [61458, 60464, 60822, 62326, 63974, 65113, 65989, 67021, 68100, 69023, 69977, 71016, 71516, 70887, 69636, 69019, 69709, 71300, 73062, 74652, 76112, 77557, 78953, 79936, 79946, 78812, 77074, 75469, 74241, 73289, 72756, 73040, 74202, 75709, 76825, 77085, 76562, 75881, 75825, 76620, 77700, 78428, 78880, 79596, 80716, 81819, 82537, 82886, 82880, 82229, 80729, 78708, 76824, 75443, 74372, 73209, 71787, 70170, 68357, 66287, 64184, 62544, 61495, 60400, 58579, 56300, 54580, 53969, 54054, 54284, 54701, 55510, 56383, 56662, 56080, 54992, 54050, 53877, 54784, 56464, 58027, 58597, 57854, 55973, 53297, 50247, 47273, 44705, 42789, 41849, 42032, 42745, 42836, 41739, 40190, 39442, 39981, 41298, 42683, 43837, 44818, 45738, 46563, 47030, 46871, 46180, 45377, 44731, 44228, 44011, 44452, 45461, 46143, 45701, 44444, 43382, 42962, 42765, 42413, 42210, 42637, 43595, 44473, 44885, 45085, 45574, 46341, 46717, 46154, 45014, 44276, 44444, 45077, 45455, 45373, 45133, 45119]
57416D5119M78R81J046L79o86j520j880j900j604r90m31l19m07j48L55M80J72
57399C9125M8L23M38L9m29m43j20K24O65J367K064K259J738P20k37m50L39J522
57381D9192K151J995J582J285R49N21K84K48M5l49m70l09n78j553k384k261j621
57364D8727j445j788j847j294o93n55o52m41K22R49J196O99k48r74j001m35L02
57347D0722R35J378J522J264P12J68j29j41O6L87O57O15J29n45q73p08o34j211
57329D4314j973j850o92L74N40M49J007J815J797Q99M1l60o98j077j044n62k02
57312D2778j59MM35P26P54Q67R39L17r30j701j307l67K77O13Q99R13N06K15N26
57293D6305J056J110O20l7o84j194j240p16p2K63L76M72M77M11N67R17R96P29
$$ y = [45119, 45597, 46578, 47624, 48003, 47317, 45797, 43917, 42017, 40413, 39423, 38992, 38673, 38266, 38118, 38473, 38953, 39125, 39173, 39496, 39934, 39973, 39544, 39101, 38981, 39205, 39870, 41237, 43301, 45560, 47298, 48018, 47781, 47331, 47670, 49192, 51343, 53338, 54920, 56205, 57154, 57675, 57959, 58207, 58252, 57903, 57433, 57124, 56546, 54993, 52609, 50348, 48727, 47282, 45494, 43647, 42353, 41660, 41105, 40453, 40012, 40234, 41183, 42379, 43078, 42830, 41856, 40855, 40420, 40722, 41657, 43035, 44557, 45821, 46533, 46701, 46572, 46431, 46497, 46884, 47541, 48156, 48285, 47740, 46867, 46159, 45525, 44314, 42341, 40491, 39799, 40173, 40713, 41162, 42169, 43984, 45781, 46680, 46721, 46361, 45663, 44586, 43542, 42980, 42778, 42619, 42623, 43058, 43784, 44538, 45405, 46344, 46661, 45731, 44030, 42723, 42356, 42633, 43246, 44145, 45058, 45564, 45779, 46305, 47361, 48471, 49091, 49054, 48370, 47176, 45936, 45220, 45148, 45411, 45787, 46259, 46736, 47147, 47714, 48631, 49627, 50356]
57275E0356P04J098J207O74K53N57R03M77r6L78J590J925P41p38j066k11P91J182
57257F0725J052R02R82J057Q46N69O63R78Q51K01j54L12R81J054O95N69P37P67
57239G3787N78M49M96P10J158J545J184J1r28p82q9K07K67P98J567J737J437J583
57221H5715K283K749K825L283M233M660M102L727M869P221R328J0448J1219J2646
57207A69308J4948J7482J9397K0289K0210J9306J7724J5926J4604J3974J3639
57196C56807J3398J3693J4766J6008J6827J7519J8466J9082J8609J7615J7406
57185E40196J8086J8372J7449J5942J4863J4553J4891J5694J6598J7178J7332
57174G21154J7058J6016J4131J2349J1732J1887J1414R942Q557Q036Q017Q169
$$ y = [50356, 51060, 52158, 53365, 54039, 54292, 54849, 55752, 56229, 56133, 56511, 58101, 60026, 60767, 60029, 58963, 58752, 59543, 60725, 61777, 62679, 63661, 64718, 65564, 66133, 66796, 67774, 68625, 68826, 68672, 68984, 69965, 71019, 71714, 72283, 73020, 73787, 74365, 74814, 75310, 76020, 77178, 78723, 79907, 79918, 78990, 78208, 78119, 78326, 78593, 79391, 80958, 82695, 84132, 85715, 87998, 90747, 93572, 96855, 101088, 105748, 109850, 113577, 118446, 125667, 134995, 145443, 156662, 169308, 184256, 201738, 221135, 241424, 261634, 280940, 298664, 314590, 329194, 343168, 356807, 370205, 383898, 398664, 414672, 431499, 449018, 467484, 486566, 505175, 522790, 540196, 558282, 576654, 594103, 610045, 624908, 639461, 654352, 670046, 686644, 703822, 721154, 738212, 754228, 768359, 780708, 792440, 804327, 815741, 825683, 834240, 842276, 850293, 858462]
57162H58462Q858J0047J0829J0795J0874J1994J3798J5462J6852J8113J8913J9028
57150A024025J9050J9672K0708K1500K1791K1610K0901J9914J9335J9442J9672
57139A247620J9635J9747K0239K0477K0193K0495K2398K5054K6739K7217K7793
57128A497607K9395L1952L5478M0243M5717N0626N4443N7709O0675O2780O3981
57117B030606O5506O8499P2674P7050Q1559Q7163R4614J03677J13543J23761J34723
57106C053375J47383J62535J80692K02877K31077K67379L12923L68507M36006
57097E362754N18405O18390P37596Q76892J036117J213218J404522J605936J812740
57088A5186570K017984K212488K386979K533539K645581K718734K751365K738506
$$ y = [858462, 867320, 877367, 888196, 898991, 909865, 921859, 935657, 951119, 967971, 986084, 1004997, 1024025, 1043075, 1062747, 1083455, 1104955, 1126746, 1148356, 1169257, 1189171, 1208506, 1227948, 1247620, 1267255, 1287002, 1307241, 1327718, 1347911, 1368406, 1390804, 1415858, 1442597, 1469814, 1497607, 1527002, 1558954, 1594432, 1634675, 1680392, 1731018, 1785461, 1843170, 1903845, 1966625, 2030606, 2096112, 2164611, 2237285, 2314335, 2395894, 2483057, 2577671, 2681348, 2794891, 2918652, 3053375, 3200758, 3363293, 3543985, 3746862, 3977939, 4245318, 4558241, 4926748, 5362754, 5881159, 6499549, 7237145, 8114037, 9150154, 10363372, 11767894, 13373830, 15186570, 17204554, 19417042, 21804021, 24337560, 26983141, 29701875, 32453240, 35191746]
57080C5191746K659975K476648K146968J654798J024881L13912m11641j093003
57072D3964284j686412k165178k519412k752236k873847k897688k839667k717350
57064B3512494k547819k346287k126540j901263j681022j473278j282724j112078
57056I041483r62286q32621p21308o26129n44694m74762m14733l63644l20539
57047C780767k84181k53301k26760k03445j82520j63911j47988j34562j22718
57038B061381j11731j01612r2468q3946p5794o8409o2260n7040n1956m6733m1756
57027A267676l7238l2619k7035k0129j2285l919N383J6812L1332M9035O9680R3028
57015A399721J17405J37727J46165J35968J05247N7816J374n5020j03210j37580
$$ y = [35191746, 37851721, 40328369, 42475337, 44130135, 45155016, 45468928, 45057287, 43964284, 42277872, 40112694, 37593282, 34841046, 31967199, 29069511, 26229844, 23512494, 20964675, 18618388, 16491848, 14590585, 12909563, 11436285, 10153561, 9041483, 8079197, 7246576, 6525268, 5899139, 5354445, 4879683, 4464950, 4101306, 3780767, 3496586, 3243285, 3016525, 2813080, 2630560, 2466649, 2318661, 2184099, 2061381, 1949650, 1848038, 1755570, 1671624, 1595830, 1527421, 1465161, 1408121, 1356165, 1309432, 1267676, 1230438, 1197819, 1170784, 1150655, 1138370, 1134451, 1139834, 1156646, 1187978, 1237013, 1306693, 1399721, 1517126, 1654853, 1801018, 1936986, 2042233, 2100049, 2101423, 2046403, 1943193, 1805613]
57005A805613j55635j57859j47653j30745j12860r6883q2643o9523n8177m9330
56995G44305m2300l5888k9935k4952k0885j7339j4378j2059r687o682l685j617
56983E24898j39J568K827J914j445n488q647j1048j3358j5372j6381j6118j4735
56970D28476j2556j0277q683p734o500m340j587J136L615N821P757R779J2310
56957D17217J4773J5619J3892J0170N576N79m730r840j4011j6851j8210j7931
56945C96253j6271j4156j2382j0753q519n456k134Q00L240N612Q465J1927J5521
56932C72147J8620K0996K2423K1973J8435J1746L398m883j2339j8740k3481k5807
56920D04488k5709k4074k1935j9804j7627j5198j2654j0504q999p726o274n019
$$ y = [1805613, 1649978, 1492119, 1344466, 1213721, 1100861, 1003978, 921335, 851812, 793635, 744305, 702005, 666117, 636182, 611230, 590345, 573006, 558628, 546569, 536882, 530200, 526515, 524898, 524759, 526327, 529154, 531068, 529623, 524135, 515488, 504440, 491082, 475710, 459329, 443211, 428476, 415920, 405643, 396960, 389226, 382726, 378386, 376799, 377935, 381550, 387371, 395128, 404907, 417217, 431990, 447609, 461501, 471671, 477247, 477826, 473096, 463256, 449245, 432394, 414184, 396253, 379982, 365826, 353444, 342691, 334172, 328716, 326582, 327382, 330622, 336234, 344699, 356626, 372147, 390767, 411763, 434186, 456159, 474594, 486340, 489738, 484855, 472516, 453776, 430295, 404488, 378779, 354705, 332770, 312966, 295339, 280141, 267487, 256983, 247984, 240258, 233984, 228965]
56908B28965m551m541m046k940k061j759j373n01K91N68Q98J844K985L817M838
56893B22434O700Q802R956J0154J0673J2390J4901J7251J8686J8557J6295J1967
56881C78766O500J000l949q215j1556j3443j3452j1797r262o531l667m95K813
56868C06712N948R110J2846J7288K2106K7160L2469L7418M0766M1697M0144L5959
56856F29623K8664J8431O554n500j6714k5902l1548l3067l1448k7929k2795j6178
56844D72191r162k978K435Q100J4671K2195L0695M0023M9411N7885O4714O8786
56832H18966O8134O1149M7956L0014Q976j3103l3242m8681n8569o3575o4241o0792
56820F92992n4225m6173l7603k8695j9829j1525l497M995J3786K1935K9284L6493
$$ y = [228965, 224414, 219873, 215827, 212887, 210826, 209067, 207694, 207193, 207484, 208052, 208950, 210794, 213779, 217596, 222434, 229134, 237936, 247892, 258046, 268719, 281109, 296010, 313261, 331947, 350504, 366799, 378766, 385266, 386266, 382317, 374102, 362546, 349103, 335651, 323854, 314592, 308061, 304394, 303899, 306712, 312660, 321770, 334616, 351904, 374010, 401170, 433639, 471057, 511823, 553520, 593664, 629623, 658287, 676718, 683272, 677772, 661058, 635156, 603608, 570541, 539093, 511164, 488369, 472191, 463029, 460051, 462486, 470586, 485257, 507452, 538147, 578170, 627581, 685466, 750180, 818966, 887100, 948249, 996205, 1026219, 1035195, 1022092, 988850, 940169, 881600, 818025, 753784, 692992, 638767, 592594, 554991, 526296, 506467, 494942, 491445, 496440, 510226, 532161, 561445, 597938]
56808E97938M3301M8016M9011M5684L7717K4858Q197r498k5507l8466m7669n2328
56796F81254n2492m9696m5619m0579l4219k7050k0309j4607r593m761J20N181
56784C87630J0451J5625K0177K3565K5030K3621J8910J1502K529p085j6478k4410
56772D91067k9687l2088l2408l1628l0213k8124k5236k1763j8347j5625j3607
56761B12341j1785r877q141o807n685m561l596k998k661k437k421k610k660k344
56747A43758j926j690j462j057q27j199j859k047j593j015o77m02o3O0j99n11
56731A27291n01l09l45o33p58m46P8L70K61L3J24P00J461J871J611Q08q9o33n64
56712A30330Q2Q63J128N89k72o72m47j66k05k51QK01q1m29j92L01M6r93j622j105
$$ y = [597938, 641239, 689255, 738266, 783950, 821667, 846525, 854722, 845224, 819717, 781251, 733582, 681254, 628762, 579066, 533447, 492868, 458649, 431599, 411290, 396683, 387090, 382329, 382449, 387630, 398081, 413706, 433883, 457448, 482478, 506099, 525009, 536511, 539040, 531955, 515477, 491067, 461380, 429292, 396884, 365256, 335043, 306919, 281683, 259920, 241573, 225948, 212341, 200556, 190679, 182538, 175731, 170046, 165485, 161889, 158891, 156230, 153793, 151372, 148762, 146102, 143758, 141832, 140142, 138680, 137623, 136796, 135597, 133738, 131691, 130098, 129083, 128406, 128004, 127941, 128001, 127802, 127291, 126790, 126481, 126136, 125503, 124745, 124299, 124377, 124747, 125008, 125041, 125165, 125865, 127326, 129197, 130808, 131616, 131527, 130894, 130330, 130412, 131275, 132403, 132992, 132720, 132048, 131601, 131435, 131230, 130979, 130987, 131188, 131107, 130678, 130486, 130787, 130833, 129840, 128218, 127113]
56692A27113j77J65j0j16j24k41j15O11J399J408P91L96L71Q6o22j107j034q88
56674A27906j022j065n61K62Q52R03M29l27q30o18M8L88J22j31K65J082J583J413
56656A30699Q43L85K97L68J52m08p16j91R10J734J770J168L03m94q37n84j20J27
56638A35406L70R94J646J624J082R36J434J851J841K096L145M359M686L822K170
56623A67462L04j075j316n73O9j98j020j553j506j083m33K86P22P30N81M43J18
56606A61958l03k34M33P80N7j095j425p69q7j00n73r76j063q14l58k0q6m74r15
56587A53936j241j237n83N22J161P11j85m09P1K60l00q90p29N2R01J706K584L297
56569A59627L419L023K724K923L356L536L452L673M652O221P806R019R805J0100
$$ y = [127113, 126936, 127101, 127091, 126975, 126851, 126610, 126495, 127106, 128505, 129913, 130704, 131100, 131471, 131557, 130935, 129828, 128794, 127906, 126884, 125819, 125258, 125520, 126372, 127275, 127704, 127377, 126547, 125929, 125977, 126365, 126487, 126356, 126621, 127703, 129286, 130699, 131542, 131927, 132224, 132592, 132744, 132336, 131620, 131429, 132339, 134073, 135843, 137011, 137314, 136820, 135983, 135399, 135279, 135406, 135776, 136770, 138416, 140040, 141122, 142058, 143492, 145343, 147184, 149280, 152425, 156784, 161470, 165292, 167462, 167766, 166691, 165375, 164802, 164871, 164673, 163653, 162100, 160594, 159511, 159078, 159364, 160086, 160816, 161397, 161840, 161958, 161655, 161421, 161854, 162634, 162691, 161596, 160171, 159402, 159315, 159215, 158642, 157666, 156603, 155789, 155431, 155411, 155325, 154851, 153936, 152695, 151458, 150875, 151397, 152558, 153269, 153084, 152675, 152746, 153006, 152706, 151816, 151087, 151139, 152040, 153746, 156330, 159627, 163046, 166069, 168793, 171716, 175072, 178608, 182060, 185733, 190385, 196606, 204412, 213431, 223236, 233336]
56555B33336R750Q769P413N871M184K539J366Q67P34N36K06q5l76r55j914k815
56539B69426l028k474j906k158l031l462l021k640l285m451m865m348l931m191
56525B22635m609m677m491l981k758j223p31j851l366l844l336k703k071j101
56511A81893k07k59j225k136k407k325k202j866j127k09M60N50L8o90j104j200
56495A65984j469j968j945r68J66M06j03l35J21P33J044J101R75O11K65L33P01
56478A65652Q01M55J13J86N98J002J033M02p82j815j943j091K04J448K316K492
56462A71071J915J139Q86J228J616J611J264Q79P72J073J508J664J726K391L607
56447A94350M095K914R82K2L72Q54O50J85J16M42Q28R82N75n23j736k227j929
$$ y = [233336, 243086, 251855, 259268, 265139, 269323, 271862, 273228, 274095, 274829, 275365, 275571, 275486, 275110, 274155, 272241, 269426, 266398, 263924, 262018, 259860, 256829, 253367, 250346, 247706, 244421, 239970, 235105, 230757, 226826, 222635, 218026, 213349, 208858, 204877, 202119, 200896, 200165, 198314, 194948, 191104, 187768, 185065, 182994, 181893, 181686, 181427, 180202, 178066, 175659, 173334, 171132, 169266, 168139, 167930, 168390, 168940, 168978, 168288, 167184, 165984, 164515, 162547, 160602, 159634, 159800, 160206, 160103, 159768, 159889, 160622, 161666, 162767, 163742, 164353, 164618, 164951, 165652, 166453, 166908, 167021, 167207, 167805, 168807, 169840, 170242, 169460, 167645, 165702, 164611, 164815, 166263, 168579, 171071, 172986, 174125, 175011, 176239, 177855, 179466, 180730, 181609, 182381, 183454, 184962, 186626, 188352, 190743, 194350, 198445, 201359, 202341, 202363, 202735, 203589, 204239, 204424, 204540, 204982, 205810, 206792, 207367, 206844, 205108, 202881, 200952]
56430B00952j528j360j114o49l38l90n51o15o28m46J89R78J121K82j012k004k271
56413A90616j714o34J98K58mJ24M20J23n94q25n72q34j720j918p36O29P91J46
56395A83754LO01J152J359J706K388K988L172L049K857K750K843K985K718J854
56380B16179Q56K75Q8N0K34P05J012P02J40J16P16J255J289J089J040J082R52
56363B27780N79O7l99n78l21J07K30j6j06M23J279J684J309O89N50R20J186J014
56345B36397P55Q11J001R00M88L3l78o35k64J016K473K944K358J868K227K798
56329B54792K660K019J808K321K945L076K775K478K455K600K535J997J215P52
56315B86428P94Q91N55q2n51p28r02j209j381j111m55K66P76J025J082J035J005
$$ y = [200952, 199424, 198064, 196950, 196301, 195963, 195573, 195022, 194407, 193779, 193333, 193522, 194500, 195621, 195903, 194891, 192887, 190616, 188902, 188268, 188466, 188724, 188720, 188844, 189264, 189387, 188793, 187968, 187396, 186562, 184842, 182924, 182188, 182817, 183608, 183754, 183757, 184358, 185510, 186869, 188575, 190963, 193951, 197123, 200172, 203029, 205779, 208622, 211607, 214325, 216179, 217035, 217310, 217398, 217448, 217682, 218387, 219399, 220101, 220241, 220357, 221073, 222328, 223617, 224706, 225746, 226828, 227780, 228359, 228426, 228027, 227449, 227128, 227235, 227465, 227449, 227343, 227766, 229045, 230729, 232038, 232727, 233277, 234197, 235383, 236397, 237152, 237963, 238964, 239864, 240352, 240385, 240007, 239372, 239108, 240124, 242597, 245541, 247899, 249767, 251994, 254792, 257452, 259471, 261279, 263600, 266545, 269621, 272396, 274874, 277329, 279929, 282464, 284461, 285676, 286428, 287222, 288113, 288668, 288586, 288035, 287307, 286405, 285196, 283815, 282704, 282249, 282515, 283291, 284316, 285398, 286433, 287438]
56298B87438J186J646K135K273K008J681J513J309Q09J31l94n88m48PO83J439
56282C02828K298L285L961L732K835K374K856L484L479L355L990N095N715N747
56268C55034N808O003O003O070O727P548P697P537Q283J0016J1496J2192J2956
56255D63370J4331J5777J7137J9285K2493K5592K7775K9986L3397L7649M1721
56244G48513M5520M9302N2395N3933N4356N4790N5238N4576N2153M8283M3275
56233A312334L7028K9536K1031J1614J512q370j6867k3648k9367l4729l9780m4003
56221A216291m6747m7734m7465m6877m6334m5301m3301m0633l7804l4814l1567
56210G47714k8427k5775k3435k1110j9038j7622j6769j6036j5123j3797j1923
$$ y = [287438, 288624, 290270, 292405, 294678, 296686, 298367, 299880, 301189, 301998, 302129, 301735, 301147, 300699, 300706, 301389, 302828, 305126, 308411, 312372, 316104, 318939, 321313, 324169, 327653, 331132, 334487, 338477, 343572, 349287, 355034, 360842, 366845, 372848, 378918, 385645, 393193, 400890, 408427, 416710, 426726, 438222, 450414, 463370, 477701, 493478, 510615, 529900, 552393, 577985, 605760, 635746, 669143, 706792, 748513, 794033, 843335, 895730, 949663, 1004019, 1058809, 1114047, 1168623, 1220776, 1269059, 1312334, 1349362, 1378898, 1399929, 1411543, 1413055, 1404685, 1387818, 1364170, 1334803, 1300074, 1260294, 1216291, 1169544, 1121810, 1074345, 1027468, 981134, 935833, 892532, 851899, 814095, 779281, 747714, 719287, 693512, 670077, 648967, 629929, 612307, 595538, 579502, 564379, 550582, 538659]
56199E38659r936q656q140p360n656l765k732k482k305k107k185k277j878j165
56185D78015p02m65p4L70M52K51J37Q1k8K20J168K153K199J418Q36R64J429J900
56167D90324K390K694K433J796J491J820K479L210M093N084N939O624P279P829
56153E45485Q112Q301Q758R555J0560J1742J2971J3886J4467J5430J7454K0329
56141F97050K3412K6536K9909L3596L7805M3292N0679N9681O9643Q0464R2234
56130A244301J04248J15014J22853J26032J23139J14379J02040Q8801P5988O4198
56120B280993N4568M7892M2904L7062K8982J9105Q247k995j3458k1592k6983l1031
56108B423694l5908m3454n4637o8896q3890r6846j06272j11842j13123j09680
$$ y = [538659, 528723, 520067, 511927, 504567, 498911, 495146, 492414, 489932, 487627, 485520, 483335, 481058, 479180, 478015, 477313, 476848, 476774, 477144, 477596, 477847, 477984, 478065, 478037, 478257, 479425, 481578, 483777, 485195, 486031, 486995, 488424, 490324, 492714, 495408, 497841, 499637, 501128, 502948, 505427, 508637, 512730, 517814, 523753, 530377, 537656, 545485, 553597, 561898, 570656, 580211, 590771, 602513, 615484, 629370, 643837, 659267, 676721, 697050, 720462, 746998, 776907, 810503, 848308, 891600, 942279, 1001960, 1071603, 1152067, 1244301, 1348549, 1463563, 1586416, 1712448, 1835587, 1949966, 2052006, 2140807, 2216795, 2280993, 2335561, 2383453, 2426357, 2463419, 2492401, 2511506, 2519753, 2516758, 2503300, 2481708, 2454725, 2423694, 2387786, 2344332, 2289695, 2220799, 2136909, 2040063, 1933791, 1821949, 1708826, 1599146]
56098A599146j02248r2588q1990p0818n9464m8746l9333l1513k5453k0899j6906
56087A009188j2772q977o299m421k398n6K148M218O285P630P485O481O038O538
56073A021088P373Q344R477R976R102P914Q290J0310J2266J3222J3807J4475J4901
56060A160545J5228J6131J7382J8000J7977J8176J8382J7465J5603J4436J4525
56049A343850J4661J4105J3623J3696J3664J3377J3860J5562J7563J9277K1261
56038A514499K3709K5718K6814K7726K9035L0498L2067L4015L5805L6601L7080
56027A853567L8737M1220M2631M2803M3735M6147M8273M9068M9838N1570N3229
56016B360818N4210N5945N9409O3331O6583P0113P4792P9418Q2784Q5803Q9733
$$ y = [1599146, 1496898, 1404310, 1322320, 1251502, 1192038, 1143292, 1103959, 1072446, 1046993, 1026094, 1009188, 996416, 987439, 981140, 976719, 974321, 974265, 976413, 980631, 986916, 994546, 1002031, 1008512, 1014550, 1021088, 1028461, 1036805, 1046282, 1056258, 1065360, 1073274, 1081564, 1091874, 1104140, 1117362, 1131169, 1145644, 1160545, 1175773, 1191904, 1209286, 1227286, 1245263, 1263439, 1281821, 1299286, 1314889, 1329325, 1343850, 1358511, 1372616, 1386239, 1399935, 1413599, 1426976, 1440836, 1456398, 1473961, 1493238, 1514499, 1538208, 1563926, 1590740, 1618466, 1647501, 1677999, 1710066, 1744081, 1779886, 1816487, 1853567, 1892304, 1933524, 1976155, 2018958, 2062693, 2108840, 2157113, 2206181, 2256019, 2307589, 2360818, 2415028, 2470973, 2530382, 2593713, 2660296, 2730409, 2805201, 2884619, 2967403, 3053206, 3142939]
56005C142939R4096R8021J01959J06400J10720J14863J20327J27817J35851J43163
55995D296156J50619J59214J68382J77849J88836K01705K14771K27289K41161
55986F025982K57767K75759K94068L14472L38765L66050L95288M27879M65164
55977I161194N06046N49914N99241O56442P20885P92055Q72907R67097J075809
55968A5901590J200789J347666J523046J731464J979105K277927K643204L091337
55960C1696128L644826M335871N199769O267095P567122R138115J1031939J3307907
55952I2188772J6012602J9144402K2618291K6246348K9706768L2465605L3719350
55945B72102138L2527985K8197156K0690910J0752765l43057j1180430k0492582
$$ y = [3142939, 3237035, 3335056, 3437015, 3543415, 3654135, 3768998, 3889325, 4017142, 4152993, 4296156, 4446775, 4605989, 4774371, 4952220, 5141056, 5342761, 5557532, 5784821, 6025982, 6283749, 6559508, 6853576, 7168048, 7506813, 7872863, 8268151, 8696030, 9161194, 9667240, 10217154, 10816395, 11472837, 12193722, 12985777, 13858684, 14825781, 15901590, 17102379, 18450045, 19973091, 21704555, 23683660, 25961587, 28604791, 31696128, 35340954, 39676825, 44876594, 51143689, 58710811, 67848926, 78880865, 92188772, 108201374, 127345776, 149964067, 176210415, 205917183, 238382788, 272102138, 304630123, 332827279, 353518189, 364270954, 363927897, 352747467, 332254885]
55938C32254885k7343183l1281420l2428962l1378413k8918856k5764696k2428001
55931A32711354j9219560j6295852j3712101j1474505r573445p987331o678844
55924D7769716n604528m726773m012649l428921k946586k546569k215109j937320
55916B0351261j700150j497290j325357j178167j049363r37327q42405p61530
55908A1059672o90030o26467n71475n23599m80315m41551m08332l79188l51411
55899F587304l24866l01253k80475k60765k41734k24403k08711j93518j78767
55890D372812j65339j53012j40579j27703j14933j02230q9037p5350o1240m5835
55880C297554k8269r319R222K6233M1042N2091N7232N5122M5315K7495J946k9409
$$ y = [332254885, 304911702, 273630282, 241201320, 209822907, 180904051, 155139355, 132711354, 113491794, 97195942, 83483841, 72009336, 62435891, 54448560, 47769716, 42165188, 37438415, 33425766, 29996845, 27050259, 24503690, 22288581, 20351261, 18651111, 17153821, 15828464, 14650297, 13600934, 12663607, 11821202, 11059672, 10369642, 9743175, 9171700, 8648101, 8167786, 7726235, 7317903, 6938715, 6587304, 6262438, 5961185, 5680710, 5419945, 5178211, 4953808, 4745097, 4551579, 4372812, 4207473, 4054461, 3913882, 3786179, 3671246, 3569016, 3479979, 3404629, 3343389, 3297554, 3269285, 3259966, 3269188, 3295421, 3336463, 3388554, 3445786, 3500908, 3546223, 3573718, 3575664, 3546255]
55868C546255o3255r6034j24496j46052j59594j65560j64722j57644j45810j32004
55858B191084j18504j05674r3167q1609p2003o4368n8040n2728m8386m4727m1726
55847A410152l9827l8839l7487l5034l2401l0649k9308k7417k5312k3986k3283
55836A066609k2229k0743j9609j9020j8375j7424j6526j5814j5072j4383j4034
55825H73380j3900j3680j3565j3965j4695j5073j4713j3735j2516j1623j1513
55814G24402j1761j1204r446p542o491n802m474k721j521j045o13N9P90J841L642
55799F68114N679O743O476N733N305N087M636L831K729J355k16j896l669n303
55785G04604o216o123n638n690o580q062j0040j2503j4990j6857j7939j8417j8182
$$ y = [3546255, 3483000, 3386966, 3262470, 3116418, 2956824, 2791264, 2626542, 2468898, 2323088, 2191084, 2072580, 1966906, 1873739, 1792130, 1720127, 1655759, 1597719, 1544991, 1496605, 1451878, 1410152, 1370325, 1331486, 1293999, 1258965, 1226564, 1195915, 1166607, 1139190, 1113878, 1089892, 1066609, 1044380, 1023637, 1004028, 985008, 966633, 949209, 932683, 916869, 901797, 887414, 873380, 859480, 845800, 832235, 818270, 803575, 788502, 773789, 760054, 747538, 735915, 724402, 712641, 701437, 691991, 684449, 677958, 672156, 667682, 664961, 663440, 662395, 661782, 661841, 662631, 664472, 668114, 673793, 680536, 687012, 692745, 698050, 703137, 707773, 711604, 714333, 715688, 715472, 713576, 709907, 704604, 698388, 692265, 686627, 680937, 674357, 666295, 656255, 643752, 628762, 611905, 593966, 575549, 557367]
55772E57367j6922j4671j1743q383n016k456j132m23M48J144O95r23k665l834
55758D91486m642n338n716n757n969o676p578q294q842r286r398r030q504q396
55744C88060q956r799j0014q842o581m582l848l834l199j625j38L55J15p8k3j19
55728C26892o65j534k371l005l618m513n548o063n651m754m084l673l083k345
55714B75985j991k093k004j311m44R3N96J756L521M897M950L784K283J066k4j380
55698B89684k871m088n035o008o799o757n899n237n484o028n836m852l706k521
55684B18563r29Q40J882J788J176P76O21L63q7n35p82p67o19o51j050j593j927
55667B17069k111k489l114l531l319k472j288q6Q66J415J561J446J364J771K967
$$ y = [557367, 540445, 525774, 514031, 505648, 500632, 498176, 497044, 496621, 497069, 498213, 498908, 497985, 495320, 491486, 486844, 481506, 475790, 470033, 464064, 457388, 449810, 441516, 432674, 423388, 413990, 404960, 396456, 388060, 379104, 369305, 359291, 350449, 343868, 339286, 335438, 331604, 328405, 326780, 326642, 326997, 327112, 327034, 327011, 326892, 326227, 324693, 322322, 319317, 315699, 311186, 305638, 299575, 293924, 289170, 285086, 281413, 278330, 275985, 273994, 271901, 269897, 268586, 268142, 268235, 268831, 270587, 274108, 279005, 283955, 287739, 290022, 291088, 291064, 289684, 286813, 282725, 277690, 271682, 264883, 258126, 252227, 246990, 241506, 235478, 229642, 224790, 221084, 218563, 217634, 218474, 220356, 222144, 223320, 224096, 224717, 225080, 224993, 224458, 223676, 222909, 222290, 221639, 220589, 218996, 217069, 214958, 212469, 209355, 205824, 202505, 200033, 198745, 198659, 199525, 200940, 202501, 203947, 205311, 207082, 210049]
55652B10049M596N778O021N648N188M714M126L541L049K443J666J054O10l89k340
55637B55754m369n298n257n429o343p366p769p436o479m985l360k181j553j149
55623A86780r10j057j427j459r58k53L07M71j15j445k569k476j521j017j345j613
55607A69393j301j075j462j901j804j604j907k368k301j814j444j115l71O01J047
55592A50574O88Q7j39O8M13O73P87P27M20j01n09l11N37J299J255P10O82J499
55574A59359K432K863L143L923N261O767Q148R136R284Q404O867N195L528J834
55560B36144K21j293k956m862o602p732q302q591q546p879o635n397m898n370
55546A57302o128n977m458k590j815k268k744k314j227p9R15J494J156L6p89n42
$$ y = [210049, 214645, 220423, 226444, 232092, 237280, 241994, 246120, 249661, 252710, 255153, 256819, 257873, 258483, 258094, 255754, 251385, 246087, 240830, 235401, 229058, 221692, 213923, 206487, 200008, 195023, 191663, 189482, 187929, 186780, 185870, 184813, 183386, 181927, 180969, 180716, 181023, 181494, 181379, 179934, 177365, 174889, 173368, 172351, 171006, 169393, 168092, 167017, 165555, 163654, 161850, 160246, 158339, 155971, 153670, 151856, 150412, 149297, 148926, 149527, 150574, 151262, 151349, 151210, 151278, 151691, 152364, 153151, 153878, 154298, 154197, 153688, 153377, 153914, 155213, 156468, 157178, 157860, 159359, 161791, 164654, 167797, 171720, 176981, 183748, 191896, 201032, 210316, 218720, 225587, 230782, 234310, 236144, 236365, 235072, 232116, 227254, 220652, 212920, 204618, 196027, 187481, 179602, 172967, 167570, 162672, 157302, 151174, 145197, 140739, 138149, 136334, 134066, 131322, 129008, 127781, 127702, 128617, 130111, 131267, 131303, 130514, 129972]
55530A29972K62O58M71J02l20q31j151j043q59j040j347j224o50j49j21o41j542
55513A20547k248k034r12J29L27N3n6j74p05j194q70N9O53O00L79K70J70K67R22
55494A16183J854K298K074J665J203L03r55j769j645r63l08J66L91J70l84p15
55478A19568m67J57P98J260J311P14l31j196j490j323r47n42l65n10n50QQ29R86
55460A17910K94l94l79N1L38M74O56P10M16k7k98m47o52p98o62k93Q5L27L18l4
55440A17595n75r21r45q81q10m43K82Q54Q34M89L44L89J63m88j119j132l20R56
55422A14272K006K343K128J860J692J303N83n9k64j77m9K29P98J365J484J104
55406A30618N06j62r10j628k156k490k667k562k080j462j079j021j084j069q52
$$ y = [129972, 130234, 130892, 131363, 131465, 131145, 130314, 129163, 128120, 127261, 126221, 124874, 123650, 123000, 122851, 122730, 122089, 120547, 118299, 116265, 115353, 115482, 115809, 115862, 115806, 115632, 114927, 113733, 112863, 112922, 113575, 114175, 114554, 114824, 114994, 115261, 116183, 118037, 120335, 122409, 124074, 125277, 125580, 124625, 122856, 121211, 120248, 119940, 120106, 120497, 120667, 120283, 119568, 119101, 119258, 120056, 121316, 122627, 123341, 123010, 121814, 120324, 119001, 118054, 117512, 117147, 116637, 116087, 116095, 116924, 117910, 118204, 117810, 117431, 117482, 117820, 118294, 118950, 119660, 120076, 120049, 119751, 119304, 118652, 117854, 117192, 116899, 116984, 117311, 117629, 117595, 117020, 116099, 115154, 114273, 113463, 113020, 113302, 114156, 114990, 115479, 115823, 116212, 116375, 115887, 114768, 113636, 113316, 114272, 116278, 118621, 120749, 122609, 124301, 125604, 126187, 126128, 125864, 125687, 125638, 125867, 126665, 128030, 129514, 130618, 131124, 130962, 130052, 128424, 126268, 123778, 121111, 118549, 116469, 115007, 113928, 112907, 111823, 110754, 109902]
55391A09902l31M43J123J294Q30l4q82j245q87j60J48l39j073j221p15k27k15
55374A06411l57j00O01J277J554J480J249Q25M6q99j396j084m28k35o09q57m86
55357A06992J21L33J54J01L49N06J90m63r70j005o72l33j54O3M64P17L57m50r58
55338A05342p88l72k32k78k16j94m33o03k06N38R07P31O18R63J366J273O89o4
55320A09041q18j399j378n57M68P30l3j085j520j136l88K02M75O38R66J380J332
55303A06918L97r48j511o98O97J428J254R03P25K36p83j614j543q61l22k7L22
55286A04573N11M9p48r06j98N00N53M29P71J273J191N02r7j56J31M51P51J041
55268A10621J215J144Q37M23L7l49r07j587j829j099K64J170R55L8p40r78o95
$$ y = [109902, 109571, 110014, 111137, 112431, 113261, 113227, 112345, 111100, 110213, 110053, 110201, 109862, 108789, 107568, 106853, 106626, 106411, 106054, 105954, 106555, 107832, 109386, 110866, 112115, 112940, 112986, 112087, 110691, 109607, 109179, 108944, 108335, 107478, 106992, 107113, 107446, 107600, 107701, 108050, 108556, 108746, 108283, 107313, 106308, 105636, 105303, 105149, 105212, 105676, 106393, 106750, 106300, 105342, 104554, 104182, 103950, 103672, 103456, 103262, 102829, 102226, 102020, 102558, 103465, 104196, 104814, 105777, 107143, 108416, 109105, 109041, 108223, 106824, 105446, 104889, 105357, 106087, 106054, 104969, 103449, 102313, 101925, 102127, 102602, 103240, 104206, 105586, 106918, 107315, 106367, 104856, 104158, 104855, 106283, 107537, 108440, 109165, 109401, 108618, 107004, 105461, 104600, 104278, 104251, 104573, 105084, 105133, 104385, 103479, 103281, 103781, 104334, 104763, 105534, 106807, 107998, 108500, 108403, 108247, 108378, 108829, 109580, 110621, 111836, 112980, 113817, 114240, 114277, 113928, 113021, 111434, 109605, 108506, 108770, 109940, 110895, 110933, 110193, 109215, 108520]
55251A08520p3L91P9q30j138l1J667K418J885J083P61N91J35k64o2N39P75K19
55233A16665p75j434j283o25l53r84j902j968r43J68M21N0l1M84J015R78M54n9
55215A09878k33p9K49N89P36N32P1k75k14R6K66K42L79Q55J333J412J181R67P95
55196A18780M64j2l82n92p63q28n81j74j25o56j352j671j517j112n78J4M10L07
55178A09632k31p04o03J06Q98J106M95n31j276j341q08mQ12J537K168K661K759
55161A16676K155R86k3j82L72Q57P88L94R0r2l32o33q84j122j410j599j411q09
55143A13821j19K08r8r35j770j915j146k2N61K80l50n97k14N83J511K301K517
55126A14616J790M02p56j078q52p02o63k85M84J039Q23m3r71j434j207m29M24
$$ y = [108520, 108447, 108838, 108917, 108087, 106949, 106918, 108585, 111003, 112888, 113971, 114732, 115323, 115458, 115194, 115132, 115671, 116446, 116665, 115890, 114456, 113173, 112548, 112195, 111211, 109309, 107341, 106398, 106566, 106987, 107037, 107006, 107490, 108505, 109483, 109937, 109878, 109645, 109566, 109815, 110404, 111140, 111672, 111743, 111468, 111254, 111350, 111616, 111858, 112237, 113092, 114425, 115837, 117018, 117985, 118780, 119244, 119232, 118850, 118258, 117495, 116667, 116086, 115912, 115787, 115131, 113779, 112108, 110591, 109479, 108901, 108915, 109325, 109632, 109401, 108697, 108094, 108200, 109098, 110204, 110699, 110168, 108892, 107551, 106743, 106739, 107551, 109088, 111256, 113917, 116676, 118831, 119817, 119794, 119612, 119984, 120841, 121629, 122023, 122113, 122021, 121689, 121056, 120172, 119050, 117640, 116041, 114630, 113821, 113702, 113910, 113812, 112877, 111107, 109192, 108046, 108024, 108585, 108865, 108515, 107918, 107704, 108287, 109798, 112099, 114616, 116406, 116808, 116052, 114974, 114122, 113420, 112757, 112472, 112956, 113995, 114818, 114775, 113804, 112370, 111163, 110734, 111158]
55109A11158R12J057J130J111P66K73J65N13P18M87L15O22R86P92K05j20O7N87
55091A21744J334K127K416J858R30L18n6o64j307j339q37n90q70j143j098j050
55075A21773j065o88J03N30J64l67l24P3K12J14K46O41Q46N23l05j322j924j515
55057A17715l04O31N30j56n24m30l62m28k86J06L69L73L87N38O24N68N43N30K50
55038A20674l32q46j049j090j091p99m8P67J115J072J239J829K225J703L60r61
55022A24768j617j684j498j125n35M4L41L98L59J19l41n04J08J005J116K80m64
55005A20770k95L73P53Q35R95J066N89k35o58l98R0L79N68Q78J206J216P04k08
54987A28628j103j531j441j140p57m6J030J828J690Q53K30L10P01P42K34m72q03
$$ y = [111158, 112070, 113127, 114257, 115368, 116134, 116407, 116572, 117085, 117803, 118290, 118605, 119227, 120213, 121005, 121210, 121090, 121157, 121744, 123078, 125205, 127621, 129479, 130409, 130727, 130671, 130007, 128700, 127361, 126524, 125934, 125064, 123921, 122823, 121773, 120708, 120020, 120123, 120653, 120817, 120450, 120126, 120199, 120411, 120525, 120771, 121412, 122258, 122781, 122476, 121154, 119230, 117715, 117411, 118042, 118572, 118416, 117892, 117462, 117100, 116672, 116386, 116492, 116861, 117234, 117621, 118159, 118783, 119351, 119894, 120424, 120674, 120342, 119496, 118447, 117357, 116266, 115467, 115419, 116186, 117301, 118373, 119612, 121441, 123666, 125369, 125729, 124768, 123151, 121467, 119969, 118844, 118309, 118353, 118694, 119092, 119451, 119570, 119229, 118725, 118833, 119838, 120954, 121234, 120770, 120475, 120848, 121601, 122436, 123431, 124497, 125086, 124851, 124193, 123795, 123885, 124264, 124832, 125710, 126916, 128132, 128836, 128628, 127525, 125994, 124553, 123413, 122656, 122610, 123640, 125468, 127158, 128011, 128241, 128551, 129252, 129994, 130228, 129756, 128953]
54970A28953m29L86Q78N73j82o48n90l89l95n28m33J23J034J783J819J168M66
54953A33589J79J39P0J36N08Q37P78O51Q83J152Q00l8o35q12j031j359j293p47
54935A33807k52k8L30R43J332J343J539K145K507K206J855K110K652K973L515
54920A58977M925O693P631P574P525Q047Q532Q254P323O178M840L056P94j725
54906B38624m184o140p235p644p956q380q441p761o702n876n262m303k820j391
54892A54529p39r94j657k117k073j618j067o50k80L51J361K417L030L160L333
54877A56986M021N039N844O376P157Q393R392R273Q096O778N844M757K718j78
54863B40496l037n251p043q774j0090j0189q823o752n060m267m200m459m683m532
$$ y = [128953, 128524, 128910, 129788, 130361, 130179, 129531, 128941, 128552, 128157, 127629, 127196, 127319, 128353, 130136, 131955, 133123, 133589, 133768, 133907, 133977, 134113, 134621, 135458, 136236, 136887, 137770, 138922, 139722, 139684, 139049, 138237, 137206, 135847, 134554, 133807, 133555, 133527, 133857, 134800, 136132, 137475, 139014, 141159, 143666, 145872, 147727, 149837, 152489, 155462, 158977, 163902, 170595, 178226, 185800, 193325, 201372, 209904, 218158, 225481, 231659, 236499, 239555, 240349, 238624, 234440, 228300, 221065, 213421, 205465, 197085, 188644, 180883, 174181, 168305, 163043, 158740, 155920, 154529, 153790, 152796, 151139, 149022, 146949, 145331, 144264, 143614, 143334, 143685, 145046, 147463, 150493, 153653, 156986, 161007, 166046, 171890, 178266, 185423, 193816, 203208, 212481, 220577, 227355, 233199, 237956, 240674, 240496, 237459, 232208, 225165, 216391, 206301, 196112, 187289, 180537, 175477, 171210, 167010, 162551, 157868, 153336]
54849A53336l822k778j909j498j357j196j031j050j243j398j393j318j313j349
54835A30681j235q08j76K08n4p75j251j053n94n51r01r14j99O67Q74M31Q5K75
54817A24710O60P45N77M90M89L12m3k18n9J87L47O44J225J696J554Q79K35q4k56
54798A34090m10l70o4J89P1l23o79q20o50n5Q27J410J176L85j44M2N46P59O82
54779A36662Q02J254J486R73J26J5J122K640L359L073K670K963L895N010O123
54764A72173P184P929Q195Q278Q524Q685Q229P144N852M394K317n13l524o120
54750B38747q124r367r449q417p195o607o330n489m053k852k285j895j381j140
54736A64163j389j553j181q13j120j616j180K13J298J220O40P54J816L139M117
$$ y = [153336, 149514, 146736, 144827, 143329, 141972, 140776, 139745, 138695, 137452, 136054, 134661, 133343, 132030, 130681, 129446, 128638, 128462, 128670, 128616, 127841, 126590, 125537, 124943, 124392, 123491, 122577, 122378, 123045, 123919, 124350, 124435, 124710, 125370, 126115, 126692, 127182, 127671, 127983, 127940, 127722, 127663, 127850, 128197, 128841, 130066, 131762, 133316, 134195, 134430, 134346, 134090, 133680, 133310, 133246, 133435, 133506, 133183, 132504, 131684, 131034, 130979, 131806, 133216, 134392, 134777, 134633, 134675, 135221, 135980, 136662, 137464, 138718, 140204, 141177, 141303, 141318, 142440, 145080, 148439, 151512, 154182, 157145, 161040, 166050, 172173, 179357, 187286, 195481, 203759, 212283, 220968, 229197, 236341, 242193, 246587, 248904, 248391, 244867, 238747, 230623, 221256, 211807, 203390, 196195, 189588, 183258, 177769, 173716, 170864, 168579, 166684, 165303, 164163, 162774, 161221, 160040, 159227, 158107, 156491, 155311, 155524, 156822, 158042, 158682, 159436, 161252, 164391, 168508]
54721A68508M733N268N935O782P600Q025P878P280O340M910K852L42k276m725
54707B29452o739q081q792r125q993p908n914m044l247l115k504j216k92n02j414
54692A57566k171k542k739k805k650k355j928j150l9P67O89M4k60J42P08P72K78
54675A42327l28o64o76n50m58l79j50K28M55K41l36r02j245j478j742j896j631
54658A30816q83n1L28J81L4L43Q01O90o2o58m67J15K98K3j01J21J22m97j213j133
54638A28807r0J231K040K092J607R10L18L9j1j87p05j236j184m35M29P46M53j0
54620A34814l19m81n49m70k85j71j65o3K85P24R19O67J1o86q74l24M49O12M2m24
54600A33712p6P68J289J281J230J399J449J072M62l1l91p78j133j191p96j9Q66
$$ y = [168508, 173241, 178509, 184444, 191226, 198826, 206851, 214729, 222009, 228349, 233259, 236111, 236453, 234177, 229452, 222713, 214632, 205840, 196715, 187722, 179814, 173900, 169856, 166609, 163494, 160990, 159774, 159482, 158980, 157566, 155395, 152853, 150114, 147309, 144659, 142304, 140376, 139226, 139187, 139954, 140643, 140687, 140427, 140569, 141277, 142049, 142327, 141999, 141335, 140659, 140109, 139651, 139272, 139122, 139350, 139805, 140046, 139710, 138808, 137563, 136085, 134343, 132447, 130816, 129933, 129882, 130210, 130391, 130425, 130768, 131569, 132259, 132197, 131539, 131072, 131187, 131485, 131508, 131407, 131528, 131650, 131153, 129940, 128807, 128717, 129948, 131988, 134080, 135687, 136597, 136915, 136954, 136943, 136756, 136051, 134815, 133631, 133196, 133625, 134371, 134824, 134814, 134495, 134014, 133465, 132995, 132710, 132539, 132374, 132311, 132596, 133320, 134239, 134906, 134917, 134231, 133357, 133033, 133482, 134094, 134136, 133712, 133636, 134404, 135693, 136974, 138204, 139603, 141052, 142124, 142586, 142555, 142164, 141386, 140253, 139062, 138266, 138247, 139113]
54583A39113J430J258L48p05j191r93o57o54p88n03K88R85R73L45k29k43K25P59
54565A39761J079J155J079R58Q76Q29O93L51j31m63l53J33N25M23M4l9K28J68
54547A47316o58j566j482l96M92K63o36j067n16N47J373J610J450J353J539J808
54531A51430J902K014K512L145L102K050O19m54j160j763k050j606o22K12N09
54516A59840M14J53k07n63q00r59j127j226j204j287j596j777j451q78o45p81
54500A45906p63l37K20P22J273J774J801J227N63L15L77L06j05o64j008q25j40
54483A50642N62P86N85L58J77j72m62p3J014J929K042J789J857K121K051J773
54467A66979J876K291K242J406M14n0m1OkO1J15J1m9K48P18P91K91k79m41l26
$$ y = [139113, 140543, 141801, 142149, 141444, 140253, 139260, 138603, 137949, 137161, 136658, 136946, 137931, 138904, 139249, 139020, 138777, 139002, 139761, 140840, 141995, 143074, 144032, 144908, 145737, 146430, 146781, 146650, 146187, 145834, 145967, 146492, 146915, 146959, 146920, 147148, 147316, 146658, 145092, 143610, 143214, 143706, 143969, 143333, 142266, 141750, 142297, 143670, 145280, 146730, 148083, 149622, 151430, 153332, 155346, 157858, 161003, 164105, 166155, 166774, 166320, 165160, 163397, 161347, 159741, 159119, 159331, 159840, 160254, 160407, 160200, 159637, 158837, 157878, 156751, 155525, 154321, 153034, 151438, 149661, 148210, 147332, 146687, 145906, 145143, 144806, 145026, 145748, 147021, 148795, 150596, 151823, 152386, 152701, 153078, 153384, 153279, 152615, 151607, 150782, 150642, 151204, 151990, 152575, 152933, 153110, 152938, 152476, 152403, 153417, 155346, 157388, 159177, 161034, 163155, 165206, 166979, 168855, 171146, 173388, 174794, 175208, 175158, 175117, 175123, 175121, 175182, 175297, 175308, 175259, 175507, 176225, 177016, 177307, 177028, 176587, 176261]
54447A76261l01l27j42Q1j55q90j541j627j236n97K42R86R55o5j223j539j183
54430A67699j078j420j431p19O9K50P3J91O21Q54N92K0m59l71O15K164L179K772
54412A73621J279j50q92j286j733j902j282j10O70M26m72j118r95k85N53J192
54396A67516J452J303J016J007J251J183M98k03n9Q92J708J693J025K17m80r70
54380A79049j105q64m80j78r7m61j343k187k131j098n2J48k64n18l39J9L46N42
54362A68987L91j77p53q09k91M65J141J447J078J56n70m80J40M99K64l69j229
54345A69890k137k540j957p59J11K86K19K83K95O4j83k08j08m8m5j41l65m60j58
54326A62039K14m7r33j541j274o04k51j69N8K83M7n15p01k22M59Q72J091J391
$$ y = [176261, 175960, 175633, 175491, 175572, 175417, 174527, 172986, 171359, 170123, 169526, 169768, 170754, 171709, 171644, 170421, 168882, 167699, 166621, 165201, 163770, 163051, 163120, 163370, 163443, 163634, 164255, 165109, 165701, 165721, 165262, 164891, 165506, 167670, 170849, 173621, 174900, 174750, 173858, 172572, 170839, 168937, 167655, 167545, 168215, 168641, 168169, 167051, 166056, 165771, 166324, 167516, 168968, 170271, 171287, 172294, 173545, 174728, 175226, 175023, 174964, 175856, 177564, 179257, 180282, 180499, 180019, 179049, 177944, 177080, 176600, 176422, 176325, 175864, 174521, 172334, 170203, 169105, 169053, 169201, 168937, 168419, 168080, 168099, 168445, 168987, 169378, 169201, 168448, 167639, 167348, 167813, 168954, 170401, 171479, 171635, 171065, 170585, 170725, 171224, 171488, 171119, 169890, 167753, 165213, 163256, 162497, 162608, 162894, 163113, 163396, 163691, 163755, 163572, 163364, 163256, 163208, 163163, 163022, 162657, 162197, 162039, 162253, 162206, 161273, 159732, 158458, 157854, 157603, 157434, 157492, 157775, 157822, 157307, 156606, 156384, 156843, 157715, 158806, 160197]
54308A60197J733J889J903K075K502K821K563J755R84P23P16L07o62j662k217
54293A75627k441k599k557k103j466j058q31m34K0m3p55j390j225n18j67n19r64
54276A56577p88j36K32q6o83q86n06J02N20N76L24l4j92l4J91J59l0j1J88J03
54256A55586l23l66M88J566J690P77J4K73R57Q98p5j030j213q52o34q59j288j537
54238A54072j417j032p15o67o71l09L78Q03N92J79K59P91R89L35q02j653j868
54221A49264j589j086n46j26J42M00P60J076J112Q44M25m4m74o99o69o61j011
54204A47118j604j905j550p06K46J093J753K082J923J349P12M87R15J682K016
54189A55611J384J24q62j092q35m50P2O13N96k69j221j207l63O7n16j188q43K58
$$ y = [160197, 161930, 163819, 165722, 167797, 170299, 173120, 175683, 177438, 178422, 179145, 179861, 180168, 179506, 177844, 175627, 173186, 170587, 168030, 165927, 164461, 163403, 162572, 162138, 162158, 162115, 161360, 159970, 158745, 158227, 158060, 157541, 156577, 155789, 155653, 155885, 155799, 155116, 154230, 153724, 153826, 154346, 154922, 155246, 155212, 155020, 154986, 155177, 155336, 155306, 155295, 155483, 155586, 155263, 154897, 155385, 156951, 158641, 159418, 159432, 159705, 160662, 161560, 161485, 160455, 159242, 158390, 157756, 156897, 155609, 154072, 152655, 151623, 150908, 150241, 149570, 149261, 149639, 150442, 151034, 151213, 151472, 152263, 153252, 153587, 152785, 151132, 149264, 147675, 146589, 146043, 145917, 146059, 146459, 147219, 148295, 149407, 150251, 150676, 150632, 150158, 149459, 148790, 148129, 147118, 145514, 143609, 142059, 141353, 141599, 142692, 144445, 146527, 148450, 149799, 150511, 150998, 151913, 153595, 155611, 156995, 157119, 156257, 155165, 154330, 153880, 153952, 154565, 155161, 154892, 153671, 152464, 152101, 152168, 151652, 150464, 149621, 149879]
54171A49879R37P49L10J37l4n31j058j117o93j35L17N47M28P6l0L87R57J130R33
54152A53189P56N95J36n06p75n50l91o17p65l53L07N43K53p0j04J6O3pj53l75
54132A51192o57r39j030o14M22J565J985J423N11m8j52J9M62R53Q22j56j046p46
54114A53966N01J406J335Q07L03l52j145j362n53O15J125P99K58l1j03j25j72
54097A57272k44k12P4M28L30l99j142j092j42J094J920K013J416M82k94o03n13
54080A60388k30J53N51P98Q66Q96R09P71N95P26J081J007K03o65q04l34N1J27
54062A67089J61K53L28N62R91R27k47j751j967o40O38O03j9J46J061J629J539
54045A71303J491J744J668R96M75Q32J841K852L646M236M412M148L989M335M696
$$ y = [149879, 150816, 151565, 151875, 152012, 151978, 151447, 150389, 149272, 148579, 148444, 148761, 149308, 149736, 149812, 149782, 150169, 151126, 152256, 153189, 153945, 154540, 154676, 154170, 153395, 152845, 152454, 151837, 151072, 150719, 151026, 151569, 151822, 151752, 151648, 151664, 151727, 151720, 151567, 151192, 150535, 149596, 148566, 147952, 148374, 149939, 151924, 153347, 153858, 153810, 153658, 153677, 154139, 155092, 155914, 155758, 154712, 153966, 154467, 155873, 157208, 158015, 158318, 157966, 156821, 155459, 154906, 155521, 156646, 157445, 157703, 157672, 157569, 157444, 157272, 157028, 156816, 156890, 157318, 157648, 157249, 156107, 155015, 154873, 155967, 157887, 159900, 161316, 161798, 161504, 160901, 160388, 160158, 160311, 160862, 161660, 162526, 163422, 164331, 165102, 165697, 166423, 167504, 168511, 168714, 168049, 167245, 166911, 166962, 167089, 167250, 167503, 167831, 168393, 169384, 170311, 170064, 168313, 166346, 165706, 166344, 166947, 166928, 167074, 168135, 169764, 171303, 172794, 174538, 176206, 177202, 177677, 178509, 180350, 183202, 186848, 191084, 195496, 199644, 203633, 207968, 212664]
54030B12664M436L989M353N382N669M534L117K799L273L196K246J413J331J451
54016B59853J125N94M03M86M21J23j88m62q23j281j862k714l810m693m950m666
54000B37556m135l340k177r94m27o86j392k020k279k078j535r51n68m25n67j073
53984B12909j624j485m56N00K90q36j587j307n00K95J223K394L310L587L622M019
53968B24354M842N984P690J0040J2209J3020J2058R754O537K610j552n120p579
53955B94847r008r626r494q772p841o890n744m275k813j876j599j585j239k37
53941B23848J164K275K589K354K321K784L199K978K411K372L034L433K614R29
53927B58305k61j67O68J311J576J828K032J807J331J410K329L273L426L202L697
$$ y = [212664, 217100, 221089, 225442, 230824, 236493, 241027, 244144, 246943, 250216, 253412, 255658, 257071, 258402, 259853, 260978, 261572, 261975, 262461, 262882, 263005, 262817, 262355, 261532, 260251, 258389, 255675, 251865, 247172, 242222, 237556, 233421, 230081, 227904, 226910, 226483, 225797, 224405, 222385, 220106, 218028, 216493, 215542, 214974, 214549, 213982, 212909, 211285, 209800, 209344, 209844, 210134, 209298, 207711, 206404, 205904, 206199, 207422, 209816, 213126, 216713, 220335, 224354, 229196, 235180, 242870, 252910, 265119, 278139, 290197, 299951, 306488, 309098, 307546, 302426, 294847, 285839, 276213, 266719, 257947, 250106, 243216, 237472, 233197, 230384, 228508, 226909, 225324, 224085, 223848, 225012, 227287, 229876, 232230, 234551, 237335, 240534, 243512, 245923, 248295, 251329, 254762, 257376, 258305, 258044, 257877, 258545, 259856, 261432, 263260, 265292, 267099, 268430, 269840, 272169, 275442, 278868, 282070, 285767]
53912B85767N111O427O708O193N747N721N691N223M451L818L435K978K187J268
53898C50725O10K00k83q68j161j021r56j515k551l494m132m662n090n156m853
53883C15793m589m703n142n677o105o147n541m413l256k464k076k040k306k595
53869B58739k523k132j871j870j720j303j267k068l027l075k255j682j979k511
53855B29456k459j971j796k140k473k327j809j228o63j20J43j92r15j268p80O1
53839B09519L51r1n33l88K3P6k11l74k97k86m34m87m25n94j087j475j359q63l38
53820B00727J18N62R04R72P55L96Q2K0K76N20L05k29k50P49K205L083L083K750
53802B17028K644K873L425M396N710O985P936Q694R591J0726J1865J2606J2621
$$ y = [285767, 290878, 297305, 304013, 310206, 315953, 321674, 327365, 332588, 337039, 340857, 344292, 347270, 349457, 350725, 351335, 351535, 351252, 350384, 349223, 348202, 347246, 345731, 343180, 339686, 335554, 330892, 325802, 320646, 315793, 311204, 306501, 301359, 295682, 289577, 283430, 277889, 273476, 270220, 267756, 265680, 263640, 261334, 258739, 256216, 254084, 252213, 250343, 248623, 247320, 246053, 243985, 240958, 237883, 235628, 233946, 231967, 229456, 226997, 225026, 223230, 221090, 218617, 216290, 214481, 213253, 212590, 212470, 212613, 212421, 211506, 210238, 209458, 209519, 209870, 209779, 209246, 208858, 208881, 208957, 208746, 208372, 208075, 207789, 207355, 206868, 206443, 205849, 204762, 203287, 201928, 201065, 200727, 200845, 201407, 202311, 203283, 204038, 204434, 204516, 204536, 204812, 205332, 205637, 205408, 205158, 205907, 208112, 211195, 214278, 217028, 219672, 222545, 225970, 230366, 236076, 243061, 250997, 259691, 269282, 280008, 291873, 304479, 317100]
53789C17100J1845J0475Q682O376L419N5l145n716p486q309q054o982n830n244
53775C07186n185n165m907m627m681n103n550n622n221m616m163l992l982l919
53761B40453l638l125k635k603l089l472l040j974j276j583k365k578j851p22
53747B06502O1J87j21l30j2P08J214J086O80O57J142J682J957K152K573L216L846
53730B27200M167L875K882J621P71N40M41j9p63j431j912k243k242j750j132r95
53714B29010j338j396n82O49J191N09p40j332p08M93J199J126R55J293J797J734
53698B33860J104O44P49J031J114J283J927K757L164K991K551J963J127K12l45
53683B56132m69n60q55j102j058r42j060j311j327r64l99J21L93L12j1l02m19
$$ y = [317100, 328945, 339420, 348102, 354478, 357897, 357952, 354807, 349091, 341605, 333296, 325242, 318260, 312430, 307186, 302001, 296836, 291929, 287302, 282621, 277518, 271968, 266346, 261125, 256509, 252346, 248354, 244372, 240453, 236815, 233690, 231055, 228452, 225363, 221891, 218851, 216877, 215601, 214018, 211653, 209075, 207224, 206502, 206563, 206750, 206629, 206299, 206287, 206995, 208209, 209295, 209975, 210632, 211774, 213456, 215413, 217565, 220138, 223354, 227200, 231367, 235242, 238124, 239745, 240516, 241056, 241497, 241478, 240715, 239284, 237372, 235129, 232887, 231137, 230005, 229010, 227672, 226276, 225694, 226343, 227534, 228043, 227303, 225971, 225263, 225756, 226955, 228081, 229036, 230329, 232126, 233860, 234964, 235608, 236357, 237388, 238502, 239785, 241712, 244469, 247633, 250624, 253175, 255138, 256265, 256477, 256132, 255663, 255103, 254248, 253146, 252088, 251146, 250086, 248775, 247448, 246484, 246085, 246206, 246599, 246911, 246900, 246598, 246179]
53666B46179m75n70o18n79n50m50j8O14O99k22j487j904j172j57K44mm62r06j315
53647B36847j543j369p99r1M46O36N46M75O37Q40P19L44K34O49J221J476J485
53630B42753J649K067K448K486K088J352N95L46Q82J834K503K609K447K286K016
53615B70361J535J195J470K344L271L793L928L872L632L161K711K681K989K993
53601C09936K241J161O23Q78J282J180O55J80k01q18j583j769r13L27O89k44j538
53584C12086k021j613j139j067j032o58k88n27j394k372l022l249l118k782k405
53569B85399j856p93O19J454J090J95o0L90O43L85L14P32Q67J78o12o08r9J01
53551B88339R1N96J533J978J632J255J462J919K131K313K985M084N033N439N365
$$ y = [246179, 245704, 245134, 244516, 243937, 243387, 242937, 242919, 243533, 244232, 244010, 242523, 240619, 239447, 239290, 239534, 239530, 239068, 238162, 236847, 235304, 233935, 233136, 233045, 233491, 234127, 234673, 235148, 235785, 236625, 237344, 237688, 237922, 238571, 239792, 241268, 242753, 244402, 246469, 248917, 251403, 253491, 254843, 255438, 255784, 256666, 258500, 261003, 263612, 266059, 268345, 270361, 271896, 273091, 274561, 276905, 280176, 283969, 287897, 291769, 295401, 298562, 301273, 303954, 306943, 309936, 312177, 313338, 313961, 314839, 316121, 317301, 317956, 318136, 317935, 317117, 315534, 313765, 312852, 313179, 313868, 313624, 312086, 310065, 308452, 307313, 306246, 305214, 304556, 304268, 303741, 302347, 299975, 296953, 293704, 290586, 287804, 285399, 283543, 282750, 283369, 284823, 285913, 286108, 286048, 286438, 287081, 287466, 287780, 288512, 289379, 289557, 288945, 288337, 288238, 288339, 288430, 289026, 290559, 292537, 294169, 295424, 296886, 298805, 300936, 303249, 306234, 310318, 315351, 320790, 326155]
53536C26155N137N186N845O936P682P474O709O469P280Q506R264R581J0196J1397
53522D33817J2632J3436J4120J5179J6456J7465J8211J8982J9587J9578J9215
53511F18678J9365K0309K1446K2349K3239K4039K3941K2573K0800J9623J8922
53500H55284J8117J7435J7507J8105J8384J8114J7751J7467J7138J7186J8267
53489A050755J9954K0769J9913J8141J6623J5701J5107J4646J4151J3369J2321
53478A231450J1356J0551R488P912O091M318K518O62j027k545m317o548q860j0848
53464A250201j2570j4173j5553j6730j8005j9364k0292k0580k0811k1496k2276
53453A048351k2544k2448k2557k2850k2765k2165k1534k1191k0835k0027j8723
$$ y = [326155, 331292, 336478, 342323, 349259, 356941, 364415, 371124, 377593, 384873, 393379, 402643, 412224, 422420, 433817, 446449, 459885, 474005, 489184, 505640, 523105, 541316, 560298, 579885, 599463, 618678, 638043, 658352, 679798, 702147, 725386, 749425, 773366, 795939, 816739, 836362, 855284, 873401, 890836, 908343, 926448, 944832, 962946, 980697, 998164, 1015302, 1032488, 1050755, 1070709, 1091478, 1111391, 1129532, 1146155, 1161856, 1176963, 1191609, 1205760, 1219129, 1231450, 1242806, 1253357, 1262845, 1270757, 1276848, 1281166, 1283684, 1284346, 1283319, 1280774, 1276457, 1269909, 1261049, 1250201, 1237631, 1223458, 1207905, 1191175, 1173170, 1153806, 1133514, 1112934, 1092123, 1070627, 1048351, 1025807, 1003359, 980802, 957952, 935187, 913022, 891488, 870297, 849462, 829435, 810712]
53442H10712j7227j5749j4175j2243j0057q284p466p094n961l636j089N40J242
53429G09513J864K955M502O402Q553J0676J2551J4304J6050J7536J8549J9370
53417H42825K0348K1331K2116K3100K4817K7010K8875L0098L1019L1906L2781
53406A136226L3889L5638L7936M0259M2394M4576M6768M8505M9644N0689N2094
53395A618618N3657N4850N5372N5270N4834N4478N4349N4079N3208N1829N0312
53384B210856M8529M5942M2425L8380L4028K9323K4656K0758J7645J4389J0390
53373B537321O072J905k485p502j2639j7226k1680k7077l3630m0394m6438n1489
53361B284738n5480n8268o0041o1335o2375o2813o2380o1362o0196n8923n7327
$$ y = [810712, 793485, 777736, 763561, 751318, 741261, 732977, 725511, 718417, 712456, 708820, 707731, 708271, 709513, 711377, 714332, 718834, 725236, 733789, 744465, 757016, 771320, 787370, 804906, 823455, 842825, 863173, 884504, 906620, 929720, 954537, 981547, 1010422, 1040520, 1071539, 1103445, 1136226, 1170115, 1205753, 1243689, 1283948, 1326342, 1370918, 1417686, 1466191, 1515835, 1566524, 1618618, 1672275, 1727125, 1782497, 1837767, 1892601, 1947079, 2001428, 2055507, 2108715, 2160544, 2210856, 2259385, 2305327, 2347752, 2386132, 2420160, 2449483, 2474139, 2494897, 2512542, 2526931, 2537321, 2543393, 2545298, 2542813, 2535311, 2522672, 2505446, 2483766, 2456689, 2423059, 2382665, 2336227, 2284738, 2229258, 2170990, 2110949, 2049614, 1987239, 1924426, 1862046, 1800684, 1740488, 1681565, 1624238]
53350A624238n5368n3194n0954m8846m7173m6084m5344m4525m3433m2151m0767
53339A106399l9181l7263l5041l2709l0466k8394k6438k4459k2297j9852j7185
53328G93114j4577j2397j0757r361p769n863l973k528j700j347j123n95N70K286
53314G23980M013N301O310P539R021J0199J0839J1573J3120J5201J6811J7537
53302H51444J8045J9090K0658K2327K3992K5731K7297K8277K8640K8782K9016
53291A123299K9385K9777K9907K9349K7939K6121K4417K2713K0503J7811J5297
53280A396518J3284J1220Q380M815J223j830m335o588q804j0949j2854j4478j6051
53267A359551j7820j9724k1555k3334k5224k7071k8431k9183k9759l0607l1666
$$ y = [1624238, 1568870, 1515676, 1464722, 1415876, 1368703, 1322619, 1277275, 1232750, 1189317, 1147166, 1106399, 1067218, 1029955, 994914, 962205, 931739, 903345, 876907, 852448, 830151, 810299, 793114, 778537, 766140, 755383, 746022, 738253, 732390, 728417, 725889, 724189, 722842, 721719, 721124, 721694, 723980, 727993, 733294, 739604, 747143, 756164, 766363, 777202, 788775, 801895, 817096, 833907, 851444, 869489, 888579, 909237, 931564, 955556, 981287, 1008584, 1036861, 1065501, 1094283, 1123299, 1152684, 1182461, 1212368, 1241717, 1269656, 1295777, 1320194, 1342907, 1363410, 1381221, 1396518, 1409802, 1421022, 1429402, 1434217, 1435440, 1433610, 1429275, 1422687, 1413883, 1402934, 1390080, 1375602, 1359551, 1341731, 1322007, 1300452, 1277118, 1251894, 1224823, 1196392, 1167209, 1137450, 1106843, 1075177]
53256A075177l2570l3058l3067l2720l2447l2676l3136l2822l1129k8749k6964
53245G25839k6149k5607k4798k4108k4055k4311k4032k3017k1909k1208k0486
53234D66159j8920j6393j3704j1712j0533r663q657p516o524n920n681n538n208
53221C40190m686m274m270m702n396o087o408o012m958l790l025k705k567k498
53207B78812k499k478k343k180j998j568q64m15o98j338j506j040n29l46k59j59
53191B58592l62r42j401j370j144j136j277j365j484j669j630j268j038j302j707
53176B39497j736j485j315j122o23q9m1l17k17M01Q05L65o95j642j925j404l81
53159B28076M57N49K5n00p55r71j189r74o7J105J851J865J275L60m62p48m90k59
$$ y = [1075177, 1042607, 1009549, 976482, 943762, 911315, 878639, 845503, 812681, 781552, 752803, 725839, 699690, 674083, 649285, 625177, 601122, 576811, 552779, 529762, 507853, 486645, 466159, 447239, 430846, 417142, 405430, 394897, 385234, 376577, 369061, 362537, 356617, 350936, 345398, 340190, 335504, 331230, 326960, 322258, 316862, 310775, 304367, 298355, 293397, 289607, 286582, 283877, 281310, 278812, 276313, 273835, 271492, 269312, 267314, 265746, 264882, 264467, 263769, 262431, 260925, 259885, 259356, 259010, 258751, 258592, 258230, 257288, 255887, 254517, 253373, 252237, 250960, 249595, 248111, 246442, 244812, 243544, 242506, 241204, 239497, 237761, 236276, 234961, 233839, 233216, 233127, 233086, 232769, 232552, 232953, 233758, 234123, 233428, 231786, 229861, 228457, 228076, 228533, 229082, 229107, 228607, 227852, 226881, 225692, 224718, 224651, 225756, 227607, 229472, 230747, 231107, 230645, 229897, 229407, 229148]
53141B29148n18r45q06K1Q00P94J11m82m52m4R4k85p52p64l63j49n54j319j806
53122B21729j663j102n78l34k60j33J00K96L48L41M06N67Q30J242J632J470L42
53105B25233j376k678k907k318j557q94k80J84L16K44K47J76m78j699k636k514
53089B07063j578p29m05l32j99k3J76M76O62L42l09m83J15N76p5j383j946j271
53071B00677l38j96p45j159r97m00K83O97M98l37j336j907j901j656j574j681
53055A87928j539o96O33J520J324N52K57O89J148J117P60K89l42q09m21P74J724
53038A94908J729J317J174R78K23o21p41l61l48p57q90n87l72m05l36k00l94o82
53020A93635l47M22M67o36j761j705o81K72O53O21L71O0oL24P41Q19M37l62j428
$$ y = [229148, 228630, 227685, 226879, 226900, 227700, 228494, 228605, 228123, 227671, 227627, 227721, 227436, 226684, 225920, 225557, 225408, 224854, 223535, 221729, 220066, 218964, 218386, 218052, 217792, 217659, 217759, 218055, 218403, 218744, 219150, 219717, 220547, 221789, 223421, 224891, 225233, 223857, 221179, 218272, 215954, 214397, 213503, 213223, 213407, 213723, 213967, 214214, 214390, 213912, 212213, 209577, 207063, 205485, 204756, 204351, 204019, 203820, 203797, 203973, 204449, 205111, 205453, 205144, 204661, 204776, 205352, 205277, 203894, 201948, 200677, 200339, 200143, 199398, 198239, 197242, 196842, 197125, 197822, 198320, 197983, 196647, 194740, 192839, 191183, 189609, 187928, 186389, 185693, 186326, 187846, 189170, 189722, 189979, 190668, 191816, 192933, 193693, 193982, 193640, 192831, 192410, 193184, 194908, 196637, 197954, 199128, 200106, 200329, 199708, 198967, 198606, 198258, 197501, 196611, 196024, 195652, 195247, 194911, 194711, 194317, 193635, 193288, 193710, 194177, 193541, 191780, 190075, 189394, 189666, 190319, 190940, 191311, 191371, 191365, 191689, 192430, 193249, 193686, 193324, 191896]
53001A91896k242k115j044J00N89N54L24k36j211j949j726p44J37N12O51P67O90
52984A84953L29mR7O60J208J099K52n16k87P95J645J661J354J273J121N06j95
52967A95951m13k19Q6O39J453J771J042O7N9Q04R97K28n97q89j102j501j543r80
52949A95853n61q25j147q20k85m35j157j570j390j187j295j291o74M01J297J522
52933A86436J120N96M06N05M86J78k00m89p59q95n38K26P09M56j70o99j259k001
52915A84108k369j790p84m55r57j324r01j37K76L00K54K08Q9k3q0k02l25q9N98
52896A76397J198J137N60R3P7L79Q33J411J907J852R81l13j203j192n39R5M38
52879A84111P64J177J186L61q16j395j169q38q82r47o13j23J61M39R95J497J394
$$ y = [191896, 189654, 187539, 186495, 186595, 187184, 187738, 188062, 187826, 186615, 184666, 182940, 182196, 182333, 182845, 183496, 184263, 184953, 185282, 185278, 185375, 186035, 187243, 188342, 188594, 188078, 187791, 188586, 190231, 191892, 193246, 194519, 195640, 196146, 195951, 195538, 195319, 195405, 196044, 197497, 199268, 200310, 200377, 200436, 201240, 202237, 202465, 201868, 200979, 199877, 198376, 196833, 195853, 195292, 194467, 193320, 192500, 192215, 191780, 190623, 189053, 187663, 186476, 185181, 183890, 183216, 183617, 184914, 186436, 187556, 188152, 188558, 189063, 189549, 189727, 189527, 189038, 188279, 187384, 186846, 187072, 187781, 188237, 188067, 187368, 186109, 184108, 181739, 179949, 179165, 178710, 177753, 176429, 175528, 175391, 175667, 175967, 176221, 176429, 176518, 176495, 176415, 176213, 175888, 175799, 176397, 177595, 178732, 179292, 179385, 179462, 179841, 180674, 182085, 183992, 185844, 186825, 186512, 185309, 184117, 183578, 183673, 184111, 184875, 186052, 187238, 187599, 186783, 185388, 184219, 183381, 182499, 181552, 180939, 180816, 180977, 181416, 182411, 183908, 185302]
52862A85302P75K25PJ3L67J310K478L027K616J763J079O78M82N08O04M04k06q86
52844B00546j374j781k221k537k642k696k739k525k018j564j297q60q8N18N12
52829A77234K32K54M90N08M27P50J434J843J642J116N55j02q68j486j777j839
52813A80413j740j383p84j34N18J348K403L458M205M385L836K725J621Q74R2j253
52797B00584k782l503l207k751k764k850k509k055j998k025j445l50M14L62j58
52782A72963o02q35r64r49o11J03R75J583J581J020L07j39j24L44R91J219O11
52765A77473m01q21l39K65K09k89n97o81q52r20m17M51Q64M99n6j18L18Q21R85
52746A76394O36l6m39p3P84J303J061M38J1k1K77P71J140J059O86N69Q06P84R0
$$ y = [185302, 186077, 186302, 186309, 186322, 186689, 187999, 190477, 193504, 196120, 197883, 198962, 199640, 200122, 200630, 201234, 201638, 201432, 200546, 199172, 197391, 195170, 192633, 189991, 187295, 184556, 182031, 180013, 178449, 177152, 176292, 176204, 176722, 177234, 177466, 177720, 178210, 178718, 179145, 179895, 181329, 183172, 184814, 185930, 186485, 186383, 185515, 184029, 182252, 180413, 178673, 177290, 176506, 176372, 176890, 178238, 180641, 184099, 188304, 192689, 196525, 199250, 200871, 201745, 201837, 200584, 197802, 194299, 191092, 188341, 185577, 182727, 180218, 178163, 176165, 174140, 172695, 172345, 172759, 173121, 172963, 172361, 171526, 170562, 169613, 169002, 169105, 170080, 171663, 173244, 174264, 174571, 174432, 174308, 174652, 175643, 176862, 177473, 177072, 176251, 175912, 176177, 176386, 176097, 175500, 174819, 173967, 173047, 172630, 173081, 173945, 174444, 174388, 174270, 174588, 175409, 176394, 177030, 176994, 176555, 176482, 177266, 178569, 179630, 180068, 180079, 180058, 180335, 181106, 182246, 183305, 183991, 184560, 185366, 186150, 186240]
52727A86240p43q26j4J048J686J679J122K93l88o41o29p54j150j589j823j817
52711A81694j657j417j159q77m98l1L23L95K95K71L15J58l02p26o72j38L01K2
52693A76297r79j984k213j581o67k9K41L00K50K46N65J235J745J584R58O02Q11
52676A77381J066Q24L13J99O70J224J307Q46J46m31o13l06K65O22M77K3l27l97
52658A83289l11k03j10o1n5Q4O03J503K512L398M035M180L519K150O98l01r23
52641B04007j467j869j893j769k022k657l003k519j451m58J47N44J008J623K279
52626A90500K798L107L290L452L454L035K120Q31p51k476l767l899k899j761j396
52611A95638j718k061k084j789r83M05J626J601L32q79r63k78J96K40L07M36J44
$$ y = [186240, 185497, 184671, 184657, 185705, 187391, 189070, 190192, 190485, 190097, 189456, 188827, 188073, 186923, 185334, 183511, 181694, 180037, 178620, 177461, 176584, 176086, 176055, 176378, 176773, 177068, 177339, 177654, 177812, 177510, 176784, 176112, 175974, 176275, 176297, 175318, 173334, 171121, 169540, 168873, 168844, 169085, 169385, 169635, 169881, 170446, 171681, 173426, 175010, 175968, 176570, 177381, 178447, 179271, 179584, 179783, 180453, 181677, 182984, 183830, 183976, 183545, 182932, 182626, 182891, 183513, 183990, 184013, 183686, 183289, 182978, 182775, 182665, 182604, 182549, 182633, 183236, 184739, 187251, 190649, 194684, 198864, 202383, 204533, 205231, 204930, 204007, 202540, 200671, 198778, 197009, 194987, 192330, 189327, 186808, 185357, 184899, 185046, 185590, 186598, 188221, 190500, 193298, 196405, 199695, 203147, 206601, 209636, 211756, 212587, 211836, 209360, 205593, 201694, 198795, 197034, 195638, 193920, 191859, 189775, 187986, 187003, 187408, 189034, 190635, 190967, 190088, 189125, 188847, 189043, 189283, 189590, 190026, 190170]
52594A90170o19j133q05J45J102J704J818J311L11n57o68r6N73R79J225J447J539
52577A98446J414J197J007P88M70J08k15m30m40j79J71K97J30r8k10k65l04k63
52559B01624k35m65q78r96n80p5j9l19m19o3N37J044J219R01K28k92l17r4k1j0
52539B00770K10L97P3o05r49q13p85j168j495j350j021r27r50p76m35o3M33J033
52521A91579J305J022O67Q35J405J809J926K041K197K120J771J415J172R75R22
52506B13161J216J733J991J682Q82j03q50r90o34m70r61j664j868j622j463j343
52490B08697p94n4K8n82q06l1R34J128P68O11O76N96O07J177J934K039J501J134
52472B19563J177R57J99l11J60J177J776J717J568J724J911J639Q71J05j58J5
$$ y = [190170, 189551, 188418, 187613, 187758, 188860, 190564, 192382, 193693, 194004, 193447, 192779, 192683, 193256, 194235, 195460, 196907, 198446, 199860, 201057, 202064, 202852, 203322, 203430, 203215, 202785, 202345, 202166, 202337, 202634, 202764, 202666, 202456, 202191, 201887, 201624, 201389, 200924, 200046, 199050, 198470, 198395, 198376, 198057, 197638, 197575, 198112, 199156, 200375, 201276, 201504, 201212, 200895, 200801, 200780, 200770, 200980, 201377, 201450, 200845, 199896, 199083, 198298, 197130, 195635, 194285, 193264, 192337, 191387, 190611, 190176, 190113, 190546, 191579, 192884, 193906, 194573, 195408, 196813, 198622, 200548, 202589, 204786, 206906, 208677, 210092, 211264, 212239, 213161, 214377, 216110, 218101, 219783, 220665, 220562, 219712, 218722, 218088, 217618, 216657, 214993, 213125, 211503, 210040, 208697, 207903, 207849, 207877, 207295, 206489, 206458, 207392, 208520, 209288, 209899, 210575, 211171, 211778, 212955, 214889, 216928, 218429, 219563, 220740, 221697, 221896, 221585, 221745, 222922, 224698, 226415, 227983, 229707, 231618, 233257, 234128, 234233, 234075, 234090]
52456B34090Q6j50k35J77M86k38j872l239l626l488l399l125k306j353q69o80
52440B10259k54K59K04n00j234j577j571j187l38N52P58K52k84n43r09j405j288
52423B01194k38Q11Q45K16N8O43J221J294J146J099J012P67O37Q72J307J637J791
52406B16312J893K145K783L874N077N905O277O460O409N679M105K129J79j799
52392B67428l838n378n719m940l857l104k594j987j348j119j493k017j916r22
52378B27196L25Q81N04j38l25J7N76J293K255L167L423K827J925J413J439J622
52362B48400J559J068O0j407k823l287k315n80N20J96r58j705j445n18M55J114
52346B38334J306J030N66L16L28K70nj65J10O70J140J423J733K244K925L492L548
$$ y = [234090, 234176, 234026, 233791, 233968, 234454, 234216, 232344, 229105, 225479, 221991, 218592, 215467, 213161, 211808, 210939, 210259, 210005, 210264, 210468, 209968, 208734, 207157, 205586, 204399, 204061, 204613, 205371, 205623, 205339, 204796, 203887, 202482, 201194, 200956, 201767, 202612, 202828, 202886, 203529, 204750, 206044, 207190, 208289, 209301, 210068, 210705, 211577, 212884, 214521, 216312, 218205, 220350, 223133, 227007, 232084, 237989, 244266, 250726, 257135, 262814, 266919, 269048, 269227, 267428, 263590, 258212, 252493, 247553, 243696, 240592, 237998, 236011, 234663, 233544, 232051, 230034, 228118, 227196, 227521, 228402, 228906, 228768, 228443, 228460, 229036, 230329, 232584, 235751, 239174, 242001, 243926, 245339, 246778, 248400, 249959, 251027, 251087, 249680, 246857, 243570, 241255, 240675, 241195, 241391, 240433, 238728, 237283, 236765, 237220, 238334, 239640, 240670, 241236, 241552, 241880, 242150, 242145, 241980, 242090, 242760, 243900, 245323, 247056, 249300, 252225, 255717, 259265]
52329B59265L016K562L051M397N463N523N284N809O889P367O831O047N591N061
52315C32156M044L028K713K937K950K490J908J447R87N60N29J069J852K423K720
52300C63813L036L651M565N430N675M928L513K359K121K418K188Q72r63k282k639
52285C98685k375j978j610j267r65o55k38J53K32J49O12J917L235L476K736K164
52269D04271K377K747K547K043J916K198K459K710L355M318M922M817M415M221
52255D49316M163L880L336K864K765L119L817M544M851M453L461K271J263O54
52241D94757M26L16P8j50L5P18J434J821K209L095M201M558L751K585K250L051
52225E25135M210M813M548L716K821K332K518L331M399N258N616N434M863M153
$$ y = [259265, 262281, 264843, 267894, 272291, 277754, 283277, 288561, 294370, 301259, 308626, 315457, 321504, 327095, 332156, 336200, 339228, 341941, 344878, 347828, 350318, 352226, 353673, 354660, 355220, 355749, 356818, 358670, 361093, 363813, 366849, 370500, 375065, 380495, 386170, 391098, 394611, 396970, 399091, 401509, 403697, 404569, 403606, 401324, 398685, 396310, 394332, 392722, 391455, 390490, 389835, 389597, 389750, 389982, 390131, 390743, 392660, 395895, 399371, 402107, 404271, 406648, 409395, 411942, 413985, 415901, 418099, 420558, 423268, 426623, 430941, 435863, 440680, 445095, 449316, 453479, 457359, 460695, 463559, 466324, 469443, 473260, 477804, 482655, 487108, 490569, 492840, 494103, 494757, 495183, 495499, 495577, 495427, 495462, 496180, 497614, 499435, 501644, 504739, 508940, 513498, 517249, 519834, 522084, 525135, 529345, 534158, 538706, 542422, 545243, 547575, 550093, 553424, 557823, 563081, 568697, 574131, 578994, 583147]
52211E83147L585L395L602L949M107M039M067M494N193N737N897N744N282M368
52197F46606L144K195J934K101K239K430L100M145M889M911M481L971L377K692
52183F92215K222K110J847Q22q36k379l384m108m908n702o153o098n672n204m996
52168F49776n006m800l980k706j503n71L28J298K032K358K605L083L448L068J906
52153F51336O38j10k65l3M48R92J222R20L71J43N43J415K340K820K445J229j97
52136F66257j075j308j481j952k271j825p26K65O78P99J272K513M480O664Q294
52121F80584R013R384J0296J1712J2497J1812J0187Q779P931P065N787M307K720
52108G92074O69j949m364n629n639n042m266l184j714k64P59J529K540L851N012
$$ y = [583147, 586732, 590127, 593729, 597678, 601785, 605824, 609891, 614385, 619578, 625315, 631212, 636956, 642238, 646606, 649750, 651945, 653879, 655980, 658219, 660649, 663749, 667894, 672783, 677694, 682175, 686146, 689523, 692215, 694437, 696547, 698394, 699216, 698380, 696001, 692617, 688509, 683601, 677899, 671746, 665648, 659976, 654772, 649776, 644770, 639970, 635990, 633284, 631781, 631210, 631538, 632836, 634868, 637226, 639831, 642914, 646362, 649430, 651336, 651974, 651864, 651599, 651566, 652014, 653006, 654228, 655148, 655519, 655662, 656205, 657620, 659960, 662780, 665225, 666454, 666257, 665182, 663874, 662393, 660441, 658170, 656345, 655619, 655884, 656562, 657361, 658633, 661146, 665626, 672290, 680584, 689597, 698981, 709277, 720989, 733486, 745298, 755485, 764264, 772195, 779260, 785047, 789354, 792074, 792743, 790794, 786430, 780801, 775162, 770120, 765854, 762670, 760956, 760692, 761451, 762980, 765520, 769371, 774383]
52093G74383N720O161O549O612N861M128J574j557m803p316q434q427q137p712
52079G64602o412l921j266K11L77K19M48Q55R67P30M04K38M43J058J731J870J257
52062G63811L27k30j02M04O44K07o03j020o81p4R6k48p01j074j489j936k294k732
52044G52305l509m393m864m879m858m895m605l893l103k277j016N46J490J364
52030G13413R79J266J981K348K442K980M045M984N474N773N887N362M236L340
52016G64510L314L857M317M487M452M101L373K680K565L007L404L150J968j92
52002H08993l206o606r667j1837j3103j3909j4748j5775j6766j7421j7643j7494
51990F50818j6959j5971j4664j3388j2341j1298r916q260o884o309o450o640o294
$$ y = [774383, 780103, 786264, 792813, 799425, 805286, 809414, 810988, 809431, 804628, 797312, 788878, 780451, 772314, 764602, 758190, 754269, 753003, 753214, 753591, 753810, 754258, 755113, 756080, 756810, 757214, 757452, 757895, 758953, 760684, 762554, 763811, 764138, 763908, 763806, 764210, 764854, 765061, 764458, 763438, 762757, 762683, 762779, 762531, 761830, 760756, 759267, 757331, 755037, 752305, 748796, 744403, 739539, 734660, 729802, 724907, 720302, 716409, 713306, 711029, 710013, 710559, 712049, 713413, 714392, 715658, 717639, 719987, 722429, 725409, 729454, 734438, 739912, 745685, 751572, 756934, 761170, 764510, 767824, 771681, 775998, 780485, 784937, 789038, 792411, 795091, 797656, 800663, 804067, 807217, 809185, 808993, 805787, 799181, 789514, 777677, 764574, 750665, 735917, 720142, 703376, 685955, 668312, 650818, 633859, 617888, 603224, 589836, 577495, 566197, 556281, 548021, 541137, 534828, 528378, 521738, 515444]
51977E15444n546n148n659o839p967q647q983q983q193o255l636j382j4R46K256
$$ y = [515444, 509898, 504750, 499091, 492252, 484285, 475638, 466655, 457672, 449479, 443224, 439588, 438206, 438192, 439138, 441394]
$$ [...]
##END NTUPLES=NMR SPECTRUM
##END=
