
##TITLE=AC1228_VIERSDE097_6075064_qxoipnyZqV
##JCAMPDX= 6.0         $$ Bruker NMR JCAMP-DX V2.0
##DATA TYPE= NMR SPECTRUM
##DATA CLASS= NTUPLES
##ORIGIN= BRUKER
##OWNER= Administrator
$$ 1.72 TOPSPIN		Version 2.1
$$ 2012-05-07 23:21:02.984 -0500  Administrator@TOPSPIN
$$ Compression mode = diff/dup
##.OBSERVE FREQUENCY= 400.13188235
##.OBSERVE NUCLEUS= ^1H
##.ACQUISITION MODE= SIMULTANEOUS (DQD)
##.ACQUISITION SCHEME= undefined
##.AVERAGES= 8
##.DIGITISER RES= 22
##SPECTROMETER/DATA SYSTEM= spect
##.PULSE SEQUENCE= zg30
##.SOLVENT NAME= COFFEE_meoh
##.SHIFT REFERENCE= INTERNAL, COFFEE_meoh, 1, 14.98061
##AUDIT TRAIL= $$ (NUMBER, WHEN, WHO, WHERE, PROCESS, VERSION, WHAT)
$$ ##TITLE= Audit trail, TOPSPIN		Version 2.1
$$ ##JCAMPDX= 5.01
$$ ##ORIGIN= Bruker BioSpin GmbH
$$ ##OWNER= Administrator
$$ $$ C:\Bruker\TOPSPIN/data/COFFEE/nmr/AC1228_VIERSDE097_6075064_qxoipnyZqV/10/pdata/1/auditp.txt
$$ ##AUDIT TRAIL=  $$ (NUMBER, WHEN, WHO, WHERE, PROCESS, VERSION, WHAT)
(   1,<2012-05-07 23:20:55.875 -0500>,<Administrator>,<TOPSPIN>,<go>,<TOPSPIN 2.1>,
      <created by zg
	started at 2012-05-07 23:19:49.250 -0500,
	POWCHK enabled, PULCHK disabled,
       configuration hash MD5:
       AF F2 23 6B 01 CD 40 DD E5 A1 38 A0 06 EA F7 77
       data hash MD5: 64K
       0C 11 98 21 D5 0E 9A 3E 79 85 65 8E 1B 42 4D 85>)
(   2,<2012-05-07 23:20:58.609 -0500>,<Administrator>,<TOPSPIN>,<proc1d>,<TOPSPIN 2.1>,
      <Start of raw data processing
       efp LB = 0 FT_mod = 6 PKNL = 1 PHC0 = 0 PHC1 = 0 SI = 32K 
       data hash MD5: 32K
       49 E2 B1 E1 6C 0C 7F 79 57 F7 B2 7E 8E 48 2D 50>)
(   3,<2012-05-07 23:20:59.000 -0500>,<Administrator>,<TOPSPIN>,<proc1d>,<TOPSPIN 2.1>,
      <pk PHC0 = 210.7397 PHC1 = 0 
       data hash MD5: 32K
       28 A5 0C AF 96 75 77 DD 79 48 B8 F3 E1 33 B0 63>)
(   4,<2012-05-07 23:20:59.046 -0500>,<Administrator>,<TOPSPIN>,<proc1d>,<TOPSPIN 2.1>,
      <abs ABSG = 1 
       data hash MD5: 32K
       E6 4E B7 C9 93 21 85 B8 4A 5E D3 53 33 6B 26 8F>)
(   5,<2012-05-07 23:20:59.078 -0500>,<Administrator>,<TOPSPIN>,<proc1d>,<TOPSPIN 2.1>,
      <abs ABSG = 2 
       data hash MD5: 32K
       94 86 07 19 53 3A 48 09 A2 62 5F CF 24 D3 F2 69>)
(   6,<2012-05-07 23:20:59.109 -0500>,<Administrator>,<TOPSPIN>,<proc1d>,<TOPSPIN 2.1>,
      <abs ABSG = 3 
       data hash MD5: 32K
       C6 70 5C 74 66 79 76 28 33 3B F7 51 15 B0 55 94>)
(   7,<2012-05-07 23:20:59.140 -0500>,<Administrator>,<TOPSPIN>,<proc1d>,<TOPSPIN 2.1>,
      <abs ABSG = 4 
       data hash MD5: 32K
       4A F0 9C 37 7C 54 26 50 22 E9 83 DD 43 C0 3C FF>)
(   8,<2012-05-07 23:20:59.156 -0500>,<Administrator>,<TOPSPIN>,<proc1d>,<TOPSPIN 2.1>,
      <abs ABSG = 5 
       data hash MD5: 32K
       72 B9 E3 AA 20 2E 5C 88 59 CB 34 8B D3 67 89 4D>)
$$ ##END=
$$ 
$$ $$ hash MD5
$$ $$ 35 DA A6 78 01 14 0B 89 41 A3 CC E1 DD E4 73 A7
##$RELAX= 
##$RELAX= 
##$RELAX= 
##$RELAX= 
##$RELAX= 
##$RELAX= 
##$RELAX= 
$$ Bruker specific parameters
$$ --------------------------
$$ [...]
150 150 150 150 150 150 150 150
##$TP07= 0
##$TPNAME0= <>
##$TPNAME1= <>
##$TPNAME2= <>
##$TPNAME3= <>
##$TPNAME4= <>
##$TPNAME5= <>
##$TPNAME6= <>
##$TPNAME7= <>
##$TPOAL= (0..7)
0.5 0.5 0.5 0.5 0.5 0.5 0.5 0.5
##$TPOFFS= (0..7)
0 0 0 0 0 0 0 0
##$TUNHIN= 0
##$TUNHOUT= 0
##$TUNXOUT= 0
##$USERA1= <user>
##$USERA2= <user>
##$USERA3= <user>
##$USERA4= <user>
##$USERA5= <user>
##$V9= 5
##$VALIST= <valist>
##$VCLIST= <CCCCCCCCCCCCCCC>
##$VD= 0
##$VDLIST= <DDDDDDDDDDDDDDD>
##$VPLIST= <PPPPPPPPPPPPPPP>
##$VTLIST= <TTTTTTTTTTTTTTT>
##$WBST= 1024
##$WBSW= 4
##$XGAIN= (0..3)
0 0 0 0
##$XL= 0
##$YL= 0
##$YMAX_a= 531200
##$YMIN_a= -638019
##$ZGOPTNS= <>
##$ZL1= 120
##$ZL2= 120
##$ZL3= 120
##$ZL4= 120
##$ABSF1= 14.98061
##$ABSF2= -5.57192
##$ABSG= 5
##$ABSL= 3
##$ALPHA= 0
##$AQORDER= 0
##$ASSFAC= 0
##$ASSFACI= 0
##$ASSFACX= 0
##$ASSWID= 0
##$AUNMP= <proc_prof1d_extract_pilot.lims>
##$AXLEFT= 0
##$AXNAME= <>
##$AXNUC= <1H>
##$AXRIGHT= 0
##$AXTYPE= 0
##$AXUNIT= <>
##$AZFE= 0.1
##$AZFW= 0.1
##$BCFW= 0
##$BC_mod= 0
##$BYTORDP= 0
##$COROFFS= 0
##$CY= 15
##$DATMOD= 1
##$DC= 0
##$DFILT= <>
##$DTYPP= 0
##$F1P= 0
##$F2P= 0
##$FCOR= 0.5
##$FTSIZE= 32768
##$FT_mod= 6
##$GAMMA= 0
##$GB= 0
##$INTBC= 1
##$INTSCL= 1
##$ISEN= 128
##$LB= 0
##$LEV0= 0
##$LPBIN= 0
##$MAXI= 10000
##$MC2= 0
##$MEAN= 0
##$ME_mod= 0
##$MI= 0
##$NCOEF= 0
##$NC_proc= -8
##$NLEV= 6
##$NOISF1= 0
##$NOISF2= 0
##$NSP= 0
##$NTH_PI= 0
##$NZP= 0
##$OFFSET= 14.98061
##$PC= 1
##$PHC0= 210.7397
##$PHC1= 0
##$PH_mod= 1
##$PKNL= yes
##$PPARMOD= 0
##$PPDIAG= 0
##$PPIPTYP= 0
##$PPMPNUM= 2147483647
##$PPRESOL= 1
##$PSCAL= 4
##$PSIGN= 0
##$PYNMP= <proc.py>
##$REVERSE= no
##$SF= 400.13
##$SI= 32768
##$SIGF1= 0
##$SIGF2= 0
##$SINO= 400
##$SIOLD= 32768
##$SPECTYP= <>
##$SREGLST= <1H.CDCl3>
##$SSB= 0
##$STSI= 32768
##$STSR= 0
##$SW_p= 8223.68421052632
##$SYMM= 0
##$S_DEV= 0
##$TDeff= 65536
##$TDoff= 0
##$TI= <>
##$TILT= no
##$TM1= 0
##$TM2= 0
##$TOPLEV= 0
##$USERP1= <user>
##$USERP2= <user>
##$USERP3= <user>
##$USERP4= <user>
##$USERP5= <user>
##$WDW= 1
##$XDIM= 32768
##$YMAX_p= 464944498
##$YMIN_p= -670270
##$CURPLOT= <Network HP LaserJet P1505>
##$CURPRIN= <$Network HP LaserJet P1505>
##$DFORMAT= <normdp>
##$LAYOUT= <+/1D_H.xwp>
##$LFORMAT= <normlp>
##$PFORMAT= <normpl>
##$SURQMSG= 1
$$ End of Bruker specific parameters
$$ ---------------------------------
##NTUPLES= NMR SPECTRUM
##VAR_NAME=  FREQUENCY,     SPECTRUM/REAL,   SPECTRUM/IMAG
##SYMBOL=    X,             R,               I
##VAR_TYPE=  INDEPENDENT,   DEPENDENT,       DEPENDENT
##VAR_FORM=  AFFN,          ASDF,            ASDF
##VAR_DIM=   32768,         32768,           32768
##UNITS=     HZ,            ARBITRARY UNITS, ARBITRARY UNITS
##FACTOR=    0.250966925370066, 1,           1
##FIRST=     8223.43324360095, -69450,       -107559
##LAST=      0,             -163944,         -119005
##MIN=       0,             -670270,         0
##MAX=       8223.43324360095, 464944498,    0
$$ Real data points
##PAGE= N=1
##DATA TABLE= (X++(R..R)), XYDATA
$$ [...]
19540i9595c0715j16526C956d8870N540r2009k7144B8406a70484g3339A0158b04883
19527d2438j86607A77531b53220B09891e9084d111A9939R9421a0174B8436P0686
19516I9122K5541b0383k74288J29708r6554J542b3103B04357b18170f2765A0000
19504A3193J06011a86612c8974O55G1508b98891b1944r7014d5654b0100I2689
19492b16438c804k42179d8090m84252d0863C10779A47794a56058o9417B35589
19481d6630A98541b63015l8570A42855B3024d4726o3304A79514h7230B7583J37856
19470A65439C2137L5682B4025J81586b36434B0316g4247j08063d9308D47167b0766
19458B28338G618b14277A14293a93432A33855b00310P5059C81422j46536j12710
$$ y = [-99595, -30715, -147241, 3956, -48870, -43330, -135339, -162483, 28406, -170484, -73339, 10158, -204883, -42438, -229045, 177531, -253220, 209891, -59084, -4111, 19939, 119360, -10174, 28436, 99122, 124663, -20383, -294671, -164963, -261517, -259975, -23103, 204357, -218170, -62765, 10000, 13193, 119204, -186612, -38974, -38319, 71508, -298891, -21944, -118958, -45654, -20100, 92689, -216438, -3804, -245983, -48090, -532342, -40863, 310779, 147794, -156058, -225475, 235589, -46630, 198541, -263015, -301585, 142855, 23024, -44726, -108030, 179514, -87230, 27583, 165439, 32137, 67819, 24025, 205611, -236434, 20316, -74247, -182310, -49308, 447167, -20766, 228338, 7618, -214277, 114293, -193432, 133855, -200310, -125251, 381422, 234886, 122176]
19448A22176l3635b45808a16198h188k34664l6885A08258a09218k8449f2962C37251
19436g0011A52613b54361h5550A2035a51107f2913A9900d2740A39096b30676b8559
19424E7327b74595a03292k9926N0732I2692c11844d6586p7832n3597A7439C803
19412b98145g1324B7131d03377A24467a5112j74788F7929a07428h228q7645a6764
19400d39298b3441o986a2341k61838A2681e5924j07438q9985D4846Q9754D141
19388A27067E809d913B7052a72128c9582l1393A11550b76449J35507m444o7315
19377b12701B62700g843A75973d25114J25482J11635r9817R1188p1427J33426
19367a34627b5931o7075A06396a78830N2312H6421K22520d2952l2638m2137j01944
$$ y = [122176, 88541, -245808, -116198, -8188, -242852, -279737, 108258, -109218, -137667, -62962, 337251, -70011, 152613, -254361, -85550, 12035, -151107, -62913, 19900, -42740, 139096, -230676, -28559, 57327, -274595, -103292, -133218, -82486, 92692, -311844, -46586, -124418, -178015, 17439, 3803, -298145, -71324, 27131, -403377, 124467, -15112, -189900, 67929, -107428, -8228, -95873, -16764, -439298, -23441, -30427, -12341, -274179, 12681, -55924, -163362, -253347, 44846, 134600, 4141, 127067, 5809, -4913, 27052, -172128, -39582, -70975, 111550, -276449, -140942, -145386, -212701, 262700, -7843, 175973, -425114, -299632, -187997, -287814, -196626, -268053, -134627, -25931, -93006, 106396, -178830, -126518, 86421, 308941, -42952, -75590, -117727, -219671]
19356b19671h1210E9966c82213a73451I2984a57754l5659i3579k43739J24773
19346b12545A25592a51289d0255n7123G1231B1344b6686r8670N6882j64845M790
19335b28529b1457j3428C51720F5637b36449D8039J6488M8076b90094j8010D5209
19323a30312b8607B58005F4003r374K4838r650a9664j56452O6437j03217e8236
19311a2283G6702C2659c4667A19298a21297h727j05837A84368o9417A448c3787
19299b53311f7066J002l386C5945j4853e2664A33702a00679m0589I404c0560B488
19286b82727d1017q5896L5046k14606D3198a35773j19154a11105B81885a0504
19275A50191a93189f1961K1194j02812q2497h9544A3147i7464b6111o0403A09288
$$ y = [-219671, -81210, 59966, -382213, -173451, 92984, -157754, -193413, -93579, -337318, -212545, 125592, -151289, -40255, -97378, 71231, 21344, -26686, -125356, -68474, -233319, -228529, -21457, -34885, 351720, 65637, -236449, 48039, 64527, 112603, -290094, -308104, 45209, -130312, -28607, 258005, 64003, 54629, 79467, 69817, -19664, -176116, -109679, -212896, -58236, -12283, 76702, 32659, -34667, 119298, -121297, -8727, -114564, 184368, 114951, 1448, -33787, -253311, -67066, -66064, -69450, 35945, 21092, -52664, 133702, -100679, -141268, 9404, -30560, 2488, -282727, -41017, -126913, -91867, -306473, 43198, -135773, -254927, -111105, 281885, -10504, 150191, -193189, -61961, -40767, -143579, -226076, -89544, 13147, -97464, -26111, -86514, 109288]
19263c90545J69810O5231A63369b56811A74927f2957I9793l6870c38370J67112
19253a71258F4815a03721j49009l16752a88890E9925c02444J45118F2256b2744
19242I1204a00436A11814E309a45154D4634j6906h1335j18989H0919i1124o8631
19231a59755l0562B58219e8260B553c1665D7484j2874R2278l9900J5562C7325
19219e6808E4870b44233E2865L8742K8030a52568c8891k11139A52372a00626q1962
19208a82588Q0202A33689a44127q4989H4354b31000a01568A07957j4129J47630
19198B41458A1048J41532a29127N1991p0771J5032G7314g5260a1371n287m2428
19187e9086B29637C5443L03300b82581E2198J59599f6442j6961j40594N6827j7781
$$ y = [-390545, -220735, -155504, 163369, -256811, 174927, -62957, 99793, 62923, -338370, -171258, 64815, -103721, -252730, -569482, -188890, 59925, -302444, -157326, 62256, -22744, 91204, -100436, 111814, 5309, -145154, 44634, 27728, -81335, -200324, 80919, -91124, -159755, -190317, 258219, -58260, 2553, -31665, 47484, 34610, 126888, 86988, 102550, 37325, -56808, 54870, -244233, 52865, 91607, 119637, -152568, -38891, -250030, 152372, -100626, -182588, -102386, 133689, -144127, -229116, 84354, -231000, -101568, 107957, 93828, 241458, 11048, 152580, -129127, -77136, -147907, -132875, 77314, -75260, -11371, -16658, -59086, 229637, 35443, 338743, -282581, 52198, 211797, -66442, -83403, -223997, -167170, -184951]
19176a84951C25086A09308D5280a17025B66180j17943F3b12434j5383A95050a47838
19164A18496E1216i8053A06117m5223b72435I1629c81482A46015d8549j14154
19154a62703A99623B3381c3717D8877J26727R1476n6255a96470f5786c0103j33236
19143a63339B34188e0187A54888a48008B2364P8564M0320J31330f4473b7446A99909
19131a99694M205r993D6717b90125a32598k91025J71352J19178m5796a6703j49020
19120a65723C64071b6533C6647b79732b2550F3016J1827h3009j96174d4830J9013
19109b5817j73070C1718P4563a01175j97475c7190l0685E3591c20777J22912G5549
19097b5409E2265a19923j5093k326j36683b9837j4391j416D06464a81646O1418
$$ y = [-184951, 325086, 109308, 45280, -117025, 266180, 148237, 63, -212434, -227817, 195050, -147838, 118496, 51216, -98053, 106117, 60894, -272435, 91629, -381482, 146015, -48549, -162703, 199623, 23381, -33717, 48877, 175604, 267080, 210825, -196470, -65786, -30103, -163339, 234188, -50187, 154888, -148008, 22364, 100928, 141248, 272578, -64473, -27446, 199909, -199694, -195489, -205482, 46717, -290125, -132598, -423623, -252271, -133093, -178889, -16703, -165723, 364071, -26533, 36647, -279732, -22550, 63016, 74843, -83009, -279183, -44830, -25817, -198887, 31718, 106281, -101175, -298650, -37190, -67875, 53591, -320777, -197865, 75549, -25409, 52265, -119923, -135016, -137342, -274025, -29837, -44228, -45644, 406464, -181646, -120228]
19086a20228k3615j35687l660f2995J9050F8144J32726a99677Q2242k08286L4085
19075b91636N9683A57263b38573J07734j43243A14914D774b9185q4738A2660f4357
19063a58375C2907b9401A82959a26092B17742c88946A56760C0848i9907j5426
19053a15333D4032g7378F1419J74328I7850a19554a5096j81778O5755A45780b06004
19041a36476d1453j55864c8609l11096B38077d07106A23998F1056J2339M06647
19031D80042A0414P5185A7580M6469Q2472a50947j9356k3630b4994j16870j5148
19020a57012c4090j1082l2857i02A59149c1599A58038a77780A83047i0866n4346
19009a45212A53990a01446M5903A0357h3580r9324f0847l8229A9677a02583K7028
$$ y = [-120228, -143843, -279530, -283190, -62995, -43945, 68144, 200870, -199677, -117435, -325721, -291636, -231953, 157263, -238573, -130839, -274082, 114914, 4774, -29185, -113923, 12660, -64357, -158375, 32907, -29401, 182959, -126092, 217742, -388946, 156760, 30848, -99907, -115333, 44032, -77378, 61419, 235747, 97850, -119554, -15096, -196874, -131119, 145780, -206004, -136476, -41453, -197317, -38609, -349705, 238077, -407106, 123998, 61056, 73395, 480042, 10414, 85599, 17580, 64049, 146521, -150947, -170303, -193933, -24994, -141864, -157012, -34090, -45172, -78029, -902, 159149, -31599, 158038, -177780, 183047, -90866, -145212, 153990, -101446, -55543, 10357, -83580, -182904, -60847, -99076, 19677, -102583, -75555]
18998g5555C8177a54697F7491J67646j03328c00820B29310c6536F9102a01493
18987B43596D2305a39714a0980j2036q7215F7072i7598C9436a72671h2902C00023
18975a13461K5925q0806L2331A94952d8532j95335q1771D8290J69925r8782b64919
18963f7806j79202C36817a24792j77967d8696k0366j03527p4418J23405B26276
18952B43044c26698g5485A50466j0777n8140i294k31991R8360A3099N4019N0090
18941A17208g2297A51142C9656b48770A37565A1471b12297I1370a15218j45012
18931b60230k1316a152A3919b74138a04036j14841B24922e4496b0164j52968j15642
18920b88774J11163k46953A05042o342r627Q5231p0271J07583l8292K49371B3167
$$ y = [-75555, 38177, -154697, 67491, 235137, 131809, -300820, 229310, -36536, 69102, -101493, 243596, 42305, -139714, -10980, -23016, -110231, 67072, -97598, 39436, -172671, -82902, 300023, -113461, -87536, -168342, -136011, 194952, -48532, -243867, -325638, 48290, 218215, 119433, -264919, -67806, -247008, 336817, -124792, -302759, -48696, -69062, -172589, -247007, -123602, 226276, 243044, -326698, -75485, 150466, 139689, 81549, -9294, -241285, -142925, 13099, 67118, 117208, -72297, 151142, 39656, -248770, 137565, 11471, -212297, 91370, -115218, -260230, -281546, -1152, 13919, -274138, -104036, -218877, 224922, -54496, -20164, -173132, -288774, -177611, -424564, 105042, 98700, 89073, 174304, 104033, 211616, 173324, 422695, 23167]
18908C5906b46520C14910a35499r6180F8043b8987A795a64135k24407b0132j18502
18897a38634A22137f8304n0883H7278j1052B9821e0098J8459E187b48242A4261
18885f7426k7353j40768C4510b69047A84626a49624I4183i1574A1026e6676p5716
18874a32392D057f9574o0227l2430P2258a4836j95817D3081c29433Q9683m5660
18863b85410B3516M7221B799c2699r0976L6550q1378A01109a89205m3640P3523
18852a59322r0930f5703k1742F1303K74796I7169c70511Q5355A24107i4974n581
18841a00555h725j03740j10002a5383B10066D1818C967d89099g4700B90867a89699
18829C7144Q0641b06281a01518J240H7449g3432I7939J55263f047j04849c8312
$$ y = [35906, -246520, 314910, -135499, -231679, 68043, -28987, 1795, -164135, -388542, -20132, -138634, 122137, -68304, -119187, 87278, 76226, 29821, -50098, -31639, 5187, -248242, 14261, -67426, -94779, -235547, 34510, -269047, 184626, -149624, 94183, -91574, 11026, -56676, -132392, 4057, -69574, -129801, -162231, -89973, -14836, -210653, 43081, -329433, -239750, -285410, 23516, 70737, 2799, -32699, -123675, -87125, -168503, 101109, -189205, -232845, -159322, -250252, -65703, -87445, 61303, 336099, 97169, -370511, -285156, 124107, -94974, -100555, -8725, -112465, -222467, -15383, 210066, 41818, 3967, -489099, -74700, 290867, -189699, 37144, 117785, -206281, -101518, -100278, 87449, -73432, 97939, 253202, -6047, -110896, -38312]
18817A27117b9034k0371j4750k89132A80125h2680n1142j21561F0809j2756h1072
18805b36649M8469h3630B03200J10554a462j15682b7367I8523A3148j786N7641
18794F9003b80882A94913g9981a9749n9331c265j13405j2172q24A75806R6889
18783B72695g5171j1701l27613J27249A68463a42349d8742l1200j81005F1136
18772e7723B57130b22865Q3075J2038j2476F7831J60461b13795A4058D856b02216
18760g2391k36188E8196a82032j47274h6956C48818G5792K29493h6878M2610p3794
18749a18062A39109D4868J03009b27325P0494f1385m4126E3761a51284J7281e6995
18737b75010Q3182H7737b16887A9707N6266e0920l2025k26152c9273C8199b16173
$$ y = [127117, -29034, -49405, -64155, -353287, 180125, -82680, -133822, -255383, 60809, 48053, -81072, -236649, -188180, -83630, 203200, 313754, -1462, -117144, -27367, 98523, 13148, 11362, 69003, -280882, 194913, -79981, -19749, -79080, -3265, -116670, -128842, -129666, 175806, 272695, -75171, -86872, -414485, -287236, 168463, -142349, -48742, -79942, -260947, 61136, -57723, 257130, -222865, -139790, -127752, -140228, 67831, 228292, -213795, 14058, 4856, -202216, -72391, -308579, 58196, -182032, -329306, -86956, 348818, 75792, 305285, -86878, -44268, -118062, 139109, 44868, 147877, -227325, -156831, -61385, -105511, 53761, -151284, -134003, -56995, -275010, -191828, 87737, -216887, 19707, 75973, -50920, -82945, -309097, -39273, 38199, -216173]
18725D3219d2422j54635H4563d0148k48145J27933B6507f2905o814C0249o421
18714B3828b49124L1444I8392m7304P0725a04033L828J3977H6339a37304O95C53441
18701b22643M8383j02978a08916b4118C9278R9792a33739j18520E6674M1191a11970
18689i2611H3007C7522d54205a29574k26621d7716P617a007E4288b38473D4359
18677A54750b36430O625e7253B8454K61410g3834k50305a36907l1628K2536F2997
18665F8024J24077R7439a7416k2296g624B02226i8199G5094Q5741b2642n1331
18654g3973j69360J9964J7754h8566G9860K04291c27036a48654H7883a06768n8609
18643a65377d9542j43920m0107i1509b9064j93181l1663a18981p9905c5344B0359
$$ y = [43219, -42422, -197057, 84563, -40148, -288293, -160360, 26507, -62905, -69719, 30249, 23828, -249124, -217680, 98392, 51088, 121813, -104033, -100205, -86228, 86339, -137304, -136609, 353441, -222643, -174260, -277238, -108916, -24118, 39278, 139070, -133739, -252259, 56674, 97865, -111970, -92611, 83007, 37522, -454205, -129574, -356195, -47716, -40099, -1007, 54288, -238473, 44359, 154750, -236430, -229805, -57253, 28454, 289864, -73834, -324139, -136907, -168535, -145999, 62997, 68024, 192101, 289540, -17416, -39712, -7624, 202226, -98199, 75094, 160835, -22642, -73973, -243333, -223369, -205615, -88566, 79860, 284151, -327036, -148654, 87883, -106768, -165377, -49542, -193462, -233569, -91509, -29064, -222245, -253908, -118981, -198886, -35344, 20359]
18631B31982G3824b69055A97442b18041H9430a16834l2840a954k08268C36772
18620f6406j69634I1391d67493c5045B29197D0925j2377d7904k42327C47478a71463
18608G9998h1092B21009a90792A39714F8823a89576j52911A7158c18262l7659
18598c55921A07889c98767E4134a1758F188J95505p2067e2019q1372b3520A69264
18586A6210b8380j02127I2533J15180l6967p5715f372C48148a61463H069L33846
18575C41915n4504a99004J6155A10262K35813q2715p9548A0825L6566O2573m9399
18564F0565a69099d4884j86459Q8877M9426q1336A40001i7219n0834A32831a27384
18552A76176a44962c9607H9778e2864B52841D0669c18628a17680p6760j60A58387
$$ y = [231982, 73824, -269055, 197442, -218041, 89430, -116834, -149674, -1954, -210222, 336772, -66406, -236040, 91391, -467493, -35045, 229197, 40925, 28548, -47904, -290231, 347478, -171463, 79998, -81092, 221009, -190792, 139714, 68823, -189576, -342487, 17158, -318262, -355921, 107889, -398767, 54134, -11758, 6188, 201693, 129626, -52019, -133391, -23520, 169264, 16210, -28380, -130507, 92533, 207713, 170746, 95031, -6372, 348148, -161463, 8069, 341915, 287411, -199004, -182849, 110262, 346075, 263360, 183812, 10825, 47391, 109964, 60565, -169099, -44884, -231343, -142466, -93040, -174376, 140001, -97219, -148053, 132831, -127384, 176176, -144962, -39607, 89778, -52864, 252841, 40669, -318628, -117680, -194440, -194600, 158387]
18540b96787a9867A49804L5394h4492A03160a86856A54258b801l33731J64677
18530a71855M1243K4576K547j2636C7192a97038B5828a44368K1642j39852d5983
18518A75049m4682O254F756b01697B37208n6023a73651A41327J78053F8147J35691
18507B03838a40199n5158R7603B74779a7295r8530M5792j93729B3109g4199n7123
18496a31322L2857k82186A01343d5166I8858e000C68991e317k55832A14644h0514
18484B7832O2826A6869a4497A6640K2641J96337E8007c06243E230Q6117N1573
18473A42920b10631O4434k1340r9550K6296A49065k1105C8872A843a75613j97341
18462c72954B4140N881d8185H9816l2766b60296h9883B73816g8452c2873A17977
$$ y = [-296787, -19867, 149804, 185198, -84492, 103160, -186856, 154258, -2801, -336532, -171855, -130612, -106036, -103489, -116125, 37192, -197038, 25828, -144368, -122726, -262578, -45983, 175049, 130367, 136621, 6756, -201697, 237208, 181185, -173651, 141327, 319380, 68147, 203838, -140199, -195357, -97754, 274779, -17295, -115825, -70033, -263762, 23109, -74199, -131322, -98465, -380651, 101343, -45166, 98858, -5000, 368991, -5317, -261149, 114644, -80514, 27832, 90658, 16869, -14497, 16640, 39281, 235618, 58007, -306243, 5230, 91347, 142920, -210631, -146197, -167537, -267087, -240791, 149065, 127960, 38872, 1843, -175613, -372954, 24140, 30021, -48185, 89816, 57050, -260296, -89883, 273816, -78452, -32873, 117977]
18450D08736a9877B50860d7402K509m3496E3977J5048N9636C9249b74247J33217
18439a41030A42822I166a99259m7063C3230g3730l6803j70688A55872b14886h2608
18427A41095A675e5238k37519J2970Q0079i8468B9022c9427H249e7562r3625H2976
18414A4391R0387J4759b97040I431O4132C1321J3287c356j06126B61395b13490
18402e5570E2910g9391A62888a24178D0153P9679F78a68464O9450A61258c48307
18390g397C51453f3915j00806j79957i9073j7574k8863B07842a38061H6263O62
18379H6925L21665j78903a04208e011l14789e7507B6029h4312B24356e106j07677
18368a12783r3867i4584C3306J25423a59296c2215j86019b5046l18742i2975Q620
$$ y = [408736, -19877, 250860, -47402, -44893, -88389, 53977, 69025, 128661, 39249, -274247, -141030, 142822, 9166, -199259, -246322, 33230, -73730, -110533, -281221, 155872, -214886, -82608, 141095, 1675, -55238, -292757, -279787, -199708, -98468, 29022, -39427, 8249, -57562, -151187, 82976, 14391, 104778, 119537, -297040, 9431, 73563, 31321, 44608, -3356, -109482, 261395, -213490, -55570, 52910, -79391, 162888, -124178, 40153, 119832, 678, -168464, -99014, 161258, -348307, -7397, 351453, -63915, -164721, -344678, -99073, -116647, -145510, 207842, -138061, 86263, 86925, 408590, 229687, -104208, -5011, -319800, -57507, 26029, -84312, 224356, -5106, -112783, -206650, -94584, 33306, 158729, -159296, -32215, -218234, -25046, -343788, -92975, -84355]
18357h4355m7551B26675b45645Q3673B04863g9437A62073D7022c1344j377J3820
18346a8901j730D5071J38897b06146A81199m7847m0318N097m7590J30760a5711
18334e54835h3173A06593E3031M2794c1693B17303D490R636d49605f2311k3521
18323h5832b1767F1880j4985a4080k31072H4495c62315p9916A11472j4791a5084
18311d4917e154k20642B12483b40578N3521q1744A2806K46543c1253A05803b02187
18299A34382f4456j89773o4130c8553j60319h5872k67401A73876G3334h1081K541
18288g8540j3061H0969k4750J97007C320c07897l1234c5477k57711i8572j24156
18277b22728a04455i212k14455j68412A84948b17715j18136a22639i845F0038
$$ y = [-84355, -131906, 226675, -245645, -161972, 204863, -79437, 162073, 47022, -31344, -32721, -18901, -20631, 45071, 183968, -206146, 181199, 133352, 93034, 98131, 50541, 181301, -15711, -554835, -83173, 106593, 53031, 95825, -31693, 217303, 4490, 14126, -449605, -62311, -85832, -21767, 61880, 46895, -14080, -245152, 84495, -362315, -442231, 111472, 96681, -15084, -44917, -5154, -225796, 212483, -240578, -187057, -268801, 12806, 259349, -31253, 105803, -202187, 134382, -64456, -254229, -318359, -38553, -198872, -85872, -353273, 173876, 73334, -81081, -78540, -91601, 80969, 56219, 253226, 3320, -307897, -339131, -35477, -293188, -98572, -222728, -104455, -9212, -223667, -392079, 184948, -217715, -335851, -122639, -9845, 60038]
18266c67834a58464k37148D175K35386b47685c4249n9066F3502b16766e7757C2257
18254C36716o6305B8638J01618b4423i110H3071K4553c4521H3042a50983C3783
18242a22053k31635M7204R770a23249M4360a3902A18307g0533B24395n8202o339
18231A59854c99333a90146B22557G0666b76101C02881F5412i0548H9530L6954
18221A26484a53569c7452C07417a34147A99575E0029J60487E8212a19104B44037
18210b15435f7867n9679j27069j80145E08561a30219J9405N4823A27522b98B4388
18198I0422h2947n8229B57362B8084e4609p4624b6903C07413H1198J08350f6293
18186A8151Q9585B0982c1334k23865B58687L4261I4758B3354R3533C8097a41085
$$ y = [-367834, -158464, -395612, 4175, 239561, -247685, -34249, -93315, 63502, -216766, -57757, 32257, 336716, 270411, 28638, 130256, -24423, -9110, 83071, 107624, -34521, 83042, -150983, 33783, -122053, -353688, -306484, -296714, -123249, -78889, -13902, 118307, -70533, 224395, 166193, 159854, -399333, -190146, 222557, 70666, -276101, 302881, 65412, -90548, 89530, 126484, -153569, -37452, 307417, -134147, 199575, 50029, 210516, 58212, -119104, 244037, -215435, -67867, -127546, -254615, -434760, 508561, -130219, -110814, -55991, 127522, -298, 24388, 90422, -82947, -141176, 257362, 28084, -54609, -129233, -26903, 307413, 81198, 189548, -66293, 18151, 107736, 20982, -31334, -255199, 258687, 292948, 94758, 23354, 116887, 38097, -141085]
18174B7795i7731A3273M05075A71119G1586h4299b4368b729G1338k6363a33173
18162A99368b91705H9502G565K2526e9454A0028b94855F7948b51421B46449A02640
18150d80168a22752A51912A6724b0182H4082a49039j90585A75353J5193N6665
18140B47211c80164A93065G5516J68815b42342h9768E8594b96625E9948b96132
18129i944n5015k37284G7601a8646p9865A24225c2653j83032D9207a67259L7134
18118a30125C01696d748m4645C0439K23933D7391L2329l2378a97381I2053B2893
18106D8914C142K8455R4966h0006k43168O6252f7898o5525L2960B85064H6317
18094F9650K34050m5915r2564b78569J18021I565a88247C9618a41160d746G0710
$$ y = [27795, -97731, 13273, 418348, 171119, 71586, -84299, -24368, -2729, 71338, 44975, -133173, 199368, -291705, 89502, 7565, 30091, -59454, 10028, -294855, 67948, -251421, 246449, 102640, -480168, -122752, 151912, 16724, -20182, 84082, -149039, -339624, 175353, 190546, 247211, -380164, 193065, 75516, 244331, -242342, -89768, 58594, -296625, 59948, -296132, -9944, -64959, -302243, 77601, -18646, -98511, 124225, -32653, -215685, 49207, -167259, -130125, 301696, -4748, -49393, 30439, 254372, 47391, 79720, 47342, -197381, 92053, 22893, 48914, 3142, 31597, 126563, -80006, -323174, -256922, -67898, -133423, -100463, 285064, 86317, 69650, 303700, 257785, 165221, -278569, -160548, 9565, -188247, 39618, -141160, -4746, 70710]
18082h5681B48598h2074k8762l2556A1346a9333k10222b2970B24822a37622c0956
18070b62049a28688C741b38555k43689A6423M61049I9051J20530a42684A34116
18059A44127K54383A09127Q7898a20532k13274h6045n6444n9958D09385A2563
18048b94740h9028A67688b27528F1342P9896F9938d5629j18314j27263B13947
18037H5283J26358E300J79014a74599c468I0201L13134f7678D6870J64306b10315
18025g6354A25424k4691B628a50660D642b28177c188j27895h6j0786j10922j4413
18013a36207I1105e3639l3870r2835A37914n1866c08631k06582A59509J04207
18003B63716a21077H5663b74282B05619I517a04002P026m7874a420k93057c896
$$ y = [-85681, 248598, -82074, -110836, -143392, 11346, -19333, -229555, -22970, 224822, -137622, -30956, -262049, -128688, 3741, -238555, -482244, 16423, 477472, 99051, 219581, -142684, 134116, 144127, 398510, 109127, 197025, -120532, -333806, -86045, -142489, -202447, 409385, 12563, -294740, -89028, 167688, -227528, 61342, 141238, 69938, -45629, -163943, -291206, 213947, 85283, 211641, 5300, 184314, -174599, -3468, 90201, 403335, -67678, 46870, 211176, -210315, -76354, 125424, 100733, 2628, -150660, 4642, -228177, -3188, -131083, -86, -10872, -121794, -136207, 91105, -53639, -87509, -180344, 137914, 86048, -308631, -515213, 159509, 263716, -121077, 85663, -274282, 205619, 9517, -104002, -96976, -144850, -1420, -294477, -3896]
17991b35632A11346B473J49178d9105I6597e4631A617J57413C8112P5452d405
17979C620a43774B38395d59654r2433D9637k3034g2276b8175B05406C449i8915
17967a31873i651A34925B0848b72639D3535g023A22467K52520G3456b06361A8547
17955E1889M7210b96435a08219r9441B73871r2915a14376d5605R567a2578B2978
17943a62649A4077J00147a67091e592D458h7315k29680R5749C5426K09919B6822
17931a99D658J40812F8729a81390C055M4117b63589e5225q4821H7504a9011D55468
17918B24310B1358a96841K1485Q4133G4902b29238G8111e0875k61087A5879a58453
17906A56215b9167B12251i2199J5312n6108r2708g7682L0731j69907j31950i2725
$$ y = [-235632, 111346, 2473, 151651, -49105, 96597, -54631, 1617, 159030, 38112, 113564, -4405, 3620, -143774, 238395, -459654, -552087, 49637, 26603, -72276, -28175, 205406, 3449, -98915, -131873, -9651, 134925, 20848, -272639, 43535, -7023, 122467, 374987, 73456, -206361, 18547, 51889, 99099, -296435, -108219, -207660, 273871, 180956, -114376, -45605, -36038, -12578, 22978, -162649, 14077, 114224, -167091, -5592, 4458, -87315, -316995, -221246, 35426, 245345, 26822, -199, 4658, 145470, 68729, -181390, 3055, 47172, -263589, -55225, -140046, 87504, -19011, 455468, 224310, 21358, -196841, -175356, -91223, 74902, -229238, 78111, -50875, -311962, 15879, -158453, 156215, -29167, 212251, -92199, -76887, -132995, -225703, -77682, -46951, -216858, -348808, -92725]
17894D7100j1538M5139K1566a64379g2693j21201E971a2600A48955l2679K9942
17883A46218K65983a45563r1423A35563D7256d8890E5152J65964F0240a05683
17872H5883K28624F1751J30576C8053h0984B47468a39050A07705f1170A0717J47933
17861A58650o823n660d8942j22188A24757b92434A76317b55759h333k96710B43651
17849A38996a9976A57978c48031L4016A09837J69403m2679a9310k8374I2910K8334
17838A21244B2409R1347A9255J85703a07120A69469n2348l5023a90096d7569C0199
17826b71915e0864j23877l9192F4309J8442K78178i9749j15000j34300a0502A1361
17814c79682D36239a28095q3007D78119e3397J521A43038K8588e3203B47484a8129
$$ y = [47100, 35562, 80701, 102267, -164379, -72693, -193894, 5971, -12600, 148955, 116276, 146218, 412201, -145563, -236986, 135563, 47256, -48890, 55152, 221116, 60240, -105683, 85883, 314507, 61751, 192327, 38053, -80984, 247468, -139050, 107705, -61170, 10717, 158650, 151827, 146167, -48942, -171130, 124757, -292434, 176317, -255759, -8333, -305043, 243651, 138996, -19976, 157978, -348031, -314015, 109837, 279240, 236561, -19310, -47684, 92910, 121244, 22409, 113756, 19255, 204958, -107120, 169469, 117121, 82098, -190096, -47569, 30199, -271915, -50864, -174741, -213933, 64309, 82751, 360929, -99749, -214749, -349049, -10502, 11361, -379682, 436239, -128095, -211102, 478119, -53397, -51876, 143038, 171626, -53203, 247484, -18129]
17802A32138h2059A14965M933a02422o5051d542k43322J21094B87207A0413J23654
17791A34067J42050h366B00703j7255a18900a1521j46537j15278B87207d50562
17780G7761C7801h1119j06258j45199e4309E181Q7857K4049a53706A37739b04244
17768A78956o509L0980B6000O7539O9089l1550a41649I476N988K8310j300a05626
17755C4237M8895J41977a65006H6070J66814A16551A6517a98336A38267k3720
17745A14547R6119E0694C357a7659A28593e6051k78000h9346k2737F707e635K348
17733c287A18345a76507j5090A28907b31799C58803A21599e3204B64844e5891
17722B79588G9458a0525H0812e6915k99571e0971D5705o938h9244L4470r159H8406
$$ y = [132138, -82059, 114965, 119898, -102422, -167473, -4542, -247864, -126770, 287207, 10413, 134067, 276117, -8366, 200703, 183448, -118900, -11521, -158058, -273336, 287207, -450562, 77761, 37801, -81119, -187377, -332576, -54309, 5181, 93038, 117087, -153706, 137739, -204244, 178956, 172447, 203427, 26000, 93539, 162628, 131078, -141649, 9476, 15464, 43774, 42474, -105626, 34237, 83132, 225109, -165006, 86070, 252884, 116551, 16517, -198336, 138267, 114547, 210666, 50694, 3357, -17659, 128593, -56051, -334051, -89346, -112083, 6707, -5635, -3287, 118345, -176507, -191597, 128907, -231799, 358803, 121599, -53204, 264844, -55891, 279588, 79458, -10525, 80812, -56915, -356486, -50971, 45705, 38767, -89244, -54774, -63933, 88406]
17709A18240R202a26553M1915D8886R8354m2659l6148a07870d1202B8025J36373
17698A64398K935K0673a01276A48692c3231A8248P7408a39885B24809a26917o5688
17687a92605F8688b37477B67255F9959f8825A0464a52373A13494a29555f4230
17676A07543K34502Q3065A17186l4562P6202e1390A90964A3596P9528K5766j3970
17665A04920A7884K293e3277r7145A41454R8450A00883p728J62887g4691H4737
17653H8276l9785h7559A02277a83747N4600G332a591C6655b6695k04492F8179
17641B65028G9198L3353h6749C2334g6036j98298D79190b4466j3621j49142j7797
17630b05026A82557C7886L43948a2420B5975b67836A21321J12517H7120N404P8168
$$ y = [118240, 127442, -126553, -84638, 48886, 147240, 104581, 68433, -107870, -41202, 28025, 164398, 167333, 188006, -101276, 148692, -33231, 18248, 95656, -139885, 224809, -126917, -192605, 68688, -237477, 267255, 69959, -68825, 10464, -152373, 113494, -129555, -64230, 107543, 342045, 425110, 117186, 82624, 158826, -51390, 190964, 13596, 93124, 118890, 104920, 17884, 20177, -53277, -150422, 141454, 239904, 100883, 93155, 256042, -74691, 84737, 88276, 48491, -87559, 102277, -183747, -129147, 7332, -1591, 36655, -26695, -231187, 68179, 265028, 79198, 112551, -86749, 32334, -76036, -274334, 479190, -24466, -38087, -187229, -205026, 182557, 37886, 381834, -12420, 25975, -267836, 121321, 233838, 87120, 92524, 170692]
17619A70692K8454G6685N9594c4972A4557J7677a35521k5741C70323e5427A54753
17607a22431c5760K4I7463e7969b6424j56896c8817k00423f9867k84811B4985
17595C70087b6814A08764f7895g148C00453a02498A96981o7123a96071a8640A82729
17583c59127B82408j38746J50069K4317c46638C644d10512a11721J4064l9023
17573a36680B11415r2043g9774l50282i8710J8495A72950a08695A29608N9359
17563A88967o1448a0539A14521L00539j63810I0017i7178E0729P7805J10310E0853
17551A53202c950j94854p8799B49590B9907M27607a5343C30613C6140b0078Q818
17540a1260j1665B17935k0375o8775E5021K15320e0079k7369A85692a82813d3044
$$ y = [170692, 199146, 76685, 136279, -34972, 14557, 32234, -135521, -161262, 370323, -55427, 154753, -122431, -35760, -35736, 97463, -57969, -26424, -183320, -38817, -239240, -69867, -354678, 24985, 370087, -26814, 108764, -67895, -7148, 300453, -102498, 196981, 129858, -196071, -18640, 182729, -359127, 282408, 143662, 293731, 318048, -346638, 3644, -410512, -111721, -97657, -136680, 211415, 119372, -79774, -430056, -98710, -80215, 172950, -108695, 129608, 188967, 127519, -10539, 114521, 415060, 251250, 90017, -97178, 50729, 128534, 238844, 50853, 153202, -3950, -198804, -277603, 249590, 29907, 457514, -15343, 330613, 36140, -20078, -11260, -22925, 217935, 197560, 128785, 55021, 270341, -50079, -77448, 185692, -182813, -43044]
17528A36997G532Q173K28867P9538a80657Q9654C8791p661J14435i9135A0509
17516B22372q1951b8869n8607K8605E8864M9007m8137b0884A83089N2201p555
17505B27735F4736i2064F2775L14404A74409k9306P4579e3600A33522a43045B03381
17493a13728A00564g7225L3076j65770B86210l4343I9918K16171h9823A00838
17482B20026C9402a71910B41808G7429L44066G2603b20161B12835E7350J13002
17472A70352G5899l6236K9203J49458r4070E0401M5403J27307N8372e7448D17596
17460A76506J55950c5648D2707K75827i6663G688P7143K09333l5504n3593J34522
17449C39589i6829B32862a79491D1531J28621o9634M6199M6249c4625B85791a40820
$$ y = [136997, 7532, 15705, 244572, 324110, -180657, -91003, 38791, 31130, 145565, -99135, 10509, 222372, 140421, -28869, -87476, -58871, 58864, 107871, 59734, -20884, 183089, 235290, 227735, 64736, -92064, 62775, 377179, 174409, 145103, 219682, -53600, 133522, -143045, 203381, -113728, 100564, -77225, -44149, -209919, 286210, 251867, 99918, 316089, -89823, 100838, 220026, 39402, -171910, 241808, 77429, 421495, 72603, -220161, 212835, 57350, 170352, 75899, 39663, 68866, 218324, 124254, 50401, 95804, 223111, 281483, -57448, 417596, 176506, 332456, -35648, 42707, 318534, -96663, 7688, 84831, 294164, 258660, 205067, 339589, -96829, 232862, -179491, 41531, 170152, 100518, 146717, 192966, -34625, 285791, -140820]
17437B97930A00539L66544J88890l24237q102H7198P6467L9899K22951B03745
17426B26052n3505l8550m8967J97358L6516A38593M3241M9198r5625c602B31492
17414G1207L46503j09977o4876j5290K89568A63002a41035A92433p6995H471M15314
17403D23785n7217J81301B24850P4121F3824J56792F8488i134D0822K9819J02431
17392A73072a98113I1847K04661O272F5784R651K43289J5686j04458d6053k0922
17381f6975E1888J41357H1255J04139F4752R5412a10833C8804a96514E1047c15471
17369H6960h5100l9743A46967M3192N1582b92241J05698A32314a74243B84172
17358D40749b29738E9326L44880c269r9766c942j50970K4259A73438p4954C1445
$$ y = [297930, 100539, 467083, 655973, 331736, 323634, 87198, 163665, 203564, 426515, 203745, 226052, 172547, 133997, 85030, 282388, 318904, 138593, 181834, 231032, 135407, -3602, 231492, 71207, 417710, 307733, 242857, 227567, 517135, 163002, -141035, 192433, 115438, 8471, 423785, 366568, 547869, 224850, 298971, 63824, 220616, 68488, -9134, 40822, 70641, 173072, -198113, 91847, 296508, 302780, 65784, 75435, 318724, 334410, 229952, -46053, -66975, 51888, 193245, 81255, 185394, 64752, 160164, -110833, 38804, -196514, 51047, -315471, 86960, -85100, -124843, 146967, 190159, 241741, -292241, -186543, 132314, -174243, 284172, 440749, -229738, 59326, 404206, -3269, -103035, -3942, -154912, -130653, 173438, 98484, 31445]
17346B13215J59506B6909J28202C8844K40119n11r8998K1843D2784L64946A5290
17334C09846e4479A32486J5666P3593L4805g9275r7639G2590J1063L5062J05320
17323B24035K68568a16433A48395R917J15766Q4225j71415J06730c8769B8425
17312A66130p269F4879K57312B0627d4326F2255R4109a02694C3400b08006B22188
17300D34656E9154J38432J7915b8475H5276J69660D0422h2511B99425b0227A78370
17288b03418F6467O7362h9564A50648R214d7816A50125n9302K32197J16828K8263
17277D68111C9261N2877N69031b31848B09611B9086J03184J14629J3332p1688
17267A88543G4625M1617a43406A06929J65495l0633I4236l2895J50220K4814l986
$$ y = [213215, 372721, 26909, 155111, 38844, 278963, 278452, 179454, 201297, 42784, 407730, 15290, 309846, -54479, 132486, 148152, 221745, 256550, -79275, -176914, 72590, 83653, 118715, 224035, 492603, -116433, 148395, 158312, 274078, 358303, 186888, 293618, -38769, 28425, 166130, 158861, 64879, 322191, 20627, -44326, 62255, 156364, -102694, 33400, -208006, 222188, 434656, 59154, 197586, 215501, -28475, 85276, 254936, 40422, -82511, 299425, -20227, 178370, -203418, 66467, 133829, -89564, 150648, 159862, -47816, 150125, 90823, 323020, 439848, 468111, 39261, 92138, 661169, -231848, 209611, 29086, 132270, 246899, 260231, 188543, 74625, 116242, -143406, 106929, 272424, 241791, 94236, 61341, 211561, 236375, 232389]
17256B32389p933J05910A20036R3161Q2652F338R2776l0620J56370E4612L44283
17245C98895c4663j2781B5545L42441A24855J0068k9614L4507J24455G015L49081
17234C56096a16457j18073A05074C2197J22135J83397L7462L794d8535C70034
17223A58935D6137L89045j57090B9196M592J14771c441B02371r9595P6401l8708
17212A40469A4143M84473A21885M3854l5376L63463r9001O1072D1209O9635E3659
17200I5264b41466A33964J71258B9969K52187K3729j27115J83073A67178p6522
17190I0656L62858a7110A52777J82821J95513j98363E5339J15406j414p9259O4239
17179A54311g0102E7474J17235R1058j13151l1245M2044M25R079k996J28268b29509
$$ y = [232389, 224456, 330366, 120036, 213197, 295849, 6338, 99114, 68494, 224864, 54612, 398895, -34663, -47444, 25545, 367986, 124855, 134923, 105309, 139816, 264271, 7015, 356096, -116457, -234530, 105074, 32197, 154332, 337729, 375191, 378985, -48535, 370034, 158935, 46137, 435182, 278092, 29196, 33788, 148559, -3441, 202371, 102776, 179177, 140469, 14143, 498616, 121885, 165739, 130363, 493826, 394825, 455897, 41209, 110844, 53659, 95264, -241466, 133964, 305222, 29969, 282156, 305885, 178770, 361843, 167178, 90656, 453514, -17110, 152777, 335598, 531111, 332748, 55339, 170745, 169331, 90072, 154311, -70102, 57474, 174709, 265767, 152616, 121371, 163415, 163840, 172919, 169923, 298191, -229509]
17166F0061P3199J18246M5259b37404D53028j28132C2232K4086j0334L71963j57079
17155B60868a84675C31886J2023A07161K23693L9919j57920A04791C9779J28055
17145A67834K95409A23356J5791J73209C7123J6J55538Q6639A32488K00378A38516
17133C40403G7611J55450J45891a05273C43415H9336K53957M4348r8291A13755
17122B92715K5779K9455O8298j73558r3324L84455A38066J31188o7500L04784
17112E06538B33531r6054L841N4979K28392j16867L1787A60331L34525P8404A4957
17100A78591J77063A70439M97174k42796p0201K19513B57176L88967B15507K25739
17090D41246j67126O9888b16108B60152J69085j94761K63552q2126D6425K8907
$$ y = [60061, 133260, 251506, 296765, -237404, 453028, 324896, 32232, 56318, 45984, 417947, 260868, -184675, 331886, 343909, 107161, 330854, 370773, 212853, 104791, 39779, 167834, 463243, 123356, 139147, 312356, 37123, 37139, 192677, 279316, 132488, 332866, 138516, 340403, 77611, 233061, 378952, -105273, 343415, 89336, 343293, 387641, 289350, 113755, 292715, 318494, 347949, 416247, 242689, 149365, 533820, 138066, 269254, 201754, 506538, 233531, 137477, 141318, 196297, 424689, 307822, 339609, 160331, 494856, 573260, 14957, 178591, 355654, 170439, 667613, 424817, 354616, 574129, 257176, 646143, 215507, 441246, 274120, 344008, -216108, 260152, 429237, 234476, 498028, 415902, 46425, 75332]
17080G5332O052M35251B05785J15949m7701m4493K47296A34477M05930j43978
17070C96429j03458n0137J90233l3800J26781k03809J83899b4012E66316j42767
17060D23549J6225p7570j16318L6144j23113J30734M24368l42074q6315J02916
17050C88546A02512J67688J54143J20968q180n6177J1227K99763k85843j93650
17040C12451r148L58679j52007p9032J10841k23102J89743n9191L9869r9164O02151
17029I92090m63190k41609J45301Q5677R3654k02408N8278J90240j28121k28678
17019C01234L20999o8544j39440j79905M33088q2900r7268j60000K15260J29887
17009F72411j65213p9854M7707K54620C35087j21139M76838k94671n5164n3181
$$ y = [75332, 81384, 516635, 205785, 321734, 274033, 229540, 476836, 134477, 540407, 396429, 292971, 242834, 433067, 399267, 526048, 322239, 506138, -24012, 566316, 423549, 439774, 362204, 245886, 282030, 158917, 289651, 714019, 371945, 285630, 388546, 102512, 270200, 424343, 545311, 537131, 480954, 492181, 791944, 506101, 312451, 303303, 661982, 509975, 430943, 541784, 318682, 508425, 449234, 489103, 389939, 992090, 528900, 287291, 432592, 518269, 611923, 409515, 467793, 658033, 529912, 301234, 622233, 553689, 414249, 234344, 667432, 584532, 487264, 327264, 542524, 672411, 507198, 427344, 475051, 729671, 335087, 213948, 690786, 396115, 340951, 287770]
16999B87770K11418j12956L4544K71855l30206K93658J84963j03118k04037K05418
16989G39309j97792k16242J19997L00709Q9158C10272Q38488m68275n6621M4193
16979F68057j29944K31663N6062k35637B93976K61688J01299K0948j47598K63256
16969G93569J78005k11908J5873R8208m13929J50282J82073O4100K9313k79983
16959F05603K15742Q9270q2926j652k14176n842J10683J49930l37572R2735P2455
16948F94250L19879k48660L82791l4923E11387N46343k36578J76666l33676K67241
16938I31383k73180N70341k93963j40355K2438R3802P4990P8215j12214j0222
16928I41235K88954k87519j75625M72259r1710k71715N4333J12416P603P3021
$$ y = [287770, 499188, 386232, 420776, 692631, 362425, 656083, 841046, 737928, 533891, 739309, 541517, 325275, 445272, 745981, 835139, 310272, 1148760, 680485, 623864, 668057, 538113, 769776, 825838, 590201, 293976, 555664, 656963, 677911, 530313, 793569, 971574, 759666, 775539, 873747, 459818, 610100, 792173, 856273, 885586, 605603, 821345, 910615, 827689, 826037, 611861, 606019, 716702, 866632, 529060, 621795, 694250, 1014129, 765469, 1148260, 1113337, 511387, 1057730, 821152, 997818, 664142, 931383, 658203, 1228544, 934581, 794226, 816664, 910466, 985456, 1063671, 951457, 941235, 1230189, 942670, 767045, 1239304, 1147594, 875879, 930212, 1042628, 1050231, 1123252]
16918A123252K49338k1488j17328J72667p5258q584o4448k51783K48892M7280
16908A302540k67616M8414K04056j99337L13915m50461K20172K68935j42026J87507
16898A486099N3907k39092J20442J02198M6761l25796j67053J34391J84206J43042
16888A539105j97932k39656N17919m786L8215n0998j53580M0084j0031J86742
16878A665082l5992K91250o8484j93322K42351j56701m8147K15160O992L6657
16868A954846j9754j60497P5274L39845k18549j71770N6495j4143J60825m2405
16858A960167j10149O08729m52909L95058m08671O17476o03871K16589L04702
16849B527121K65805k01471R9936m41540N77061p2653j76260J3592J21021p1935
$$ y = [1123252, 1372590, 1351102, 1233774, 1406441, 1331183, 1322599, 1258151, 1006368, 1255260, 1302540, 1034924, 1083338, 1287394, 1088057, 1401972, 951511, 1171683, 1440618, 1298592, 1486099, 1540006, 1300914, 1421356, 1523554, 1570315, 1244519, 1077466, 1211857, 1396063, 1539105, 1341173, 1101517, 1619436, 1614650, 1652865, 1601867, 1448287, 1488371, 1478340, 1665082, 1629090, 1920340, 1851856, 1658534, 1900885, 1744184, 1696037, 1911197, 1918189, 1954846, 1935092, 1774595, 1849869, 2189714, 1971165, 1799395, 1855890, 1841747, 2002572, 1960167, 1850018, 2458747, 2005838, 2400896, 1992225, 2609701, 2005830, 2222419, 2527121, 2792926, 2591455, 2691391, 2249851, 2826912, 2754259, 2577999, 2591591, 2712612, 2640677]
16839B640677Q9304J37160k65275J0780M62744l71748K86154P20K6077M84832
16829C501425l93364J25570Q877L71444k06160j37660J96870N9181J84183K95676
16819D006042o7875m34091M61452k13374O61901l85667J53667J06841J02637K57903
16809D649436k55602K07206M25154l92722L54704j52347J12584M34041J19547
16800E502001j27390J07973J72837J47559R5444K02837P9328k03996O86926j90800
16790F472719L62979J5700K01925K25128K81250N1873K05266R0059L02859r2453
16780H117305L32018O65332k50162N36390j7405L26421L92098M18480J73822K32210
16770A0926509N55298M8273J54971M07721P02263K36061O87433m1109N99067R68710
$$ y = [2640677, 2729981, 2867141, 2601866, 2612646, 3075390, 2703642, 2989796, 2990516, 3016593, 3501425, 3108061, 3233631, 3242508, 3613952, 3407792, 3270132, 3467002, 3526183, 3710366, 4006042, 3938167, 3504076, 3965528, 3752154, 4414055, 4028388, 4182055, 4288896, 4391533, 4649436, 4393834, 4601040, 5026194, 4633472, 4988176, 4835829, 4948413, 5382454, 5502001, 5374611, 5482584, 5655421, 5802980, 5898424, 6101261, 6180589, 5976593, 6663519, 6472719, 6835698, 6851398, 7053323, 7278451, 7559701, 7611574, 7816840, 7906899, 8209758, 8117305, 8449323, 9114655, 8864493, 9400883, 9383478, 9709899, 10101997, 10520477, 10694299, 10926509, 11481807, 11530080, 11685051, 12092772, 12795035, 13031096, 13718529, 13677420, 14276487, 15245197]
16760A5245197J12570M15576N31626M62368O64406N19475P30824M73618J281172
16751B0436832O49108O66456Q82139J148506P33256J120948J193316R48361J163589
16742B8942511J317615J663473J433829J616254K014946J545165J776341K363293
16734D2673427K004849K448274K800531K660712K612711L471526L485902M033512
16726F6191444L929133M351983M257569M916125N441231N930484O079749O334563
16718A07432281O890307P607147P565809P745840P905818Q532395P771163Q509251
16710A69960011P589767P433984O626606N829417M706469L307119J798939N91843
16702B07844155j005580k483342m097036n014422o015393p297980p716786p936037
$$ y = [15245197, 15357767, 15773343, 16304969, 16767337, 17431743, 17951218, 18682042, 19155660, 20436832, 21085940, 21752396, 22634535, 23783041, 24516297, 25637245, 26830561, 27778922, 28942511, 30260126, 31923599, 33357428, 34973682, 36988628, 38533793, 40310134, 42673427, 44678276, 47126550, 49927081, 52587793, 55200504, 58672030, 62157932, 66191444, 70120577, 74472560, 78730129, 83646254, 89087485, 95017969, 101097718, 107432281, 114322588, 121929735, 129495544, 137241384, 145147202, 153679597, 161450760, 169960011, 177549778, 184983762, 191610368, 197439785, 202146254, 205453373, 207252312, 207844155, 206838575, 204355233, 200258197, 195243775, 189228382, 181930402, 174213616, 166277579]
16694A66277579q095061q435942q379429p872371p653501p578988p290740o728448
16686A04243099o314858n894263n476346n364865n022863m238220m534566m277219
16678F3119899l168485l591778l308019k816110l056752k577637j982021k383809
16670D0235288k036253j969482k186672j211626j803728j203888j562385j161949
16662B7099305j124365j251745j059501q54358j131252r63607q52185p03031o93322
16653A8465939o86879o43823m69729o99829o83529n50215m07924l98170o10844
16644A3314997k65572m23423n42313k013n74284l08082m00086m77858n09302q6327
16634I725737L5049o01173N2416o28141Q2910l60298l83711J5539l77656o356
$$ y = [166277579, 158182518, 149746576, 141367147, 133494776, 125841275, 118262287, 110971547, 104243099, 97928241, 92033978, 86557632, 81192767, 76169904, 71931684, 67397118, 63119899, 59951414, 56359636, 53051617, 50235507, 47178755, 44601118, 42619097, 40235288, 38199035, 36229553, 34042881, 32831255, 31027527, 29823639, 28261254, 27099305, 25974940, 24723195, 23663694, 22809336, 21678084, 20714477, 19862292, 19159261, 18465939, 17779060, 17135237, 16665508, 15965679, 15282150, 14731935, 14324011, 13925841, 13314997, 13049425, 12626002, 12083689, 12081676, 11507392, 11199310, 10799224, 10321366, 9812064, 9725737, 9760786, 9159613, 9212029, 8583888, 8666798, 8306500, 7922789, 7938328, 7560672, 7554316]
16624G554316l86536Q5981m20315j48694M7921r2793l63938k25958J6012l78194
16614E687802j49489m2153k08926J33668m74786K20723j63559j13309q7195J42943
16604D945719m72567m9519l8517k41069J35527l21568J18571j44088J19649m50163
16594C601975P9036N6931k4752j54474j41420L96121l90034k6337o5198k80076
16584C051772k12736J80132N789j39105O8777K49695l30936K57297l04230j33103
16574B693352J39747j50623l0001j26414j47646m92009M23656J86821K5288q03494
16564A718677K63668M66121l67045J05200P1537k35537Q385k7055j47087J67941
16554B024805j71091K82170n27346j73121M75454j21920o1617k36717J98792M06
$$ y = [7554316, 7167780, 7253761, 6833446, 6684752, 6732673, 6639880, 6275942, 6049984, 6065996, 5687802, 5538313, 5496160, 5287234, 5420902, 4946116, 5166839, 5003280, 4889971, 4802776, 4945719, 4473152, 4423633, 4385116, 4144047, 4279574, 3958006, 4076577, 3932489, 4052138, 3601975, 3681011, 3737942, 3713190, 3558716, 3417296, 3813417, 3423383, 3397046, 3331848, 3051772, 2839036, 3019168, 3024957, 2885852, 2954629, 3204324, 2873388, 3130685, 2826455, 2693352, 2833099, 2682476, 2652475, 2526061, 2378415, 1886406, 2310062, 2496883, 2522171, 1718677, 1982345, 2448466, 2081421, 2186621, 2258158, 2022621, 2031006, 2003951, 1856864, 2024805, 1853714, 2135884, 1608538, 1435417, 1910871, 1788951, 1727334, 1490617, 1689409, 1689815]
16544A689815L500m22401K92263j59681M00162J06249m29261K00916J39023j15976
16534A704609k31789O8787k64051o4094O4345J47079o2067N0757J40482k87831
16524A266227O1226j35465r4500J36548M6773k01131L18685j48907L38233o21521
16514I66168L60258j50694k8739k01950K83185k21899N3123n8321L1362J05679
16504A138172j41240j2572j0020k04995M38002E05903K80888j40789K93579J7188
16494I56769j19237j48023P0411P2113J82515j39518K78646k5617m3686J5990
16484A100363n13230O38509m36419M63677k97984k83310K52307k45456k79207
16475C99250L59066j15503O9606j39202K76649l55810K21475l28401K91984R8094
$$ y = [1689815, 1693315, 1270914, 1563177, 1403496, 1803658, 1909907, 1480646, 1681562, 1820585, 1704609, 1472820, 1541607, 1277556, 1213462, 1277807, 1424886, 1362819, 1413576, 1554058, 1266227, 1327453, 1191988, 1097488, 1234036, 1280809, 1079678, 1398363, 1249456, 1587689, 966168, 1326426, 1175732, 1146993, 945043, 1228228, 1006329, 1059452, 1001131, 1032493, 1138172, 996932, 984360, 974340, 769345, 1207347, 505903, 786791, 646002, 939581, 956769, 837532, 689509, 759920, 832033, 1014548, 875030, 1153676, 1128059, 1084373, 1100363, 587133, 1225642, 789223, 1252900, 954916, 671606, 923913, 678457, 399250, 758316, 642813, 712419, 573217, 849866, 494056, 715531, 387130, 679114, 777208]
16465G77208C56745N51479j12957j65598m9645r135J16943J87445j08514P1513
16455H38276k70951J31866K5250N6901k15992O01741n35419J11748J6151j63370
16445E96201K53445J29596m10718L9994o7705J0795j33876N2411J03967J10942
16435F85052j67278J44880C06526K16567k04519M65176k24277B12846k7057K69355
16425D55144r8569N13248l55557j24937k6465J40295o7147n8040J29443p1166
16415D36249j57169K30660j2121J8041M4685q206n0663K11461A17037L84827J02647
16404F04511r5719J17064r1703k63665O4799j45080K08403J178P0753j15826L6035
16393C90750j43693O63J6480J97811L0374j69626L5814L74890m4970l24222j8443
$$ y = [777208, 356745, 908224, 795267, 629669, 580024, 570889, 687832, 875277, 766763, 838276, 567325, 699191, 724441, 781342, 565350, 1167091, 631672, 743420, 759571, 596201, 849646, 979242, 568524, 608518, 540813, 551608, 417732, 470143, 574110, 685052, 517774, 662654, 306526, 523093, 318574, 783750, 559473, 212846, 185789, 455144, 356575, 869823, 514266, 389329, 362864, 503159, 436012, 377972, 507415, 436249, 279080, 509740, 497619, 515660, 560345, 552139, 501476, 712937, 117037, 501864, 604511, 508792, 625856, 534153, 270488, 335287, 190207, 398610, 399788, 470541, 354715, 390750, 247057, 247720, 264200, 462011, 492385, 322759, 358573, 733463, 688493, 364271, 345828]
16382C45828k3075J79960p8699j31993L4640q0533K9553A27887L73423J5099A66854
16370D95425j70303j35240J77096r480N6910J4023A22261L21776j79754L02763
16360E67046N8157A97722L8836J83979k3694K76356B48875k5122a85359E48777
16349i9647a767C51540j18036J38269A26956M38741j92024A29137J25622j00482
16339A54277L45894k10498J96954j60406j40594K07618A53293K4877J00723O8113
16329C47006A66474L1297J36623A45986J0956J67548F9768K14379J06716J53079
16319E43942B15455h065A95690n5758K9224J52414H7822J1328b05659A04225P2106
16308A76331q3346K77349P765A0860J98005o8348K7923L29578o2537c34842B82508
$$ y = [345828, 322753, 502713, 424014, 292021, 326661, 246128, 275681, 127887, 501310, 516409, 166854, 495425, 325122, 189882, 366978, 357498, 414408, 428431, 122261, 444037, 264283, 567046, 625203, 197722, 236558, 420537, 396843, 673199, 248875, 223753, -185359, 548777, -99647, -1767, 351540, 233504, 371773, 126956, 565697, 373673, 129137, 254759, 154277, 500171, 289673, 486627, 326221, 185627, 393245, 153293, 178170, 278893, 347006, 166474, 197771, 334394, 145986, 156942, 324490, 69768, 284147, 390863, 543942, 215455, -8065, 195690, 139932, 169156, 321570, 87822, 99150, -205659, 104225, 176331, 92985, 370334, 378099, 10860, 208865, 140517, 168440, 498018, 435481, -334842, 282508]
16296A2304L70334j33113N8152n192L8837j26522K39959A07056K14625i6828B63853
16284D49555b34946C25456o9394j6712j09690J78043L29747B52085o9080K89171
16274D72176k07147J19420j59879f2397G0728J06587Q8622j7031o5057K081M9793
16263B35723K12123A19917J50580R0349A10429M15102h3630C6416Q8379N5286
16253A80081J4039J77390a7984B50508G9139C1790I2J31523C6397A6520d32011
16241f0795o3986A57266f4441D8835A1888N0008Q9604b1512B78208C8788L2058
16230G0846K52534f3400B49853q7717G6776Q5823J57166i3213A27713C8265M2519
16219H0784P9930M3271o4466b7006p095p8652C43832H3863e7081c758A86383H4532
$$ y = [12304, 382638, 249525, 307677, 302485, 341322, 214800, 454759, 107056, 321681, -96828, 263853, 449555, -234946, 325456, 256062, 239350, 129660, 307703, 637450, 252085, 183005, 472176, 265029, 384449, 224570, -62397, 70728, 177315, 265937, 248906, 183849, 185930, 235723, 447846, 119917, 270497, 360846, 110429, 525531, -83630, 36416, 124795, 180081, 194120, 371510, -17984, 250508, 79139, 31790, 92, 131615, 36397, 16520, -432011, -60795, -124781, 157266, -64441, 48835, 11888, 61896, 151500, -21512, 278208, 38788, 70846, 323380, -63400, 249853, 162136, 76776, 162599, 319765, -93213, 127713, 38265, 80784, 160714, 203985, 139519, -27006, -34101, -112753, 343832, 83863, -57081, -3758, 186383, 84532]
16206a84741A69813p2604c1690G5514J08644J2447J111J18227D4932A1266M14601
16195D25867A68032f4593L0421B23087l090M2692j27782R0154F0742i7373l7972
16184a35345r4250B81690A16391J75915r4472b3086I9623J9554k1039K58346k8346
16173C28138K751E64b3781A95927Q5847A17312n1982L6260B7427J82659J49255
16162C59341L6573a64903A92010n3628k6644i5572B41707j13803B6410M3257N7285
16151A26952J29029A9655d3604C79770j16670a9068I3672a6095A0128O7408J66952
16140B44488b9122g806H2930L58805f9226J7432k75494A55823o1890F879b24316
16128F8958J4481d4322B05042G6515k6935J70540K236f1255B94888b17019e0599
$$ y = [-184741, 169813, 97209, -31690, 75514, 184158, 196605, 197716, 315943, 44932, 11266, 425867, 168032, -64593, -34172, 223087, 219997, 262689, 134907, 225061, 60742, -97373, -135345, -229595, 281690, 116391, 292306, 197834, -23086, 99623, 119177, 98138, 356484, 328138, 330889, 564, -23781, 195927, 281774, 117312, 65330, 101590, 27427, 210086, 359341, 395914, -164903, 192010, 138382, 111738, -95572, 241707, 127904, 26410, 69667, 126952, 255981, 19655, -43604, 379770, 263100, -19068, 93672, -16095, 10128, 77536, 244488, -29122, -7806, 82930, 441735, -69226, -51794, -327288, 155823, 93933, 6879, -224316, 68958, 83439, -44322, 205042, 76515, 49580, 220120, 222356, -61255, 294888, -217019, -50599]
16116F954a17819d6385j15697D3499c35620A5573K980i3090B64736m506a36633
16104b40948P7352B96565H3122l4427A2770c58851F5046K5781k9493K58784j25495
16093A94623k8451c74363e451E6291M65376i3460H0904C3453K60475j5302G785
16081A50746E3037J0442Q3995B8729a85608q1673i934j98350b0434A01780b27708
16069H9996M1586J00108J25315c5573B16592a31509L6775J3967D1578b26278A89288
16057b40524E6375Q3056E9488a50931F4165K3886J5534d768A28757c70090f9723
16045A07783a23671p1615d6277D35807F3314a63055K0270G4008J76708b06790
16034b20267H3095k1590b30991M8948A12848b27256g3367A2455b19748B60558
$$ y = [6954, -117819, -46385, -162082, 43499, -335620, 15573, 18553, -93090, 264736, 260230, -136633, -240948, -163596, 296565, 83122, 48695, 12770, -358851, 65046, 90827, 61334, 320118, 194623, 166172, -374363, -5451, 56291, 521667, -93460, 80904, 33453, 293928, 278626, 7785, 150746, 53037, 63479, 147474, 28729, -185608, -267281, -9934, -208284, -20434, 101780, -227708, 89996, 131582, 231690, 357005, -35573, 216592, -131509, -94734, -80767, 41578, -226278, 189288, -240524, 56375, 139431, 59488, -150931, 64165, 88051, 103585, -4768, 128757, -370090, -69723, 107783, -123671, -195286, -46277, 435807, 63314, -163055, -142785, 74008, 250716, -206790, -220267, 83095, 61505, -230991, -182043, 112848, -227256, -73367, 12455, -219748, 260558]
16023B69336k8372a61936I8302A0018e220j71681j59493J55693F019b3504A99030
16011A08726M3330J64957b4574j25527K0828A38319e22569G6236J5025i3099m5247
16000a38346M0450K4379r1335G6782P6670l6569P2941a78621M0481I9568K9551
15989A29119b65521L0524j39776F0510a5891k51292l9824I7894k9563J21134h9703
15977C05856A05117a34905L9192I0340K0356k0782R0624a42006I8002g9858k91829
15966c71687a23671L0470A1428O3154e9802l1967B12215a39860l6076f6364m233
15955g0597B20343G5971N241r405A0392a83732j8009C8164a97935e5402r5645
15944a51047b0408j72021h5922k46626f7699j9032A17041D0556J10862a02986
$$ y = [269336, 240964, -161936, 98302, 10018, -5220, -176901, -336394, -180701, 6019, -23504, 199030, 108726, 152056, 317013, -24574, -150101, -129273, 138319, -522569, 76236, 91261, -93099, -138346, -97896, -73517, -164852, 76782, 153452, 116883, 189824, -178621, -138140, 99568, 129119, -265521, -234997, -374773, 60510, -15891, -267183, -307007, 97894, 68331, 189465, -89703, 305856, 105117, -134905, -95713, 90340, 110696, 89914, 180538, -142006, 98002, -79858, -371687, -123671, -93201, 11428, 74582, -59802, -91769, 212215, -139860, -175936, -66364, -70597, 220343, 75971, 81212, 71807, 10392, -183732, -201741, 38164, -197935, -55402, -151047, -20408, -192429, -85922, -332548, -67699, -86731, 117041, 40556, 151418, -102986]
15933I4975C7320b07708k213g1361j1366A76461J20757I805M32872A77568K963
15922A80531J3114g5762L083A84080p4521k5839a39700k31989c309r9289a4824
15910a310A23900r724j2814d02676A0417h5170k69834a7103k31861P395O4487
15899a77082f2416k0735B33361a83773A14272j7663b53196R3108F0873f7213G888
15887F1162g8789q442n1654M9903k13911i9179D8489a32943N1863p0911N8368
15876i3623L4909D7411a82432A67332a64503c9329G2942J93587p3043c83161A35482
15864B54286a62177o0173D5437J80775G6109a62299L7832k13948J33742M7926
15854a56747l2526A13120a48273k76831a76262P068B83406g977C2823h5419b7281
$$ y = [94975, 37320, -207708, -209921, -71361, -82727, 176461, 297218, 9805, 442677, 177568, 180531, 193645, -75762, -72679, 184080, 109559, 83720, -139700, -371689, -3309, -102598, -14824, -1310, 123900, 114176, 101362, -402676, 10417, -85170, -355004, -17103, -248964, -241569, -177082, -62416, -83151, 233361, -183773, 114272, 96609, -253196, -160088, 60873, -67213, 7888, 61162, -78789, -87231, -138885, -88982, -302893, -99179, 48489, -132943, -81080, -151991, -93623, -58714, 47411, -182432, 167332, -164503, -39329, 72942, 266529, 193486, -383161, 135482, 254286, -162177, -222350, 45437, 226212, 76109, -162299, -124467, -338415, -204673, -156747, -189273, 113120, -148273, -425104, -176262, -169194, 283406, -7977, 32823, -85419, -27281]
15842d06276C8721E725a26181k36133C4261J57065o9476E432O9453a14885J9665
15831i5220A73400e2665A10499E4603A3270a44574C6884d9265H8229N5078D610
15819b59372B45093H4993M522J24297c19208B9548a52024j58157a3432A74933
15808A18635b41281c4470r5750B1164b03525O3996e2402r9361l6074f1896j29048
15797a90944A88291G6469f1031B1900b85847C0369g6135H2526b40241D02402a0872
15785C56224a88077A40360N185J30420a30542k17025a21160I8158c71873A21793
15774d3172j03183j47127A05378a65675j13932c5592E8185c321B20683A0183P4203
15763H4386d13119d3115j14604A75432H72K50033I6952b61982a03422H4871A984
$$ y = [-406276, 38721, 5725, -126181, -362314, 34261, 191326, 121850, 5432, 74885, -114885, -95220, 173400, -52665, 110499, 54603, 13270, -144574, 36884, -49265, 88229, 143307, 4610, -259372, 245093, 84993, 89515, 213812, -319208, 29548, -152024, -310181, -13432, 174933, 118635, -241281, -34470, -130220, 21164, -203525, -139529, -52402, -151763, -187837, -61896, -190944, 188291, 76469, -61031, 21900, -285847, 30369, -76135, 82526, -240241, 402402, -10872, 356224, -188077, 140360, 145545, 275965, -130542, -347567, -121160, 98158, -371873, 121793, -43172, -146355, -293482, 105378, -165675, -279607, -35592, 58185, -3321, 220683, 10183, 84386, -413119, -43115, -157719, 175432, 872, 250905, 96952, -261982, -103422, 84871, 1984]
15751b51411A15384c73569a64658G3784a1937A24247b15632A87565A7137m685
15741A2452O9865e007k12864B5565b46765F941J17391a71307Q4572j77980C3903
15729d96291a45434g734G1483J50405a27509O3615a0913j53317C3387a29447g204
15717f1166B89353a43701E9350a31424D9772J7371h4903a81l11404G5832b2039
15705e1315C07756c45374a34113A38928a02546j72048a0516k4206C69138h6073
15694a20560N2123A11351a11088k10838q5925h0822F1822b32356B06820D1624
15683E6801J15688a74227c861F4757b2925q9946q3221l1849A10196D0925K04469
15672B45394a02246G748b84737d1213j11685a3694n1770I2870h212B10630h5714
$$ y = [-251411, 115384, -373569, -164658, 73784, -11937, 124247, -215632, 187565, 17137, 12452, 82317, -5007, -217871, 25565, -246765, 6941, 124332, -171307, -86735, -264715, 33903, -496291, -145434, -7734, 71483, 221888, -127509, -63894, -10913, -164230, 33387, -129447, -7204, -61166, 289353, -143701, 59350, -131424, 49772, 67143, -84903, -181, -311585, 75832, -22039, -51315, 307756, -345374, -134113, 138928, -102546, -274594, -10516, -34722, 369138, -86073, -120560, -68437, 111351, -111088, -321926, -407851, -80822, 61822, -232356, 206820, 41624, 56801, 172489, -174227, -3861, 64757, -22925, -112871, -196092, -227941, 110196, 40925, 245394, -102246, 7748, -284737, -41213, -152898, -13694, -65464, 92870, -8212, 210630, -85714]
15660c450B23122B6422c85296A37711a72582A65244b16756k13668A3001h5717
15649f3440H0567a50711J590F7657a32364B05504i0475l7398k0355j18807B15505
15637E2159a29427F9759b58826J27122j30390I1145f5465k4620E9341B5851J49418
15626A75269a32923C15304a1305H251b30002o1840l7008a14070A71507E0666L06187
15615C56853a58740L6027A54737B0419K31942f8574B00968c09039J51770A23245
15604B03243e1317A67032q976i3107j6095p7842m3681c5535j01743L5843D7907
15592d4458B04753a25469A22750a23451j63057G7230f8295C6653g6848o3106C51234
15580b30965k7782b8242C00089a32878O3184K688F6802e5019p0675A97472A720
$$ y = [-3450, 223122, 26422, -385296, 137711, -172582, 165244, -216756, -430424, 13001, -85717, -63440, 80567, -150711, -149121, 67657, -132364, 205504, -90475, -127873, -148228, -267035, 215505, 52159, -129427, 69759, -258826, -131704, -262094, 91145, -65465, -90085, 59341, 25851, 175269, -132923, 315304, -11305, 8251, -230002, -291842, -328850, -114070, 171507, 50666, 356853, -158740, -122713, 154737, 20419, 252361, -68574, 200968, -309039, -157269, 123245, 203243, -51317, 167032, 158056, -93107, -109202, -187044, -230725, -35535, -137278, -101435, 47907, -44458, 204753, -125469, 122750, -123451, -286508, 77230, -68295, 36653, -76848, -139954, 351234, -230965, -258747, -28242, 300089, -132878, -69694, -67006, 66802, -55019, -125694, 197472, 1720]
15568d7168r9144a8592p5811K5031j22297a4414k12245d4160l05556o9587A74390
15556d213C2846a58315I6798a01364j0901j33105A01403B3866N7323J7183B2484
15544b13921G2104K46870a98693i4670c8671A00033d7621A37780g4994j66933
15534b41927K9662G9656R6651a94648E1354R5151A736b07247B4423a09770B98332
15522a66213N2854m8557m5657m6488p486a23506b6457k48081g2393L5181k15873
15511b53085a20865k02940H0455K23892j06564c98243e2204j41290D88549D0314
15500b11611A74922f2978A50076F0031b53534f6780k6275A86138G0980J2361j9684
15489F3657e706A5453b69809E119b04028H9814e3203m2409j03546D6233M050J47641
$$ y = [-47168, -146312, -18592, -94403, -69372, -191669, -14414, -226659, -44160, -349716, -419303, 174390, -4213, 32846, -158315, 96798, -101364, -112265, -245370, 101403, 23866, 81189, 98372, 22484, -213921, 72104, 318974, -198693, -94670, -38671, 100033, -47621, 137780, -74994, -241927, -212265, 79656, 176307, -194648, 51354, 146505, 1736, -207247, 24423, -109770, 298332, -166213, -113359, -161916, -207573, -254061, -261547, -123506, -26457, -274538, -72393, -37212, -253085, -120865, -323805, 80455, 304347, 197783, -398243, -52204, -193494, 488549, 40314, -211611, 174922, -62978, 150076, 60031, -253534, -66780, -93055, 186138, 70980, 83341, 63657, -5706, 15453, -269809, 5119, -204028, 89814, -53203, -95612, -199158, 46233, 50283, 197924]
15477A97924a26380j00078f3266B7865b0676p7297L6994j33893B1839K51866b71481
15465E7993O4384h7828B92513H222L06063d3857B31830b4642k9139k0285l7433
15454a11499A04225a50324E5598K67583A12016K85989a07177A37961N145l8098
15444A05008l0997b03192H3695J15937D3090J70493n0800i5135A34742G724g0782
15432D6871P369A5774e5464C66919C4975a97065C1004H404N7720i5329j74008
15421b69337j512G7043L731c48355a46255l3180B93803b03128k3164Q4054A55092
15409a78740H2160J09015a52048m3546g4006L2289n6757D8424J40079P0932A05164
15397a2513j66661m037B60484F6654a91086A09221h0532I7596c40165H783b61435
$$ y = [197924, -126380, -226458, -63266, 27865, -20676, -97973, -60979, -194872, 21839, 273705, -271481, 57993, 122377, -87828, 292513, 8222, 314285, -43857, 231830, -24642, -53781, -74066, -111499, 104225, -150324, 55598, 323181, 112016, 398005, -107177, 137961, 143106, 105008, 74011, -203192, 83695, 199632, 43090, 213583, 162783, -95135, 134742, 7724, -70782, 46871, 54240, 15774, -55464, 366919, 34975, -197065, 31004, 8404, 66124, -95329, -269337, -270849, 77043, 80774, -348355, -146255, -179435, 293803, -203128, -226292, -142238, 155092, -178740, 82160, 191175, -152048, -195594, -74006, -41717, -98474, 48424, 188503, 259435, 105164, -12513, -179174, -183211, 260484, 66654, -191086, 109221, -80532, 97596, -340165, 8783, -261435]
15385b5167B38952o0846a83850B1210k384J33240B2963J11370j1616q922B9981
15373h1529B1597a29990p7223N6196B134a34283j44782i5796m88221b2149k41891
15362b64040F2582a77506h3305J6538A3154K19363I9486g8944j68065D02360a39341
15350F163b10664A12223d7266A16637a95338A83050a18206m11875B03509A1311
15339E7270K09186I4608L79184A84284e0729a2772j71440A46880G2068K1301J58503
15328B51872k7664D1839a76987e0035A83819j4482f3686D3037a14238A18543a13577
15316a18061j17630a17397d2412A55484Q5742b48984A3283a72933g1807L1846
15306c9961n3744a6141O354A71993a42504C5525e8350m8382b8813C154a50063
$$ y = [-25167, 238952, 178106, -183850, 21210, 18826, 152066, 22963, 134333, 122717, 113795, 29981, -81529, 21597, -129990, -207213, -151017, 2134, -134283, -279065, -95796, -584017, -22149, -264040, 62582, -177506, -83305, -66767, 13154, 232517, 99486, -78944, -247009, 402360, -139341, 6163, -210664, 112223, -47266, 116637, -195338, 183050, -118206, -530081, 203509, 11311, 57270, 266456, 94608, 473792, 184284, -50729, -12772, -184212, 146880, 72068, 93369, 251872, 224208, 41839, -176987, -50035, 183819, 169337, -63686, 43037, -114238, 118543, -113577, -118061, -235691, -117397, -42412, 155484, 241226, -248984, 13283, -172933, -71807, -39961, -93705, -16141, -9787, 171993, -142504, 35525, -58350, -106732, -28813, 3154, -150063]
15294a21801B05288p7029j296F584d34646B61639j24120c55011g645l6746J0861
15283c3530l22807F0134j9598b9175j86438A93873J26293a50231C62598a44139
15272C44985A72350L5468e9280b5395m2413I9003c4091k20454f4855A89260b5140
15260H0461J6076J27091a46336O0682B28825B5942K7073k6068d37843b18019C74956
15248a50513A33077n312D7956g4729k21638E10828E3989J60517C5765K15942a02346
15236D52613E9298B5736O6861L2888g7720n9290C6779Q4478D4129J34262J47488
15225C25879c22697O1799B310L99062b8346j33824e2225K3597D54833d6519A42943
15213A34233K04963a38855a9702r689A40015c19907C9262J58334b56054H8257
$$ y = [-121801, 205288, 128259, 126963, 6584, -434646, 261639, 137519, -355011, -7645, -44391, -33530, -356337, 60134, 40536, -29175, -215613, 193873, 320166, -150231, 362598, -144139, 344985, 172350, 207818, -59280, -25395, -67808, 99003, -34091, -254545, -64855, 189260, -25140, 80461, 96537, 223628, -146336, -85654, 228825, 25942, 53015, 26947, -437843, -218019, 374956, -150513, 133077, 127765, 47956, -74729, -296367, 510828, 53989, 214506, 35765, 251707, -102346, 452613, 59298, 25736, 92597, 125485, -77720, -137010, 36779, 121257, 44129, 178391, 325879, -322697, -260898, 2310, 401372, -28346, -162170, -52225, -28628, 454833, -46519, 142943, 134233, 339196, -138855, -19702, -29391, 140015, -319907, 39262, 197596, -256054, 88257]
15202C64850h7211C548L95517A7102L1659J08601a22900C6385J75422j00014D1780
15190B06917i3900B5498M27730E9663J29188D0592K29686e333A71566E0498A3725
15178A07840E1061a24265d5513A80779p4252P8750D3517K04974Q2884A21437a6441
15166A70719O047B7644h5958G4338J42899c8802I7357J32329b82845A15639a5421
15154a0082C016a21456A67659e4751E3428R727J40050M8842q6840J28D65K49093
15142B49558O8074K8980b40429C58575a08334B36688a44508j30397C50342c3715
15131B19383I1110K14863f8449B7056J6728A3729f8606J3283A59795a50848l5968
15120a86816B84283r91q6802m5748A0263b64769A48163l5000A5294M7587L43428
$$ y = [364850, -87211, 3548, 399065, 17102, 48761, 157362, -122900, 36385, 211807, 111793, 41780, 206917, -93900, 25498, 453228, 59663, 188851, 40592, 270278, -5333, 171566, 50498, 13725, 107840, 51061, -124265, -45513, 180779, 106527, 185277, 43517, 248491, 331375, 121437, -16441, 170719, 176766, 27644, -85958, 74338, 217237, -38802, 97357, 229686, -282845, 115639, -15421, -10082, 3016, -121456, 167659, -54751, 53428, 63155, 203205, 252047, 165207, 165335, 465, 249558, 317632, 346612, -240429, 358575, -108334, 236688, -144508, -274905, 350342, -33715, 219383, 91110, 305973, -68449, 27056, 43784, 13729, -68606, -55323, 159795, -150848, -186816, 284283, 283292, 196490, 150742, 10263, -264769, 148163, 113163, 15294, 62881, 406309]
15109D06309F4979J80141J36474j60803n9816N0051J8606M0370F0763J70234a39546
15097C30225f6072A68974k8059J10000f3913B57905c0314C32331k1898e1864C968
15085c11713A73535E4830g7369B31452g0463A73089J40359A30433g8217A02541
15074a80835A50856l7645D7851J90775F5049a08412a7178B53612l002L1928A00517
15062C89085A86550m7650J87487n8566j27739K00810A56151L7947J4347A833N8377
15051F0210N0638l6362J56991D8392K85312I0687C1002K9313M45051k49516j09854
15040A45996K66133E42K05711a27545F3230K09010f4995C62684j13805G645O4178
15029G1823J17003J53493A45928J00537K08329B27142K0869K10713B00249c10929
$$ y = [406309, 64979, 245120, 381594, 220791, 160975, 211026, 229632, 270002, 60763, 230997, -139546, 330225, -66072, 168974, 140915, 250915, -63913, 257905, -30314, 332331, 310433, -51864, 3968, -311713, 173535, 54830, -77369, 231452, -70463, 173089, 313448, 130433, -78217, 102541, -180835, 150856, 113211, 47851, 238626, 65049, -108412, -17178, 253612, 250610, 282538, 100517, 389085, 186550, 138900, 326387, 267821, 140082, 340892, 156151, 194098, 208445, 1833, 60210, 110848, 74486, 231477, 48392, 333704, 90687, 31002, 60315, 505366, 255850, 145996, 412129, 542, 206253, -127545, 63230, 272240, -64995, 362684, 248879, 7645, 71823, 188826, 342319, 145928, 246465, 454794, 227142, 248011, 458724, 200249, -310929]
15018b28197a3719B76541j32562d8113D43823A49757O5432j6957F7756J02881
15008A70637d0115D6031e2744k5384A25265J26551J61402h5824A05399D3288K34306
14997B77594G8177L14156m6194p0938l55J31934M3580B23723J93294J0468n2266
14986C75219b26408a3015B2057L77592Q7308j69116l0615a63034D13250j52478
14976B60772L33053k15273L1174j43147K6755J6607J38988k12629r8248K40625
14966C78677b25780A3220d5053D78711n7740A3058M10692k5180j10853M2801J75650
14955E06168B46465K43073I8436J93763C1509N7065J25401K39569n1677j13164
14945B88703D7273K943L10308A44667M00199G7252L36645J74116k44341G6053
$$ y = [-228197, -13719, 276541, 143979, -48113, 443823, 149757, 215189, 198232, 67756, 170637, -40115, 46031, -52744, -78128, 125265, 251816, 413218, -85824, 105399, 43288, 277594, 78177, 392333, 346139, 275201, 274846, 406780, 450360, 223723, 417017, 427485, 375219, -226408, -13015, 22057, 399649, 486957, 317841, 287226, -163034, 413250, 260772, 593825, 378552, 409726, 266579, 293334, 309941, 448929, 236300, 138052, 378677, -225780, 13220, -45053, 478711, 420971, 13058, 423750, 398570, 287717, 330518, 506168, 246465, 489538, 98436, 292199, 31509, 88574, 213975, 453544, 401867, 288703, 47273, 50216, 360524, 144667, 544866, 77252, 413897, 588013, 343672, 76053]
14934D3925K80919R7009H8777J7650e8051l0214A04490K62642j35136G4144A1287
14922C17227j1117A52692L68284p6626k20157L7386K1484M282M7931J15234A66800
14910D3928L138M503J46703K81309B28631G6932l221L07825j22245R8634j12907
14899B45018k6495Q0864L21923k47269j80742J70017H4669J1865O17377B71235
14888C87611n775B7222J53575L3120K05720j51041j08246F7228Q8631L09548K378
14877D67785k15502J7568R4106B531L65192R5251A04944k1338q776K48534K60396
14866E83760j75202E3209L22832j32823J82800B09922N6960J91555j34676K8073
14856C51834J09445K20805k84426n5480Q3412K74535A07413J98710L72760q1790
$$ y = [43925, 324844, 421853, 88777, 106427, -58051, -88265, 104490, 367132, 231996, 74144, 11287, 317227, 306110, 152692, 520976, 444350, 224193, 261579, 283063, 287345, 335276, 450510, 166800, 43928, 47066, 51569, 198272, 479581, 228631, 76932, 73711, 381536, 259291, 357925, 245018, 218523, 299387, 621310, 374041, 193299, 363316, 84669, 96534, 713911, 271235, 387611, 381836, 27222, 180797, 213917, 419637, 268596, 160350, 67228, 155859, 465407, 467785, 252283, 269851, 363957, 2531, 367723, 462974, 104944, 83606, 74830, 323364, 583760, 408558, 53209, 376041, 243218, 426018, 209922, 266882, 458437, 323761, 351834, 461279, 682084, 397658, 342178, 425590, 700125, 107413, 306123, 678883, 597093]
14846E97093k59623l2316J29319k08387K02268j8220q820J12044A18023L29244
14836D47267k21175M87724k13545A7900M06048K70143A92783K39175m0990j76557
14826B14411J03453K06351k39586K34194P8220k33155L65829j07329j85682J42935
14816E79641B49093K07337L8755J00364j29668K64046A94155J78009K38941l6916
14806E74189j97722k1973j38317L78916k31956P3901j16812K25882j78632J44338
14796E11814M4160l7200o8976K81158l4466k88440B9027P91737D03208p8688L56522
14785F81042k38145R8058q3872P4770q8831j3461m6993M00758C29419K42823j27582
14774D44660J17744j8529L14629k95907K215j9087j33164J62737q897k00065J63629
$$ y = [597093, 337470, 305154, 434473, 226086, 428354, 410134, 401314, 513358, 118023, 447267, 226092, 713816, 500271, 17900, 423948, 694091, 192783, 431958, 390968, 214411, 317864, 524215, 284629, 518823, 597043, 363888, 729717, 622388, 436706, 579641, 249093, 456430, 495185, 595549, 465881, 729927, 194155, 372164, 611105, 574189, 376467, 354494, 216177, 595093, 363137, 437038, 320226, 546108, 367476, 511814, 555974, 518774, 449798, 730956, 696490, 408050, 29027, 820764, 403208, 324520, 681042, 442897, 540955, 457083, 531853, 443022, 429561, 382568, 783326, 329419, 572242, 444660, 562404, 543875, 858504, 562597, 564812, 545725, 412561, 575298, 566401, 366336, 529965]
14763E29965J59620m4227m820k21335j00701K67103k30226l059K53042J36648
14753G42010L8497M3989k39615q1257J45842k088M204L42857j73535l25015L8648
14742E34537p5040Q1817J53002m4829j13240J82796k77413J24683M17783m6098
14732I37998D48204J01442N16808J9173m63896J38199k28896L90380k54155K6852
14722F94111N2227P1440L7332k23737k01867K48899J22337O2704l82323N8980
14712E40103m3835L24377j1759q5670J90123k40957J13820j97869M5333M11888
14702A045554l96641r5128j1970J46675k6241L06964m46922K16692J07267j0214
14692H36036j56617J84831p2808J34253L6376k75237M0794O2401J03144L29235
$$ y = [529965, 689585, 645358, 640538, 419203, 318502, 585605, 355379, 352320, 605362, 742010, 780507, 824496, 584881, 503624, 649466, 647378, 651582, 994439, 820904, 495889, 534537, 459497, 541314, 694316, 649487, 536247, 719043, 441630, 566313, 984096, 937998, 448204, 549646, 1066454, 1085627, 621731, 759930, 531034, 921414, 667259, 694111, 746338, 817778, 855110, 631373, 429506, 678405, 800742, 863446, 481123, 540103, 496268, 820645, 808886, 723216, 913339, 672382, 786202, 588333, 633666, 1045554, 648913, 553785, 541815, 688490, 662249, 969213, 522291, 738983, 846250, 836036, 679419, 864250, 791442, 925695, 962071, 686834, 727628, 790029, 893173, 1222408]
14682A222408m51169K08148o2747k26784O6803j30907J02896K10841k63777J12007
14672G87719L49761l18447J85830j92965j07816K55482m1580K92728k60424K44352
14662A194640l01203K30951j02601o8353k41553L74496n2994j83360L11020J43494
14652A304537k99302q4589L22514o8352j01901O2633O7897J85462k81387j20179
14642I87333j61830N26634l3810p2901M5953l43220J81317j57364L86168O377
14632A364657j46435k60441L19049l49531N12514J47439k35972j57355K2698m5876
14622A170747k5418J01471j60808K98060j875m322l44450M12910j7800k23535
14612A204980P7968j30881R8349J81911J24623j17828P0377m02356N85979j47802
$$ y = [1222408, 771239, 979387, 916640, 689856, 756659, 625752, 728648, 939489, 675712, 787719, 1137480, 819033, 1004863, 811898, 704082, 959564, 917984, 1210712, 950288, 1194640, 893437, 1124388, 1021787, 953434, 711881, 1086377, 1033383, 850023, 1161043, 1304537, 1005235, 920646, 1243160, 1174808, 1072907, 1135540, 1203437, 1388899, 1107512, 987333, 825503, 1352137, 1318327, 1245426, 1291379, 948159, 1129476, 972112, 1358280, 1364657, 1218222, 957781, 1276830, 927299, 1439813, 1587252, 1351280, 1193925, 1216623, 1170747, 1145329, 1246800, 1085992, 1384052, 1382177, 1377855, 1033405, 1446315, 1428515, 1204980, 1282948, 1152067, 1250416, 1432327, 1556950, 1439122, 1509499, 1107143, 1693122, 1545320]
14602A545320K3302r0962n4582m4154J59422J75331P4999n44223J77802K08427
14592A630682k30631l2466J99889m616j47911O18669n80624L3935K77568p8570
14582A685925P907l521l23245M0774J01137m231L93290j4214L1576J01737J78270
14571B195405l98440l5677J26496L98407j47710J21776j16555k62637K47949m53224
14561A675790L06145O2544j53222K36532j10858j58792K82141j55666J42221K11383
14551B338218p1626K64963j92286K26918j05216K56134J20499J29651K25063M5920
14541C238238N56641j0017K39125N33375P46033O77084J227684K183167L490049
14532A2881379N744810P832088M068437j0095086q404075m375756k311883j109777
$$ y = [1545320, 1568622, 1477660, 1423078, 1378924, 1538346, 1713677, 1788676, 1244453, 1422255, 1630682, 1400051, 1367585, 1567474, 1562858, 1414947, 2033616, 1452992, 1486927, 1764495, 1685925, 1693832, 1690311, 1367066, 1407840, 1508977, 1504746, 1898036, 1883822, 1915398, 2017135, 2195405, 1796965, 1761288, 1887784, 2286191, 2138481, 2260257, 2143702, 1881065, 2129014, 1675790, 1981935, 2044479, 1891257, 2127789, 2016931, 1858139, 2140280, 1984614, 2126835, 2338218, 2266592, 2531555, 2339269, 2566187, 2460971, 2717105, 2837604, 2967255, 3192318, 3238238, 3794879, 3784862, 4023987, 4557362, 5303395, 5980479, 7208163, 9391330, 12881379, 18626189, 26458277, 30526714, 20431628, 12027553, 7651797, 5339914, 4230137]
14524D230137r43702j9507j67489j95827n60243L47837k02111j27539M20956j79838
14514B602674l14707K25547l19279J63459n8211J15309k87955M97499k80180J05799
14504B449955L85627J440m37113M73497P5875k41858M23705n37285L3152J84038
14494B811033j37690L35275p566o9824j51743L16719m21180L94563p2538L06288
14484C303337l5935J37082k26051J37409M54750n35469r78k3798M39638n0610
14474C599375J74953k13196k25099K90484n6448K05505K57704L06141q17220L90816
14464C913015J26351N5737j35063K82013j44236Q5492j41179J63497K19002q4976
14454D339653J12318j52753j01030L01579M30779k71782K61627p9726O765J23200
$$ y = [4230137, 3286435, 3266928, 3099439, 2903612, 2343369, 2691206, 2489095, 2361556, 2782512, 2602674, 2287967, 2513514, 2194235, 2357694, 2299483, 2414792, 2126837, 2624336, 2344156, 2449955, 2835582, 2837022, 2399909, 2873406, 2949281, 2707423, 3131128, 2593843, 2626995, 2811033, 2673343, 3008618, 3001052, 2931228, 2779485, 3096204, 2675024, 3069587, 2997049, 3303337, 3267402, 3404484, 3178433, 3315842, 3770592, 3235123, 3234145, 3210347, 3649985, 3599375, 3774328, 3561132, 3336033, 3626517, 3570069, 3775574, 4033278, 4339419, 3522199, 3913015, 4039366, 4095103, 3960040, 4242053, 4097817, 4183309, 4042130, 4205627, 4424629, 4339653, 4451971, 4299218, 4198188, 4499767, 4930546, 4658764, 4920391, 4840665, 4847430, 4970630]
14444D970630l65013O01598N9493j81989P8213J58514j04695K00801J06267k46445
14434E277374K38254K69965p4618K2352J34330R1541k75758M70431K7714J5177
14424F196762K81178l47378L73855r602R6196K01052j63524o9102L4930K79028
14414F873395K80475k5003L56401r6048L49321k50936L15755l03926L27215J9631
14404G846280n3158M57570j41617M10465L3499N6182K99436o8288L68028K3794
14394I232191Q381L23211O5876M74837j42848L5046P24699l94909M3465O67979
14384A1037928J40063j60894K51153L45921Q5242K88226R8174L35665L830M17373
14374A2842681J23090J17008M21196J95852M75018k60268M18044M86444k25232
$$ y = [4970630, 4605617, 5207215, 5266708, 5084719, 5162932, 5321446, 5216751, 5417552, 5523819, 5277374, 5515628, 5785593, 5710975, 5733327, 5867657, 5959198, 5683440, 6153871, 6181585, 6196762, 6477940, 6130562, 6504417, 6494815, 6591011, 6792063, 6628539, 6559437, 6594367, 6873395, 7153870, 7128867, 7485268, 7389220, 7738541, 7487605, 7803360, 7499434, 7826649, 7846280, 7793122, 8250692, 8109075, 8519540, 8553039, 8609221, 8908657, 8840369, 9208397, 9232191, 9240572, 9563783, 9629659, 10104496, 9961648, 9996694, 10721393, 10326484, 10369949, 11037928, 11177991, 11017097, 11268250, 11614171, 11699413, 11987639, 12085813, 12421478, 12425308, 12842681, 12965771, 13082779, 13503975, 13699827, 14174845, 13914577, 14332621, 14819065, 14593833]
14365A4593833N78201L50465O34906J9953j32280Q23177K19585K55589M87716
14356A7831145p8202P53000L57536Q1143Q03511M82835K69680K02120M71787P66363
14346B1940918K29350K97702O74381M73211N91427O97914K69405R17012M46851
14337B6538171P67062M88353R70631J72430Q26076J233819N66955O10023J307176
14328C3480696P12928P86558J228336N37561J406592J070752Q20720J580228J506199
14319D3130570M86261J661126J532579J609243J373811J280065J722236J823148
14311E4619039J642272K026108K251305K031735K203259K364137K615390K363901
14303G2117146K648956K621195L077140L187141L609661L313042L967738L793908
$$ y = [14593833, 15172034, 15522499, 16157405, 16177358, 16045078, 16868255, 17087840, 17343429, 17831145, 17752943, 18505943, 18863479, 18944622, 19748133, 20230968, 20500648, 20702768, 21174555, 21940918, 22170268, 22467970, 23142351, 23615562, 24206989, 24904903, 25174308, 26091320, 26538171, 27305233, 27793586, 28764217, 28936647, 29762723, 30996542, 31563497, 32173520, 33480696, 34193624, 34980182, 36208518, 36746079, 38152671, 39223423, 40044143, 41624371, 43130570, 43616831, 45277957, 46810536, 48419779, 49793590, 51073655, 52795891, 54619039, 56261311, 58287419, 60538724, 62570459, 64773718, 67137855, 69753245, 72117146, 74766102, 77387297, 80464437, 83651578, 87261239, 90574281, 94542019, 98335927]
14295I8335927M176426M210578M744907M536105N043971N609151N894650O173370
14287A38725085O468152O969212P435955P756561Q018566Q962508Q847823J0161685
14279B03345547J0521621J0625920J1542570J2336881J2649506J3228255J4066480
14272B88316780J4541485J4883062J5564913J5373153J5643880J4264534J3404897
14265C91992704J2178737J1864437J0306262R705424Q652847P892692O629880
14258D59222983M303876J417639o66204k13399j739734p130714p611029r488976
14250D38094442j1296042j2194679j2501024j3385128j3332934j4017633j4138907
14243C47228095j4445968j4104825j3567844j2812165j3516976j2600991j1672914
$$ y = [98335927, 102512353, 106722931, 111467838, 116003943, 121047914, 126657065, 132551715, 138725085, 145193237, 152162449, 159598404, 167354965, 175373531, 184336039, 193183862, 203345547, 213867168, 224493088, 236035658, 248372539, 261022045, 274250300, 288316780, 302858265, 317741327, 333306240, 348679393, 364323273, 378587807, 391992704, 404171441, 416035878, 426342140, 436047564, 444700411, 452593103, 459222983, 463526859, 464944498, 464278294, 464064895, 462325161, 455194447, 447583418, 438094442, 426798400, 414603721, 402102697, 388717569, 375384635, 361367002, 347228095, 332782127, 318677302, 305109458, 292297293, 278780317, 266179326, 254506412]
14236B54506412j2102482j1753776j0899733j0881300r978533r609876r172392
14229A80108320q566192q784016q120576p865228o727304o914161n784012o021341
14221A21325490n234501m846463m911528m664180l940490l979783l436603l932105
14213H6379837l571894l192018k698512l013484k720588k495289k602408k251843
14205F3833801k018615k080138j903378k258973j389604j634948j889237j133837
14197D9525071j666543j460066j609236j125807j469163o00203r67189j354263
14189C9272601j346411o15359j525979p10315p37682r17086r94593p23186q17752
14180C0884238o94249j026047m78402n88146q26035p98589n34085n78689o09750
$$ y = [254506412, 242403930, 230650154, 219750421, 208869121, 198890588, 189280712, 180108320, 171542128, 162758112, 154637536, 146772308, 140045004, 133130843, 127346831, 121325490, 116090989, 111244526, 106332998, 101668818, 97728328, 93748545, 90311942, 86379837, 82807943, 79615925, 76917413, 73903929, 71183341, 68688052, 66085644, 63833801, 61815186, 59735048, 57831670, 55572697, 54183093, 52548145, 50658908, 49525071, 47858528, 46398462, 44789226, 43663419, 42194256, 41594053, 40626864, 39272601, 37926190, 37310831, 35784852, 35074537, 34336855, 33419769, 32425176, 31701990, 30884238, 30189989, 29163942, 28685540, 28097394, 27271359, 26472770, 25938685, 25359996, 24750246]
14171B4750246m53027o28658p09492k74654m88466m30625n07106n55003j08354
14162B0594861o98852o29833k84546l56460l45653k40140l67419q00579Q3242
14153A6954621o56831j64938m03720r2254m96317m11392J83991n41879j44940
14144A4226341l86075K4148l70908k52133l44766J3871p0340m40871l75452k11367
14134A1812448J64184k56670j50349k08186l60147R3517l08928j19240l41167
14125A0325462j2398l34891K36018l60487p0317m00717o7786j0609p0978j08484
14115I124813k83694j16889J28434o5271j52923j62453j44232R9992j41708j64313
14105H121756j17899l96716L93642n30266j12369q9913J33719j36219j38521l19968
$$ y = [24750246, 24297219, 23668561, 22959069, 22684415, 22195949, 21765324, 21258218, 20703215, 20594861, 19896009, 19266176, 18981630, 18625170, 18279517, 18039377, 17671958, 16871379, 16954621, 16297790, 16132852, 15729132, 15636878, 15140561, 14729169, 14913160, 14371281, 14226341, 13840266, 13864414, 13493506, 13241373, 12896607, 12910478, 12840138, 12399267, 12023815, 11812448, 11976632, 11719962, 11569613, 11361427, 11001280, 11094797, 10785869, 10666629, 10325462, 10313064, 9978173, 10214191, 9853704, 9783387, 9382670, 9314884, 9304275, 9233297, 9124813, 8841119, 8724230, 8852664, 8787393, 8634470, 8472017, 8327785, 8427777, 8286069, 8121756, 8003857, 7607141, 8000783, 7470517, 7358148, 7268235, 7401954, 7265735, 7127214, 6807246]
14095F807246J06700l7629k66410O6053l29673m6470q5382k76119J43407O924
14085F088647l8631K30853l67828K25389m71631k88723L32903J17691l66043P316
14075E469943N0802r70n3435j72638k40730K59864n39848L06872q7226j96395
14065D796239K04006j69017m19044K39015l8783j8957j79633O381P3977k5516
14055D468668l19075J78652L86350l54084j97479K50295l06662j57463p4478K82834
14045D157558j02204l28416j94535J24705k0214Q3829r6593j14650K00321J44326
14035C854127k02060l74988M57325k70848j04799l1952M7590K35659j87471k65201
14025C157382O0658k6014J09381k53172L06405K1432j93284j5038r3108K01365
$$ y = [6807246, 6913946, 6876317, 6609907, 6675960, 6346287, 6299817, 6214435, 5938316, 6081723, 6088647, 6050016, 6280869, 5913041, 6138430, 5666799, 5378076, 5710979, 5828670, 5462627, 5469943, 5520745, 5519775, 5466340, 5293702, 5052972, 5312836, 4772988, 5079860, 4992634, 4796239, 5000245, 4831228, 4412184, 4651199, 4612416, 4593459, 4413826, 4420207, 4494184, 4468668, 4149593, 4328245, 4714595, 4360511, 4163032, 4413327, 4106665, 3949202, 3874724, 4157558, 4055354, 3726938, 3532403, 3657108, 3636894, 3720723, 3624130, 3509480, 3709801, 3854127, 3652067, 3277079, 3734404, 3463556, 3358757, 3326805, 3374395, 3610054, 3422583, 3157382, 3218040, 3192026, 3301407, 3048235, 3354640, 3376072, 3182788, 3167750, 3074642, 3276007]
14015C276007k21153n0570K43914n06336q3005L42525j28492K71438n68975J74818
14005B750171l81537J96994K83937j35187Q6911k58552N1104j40395J35750j23768
13995B465428N8397j00060L63202k76612l19747J21051J35994j3260k58133J83488
13985B359748j68928J67611R1005J14765K02184j37838J64417L35109J81888K40779
13975C550740J285370J211655L273828N241006Q242008P215557o911612p657068
13967A5451484m847485k727488r92449j709774n67589n38218m09362m32288m59850
13958B766981O32278l9289p26372K85664l35966J29952j74831n71119L78995m2544
13948B303749J01584k20523J64950k128k97643K89847q6829j51293J81516k11706
$$ y = [3276007, 3054854, 3004284, 3248198, 2741862, 2658857, 3001382, 2872890, 3144328, 2575353, 2750171, 2368634, 2565628, 2849565, 2714378, 2801289, 2542737, 2593841, 2453446, 2589196, 2465428, 2523825, 2423765, 2786967, 2510355, 2190608, 2311659, 2447653, 2434393, 2176260, 2359748, 2190820, 2358431, 2449436, 2564201, 2766385, 2628547, 2792964, 3128073, 3309961, 3550740, 4836110, 6047765, 9321593, 14562599, 22804607, 30020164, 23108552, 15451484, 10603999, 7876511, 6884062, 5174288, 4606699, 4068481, 3659119, 3226831, 2766981, 3399259, 3359970, 2633598, 2919262, 2583296, 2713248, 2538417, 1967298, 2346293, 2303749, 2405333, 2184810, 2349760, 2347632, 2049989, 2339836, 2253007, 2101714, 2283230, 2071524]
13938B071524L68496m48576O5571r0106j88590j2889J93091K24113l24662j66628
13928A691344J67286K36377n2248m1630p2845l63335j72438N07641j51789o368
13918A741995p7744j35651O5289M9566K75969l44374Q1803m45221K11434Q8965
13908A512031R3531r4531q0070Q6119J39576k45013K92094J40607j87467j04891
13898A551986J85879k09604L0428M8051l04652n5984J97750k51299J71636Q7050
13888A451241n41744K15377K35016j11375R9397j37009L22070k88853l23945L39631
13878A259806O383M1040P8614L9809j50598R2045j28835q7771L7063J701M6428
13867A235685m2624O3551L7553m8396J02934L2111l87236J17969K2676j14178
$$ y = [2071524, 2440020, 1991444, 2057015, 1966909, 1778319, 1765430, 1958521, 2182634, 1857972, 1691344, 1858630, 2095007, 2042759, 2001129, 1928284, 1564949, 1392511, 1900152, 1748363, 1741995, 1664251, 1528600, 1593889, 1643455, 1919424, 1575050, 1656853, 1211632, 1423066, 1512031, 1605562, 1511031, 1430961, 1517080, 1656656, 1411643, 1703737, 1844344, 1656877, 1551986, 1737865, 1528261, 1558689, 1606740, 1302088, 1246104, 1443854, 1192555, 1364191, 1451241, 909497, 1124874, 1359890, 1248515, 1347912, 1210903, 1532973, 1244120, 920175, 1259806, 1266189, 1307229, 1385843, 1425652, 1275054, 1367099, 1238264, 1150493, 1187556, 1189257, 1235685, 1193061, 1256612, 1294165, 1245769, 1348703, 1380814, 993578, 1111547, 1134223, 1020045]
13857A020045K40549l35690K25113k22779K92818J12519k77683m2273j00728R9907
13847A011798p0243q8341L00951P3502k34691m83111P51903l27222L8021K1778
13837I94345J8772K90156l67687K3670J95124p7759L11085k91055q1014l36969
13827F78668L46542l30705K34823k8652j09762K98809j04473l3622K24710j39379
13817A036959r5924K722J11545n2530R6272k38397R2184p4996p3617k2892J16014
13806H97340J85065j55717j99140K99189j50524K9536j62934L12066l44583N9766
13796G70064K67164D54748P69793j46588k18956j82556K74820J9685j12432K28581
13786A087095k34827K81845m19902O9657J70230K57906m52292J83401k81991J11951
$$ y = [1020045, 1260594, 924904, 1150017, 927238, 1220056, 1332575, 1054892, 1012619, 911891, 1011798, 941555, 853214, 1154165, 1227667, 992976, 509865, 1261768, 934546, 972567, 994345, 1013117, 1303273, 935586, 959256, 1154380, 1076621, 1387706, 1096651, 1015637, 678668, 1025210, 694505, 929328, 900676, 790914, 1089723, 985250, 951628, 1176338, 1036959, 941035, 943757, 1055302, 1002772, 1099044, 860647, 952831, 877835, 804218, 781326, 897340, 1082405, 926688, 727548, 1026737, 876213, 905749, 742815, 1054881, 710298, 770064, 1037228, 454748, 1224541, 1077953, 858997, 676441, 951261, 970946, 858514, 1087095, 852268, 1134113, 714211, 783868, 954098, 1212004, 759712, 943113, 661122, 773073]
13776G73073R4241n3456J68422k22117j36497N35251m94477n8351q0524J7789
13766E43354J01835L95979l19788K34140l37535K15116k16152J49425j601l2098
13756G32675n6053L985l4255q1002M38733l26988p3829l5571J41154M2990B26852
13744G44286L27601l99315k12419L24858r6881M2778l8390n8784j84409O8549
13734E17874j13618L1996L23365k10882L1427j28348J30595J23952k05469L33984
13724H34876k6915L8684C54746J07537r426J37802K89300k71814r7133j68500
13714C42512K66467J13703j9782M8619j81473m5039K04000r2428j31379J6431
13704E21631j6136K17560k69059K51567j49492r5923K00023k69528N35319l49635
$$ y = [773073, 867314, 813858, 982280, 760163, 623666, 1158917, 664440, 606089, 525565, 543354, 645189, 1041168, 721380, 955520, 617985, 833101, 616949, 766374, 764773, 732675, 676622, 680607, 646352, 565350, 1004083, 677095, 603266, 567695, 708849, 751839, 226852, 744286, 1071887, 672572, 460153, 785011, 688130, 730908, 692518, 633734, 449325, 517874, 404256, 436252, 759617, 548735, 580162, 451814, 582409, 706361, 500892, 834876, 807961, 846645, 354746, 462283, 452857, 590659, 879959, 608145, 511012, 342512, 608979, 722682, 702900, 751519, 570046, 525007, 729007, 636579, 505200, 521631, 505495, 723055, 453996, 705563, 556071, 460148, 660171, 390643, 925962, 576327]
13694E76327j48170j09J70964K9778j75776l7390J7182Q8741L17091m06427K37390
13683F69601q7017j52023L53636l40947J20575j20130M25298k36142B47790J58717
13673D06507l2113K61578J87105N370k37036J08503L3439O7872C23095K20382
13663E43477j60081K49982A88749K34578J69761O9249j69606q3140M68578m08199
13653D69970j85046Q4263K72232k18743K0790j0675l1156j38197N7562J32614
13643D53614L36082j39800k25157K86336k92328j81488M97378j73357j38156k09216
13633B13908M17330j54207n0997j64656L40358r6249j62475L01966A52669N17795
13623F70464C25483G5079N72105j45885j25670M086K1556q0900O7657r8162L59132
$$ y = [576327, 428157, 428048, 599012, 628790, 453014, 415624, 432806, 521547, 838638, 432211, 669601, 582584, 430561, 784197, 443250, 563825, 443695, 868993, 632851, 247790, 406507, 374394, 635972, 823077, 828447, 591411, 699914, 733353, 801225, 323095, 543477, 383396, 633378, 188749, 423327, 593088, 662337, 492731, 409591, 878169, 469970, 284924, 369187, 641419, 422676, 443466, 432791, 401635, 263438, 321000, 453614, 789696, 649896, 424739, 711075, 418747, 237259, 734637, 561280, 423124, 213908, 631238, 477031, 426034, 261378, 601736, 505487, 343012, 644978, 152669, 670464, 325483, 75079, 647184, 501299, 375629, 379715, 401271, 320371, 388028, 289866, 648998]
13612F48998l09005j9672K31155j55766J65650k09621p8470l9323q065K90811
13602E16692J1338C650Q16346l90215p7533J3152j39455C0032K02584M84109k90414
13591D26311P9591B51356A11013J83920r8278J78549J25350j30343j16936K68750
13581E22025k55426K7514j29704M5011L97989K08270I3978J06416J23306A28724
13570D73629l27o7902q5550j47086L82649o7580o2827Q5329A68260j8057M50872
13559F01075k33036j61266J86509j2029n8238J80356p6309L1006j46078L18265
13549F30255B91882J14821j01349K8663j0548p2091m9913J71427j34400Q5996
13539C24488j31277N8106J16310q767e6494A47833J97463P8895D2859b41929C02658
$$ y = [648998, 339993, 320321, 551476, 395710, 561360, 351739, 273269, 233946, 225881, 516692, 528030, 3650, 819996, 429781, 352248, 365400, 225945, 30032, 232616, 716725, 426311, 505902, 251356, 111013, 294933, 196655, 375204, 500554, 370211, 253275, 522025, 266599, 294113, 164409, 209420, 607409, 815679, 93978, 200394, 323700, 128724, 473629, 473302, 405400, 319850, 172764, 555413, 487833, 425006, 510335, 168260, 150203, 601075, 368039, 206773, 393282, 381253, 323015, 503371, 427062, 458068, 311990, 630255, 291882, 406703, 305354, 334017, 323469, 251378, 201465, 372892, 238492, 324488, 193211, 251317, 367627, 358860, -56494, 147833, 345296, 424191, 42859, -241929, 302658]
13527E25276J31796k39890j29393j24054J29916J02567A03357K56905o3561p5445
13517B21256K28727k14350G0174L67410j98221M2298K98579k17825l9865J72969
13507D95519A26511K20931J11957A68428L43630n055k42932J69215L7322B20263
13496C56658o8945J434A31669Q4978R608J26658l3399M7091L67534C65469c00568
13484d2652E4981J83236L08941J02825C12501A35499Q2814p2937n7613K75892
13474C63655J62911A5108J91818H8586L98746E9018K91016R8151A60871N52848
13464G13719a19196D4730L2436O7437K64748q3129o7935M2390A07298O1046R2662
13453B61006K527j31425A4625J33357J58589j06285f6297B36685n8160P3147j3257
$$ y = [525276, 657072, 417182, 287789, 163735, 293651, 396218, 103357, 360262, 296701, 221256, 449983, 235633, 70174, 437584, 239363, 281661, 580240, 362415, 322550, 495519, 126511, 347442, 459399, 168428, 512058, 507003, 264071, 433286, 470608, 220263, 356658, 287713, 289147, 131669, 216647, 226255, 352913, 319514, 366605, 734139, 365469, -300568, -42652, 54981, 238217, 547158, 649983, 312501, 135499, 218313, 145376, 87763, 363655, 526566, 15108, 206926, 88586, 487332, 59018, 350034, 448185, 160871, 713719, -119196, 44730, 77166, 144603, 409351, 326222, 258287, 300677, 107298, 168344, 261006, 263533, 132108, 14625, 147982, 306571, 200286, -66297, 236685, 178525, 251672, 238415]
13442B38415J49223o7821J12084j23130r0964J68613L9855a6926A39142J12415
13432B51557K64211A79301q3761J4296K20913p2642j01513J69874J7682j714m1119
13421C01317E134L17816b0895A27408c8945C95057A67189M3204n8668J35213l3106
13410B53832K72264A59527E0631K77661k1907n8185q2494K33691J7700k5489q1295
13399C10313h3826B44980m7179K86812Q2451k09550p6021L1581a50985E4295J16460
13388A70755k1756M16301B77675d6414B58985N5101a33932B09677N8477A07069
13377b41660B50102q3056J15275L0584J15364j04421H7219Q4183J88158p4609
13367B84951E7908J03948A2947J51131Q3931j12784J16911j2875a43475B44228
$$ y = [238415, 387638, 319817, 431901, 308771, 217807, 386420, 426275, -16926, 139142, 251557, 515768, 179301, 95540, 109836, 330749, 258107, 156594, 326468, 344150, 342436, 301317, 5134, 322950, -20895, 127408, -38945, 395057, 167189, 210393, 151725, 286938, 253832, 526096, 159527, 50631, 328292, 306385, 248200, 165706, 399397, 417097, 391608, 310313, -83826, 244980, 197801, 484613, 567064, 357514, 281493, 313074, -150985, 54295, 170755, 148999, 565300, 277675, -46414, 258985, 314086, -133932, 209677, 268154, 107069, -241660, 250102, 167046, 282321, 312905, 428269, 323848, 87219, 171402, 359560, 284951, 57908, 161856, 12947, 164078, 248009, 135225, 252136, 239261, -143475, 244228]
13356A09703J1428K53294r9915e6594A48132R2318J51775H5633L07011I7061J80735
13345B77796b03314C11535o2699J79112A49174K46379A95439E2030L25330O2816
13335D40176B02928J01916P7197q5482L4500M0084o0105J80609c2481A83616L66006
13324E49622j58666A75062K39807B01857L55290C2326O3951J68016k3910D8064
13313C34663A53138P786K51993A14466K33707R5782I2459L75644o1918I9935L34828
13302D34763F9251L92133k29145C7545J47269r567k9707N5714D6279a58764d9910
13290B88201I7816J87437A37962i6618D93542k31478Q3259k2136R8855D0411L3679
13279G4090J02007K04462l8429o1859q3247P1751F4422a4183C06777c1285A04063
$$ y = [109703, 121131, 374425, 274510, -56594, 148132, 240450, 392225, 85633, 392644, 97061, 277796, -203314, 311535, 248836, 427948, 149174, 395553, 195439, 52030, 377360, 440176, 202928, 304844, 382041, 296559, 331059, 371143, 311038, 491647, -32481, 183616, 549622, 390956, 175062, 414869, 201857, 557147, 32326, 96277, 264293, 240383, 48064, 334663, 153138, 160924, 412917, 114466, 348173, 443955, 92459, 468103, 406185, 99935, 434763, 69251, 461384, 232239, 37545, 184814, 175247, 145540, 201254, 46279, -158764, -49910, 288201, 97816, 285253, 137962, -96618, 493542, 262064, 345323, 323187, 422042, 40411, 74090, 176097, 380559, 342130, 280271, 197024, 268775, 64422, -14183, 306777, -31285, 104063]
13267B74092K8123p3897b5952A25270h3816E8994c52212e0429B01011H2752K14507
13256B97259j02754a20112E5550K50719J9829A08782O7881C1566J22103C2921
13245C6413K26149f1309j3785A83225J12770G3310J26098p9706L0620l4700P9011
13234A94633Q215j5800F7869P2919j0871j2L52872B25747C6830K8484i5821A05239
13221f1740B10316B0063K87684d1470a3324H9772j9757K1337J02751a56880B58851
13209C38349l6897b05707D41869j61325d7677a9558k0340A64233a02186C03304
13198A18324J28248c0873C05055j15119e3850B75047E3708J65459J52980b14346
13187a95501A82202g7241j61628C004R4978K92474b49456F7113b312l3531C4899
$$ y = [274092, 302215, 228318, -25952, 125270, -83816, 58994, -352212, -50429, 201011, 82752, 297259, 194505, -120112, 55550, 306269, 326098, 108782, 176663, 31566, 153669, 32921, 36413, 262562, -61309, -75094, 183225, 295995, 73310, 199408, 119702, 150322, 115622, 194633, 202848, 187048, 67869, 140788, 129917, 129905, 482777, 225747, 36830, 65314, -95821, 105239, -61740, 210316, 20063, 307747, -41470, -13324, 89772, 70015, 91352, 194103, -156880, 258851, 338349, 301452, -205707, 441869, 280544, -47677, -19558, -39898, 164233, -102186, 303304, 118324, 246572, -30873, 305055, 189936, -53850, 275047, 53708, 219167, 372147, -214346, -195501, 182202, -77241, -238869, 3004, 97982, 390456, -249456, 67113, -2312, -35843, 34899]
13175A44175j6343i1444d3098H5527k5979B2537P0089e2069l06785a6133F8166
13163F5313J06650L24378B04283q4530J52691D9268e7030C50768m9372a0994B66611
13151F2051P4954h0226B75476B286R8183K827J73805I0010B371a44062A24026
13139D16828A09106L35944q5273b33806E3730J1514a70743I2970Q1402o4352d63519
13127i8657B27317j01702a79527D37465b6448A45039c7364n0542B18940H4987
13116C0457J83298j6940C6255b1676r9630B02400j0445D9039J41819E4563J91672
13105B46235E5612f4775B70496m480H3955a096l9021l7717H2752N8497l3720d3030
13092E3013P5981n2925h6581J5124A54983N4332i7225j11075C26498j49233G8255
$$ y = [144175, 127832, -91444, -43098, 85527, 59548, 22537, 92626, -52069, -358854, -16133, 68166, 65313, 171963, 496341, 204283, 119753, 272444, 49268, -57030, 350768, 301396, -10994, 266611, 62051, 137005, -80226, 275476, 2286, 100469, 103296, 277101, 90010, 2371, -144062, 124026, 416828, 109106, 445050, 359777, -233806, 53730, 65244, -170743, 92970, 174372, 110020, -463519, -98657, 227317, 125615, -179527, 437465, -26448, 145039, -37364, -87906, 218940, 84987, 30457, 213755, 196815, 36255, -21676, -121306, 202400, 191955, 49039, 190858, 54563, 246235, 55612, -64775, 270496, 266016, 83955, -1096, -40117, -77834, 82752, 141249, 107529, -43030, 53013, 128994, 76069, -86581, -71457, 154983, 209315, -97225, -208300, 326498, 177265, 78255]
13080B19921j08988N9492l2610E6851k2537b7136D54471f4444B62825q8502m2260
13069A32063a83450g4781A7751N0330L00632d22437B26475r3215a14583j7521
13059a32104N1415G6978c03546e1283k608A68063b07592A88084r1133R0712a60742
13047A49707d1412D9875K00627c7646J5164B88775a19625A78438a91604B63064
13036B39211g2046j58711A05930J9916b3346D05765A91153L0939J5161H9676c0997
13024D7379L63710E9131D568a20242F0650i6885A13928K1567J98921j58916D9176
13012a146j9151A43976a00183G3888b47634B55142b50157I7835K22611A08149
13001a14120A0530L8014A345Q0453c46142A90539q1884L5967b9716n6709G3729
$$ y = [219921, 110933, 170425, 137815, 56851, 34314, -27136, 454471, -64444, 262825, 174323, 132063, -183450, -74781, 17751, 68081, 368713, -422437, 226475, 133260, -114583, -132104, -80689, 76978, -303546, -51283, -53891, 168063, -207592, 188084, 96951, 187663, -160742, 149707, -41412, 49875, 250502, -37646, -22482, 288775, -119625, 178438, -191604, 263064, 239211, -72046, -230757, 105930, 125846, -23346, 405765, 191153, 222092, 237253, 89676, -30997, 47379, 411089, 59131, 4568, -120242, 60650, -96885, 113928, 135495, 334416, 175500, 49176, -1146, -20297, 143976, -100183, 73888, -247634, 255142, -250157, 97835, 320446, 108149, -114120, 10530, 48544, 1345, 81798, -346142, 190539, 108655, 144622, -29716, -86425, 73729]
12989c6653n2528E115a71312A4659J99618c65093A05398J99019d4452J5560A59467
12977a4242r605A42482K5183f0323F1684J46083i2041k12947a5012I9195P3576
12966A72771a16183C40520E4074J15250N071a28894r0274A69879J19249F4381
12955c1782A26437k4347K99449C2704A3229K93877e9250j82122I0531C9317J9186
12944E8503O1413n4943P8326e5027A14037L57840b1013m8675A73331J83998a34804
12932D2191J23997a46674j3951A20319L8411J44757F4142a72425j7A20130p358
12921A12772a626A9378M94353f0100A25693K0019f0668A22477k2873a80880I527
12909A16959b4182n2220J0644I7672N8900a50953q2964b7571A84436N1282C504
$$ y = [-36653, -89181, 5115, -171312, 14659, 214277, -365093, 105398, 304417, -44452, -28892, 159467, -14242, -23847, 142482, 167665, -60323, 61684, 207767, -92041, -304988, -15012, 99195, 172771, -116183, 340520, 54074, 169324, 174395, -128894, -219168, 169879, 289128, 64381, -31782, 126437, 102090, 401539, 32704, 13229, 307106, -59250, -241372, 90531, 39317, 58503, 119916, 64973, 143299, -55027, 114037, 471877, -21013, -69688, 173331, 357329, -134804, 42191, 166188, -146674, -160625, 120319, 158730, 303487, 64142, -172425, -172442, 120130, 112772, -1626, 19378, 513731, -60100, 125693, 145712, -60668, 122477, 99604, -180880, 9527, 116959, -24182, -76402, -65758, 97672, 156572, -150953, -233917, -27571, 184436, 235718, 3504]
12897i8829C6646J33732N7124J09653A48148F7044c93238A61288o925a06860A94953
12885b45124A63836K50444f7494C14694b63159B79090J55805B01535K0190b886
12874A43958R4240H854K89408A05392P648J83630D3109e0230A99786B8089a6554
12862E3881k6686a90337L8301C54557A2221K65492A9080a78391C15136A7624a8563
12850a59078a6968k83764E4894b02477D25417G4020b34238C12995h4505b4725
12839A56210f3257B5884c9322B51271A02343a9480p3883K2340q8981M7646C38943
12827B04162j6572q9426J13849r7756k5302L48362A13374a7477B1900M1408a03486
12815b74789f6214A44763E9154b4420l0604C38117A33285f2868G3900K5670m7722
$$ y = [-98829, 36646, 170378, 227502, 337155, 148148, 67044, -393238, 161288, 154363, -106860, 194953, -245124, 163836, 414280, -67494, 314694, -263159, 279090, 434895, 201535, 221725, -2886, 143958, 238198, 8854, 298262, 105392, 113040, 296670, 43109, -50230, 199786, 28089, -16554, 53881, 27195, -190337, -152036, 354557, 12221, 277713, 19080, -178391, 315136, 17624, -18563, -159078, -16968, -300732, 54894, -202477, 425417, 74020, -234238, 312995, -84505, -24725, 156210, -63257, 25884, -39322, 251271, 102343, -19480, -93363, -71023, -160004, -112358, 338943, 204162, 187590, 98164, 212013, 114257, 88955, 437317, 113374, -17477, 21900, 63308, -103486, -274789, -66214, 144763, 59154, -24420, -55024, 338117, 133285, -62868, 73900, 99570, 51848]
12804E1848M6547b34213F3553b51101G2678e3894G8827N4738g5394K928C45624
12792f1249p7255A24326A9500R1130J42458o6428e5564G7286J6908a66503d7080
12780a85898p1624O6309Q29d0044I181a38870C1244b09877e4942j71793C20267
12768a93478G1506B8848J41439j7262m4423l8051a89941l254a6719E5078d9646
12756D1073e8755A064N0013J53172H4959K12863J36091i504A31817j30D7210c33668
12743A16378M4634a18656D4193P1915a071B03411f929A7894K30310e1296j02352
12732a53648D17743a35845e5560j11224L6007A99226E9770B8932L01589B7727
12721a33114N1285j47941C4297R1464g6493B44770C9456J23551i3037I8455c76006
$$ y = [51848, 98395, -234213, 63553, -251101, 72678, -53894, 78827, 133565, -75394, -72466, 345624, -61249, -138504, 124326, 19500, 110630, 253088, 186660, -55564, 77286, 94194, -166503, -47080, -185898, -257522, -191213, -190384, -40044, 9181, -138870, 31244, -209877, -54942, -226735, 320267, -193478, 71506, 28848, 170287, 153025, 108602, 70551, -189941, -193195, -16719, 55078, -49646, 41073, -58755, 1064, 51077, 204249, 84959, 297822, 433913, -9504, 131817, 131687, 47210, -333668, 116378, 161012, -118656, 44193, 116108, -1071, 203411, -6929, 17894, 248204, -51296, -153648, 417743, -135845, -55560, -166784, -130777, 199226, 59770, 28932, 330521, 27727, -133114, -81829, -229770, 34297, 125761, -76493, 244770, 39456, 163007, -93037, 98455, -376006]
12709a89541D37974A58742a42358m4391B81816c28689R1437I0780a19563j19838
12699b39401P7108J2193B24311b45478A27626b69726Q0914B98457r0617m9455
12689A58385a73122O7521c7467G1166l5346H805J6322h8062B10793i08C7491J00717
12677A38208K07774a4118j06510A8185P9524D6657g3541p9791F5242a61000F2676
12665E7486h1871j90277M7278B66845a83373c9099F1908K15760l8610I5729P1734
12654A67463k0627E7845P8625L5379g9507j01292D77417B16371G5719C7396f2996
12642E7387a55231A08742Q7978E3882B2318J56408a00301H7658K16394o447a07545
12630A20421B9666b10956C5673a5568k20645h5242Q647B25529l8677M4623L84477
$$ y = [-189541, 437974, 158742, -142358, -186749, 281816, -328689, -237252, 90780, -119563, -239401, -162293, -150100, 224311, -245478, 127626, -269726, -188812, 298457, 207840, 158385, -173122, -105601, -37467, 71166, 35820, 8805, 25127, -88062, 210793, -908, 37491, 138208, 345982, -14118, -120628, 18185, 97709, 46657, -73541, -153332, 65242, -161000, 62676, 57486, -81871, -272148, -224870, 266845, -183373, -39099, 61908, 277668, 239058, 95729, 167463, 146836, 57845, 136470, 171849, -79507, -180799, 477417, 216371, 75719, 37396, -62996, 57387, -155231, 108742, 196720, 53882, 22318, 178726, -100301, 87658, 304052, 297605, -107545, 120421, 29666, -210956, 35673, -15568, -236213, -85242, -76595, 225529, 186852, 231475, 615952]
12619F15952A75913j7973P3936J17201j32956K49254j57659j38780K64055A70029
12608g3617A63519N0237G9953M230b9794E5831N1557l7539M656L4093J6947N2820
12596A78365O1548j03033N6044B5279a13642c8380p4625L8612C84597j39608e7176
12584C23050A08408J64618B5988J69766d0576O707A00566M15266I2734J42344
12574B35078k1857a31500B07286h0283b9322B0336a76451H271J93015a57485a817
12562A18110K128c47105B7715K62761a43857B54957c634A80749a17841j77749
12552b95590C12968B7395J31101o5537J07223e9997g652j09644B02704E5280B6189
12540g1003j19049A68964a61169E7K2755J22383f4081D9107I85P0174J82211I4977
$$ y = [615952, 175913, 157940, 231876, 349077, 216121, 465375, 307716, 168936, 432991, 170029, -73617, 163519, 213756, 79953, 84183, -29794, 55831, 107388, 69849, 74505, 108598, 125545, 178365, 239913, 136880, 192924, 25279, -113642, -38380, -113005, -74393, 384597, 244989, -57176, 323050, 108408, 273026, 25988, 195754, -40576, -33869, 100566, 515832, 92734, 235078, 213221, -131500, 207286, -80283, -29322, 20336, -176451, 8271, 201286, -157485, -1817, 118110, 120238, -347105, 27715, 290476, -143857, 254957, -3634, 180749, -117841, -295590, 312968, 27395, 158496, 92959, 200182, -59997, -7652, -117296, 202704, 55280, 26189, -71003, -190052, 168964, -161169, 57, 22812, 145195, -64081, 49107, 985, 71159, 253370, 94977]
12527a39325d4536l15416J54111A1752P4398c69194F4164K590f542k48531A71494
12515A25633J27836j1180L9077Q960A40696g2095r496l6852D2852J04517J51518
12504B98887K2112j00843k2476e8861o5569N3268B25983P270J7435b4818j06615
12493a31433B993a05808G4042a10167E371c48057A02782h5027q7753j19364B21096
12481I9491c9276I0732K6962R4388f6063b1831I452P4867k7659P7874n1651l9175
12469D3708R5995K6901n4396k5512b2378B17287F6065k915a07072A44318J0617
12458A54935g0826B78615a26748F5167B226h1112b6484C47564A16772c33849A75668
12446f0110J7532j44600H069e3434p9345A71004a2111n6766D2847O6109i4855
$$ y = [-139325, -44536, -359952, -205841, 11752, 86150, -369194, 64164, 66754, -6542, -255073, 171494, 125633, 253469, 242289, 281366, 290326, 140696, -72095, -81591, -118443, 42852, 147369, 298887, 320999, 220156, 197680, -58861, -124430, -71162, 225983, 233253, 250688, -24818, -131433, 2993, -105808, 74042, -110167, 5371, -348057, 102782, -85027, -172780, -292144, 221096, 99491, -39276, 90732, 117694, 212082, -66063, -21831, 9452, 84319, 56660, 134534, 82883, 43708, 139703, 166604, 112208, 86696, -22378, 217287, 66065, 63150, -107072, 144318, 154935, -70826, 278615, -126748, 65167, 2226, -81112, -26484, 347564, 116772, -333849, 175668, -60110, -42578, -187178, 8069, -53434, -132779, 171004, -12111, -68877, 42847, 108956, -94855]
12434E50115B59760Q6977j52779a47209e7539n7419R528M0829E27424b0617G07
12422a01946b5878A33949a98537Q9231l22794H9302B449K9740Q1252K51065a03465
12410a83143A27186d931A44279B7919a32287a9766G6186a75427m911f1845B04542
12398E9257f7385o5705A88425J1959C2473b04337B14104E8699R8860c85331B89590
12386G4156C520b04726C9949a88868H7033J01296H7407c239A62624K71982a687
12374b8989A1999O2114a19j85202B31045I6825a9230l03435D9545A3641b33845
12362d5528c28j79472O2576l35771a61195a536k7136A641K78690d3513A10323
12350B39962A09993a63450F4843c95250B28602b63474N7546A84315d9568C24294
$$ y = [550115, 259760, 346737, 193958, -147209, -57539, -114958, -105430, -64601, 527424, -20617, 707, -101946, -25878, 133949, -198537, -109306, -432100, 89302, 2449, 32189, 113441, 364506, -103465, -183143, 127186, -4931, 144279, 27919, -132287, -19766, 76186, -175427, -180338, -61845, 204542, 59257, -67385, -133090, 188425, 200384, 32473, -204337, 214104, 58699, 157559, -385331, 289590, 74156, 3520, -204726, 39949, -188868, 87033, 188329, 87407, -3239, 162624, 434606, -1687, -28989, 11999, 74113, -119, -185321, 231045, 96825, -19230, -322665, 49545, 13641, -233845, -45528, -328, -179800, -117224, -452995, -161195, -1536, -28672, 1641, 280331, -43513, 110323, 239962, 109993, -163450, 64843, -395250, 228602, -263474, -205928, 184315, -49568, 324294]
12339A93282h9083J5159j44523g176k4029B6293a15773c9379P360A4012b1330
12327h1200k2656B33752j06464b55128a15281n6691k0212r1020o6646D6164K2485
12316F8649g6241D7057a1425l2026B23785H0674C5723J19156l1442p779E0020
12304f1542A9327L8211d5998A011i49l0358n2798C560L07516o779a44853E6385
12291a46378A89588o7401D4198j0336c5460B60118b00807g9845R553k47546C14953
12279b16675N8926N0082C40225H897K779R9896J3682e2684q1790r1228a06183
12267A70051B2211J22347d0393F6933R1548g5654j46138n5853f451j02684B09479
12255b0610k05288E301J76984c40535B06098b92469G8693L9316k1020c0708G3015
$$ y = [193282, -89083, -73924, -218447, -7176, -31205, 26293, -115773, -39379, -32019, 14012, -21330, -81200, -103856, 233752, 127288, -255128, -115281, -171972, -192184, -283204, -349850, 46164, 68649, -76241, 47057, -11425, -43451, 223785, 80674, 35723, 154879, 123437, 115658, 50020, -61542, 19327, 57538, -45998, 1011, -949, -31307, -84105, 3560, 311076, 304297, -144853, 56385, -146378, 189588, 122187, 44198, 33862, -35460, 260118, -200807, -79845, -70292, -317838, 314953, -216675, -157749, -107667, 340225, 8897, 11676, 111572, 125254, -52684, -134474, -225702, -106183, 170051, 22211, 144558, -40393, 66933, 158481, -75654, -221792, -277645, -6451, -109135, 209479, -20610, -225898, 5301, 182285, -340535, 206098, -292469, 78693, 118009, 96989, -30708, 73015]
12243I7043j6286K44709j7828a66912d5078C24723A28491c0436H9109d117H8979
12231D31887j52154f0557A32703E9099B394a97585F5785g3013m770A31369d4019
12219B63639j04018f6264G6784J55635L6536I9161L04621A08281J74699a66425
12208D98062j99732m4517m2883J11009I9336A6698K25956o2711B5069K84497r1032
12197B18534p1697D4613K19638o5950n9167l5605Q394B5079J40004G5231M10092
12186D85323G157J41355K30570J33034k46590l1812a43884B09687a37773I7425
12175C10938E7385a68750A31184E2108k5324J91120a14201A41710c22849B99865
12164D17539A22231D8840P7526K84715g9337j0653I4392L6452A1919P4143J85981
$$ y = [97043, 80757, 325466, 307638, -166912, -45078, 324723, 128491, -30436, 89109, -4117, 88979, 431887, 279733, -60557, 132703, 59099, 2394, -197585, 65785, -73013, -77783, 131369, -44019, 263639, 159621, -66264, 76784, 232419, 268955, 99161, 403782, 108281, 282980, -166425, 498062, 298330, 253813, 210930, 321939, 99336, 16698, 242654, 179943, 25069, 309566, 218534, 146837, 44613, 264251, 198301, 139134, 103529, 111923, 25079, 165083, 75231, 485323, 7157, 148512, 379082, 512116, 265526, 233714, -143884, 209687, -137773, 97425, 310938, 57385, -168750, 131184, 52108, 26784, 217904, -114201, 141710, -322849, 299865, 417539, 122231, 48840, 126366, 411081, -79337, -89990, 94392, 130844, 11919, 86062, 272043]
12153B72043I8251a34157F7119m74D959K70838O0748F07P6119J40737A00674b1443
12140c455B21223o6385m9971d4551A9110J69324b5463o4420L8094D4943Q7262
12129A32205D1516N3045c543E7818R8076m7448l5100h8031B96872a36265I0664
12117f2375M339b485C6783e8501D8264L7504C2324P7337J48330a36045l0141k7562
12105a93748C2622j0693a61713D1684K55420j24819f7851p9392B63708A04423
12094f2102H9749b66698J17361A25040J23952B5203L02700b5773B19360A04172
12083c32410J54585l7688A24289J27876a46716e4973E049J61307b17272G7737
12072A580L03321a11141A32085b7619A95442b10402C44994b70380A04878a91091
$$ y = [272043, 98251, -134157, 67119, 66645, 4959, 275797, 336545, 607, 76726, 217463, 100674, -21443, -3455, 221223, 154838, 104867, -44551, 19110, 188434, -25463, -89883, -51789, 44943, 132205, 41516, 94561, -3543, 57818, 155894, 108446, 73346, -88031, 296872, -136265, 90664, -62375, -58036, -2485, 36783, -58501, 48264, 85768, 32324, 109661, 257991, -136045, -166186, -193748, 32622, 21929, -161713, 41684, 297104, 172285, -67851, -147243, 263708, 104423, -62102, 89749, -266698, -149337, 125040, 248992, 25203, 327903, -25773, 219360, 104172, -332410, -177825, -215513, 124289, 252165, -146716, -54973, 5049, 166356, -217272, 77737, 1580, 304901, -111141, 132085, -27619, 195442, -210402, 344994, -270380, 104878, -191091]
12061H6607c7363j35962G1862N3697J82928f3431A571g2703A53760D1377J6127
12050E7504b61578G1133L1085b03775b4888A04360A7490L79396R24468k99033
12040A022321C45566j42020J2292a42161A74359c01841e2193l0402j20665A45942
12029C49163B8932f7839A22529n2084M66633a36170j30286B5059O2302h5193A39047
12017a52996D1048a62640A83983a57773O517A4627M40851E6937h1004j07096R1802
12006i6298j56255B29092e2159A60359N3417J00588A14753a19932C79586f4097
11995D46653A4023N3648b02697b0138k78459b7865k10839B15450A5633g0502b0790
11983a7378A67795f7283H1362d10498C37657a63029a2538C08109a87919n3770
$$ y = [86607, -37363, -173325, 71862, 125559, 308487, -63431, 1571, -72703, 153760, 41377, 57504, -261578, 71133, 102218, -203775, -24888, 104360, 17490, 396886, 1321354, 1022321, 345566, 203546, 215838, -142161, 174359, -301841, -52193, -82595, -203260, 145942, 349163, 28932, -67839, 122529, 70445, 537078, -136170, -266456, 25059, 87361, -85193, 139047, -152996, 41048, -162640, 183983, -157773, -151256, 14627, 455478, 56937, -81004, -188100, -96298, -252553, 229092, -52159, 160359, 213776, 314364, 114753, -119932, 379586, -64097, 446653, 14023, 67671, -202697, -20138, -298597, -27865, -238704, 215450, 15633, -70502, -20790, -17378, 167795, -67283, 81362, -410498, 337657, -163029, -12538, 308109, -187919, -241689]
11973b41689i8757l7165L4703c2404C04677j17042b51503f3916a6056j78902A34756
11961F1343b19593B92671G9522l1063J29514c6A30516a36523A29730a42640F099
11949A6063a35508d5145k89427B35187E7479b67466j6992P5024f3488j5281J5959
11938f2810r7288l98736a4350r2236C42562a88353a0962p2436A27876a82113l184
11927a85297c2906F0026k3678c20780a06000j70720b1140o245D4878a9922A14001
11915A83374G8955b97396c7845C2857J6445b44049A72574e6719l76339d6445C0200
11903b7799j12583A05405a01099c0961A6387Q060N4646a65304M5354A64833A1441
11891C4196c33805a8751j18472A28747a73607A18480Q8172b1217k26790G325J57285
$$ y = [-241689, -98757, -135922, -101219, -32404, 304677, 187635, -251503, -63916, -16056, -194958, 134756, 61343, -219593, 292671, 79522, 48459, 177973, -36, 130516, -136523, 129730, -142640, 6099, 16063, -135508, -45145, -334572, 235187, 57479, -267466, -284458, -209434, -63488, -78769, -62810, -160098, -558834, -14350, -106586, 342562, -188353, -10962, -83398, 127876, -182113, -185297, -32906, 60026, 36348, -320780, -106000, -276720, -21140, -27385, 44878, -19922, 114001, 183374, 78955, -297396, -37845, 32857, 49302, -244049, 172574, -56719, -433058, -46445, 30200, -27799, -140382, 105405, -101099, -30961, 16387, 24447, 79093, -165304, -119950, 164833, 11441, 34196, -333805, -18751, -137223, 128747, -173607, 118480, 206652, -21217, -248007, 7325, 164610]
11880A64610a02532B03419a29614O1378I5179H658h4916A21811H182h4609j28686
11869b13295B1084J2894J85994f42099L02265E4122J37465a67064j10016F9577
11858B35366a61133k4168A32465l3136a42671A12523a43123E8136c2091j2020
11848d4111j78688B1369c01081c1699C7038a60059A03041d8524k04201C15631
11837f7311A38936c33723a19710j6794A55630E2864J19431a50399B04810b14044
11826H8910b79432d7937H5551c32067A23504a24345H8569A8555J28036g4334B64364
11814e6269A28022b74537D48691c1801A91374c0784j49967e1652B5907b02526
11803a95012H0988c71092F735M6909a46923a4265B1659Q9093g6432A12284L8601
$$ y = [164610, -102532, 203419, -129614, -68236, 95179, 8658, -84916, 121811, 8182, -84609, -213295, 21084, 33978, 219972, -642099, -339834, 54122, 191587, -167064, -277080, 69577, 235366, -161133, -185301, 132465, 99329, -142671, 112523, -143123, 58136, -32091, -44111, -222799, 21369, -301081, -31699, 37038, -160059, 103041, -48524, -252725, 315631, -67311, 138936, -333723, -119710, -136504, 155630, 52864, 172295, -150399, 204810, -214044, 88910, -279432, -47937, 85551, -332067, 123504, -124345, 88569, 18555, 146591, -74334, 264364, -56269, 128022, -274537, 448691, -31801, 191374, -30784, -180751, -51652, 25907, -202526, -195012, 80988, -371092, 6735, 53644, -146923, -14265, 21659, 110752, -76432, 112284, 150885]
11792A50885d3600A51917C9430R9161g4845Q225l73867a94903N6350B138L00720
11781C02858b36962C55391e9356B82785A05290b5344j54221j65750N5465h9763
11770a72782k54952e9465k73849a54791l42356i8367D2955J64526H6489c3819
11759a42296e2053C7688J64701b77629C07376a234k99059C15978j12479b20322
11748a22135M1535p9594O141a390j62577A24369m3550J08673b58067C0004M4049
11737G4053a99789o149F4324a24427e1093i023k20905g6673j72670l5104A59627
11725a32557L6199a0944A62051G0353C0828i574H6716B843a41936j1317A2873
11713c41773J33093G0559c5554p7359A86830b73063K7648A69239c94108a61526
$$ y = [150885, -43600, 151917, 39430, 138591, -74845, -66620, -440487, -194903, -138553, 2138, 302858, -236962, 355391, -59356, 282785, 105290, -25344, -179565, -345315, -289850, -89763, -172782, -427734, -59465, -333314, -154791, -497147, -98367, 42955, 207481, 86489, -33819, -142296, -52053, 37688, 202389, -277629, 307376, -1234, -300293, 315978, 203499, -220322, -122135, -80600, -160194, -154053, -1390, -163967, 124369, 80819, 189492, -258067, 30004, 74053, -199789, -205938, 64324, -124427, -51093, -9023, -229928, -76673, -249343, -284447, 159627, -132557, -96358, -10944, 162051, 70353, 30828, -9574, 86716, 2843, -141936, -153253, 12873, -341773, -208680, 70559, -35554, -112913, 186830, -273063, -245415, 169239, -394108, -161526]
11702c6059A7805a18612B03682a47022J0270B2924J14418b65958m0157A65158
11691B12791g4368A8596L57991A6695R9635a73539m6045a07839B34800B285K65169
11680B67454a23021E3712K14979m2636e4613G9165a7363B9499c07609a09A21891
11668G3296c92186G0051J5268b9788p9675C6973c7504A3118J91424b40824i6601
11656A78962d387j28349L7347L8999j83457c4012J5259n50645B93976b70979R1553
11645a79426e3316A66213J47255h1786K0732j21721m5973B06421F375f0539F5009
11633h6978D7316M1761J3542c16468A11460M1759i9659j73539B68268r1574p0698
11622A05996a94745L2302B58826p8823a71315I2190N9195a3500m1779l21884b7835
$$ y = [-36059, 17805, -118612, 203682, -147022, -136752, 22924, 137342, -265958, -306115, 165158, 212791, -74368, 18596, 376587, 16695, 116330, -173539, -219584, -107839, 234800, 2285, 267454, -123021, 53712, 268691, 226055, -54613, 79165, -17363, 29499, -307609, -109, 121891, 73296, -392186, 70051, 85319, -29788, -109463, 36973, -37504, 13118, 204542, -240824, -96601, 178962, -4387, -132736, -95389, -56390, -239847, -34012, -18753, -569398, 293976, -270979, -179426, -53316, 166213, 313468, -81786, -61054, -182775, -228748, 206421, 6375, -60539, 65009, -86978, 47316, 89077, 102619, -316468, 111460, 153219, -99659, -273198, 268268, 176694, 105996, -194745, -162443, 258826, 180003, -171315, 92190, 151385, -13500, -55279, -377163, -27835]
11610H9998j8930a79973d9822N945l6346C8672P5896a66794b8596l9370G5397
11598A69704a9693n4132k31699F959a15279n0442b2282k17962R0090D2466a83356
11586c11505a49062n6272A8433b8185F8270d6395n0518h885A60978m1164b5092
11574A7335J97696c27434C15898a33463D7903d062l4328A33662g2397n5649A42074
11562A2164c08816d6034J8752p92H0007i1776A8794Q8957J6591c6460j71697B0126
11549a66532m4605A32951b32562E048K08360c6410B20678g1318E1375d9799E10896
11537A95432a03548A6992K9486K08952d6981C4601f8719H3072L5200l8729a18046
11525B0239b01695H4208J13694O7025B9378a7360k2373D5377b96988J18109E9341
$$ y = [89998, 71068, -179973, -49822, -43877, -80223, 38672, 114568, -166794, -28596, -67966, 75397, 169704, -19693, -73825, -305524, 6959, -115279, -165721, -22282, -240244, -150154, 42466, -183356, -311505, -149062, -205334, 18433, -28185, 68270, -46395, -96913, -8885, 160978, 119814, -25092, 17335, 215031, -327434, 315898, -133463, 47903, -4062, -38390, 133662, -72397, -128046, 142074, 12164, -308816, -46034, -27282, -28074, 80007, -91776, 18794, 107751, 124342, -36460, -208157, 20126, -166532, -211137, 132951, -232562, 5048, 213408, -36410, 220678, -71318, 51375, -49799, 510896, 195432, -103548, 16992, 46478, 255430, -46981, 34601, -68719, 83072, 118272, 79543, -118046, 20239, -201695, 84208, 197902, 264927, 29378, -17360, -39733, 45377, -296988, -178879, 59341]
11513C04453A10286O4330J96825a26710c3872B17971a37451B4568b01993A69421
11502a31433A23743C4848L34159E3110a21429B28467j9767g273B62915a70953
11491C4391R0122c30335D1292M06829a21500I273M18067f168F7424L13440A71362
11479A46709O9183A5511J06499q862J60273D0797J7536L52941j78446K257K56518
11468D91603a50859J7708E4485d0257j82838Q1372F7685E828K95132a9216D6854
11456A89570r155C0112a51141L4486k15955A64518A3135J18507D2627M7520A3354
11444c9308j0453H4720l8518c5348C6513L52342a63165A02040a62814A04723l3923
11433G0800K91a30434A64175n1394a00258m5653A03314J84907R8393j56120N3013
$$ y = [304453, 110286, 174616, 371441, -126710, -33872, 217971, -137451, 24568, -201993, 169421, -131433, 123743, 34848, 369007, 53110, -121429, 228467, 208700, -7273, 262915, -170953, 34391, 124513, -330335, 41292, 448121, -121500, 9273, 427340, -6168, 67424, 380864, 171362, 146709, 215892, 15511, 122010, 113148, 273421, 40797, 58333, 411274, 232828, 235085, 491603, -150859, -133151, 54485, -40257, -223095, -141723, 67685, 5828, 300960, -19216, 46854, 189570, 180415, 30112, -151141, -116655, -332610, 164518, 13135, 131642, 42627, 90147, 13354, -39308, -49761, 84720, 46202, -35348, 36513, 388855, -163165, 102040, -162814, 104723, 70800, 71091, -130434, 164175, 112781, -100258, -145911, 103314, 288221, 386614, 230494, 283507]
11422B83507a78639A32628A5967a22043A63798A60J88034c6874j1600l3829j14984
11411a97287e2843K903C24430a04804A11647b14945B2895Q2401h3790G3521J19163
11400A92684a32145r554O2715H8283C5401b9252j69164P5404k50647a32597B19394
11388a79483n5304J03072l2236n465p2105G8547a63381j0869C3325J28259A9028
11376e3458E766F33J05745J20570a01468e036k43633l7462Q6100M3437j60730
11365c17324D0399K98430G143a39494M7499A65503n2649F675K1446a72615j02822
11354b75437J16468j0960k2806A09722m1474b92273k3857J10744j49104a75839
11343d83632a68321O6940g603j9098J409A23635b20611I9598J21915B2101b87643
$$ y = [283507, -178639, 132628, 15967, -122043, 163798, 160, 188194, -36874, -48474, -82303, -197287, -52843, -49940, 324430, -104804, 111647, -214945, 22895, 105296, -83790, 73521, 192684, -132145, -141699, -78984, 88283, 35401, -29252, -198416, -123012, -373659, -132597, 219394, -179483, -234787, -131715, -163951, -169416, -241521, 78547, -163381, -174250, 33325, 161584, 19028, -53458, 5766, 633, 106378, 226948, -101468, -5036, -248669, -286131, -200031, -156594, -317324, 40399, 338829, 7143, -139494, -91995, 165503, 112854, 6675, 28121, -172615, -275437, -158969, -169929, -192735, 109722, 68248, -292273, -316130, -205386, -354490, -175839, -483632, -168321, -101381, -7603, -26701, -25292, 123635, -220611, 99598, 221513, 22101, -287643]
11331a48846f9148k7759j06060q8518C28489b0243j23468B04237e2887A77923
11320a67511M2321E7603a33826A75851R4368c74013f0577F3287b16350A31046
11309B72584r8514a35433b7138B42438I6493b35857A51654m3036a73676E9044
11298a98732g370k89696A72444d1700A22606J00037B1559O1271h0306K7717q7249
11287a39838n1598h0008r3000P8420k38594F5747G833e3164j8459j1640E4100
11275d28870F1051d2583B29130A8438i5129D2191b59324C478c55583a53772H0677
11263A03834d5195A266K824L381a8674j82249a6002j36500J6775e1631G2446a29178
11250h7411K6684m0768J5222A08031b0748A88989a7447A62955C2648a82907P231
$$ y = [-148846, -69148, -96907, -202967, -291485, 328489, -20243, -143711, 204237, -52887, 177923, -167511, -125190, 57603, -133826, 175851, 270219, -374013, -60577, 63287, -216350, 131046, 272584, 174070, -135433, -27138, 242438, 96493, -235857, 151654, 108618, -173676, 59044, -198732, -7370, -297066, 172444, -41700, 122606, 222643, 21559, 82830, -80306, -52589, -139838, -191436, -80008, -173008, -94588, -333182, 65747, 7833, -53164, -71623, -83263, 54100, -428870, 61051, -42583, 229130, 18438, -95129, 42191, -259324, 3478, -355583, -153772, 80677, 103834, -45195, 1266, 4090, 7471, -18674, -200923, -16002, -152502, -135727, -51631, 72446, -129178, -87411, -60727, -101495, -86273, 108031, -20748, 188989, -17447, 162955, 32648, -182907, -175676]
11239a75676C21627e31089A19634h2610A15247N7071G5000b38436m4059d5359
11228I9164k3642m669a21118c3489o470j85645m12210A47601b5600A03891b8810
11216a20805e9857k20522E7623b84926g025L143m6557B2952P7005C6081K5502
11205F1583R1003q99n7309J0312b24616g8342F620K83051j30919e133l1376I9794
11192d77276F2672b50683h4231j53307e9986j00411c2545l51203d3286E7825J14347
11181A72172b73655J24976B850R1543b23142P2289I4333J83536F9343a0164l4757
11170d4921m4599k9480n0280d6001j6605k41701I6913J3735N1697g9774G5971
11158a48972C29136a17874j77627A4370g8179B09662b40050e5598a815A65819
$$ y = [-175676, 321627, -531089, 119634, -82610, 115247, 172318, 75000, -238436, -282495, -45359, 99164, 75522, 70853, -121118, -33489, -39959, -225604, -637814, 147601, -25600, 103891, -28810, -120805, -59857, -280379, 57623, -284926, -7025, -3882, -50439, 22952, 99957, 36081, 61583, 152586, 151687, 94378, 104690, -224616, -78342, 6620, 289671, 158752, -5133, -36509, 99794, -477276, 62672, -250683, -84231, -237538, -59986, -160397, -32545, -383748, -43286, 57825, 172172, -273655, -148679, 2850, 94393, -223142, -150853, 94333, 277869, 69343, -10164, -44921, -89520, -119000, -169280, -46001, -62606, -304307, 96913, 110648, 162345, -79774, 75971, -148972, 329136, -117874, -295501, 14370, -78179, 209662, -240050, -55598, -1815, 165819]
11147a18928o5289j03564h5013g279B28927f8967o8396j95944A26456a22909B04903
11135B0605J00556n060k7989e3952A06094m8587b41765j66987f6027p46A28341
11123E5592g5954E5609N5887A9072J27390k5578j6349K3850A9770h4979A33867
11111C37444a054I3010K2811M3437g1332B66190d52857C9148J3926d9093A55972
11099a87180j52276c7853F214a28616G1695f5671H4170M0717l452b7982A78955
11087B79280p5934C4226O9093A3874M02242d5373F5599I772L80537k2670n2060
11076C15579a8946B67770O4868J80274A68679a36566F1445J44760j3682A95K31865
11065B32060a9021A51522p1714K50615D7176J89185l6201K60428J02249m0541
$$ y = [-118928, -184217, -287781, -85013, -7279, 228927, -68967, -137363, -333307, 126456, -122909, 204903, 20605, 121161, 116101, 88112, -53952, 106094, 57507, -241765, -408752, -66027, -66773, 128341, 55592, -75954, 55609, 111496, 19072, 146462, 120884, 104535, 128385, 19770, -84979, 133867, 337444, -1054, 93010, 115821, 159258, -71332, 266190, -452857, 39148, 53074, -49093, 155972, -187180, -339456, -37853, 6214, -128616, 71695, -65671, 84170, 124887, 121435, -27982, 178955, 279280, 203346, 34226, 103319, 13874, 416116, -45373, 65599, 9772, 390309, 367639, 315579, -18946, 267770, 332638, 512912, 168679, -136566, 61445, 206205, 192523, 195, 232060, -19021, 151522, 79808, 330423, 47176, 236361, 200160, 460588, 562837, 522296]
11055E22296a4312A66065Q6810A9736M43166B19447J08529k3265L7683P1360l2106
11044C81648L2793L6877J94303j34523L16787k79044j18938J06500L01008k3762
11034H13649j60510j05355J23762K81081m67558M77529j28549j3561k15106J27246
11024G32628n2131k75061P810R4762K16801k58427L6016N0119J30066j19904K86104
11013H48783j23356j28501J30373J22036K8014m23262K17870k48507O3726J50498
11003F37674k10241k6532j56311J44298Q6330J6319j64171J49000J20827K3569
10993F20762j0702k29467J25578l9556P506J03662P2386l5808k54608K14906K55899
10982H30558k41372l9222j91038K56984q5291R0181n5346P720K29295j223j44306
$$ y = [522296, -14312, 166065, 252875, 19736, 462902, 219447, 327976, 304711, 342394, 413754, 381648, 414441, 451318, 645621, 511098, 827885, 548841, 429903, 536403, 837411, 813649, 653139, 547784, 671546, 952627, 485069, 962598, 834049, 820488, 605382, 732628, 680497, 405436, 413246, 508008, 724809, 466382, 502398, 552517, 682583, 562679, 848783, 725427, 596926, 727299, 849335, 877349, 454087, 671957, 423450, 487176, 637674, 427433, 400901, 244590, 388888, 475218, 491537, 327366, 476366, 597193, 620762, 610060, 380593, 506171, 466615, 474121, 577783, 650169, 614361, 359753, 574659, 830558, 589186, 549964, 358926, 615910, 530619, 620800, 565454, 573174, 802469, 801246, 656940]
10971F56940K29018J24704M22046n11529J74296K43471k04156J58440K01068K58868
10961A753166M04311K65774N0108K5106J83541k78369Q0301l50479K1423j2931
10951B141951n01541l57578k50959J27032k63796L6224Q3684j37844k75929M535
10941F05779p4753J87051j49927j18724k1441j8211n6133N3234B5093L73624A41419
10929A66209P3548E9579j8087J38306P3287M2959J08744a1077C0543K04459c75774
10917b07228c2798k771q604n5609H7769b20005k94191D27066A2339a03970j9128
10906a23098i548A90239k0498j9524j3514b63704k7301A41422J61161a85376N1704
10895a33672K2204J6172l9764B26892p6444h1094I2976b41724c9025k27830E2695
$$ y = [656940, 885958, 1010662, 1432708, 921179, 1095475, 1338946, 1134790, 1293230, 1494298, 1753166, 2157477, 2423251, 2473359, 2498465, 2682006, 2403637, 2483938, 2133459, 2154882, 2141951, 1640410, 1282832, 1031873, 1158905, 895109, 931333, 1015017, 877173, 601244, 605779, 531026, 718077, 568150, 449426, 427985, 409774, 353641, 406875, 25093, 398717, 141419, 166209, 239757, 59579, 41492, 179798, 253085, 296044, 404788, -11077, 30543, 235002, -375774, -207228, -32798, -35569, -44173, -99782, 87769, -220005, -514196, 427066, 12339, -103970, -123098, -9548, 190239, 169741, 150217, 136703, -263704, -291005, 141422, 302583, -185376, -133672, -111468, -95296, -135060, 226892, 150448, -81094, 92976, -241724, -39025, -266855, 52695]
10883A79198M422d2095k38753a4757o5108A93280a75445C0565c03256G9877d69910
10871B0762M085M6398M2667A9037K8661b24995F2607c449H0889b88585m2222B39935
10858A66121j8208k4361K7134J71299G5974M2525a81970l7145R0968k63296B14188
10846a16799C5783R3967d712j12101l5316j88415a10675a6111j57355H2306a33999
10834h6728b3185B44576N7215a28564R105D19396b03222d8197k4537l0039k66500
10823c69273C2569J53015j9218D1063L0228a70841B44637F7999b4550j72311G0581
10811F3424j2420A0269b42991C2293b28338j0782c0167G102Q2089K1419b6997
10799a38862B69349a31958c2093q4122C3799a90380a4114H3475M6463e6629J1993
$$ y = [179198, 183620, -42095, -280848, -14757, -79865, 193280, -175445, 30565, -303256, 79877, -469910, 20762, 24847, 71245, 113912, 19037, 47698, -224995, 62607, -3449, 80889, -288585, -330807, 239935, 166121, 147913, 123552, 150686, 321985, 75974, 118499, -181970, -219115, -128147, -391443, 214188, -116799, 35783, 129750, -4712, -116813, -152129, -340544, -110675, -16111, -173466, 82306, -133999, -86728, -23185, 244576, 301791, -128564, -119459, 419396, -203222, -48197, -72734, -102773, -369273, 32569, 185584, 166366, 41063, 71291, -170841, 244637, 67999, -24550, -196861, 70581, 63424, 51004, 10269, -242991, 32293, -228338, -239120, -30167, 7102, 89191, 110610, -26997, -138862, 269349, -131958, -32093, -116215, 33799, -190380, -14114, 83475, 129938, -56629, -44636]
10788d4636j6761A31464O5099c07829a18281A91410a8776A14156m7574d00176
10777b25950H6576c1744H5393a247n6051B75095a01863H9590k6923J88160K3369
10766B74196b05361f7233l3124j4581M0263G5275e8956k91802h0238A2211R7042
10755A09253D7856K50229A32267a63173J6033n2287B43179a98585A3231a39611
10744g8805E772i4744A26647K7483R324A4404b21608a10566B0378b4705j56049
10733a80754A1300J91406C800L41539i8622h508k07584b3277j26542k7154b5061
10721f6554p857A8188i5163C639Q1032e5760k90326B92566a74425B83058h9280
10709c0717I2727J66695C4711N5367J20950c43435a37165d5913E0133c0418r1821
$$ y = [-44636, -61397, 131464, 196563, -307829, -118281, 191410, -18776, 114156, 66582, -400176, -225950, 86576, -31744, 85393, -1247, -57298, 275095, -101863, 89590, 62667, 250827, 274196, -205361, -67233, -100357, -114938, -74675, 75275, -58956, -350758, -80238, 12211, 109253, 47856, 298085, 132267, -163173, -147140, -199427, 243179, -198585, 13231, -139611, -78805, 5772, -94744, 126647, 154130, 163454, 14404, -221608, -110566, 20378, -24705, -180754, 11300, 202706, 3800, 345339, -98622, -8508, -216092, -23277, -149819, -176973, -25061, -66554, -74411, 18188, -95163, 3639, 84671, -55760, -346086, 292566, -174425, 283058, -89280, -30717, 92727, 259422, 34711, 90078, 211028, -343435, -137165, -45913, 50133, -30418, -122239]
10698a22239c5928o4249M6211b1257q4335C324b24044e6800j77715n9358h9233
10686A63996b3063j94539d1045j62584R8783D2177a00025q2201M3044I5908C538
10674A70750G588h8008A25962K214a2841p1112k28414L3090C49007h3051K8476
10663e4575r4422B74930B5033J80076c00814a49258D28128a68317a0700B06677
10652G0121K04836G910a21956q4611e0320e041A01220Q4006b63328J17026j7732
10641a64034l6433N0770K5726L5923l4707j7275j23638p7676g9013A19847J09540
10630B29387b18842I5561M5732a91083I0163N8708J02619a18902B24794a17403
10619E4607J65429b4549A18178c26562f0729j52072I8834c27272a34306b1258
$$ y = [-122239, -35928, -100177, -53966, -21257, -105592, 3324, -224044, -56800, -234515, -293873, -89233, 163996, -23063, -217602, -41045, -203629, -104846, 42177, -100025, -182226, -139182, 95908, 3538, 170750, 7588, -88008, 125962, 128176, -12841, -83953, -312367, -279277, 349007, -83051, -54575, -148997, 274930, 25033, 205109, -300814, -149258, 428128, -168317, -10700, 206677, 70121, 274957, 7910, -121956, -206567, -50320, -5041, 101220, 185226, -263328, -146302, -164034, -200467, -149697, -123971, -88048, -122755, -140030, -263668, -341344, -79013, 119847, 229387, -218842, 95561, 141293, -191083, 90163, 148871, 251490, -118902, 224794, -117403, 54607, 220036, -24549, 118178, -326562, -60729, -212801, 98834, -327272, -134306, -21258]
10608b5809k9556j58613B10435J83422b59385D6912j0843c18113e4840o489D8092
10596A78198E4113b52720r1738R599P5580k2300B96177A17440c58426D4239c5005
10584A5089N6454i6923j35A0366J17179K45729A86473a56391M0285A00990e55777
10572a01323M6988j22092O2473C3443R1138a87455M8640A13314B6591b31817A25780
10560A02996b48306B1869a56257N443K7458d6576j70917B39446A03788M2782a62345
10548f8420C06691j05898A5522d6496J6114J2115k3799j01064f4853F1122b69030
10536A9920d275m10713E7836J25031c40859J68587j75539B57071b09703b4518
10525A66920N3783b04944i9942j92345Q8246M8360c611o753k39135a21588B18639
$$ y = [-25809, -55365, -213978, 210435, 393857, -259385, 46912, 36069, -318113, -54840, -61329, 48092, 178198, 54113, -252720, -344458, -334859, -259279, -281579, 296177, 117440, -358426, 44239, -35005, 15089, 71543, -96923, -97058, 10366, 127545, 373274, 186473, -156391, -116106, 100990, -555777, -101323, -54335, -176427, -113954, 33443, 124581, -187455, -138815, 113314, 26591, -231817, 125780, 102996, -248306, 21869, -156257, -150814, -123356, -46576, -217493, 239446, 103788, 146570, -162345, -68420, 306691, 200793, 15522, -46496, -30382, -18267, -42066, -143130, -64853, 61122, -269030, 19920, -4275, -414988, 57836, 182867, -340859, -172272, -347811, 257071, -209703, -24518, 166920, 220703, -204944, -99942, -292287, -204041, -155681, -3611, -10364, -249499, -121588, 218639]
10513A79720R9494A7472j917b42946B38309H0736b17997h1575l13888d2573n20543
10502e63116B15303C735K21678A0113h064k94027d3521J9870j01098H5704h4414
10490B43997R6332c72666c0148m7481j60770d2271j46112i2178B53810E6559m270
10479E2289b99591f132k01197A77716c08281N7786j40055C35587b37439G8021
10468b19647A66091L08687a5208B3540f9794B53783p8261a88161e6862A79242
10457a34820L7002A00292i2142k6043C921J18806J4858j4942O940d5405B53307
10445a24223B71964d93474C5724J07506J9677j1029A5557b09867I7269K39893
10435C37162D0549b10118A54925J23255g7459l9171D70173A12559C7134K7440
$$ y = [179720, 279214, 17472, 15555, -242946, 238309, 80736, -217997, -81575, -395463, -42573, -563116, 215303, 3735, 225413, 10113, -8064, -302091, -43521, -23651, -124749, 85704, -84414, 243997, 340329, -372666, -30148, -77629, -238399, -42271, -188383, -92178, 253810, 56559, 52289, -299591, -6132, -207329, 177716, -308281, -250495, -390550, 335587, -237439, 78021, -219647, 166091, 474778, -15208, 23540, -69794, 253783, 175522, -188161, -56862, 179242, -134820, -97818, 100292, -92142, -118185, 3921, 122727, 137585, 122643, 129583, -45405, 253307, -124223, 271964, -493474, 35724, 143230, 162907, 151878, 15557, -209867, 97269, 337162, 40549, -210118, 154925, 278180, -77459, -116630, 470173, 112559, 37134, 64574]
10425F4574P4661a26057j0532B225L04503D6339R925a60881B64569c1225B45780
10413B38851a04714q9641q6189c265l54124d0234l03154B3783N3762A8814a36634
10401c17002E9097b26542C2186b44223A19735M6364a04574q4451g7338B3825a41344
10389b78615B68699f0968q386k37162a08614d9A93692I4143c06735A57232Q6527
10378B43759c03780E6470L38956A90207b1047G3114J15086a46886j35712A12376
10367A25776N7442l520A1815J68796J06157h772B74928R1737A18194J89358E6462
10355B30315K5001L6760K05733j04385r1363K3192N6663j580m0552O2776j80622
10344B21938k5329j0545e5311A65468H1790L0440J63439K86906R101P6532k4547
$$ y = [64574, 139235, -126057, -136589, 2225, 306728, 46339, 56264, -160881, 264569, -31225, 245780, 238851, -104714, -194355, -280544, -3265, -357389, -40234, -343388, 23783, 77545, 18814, -136634, -317002, 59097, -226542, 32186, -244223, 119735, 166099, -104574, -189025, -77338, 23825, -141344, -278615, 268699, -60968, -69354, -306516, -108614, -49, 193692, 94143, -306735, 157232, 243759, -303780, 56470, 395426, 190207, -21047, 73114, 188200, -146886, -282598, 112376, 125776, 183218, 179698, 11815, 180611, 286768, -8772, 274928, 366665, 118194, 307552, 56462, 230315, 255316, 292076, 497809, 393424, 302061, 325253, 381916, 380336, 339784, 402560, 221938, 196609, 186064, -55311, 165468, 81790, 112230, 275669, 562575, 571676, 648208, 623661]
10333F23661j45996j85172Q8455j65463J29243j30497q2123K85024j40711H7844
10322A21788a11356f364A53599Q0407I5822b45166B19298f9392c0434B89482a66816
10310I193L5519J34820N4006j986b37506C188L37208q8259A00727l7013E88J7755
10298A8343a02804j62073C77816A42376i4181j98924k54084A62750C2643L45480
10288C78123a17980B8795a59185g5048A25433o2244a21888D8919J39975D1648
10277g7332B2408L2355K41172i9161B18982j1886o8449M0988G4270b22266B6460
10265h3787H3534a38747K2745j21868I725a46866J0603k4515J0549B24677a56764
10253d8474A30914e6442D27530I4827R0405P6943b20918k2364Q5404A37741h052
$$ y = [623661, 477665, 292493, 380948, 215485, 344728, 214231, 132108, 417132, 276421, 87844, 121788, -111356, -6364, 153599, 234006, 95822, -245166, 219298, -69392, -30434, 289482, -166816, 9193, 44712, 179532, 233538, 231552, -237506, 3188, 340396, 252137, 100727, 63714, 588, 18343, -102804, -264877, 377816, 142376, -94181, -293105, -547189, 162750, 32643, 378123, -117980, 28795, -159185, -75048, 125433, 63189, -121888, 48919, 188894, 41648, -77332, 22408, 54763, 295935, -99161, 218982, 207096, 138647, 179635, 74270, -222266, 26460, -83787, 83534, -138747, -116002, -237870, 9725, -146866, -136263, -160778, -150229, 224677, -156764, -48474, 130914, -56442, 427530, 94827, 185232, 262175, -220918, -243282, -157878, 137741, -8052]
10241A43380f1185A50699j9740D2573H148e5457A71791b2605o565k07696A13581
10229B3198H103e6768A25081a06235A32602a37569k1755K0191C073J02178a43996
10217b7268j48757m7204e0217n4695d8769q9624B2748b45073M7364B6046b26209
10205A63250A2355K04535m4573h9533j82790J07622D9942M6436A3860i9289G6288
10193a89064c3684A53800G278f8549C9029b05717E1234b15120E7282L21805E8968
10181A00740C4058J39340a08876K1439j79190i3499n4209A07412a82993A14810
10170I3966O7348a53971O2835C4447j0649b41156D6379i9378G2873J23398o6555
10159A29716d66961b5115A20508a03675l99253a07285D2270a78200e2835r0973
$$ y = [143380, -61185, 150699, 130959, 42573, 8148, -55457, 171791, -22605, -29170, -236866, 113581, 23198, 8103, -56768, 125081, -106235, 132602, -137569, -159324, -139133, 3073, 105251, -143996, -27268, -176025, -223229, -50217, -104912, -48769, -138393, 22748, -245073, -197709, 26046, -226209, 163250, 12355, 216890, 172317, -89533, -272323, -164701, 49942, 96378, 13860, -99289, 76288, -189064, -33684, 153800, 7278, -68549, 39029, -205717, 51234, -215120, 57282, 379087, 58968, 100740, 34058, 173398, -108876, -87437, -266627, -93499, -147708, 107412, -182993, 114810, 93966, 161314, -153971, -91136, 34447, 23798, -241156, 46379, -99378, 72873, 196271, 129716, -466961, -25115, 120508, -103675, -502928, -107285, 42270, -178200, -52835, -143808]
10149a43808o1898E1183a1382k82094A85662i8565C5509A4637b33127j58177I6865
10137b59435H5369C5285J26644J51274p7466a65912N6230e1157F0233Q6043b57275
10125C946P6869L0449j4095m0609d82986a16099J0319B57576B9543P2216d964
10113a52393r7677J23707b0540k4114k0516F3479a83694j8843I9184L586J58169
10102B60939c01749A54682K38591a68769P1618J9558B0950c86630b7265k81743
10092c09008E8019f8399K824r7918j21681B6457h13k27633F8161b15187o9638
10081b84825J8666l09744B534J2269b69080B1304a92988o5227d1561j51919O4453
10070a29027l08945A01157c2392E8336a43180L5824A98919r5497K07433a06905
$$ y = [-143808, -205706, 51183, -11382, -293476, 185662, -98565, 35509, 14637, -233127, -391304, 96865, -259435, 85369, 35285, 161929, 313203, 235737, -165912, -109682, -51157, 60233, 146276, -257275, 3946, 80815, 111264, 97169, 56560, -482986, -116099, -105780, 257576, 29543, 101759, -4964, -152393, -250070, -126363, -20540, -44654, -65170, 63479, -183694, -202537, 99184, 102770, 260939, -301749, 154682, 393273, -168769, -97151, -77593, 20950, -386630, -27265, -309008, 58019, -68399, -65575, -163493, -285174, 26457, -813, -228446, 68161, -215187, -284825, -266159, -575903, 2534, 14803, -269080, 21304, -192988, -258215, -41561, -193480, -129027, -437972, 101157, -32392, 58336, -143180, -107356, 198919, 103422, 310855, -106905]
10059B38554F4799a39516m6343N9568l616A9923J645e0298C562P3135J49402b89385
10046B08952c57114O6935H2086a18098o3359h069D9407j2000O8784J96521j25436
10035A77276b88291j12152h5741m0832k8382M2357F4514a3411k0445A23397K28759
10024C52156d76656a19471I5298a4672q1997m22085f0075a3308j09328k43749
10014c66385H0142a31980p9829C169K3000a35642A04898A9665a72946m7479O3718
10003a56707A30503K9717a42550Q306j19635r9591A92798B6935k568R1907B8627
9991A32876M4656q3779c8129A29684d0866B66811a6637A03518a78097F7051b5790
9979a41811g191B17521K7657e9501k56845a27826r5124A54068c4243a1263C25009
$$ y = [238554, 64799, -139516, -185859, -126291, -129907, 19923, 21568, -50298, 3562, 76697, 226099, -289385, 208952, -357114, -290179, 82086, -118098, -181457, -8069, 49407, 37407, 106191, 302712, 177276, -288291, -400443, -85741, -126573, -154955, -112598, 64514, -13411, -33856, 123397, 352156, -476656, -119471, 95298, -14672, -96669, -518754, -60075, -13308, -122636, -366385, 80142, -131980, -211809, 3169, 26169, -135642, 104898, 19665, -172946, -220425, -156707, 130503, 160220, -142550, -134244, -253879, -353470, 192798, 26935, 24367, 116274, 28627, 132876, 177532, 93753, -38129, 129684, -40866, 266811, -16637, 103518, -178097, 67051, -25790, -141811, -7191, 217521, 245178, -59501, -316346, -127826, -222950, 154068, -34243, -11263, 325009]
9967A43843b58128a09341A95156J591c21025J47045M0125j46575A02748J11036
9957B13784b34940e9316G4749c08j03116k71241a48896E1139d0626k10297A03175
9945c4888j39232m5491r5619G2790a96888i1888b1044B62298d34230A01595f8850
9933b35372n267O8975a2000A13953b88605A44623D7883g1176J4093E0315e03463
9921f268o1044B8689J6478K20795a12760A65347k0669c90127h9581K6549A90599
9909a90171A25477j8008f918j43059I4033d8049A87162b15374p2195B46669b89063
9897a65449d409j58043a1308A70151A7096C36c0055A85770a10667A5808b62591
9885A03533d06109d2387B07232H0663g8285k12189b0043k25709i1860k49753a30984
$$ y = [143843, -258128, -109341, 195156, 196747, -321025, -173980, -133855, -280430, 102748, 213784, -234940, -59316, 74749, -308, -103424, -374665, -148896, 51139, -40626, -250923, 103175, -34888, -174120, -219611, -315230, 72790, -196888, -91888, -21044, 262298, -434230, 101595, -68850, -235372, -240639, -171664, -12000, 113953, -288605, 144623, 47883, -71176, -57083, 50315, -503463, -6268, -67312, 28689, 45167, 265962, -112760, 165347, 144678, -390127, -89581, -63032, 190599, -190171, 125477, 107469, -6918, -149977, 94033, -48049, 187162, -215374, -287569, 246669, -289063, -165449, -4409, -162452, -11308, 170151, 17096, 336, -30055, 185770, -110667, 15808, -262591, 103533, -406109, -42387, 207232, 80663, -78285, -290474, -20043, -245752, -91860, -341613, -130984]
9873I7373g5193A76842h7994k86674F3421a04625J9426l7843b4902j06449A8730
9861a46871D3116O6339b91626A15571f00433B5363e4182r2872B30212g7734B01444
9849b56668Q8458e6843E4173Q6473a88885B98311Q5667b53508e8491b8849j09122
9838a37971j11550k77698J63855a42238k12220a04002k35072A02792a28647N5703
9828g2944n127n7531N5433E7171a09455d838n4017j03283M1725j88756E3603c20523
9815a50449O3817H6295a96795B405d3396n0169j28018J07317C6386a82j62996
9804a63178j19566a246m30928b6510j40040m9231a03080K1840k23426J8908D08920
9792i8875L9549E6685g5184F7319a92051l0289d1369j71731a03289k14899b6202
$$ y = [97373, -75193, 176842, -87994, -374668, 63421, -104625, -85199, -123042, -24902, -131351, 18730, -146871, 43116, 109455, -291626, 115571, -600433, 25363, -54182, -147054, 230212, -77734, 201444, -256668, -168210, -56843, 54173, 140646, -188885, 298311, 383978, -253508, -58491, -28849, -137971, -249521, -527219, -363364, -142238, -354458, -104002, -339074, 102792, -128647, -72944, -78071, -135602, -80169, 57171, -109455, -4838, -58855, -162138, -120413, -309169, 53603, -320523, -150449, -86632, 86295, -196795, 2405, -43396, -93565, -221583, -114266, 36386, -182, -163178, -282744, -1246, -432174, -26510, -166550, -215781, -103080, -81240, -304666, -285758, 408920, -98875, -59326, 56685, -75184, 67319, -192051, -222340, -41369, -213100, -103289, -318188, -26202]
9780a02565B50379A01182a46977P3199j81599A9159N1171Q0515Q5484c44281A63802
9768h1107B36588e57518K77341g2615A19888a52189M5296C6156P6669B3055O3872
9757H6927a03117l29579A3637L2065G898a90075B1945b65495C10602j28491c99666
9745A07806D2847i7941L8608p0355l91494F2125d1634I1370K0894a99897f7393
9733E4455b92067J43214m7022B1886a11725B38857k291a03339B43358C8682a14177
9721A08705e017A04362b95636E3847a99487r4683A72188a70625J1672A89880i1485
9709D8420N9204a25711l5437j90290c9377k37487B53253b29825b6201l0635m21925
9698d78761c038B58674h5882j47373p145h8761k04645f2483A47022b155A6071
$$ y = [-102565, 250379, 101182, -146977, -73778, -255377, 19159, 70330, 150845, 236329, -344281, 163802, -81107, 236588, -557518, -280177, -72615, 119888, -152189, -106893, 36156, 112825, 23055, 86927, -103117, -432696, 13637, 45702, 7898, -190075, 21945, -265495, 310602, 182111, -399666, 107806, 42847, -97941, -59333, -129688, -521182, 62125, -41634, 91370, 112264, -199897, -67393, 54455, -292067, -148853, -195875, 21886, -111725, 238857, 236566, -103339, 243358, 38682, -114177, 108705, -5017, 104362, -295636, 53847, -199487, -294170, 172188, -170625, -158953, 189880, -91485, 48420, 107624, -125711, -161148, -351438, -39377, -276864, 253253, -229825, -26201, -56836, -478761, -3038, 258674, -85882, -233255, -240400, -88761, -293406, -62483, 147022, -2155, 16071]
9686C227b33778A69084a03925l9497A04725g1960A9838J82275a51289e6763A84247
9674A06112a64324j1421b6292j65761h9305j10513D2953i9660j06526p8373F1421
9662h5280I7690e8381n8191d9578d918k14749b363j14945A66290m2073a37475
9650A58895J21703c29303A3605a88043m6387A34006J65295B1094J75407r1258
9640A05243a22862A64326d94793F0143R0814b03782J01302p1000r5246H3773f7180
9628B9235g4035q1341a309C95551g797m7678E7525R876a9788k62038a01916j33367
9616b35283A70620C3977o244b82978J38351l57N4836j66052F6697b14795d1592
9604C57763a63855A21812b66135j19080a4740r0357k18440g9020A95865d666G9429
$$ y = [3227, -233778, 169084, -103925, -143422, 104725, -71960, 19838, 202113, -151289, -56763, 184247, 106112, -164324, -175745, -26292, -192053, -89305, -199818, 42953, -99660, -206186, -284559, 61421, -85280, 97690, -58381, -116572, -49578, -4918, -219667, -2363, -117308, 166290, 124217, -137475, 158895, 280598, -329303, 13605, -188043, -234430, 134006, 299301, 21094, 196501, 105243, -122862, 164326, -494793, 60143, 150957, -203782, -102480, -173480, -268726, 83773, -67180, 29235, -74035, -155376, -1309, 395551, -7797, -55475, 57525, 67401, -19788, -281826, -101916, -235283, 170620, 33977, 27733, -282978, -144627, -144984, -90148, -256200, 66697, -214795, -41592, 357763, -163855, 121812, -266135, -385215, -14740, -105097, -323537, -79020, 195865, -4666, 79429]
9592b1044j54832C2862a11275M2661j45569A29893g1417p9427c3453a5972H3060
9580b37708n2766j1207e5409i620E153e8204G860f00848G464h8307p6806A12941
9567a03396k33045a33342I6768a26195d3033B03809d22041a20740c5280A07611
9556b82998e9750E3722J15699a84351g5583K0818E0931a50225A68646a33558k55580
9545c89138A0176O5280B0369a51772H8096J20017F4439L2648i1209b992G3432
9533f8030j4723j41002d3642n2751d1106k00951a5640C88573d3705j17592j2386
9522a73683C0752c70269F5334a31461n1823B28238K86348a76425R702D5859c7089
9510A63553C1311b21098O3669M4227m4037I6523J18182m9989a3604j84756A43287
$$ y = [-21044, -175876, 32862, -111275, -68614, -214183, 129893, -71417, -150844, -33453, -15972, 83060, -237708, -290474, -301681, -55409, -9620, 5153, -58204, 7860, -600848, 7464, -88307, -165113, 112941, -103396, -336441, -133342, 96768, -126195, -43033, 203809, -422041, -120740, -35280, 107611, -282998, -59750, 53722, 169421, -184351, -75583, -54765, 50931, -150225, 168646, -133558, -389138, 10176, 75456, 20369, -151772, 88096, 208113, 64439, 97087, -91209, -2992, 73432, -68030, -82753, -223755, -43642, -96393, -41106, -242057, -15640, 388573, -43705, -161297, -173683, 30752, -370269, 65334, -131461, -183284, 228238, 514586, -176425, -166723, 45859, -37089, 163553, 31311, -221098, -157429, -113202, -157239, 96523, 214705, 164716, -13604, -198360, 143287]
9498b23001l7381C3098i1969B44103b15916M0470j3823A25679b16648A00766H517
9486a88864k2425A25647A222b402j31613J610A56313n8588h9536E087K45944q3384
9474A67647a44611j12965C8799b3783r3068B29095a86286A40721k3089a31572
9463A08890d41777e7125D265p95a22203c5937A67440a6032j27859e547j02495
9452a08042p1366B19388E4938b9076k18648p0909P9760D3623M7846C3826b00545
9440i9388J1094K2500B75158f8809l0150j2682C2728a68741d9965k0547A06240
9428B27670h4152A07976f8638m24100a47630j59135f870k35386Q3056A34942l2383
9417A02559b20019H3967b24570h0476j9015b7716k75331E0532c66080J49015j10904
$$ y = [-223001, -260382, 33098, -91969, 244103, -215916, -175446, -189269, 125679, -216648, 100766, 8517, -188864, -211289, 125647, 1222, -2402, -134015, -132405, 156313, 97725, -89536, 5087, 251031, 167647, -144611, -257576, 38799, -23783, -116851, 229095, -186286, 140721, 117632, -131572, 108890, -441777, -57125, 4265, 3470, -122203, -35937, 167440, -16032, -143891, -5547, -108042, -179408, 219388, 54938, -29076, -247724, -318633, -238873, 43623, 91469, 33826, -200545, -99388, -88294, -65794, 275158, -68809, -98959, -111641, 32728, -168741, -49965, -70512, 106240, 227670, -84152, 107976, -68638, -492738, -147630, -306765, -6870, -242256, -159200, 134942, 102559, -220019, 83967, -224570, -80476, -99491, -27716, -303047, 50532, -366080, -217065, -327969]
9406c27969C75494b13590B17001o0601c0237C6985K59199A11932a17574j50599
9396b68173A09839a21778G1074f195j47833c6114A52867g2734j43578a9431p7503
9385i6934B35159e0579j53667r7112G964J82435C9772b26500j7987L2011i0892
9373a4313B59744O6710a6177C8781d80309B6375c5168A04862b04829a4392k0974
9362c5366j34948q7865A05439g8721k69426a11282c2562A97287D5784b78186o1752
9351c39938C43942g8278l9174r1405K4260b4156k65106B35758a36035C29618r1714
9340B37904b55201A53761h9998I7897h1184A35986c11106K3170O8671H0272b83853
9328a01445l5576D13035A87989e826r4425o3878O4661A12370g7418k52468i8125
$$ y = [-327969, 375494, -213590, 217001, 156400, -30237, 36985, 296184, 111932, -117574, -268173, 109839, -121778, 71074, -6195, -154028, -36114, 152867, -72734, -216312, -19431, -96934, 235159, -50579, -204246, -301358, 7964, 190399, 39772, -226500, -244487, -212476, -90892, -14313, 259744, 326454, -16177, 38781, -480309, 26375, -35168, 104862, -204829, -14392, -35366, -170314, -258179, 105439, -78721, -348147, -111282, -32562, 197287, 45784, -278186, -339938, 343942, -78278, -117452, -208857, -184597, -24156, -289262, 235758, -136035, 329618, 237904, -255201, 153761, -89998, 97897, -81184, 135986, -311106, -287936, -219265, 80272, -283853, -101445, -137021, 413035, 187989, -5826, -100251, -164129, -99468, 112370, -77418, -329886, -98125]
9316C03704J7972d6384m8074p3252f7709p7993d3974B32528c26013a27156e1102
9304a96365m1238C60402a17858d5289A96157G6299e102p8227H8121K1429b07864
9292F4666b69956p6344B6760c42220a02107n2572A94688a76731b7050k8747j19417
9281a75214p7175a06626C8636a61578g2000q5755j80658a0575k4388A61414b56346
9269E3198B6395a9330B81726d12531a56012A57694d85800i7944b2712C076L120
9258F196c41695A67012a36830f7199C5109h1315A66379j1637b8560n782k74047
9247c08389i2797j64972A24355c25343a26446i311B09428A9125h1741G5127a58793
9235i6598l5762k4847c5747j55271g1300F7018a15263C5630J40864q7839a92323
$$ y = [303704, 321676, -46384, -94458, -167710, -67709, -145702, -43974, 232528, -326013, -127156, -51102, -196365, -237603, 360402, -117858, -45289, 196157, 76299, -5102, -83329, 88121, 109550, -207864, 64666, -269956, -346300, 26760, -342220, -102107, -154679, 194688, -176731, -27050, -55797, -175214, -252389, -106626, 38636, -161578, -72000, -157755, -338413, -10575, -34963, 161414, -256346, 53198, 26395, -19330, 281726, -412531, -156012, 157694, -485800, -97944, -22712, 3076, 6196, -341695, 167012, -136830, -67199, 35109, -81315, 166379, 154742, -28560, -34342, -308389, -92797, -257769, 124355, -325343, -126446, -9311, 209428, 19125, -81741, 75127, -158793, -96598, -132360, -157207, -35747, -191018, -71300, 67018, -115263, 35630, 176494, 88655, -192323]
9223f1923G8749a5136l08200J55209D949b02219q75A51110i0321B94367A5653
9211b82264F7949R4793i8381b1852j94246F8605i2463I1172L6626b45804o4556
9200c10360P7801b258r529D8333J836P0714j9955K7212b510k3801j04419j40647
9188b71377H4919d9828I9871d6552j76417n3920A42348b45211C3935J07500J4039
9177A55474a66938A02046d4737A67200A4510a46263j12200A75909b08227b1684
9166H4253e4291D3603a88740B51409A12665d78532C4254K33241i4341l0635E39969
9154b5342A42218K4597c55132A88906L3693b50689J2800A66870K5927a71568B6016
9142a27706q3e418l94818G360a07708r104n0977g3233m0789B06369b56711c3773
$$ y = [-61923, 78749, -15136, -323336, -168127, 4949, -202219, -203094, 151110, -90321, 294367, 15653, -282264, 67949, 162742, -98381, -21852, -216098, 68605, -92463, 91172, 127798, -245804, -310360, -232559, -2258, -11787, 48333, 50169, 120883, 100928, 128140, -2510, -26311, -130730, -271377, 84919, -49828, 99871, -46552, -222969, -276889, 142348, -245211, 33935, 141435, 155474, -166938, 102046, -44737, 167200, 14510, -146263, -258463, 175909, -208227, -21684, 84253, -54291, 43603, -188740, 251409, 112665, -478532, 34254, 267495, -94341, -124976, 539969, -25342, 142218, 166815, -355132, 188906, 222599, -250689, -237889, 166870, 192797, -171568, 26016, -127706, -127789, -5418, -400236, 7360, -107708, -116812, -167789, -73233, -114022, 206369, -256711, -33773]
9129A50862f7431j60557F0477f02525F0437a79884r048B44927a14075I5886k8632
9118F7254a30552k466A15230B138b20337k7601a07239A94325i7681q9048M7236
9107a39493k07141J16051e6618k94724P5765J32116A61771A5198e8343B2832a26482
9095A36052E7845a48426H8449a28493M5336E2271i0153A1629b4011A43213K65684
9084D08897f5231F5984a85837L7609d6582j34981b3576E7769a63744M556B6399
9072b83838a525n6136K0467B86802b26923B20943C2313b80812A13459a6349A29027
9060b602l13961E9288a89783l1905P5587j36958B05467d3216A05018a38056B9709
9048b62753j5698c9345p0961c0419B03253d30780a61006A06556J11202a79289
$$ y = [150862, -67431, -227988, 60477, -602525, 60437, -179884, -188932, 244927, -114075, 95886, 67254, -130552, -133018, 115230, 2138, -220337, -247938, -107239, 194325, -97681, -186729, -139493, -346634, -230583, -56618, -351342, -275577, -143461, 161771, 15198, -58343, 22832, -126482, 136052, 57845, -148426, 88449, -128493, -83157, 52271, -90153, 11629, -24011, 143213, 408897, -65231, 65984, -185837, -148228, -46582, -181563, -23576, 57769, -163744, -159188, 26399, -283838, -1525, -57661, -37194, 286802, -226923, 220943, 32313, -280812, 113459, -16349, 129027, -2602, -316563, 59288, -189783, -221688, -146101, -283059, 205467, -43216, 105018, -138056, 29709, -262753, -278451, -39345, -110306, -30419, 203253, -430780, -161006, 106556, 217758, -179289]
9037a10279H1868B0340g9494f872j97311a5562j56118A72049N6279a22542j1551
9026a34093A94883a73194A63564a84317L3695G0238a58620E8439c0806B30541
9015d23094B36690a22679B6515b43812C71844A14334c57571f0379A15408b14683
9004a04022n1047A02126R4025a57915A61635g3559j3583j92728j74A95572a67077
8992a14530M6201B37064a29989L7069k48744f5318a8411n4011q4725A11498l2608
8981G8890b35832J12149r7474g4223r5780P0243I651J97863a817H321J9660f8368
8968a50145q5696A62139Q9453a61810k4045P6852j97205A63213b22439h7396j61049
8957b48445F6327e14498a7863A1404L13075h3300J2721n4385k399j16118r4972
$$ y = [-110279, 81868, 20340, -79494, -6872, -204183, -15562, -171680, 172049, 228328, -122542, -134093, 194883, -173194, 163564, -184317, -150622, 70238, -158620, 58439, -30806, 230541, -423094, 236690, -122679, 26515, -243812, 371844, 114334, -357571, -60379, 115408, -214683, -104022, -155069, 102126, 196151, -157915, 161635, -73559, -87142, -279870, -280044, 195572, -167077, -114530, -68329, 237064, -129989, -92920, -341664, -65318, -18411, -72422, -157147, 111498, 78890, -235832, -123683, -221157, -74223, -170003, -99760, 9651, 207514, -1817, 8321, 27981, -68368, -150145, -235841, 162139, 251592, -161810, -185855, -109003, -306208, 163213, -222439, -87396, -248445, 66327, -514498, -17863, 11404, 324479, -83300, -70579, -124964, -127363, -243481, -338453]
8946c38453D8282c1824A45881a04304J5693A85250G0998K6348b41137A4600J68289
8935A82889a44290B58355j28899a21981F0029a47037L227M2410F9064b83567f3939
8923f0211K1148C12727a03840k31715A52374F3945J36168J48836f0044j04552
8913a64596D0198A8382J18758Q8823J9527J00769Q72188N91103p25050D47536
8902D69467e4650B8236J32675a41240B08110G6096O839f0501A53048K39563I3501
8890A01538a1679C3505f490j82257d274C1291f8418E4941a68137p8044A21678
8878C0670D231J16477k6059B548J88922q3418l0718E99a25505L5447r9426A58790
8865A39592l3165k6246b27019O2713k8287K5893C6070a76124m2802A41134L8281
$$ y = [-338453, 48282, -31824, 145881, -104304, -88611, 185250, 70998, 97346, -241137, 14600, 182889, -144290, 258355, 129456, -121981, 60029, -147037, -143810, -101400, 69064, -283567, -63939, -60211, -39063, 312727, -103840, -335555, 152374, 63945, 200113, 348949, -60044, -164596, 40198, 18382, 137140, 225963, 245490, 346259, 1218447, 1809550, 1084500, 447536, 469467, -54650, 28236, 160911, -141240, 208110, 76096, 82935, -60501, 153048, 392611, 93501, 101538, -11679, 33505, -6490, -188747, -4274, 31291, -68418, 54941, -168137, -246181, 121678, 30670, 4231, 120708, 94649, 2548, 191470, 108052, 77334, 599, -125505, -90058, -189484, 158790, 139592, 106427, 80181, -227019, -164306, -192593, -166700, 36070, -176124, -218926, 141134, 179415]
8854A79415b99091f7946k2977q1481F7144b62606g3502A288a02048k8140L2215
8843i7973E3504d0433k29890C28603E3349n75h4765k48690i2041B26697a70537
8831b33721R9468j31872N4579a5518j73915p3588a4602k93082A41916K73735a80523
8819A26646b84048C683i2137A14976a64152B61696l0440b39112n8755A30537B6177
$$ y = [179415, -299091, -67946, -90923, -172404, 67144, -262606, -73502, 1288, -102048, -130188, -97973, 53504, -40433, -270323, 328603, 53349, 52774, -84765, -333455, -92041, 226697, -170537, -233721, -134253, -266125, -211546, -15518, -189433, -263021, -14602, -307684, 141916, 415651, -180523, 126646, -284048, 3683, -92137, 114976, -164152, 261696, 231256, -239112, -297867, 130537, 26177]
$$ [...]
##END NTUPLES=NMR SPECTRUM
##END=
