
##TITLE=AC1228_VIERSDE097_6075064_qxoipnyZqV
##JCAMPDX= 6.0         $$ Bruker NMR JCAMP-DX V2.0
##DATA TYPE= NMR SPECTRUM
##DATA CLASS= NTUPLES
##ORIGIN= BRUKER
##OWNER= Administrator
$$ 1.72 TOPSPIN		Version 2.1
$$ 2012-05-07 23:34:07.000 -0500  Administrator@TOPSPIN
$$ Compression mode = diff/dup
##.OBSERVE FREQUENCY= 400.13188235
##.OBSERVE NUCLEUS= ^1H
##.ACQUISITION MODE= SIMULTANEOUS (DQD)
##.ACQUISITION SCHEME= undefined
##.AVERAGES= 64
##.DIGITISER RES= 22
##SPECTROMETER/DATA SYSTEM= spect
##.PULSE SEQUENCE= noesygpps1d.comp
##.SOLVENT NAME= COFFEE_meoh
##.SHIFT REFERENCE= INTERNAL, COFFEE_meoh, 1, 14.96653
##AUDIT TRAIL= $$ (NUMBER, WHEN, WHO, WHERE, PROCESS, VERSION, WHAT)
$$ ##TITLE= Audit trail, TOPSPIN		Version 2.1
$$ ##JCAMPDX= 5.01
$$ ##ORIGIN= Bruker BioSpin GmbH
$$ ##OWNER= Administrator
$$ $$ C:\Bruker\TOPSPIN/data/COFFEE/nmr/AC1228_VIERSDE097_6075064_qxoipnyZqV/12/pdata/1/auditp.txt
$$ ##AUDIT TRAIL=  $$ (NUMBER, WHEN, WHO, WHERE, PROCESS, VERSION, WHAT)
(   1,<2012-05-07 23:34:01.953 -0500>,<Administrator>,<TOPSPIN>,<go>,<TOPSPIN 2.1>,
      <created by zg
	started at 2012-05-07 23:22:31.609 -0500,
	POWCHK enabled, PULCHK disabled,
       configuration hash MD5:
       AF F2 23 6B 01 CD 40 DD E5 A1 38 A0 06 EA F7 77
       data hash MD5: 64K
       98 7D 98 37 A6 54 63 6C BF 5C 1A 0B 02 EC 27 5F>)
(   2,<2012-05-07 23:34:04.687 -0500>,<Administrator>,<TOPSPIN>,<proc1d>,<TOPSPIN 2.1>,
      <Start of raw data processing
       efp LB = 0.3 FT_mod = 6 PKNL = 1 PHC0 = 0 PHC1 = 0 SI = 128K 
       data hash MD5: 128K
       CD A6 1B D4 AD 67 70 F8 A9 11 93 92 DB 19 D1 1C>)
(   3,<2012-05-07 23:34:05.984 -0500>,<Administrator>,<TOPSPIN>,<proc1d>,<TOPSPIN 2.1>,
      <pk PHC0 = 32.52502 PHC1 = 0 
       data hash MD5: 128K
       25 F6 D4 20 18 04 8D BE CE 65 83 D0 34 92 42 EF>)
(   4,<2012-05-07 23:34:06.656 -0500>,<Administrator>,<TOPSPIN>,<proc1d>,<TOPSPIN 2.1>,
      <abs ABSG = 1 
       data hash MD5: 128K
       95 AF 90 18 C2 BC 02 7D 09 1B 19 40 93 72 CA BA>)
(   5,<2012-05-07 23:34:06.718 -0500>,<Administrator>,<TOPSPIN>,<proc1d>,<TOPSPIN 2.1>,
      <abs ABSG = 2 
       data hash MD5: 128K
       A6 A1 99 14 6A AF 49 66 55 37 9E 69 C6 AC 4F FE>)
(   6,<2012-05-07 23:34:06.781 -0500>,<Administrator>,<TOPSPIN>,<proc1d>,<TOPSPIN 2.1>,
      <abs ABSG = 3 
       data hash MD5: 128K
       A5 D8 C6 FD FE 4E 47 B6 8B 99 1F 77 67 6F 5C 92>)
(   7,<2012-05-07 23:34:06.859 -0500>,<Administrator>,<TOPSPIN>,<proc1d>,<TOPSPIN 2.1>,
      <abs ABSG = 4 
       data hash MD5: 128K
       4B A9 B9 B4 8D C2 CE A4 14 E0 94 C2 53 25 7E EF>)
(   8,<2012-05-07 23:34:06.921 -0500>,<Administrator>,<TOPSPIN>,<proc1d>,<TOPSPIN 2.1>,
      <abs ABSG = 5 
       data hash MD5: 128K
       52 A1 13 82 37 84 2F 46 74 B6 41 0E 72 53 5A 96>)
$$ ##END=
$$ 
$$ $$ hash MD5
$$ $$ 23 30 C3 FF 09 D6 14 06 B4 B5 03 9B 3D 4C 1E 7C
##$RELAX= 
##$RELAX= 
##$RELAX= 
##$RELAX= 
##$RELAX= 
##$RELAX= 
##$RELAX= 
##$RELAX= 
$$ Bruker specific parameters
$$ [...]
150 150 150 150 150 150 150 150
##$TP07= 0
##$TPNAME0= <>
##$TPNAME1= <>
##$TPNAME2= <>
##$TPNAME3= <>
##$TPNAME4= <>
##$TPNAME5= <>
##$TPNAME6= <>
##$TPNAME7= <>
##$TPOAL= (0..7)
0.5 0.5 0.5 0.5 0.5 0.5 0.5 0.5
##$TPOFFS= (0..7)
0 0 0 0 0 0 0 0
##$TUNHIN= 0
##$TUNHOUT= 0
##$TUNXOUT= 0
##$USERA1= <user>
##$USERA2= <user>
##$USERA3= <user>
##$USERA4= <user>
##$USERA5= <user>
##$V9= 5
##$VALIST= <valist>
##$VCLIST= <CCCCCCCCCCCCCCC>
##$VD= 0
##$VDLIST= <DDDDDDDDDDDDDDD>
##$VPLIST= <PPPPPPPPPPPPPPP>
##$VTLIST= <TTTTTTTTTTTTTTT>
##$WBST= 1024
##$WBSW= 4
##$XGAIN= (0..3)
0 0 0 0
##$XL= 0
##$YL= 0
##$YMAX_a= 9287482
##$YMIN_a= -4950561
##$ZGOPTNS= <>
##$ZL1= 120
##$ZL2= 120
##$ZL3= 120
##$ZL4= 120
##$ABSF1= 14.96653
##$ABSF2= -5.586
##$ABSG= 5
##$ABSL= 3
##$ALPHA= 0
##$AQORDER= 0
##$ASSFAC= 0
##$ASSFACI= 0
##$ASSFACX= 0
##$ASSWID= 0
##$AUNMP= <proc_prof1d_extract.lims>
##$AXLEFT= 0
##$AXNAME= <>
##$AXNUC= <1H>
##$AXRIGHT= 0
##$AXTYPE= 0
##$AXUNIT= <>
##$AZFE= 0.1
##$AZFW= 0.1
##$BCFW= 0
##$BC_mod= 0
##$BYTORDP= 0
##$COROFFS= 0
##$CY= 15
##$DATMOD= 1
##$DC= 0
##$DFILT= <>
##$DTYPP= 0
##$F1P= 0
##$F2P= 0
##$FCOR= 0.5
##$FTSIZE= 131072
##$FT_mod= 6
##$GAMMA= 0
##$GB= 0
##$INTBC= 1
##$INTSCL= 1
##$ISEN= 128
##$LB= 0.3
##$LEV0= 0
##$LPBIN= 0
##$MAXI= 10000
##$MC2= 0
##$MEAN= 0
##$ME_mod= 0
##$MI= 0
##$NCOEF= 0
##$NC_proc= -3
##$NLEV= 6
##$NOISF1= 0
##$NOISF2= 0
##$NSP= 0
##$NTH_PI= 0
##$NZP= 0
##$OFFSET= 14.96653
##$PC= 1
##$PHC0= 32.52502
##$PHC1= 0
##$PH_mod= 1
##$PKNL= yes
##$PPARMOD= 0
##$PPDIAG= 0
##$PPIPTYP= 0
##$PPMPNUM= 2147483647
##$PPRESOL= 1
##$PSCAL= 4
##$PSIGN= 0
##$PYNMP= <proc.py>
##$REVERSE= no
##$SF= 400.130005635602
##$SI= 131072
##$SIGF1= 0
##$SIGF2= 0
##$SINO= 400
##$SIOLD= 131072
##$SPECTYP= <>
##$SREGLST= <1H.CDCl3>
##$SSB= 0
##$STSI= 131072
##$STSR= 0
##$SW_p= 8223.68421052632
##$SYMM= 0
##$S_DEV= 0
##$TDeff= 65536
##$TDoff= 0
##$TI= <>
##$TILT= no
##$TM1= 0
##$TM2= 0
##$TOPLEV= 0
##$USERP1= <user>
##$USERP2= <user>
##$USERP3= <user>
##$USERP4= <user>
##$USERP5= <user>
##$WDW= 1
##$XDIM= 131072
##$YMAX_p= 392451664
##$YMIN_p= -34691043
##$CURPLOT= <Network HP LaserJet P1505>
##$CURPRIN= <$Network HP LaserJet P1505>
##$DFORMAT= <normdp>
##$LAYOUT= <+/1D_H.xwp>
##$LFORMAT= <normlp>
##$PFORMAT= <normpl>
##$SURQMSG= 1
$$ End of Bruker specific parameters
$$ ---------------------------------
##NTUPLES= NMR SPECTRUM
##VAR_NAME=  FREQUENCY,     SPECTRUM/REAL,   SPECTRUM/IMAG
##SYMBOL=    X,             R,               I
##VAR_TYPE=  INDEPENDENT,   DEPENDENT,       DEPENDENT
##VAR_FORM=  AFFN,          ASDF,            ASDF
##VAR_DIM=   131072,        131072,          131072
##UNITS=     HZ,            ARBITRARY UNITS, ARBITRARY UNITS
##FACTOR=    0.0627417313425165, 1,          1
##FIRST=     8223.62146879498, 1078,         -80844
##LAST=      0,             4350,            -80995
##MIN=       0,             -34691043,       0
##MAX=       8223.62146879498, 392451664,    0
$$ Real data points
##PAGE= N=1
##DATA TABLE= (X++(R..R)), XYDATA
$$ [...]
61468E15387J207p8k400m018l923k619j587k268m670o739o187l281p30l78j316
61453D76400j817j579j140n26K08J80j135k791l540l257k170P6L190N258M824
61438D72181K981J660Q03o84k075j571M27J447N73o19j130j965l535m111k508
61423D61874l82l9j235j918j296m16k61o78j104j187o89L61J439K041K207K161
61407D60878J722O12r42k399l463m121m438m531m468m015k937j635q36n56n5Q82
61391D29698J453J116M88M67J097J848K379K476J958J131P17Q91J171J669L316
61376D51875O002P721O857M471K943K982L487L800M258M679M195K960K415L203
61362E11848M242M566M759N479N864M803L073K545L490M143L245J637P33M51l19
$$ y = [515387, 516594, 516516, 514116, 510098, 506175, 503556, 501969, 499701, 495031, 488292, 482105, 478824, 478094, 477716, 476400, 474583, 473004, 471864, 471338, 471546, 471726, 470591, 467800, 464260, 461003, 458833, 458909, 462099, 467357, 472181, 475162, 476822, 477625, 476941, 474866, 473295, 473722, 475169, 475742, 475123, 473993, 472028, 468493, 464382, 461874, 461492, 461453, 460218, 458300, 457004, 456588, 456327, 455649, 454545, 453358, 452669, 453030, 454469, 456510, 458717, 460878, 462600, 463212, 462270, 459871, 456408, 452287, 447849, 443318, 438850, 434835, 431898, 430263, 429427, 428871, 428816, 429698, 431151, 432267, 432755, 433222, 434319, 436167, 438546, 441022, 442980, 444111, 444828, 445719, 446890, 448559, 451875, 457877, 465598, 472455, 476926, 479869, 482851, 486338, 490138, 494396, 499075, 503270, 506230, 508645, 511848, 516090, 520656, 525415, 530894, 536758, 541561, 544634, 547179, 550669, 554812, 558057, 559694, 560427, 560878, 560559]
61347E60559j780k907l030k818l356m788o251o720n748l887k510k684l731l657
61333E06692j574R50J879J383J293K170K547J304o19j630j421p45k13j07n80j161
61317E10168q62L69J126N14k96K72J662K068J298J025K042L199L536L740M558
61302E34419N186M526L113K464L076M228N374O562P589P988P945Q294R284J0243
61288F20291J0809J1607J3109J4459J4385J3036J2027J2533J3945J4653J3691
61277G64545J1371Q709O728N967O155O345N738M350K644P72j308l113l845l537
61263H11521l352m255n821o844o734n910n042m583m745n315n498m625l154k339
61249G43304k693l319l155k363j782j381j49K294M804O052O166O150N964M380
$$ y = [560559, 558779, 555872, 552842, 550024, 546668, 541880, 535629, 528909, 523161, 519274, 516764, 514080, 510349, 506692, 505118, 506068, 507947, 509330, 510623, 512793, 515340, 516644, 516025, 514395, 512974, 512229, 512016, 511909, 511329, 510168, 509306, 509675, 510801, 511315, 511019, 511291, 512953, 515021, 516319, 517344, 519386, 522585, 526121, 529861, 534419, 539605, 544131, 547244, 549708, 552784, 557012, 562386, 568948, 576537, 584525, 592470, 600764, 610048, 620291, 631100, 642707, 655816, 670275, 684660, 697696, 709723, 722256, 736201, 750854, 764545, 775916, 784625, 791353, 797320, 803475, 809820, 815558, 819908, 822552, 823324, 822016, 818903, 815058, 811521, 808169, 803914, 798093, 791249, 784515, 778605, 773563, 768980, 764235, 758920, 753422, 748797, 745643, 743304, 740611, 737292, 734137, 731774, 729992, 728611, 728462, 730756, 735560, 741612, 747778, 753928, 759892, 764272]
61235G64272J072k371m294n074o158p536p722o218m512m031m259l741k105k59
61221G07064R51J424J598K152L515N219O204O314O724Q234J0014J1014J1690J2934
61207G95051J4020J3453J1620J0673J1560J2907J3408J3527J3999J4386J4394
61196I38998J5166J7530J9906J9876J7446J4996J3962J3277J1394Q409N478L212
61184A099650J504K13q61k300m585p406r870j1340j1859j1922j1995j2055j1569
61171A005605j0310r154r425j1152j2602j2067r609o560l948k198j744k716m135
61158I09985m617m054l587l690l457k320j346j844l352m125l216j287M23J007
61144H74520J67j460k344j297J179L498M823N606O428P332Q414J0104J2545J5403
$$ y = [764272, 765344, 762973, 758679, 753605, 747447, 739911, 732189, 725971, 721459, 717428, 713169, 709428, 707323, 707064, 708015, 709439, 711037, 713189, 716704, 721923, 728127, 734441, 741165, 749399, 759413, 770427, 782117, 795051, 809071, 822524, 834144, 844817, 856377, 869284, 882692, 896219, 910218, 924604, 938998, 954164, 971694, 991600, 1011476, 1028922, 1043918, 1057880, 1071157, 1082551, 1090960, 1096438, 1099650, 1101154, 1101367, 1100506, 1098206, 1093621, 1086215, 1076345, 1065005, 1053146, 1041224, 1029229, 1017174, 1005605, 995295, 986141, 976716, 965564, 952962, 940895, 931286, 924726, 920778, 918580, 916836, 914120, 909985, 905368, 901314, 897727, 894037, 890580, 888260, 886914, 885070, 881718, 877593, 874377, 873090, 873513, 874520, 874687, 873227, 870883, 869586, 870765, 874263, 879086, 884692, 891120, 898452, 906866, 916970, 929515, 944918]
61130I44918J8463K1578K3988K4614K3514K2067K1295K0888K0191J9163J7794
61119A178473J5806J3666J2795J3675J4703J4093J2089J0007Q023N434K560N52
61107A301876n44j808l465m494m607n070o951r695j2113j3770j4879j5711j6635
61094A192134j7876j8807j8418j6898j5705j5520j5243j3714j1339r027o762m439
61082A028386l187m244o883r022r734r874j0210j0437j0281j0274j0757j1088
61070I22395j0525r225p668n671k797O29L565N314O064O599P912J0803J5163J9486
61056I62044K1839K1719K0710K0952K3127K6167K8601K9735K9690K8985K8314
61045A241883K8171K8315K7909K6553K4857K3554K2362K0302J7056J3291R533
$$ y = [944918, 963381, 984959, 1008947, 1033561, 1057075, 1079142, 1100437, 1121325, 1141516, 1160679, 1178473, 1194279, 1207945, 1220740, 1234415, 1249118, 1263211, 1275300, 1285307, 1293330, 1298764, 1301324, 1301876, 1301332, 1299524, 1296059, 1291565, 1286958, 1281888, 1274937, 1265242, 1253129, 1239359, 1224480, 1208769, 1192134, 1174258, 1155451, 1137033, 1120135, 1104430, 1088910, 1073667, 1059953, 1048614, 1039587, 1032825, 1028386, 1025199, 1020955, 1014072, 1005050, 995316, 985442, 975232, 964795, 954514, 944240, 933483, 922395, 911870, 902645, 894977, 889306, 886509, 887138, 890703, 896017, 902081, 908680, 916592, 927395, 942558, 962044, 983883, 1005602, 1026312, 1047264, 1070391, 1096558, 1125159, 1154894, 1184584, 1213569, 1241883, 1270054, 1298369, 1326278, 1352831, 1377688, 1401242, 1423604, 1443906, 1460962, 1474253, 1483786]
61034A483786N429N46m544q578j0971j2513j4550j7719k1599k5462k8987l1973
61022A312865l3755l3664l2256l1277l1754l2750l2691l1384k9751k8025k5587
61011I69971k2530j9937j8247j6668j4779j3433j3234j3275j2450j1060r895q641
60999G95822o657m635l680l107j117K237M610M579L557L610M818O092P411R535
60985H23075J2160J4048J4955J5956J7734J9779K1596K3434K5257K6147K5668
60974A039809K5073K6085K8875L2115L4794L7045L9304M1625M4090M7087N0853
60963A446755N5309O0591O7173P5196Q4149R3640J04025J16048J30423J47678
60953B380987J66826J82706J85641J66632J25013P1036K0147j5878l3224l3949
$$ y = [1483786, 1489215, 1489761, 1485217, 1476639, 1465668, 1453155, 1438605, 1420886, 1399287, 1373825, 1344838, 1312865, 1279110, 1245446, 1213190, 1181913, 1150159, 1117409, 1084718, 1053334, 1023583, 995558, 969971, 947441, 927504, 909257, 892589, 877810, 864377, 851143, 837868, 825418, 814358, 804463, 795822, 789165, 784530, 780850, 777743, 776626, 778863, 783473, 788052, 791609, 795219, 800037, 806129, 813540, 823075, 835235, 849283, 864238, 880194, 897928, 917707, 939303, 962737, 987994, 1014141, 1039809, 1064882, 1090967, 1119842, 1151957, 1186751, 1223796, 1263100, 1304725, 1348815, 1395902, 1446755, 1502064, 1562655, 1629828, 1705024, 1789173, 1882813, 1986838, 2102886, 2233309, 2380987, 2547813, 2730519, 2916160, 3082792, 3207805, 3278841, 3298988, 3283110, 3249886, 3215937]
60943C215937k2431n033Q261N626j9856o4101j13727j54752j80039j89615j86743
60932B293527j75405j59822j43296j26825j10154r4263q1219p1488o3184n4720
60922A213151m6804m0893l6920l3575l0006k6276k2836k0296j9076j8531j7179
60911I00759j4463j1566r698q452o816m988l962l888l985l713l059k075j157j195
60897H21742k398l440k982j622j025j557k190k435k677k696j638K02J222P03k13
60882G98996l32J09L51K40j86j038j847j692r04j250l497n987o941o996p977j0041
60866G51008j1778j2524j2790j2619j1410r590q760r592j0847j1063j0146q696
60854F21193o860m779l230k780k764k046o16M02L13k66j07J482M122O554P513
$$ y = [3215937, 3193506, 3188473, 3196734, 3202360, 3182504, 3118403, 3004676, 2849924, 2669885, 2480270, 2293527, 2118122, 1958300, 1815004, 1688179, 1578025, 1483762, 1402543, 1331055, 1267871, 1213151, 1166347, 1125454, 1088534, 1054959, 1024953, 998677, 975841, 955545, 936469, 917938, 900759, 886296, 874730, 865032, 856580, 849764, 844776, 840814, 836926, 832941, 829228, 826169, 824094, 822937, 821742, 819344, 815904, 812922, 811300, 810275, 808718, 806528, 804093, 801416, 798720, 797082, 797284, 798506, 799209, 798996, 798664, 798773, 799124, 799364, 799178, 798140, 796293, 794601, 793697, 792447, 788950, 782963, 776022, 769026, 761049, 751008, 739230, 726706, 713916, 701297, 689887, 680297, 671537, 661945, 651098, 640035, 629889, 621193, 614333, 609554, 606324, 603544, 600780, 598734, 598118, 598520, 598833, 598567, 598460, 599942, 604064, 610618, 618131]
60839F18131O979O442P281Q912R322P654N451M778N831P148P608P237O289M792
60825G13855L172K222J886R59j307l957n472n681n698o330p428q563r431r574
60811F58653q677p339o736p180p606o893n172l545k826k913l077k694j861j283
60797E90851j285j199k96R67J489J274J609L128M770N283M876M646N017N562N949
60782F32641O254O627P232Q190R157R369Q714Q091P984P292M767J189j142j101
60768G15264J48R00O60j13r86j693j947j716j296q68m39l59j264l158n118o322
60752F91693o922p508q279r178j0285j1449j1905j0968q998p107o076n935o456
60739E80627p324p857p242n336k933j038j16j05p48j573j855j089M10J609J636
$$ y = [618131, 625110, 631552, 638833, 647745, 657067, 664721, 670172, 674950, 680781, 687929, 695537, 702774, 709063, 713855, 717027, 719249, 721135, 722094, 720787, 716830, 711358, 705677, 699979, 693649, 686221, 677658, 668227, 658653, 649976, 642637, 635901, 628721, 621115, 614222, 609050, 605505, 602679, 599766, 596689, 593995, 592134, 590851, 589566, 588367, 588071, 589038, 590527, 591801, 593410, 596538, 601308, 606591, 611467, 616113, 621130, 626692, 632641, 638895, 645522, 652754, 660944, 670101, 679470, 688184, 696275, 704259, 711551, 716318, 717507, 716365, 715264, 715412, 716312, 716972, 716859, 715873, 714180, 712233, 710517, 709221, 708353, 707914, 707555, 706291, 703133, 698015, 691693, 684771, 677263, 668984, 659806, 649521, 638072, 626167, 615199, 606201, 599094, 593018, 587083, 580627, 573303, 565446, 558204, 552868, 549935, 548897, 548781, 548676, 547928, 546355, 544500, 543411, 543821, 545430, 547066]
60724E47066N69n73o94M08J806K298J716J331K666N738Q762R901R172Q230Q279
60709F06675Q752Q328O841N601N957P985J0579J2428J2711J1319Q739N854L598
60696G15367K615K932L818M267L945L543L802M346M119K977K144K663L973M612
60682G65123L984K760J663N73r63k843m446n401o114p392r526j1609j2051j0112
60668G03646o948m756m639n502n283l080J02K628L911M692N880P402Q354Q145
60654G14552P242O773P586R712J2418J4643J5681J5883J6495J8500K1689K5155
60642H86329K8418L1421L3671L4387L3906L4049L6303M0082M3428M5020M4728
60631A291742M2699L9080L4751L1138K8654K6011K1540J4669N765m598j5402k4831
$$ y = [547066, 547635, 547062, 546368, 546776, 548582, 550880, 552596, 553927, 556593, 562331, 571093, 580994, 590166, 598396, 606675, 615427, 623755, 630596, 636197, 642154, 650139, 660718, 673146, 685857, 697176, 705915, 711769, 715367, 717982, 720914, 724732, 728999, 732944, 736487, 740289, 744635, 748754, 751731, 753875, 756538, 760511, 765123, 769107, 771867, 773530, 774103, 773140, 770297, 765851, 760450, 754336, 746944, 737418, 725809, 713758, 703646, 696698, 691942, 687303, 681801, 676518, 673438, 673540, 676168, 680079, 684771, 690651, 698053, 706407, 714552, 721794, 728567, 736153, 745865, 758283, 772926, 788607, 804490, 820985, 839485, 861174, 886329, 914747, 946168, 979839, 1014226, 1048132, 1082181, 1118484, 1158566, 1201994, 1247014, 1291742, 1334441, 1373521, 1408272, 1439410, 1468064, 1494075, 1515615, 1530284, 1536049, 1531451, 1516049, 1491218]
60619A491218l1411l5546l8978m2557m5387m6487m6365m6158m5773m3974m0376
60608A028206l6425l3861l2691l1413k9060k6276k4179k2864k1618k0110j8588
60597G31121j7042j4988j2330r733p782o292m777l141j567k23M99N3j333k335
60583F50130j908n84L45N70P43J066R99M47m4l75j097k091k166o79J388K769L577
60566F53090M668N991O683O541O285O309O040M837K916J050k20q81j234j639k274
60551F98162l028l692m208m635m988n258n551n997o543o930o828n995m497k851
60537F27161j773j649k229k784k540j199O80K033K466K782L837N192N790N724
60523F43491O138P434Q830J0079J2134J5378J8420J9736J9486J8734J7898J7144
$$ y = [1491218, 1459807, 1424261, 1385283, 1342726, 1297339, 1250852, 1204487, 1158329, 1112556, 1068582, 1028206, 991781, 957920, 925229, 893816, 864756, 838480, 814301, 791437, 769819, 749709, 731121, 714079, 699091, 686761, 677028, 669246, 662954, 658177, 655036, 653469, 653246, 653745, 653798, 652465, 650130, 648222, 647638, 647983, 648553, 649296, 650362, 651361, 651808, 651764, 651389, 650292, 648201, 646035, 645356, 646744, 649513, 653090, 657758, 663749, 670432, 676973, 683258, 689567, 695607, 700444, 703360, 704410, 704190, 703309, 702075, 700436, 698162, 695134, 691442, 687234, 682599, 677611, 672353, 666802, 660805, 654262, 647332, 640504, 634509, 630012, 627161, 625388, 623739, 621510, 618726, 616186, 614987, 615667, 617700, 620166, 622948, 626785, 631977, 637767, 643491, 649629, 657063, 665893, 675972, 688106, 703484, 721904, 741640, 761126, 779860, 797758, 814902]
60511H14902J7197J8084J7857J4395Q308K370j711m453o608p894q047p556o705
60498H50139n073k513M28L465O914J0735J4308J7490K0805K4225K6829K8018K7947
60485A023717K6406K2711J7228J1600O674J537m378r579j2107j1867j0137p723
60473A054082m891k413j151q93p04k63O7J95M69J166K436M359O557Q337R765J1728
60457A088846J4383J6630J7957J9686K3160K7956L3138L9104M6327N3512N9166
60446A439865O4270P0836P8181Q3149Q4226Q2936Q0590P6064O7733N5472L9584
60435B222906J9594m299k9838n3969p4584r0266r9803j03333j02876j00331r5713
60424A487488q8508p9879p1999o5723o0214n4666m9201m4133l9370l4774l0541
$$ y = [814902, 832099, 850183, 868040, 882435, 890743, 893113, 891402, 886949, 880341, 872447, 864400, 856844, 850139, 845066, 842553, 842981, 846446, 853360, 864095, 878403, 895893, 916698, 940923, 967752, 995770, 1023717, 1050123, 1072834, 1090062, 1101662, 1108336, 1109873, 1105495, 1095916, 1083809, 1071942, 1061805, 1054082, 1049191, 1046778, 1045627, 1044734, 1044030, 1043767, 1043834, 1044029, 1044498, 1045664, 1048100, 1052459, 1059016, 1067353, 1077118, 1088846, 1103229, 1119859, 1137816, 1157502, 1180662, 1208618, 1241756, 1280860, 1327187, 1380699, 1439865, 1504135, 1574971, 1653152, 1736301, 1820527, 1903463, 1984053, 2060117, 2127850, 2183322, 2222906, 2242500, 2238201, 2208363, 2154394, 2079810, 1989544, 1889741, 1786408, 1683532, 1583201, 1487488, 1398980, 1319101, 1247102, 1181379, 1121165, 1066499, 1017298, 973165, 933795, 899021, 868480]
60413H68480k7073k4623k2809k0580j7362j4245j3011j3643j4033j2731j0733
60402F77637r656r471r236q938r015q925p810o141n186n110m953m216l138j828
60388E84014m44O1j069k919l864l796l771l787k875j415j118k196k662j447j78
60373E52534o97k465l868m549m776l828j047K111L162J677l11j030q71j281k816
60358E31945m596n090l456n69J501J668J003R83J283N46j110j991j277q9K59k19
60342E20791q31j194r88J16J623K317J865J344J499J664J333J567L292N147M946
60327E44491K884J415J796K632K404J694J846K748L269L111K894K758K178J097
60313E77217K61K37P98J444J900J982J517O85J16L96J610L274M550M711L734K447
$$ y = [868480, 841407, 816784, 793975, 773395, 756033, 741788, 728777, 715134, 701101, 688370, 677637, 667981, 658510, 649274, 640336, 631321, 622396, 614586, 608445, 603259, 598149, 593196, 588980, 585842, 584014, 583570, 583631, 582562, 579643, 575779, 571983, 568212, 564425, 561550, 560135, 559017, 556821, 554159, 552712, 552534, 551837, 549372, 545504, 540955, 536179, 532351, 531304, 533415, 536577, 538254, 537943, 536913, 536042, 534761, 531945, 527349, 522259, 518803, 518234, 519735, 521403, 522406, 523389, 524672, 525218, 524108, 522117, 520840, 520751, 521010, 520791, 519960, 518766, 517778, 517894, 519517, 521834, 523699, 525043, 526542, 528206, 529539, 531106, 534398, 539545, 544491, 547375, 548790, 550586, 553218, 555622, 557316, 559162, 561910, 565179, 568290, 571184, 573942, 576120, 577217, 577478, 577715, 578513, 579957, 581857, 583839, 585356, 586041, 586157, 586553, 588163, 591437, 595987, 600698, 604432, 606879]
60297F06879J709J634J867K301L012L654L674L150K757K811K883K519J794J008
60283F41652L53P6M18J098J382R24K32N8P30K098L549M078L082J354N25J218K473
60266F65300L346M061N023N793O036O598Q461J1162J3480J5256J7231J9427K1095
60253H02269K2261K3981K6790L0038L2911L4924L5108L2094K5686J7302Q145k013
60241A089496j3342k4120l1678l4858l4629l2564k9754k7022k5068k3789k2139
60230G90533j9211j5313j1650r079p477o296n401n060n252n443n180m585l991
60217F86595l467l037k957l290l496l021k064j205n46M4J32q42k439l519l677
60202F53211l381k691j133Q66J792R28o87j886k706l324k942j089R88J686J206
$$ y = [606879, 608588, 610222, 612089, 614390, 617402, 621056, 624730, 627880, 630637, 633448, 636331, 638850, 640644, 641652, 642005, 642081, 642499, 643597, 644979, 645903, 646135, 646193, 646923, 649021, 652570, 656648, 659730, 661084, 661609, 662827, 665300, 668646, 672707, 677730, 683523, 689559, 696157, 704618, 715780, 729260, 744516, 761747, 781174, 802269, 824530, 848511, 875301, 905339, 938250, 973174, 1008282, 1040376, 1066062, 1083364, 1091509, 1089496, 1076154, 1052034, 1020356, 985498, 950869, 918305, 888551, 861529, 836461, 812672, 790533, 771322, 756009, 744359, 735280, 727803, 721507, 716106, 711046, 705794, 700351, 695171, 690586, 686595, 683128, 680091, 677134, 673844, 670348, 667327, 665263, 664058, 663512, 663556, 663688, 662846, 660407, 656888, 653211, 649830, 647139, 646006, 646872, 648664, 649592, 648905, 647019, 644313, 640989, 638047, 636958, 637946, 639632, 640838]
60187F40838Q93R32L45r64j825j674j311j299r17O14K769M368M938M767M061K775
60171F59310J094l29p64OJ426K627L316L927M543M259K409O4q08K70J802K457
60155F85609K616L252M162M213K935J102j16j49P35J794K537L139L992M931N391
60140G26143N312N176N038M364L206K674L431M404M018K355J106J385K537L245
60126G74394K998K114R69k23j198j690j753j702j739j774j595j156o64l82l28
60111G66271k42P6M52N57L50Q1k03q08j760k237j196J235L434L832K574J154N45
60094G74115L41p1l09L59J684K613K739K813L614M911N841N998N783N881O510
60079H22822P119O800N271L347K197K178K694K991K594J152j243l456l858k111
$$ y = [640838, 641731, 642663, 643008, 642044, 640219, 638545, 637234, 635935, 635018, 635632, 638401, 642769, 647707, 652474, 656535, 659310, 660404, 660075, 659311, 659317, 660743, 663370, 666686, 670613, 675156, 679415, 681824, 681888, 681080, 681350, 683152, 685609, 688225, 691477, 695639, 699852, 702787, 703889, 703773, 703624, 704359, 706153, 708690, 711829, 715821, 720752, 726143, 731455, 736631, 741669, 746033, 749239, 751913, 755344, 759748, 763766, 766121, 767227, 768612, 771149, 774394, 777392, 779506, 780475, 780252, 779054, 777364, 775611, 773909, 772170, 770396, 768801, 767645, 766981, 766599, 766271, 766029, 766105, 766557, 767114, 767464, 767545, 767342, 766534, 764774, 762537, 761341, 762576, 766010, 769842, 772416, 773570, 774115, 774456, 774385, 774076, 774435, 776119, 778732, 781471, 784284, 787898, 792809, 798650, 804648, 810431, 816312, 822822, 829941, 836741, 842012, 845359, 847556, 849734, 852428, 855419, 858013, 859165, 857922, 854466, 850608, 848497]
60065H48497K42J472J465J246J271J086M63j61m92q42j385j543o37J152K922L963
60049H58719M072L146J133j317k720j997J64J817J867J287J741L392M696M313
60035H80313K673J496K051M033N770N600L454J102L89J172J650Q01l83o03k83
60020I09235q98k648l985l643k253j482k072l234l829l734l914n289p646r797
60006H54811j0797j0681r942q694o862n004m239n124o943q308q357p284o027n397
59992G51152n330m906l399j353k01o30j828k633k938l342l677k871n20K146L510
59977G23180L330K657K227J775J013M62Q15J919K915L199K769J835N60p85j939
59962G45932k994m348o129p940r288j0044j0265r799q372o196m243l575m149m589
$$ y = [848497, 848739, 850211, 851676, 852922, 854193, 855279, 855742, 855581, 855089, 854247, 852862, 851319, 850682, 851834, 854756, 858719, 862791, 865937, 867070, 865753, 863033, 861036, 861200, 863017, 864884, 866171, 867912, 871304, 876000, 880313, 882986, 884482, 886533, 890566, 896336, 901936, 905390, 906492, 906881, 908053, 909703, 910504, 910121, 909518, 909235, 908337, 905689, 901704, 898061, 895808, 894326, 892254, 889020, 885191, 881457, 877543, 872254, 864608, 854811, 844014, 833333, 823391, 814697, 807835, 802831, 798592, 793468, 786525, 778217, 769860, 762576, 756549, 751152, 745822, 740916, 737517, 736164, 735963, 735333, 733505, 730872, 727934, 724592, 720915, 718044, 717524, 719670, 723180, 726510, 729167, 731394, 733169, 734182, 734644, 735459, 737378, 740293, 743492, 746261, 748096, 748656, 747871, 745932, 742938, 738590, 732461, 724521, 715233, 705189, 694924, 685125, 676753, 670557, 666314, 662739, 658590, 654001]
59948F54001l642j862j167k421m109m065k032K85J444J641J807K285K761K889
59934F47815K630K275K355L135M214M980N454O030O401N635L612J592Q63J387
59920F98378K186K561K392J810J191R70J023N63p31j997k208j562j172j605k467
59905F99332l245l770l878l348k422j846k094k740k870k049q35k82p98j494j034
59890F66627P76K699L502L205K593K081J570J046O63M65N63J302K665L687L124
59875F96568Q73j670k737j710L30J499R47j61o2J206J768P22k73P93L271M545
59859G05909L322R93l23k0Q77J037J05q49l47J611L179K880J513Q20J008J073
59843G22788J040K003L961N481N820N701N514M595L009K261L072L980L547K709
$$ y = [654001, 650359, 648497, 647330, 644909, 640800, 636735, 634703, 634988, 636432, 638073, 639880, 642165, 644926, 647815, 650445, 652720, 655075, 658210, 662424, 667404, 672858, 678888, 685289, 690924, 694536, 696128, 696991, 698378, 700564, 703125, 705517, 707327, 708518, 709488, 710511, 711074, 710343, 708346, 706138, 704576, 703404, 701799, 699332, 696087, 692317, 688439, 685091, 682669, 680823, 678729, 675989, 673119, 671070, 670235, 669953, 669155, 667661, 666627, 667403, 670102, 673604, 676809, 679402, 681483, 683053, 684099, 684762, 685227, 685790, 687092, 689757, 693444, 696568, 697441, 695771, 693034, 691324, 691654, 693153, 694100, 693939, 693877, 695083, 696851, 697573, 697300, 698093, 701364, 705909, 709231, 710224, 709901, 709881, 710758, 711795, 711900, 711051, 710704, 712315, 715494, 718374, 719887, 720707, 721715, 722788, 723828, 725831, 729792, 735273, 741093, 746794, 752308, 756903, 759912, 762173, 765245, 769225, 772772, 775481]
59829G75481L351N503P538Q507Q671Q131O673M899M068M437M804M000K029k64
59815H47828j867j864n9K336L394K325J47j710k958m261n910p232p285n966m282
59800H12636l435l689m335m740m974n266n445n375n286n147m232k310p89j446
59786G56167l880n375l945o86J532J282k46j104q03l04k74j20R80K679L813L955
59770G53671L725L427K490Q66o6P93K287K135j07k590l787m148m710n378n498
59755G43110n203n166n470n631n460n109m569l743k878k290j921j717k077l158
59741F88718m085l821k745k362l335m710n293m871l778k251q49m27j002j361o87
59726F47141K38L26j40l47o70j845k936k171n6N89j486l918l936k048q61j327
$$ y = [775481, 778832, 784335, 791873, 800380, 809051, 817182, 823855, 828754, 832822, 837259, 842063, 846063, 848092, 847828, 845961, 844097, 844038, 846374, 849768, 852093, 852240, 850530, 847572, 843311, 837401, 830169, 822884, 816918, 812636, 809201, 805512, 801177, 796437, 791463, 786197, 780752, 775377, 770091, 764944, 760712, 758402, 757613, 756167, 752287, 746912, 742967, 742281, 743813, 745095, 744849, 743745, 742942, 742638, 742364, 742244, 743224, 745903, 749716, 753671, 757396, 760823, 763313, 764179, 764113, 764906, 767193, 769328, 769221, 766631, 762844, 758696, 753986, 748608, 743110, 737907, 732741, 727271, 721640, 716180, 711071, 706502, 702759, 699881, 697591, 695670, 693953, 691876, 688718, 684633, 680812, 678067, 675705, 672370, 667660, 662367, 657496, 653718, 651467, 650618, 650191, 649189, 647828, 647141, 647379, 647705, 647565, 647218, 646548, 644703, 641767, 639596, 639540, 640129, 638643, 634725, 630789, 628741, 627880, 626553]
59710F26553k144k297k132j900j005P88K574L273K620J097l84p92N3R68Q56N15
59694F28643J707M402O450O263M412K255N91J89J804M517N737M366K688L404N818
59679F83246O866N360L109J957J684J304P09K92M3j29Q7Q31J463J074m88k362
59663G05046l338k899j750j094j148q84L12J471J420O71O88J637K273K062J769
59648G06236J684Q51j111k741k391k58K207M103N202N105L698K196K279L967N543
59633G36570N856N581N638N448L955J797R85K176L462K721M26j033n26O15Q11
59618G74482L33K87M23o61l267n804o563n444l628k250j801k211k971l482l663
59603G33780m029m902n811n941m926k998o28J602L084L513L220K917L089L620
$$ y = [626553, 624409, 622112, 619980, 618080, 617075, 617863, 620437, 623710, 626330, 627427, 627043, 626251, 626304, 627272, 628128, 628643, 630350, 634752, 641202, 647465, 651877, 654132, 654723, 654912, 656716, 661233, 666970, 671336, 674024, 677428, 683246, 690112, 695472, 698581, 700538, 702222, 703526, 704235, 704527, 704570, 704441, 704528, 705359, 706822, 707896, 707408, 705046, 701708, 698809, 697059, 695965, 694817, 693933, 694245, 695716, 697136, 697807, 698495, 700132, 702405, 704467, 706236, 707920, 708771, 707660, 704919, 702528, 702270, 704477, 708580, 713782, 718887, 722585, 724781, 727060, 731027, 736570, 742426, 748007, 753645, 759093, 763048, 764845, 765830, 768006, 771468, 774189, 774615, 773582, 773056, 773671, 774482, 774815, 775102, 775525, 774864, 771597, 765793, 759230, 753786, 750158, 747908, 746107, 743896, 740925, 737443, 733780, 729751, 724849, 719038, 713097, 708171, 705173, 704545, 706147, 709231, 712744, 715964, 718881, 721970, 725590]
59589G25590L936L534K526J638J435J683J742J533J507J675J286j00j766k656
59575G43563k719k847l530m187m037l180k508k707l595m326m098k740r07K75R9
59560G02556j017j945k188k429l288l973l107r09O19J40j322k016j898k128k690
59545F74405k202k09J750K159J457J082J321J236L87l82j31R53J855J973J618
59530F87272J345J119M86n40j271j334j388k253l586m154l483k469k218k810l580
59515F61136m086m320m304l908l034j855r13q69j734k403j580O03K450K529J231
59500F38943J88M33J612K789L532M180N161O238O580N731M334L576M063N546P566
59485G00472R717J1444J2228J2180J2023J2509J4196J7286K0681K1500J7114Q295
$$ y = [725590, 729526, 733060, 735586, 737224, 738659, 740342, 742084, 743617, 745124, 746799, 748085, 747985, 746219, 743563, 740844, 737997, 734467, 730280, 726243, 723063, 720555, 717848, 714253, 709927, 705829, 703089, 702182, 702457, 702556, 701539, 699594, 697406, 694977, 691689, 687716, 684609, 683700, 684319, 684459, 683137, 681121, 679223, 677095, 674405, 672203, 671994, 673744, 675903, 677360, 678442, 679763, 680999, 681386, 681004, 680873, 681826, 683681, 685654, 687272, 688617, 689736, 690222, 689682, 688411, 687077, 685689, 683436, 679850, 675696, 672213, 669744, 667526, 664716, 661136, 657050, 652730, 648426, 644518, 641484, 639629, 638716, 637847, 636113, 633710, 632130, 632733, 635183, 637712, 638943, 639131, 639564, 641176, 643965, 647497, 651677, 656838, 663076, 669656, 675387, 679721, 683297, 687360, 692906, 700472, 710189, 721633, 733861, 746041, 758064, 770573, 784769, 802055, 822736, 844236, 861350, 869645]
59473H69645p50o241p913p918p775p440o495m928k922p72J144K783M521O334P435
59458H38708P331O615O005N225L679J641j77j758l539n446p173q876j0497j1007
59444H20731r769q194q315r804j0289q808p040o369n743l704j004M85M88J31l12
59429G42484j558l225l380r47K694N251N886N324M380L400K887L531N310P286
59415G79323Q679R629J0456J0718R667P271M161Q56k129l638k615K95K977M181
59401H39831M666N535O665P564Q536R746J0220R374Q765J0466J4080J7215J8783
59388I71446J9904K1312K1907K0495J7190J2347N781j882q631j3014j5539j7138
59376A034178j7563j6546j5211j4791j4868j4419j3654j3190j2241r601n946l194
$$ y = [869645, 868895, 862654, 854741, 846823, 839048, 831608, 825113, 820185, 817263, 816491, 817635, 820418, 824939, 831273, 838708, 846039, 852654, 858659, 863884, 867563, 869204, 869027, 867269, 863730, 858284, 851111, 842235, 831738, 820731, 810962, 802768, 794453, 784649, 774360, 765552, 758512, 752143, 746400, 742696, 741692, 742177, 742665, 742796, 742484, 740926, 737701, 734321, 733374, 736068, 741319, 747205, 752529, 756909, 760309, 763196, 766727, 772037, 779323, 788002, 797631, 808087, 818805, 828472, 835743, 839904, 840760, 838631, 834993, 832378, 832673, 835650, 839831, 844497, 850032, 856697, 864261, 872797, 882543, 892763, 902137, 910902, 921368, 935448, 952663, 971446, 991350, 1012662, 1034569, 1055064, 1072254, 1084601, 1090382, 1088500, 1079869, 1066855, 1051316, 1034178, 1016615, 1000069, 984858, 970067, 955199, 940780, 927126, 913936, 901695, 892094, 886148, 882954]
59364H82954j684J25L058O143Q492J0565J2966J5426J7664K0098K3138K6772L1155
59351A056872L6112L9467L7356K7645J2535k854j3907j8511j7423j3817j1136
59340A132339r837p080j143M597M066n059j8817l0981l8106m0409l9484l6664
59328I13422l2876k8742k4492k0309j6728j4342j3018j1811r870p430n625n194
59316G22985n570n563m750l715k879j877l71J176K093K307K082J409M55Q5J045
59301G08912K788M071M553M969N725O253O067N731O297Q113J0326J1491J0944
59288G96240R880J0580J3875J7885K0194K0687K0963K1370K0527J8044J5655J4723
59276A000623J4214J2490R821P553N682K997p19m189o409p711q884j0238j1706
$$ y = [882954, 881270, 881395, 884453, 890596, 899088, 909653, 922619, 938045, 955709, 975807, 998945, 1025717, 1056872, 1092984, 1132451, 1169807, 1197452, 1209987, 1207133, 1193226, 1174715, 1157292, 1143475, 1132339, 1122502, 1115422, 1114279, 1118876, 1122942, 1117883, 1099066, 1068085, 1029979, 989570, 950086, 913422, 880546, 851804, 827312, 807003, 790275, 775933, 762915, 751104, 741234, 733804, 728179, 722985, 717415, 711852, 707102, 703387, 700508, 698631, 698260, 699436, 701529, 703836, 705918, 707327, 707782, 707867, 708912, 711700, 715771, 720324, 725293, 731018, 737271, 743338, 749069, 755366, 763479, 773805, 785296, 796240, 806120, 816700, 830575, 848460, 868654, 889341, 910304, 931674, 952201, 970245, 985900, 1000623, 1014837, 1027327, 1037148, 1044701, 1050383, 1053380, 1052661, 1048472, 1042063, 1034352, 1025468, 1015230, 1003524]
59263A003524j3072j3871j3769j3176j2968j3321j3389j2346j0491r097r151j0091
59251H58782r913p135k854o0m21k384l206k160p25k69o59j010o84M13J642J868
59235H31225P52m26j82J228K337K581K590K653K443K270K980M270M696L866L003
59220H66286K819K479J561J316K597M103M361M334O092R574J2580J3704J3464
59207I45270J2625J1242R762R387J0471J1669J1478R882P731N243K095j343l870
59194A041642m855n196o437q912j1137j1387r688p804p244p821q435q465p782
59181I36479o075l293n65N11j51p24M01K671M129L694K048M39o01j204j545j862
59165I34352k731m539o649p817p819p943r291j1158j2054j1904j1961j2581j2434
$$ y = [1003524, 990452, 976581, 962812, 949636, 936668, 923347, 909958, 897612, 887121, 878024, 868873, 858782, 848869, 841734, 838880, 838820, 838399, 836015, 832809, 830649, 829924, 829655, 828996, 827986, 827302, 827715, 829357, 831225, 831977, 831551, 831369, 832597, 834934, 837515, 840105, 842758, 845201, 847471, 850451, 854721, 859417, 863283, 866286, 869105, 871584, 873145, 874461, 877058, 881161, 885522, 889856, 895948, 905522, 918102, 931806, 945270, 957895, 969137, 978899, 988286, 998757, 1010426, 1021904, 1031786, 1039517, 1044760, 1046855, 1045512, 1041642, 1036787, 1031591, 1025154, 1016242, 1005105, 993718, 984030, 976226, 968982, 961161, 952726, 944261, 936479, 930404, 927111, 926546, 927057, 926906, 926182, 926583, 929254, 933383, 937077, 939125, 939564, 938963, 937759, 936214, 934352, 931621, 927082, 920433, 912616, 904797, 896854, 887563, 876405, 864351, 852447, 840486, 827905, 815471]
59152H15471j0550q019o731p083p794p662o655n490m776m586m563m442m435m676
59138G28009m391k524M74K478K113N25j30O86J765K144K080K274L120M642O271
59123G49536O857N770M010L374M431O063O976O857O098N241M962N836P682R574
59109H33267J0657J0751J0204R619R554J0022J0401J0248R982J0144J0396J0007
59097I55252R054Q250P728O948N762M459K833L75k354l883l892m026n714q042
59083I72750q779p141m601l175l625n246o667o797n569m059l570m242m794l931
59069I00554j881m3Q91J641K767L378K674K064L876P812J0768J0979J0389J1484
59055I67353J3641J4644J4480J5032J6759J8266J9067K0148K1538K1753K0348
$$ y = [815471, 804921, 796902, 790171, 783088, 775294, 767632, 760977, 755487, 750711, 746125, 741562, 737120, 732685, 728009, 723618, 721094, 721568, 724046, 726159, 726684, 726554, 727240, 729005, 731149, 733229, 735503, 738623, 743265, 749536, 756393, 762163, 766173, 769547, 773978, 780041, 787017, 793874, 799972, 805213, 810175, 816011, 823693, 833267, 843924, 854675, 864879, 874498, 884052, 894074, 904475, 914723, 924705, 934849, 945245, 955252, 964306, 972556, 980284, 987232, 992994, 997453, 1000286, 1000661, 998307, 994424, 990532, 986506, 980792, 972750, 963971, 956830, 952229, 949054, 945429, 940183, 933516, 926719, 921150, 917091, 913521, 909279, 904485, 900554, 898673, 898630, 899521, 901162, 903929, 907307, 909981, 912045, 915921, 923733, 934501, 945480, 955869, 967353, 980994, 995638, 1010118, 1025150, 1041909, 1060175, 1079242, 1099390, 1120928, 1142681, 1163029]
59044A163029J8877J8412J8045J6857J5481J4605J3582J1865J0234R265P978N545
59032A323775L018J715J007m86k374l136k756k740l615m327m375m977p435j1444
59018A281850j5570j8697k0492k1090k0803k0020j9154j8607j8506j8338j7367
59007A073206j5712j4477j4288j4326j3431j1733j0318r656r090p782n605l214
58995I43574j643j461j967j751n14K93o75k791m318m502l890l000j891q35k72
58980I14357K7P98K174L364L625K993K101J716K347L814N331O433P488Q906J0296
58965I75770J1049J1290J1534J1907J2431J3578J5598J7691J8799J8840J8222
58954A136709J6715J4092J1475J0464J0876J0736Q805N903L408J723O83M22J071
$$ y = [1163029, 1181906, 1200318, 1218363, 1235220, 1250701, 1265306, 1278888, 1290753, 1300987, 1310252, 1318230, 1323775, 1326793, 1328508, 1329515, 1329029, 1326655, 1323519, 1320763, 1318023, 1314408, 1310081, 1305706, 1300729, 1293294, 1281850, 1266280, 1247583, 1227091, 1206001, 1185198, 1165178, 1146024, 1127417, 1108911, 1090573, 1073206, 1057494, 1043017, 1028729, 1014403, 1000972, 989239, 978921, 969265, 960175, 952393, 946788, 943574, 941931, 940470, 938503, 936752, 936238, 936531, 935856, 933065, 928747, 924245, 920355, 917355, 915464, 914629, 914357, 914384, 915182, 917356, 920720, 924345, 927338, 929439, 931155, 933502, 937316, 942647, 949080, 956568, 965474, 975770, 986819, 998109, 1009643, 1021550, 1033981, 1047559, 1063157, 1080848, 1099647, 1118487, 1136709, 1153424, 1167516, 1178991, 1189455, 1200331, 1211067, 1219872, 1225775, 1229183, 1230906, 1231589, 1232011, 1233082]
58941A233082K218L157L354K759K253L385O516R441R353O375L577K957L082J676
58927A293185j064l228m221n210o900q520r193r195r436j0469j2257j4260j5448
58914A183784j4727j1930q259n466m408m315l630j706M82J567J460J372K198L622
58900A140044M919N973P011P877Q125P522O173M338K423P60r81l702p663j1630
58886A171189j3896j4043j3094j2024j0831r389q431q930j0669j2194j2460j1981
58874A033247j1918j2462j2761j2279j1378j0388q942o633l854j428J43P50N26
58861I42623Q5L04J277K053K067K180L339M827N036L773K557K659L960N713P399
58846I89852Q711R645J0781J2496J3934J3876J2653J1889J2119J2058J0600Q257
$$ y = [1233082, 1235300, 1238457, 1241811, 1244570, 1246823, 1250208, 1256724, 1266165, 1275518, 1281893, 1285470, 1288427, 1291509, 1293185, 1292121, 1288893, 1284672, 1279462, 1272562, 1264042, 1254849, 1245654, 1236218, 1225749, 1213492, 1199232, 1183784, 1169057, 1157127, 1148868, 1143402, 1138994, 1134679, 1131049, 1129343, 1129825, 1131392, 1132852, 1134224, 1136422, 1140044, 1144963, 1150936, 1157947, 1165824, 1173949, 1181471, 1187644, 1191982, 1194405, 1195165, 1194184, 1190482, 1182819, 1171189, 1157293, 1143250, 1130156, 1118132, 1107301, 1097912, 1089481, 1080551, 1069882, 1057688, 1045228, 1033247, 1021329, 1008867, 996106, 983827, 972449, 962061, 953119, 946486, 942632, 941204, 941347, 942097, 942623, 942708, 943012, 944289, 946342, 948409, 950589, 953928, 958755, 963791, 967564, 970121, 972780, 976740, 982453, 989852, 998563, 1008208, 1018989, 1031485, 1045419, 1059295, 1071948, 1083837, 1095956, 1108014, 1118614, 1126871]
58834A126871O053M334L562M925Q990J4511J9577K3394K6221K8361L0007L1379
58822A328185L2202L1804L0364K9073K8186K6087K1449J5398J0077N853J516l439
58810A556755q463j3517j9114k4764k8988l1252l2431l3087l2639l0696k8037
58799A273767k5728k4192k3474k3341k2810k0791j7795j5916j6437j8385k0014
58788A044884k0716k0722j9981j8488j6961j6046j5234j3571j1064q555o592n303
58776H71651m933n523o278o348n950n770n481m234k544k162l525m745l981j748
58762H08429O9N49m5j603m098o412o814n088l090k542l012k734r07J422K592J877
58746G78593Q1j125n94J201K642K709J974J614J842J868J236N15M96J110J451
$$ y = [1126871, 1132924, 1137258, 1140820, 1145745, 1154735, 1169246, 1188823, 1212217, 1238438, 1266799, 1296806, 1328185, 1360387, 1392191, 1422555, 1451628, 1479814, 1505901, 1527350, 1542748, 1552825, 1558678, 1560194, 1556755, 1548292, 1534775, 1515661, 1490897, 1461909, 1430657, 1398226, 1365139, 1332500, 1301804, 1273767, 1248039, 1223847, 1200373, 1177032, 1154222, 1133431, 1115636, 1099720, 1083283, 1064898, 1044884, 1024168, 1003446, 983465, 964977, 948016, 931970, 916736, 903165, 892101, 883546, 876954, 871651, 866718, 861195, 854917, 848569, 842619, 836849, 831368, 827134, 824590, 822428, 818903, 814158, 810177, 808429, 808498, 809047, 809002, 807399, 803301, 796889, 790075, 784987, 781897, 779355, 776343, 773609, 772702, 774124, 776716, 778593, 778674, 777549, 776955, 778156, 780798, 783507, 785481, 787095, 788937, 790805, 792041, 792556, 793052, 794162, 795613]
58731G95613Q65j88n34L55J656K279K456L461N561P176O793N063M020M628O084
58716H45288P360Q281Q848Q541O909M261J464o29j448j082o24j402l481n480o209
58701H70597n871n243m404l026j429m36k79l80j80L32R19J522K296L438M981O578
58685H69415P728Q331Q749R043Q721P671O849P213Q331Q944Q767Q716R134R019
58671I86631P687O309O698Q854J0778J0878R679Q866R217J0032J0223R408Q061
58658A103321O985O676O799O385M973L483L401M983O896P878Q077Q219Q187P316
58644A193579N791M597L943K727L8l493o489q596j0835j4253j8605k2463k4558
58631A101383k4901k4546k4187k3301k0993j7521j4401j2989j3355j4523j5249
$$ y = [795613, 796478, 796290, 795756, 796111, 797767, 800046, 802502, 805963, 811524, 818700, 825493, 830556, 834576, 839204, 845288, 852648, 860929, 869777, 878318, 885227, 889488, 890952, 890323, 888875, 887793, 887169, 885767, 882286, 876806, 870597, 864726, 859483, 855079, 852053, 850624, 850188, 849909, 849529, 849349, 849681, 850600, 852122, 854418, 857856, 862837, 869415, 877143, 885474, 894223, 903266, 911987, 919658, 926507, 933720, 942051, 950995, 959762, 968478, 977612, 986631, 994318, 1000627, 1007325, 1016179, 1026957, 1037835, 1047514, 1056380, 1065597, 1075629, 1085852, 1095260, 1103321, 1110306, 1116982, 1123781, 1130166, 1135139, 1138622, 1142023, 1147006, 1153902, 1161780, 1169857, 1178076, 1186263, 1193579, 1199370, 1203967, 1207910, 1210637, 1210675, 1207182, 1200693, 1192097, 1181262, 1167009, 1148404, 1125941, 1101383, 1076482, 1051936, 1027749, 1004448, 983455, 965934, 951533, 938544, 925189, 910666, 895417]
58620H95417j4585j2399r716p951p433p067n810l969k714k643l314l755l019o63
58606H10379K726N656P008P099P082P523Q111Q476Q499P858O147L781K028J528
58592H93901J235l76l105m924m266j860K34R76R91J061Q67l37k354m007m265l074
58576H70697j318k97q97k714m161l922k180j23J433K341K527J993J386J605K610
58561H68980L383L290K846K823L157L168K531J731J794L452O185Q263Q396P335
58547I27334O972P820Q338P068M439J930K16j019k100k888l156k950k685l001
58533I46318m016m697l678j056J369K109J505Q35P20J125K194M067O279Q200R893
58518I71167J1706J3259J3637J2645J1296J0824J1464J2266J2016J0500Q815Q239
$$ y = [895417, 880832, 868433, 858717, 850766, 843333, 836266, 830456, 826487, 823773, 821130, 817816, 814061, 811042, 810379, 813105, 818761, 825769, 832868, 839950, 847473, 855584, 864060, 872559, 880417, 886564, 890345, 892373, 893901, 895136, 894760, 891655, 886731, 882465, 880605, 880839, 881815, 882806, 883867, 884734, 884397, 882043, 878036, 873771, 870697, 869379, 869082, 868185, 865471, 861310, 857388, 855208, 855085, 856518, 858859, 861386, 863379, 864765, 866370, 868980, 872363, 875653, 878499, 881322, 884479, 887647, 890178, 891909, 893703, 897155, 903340, 911603, 919999, 927334, 934306, 942126, 950464, 957532, 961971, 963901, 964117, 963098, 960998, 958110, 954954, 952004, 949319, 946318, 942302, 937605, 933927, 932871, 934240, 936349, 937854, 938689, 939409, 940534, 942728, 946795, 953074, 961274, 971167, 982873, 996132, 1009769, 1022414, 1033710, 1044534, 1055998, 1068264, 1080280, 1090780, 1099595, 1107834]
58506A107834Q903J0054J1403J3335J5778J7920J9393K0706K1980K2449K1891
58495A291646K1475K2047K2518K1236J8311J5205J2383Q850M080r61m970p638
58483A424182r453j0955j2466j4099j5693j6989j7953j8719j9334j9761j9943
58472A248817j9702j8839j7524j6220j5046j3663j2010j0583r614q609p105n314
58460A094588l651k214j112m90Q0J315K762K843J098p60j083m65l39n25J73J574
58444A093794K203J606Q98R24J286J405J267R09K44m03n15l89r80k472l773l703
58428A092301k277o19N4m83j155p31N21J096N36L64J873M110N286N221M979N033
58412A116109N511P376J1131J4664J4689J0737N879L017J930N83k122n540q176
$$ y = [1107834, 1116737, 1126791, 1138194, 1151529, 1167307, 1185227, 1204620, 1225326, 1247306, 1269755, 1291646, 1313121, 1335168, 1357686, 1378922, 1397233, 1412438, 1424821, 1433671, 1437751, 1436790, 1431820, 1424182, 1414729, 1403774, 1391308, 1377209, 1361516, 1344527, 1326574, 1307855, 1288521, 1268760, 1248817, 1229115, 1210276, 1192752, 1176532, 1161486, 1147823, 1135813, 1125230, 1115616, 1107007, 1099902, 1094588, 1090937, 1088723, 1087611, 1087121, 1087201, 1088516, 1091278, 1094121, 1095219, 1094459, 1093376, 1092911, 1092572, 1092047, 1092220, 1093794, 1095997, 1097603, 1098501, 1099425, 1100711, 1102116, 1103383, 1104292, 1104536, 1104133, 1103618, 1103229, 1102249, 1099777, 1096004, 1092301, 1090024, 1089405, 1089459, 1088976, 1087821, 1087090, 1087611, 1088707, 1089243, 1089607, 1091480, 1095590, 1100876, 1106097, 1111076, 1116109, 1121620, 1128996, 1140127, 1154791, 1169480, 1180217, 1186096, 1189113, 1191043, 1191626, 1189504, 1183964, 1175788]
58399A175788q770p219m715k490o93Q98J717J300P07J426L053L790L109K168J624
58384A171693R11j27p74j117k264m298n582m850k573J92K755M121L222P43q64
58369A161188j53J810L482M766N896O032M625L085L482N932Q463R268Q312O990
58355A233178O704P554Q238P565N969M795M404L992L166K356J704R01J92J5k67
58340A290466j575l027k734r72k04j246j872m52J430J748J323K254M493O190O457
58325A302279N806M618L062K081K661M271N342N218M628M516N234O499P382O916
58311A370513N399M493N172O373O507N664N334O523Q876J1295J2679J2694J2231
58298A473753J2646J4161J5774J6831J7581J7907J6949J4686J2493J1367J0732
$$ y = [1175788, 1167018, 1159799, 1155084, 1152594, 1151901, 1152799, 1154516, 1155816, 1156523, 1157949, 1161002, 1164792, 1167901, 1170069, 1171693, 1172604, 1172477, 1171703, 1170586, 1168322, 1164024, 1158442, 1153592, 1151019, 1151211, 1153966, 1158087, 1161309, 1162052, 1161188, 1161035, 1162845, 1166327, 1171093, 1176989, 1183021, 1187646, 1190731, 1194213, 1200145, 1208608, 1217876, 1226188, 1233178, 1239882, 1247436, 1255674, 1263239, 1269208, 1274003, 1278407, 1282399, 1285565, 1287921, 1289625, 1290526, 1290718, 1290733, 1290466, 1288891, 1285864, 1283130, 1282158, 1281954, 1280708, 1278836, 1278384, 1279814, 1281562, 1282885, 1285139, 1289632, 1295822, 1302279, 1308085, 1312703, 1315765, 1317846, 1320507, 1324778, 1330120, 1335338, 1339966, 1344482, 1349716, 1356215, 1363597, 1370513, 1375912, 1380405, 1385577, 1391950, 1398457, 1404121, 1409455, 1415978, 1424854, 1436149, 1448828, 1461522, 1473753, 1486399, 1500560, 1516334, 1533165, 1550746, 1568653, 1585602, 1600288, 1612781, 1624148, 1634880]
58287A634880R781Q761Q201Q077Q561J0264J2893J4920J5422J5144J5047J5210
58275A777161J5798J7404J9502K0288J9243J8237J8972K0893K2680K4035K4740
58264A998953K4005K2266K1756K3513K5461K5300K3640K2436K2041K1821K2100
58253B253292K3140K3518K1899J9411J8201J8584J9593K1157K3512K5593K6232
58242B494132K6209K7038K8573K9746L0667L1927L2886L2800L2740L4133L6268
58231B837119L7470L7889L8936M0643M1861M2399M2970M3686M4648M7102N1855
58220C306578N7242O0827O2461O3763O5554O7844P1267P6216Q1362Q5230Q8392
58209D086736R2134R6143R9610J03190J07493J11204J13390J16128J21818J29174
$$ y = [1634880, 1644661, 1653422, 1661623, 1669700, 1678261, 1688525, 1701418, 1716338, 1731760, 1746904, 1761951, 1777161, 1792959, 1810363, 1829865, 1850153, 1869396, 1887633, 1906605, 1927498, 1950178, 1974213, 1998953, 2022958, 2045224, 2066980, 2090493, 2115954, 2141254, 2164894, 2187330, 2209371, 2231192, 2253292, 2276432, 2299950, 2321849, 2341260, 2359461, 2378045, 2397638, 2418795, 2442307, 2467900, 2494132, 2520341, 2547379, 2575952, 2605698, 2636365, 2668292, 2701178, 2733978, 2766718, 2800851, 2837119, 2874589, 2912478, 2951414, 2992057, 3033918, 3076317, 3119287, 3162973, 3207621, 3254723, 3306578, 3363820, 3424647, 3487108, 3550871, 3616425, 3684269, 3755536, 3831752, 3913114, 3998344, 4086736, 4178870, 4275013, 4374623, 4477813, 4585306, 4696510, 4809900, 4926028, 5047846, 5177020]
58199E177020J35149J39619J44914J51670J58669J65935J74436J83272J90676
58190F621360J97542K06609K18329K30745K43237K57370K74140K93294L15017
58181H857643L39592L65801L92302M19913M49983M81726N13968N48098N85995
58172A2955021O26414O66858P07528P49805P92491Q33749Q75367R20942R71163
58163B0099338J024983J083767J149560J220794J294599J372251J457809J552946
58155C0256047J657710J774526J906329K052909K214034K393799K596571K821942
58147D7673867L069855L347895L667573M036439M457534M928961N438602N973076
58139H2593802O547701P219511Q053458R079310J0292050J1678121J3215379J4857804
$$ y = [5177020, 5312169, 5451788, 5596702, 5748372, 5907041, 6072976, 6247412, 6430684, 6621360, 6818902, 7025511, 7243840, 7474585, 7717822, 7975192, 8249332, 8542626, 8857643, 9197235, 9563036, 9955338, 10375251, 10825234, 11306960, 11820928, 12369026, 12955021, 13581435, 14248293, 14955821, 15705626, 16498117, 17331866, 18207233, 19128175, 20099338, 21124321, 22208088, 23357648, 24578442, 25873041, 27245292, 28703101, 30256047, 31913757, 33688283, 35594612, 37647521, 39861555, 42255354, 44851925, 47673867, 50743722, 54091617, 57759190, 61795629, 66253163, 71182124, 76620726, 82593802, 89141503, 96361014, 104414472, 113493782, 123785832, 135463953, 148679332, 163537136]
58131A63537136J6554383J8286538K0065522K1896952K3748336K5458202K6527008
58124C16074077K5987549K2716168J6186199P070724k930392j1955295j8808852
58117C54340178k3183701k5364684k5857300k5182108k3789001k2013178k0076434
58110A88873772j8125853j6260180j4530515j2949330j1516166j0231072r089091
58103I6171565q079397p193765o425472n759499n174498m655748m197920l795690
58095E0889576l440672l127468k853892k614319k400050k206574k033907j879782
58087C0332912j738857j608571j489655j380986j279570j185394j100799j025301
58079A9523779r56045q92736q36962p87257p40043o94983o54455o18220n83676
$$ y = [163537136, 180091519, 198378057, 218443579, 240340531, 264088867, 289547069, 316074077, 342061626, 364777794, 380963993, 388034717, 385104325, 373149030, 354340178, 331156477, 305791793, 279934493, 254752385, 230963384, 208950206, 188873772, 170747919, 154487739, 139957224, 127007894, 115491728, 105260656, 96171565, 88092168, 80898403, 74472931, 68713432, 63538934, 58883186, 54685266, 50889576, 47448904, 44321436, 41467544, 38853225, 36453175, 34246601, 32212694, 30332912, 28594055, 26985484, 25495829, 24114843, 22835273, 21649879, 20549080, 19523779, 18567734, 17674998, 16838036, 16050779, 15310736, 14615753, 13961298, 13343078, 12759402]
58070A2759402n50803n21745m95715m69377m42300m17259l95103l74027l54035
58061H739038l37328l23716l10180k95718k82555k71739k61428k50402k39602
58052F166370k29348k18307k06230j94908j85627j78164j72402j68322j64414
58043D448648j58716j51462j44239j37048j28975j21087j15408j11399j06829
58034C273485j01662r7681r4578r0238q4959q1561q0798q0189p8016p5172p2478
58023B336153o9429o6231o3989o2233n9287n5490n2956n1784m9878m6959m5051
58012A712866m4271m2018l7682l4364l4156l4992l4099l1647k9089k6680k4584
58001A339284k3875k4451k4205k2134k0082j9745k0277k0538k1252k2907k3885
$$ y = [12759402, 12208599, 11686854, 11191139, 10721762, 10279462, 9862203, 9467100, 9093073, 8739038, 8401710, 8077994, 7767814, 7472096, 7189541, 6917802, 6656374, 6405972, 6166370, 5937022, 5718715, 5512485, 5317577, 5131950, 4953786, 4781384, 4613062, 4448648, 4289932, 4138470, 3994231, 3857183, 3728208, 3607121, 3491713, 3380314, 3273485, 3171823, 3074142, 2979564, 2889326, 2804367, 2722806, 2642008, 2561819, 2483803, 2408631, 2336153, 2266724, 2200493, 2136504, 2074271, 2014984, 1959494, 1906538, 1854754, 1804876, 1757917, 1712866, 1668595, 1626577, 1588895, 1554531, 1520375, 1485383, 1451284, 1419637, 1390548, 1363868, 1339284, 1315409, 1290958, 1266753, 1244619, 1224537, 1204792, 1184515, 1163977, 1142725, 1119818, 1095933]
57990A095933k2892k1391k1140k1159j9458j6287j3351j1082q992p648q023r606
57978I14904j1039j1960j2597j2497j1465j0791j1656j3009j2859j1216r935j0008
57966G75872j0697j1103j1089j0737j0320j0555j1650j2307j1100q791p826r141
57954F50556j0716r962o907m239m252o296p656o856n242m779n281n166m371m495
57940E64338n825o378m812k522j565j936k353k506k889l187k556j217k07L33J369
57925E28087L311N182N813N228M569M821N631N610M072K338K325L885M791L709
57911E89372J915J183J303R33m2n62l05l4j93l80k92k42m53p08q26r85j328j736
57893E86620k087k525l310m492n620n893m961l539k685k490k185j620j576k215
$$ y = [1095933, 1073041, 1051650, 1030510, 1009351, 989893, 973606, 960255, 949173, 940181, 932533, 924510, 914904, 903865, 891905, 879308, 866811, 855346, 844555, 832899, 819890, 807031, 795815, 785880, 775872, 765175, 754072, 742983, 732246, 721926, 711371, 699721, 687414, 676314, 667523, 659697, 650556, 639840, 629878, 622971, 618732, 614480, 608184, 600528, 593672, 588430, 583651, 578370, 573204, 568833, 564338, 558513, 552135, 547323, 544801, 543236, 541300, 538947, 536441, 533552, 530365, 527809, 526592, 526385, 526718, 528087, 531398, 536580, 542393, 547621, 552190, 557011, 562642, 568252, 572324, 574662, 576987, 580872, 585663, 589372, 591287, 592470, 593773, 594706, 594664, 594102, 593797, 593763, 593570, 593190, 592898, 592656, 592203, 591495, 590669, 589684, 588356, 586620, 584533, 582008, 578698, 574206, 568586, 562693, 557732, 554193, 551508, 549018, 546833, 545213, 543637, 541422]
57879E41422k285p91J328K321J910J518K328M061N732O771P208P228O871O043
57865E91665M768L417K491K023J391j40k714n702q011q775q086o942o120n405
57851E53860m416l775m493o395q178r037r204q922q087p059o600o630o265n392
57837D59407m914n020m760l980l999n264n949m508k310j906l416m572l965k415
57823D02429j121j96N96J029Q71K60p34k064l071k789j300k7k18j540k561k250
57807C87314p70Q31J471Q13n57j802k703l620m582m745l124J57L648N891O734
57792C84956P037P160O565N176M195M660N815N994M797L242K056J142O45R32J361
57777D45733N61j529l363m071m545n559o352o049n101m123k641m10J298J269L08
$$ y = [541422, 539137, 538346, 539674, 541995, 543905, 545423, 547751, 551812, 557544, 564315, 571523, 578751, 585622, 591665, 596433, 599850, 602341, 604364, 605755, 605615, 602901, 597199, 589188, 580413, 572327, 565385, 559265, 553860, 549444, 545669, 541176, 534781, 526603, 517566, 508362, 499440, 491353, 484294, 477694, 471064, 464799, 459407, 454493, 449473, 444713, 440733, 436734, 431470, 425521, 421013, 418703, 416797, 413381, 408809, 404844, 402429, 401308, 401112, 401708, 402737, 403608, 403868, 403134, 401070, 397999, 395210, 393910, 393883, 393665, 392125, 389564, 387314, 386544, 387375, 388846, 389659, 389102, 387300, 384597, 380977, 376395, 371650, 368526, 368683, 372331, 378222, 384956, 391993, 399153, 405718, 410894, 415089, 419749, 425564, 431558, 436355, 439597, 441653, 442795, 443440, 444372, 445733, 446294, 444765, 441402, 437331, 432786, 427227, 420875, 414826, 409725, 405602, 402961, 402551, 403849, 405118, 405426]
57762D05426Q9O97Q89J67r10j921k616k276o95O98L79q99j084m7J76j412l284
57745C93377l839l599l880m544m429l333k337k284k690k382q75Q79J253l80k784
57730C58153l987l221j477l04m33j369k014j826j511k200l684m240k744j91J664
57715C30616K499L230M222M882M750L917K506O67j035k134k873l507l539k669
57701C41532j870k156k783k359j465k233n087p775q260p042n881n491n342m650
57687B79138k916l71J628J707M05k15N90J200K21j358j835j371j370k116k548
57672B70789k056j070l4R72J619J494Q89M98K32o40j980k442j192P58J619Q55
57656B70311n06j286j201m01J130L100M240L234N52j602j807j054r64j138J66
$$ y = [405426, 405515, 406212, 407101, 407268, 406358, 404437, 401821, 399545, 398850, 399548, 399927, 399028, 397944, 397897, 398073, 396661, 393377, 389538, 385939, 382059, 377515, 373086, 369753, 367416, 365132, 362442, 360060, 359185, 360064, 361317, 360937, 358153, 354166, 350945, 349468, 349164, 348731, 347362, 345348, 343522, 342011, 339811, 336127, 331887, 329143, 328952, 330616, 333115, 336345, 340567, 345449, 350199, 354116, 356622, 357289, 356254, 354120, 351247, 347740, 344201, 341532, 339662, 337506, 334723, 332364, 330899, 328666, 323579, 315804, 307544, 300502, 294621, 289130, 283788, 279138, 276222, 275851, 277479, 279186, 279591, 279376, 279966, 281166, 281387, 280029, 278194, 276823, 275453, 273337, 270789, 268733, 267663, 267629, 268601, 270220, 271714, 272603, 273101, 273333, 272693, 270713, 268271, 267079, 267837, 269456, 270311, 269805, 268519, 267318, 266917, 268047, 271147, 275387, 278621, 279173, 277571, 275764, 274710, 273746, 272608, 272774]
57641B72774K976N019M763L410K893L216L143K567K450K780K319O41j002j403
57627C06546q47j50O72J895K961L110K838L565N790Q618J1276J4049J7168J9893
57613C97384K1619K3153K5784K9614L3989L9187M5770N1983N3474M6807L2502
57602H01266J4020n146k2432l5603m3137m5405m4307m1651l8425l5320l2763l0363
57590D40734k7238k3222j9248j6301j4376j2558r933o566l746k817l559m266l810
57577B93094k842k378k174j492p27r05k009l077l568l505k667j018L89M33l28
57562B67226m40J2n06k216l187k005K11J351Q36k21o25k1J093J751J249r8j261
57545B63149j509p38Q71K625L186J829k72j172m44P51J495J578N41j769l776l381
$$ y = [272774, 275750, 280769, 285532, 288942, 291835, 295051, 298194, 300761, 303211, 305991, 308310, 308951, 307949, 306546, 305699, 305549, 306221, 308116, 311077, 314187, 317025, 320590, 326380, 334998, 346274, 360323, 377491, 397384, 419003, 442156, 467940, 497554, 531543, 570730, 616500, 668483, 721957, 768764, 801266, 815286, 810140, 787708, 752105, 708968, 663563, 619256, 577605, 539180, 503860, 471097, 440734, 413496, 390274, 371026, 354725, 340349, 327791, 317858, 311292, 307546, 304729, 301170, 296904, 293094, 290252, 287874, 285700, 284208, 283481, 282576, 280567, 277490, 273922, 270417, 267750, 266732, 267121, 267554, 267226, 266786, 266798, 266292, 264076, 260889, 258884, 259095, 260446, 261282, 261061, 260436, 260415, 261508, 263259, 264508, 264410, 263149, 261640, 260902, 261773, 264398, 267584, 269413, 269141, 267969, 267525, 268276, 269771, 271349, 271890, 270121, 266345, 262964]
57529B62964r12J107J456J326J433N93j621l230k545o41N57R70J411J530P30j23
57513B65005J03R19J321J821L479N645O570N708L819J587l38o64J146L365L644
57498C03130J892l2j025j406j437r13r5N76J407K712L626L203K146J768J877J550
57482C18979J290K095L007K200M25N15L067N351N357M287L898L738K720J565J720
57467C60214L048M190M398L744K348N49q66j549k039k594k433j098M01Q31M25
57452C69569K93O69P99L59O6Q42K727M524M591K561K35r9J693L491L608K385Q25
57435C99138q06k284k636j172J399L742M963M493K153p08j503Q33M208N835N451
57420D23106M714M287L382J877J008J712L611N802P445P573N710L106K030L232
$$ y = [262964, 262052, 263159, 264615, 265941, 267374, 267967, 266346, 263116, 260571, 259930, 260487, 261457, 262868, 264398, 265128, 265005, 265108, 266027, 267348, 269169, 272648, 278293, 284863, 290571, 294390, 295977, 295639, 294975, 296121, 299486, 303130, 305022, 304990, 303965, 302559, 301122, 300209, 300114, 300690, 302097, 304809, 308435, 311638, 313784, 315552, 317429, 318979, 320269, 322364, 325371, 327571, 327996, 328511, 331578, 336929, 342286, 346573, 350471, 354209, 356929, 358494, 360214, 363262, 367452, 371850, 375594, 377942, 378491, 377625, 376076, 374037, 371443, 369010, 367912, 368313, 369144, 369569, 369862, 370531, 371330, 371689, 371755, 372597, 375324, 379848, 384439, 387000, 387235, 387136, 388829, 392320, 395928, 398313, 399138, 398332, 396048, 393412, 392240, 393639, 397381, 402344, 406837, 408990, 408282, 406779, 407612, 411820, 417655, 423106, 427820, 432107, 435489, 437366, 438374, 440086, 443697, 449499, 456944, 464517, 470227, 473333, 475363, 478595]
57406D78595N065N747N433N289N392M791L304K026J823K264K516K604L033L578
57392E31460L480K858K917M229N750O363O593P511Q594Q281O572N216M927M330
57378F09081K609J358K279M367N327M923M913N978O761O198N009M279M045M008
57364F71135M508N833P340Q060P739O758N601M801M842N403N286L824K056J805
57350G44991L581N998P266O899N911N627O344P125O997O229O016O765P429P046
57336H34224O291O563P838Q559P838O667O365O775O893O659O992Q192R373R745
57322I38974R526R313R137Q628P665O580O076O946R155J1086J0709Q060N593N384
57308A052832O857Q218R056J0077J1062J1003J0191J0232J1514J2379J1539R959
$$ y = [478595, 483660, 489407, 494840, 500129, 505521, 510312, 513616, 515642, 517465, 519729, 522245, 524849, 527882, 531460, 534940, 537798, 540715, 544944, 550694, 557057, 563650, 571161, 579755, 588036, 594608, 599824, 604751, 609081, 611690, 613048, 615327, 619694, 625021, 629944, 634857, 640835, 647596, 653794, 658803, 663082, 667127, 671135, 675643, 681476, 688816, 696876, 704615, 711373, 716974, 721775, 726617, 732020, 737306, 741130, 743186, 744991, 748572, 754570, 761836, 768735, 774646, 780273, 786617, 793742, 800739, 806968, 812984, 819749, 827178, 834224, 840515, 847078, 854916, 863475, 871313, 877980, 884345, 891120, 898013, 904672, 911664, 919856, 929229, 938974, 948500, 957813, 966950, 975578, 983243, 989823, 995899, 1002845, 1012000, 1023086, 1033795, 1041855, 1047448, 1052832, 1059689, 1067907, 1076963, 1087040, 1098102, 1109105, 1119296, 1129528, 1141042, 1153421, 1164960, 1174919]
57296A174919R302R722J0230J0398J0458J0318R580Q402P462P230P764Q911J0136
57283A294832J0617J0117R400R199R363R657J0581J2328J3568J2836J1012J0754
57271A424264J3052J5652J5821J3712J1950J2411J4475J6285J6780J6101J4770
57260A585273J3188J1813J1188J1520J2512J3831J5458J7219J8307J7958J6613
57249A744880J5667J5814J6217J5778J4694J4190J4915J6280J7249J7327J6683
57238A919694J5667J4512J3393J2581J2358J2691J3189J3639J4301J5344J6235
57227B073604J6248J5462J4530J3594J2230J0556R435R154Q887P909O719O390
57215B204718P494R979J3382J6599J8357J8622J8822K0025K1626K2523K2727K2968
$$ y = [1174919, 1184221, 1193943, 1204173, 1214571, 1225029, 1235347, 1244927, 1253329, 1260791, 1268021, 1275785, 1284696, 1294832, 1305449, 1315566, 1324966, 1334165, 1343528, 1353185, 1363766, 1376094, 1389662, 1402498, 1413510, 1424264, 1437316, 1452968, 1468789, 1482501, 1494451, 1506862, 1521337, 1537622, 1554402, 1570503, 1585273, 1598461, 1610274, 1621462, 1632982, 1645494, 1659325, 1674783, 1692002, 1710309, 1728267, 1744880, 1760547, 1776361, 1792578, 1808356, 1823050, 1837240, 1852155, 1868435, 1885684, 1903011, 1919694, 1935361, 1949873, 1963266, 1975847, 1988205, 2000896, 2014085, 2027724, 2042025, 2057369, 2073604, 2089852, 2105314, 2119844, 2133438, 2145668, 2156224, 2165659, 2174813, 2183700, 2191609, 2198328, 2204718, 2212212, 2222191, 2235573, 2252172, 2270529, 2289151, 2307973, 2327998, 2349624, 2372147, 2394874, 2417842]
57203B417842K3522K4414K5885K7537K7784K5600K2363K0527K0811K1997K3065
57192B681347K3976K4648K4819K5017K5975K6861K5776K2576J9630J8974J9979
57181B939578K0682K0303J9439J8594J7737J6915J6429J6423J6704J6869J6508
57170C136181J5694J5239J5936J7533J9087K0305K1719K3464K4992K6157K7515
57159C363822K9082K9868K9278K8065K7224K6784K6377K6144K6231K6029K4823
57148C663727K2791K0685J8989J7907J7579J7536J6540J3843J0344P697O567O367
57136C840572O445O716P188P574P558P204P026P679R256J1004J2188J3197J5024
57123C958631J7582J9629K0616K1435K2722K3800K4258K5300K7983L0970L1836
$$ y = [2417842, 2441364, 2465778, 2491663, 2519200, 2546984, 2572584, 2594947, 2615474, 2636285, 2658282, 2681347, 2705323, 2729971, 2754790, 2779807, 2805782, 2832643, 2858419, 2880995, 2900625, 2919599, 2939578, 2960260, 2980563, 3000002, 3018596, 3036333, 3053248, 3069677, 3086100, 3102804, 3119673, 3136181, 3151875, 3167114, 3183050, 3200583, 3219670, 3239975, 3261694, 3285158, 3310150, 3336307, 3363822, 3392904, 3422772, 3452050, 3480115, 3507339, 3534123, 3560500, 3586644, 3612875, 3638904, 3663727, 3686518, 3707203, 3726192, 3744099, 3761678, 3779214, 3795754, 3809597, 3819941, 3827638, 3834205, 3840572, 3847017, 3853733, 3860921, 3868495, 3876053, 3883257, 3890283, 3897962, 3907218, 3918222, 3930410, 3943607, 3958631, 3976213, 3995842, 4016458, 4037893, 4060615, 4084415, 4108673, 4133973, 4161956, 4192926, 4224762]
57112D224762L0186K7882K6168K4216K0767J5810R955L176m899j3839k2142k8047
57100D313995l0629l0313k8394k5952k3430k1219j9849j9078j7650j4822j1622
57089D071037r607q860q264p420o954p022o777n559l643j579L50J861K678K932
57075D013173K816J898l79l571o565r127j2127j6154k1017k6823l4447m4412n6032
57062C787233o8123p9972r1541j03358j16208j30221j44380j57794j71170j85936
57052B538530k02166k18811k35960k55243k77757l02848l29215l55873b1150m05942
57042d27092m27426m44892m55773m58136m52546m40012m19066l88411l52837l23333
57032d589524l11177l24955l72311m58668n82424p35241r06231j080476j240920
$$ y = [4224762, 4254948, 4282830, 4308998, 4333214, 4353981, 4369791, 4379746, 4382922, 4378023, 4364184, 4342042, 4313995, 4283366, 4253053, 4224659, 4198707, 4175277, 4154058, 4134209, 4115131, 4097481, 4082659, 4071037, 4061430, 4052570, 4044306, 4036886, 4029932, 4022910, 4016133, 4010574, 4006931, 4005352, 4005702, 4007563, 4010241, 4013173, 4015989, 4017887, 4017508, 4013937, 4007372, 3998245, 3986118, 3969964, 3948947, 3922124, 3887677, 3843265, 3787233, 3719110, 3639138, 3547597, 3444239, 3328031, 3197810, 3053430, 2895636, 2724466, 2538530, 2336364, 2117553, 1881593, 1626350, 1348593, 1045745, 716530, 360657, -21150, -427092, -854518, -1299410, -1755183, -2213319, -2665865, -3105877, -3524943, -3913354, -4266191, -4589524, -4900701, -5225656, -5597967, -6056635, -6639059, -7374300, -8280531, -9361007, -10601927]
57023a0601927j395121j608859j982465k547537l172586l595938l581989l061521
57015c1547943k139941j003159J68468J227109K060310K605339K862351K883780
57007b2883686K747012K530288K297447K088733J919922J790261J691042J609141
56999f209840J529894J442846J345095f53523D72332J011253R00377P97862P05007
56990C886831O21462N47231M81437M21420L65325L14166K69441K30275J94845
56981G332433J63211J36566J14724R6410Q1192O9187N9490N0684M2341L4488K6301
56970H207027J6991P194k176j1742k2523l3676m3428n1834o0372o8852p4971p7484
56958G784154p7930p8525p9846q1400q3153q5539q8797r3053r8471j04717j10622
$$ y = [-10601927, -11997048, -13605907, -15588372, -18135909, -21308495, -24904433, -28486422, -31547943, -33687884, -34691043, -34522575, -33295466, -31235156, -28629817, -25767466, -22883686, -20136674, -17606386, -15308939, -13220206, -11300284, -9510023, -7818981, -6209840, -4679946, -3237100, -1892005, -653523, 472332, 1483585, 2383962, 3181824, 3886831, 4508293, 5055524, 5536961, 5958381, 6323706, 6637872, 6907313, 7137588, 7332433, 7495644, 7632210, 7746934, 7843344, 7924536, 7993723, 8053213, 8103897, 8146238, 8180726, 8207027, 8224018, 8231212, 8229036, 8217294, 8194771, 8161095, 8117667, 8065833, 8005461, 7936609, 7861638, 7784154, 7706224, 7627699, 7547853, 7466453, 7383300, 7297761, 7208964, 7115911, 7017440, 6912723, 6802101]
56947F802101j14791j16395j15565j13565j12369j13265j15754j18335j20349
56938E761713j22468j25616j30038j35093j39197j40467j38599j35853j34884
56929D559498j35659j35879j34456j32969j33171j34573j35549j35714j36071
56920C345457j37333j39194j41121j43082j45336j47762j49405j48860j45425
56911B047939j39671j32425j23588j12761j00917r0149q1421p3648o5488n7059
56901A070812m9144m1650l3932k6145j9380j4451j1304r565r186j0373j3117j6802
56889H15763k0280k2486k3063k2279k0610j8775j7721j7713j7527j5567j1929
56878F07813q394o157m647k980j338l9J644M456P564R312R191P971O016K780j851
$$ y = [6802101, 6687310, 6570915, 6455350, 6341785, 6229416, 6116151, 6000397, 5882062, 5761713, 5639245, 5513629, 5383591, 5248498, 5109301, 4968834, 4830235, 4694382, 4559498, 4423839, 4287960, 4153504, 4020535, 3887364, 3752791, 3617242, 3481528, 3345457, 3208124, 3068930, 2927809, 2784727, 2639391, 2491629, 2342224, 2193364, 2047939, 1908268, 1775843, 1652255, 1539494, 1438577, 1348428, 1267007, 1193359, 1127871, 1070812, 1021668, 980018, 946086, 919941, 900561, 886110, 874806, 865241, 856055, 845682, 832565, 815763, 795483, 772997, 749934, 727655, 707045, 688270, 670549, 652836, 635309, 619742, 607813, 599419, 593262, 588615, 585635, 584297, 584258, 585902, 590358, 597922, 607234, 616425, 624396, 630412, 633192, 631341]
56863F31341o901j1425j5435j9165k2060k3212k2477k0567j8264j6033j4302j3396
56851D28104j2988j2161j0475q661p675p299o388m450k192l40J199K516L088K744
56837C65022K378K696L036K647K439L887O618Q898J0337J2040J3866J3897J1571
56824D59332R198Q819R274Q143N274K361R9k138m211n006m302l103k020q82kN
56808D80841m3J802N880J0022J2371J3838J6613K1224K6254L0202L2383L2403
56796F83790K9933K5055J8151R610L24p870j3242j5708j6532j6409j4706j0915
56784F71481o052j844J188M186Q435J3875J9277K3722K7520L1602L6177M0278
56772H69845M2714M3041M1105L5888K5837J1034n547j9809k9670l5799l9438m0574
$$ y = [631341, 624440, 613015, 597580, 578415, 556355, 533143, 510666, 490099, 471835, 455802, 441500, 428104, 415116, 402955, 392480, 383819, 376144, 368845, 362457, 358007, 355815, 355475, 356674, 359190, 362278, 365022, 367400, 370096, 373132, 375779, 378218, 382105, 388723, 397621, 407958, 419998, 433864, 447761, 459332, 468530, 477349, 486623, 494766, 500040, 502401, 502500, 500362, 496151, 491145, 486843, 483740, 481720, 480838, 480836, 480841, 480798, 482600, 488480, 498502, 510873, 524711, 541324, 562548, 588802, 619004, 651387, 683790, 713723, 738778, 756929, 766539, 766863, 758993, 745751, 730043, 713511, 697102, 682396, 671481, 665429, 663585, 664773, 668959, 677394, 691269, 710546, 734268, 761788, 793390, 829567, 869845, 912559, 955600, 996705, 1032593, 1058430, 1069464, 1063917, 1044108, 1014438, 978639, 939201, 898627]
56760H98627l8741l4579k9575k4620j9725j4926j0489o182j336M098R306J3734
56748G45592J7793K1865K5165K6222K4315J9895J3640N555m618j6053k6218l2272
56736H20881l3486l1931l0247k9058k7246k4290k1135j8653j6385j3327r182m429
56724E61512J74L820O051P350Q591R666R463P463M302K75n298j2271j8408k1358
56710E61332k1262k0198j9607j9548j9868k0511k0787j9798j7742j5628j3664
56699C52719j1221q569p199p800q989q915p387n689m838m741m744m398l671k765
56685B61793j825q75j69k85j370k477k367j172n21j636l759m959m203k281o87
56670B33207NM54J268J784P42j656l271k312K95J815R01j089k073j571o54k77
$$ y = [898627, 859886, 825307, 795732, 771112, 751387, 736461, 725972, 719790, 718454, 722552, 731858, 745592, 763385, 785250, 810415, 836637, 860952, 880847, 894487, 900042, 895424, 879371, 853153, 820881, 787395, 755464, 725217, 696159, 668913, 644623, 623488, 604835, 588450, 575123, 565941, 561512, 561686, 565506, 571557, 578907, 587498, 597164, 606627, 614090, 618392, 618667, 613369, 601098, 582690, 561332, 540070, 519872, 500265, 480717, 460849, 440338, 419551, 399753, 382011, 366383, 352719, 341498, 332929, 325730, 317930, 308941, 300026, 292639, 286950, 282112, 277371, 272627, 268229, 264558, 261793, 259968, 259093, 258924, 258639, 257269, 254792, 252425, 251253, 250732, 249096, 245337, 240378, 236175, 233894, 233207, 233212, 233666, 234934, 236718, 237460, 235804, 232533, 230221, 230516, 232331, 233232, 232143, 230070, 228499, 227845, 227568]
56654B27568m24o03n62m25m09n27o16n78m56k20K16O29M87l23j115j145m21O43
56636B21719J825K833K938J746L9j077j636k423l351l443k555j831j982k255j825
56621B08722j263j725l192m365m079k320j30J114O79p82j715j261q9N89L76k79
56605A90280q36r59n09J78L44k65q78o93J1M36N89J054J676J564O33L3M28R05
56587A93991M25l90p4J390K428K029R06J36j20pP82K167L027K669K299L582N994
56570B21234P254O374M693L514K502J189M01R04J842J998J695J981K506J945L35
56555B60367o23J51J785K796K769K210J424K56j318k751l324l076k963l606m019
56540B50078k679P7K007J853Q40L81j50j800l546l495j822m43j43j22q5o08j305
$$ y = [227568, 227144, 226541, 225979, 225554, 225145, 224618, 224002, 223424, 222968, 222748, 222964, 223593, 224080, 223757, 222642, 221497, 221076, 221719, 223544, 226377, 229315, 231061, 231100, 230023, 228387, 225964, 222613, 219170, 216615, 214784, 212802, 210547, 208722, 207459, 205734, 202542, 198177, 194098, 191778, 191648, 192762, 193441, 192659, 190944, 189683, 189594, 190183, 190559, 190280, 189444, 188485, 187976, 188154, 188498, 188233, 187355, 186662, 186673, 187109, 187698, 188752, 190428, 191992, 192625, 192658, 193086, 193991, 194416, 194026, 193952, 195342, 197770, 199799, 200705, 200841, 200721, 200714, 201496, 203663, 206690, 209359, 211658, 215240, 221234, 228488, 234862, 239555, 243069, 245571, 246760, 247161, 248065, 249907, 251905, 253600, 255581, 258087, 260032, 260367, 259744, 259895, 261680, 264476, 267245, 269455, 270879, 271135, 269817, 267066, 263742, 260666, 257703, 254097, 250078, 247399, 247476, 249483, 251336, 252176, 252557, 252407, 250607, 247061, 243566, 241744, 241301, 241158, 241036, 240951, 240343, 239038]
56523B39038q50P40J878K052K672M403N584M555K181O34O87J419J841J792J631
56508B70257J789K323K699K495K314L013M218M871N210O525Q639R474P933N480
56494C37240L991L568L455L473L337K180J53r45j49R05K99j347k176k096k394
56479C49494l176l389k870k423k076j333r23k243m767o152n472m536n150o532
56465B98452o563m622k072m11M9r8l09n55r48j196p72K28R01O90K62O08J613K176
56447B87433J542j3j556k089j211K16N33q65k617l092k444j971j962j466q8J289
56431B71639J736J237L14n21p92m17r8m99j008l21J535K811K170M41m02M57K065
56414B80347K988K612J242m41j772k201j513j50R61J231R74Q32R12R65J124J605
$$ y = [239038, 238188, 238928, 240806, 242858, 245530, 249933, 255517, 260072, 262253, 262887, 263574, 264993, 266834, 268626, 270257, 272046, 274369, 277068, 279563, 281877, 284890, 289108, 293979, 299189, 305714, 314353, 323827, 331760, 337240, 341231, 344799, 348254, 351727, 355064, 357244, 357397, 356452, 356303, 357208, 357507, 356160, 353984, 351888, 349494, 346318, 342929, 340059, 337636, 335560, 334227, 333304, 331061, 326294, 320142, 314670, 310134, 304984, 298452, 291889, 287267, 285195, 284784, 284833, 284735, 284426, 283871, 282923, 281727, 280955, 281183, 282084, 282774, 283036, 283644, 285257, 287433, 288975, 288962, 287406, 285317, 284106, 284322, 284855, 283990, 281373, 278281, 275837, 273866, 271904, 270438, 270350, 271639, 273375, 274612, 274926, 274405, 273613, 273196, 273098, 272599, 271591, 271270, 272805, 275616, 277786, 278227, 277825, 278282, 280347, 283335, 285947, 287189, 286748, 284976, 282775, 281262, 281112, 282073, 283304, 284278, 285110, 286022, 286987, 288111, 289716]
56398B89716J847J126L4N1J228J762N30j264j948j576j045k92J125K478K570J554
56382B97896O19K78K09K77L45k57j650k357j114Q28J165rl95Q39J926J590J014
56365C01204J606K640K628J780J615K777M294M705L277O07j498j472K52J590J315
56350C27320L68K47R63J391R11j33j115j614j529j187j065j082o55K89R75Q61
56334C24945L89K23L47M90Q23J548K315K622K524K293J796R09L24J044K975M690
56318C50257M959M113L484L713M122L811K887K134J780J289M12l17m46k60o9N60
56302C82429J992L440L557K114L55m08k0P04R70P60P51J380K037J692M87j73M27
56285D02494J219R81J63KN17O65J51k38P3R06K035L374M473M797M434L820K920
$$ y = [289716, 291563, 292689, 292723, 292774, 294002, 295764, 296294, 295030, 293082, 291506, 290461, 290169, 291294, 293772, 296342, 297896, 298515, 298793, 299002, 299279, 299624, 299367, 297717, 295360, 294246, 295074, 296239, 296230, 295835, 296674, 298600, 300190, 301204, 302810, 305450, 308078, 309858, 311473, 314250, 318544, 323249, 326526, 327133, 325635, 324163, 324415, 326005, 327320, 327688, 327935, 328898, 330289, 331200, 331067, 329952, 328338, 326809, 325622, 324557, 323475, 322820, 323109, 324084, 324945, 325334, 325557, 325904, 326394, 327217, 328765, 331080, 333702, 336226, 338519, 340315, 341224, 341548, 342592, 345567, 350257, 355216, 359329, 362813, 366526, 370648, 374459, 377346, 379480, 381260, 382549, 382961, 382644, 382198, 381938, 381869, 382429, 384421, 387861, 391418, 393532, 393887, 393479, 393459, 394163, 395133, 395893, 396644, 398024, 400061, 401753, 402240, 402067, 402494, 403713, 404694, 404857, 404859, 405376, 406041, 406192, 405954, 406027, 406933, 408968, 412342, 416815, 421612, 426046, 429866, 432786]
56268D32786J550K13l17m5L81O01N00j22r36q03O66J943J361m86j639j441o63
56251D33549L83J808K626J572m55r99N68K287K622K124J643J088P85J980M714
56236D56295O908O724M619K178L26n25j09R38J358J157J760L566M920M542L271
56221D97928K334J544N21P5Q54J944K372K737L847M961N036M565M574M793M508
56206E42593M216M626M973M185L077L363M934O095O215O262O760P114P214P932
56192F19559R499J0759J0747J0004R793J0672J2225J3680J4468J4564J4406J4238
56180G64614J3834J3173J2979J3818J4940J4887J3268J1272J0169R861R135P157
56168I09107M372J849p0j993m179n791o133o003o697q063q960r281r945j0835
$$ y = [432786, 434336, 434549, 434232, 434187, 434568, 435169, 435669, 435547, 434611, 433808, 434474, 436417, 437778, 437292, 435653, 434212, 433549, 433932, 435740, 438366, 439938, 439483, 438484, 439052, 441339, 443961, 446085, 447728, 448816, 449601, 451581, 456295, 463203, 469927, 474546, 476724, 477050, 476525, 476416, 477354, 478712, 479869, 481629, 485195, 490115, 494657, 497928, 500262, 501806, 502327, 502402, 503256, 505200, 507572, 510309, 514156, 519117, 524153, 528718, 533292, 538085, 542593, 546809, 551435, 556408, 560593, 563670, 567033, 571967, 578062, 584277, 590539, 597299, 604413, 611627, 619559, 629058, 639817, 650564, 660568, 670361, 681033, 693258, 706938, 721406, 735970, 750376, 764614, 778448, 791621, 804600, 818418, 833358, 848245, 861513, 872785, 882954, 892815, 901950, 909107, 913479, 915328, 915258, 913265, 909086, 903295, 897162, 891159, 884462, 876399, 867439, 858158, 848213, 837378]
56154H37378j0651r200q000p775p213n290l233k738l509l890l122j698l12N67
56140G71314P68Q42J591K574K336P99j1J336L646M953N024M724M272L629L427
56125H11224M017M467L927L020K783L288M392O410Q666R119P169N322N979P977
56111H87760Q528P371O571P219Q770J0878J3301J4602J3591J1789J1989J4416
56099A016785J6666J7310J7331J7901J9017K0520K2536K4677K6503K8701L2068
56088A260015L5656L7972L9687M2963M8244N4027N9620O5549P1309P5534P8923
56077A869499Q4097R1771R9589J05665J10477J14013J13761J07700R7475Q6666
56067B880713P7297O9688O4059N9988N5025M5999L1982J5098j279j4501k3554
$$ y = [837378, 826727, 817527, 809527, 801752, 794539, 789249, 786016, 783278, 779769, 775879, 772757, 771059, 770747, 771314, 772082, 772924, 774515, 777089, 779425, 780224, 780213, 781549, 785195, 790148, 795172, 799896, 804168, 807797, 811224, 815241, 819708, 823635, 826655, 829438, 832726, 837118, 843528, 852194, 861313, 868482, 873804, 879783, 887760, 896288, 903659, 910230, 917449, 926219, 937097, 950398, 965000, 978591, 990380, 1002369, 1016785, 1033451, 1050761, 1068092, 1085993, 1105010, 1125530, 1148066, 1172743, 1199246, 1227947, 1260015, 1295671, 1333643, 1373330, 1416293, 1464537, 1518564, 1578184, 1643733, 1715042, 1790576, 1869499, 1953596, 2045367, 2144956, 2250621, 2361098, 2475111, 2588872, 2696572, 2794047, 2880713, 2958010, 3027698, 3091757, 3151745, 3206770, 3252769, 3284751, 3299849, 3298570, 3284069, 3260515]
56056C260515k9253l3457l7628m2294m7960n5599o5687p7277q8340r6572j00118
56045B586330r8577r3595q7413q0584p2123o2036n2127m3812l6596k9663k3601
56034A906203j9208j5634j1330o503l036j853j542j64K397M639N667O316P857
56021A873809J0248J2363J3581J4294J4973J5678J6547J7759J8770J8737J7987
56010B044746J7876J8794J9649J9898K0401K1493K2046K1780K2601K5887K9906
55999B285077L2070L2439L2943L4180L5324L6358L8096M0407M2490M4305M5900
55988B699589M6112M4157M1857M1811M3877M5815M7024M8992N2173N5134N7161
55977C223702N9404O2788O6687P0123P2788P4735P6388P8767Q2284Q5886Q8795
$$ y = [3260515, 3231262, 3197805, 3160177, 3117883, 3069923, 3014324, 2948637, 2871360, 2783020, 2686448, 2586330, 2487753, 2394158, 2306745, 2226161, 2154038, 2092002, 2039875, 1996063, 1959467, 1929804, 1906203, 1886995, 1871361, 1860031, 1853528, 1850492, 1848639, 1847097, 1846933, 1849330, 1853969, 1859636, 1865952, 1873809, 1884057, 1896420, 1910001, 1924295, 1939268, 1954946, 1971493, 1989252, 2008022, 2026759, 2044746, 2062622, 2081416, 2101065, 2120963, 2141364, 2162857, 2184903, 2206683, 2229284, 2255171, 2285077, 2317147, 2349586, 2382529, 2416709, 2452033, 2488391, 2526487, 2566894, 2609384, 2653689, 2699589, 2745701, 2789858, 2831715, 2873526, 2917403, 2963218, 3010242, 3059234, 3111407, 3166541, 3223702, 3283106, 3345894, 3412581, 3482704, 3555492, 3630227, 3706615, 3785382, 3867666, 3953552, 4042347]
55966D042347R2236R7582J03801J08856J12784J16922J21081J24217J27341J32776
55956E179943J40654J48785J55902J62770J70350J79101J89599K01676K13717
55947F742497K25089K37921K54048K71737K88682L06415L28064L53221L79131
55938I386805M05638M34475M64812M94421N24403N57856N94459O31340O68633
55929A4162842P08687P50406P90400Q29895Q74279R25147R78764J033278J091485
55920B2145183J155352J223759J296963J377814J467314J564389J670735J790425
55912C3691934J924491K071911K235715K421437K630201K861130L120013L416613
55904E4373445L753970M130930M556154N049061N626303O298954P083581Q002093
$$ y = [4042347, 4134583, 4232165, 4335966, 4444822, 4557606, 4674528, 4795609, 4919826, 5047167, 5179943, 5320597, 5469382, 5625284, 5788054, 5958404, 6137505, 6327104, 6528780, 6742497, 6967586, 7205507, 7459555, 7731292, 8019974, 8326389, 8654453, 9007674, 9386805, 9792443, 10226918, 10691730, 11186151, 11710554, 12268410, 12862869, 13494209, 14162842, 14871529, 15621935, 16412335, 17242230, 18116509, 19041656, 20020420, 21053698, 22145183, 23300535, 24524294, 25821257, 27199071, 28666385, 30230774, 31901509, 33691934, 35616425, 37688336, 39924051, 42345488, 44975689, 47836819, 50956832, 54373445, 58127415, 62258345, 66814499, 71863560, 77489863, 83788817, 90872398, 98874491]
55896I8874491R067579J0282065J1647870J3165695J4823358J6607697J8526107
55889A92994862K0584987K2732303K4824757K6600719K7576996K6950793K3786336
55882C66051753J7581678Q818233j065152j0336645j7731271k2758751k5532574
55875C15027271k6461409k6041971k4747328k2955962k0932534j8858141j6857690
55868A58172236j5001214j3311147j1790151j0439305r252713q213966p307362
55861H2856378o523071n847187n257733m736230m275207l870376l513534l197105
55853D5635935k918145k673123k454410k255538k075059j912451j764819j629820
55845B7952570j507345j396175j293200j197602j111532j035162r65105q99156
$$ y = [98874491, 107942070, 118224135, 129872005, 143037700, 157861058, 174468755, 192994862, 213579849, 236312152, 261136909, 287737628, 315314624, 342265417, 366051753, 383633431, 392451664, 391386512, 381049867, 363318596, 340559845, 315027271, 288565862, 262523891, 237776563, 214820601, 193888067, 175029926, 158172236, 143171022, 129859875, 118069724, 107630419, 98377706, 90163740, 82856378, 76333307, 70486120, 65228387, 60492157, 56216950, 52346574, 48833040, 45635935, 42717790, 40044667, 37590257, 35334719, 33259660, 31347209, 29582390, 27952570, 26445225, 25049050, 23755850, 22558248, 21446716, 20411554, 19446449, 18547293]
55837A8547293q38571p84190p34157o86909o42804o01507n61203n21623m84603
55828A2691726m50493m17170l83496l50721l19815k90592k64342k44068k31386
55819I739643k26149k29416k42843k63944k85588l01993l12423l17998l18293
55810G240996l13043l04318k94477k83759k71547k58287k44700k30560k15681
55801D824624k00878j87048j74411j63231j53918j45913j37922j29645j22073
55792C409585j15864j10827j06815j03581r9999r5328r0928q8563q7315q4710
55782B425655q0801p8248p7886p7151p3924o9308o5209o1490n7084n2197m7780
55771A684577m4035m0701l7843l5490l3424l1821l1037l0418k8722k6113k4340
$$ y = [18547293, 17708722, 16924532, 16190375, 15503466, 14860662, 14259155, 13697952, 13176329, 12691726, 12241233, 11824063, 11440567, 11089846, 10770031, 10479439, 10215097, 9971029, 9739643, 9513494, 9284078, 9041235, 8777291, 8491703, 8189710, 7877287, 7559289, 7240996, 6927953, 6623635, 6329158, 6045399, 5773852, 5515565, 5270865, 5040305, 4824624, 4623746, 4436698, 4262287, 4099056, 3945138, 3799225, 3661303, 3531658, 3409585, 3293721, 3182894, 3076079, 2972498, 2872499, 2777171, 2686243, 2597680, 2510365, 2425655, 2344854, 2266606, 2188720, 2111569, 2037645, 1968337, 1903128, 1841638, 1784554, 1732357, 1684577, 1640542, 1599841, 1561998, 1526508, 1493084, 1461263, 1430226, 1399808, 1371086, 1344973, 1320633]
55760A320633k4385k5280k5696k5378k4498k2978k1130j9895j9779k0341k0847
55749A070426k0684j9290j6804j4515j3427j2700j0996q791p536p017n795m029
55737I28842l418m170m560l927l553l866l294j121Q41R59L08R31K854M228L419
55722I14473L9n068r998j2963j3964j4469j5351j6418j7825j9899k1319j9902
55710G47336j6000j2824j2309j2924j2901j3133j4891j6687j6045j3109j0144
55699E96369q267o923o026o311p537q223p610o566o245o717p187o934n995n073
55685E00755m677m259k913j091n21j842l425l474k445k286l843o034p263o865
55671D49817n405m136l872m097l677k605k214l326n172o716p887q818q981q072
$$ y = [1320633, 1296248, 1270968, 1245272, 1219894, 1195396, 1172418, 1151288, 1131393, 1111614, 1091273, 1070426, 1049742, 1030452, 1013648, 999133, 985706, 973006, 962010, 953219, 945683, 938666, 932871, 928842, 925424, 921254, 916694, 912767, 909214, 905348, 902054, 900933, 901774, 902733, 903041, 903972, 906826, 911054, 914473, 914512, 909444, 899446, 886483, 872519, 858050, 842699, 826281, 808456, 788557, 767238, 747336, 731336, 718512, 706203, 693279, 680378, 667245, 652354, 635667, 619622, 606513, 596369, 588102, 581179, 575153, 568842, 561305, 553082, 545472, 538906, 532661, 525944, 518757, 511823, 505828, 500755, 496078, 491819, 488906, 487815, 487294, 485452, 482027, 478553, 476108, 473822, 469979, 463945, 456682, 449817, 444412, 440276, 436404, 432307, 428630, 426025, 423811, 420485, 415313, 408597, 400710, 391892, 382911, 374839]
55657C74839o798n735m273j963m4q8j495j946m55J393J658M31p40j144j600k782
55641C49258l739k994j029l59k397n261o059m650l398l513l788l326l237m425
55627C01083n590n012l125j680j317j433j732k230k179p10J459K311Q62j691l310
55612B75706k985j230N43J051O4j564k895l666l923l489k390j261p78r16j303
55597B50964j832k368k261r55J073K629L049K714K390K413K542K416K130K166
55583B67070K610K708J850O90M01R70J241O68j20o87j376k157k219j449j050j860
55567B67290l197m194n123o314o941o207m803l849l243k395j823k313l130k753
55553B11005j203n5k19j109k013k737k892k057r27q80j899k424j745j182j946
$$ y = [374839, 368041, 362306, 358033, 356070, 356026, 355938, 354443, 352497, 352042, 353435, 355093, 355524, 354784, 353640, 352040, 349258, 345519, 342525, 341496, 341137, 338740, 333479, 327420, 322770, 319372, 315859, 312071, 308745, 305508, 301083, 295493, 290481, 287356, 285676, 284359, 282926, 281194, 278964, 276785, 276075, 277534, 279845, 280707, 279016, 275706, 272721, 271491, 272034, 273085, 273149, 271585, 268690, 265024, 261101, 257612, 255222, 253961, 253183, 252267, 250964, 249132, 246764, 244503, 243548, 244621, 247250, 250299, 253013, 255403, 257816, 260358, 262774, 264904, 267070, 269680, 272388, 274238, 274928, 275329, 276299, 277540, 278208, 278088, 277401, 276025, 273868, 271649, 270200, 269150, 267290, 264093, 259899, 254776, 248462, 241521, 235314, 230511, 226662, 223419, 221024, 219201, 216888, 213758, 211005, 209802, 209747, 209528, 208419, 206406, 203669, 200777, 198720, 197793, 196913, 195014, 192590, 190845, 189663, 187717]
55538A87717l153l217k305j776j728q00J308K802K178N40L06J990L725M033L617
55523A95237L779M254L842K593J883K493L804N090O379P705Q458Q015O353L771
55509B63656O92k012l375l480l544m393n489n810n044l728k859l479n664p790
55495B07681p921o242m855m876n227m856m421m628m559l257j777j767k888l344
55481A47063k491j276m14J54K58m47j344j150L75K080K865K551J408j44j362j695
55465A46431j537j631j885j605p11J49O08P40M33m32j301j443j022p41o47l50
55449A35056k01q90j908j772j24J586J899R80J1j50M97J245J128j35j577k091
55433A33554j862j849k022j343L47J685J483L4j525k311j871l74J000Q10r28k587
$$ y = [187717, 184564, 181347, 179042, 177266, 175538, 174738, 176046, 178848, 181026, 181566, 181872, 183862, 187587, 191620, 195237, 199016, 203270, 207112, 209705, 211588, 214081, 217885, 222975, 229354, 237059, 245517, 253532, 259885, 263656, 264348, 262336, 258961, 255481, 251937, 247544, 242055, 236245, 231201, 227473, 224614, 221135, 215471, 207681, 199760, 193518, 188663, 183787, 178560, 173704, 169283, 164655, 160096, 156839, 155062, 153295, 150407, 147063, 144572, 143296, 142882, 143036, 143294, 142847, 141503, 140353, 140728, 142808, 145673, 148224, 149632, 149488, 148126, 146431, 144894, 143263, 141378, 139773, 139062, 139211, 139819, 140559, 140992, 140560, 139259, 137816, 136794, 136053, 135406, 135056, 134855, 133965, 132057, 130285, 130161, 131747, 133646, 134626, 134637, 134487, 134984, 136229, 137357, 137222, 135645, 133554, 131692, 129843, 127821, 126478, 126825, 128510, 129993, 130027, 128502, 126191, 124320, 123946, 124946, 125756, 124828, 122241]
55417A22241k826j737M7K176L874L785J608r70k049j699j341j547j588r54q5M52
55401A19387O39O17L58n8l70o52j422k802l882l507j757j26J27n50o81K29J125
55384A06675J013L51K90J123K171K762K621J684L69k47N16J896K577K452K448
55369A28701K662J980p4k212k877k023p69P1M21M31K69J67K00J11l05q27j140
55352A24786j227j208j072q68q81j264j659j444l52J191K203J782M6j569j519
55337A16945J01J506J186m29j568j092M80J680J475Q2j302j561o60L93O10M4l26
55320A17564K68J393J757O20j174j983j140M30J478J734J668J498J061M01j07
55305A25468k32j48k33o54j020m79J250K966K967J140p36j360j404k000k736k437
$$ y = [122241, 119415, 117678, 117725, 119901, 123775, 127560, 129168, 128198, 126149, 124450, 123109, 121562, 119974, 119020, 118935, 119387, 120026, 120643, 121001, 120943, 120573, 119921, 118499, 115697, 111815, 108308, 106551, 106425, 106552, 106002, 105321, 105550, 106675, 107688, 108039, 108329, 109452, 111623, 114385, 117006, 118690, 119059, 118812, 119328, 121224, 123801, 126253, 128701, 131363, 133343, 133269, 131057, 128180, 126157, 125388, 125459, 125880, 126311, 126580, 126747, 126947, 127058, 126753, 125926, 124786, 123559, 122351, 121279, 120411, 119530, 118266, 116607, 115163, 114811, 116002, 118205, 119987, 120033, 118464, 116945, 117046, 118552, 119738, 119309, 117741, 116649, 117129, 118809, 120284, 120366, 119064, 117503, 116843, 117236, 117846, 117890, 117564, 117832, 119225, 120982, 121602, 120428, 118445, 117305, 117735, 119213, 120947, 122615, 124113, 125174, 125575, 125468, 125236, 125088, 124855, 124201, 123181, 122702, 123952, 126918, 129885, 131025, 130289, 128929, 127525, 125525, 122789, 120352]
55289A20352j097K28R55J188R04K89M12K003L813L720J521q65j969k113k032j804
55273A25505j558j787k232j750PJ746K049R64m87j555j986j675o50Q19K200K614
55257A22224J302j008k027n16J615J630j50r39J55J002K34o13m9P18l6j554j923
55240A20065j020j97K8O1j98j001j574j001J04L41l61q56n85Q7R89K129K802K185
55222A21998P92J20P71K009K996L348K661P44j469k417j677m39j15j004k279k758
55206A23281j735L32K133K851K800K445J580K52n00N5R93Q87k54j389k155k766
55190A28810k783j616j5N90J57j07J04j10q82r95J58J507J834J158J62p23j143
55173A26106q68m43p65j635j810q76J73O66J141J852J874P20l62j6J189J685J160
$$ y = [120352, 119255, 119483, 120438, 121626, 122530, 122819, 123231, 125234, 129047, 132767, 134288, 133423, 131454, 129341, 127309, 125505, 123947, 122160, 119928, 118178, 118185, 119931, 121980, 122944, 122457, 120902, 118916, 117241, 116591, 117410, 119610, 122224, 123526, 122518, 120491, 119975, 121590, 123220, 123070, 122131, 122286, 123288, 123522, 122909, 122860, 123578, 123542, 121988, 120065, 119045, 118848, 118876, 118937, 118739, 117738, 116164, 115163, 115267, 115608, 115247, 114391, 113806, 113893, 114882, 117011, 119813, 121998, 122790, 122910, 123681, 125690, 128686, 132034, 134695, 135439, 133970, 131553, 129876, 129437, 129322, 128318, 126039, 123281, 121546, 121878, 124011, 126862, 129662, 132107, 133687, 133939, 133439, 133494, 134487, 135374, 135120, 133731, 131576, 128810, 126027, 124411, 124396, 124986, 125143, 125036, 125140, 125030, 124148, 123153, 123311, 124818, 126652, 127810, 127972, 127249, 126106, 125238, 124795, 124030, 122395, 120585, 119709, 119882, 120548, 121689, 123541, 125415, 126135, 125773, 125757, 126946, 128631, 129791]
55156A29791N98N36O13O72R69J255P70m83j314p23P85J727J297K04j46Q07K097
55139A39455K172N42j630k719k267j295j054j588j695m65J394K210J346j01q84
55124A33421j010r98o46L50J158O35q44j756j649j468j540r05P06J903J717J237
55108A30311J794K595J896r2j222l29J354K035J406M03j47J4Q61K074K874K461
55092A48288Q10j050j853j258k09J02n17j364k044k834l645l521j854L47J360
55077A30758P74j69k88J12p0j074j805j075R45K771L200K450J507O66m67j643
55061A36592j768n95K93p03k883l871k516j62J274J521J606K019K116J332J72
55046A34427l60M3P46R94O77K74K38N41N72l35j967k920j929L22J563O85o99m46
$$ y = [129791, 130389, 130925, 131538, 132210, 133179, 134434, 135204, 134721, 133407, 132684, 133469, 135196, 136493, 136697, 136551, 137358, 139455, 141627, 142169, 140539, 137820, 135553, 134258, 133204, 131616, 129921, 129456, 130850, 133060, 134406, 134305, 133421, 132411, 131413, 130767, 131117, 132275, 132910, 132066, 130310, 128661, 127193, 125653, 124748, 125454, 127357, 129074, 130311, 132105, 134700, 136596, 136504, 135282, 134953, 136307, 138342, 139748, 140151, 140004, 140018, 140879, 142953, 145827, 148288, 149098, 148048, 146195, 144937, 144728, 144830, 144313, 142949, 140905, 138071, 134426, 130905, 129051, 129398, 130758, 131532, 131363, 131075, 131187, 131117, 130043, 128238, 127163, 128108, 130879, 134079, 136529, 138036, 138702, 138235, 136592, 134824, 134229, 134522, 133819, 130936, 127065, 124549, 124387, 125661, 127182, 128788, 130807, 132923, 134255, 134427, 134067, 134110, 134856, 135850, 136527, 136801, 137039, 137580, 138152, 137817, 135850, 132930, 131001, 131323, 132886, 133571, 132872, 132426]
55028A32426J106J755P67j68L62J541J921J576J461J605J333O58K49K38J65k30
55012A46765r24j933k781k308k29J700J568M0m86N78J257J87j408j791j077k15
54996A38943Q43K352L287K442N04p45q89q94r15j32J143J291R5l63J230L017K379
54979A53588l51k514k816k289j735n25J434K446J190j067j866n56J297K111J683
54964A50030O47k87m41M24J531J637M99q17j220p43j77j98r60k039k597k141j190
54947A41958o73o60l42O01J538J976K163K248J871J249J489K849L634K223m23
54932A61701j759q64P73J670J958K211K167J405L01n28j068j445j310m20O43J114
54916A66549J021Q34N32j09o19j71J126K140K096J420Q92O11K20l19p72j159j645
$$ y = [132426, 133532, 135287, 136054, 135886, 136248, 137789, 139710, 141286, 142747, 144352, 145685, 146343, 146592, 146830, 146995, 146765, 145841, 143908, 141127, 138819, 138590, 140290, 141858, 141898, 141412, 141990, 143247, 143434, 142026, 140235, 139158, 138943, 139786, 142138, 145425, 147867, 148371, 147626, 146737, 145843, 144928, 144796, 145939, 147230, 147325, 146962, 148192, 151209, 153588, 153237, 150723, 147907, 145618, 143883, 143358, 144792, 147238, 148428, 147361, 145495, 144939, 146236, 148347, 150030, 150677, 150390, 149949, 150373, 151904, 153541, 154040, 153223, 152003, 151260, 151083, 150885, 149925, 147886, 145289, 143148, 141958, 141285, 140625, 140283, 140884, 142422, 144398, 146561, 148809, 150680, 151929, 153418, 156267, 159901, 162124, 161701, 159942, 159078, 159851, 161521, 163479, 165690, 167857, 169262, 169563, 169035, 167967, 166522, 165212, 164792, 165435, 166549, 167570, 168404, 168936, 168827, 168208, 168037, 169163, 171303, 173399, 174819, 175711, 176322, 176542, 176223, 175451, 174292, 172647]
54899A72647j933j360J37J568J883J180M60K85L06K20M32J103J279qj968k568
54883A73663j077R23J536P04k98o42l83K61R49J006K42k93M41J654J545L5r07
54866A79359j86P60K82q76q10N77J655J844K427M243O200O868O408N904N646N275
54850B25576N087N984P851R068Q175N502K631N74q64k043k693k702k965m408o307
54835B48466o890n935n389o478p395n635j888M98pj287r95L42R54Q10R98J260
54819B11429M00j240j819o95Q37J860L110N195P113P690P335P166P164O433M814
54804B66792L177K258K036K060J693K47k355n111o790p197p054o889o671o393
54790B29803o180n866n193m441m102l895l055j814j548k784m008l520j797q10
$$ y = [172647, 170714, 169354, 169491, 171059, 172942, 174122, 174582, 174867, 175173, 175393, 175825, 176928, 178207, 178199, 176231, 173663, 172586, 173509, 175045, 175749, 175451, 174809, 174426, 174687, 175636, 176642, 176884, 176591, 177032, 178686, 180231, 180266, 179359, 179173, 179933, 180215, 179339, 178529, 179106, 180761, 182605, 185032, 189275, 195475, 202343, 208751, 214655, 220301, 225576, 230663, 236647, 244498, 253566, 261741, 267243, 269874, 270448, 269584, 267541, 264848, 262146, 259181, 254773, 248466, 241576, 235641, 230252, 223774, 216379, 210744, 208856, 209354, 209347, 208060, 207065, 207407, 208361, 209171, 210169, 211429, 211829, 210589, 208770, 208075, 208912, 210772, 213882, 219077, 226190, 233880, 241215, 248381, 255545, 261978, 266792, 269969, 272227, 274263, 276323, 278016, 278263, 275908, 270797, 264007, 256810, 249756, 242867, 236196, 229803, 223623, 217757, 212564, 208123, 204021, 200126, 197071, 195257, 193709, 190925, 186917, 183397, 181600, 180790]
54776A80790j166j366k64J135J287N02L51J002P72j292l675m137k337J04J680
54761A73386K114J811J318J256J826K214J458r0j007p69l27m69q19j028j642k686
54745A76546k642m42K212K437q4k584k820j527o49n57j12J278K853L491K756J138
54729A81294k87o45l5P37J263J759K049J301n63k061j795k90R10J504K442L816
54713A91399M365L513K457K388K716K216J217J267K775M234M119K739J761K399
54699B29565M512P039Q801R129Q233P067O495O453O045M492J929p15k607l728
54685B92710m719o035p289p647o856n581m605l966l322k805k907l482l583k745
54671B27168j798j792k448k489j426j52M18M69O56J052J459K136L456N073O238
$$ y = [180790, 179624, 178258, 177994, 179129, 180416, 180918, 181269, 182271, 183043, 181751, 178076, 173939, 171602, 171706, 173386, 175500, 177311, 178629, 179885, 181711, 183925, 185383, 185293, 184286, 183517, 183190, 182721, 181902, 180874, 179232, 176546, 173904, 173462, 175674, 178111, 178027, 175443, 172623, 171096, 170447, 169890, 169778, 171056, 173909, 177400, 180156, 181294, 181007, 180362, 180327, 181064, 182327, 184086, 186135, 187436, 186873, 184812, 183017, 182727, 183637, 185141, 187583, 191399, 195764, 199277, 201734, 204122, 206838, 209054, 210271, 211538, 214313, 218547, 222666, 225405, 227166, 229565, 234077, 241116, 249917, 259046, 267279, 274346, 280841, 287294, 293339, 297831, 299760, 299045, 296438, 292710, 287991, 281956, 274667, 267020, 260164, 254583, 249978, 246012, 242690, 239885, 236978, 233496, 229913, 227168, 225370, 223578, 221130, 218641, 217215, 217063, 217481, 217950, 218606, 219658, 221117, 223253, 226709, 231782, 238020]
54656B38020O809P140P105O172M650L783M082M445L589J756J65p05j385k255l143
54641B80228m037n236o550p114o455n199m384m354m710m928m768m210l364k404
54627B12515j530j004j056j535j955k141k581l534m135l241j072Q90J715J752
54613A93088J438N20j009k270k539k074j302j66R17O51j271k906k235k4J228P06
54597A82752j25k21j57l27pJ004J484P17j04M16J843K772K792K334J404j30j477
54580A94970j607p40N4M95J155K010K305J978J938K449K364P36j513k377j122
54565B03095Q16J349o2j987k830k662k693l165k821r35J262K140J832J601J678
54550A96618J299N96O59J478J471j60k017k315j028O47K021K978L156K279J025
$$ y = [238020, 244829, 251969, 259074, 265246, 269896, 273679, 277761, 282206, 285795, 287551, 287716, 287011, 285626, 283371, 280228, 276191, 270955, 264405, 257291, 250836, 245637, 241253, 236899, 232189, 227261, 222493, 218283, 214919, 212515, 210985, 209981, 208925, 207390, 205435, 203294, 200713, 197179, 193044, 189803, 188731, 189621, 191336, 193088, 194526, 195046, 194037, 191767, 189228, 187154, 185852, 185686, 186603, 187254, 185983, 183077, 180842, 180818, 182046, 182752, 182627, 182406, 182249, 181922, 181915, 182919, 184403, 185120, 185016, 185432, 187275, 190047, 192839, 195173, 196577, 196447, 194970, 193363, 192623, 192677, 193172, 194327, 196337, 198642, 200620, 202558, 205007, 207371, 208107, 206594, 204217, 203095, 203911, 205260, 205198, 203211, 200381, 197719, 195026, 191861, 189040, 188105, 189367, 191507, 193339, 194940, 196618, 197917, 198513, 199172, 200650, 202121, 201961, 199944, 197629, 196601, 197248, 199269, 202247, 205403, 207682, 208707]
54535B08707M81R28J832K698L151K693J301O5J39J213J934J654P73m19j927k994
54519B22229k376k58J389J227K87L11J297J930J778J571J513Q99k78p50K45J616
54503B32630J778P76J6K22O98O58L64M60Q53R57P44P66J109J011K3r61o48P77
54485B42233J588P93l60O5K050L636L541K631K384K844K951K246J359J053J557
54470B70571K616L531L410K138Q72O96J017M22r57j458o05k09j697l647l560j395
54454B71745L31m5j377j574k56J134J246J73r05j062n35k78n84p12k22K4q17j806
54436B64480j203P87J861P24j054j214K99J827K517K942L645M365M692M496L733
54421B92897K692K300L114M109L692K003R64J641K867L214L034L419M060L706
$$ y = [208707, 209188, 210116, 211948, 214646, 217797, 220490, 221791, 221856, 221995, 223208, 225142, 226796, 227569, 227150, 225223, 222229, 219853, 219595, 220984, 222211, 222498, 222809, 224106, 226036, 227814, 229385, 230898, 231797, 231519, 230769, 231014, 232630, 234408, 235184, 235200, 235422, 236120, 236778, 237142, 237602, 238455, 239412, 240156, 240922, 242031, 243042, 243065, 242104, 241456, 242233, 243821, 244614, 244254, 244319, 246369, 250005, 253546, 256177, 258561, 261405, 264356, 266602, 267961, 269014, 270571, 273187, 276718, 280128, 282266, 283138, 283834, 284851, 285273, 284316, 282858, 282253, 282044, 280347, 276700, 273140, 271745, 272076, 272031, 270654, 269080, 268824, 269958, 271204, 271377, 270472, 269410, 268875, 268597, 268013, 267301, 267079, 267103, 266286, 264480, 263277, 264064, 265925, 266649, 265595, 264381, 264680, 266507, 269024, 271966, 275611, 279976, 284668, 289164, 292897, 295589, 297889, 301003, 305112, 308804, 310807, 311771, 313412, 316279, 319493, 322527, 325946, 330006, 333712]
54407C33712K362J427J573J885J625J608K859M595M792K596o25k845l303k607
54393C49654j533l26R27J827J866R78l11j323j797k057k605l461l957l351j839
54378C32692o15p55k051l245l391k602j560q09o76j306k287k639j794m63J11k52
54362C08358m32L90J555J724O03o58p89K07J080O67q89k263k273r57P60K103K798
54345C11984K607J304o14j903j767p82j53l30q40j114q53K45K239M180M450K444
54329C21097m17k018j741q89q60j515j652p30M59Q92N28O2j30l05o76j051j268
54312C09786j464j630j379n74K14L70J36L07J107J825J650N02j007k149k604k530
54296C02560k274j964j488q42k31J26q6j405l900o191o263l875j212k12j76O88
$$ y = [333712, 336074, 337501, 339074, 340959, 342584, 344192, 347051, 351646, 356438, 359034, 358409, 355564, 352261, 349654, 348121, 347795, 348722, 350549, 352415, 353393, 353082, 351759, 349962, 347905, 345300, 341839, 337882, 334531, 332692, 332077, 331322, 329271, 326026, 322635, 320033, 318473, 317664, 316988, 315682, 313395, 310756, 308962, 308499, 308610, 308358, 307926, 308316, 309871, 311595, 312198, 311540, 310751, 310958, 312038, 312705, 311816, 309553, 307280, 306323, 307083, 309186, 311984, 314591, 315895, 315281, 313378, 311611, 310829, 310676, 310346, 309506, 308392, 307539, 307784, 310023, 314203, 318653, 321097, 320680, 318662, 316921, 316032, 315172, 313657, 312005, 311275, 311734, 312626, 313154, 313216, 313086, 312781, 312105, 311054, 309786, 308322, 306692, 305313, 304739, 304953, 305323, 305459, 305766, 306873, 308698, 310348, 310850, 309843, 307694, 305090, 302560, 300286, 298322, 296834, 295992, 295761, 295887, 295801, 294396, 290496, 284305, 278042, 274167, 272955, 272743, 272567, 273255]
54280B73255K071J803p84l631m628m024l296k874k089o65Q18J627J427L93q00
54265B58603j372j213q94q47j047j463k029k098r76O97J317N64j1P36J896K082
54249B53945J439Q95M90j43n74k87J13q6k32N23J302O93n52l12J385J971Q9k343
54231B58316k888j757r40j369k333k939k917k368j643j242j269j248q61l83q9
54216B34070J97O37J015J246J549J732J057o30k278k707j846m89N87R25N09K6
54200B35600K50P24N5j838k957j797K91Q16l74j090j17J234J335N16K07Q60J690
54183B35405K001J786J207K40j017k163k723k372r92J076K778K855J061j318k621
54168B35203k477j842j471j032j28O56M32o29j490j613j326r60n45l52r25k167
$$ y = [273255, 275326, 277129, 276345, 272714, 268086, 264062, 260766, 257892, 255803, 255138, 255956, 257583, 259010, 259403, 258603, 257231, 256018, 255124, 254277, 253230, 251767, 249738, 247640, 246664, 247361, 248678, 249242, 249231, 249967, 251863, 253945, 255384, 256279, 256769, 256626, 256052, 255765, 255878, 255792, 255560, 256083, 257385, 258078, 257526, 257214, 258599, 260570, 260659, 258316, 255428, 253671, 252731, 251362, 249029, 246090, 243173, 240805, 239162, 237920, 236651, 235403, 234542, 234159, 234070, 234267, 234904, 235919, 237165, 238714, 240446, 241503, 240873, 238595, 235888, 234042, 233553, 234140, 235065, 235574, 235600, 235850, 236574, 236629, 234791, 231834, 230037, 230328, 231144, 230770, 229680, 229563, 230797, 232132, 232648, 232855, 233715, 235405, 237406, 239192, 240399, 240639, 239622, 237459, 234736, 232364, 231372, 232448, 235226, 238081, 239142, 237824, 235203, 232726, 230884, 229413, 228381, 228253, 228909, 229341, 228712, 227222, 225609, 224283, 223323, 222778, 222426, 221501, 219334]
54152B19334l102k843j338Q48K823L554K592Q79p6N5L27K38L38Q43Q93k5j058
54135B24282j236q12n20l61n4J13n1N3Q60J557J157L7p16j009j569k365k465j445
54117B15456K2J037J267J074J332K677M374M690L113J241N26K23r75k473k846
54102B30738k465k750l343k587p96k43j394j768K38K785L280J775Qj281k262k491
54086B17444j457O3Q39R19J125J362Q58k86j226j702k072k156j375J1R96J196
54070B14539J192J421J656J650J468J073K89o60j218j175q11m45k60l75n91l00
54054B17453O93J602J554P35j6m92j099j787k000j666j345j328j333j161q25p3
54038B08912J359K877L367K537J164q5j122j614r09O72J578R62J4M33K132L490
$$ y = [219334, 216232, 213389, 212051, 212899, 215722, 219276, 221868, 222747, 222671, 222726, 223053, 223291, 223629, 224472, 225365, 225340, 224282, 223046, 222234, 221714, 221353, 221299, 221412, 221361, 221414, 222274, 223831, 224988, 225025, 224309, 223300, 221731, 219366, 216901, 215456, 215478, 216515, 217782, 218856, 220188, 222865, 227239, 231929, 235042, 236283, 236809, 237032, 236057, 233584, 230738, 228273, 225523, 222180, 219593, 218797, 218554, 217160, 215392, 215630, 218415, 221695, 223470, 223478, 222197, 219935, 217444, 215987, 216050, 216889, 217808, 218933, 220295, 221153, 220867, 219641, 217939, 215867, 213711, 212336, 212347, 213343, 214539, 215731, 217152, 218808, 220458, 221926, 222999, 223288, 222628, 221410, 220235, 219424, 218979, 218719, 218344, 217753, 217453, 218146, 219748, 221302, 222037, 222021, 221529, 220430, 218643, 216643, 214977, 213632, 212304, 210971, 209810, 208985, 208912, 210271, 213148, 216515, 219052, 220216, 220131, 219009, 217395, 216486, 217158, 218736, 219698, 219712, 220145, 222277, 225767]
54022B25767L587L131L109L368K926J307p87k110k158j676j701k236k390j883
54008B28254j485j618j415p0J435J304m91j831j147N39J137L70%J223K942L209
53992B32356J695j04q11m33M10J523K735L235K277M73o32l46N11R18Q16O53N47
53975B45823M58N69Q53P83J31l97m4Q22J278J239J300J436R34k20j059j131j171
53958B51604j759k207j666o04j48m53p16o11o88j247j760j714j323j013p67l07
53942B34621M75J485K461K824K000L07q68k98J761L731M076K438j74k071k079
53927B50689m86J312K298K557K459J829O42j41L64J366J108n78j693o55J629L163
53911B65863L514L919N162O717P965R054J0110J0587J0158R605R936J0785J0519
$$ y = [225767, 229354, 232485, 235594, 238962, 241888, 243195, 242408, 240298, 238140, 236464, 234763, 232527, 230137, 228254, 226769, 225151, 223736, 223666, 225101, 226405, 225914, 224083, 222936, 223475, 224612, 224982, 224982, 226205, 229147, 232356, 234051, 233947, 233136, 232703, 233113, 234636, 237371, 240606, 242883, 243356, 242724, 242378, 242889, 243807, 244623, 245276, 245823, 246281, 246850, 247703, 248486, 248617, 248220, 248176, 248998, 250276, 251515, 252815, 254251, 255185, 254965, 253906, 252775, 251604, 249845, 247638, 245972, 245368, 245220, 244767, 244051, 243440, 242752, 241505, 239745, 238031, 236708, 235695, 234928, 234621, 235096, 236581, 239042, 241866, 243866, 244173, 243305, 243007, 244768, 248499, 252575, 255013, 254839, 252768, 250689, 250203, 251515, 253813, 256370, 258829, 260658, 261300, 261159, 261523, 262889, 263997, 263419, 261726, 261071, 262700, 265863, 269377, 273296, 278458, 285175, 293140, 302194, 312304, 322891, 333049, 342654, 352590, 363375, 373894]
53898C73894Q047M029J14k658m403n711o822p551p672p214o380n405m582m145
53884C23541m030l789l027j881q24L4J014K104K511J574o5p89K15K033L094K766
53868C24481J501j32j866l280l757l189k168j165p2J044J338J08j927l103k685
53853C05128j620j305k158l570m653m694l529j875r52j187j647j182J36J241J494
53838B79627J218R65P95L20r33k994m856m784k136J206K308L70k380l419k572
53823B62735j369o69l4J027K256L163L449K927J641J94o00n21p1J48k08j211k432
53806B70425k849j734L57K054K556K001O95r99k105j590J19J247P80m30j165j293
53790B68069j076k15J262K207J787R26Q55R23l42k386k936j440j37q17k280k255
$$ y = [373894, 381941, 385970, 386084, 383426, 379023, 373312, 366490, 358939, 351267, 344053, 337673, 332268, 327686, 323541, 319511, 315722, 312695, 310814, 309990, 310024, 311038, 313142, 315653, 317227, 317162, 316373, 316588, 318621, 321715, 324481, 325982, 325850, 323984, 320704, 316947, 313758, 311590, 310425, 310353, 311397, 312735, 312843, 310916, 307813, 305128, 303508, 302203, 300045, 296475, 291822, 287128, 283599, 281724, 280772, 279585, 277938, 276756, 276892, 278133, 279627, 280845, 281810, 282605, 282925, 281992, 278998, 274142, 269358, 267222, 268428, 270736, 271106, 268726, 265307, 262735, 261366, 260697, 260663, 261690, 263946, 267109, 270558, 273485, 275126, 275320, 274720, 274199, 274128, 274276, 274068, 272857, 270425, 267576, 265842, 266199, 268253, 270809, 272810, 273505, 272506, 270401, 268811, 268930, 270177, 270957, 270527, 269362, 268069, 266993, 266778, 268040, 270247, 272034, 272960, 273815, 274738, 274396, 272010, 269074, 267634, 267497, 266680, 264400, 262145]
53774B62145n88R51J276R33P68Q70R16O14k18j364k014j471q2J060J386J330J532
53757B68044K041K461K629K861L522M289M062K199r6m50J955M837N038K265k54
53742C05403P49M987R008R888P923N626M805N424O987R572J2553J3495J0165L574
53728D10159k609o018p457q399q551p200n360m616m687m096k764k111k704l622
53714C39965m231m868n521n434m488l443k496j116J82j89k225l399j950L53N02
53699C01642j573l152k619j267r30j489j543n17P75J294R26M48N40R46Q43R5l10
53682B94109M52J854K605K208J310P98J129K321L911N029N113M532L931L240K131
53667C34673J299K086M513O706P071O317O406P731Q468O977M044K005J956K704
$$ y = [262145, 261557, 262508, 263784, 264717, 265485, 266355, 267271, 267885, 267667, 266303, 264289, 262818, 262736, 263796, 265182, 266512, 268044, 270085, 272546, 275175, 278036, 281558, 285847, 289909, 292108, 292012, 291562, 293517, 298354, 303392, 305657, 305403, 306152, 311139, 320147, 330035, 337958, 343584, 348389, 353813, 360800, 370372, 382925, 396420, 406585, 410159, 407550, 401532, 394075, 385676, 377125, 369925, 364565, 359949, 355262, 351166, 348402, 346291, 343587, 339965, 335734, 330866, 325345, 319911, 315423, 311980, 309484, 308368, 308550, 308361, 306136, 302737, 300787, 301140, 301642, 300069, 296917, 294298, 293031, 292101, 290612, 289069, 288552, 289327, 290621, 291547, 291995, 292535, 293481, 294324, 294419, 294109, 294561, 296415, 299020, 301228, 302538, 303336, 304465, 306786, 310697, 315726, 320839, 325371, 329302, 332542, 334673, 335972, 338058, 342571, 349277, 356348, 362665, 369071, 376802, 385270, 392247, 396291, 398296, 400252, 402956]
53653D02956K527J288J20l62n98r01q49k65Q8m26j133q59K88Q78M0j318j532p1
53635C99871J895K733J974O95K57P98J370J506J858K873L628L000J534R53J783
53620D26728K627K123N97q10j757k590l224l158k506k019j897j349K37K138K880
53605D18020J864Pj204j064k7R03R94K33q50j771k505l166l378k523p94N61O35
53588D05935P4J47Q93J214P56N45J315K284K332J673J399J904K611K966K798J975
53572D30821N78o07o97J93J225K251M045O735Q789Q335N299J732j5O83K508L772
53556D75647M071M245M935N664N643M869L957L174K294J303O41O43J111J496J404
53541E21097R78R15J652K432J802m57k639l053k153j727k461l349l275k069p4
$$ y = [402956, 405483, 406771, 406891, 406529, 405931, 405030, 404181, 403916, 404004, 403578, 402445, 401586, 401874, 402752, 402792, 401474, 399942, 399871, 401766, 404499, 406473, 407168, 407425, 408223, 409593, 411099, 412957, 415830, 419458, 422458, 423992, 424945, 426728, 429355, 431478, 432075, 431265, 429508, 426918, 423694, 420536, 418030, 416011, 414114, 412765, 413002, 415140, 418020, 419884, 419891, 418687, 417623, 417596, 418499, 419493, 419726, 418876, 417105, 414600, 411434, 408056, 405533, 404739, 405300, 405935, 406009, 406156, 407049, 408263, 409019, 409564, 410879, 413163, 415495, 417168, 418567, 420471, 423082, 426048, 428846, 430821, 431399, 430792, 430095, 430288, 431513, 433764, 437809, 444544, 453333, 461668, 466967, 468699, 468684, 469367, 471875, 475647, 479718, 483963, 488898, 494562, 500205, 505074, 509031, 512205, 514499, 515802, 516443, 517086, 518197, 519693, 521097, 522075, 522990, 524642, 527074, 528876, 528419, 525780, 522727, 520574, 518847, 516386, 513037, 509762, 507693, 507619]
53526E07619K108L421K994J278l48j167j432j230l85M02j29j770k524j146J173
53511E08864K542K672K475K382K242K166K256K035J227N59Q17J607K170K866M587
53496E41467O985Q524Q300O680M431K323J573L218O661R784J1025J0693J0172
53483F31836J0557J2161J4396J5928J5827J4943J5292J7735K1075K3718K5313
53472H18781K6269K6674K6526K6328K6550K6949K7161K7546K8648L0149L1210
53461A122791L1662L2100L2957L4185L5774L7790L9877M1427M2355M3018M3358
53450A537294M2939M1940M1228M0954M0041L7764L5246L4411L5836L8460M1028
53439A967141M2845M3292M1912L9258L6683L4821L3098L1154K9748K9494K9592
$$ y = [507619, 509727, 513148, 516142, 517420, 517072, 515905, 514473, 513243, 512858, 513260, 513131, 511361, 508837, 507691, 508864, 511406, 514078, 516553, 518935, 521177, 523343, 525599, 527634, 528861, 529420, 530237, 531844, 534014, 536880, 541467, 548452, 556976, 565276, 571956, 576387, 578710, 580283, 583501, 590162, 599946, 610971, 621664, 631836, 642393, 654554, 668950, 684878, 700705, 715648, 730940, 748675, 769750, 793468, 818781, 845050, 871724, 898250, 924578, 951128, 978077, 1005238, 1032784, 1061432, 1091581, 1122791, 1154453, 1186553, 1219510, 1253695, 1289469, 1327259, 1367136, 1408563, 1450918, 1493936, 1537294, 1580233, 1622173, 1663401, 1704355, 1744396, 1782160, 1817406, 1851817, 1887653, 1926113, 1967141, 2009986, 2053278, 2095190, 2134448, 2171131, 2205952, 2239050, 2270204, 2299952, 2329446, 2359038]
53428B359038K8816K7150K5413K3752K1751J9697J8370J7476J5594J2084P946
53417B577087M277Q33l258q113j3068j7496k1093k3783k5851k7744k9518l0889
53405B381384l2010l3422l5089l6327l7075l8183l9842m0948m0733m0016l9716
53394A968023l9220l7539l5252l3675l2699l1138k8865k6901k5397k3229j9794
53383A634314j5788j1832p892m282j835l92J461M533Q076J1359J4876J9064K3058
53370A674720K5839K7721K9636L1706L3648L5849L8785M1847M4027M5532M7669
53359B076979N1097N5092N8539O0947O2594O4336O7120P1084P5217P8450Q0877
53348B802332Q3353Q6187Q9010R1666R4361R6950R8845R9819J00354J01062J02095
$$ y = [2359038, 2387854, 2415004, 2440417, 2464169, 2485920, 2505617, 2523987, 2541463, 2557057, 2569141, 2577087, 2581364, 2582197, 2578939, 2570826, 2557758, 2540262, 2519169, 2495386, 2469535, 2441791, 2412273, 2381384, 2349374, 2315952, 2280863, 2244536, 2207461, 2169278, 2129436, 2088488, 2047755, 2007739, 1968023, 1928803, 1891264, 1856012, 1822337, 1789638, 1758500, 1729635, 1702734, 1677337, 1654108, 1634314, 1618526, 1606694, 1598802, 1594520, 1592685, 1592293, 1593754, 1598287, 1606363, 1617722, 1632598, 1651662, 1674720, 1700559, 1728280, 1757916, 1789622, 1823270, 1859119, 1897904, 1939751, 1983778, 2029310, 2076979, 2128076, 2183168, 2241707, 2302654, 2365248, 2429584, 2496704, 2567788, 2643005, 2721455, 2802332, 2885685, 2971872, 3060882, 3152548, 3246909, 3343859, 3442704, 3542523, 3642877, 3743939, 3846034]
53337C846034J03067J03228J01884R8993R5201R1022Q6435Q1582P7123P3148O8452
53326D826169O1940N4263M7012M0531L3796K6198J8259J0561L131m067j1104j8711
53314E087978k7657l7599m7661n8148o9957q2121r1886r8118j02750j07657j11754
53303D252670j12894j11417j09812j09533j09958j10125j09683j08216j05333
53294C265699j01688r8592r6339r4055r1378q8989q7168q4934q1269p6378p1297
53283B293612o6916o3563o0761n7217n1927m5611m0171l6381l3157k9540k6197
53272A782171k4143k2940k1299j8746j5620j1941p631l574j035J35J585M285P277
53259A668524R149R948J0778J2112J3559J5229J8153K2770K7675L0800L1805L2524
$$ y = [3846034, 3949101, 4052329, 4154213, 4253206, 4348407, 4439429, 4525864, 4607446, 4684569, 4757717, 4826169, 4888109, 4942372, 4989384, 5029915, 5063711, 5089909, 5108168, 5118729, 5121860, 5117793, 5106689, 5087978, 5060321, 5022722, 4975061, 4916913, 4846956, 4764835, 4672949, 4574831, 4472081, 4364424, 4252670, 4139776, 4028359, 3918547, 3809014, 3699056, 3588931, 3479248, 3371032, 3265699, 3164011, 3065419, 2969080, 2875025, 2783647, 2694658, 2607490, 2522556, 2441287, 2364909, 2293612, 2226696, 2163133, 2102372, 2045155, 1993228, 1947617, 1907446, 1871065, 1837908, 1808368, 1782171, 1758028, 1735088, 1713789, 1695043, 1679423, 1667482, 1659851, 1656277, 1655242, 1655377, 1656962, 1661247, 1668524, 1677673, 1687621, 1698399, 1710511, 1724070, 1739299, 1757452, 1780222, 1807897, 1838697, 1870502, 1903026]
53247A903026L4817L8517M1867M3578M3902M3905M4335M5284M6524M7895M9352
53236B383002N0571N0647M8797M5618M2897M1523M0161L6922L1862K6596K1900
53225B820496J7227J2591R039O638L586j574q011j3891j8561k2417k5655k8547
53213B750921l1998l6487m1079m4850m8552n3253n7918o0321o0270n9984o1028
53202B195181o2663o3693o4210o4661o4607o3512o1794o0149n8500n6353n3764
53191A521275n1356m9800m9483n0105n0488m9589m7754m6050m4396m1716l8126
53180A002412l5233l3658l1967k9064k5962k3857k2030j9343j6545j5129j4856
53169G34768j4504j4262j5076j6085j5158j2223r745r382j0173j0710j1047j1488
$$ y = [1903026, 1937843, 1976360, 2018227, 2061805, 2105707, 2149612, 2193947, 2239231, 2285755, 2333650, 2383002, 2433573, 2484220, 2533017, 2578635, 2621532, 2663055, 2703216, 2740138, 2772000, 2798596, 2820496, 2837723, 2850314, 2859353, 2865991, 2869577, 2868003, 2859992, 2846101, 2827540, 2805123, 2779468, 2750921, 2718923, 2682436, 2641357, 2596507, 2547955, 2494702, 2436784, 2376463, 2316193, 2256209, 2195181, 2132518, 2068825, 2004615, 1939954, 1875347, 1811835, 1750041, 1689892, 1631392, 1575039, 1521275, 1469919, 1420119, 1370636, 1320531, 1270043, 1220454, 1172700, 1126650, 1082254, 1040538, 1002412, 967179, 933521, 901554, 872490, 846528, 822671, 800641, 781298, 764753, 749624, 734768, 720264, 706002, 690926, 674841, 659683, 647460, 637715, 628333, 618160, 607450, 596403, 584915]
53157E84915j1306j0070q829q575q651q109p563q052q829q162o070m477m359m409
53143D77454l230j585j303k703m230m564m052l789m017m015l182j648MR97M68
53128D40605j743m276n167m150l112l518m372l923k435j592j676j384m18r9q45
53113D01895j096J62J573J561P47N54O57k24j761k289j415m22k12m88j010j969
53097C96263k756k127k05J093M17j287k145j464Q8J484J820O97j069j957j565
53082C87287j189j855k713k326q11M01M28m31j473k011j437O0J115O46n25o26
53066C74540N69J445P63r50k445k970k257n10J021O54j725m122m627l394j765
53051C54227m28N15N93m16j366p54J122K299J582k84k008l076l340k555j141l56
$$ y = [584915, 573609, 563539, 554710, 546135, 537484, 529375, 521812, 513760, 504931, 496769, 490699, 486222, 481863, 477454, 474224, 472639, 471336, 468633, 464403, 459839, 455787, 451998, 447981, 443966, 440784, 439136, 439140, 440137, 440605, 438862, 434586, 429419, 425269, 422157, 418639, 414267, 410344, 407909, 406317, 404641, 403257, 402839, 402740, 401895, 400799, 400961, 402534, 404095, 404842, 405396, 406053, 405829, 404068, 401779, 400364, 399942, 399730, 399242, 398232, 396263, 393507, 391380, 391175, 392268, 392685, 391398, 389253, 387789, 387877, 389361, 391181, 391878, 390809, 388852, 387287, 386098, 384243, 381530, 379204, 378393, 378794, 379222, 378791, 377318, 375307, 373870, 373930, 375045, 375691, 375166, 374540, 375109, 376554, 377317, 376367, 373922, 370952, 368695, 368185, 369206, 369860, 368135, 364013, 359386, 355992, 354227, 353799, 354314, 354907, 354491, 353125, 352371, 353493, 355792, 357374, 357090, 355082, 352006, 348666, 346111, 344970, 344614]
53035C44614q13j574j572j199j515k394k743k281j889k023j889n99J651L761M525
53020C34060L137m9l035l428r77J897K784J838P82J73r00k584l321j910N15J552
53004C30534K53j949k977k157m82O89Q22K87m09j136j937k530k332j017J058K931
52988C19648L576K641Q68l94m69J6Lo48j200j150o50J01R96J401M32j643l077
52971C20451k654j351j000j706j827m66J190J509M21p80r99n5J563K942L008J426
52955C21672p85k112k132j761j856k105j720p97l57j018k110k474j829j005q16
52940B98795j145j320j037n52k39k65o21j070j127m81N45J279J463J389J314J202
52924B98130J121J391K039K511K243J375O09M91Q77J035K78j195k284k203j574
$$ y = [344614, 343801, 342227, 340655, 339456, 337941, 335547, 332804, 330523, 328634, 326611, 324722, 324123, 325774, 329535, 334060, 337197, 337148, 334113, 330685, 329708, 331605, 334389, 336227, 337009, 337182, 336282, 333698, 330377, 328467, 328982, 330534, 330787, 328838, 325861, 323704, 323222, 323911, 324733, 325020, 324611, 323475, 321538, 319008, 316676, 315659, 316717, 319648, 323224, 325865, 326733, 326339, 325870, 325886, 325889, 325241, 324041, 322891, 322241, 322342, 323338, 324739, 325171, 323528, 320451, 317797, 316446, 315446, 313740, 311913, 311447, 312637, 314146, 314567, 313787, 312788, 312733, 314296, 317238, 320246, 321672, 320887, 318775, 316643, 314882, 313026, 310921, 309201, 308404, 308047, 307029, 304919, 302445, 300616, 299611, 298795, 297650, 296330, 295293, 294741, 294502, 294237, 293616, 292546, 291419, 290938, 291483, 292762, 294225, 295614, 296928, 298130, 299251, 300642, 302681, 305192, 307435, 308810, 309419, 309910, 310787, 311822, 312100, 310905, 308621, 306418, 304844]
52909C04844j542j939j372N77K412K745K214K262K816K697J864J645K537L237
52895C24997K426M50j460k743l463l492k617j319o22j096k348l478l809l265k288
52880B95873j406q60o66q13j046p49L99J651J839Q58j92n56p55j553k697l331
52864B85996l109k303j243k64J50n1n2R27K431L162K594J516Q62P18P21P93R62
52847B93810Q07k20j913l223l354k677k164j969j222N23K216K443J274J58j8K64
52831B84735L99O38J156J212L44l04P73L051M142K780M68m60L02J066O07m23o69
52814B99817J58J251J899J964J331j46j828k222n76J891L140K580J389P77Q08
52799C12233J007J121J051P58N37O06L22j159l196l802k185o4M76m82j240q88
$$ y = [304844, 303302, 301363, 299991, 300568, 302980, 305725, 307939, 310201, 313017, 315714, 317578, 319223, 321760, 324997, 327423, 327873, 326413, 323670, 320207, 316715, 314098, 312779, 312157, 311061, 308713, 305235, 301426, 298161, 295873, 294467, 293607, 292941, 292128, 291082, 290333, 290732, 292383, 294222, 295080, 294888, 294332, 293577, 292024, 289327, 285996, 282887, 280584, 279341, 279077, 279227, 279176, 279124, 280051, 282482, 285644, 288238, 289754, 290616, 291334, 292055, 292848, 293810, 294617, 294397, 292484, 289261, 285907, 283230, 281066, 279097, 277875, 278398, 280614, 283057, 284331, 284489, 284471, 284735, 285134, 285772, 286928, 288140, 288484, 288180, 288953, 292004, 296146, 298926, 299394, 298934, 299236, 300302, 300909, 300486, 299817, 299975, 301226, 303125, 305089, 306420, 306274, 304446, 302224, 301648, 303539, 306679, 309259, 310648, 311425, 312233, 313240, 314361, 315412, 316170, 316707, 317313, 317635, 316476, 313280, 309478, 307293, 307229, 307705, 307223, 305983, 305095]
52783C05095oN02L39k03m84j30J38r00k896l643j959K08J87j680k585j195Q32
52766B91620J402M14p97j047l5J451J843L77j667k378j802j636k354k500j198
52751B81693L88R74J054J739K947L819M112M060L498K179N77l94l39K38K87j080
52735C05752l560n422n113l112j304o18n16o50j430k525k590j200L49R40R21Q26
52719B80748M06j93J44J639K659J922L30o74j146j583j333J00J367R28m94j022
52703B83798m40%j43l24n47j016q32Q69K851L012J469K47M8l72j463j949j145
52686B84063j16K17K93N83Q51J273K561M275M781L663K382J818J090k64r52k24
52670C06294M94j3m13J037L269L553J301j364k586k472j919j388j157j499k187
$$ y = [305095, 305089, 305591, 305930, 305727, 305243, 305113, 305251, 304351, 301455, 297812, 295853, 296061, 296248, 294568, 291983, 290788, 291620, 293022, 293436, 292639, 291592, 291557, 293008, 294851, 295228, 293561, 291183, 289381, 287745, 285391, 282891, 281693, 282081, 283055, 284109, 285848, 288795, 292614, 296726, 300786, 304284, 306463, 307040, 306646, 306307, 306545, 306832, 305752, 302192, 296770, 291657, 288545, 287241, 286623, 286107, 285457, 284027, 281502, 278912, 277712, 278061, 279001, 279922, 280748, 281154, 280961, 281105, 282744, 285403, 287325, 287655, 286981, 285835, 284252, 282919, 283019, 284386, 285314, 284820, 283798, 283358, 283358, 283215, 282891, 282344, 281328, 280496, 281365, 284216, 287228, 288697, 288944, 288992, 288620, 287157, 285208, 284063, 283947, 284164, 284457, 285040, 285891, 287164, 289725, 294000, 298781, 302444, 304826, 306644, 307734, 307470, 306518, 306294, 306788, 306775, 306362, 307399, 310668, 314221, 315522, 314158, 311572, 309100, 307181, 305793, 304636, 303137, 300950]
52655C00950k688k967l394l888l904l227k115q06M77J208J022L66j1q7l05n17
52639B80114j23P42J071L49o67r30l41L80O75N82L55K7m67q93p59J29J369K461
52621B84074L312L832L424J672n52j697j473j172j633j930p84J527L479L941K882
52606B98902J048k81J8J623K735K179Q61J92J4n43q64M86K969M030K375k63j563
52589C13918j459j544k562l730m055l327j953o34l5k30n61n45o21j389k319k083
52573B86871l39J573K193J625J130J332J663J555J357J636K233K680L059L545
52559C12113L428J754j014l053l255k248r80M63J860K035M16j404j248P73K470
52544C12110K449J381L43m40q81n07M99R72L19m53j34R34J474J077M09j21q84
$$ y = [300950, 298262, 295295, 291901, 288013, 284109, 280882, 278767, 277961, 278438, 279646, 280668, 281034, 281023, 280936, 280631, 280114, 279991, 280733, 281804, 282153, 281486, 280556, 280215, 280595, 281270, 281852, 282207, 282234, 281767, 280874, 280115, 280244, 281613, 284074, 287386, 291218, 294642, 296314, 295762, 294065, 292592, 291420, 289787, 287857, 287073, 288600, 292079, 296020, 298902, 299950, 299669, 299687, 301310, 304045, 306224, 307085, 307277, 307291, 306748, 305884, 306370, 309339, 313369, 315744, 315481, 313918, 312459, 310915, 308353, 304623, 300568, 297241, 295288, 294654, 294619, 294389, 293828, 293283, 292662, 291273, 288954, 286871, 286532, 288105, 290298, 291923, 293053, 294385, 296048, 297603, 298960, 300596, 302829, 305509, 308568, 312113, 315541, 317295, 316281, 313228, 309973, 307725, 306745, 307208, 309068, 311103, 311519, 310115, 308867, 309640, 312110, 314559, 315940, 316283, 315843, 314962, 314455, 314954, 315926, 316245, 315792, 315658, 316592, 318066, 319143, 319552, 319431, 318547]
52527C18547k043k809k115R8K548L729L369K454J726P80p50j812j049R58K092
52512C25723J495L38n64k021m209n109l049L33J916J187L35N75Q01J58l84K3N24
52495C18072J29n22l32M28P31L61k06p84j197p70O66J896J680N20k56o43j674
52478C18099l194l609k149N6J567K081J858Q63p32k080k435j860q57N3K31o74
52462C07218j832j781l00J230J822K035K482K656K258K336L581M606L830K238
52448C32379K146L655M567L869K931K818K688J816J180J579J846O72j132j964
52434C59050k078k942m427m732l113q87N78J319J688J395N24K71J486L178L557
52419C54867K260N81k96m35n14q64j310j439q35N94K264L251L137K300J355O05
$$ y = [318547, 316504, 313695, 311580, 311678, 314226, 317955, 321324, 323778, 325504, 326284, 325534, 323722, 322673, 323631, 325723, 327218, 327556, 326992, 324971, 320762, 315653, 312604, 312937, 314853, 316040, 316375, 316950, 317751, 317909, 317525, 317548, 318072, 318201, 317679, 317347, 317775, 318506, 318867, 318661, 317877, 316680, 315910, 316576, 318472, 320152, 320672, 320416, 319773, 318099, 314905, 311296, 309147, 309203, 310770, 312851, 314709, 315572, 314840, 312760, 310325, 308465, 307608, 307661, 307892, 307218, 305386, 303605, 303305, 304535, 306357, 308392, 310874, 313530, 315788, 318124, 321705, 326311, 330141, 332379, 334525, 338180, 342747, 346616, 349547, 352365, 355053, 356869, 358049, 359628, 361474, 362146, 361014, 359050, 356972, 354030, 349603, 344871, 341758, 340871, 341449, 342768, 344456, 345851, 346375, 346646, 348132, 351310, 354867, 357127, 357708, 357412, 356977, 356463, 355599, 354289, 352850, 352015, 352609, 354873, 358124, 361261, 363561, 364916, 365521]
52403C65521Q5l56j067k129k685j451J462L917L820J489r74k326k987l370l025
52388C55924j969j327j662j842q03N21M58q56j770j599j236j288j200n45J23K70
52372C41199K19M87J100J830K447K562K025J499J663J922J138k88o15O64K055
52357C59907K521L050M747O952Q458R291R834R409P369M636K549R10j142l061
52343D25430l575k949k710l217l402k905k705l290l852l747l364l021k291r62
52329C83440M43J470J996J537l18k363k247N67L624M339L017J872J941K362K227
52314D03907J793J812K604M005N507O363O043M816L592L056L119L145K633J729
52300D54124J050J044J525J952J969J490O39n8J47J302K420K859L420N073O920
$$ y = [365521, 365606, 365250, 364183, 362054, 359369, 357918, 359380, 363297, 367117, 368606, 367632, 365306, 362319, 358949, 355924, 353955, 352628, 350966, 349124, 348321, 348842, 349300, 348444, 346674, 345075, 343839, 342551, 341351, 340806, 340929, 341199, 341418, 341905, 343005, 344835, 347282, 349844, 351869, 353368, 355031, 356953, 358091, 357803, 357188, 357852, 359907, 362428, 365478, 370225, 377177, 385635, 394926, 404760, 414169, 421538, 426174, 428723, 429633, 428491, 425430, 421855, 418906, 416196, 412979, 409577, 406672, 403967, 400677, 396825, 393078, 389714, 386693, 384402, 383440, 383883, 385353, 387349, 388886, 388568, 386205, 383958, 384525, 388149, 392488, 395505, 397377, 399318, 401680, 403907, 405700, 407512, 410116, 414121, 419628, 425991, 432034, 436850, 440442, 443498, 446617, 449762, 452395, 454124, 455174, 456218, 457743, 459695, 461664, 463154, 463793, 463735, 463882, 465184, 467604, 470463, 473883, 478956, 485876]
52285D85876O985N135L624M203O043P367P933Q736J0097J1315J1864J1883J1576
52272E92637J1003J0447J0297J0552J0799J0780J0660J0742J0988J0805R509P258
52260G16477N264M481M370L702K395J472J239P91l71j503j920j875j620q05L82
52245G32479Q52L24J13R94J587M73j205j052J273L904N471O169O358N947N246
52230G68933M867M595L891L548M980P551Q515O575L903L376N042O653O894O561
52216H45884O828P524P428N659K687K17j37J607L696M197K547k60k499k824j317
52201H81237L47M98o18j223m45O51R54R95J851L232L967L907M060M933N917O390
52185I16653O434O116N033L099J164K51L81P18O97O93J495L283N182N935N233
$$ y = [485876, 492861, 497996, 501620, 505823, 511866, 519233, 527166, 535902, 545999, 557314, 569178, 581061, 592637, 603640, 614087, 624384, 634936, 645735, 656515, 667175, 677917, 688905, 699710, 709219, 716477, 721741, 726222, 730592, 734294, 736689, 738161, 739400, 740191, 739820, 738317, 736397, 734522, 732902, 732097, 732479, 733331, 733655, 733768, 734762, 736349, 736822, 735617, 734565, 735838, 739742, 745213, 751382, 757740, 763687, 768933, 773800, 778395, 782286, 785834, 790814, 798365, 806880, 813455, 817358, 820734, 825776, 832429, 839323, 845884, 852712, 860236, 867664, 873323, 876010, 876227, 876090, 877697, 881393, 885590, 888137, 887877, 885378, 882554, 881237, 881584, 882082, 881464, 880241, 879796, 880447, 881401, 882396, 884247, 887479, 891446, 895353, 899413, 904346, 910263, 916653, 923087, 929203, 934236, 937335, 938499, 938750, 939131, 939849, 940546, 941239, 942734, 946017, 951199, 957134, 962367]
52170I62367M292M697O566Q264Q172O442M660M082M679N703O506O671O098N272
52156A044471N005N462N883N767N708O318O867O140M453L403L400K918R55j134
52142A105616j448k50O12L93L5K26M26J00l31l01K2J26k16r55j761j904r62K15
52124A099643K36q98j626j097m14r08k151k796k588k398k624k771k524k177j904
52109A073003j423o14J51N25N60N13N94R07J335J481J175Q77J199K070K852L222
52093A088427L435L704L872L881M055M647N284N309M607L910M039M907N521N259
52079A150857M824N380O855P930P931P715Q198Q842Q562P428O428O016N989O459
52065A249414P610Q690Q675Q141R024J1949J5087J6331J5562J3986J2345J0813
$$ y = [962367, 966659, 971356, 977922, 986186, 994358, 1000800, 1005460, 1009542, 1014221, 1019924, 1026430, 1033101, 1039199, 1044471, 1049476, 1054938, 1060821, 1066588, 1072296, 1078614, 1085481, 1091621, 1096074, 1099477, 1102877, 1105795, 1106750, 1105616, 1104168, 1103918, 1104530, 1104923, 1104958, 1105184, 1105610, 1105710, 1105379, 1105078, 1105100, 1105226, 1105010, 1104055, 1102294, 1100390, 1099428, 1099643, 1099879, 1098981, 1097355, 1096258, 1095844, 1094936, 1092785, 1089989, 1087401, 1085003, 1082379, 1079608, 1077084, 1074907, 1073003, 1071580, 1070966, 1071117, 1071642, 1072202, 1072715, 1073309, 1074216, 1075551, 1077032, 1078207, 1079084, 1080283, 1082353, 1085205, 1088427, 1091862, 1095566, 1099438, 1103319, 1107374, 1112021, 1117305, 1122614, 1127221, 1131131, 1135170, 1140077, 1145598, 1150857, 1155681, 1161061, 1167916, 1175846, 1183777, 1191492, 1199690, 1208532, 1217094, 1224522, 1230950, 1236966, 1242955, 1249414, 1257024, 1265714, 1274389, 1282530, 1291554, 1303503, 1318590, 1334921, 1350483, 1364469, 1376814, 1387627]
52053A387627R687Q901P473M738J801M45P16Q40m72k730m820o236o821o388n139
52038A389622l696k148J09L102N681O947P582Q768J0310J1011J0660J0403J0823
52025A469174J0773Q902N650K899J782J583R30n05j882k452k332j977j551j282
52011A489712k026m513p949j0236j0197r039q880j0205j1627j2022j1858j2091
51999A379069j2635j2731j2400j2561j3613j4516j3820j1447r074q492r727j1069
51987A236984j0883r085o708m567k814j413k77J023K860M733N504M760L362K342
51973A225821J920J965K676M017N106N106M483M447N114N154L446M32k490m367
51959A262830n214n587n945o182n820m942m818o752j0151j2653j2698j1320j0725
$$ y = [1387627, 1397314, 1406215, 1413688, 1418426, 1420227, 1420672, 1421388, 1422228, 1421756, 1419026, 1414206, 1407970, 1401149, 1394761, 1389622, 1385926, 1383778, 1383887, 1386989, 1392670, 1399617, 1407199, 1415967, 1426277, 1437288, 1447948, 1458351, 1469174, 1479947, 1488849, 1494499, 1497398, 1499180, 1500763, 1501693, 1501188, 1499306, 1496854, 1494522, 1492545, 1490994, 1489712, 1487686, 1483173, 1475224, 1464988, 1454791, 1445752, 1436872, 1426667, 1415040, 1403018, 1391160, 1379069, 1366434, 1353703, 1341303, 1328742, 1315129, 1300613, 1286793, 1275346, 1266272, 1257780, 1248053, 1236984, 1226101, 1217016, 1210308, 1205741, 1202927, 1201514, 1201237, 1202260, 1205120, 1209853, 1215357, 1220117, 1223479, 1225821, 1227741, 1229706, 1232382, 1236399, 1241505, 1246611, 1251094, 1255541, 1260655, 1265809, 1269255, 1269687, 1267197, 1262830, 1257616, 1252029, 1246084, 1239902, 1234082, 1229140, 1224322, 1217570, 1207419, 1194766, 1182068, 1170748, 1160023]
51946A160023j1623j2992j4066j5361j7355j9124j9131j7034j4124j1944j1033
51935I96236j1125j2061j3859j5924j6927j6040j4056j2593j2158j1658j0032
51924H49803p736n968m990m049k784j778j656k400l808n811p842q681p809o498
51910G77993o541q054r370r221q035o750n299l078l09K107L831N348O912Q064
51896G47598Q465Q516Q746R050R048Q789Q546Q022O432L614O74q72o58J54L03
51881H26427JN65K490M675O048P128Q981J1156J2113J1614J1031J0754R019M477
51867I26479j344n721q036r781j1858j3725j5057j6420j7876j8515j7974j7128
51855G73044j6662j6107j4916j3353j1687r684p583o455o626o796n771l976k180
$$ y = [1160023, 1148400, 1135408, 1121342, 1105981, 1088626, 1069502, 1050371, 1033337, 1019213, 1007269, 996236, 985111, 973050, 959191, 943267, 926340, 910300, 896244, 883651, 871493, 859835, 849803, 842067, 836099, 831109, 827060, 824276, 822498, 820842, 818442, 814634, 808823, 800981, 792300, 784491, 777993, 771452, 763398, 754028, 744807, 736772, 730022, 724723, 721645, 721336, 723443, 727274, 732622, 739534, 747598, 756063, 764579, 773325, 782375, 791423, 800212, 808758, 816780, 823212, 826826, 827500, 826628, 825970, 826124, 826427, 826428, 826993, 829483, 834158, 840206, 847334, 856315, 867471, 879584, 891198, 902229, 912983, 922002, 926479, 925135, 919414, 911378, 901597, 889739, 876014, 860957, 844537, 826661, 808146, 790172, 773044, 756382, 740275, 725359, 712006, 700319, 690635, 683052, 676597, 669971, 663175, 657404, 653428, 651248]
51842F51248L2L038N609O461O632Q116J0543J1528J0509R738J0787J2266J2229
51829G58736J0845R147O751K805j746m885o053o274n994m608k198m3J154K195
51815G59832L974O140P781Q591Q814Q771R117J0665J3311J5636J6375J5744J4614
51802H99365J2994J0361P182M831L828L192J894jk218n405j0242j5722j9432j9921
51788H70706j8225j6572j6023j5842j4992j3482j2015j0828r621q504q162q598
51776G17842q399o255l018j202j961l584l774k712k498l814m747l460q14Q29N93
51761F73026m32j332k397l757m431l652k347k124l095l721k806q50P98J482J625
51746F45987K053L336N444P670Q911Q311N775J934k205n675p987r248r638q999
$$ y = [651248, 651280, 654318, 659927, 666388, 673020, 681136, 691679, 703207, 713716, 723454, 734241, 746507, 758736, 769581, 778728, 785479, 788284, 786538, 781653, 775600, 769326, 763332, 758724, 756526, 756483, 757637, 759832, 763806, 769946, 777727, 786318, 795132, 803903, 813020, 823685, 836996, 852632, 869007, 884751, 899365, 912359, 922720, 929902, 934733, 938561, 941753, 943647, 943646, 941428, 936023, 925781, 910059, 890627, 870706, 852481, 835909, 819886, 804044, 789052, 775570, 763555, 752727, 743106, 734602, 726440, 717842, 709443, 703188, 700170, 698968, 697007, 693423, 689649, 686937, 684439, 680625, 675878, 672418, 671604, 672433, 673026, 672594, 671262, 668865, 665108, 660677, 657025, 654678, 652554, 649459, 645738, 642932, 642082, 642880, 644362, 645987, 648040, 651376, 656820, 664490, 673401, 681712, 687487, 689421, 687216, 681541, 673554, 664306, 654668, 645669]
51732F45669p410o009o257q054r345q370n649l075j518l78P85J419J003j4p67
51717E92030p63J33J834L695M619M045K495Q76k49n34K33J545K236J940J905L515
51701F19555O368Q822J0057J0508J0481R651Q224P161O620N171J648k913o236
51688F95117p446p677q042q152p068m891k591n55J719M418O683P735Q204R514
51674F86968J1901J3908J4142J2940J1792J1535J1920J2611J3747J5236J5986
51663H32686J4369R454J889o228j2521j5728j6151j4810j2534j0088q494q353
51651G53491r083r551r483r401r197p865n105k191m80L46J649L795N571N705M265
51636G12466K438J283J094J671K819M344N742O292N745M628L559K443Q42j123
$$ y = [645669, 638259, 632250, 625993, 617939, 608594, 600224, 594575, 591500, 589982, 589604, 590389, 591808, 592811, 592797, 592030, 591267, 591400, 593234, 596929, 601548, 605593, 608088, 608964, 608715, 608181, 608414, 609959, 612195, 614135, 616040, 619555, 625923, 634745, 644802, 655310, 665791, 675442, 683666, 690827, 697447, 702618, 704266, 701353, 695117, 687671, 679994, 671952, 663800, 656732, 651841, 649250, 648695, 650414, 654832, 661515, 669250, 677454, 686968, 698869, 712777, 726919, 739859, 751651, 763186, 775106, 787717, 801464, 816700, 832686, 847055, 856509, 858398, 852170, 839649, 823921, 807770, 792960, 780426, 770338, 761844, 753491, 744408, 734857, 725374, 715973, 706776, 698911, 693806, 691615, 691135, 691481, 693130, 696925, 702496, 708201, 712466, 714904, 716187, 717281, 718952, 721771, 726115, 731857, 738149, 743894, 748522, 752081, 754524, 755366, 754243]
51622G54243k816m033n083n843n541l869j637J74J487K801M316N984Q059J0911
51608G59153J4417J7860K0325K0963J9196J5007Q951J761n611j1636j4706j4563
51596H31117j2711j1032j0515j1498j4031j7053j8265j6291j2645j0265j0125
51585F86686j0487r528p455n684m937m849m800m569m445n081o920r549j1724j2192
51571E84466j0546p540m849l976m821n656n071l615k781k881k961k560k184j971
51557E23054j225K89J676K130J933J786J964K555L635M659M677L864L816N365
51543E60178O898O175L352J036J406M229P614R780R918Q300N954L933K544J444
51529F32761K99q01j375p29J494M650P402R196J0850J3068J4964J5197J4190J3976
$$ y = [754243, 751427, 747394, 742311, 736468, 730927, 727058, 725421, 725595, 727082, 729883, 734199, 740183, 748242, 759153, 773570, 791430, 811755, 832718, 851914, 866921, 875872, 877633, 872022, 860386, 845680, 831117, 818406, 807374, 796859, 785361, 771330, 754277, 736012, 719721, 707076, 696811, 686686, 676199, 666671, 659216, 653532, 648595, 643746, 638946, 634377, 629932, 624851, 617931, 608382, 596658, 584466, 573920, 566380, 561531, 557555, 552734, 547078, 542007, 538392, 535611, 532730, 529769, 527209, 525025, 523054, 521829, 522118, 523794, 525924, 527857, 529643, 531607, 534162, 537797, 542456, 547133, 550997, 554813, 560178, 567076, 573251, 576603, 577639, 579045, 583274, 590888, 600668, 610586, 618886, 624840, 628773, 631317, 632761, 633060, 632259, 630884, 630155, 631649, 636299, 643701, 652897, 663747, 676815, 691779, 706976, 721166, 735142]
51515G35142J5723J8585K1175K3101K4518K5340K5665K6305K7884K9896L1333
51504A004667L1878L1722L0762K9039K7852K9230L3803M0019M5904N0953N5641
51493A411470N9531O0804N7768N0362M0037K8491J6640M453q338k1331l3235m2856
51481A623796n0247n6440o1777o5101o5197o2678n9621n7113n4020m8708m1572
51470A001322l5047l1209k9895k9318k7868k5020k1106j6943j3610j1801j1115
51459G48390j0474r448q736q941r537r680r507r728j0084r369p162m543k698j709
51445F36774j232j404k303l281l811m320n205n594m418k359j353k141l553m334
51431E91466m412m092l295k168j343r63m02M68P32r1r83q25j13k16j402k689l366
$$ y = [735142, 750865, 769450, 790625, 813726, 838244, 863584, 889249, 915554, 943438, 973334, 1004667, 1036545, 1068267, 1099029, 1128068, 1155920, 1185150, 1218953, 1258972, 1304876, 1355829, 1411470, 1471001, 1531805, 1589573, 1639935, 1679972, 1708463, 1725103, 1729556, 1721218, 1699887, 1666652, 1623796, 1573549, 1517109, 1455332, 1390231, 1325034, 1262356, 1202735, 1145622, 1091602, 1042894, 1001322, 966275, 935066, 905171, 875853, 847985, 822965, 801859, 784916, 771306, 759505, 748390, 737916, 728468, 719732, 710791, 701254, 691574, 682067, 672339, 662255, 652886, 645724, 641181, 638483, 636774, 635542, 634138, 631835, 628554, 624743, 620423, 615218, 609624, 605206, 602847, 601494, 599353, 595800, 591466, 587054, 582962, 579667, 577499, 576156, 575193, 574791, 575259, 575991, 575900, 574917, 574092, 573979, 573763, 572361, 569672, 566306]
51414E66306l626l701l392k606j785j528k040k998l647l302j957k66J269K646
51400E39373L801M319M134L938M361N192N866O094N614M146K450K402M854Q045
51386F04589R481R049Q827J0087J2019J3509J4616J5689J6223J5265J2429Q182
51374G49965L782Q54R2K39o23k682m487n511p032r828j2533j3400j2484j0845
51360F75507q680n797l224k493l349l731k417m87L24j62o13O3J662L188L998M260
51344F58049M396M342L803L212L616N174O471O252N331N615P334Q578Q050P058
51330G37281P789J0333J2662J3485J3997J6325K0981K6505L1167L4471L7187M0678
51318A002861M6119N3545O1251O6838O9346O9900O9818O8794O5672O0308N3365
$$ y = [566306, 562680, 558979, 555587, 552981, 551196, 549668, 547628, 544630, 540983, 537681, 535724, 535458, 536727, 539373, 543174, 547493, 551627, 555565, 559926, 565118, 570984, 577078, 582692, 586838, 589288, 591690, 596544, 604589, 614070, 623119, 631946, 642033, 654052, 667561, 682177, 697866, 714089, 729354, 741783, 749965, 753747, 754601, 754693, 754932, 754309, 751627, 747140, 741629, 734597, 724769, 712236, 698836, 686352, 675507, 666827, 661030, 657806, 655313, 651964, 648233, 645816, 645329, 645653, 645491, 644878, 644941, 646603, 649791, 653789, 658049, 662445, 666787, 670590, 673802, 677418, 682592, 689063, 695315, 700646, 706261, 713595, 722173, 730223, 737281, 745070, 755403, 768065, 781550, 795547, 811872, 832853, 859358, 890525, 924996, 962183, 1002861, 1048980, 1102525, 1163776, 1230614, 1299960, 1369860, 1439678, 1508472, 1574144, 1634452, 1687817]
51307A687817M4662L3224J9370N197p616j9485l1516m3441n3982o2499o9034p3110
51295A429587p3810p1256o7087o3097n9723n5979n0716m4074l7828l3773l1555
51284H40689k8866k4439j9934j7726j7568j7012j4944j2957j2774j3820j4240
51273F46409j3271j1636j0250r521r570j0148j0366r257o899m605l732m268m703
51260E38183l497p55J748K440J594P45Q34J492J830J232m29k482l525k802j516
51245E35092j490k407j873J096M195M695K992J715K069K832K704J862Q33n78k454
51230E51283l914l988k895j867j920l018m107l842j780R34K507K311J278M74O4
51215E31520q1L29J419K461K637K138J805J923K136K396L113M305N365N944O354
$$ y = [1687817, 1732479, 1765703, 1785073, 1790270, 1782654, 1763169, 1731653, 1688212, 1634230, 1571731, 1502697, 1429587, 1355777, 1284521, 1217434, 1154337, 1094614, 1038635, 987919, 943845, 906017, 872244, 840689, 811823, 787384, 767450, 749724, 732156, 715144, 700200, 687243, 674469, 660649, 646409, 633138, 621502, 611252, 601731, 592161, 582013, 571647, 562390, 555491, 550886, 547154, 542886, 538183, 534686, 533931, 535679, 538119, 539713, 540458, 541292, 542784, 544614, 545846, 545417, 542935, 539410, 536608, 535092, 533602, 531195, 529322, 530418, 534613, 539308, 542300, 544015, 546084, 548916, 551620, 553482, 554315, 553737, 551283, 547369, 543381, 540486, 538619, 536699, 533681, 529574, 525732, 523952, 524886, 527393, 529704, 530982, 531456, 531520, 531439, 531768, 533187, 535648, 538285, 540423, 542228, 544151, 546287, 548683, 551796, 556101, 561466, 567410, 573764]
51200E73764O768O561N048K484j86k343l957m985n208m766m365m635n448o095
51186E52637n877m569k641j175j143k390l711m192m083l917l441k210q40m03o88
51171E11357l27R87J732P13j144k130j869r38O71L134N383N976N295N082N573
51156E39495M990K613M63N77K023K276P77n87k25J433K886L032J721l5m83J138
51140E62094L323L917K939K382L037L206J408j170k202j128P61K339L272L112
51126E87290J519n36j335n33L97L16j89k08j72r96k265k499j142O84J486P56r41
51109E81632k468k596q01J993L989M232L356K468J806J056L71K53N00J02j593
51094E94300l997n908o747o901o903o538n096k586l48J47q75j606r24K86O97N32
$$ y = [573764, 580532, 587093, 592141, 594625, 594439, 592096, 588139, 583154, 577946, 573180, 568815, 564180, 558732, 552637, 546760, 542191, 539550, 538375, 537232, 534842, 531131, 526939, 522856, 518939, 515498, 513288, 512448, 512045, 511357, 511030, 512017, 513749, 514462, 513318, 511188, 509319, 508381, 509052, 512186, 517569, 523545, 528840, 533922, 539495, 544485, 547098, 547561, 548138, 550161, 552437, 553214, 552627, 552402, 553835, 556721, 559753, 561474, 561439, 560956, 562094, 565417, 569334, 572273, 574655, 577692, 580898, 582306, 581136, 578934, 577806, 578567, 580906, 584178, 587290, 588809, 588273, 586938, 586405, 586802, 587118, 586929, 586721, 586549, 585553, 583288, 580789, 579647, 580331, 581817, 582573, 581632, 579164, 576568, 575767, 577760, 581749, 585981, 589337, 591805, 593611, 594667, 595038, 595291, 595791, 595893, 594300, 590303, 584395, 577648, 570747, 563844, 557306, 552210, 549624, 549276, 549423, 548548, 546942, 546018, 546304, 547001, 547533]
51078E47533Q52J385P41j206k743k645j615p07K88J724K670K232J534K543N197
51063E57783P285P294N840M116K462J030M64J053K065K652K684K233J161r4k59
51048E97769J280L482M923N472N715N528M441K958K122J835R34q48k260k223j166
51033F29962j33M51N44j61j655k859k408l65J592J866N27r41j162OJ725L145L990
51016F34124M343M199L528K603K022K240L171M229M808M868N069O085P661Q766
51002F97716Q962R181J0584J2849J4282J3588J1002P736N047L975N165Q254J1761
50989H20102J4102J4698J4006J2930J2388J2933J4135J4565J2965R562N991L955
50977I62332L973M964M840J921l538r421j3835j6974k0298k4085k6721k6595k3924
$$ y = [547533, 548385, 549770, 550511, 549305, 546562, 543917, 542302, 541595, 541883, 543607, 546277, 548509, 550043, 552586, 557783, 565068, 572362, 578202, 582318, 584780, 585810, 586274, 587327, 589392, 592044, 594728, 596961, 598122, 598028, 597769, 599049, 602531, 607454, 612926, 618641, 624169, 628610, 631568, 633690, 635525, 636459, 635611, 633351, 631128, 629962, 629829, 630280, 630824, 630663, 629008, 626149, 623741, 623376, 624968, 626834, 627361, 626420, 625258, 625264, 626989, 630134, 634124, 638467, 642666, 646194, 648797, 650819, 653059, 656230, 660459, 665267, 670135, 675204, 681289, 688950, 697716, 706678, 715859, 726443, 739292, 753574, 767162, 778164, 785900, 790947, 794922, 800087, 808341, 820102, 834204, 848902, 862908, 875838, 888226, 901159, 915294, 929859, 942824, 952386, 958377, 962332, 966305, 971269, 976109, 978030, 974492, 965071, 951236, 934262, 913964, 889879, 863158, 836563, 812639]
50964H12639k0261j6918j4366j2591j1212r509p055m338k208q24M01J910L549
50951G19217M978N952O236N943N930P188R595J1937J3327J3898J3956J3426J2628
50938H44211J2511J3299J3819J3094J1876J1449J1742J2035J2782J4891J7453
50927I89162J8305J7096J5776J5452J4809J2612R761P386M711Q59k513k821k93
50914A100302K056K153P41o12j447j938k047j859j636j025P42L428N759P303R276
50899A121196J2668J6476J8783J9064J8641J9139K1024K3445K5172K5850K6313
50888A347771K7332K8406K8578K8256K8930L0833L2133L0980K7341K2184J6068
50877A648812R440L383j071l901n638o497o764p257q469r873j1006j2662j5855
$$ y = [812639, 792378, 775460, 761094, 748503, 737291, 727782, 720727, 716389, 714181, 713357, 713758, 715668, 719217, 724195, 730147, 736383, 742326, 748256, 755444, 765039, 776976, 790303, 804201, 818157, 831583, 844211, 856722, 870021, 883840, 896934, 908810, 920259, 932001, 944036, 956818, 971709, 989162, 1007467, 1024563, 1040339, 1055791, 1070600, 1083212, 1092973, 1100359, 1105070, 1105929, 1103416, 1100595, 1100302, 1102358, 1104511, 1105252, 1104640, 1103193, 1101255, 1099208, 1097349, 1095713, 1094688, 1095430, 1098858, 1104617, 1111920, 1121196, 1133864, 1150340, 1169123, 1188187, 1206828, 1225967, 1246991, 1270436, 1295608, 1321458, 1347771, 1375103, 1403509, 1432087, 1460343, 1489273, 1520106, 1552239, 1583219, 1610560, 1632744, 1648812, 1658252, 1661635, 1660564, 1656663, 1651025, 1644528, 1637764, 1630507, 1622038, 1612165, 1601159, 1588497, 1572642]
50864A572642k0049k3625k5860k7329k8548k9449l0184l1216l2179l1701k9018
50853A263484k5129k1887k0127j9137j7731j5679j3892j3165j3001j2250j0870
50842A080616j0065j0277j0179q543o211m955n168n972p022q378q937p047l268
50829I84594o06j058l246m588m624m836n858o489n462l033m50J404K420K776K701
50814I53645K687L333M539N139M100K164J409K840N355P708J0292J3696J6608
50801A033515J7117J5814J5435J7206J9449K0461K0911K2422K5185K8221L0939
50790A266675L3304L5470L8137M2236M7254N0961N2008N1790N2433N3927N4831
50779A779026N4871N4980N5174N4318N1996M8971M5745M2143L8442L5362L2829
$$ y = [1572642, 1552593, 1528968, 1503108, 1475779, 1447231, 1417782, 1387598, 1356382, 1324203, 1292502, 1263484, 1238355, 1216468, 1196341, 1177204, 1159473, 1143794, 1129902, 1116737, 1103736, 1091486, 1080616, 1070551, 1060274, 1050095, 1041552, 1035341, 1030386, 1025218, 1019246, 1012224, 1003846, 994909, 987862, 984594, 983988, 982930, 979684, 975096, 970472, 965636, 959778, 953289, 947827, 944794, 944344, 945748, 948168, 950944, 953645, 956332, 959665, 964204, 969343, 973443, 975607, 977016, 979856, 985211, 992919, 1003211, 1016907, 1033515, 1050632, 1066446, 1081881, 1099087, 1118536, 1138997, 1159908, 1182330, 1207515, 1235736, 1266675, 1299979, 1335449, 1373586, 1415822, 1463076, 1514037, 1566045, 1617835, 1670268, 1724195, 1779026, 1833897, 1888877, 1944051, 1998369, 2050365, 2099336, 2145081, 2187224, 2225666, 2261028, 2293857]
50768B293857L0219K8125K8159L0494L3106L4316L4757L5894L7808L9474M0292
50757B666501M0076L8233L4142K8164K1349J4338P054p52r178j8048k6647l4087
50745B761145m0233m5692n0461n3340n3386n1176m7793m3394l7843l2079k7398
50734B278350k3652j9445j4068q153k429K866P260J0013J1157J1558J1611J0876
50722B275944R300P569N794L121o20m054o195q172j1729j6671k1280k4907k8573
50709B179527l2939l7105m0028m2107m4587m7905n1156n2984n2658n0476m7360
50698A680222m4033m0617l7073l3578l0211k6704k3119k0242j8494j6795j3682
50687A375674r495o232m869m064j945J710N817R563J2876J5983J9277K3032K6633
$$ y = [2293857, 2324076, 2352201, 2380360, 2410854, 2443960, 2478276, 2513033, 2548927, 2586735, 2626209, 2666501, 2706577, 2744810, 2778952, 2807116, 2828465, 2842803, 2849857, 2849105, 2839927, 2821879, 2795232, 2761145, 2720912, 2675220, 2624759, 2571419, 2518033, 2466857, 2419064, 2375670, 2337827, 2305748, 2278350, 2254698, 2235253, 2221185, 2213032, 2210603, 2213469, 2220729, 2230742, 2241899, 2253457, 2265068, 2275944, 2285244, 2292813, 2298607, 2301728, 2301108, 2297054, 2290859, 2282687, 2270958, 2254287, 2233007, 2208100, 2179527, 2146588, 2109483, 2069455, 2027348, 1982761, 1934856, 1883700, 1830716, 1778058, 1727582, 1680222, 1636189, 1595572, 1558499, 1524921, 1494710, 1468006, 1444887, 1424645, 1406151, 1389356, 1375674, 1366179, 1359947, 1355078, 1351014, 1349069, 1350779, 1356596, 1366159, 1379035, 1395018, 1414295, 1437327, 1463960]
50674A463960K8828K9502L0409L3035L6366L8137L7936L7546L8133L8657L7738
50663A850247L5953L5199L6226L7682L7576L5108L1018K6440K1920J7570J3817
50652B178756J1240R638Q079O336N586O964J0027J3429J6642J9992K3483K6710
50640B336882K9693L2539L4405L4158L2182L0093K8350K5553K0737J5158J0960
50629B630710R015Q866R913J1756J4024J6683J9983K3597K6505K8364L0215L3125
50617B862756L6990M1438M6973N4015O1545O8027P3189P7616Q0913Q1782Q0000
50606C565244P7004P4082P1008O6984O2259N8169N5796N4952N4381N2916N0416
50595D243211M7426M4119M0188L5819L1866K8683K5805K3515K3619K7393L3380
$$ y = [1463960, 1492788, 1522290, 1552699, 1585734, 1622100, 1660237, 1698173, 1735719, 1773852, 1812509, 1850247, 1886200, 1921399, 1957625, 1995307, 2032883, 2067991, 2099009, 2125449, 2147369, 2164939, 2178756, 2189996, 2199634, 2207713, 2214049, 2219635, 2226599, 2236626, 2250055, 2266697, 2286689, 2310172, 2336882, 2366575, 2399114, 2433519, 2467677, 2499859, 2529952, 2558302, 2583855, 2604592, 2619750, 2630710, 2639725, 2648591, 2658504, 2670260, 2684284, 2700967, 2720950, 2744547, 2771052, 2799416, 2829631, 2862756, 2899746, 2941184, 2988157, 3042172, 3103717, 3171744, 3244933, 3322549, 3403462, 3485244, 3565244, 3642248, 3716330, 3787338, 3854322, 3916581, 3974750, 4030546, 4085498, 4139879, 4192795, 4243211, 4290637, 4334756, 4374944, 4410763, 4442629, 4471312, 4497117, 4520632, 4544251, 4571644, 4605024]
50584D605024L8715M2357M5730N0145N4876N8127N9022N8233N6930N5182N1467
50573E175808M4395L5109K6740K0794J5479Q770J120p181j9620m0621o8688r5512
50561E096593j13014j19202j16581j07795r4658p9289o3763m9105l5667k3647
50551D293872j2735k725M810P282M461r30p195j5957k8618m2873n5323o5921p6792
50538D001356q7814r6541j02070j05804j08365j08652j06440j03332j00316r6553
50528B985469r1305q5079p8081o9504n9273m8968m0074l2678k6492k1496j6915
50517B415604j1332m747J121N554J0149J6094K1851K5159K6059K6270K6609K6782
50505B585173K6972K7783K9113L0560L2581L5826L9687M3059M6415N1636N9700
$$ y = [4605024, 4643739, 4686096, 4731826, 4781971, 4836847, 4894974, 4953996, 5012229, 5069159, 5124341, 5175808, 5220203, 5255312, 5282052, 5302846, 5318325, 5327095, 5328215, 5321034, 5301414, 5260793, 5192105, 5096593, 4983579, 4864377, 4747796, 4640001, 4545343, 4466054, 4402291, 4353186, 4317519, 4293872, 4281137, 4278412, 4283222, 4290504, 4294965, 4294035, 4286840, 4270883, 4242265, 4199392, 4144069, 4078148, 4001356, 3913542, 3817001, 3714931, 3609127, 3500762, 3392110, 3285670, 3182338, 3082022, 2985469, 2894164, 2809085, 2731004, 2661500, 2602227, 2553259, 2513185, 2480507, 2454015, 2432519, 2415604, 2404272, 2399525, 2400646, 2406200, 2416349, 2432443, 2454294, 2479453, 2505512, 2531782, 2558391, 2585173, 2612145, 2639928, 2669041, 2699601, 2732182, 2768008, 2807695, 2850754, 2897169, 2948805, 3008505]
50494C008505O9596P9479Q7909R4114R8240J01393J04418J06736J07348J06805
50484C964543J06905J08422J10510J12686J16040J21876J29987J38980J47603
50475E057552J55361J62497J69863J78363J87981J97679K06448K13984K20146
50466F749874K24330K25918K24955K22036K17465K10589J99708J82853J59177
50457H616905J29752R6781O2009K6127j0702m8270q6025j22601j55762j83415
50447H324799k04599k18898k25431k23573k14373j99837j80772j56749j28521
50438F572046r8914p0528m3897j8788L837K2216L5103M1519M0130L0228J2684
50427F525636j1206m0978p5509j10902j42011j66383j85209k00041k10320k14878
$$ y = [3008505, 3078101, 3157580, 3245489, 3339603, 3437843, 3539236, 3643654, 3750390, 3857738, 3964543, 4071448, 4179870, 4290380, 4403066, 4519106, 4640982, 4770969, 4909949, 5057552, 5212913, 5375410, 5545273, 5723636, 5911617, 6109296, 6315744, 6529728, 6749874, 6974204, 7200122, 7425077, 7647113, 7864578, 8075167, 8274875, 8457728, 8616905, 8746657, 8843438, 8905447, 8931574, 8920872, 8872602, 8786577, 8663976, 8508214, 8324799, 8120200, 7901302, 7675871, 7452298, 7237925, 7038088, 6857316, 6700567, 6572046, 6473132, 6402604, 6358707, 6339919, 6343756, 6365972, 6401075, 6442594, 6482724, 6512952, 6525636, 6514430, 6473452, 6397943, 6287041, 6145030, 5978647, 5793438, 5593397, 5383077, 5168199]
50417E168199k14421k11061k06009j98997j89846j79495j69210j59398j49643
50408C490119j39775j30335j21868j13986j05708r6818q8274q0942p4433o7790
50398B470190o0978n4861m9810m5166m0189l4995l0305k6693k4089k1693j8405
50387B063006j3934r479o770o277o698o181l656P98O220J1300J5389J9088K3373
50374B086179K8239L2834L6854M0860M5154M9386N3551N8247O3398O7739P0433
50363B632874P2426P5418Q0023Q5727R1921R8047J03271J07296J11363J17275
50353C575641J25129J32800J37897J39776J39529J38452J36784J33566J27621
50344D787195J18716J07699R5402Q1784O6356M8866K9147O909j7515m2549o6332
$$ y = [5168199, 4953778, 4742717, 4536708, 4337711, 4147865, 3968370, 3799160, 3639762, 3490119, 3350344, 3220009, 3098141, 2984155, 2878447, 2781629, 2693355, 2612413, 2537980, 2470190, 2409212, 2354351, 2304541, 2259375, 2219186, 2184191, 2153886, 2127193, 2103104, 2081411, 2063006, 2049072, 2039593, 2032823, 2026546, 2019848, 2013667, 2010011, 2010809, 2017029, 2028329, 2043718, 2062806, 2086179, 2114418, 2147252, 2184106, 2224966, 2270120, 2319506, 2373057, 2431304, 2494702, 2562441, 2632874, 2705300, 2780718, 2860741, 2946468, 3038389, 3136436, 3239707, 3347003, 3458366, 3575641, 3700770, 3833570, 3971467, 4111243, 4250772, 4389224, 4526008, 4659574, 4787195, 4905911, 5013610, 5109012, 5190796, 5257152, 5306018, 5335165, 5342074, 5324559, 5282010, 5215678]
50333E215678q8081j07601j23713j34384j38778j38187j34456j28137j18731j06174
50323C997436r1432p5894o0633m6109l2242j8922o759K855Q643J0282Q093K161
50311C697479p711k1116l6470n1811o6071p9128r0507r8764j02835j03661j03387
50300B936018j02959j01504r8467r4979r2270q9769q6091q1250p6391p1614o5764
50289A974960n8545n1440m5986m2136l8865l5476l1912k8537k6063k4913k4289
50278A566798k2638j9441j5806j2994j1321j0757j1374j2451j2464j1075j0094
50267A416383j1046j2576j1975q945o078n364n875n504l690j393P65L079N659
50254A353440P859R161J0063J1554J3747J5549J5886J4993J4140J4209J4865J5161
$$ y = [5215678, 5127597, 5019996, 4896283, 4761899, 4623121, 4484934, 4350478, 4222341, 4103610, 3997436, 3906004, 3830110, 3769477, 3723368, 3691126, 3672204, 3665445, 3668300, 3676943, 3687225, 3695318, 3697479, 3689768, 3668652, 3632182, 3580371, 3514300, 3435172, 3344665, 3245901, 3143066, 3039405, 2936018, 2833059, 2731555, 2633088, 2538109, 2445839, 2356070, 2269979, 2188729, 2112338, 2040724, 1974960, 1916415, 1864975, 1818989, 1776853, 1737988, 1702512, 1670600, 1642063, 1616000, 1591087, 1566798, 1544160, 1524719, 1508913, 1495919, 1484598, 1473841, 1462467, 1450016, 1437552, 1426477, 1416383, 1405337, 1392761, 1380786, 1371841, 1365763, 1360399, 1354524, 1349020, 1345330, 1343937, 1344702, 1347781, 1353440, 1361299, 1370460, 1380523, 1392077, 1405824, 1421373, 1437259, 1452252, 1466392, 1480601, 1495466, 1510627]
50242A510627J4585J3424J2389J1868J1398J0142Q288P379Q357R668Q711N246
50230A632082J867O89J157J893K868M377N299M377K279N42r76l528o673q314p637
50215A630302n944l985l80O146J4298K0777K2393J7281N766q847k1512k8990l1825
50202A615480l2313l1562k9408k6069k2349j8635j4971j1802r622q081o513n121
50190A399034m599m721m365l137j994j968k912l944m554m803m700l914k358q76
50176A350189q17k504m546n433n567o504q175q477o493m488n006p034p192m480
50162A273473j580j034k060k207n95J891M665P969J1578J4530J6613J9039K2935
50149A365217K7652L1520L4224L7477M2877M9735N6022O1146O6532P3101P9530
$$ y = [1510627, 1525212, 1538636, 1551025, 1562893, 1574291, 1584433, 1592721, 1600100, 1608457, 1618125, 1626836, 1632082, 1633949, 1634638, 1635795, 1637688, 1640556, 1644933, 1650232, 1654609, 1656888, 1657430, 1656454, 1652926, 1646253, 1637939, 1630302, 1624358, 1620373, 1619993, 1626139, 1640437, 1661214, 1683607, 1700888, 1706654, 1697807, 1676295, 1647305, 1615480, 1583167, 1551605, 1522197, 1496128, 1473779, 1455144, 1440173, 1428371, 1418749, 1410668, 1404155, 1399034, 1394435, 1389714, 1385349, 1382212, 1380218, 1378250, 1375338, 1371394, 1366840, 1362037, 1357337, 1353423, 1351065, 1350189, 1349372, 1346868, 1342322, 1336889, 1331322, 1324818, 1316643, 1308166, 1301673, 1297185, 1292179, 1285145, 1277953, 1273473, 1271893, 1270859, 1268799, 1266592, 1265997, 1267888, 1272553, 1280522, 1292100, 1306630, 1323243, 1342282, 1365217, 1392869, 1424389, 1458613, 1496090, 1538967, 1588702, 1644724, 1705870, 1772402, 1845503, 1925033]
50138A925033Q3765Q5274Q4518Q1111P4252O4850N5517M8000M1954L6597L2173
50127B613044K9031K6331K2634J7055R054k032j6274l2359m8347o2872p5014q3675
50115B396576q8171q9101q7724q4562p9395p2338o4085n5158m5947l7309l0150
50104A662636k4230j8475j2889r214q939j1300j3893j4979j4503j3181j1396r178
50092A500459o712m428k696j632j262j688k875m193m656l944l084l586n862q850
50078A444991j1276j2682j3063j2082r313n130p38K718M806N694N895O196P317
50065A413333R127J0435J0081Q328O844P038Q596R897R825Q824Q182Q534R361
50052A528405R847J0036J0928J3333J6691J9392K0525K0999K2443K5104K7612
$$ y = [1925033, 2008798, 2094072, 2178590, 2259701, 2333953, 2398803, 2454320, 2502320, 2544274, 2580871, 2613044, 2642075, 2668406, 2691040, 2708095, 2717149, 2715117, 2698843, 2666484, 2618137, 2555265, 2480251, 2396576, 2308405, 2219304, 2131580, 2047018, 1967623, 1895285, 1831200, 1776042, 1730095, 1692786, 1662636, 1638406, 1619931, 1607042, 1597828, 1588889, 1577589, 1563696, 1548717, 1534214, 1521033, 1509637, 1500459, 1493747, 1489319, 1486623, 1484991, 1483729, 1482041, 1479166, 1474973, 1470317, 1466373, 1463289, 1459703, 1453841, 1444991, 1433715, 1421033, 1407970, 1395888, 1386575, 1381445, 1380707, 1383425, 1388231, 1393925, 1399820, 1406016, 1413333, 1422460, 1432895, 1442976, 1451304, 1458148, 1465186, 1473782, 1483679, 1493504, 1502328, 1510510, 1519044, 1528405, 1538252, 1548288, 1559216, 1572549, 1589240, 1608632, 1629157, 1650156, 1672599, 1697703, 1725315]
50041A725315K8948K9871L1772L4759L7693L9899M1899M4419M7499N0988N5242
50030B168304O0795O7543P4851Q2503R1149J01560J13450J25254J35250J42616
50020C163275J47097J47890J43799J34872J23205J11440J00871R1594Q3797P7854
50010D325694P3305O8785O2758N3386L8129J5319j3278m2924o9662r2736j12837
49999D305939j29657j42382j51380j57604j60952j60713j57305j51969j44996
49990B948981j35848j25051j14384j04784r5495q5880p6670o8598o0934n2688
$$ y = [1725315, 1754263, 1784134, 1815906, 1850665, 1888358, 1928257, 1970156, 2014575, 2062074, 2113062, 2168304, 2229099, 2296642, 2371493, 2453996, 2545145, 2646705, 2760155, 2885409, 3020659, 3163275, 3310372, 3458262, 3602061, 3736933, 3860138, 3971578, 4072449, 4164043, 4247840, 4325694, 4398999, 4467784, 4530542, 4583928, 4622057, 4637376, 4624098, 4581174, 4511512, 4418776, 4305939, 4176282, 4033900, 3882520, 3724916, 3563964, 3403251, 3245946, 3093977, 2948981, 2813133, 2688082, 2573698, 2468914, 2373419, 2287539, 2210869, 2142271, 2081337, 2028649]
$$ [...]
##END NTUPLES=NMR SPECTRUM
##END=
