
##TITLE=AC1228_VIERSDE097_6075064_qxoipnyZqV
##JCAMPDX= 6.0         $$ Bruker NMR JCAMP-DX V2.0
##DATA TYPE= NMR SPECTRUM
##DATA CLASS= NTUPLES
##ORIGIN= BRUKER
##OWNER= Administrator
$$ 1.72 TOPSPIN		Version 2.1
$$ 2012-05-08 22:43:17.312 -0500  Administrator@TOPSPIN
$$ Compression mode = diff/dup
##.OBSERVE FREQUENCY= 400.13188235
##.OBSERVE NUCLEUS= ^1H
##.ACQUISITION MODE= SIMULTANEOUS (DQD)
##.ACQUISITION SCHEME= undefined
##.AVERAGES= 64
##.DIGITISER RES= 22
##SPECTROMETER/DATA SYSTEM= spect
##.PULSE SEQUENCE= noesygpps1d.comp
##.SOLVENT NAME= COFFEE_meoh
##.SHIFT REFERENCE= INTERNAL, COFFEE_meoh, 1, 14.96692
##AUDIT TRAIL= $$ (NUMBER, WHEN, WHO, WHERE, PROCESS, VERSION, WHAT)
$$ ##TITLE= Audit trail, TOPSPIN		Version 2.1
$$ ##JCAMPDX= 5.01
$$ ##ORIGIN= Bruker BioSpin GmbH
$$ ##OWNER= Administrator
$$ $$ C:\Bruker\TOPSPIN/data/COFFEE/nmr/AC1228_VIERSDE097_6075064_qxoipnyZqV/22/pdata/1/auditp.txt
$$ ##AUDIT TRAIL=  $$ (NUMBER, WHEN, WHO, WHERE, PROCESS, VERSION, WHAT)
(   1,<2012-05-08 22:43:12.656 -0500>,<Administrator>,<TOPSPIN>,<go>,<TOPSPIN 2.1>,
      <created by zg
	started at 2012-05-08 22:31:42.109 -0500,
	POWCHK enabled, PULCHK disabled,
       configuration hash MD5:
       AF F2 23 6B 01 CD 40 DD E5 A1 38 A0 06 EA F7 77
       data hash MD5: 64K
       9D FD 69 B3 DB 22 BA 70 51 B0 33 C9 02 93 DE 3C>)
(   2,<2012-05-08 22:43:15.375 -0500>,<Administrator>,<TOPSPIN>,<proc1d>,<TOPSPIN 2.1>,
      <Start of raw data processing
       efp LB = 0.3 FT_mod = 6 PKNL = 1 PHC0 = 0 PHC1 = 0 SI = 128K 
       data hash MD5: 128K
       94 C4 95 5C 43 8C AD 1A C3 CA 8A 8B B4 B3 28 AF>)
(   3,<2012-05-08 22:43:16.593 -0500>,<Administrator>,<TOPSPIN>,<proc1d>,<TOPSPIN 2.1>,
      <pk PHC0 = 31.42639 PHC1 = 0 
       data hash MD5: 128K
       0A D2 0A A1 6E 35 9F F6 EE DA 9F 1A 72 BC E2 D9>)
(   4,<2012-05-08 22:43:16.812 -0500>,<Administrator>,<TOPSPIN>,<proc1d>,<TOPSPIN 2.1>,
      <abs ABSG = 1 
       data hash MD5: 128K
       0B 24 C2 A0 6F 0A 65 BF B7 DD A6 02 BC 41 B0 EA>)
(   5,<2012-05-08 22:43:16.890 -0500>,<Administrator>,<TOPSPIN>,<proc1d>,<TOPSPIN 2.1>,
      <abs ABSG = 2 
       data hash MD5: 128K
       C9 46 EF 0F 13 37 D8 51 6F 15 30 E9 13 E5 20 99>)
(   6,<2012-05-08 22:43:16.984 -0500>,<Administrator>,<TOPSPIN>,<proc1d>,<TOPSPIN 2.1>,
      <abs ABSG = 3 
       data hash MD5: 128K
       DA CF C4 79 09 63 61 3C 64 25 DB 62 62 42 A9 19>)
(   7,<2012-05-08 22:43:17.171 -0500>,<Administrator>,<TOPSPIN>,<proc1d>,<TOPSPIN 2.1>,
      <abs ABSG = 4 
       data hash MD5: 128K
       C1 4C 48 4B 0F AE 52 35 C5 A2 BB 43 7D A8 F1 EC>)
(   8,<2012-05-08 22:43:17.218 -0500>,<Administrator>,<TOPSPIN>,<proc1d>,<TOPSPIN 2.1>,
      <abs ABSG = 5 
       data hash MD5: 128K
       DE DD 63 69 90 7B 4D 5F E6 13 9F B6 50 85 3E 74>)
$$ ##END=
$$ 
$$ $$ hash MD5
$$ $$ 16 CD 05 DA 24 EA F2 65 F9 6F BB CC 6E 8F F3 CE
##$RELAX= 
##$RELAX= 
##$RELAX= 
##$RELAX= 
##$RELAX= 
##$RELAX= 
##$RELAX= 
##$RELAX= 
$$ Bruker specific parameters
$$ [...]
##$TP07= 0
##$TPNAME0= <>
##$TPNAME1= <>
##$TPNAME2= <>
##$TPNAME3= <>
##$TPNAME4= <>
##$TPNAME5= <>
##$TPNAME6= <>
##$TPNAME7= <>
##$TPOAL= (0..7)
0.5 0.5 0.5 0.5 0.5 0.5 0.5 0.5
##$TPOFFS= (0..7)
0 0 0 0 0 0 0 0
##$TUNHIN= 0
##$TUNHOUT= 0
##$TUNXOUT= 0
##$USERA1= <user>
##$USERA2= <user>
##$USERA3= <user>
##$USERA4= <user>
##$USERA5= <user>
##$V9= 5
##$VALIST= <valist>
##$VCLIST= <CCCCCCCCCCCCCCC>
##$VD= 0
##$VDLIST= <DDDDDDDDDDDDDDD>
##$VPLIST= <PPPPPPPPPPPPPPP>
##$VTLIST= <TTTTTTTTTTTTTTT>
##$WBST= 1024
##$WBSW= 4
##$XGAIN= (0..3)
0 0 0 0
##$XL= 0
##$YL= 0
##$YMAX_a= 9040062
##$YMIN_a= -4572594
##$ZGOPTNS= <>
##$ZL1= 120
##$ZL2= 120
##$ZL3= 120
##$ZL4= 120
##$ABSF1= 14.96692
##$ABSF2= -5.58561
##$ABSG= 5
##$ABSL= 3
##$ALPHA= 0
##$AQORDER= 0
##$ASSFAC= 0
##$ASSFACI= 0
##$ASSFACX= 0
##$ASSWID= 0
##$AUNMP= <proc_prof1d_extract.lims>
##$AXLEFT= 0
##$AXNAME= <>
##$AXNUC= <1H>
##$AXRIGHT= 0
##$AXTYPE= 0
##$AXUNIT= <>
##$AZFE= 0.1
##$AZFW= 0.1
##$BCFW= 0
##$BC_mod= 0
##$BYTORDP= 0
##$COROFFS= 0
##$CY= 15
##$DATMOD= 1
##$DC= 0
##$DFILT= <>
##$DTYPP= 0
##$F1P= 0
##$F2P= 0
##$FCOR= 0.5
##$FTSIZE= 131072
##$FT_mod= 6
##$GAMMA= 0
##$GB= 0
##$INTBC= 1
##$INTSCL= 1
##$ISEN= 128
##$LB= 0.3
##$LEV0= 0
##$LPBIN= 0
##$MAXI= 10000
##$MC2= 0
##$MEAN= 0
##$ME_mod= 0
##$MI= 0
##$NCOEF= 0
##$NC_proc= -3
##$NLEV= 6
##$NOISF1= 0
##$NOISF2= 0
##$NSP= 0
##$NTH_PI= 0
##$NZP= 0
##$OFFSET= 14.96692
##$PC= 1
##$PHC0= 31.42639
##$PHC1= 0
##$PH_mod= 1
##$PKNL= yes
##$PPARMOD= 0
##$PPDIAG= 0
##$PPIPTYP= 0
##$PPMPNUM= 2147483647
##$PPRESOL= 1
##$PSCAL= 4
##$PSIGN= 0
##$PYNMP= <proc.py>
##$REVERSE= no
##$SF= 400.130005479238
##$SI= 131072
##$SIGF1= 0
##$SIGF2= 0
##$SINO= 400
##$SIOLD= 131072
##$SPECTYP= <>
##$SREGLST= <1H.CDCl3>
##$SSB= 0
##$STSI= 131072
##$STSR= 0
##$SW_p= 8223.68421052632
##$SYMM= 0
##$S_DEV= 0
##$TDeff= 65536
##$TDoff= 0
##$TI= <>
##$TILT= no
##$TM1= 0
##$TM2= 0
##$TOPLEV= 0
##$USERP1= <user>
##$USERP2= <user>
##$USERP3= <user>
##$USERP4= <user>
##$USERP5= <user>
##$WDW= 1
##$XDIM= 131072
##$YMAX_p= 367463774
##$YMIN_p= -21032990
##$CURPLOT= <Network HP LaserJet P1505>
##$CURPRIN= <$Network HP LaserJet P1505>
##$DFORMAT= <normdp>
##$LAYOUT= <+/1D_H.xwp>
##$LFORMAT= <normlp>
##$PFORMAT= <normpl>
##$SURQMSG= 1
$$ End of Bruker specific parameters
$$ ---------------------------------
##NTUPLES= NMR SPECTRUM
##VAR_NAME=  FREQUENCY,     SPECTRUM/REAL,   SPECTRUM/IMAG
##SYMBOL=    X,             R,               I
##VAR_TYPE=  INDEPENDENT,   DEPENDENT,       DEPENDENT
##VAR_FORM=  AFFN,          ASDF,            ASDF
##VAR_DIM=   131072,        131072,          131072
##UNITS=     HZ,            ARBITRARY UNITS, ARBITRARY UNITS
##FACTOR=    0.0627417313425165, 1,          1
##FIRST=     8223.62146879498, 2470,         -85910
##LAST=      0,             5878,            -85201
##MIN=       0,             -21032990,       0
##MAX=       8223.62146879498, 367463774,    0
$$ Real data points
##PAGE= N=1
##DATA TABLE= (X++(R..R)), XYDATA
$$ [...]
63548A004070K2707J5206Q390K633j805m376n197n595o757q183q437p491p333
$$ 1004070 1026777 1041983 1050373 1053006 1051201 1046825 1041628 1036033 1029276 1021093 1012656 1005165 997832
63535I97832r871j4711j9578k2652k3967k4509k4691k4143k2598k0191j7059j3441
$$ 997832 987961 973250 953672 931020 907053 882544 857853 833710 811112 790921 773862 760421
63523G60421j0275q734q656q181n787k177O08J704K161L376N628Q288J0775J2877
$$ 760421 750146 741412 732756 724575 718788 716611 717219 718923 721084 724460 730088 738376 749151 762028
63509G62028J4517J5531J5851J5940J6785J8872K1187K1960K0817J9398J9381
$$ 762028 776545 792076 807927 823867 840652 859524 880711 902671 923488 942886 962267
63498I62267K0630K1945K2851K3764K5005K6591K8442K9935K9746K7135K2864
$$ 962267 982897 1004842 1027693 1051457 1076462 1103053 1131495 1161430 1191176 1218311 1241175
63487A241175J7998J2580O643J570j258k653m474o680p542o812o529q121j0738
$$ 1241175 1259173 1271753 1278396 1279966 1278708 1276055 1271581 1264901 1257359 1250547 1244018 1235897 1225159
63474A225159j3176j5677j8832k2307k5737k9472l3289l5670l5629l4280l3271
$$ 1225159 1211983 1196306 1177474 1155167 1129430 1099958 1066669 1030999 995370 961090 927819
63463I27819l2527l0904k8356k6030k4474k2976k0764j8051j5740j4503j4120
$$ 927819 895292 864388 836032 810002 785528 762552 741788 723737 707997 693494 679374
63452F79374j3688j2776j2136j2596j3433j2978j0855q384o578n365n081o643
$$ 679374 665686 652910 640774 628178 614745 601767 590912 582528 575950 570585 565504 558861
63440E58861r350j0541q955o699o016n828l840p88K61j520l631l874k684j347
$$ 558861 549511 538970 530015 523316 517300 511472 507632 506844 507105 505585 501954 498080 495396 494049
63426D94049OJ648L265M618N953P083P215O286N249M359K529q10m448o948q429
$$ 494049 494055 495703 498968 503586 509539 516622 523837 530123 535372 539731 542260 541450 537002 530054 521625
63411E21625r642j0320r823q819q707r517r708q333o283m971m602m259l240j693
$$ 521625 511983 501663 491840 483021 474314 464797 455089 446756 440473 435502 430900 426641 423401 421708
63397D21708k01Q47J456J986K901M383O080P348P870Q014Q542J0024J2380J4854
$$ 421708 421507 422354 423810 425796 428697 433080 439160 446508 454378 462392 470934 480958 493338 508192
63383E08192J6396J6472J5782J5966J8077K1386K4112K5353K5828K6775K8637
$$ 508192 524588 541060 556842 572808 590885 612271 636383 661736 687564 714339 742976
63372G42976L0983L3094L4460L5246L6596L9782M4570M8947N1080N1130N0550
$$ 742976 773959 807053 841513 876759 913355 953137 997707 1046654 1097734 1148864 1199414
63361A199414N0002M8667M5346L9553L1674K2793J4356P507K484j171m031o564
$$ 1199414 1249416 1298083 1343429 1382982 1414656 1437449 1451805 1459312 1461796 1460625 1456594 1450030
63349A450030r121j1700j3975j5905j8083k1036k4620k8384l1982l4707l5333
$$ 1450030 1440909 1429209 1415234 1399329 1381246 1360210 1335590 1307206 1275224 1240517 1205184
63338A205184l3406l0336k8196k7496k6938k5245k2370j9012j5714j2606r388
$$ 1205184 1171778 1141442 1113246 1085750 1058812 1033567 1011197 992185 976471 963865 954477
63327I54477n604j426K007L681L903L797M001M668O273R133J2333J4544J5869
$$ 954477 948873 947447 949454 953135 957038 960835 964836 969504 975777 984910 997243 1011787 1027656
63314A027656J7617K0051K1978K2930K4147K6535K9088L0510L1259L2674L4892
$$ 1027656 1045273 1065324 1087302 1110232 1134379 1160914 1190002 1220512 1251771 1284445 1319337
63303A319337L7008L8708M0143M0475L8046L2412K5107J8057J1921O287P79m471
$$ 1319337 1356345 1395053 1435196 1475671 1513717 1546129 1571236 1589293 1601214 1607501 1608280 1603809
63291A603809q991j2226j3893j4392j4686j5620j7497k0255k3699k7437l0903
$$ 1603809 1594818 1582592 1568699 1554307 1539621 1524001 1506504 1486249 1462550 1435113 1404210
63280A404210l3773l6201l8359l9891m0084l8794l6833l5172l3836l2005k9310
$$ 1404210 1370437 1334236 1295877 1255986 1215902 1177108 1140275 1105103 1071267 1039262 1009952
63269A009952k6507k4522k3159k1400j8844j6257j4548j3751j3298j2826j2312
$$ 1009952 983445 958923 935764 914364 895520 879263 864715 850964 837666 824840 812528
63258H12528j1629j0517r096q098q297r574j0781j0799r757q895r097r992j0671
$$ 812528 800899 790382 781286 773188 764891 755317 744536 733737 723980 715085 705988 695996 685325
63245F85325j0830j0730j0530j0300j0359j0817j0957r917p972o351n767n879
$$ 685325 674495 663765 653235 642935 632576 621759 610802 600885 592913 586562 580795 574916
63233E74916o209o744p365p627p394o952o173m457j990k34m97k453m645n922n927
$$ 574916 568707 561963 554598 546971 539577 532625 526452 521995 520005 519771 519274 516821 512176 506254 500327
63218E00327m873l537k913l242l755l853l955m545n061m609l328k134j451j070
$$ 500327 495454 491917 489004 485762 482007 478154 474199 469654 464593 459984 456656 454522 453071 452001
63204D52001j022j581k579l594m644n801o279n064k538l75N20P75R48L22j682
$$ 452001 450979 449398 446819 443225 438581 432780 426501 421437 418899 418524 419044 419819 420767 421089 419407
63189D19407l771l800j385J515K841K566K142K417K757K317J474J399K315L058
$$ 419407 415636 411836 410451 411966 414807 417373 419515 421932 424689 427006 428480 429879 432194 435252
63175D35252K754K229K893M476M994L215K55j759j962j057J7Q86J460J685J789
$$ 435252 438006 440235 443128 447604 452598 455813 456068 454309 452347 451290 451307 452193 453653 455338 457127
63160D57127K199K918L389L191K669K618L467M819N778N665M579L325K727K966
$$ 457127 459326 462244 465633 468824 471493 474111 477578 482397 488175 493840 498419 501744 504471 507437
63146E07437L690M630N786O948P526P242O714O900P974R206R959J0339J0750J1262
$$ 507437 511127 515757 521543 528491 536017 543259 549973 556873 564847 574053 584012 594351 605101 616363
63132F16363J1739J2219J2776J3257J3537J3752J3939J3692J2693J1450J0883
$$ 616363 628102 640321 653097 666354 679891 693643 707582 721274 733967 745417 756300
63121G56300J1255J1911J2073J1482J0364R290Q863Q886Q061N374J764o26j098
$$ 756300 767555 779466 791539 803021 813385 822675 831538 840424 848485 853859 855623 854997 853899
63108H53899j194k478m695o771q500j0154j1306j1378j0885j0863j1326j1464
$$ 853899 852705 850227 845532 838761 830261 820107 808801 797423 786538 775675 764349 752885
63096G52885j1096j0651r819p679m411j683p32j031j304j124r90j520k857m397
$$ 752885 741789 731138 721319 713640 709229 707546 706814 705783 704479 703355 702365 700845 697988 693591
63082F93591m944l830j936o56J29J820M486O114N325L466K728L240L570L185K734
$$ 693591 688647 684817 682881 682225 682354 684174 688660 694774 700099 703565 706293 709533 713103 716288 719022
63067G19022K305J319K39N55K654N024O204O364O363O358O157O059O465P169P844
$$ 719022 721327 722646 722885 723440 726094 731118 737322 743686 750049 756407 762564 768623 775088 782257 790101
63052G90101Q790J0386J2193J3356J3779J4218J5143J6057J6100J5073J3710J2877
$$ 790101 798891 809277 821470 834826 848605 862823 877966 894023 910123 925196 938906 951783
63040I51783J2472J1379Q853N738L636K839J986j4k582m596o072p856j0146j2256
$$ 951783 964255 975634 984487 990225 993861 996700 998686 998672 996090 991494 985422 977566 967420 955164
63026I55164j3554j3900j3367j2270j1279j0824j0556j0082r835j0331j0857j0137
$$ 955164 941610 927710 914343 902073 890794 879970 869414 859332 849497 839166 828309 818172
63014H18172q291o958p091p734p483o174m564l181k298k402l655n219n891n457
$$ 818172 809881 802923 795832 788098 780615 774441 769877 766696 764398 761996 758341 753122 747231 741774
63000G41774m807m692m814m315k923j452j005j662k245j782q00n56j244j892j932
$$ 741774 736967 732275 727461 723146 720223 718771 717766 716104 713859 712077 711277 710721 709477 707585 705653
62985G05653j756j503n74J039K182K119J717K146L190L920M145M101L502K162
$$ 705653 703897 702394 701820 702859 705041 707160 708877 711023 714213 718133 722278 726379 729881 732043
62971G32043J010J051J841K335K668L495M151L496K303K592M341N309M749M897
$$ 732043 733053 734104 735945 738280 740948 744443 748594 752090 754393 756985 761326 766635 771384 776281
62957G76281P441J0735J2351J2605J3414J4898J5523J4955J4498J4829J5333J5679
$$ 776281 783722 794457 806808 819413 832827 847725 863248 878203 892701 907530 922863 938542
62945I38542J6184J6448J5484J3726J3121J4474J6114J6105J4597J3016J2035
$$ 938542 954726 971174 986658 1000384 1013505 1027979 1044093 1060198 1074795 1087811 1099846
62934A099846J1347J0588R324O824K957j135m262o733r620j2920j5677j7734j9957
$$ 1099846 1111193 1121781 1131105 1137929 1140886 1139751 1135489 1128756 1119136 1106216 1090539 1072805 1052848
62921A052848k2555k4510k5267k5849k7376k9353l0411l0291k9917k9710k8913
$$ 1052848 1030293 1005783 980516 954667 927291 897938 867527 837236 807319 777609 748696
62910G48696k6858k4033k1485j9723j8644j8030j7604j6869j5467j3701j2347
$$ 748696 721838 697805 676320 656597 637953 619923 602319 585450 569983 556282 543935
62899E43935j1982j2577j3615j4292j3863j2181r889p859o567o252p171r045j0488
$$ 543935 531953 519376 505761 491469 477606 465425 455536 447677 441110 434858 427687 418642 408154
62886D08154j0015p831n829n335n634n368m619m483m953m633k963j512k116m265
$$ 408154 398139 390308 384479 379144 373510 368142 363523 359040 354087 349454 346491 344979 342863 338598
62872C38598n478m274j820l07l93r96j172j244j826k544k354r44Q11J807J804
$$ 338598 333120 328846 327026 326719 326326 325330 324158 322914 321088 318544 316190 315246 316057 317864 319668
62857C19668J452J516K222L274M380N613P034Q065P885O841O835R326J3111J5168
$$ 319668 321120 322636 324858 328132 332512 338125 345159 353224 361109 367950 374785 384111 397222 412390
62843D12390J4040J1375R558Q768P447N051K891K095J971R75j394m334o889q629
$$ 412390 426430 437805 447363 456131 463578 468629 471520 473615 475586 476561 475167 470833 463944 455315
62829D55315r521r799j0007j0585j1270j1328j0574r688r321r252q925q409q267
$$ 455315 445794 435995 425988 415403 404133 392805 382231 372543 363222 353970 345045 336636 328369
62816C28369q537q537p867o960o301n635m420k817j646j534k458l962n261n372
$$ 328369 319832 311295 303428 296468 290167 284532 280112 277295 275649 274115 271657 267695 262434 257062
62802B57062l868j624j20K14L15Q95J227L25j139j193R16L330L435Q50k102k994
$$ 257062 253194 251570 251450 251664 251979 252874 254101 254426 253287 252094 253010 256340 259775 260625 258523 255529
62786B55529j701J04J166J488J262K49j350k403k128j241j024j664k351k570k327
$$ 255529 253828 253932 255098 256586 257848 258097 256747 254344 252216 250975 249951 248287 245936 243366 241039
62771B41039j423K89J956K362J670J310J760J712J31j981k808j915l66P95J180
$$ 241039 239616 239905 241861 244223 245893 247203 248963 250675 250806 248825 246017 244102 243736 244531 245711
62756B45711O90n45j895k617k518j963j471j537k339l269l287k209j089r20j557
$$ 245711 246401 245856 243961 241344 238826 236863 235392 233855 231516 228247 224960 222751 221662 220742 219185
62741B19185k400l176l354j860J352M287M921L778K925K845K080P2j665j882j458
$$ 219185 216785 213609 210255 208395 209747 214034 218955 222733 225658 228503 230583 230655 228990 227108 225650
62726B25650j784k470k071m02J152J643J724K606M375N772N534L842K232J963
$$ 225650 223866 221396 219325 218923 220075 221718 223442 226048 230423 236195 241729 245571 247803 249766
62712B49766K715L197K849K252J872J356M41j78L99J936L167L191K300J370P49
$$ 249766 252481 255678 258527 260779 262651 264007 264448 264270 264669 266605 269772 272963 275263 276633 277382
62697B77382J9j292k928m000l881k807j601r91j285k289l201l039j668j63M36
$$ 277382 277401 276109 273181 269181 265300 262493 260892 259901 258616 256327 253126 250087 248419 248256 248692
62682B48692M10P39J443J480L78r71j457j005k37M61J109J767K383K830K931K855
$$ 248692 249102 249841 251284 252764 253142 252171 250714 249709 249472 249933 251042 252809 255192 258022 260953 263808
62666B63808L374N069P101P699O350M747M837O563Q397R585J0722J2148J3120
$$ 263808 267182 272251 279352 287051 293401 298148 302985 309548 317945 327530 338252 350400 363520
62653C63520J3100J3007J4260J6920J9607K1305K2461K3945K5682K7016K8026
$$ 363520 376620 389627 403887 420807 440414 461719 484180 508125 533807 560823 588849
62642E88849K9432L1162L2036L1501L0676L0873L1540L0777K7659K3046J8030
$$ 588849 618281 649443 681479 712980 743656 774529 806069 836846 864505 887551 905581
62631I05581J2587O242o01o680j1144j4536j8264k2889k7112k9154k9239k9631
$$ 905581 918168 924410 923809 917129 905985 891449 873185 850296 823184 794030 764791 735160
62619G35160l1548l3174l2167k9245k7356k7545k7700k5849k2732k0186j8589
$$ 735160 703612 670438 638271 609026 581670 554125 526425 500576 477844 457658 439069
62608D39069j7133j5537j4146j3096j2461j2597j3386j3649j2363j0004p851o362
$$ 439069 421936 406399 392253 379157 366696 354099 340713 327064 314701 304697 296846 290484
62596B90484n143m141l845m318m823m570l452k134j526j877k297j777p19n51j572
$$ 290484 285341 281200 277355 273037 268214 263644 260192 258058 256532 254655 252358 250581 249862 249311 247739
62581B47739k411k183j785k079k093o89J062J009r02k492k351j365r61j250j403
$$ 247739 245328 243145 241360 239281 237188 236499 237561 238570 237668 235176 232825 231460 230499 229249 227846
62566B27846q91P8P04J28j447k331j099J269K255Q99j186k150j998j743j662j294
$$ 227846 226955 227033 227737 227865 226418 224087 222988 224257 226512 227411 226225 224075 222077 220334 218672 217378
62550B17378m75M89J291J732J641J092M66Q7K8K88O88O91n4r69j047j98N58M23
$$ 217378 216903 217392 218683 220415 222056 223148 223614 223701 223729 224017 224705 225396 225342 224373 223326 223128 223686 224109
62532B24109k68o22j01J081J966J436l87j634p34J154J312p72k503j687O75K266
$$ 224109 223841 223219 223118 224199 226165 227601 227214 225580 224846 226000 227312 226540 224037 222350 223025 225291
62516B25291K606K794L043K396O04j313k576l419m082l951k351L09K499K768J007
$$ 225291 227897 230691 233734 236130 236734 235421 232845 229426 225344 221393 219042 219351 221850 224618 225625
62501B25625j294k267j457j50K26l29o91r3J094J744R61r03k078r87J742L667
$$ 225625 224331 222064 220607 220457 220683 220354 219663 219570 220664 222408 223369 222466 220388 219401 221143 224810
62485B24810L451K318J946K071J381n9q04j8J909M450P089Q554P567M808K774
$$ 224810 228261 230579 232525 234596 235977 235918 235114 235096 237005 241455 248544 257098 264665 269473 272247
62470B72247L144N241P408Q830R517R687R887J0877J2568J3855J4160J4427J5756
$$ 272247 275391 280632 288040 296870 306387 316074 325961 336838 349406 363261 377421 391848 407604
62457D07604J7763J9149J9439J9133J8480J7175J5270J3355J1557R170N711J796
$$ 407604 425367 444516 463955 483088 501568 518743 534013 547368 558925 568095 573806 575602
62445E75602j622m543p721j1215j3789j4352j3582j3367j4515j5907j6243j5793
$$ 575602 573980 569437 561716 550501 536712 522360 508778 495411 480896 464989 448746 432953
62433D32953j5509j5222j4036j2213j1070j0813j0069q200o551o380o812o289
$$ 432953 417444 402222 388186 375973 364903 354090 344021 335821 329270 322890 316078 309789
62421C09789n006m293m098l134j368m21j080k107k381k652l959n487n493l792
$$ 309789 304783 300490 296392 293258 291890 291469 290389 288282 285901 283249 279290 273803 268310 264518
62407B64518j817n78J00L43k49j435j930r53O55J550J493J060M46m45j093p67
$$ 264518 262701 262123 262223 262566 262317 260882 258952 257999 258654 260204 261697 262757 263203 262758 261665 260898
62391B60898J33K94n40r25L30K304L005J782q9r83l50J218K491K318P35o49j91
$$ 260898 261031 261325 260785 259860 260190 262494 265499 267281 267192 266209 265859 267077 269568 271886 272621 271972 271781
62374B71781J763L344L556L174K967K505J436O39R00J461J278R77J907L739M771
$$ 271781 273544 276888 280444 283618 286585 289090 290526 291165 292065 293526 294804 295781 297688 301427 306198
62359C06198M508M082L940L104J429P14K242M655N805N647N655O139O009M936
$$ 306198 310706 314788 318728 321832 323261 323975 326217 330872 336677 342324 347979 354118 360127 365063
62345C65063L940L635L440K963K835L516M438M984N507O612Q147R558J0627J1240
$$ 365063 369003 372638 376078 379041 381876 385392 389830 394814 400321 406933 415080 424638 435265 446505
62331D46505J1033J0043R245R520J0540J1453J2435J4422J7357J9765K0513K0213
$$ 446505 457538 467581 476826 486346 496886 508339 520774 535196 552553 572318 592831 613044
62319F13044K0318K1349K2680K3843K5333K7942L1637L5376L8046L9459M0431
$$ 613044 633362 654711 677391 701234 726567 754509 786146 821522 859568 899027 939458
62308I39458M1954M4515M8223N3187N9247O5404P0201P3071P5033P7524Q0579
$$ 939458 981412 1025927 1074150 1127337 1186584 1251988 1322189 1395260 1470293 1547817 1628396
62297A628396Q2598Q2017P8717P3453O6322N6546M3949L0016J6960N973l281j1701
$$ 1628396 1710994 1793011 1871728 1945181 2011503 2068049 2111998 2142014 2158974 2164947 2161666 2149965
62285B149965j9855k7973l6025m3482m9460n3582n6366n8442n9693n9588n8184
$$ 2149965 2130110 2102137 2066112 2022630 1973170 1919588 1863222 1804780 1745087 1685499 1627315
62274A627315n6182n4094n1827m9163m6181m3084l9986l7085l4691l2848l1171
$$ 1627315 1571133 1517039 1465212 1416049 1369868 1326784 1286798 1249713 1215022 1182174 1151003
62263A151003k9347k7589k6369k5830k5670k5560k5316k4608k2873j9905j6507
$$ 1151003 1121656 1094067 1067698 1041868 1016198 990638 965322 940714 917841 897936 881429
62252H81429j4126j3437j3493j2699j0658q591p737p940q122p659o601m956k677
$$ 881429 867303 853866 840373 827674 817016 808425 800688 792748 784626 776967 770366 765410 762733
62239G62733k81J334K022K576L531M499N051N571O586P767Q306P993P325O821
$$ 762733 762452 763786 765808 768384 771915 776414 781465 787036 793622 801389 809695 817688 825013 831834
62225H31834O890Q079J0598J3605J5758J6622J7019J7819J9003K0175K1350K2784
$$ 831834 838724 846803 857401 871006 886764 903386 920405 938224 957227 977402 998752 1021536
62213A021536K4454K6190K8087L0412L3260L6617M0556M5041M9620N3718N7264
$$ 1021536 1045990 1072180 1100267 1130679 1163939 1200556 1241112 1286153 1335773 1389491 1446755
62202A446755O0869O5289P0741P6556Q1424Q4007Q3587Q0212P4415O6935N8485
$$ 1446755 1507624 1572913 1643654 1720210 1801634 1885641 1969228 2049440 2123855 2190790 2249275
62191B249275M9357L9206K7606J4950K394r288k0374l1342m1754n0477n6774o0759
$$ 2249275 2298632 2337838 2365444 2380394 2382788 2373500 2353126 2321784 2280030 2229553 2172779 2112020
62179B112020o2942o3846o3956o3484o2124n9436n5513n0958m6277m1700l7489
$$ 2112020 2049078 1985232 1921276 1857792 1795668 1736232 1680719 1629761 1583484 1541784 1504295
62168A504295l3851l0482k6815k2994j9977j8336j7409j6161j4466j2907j1593
$$ 1504295 1470444 1439962 1413147 1390153 1370176 1351840 1334431 1318270 1303804 1290897 1279304
62157A279304r967p928o379o214p018p312o108l866j899j081j299j880k150j718
$$ 1279304 1269337 1261409 1255030 1248816 1241798 1234486 1228378 1224512 1222613 1221532 1220233 1218353 1216203 1214485
62143A214485o03P49J929L123M881P145R053J0004J0500J1379J2615J3547J4009
$$ 1214485 1213882 1214631 1216560 1219683 1224564 1231709 1240762 1250766 1261266 1272645 1285260 1298807 1312816
62130A312816J4446J4975J5330J5712J6777J8434J9650J9975K0346K1614K2998
$$ 1312816 1327262 1342237 1357567 1373279 1390056 1408490 1428140 1448115 1468461 1490075 1513073
62119A513073K2977K1379J9698J9473K1159K4453K8886L3877L8871M3778M8907
$$ 1513073 1536050 1557429 1577127 1596600 1617759 1642212 1671098 1704975 1743846 1787624 1836531
62108A836531N4225N8871O1553O1406N8635N4353M9549M3969L6442K6588J5813
$$ 1836531 1890756 1949627 2011180 2072586 2131221 2185574 2235123 2279092 2315534 2342122 2357935
62097B357935O110j770q449j4607k0362k5718l0835l5574l9437m2174m4001m5125
$$ 2357935 2364045 2362275 2353826 2339219 2318857 2293139 2262304 2226730 2187293 2145119 2101118 2055993
62085B055993m5319m4122m1253l7008l2430k8768k6309k4200k1766j9519j8042
$$ 2055993 2010674 1966552 1925299 1888291 1855861 1827093 1800784 1776584 1754818 1735299 1717257
62074A717257j6592j4056j0932q785p746o200l557j620k099l885m277k297N23
$$ 1717257 1700665 1686609 1675677 1666892 1659146 1652946 1649389 1647769 1645670 1641785 1637508 1635211 1635734
62061A635734K426L183L453L488L081K301J654J494J626J716J971K916M290M800
$$ 1635734 1638160 1641343 1644796 1648284 1651365 1653666 1655320 1656814 1658440 1660156 1662127 1665043 1669333 1674133
62047A674133L653J840R78J107Q67r2l33J133L208M247M349M857O229P571Q121
$$ 1674133 1677786 1679626 1680604 1681711 1682578 1682486 1682153 1683286 1686494 1690741 1695090 1699947 1706176 1713747 1721868
62032A721868Q197Q603R768J1544J3443J5085J6551J8107J9551K0512K1418K3228
$$ 1721868 1730065 1738668 1748436 1759980 1773423 1788508 1805059 1823166 1842717 1863229 1884647 1907875
62020A907875K5882K7982K8739K9157L0507L2514L4158L5319L6421L7262L7606
$$ 1907875 1933757 1961739 1990478 2019635 2050142 2082656 2116814 2152133 2188554 2225816 2263422
62009B263422L8296M0201M2419M3057M1590L8941L5477L0577K4202J7179R728
$$ 2263422 2301718 2341919 2384338 2427395 2468985 2507926 2543403 2573980 2598182 2615361 2625089
61998B625089J324p610j5518k1779k7471l3477l9323m4570m9686n4515n7454n7595
$$ 2625089 2626413 2618803 2603285 2581506 2554035 2520558 2481235 2436665 2386979 2332464 2275010 2217415
61986B217415n6420n5820n5361n3272m9465m5774m3372m1583l9371l6465l2772
$$ 2217415 2160995 2105175 2049814 1996542 1947077 1901303 1857931 1816348 1776977 1740512 1707740
61975A707740k8132k3295j9988j8996j8979j8042j6064j4468j3936j3459j2016
$$ 1707740 1679608 1656313 1636325 1617329 1598350 1580308 1564244 1549776 1535840 1522381 1510365
61964A510365j0267r732j0691j1923j2556j3114j4252j5401j5652j5301j5279
$$ 1510365 1500098 1490366 1479675 1467752 1455196 1442082 1427830 1412429 1396777 1381476 1366197
61953A366197j5372j4360j2069r910q939q552p790o896o639o880o827o234n457
$$ 1366197 1350825 1336465 1324396 1314486 1305547 1296995 1289205 1282309 1275670 1268790 1261963 1255729 1250272
61940A250272m733m205m413n768p726r251r994j0370j0643j0834j1327j2709j4765
$$ 1250272 1245539 1241334 1236921 1231153 1223427 1214176 1204182 1193812 1183169 1172335 1161008 1148299 1133534
61927A133534j6439j7061j7047j7108j7410j7813j8298j8705j8412j6939j4699
$$ 1133534 1117095 1100034 1082987 1065879 1048469 1030656 1012358 993653 975241 958302 943603
61916I43603j2647j1169r761p949o142n220n405n940n915n088l741k116l04J455
$$ 943603 930956 919787 910026 902077 895935 890715 885310 879370 873455 868367 864626 862510 862206 863661
61902H63661K885L960M784N235N221N217O092Q186J0914J3376J5084J6210J7539
$$ 863661 866546 870506 875290 880525 885746 890963 897055 905241 916155 929531 944615 960825 978364
61889I78364K0080K4053K8291L1363L3414L6044M0026M4041M6319M6838M7128
$$ 978364 998444 1022497 1050788 1082151 1115565 1151609 1191635 1235676 1281995 1328833 1375961
61878A375961M8294M9888N0543M9190M5974M2348L9983L9113L8361L6490L3701
$$ 1375961 1424255 1474143 1524686 1573876 1619850 1662198 1702181 1741294 1779655 1816145 1849846
61867A849846L0594K6644K0860J3681P118K876J081R08J696L192N365Q333J2203
$$ 1849846 1880440 1907084 1927944 1941625 1948743 1951619 1952700 1953608 1955304 1958496 1963861 1972194 1984397
61854A984397J6884K2206K8124L4412M0447M5626M9787N2766N3883N2563M9297
$$ 1984397 2001281 2023487 2051611 2086023 2126470 2172096 2221883 2274649 2328532 2381095 2430392
61843B430392M5141M0394L4620K8105K2311J8539J6693J5751J4944J4056J3088
$$ 2430392 2475533 2515927 2550547 2578652 2600963 2619502 2636195 2651946 2666890 2680946 2694034
61832B694034J2095J1111R946Q269O156M183K569L77l988j1197j9929k7639l2748
$$ 2694034 2706129 2717240 2727186 2735455 2741611 2745794 2748363 2748740 2744752 2733555 2713626 2685987 2653239
61819B653239l6231m0693m7444n4813n9707o0678n8909n6436n4116n1479m7872
$$ 2653239 2617008 2576315 2528871 2474058 2414351 2353673 2294764 2238328 2184212 2132733 2084861
61808B084861m3339l8664l4723l1548k8068k3182j7109j1067n557K84P275J4830
$$ 2084861 2041522 2002858 1968135 1936587 1908519 1885337 1868228 1857161 1851604 1851888 1859163 1873993
61796A873993K1685K7563L3335L9501M5265M9415N1791N3358N4755N5080N2564
$$ 1873993 1895678 1923241 1956576 1996077 2041342 2090757 2142548 2195906 2250661 2305741 2358305
61785B358305M6501L8236K9851K2106J4083M834n161j4259k0943k4634k5592k4448
$$ 2358305 2404806 2443042 2472893 2494999 2509082 2513916 2508755 2494496 2473553 2448919 2423327 2398879
61773B398879k1782j7861j2797o990j294L424O955R764J2267J4022J3688R913
$$ 2398879 2377097 2359236 2346439 2339449 2338155 2341579 2348534 2358298 2370565 2384587 2398275 2408188
61761B408188K429p688j8739k9316l8775m7205n5013o2012o6976o8581o7089o4508
$$ 2408188 2410617 2402929 2384190 2354874 2316099 2268894 2213881 2151869 2084893 2016312 1949223 1884715
61749A884715o2563o1077n8864n5596n1862m7743m2633l6620l0937k6548k3052
$$ 1884715 1822152 1761075 1702211 1646615 1594753 1547010 1504377 1467757 1436820 1410272 1387220
61738A387220j9494j5714j2195r019n681j903J873M883O757P867R099J1196J4191
$$ 1387220 1367726 1352012 1339817 1330798 1325117 1323214 1325087 1329970 1336727 1344594 1353693 1364889 1379080
61725A379080J7494K0572K3373K6147K9028L1940L4837L7875M1395M5674N0565
$$ 1379080 1396574 1417146 1440519 1466666 1495694 1527634 1562471 1600346 1641741 1687415 1737980
61714A737980N5486N9762O2981O5183O7049O9873P4654Q0806Q6223Q9233R0221
$$ 1737980 1793466 1853228 1916209 1981392 2048441 2118314 2192968 2273774 2359997 2449230 2539451
61703B539451R0771R1554R1661Q9806Q5555P9436P2430O5225N7428M7761L5646
$$ 2539451 2630222 2721776 2813437 2903243 2988798 3068234 3140664 3205889 3263317 3311078 3346724
61692C346724K2192Q859m362j8311l2545m5373n6031o5291p3616q0306q5200q9566
$$ 3346724 3368916 3377775 3373413 3355102 3322557 3277184 3221153 3155862 3082246 3001940 2916740 2827174
61680B827174r4033r6950r6267r2452q8021q4679q2161p9605p6644p3158o9146
$$ 2827174 2733141 2636191 2539924 2447472 2359451 2274772 2192611 2113006 2036362 1963204 1894058
61669A894058o5060o1371n7797n3777m9751m6934m5686m5015m3965m2462m0548
$$ 1894058 1828998 1767627 1709830 1656053 1606302 1559368 1513682 1468667 1424702 1382240 1341692
61658A341692l7899l4861l2811l2362l1891k9336k5312k2881k3784k6220k7264
$$ 1341692 1303793 1268932 1236121 1203759 1171868 1142532 1117220 1094339 1070555 1044335 1017071
61647A017071k6434k5499k5292k4574k2404j9984j9008j9218j8967j7608j5938
$$ 1017071 990637 965138 939846 915272 892868 872884 853876 834658 815691 798083 782145
61636G82145j4590j3405j2458j2230j2419j1854j0190q575p971p965p854p767
$$ 782145 767555 754150 741692 729462 717043 705189 694999 686424 678453 670488 662634 654867
61624F54867p720o761m474k444k559m296n345m817m160m615n384n008l426j866
$$ 654867 647147 640386 635912 633468 630909 626613 621268 616451 612291 607676 602292 597284 593858 591992
61610E91992j389k211l794n080n193m352l676l750l928l399k274j101L8J204J959
$$ 591992 590603 588392 584598 579518 574325 569973 566297 562547 558619 555220 552946 551845 551883 553087 555046
61595E55046J820J213J218K314L874M939N152M939M970N487N997N871N197M671
$$ 555046 556866 558079 559297 561611 565485 570424 575576 580515 585485 590972 596969 602840 608037 612708
61581F12708M552M317L567K546J313p23l627o094p003p238q396r902r340o058
$$ 612708 617260 621577 625144 627690 629003 628280 624653 618559 611556 604318 595922 586020 576680 570622
61567E70622k698k027l645n245n846o081o035m997l378k820l729m300l073j227
$$ 570622 567924 565897 562252 557007 551161 545080 539045 534048 530670 527850 524121 519821 516748 515521
61553E15521j022k748m563n090m937n471p027q716r521r052p491n127k264L60
$$ 515521 514499 511751 507188 502098 497161 491690 484663 475947 466426 457374 449883 444756 442492 442852
61539D42852J437Q0k985n755o883o704o100n143l571j856q03l39K69J193J958
$$ 442852 444289 444369 441384 435629 428746 422042 415942 410799 407228 405372 404569 404230 404499 405692 407650
61524D07650K502L264M050L875K487J177J379K881M116M125L606L940N459P022
$$ 407650 410152 413416 417466 421341 423828 425005 426384 429265 433381 437506 441112 445052 450511 457533
61510D57533P357O535N695N460N372N125N415O839Q647R579R559R469R687R877
$$ 457533 464890 471425 477120 482580 487952 493077 498492 505331 513978 523557 533116 542585 552272 562149
61496E62149J0014J0337J0430R697Q638Q265Q225P098M859L233L028K881J643
$$ 562149 572163 582500 592930 602627 611265 619530 627755 634853 639712 642945 645973 648854 650497
61483F50497K96J12M74J48m29RJ259K090K505L583N137N344L187r4k429k820j555
$$ 650497 650793 650905 651379 651527 651098 651107 652366 654456 656961 660544 665681 671025 674212 674118 671689 668869 667314
61466F67314M10J966K548K697L314M310M775M488M391N290O915Q624J0318J2257
$$ 667314 667724 669690 672238 674935 678249 682559 687334 691822 696213 701503 708418 717042 727360 739617
61452G39617J4455J6585J8176J8818J8654J8667J9976K2695K5922K8836L1294
$$ 739617 754072 770657 788833 807651 826305 844972 864948 887643 913565 942401 973695
61441I73695L3317L4691L5291L5423L5585L6143L7144L8100L8074L6452L3589
$$ 973695 1007012 1041703 1076994 1112417 1148002 1184145 1221289 1259389 1297463 1333915 1367504
61430A367504L0306K6960K3434J9739J5990J1953P381K735j135l973o196q146
$$ 1367504 1397810 1424770 1448204 1467943 1483933 1495886 1503267 1506002 1504867 1500894 1494698 1486552
61418A486552r821j1175j1987j1711j0239q498p330o206m235k149j710l001m012
$$ 1486552 1476731 1465556 1453569 1441858 1431619 1423121 1415791 1409585 1405350 1403201 1401491 1398490 1394478
61405A394478l445k433k726m360o129p293p835p815p472p397p715p625o359m096
$$ 1394478 1391033 1388600 1385874 1381514 1375385 1368092 1360257 1352442 1344970 1337573 1329858 1322233 1315874 1311778
61391A311778j262K244O384J0239J2915J4656J6163J7300J7443J6571J5032J2622
$$ 1311778 1310516 1312760 1319144 1329383 1342298 1356954 1373117 1390417 1407860 1424431 1439463 1452085
61379A452085R121N558L581L385L330K044P4j138j193r34r11l68J850N540Q834
$$ 1452085 1461206 1466764 1470345 1473730 1477060 1479104 1479178 1478040 1476847 1475913 1475002 1474634 1476484 1482024 1490858
61364A490858J0042R568R296J0059J0547Q953M909p20o950j2680j6474j7651j7379
$$ 1490858 1500900 1510468 1519764 1529823 1540370 1549323 1554232 1553512 1546562 1533882 1517408 1499757 1482378
61351A482378j7459j8107j8033j6819j5805j6132j6985j6626j4631j2232j0773
$$ 1482378 1464919 1446812 1428779 1411960 1396155 1380023 1363038 1346412 1331781 1319549 1308776
61340A308776j0534j0934j1256j0957r770p784n337k641L89L687O534Q013Q229
$$ 1308776 1298242 1287308 1276052 1265095 1255325 1247541 1242204 1239563 1239952 1243639 1250173 1258186 1266415
61327A266415Q610J0325J2794J4570J5624J7508K0895K4261K5898K6317K7281
$$ 1266415 1275025 1285350 1298144 1312714 1328338 1345846 1366741 1391002 1416900 1443217 1470498
61316A470498K9108L0373L0183K9282K8614K8086K7283K6409K5706K4575K2041
$$ 1470498 1499606 1529979 1560162 1589444 1618058 1646144 1673427 1699836 1725542 1750117 1772158
61305A772158J7854J2654P293K388j776n288q491j1551j4242j6186j7141j7033
$$ 1772158 1790012 1802666 1809959 1812347 1810571 1805283 1796792 1785241 1770999 1754813 1737672 1720639
61293A720639j6140j5278j5301j6169j6905j6878j6659j7239j8602j9649j9494
$$ 1720639 1704499 1689221 1673920 1657751 1640846 1623968 1607309 1590070 1571468 1551819 1532325
61282A532325j8410j7387j6980j6730j5654j3240r937o850m999m792n806o891
$$ 1532325 1513915 1496528 1479548 1462818 1447164 1433924 1423987 1417137 1412138 1407346 1401540 1394649
61270A394649o904n765m494l817l108j498L64Q12l69j247j72K012L251L076K830
$$ 1394649 1387745 1381980 1377486 1373669 1370561 1369063 1369427 1370239 1369870 1368623 1368451 1370463 1373714 1376790 1379620
61255A379620L359L804L230K277K296L240L557K359R24J356L986O791P526N825
$$ 1379620 1382979 1386783 1390013 1392290 1394586 1397826 1401383 1403742 1404666 1406022 1410008 1416799 1424325 1430150
61241A430150K840n26m167p837j0756j2428j3112j3172j2691j2001j1785j2040
$$ 1430150 1432990 1432464 1428297 1420460 1409704 1397276 1384164 1370992 1358301 1346300 1334515 1322475
61229A322475j1684r942p533n630m280k807j282l23L71J864M153N837O026N531
$$ 1322475 1310791 1300849 1293316 1287686 1283406 1280599 1279317 1278994 1279365 1281229 1285382 1291219 1297245 1302776
61215A302776N614O534P914R595J1333J2474J2790J2968J3478J3682J3056J2703
$$ 1302776 1308390 1314924 1322838 1332433 1343766 1356240 1369030 1381998 1395476 1409158 1422214 1434917
61203A434917J4308J7871K1666K4441K6546K8725L0773L1741L0843K8032K4312
$$ 1434917 1449225 1467096 1488762 1513203 1539749 1568474 1599247 1630988 1661831 1689863 1714175
61192A714175K1503K0888K1991K3365K4480K5772K6903K6455K3849K0232J6596
$$ 1714175 1735678 1756566 1778557 1801922 1826402 1852174 1879077 1905532 1929381 1949613 1966209
61181A966209J2272O509N57l358m806n439o587p937q780r316r974j0327r515p580
$$ 1966209 1978481 1984990 1985547 1982189 1977383 1971944 1965357 1957420 1948640 1939324 1929350 1919023 1909508 1901928
61167A901928n746n316o565q818j1480j4790j9394k5239l1309l6485m0323m2818
$$ 1901928 1896182 1890866 1884301 1875483 1864003 1849213 1829819 1804580 1773271 1736786 1696463 1653645
61155A653645m3865m3375m1627l9270l7110l5853l5440l4635l2147k8439k5426
$$ 1653645 1609780 1566405 1524778 1485508 1448398 1412545 1377105 1342470 1310323 1281884 1256458
61144A256458k3883k2388j9728j6978j5653j4832j2138p223k217J276L699N706
$$ 1256458 1232575 1210187 1190459 1173481 1157828 1142996 1130858 1123635 1121418 1122694 1126393 1132099
61132A132099O757O266M716K741L87k105m033n335o632p617o989m850l373l788
$$ 1132099 1138856 1145122 1149838 1152579 1152966 1150861 1146828 1141493 1134861 1127244 1120255 1115405 1112032 1108244
61118A108244m442l494k059k456m450n656n128m102l324k066k09R49P88M59R43
$$ 1108244 1103802 1100308 1098249 1095793 1091343 1085687 1080559 1076457 1073133 1071067 1070858 1071807 1072595 1073054 1073997
61103A073997J599J649J721K698M054M624M296L804L429K955K571K710L232L585
$$ 1073997 1075596 1077245 1078966 1081664 1085718 1090342 1094638 1098442 1101871 1104826 1107397 1110107 1113339 1116924
61089A116924L651L597K967Q27l038p588j1508j4382j6751j9218k1624k3197k3414
$$ 1116924 1120575 1124172 1127139 1127966 1124928 1117340 1105832 1091450 1074699 1055481 1033857 1010660 987246
61076I87246k2634k1555k0315j8614j6601j4926j3765j2698j1829j2066j3492
$$ 987246 964612 943057 922742 904128 887527 872601 858836 846138 834309 822243 808751
61065H08751j4463j3466j1275r986j0192j0525j0034r517r901j0539j0083q290
$$ 808751 794288 780822 769547 759561 749369 738844 728810 719293 709392 698853 688770 680480
61053F80480o043m080k507j339p13o93j236k111k446j086J762L849L021j24l056
$$ 680480 674437 670357 667850 666511 665798 665105 663869 661758 659312 658226 659988 663837 666858 666734 663678
61038F63678m696o392r074j1314j1513j0647j0896j2194j2249j0096p621o785
$$ 663678 658982 652590 643516 632202 620689 610042 599146 586952 574703 564607 556986 550201
61026E50201o960o253m357k577j638r19J40J110J373Q54k10j482k121j148J217
$$ 550201 543241 536988 532631 530054 528416 527497 527637 528747 530120 530974 530764 529282 527161 526013 527230
61011E27230L315L915L715M121M931M615K939J884L205O009P881P766O610N488
$$ 527230 530545 534460 538175 542296 547227 551842 554781 556665 559870 565879 573760 581526 588136 593624
60997E93624M489L543K961K649J867M32p51j078j190j737k085j309K69J751L132
$$ 593624 598113 601656 604617 607266 609133 609565 608814 607736 606546 604809 602724 601415 601684 603435 606567
60982F06567M686N486M280J726l0p6O57J674L873P527J1149J3466J5052J6864
$$ 606567 611253 616739 621019 622745 622715 622639 623296 624970 628843 636370 647519 660985 676037 692901
60968F92901J8542J9499K0627K3364K7778L2820L7870M2927M8118N4144O2365
$$ 692901 711443 730942 751569 774933 802711 835531 873401 916328 964446 1018590 1080955
60957A080955P3087Q4793R6572J10276J28163J49278J70877J93046K18024K42627
$$ 1080955 1154042 1238835 1335407 1445683 1573846 1723124 1894001 2087047 2305071 2547698
60947B547698K53742K35534J83495J11565M4420J265j4304j0169N556K8037M8329
$$ 2547698 2801440 3036974 3220469 3332034 3376454 3377719 3363415 3353246 3358802 3386839 3435168
60936C435168M9110J5422m9329j22556j79926k11678k22171k19081k07324j90433
$$ 3435168 3484278 3499700 3450371 3327815 3147889 2936211 2714040 2494959 2287635 2097202
60926B097202j71862j53512j35583j18617j03854r1350p9690o8232n8090n0247
$$ 2097202 1925340 1771828 1636245 1517628 1413774 1322424 1242734 1174502 1116412 1066165
60916A066165m4105l8704l4239l1354k9637k7810k5185k2169j9344j6696j3985
$$ 1066165 1022060 983356 949117 917763 888126 860316 835131 812962 793618 776922 762937
60905G62937j1550j0162r930r807q730o971n652n019m289l260k839l324l386j919
$$ 762937 751387 741225 731295 721488 712758 705787 700135 695116 690827 687567 684728 681404 678018 676099
60891F76099Q8Q37K58k81l91j116k802m148m012l046k735l537m707n485n872o493
$$ 676099 676187 677024 677282 677001 676610 675494 672692 668544 664532 661486 658751 655214 650507 645022 639150 632657
60875F32657q058j0641j3199j4179j3013j0739q864p904p323o564n575m441l138
$$ 632657 624599 613958 600759 586580 573567 562828 553964 546060 538737 532173 526598 522157 519019
60862E19019j937j572k429l637l705k288p63m52q43m63Q67J891J993J967K351
$$ 519019 517082 515510 513081 509444 505739 503451 502688 502236 501393 500930 501797 503688 505681 507648 509999
60847E09999K491K056K039K965L395J916k57n92J239L006K975J504m87k662m464
$$ 509999 512490 514546 516585 519550 522945 524861 524604 524012 525251 528257 531232 532736 532249 529587 525123
60832E25123n027m723n218o984q219p462n879n466o082o049n135m947o202p346
$$ 525123 520096 515373 510155 503171 494952 487490 481611 476145 470063 464014 458879 453932 447730 440384
60818D40384o569m215k230j772k094j810o42L95M12j87k47P26K198L464M162M127
$$ 440384 433815 429600 427370 425598 423504 421694 421052 421447 421859 421672 421425 422151 424349 427813 431975 436102
60802D36102L536L336M427O036N983L430M31l16J321K974K722R29o52o81P76K193
$$ 436102 439638 442974 447401 453437 459420 462850 463281 462965 464286 467260 469982 470911 470259 469578 470354 472547
60786D72547J725p31k834k175P09K833K422P78RK70K27o28j538k148l246n425
$$ 472547 474272 473541 470707 468532 469241 472074 474496 475274 475283 475553 475780 475152 473614 471466 468220 462795
60770D62795p798q801q062o808o319o446o069m726l141k200k055k445l246m156
$$ 462795 454997 446196 438134 431326 425007 418561 412492 407766 404625 402425 400370 397925 394679 390523
60756C90523m447l762k830k582k808k467j302l05l18r21j012r2J300K132J800
$$ 390523 386076 382314 379484 376902 374094 371627 370325 370020 369702 368781 367769 367677 368977 371109 372909
60741C72909P73K62R00J985K448K220J952J737J161M97O01J438J965J876K269
$$ 372909 373682 373944 374844 376829 379277 381497 383449 385186 386347 386844 387445 388883 390848 392724 394993
60726C94993L871N667O137N121L600K403J892K269L293M123M188L750L100J986
$$ 394993 398864 404531 410668 415789 419389 421792 423684 425953 429246 433369 437557 441307 444407 446393
60712D46393N63j04N33J378J219M99K45Q3q61j733q23J421K491J365j75m66k58
$$ 446393 446956 446852 447385 448763 449982 450481 450726 450809 449948 448215 447392 448813 451304 452669 452494 452028 451770
60695D51770q74j769j523j57J035J294Q18J7n35PJ703L098K611L60k205m102n194
$$ 451770 450896 449127 447604 447447 448482 449776 450594 450611 450076 450083 451786 454884 457495 457855 455650 451548 446354
60678D46354n382m634l666l376l572l246k139j056o06o14q28j317j915k086j617
$$ 446354 440972 436338 432672 429296 425724 422478 420339 419283 418677 418063 417235 415918 414003 411917 410300
60663D10300q46j64J60k91j539k454j587Q29K707K459P98m33n04j91m31j350k445
$$ 410300 409454 409290 409450 409159 407620 405166 403579 404408 407115 409574 410372 409939 409435 409244 408813 407463 405018
60646D05018l112l050k476j979j961k335k781l081l159l095l124l375l597l527
$$ 405018 401906 398856 396380 394401 392440 390105 387324 384243 381084 377989 374865 371490 367893 364366
60632C64366l423l589l498k218N0J835K156J606J187R49N76M45R54J358M92j427
$$ 364366 360943 357354 353856 351638 351688 353523 355679 357285 358472 359421 359997 360442 361396 362754 363246 361819
60616C61819k949l358l361l584l462k266n04O02O58M79R63K088L039L096K398
$$ 361819 358870 355512 352151 348567 345105 342839 342335 342937 343595 344074 345037 347125 350164 353260 355658
60601C55658J957K702M351N394M576K377P23J207L605O203P436P198O683P040
$$ 355658 357615 360317 364668 370062 374638 377015 377738 378945 382550 388753 396189 403387 410070 417110
60587D17110Q184Q933Q319O649N072M199L516K378J200R80J687J959Q17r73j949
$$ 417110 425294 434227 442546 449195 454267 458466 461982 464360 465560 466540 468227 470186 471003 470030 468081
60572D68081j960k023k422k230j046l1l36j425k031k094k438k923k497j145k14
$$ 468081 466121 464098 461676 459446 458400 458369 458033 456608 454577 452483 450045 447122 444625 443480 443266
60557D43266j93M01K750N497O172M343J933M77m19j748l524n082n847n177k592
$$ 443266 443073 443474 446224 451721 457893 462236 464169 464646 464227 462479 458955 453873 448026 442849 440257
60542D40257R78L140K470N20N3J564K938K592J405J024J607K220K511K875L376
$$ 440257 441235 444375 446845 447365 447418 448982 451920 454512 455917 456941 458548 460768 463279 466154 469530
60527D69530L594L435L378L911N149O787Q011P902O525N190M931N173M890M653
$$ 469530 473124 476559 479937 483848 488997 495784 503795 511697 518222 523412 528343 533516 538406 543059
60513E43059O064R118J1624J1914J1022J1253J3397J6308J8697K0312K1490K2611
$$ 543059 549123 558241 569865 581779 592801 604054 617451 633759 652456 672768 694258 716869
60501G16869K4180K6760L0440L4698L9016M3519M8805N5138O1962O8363P4303
$$ 716869 741049 767809 798249 832947 871963 915482 964287 1019425 1081387 1149750 1224053
60490A224053Q1226R0922J03545J17186J29672J40317J49239J55258J55425J47010
$$ 1224053 1305279 1396201 1499746 1616932 1746604 1886921 2036160 2191418 2346843 2493853
60480B493853J29535J04539P3935L9316K839l2089o1792q4037r8559j06099j07602
$$ 2493853 2623388 2727927 2801862 2841178 2844017 2811928 2750136 2666099 2567540 2461441 2353839
60469B353839j04463r8758r2224q5150p6907o7582n8342m9898m1417l1616k0567
$$ 2353839 2249376 2150618 2058394 1973244 1896337 1828755 1770413 1720515 1679098 1647482 1626915
60458A626915r571P38J1264K2984L5238M6487N6689O7886Q1734R7172J11384J22541
$$ 1626915 1617344 1618082 1629346 1652330 1687568 1734055 1790744 1858630 1940364 2037536 2148920 2271461
60446B271461J30264J33496J29694J17105R6805P1491M3143J3243j5371l8620
$$ 2271461 2401725 2535221 2664915 2782020 2878825 2950316 2993459 3006702 2991331 2952711
60436B952711n3486n9437n7615m9706l7563k2741n836J3170L3856N5272P6796
$$ 2952711 2899225 2839788 2782173 2732467 2694904 2672163 2666327 2679497 2713353 2768625 2845421
60425B845421R8110J18246J35497J48312J55303J54308J42613J18758Q3663L9953
$$ 2845421 2943531 3061777 3197274 3345586 3500889 3655197 3797810 3916568 4000231 4040184
60415D040184q960n9151j06547j47613j79423j99838k08921k09781k06236j99498
$$ 4040184 4031224 3972073 3865526 3717913 3538490 3338652 3129731 2919950 2713714 2514216
60405B514216j88700j74488j59654j45787j31844j17225j03835r3389q4794p6254
$$ 2514216 2325516 2151028 1991374 1845587 1713743 1596518 1492683 1399294 1314500 1238246
60395A238246o8179o1757n6223n0158m4351m0570l8166l4754l0085k6487k5201
$$ 1238246 1170067 1108310 1052087 1001929 957578 917008 878842 844088 814003 787516 762315
60384G62315k4732k3447k1640k0234j9235j8343j7590j6707j5032j2696j0733
$$ 762315 737583 714136 692496 672262 653027 634684 617094 600387 585355 572659 561926
60373E61926r665r117r057j0022j1656j2402j1303r057o860n277m570m871n466
$$ 561926 552261 543144 534087 524065 512409 500007 488704 479647 472787 467510 462940 458069 452603
60360D52603n061l333j374k04J46j51j208k680l689l967m006l820k780j050J32
$$ 452603 447542 444209 442835 442631 442777 442626 441418 438738 435049 431082 427076 423256 420476 419426 419558
60345D19558J08m51q47j080q95K98J935K320R83m68p29m46n42m78N18J909K882
$$ 419558 419666 419215 418368 417288 416393 416691 418626 420946 421929 421461 420732 420286 419744 419266 419784 421693 424575
60328D24575L621M277M046K770K027K908L956L285J636J114J798K006J455J672
$$ 424575 428196 432473 436519 439289 441316 444224 448180 451465 453101 454215 456013 458019 459474 461146
60314D61146L137M289L962K881K068J328J79r27j240q82o49r89j517j420l95P51
$$ 461146 464283 468572 472534 475415 477483 478811 478990 478063 476823 475941 475292 474303 472786 471366 470971 471722
60298D71722Q94K50L50J840L320L254J920L71j307l097l735k378o35n79j344m05
$$ 471722 472616 472866 473216 475056 478376 481630 483550 483921 482614 479517 475782 473404 472769 472190 470846 470441
60282D70441K037L027J500j72k13j2j151k545k672k369l057l883l276k087k454
$$ 470441 472478 475505 477005 476833 476620 476608 475457 472912 470240 467871 464814 460931 457655 455568 453114
60267D53114m075m396k586p81q23j860k180j777j705j992j646m35O55J027J576
$$ 453114 449039 444643 442057 441276 440453 438593 436413 434636 432931 430939 429293 428858 429513 430540 432116
60252D32116L509O485Q787R346Q727P723O097L670J620R73L71k514p139j0078
$$ 432116 435625 442110 450897 460243 468970 476693 482790 486460 488080 489053 489424 486910 479771 469693
60238D69693r612q064q094q794p675n042l477l636l373j377P24O76j510l832m301
$$ 469693 460081 452017 443923 435129 427454 422412 418935 415299 411926 410549 411273 411949 410439 406607 402306
60223D02306k191J554M714N509M425L449L494L766L702L942M756N108M287L316
$$ 402306 400115 401669 406383 411892 416317 419766 423260 427026 430728 434670 439426 444534 448821 452137
60209D52137L492M442M783M142L453L522M160M539L873K183O72O70J754J886J66
$$ 452137 455629 460071 464854 468996 472449 475971 480131 484670 488543 490726 491398 492068 493822 495708 495874
60194D95874j705j723m13J52o40j541j784j950k293j880k4K562M700N928O290
$$ 495874 494169 492446 492033 492185 491545 490004 488220 486270 483977 482097 482073 484635 489335 495263 501553
60179E01553N832M916M403M974O561Q722J1015J2884J3873J4207J4650J5554J6686
$$ 501553 507385 512301 516704 521678 528239 536961 547976 560860 574733 588940 603590 619144 635830
60166F35830J7996J9784K1932K3814K5247K6662K8065K8802K8768K8824K9495
$$ 635830 653826 673610 695542 719356 744603 771265 799330 828132 856900 885724 915219
60155I15219L0246L0654L1019L1063K9283K5049K0273J7450J6540J5410J2962
$$ 915219 945465 976119 1007138 1038201 1067484 1092533 1112806 1130256 1146796 1162206 1175168
60144A175168J0198Q141O373M155J736q0r19r07k67Q25K371M540P136R300J0426
$$ 1175168 1185366 1193507 1199880 1204035 1205771 1205691 1204772 1203865 1203598 1204423 1206794 1211334 1218470 1227770 1238196
60129A238196J1261J3218J6640K0469K3705K6421K9274L2619L6116L8712L9276
$$ 1238196 1249457 1262675 1279315 1299784 1323489 1349910 1379184 1411803 1447919 1486631 1525907
60118A525907L7943L6408L5987L5833L4235L1221K8392K6337K3963K0615J7175
$$ 1525907 1563850 1600258 1636245 1672078 1706313 1737534 1765926 1792263 1816226 1836841 1854016
60107A854016J4561J2597J0883R328P368M186L46k534m385p157j1640j5713j7299
$$ 1854016 1868577 1881174 1892057 1901385 1908753 1912939 1913285 1910751 1906366 1899209 1887569 1871856 1854557
60094A854557j7297j7679j8204j7240j4848j2643j1127r361p141n327m069k603
$$ 1854557 1837260 1819581 1801377 1784137 1769289 1756646 1745519 1736158 1729017 1723690 1719621 1717018
60082A717018j023m47j136k128l033m544o740q493r202r578j0067r859q361o384
$$ 1717018 1715995 1715548 1714412 1712284 1709251 1704707 1697967 1689474 1680272 1670694 1660627 1650768 1642407 1636023
60068A636023m845l239n17L220O972J0341J3852J7902K2106K5756K8659L1485
$$ 1636023 1631178 1627939 1627422 1630642 1637614 1647955 1661807 1679709 1701815 1727571 1756230 1787715
60056A787715L5243M0202M5589N0757N6200O2527O8875P3645P6735P9619Q2875
$$ 1787715 1822958 1863160 1908749 1959506 2015706 2078233 2147108 2220753 2297488 2377107 2459982
60045B459982Q5183Q5327Q3659Q0645P5464O7429N7691M7832L7466K4993J0497
$$ 2459982 2545165 2630492 2714151 2794796 2870260 2937689 2995380 3043212 3080678 3105671 3116168
60034C116168l890j6776k9061m1960n4701o5079p1727p4943p5701p4707p2477
$$ 3116168 3112278 3095502 3066441 3024481 2969780 2904701 2832974 2758031 2682330 2607623 2535146
60023B535146o9528o6119o2117n7539n3011m9177m5717m1505l6027l0168k5085
$$ 2535146 2465618 2399499 2337382 2279843 2226832 2177655 2131938 2090433 2054406 2024238 1999153
60012A999153k0838j6861j3475j1799j1898j2084j0737q239o384o215p156q099
$$ 1999153 1978315 1961454 1947979 1936180 1924282 1912198 1901461 1893222 1886838 1880623 1873467 1865368
60000A865368q622q934r227r601j0532j2743j6115j9042j9762j8666j8376k0722
$$ 1865368 1856746 1847812 1838585 1828984 1818452 1805709 1789594 1770552 1750790 1732124 1713748 1693026
59988A693026k4239k5874k4831k3349k3490k4542k4307k1894j8368j5233j3205
$$ 1693026 1668787 1642913 1618082 1594733 1571243 1546701 1522394 1500500 1482132 1466899 1453694
59977A453694j1944j0365p406l092J466N444R128J2995J6660J9571K2253K5770
$$ 1453694 1441750 1431385 1423979 1420887 1422353 1427797 1436925 1449920 1466580 1486151 1508404 1534174
59965A534174L0093L3847L5897L6470L6539L6494L5728L3458K9769K5760K2386
$$ 1534174 1564267 1598114 1634011 1670481 1707020 1743514 1779242 1812700 1842469 1868229 1890615
59954A890615J9319J5447J0517N565J376k650p414j2477j6366j8252j8530j7919
$$ 1890615 1909934 1925381 1935898 1941463 1942839 1940189 1932775 1920298 1903932 1885680 1867150 1849231
59942A849231j6732j5144j3504j2134j1064r995q392n800k344J379M979Q477J1632
$$ 1849231 1832499 1817355 1803851 1791717 1780653 1770658 1762266 1756466 1754122 1755501 1760480 1768957 1780589
59929A780589J3843J5384J7877K2555K8412L3177L5922L7633L9275M0482M0410
$$ 1780589 1794432 1809816 1827693 1850248 1878660 1911837 1947759 1985392 2024667 2065149 2105559
59918B105559L8818L5825L1497K6196K0717J5518J0326M935j87m624q802j3309
$$ 2105559 2144377 2180202 2211699 2237895 2258612 2274130 2284456 2289391 2289204 2284580 2275778 2262469
59906B262469j7820k1417k3736k5142k5796k5312k3531k0932j7979j4486j0221
$$ 2262469 2244649 2223232 2199496 2174354 2148558 2123246 2099715 2078783 2060804 2046318 2036097
59895B036097n762k068P88L843P899J2505J6649K0055K3087K5623K6853K6438
$$ 2036097 2030335 2028267 2029055 2032898 2040797 2053302 2069951 2090006 2113093 2138716 2165569 2192007
59883B192007K5254K4597K4969K5751K5889K4777K2812K1020J9724J7826J4256
$$ 2192007 2217261 2241858 2266827 2292578 2318467 2343244 2366056 2387076 2406800 2424626 2438882
59872B438882R978P376P292P971P685P123Q016J0442J3092J5603J8887K3200K7606
$$ 2438882 2448860 2456236 2463528 2471499 2479184 2486307 2494323 2504765 2517857 2533460 2552347 2575547 2603153
59859B603153L1584L5782M0543M4834M7317M7740M6734M4819M2061L8239L3064
$$ 2603153 2634737 2670519 2711062 2755896 2803213 2850953 2897687 2942506 2984567 3022806 3055870
59848C055870K6658J9820J3281O769m56q249j5772k2877l0017l6625m1091m2916
$$ 3055870 3082528 3102348 3115629 3122398 3121942 3113693 3097921 3075044 3045027 3008402 2967311 2924395
59836B924395m3549m4309m4730m3851m1795l8974l5016k9939k5271k2294j9924
$$ 2924395 2880846 2836537 2791807 2747956 2706161 2667187 2632171 2602232 2576961 2554667 2534743
59825B534743j6255j1686q471p232o061l416n5K633M540O091P049P179P045O971
$$ 2534743 2518488 2506802 2498331 2491099 2485038 2481622 2481567 2484200 2488740 2494831 2501880 2509059 2516104 2523075
59811B523075O038L299n14l630n362o649q692j1731j5033j7475j8332j8020j7840
$$ 2523075 2529113 2532412 2531898 2528268 2522906 2516257 2507565 2495834 2480801 2463326 2444994 2426974 2409134
59798B409134j8572j9762k0723k1458k1963k1541k0106j9374k1139k4566k6903
$$ 2409134 2390562 2370800 2350077 2328619 2306656 2285115 2265009 2245635 2224496 2199930 2173027
59787B173027k7067k6798k7700k8797k8223k6163k4602k4655k5429k5382k3948
$$ 2173027 2145960 2119162 2091462 2062665 2034442 2008279 1983677 1959022 1933593 1908211 1884263
59776A884263k1783k0109j9733k0244k0337j9246j7411j5437j3095j0174p579
$$ 1884263 1862480 1842371 1822638 1802394 1782057 1762811 1745400 1729963 1716868 1706694 1699115
59765A699115o405o193n257k730P09M031O716Q530R644J1030J3505J6088J6654
$$ 1699115 1692710 1686517 1681260 1678530 1679239 1683270 1689986 1698516 1708160 1719190 1732695 1748783 1765437
59752A765437J4678J1968J0035Q170N133J426j612l912o233q250q911q533q838
$$ 1765437 1780115 1792083 1802118 1810288 1815421 1816847 1815235 1811323 1805090 1796840 1787929 1779396 1770558
59739A770558j0594j2630j3596j3506j3137j2973j3289j4193j5026j4620j2915
$$ 1770558 1759964 1747334 1733738 1720232 1707095 1694122 1680833 1666640 1651614 1636994 1624079
59728A624079j1447j1448j2109j1633r568p198n873n791o294o527n776l848j393
$$ 1624079 1612632 1601184 1589075 1577442 1567874 1560676 1554803 1549012 1542718 1536191 1530415 1526567 1525174
59715A525174N13J326J563K420M943R084J3386J6018J6721J7260J9448K3121K6843
$$ 1525174 1525687 1527013 1528576 1530996 1535939 1545023 1558409 1574427 1591148 1608408 1627856 1650977 1677820
59702A677820L0098L3615L7620M1283M4344M8092N3685O0223O5409O7693O6798
$$ 1677820 1707918 1741533 1779153 1820436 1864780 1912872 1966557 2026780 2092189 2159882 2226680
59691B226680O2583N4656M3214K9268J3768k617j8503l1572m0196m4765m6754
$$ 2226680 2289263 2343919 2387133 2416401 2430169 2427552 2409049 2377477 2337281 2292516 2245762
59680B245762m6829m4768m0944l6723l2999k9179k4252j8337j2527p404k524K612
$$ 2245762 2198933 2154165 2113221 2076498 2043499 2014320 1990068 1971731 1959204 1951800 1949276 1951888
59668A951888P732J2292J6291K0158K4130K8238L2769L7993M3437M8146N2045
$$ 1951888 1959620 1971912 1988203 2008361 2032491 2060729 2093498 2131491 2174928 2223074 2275119
59657B275119N6454O2582O9921P6943Q3154Q9550R6938J04832J12419J19669J26708
$$ 2275119 2331573 2394155 2464076 2541019 2624173 2713723 2810661 2915493 3027912 3147581 3274289
59646C274289J32898J37659J41735J46374J51144J53859J53111J49886J45904
$$ 3274289 3407187 3544846 3686581 3832955 3984099 4137958 4291069 4440955 4586859
59637D586859J41118J33859J23205J10210R6742Q3920P2096O1623N2828M5326
$$ 4586859 4727977 4861836 4985041 5095251 5191993 5275913 5348009 5409632 5462460 5507786
59627E507786L8135L0857K4320J9648J6863J4967J3249J1803J0612R030O804M934
$$ 5507786 5545921 5576778 5601098 5620746 5637609 5652576 5665825 5677628 5688240 5697270 5704074 5709008
59615E709008M588N547O766Q161J0636J4264J7879K1000K4915L0808L7763M3813
$$ 5709008 5713596 5719143 5725909 5734070 5744706 5758970 5776849 5797849 5822764 5853572 5891335 5935148
59603E935148M8511N3087N8297O3358O7241O9916P1754P2458P1282O7939O2678
$$ 5935148 5983659 6036746 6095043 6158401 6225642 6295558 6367312 6439770 6511052 6578991 6641669
59592F641669N5597M6300L4369J9915L503j4379l3573n3796p4091r3048j09633
$$ 6641669 6697266 6743566 6777935 6797850 6801353 6786974 6753401 6699605 6625514 6532466 6422833
59581F422833j23539j34673j42789j47879j50469j51038j49433j45294j38788
$$ 6422833 6299294 6164621 6021832 5873953 5723484 5572446 5423013 5277719 5138931
59572E138931j30537j21172j11598j03429r8371r7126r9471j05276j14474j25796
$$ 5138931 5008394 4887222 4775624 4672195 4573824 4476698 4377227 4271951 4157477 4031681
59562D031681j36528j44175j47938j48217j45313j39492j31830j23910j16446
$$ 4031681 3895153 3750978 3603040 3454823 3309510 3170018 3038188 2914278 2797832
59553B797832j08856j00530r1967q4130p7062o9860o2207n5273n0606m8400m7322
$$ 2797832 2688976 2588446 2496479 2412349 2335287 2265427 2203220 2147947 2097341 2048941 2001619
59542B001619m5874m3333l9513l4638k9874k7015k6632k6916k5428k1945j8626
$$ 2001619 1955745 1912412 1872899 1838261 1808387 1781372 1754740 1727824 1702396 1680451 1661825
59531A661825j7311j7685j8372j8737j8862j8532j7362j5694j4511j4412j5168
$$ 1661825 1644514 1626829 1608457 1589720 1570858 1552326 1534964 1519270 1504759 1490347 1475179
59520A475179j6210j6944j6757j5483j3949j3315j3514j3044j0796p622n395m763
$$ 1475179 1458969 1442025 1425268 1409785 1395836 1382521 1369007 1355963 1345167 1337545 1332150 1327387
59508A327387m557l479j679k94K39Q91K967O527J0038J1800J1787J1788J3471
$$ 1327387 1322830 1319351 1317672 1317378 1317617 1318508 1321475 1328002 1338040 1349840 1361627 1373415 1386886
59495A386886J6522J9217K0651K1642K3248K5322K7048K8269K9408L0561L1633
$$ 1386886 1403408 1422625 1443276 1464918 1488166 1513488 1540536 1568805 1598213 1628774 1660407
59484A660407L3177L6124M0505M5232M9138N1310N0291M4421L3976K2364J3995
$$ 1660407 1693584 1729708 1770213 1815445 1864583 1915893 1966184 2010605 2044581 2066945 2080940
59473B080940J0838J1374J2638J2735J1701J0594J0035R507Q084N720L264J004
$$ 2080940 2091778 2103152 2115790 2128525 2140226 2150820 2160855 2170362 2178446 2184166 2187430 2188434
59461B188434k017o585j1707j5288j6383j6213j6900j9581k3602k7103k8474k7612
$$ 2188434 2186417 2179832 2168125 2152837 2136454 2120241 2103341 2083760 2060158 2033055 2004581 1976969
59449A976969k5738k3911k2030j9651j7102j5094j3572j1790r330o323k732J558
$$ 1976969 1951231 1927320 1905290 1885639 1868537 1853443 1839871 1828081 1818751 1812428 1809696 1811254
59437A811254N883R104J1208J3837J8491K4691L0539L4903L8343M1941M5884M9531
$$ 1811254 1817137 1826241 1837449 1851286 1869777 1894468 1925007 1959910 1998253 2040194 2086078 2135609
59425B135609N2336N4079N4206N1808M6776M0542L4784K9479K3026J4465M748
$$ 2135609 2187945 2242024 2296230 2348038 2394814 2435356 2470140 2499619 2522645 2537110 2541858
59414B541858m460j2420j9238k4975k9673l3652l7008l9108l9379l8243l6701
$$ 2541858 2537398 2524978 2505740 2480765 2451092 2417440 2380432 2341324 2301945 2263702 2227001
59403B227001l5191l3489l1301k8409k4660k0490j6942j4516j2542j0388q609
$$ 2227001 2191810 2158321 2127020 2098611 2073951 2053461 2036519 2022003 2009461 1999073 1990464
59392A990464q005q371r269j1251j4753j8479k0588k1247k2231k4233k6423k8569
$$ 1990464 1982459 1974088 1964819 1953568 1938815 1920336 1899748 1878501 1856270 1832037 1805614 1777045
59380A777045l1434l4699l6609l6460l5668l5515l5510l4901l4086l3453l2327
$$ 1777045 1745611 1710912 1674303 1637843 1602175 1566660 1531150 1496249 1462163 1428710 1396383
59369A396383l0404k8772k8160k7340k4702k0427j5894j1973r029p432o583m667
$$ 1396383 1365979 1337207 1309047 1281707 1257005 1236578 1220684 1208711 1199682 1192250 1185667 1181000
59357A181000q85L292O736J0904J6862K1332J9097R644j548r015j2065j2754j1959
$$ 1181000 1180115 1183407 1190143 1201047 1217909 1239241 1258338 1267982 1266434 1257419 1245354 1232600 1220641
59344A220641r298m980M79P099J3859J7060J2794J514j1478k0674k4436k4353
$$ 1220641 1211343 1206363 1206842 1213941 1227800 1244860 1257654 1259168 1247690 1227016 1202580 1178227
59332A178227k2170j8624j4596j1589j0319r539p169k617K519O312Q531J0464
$$ 1178227 1156057 1137433 1122837 1111248 1100929 1091390 1084221 1081604 1084123 1090435 1098966 1109430
59320A109430J2994J5585J7303J8225J9286K0930K2603K3779K4921K6795K9139
$$ 1109430 1122424 1138009 1155312 1173537 1192823 1213753 1236356 1260135 1285056 1311851 1340990
59309A340990L0958L2187L3991L6790L9064L9288L8391L8740M0938M3288M4563
$$ 1340990 1371948 1404135 1438126 1474916 1513980 1553268 1591659 1630399 1671337 1714625 1759188
59298A759188M5652M7872N1247N5406O0659O6869P2438P6018P8612Q2482Q8367
$$ 1759188 1804840 1852712 1903959 1959365 2020024 2086893 2159331 2235349 2313961 2396443 2484810
59287B484810R5097J01594J07778J13554J18255J21428J23294J24246J24475J23935
$$ 2484810 2579907 2681501 2789279 2902833 3021088 3142516 3265810 3390056 3514531 3638466
59277C638466J22026J17628J10197J00542Q9653P7381O3405M9004L6240K5430
$$ 3638466 3760492 3878120 3988317 4088859 4178512 4255893 4319298 4368302 4404542 4429972
59267D429972J4910L540p960j8612k8685l8960m9551o0094p0342p9914q8285r5407
$$ 4429972 4444882 4448422 4440462 4421850 4393165 4354205 4304654 4244560 4174218 4094304 4006019 3910612
59255C910612j01723j07102j10694j12291j12997j13707j13690j11488j06845
$$ 3910612 3808889 3701787 3591093 3478802 3365805 3252098 3138408 3026920 2920075
59246B920075j00950r4932q8787q1958p4690o8389o4253o1462n7642n1758m5737
$$ 2920075 2819125 2724193 2635406 2553448 2478758 2410369 2346116 2284654 2227012 2175254 2129517
59235B129517m1948l9758l6395l1132k6415k4260k3570k2183j9772j7175j4333
$$ 2129517 2087569 2047811 2011416 1980284 1953869 1929609 1906039 1883856 1864084 1846909 1832576
59224A832576j0844p675o269o258n818m206k338q73O82K533L785L749L138L243
$$ 1832576 1821732 1814057 1807788 1801530 1795712 1791506 1789168 1788295 1788977 1791510 1795295 1799044 1802182 1805425
59210A805425M533O485Q210Q886Q150O461M697L210J625m03k824n616q892j2364
$$ 1805425 1809958 1816443 1824653 1833539 1841689 1848150 1852847 1856057 1857682 1857279 1854455 1848839 1839947 1827583
59196A827583j5359j7640j9685k1873k3984k5742k7265k8641k9695l0459l1185
$$ 1827583 1812224 1794584 1774899 1753026 1729042 1703300 1676035 1647394 1617699 1587240 1556055
59185A556055l1543l0733k9012k8036k8656k9215k7561k4246k2014k2052k2562
$$ 1556055 1524512 1493779 1464767 1436731 1408075 1378860 1351299 1327053 1305039 1282987 1260425
59174A260425k1577j9448j7586j6103j4172j1811r798q234o634n098m098l229
$$ 1260425 1238848 1219400 1201814 1185711 1171539 1159728 1149930 1141696 1135062 1129964 1125866 1122637
59162A122637j642L36J442J567K070L576N004N584O398Q744J2014J4559J5887
$$ 1122637 1120995 1121331 1122773 1124340 1126410 1129986 1134990 1140574 1146972 1155716 1167730 1182289 1198176
59149A198176J6739J7580J8415J9700K2132K5559K9112L2285L5025L7108L8540
$$ 1198176 1214915 1232495 1250910 1270610 1292742 1318301 1347413 1379698 1414723 1451831 1490371
59138A490371M0265M3242M6988N0307N3366N7600O3487O9785P5218P9445Q2078
$$ 1490371 1530636 1573878 1620866 1671173 1724539 1782139 1845626 1915411 1990629 2070074 2152152
59127B152152Q2434Q0966P9318P7907P4774O8111N8795M9002L9211K8270J5951
$$ 2152152 2234586 2315552 2394870 2472777 2547551 2615662 2674457 2723459 2762670 2790940 2806891
59116B806891L690p349j7521k7583l7344m5887n2526n7116n9851o1077o1124o0125
$$ 2806891 2810581 2803232 2785711 2758128 2720784 2674897 2622371 2565255 2505404 2444327 2383203 2323078
59104B323078n8080n5037n1187m7090m3679m1481l9660l6626l2080k7693k4952
$$ 2323078 2264998 2209961 2158774 2111684 2068005 2026524 1986864 1950238 1918158 1890465 1865513
59093A865513k3137k0510j7015j4338j3356j3053j2308j1524j1601j2223j2194
$$ 1865513 1842376 1821866 1804851 1790513 1777157 1764104 1751796 1740272 1728671 1716448 1704254
59082A704254j1080r619q632q238q219q443q655q291o983n158l714k937k113n29
$$ 1704254 1693174 1683555 1674923 1666685 1658466 1650023 1641368 1633077 1626094 1620936 1617222 1614285 1612172 1611643
59068A611643J307K093J476Q09J711M175O699Q109Q682R374J0475J1363J1380
$$ 1611643 1612950 1615043 1616519 1617328 1619039 1623214 1629913 1638022 1646704 1656078 1666553 1677916 1689296
59055A689296J0656R962R819R877R362Q138O949O359N870M403J588j904n105p392
$$ 1689296 1699952 1709914 1719733 1729610 1738972 1747110 1754059 1760418 1766288 1770691 1772279 1770375 1765270 1757878
59041A757878q544q687q400q404q965r831j0746j1728j2747j3566j4042j4241
$$ 1757878 1749334 1740647 1732247 1723843 1714878 1705047 1694301 1682573 1669826 1656260 1642218 1627977
59029A627977j4076j3215j1739j0512j0481j1573j2693j2810j1851j0519r546
$$ 1627977 1613901 1600686 1588947 1578435 1567954 1556381 1543688 1530878 1519027 1508508 1498962
59018A498962r173r098q827q175p514p376p794q242q299q037p568o600n039l743
$$ 1498962 1489789 1480691 1471864 1463689 1456175 1448799 1441005 1432763 1424464 1416427 1408859 1402259 1397220 1393477
59004A393477m024o082q615j0319j1316j2587j4385j5884j6320j5822j5027j4433
$$ 1393477 1389453 1383371 1374756 1364437 1353121 1340534 1326149 1310265 1293945 1278123 1263096 1248663
58992A248663j4318j4895j6196j7847j9060j8900j6950j4018j1849j1553j2295
$$ 1248663 1234345 1219450 1203254 1185407 1166347 1147447 1130497 1116479 1104630 1093077 1080782
58981A080782j2137j0165p244m791l486l338m050m892m946m126l397l352l143
$$ 1080782 1068645 1058480 1051236 1046445 1042959 1039621 1035571 1030679 1025733 1021607 1018210 1014858 1011715
58968A011715j651P37K522L156L626M744N855N924N225N029N690N930M416J559
$$ 1011715 1010064 1010801 1013323 1016479 1020105 1024849 1030704 1036628 1041853 1046882 1052572 1058502 1062918 1064477
58954A064477q22j463p91r5q7n82j096j307j151q87r38j300j373q58m58j023k189
$$ 1064477 1063655 1062192 1061401 1061306 1061219 1060637 1059541 1058234 1057083 1056196 1055258 1053958 1052585 1051727 1051269 1050246 1048057
58937A048057k780k615k861m272n949o423n334l559k187j815k262k465j245J258
$$ 1048057 1045277 1042662 1039801 1035529 1029580 1023157 1017823 1014264 1012077 1010262 1008000 1005535 1004290 1005548
58923A005548L440M063L757M010N234O639P673Q632R927J1527J3155J4412J4753
$$ 1005548 1008988 1013051 1016808 1020818 1026052 1032691 1040364 1048996 1058923 1070450 1083605 1098017 1112770
58910A112770J3916J2434J1212J0493R638P849M872J191k096l975m550n059o300
$$ 1112770 1126686 1139120 1150332 1160825 1170463 1178312 1183184 1184375 1182279 1178304 1173754 1168695 1162395
58897A162395p521p594o812o476o920p105o278m904l747k994k624k665k680j931
$$ 1162395 1154874 1147280 1140468 1133992 1127072 1119967 1113689 1108785 1105038 1102044 1099420 1096755 1094075 1092144
58883A092144n57L28K50J78R17J689J418P54J431L665N666N934N092M926O344
$$ 1092144 1091587 1091915 1092165 1092343 1093260 1094949 1096367 1097121 1098552 1102217 1107883 1113817 1118909 1123835 1130179
58868A130179Q798J1143J2460J2562J2215J2724J4691J7288J9138J9831K0178
$$ 1130179 1138977 1150120 1162580 1175142 1187357 1200081 1214772 1232060 1251198 1271029 1291207
58857A291207K1065K2561K4205K5729K7255K9061L1360L4145L7120L9945M2563
$$ 1291207 1312272 1334833 1359038 1384767 1412022 1441083 1472443 1506588 1543708 1583653 1626216
58846A626216M5057M7153M8207M7790M6040M3310L9928L6395L3349L1038K9380
$$ 1626216 1671273 1718426 1766633 1814423 1860463 1903773 1943701 1980096 2013445 2044483 2073863
58835B073863K8671K9614L2177L5234L7960M0779M4148M7335M9607N1743N4832
$$ 2073863 2102534 2132148 2164325 2199559 2237519 2278298 2322446 2369781 2419388 2471131 2525963
58824B525963N8071N9728O0066O1136O3403O4858O4192O2749O1999O0991N7924
$$ 2525963 2584034 2643762 2703828 2764964 2828367 2893225 2957417 3020166 3082165 3143156 3201080
58813C201080N2741M6459L9143L0414K1003J1949L050o042j4057j9487k3266k7914
$$ 3201080 3253821 3300280 3339423 3369837 3390840 3402789 3405839 3399797 3385740 3366253 3342987 3315073
58801C315073l4185m0589m6076n0970n5119n7580n8733o0473o3420o5772o6040
$$ 3315073 3280888 3240299 3194223 3143253 3088134 3030554 2971821 2911348 2847928 2782156 2716116
58790B716116o5041o4034o2647o0231n7808n6732n6369n4920n2107m9469m8098
$$ 2716116 2651075 2587041 2524394 2464163 2406355 2349623 2293254 2238334 2186227 2136758 2088660
58779B088660m7446m6416m4548m2012l9222l6627l4328l1994k9379k6659k3933
$$ 2088660 2041214 1994798 1950250 1908238 1869016 1832389 1798061 1766067 1736688 1710029 1686096
58768A686096k0979j7920j5485j3956j2559j0588q424o651m881k578l88P77J568
$$ 1686096 1665117 1647197 1631712 1617756 1605197 1594609 1586185 1579534 1574653 1572075 1571687 1572464 1574032
58755A574032L557O767R428J0562J1414J3455J6070J7324J6576J5298J5250J6612
$$ 1574032 1577589 1584356 1593784 1604346 1615760 1629215 1645285 1662609 1679185 1694483 1709733 1726345
58743A726345J8205J9245K0260K2117K4540K6416K7624K9538L3085L7108L9756
$$ 1726345 1744550 1763795 1784055 1806172 1830712 1857128 1884752 1914290 1947375 1984483 2024239
58732B024239M1033M2610M5178M7471M8399M8848N0392N3065N5495N6837N7572
$$ 2024239 2065272 2107882 2153060 2200531 2248930 2297778 2348170 2401235 2456730 2513567 2571139
58721B571139N8462N9467N9884N9031N6703N3246M9198M4620L8967L2056K4876
$$ 2571139 2629601 2689068 2748952 2807983 2864686 2917932 2967130 3011750 3050717 3082773 3107649
58710C107649J8685J3298P071j009r845j7477k3345k8550l4037l9421m3871m7409
$$ 3107649 3126334 3139632 3146703 3145694 3135849 3118372 3095027 3066477 3032440 2993019 2949148 2901739
58698B901739n0748n4140n7001n8671n9144n8940n8457n7541n5815n3453n1509
$$ 2901739 2850991 2796851 2739850 2681179 2622035 2563095 2504638 2447097 2391282 2337829 2286320
58687B286320n1004n1519n1319m9164m5692m2465m0126l8146l6066l4083l2332
$$ 2286320 2235316 2183797 2132478 2083314 2037622 1995157 1955031 1916885 1880819 1846736 1814404
58676A814404l0434k8103k5539k2910k0006j6764j3791j1860j1149j1224j1582
$$ 1814404 1783970 1755867 1730328 1707418 1687412 1670648 1656857 1644997 1633848 1622624 1611042
58665A611042j1953j2280j2513j2387j1452r597p398n517l957k357q09L49J290
$$ 1611042 1599089 1586809 1574296 1561909 1550457 1540860 1533462 1527945 1523988 1521631 1520822 1521171 1522461
58652A522461K321K837J936J21j086j801m307r883j6597k1787k5502k9565l4090
$$ 1522461 1524782 1527619 1529555 1529676 1528590 1526789 1522482 1512599 1496002 1474215 1448713 1419148 1385058
58639A385058l7263l8323l8463l8450l7459l5082l2607l1127k9773k7165k3569
$$ 1385058 1347795 1309472 1271009 1232559 1195100 1160018 1127411 1096284 1066511 1039346 1015777
58628A015777k0318j7870j5728j3743j2198j0903r241p032m445j431J786L924
$$ 1015777 995459 977589 961861 948118 935920 925017 915776 908744 904299 902868 904654 908578
58616I08578L599J142j641l692n696q451j1314j2974j3119j2637j2427j2561j2414
$$ 908578 912177 913319 911678 907986 902290 893839 882525 869551 856432 843795 831368 818807 806393
58603H06393j1306r224p218o644p691q998r145q165p157o766o753o852p161p473
$$ 806393 795087 785863 778645 772001 764310 755312 746167 738002 730845 724079 717326 710474 703313 695840
58589F95840o983n217k893j411j485k520l207k591p24J453K832K898J922O59n3
$$ 695840 688857 683640 680747 679336 677851 675331 672124 669533 668809 670262 673094 675992 677914 678573 678520
58574F78520M23K086M051N209N385N517O318P205P116O157N653O528Q258R783
$$ 678520 678943 681029 685080 690289 695674 701191 707509 714714 721830 727987 733640 740168 748426 758209
58560G58209J0844J1869J2993J3726J3585J2465J0455P754M835K292L34j194k286
$$ 758209 769053 780922 793915 807641 821226 833691 844146 851900 856735 859027 859361 858167 855881
58547H55881k714k609k575k863k901k081n41J389L938P170R890J0567R533R014
$$ 855881 853167 850558 847983 845120 842219 840138 839597 840986 844924 852094 861984 872551 882084 891098
58533H91098J0470J2902J4538J5130J5604J6386J7388J8929K1186K3059K3181
$$ 891098 901568 914470 929008 944138 959742 976128 993516 1012445 1033631 1056690 1079871
58522A079871K2011K1326K1520K1151J9543J7978J7299J6220J3482J0309Q813
$$ 1079871 1101882 1123208 1144728 1165879 1185422 1203400 1220699 1236919 1250401 1260710 1269523
58511A269523Q807Q149N940L530K228J698J034O1r81k072l120l735l728l393l127
$$ 1269523 1278330 1286479 1292419 1295949 1298177 1299875 1300909 1300970 1299989 1297917 1294797 1291062 1287334 1283941 1280814
58496A280814l204l830m816n385n216n512p904j2209j6369j8828j9867k0411k0847
$$ 1280814 1277610 1273780 1268964 1263579 1258363 1252851 1244947 1232738 1216369 1197541 1177674 1157263 1136416
58483A136416k1520k2999k4967k5887k4778k2501k0471j8968j7628j6681j6427
$$ 1136416 1114896 1091897 1066930 1041043 1016265 993764 973293 954325 936697 920016 903589
58472I03589j6133j4776j2590j0723r657r083r002r624j0285r884q544p590p440
$$ 903589 887456 872680 860090 849367 839710 830627 821625 812001 801716 791832 783288 775698 768258
58459G68258o795m517j373Q72J517J310J223J537J928J995J733J670K320L401
$$ 768258 761463 756946 755573 756445 757962 759272 760495 762032 763960 765955 767688 769358 771678 775079
58445G75079M050M009M098N112O722P881P943O865M803K232J83n31l51m41r64
$$ 775079 779129 783138 787236 792348 799070 806951 814894 821759 826562 828794 828977 828446 828095 827654 826690
58430H26690o45J464M421O218N888M288K918K637L346M288M468L383J672N88O53
$$ 826690 826045 827509 831930 838148 844036 848324 851242 853879 857225 861513 865981 869364 871036 871624 872277
58415H72277J016N12j020k782m023m572m553m176l725l373k936k155j271r39j532
$$ 872277 873293 873805 872785 870003 865980 861408 856855 852679 848954 845581 842645 840490 839219 838280 836748
58400H36748k749l885m180l160j162M98N42p84j713q25J415L272L566K536J244
$$ 836748 833999 830114 825934 822774 821612 822110 822652 821868 820155 819330 820745 824017 827583 830119 831363
58385H31363N89Q72J850L070M203N132N680N555M779L967L756M032M112L843M032
$$ 831363 831952 832824 834674 837744 841947 847079 852759 858314 863093 867060 870816 874848 878960 882803 886835
58370H86835N393P364Q490Q026O666N596N372N936O993P775P109M760K389K013
$$ 886835 892228 899592 908082 916108 922774 928370 933742 939678 946671 954446 961555 966315 968704 970717
58356I70717L514M917N191N371O341P088O292M472L238L133L617M534O061P562
$$ 970717 974231 979148 984339 989710 996051 1003139 1009431 1013903 1017141 1020274 1023891 1028425 1034486 1042048
58342A042048P976P338O749O852P419Q270R443J0541J1077J1310J1642J1534J0425
$$ 1042048 1050024 1057362 1064111 1070963 1078382 1086652 1096095 1106636 1117713 1129023 1140665 1152199 1162624
58329A162624R338R784J1244J1659J0623J0000J0811J1587J0803R130Q122Q103
$$ 1162624 1171962 1181746 1192990 1204649 1215272 1225272 1236083 1247670 1258473 1267603 1275725 1283828
58317A283828Q443Q644Q307P388P187R322J2795J4230J2454J0624J1819J4601
$$ 1283828 1292271 1300915 1309222 1316610 1323797 1333119 1345914 1360144 1372598 1383222 1395041 1409642
58305A409642J5592J4733J4682J5945J6152J4283J2340J2004J2355J2046J1567
$$ 1409642 1425234 1439967 1454649 1470594 1486746 1501029 1513369 1525373 1537728 1549774 1561341
58294A561341J1966J2978J3748J4177J4404J4107J3429J3663J5742J8655K0519
$$ 1561341 1573307 1586285 1600033 1614210 1628614 1642721 1656150 1669813 1685555 1704210 1724729
58283A724729K0806K0610K0889K1432K1633K1580K2015K3337K4913K5592K5031
$$ 1724729 1745535 1766145 1787034 1808466 1830099 1851679 1873694 1897031 1921944 1947536 1972567
58272A972567K4178K4204K5181K6254K6793K6781K6410K6017K6349K7986L0354
$$ 1972567 1996745 2020949 2046130 2072384 2099177 2125958 2152368 2178385 2204734 2232720 2263074
58261B263074L2039L2390L2297L3078L4936L6852L7797L7854L8159L9668M2058
$$ 2263074 2295113 2327503 2359800 2392878 2427814 2464666 2502463 2540317 2578476 2618144 2660202
58250B660202M4101M5073M5269M5160M4891M4980M6400M9081N1186N1084M9600
$$ 2660202 2704303 2749376 2794645 2839805 2884696 2929676 2976076 3025157 3076343 3127427 3177027
58239C177027M9130N0744N3354N5534N7009N8175N9353O0867O3140O6219O9615
$$ 3177027 3226157 3276901 3330255 3385789 3442798 3500973 3560326 3621193 3684333 3750552 3820167
58228C820167P2759P5331P7202P8516P9793Q1581Q4132Q7498R1522R5570R8954
$$ 3820167 3892926 3968257 4045459 4123975 4203768 4285349 4369481 4456979 4548501 4644071 4743025
58217D743025J02026J06024J11205J16074J19315J21627J24647J28880J33821
$$ 4743025 4845051 4951075 5062280 5178354 5297669 5419296 5543943 5672823 5806644
58208E806644J39347J45638J52340J59173J66747J75513J84555J92949K01611
$$ 5806644 5945991 6091629 6243969 6403142 6569889 6745402 6929957 7122906 7324517
58199G324517K12055K23797K34981K45190K55610K66528K76958K87075K98828
$$ 7324517 7536572 7760369 7995350 8240540 8496150 8762678 9039636 9326711 9625539
58190I625539L13400L29891L47292L66093L87002M09516M32919M57754M85238
$$ 9625539 9938939 10268830 10616122 10982215 11369217 11778733 12211652 12669406 13154644
58181A3154644N15793N48678N82663O16866O51484O87654P26180P66675Q08728
$$ 13154644 13670437 14219115 14801778 15418644 16070128 16757782 17483962 18250637 19059365
58172A9059365Q53166R00955R51599J004085J059025J118226J182546J251766
$$ 19059365 19912531 20813486 21765085 22769170 23828195 24946421 26128967 27380733
58164B7380733J326129J406375J492655J585247J685818J796156J916369K046485
$$ 27380733 28706862 30113237 31605892 33191139 34876957 36673113 38589482 40635967
58156D0635967K188843K346450K519963K709381K917833L150194L408601L693286
$$ 40635967 42824810 45171260 47691223 50400604 53318437 56468631 59877232 63570518
58148F3570518M007313M356308M743973N173112N651541O191950O805671P501598
$$ 63570518 67577831 71934139 76678112 81851224 87502765 93694715 100500386 108001984
58140A08001984Q288900R169228J0122831J1115083J2128268J3181588J4308440
$$ 108001984 116290884 125460112 135582943 146698026 158826294 172007882 186316322
58133A86316322J5513027J6751270J7943256J8985467J9742079K0026317J9593111
$$ 186316322 201829349 218580619 236523875 255509342 275251421 295277738 314870849
58126C14870849J8163673J5503412J1547630O508256Q69954m747423r778958j3848273
$$ 314870849 333034522 348537934 360085564 366593820 367463774 362716351 352937393 339089120
58118C39089120j6800393j8662162j9575672j9733043j9328230j8533112j7491246
$$ 339089120 322288727 303626565 284050893 264317850 244989620 226456508 208965262
58111B08965262j6316293j5091090j3871559j2694695j1584252j0552763r604269
$$ 208965262 192648969 177557879 163686320 150991625 139407373 128854610 119250341
58104A19250341q738668p953829p244913o604614o025505n501751n028716m602197
$$ 119250341 110511673 102557844 95312931 88708317 82682812 77181061 72152345 67550148
58096F7550148m218252l873166l563587l286856l040360k819931k619857k435397
$$ 67550148 63331896 59458730 55895143 52608287 49567927 46747996 44128139 41692742
58088D1692742k264537k106530j960057j824008j698796j585062j481542j385797
$$ 41692742 39428205 37321675 35361618 33537610 31838814 30253752 28772210 27386413
58080B7386413j296740j214969j140866j073641j012065r55052r01634q51435
$$ 27386413 26089673 24874704 23733838 22660197 21648132 20693080 19791446 18940011
58072A8940011q04934p62359p22651o84537o48107o14139n82339n51811n23076
$$ 18940011 18135077 17372718 16650067 15965530 15317423 14703284 14120945 13569134 13046058
58063A3046058m97851m76363m56431m35888m14894l95034l76993l60036l43454
$$ 13046058 12548207 12071844 11615413 11179525 10764631 10369597 9992604 9632568 9289114
58054I289114l27541l13063l00145k87985k75667k63213k51631k41740k33075
$$ 9289114 8961573 8648510 8348365 8060380 7784713 7521500 7269869 7028129 6795054
58045F795054k24242k14319k03704j93711j85541j79497j74901j70652j65970
$$ 6795054 6570812 6356493 6152789 5959078 5773537 5594040 5419139 5248487 5082517
58036E082517j60622j54619j48065j41299j34702j28305j21980j16189j11860
$$ 5082517 4921895 4767276 4619211 4477912 4343210 4214905 4092925 3976736 3864876
58027C864876j09065j06408j02405r7211r2347q8846q6288q3641q0522p7395p4870
$$ 3864876 3755811 3649403 3546998 3449787 3357440 3268594 3182306 3098665 3018143 2940748 2865878
58016B865878p2957p0998o8265o4667o0915n8011n6560n6290n6032n4532n1717
$$ 2865878 2792921 2721923 2653658 2588991 2528076 2470065 2413505 2357215 2301183 2246651 2194934
58005B194934m8912m7199m5853m3344l9837l7448l7565l8974l9427l8196l6166
$$ 2194934 2146022 2098823 2052970 2009626 1969789 1932341 1894776 1855802 1816375 1778179 1742013
57994A742013l4077l1930k9909k8634k8242k8106k7791k7668k8155k8775k8451
$$ 1742013 1707936 1676006 1646097 1617463 1589221 1561115 1533324 1505656 1477501 1448726 1420275
57983A420275k6681k4062k1712k0302j9810k0028k0894k2034k2423k1216j8936
$$ 1420275 1393594 1369532 1347820 1327518 1307708 1287680 1266786 1244752 1222329 1201113 1182177
57972A182177j7123j6545j6395j5744j5007j5191j6076j6273j5196j4064j4310
$$ 1182177 1165054 1148509 1132114 1116370 1101363 1086172 1070096 1053823 1038627 1024563 1010253
57961A010253j5578j6050j4697j2505j1208j1253j1622j1398j0737j0101r378
$$ 1010253 994675 978625 963928 951423 940215 928962 917340 905942 895205 885104 875726
57950H75726q384p694q061r127r619r000q113p868p934p195n217k753r51l32n09
$$ 875726 867342 859648 851587 842460 832841 823841 815728 807860 799926 792731 787514 784761 783810 783478 782969
57935G82969p21n60n0Q15K079L114K676N21j503j105J730M703N930N714N454N849
$$ 782969 782248 781688 781638 782453 784532 787646 790322 790843 789340 788235 789965 794668 800598 806312 811766 817615
57919H17615O615P073O508M833L336L738N992Q007Q326P997Q732J0129J0240Q424
$$ 817615 824230 831303 837811 842644 845980 849718 855710 863717 872043 880040 888772 898901 909141 917565
57905I17565O109M608L478J455j838n612q876j1225j2944j4426j5592j6117j6241
$$ 917565 923674 928282 931760 933215 931377 925765 916889 905664 892720 878294 862702 846585 830344
57892H30344j6749j7772j8310j7586j6290j5532j5103j3937j2078j0745j0281
$$ 830344 813595 795823 777513 759927 743637 728105 713002 699065 686987 676242 665961
57881F65961r470p478n216l765k509k18K604M029L441K561L113M567N089M021
$$ 665961 656491 649013 643797 640032 637523 637305 639909 643938 647379 649940 653053 657620 662709 666730
57867F66730K298P40q23k522l734m036m137m992o389p126o516n127m082m095n049
$$ 666730 669028 669768 668945 666423 662689 658653 654516 649524 643135 636009 629493 624366 620284 616189 611140
57852F11140o071o093m854l165j838o28J063K759L094J584o48k190k790l207m194
$$ 611140 605069 598976 594122 590957 589119 588491 589554 592313 595407 596991 596343 594153 591363 588156 583962
57837E83962n986q408j1054j3396j4764j4418j2157r157p428p656q196p254n367
$$ 583962 577976 569568 558514 545118 530354 515936 503779 494622 487194 479538 471342 464088 458721
57824D58721m332m138l007o75N12j259m659p002p459p182p226p668q167q198p206
$$ 458721 454389 450251 447244 446569 447081 445822 441163 434161 426702 419520 412294 404626 396459 388261 381055
57809C81055n398l955l642l795l490k954k851k867k199q40O62K232L857M756M320
$$ 381055 375657 371702 368060 364265 360775 357821 354970 352103 349904 349064 349726 351958 355815 360571 364891
57794C64891L533L975N519O469N974M968M435M130L504K810K563K528J803l12
$$ 364891 368424 372399 377918 384387 390361 395329 399764 403894 407398 410208 412771 415299 417102 416790
57780D16790l651p125r356r920r760r951j0357j0214r504q708p565n421k829j340
$$ 416790 413139 406014 396658 386738 376978 367027 356670 346456 336952 328244 320679 315258 312429 311089
57766C11089j416j791j447r77j226j692j313p8J152J954K481K565J740K41r31
$$ 311089 309673 307882 306435 305458 304232 302540 301227 301149 302301 304255 306736 309301 311041 311282 310351
57751C10351j171q89o56l44L55Q98L26j203k087j161O48J366M95n21l48P65J943
$$ 310351 309180 308291 307635 307291 307646 308544 308870 307667 305580 304419 305067 306433 306928 306407 306059 306824 308767
57734C08767L042M298N485O223O562O504N639M119L163L594M391L978K402R30
$$ 308767 311809 316107 321592 327815 334377 340881 346520 350639 353802 357396 361787 365765 368167 369097
57720C69097j43j660l682m980m820l927l355l388l867m545m870m560m463n712
$$ 369097 368954 367294 363612 358632 353812 349885 346530 343142 339275 334730 329860 325300 320837 315125
57706C15125p778q827q403q213r559j1479j2487j2795j3485j4471j4704j3872
$$ 315125 307347 298520 290117 281904 272345 260866 248379 235584 222099 207628 192924 179052
57694A79052j2573j1202r713q158o561m551k011L03J704K662L996N298N306L782
$$ 179052 166479 155277 145564 137406 130845 126294 124283 124586 126290 128952 132948 138246 143552 147334
57680A47334K000J282J743K525K655J738M55J39J196K260J803L07k62R63K879
$$ 147334 149334 150616 152359 154884 157539 159277 159732 159871 161067 163327 165130 165437 165175 166138 169017
57665A69017M231N039N649N628M467K763J790K097L073L649L144J862J142K240
$$ 169017 173248 178287 183936 189564 194031 196794 198584 200681 203754 207403 210547 212409 213551 215791
57651B15791M705O458O034M266L091L276M102M810N264N393N127M961N502O229
$$ 215791 220496 226954 232988 237254 240345 243621 247723 252533 257797 263190 268317 273278 278780 285009
57637B85009N923M622L996M925N912M994K439J53r92j675k112j265J319M320O155
$$ 285009 290932 295554 299550 304475 310387 315381 317820 317973 316981 315306 313194 311929 313248 317568 323723
57622C23723O867P605Q975J0767J2898J5640J9027K2778K6838L1466L6741M2412
$$ 323723 330590 338195 347170 357937 370835 386475 405502 428280 455118 486584 523325 565737
57610E65737M8291N4461O0920O6847O9934O6692N4438L3838R325j3456l0644m0987
$$ 565737 614028 668489 729409 796256 866190 932882 987320 1021158 1030483 1017027 986383 945396
57598I45396m5029m4464m1608l8167l4310k9482k3968j8921j5066j2076r318o556
$$ 945396 900367 855903 814295 776128 741818 712336 688368 669447 654381 642305 632987 626431
57586F26431l854j373O56K182L490M672N186M499K953J408J57j152k724m418o181
$$ 626431 622577 621204 621860 624042 627532 632204 637390 641889 644842 646250 646407 645255 642531 638113 631932
57571F31932p865q871q832q599r528j1646j3424j3596j2364j0727r490r201j0066
$$ 631932 624067 615196 606364 597765 588237 576591 563167 549571 537207 526480 516990 507789 497723
57558D97723j1389j1866j0886r000o951m964l376k967l973n295n482m198k371
$$ 497723 486334 474468 463582 454582 447631 442667 439291 436324 432351 427056 421574 417376 415005
57545D15005j042m30J07J298K924L831L424K798L483N250O371O080N455N556O088
$$ 415005 413963 413533 413640 414938 417862 421693 425117 427915 431398 436648 443019 449099 454554 460110 466198
57530D66198O530P261Q630R973J0589J0767J0886J0396Q741O553M845L743L016
$$ 466198 472728 479989 488619 498592 509181 519948 530834 541230 549971 556524 561369 565112 568128
57517E68128K892L007J486l027q739j2041j1665r884r282r876j0276j0166j0460
$$ 568128 571020 574027 575513 572486 563747 551706 540041 530157 520875 510999 500723 490557 480097
57504D80097j1594j2884j3498j3353j2997j2870j2801j2163j0633q708p302o834
$$ 480097 468503 455619 442121 428768 415771 402901 390100 377937 367304 358596 351294 344460
57492C44460o985p195p173o967o828o854o666n704m189l270l643m446m268l098
$$ 344460 337475 330280 323107 316140 309312 302458 295792 290088 285899 282629 278986 274540 270272 267174
57478B67174k351k913m048m538m215l879m008m143l555k238j060q22j244j322
$$ 267174 264823 261910 257862 253324 249109 245230 241222 237079 233524 231286 230226 229404 228160 226838
57464B26838p29l84j235k862l802l062q94J593L180L276K431J903K258K869L192
$$ 226838 226109 225725 224490 221628 217826 214764 213870 215463 218643 221919 224350 226253 228511 231380 234572
57449B34572L838N453P188P526O388N169M838N232O262Q242J0631J1901J1458
$$ 234572 238410 243863 251051 258577 264965 270134 274972 280204 286466 294708 305339 317240 328698
57436C28698J0598J0687J1317J1232J0357R719R758R746Q844P042N019L589L204
$$ 328698 339296 349983 361300 372532 382889 392608 402366 412112 420956 427998 433017 436606 439810
57423D39810L545L717L200K351J644P22j222m170o860p758o350l664j618j518
$$ 439810 443355 447072 450272 452623 454267 454989 453767 449597 442737 434979 428629 424965 423347 421829
57409D21829k890m132m423m555n501o796p086o025m800m612n174m951k859L78
$$ 421829 418939 414807 410384 405829 400328 393532 386446 380421 375621 371009 365835 360884 358025 358403
57395C58403K628K376L36j371j621j081m83O45K652M291M054K530J931L264N357
$$ 358403 361031 363407 363743 362372 360751 359670 359187 359832 362484 366775 370829 373359 375290 378554 383911
57380C83911O663O717N660L917K868M200P632J0520J0805R225P564O074M280L224
$$ 383911 390574 397291 402951 406868 409736 413936 421568 432088 442893 452118 459682 465756 470036 473260
57366D73260M626P960J0496J0522Q772O341L110q48m097n423n533n828o400o525
$$ 473260 477886 485846 496342 506864 515636 521977 525087 524239 520142 514719 509186 503358 496958 490433
57352D90433o428o987q020q360p689o980o950p211p235p218p371p245o385n201
$$ 490433 484005 477018 468998 460638 452949 445969 439019 431808 424573 417355 409984 402739 396354 391153
57338C91153m533m523m393l365j607k30k75j668l237l845l295k106q12J61N41
$$ 391153 386620 382097 377704 374339 372732 372502 372227 370559 367322 363477 360182 358076 357264 357425 357966
57323C57966O61J357K790L787L206J521P9p70j670k543k433j225j24J09J42P49
$$ 357966 358627 359984 362774 366561 369767 371288 371367 370597 368927 366384 363951 362726 362602 362711 362853 363602
57307C63602J612K184K680L363L881M034M363N073N300M453L431L410M195M849
$$ 363602 365214 367398 370078 373441 377322 381356 385719 390792 396092 400545 403976 407386 411581 416430
57293D16430N228N563N367M331L744N198Q039R937J0060R892J0589J1370J1374
$$ 416430 421658 427221 432588 436919 440663 445861 453900 463837 473897 483789 494378 505748 517122
57280E17122J1353J2276J3468J3567J2757J2668J4255J6694J8369J8417J7377
$$ 517122 528475 540751 554219 567786 580543 593211 607466 624160 642529 660946 678323
57269F78323J6643J6976J7428J6383J3941J2297J3028J4962J5853J5375J5042
$$ 678323 694966 711942 729370 745753 759694 771991 785019 799981 815834 831209 846251
57258H46251J5471J5522J4369J2952J2559J3074J3492J3441J3291J3217J3104
$$ 846251 861722 877244 891613 904565 917124 930198 943690 957131 970422 983639 996743
57247I96743J3049J3244J3564J3937J4775J6174J7027J6079J3856J2422J2816
$$ 996743 1009792 1023036 1036600 1050537 1065312 1081486 1098513 1114592 1128448 1140870 1153686
57236A153686J3912J4326J4389J5246J6826J7903J7836J7093J6309J5773J5765
$$ 1153686 1167598 1181924 1196313 1211559 1228385 1246288 1264124 1281217 1297526 1313299 1329064
57225A329064J6397J7085J7075J6535J6271J6419J6393J6078J6002J6257J6401
$$ 1329064 1345461 1362546 1379621 1396156 1412427 1428846 1445239 1461317 1477319 1493576 1509977
57214A509977J6597J7431J8370J7937J6071J4685J4929J5548J5116J4385J4684
$$ 1509977 1526574 1544005 1562375 1580312 1596383 1611068 1625997 1641545 1656661 1671046 1685730
57203A685730J5408J5184J4485J4712J5273J4162J1437R584R965J1231J1927J2437
$$ 1685730 1701138 1716322 1730807 1745519 1760792 1774954 1786391 1795975 1805940 1817171 1829098 1841535
57191A841535J3247J3477J2738J2662J4623J7162J7724J6206J4793J4655J4774
$$ 1841535 1854782 1868259 1880997 1893659 1908282 1925444 1943168 1959374 1974167 1988822 2003596
57180B003596J4186J3558J3948J5314J6985J8684K0326K1426K1445K0492J9256
$$ 2003596 2017782 2031340 2045288 2060602 2077587 2096271 2116597 2138023 2159468 2179960 2199216
57169B199216J8290J7628J7055J6578J6597J7437J8817K0102K1169K2469K3951
$$ 2199216 2217506 2235134 2252189 2268767 2285364 2302801 2321618 2341720 2362889 2385358 2409309
57158B409309K4628K3993K3265K4095K6212K7654K7535K7258K8316L0028L0666
$$ 2409309 2433937 2457930 2481195 2505290 2531502 2559156 2586691 2613949 2642265 2672293 2702959
57147B702959L0037K9577L0021L0396K9687K8317K7255K6492K5233K3246K1150
$$ 2702959 2732996 2762573 2792594 2822990 2852677 2880994 2908249 2934741 2959974 2983220 3004370
57136C004370J9607J8921J9317K0714K2178K2441K1326J9966J9266J8957J8656
$$ 3004370 3023977 3042898 3062215 3082929 3105107 3127548 3148874 3168840 3188106 3207063 3225719
57125C225719J8963K0494K2379K3066K2631K3069K5761K9599L2252L2689L1667
$$ 3225719 3244682 3265176 3287555 3310621 3333252 3356321 3382082 3411681 3443933 3476622 3508289
57114C508289L0219K8663K7099K6006K5791K6164K6410K6216K5895K5772K5703
$$ 3508289 3538508 3567171 3594270 3620276 3646067 3672231 3698641 3724857 3750752 3776524 3802227
57103C802227K5365K4847K4659K5191K6354K7747K9021L0019L0852L1889L3360
$$ 3802227 3827592 3852439 3877098 3902289 3928643 3956390 3985411 4015430 4046282 4078171 4111531
57092D111531L4923L5941L6396L7116L8759M0910M2789M4576M7306N1348N5627
$$ 4111531 4146454 4182395 4218791 4255907 4294666 4335576 4378365 4422941 4470247 4521595 4577222
57081D577222N8774O0710O2670O5664O9363P2666P5118P7235P9327Q0567P9887
$$ 4577222 4635996 4696706 4759376 4825040 4894403 4967069 5042187 5119422 5198749 5279316 5359203
57070E359203P7472P4447P0970O5609N7142M6113L3884K0968P238o736j9927l2307
$$ 5359203 5436675 5511122 5582092 5647701 5704843 5750956 5784840 5805808 5813046 5806310 5786383 5754076
57058E754076m5048n9093p4484r1115j09022j27750j46576j65882j87250k11408
$$ 5754076 5709028 5649935 5575451 5484336 5375314 5247564 5100988 4935106 4747856 4536448
57048D536448k36816k61237k84253l07294l31543l56655l81471m05140m27499
$$ 4536448 4299632 4038395 3754142 3446848 3115305 2758650 2377179 1972039 1544540
57039A544540m49159m71571A27279c98109n58964n98282o44934p00112p63577
$$ 1544540 1095381 623810 127279 -398109 -957073 -1555355 -2200289 -2900401 -3663978
57030c663978q33814r08744r85694j061062j131523j196490j258560j319672j375168
$$ -3663978 -4497792 -5406536 -6392230 -7453292 -8584815 -9781305 -11039865 -12359537 -13734705
57021a3734705j410734j404901j335747j188668r62054o68068l28113L3514L93194
$$ -13734705 -15145439 -16550340 -17886087 -19074755 -20036809 -20704877 -21032990 -20999476 -20606282
57012b0606282P28665J020452J255228J427651J538584J592447J596581J561149
$$ -20606282 -19877617 -18857165 -17601937 -16174286 -14635702 -13043255 -11446674 -9885525
57004i885525J497282J414896J322260J226099J130486J036481R44422d57521
$$ -9885525 -8388243 -6973347 -5651087 -4424988 -3294502 -2258021 -1313599 -457521
56995C15856O96298O24016N57584M98905M47416M00202L55651L14633K77702K43751
$$ 315856 1012154 1636170 2193754 2692659 3140075 3540277 3895928 4210561 4488263 4732014
56985D732014K12380J85147J62980J44248J26777J10201R4832Q0168O6190N4503
$$ 4732014 4944394 5129541 5292521 5436769 5563546 5673747 5768579 5848747 5914937 5969440
56975E969440M6115L9323L1898K4262J8237J3566Q179J644m260q440j1711j4657
$$ 5969440 6015555 6054878 6086776 6111038 6129275 6142841 6151020 6152664 6148404 6139964 6128253 6113596
56963F113596j6533j7143j7911j9994k2755k5350k8643l4154m1731m9450n5582
$$ 6113596 6097063 6079920 6062009 6042015 6019260 5993910 5965267 5931113 5889382 5839932 5784350
56952E784350n9781o2629o4887o7316p0432p4100p7546q0029q1477q2414q3382
$$ 5784350 5724569 5661940 5597053 5529737 5459305 5385205 5307659 5227630 5146153 5063739 4980357
56941D980357q4554q6013q8072r0840r3471r4631r4073r3205r3548r5027r6345
$$ 4980357 4895803 4809790 4721718 4630878 4537407 4442776 4348703 4255498 4161950 4066923 3970578
56930C970578r6650r6135r5404r5167r6398r9726j04407j08640j11319j13051
$$ 3970578 3873928 3777793 3682389 3587222 3490824 3391098 3286691 3178051 3066732 2953681
56920B953681j15172j18211j21517j24001j24854j23826j21150j17240j12421
$$ 2953681 2838509 2720298 2598781 2474780 2349926 2226100 2104950 1987710 1875289
56911A875289j06935j01130r5434r0078q4930p9654p4095o8426o2741n6583m9376
$$ 1875289 1768354 1667224 1571790 1481712 1396782 1317128 1243033 1174607 1111866 1055283 1005907
56900A005907m1669l5340l1765l0103k8399k6153k4532k4042k3526k2054k0264
$$ 1005907 964238 928898 897133 867030 838631 812478 787946 763904 740378 718324 698060
56889F98060j8965j7714j5928j4297j3713j3694j3261j2530j1974j0846q167m828
$$ 698060 679095 661381 645453 631156 617443 603749 590488 577958 565984 555138 546971 542143
56877E42143k744k011q33J482L417L680K974K384J502o68l794o524q203r295j0414
$$ 542143 539399 537388 536555 538037 541454 545134 548108 550492 551994 551326 547532 541008 532805 523510 513096
56862E13096j1655j2734j3313j3261j2829j2326j1587j0249q637p773q086q654
$$ 513096 501441 488707 475394 462133 449304 436978 425391 415142 406505 398732 390646 381992
56850C81992q175o440m510l570l832m449m396l426k115r54J69J335K062K009J735
$$ 381992 373817 367377 362867 359297 355465 351016 346620 343194 341079 340125 340294 341629 343691 345700 347435
56835C47435J901K080J366J5o68j01Q09R85L40o17j532k268k830l465m348n232
$$ 347435 349336 351416 352782 352797 352129 352028 352837 353822 354162 353545 352013 349745 346915 343450 339102 333870
56819C33870n877o602p529p647n803k571J95J787L291N516P735R118J0079J1355
$$ 333870 327993 321391 313862 306215 300412 297841 298036 299823 303114 308630 316365 325483 335562 346917
56805C46917J2841J4230J5850J7890J9569K0015J9301J7838J5449J1990Q221N135
$$ 346917 359758 373988 389838 407728 427297 447312 466613 484451 499900 511890 520111 525246
56793E25246K833Q58q60k252l620m989n360l816j100J060K243L960P688J2971
$$ 525246 528079 528937 528077 525825 522205 517216 511856 508040 506940 508000 510243 514203 521891 534862
56779E34862J7800K0515K1199K1408K2549K4414K5390K4078K0403J5137R086K993
$$ 534862 552662 573177 594376 615784 638333 662747 688137 712215 732618 747755 756841 759834
56767G59834k445p028j0991j4101j5531j5160j4262j3950j3571j1715q475n538
$$ 759834 757389 750361 739370 725269 709738 694578 680316 666366 652795 641080 632605 627067
56755F27067l936k852r52J833M400N958O831P801Q948R364Q123N295J738j883
$$ 627067 623131 620279 619327 621160 625560 631518 638349 646150 655098 664462 672585 677880 679618 677735
56741F77735n392q661j1587j4436j7467j9959k0616j9160j6703j4310j2182j0569
$$ 677735 672343 663682 652095 637659 620192 600233 579617 560457 543754 529444 517262 506693
56729E06693j0054j0118q846n290j175J101J299Q93N83m8r97j767k673m526o952
$$ 506693 496639 486521 477675 472385 471210 472311 473610 474503 475086 475038 474041 472274 469601 465075 458123
56714D58123q721r811j1568j4256j6076j5527j3491j2029j1907j2220j1840j0498
$$ 458123 449402 439591 428023 413767 397691 382164 368673 356644 344737 332517 320677 310179
56702C10179q818p834q155r169r573q867p814p093o263m683k919k258l026m037
$$ 310179 301361 293527 285372 276203 266630 257763 249949 242856 236593 231910 228991 226733 223707 219670
56688B19670l904k532j106p77j551k526l027l146l091k635j737j196j839l163
$$ 219670 215766 213234 212128 211351 209800 207274 204247 201101 198010 195375 193638 192442 190603 187440
56674A87440l602k408n68M07J04o40q52l02M77Q16N08j63q85j522j867j711j436
$$ 187440 183838 181430 180862 181269 181373 180733 179881 179579 180056 180872 181380 181217 180332 178810 176943 175232 173796
56657A73796j869l014l601k637r03J1k11n30j93O01J489K232K201Q26j302k831
$$ 173796 171927 168913 165312 162675 161772 161783 161572 161042 160849 161450 162939 165171 167372 168198 166896 164065
56641A64065l280l358l506l291k433j346m08L11L84o58k071k276r98K61M00N8
$$ 164065 160785 157427 153921 150630 148197 146851 146443 146754 147138 146480 144409 142133 141135 141396 141796 141854
56625A41854J19L76M95R93K107K866K511J778J539J247J03j183j405q79p90j081
$$ 141854 141973 142349 142844 143837 145944 148810 151321 153099 154638 155885 155988 154805 153400 152521 151731 150650
56609A50650o33P43K107K955L526L634K748J237J33l90r63j430q95M73J225P20
$$ 150650 150017 150760 152867 155822 159348 162982 165730 166967 167100 166710 165747 164317 163422 163895 165120 165840
56593A65840R6N21J638K381K355J794J049O44J029J795J903J093K92K15M38L39
$$ 165840 165936 166457 168095 170476 172831 174625 175674 176318 177347 179142 181045 182138 182430 182645 183083 183422
56577A83422N2k2R0K48M57M37k81j387j826j283o33n14m52q9p6q64j666j661j313
$$ 183422 183474 183452 183542 183790 184247 184684 184403 183016 181190 179907 179274 178760 178308 178219 178143 177279 175613 173952 172639
56558A72639j407j588j101k10L80Q33J583K012J237j27n45J89P49L54k77k65L32
$$ 172639 171232 169644 168543 168333 168713 169546 171129 173141 174378 174251 173706 173895 174644 174998 174721 174456 174788
56541A74788R96J308Q83k76j225r11L82J381J626J772K106K059J506J171J288
$$ 174788 175784 177092 177975 177699 176474 175563 175945 177326 178952 180724 182830 184889 186395 187566 188854
56526A88854J184P27Q54J923K792K464J576J292J593J748J657J737K072K661L757
$$ 188854 190038 190765 191619 193542 196334 198798 200374 201666 203259 205007 206664 208401 210473 213134 216891
56511B16891N119N617M642L228K603K367J442L02O18K763N083N851M833K882J092
$$ 216891 222010 227627 232269 235497 238100 240467 241909 242211 242829 245592 250675 256526 261359 264241 265333
56496B65333N45J668L507M427L851K592J541Q95P84J442K367K381J105m46j210
$$ 265333 265878 267546 271053 275480 279331 281923 283464 284359 285143 286585 288952 291333 292438 291992 290782
56481B90782j271j169q70j99L14m7j026j576j165n00q07k572m944o351n891m154
$$ 290782 289511 288342 287472 287273 287587 287540 286514 284938 283773 283273 282466 279894 274950 268599 262708 258554
56465B58554k532j901k220l046l797l785k861j937j965k421j904l31Q03P87P97
$$ 258554 256022 254121 251901 248855 245058 241273 238412 236475 234510 232089 230185 229854 230657 231444 232241
56450B32241J784K609J738k32j368j222j053j379j116L24J646J334k62j516j643
$$ 232241 234025 236634 238372 238140 236772 235550 234497 233118 232002 232326 233972 235306 235044 233528 231885
56435B31885j197p29pJ157K040J587k41k159k716j636J10J353J648J278O77O1
$$ 231885 230688 229959 229952 231109 233149 234736 234495 232336 229620 227984 228094 229447 231095 232373 233050 233111
56419B33111m92p62k97J027K348K266N00j304j257M44J850J904J546J808K163
$$ 233111 232619 231857 231560 232587 234935 237201 237701 236397 235140 235584 237434 239338 240884 242692 244855
56404B44855J702J036J574L329M750M791M092L796M030L993L073J487Oo89m63
$$ 244855 246557 247593 249167 252496 257246 262037 266129 269925 273955 277948 281021 282508 282514 281825 281362
56389B81362L67J393K194K222J267P5k14L87N70m16j680k211k439l074l375k240
$$ 281362 281729 283122 285316 287538 288805 288880 288666 289053 289623 289207 287527 285316 282877 279803 276428 274188
56373B74188m86j18j264j802n02J175J317J07r69j273j182r03k85N52J331J947
$$ 274188 273702 273584 272320 270518 270016 271191 272508 272615 271646 270373 269191 268288 268003 268555 269886 271833
56357B71833K045J020q09j762o67J369K354K065J952K571K745J631J69k55L71
$$ 271833 273878 274898 274089 272327 271660 273029 275383 277448 279400 281971 284716 286347 286516 286261 286632
56342B86632R99R53K89o73j453j409m06P83J267J130J224K036L241M273M765M633
$$ 286632 287631 288584 288873 288200 286747 285338 284932 285715 286982 288112 289336 291372 294613 298886 303651 308284
56326C08284M183M113M847N916O550O802P407Q456Q952Q042N993L584J203r63
$$ 308284 312467 316580 321427 327343 333893 340695 348102 356558 365510 373552 379545 383129 384332 383369
56312C83369k495l352m267n621o382n415l613l249m835o098m861j909J67K00o58
$$ 383369 380874 377522 373255 367634 361252 355837 352224 348975 344140 338042 333181 331272 331439 331639 330981
56297C30981r78p14p62j689l211m423m361k753l60J683K748K783J900N51k54L00
$$ 330981 330003 329289 328527 326838 323627 319204 314843 312090 311730 313413 316161 318944 320844 321395 321141 321441
56281C21441J823L199L995M606N023M458K581L57q37m53J125L037M182L810K453
$$ 321441 323264 326463 330458 335064 340087 344545 347126 347483 346646 346193 347318 350355 354537 358347 360800
56266C60800J641K063K652K209J187P93R28M54n93o12J201L424M158L296K094
$$ 360800 362441 364504 367156 369365 370552 371345 372273 372727 372134 371522 372723 376147 380305 383601 385695
56251C85695J222M85J6L85J303J458J09j927l297l478k621r85P77J493P87J13
$$ 385695 386917 387402 387418 387803 389106 390564 390673 388746 385449 381971 379350 378365 379142 380635 381422 381535
56235C81535J209L586M807L559J295K71R74K263L225L793L960L447K309J178P35
$$ 381535 382744 386330 391137 394696 395991 396262 397236 399499 402724 406517 410477 413924 416233 417411 418146
56220D18146J221K270K953K403R23J13J178L279M347L550K112J664K518L814M747
$$ 418146 419367 421637 424590 426993 427916 428029 429207 432486 436833 440383 442495 444159 446677 450491 455238
56205D55238N079M896M330L564K827K355K285K564K969L448M192N239O225O775
$$ 455238 460317 465213 469543 473107 475934 478289 480574 483138 486107 489555 493747 498986 505211 511986
56191E11986O886O686O184N729O143P747R544J0254R905R531R462R027Q046P426
$$ 511986 518872 525558 531742 537471 543614 551361 560905 571159 581064 590595 600057 609084 617130 624556
56177F24556P766Q272P821O404M936M096L972M375M852M689L694K837L380N240
$$ 624556 632322 640594 648415 654819 659755 663851 667823 672198 677050 681739 685433 688270 691650 696890
56163F96890O660N910L164L95n95J27J041J077M89q6o28j166j021K77J679J455
$$ 696890 703550 709460 712624 713019 712424 712551 713592 714669 715158 715072 714444 713278 712257 712534 714213 715668
56147G15668n35k462k770j804q66n66n94l85O11K621M911O086N603M528M173M554
$$ 715668 715133 712671 709901 708097 707231 706665 706071 705686 706297 708918 713829 719915 725518 730046 734219 738773
56131G38773M772M500M305M779N969P427Q405Q292P404O998P876R181R278P731
$$ 738773 743545 748045 752350 757129 763098 770525 778930 787222 794626 801624 809500 818681 827959 835690
56117H35690N896N484O960R343J1229J1913J1682J1181J0637J0014R649J0116
$$ 835690 841586 847070 854030 863373 874602 886515 898197 909378 920015 930029 939678 949794
56105I49794J1301J2334J2746J3130J4247J6087J8233K0534K2834K4566K5297
$$ 949794 961095 973429 986175 999305 1013552 1029639 1047872 1068406 1091240 1115806 1141103
56094A141103K5331K5253K5291K5680K7140L0116L4002L7857M1720M6360N1916
$$ 1141103 1166434 1191687 1216978 1242658 1269798 1299914 1333916 1371773 1413493 1459853 1511769
56083A511769N7644O3030O8510P5049Q3524R4401J07316J20862J33274J43249
$$ 1511769 1569413 1632443 1700953 1776002 1859526 1953927 2061243 2182105 2315379 2458628
56073B458628J49639J50755J45155J33511J18951J04964R3266Q3777P5781O8255
$$ 2458628 2608267 2759022 2904177 3037688 3156639 3261603 3354869 3438646 3514427 3582682
56063C582682N9460M7369L1324J3029m507j8967k9438l5638l7898l8579m2219
$$ 3582682 3642142 3689511 3720835 3733864 3729357 3710390 3680952 3645314 3607416 3568837 3526618
56052C526618n2432o8305q5006r8202j06973j12408j14975j14133j09408j00894
$$ 3526618 3474186 3405881 3320875 3222673 3115700 3003292 2888317 2774184 2664776 2563882
56042B563882q9383p6816o5643n6820m9103m1226l3856k8192k3627j8448j2466
$$ 2563882 2474499 2397683 2332040 2275220 2226117 2184891 2151035 2122843 2099216 2080768 2068302
56031B068302p324m126k178k78J939M201O213P791R078J0714J3038J5287J6438
$$ 2068302 2060978 2056852 2054674 2054396 2056335 2060536 2066749 2074540 2083618 2094332 2107370 2122657 2139095
56018B139095J6869J8169K1203K5142K8518L0463L0934L0422K9693K9253K9180
$$ 2139095 2155964 2174133 2195336 2220478 2248996 2279459 2310393 2340815 2370508 2399761 2428941
56007B428941K9693L1300L3740L5607L6169L6880L9605M3817M7096M8177M7835
$$ 2428941 2458634 2489934 2523674 2559281 2595450 2632330 2671935 2715752 2762848 2811025 2858860
55996B858860M7056M6280M6515M8951N2833N5637N6264N6463N8248O1451O4760
$$ 2858860 2905916 2952196 2998711 3047662 3100495 3156132 3212396 3268859 3327107 3388558 3453318
55985C453318O7576O9719P0807P1258P2626P5598P8767Q0718Q2199Q4754Q8315
$$ 3453318 3520894 3590613 3661420 3732678 3805304 3880902 3959669 4040387 4122586 4207340 4295655
55974D295655R1854R5511J00124J05174J09225J12402J16539J22528J28989J34235
$$ 4295655 4387509 4483020 4583144 4688318 4797543 4909945 5026484 5149012 5278001 5412236
55964E412236J38501J43584J50870J60170J70111J79500J88403J97806K08064
$$ 5412236 5550737 5694321 5845191 6005361 6175472 6354972 6543375 6741181 6949245
55955F949245K18286K27818K37682K49528K63545K78291K92451L05978L19675
$$ 6949245 7167531 7395349 7633031 7882559 8146104 8424395 8716846 9022824 9342499
55946I342499L34659L52079L72434L94914M18212M42121M67714M95826N25934
$$ 9342499 9677158 10029237 10401671 10796585 11214797 11656918 12124632 12620458 13146392
55937A3146392N56786N87715O19242O52498O88003P24991P62440Q00856Q42198
$$ 13146392 13703178 14290893 14910135 15562633 16250636 16975627 17738067 18538923 19381121
55928A9381121Q87563R36033R86663J040575J099729J164538J234448J310313
$$ 19381121 20268684 21204717 22191380 23231955 24331684 25496222 26730670 28040983
55920B8040983J394195J486807J587155J695175J812879J942266K083938K238783
$$ 28040983 29435178 30921985 32509140 34204315 36017194 37959460 40043398 42282181
55912D2282181K409397K598404K806678L034937L286327L565935L878293M227037
$$ 42282181 44691578 47289982 50096660 53131597 56417924 59983859 63862152 68089189
55904F8089189M616863N054323N546595O100794O724649P426445Q213259R089265
$$ 68089189 72706052 77760375 83306970 89407764 96132413 103558858 111772117 120861382
55896A20861382J0054991J1106200J2231698J3410878J4610169J5775814J6823397
$$ 120861382 130916373 142022573 154254271 167665149 182275318 198051132 214874529
55889B14874529J7628242J8019835J7783634J6682697J4517678J1222670O950873
$$ 214874529 232502771 250522606 268306240 284988937 299506615 310729285 317680158
55882C17680158K083698k863243p391016j1141953j3945779j5795275j6791244
$$ 317680158 319763856 316900613 309509597 298367644 284421865 268626590 251835346
55875B51835346j7088302j6853686j6241765j5383210j4383121j3321555j2254934
$$ 251835346 234747044 217893358 201651593 186268383 171885262 158563707 146308773
55868A46308773j1220018j0239571r326707q487429p722903p031320o408160n846232
$$ 146308773 135088755 124849184 115522477 107035048 99312145 92280825 85872665 80026433
55860H0026433n337748m877083m460900m085955l748077l443442l169481k923986
$$ 80026433 74688685 69811602 65350702 61264747 57516670 54073228 50903747 47979761
55852D7979761k704125k506577k327908k164735k014459j876058j749259j632790
$$ 47979761 45275636 42769059 40441151 38276416 36261957 34385899 32636640 31003850
55844C1003850j524329j422465j327568j240294j160209j086386j018424r55974
$$ 31003850 29479521 28057056 26729488 25489194 24328985 23242599 22224175 21268201
55836B1268201q97953q43000p90395p40054o91951o45980o01872n58929n16360
$$ 21268201 20370248 19527248 18736853 17996799 17304848 16658868 16056996 15498067 14981707
55827A4981707m74343m34180l96953l62671l31423l04869k85802k76417k77400
$$ 14981707 14507364 14073184 13676231 13313560 12982137 12677268 12391466 12115049 11837649
55818A1837649k88007l05921l27195l47504l64033l75866l82519l82897l76320
$$ 11837649 11549642 11243721 10916526 10569022 10204989 9829123 9446604 9063707 8687387
55809H687387l64142l49378l34324l19042l02648k85520k69245k54487k40349
$$ 8687387 8323245 7973867 7639543 7320501 7017853 6732333 6463088 6208601 5968252
55800E968252k26378k13784k03448j93971j83402j72312j62997j55761j48288
$$ 5968252 5741874 5528090 5324642 5130671 4947269 4774957 4611960 4456199 4307911
55791D307911j39235j30327j23793j19474j15865j12454j09418j06143j01888
$$ 4307911 4168676 4038349 3914556 3795082 3679217 3566763 3457345 3351202 3249314
55782C249314r7262r3423r0246q6638q2314p7861p3488o9218o5751o3561o1442
$$ 3249314 3152052 3058629 2968383 2881745 2799431 2721570 2648082 2578864 2513113 2449552 2388110
55771B388110n7883n3779n1660n1853n1582m8840m5158m3099m2561m1410l8904
$$ 2388110 2330227 2276448 2224788 2172935 2121353 2072513 2027355 1984256 1941695 1900285 1861381
55760A861381l6434l5125l4454l3470l2015l0223k7872k4957k2179k0152j8623
$$ 1861381 1824947 1789822 1755368 1721898 1689883 1659660 1631788 1606831 1584652 1564500 1545877
55749A545877j7142j6190j6725j8453j9479j8261j5526j3419j2853j2567j1094
$$ 1545877 1528735 1512545 1495820 1477367 1457888 1439627 1424101 1410682 1397829 1385262 1374168
55738A374168q764p037o403n942m949m049m397o271q841j1020j2335j3223j4565
$$ 1374168 1365404 1358367 1351964 1346022 1341073 1337024 1332627 1326356 1317515 1306495 1294160 1280937 1266372
55725A266372j6784j9412k1769k3888k6220k8530k9713k9038k7049k4868k2927
$$ 1266372 1249588 1230176 1208407 1184519 1158299 1129769 1100056 1071018 1043969 1019101 996174
55714I96174k0784j8003j4874j2297j1102j1468j2805j4184j4887j4720j4063
$$ 996174 975390 957387 942513 930216 919114 907646 894841 880657 865770 851050 836987
55703H36987j3643j3852j4064j3116j0930r095r167j0798j2408j3254j3648j3351
$$ 836987 823344 809492 795428 782312 771382 762287 753120 742322 729914 716660 703012 689661
55691F89661j1484q541o876p997j0255j0606q154m816k725k229k525l113m017
$$ 689661 678177 669636 662760 654763 644508 633902 625748 620932 618207 615978 613453 610340 606323
55678F06323n140o100o680p151p956r062r776r477q482p735p600p632p624q132
$$ 606323 601183 595083 588403 581252 573296 564234 554458 544981 536499 528764 521164 513532 505908 497776
55664D97776r473j0932j1556j1177r990p834m882k505k124l284l987l154j730
$$ 497776 488303 477371 465815 454638 444648 436814 431932 429427 427303 424019 420032 416878 415148
55651D15148j140j634k529l261l661l825m208n358p098q453q690q064p270o655
$$ 415148 414008 412374 409845 406584 402923 399098 394890 389532 382434 373981 365291 357227 349957 343302
55637C43302o293o252o350o079n288m547m395m622m753m824n081n224m627l266
$$ 343302 337009 330757 324407 318328 313040 308493 304098 299476 294723 289899 284818 279594 274967 271701
55623B71701j775o37Q9K84l29j560k633l021l035l186l308k859j970j560k145
$$ 271701 269926 269289 269378 269662 269333 267773 265140 262119 259084 255898 252590 249731 247761 246201 244056
55608B44056k991l009k235j792k332l206l408k755j634k05J407K557K628K007
$$ 244056 241065 238056 235821 234029 231697 228491 225083 222328 220694 220489 221896 224453 227081 229088
55594B29088J702K055K665L422M511N345M809K945J180L27l21j196j280k3R04
$$ 229088 230790 232845 235510 238932 243443 248788 253597 256542 257722 258049 257728 256532 255252 255229 256133
55579B56133l21k771m000l792m217n875o551m709k140j490k510k736j147P54J447
$$ 256133 255812 253041 249041 245249 241032 235157 228606 223897 221757 220267 217757 215021 213874 214628 216075
55564B16075J255J278J653J662Q86k61r58o32N51J631J510j7j866k472j134J205
$$ 216075 217330 218608 220261 221923 222809 222548 221590 220958 221509 223140 224650 224633 222767 220295 219161 220366
55548B20366K636J944k89k386l293l210k662j741n89J40K5l49j75M03O22L12q6
$$ 220366 223002 224946 224657 222271 218978 215768 213106 211365 210776 210916 210941 210592 210417 210820 211442 211754 211668
55531B11668m99j157j595q49R96K655L438M128N344O242O014N758P218J0062J2144
$$ 211668 211169 210012 208417 207568 208564 211219 214657 218785 224129 230371 236385 242143 249361 259423 271567
55516B71567J2531J2480J2913J2595R926N234k6n312j0636j4839j6300j5449j4758
$$ 271567 284098 296578 309491 322086 332012 337246 337220 331908 321272 306433 290133 274684 259926
55503B59926j5651j6862j6629j5128j3616j2240j0271p988o830p491q900r426
$$ 259926 244275 227413 210784 195656 182040 169800 159529 151541 144711 137220 128320 118894
55491A18894q368o250m258l466l990m779m829m441m621n276n050l172n56J339
$$ 118894 110526 104276 100018 96552 92562 87783 82954 78513 73892 68616 63566 60394 59838 61177
55477F1177J910J189q03l571n617n570l764j883j006p95o58r42k344m600o436
$$ 61177 63087 64276 63473 59902 54285 48715 44951 43068 42062 41267 40609 39667 37323 32723 26287
55462B6287o906o401o003H58e306n590m600l554k189j67J820K495J614M61L56
$$ 26287 19381 12980 6977 858 -5306 -10896 -15496 -19050 -21239 -21406 -19586 -17091 -15477 -15016 -14660
55447a4660J349K560L201L029b133IK959M285M824M173L259K761K157J010J30
$$ -14660 -13311 -10751 -7550 -4521 -2133 9 2968 7253 12077 16250 19509 22270 24427 25437 25567
55432B5567L94J275J753J997K757L656L565K411J182L36k74q6J780M483N669M395
$$ 25567 25961 27236 28989 30986 33743 37399 40964 43375 44557 44893 44619 44533 46313 50796 56465 60860
55416F0860K342J393J385J146M34l42j168j970j998r97k07r15k529l442l278k994
$$ 60860 63202 64595 65980 67126 67560 67218 66050 64080 62082 61085 60878 59963 57434 53992 50714 47720
55400D7720l032k833k137j434j058r40j247k183l069k868j828j266j449j003Q03
$$ 47720 44688 41855 39718 38284 37226 36286 35039 32856 29787 26919 25091 23825 22376 21373 22176
55385B2176K532K395P71l82j95K77p2p72n95N69J330M18j606k832k209o95K36
$$ 22176 24708 27103 27874 27492 27297 27574 27502 26730 26135 26704 28034 28452 26846 24014 21805 21110 21346
55368B1346O23J511K796K994J497l98j383j843k579k939j750N16K083K229J775
$$ 21346 21969 23480 26276 29270 30767 30369 28986 27143 24564 21625 19875 20391 22474 24703 26478
55353B6478J219K0j834k971k339p99o2o83j905k862l047k121l00J248J346K49
$$ 26478 27697 27717 25883 22912 20573 19774 19712 19029 17124 14262 11215 9094 8794 10042 11388 11637
55337A1637o94p90o43r26j379j441j060l81P76K385L507L034J147o59j155m86
$$ 11637 10943 10153 9510 8584 7205 5764 4704 4323 5099 7484 10991 14025 15172 14513 13358 12872
55321A2872N39J550K423K553J293p91k034j554m25k60j037j261j58J317J954J878
$$ 12872 13411 14961 17384 19937 21230 20439 18405 16851 16426 16166 15129 13868 13710 15027 16981 18859
55305A8859J920K042J383l15k162l139l038k211j056N0P47J034J248J464J220
$$ 18859 20779 22821 24204 23889 21727 18588 15550 13339 12283 12333 13080 14114 15362 16826 18046
55290A8046J84j188k027j982j432q44k91M45J475K459K665J557m38j990j981o41
$$ 18046 18230 17042 15015 13033 11601 10757 10466 10911 12386 14845 17510 19067 18629 16639 14658 14017
55274A4017O85Q73P1n76j14J119J661M79j550k277q47R50P43j398l031k538j037
$$ 14017 14702 15575 15646 15070 14956 16075 17736 18215 16665 14388 13541 14491 15234 13836 10805 8267 7230
55257G230n71j424k224I67b26j95D10J571J488P80M08N69J47j425A372D1J707
$$ 7230 6659 5235 3011 967 -226 -421 410 1981 3469 4249 4657 5226 5373 3948 1372 41 1748
55240A748L625K730M88o98m08M0j39n40p67r76j106o56M41J479J793J367M96n41
$$ 1748 5373 8103 8591 7893 7485 7525 7386 6846 6079 5103 3997 3341 3782 5261 7054 8421 8917 8376
55222H376j352j650j708A727a96q04H1K111J479M33M37J105J084L15o2K09R3q58
$$ 8376 7024 5374 3666 1727 -196 -1000 81 2192 3671 4104 4541 5646 6730 7045 6983 7192 7285 6427
55204F427j612j166K0P64P04M46N92J095J407J019K2q46r22l31L42Q10R67L40
$$ 6427 4815 3649 3669 4433 5137 5583 6175 7270 8677 9696 9718 8872 7950 7619 7961 8771 9738 10078
55186A0078j275k797k634q10Q40J094Q14J238J891J449N7o58K06J685K174R54
$$ 10078 8803 6006 3372 2562 3402 4496 5310 6548 8439 9888 9945 9287 9493 11178 13352 14306
55170A4306j447l747m552A258C76J093J734J371O84Jn01m68K25J028J075J13j037
$$ 14306 12859 9112 4560 1258 376 1469 3203 4574 5258 5259 4758 4290 4515 5543 6618 6731 5694
55153E694j130K16J940K568J884J042R81J279J075M11l6q0p8j79l04o01j092j126
$$ 5694 4564 4780 6720 9288 11172 12214 13195 14474 15549 15960 15924 15844 15766 15587 15283 14682 13590 12464
55135A2464j88Q26M34j232k223j292M46J069L18m38k20M47L10j116k861l221j415
$$ 12464 12276 13102 13536 12304 10081 8789 9235 10304 10622 10184 9964 10411 10721 9605 6744 3523 2108
55118B108J343K894K427J137M81N52N83K72m5j09L5J67p3q08j330o99O43R00n65
$$ 2108 3451 6345 8772 9909 10390 10942 11525 11797 11752 11643 11678 11845 11772 10964 9634 8935 9578 10478 9913
55099I913j859r48J461K914K474J277K25q84j848j752p99n73j570k116j011L40
$$ 9913 8054 7106 8567 11481 13955 15232 15457 14573 12725 10973 10174 9601 8031 5915 4904 5244
55083E244K2j399j829q67m1j08j15O09J289J164O75L75j56j247A739p86J483K831
$$ 5244 5266 3867 2038 1171 1130 1022 907 1516 2805 3969 4644 5019 4863 3616 1739 953 2436 5267
55065E267J999nj109l45J405K486K009M47j054j787j858j621j085p6J291K493
$$ 5267 7266 7261 6152 5807 7212 9698 11707 12154 11100 9313 7455 5834 4749 4673 5964 8457
55049H457L014K723J974J378J364J744J866J335M92lm0j45o43j094q85j97J53
$$ 8457 11471 14194 16168 17546 18910 20654 22520 23855 24347 24344 24304 24159 23516 22422 21537 21340 21493
55032B1493q6r9P99J898J775K06j441k006j902k102k444j903l09J203J478L83
$$ 21493 21407 21308 22107 24005 25780 25986 24545 22539 20637 18535 16091 14188 13879 15082 16560 16943
55016A6943j392k795k651n22K216L152J432j018j720n58M48Nr75q99L84J622J835
$$ 16943 15551 12756 10105 9583 11799 14951 16383 15365 13645 13087 13535 13540 12565 11666 12050 13672 15507
54999A5507J270Q08Q07Q70N23r1m73m95n80j039j603j807j537r55k05N25R64J121
$$ 15507 16777 17585 18392 19262 19785 19694 19221 18726 18146 17107 15504 13697 12160 11205 11000 11525 12489 13610
54981A3610J352J689J472L10r80j216n24k26q86j445q05N78J349R57q1j143j844
$$ 13610 14962 16651 18123 18433 17453 16237 15713 15487 14601 13156 12351 12929 14278 15235 15154 14011 12167
54964A2167j634p7K206L678L443K218J396J518K065K359K114J310J88o10m68L40
$$ 12167 10533 10456 12662 16340 19783 22001 23397 24915 26980 29339 31453 32763 32951 32341 31873 32213
54948C2213O85j67j650k551k306j345l57K73M77M73P92J818L160L815L158J526
$$ 32213 32898 32731 31081 28530 26224 24879 24522 24795 25272 25745 26537 28355 31515 35330 38488 40014
54932D0014j69j025m58J393L272L537J801m37j322m88R27J735J679J276J314K234
$$ 40014 39845 38820 38362 39755 43027 46564 48365 47928 46606 46118 47045 48780 50459 51735 53049 55283
54916E5283L490L766K406L80p89p69l39L5M96P60P5j478k685k730k100j437n70
$$ 55283 58773 62539 64945 65325 64536 63767 63428 63463 63959 64719 64794 63316 60631 57901 55801 54364 53794
54899E3794N21Q91j6q89j9K037K795J130j190j940j210p61j414k433l153l827
$$ 53794 54315 55206 55190 54301 54282 56319 59114 60244 59054 57114 55904 55143 53729 51296 48143 44316
54883D4316m458m050j983N58J689J212P64J345J926J244kj8J486K980L530M001
$$ 44316 39858 35808 33825 34383 36072 37284 38048 39393 41319 42563 42561 42543 44029 47009 50539 54540
54867E4540N291O534O242M551L156L210M274N396O196O707O964P136P579Q214
$$ 54540 59831 66365 72607 77158 80314 83524 87798 93194 99390 106097 113061 120197 127776 135990
54853A35990Q277P079M811K180n16l449o460q700r382q732p816p416p295o743
$$ 135990 144267 151346 156157 158337 157821 154372 147912 139212 129830 121098 113282 105866 98571 91828
54839I1828n638m599m003l317j837Q0J059K27j661k943k780j713o44J85Q78J123
$$ 91828 86190 81591 77588 74271 72434 72514 73573 73800 72139 69196 66416 64703 64059 64244 65122 66245
54823F6245M98o11j093l13J414L698O539R430J0894J0045Q182P591Q745R756Q856
$$ 66245 66743 66132 65039 64726 66140 69838 76377 85807 96701 106746 114928 122519 131264 141020 149876
54808A49876O296L335N08k268m639n927o116n934o023o454o878o735n655m081
$$ 149876 156172 159507 160015 157747 153108 147181 141065 135131 129108 122654 115776 109041 103386 99305
54794I9305l159l415l968l626k492j719j931k572k780k246j347j002k054m053
$$ 99305 96146 92731 88763 85137 82645 80926 78995 76423 73643 71397 70050 69048 66994 62941
54780F2941m918l020M62K452J558m28j000K51K014L249L616K757N24k139l808
$$ 62941 58023 55003 55465 57917 59475 59047 58047 58298 60312 63561 67177 69934 70458 68319 64511
54765F4511m126l938l793l301k202j104o73p28p04n85q24j511k121k093j432o60
$$ 64511 60385 56447 52654 49353 47151 46047 45374 44646 43942 43357 42533 41022 38901 36808 35376 34716
54749C4716k61jR59K870M388L635O28k152k405o06R07R76M82K82m2q49j210j97
$$ 34716 34455 34454 35413 38283 42671 46306 46934 44782 42377 41771 42678 43654 44136 44418 44376 43527 42317 42120
54731D2120J400J923J024m8k30L65J198K007K566K646K457K467K566K214J602
$$ 42120 43520 45443 46467 46419 46189 46554 47752 49759 52325 54971 57428 59895 62461 64675 66277
54716F6277J669K509K820J769N55J032L197N229N835N505N338N693O412P504Q966
$$ 66277 67946 70455 73275 75044 75599 76631 79828 85057 90892 96397 101735 107428 113840 121344 130310
54701A30310J0220J0439R352P475N543L862K201K66j698k796k283n86O83J45j882
$$ 130310 140530 150969 160321 167796 173339 177201 179402 179668 177970 175174 172891 172305 172988 173133 171251
54686A71251l584l419j531P71K580L937N021N528N207M350L219J659j18j046o36
$$ 171251 167667 164248 162717 163488 166068 170005 175026 180554 185761 190111 193330 194989 194871 193825 193189
54671A93189l51k040n040o522n274l496l749n442n828l665k84K614M589N768N827
$$ 193189 192838 190798 185758 179236 173962 170466 166717 161275 155447 151782 151498 154112 158701 164469 170296
54656A70296M433J989n59k393l323l824m554n513n993n665n248n534o255o722
$$ 170296 174729 176718 176159 173766 170443 166619 162065 156552 150559 144894 139646 134112 127857 121135
54642A21135p008p432p287n402k162L67O66p74k581m021m841m601l220j643j033
$$ 121135 114127 106695 99408 94006 91844 92211 92877 92103 89522 85501 80660 76059 72839 71196 70163
54627G0163j334j300j09J535K173J307L9j94P38J754K157K382K828K902J967N86
$$ 70163 68829 67529 67420 68955 71128 72435 72474 72280 73018 74772 76929 79311 82139 85041 87008 87594
54611H7594r4J19N60R53J484J883J569P17R5j50n33j076j181p85n40p60j190j775
$$ 87594 87500 87619 88179 89132 90616 92499 94068 94785 94880 94730 94197 93121 91940 91155 90615 89855 88665 86890
54593H6890k459k337m99K121L406K936K455K918L083J988R08J309K579L447M258
$$ 86890 84431 82094 81595 83716 87122 90058 92513 95431 98514 100502 101410 102719 105298 108745 113003
54578A13003N803P097O611N101M964O947R502J1332J2665J3793J4246J3888J3285
$$ 113003 118806 125903 132514 137615 142579 149526 159028 170360 183025 196818 211064 224952 238237
54565B38237J2505J0954Q820P177O029L726o81n658q853r742r566r372r209q934
$$ 238237 250742 261696 270516 277693 283722 287448 286767 281109 272256 262514 252948 243576 234367 225433
54551B25433q761q900r217r302q658p109n297m353m583m940m313l061k499k986
$$ 225433 216672 207772 198555 189253 180595 173486 168189 163836 159253 154313 150000 146939 144440 141454
54537A41454l408k784j603j034j236j285o85j29l22p98o43lO5o84j130l30J125
$$ 141454 138046 135262 133659 132625 131389 130104 129419 129290 128968 128170 127527 127524 127589 126905 125775 125445 126570
54520A26570J885J387R5j323k338k525j865j010o11m83P1J281K676L691M082L926
$$ 126570 128455 129842 129937 128614 126276 123751 121886 120876 120265 119782 119853 121134 123810 127501 131583 135509
54504A35509L490K967K172Q81l61n71J93N97n8o46K5J166J125m9p48j84R23J921
$$ 135509 138999 141966 144138 145019 144658 144087 144280 144877 144819 144173 144198 145364 146489 146440 145692 145508 146431 148352
54486A48352K861L405K778J255L00O23J316J462J312J369J574K070L401N049N131
$$ 148352 151213 154618 157396 158651 158951 159574 160890 162352 163664 165033 166607 168677 172078 177127 182258
54471A82258K790j66j298l97R74K035L286M818N755N574M863M453M602N167N842
$$ 182258 185048 184882 183584 183187 184161 186196 189482 194300 200055 205629 210492 214945 219547 224714 230556
54456B30556O128N645M694L931L471K765J446k25j826l246m555n634o199o085
$$ 230556 236684 242329 247023 250954 254425 257190 258636 258411 256585 253339 248784 243150 236951 230866
54442B30866n560n161n077m796l746k232j115o09j00P55J565K072K535K862K485
$$ 230866 225306 220145 215068 210272 206526 204294 203179 202570 202470 203225 204790 206862 209397 212259 214744
54427B14744J647J654K924L930L250J735J175J622J711J110Q85J563K520L326
$$ 214744 216391 218045 220969 224899 228149 229884 231059 232681 234392 235502 236387 237950 240470 243796
54413B43796M058M170K750L57j014m17R85J946K708L675L971K660M74r92j242
$$ 243796 247854 252024 254774 255131 254117 253700 254685 256631 259339 263014 266985 269645 270119 269127 267885
54398B67885j000q34p27p18j142k265l997n697o121m518k078j202k553l982l385
$$ 267885 266885 266051 265324 264606 263464 261199 257202 251505 245384 240866 238788 237586 235033 231051 227666
54383B27666j577q40j552k035j367m50j27Q5P58J340R65k62j423j762j251n29
$$ 227666 226089 225249 223697 221662 220295 219845 219718 219803 220561 221901 222866 222604 221181 219419 218168 217639
54367B17639l62p70q85k28L18k67j409j739j373j792l289m253l605k265j318k64
$$ 217639 217277 216507 215622 215394 215712 215445 214036 212297 210924 209132 205843 201590 197985 195720 194402 194138
54351A94138J572L267L612L259L744M892M929L251J332P07J287K136K771L112
$$ 194138 195710 198977 202589 205848 209592 214484 219413 222664 223996 224703 225990 228126 230897 234009
54337B34009K975K229R67p47k764m427m944m382l640l256l010k866l294m147m204
$$ 234009 236984 239213 240180 239433 236669 232242 227298 222916 219276 216020 213010 210144 206850 202703 198499
54322A98499k619k04J550K199K208J700M09j305k555l121l495l551k352J06K029
$$ 198499 195880 195676 197226 199425 201633 203333 203742 202437 199882 196761 193266 189715 187363 187469 189498
54307A89498J748l3j093n77J83j92j374k260k616k832k729j784l21N66M45J7J2
$$ 189498 191246 191213 190120 189543 189726 189534 188160 185900 183284 180452 177723 175939 175618 176184 176629 176646 176658
54290A76658L15M07J1r11k131k916k575j552j178j956k954l305l304l351l023
$$ 176658 176973 177380 177391 176480 174349 171433 168858 167306 166128 164172 161218 157913 154609 151258 148235
54275A48235k185k006l351m922m667k671r80p16j114j454k048k812k676j335j93
$$ 148235 146050 144044 140693 135771 131104 128433 127453 126737 125623 124169 122121 119309 116633 115298 115105
54260A15105m04j212j318r11j079j920k497k219j224J96J581K129J513O30N50
$$ 115105 114701 113489 112171 111260 110181 108261 105764 103545 102321 102517 104098 106227 107740 108370 108920
54245A08920R94Q09k24j082j011m81m48j336k863m260m620l617j986q41m73k90
$$ 108920 109914 110723 110499 109417 108406 107925 107477 106141 103278 99018 94398 90781 88795 87954 87481 87191
54229H7191J42N39M77K5m03n97q05j466k597l511l558l090l011l205k474n86P44
$$ 87191 87333 87872 88349 88374 87971 87374 86569 85103 82506 78995 75437 72347 69336 66131 63657 63071 63815
54212F3815R7j320j218M44J405M82q39p57L62Q63J25j032j618j285j76J196K199
$$ 63815 63912 62592 61374 61818 63223 63705 62866 62109 62471 63334 63459 62427 60809 59524 59348 60544 62743
54195F2743K652K905L025K496J258M25R59J996J572p24k938l134j869j350k442
$$ 62743 65395 68300 71325 73821 75079 75504 76463 78459 80031 79307 76369 73235 71366 70016 67574
54180F7574l654l331j804n98j75K88J140J512P49m95j278j609j934k035j407l25
$$ 67574 63920 60589 58785 58187 58012 58300 59440 60952 61701 61206 59928 58319 56385 54350 52943 52618
54164E2618M11N20K66k94j281k303k589j758P7K531M718N273L652J080p64j627
$$ 52618 53029 53549 53815 53521 52240 49937 47348 45590 45667 48198 52916 58189 61841 62921 62157 60530
54148F0530k228k439j493K12J163Q99M43K57m78j914k599j669m14l66r44o31M82
$$ 60530 58302 55863 54370 54582 55745 56644 57087 57344 56866 54952 52353 50684 50270 49904 48960 48329 48811
54131D8811R86N24J79N86J068R17L23k81r26j693k173j762l62J259J832P19j043
$$ 48811 49797 50321 50500 51086 52154 53071 53394 53113 52187 50494 48321 46559 46197 47456 49288 50007 48964
54114D8964j408L16K335K374M30j429j725r66l55k59l69m66m52j72K55K92l75
$$ 48964 47556 47872 50207 52581 53011 51582 49857 48891 48536 48277 47908 47442 46990 46818 47073 47365 46990
54097D6990j298j753j607j199o21M37J918K940K587J095k37m86j31k33r35j376
$$ 46990 45692 43939 42332 41133 40512 40949 42867 45807 48394 49489 49252 48766 48635 48402 47467 46091
54081D6091r88k04L14M63L83p1r73j858k117j812j548j601j500n89J063K442K449
$$ 46091 45103 44899 45213 45676 46059 45988 45015 43157 41040 39228 37680 36079 34579 33990 35053 37495 39944
54064C9944J124k18n43l68q32j785j930r93l58r36j580p57J032J874J067j30l77
$$ 39944 41068 40850 40307 39939 39107 37322 35392 34399 34041 33105 31525 30768 31800 33674 34741 34611 34234
54047C4234K45Q44Q48K19q46j851k069j055Q55K663L391K799J586O91L49R0l68
$$ 34234 34479 35323 36171 36390 35544 33693 31624 30569 31424 34087 37478 40277 41863 42554 42903 42993 42625
54030D2625p59r30j224j803k199j997j445q77j80N88P22n4o48K53K319L886L976
$$ 42625 41866 40936 39712 37909 35710 33713 32268 31391 31211 31799 32521 32467 31819 32072 34391 38277 42253
54013D2253L089K120J522J575K422L522L763K587O16j014j603j284p73p26r32
$$ 42253 45342 47462 48984 50559 52981 56503 60266 62853 63469 62455 60852 59568 58795 58069 57137
53998E7137m65R99K462K805K271J941K156K386K332K094J471K81p35n19O96J537
$$ 57137 56672 57671 60133 62938 65209 67150 69306 71692 74024 76118 77589 77870 77135 76616 77312 78849
53982G8849J330O34j43j230k316k300q58Q48J662J585R60k33j512j682n31L28
$$ 78849 80179 80813 80670 79440 77124 74824 73966 74814 76476 78061 79021 78788 77276 75594 75063 75391
53966G5391m19j753j790n14M33L05k1J19J22n75j285j002j1K31j146l176l971
$$ 75391 74972 73219 71429 70915 71348 71653 71632 71751 71873 71298 70013 69011 69000 69231 68085 64909 60938
53949F0938k979j767j924k622j621J226L112J945o54j547l11P26J66q23q87m74
$$ 60938 57959 56192 54268 51646 50025 51251 54363 56308 55654 54107 53796 54522 54688 53865 52978 52504
53933E2504o23j183j388j227j176j184q26j16N78J126J528J552J190J060J602
$$ 52504 51881 50698 49310 48083 46907 45723 44897 44781 45359 46485 48013 49565 50755 51815 53417
53918E3417K117J541J21n99K33J614K059J538J257J756K125J363r0p51J16J681
$$ 53417 55534 57075 57196 56597 56830 58444 60503 62041 63298 65054 67179 68542 68452 67701 67817 69498
53902F9498K581K440K113K608L914M912M467K697J045P71J413J249m99k390k208
$$ 69498 72079 74519 76632 79240 83154 88066 92533 95230 96275 97046 98459 99708 99209 96819 94611
53887I4611M31L408M189K330j71r45L97K044K182J079M40R08J259M63n37j76J351
$$ 94611 95042 98450 102639 104969 104798 103853 104250 106294 108476 109555 109995 110903 112162 112625 112088 111912 113263
53870A13263K416K351K039K057J785R04L73R43J736J591R67J225K353K855J872
$$ 113263 115679 118030 120069 122126 123911 124815 125188 126131 127867 129458 130425 131650 134003 136858 138730
53855A38730K24r56j539k007k552l071l507l687l305k381j394p21l91n30j414
$$ 138730 138954 137998 136459 134452 131900 128829 125322 121635 118330 115949 114555 113834 113443 112913 111499
53840A11499k716l449l123k444k275k454k300j797j379q54L97K204L480L521K602
$$ 111499 108783 105334 102211 99767 97492 95038 92738 90941 89562 88708 89105 91309 94789 98310 100912
53825A00912J144q24k940m121l654k254j264j073r63m29J02jp68j795k737l178
$$ 100912 102056 101232 98292 94171 90517 88263 86999 85926 84963 84534 84636 84635 83867 82072 79335 76157
53809G6157k464l75J943K556P25j944k990j677M50J505J132L04J3O50K003L237
$$ 76157 73693 73318 75261 77817 78542 76598 73608 71931 72381 73886 75018 75322 75335 75985 77988 81225
53793H1225L243J800N4p72q41j055j335p34P50J754J421N59K96M69K08n17r36
$$ 81225 84468 86268 86322 85550 84709 83654 82319 81585 82335 84089 85510 86069 86365 86834 87042 86525 85589
53776H5589p34m93q53j797k690k659j221R97K354J630o33k588k839j471M26J798
$$ 85589 84855 84362 83509 81712 79022 76363 75142 76139 78493 80123 79490 76902 74063 72592 73018 74816
53760G4816K260K097J804J539J120N26J06R2K74M08O13J084J753K443L043L262
$$ 74816 77076 79173 80977 82516 83636 84162 84268 84360 84634 85042 85655 86739 88492 90935 93978 97240
53744I7240K692J574R85J710L170M074L886L089K273J560Q50M2j014k254l135
$$ 97240 99932 101506 102491 104201 107371 111445 115331 118420 120693 122253 123103 123145 122131 119877 116742
53729A16742l027j885k20J422K657L094K487J067n53j731k025j461p84q61j456
$$ 116742 113715 111830 111610 113032 115689 118783 121270 122337 121784 120053 118028 116567 115783 114922 113466
53714A13466j231L49J844J458m76j830j393j41L98Jm80m52m3L91O49O72N00K86
$$ 113466 112235 112584 114428 115886 115410 113580 112187 112046 112444 112445 111965 111513 111470 111861 112510 113182 113682 113968
53696A13968J75R2l70j499k749k819j150R19J460M94j8R44J964J484P3q50j303
$$ 113968 114143 114235 113865 112366 109617 106798 105648 106567 108027 108521 108503 109447 111411 112895 112968 112118 110815
53679A10815j951k087o32J352J605J41n56N85J489J91k101k746j125J220L008
$$ 110815 108864 106777 106145 107497 109102 109243 108687 109272 110761 110952 108851 106105 104980 106200 109208
53664A09208M060M267L303J567L56O27J973L064K875J627N01L93J042J612J813
$$ 109208 113268 117535 120838 122405 122761 123388 125361 128425 131300 132927 133428 133821 134863 136475 138288
53649A38288J883J827J460J060J040J158J058J380K961M972N372L633J515O23
$$ 138288 140171 141998 143458 144518 145558 146716 147774 149154 152115 157087 162459 166092 167607 168230
53635A68230O76Q34J094J410R81k68q83O8J270J099K54O67K460L897M042L588
$$ 168230 168906 169740 170834 172244 173225 172957 172074 172142 173412 174511 174765 175432 177892 181789 185831 189419
53619A89419L113K209O98p56j636k060j975j024M37J190N69p54j775k146j927
$$ 189419 192532 194741 195439 194683 193047 190987 189012 187988 188425 189615 190184 189430 187655 185509 183582
53604A83582j181l59k63r39j175J31K391L791L271J453l79j632k391k557j745
$$ 183582 182401 182042 181779 180840 179665 179796 182187 185978 189249 190702 190323 188691 186300 183743 181998
53589A81998j60J066R77Pn41j07O66J029R78Q28O49M77N38R18J429J972K521K604
$$ 181998 181838 182904 183881 183888 183347 183240 183906 184935 185913 186741 187390 187867 188405 189323 190752 192724 195245 197849
53571A97849J629O2n74N39K440L677L948L848L678L294K584J331p21k858l158
$$ 197849 199478 199540 198966 199505 201945 205622 209570 213418 217096 220390 222974 224305 223584 220726 217568
53556B17568n21L491N979N835M487L643L451L143K400J544R08N13K14l9n9L89
$$ 217568 217047 220538 226517 232352 236839 240482 243933 247076 249476 251020 251928 252441 252655 252616 252557 252946
53540B52946J136J696J954K335K925K931J674k47j400j002M86J951K354J298n24
$$ 252946 254082 255778 257732 260067 262992 265923 267597 267350 265950 264948 265434 267385 269739 271037 270513
53525B70513j684j349j10Q12P99k3j246k246k410j898j580j640j029Q30K675K859
$$ 270513 268829 267480 267370 268182 268981 268958 267712 265466 263056 261158 259578 257938 256909 257739 260414 263273
53509B63273J658Q47J386K628L645M046L624K372R58L08O73J762L416N310O385
$$ 263273 264931 265778 267164 269792 273437 277483 281107 283479 284437 284745 285418 287180 290596 295906 302291
53494C02291N782M149K910K414J935J376J580K825M276N274O116P256Q578R784
$$ 302291 308073 312222 315132 317546 319481 320857 322437 325262 329538 334812 340928 348184 356762 366546
53480C66546J0715J1213J1241J1159J1205J1102J0880J1558J3803J6399J7594
$$ 366546 377261 388474 399715 410874 422079 433181 444061 455619 469422 485821 503415
53469E03415J7663J8404K0224K1635K1890K2129K3169K4150K4362K4878K6951
$$ 503415 521078 539482 559706 581341 603231 625360 648529 672679 697041 721919 748870
53458G48870K9948L2164L2924L2853L2668L2684L2932L3087L2737L2245L2679
$$ 748870 778818 810982 843906 876759 909427 942111 975043 1008130 1040867 1073112 1105791
53447A105791L4278L5853L6235L5653L5141L5329L6296L7611L8097L6598L3753
$$ 1105791 1140069 1175922 1212157 1247810 1282951 1318280 1354576 1392187 1430284 1466882 1500635
53436A500635L1847L2068L3087L3285L3022L3241L3098L1035K7692K5491K5210
$$ 1500635 1532482 1564550 1597637 1630922 1663944 1697185 1730283 1761318 1789010 1814501 1839711
53425A839711K4933K2967K0264J8761J8544J7906J5832J3222J1466J0661R710
$$ 1839711 1864644 1887611 1907875 1926636 1945180 1963086 1978918 1992140 2003606 2014267 2023977
53414B023977P803N166K342o12l858p227j0502j3937j7861k1882k5189k7539k9262
$$ 2023977 2031780 2036946 2039288 2038676 2034818 2027591 2017089 2003152 1985291 1963409 1938220 1910681 1881419
53401A881419l0431l0843l0796l0955l1357l1449l1279l1589l2421l2708l1712
$$ 1881419 1850988 1820145 1789349 1758394 1727037 1695588 1664309 1632720 1600299 1567591 1535879
53390A535879l0031k8712k8148k8133k8116k7128k4588k1577j9992j9877j8889
$$ 1535879 1505848 1477136 1448988 1420855 1392739 1365611 1341023 1319446 1299454 1279577 1260688
53379A260688j5364j0622p112n311l809j566J335M522P541R623J0597J1770J4744
$$ 1260688 1245324 1234702 1227590 1222279 1218470 1216904 1218239 1222761 1230302 1239925 1250522 1262292 1277036
53366A277036J9473K4411K8269L0792L2279L3336L4811L6917L8799L9909M1347
$$ 1277036 1296509 1320920 1349189 1379981 1412260 1445596 1480407 1517324 1556123 1596032 1637379
53355A637379M4555M9006N2604N4331N5231N6661N8809O1276O3992O7073P0331
$$ 1637379 1681934 1730940 1783544 1837875 1893106 1949767 2008576 2069852 2133844 2200917 2271248
53344B271248P3358P5794P7548P9102Q1174Q3609Q5138Q5128Q4860Q5758Q6939
$$ 2271248 2344606 2420400 2497948 2577050 2658224 2741833 2826971 2912099 2996959 3082717 3169656
53333C169656Q6241Q3568Q1223Q0427P9388P6015P0990O6587O3280N9309N3446
$$ 3169656 3255897 3339465 3420688 3501115 3580503 3656518 3727508 3794095 3857375 3916684 3970130
53322C970130M6668M0642L5591L0479K4834J9421J4930J0719N558o70o930j3010
$$ 3970130 4016798 4057440 4093031 4123510 4148344 4167765 4182695 4193414 4198972 4198302 4191372 4178362
53310D178362k0554l1193m4083n6274o5621p2562p8803q4892q9629r1777r1958
$$ 4178362 4157808 4126615 4082532 4026258 3960637 3888075 3809272 3724380 3634751 3542974 3451016
53299C451016r2432r4689r7629r8896r7912r6409r5615r4462r1655q8186q6042
$$ 3451016 3358584 3263895 3166266 3067370 2969458 2873049 2777434 2682972 2591317 2503131 2417089
53288B417089q5211q3912q1479p8988p6883p4066p0009o5949o2923o0083n6201
$$ 2417089 2331878 2247966 2166487 2087499 2010616 1936550 1866541 1800592 1737669 1677586 1621385
53277A621385n1790m8293m5870m3256l9539l5046l0625k6838k3823k1212j8278
$$ 1621385 1569595 1521302 1475432 1432176 1392637 1357591 1326966 1300128 1276305 1255093 1236815
53266A236815j4691j1012q041n881l996j984J89K397M385N837O875Q224J0422
$$ 1236815 1222124 1211112 1203071 1197190 1193194 1191210 1191399 1193796 1198181 1204018 1210893 1219117 1229539
53253A229539J3097J5525J7548J9476K1341K2981K4644K6759K9127L1100L2722
$$ 1229539 1242636 1258161 1275709 1295185 1316526 1339507 1364151 1390910 1420037 1451137 1483859
53242A483859L4802L7483L9554M0017L9710M0404M2359M3874M3588M2199M1188
$$ 1483859 1518661 1556144 1595698 1635715 1675425 1715829 1758188 1802062 1845650 1887849 1929037
53231A929037M0683L9647L7772L5780L3789L0896K6921K3295K1121J9396J6386
$$ 1929037 1969720 2009367 2047139 2082919 2116708 2147604 2174525 2197820 2218941 2238337 2254723
53220B254723J2105P936M248J20m529q347j0732j3133j7133k2297k6879l0006
$$ 2254723 2266828 2274764 2279012 2279132 2274603 2266256 2255524 2242391 2225258 2202961 2176082 2146076
53208B146076l2156l4136l6637m0222m4679m8600n0696n1461n2587n4768n7043
$$ 2146076 2113920 2079784 2043147 2002925 1958246 1909646 1858950 1807489 1754902 1700134 1643091
53197A643091n8311n8499n7925n6570n4547n2553n1167n0093m8729m7108m5750
$$ 1643091 1584780 1526281 1468356 1411786 1357239 1304686 1253519 1203426 1154697 1107589 1061839
53186A061839m4762m3711m2312m0809l9579l8639l7601l6032l3984l2202l1435
$$ 1061839 1017077 973366 931054 890245 850666 812027 774426 738394 704410 672208 640773
53175F40773l1338l0468k7807k3999k0587j8382j7104j6298j5676j4669j2703
$$ 640773 609435 578967 551160 527161 506574 488192 471088 454790 439114 424445 411742
53164D11742j0199q454q128q534q790q802q739q391p786p665q411r174q937p929
$$ 411742 401543 393089 384961 376427 367637 358835 350096 341705 333919 326254 317843 308669 299732 291803
53150B91803p000o171m964l732l301l492l255k316j440j048q85j087k148l592
$$ 291803 284803 278632 273668 269936 266635 263143 259888 257572 256132 255084 254199 253112 250964 247372
53136B47372m141l607l094k913k019k93M05j124l225l408j584L10R78N04q28k602
$$ 247372 243231 239624 236530 233617 231598 231305 231710 230586 227361 223953 222369 222679 223657 224161 223333 220731
53120B20731l546k531l62R47O43k39q28j362k022k176j468n91m61j207k284k968
$$ 220731 217185 214654 214292 215239 215882 215643 214815 213453 211431 209255 207787 207196 206735 205528 203244 200276
53104B00276k701j478q0P02Q24N20m24j997l044k424q53j07l80r2J311K124Q43
$$ 200276 197575 196097 196017 196719 197543 198063 197639 195642 192598 190174 189321 189214 188834 188742 190053 192177 193020
53087A93020j561k973k755j872j196q84j002j597k138j881r09j95m19j102j234
$$ 193020 191459 188486 185731 183859 182663 181779 180777 179180 177042 175161 174252 174057 173638 172536 171302
53072A71302n90j67r30k324k665j412k11o84j915j679L9O24j492m473n509m298
$$ 171302 170712 170545 169615 167291 164626 163214 163003 162319 160404 158725 158764 159388 157896 153423 147914 143616
53056A43616k753k120j973j636j126n74P5N98O00K86L62Q55Q35l20j901k676k378
$$ 143616 140863 138743 136770 135134 134008 133434 133509 134107 134707 134993 135355 136210 137045 136725 134824 132148 129770
53039A29770j869j874k143k031j482r13l44N65J421R58j178l162k724r1K033J645
$$ 129770 127901 126027 123884 121853 120371 119458 119114 119679 121100 122058 120880 117718 114994 114903 116936 118581
53023A18581m66k255k882k758k251j535j244j916k853k667j091O24J394J441J394
$$ 118581 118115 115860 112978 110220 107969 106434 105190 103274 100421 97754 96663 97287 98681 100122 101516
53008A01516J200O47K86P98J643J405k17j683j489k17J60j114k630k683j299M0
$$ 101516 102716 103363 103649 104447 106090 107495 107278 105595 104106 103889 104049 102935 100305 97622 96323 96363
52992I6363J96o34j432j305j68J041J027n28k464l448l424l231l017k054j60J530
$$ 96363 96559 95925 94493 93188 93020 94061 95088 94560 92096 88648 85224 81993 78976 76922 76762 78292
52976G8292J718L93j271k189k245k080k291k786k902k150p61N46J151Q10k01j049
$$ 78292 80010 80403 79132 76943 74698 72618 70327 67541 64639 62489 61728 62274 63425 64235 64034 62985
52960F2985r23rN08j38j374k104j908q90Q23K603L158K013N57M03J218J621J623
$$ 62985 62062 62053 62561 62423 61049 58945 57037 56147 56970 59573 62731 64744 65301 65704 66922 68543 70166
52943G0166K285L238K706M75j292j044J22M85J06p2j41o96j316j183n54k14k7
$$ 70166 72451 75689 78395 78870 77578 76534 76656 77141 77247 77175 77034 76338 75022 73839 73285 73071 73044
52926G3044P24J808K247J789J078M81j61n58P5J820L602M215L406J898P45O84
$$ 73044 73768 75576 77823 79612 80690 81171 81010 80452 80527 82347 85949 90164 93570 95468 96213 96897
52910I6897J577K528K784K433J858R73n47k454l973m515l970k548q30J89k00j681
$$ 96897 98474 101002 103786 106219 108077 109050 108503 106049 102076 97561 93591 91043 90213 90402 90202 88521
52894H8521l227m084m127l447k173o48O34J364J503J124L88m70j299k113k831
$$ 88521 85294 81210 77083 73636 71463 70815 71449 72813 74316 75440 75828 75358 74059 71946 69115
52879F9115l208l088k537j573j67J333K220K178J679J424J622J958J952J251M3
$$ 69115 65907 62819 60282 58709 58542 59875 62095 64273 65952 67376 68998 70956 72908 74159 74202
52864G4202q03n90J08K0j011j654j023RJ08p27j536j937k278k671k766k336j349
$$ 74202 73399 72809 72917 72937 71926 70272 69249 69258 69366 68639 67103 65166 62888 60217 57451 55115 53766
52847E3766K80K328L838L846K489P99m43j165j460j265o50oK42m9n90q34n71l35
$$ 53766 54046 56374 60212 64058 66547 67346 66903 65738 64278 63013 62363 62357 62599 62550 61960 61126 60555 60220
52829F0220o77j092n18Q71J471M32r77j159m03p6k55L06J931L193K682O64j468
$$ 60220 59543 58451 57933 58804 60275 60707 59730 58571 58168 58092 57837 58143 60074 63267 65949 66613 65145
52812F5145k620k450j053J132L259M349L945K544J331J191J923K567K493J872
$$ 65145 62525 60075 59022 60154 63413 67762 71707 74251 75582 76773 78696 81263 83756 85628
52798H5628J155N66J17m31j516l063l949l159j413m71o06l00J122K119J283l83
$$ 85628 86783 87349 87466 87035 85519 82456 78507 75348 73935 73464 72858 72558 73680 75799 77082 76699
52782G6699q89lR20J033N53k93j381k032j507q8J264K027K194J710P77J56K25
$$ 76699 75810 75807 76727 77760 78313 78020 76639 74607 73100 73012 74276 76303 78497 80207 80984 81140 81365
52765H1365M29N30J492L793N863N868M418L662M015L725J647j242l337l911l057
$$ 81365 81794 82324 83816 87609 93472 99340 103758 107420 111435 115160 116807 115565 112228 108317 105260
52750A05260j502n78j095k211k600k403k602k925k261j004q13j797k249j661j714
$$ 105260 103758 103180 102085 99874 97274 94871 92269 89344 87083 86079 85266 83469 81220 79559 77845
52735G7845l293m683m094k246q58p5R59K010J988P10j006k572l816m344l834k682
$$ 77845 74552 69869 65775 63529 62671 62596 63555 65565 67553 68263 67257 64685 60869 56525 52691 50009
52719E0009j557n25O65J763K235K011J486J014Q51J157J536J103m33k094k634
$$ 50009 48452 47927 48592 50355 52590 54601 56087 57101 57952 59109 60645 61748 61315 59221 56587
52704E6587j941r76n55m98L6J571L423M047K742P24k26Q9N23O48J078J639J056
$$ 56587 54646 53670 53115 52617 52653 54224 57647 61694 64436 65160 64934 65023 65546 66194 67272 68911 69967
52687F9967q53k269j789l53M38O25J037J242K50j304j629m63M36j24j159j175
$$ 69967 69114 66845 65056 64703 65141 65766 66803 68045 68295 66991 65362 64899 65335 65211 64052 62877
52671F2877l97k92j466k840k933j374R27K733L282K474Q37m62k02J628L357L264
$$ 62877 62480 62188 60722 57882 54949 53575 54502 57235 60517 62991 63828 63366 63164 64792 68149 71413
52655G1413J613L29N00J193J078K51k71k19k19n82q18m30M34J344K177L039L758
$$ 71413 73026 73355 73855 75048 76126 76377 76106 75887 75668 75086 74268 73838 74272 75616 77793 80832 84590
52638H4590L774K783J291J13o36j556k831l800l979l656k941j243J273K756J683
$$ 84590 88364 91147 92438 92551 91915 90359 87528 83728 79749 76093 73152 71909 73182 75938 77621
52623G7621q77k553k706k376j793k23J720K166R50R0M45K99j410k737j630O39
$$ 77621 76744 74191 71485 69109 67316 67093 68813 70979 71929 72019 72464 72763 71353 68616 66986 67625
52607F7625J170o13k774l799l644k483n16J286J910J773J960K323J893Q00J59
$$ 67625 68795 68182 65408 61609 57965 55482 54966 56252 58162 59935 61895 64218 66111 66911 67070
52592F7070Q0l79j189j052L24J298M86j344k536k711k635k517j648K58K246L045
$$ 67070 67150 66771 65582 64530 64854 66152 66638 65294 62758 60047 57412 54895 53247 53505 55751 58796
52576E8796K523J793J788K147J830P32q9J13P52P93P1p56j118q66j18P26J096
$$ 58796 61319 63112 64900 67047 68877 69609 69520 69633 70385 71178 71249 70493 69375 68509 68391 69117 70213
52559G0213Q38L65L5k19m04l08k15r09k454l639l377k032p21L9L23K46K20R74
$$ 70213 71051 71416 71451 71232 70828 70520 70305 69396 66942 63303 59926 57894 57173 57212 57535 57781 58001 58975
52541E8975K431L275K664J624J614K302K185R61j78l94p8K64P01J235J429J011
$$ 58975 61406 64681 67345 68969 70583 72885 75070 76031 75853 75459 75381 75645 76346 77581 79010 80021
52525H0021K69l33m97k06J74J93M7N03J589K142J366n2j185k156l063k745m30
$$ 80021 80290 79957 79460 79254 79428 79621 79668 80171 81760 83902 85268 85216 84031 81875 78812 76067 75637
52508G5637K174K546Q49l06M15J645J959J837K084K065R00o72j051O6J349J507
$$ 75637 77811 80357 81206 80900 81315 82960 84919 86756 88840 90905 91805 91133 90082 90148 91497 93004
52492I3004P06J54N94J306J074R3O4J801L701L719J982Q3j389k769l388k116Q8
$$ 93004 93710 93864 94458 95764 96838 96931 96995 98796 102497 106216 108198 108281 106892 104123 100735 98619 98707
52475I8707O09j162k773k263p62k75p32q73o53q82j359j210o42o45j199j238m23
$$ 98707 99316 98154 95381 93118 92356 92081 91349 90476 89823 88941 87582 86372 85730 85085 83886 82648 82225
52458H2225M03P15J080J923K456J644j35j191m72J052J519N31m13q3P72P57k5
$$ 82225 82628 83343 84423 86346 88802 90446 90311 89120 88648 89700 91219 91750 91337 91254 92026 92783 92758
52441I2758m63n10j106k105k190j207p90j764k578j549O79K279K757K749K290
$$ 92758 92295 91785 90679 88574 86384 85177 84387 82623 80045 78496 79175 81454 84211 86960 89250
52426H9250R89m62p60P5O26J80m67n62m85p35p40L55K241L519L156J473l32j284
$$ 89250 90239 89777 89017 89092 89718 89898 89431 88869 88384 87649 86909 87264 89505 93024 96180 97653 97321 96037
52408I6037j262p05m5N14Q20P54M90M54P90J035O00m68j466j745j425j178j337
$$ 96037 94775 94070 94025 94539 95359 96113 96603 97057 97847 98882 99482 99014 97548 95803 94378 93200 91863
52391I1863j321l85J161J991J349%q19q34n75k83J31M64M36K00j06r36k438l526
$$ 91863 90542 90157 91318 93309 94658 94658 93839 93005 92430 92147 92278 92742 93178 93378 93272 92336 89898 86372
52373H6372l164k146j996k361j434Q58K268J512R4j66L91O29Q10J636K405J986
$$ 86372 83208 81062 79066 76705 75271 76129 78397 79909 80003 79837 80228 80857 81667 83303 85708 87694
52357H7694Q50M35J018J807K525L280L365J963m9p70L2M97o28k234k389p48J196
$$ 87694 88544 88979 89997 91804 94329 97609 100974 102937 102888 102118 102150 102647 102019 99785 97396 96648 97844
52340I7844J755O09r86j463o79m8n45j250p26P99J921K266K756L615L748K509
$$ 97844 99599 100208 99222 97759 97080 97032 96487 95237 94511 95310 97231 99497 102253 105868 109616 112125
52324A12125Q82J66M05O94L55o43j815k287j399M82K199L077L357L355K906J984
$$ 112125 113007 113173 113578 114272 114627 113984 112169 109882 108483 108965 111164 114241 117598 120953 123859 125843
52308A25843R76Qj250k570k767j036J751L787M096L173K151J820K178K539K250
$$ 125843 126819 126827 125577 123007 120240 119204 120955 124742 128838 132011 134162 135982 138160 140699 142949
52293A42949J542J345J954K416J770M99l4N80J297J102L16k9L83J012J537K384
$$ 142949 144491 145836 147790 150206 151976 152475 152441 153021 154318 155420 155736 155707 156090 157102 158639 161023
52277A61023L793M982M947L851K953L066L872M891O105P184P072N347L271K389
$$ 161023 164816 169798 174745 178596 181549 184615 188487 193378 199483 206667 213739 219086 222357 224746
52263B24746K571K651K569L277M613N016L914K725K701L138K859K288K594L521
$$ 224746 227317 229968 232537 235814 240427 245443 249357 252082 254783 257921 260780 263068 265662 269183
52249B69183L646K521J118J89n62j494k265k401j854p37P86K125K592K426K690
$$ 269183 272829 275350 276468 276657 276095 274601 272336 269935 268081 267344 268130 270255 272847 275273 277963
52234B77963L761M671M452L449K634K182J524N21k47k27P18K454M387N271M305
$$ 277963 281724 286395 290847 294296 296930 299112 300636 301157 300910 300683 301401 303855 308242 313513 317818
52219C17818K527K142L844N661N331L216J831K661M524N276M259K641J971K867
$$ 317818 320345 322487 326331 331992 337323 340539 342370 345031 349555 354831 359090 361731 363702 366569
52205C66569M677N877N242L134J378J379K586L365L070K493K364K469K499K919
$$ 366569 371246 377123 382365 385499 386877 388256 390842 394207 397277 399770 402134 404603 407102 410021
52191D10021M213N855O767O588N802M830L729K790K603L233L923M075M000M300
$$ 410021 414234 420089 426856 433444 439246 444076 447805 450595 453198 456431 460354 464429 468429 472729
52177D72729M870N199N324N762O542P042O976O875P235P711P617O814N656M386
$$ 472729 477599 482798 488122 493884 500426 507468 514444 521319 528554 536265 543882 550696 556352 560738
52163E60738L193K557K828L429L323K501K312L780N975O786N322K982J904K691
$$ 560738 563931 566488 569316 572745 576068 578569 580881 584661 590636 597422 602744 605726 607630 610321
52149F10321L989M239L301K127J295N09m52j089q92j71M18P75J109J088K10j082
$$ 610321 614310 618549 621850 623977 625272 625781 625329 624240 623348 623177 623595 624370 625479 626567 626777 625695
52133F25695j687j517j798l051l869k690k96P95o28l152m661m570l723k895k321
$$ 625695 624008 622491 620693 617642 613773 611083 610787 611582 610954 607802 603141 598571 594848 591953 589632
52118E89632k153k477k841k557j670j062j289j768j592q66o72j727l540m968n254
$$ 589632 587479 585002 582161 579604 577934 576872 575583 573815 572223 571357 570685 568958 565418 560450 555196
52103E55196m397k930j667j372k230l631m663m847m320l494k736k247k048k127
$$ 555196 550799 547869 546202 544830 542600 538969 534306 529459 525139 521645 518909 516662 514614 512487
52089E12487k603l515m355m275l099j767j304j618j784j294m86J80O07Q63R65
$$ 512487 509884 506369 502014 497739 494640 492873 491569 489951 488167 486873 486387 486567 487174 488037 489002
$$ [...]
##END NTUPLES=NMR SPECTRUM
##END=
