
##TITLE=AC1229_PANAH12122_6075152_Um2lDYV4CZ
##JCAMPDX= 6.0         $$ Bruker NMR JCAMP-DX V2.0
##DATA TYPE= NMR SPECTRUM
##DATA CLASS= NTUPLES
##ORIGIN= BRUKER
##OWNER= Administrator
$$ 1.72 TOPSPIN		Version 2.1
$$ 2012-05-07 23:54:22.843 -0500  Administrator@TOPSPIN
$$ Compression mode = diff/dup
##.OBSERVE FREQUENCY= 400.13188235
##.OBSERVE NUCLEUS= ^1H
##.ACQUISITION MODE= SIMULTANEOUS (DQD)
##.ACQUISITION SCHEME= undefined
##.AVERAGES= 8
##.DIGITISER RES= 22
##SPECTROMETER/DATA SYSTEM= spect
##.PULSE SEQUENCE= zg30
##.SOLVENT NAME= COFFEE_meoh
##.SHIFT REFERENCE= INTERNAL, COFFEE_meoh, 1, 14.98061
##AUDIT TRAIL= $$ (NUMBER, WHEN, WHO, WHERE, PROCESS, VERSION, WHAT)
$$ ##TITLE= Audit trail, TOPSPIN		Version 2.1
$$ ##JCAMPDX= 5.01
$$ ##ORIGIN= Bruker BioSpin GmbH
$$ ##OWNER= Administrator
$$ $$ C:\Bruker\TOPSPIN/data/COFFEE/nmr/AC1229_PANAH12122_6075152_Um2lDYV4CZ/10/pdata/1/auditp.txt
$$ ##AUDIT TRAIL=  $$ (NUMBER, WHEN, WHO, WHERE, PROCESS, VERSION, WHAT)
(   1,<2012-05-07 23:54:15.000 -0500>,<Administrator>,<TOPSPIN>,<go>,<TOPSPIN 2.1>,
      <created by zg
	started at 2012-05-07 23:53:08.281 -0500,
	POWCHK enabled, PULCHK disabled,
       configuration hash MD5:
       AF F2 23 6B 01 CD 40 DD E5 A1 38 A0 06 EA F7 77
       data hash MD5: 64K
       FB 24 9D 21 F6 80 7D 1F FB E4 42 3C 0E DE C5 C7>)
(   2,<2012-05-07 23:54:18.531 -0500>,<Administrator>,<TOPSPIN>,<proc1d>,<TOPSPIN 2.1>,
      <Start of raw data processing
       efp LB = 0 FT_mod = 6 PKNL = 1 PHC0 = 0 PHC1 = 0 SI = 32K 
       data hash MD5: 32K
       8D FC CD 94 F8 92 84 28 CC EA DC 74 A5 BA CB EF>)
(   3,<2012-05-07 23:54:18.921 -0500>,<Administrator>,<TOPSPIN>,<proc1d>,<TOPSPIN 2.1>,
      <pk PHC0 = 211.734 PHC1 = 0 
       data hash MD5: 32K
       DD CC 5A D6 11 54 0E 63 8F 30 6A 15 EF E2 83 49>)
(   4,<2012-05-07 23:54:18.984 -0500>,<Administrator>,<TOPSPIN>,<proc1d>,<TOPSPIN 2.1>,
      <abs ABSG = 1 
       data hash MD5: 32K
       C7 35 AE 9D 25 BE B5 1B 9D 73 B3 44 6D 21 EC A6>)
(   5,<2012-05-07 23:54:19.015 -0500>,<Administrator>,<TOPSPIN>,<proc1d>,<TOPSPIN 2.1>,
      <abs ABSG = 2 
       data hash MD5: 32K
       EB CF 4A 16 2C B8 F8 DB 32 7D BB 55 09 C6 53 6D>)
(   6,<2012-05-07 23:54:19.046 -0500>,<Administrator>,<TOPSPIN>,<proc1d>,<TOPSPIN 2.1>,
      <abs ABSG = 3 
       data hash MD5: 32K
       53 D3 75 6B 40 F1 0E 57 8F 87 36 67 CA 8E 58 C6>)
(   7,<2012-05-07 23:54:19.078 -0500>,<Administrator>,<TOPSPIN>,<proc1d>,<TOPSPIN 2.1>,
      <abs ABSG = 4 
       data hash MD5: 32K
       B6 1D 91 0F 77 0C 04 CD 85 E5 A8 D4 09 51 50 75>)
(   8,<2012-05-07 23:54:19.109 -0500>,<Administrator>,<TOPSPIN>,<proc1d>,<TOPSPIN 2.1>,
      <abs ABSG = 5 
       data hash MD5: 32K
       B1 24 2C 88 42 FF 0A E8 41 7E 09 49 88 C2 02 F1>)
$$ ##END=
$$ 
$$ $$ hash MD5
$$ $$ 76 2B A5 EA 7D 9E 79 A6 D2 34 2A EB BE 87 4A 97
##$RELAX= 
##$RELAX= 
##$RELAX= 
##$RELAX= 
##$RELAX= 
##$RELAX= 
##$RELAX= 
$$ Bruker specific parameters
$$ --------------------------
$$ [...]
##$TP= (0..7)
150 150 150 150 150 150 150 150
##$TP07= 0
##$TPNAME0= <>
##$TPNAME1= <>
##$TPNAME2= <>
##$TPNAME3= <>
##$TPNAME4= <>
##$TPNAME5= <>
##$TPNAME6= <>
##$TPNAME7= <>
##$TPOAL= (0..7)
0.5 0.5 0.5 0.5 0.5 0.5 0.5 0.5
##$TPOFFS= (0..7)
0 0 0 0 0 0 0 0
##$TUNHIN= 0
##$TUNHOUT= 0
##$TUNXOUT= 0
##$USERA1= <user>
##$USERA2= <user>
##$USERA3= <user>
##$USERA4= <user>
##$USERA5= <user>
##$V9= 5
##$VALIST= <valist>
##$VCLIST= <CCCCCCCCCCCCCCC>
##$VD= 0
##$VDLIST= <DDDDDDDDDDDDDDD>
##$VPLIST= <PPPPPPPPPPPPPPP>
##$VTLIST= <TTTTTTTTTTTTTTT>
##$WBST= 1024
##$WBSW= 4
##$XGAIN= (0..3)
0 0 0 0
##$XL= 0
##$YL= 0
##$YMAX_a= 530077
##$YMIN_a= -633584
##$ZGOPTNS= <>
##$ZL1= 120
##$ZL2= 120
##$ZL3= 120
##$ZL4= 120
##$ABSF1= 14.98061
##$ABSF2= -5.57192
##$ABSG= 5
##$ABSL= 3
##$ALPHA= 0
##$AQORDER= 0
##$ASSFAC= 0
##$ASSFACI= 0
##$ASSFACX= 0
##$ASSWID= 0
##$AUNMP= <proc_prof1d_extract_pilot.lims>
##$AXLEFT= 0
##$AXNAME= <>
##$AXNUC= <1H>
##$AXRIGHT= 0
##$AXTYPE= 0
##$AXUNIT= <>
##$AZFE= 0.1
##$AZFW= 0.1
##$BCFW= 0
##$BC_mod= 0
##$BYTORDP= 0
##$COROFFS= 0
##$CY= 15
##$DATMOD= 1
##$DC= 0
##$DFILT= <>
##$DTYPP= 0
##$F1P= 0
##$F2P= 0
##$FCOR= 0.5
##$FTSIZE= 32768
##$FT_mod= 6
##$GAMMA= 0
##$GB= 0
##$INTBC= 1
##$INTSCL= 1
##$ISEN= 128
##$LB= 0
##$LEV0= 0
##$LPBIN= 0
##$MAXI= 10000
##$MC2= 0
##$MEAN= 0
##$ME_mod= 0
##$MI= 0
##$NCOEF= 0
##$NC_proc= -8
##$NLEV= 6
##$NOISF1= 0
##$NOISF2= 0
##$NSP= 0
##$NTH_PI= 0
##$NZP= 0
##$OFFSET= 14.98061
##$PC= 1
##$PHC0= 211.734
##$PHC1= 0
##$PH_mod= 1
##$PKNL= yes
##$PPARMOD= 0
##$PPDIAG= 0
##$PPIPTYP= 0
##$PPMPNUM= 2147483647
##$PPRESOL= 1
##$PSCAL= 4
##$PSIGN= 0
##$PYNMP= <proc.py>
##$REVERSE= no
##$SF= 400.13
##$SI= 32768
##$SIGF1= 0
##$SIGF2= 0
##$SINO= 400
##$SIOLD= 32768
##$SPECTYP= <>
##$SREGLST= <1H.CDCl3>
##$SSB= 0
##$STSI= 32768
##$STSR= 0
##$SW_p= 8223.68421052632
##$SYMM= 0
##$S_DEV= 0
##$TDeff= 65536
##$TDoff= 0
##$TI= <>
##$TILT= no
##$TM1= 0
##$TM2= 0
##$TOPLEV= 0
##$USERP1= <user>
##$USERP2= <user>
##$USERP3= <user>
##$USERP4= <user>
##$USERP5= <user>
##$WDW= 1
##$XDIM= 32768
##$YMAX_p= 466525435
##$YMIN_p= -697524
##$CURPLOT= <Network HP LaserJet P1505>
##$CURPRIN= <$Network HP LaserJet P1505>
##$DFORMAT= <normdp>
##$LAYOUT= <+/1D_H.xwp>
##$LFORMAT= <normlp>
##$PFORMAT= <normpl>
##$SURQMSG= 1
$$ End of Bruker specific parameters
$$ ---------------------------------
##NTUPLES= NMR SPECTRUM
##VAR_NAME=  FREQUENCY,     SPECTRUM/REAL,   SPECTRUM/IMAG
##SYMBOL=    X,             R,               I
##VAR_TYPE=  INDEPENDENT,   DEPENDENT,       DEPENDENT
##VAR_FORM=  AFFN,          ASDF,            ASDF
##VAR_DIM=   32768,         32768,           32768
##UNITS=     HZ,            ARBITRARY UNITS, ARBITRARY UNITS
##FACTOR=    0.250966925370066, 1,           1
##FIRST=     8223.43324360095, -101508,      -146844
##LAST=      0,             -13425,          -54767
##MIN=       0,             -697524,         0
##MAX=       8223.43324360095, 466525435,    0
$$ Real data points
##PAGE= N=1
##DATA TABLE= (X++(R..R)), XYDATA
$$ [...]
19554a06732j39191b580l9024a4157j36637A12050b44115A37591f25640a90993
$$ -106732 -245923 -2580 -41604 -14157 -150794 112050 -244115 137591 -625640 -190993
19543A87807a75250F6306b8779G8431b47306m4981A07368N6018J9830a71779B74171
$$ 187807 -175250 66306 -28779 78431 -247306 -292287 107368 163386 183216 -171779 274171
19531A78448b96969G5090N9761a82921P4149C98222j69194r1562J10788f4547
$$ 178448 -296969 75090 134851 -182921 -108772 398222 229028 137466 248254 -64547
19520a76564D6073a50211L3540q7084A20541a43995K0470K9783j57177m6766K0126
$$ -176564 46073 -150211 -116671 -203755 120541 -143995 -123525 -93742 -250919 -297685 -277559
19509b77559O3948f2600F9651M460J29535a17488P141n322n7161k54358J16392
$$ -277559 -213611 -62600 69651 74111 203646 -117488 -110347 -115669 -172830 -427188 -310796
19498c10796A92899L4025i7471A59517c10991A39933N8570b12296R198P338j98840
$$ -310796 192899 226924 -97471 159517 -310991 139933 198503 -212296 -203098 -195760 -394600
19487c94600a03341A63197g2044C8441f0067j66897a6699k19192B32886I6913
$$ -394600 -103341 163197 -72044 38441 -60067 -226964 -16699 -235891 232886 96913
19476a089I4036c11999B25183F6835L9694b50890h5368j29865c6104p9550j38911
$$ -1089 94036 -311999 225183 66835 106529 -250890 -85368 -215233 -36104 -115654 -254565
19465b54565K2128r3045n0360a39856A93940n4426L1842a44080C00401A27668
$$ -254565 -232437 -325482 -375842 -139856 193940 139514 171356 -144080 300401 127668
19454A0686b748m8157l3344j19634j23470a09295F8776a68080l42977K00673c8909
$$ 10686 -2748 -50905 -84249 -203883 -327353 -109295 68776 -168080 -511057 -310384 -38909
19442e17815A61001a50394J4523A8575b7370C64260B9054f7670B854b67694B3118
$$ -517815 161001 -150394 -135871 18575 -27370 364260 29054 -67670 2854 -267694 23118
19430B34935c8922p0219m6204C9038J51009i357k27836J11681A90248g9622f978
$$ 234935 -38922 -109141 -155345 39038 190047 -9357 -237193 -125512 190248 -79622 -6978
19418a4809D0805d6626n4118j64647B46177a82601B17987a89439n2894c3783n0366
$$ -14809 40805 -46626 -100744 -265391 246177 -182601 217987 -189439 -242333 -33783 -84149
19407h4149l51166K13338F6276c01194O5475A70360g8315I114Q8954C185a89560
$$ -84149 -435315 -221977 66276 -301194 -235719 170360 -78315 9114 98068 3185 -189560
19395a50833E0125J016L01462A12987D089a79836K7117N5080r4006A48267a89304
$$ -150833 50125 51141 352603 112987 4089 -179836 -152719 -97639 -191645 148267 -189304
19383c39750F4405a70916b1140A77132O1121D3769K68237a25336j72990a10991
$$ -339750 64405 -170916 -21140 177132 238253 43769 312006 -125336 -298326 -110991
19372A39430c0419R456I3079O9652k2363a58588P7503m7537A26985a3094b062
$$ 139430 -30419 -20963 93079 162731 140368 -158588 -81085 -128622 126985 -13094 -2062
19360d9322K4582A07149M5109i6559B5569b00547k21814J49125J00046P6144q6109
$$ -49322 -24740 107149 152258 -96559 25569 -200547 -422361 -273236 -173190 -97046 -183155
19349a83155m3988e809l16597M6302d1597l09889J68281E7816j8662b0957A93039
$$ -183155 -227143 -5809 -322406 -276104 -41597 -351486 -183205 57816 39154 -20957 193039
19337G7034a78078A78458a75225P2048A03496c88545J80721j04076C83936H2933
$$ 77034 -178078 178458 -175225 -103177 103496 -388545 -207824 -311900 383936 82933
19326I1416a20849N08A29419d9409Q849j71760m4804A76721b10206A02115D4634
$$ 91416 -120849 -120341 129419 -49409 -40560 -212320 -257124 176721 -210206 102115 44634
19314H2422D804b36992i4297H5851P3865b64331R1344M1957I9975c8848k08714
$$ 82422 4804 -236992 -94297 85851 159716 -264331 -172987 -131030 99975 -38848 -247562
19303b47562B59315a32363A10517c2761A79519j8611a5235k10117a02888m9994
$$ -247562 259315 -132363 110517 -32761 179519 160908 -15235 -225352 -102888 -152882
19293a52882c4261j14499C178L98116g5570A25603C0863e2425A57081f230m9858
$$ -152882 -34261 -148760 3178 401294 -75570 125603 30863 -52425 157081 -6230 -56088
19282e6088k70081D6658B3215a46298D2336J60042e871j61103A92258R363B3928
$$ -56088 -326169 46658 23215 -146298 42336 202378 -5871 -166974 192258 201621 23928
19270i9893K879A76725l2367a48964C3238R886a54319f5170J5187B96490J12557
$$ -99893 -97014 176725 144358 -148964 33238 43124 -154319 -65170 -49983 296490 409047
19259D09047j66992D1649K39362a91043h5786k07527P5839k3310E5541c39377
$$ 409047 242055 41649 281011 -191043 -85786 -293313 -217474 -240784 55541 -339377
19248a92461L122j37824a40707F4401a23175I1765J74742F7543d77693b04631
$$ -192461 -189339 -327163 -140707 64401 -123175 91765 266507 67543 -477693 -204631
19237a13468A1551J49224c8482C8957a67361B03183b71688C2885a499j22138H8913
$$ -113468 11551 160775 -38482 38957 -167361 203183 -271688 32885 -1499 -123637 88913
19225b20337B24M4411b92488N0348b164j40396j65526B37324a54923o571A79944
$$ -220337 224 44635 -292488 -242140 -2164 -142560 -308086 237324 -154923 -161494 179944
19213G3778K31603h7790A8537g532j2259B88692h0240I1138A6955h15p1500j18457
$$ 73778 305381 -87790 18537 -7532 -19791 288692 -80240 91138 16955 -815 -72315 -190772
19201a90772A40976a4433C30220a2008j8380a2526A61549a40566O410c2856r5603
$$ -190772 140976 -14433 330220 -12008 -30388 -12526 161549 -140566 -134156 -32856 -128459
19190a28459r9276A35878J12508I8620a26859H0725J61388r8763b01664C2533
$$ -128459 -227735 135878 248386 98620 -126859 80725 242113 143350 -201664 32533
19179c51303a19810p2580q9036k7125Q3340J12257j79174J04394G847a65570A14503
$$ -351303 -119810 -192390 -281426 -308551 -225211 -112954 -292128 -187734 7847 -165570 114503
19167c7418A63726p4853c58777e7400C6363b32133B82217A26471b04086f2185
$$ -37418 163726 88873 -358777 -57400 36363 -232133 282217 126471 -204086 -62185
19156f1209j15441j61299J55249G7208O5228l1886c4977B83469d46413b0257A60578
$$ -61209 -176650 -337949 -182700 77208 142436 110550 -34977 283469 -446413 -20257 160578
19144H2560P4091a89056l5613D0770d5479G0966k9248K36024a35225j94018i3552
$$ 82560 156651 -189056 -224669 40770 -45479 70966 41718 277742 -135225 -329243 -93552
19132b23492C06850h5122D8041i866l28230e262k97591G9502a01418A60852B9761
$$ -223492 306850 -85122 48041 -9866 -338096 -5262 -302853 79502 -101418 160852 29761
19120F5996h4103C0827b05654O0878A26050J58034j3691a24459I0674a90244f3828
$$ 65996 -84103 30827 -205654 -144776 126050 284084 270393 -124459 90674 -190244 -63828
19108b81689a09846N871A98517l5420m9917a17338J1842j57427D7289M1416a45223
$$ -281689 -109846 -103975 198517 163097 113180 -117338 -105496 -262923 47289 88705 -145223
19096I5338b44203A7333b45619M718G7799i9836F9688a31251A21508a50740j1995
$$ 95338 -244203 17333 -245619 -240901 77799 -99836 69688 -131251 121508 -150740 -162735
19085a62735E474g456H3909b31248A86698b29600B4678J41609a16232j93373e2954
$$ -162735 5474 -7456 83909 -231248 186698 -229600 24678 166287 -116232 -309605 -52954
19073e6354D2267a75894l30639C9642R494O7722K72557a90585H0561d5405m3276
$$ -56354 42267 -175894 -506533 39642 49136 116858 389415 -190585 80561 -45405 -88681
19062h8681L0657A39206B5682c339j5244C0166h1608H6245b78140c4818k06867
$$ -88681 -58024 139206 25682 -3339 -18583 30166 -81608 86245 -278140 -34818 -241685
19051b41685A8327a51303A1007h5465j79051d284E1333K5881c87908a10704l6077
$$ -241685 18327 -151303 11007 -85465 -264516 -4284 51333 77214 -387908 -110704 -146781
19040a46781f7170j13906D06526G0063K420M13i9536j31630j50365A01087b4941
$$ -146781 -67170 -181076 406526 70063 72483 72896 -99536 -231166 -381531 101087 -24941
19028C40926d3862J5292h726k20256a01724B03869a49514B45516i3917c600j9420
$$ 340926 -43862 -28570 -8726 -228982 -101724 203869 -149514 245516 -93917 -3600 -23020
19017b3020A37523F2666b9625A53717J1257D3181J3779g8843a2692A02261f5011
$$ -23020 137523 62666 -29625 153717 164974 43181 56960 -78843 -12692 102261 -65011
19005d6355l0073M400m2708B0406b76852M9845e0684J7523A38495b4569m7658
$$ -46355 -76428 -72028 -114736 20406 -276852 -227007 -50684 -33161 138495 -24569 -72227
18994g2227A23014f7291D9784K6460N3404a52257B20091E9758j9949J28466b29192
$$ -72227 123014 -67291 49784 76244 129648 -152257 220091 59758 39809 168275 -229192
18982A99487a3612D2417a59206k92858a84943j03880F1993h8666B4671b48193
$$ 199487 -13612 42417 -159206 -452064 -184943 -288823 61993 -88666 24671 -248193
18971a16239D31304H849J1464r957K91633f1298j78108D540b71811I8727h7704
$$ -116239 431304 8849 20313 10356 301989 -61298 -239406 4540 -271811 98727 -87704
18959h3442j08213j21177g3608j3482A96815M751E084O0410a39930k5079K8454
$$ -83442 -191655 -312832 -73608 -87090 196815 201566 5084 65494 -139930 -165009 -136555
18948a36555M2224L3738q2474A53789j1760D1149i374C30923a42222L7824D1067
$$ -136555 -94331 -60593 -143067 153789 142029 41149 -9374 330923 -142222 -104398 41067
18936D8455Q402O9467g8645B09439a2402B46311a38035B10210c7147B41409c80675
$$ 48455 56857 126324 -78645 209439 -12402 246311 -138035 210210 -37147 241409 -380675
18924A87458d62896K14071A14040a06059N0244j62923A93287A7543c50111A48546
$$ 187458 -462896 -248825 114040 -106059 -55815 -218738 193287 17543 -350111 148546
18913A06884J29375a54959D4226J9689d5057k3164l3421j34745B75212A30176
$$ 106884 236259 -154959 44226 63915 -45057 -68221 -101642 -236387 275212 130176
18902B84357H283b2649F4678a81786A55337a45467M5267i416H274a16587C35282
$$ 284357 8283 -22649 64678 -181786 155337 -145467 -100200 -9416 8274 -116587 335282
18890b56658C1348N9929a76875B33364a31554q722N2961H4872a45822D14414c83796
$$ -256658 31348 91277 -176875 233364 -131554 -140276 -87315 84872 -145822 414414 -383796
18878b08785a03881B53302j17988m5646c69933a69943f7635j06599E2501j0065
$$ -208785 -103881 253302 135314 89668 -369933 -169943 -67635 -174234 52501 42436
18868D2436B1201L2844a88828n0956j42905L0923B55551a4068B3402c37245A44205
$$ 42436 21201 54045 -188828 -239784 -382689 -351766 255551 -14068 23402 -337245 144205
18856a62246B47846b84969a11529B17619a6016j29969A43208Q8110c1336r1752
$$ -162246 247846 -284969 -111529 217619 -16016 -145985 143208 231318 -31336 -123088
18846a23088k73087h220j09204M7121b6889j33073B22681a50369q5381c0087j55612
$$ -123088 -396175 -8220 -117424 -70303 -26889 -159962 222681 -150369 -235750 -30087 -185699
18835a85699q0704G9888f8907f376F4547b1453k74236A60162m0715m9728a99132
$$ -185699 -266403 79888 -68907 -6376 64547 -21453 -295689 160162 119447 69719 -199132
18823G9603d7108j91503k0557B16025n8138b37813A66847a01185A24979a15609
$$ 79603 -47108 -238611 -259168 216025 157887 -237813 166847 -101185 124979 -115609
18812B69392d267l90815J08100g7330j06971e3978g893C42470c3956o6780A4752
$$ 269392 -4267 -395082 -286982 -77330 -184301 -53978 -7893 342470 -33956 -100736 14752
18800c09772a28872a5974I192K34620G1696a11653L1435B2053a55251j39850D4813
$$ -309772 -128872 -15974 9192 243812 71696 -111653 -80218 22053 -155251 -295101 44813
18788B72933D1990a13510L2109A26385R833e1274I1948a54744A90659c05255R1696
$$ 272933 41990 -113510 -81401 126385 136218 -51274 91948 -154744 190659 -305255 -213559
18777b13559B18582a22894j4768j73098o2879A0394J48565b11471h3912K9349
$$ -213559 218582 -122894 -137662 -310760 -373639 10394 158959 -211471 -83912 -54563
18767e4563p4977j99441A562b77185E9006Q1629Q649B3485d17016L8684a12345
$$ -54563 -129540 -328981 1562 -277185 59006 140635 149284 23485 -417016 -378332 -112345
18755b32493c9259l59758B3149a25737j54578h8349b0320n9658k36491f1491B66278
$$ -232493 -39259 -399017 23149 -125737 -280315 -88349 -20320 -79978 -316469 -61491 266278
18743c82031J71074g1002m5853F3230a09346j17463A50961B5919J28670K6177
$$ -382031 -210957 -71002 -116855 63230 -109346 -226809 150961 25919 154589 180766
18733A80766a48630p1409J08631K172C9600b08250l276H2297a41562K1825a2630
$$ 180766 -148630 -220039 -111408 -109236 39600 -208250 -211526 82297 -141562 -119737 -12630
18721H7732a88920P1919A31043b99496N1908i1563j54991K5092c1526A54805h8972
$$ 87732 -188920 -117001 131043 -299496 -247588 -91563 -246554 -221462 -31526 154805 -88972
18709B79511d5559l1213A8201f6306k61892a10257c1398A3386c91253D0141J4334
$$ 279511 -45559 -76772 18201 -66306 -328198 -110257 -31398 13386 -391253 40141 54475
18698E4475R3187g8949j28535g1666L2533I3333a28076C4351g0558j68717k45470
$$ 54475 147662 -78949 -207484 -71666 -39133 93333 -128076 34351 -70558 -239275 -484745
18687d84745a76021R662A43752A8359L0283K8836a09852j30333E3313a34673n9322
$$ -484745 -176021 -166359 143752 18359 48642 77478 -109852 -240185 53313 -134673 -193995
18676a93995d5324k25812P0985P2333j25915J04201d1431D0938N4633J7772m1018
$$ -193995 -45324 -271136 -200151 -127818 -253733 -149532 -41431 40938 95571 113343 72325
18665G2325P3820P6552b48336j1946I883P9244M3921a0997q4132L5990j12462
$$ 72325 146145 222697 -248336 -260282 9883 89127 133048 -10997 -95129 -59139 -171601
18654a71601L391O7789H0305g6575k73935H094a95530j58385M5513A90913a29485
$$ -171601 -168210 -100421 80305 -76575 -350510 8094 -195530 -353915 -308402 190913 -129485
18642B12031a11248B65566C815a05890A20703c52573B3180a22156B23963F9876
$$ 212031 -111248 265566 3815 -105890 120703 -352573 23180 -122156 223963 69876
18631a48664B89247a74932o591C9742d6233E8003L725i8163c0749r6131A53252
$$ -148664 289247 -174932 -181523 39742 -46233 58003 61728 -98163 -30749 -126880 153252
18619B5360a45988E1361f4489L950j00549b4507k55061a27083B60787a81302A99478
$$ 25360 -145988 51361 -64489 -60539 -161088 -24507 -279568 -127083 260787 -181302 199478
18607I6583g7747b9546G8529b37053b8810j08909m80499A00991J19438a01721
$$ 96583 -77747 -29546 78529 -237053 -28810 -137719 -618218 100991 220429 -101721
18596d0117r3891N5882j02947O2616F0608K4841h2419j61618B16576i1862B5950
$$ -40117 -134008 -78126 -181073 -118457 60608 85449 -82419 -244037 216576 -91862 25950
18584b7972D7562i9199B8848P4442M2107F2189Q158i1948k8323G157g9305q2370
$$ -27972 47562 -99199 28848 103290 145397 62189 70347 -91948 -120271 7157 -79305 -161675
18572a61675A6626d19133a33752j09040j92663b04766f6175A27614J26817B0753
$$ -161675 16626 -419133 -133752 -242792 -435455 -204766 -66175 127614 254431 20753
18561f7553F2878i6460C66818d0j6893D5559L43L4404J10247a95304A80541d2751
$$ -67553 62878 -96460 366818 -40 -16933 45559 45902 80306 190553 -195304 180541 -42751
18548F6488b07151A15289K773b41241c3465k87k58410A71605a19734j3423l67136
$$ 66488 -207151 115289 118062 -241241 -33465 -33752 -292162 171605 -119734 -133157 -500293
18537e00293B0931L711c70019a05726C0200M871b77559G8922a15341A4081J19386
$$ -500293 20931 24642 -370019 -105726 30200 35071 -277559 78922 -115341 14081 133467
18526A33467n4578j5657B5880b29050p5326J36507d7887j95526B19873b24159
$$ 133467 78889 63232 25880 -229050 -304376 -167869 -47887 -243413 219873 -224159
18515h1693k1788i342p6000K1541k7556A19311r45f5642A46823c2177B13987b55778
$$ -81693 -103481 -9342 -85342 -63801 -91357 119311 118366 -65642 146823 -32177 213987 -255778
18502b55088J5955g1499A5560b5747j08538D14021A84149J23958j16584b45873
$$ -255088 -239133 -71499 15560 -25747 -134285 414021 184149 308107 191523 -245873
18491g7270r7570L3037l784l6855c2082A26091g5805F89482b98827l08772B59126
$$ -77270 -174840 -141803 -145587 -182442 -32082 126091 -75805 689482 -298827 -607599 259126
18479a33505j70507d4479l5234o1770G3437A361K4526N6902b23154N1866j94171
$$ -133505 -304012 -44479 -79713 -141483 73437 1361 25887 82789 -223154 -171288 -365459
18468c65459h3522c7612A26405a45973B41658r5974J23581j16545F2096L136Q8522
$$ -365459 -83522 -37612 126405 -145973 241658 145684 269265 152720 62096 65232 153754
18457A53754a2005B96300b252k20422k8404A56521b65856l8161C4783a54210D13331
$$ 153754 -12005 296300 -2252 -222674 -251078 156521 -265856 -304017 34783 -154210 413331
18445A9849l200a82725I6160b3083g195j09318k23674M4000A39331n8141a60088
$$ 19849 16649 -182725 96160 -23083 -7195 -116513 -340187 -296187 139331 81190 -160088
18433a10380B21734p9355c03559j91310a45888P2912C54738A20301a12950E7951
$$ -110380 221734 142379 -303559 -494869 -145888 -72976 354738 120301 -112950 57951
18422b46339F22K24008c1774G7603i0359l07015e7623A82769j28c44587a27237
$$ -246339 622 224630 -31774 77603 -90359 -397374 -57623 182769 182641 -344587 -127237
18410E3924i2233k34082B0413K2371b04935D4525c10665A16248b86190b0907k00575
$$ 53924 -92233 -326315 20413 42784 -204935 44525 -310665 116248 -286190 -20907 -221482
18399b21482P9615d5807A4770J29533M0112G5365b19328M0292B9575b02987f3052
$$ -221482 -141867 -45807 14770 144303 184415 75365 -219328 -179036 29575 -202987 -63052
18387e5832j12581E3161a18730j53963a05499A47895J42497B5322b16488P6345
$$ -55832 -168413 53161 -118730 -272693 -105499 147895 290392 25322 -216488 -140143
18377a40143p682c0513D00J5039a7169j13002E2989J34737g7390J6884K8971A17833
$$ -140143 -147825 -30513 400 15439 -17169 -130171 52989 187726 -77390 -60506 -31535 117833
18364i8985A66135a99477b5281r7193d6178A8468c32939J5593A32354N4035m9851
$$ -98985 166135 -199477 -25281 -122474 -46178 18468 -332939 -317346 132354 186389 136538
18353A36538a46203C6364O8447d7570r9354O0282n338K8483B8435a81959g69C97073
$$ 136538 -146203 36364 104811 -47570 -146924 -86642 -91980 -63497 28435 -181959 -769 397073
18340b39526j44248F8629a22242e0635A21187j3367b49636q4993b3759j15820
$$ -239526 -383774 68629 -122242 -50635 121187 107820 -249636 -334629 -23759 -139579
18330a39579D77417D5328d2860m9310n6076e6447r1696a4398j9484B35329b67696
$$ -139579 477417 45328 -42860 -92170 -148246 -56447 -148143 -14398 -33882 235329 -267696
18318b31877a5761C38908A49122e66k10774b6002A74829a34603d1263C19343j59284
$$ -231877 -15761 338908 149122 -566 -211340 -26002 174829 -134603 -41263 319343 160059
18307A60059a19030j87806a00393j35399O5986l7792k97036B06741b50855R9019
$$ 160059 -119030 -306836 -100393 -235792 -169806 -207598 -504634 206741 -250855 -151836
18297a51836A23944d5529l091o9966F8020i5930l3427A32255b44556A3783J42900
$$ -151836 123944 -45529 -48620 -118586 68020 -95930 -129357 132255 -244556 13783 156683
18286A56683J41045A42459J09315p7503e3347n3335d5192A60091a09703j6755
$$ 156683 297728 142459 251774 174271 -53347 -106682 -45192 160091 -109703 -126458
18276a26458G0771a41994A2952a99121P9357r995m632o1128M8975k94962B05918
$$ -126458 70771 -141994 12952 -199121 -119764 -129759 -134391 -195519 -146544 -441506 205918
18264a89230D6839a13638N178j03336A16681a78881Q7122k33774a951E4008O9346
$$ -189230 46839 -113638 -108460 -211796 116681 -178881 -91759 -325533 -1951 54008 123354
18253A23354b0160j40912a7887c697j5334q3590J19b8246A48040o2808e5356D8927
$$ 123354 -20160 -161072 -17887 -3697 -19031 -102621 -102502 -28246 148040 85232 -55356 48927
18240D9258k2150P1465e638C3809P1211a86503A97737r2816b7209A47880a16845
$$ 49258 27108 98573 -5638 33809 105020 -186503 197737 104921 -27209 147880 -116845
18228e9042I5315l7031e8490j42253d3690k5317A33601e1547B32121b57617c0791
$$ -59042 95315 58284 -58490 -200743 -43690 -69007 133601 -51547 232121 -257617 -30791
18216h2347j07525J9103M7644b6090o0022j8868C4928J56702a3202j8960F6570
$$ -82347 -189872 -170769 -123125 -26090 -86112 -104980 34928 191630 -13202 -32162 66570
18204E5124R1680C4105q564K8835c91339B66085b43945a943j04317M9036B5817
$$ 55124 146804 34105 25541 54376 -391339 266085 -243945 -1943 -106260 -57224 25817
18192a04220A10549J703d798l41065d9059i073j87918A99525J00825b33321a06761
$$ -104220 110549 112252 -4798 -345863 -49059 -9073 -196991 199525 300350 -233321 -106761
18180B3760a3657j56619N7304M7281A79012M8321O9718A26412a80048A94862a45772
$$ 23760 -13657 -170276 -112972 -65691 179012 227333 297051 126412 -180048 194862 -145772
18168a73564P0047B30852a4099I1546i0017H6460a46953A52913i0895D66769B33086
$$ -173564 -103517 230852 -14099 91546 -90017 86460 -146953 152913 -90895 466769 233086
18156i5885A61231a6787k25235R9753A12081E4912a67802p2328H2924J51944b6311
$$ -95885 161231 -16787 -242022 -142269 112081 54912 -167802 -240130 82924 234868 -26311
18144f7567F3782i4351C68010m9238B0813K1015j8185a46830e0163F2027b7722
$$ -67567 63782 -94351 368010 318772 20813 41828 23643 -146830 -50163 62027 -27722
18132a21391A82572q8588j3989J62080b35697L7143h7949j15722A83154E9372
$$ -121391 182572 93984 79995 242075 -235697 -198554 -87949 -203671 183154 59372
18121I19b65535M0031j35808f1943k72496f0749A43654a36687B03438c4538j7172
$$ 919 -265535 -225504 -361312 -61943 -334439 -60749 143654 -136687 203438 -34538 -51710
18110e1710a2449A63598L2573h1017j05142j00408C2514c63309J48489A42323
$$ -51710 -12449 163598 196171 -81017 -186159 -286567 32514 -363309 -214820 142323
18099A08936b01873d4123j25841a9097C3736a65773B8971I82J03265g4223D23439
$$ 108936 -201873 -44123 -169964 -19097 33736 -165773 28971 982 104247 -74223 423439
18087b940B48617a27905n9958j06580D24067A41009F4168N0815E5517J07118B5249
$$ -2940 248617 -127905 -187863 -294443 424067 141009 64168 114983 55517 162635 25249
18075a06231k96930f6140C6971a84334g705I4880L59075a21709C74009D4087a99818
$$ -106231 -403161 -66140 36971 -184334 -7705 94880 453955 -121709 374009 44087 -199818
18063B230L1312c5223j78442N2652B32735a4622k1627B19107g4648C6220c48631
$$ 2230 33542 -35223 -213665 -161013 232735 -14622 -36249 219107 -74648 36220 -348631
18051c1971G6679b0452k97202P2505B1343c1642F3641a22351B00220P478b47458
$$ -31971 76679 -20452 -317654 -245149 21343 -31642 63641 -122351 200220 207698 -247458
18039d1168A3390J11126J1524A2245a94510N3955m4622e3530j73986C5454h079
$$ -41168 13390 124516 136040 12245 -194510 -140555 -185177 -53530 -227516 35454 -8079
18027b0583A36348C3828O822b4801I7047a91890j24515J51113c3456A15177J61778
$$ -20583 136348 33828 40650 -24801 97047 -191890 -316405 -165292 -33456 115177 276955
18016B76955A7580M2121c90303H7927B4236b61358a03882A57193a03178A92399
$$ 276955 17580 59701 -390303 87927 24236 -261358 -103882 157193 -103178 192399
18005A0166J48851b15122a9142m46l15706J33151k1192B33924b66103b2122j90769
$$ 10166 159017 -215122 -19142 -19588 -335294 -202143 -223335 233924 -266103 -22122 -212891
17994b12891o86A8038L3729h1637l193p5627c7348k25946A35452c7977C3042K8326
$$ -212891 -213577 18038 51767 -81637 -84830 -160457 -37348 -263294 135452 -37977 33042 61368
17982F1368M5332c4017C13773a36952j25430m3927E5116R4789a56107j6A3157
$$ 61368 106700 -34017 313773 -136952 -262382 -306309 55116 149905 -156107 -156123 13157
17970iA551O2943e4648p7617p8B85888A35083a51763A30948c69723j7203B71181
$$ -9 1551 64494 -54648 -132265 -132343 285888 135083 -151763 130948 -369723 -386926 271181
17957A02967i1368j04486P2065A20944n1172f4114l4488c4354E4516J38079a40902
$$ 102967 -91368 -195854 -123789 120944 69772 -64114 -98602 -34354 54516 192595 -140902
17945a57441k56771B73741b34591A92410a40532j1245q7111M3990E2004a60459
$$ -157441 -414212 273741 -234591 192410 -140532 -151777 -238888 -194898 52004 -160459
17934a15331n6753Q2269A41489b13393g4350r7238C9469M0885R7966B4915a54376
$$ -115331 -172084 -89815 141489 -213393 -74350 -171588 39469 80354 178320 24915 -154376
17922E0226j4936P9168E546a7439k38448B23143B2847a47918m0722B1826b30944
$$ 50226 35290 114458 5546 -17439 -255887 223143 22847 -147918 -188640 21826 -230944
17910A8442K76509D643N6027d3255K816A64238n9253e7821A0169c8587q5380N7809
$$ 18442 294951 4643 60670 -43255 -40439 164238 104985 -57821 10169 -38587 -123967 -66158
17898f6158D73761a42316l8983A82396i9559o1425d0668F980K95634f7411F382
$$ -66158 473761 -142316 -181299 182396 -99559 -160984 -40668 6980 302614 -67411 6382
17886A53832f2167r6428f8043k53549f1166K5418B20819m9791a23220A86669N7732
$$ 153832 -62167 -158595 -68043 -321592 -61166 -35748 220819 171028 -123220 186669 244401
17875B44401p9521h7305C42352B1509b42924j8352P5197A72880l1786a18793e3597
$$ 244401 164880 -87305 342352 21509 -242924 -261276 -186079 172880 141094 -118793 -53597
17863i3825p8276a3679A90019r3397h5154r9172G2952f1537A59994a11280B15690
$$ -93825 -172101 -13679 190019 96622 -85154 -184326 72952 -61537 159994 -111280 215690
17851G961a56057c3214A05424d2521A72659b96183C66036b83365H5923d9931m3729
$$ 7961 -156057 -33214 105424 -42521 172659 -296183 366036 -283365 85923 -49931 -93660
17840i3660A9614a9012j73125C31917j24635C7273a40492c8622A27800A4893J83954
$$ -93660 19614 -19012 -192137 331917 207282 37273 -140492 -38622 127800 14893 198847
17829A98847h3548j4215G2774a12289M0304m24306K29299b6142l00733a25997
$$ 198847 -83548 -97763 72774 -112289 -71985 -496291 -266992 -26142 -326875 -125997
17818B35470c6813G7993R9415G5468b19058b2683E6657a03521B02867q3006D3489
$$ 235470 -36813 77993 177408 75468 -219058 -22683 56657 -103521 202867 119861 43489
17806a06323q8164B36793J590h2018B06180D3140b48330D0875a89546A95681J00723
$$ -106323 -194487 236793 238383 -82018 206180 43140 -248330 40875 -189546 195681 296404
17795B96404A46822a1080d978D326f1221I1065g3614n099L0370C5095a78795h01
$$ 296404 146822 -11080 -4978 4326 -61221 91065 -73614 -78713 -48343 35095 -178795 -801
17782a26849m8106J0158g6548n8330A64651a1260D2191a67063B10519n0289n9753
$$ -126849 -174955 -164797 -76548 -134878 164651 -11260 42191 -167063 210519 160230 100477
17771A00477l3372b24641B66218M0653a09749A78375q837a97346E0453K37668
$$ 100477 67105 -224641 266218 306871 -109749 178375 169538 -197346 50453 288121
17761B88121b11760A93707a50986N8073A0963L816g7663j42917L8454L6117d4877
$$ 288121 -211760 193707 -150986 -92913 10963 14779 -77663 -220580 -182126 -146009 -44877
17749d8449k31303C90862b0648A17795h1643l88315A33261e29797A01300l704
$$ -48449 -279752 390862 -20648 117795 -81643 -469958 133261 -529797 101300 97596
17739I7596J70799i0971C98523a01097G3587a26972j9591m5396A4361J2524K29960
$$ 97596 268395 -90971 398523 -101097 73587 -126972 -146563 -191959 14361 26885 256845
17728B56845F9136g0897q9915f2911A02004F291e8155r3802A849b26883A52296
$$ 256845 69136 -70897 -160812 -62911 102004 6291 -58155 -151957 1849 -226883 152296
17716a17352K9879J2309G1782a52020A09464D0143k836c88344A68106g9322I7303
$$ -117352 -87473 -75164 71782 -152020 109464 40143 37307 -388344 168106 -79322 97303
17704A36281a05892A32053M1095B4555J2249c7504B33248h4203j44985d5076j6628
$$ 136281 -105892 132053 173148 24555 36804 -37504 233248 -84203 -229188 -45076 -61704
17693f1704C88973C9087c96651A35869n3225J59421h4437A8800J85152E9238L45824
$$ -61704 388973 39087 -396651 135869 82644 242065 -84437 18800 203952 59238 405062
17682D05062I3450k2154l2167b67494A64839o4504k7500N6916B9245c34907A95576
$$ 405062 93450 71296 39129 -267494 164839 100335 72835 129751 29245 -334907 195576
17670c31448A54426d7684p0186A46517b05218A25131C8801a12450B55285j05007
$$ -331448 154426 -47684 -117870 146517 -205218 125131 38801 -112450 255285 150278
17660A50278J09154h4662A64105g804E9389a16402F0382O943d400j54764B90272
$$ 150278 259432 -84662 164105 -7804 59389 -116402 60382 67325 -4400 -159164 290272
17648A3550g9434K0748A11069J9612b02328B41670a26926p3160e734G5520c02372
$$ 13550 -79434 -58686 111069 130681 -202328 241670 -126926 -200086 -5734 75520 -302372
17636D479K21840E319L9003a4928k8833A60226P0376D1407a42051C7987J12671
$$ 4479 226319 5319 44322 -14928 -43761 160226 230602 41407 -142051 37987 150658
17625A50658j0980C7317a00310a6878l7495k5272C72813d7383j65468h880A29102
$$ 150658 139678 37317 -100310 -16878 -54373 -79645 372813 -47383 -212851 -8880 129102
17613C3338L56737b62325h1012A18789g3670l09701a34541j52301E80J21964a87423
$$ 33338 390075 -262325 -81012 118789 -73670 -383371 -134541 -286842 580 122544 -187423
17601e7896o0799A63228J27325L261b00477C31972a70464K3659d6259B67495i193
$$ -57896 -118695 163228 290553 293814 -200477 331972 -170464 -146805 -46259 267495 -9193
17589C7322J93172d9218q0423j57819B9903a44788j21756P3149A53891a19240
$$ 37322 230494 -49218 -129641 -287460 29903 -144788 -266544 -193395 153891 -119240
17578H077b39186B68143A07916J97583b92692F8170J09554l0873g3071E6554b9009
$$ 8077 -239186 268143 107916 305499 -292692 68170 177724 146851 -73071 56554 -29009
17566b09924B34834a01198a3547C14245I5949M6317l1606c38526A37697Q5437
$$ -209924 234834 -101198 -13547 314245 95949 142266 110660 -338526 137697 223134
17556B23134p6654O2464n323a63841B49588G3747j3931K01518a73852P7055A89976
$$ 223134 146480 208944 203621 -163841 249588 73747 59816 261334 -173852 -96797 189976
17544A31794R5497a38442c5470B3169a75842M8153A30548K47223c518E6916P5549
$$ 131794 227291 -138442 -35470 23169 -175842 -127689 130548 377771 -3518 56916 132465
17533A32465b08985b2304A25711J7845b75504C9716b24056e8402o5455b2710A87735
$$ 132465 -208985 -22304 125711 143556 -275504 39716 -224056 -58402 -123857 -22710 187735
17521C83738h6239A52576c658j39619E6303K03651a5407r3479B13356F7041B1849
$$ 383738 -86239 152576 -3658 -143277 56303 259954 -15407 -108886 213356 67041 21849
17509d2032J1620H8216k8150k3944K09501m5730k9556q4746J0050J92014b1945
$$ -42032 -30412 88216 60066 36122 245623 199893 170337 85591 95641 287655 -21945
17497h7093m592A42287i0755j87328E4819K8729J654K13009a67537j72567e7696
$$ -87093 -91685 142287 -90755 -278083 54819 83548 85202 298211 -167537 -340104 -57696
17485c2113A76586e8719B33749q0694Q8481b60787f0432k49541K3965B01545A2446
$$ -32113 176586 -58719 233749 153055 241536 -260787 -60432 -309973 -286008 201545 12446
17473a51725B21786G9583K12561C1467g0288A47241a89029h8212j03568E8619
$$ -151725 221786 79583 292144 31467 -70288 147241 -189029 -88212 -191780 58619
17462A76461J99767m1892A17330m8708J28657l4081e923B08074a2077C1843a71500
$$ 176461 376228 334336 117330 68622 197279 163198 -5923 208074 -12077 31843 -171500
17450b01569C1388K10637Q4769A24615h4959l0245B13167n1959J92260k1073j21058
$$ -201569 31388 242025 326794 124615 -84959 -115204 213167 161208 353468 332395 211337
17439B11337k5100q1961K25289j38736F078M47607J48296B95767K01371j51650
$$ 211337 186237 104276 329565 190829 6078 453685 601981 295767 497138 345488
17429C45488l0220A6845K93174j06961k7477c7549B49619P2317A4506L48780G8588
$$ 345488 315268 16845 310019 203058 175581 -37549 249619 321936 14506 363286 78588
17417C09549K51132B39027A08567J77996M0612P6A09384N06852B18821e2890E15397
$$ 309549 560681 239027 108567 286563 327175 327251 109384 616236 218821 -52890 515397
17405B500a01241A34596C3293L5364a36823A23652J92716a65744D77625B9938
$$ 2500 -101241 134596 33293 68657 -136823 123652 316368 -165744 477625 29938
17394A79634D4839O2424J59629A1327a15931J8437G8930M444P0565o8678b79289
$$ 179634 44839 107263 266892 11327 -115931 -97494 78930 83374 153939 85261 -279289
17382C26811F9907K34464q3635q8941b8305B62987j26235J64524O2754c6393r552
$$ 326811 69907 304371 220736 131795 -28305 262987 136752 301276 364030 -36393 -45945
17371d5945j11440C09776A4486J1648K07174A0061Q9776a12675B62628m2801K7128
$$ -45945 -157385 309776 14486 26134 233308 10061 99837 -112675 262628 219827 246955
17360B46955n6135l1769K27957A11362f2997A64935g7374A70259a27375A53282
$$ 246955 190820 159051 387008 111362 -62997 164935 -77374 170259 -127375 153282
17349A9221K67248m5995C5110b42759C52928j48275C4825J36098H0774L41831
$$ 19221 286469 240474 35110 -242759 352928 204653 34825 170923 80774 422605
17339D22605A46063L4461M8770J4723m7875J77426p8420D2769K60636r5237b4869
$$ 422605 146063 180524 229294 244017 196142 373568 295148 42769 303405 208168 -24869
17327A08344N7582j7593k2360j0333K65352A30544L0918b0346B82558a61135b3044
$$ 108344 165926 148333 125973 115640 380992 130544 161462 -20346 282558 -161135 -23044
17315I9347i3030A45444l7283b26291B20149E8211L19359I2129a93086C63454
$$ 99347 -93030 145444 108161 -226291 220149 58211 377570 92129 -193086 363454
17304B71728B8038J90467J08569A42378a49559L6461D00409e3145E19982j90143
$$ 271728 28038 218505 327074 142378 -149559 -113098 400409 -53145 519982 329839
17294C29839F2001L29900b3782n6496A4093J85436B4440Q9331M6141N99569D0716
$$ 329839 62001 391901 -23782 -80278 14093 199529 24440 113771 159912 759481 40716
17282h4111C09751C8886O15724E5371K18850A05375L84241j53588r6280p9586
$$ -84111 309751 38886 654610 55371 274221 105375 489616 336028 239748 160162
17272A60162m1724a03293C35202q7144H3950M62060j80560j81811E4071J34485
$$ 160162 118438 -103293 335202 248058 83950 546010 365450 183639 54071 188556
17262A88556a7462D01270A51981n7336K02457J47523j65323J17738A12671b0540
$$ 188556 -17462 401270 151981 94645 297102 444625 279302 397040 112671 -20540
17251I8013C4500d6543A97456F1364a03566A90792H6111P0298F3492a43740B86277
$$ 98013 34500 -46543 197456 61364 -103566 190792 86111 156409 63492 -143740 286277
17239B98499H8734K18514A4463L241e1444B62245B9630R6882O2761b7619k5986
$$ 298499 88734 307248 14463 17704 -51444 262245 29630 126512 189273 -27619 -53605
17228e3605o291B57849C4000J91990j12920f2212B93955j39373O8704M8909F6609
$$ -53605 -59896 257849 34000 225990 113070 -62212 293955 154582 223286 272195 66609
17216A57580J28937d0607B94921j16652K78003F1467O9447E2866K54348j14741
$$ 157580 286517 -40607 294921 178269 456272 61467 130914 52866 307214 192473
17206A92473o2523K92566A52135J23457K5600f8844G6138J19550a5588A06399
$$ 192473 129950 422516 152135 275592 301192 -68844 76138 195688 -15588 106399
17195A04322J8509K18514A66829k3316G002N72772I2732g8869A39277J38578f9233
$$ 104322 122831 341345 166829 143513 7002 579774 92732 -78869 139277 277855 -69233
17183B37885k1161Q2542d5050D5327L84888k09613F9971c3271A30083a9111A43660
$$ 237885 216724 299266 -45050 45327 430215 220602 69971 -33271 130083 -19111 143660
17171C24527K0594b73B02774p9776g2770B24747Q213f1360B57039k0150q7615
$$ 324527 345121 -273 202774 122998 -72770 224747 232960 -61360 257039 236889 149274
17160A49274d0914C93823j55820K76880q5576j19533j42453N7636l5060J3623
$$ 149274 -40914 393823 238003 514883 429307 309774 167321 224957 189897 203520
17150B03520O8267K63990j59690M7708j02191E1458J95180J97495k11441J33636
$$ 203520 271787 535777 376087 423795 321604 51458 246638 444133 232692 366328
17140C66328j32733a5752A35169K10743J48923B12655J13411q5079c2662D41540
$$ 366328 233595 -15752 135169 345912 494835 212655 326066 240987 -32662 441540
17129A34783K24072j49839P8434B7394M50698o1948j15331b5973E83069A74488
$$ 134783 358855 209016 287450 27394 478092 416144 300813 -25973 583069 174488
17118C90432p8058n9887P3959b787D15520k02764k994k7888J72624j57827K40147
$$ 390432 312374 252487 326446 -2787 415520 212756 209762 181874 354498 196671 436818
17107D36818A36795J61698J26365k00459n4341a10151A79697k108C8613K45064
$$ 436818 136795 298493 424858 224399 170058 -110151 179697 177589 38613 283677
17097B83677J90121I7992K60107l1912Q2230j89630O4186O2526m3731q0296K90165
$$ 283677 473798 97992 358099 326187 408417 218787 282973 345499 301768 221472 511637
17086E11637q1142j79329J66676j65493J92376o2510K106A24816R7809P9997J42498
$$ 511637 430495 251166 417842 252349 444725 382215 384321 124816 222625 302622 445120
17075D45120j45477j1085K1393j17639K9405J12465Q2050A61354n0582J12396
$$ 445120 299643 288558 309951 192312 221717 334182 416232 161354 110772 223168
17065B23168K32477n806J43784B50889j6576M75950F7436K48495K00405A50808
$$ 223168 455645 449839 593623 250889 234313 710263 67436 315931 516336 150808
17054D47971j6835A70770l2460N01390a8977C9727J66976M3011J52635K06969
$$ 447971 431136 170770 138310 639700 -18977 39727 206703 249714 402349 609318
17044F09318A72650K66076J12854m9204B25225K108K61289j03961j18396L41025
$$ 609318 172650 438726 551580 502376 225225 227333 488622 384661 266265 607290
17034F07290k13155J66034j21633k02596g5315F37451l05919J45839P5612k84
$$ 607290 394135 560169 438536 235940 -75315 637451 331532 477371 552983 552699
17024E52699B00015M23471J6526L6170k12806J58589k88159M29258l19495Q1886
$$ 552699 200015 623486 640012 676182 463376 621965 333806 763064 443569 525455
17014E25455j17489J82692k02873K03581j58685J46846j00746L000K87724l22046
$$ 525455 407966 590658 387785 591366 432681 579527 478781 481781 769505 447459
17004D47459G1387N13411K08742l37368o8360M72631k23994k33842J90549K65979
$$ 447459 71387 584798 793540 456172 387812 860443 636449 402607 593156 859135
16994H59135C69149M56302C11439R0720L60304j18273J92682k02852n398R263
$$ 859135 369149 825451 311439 402159 762463 644190 836872 634020 628622 637885
16984F37885K4677J16927k81534R1061J38912K18917l38326k1647J00154k80136
$$ 637885 662562 779489 497955 589016 727928 946845 608519 586872 687026 406890
16974D06890K74007Q5319R6360k26411K15421k15579J84152R8943k27916K97012
$$ 406890 680897 766216 862576 636165 851586 636007 820159 919102 691186 988198
16964I88198D66559M92555l52487L31650M5502j55708R7365l59076j27094K94274
$$ 988198 466559 959114 606627 938277 983779 828071 925436 566360 439266 733540
16954G33540K84996j59673K58860l15537r4384R1676L5193N2743j98629J37216
$$ 733540 1018536 858863 1117723 802186 707802 799478 834671 887414 688785 826001
16944H26001k25738M64797o1733L29320n21517r472j14579K54995n6068J45642
$$ 826001 600263 1065060 1003327 1332647 811130 801658 687079 942074 886006 1031648
16934A031648l86431J88025J52956r9847K95253l24116j55278M09925J3672K88687
$$ 1031648 645217 833242 986198 886351 1181604 857488 702210 1112135 1125807 1414494
16924A414494n88062L49553k88404O0002j36232r22J11532J18387P0405M80811
$$ 1414494 826432 1175985 887581 947583 811351 810429 921961 1040348 1110753 1591564
16914A591564o81546L95951j41920l38546K80951J28409m834R8519J21766j19279
$$ 1591564 910018 1305969 1164049 825503 1106454 1234863 1230029 1328548 1450314 1331035
16904A331035q578j26127J9228P0994J37423k40710K16708m3079j21024J60125
$$ 1331035 1322457 1196330 1215558 1286552 1423975 1183265 1399973 1356894 1235870 1395995
16894A395995j99562K8871J64045j82415L34377Q4487L55173m10363j35580n0641
$$ 1395995 1196433 1225304 1389349 1206934 1541311 1625798 1980971 1570608 1435028 1384387
16884A384387j6845J43508k99576L39689K06318J43404k70511J5148J48505k55440
$$ 1384387 1367542 1511050 1211474 1551163 1757481 1900885 1630374 1645522 1794027 1538587
16874A538587O01297o77554N54988J3570q9481k92818L69666l8691o471l54549
$$ 1538587 2139884 1462330 2017318 2030888 1941407 1648589 2018255 1979564 1973093 1618544
16864A618544L97261j34889R3583M02721k32624l9587l25280L87542J40475o1495
$$ 1618544 2015805 1880916 1974499 2377220 2144596 2105009 1779729 2167271 2307746 2246251
16854B246251j14934K14622m44163K92437K11814l18032J20021K79653j85645
$$ 2246251 2131317 2345939 1901776 2194213 2406027 2087995 2208016 2487669 2302024
16845B302024J48141J2881q9403j44804K92806K36281j81466n8320M23225J07840
$$ 2302024 2450165 2463046 2373643 2228839 2521645 2757926 2576460 2518140 2941365 3049205
16835C049205j18932m36460L69704J52348P723r882J26323K04655l9829L6687
$$ 3049205 2930273 2493813 2863517 3015865 3023588 3013706 3140029 3344684 3304855 3341542
16825C341542l32976K75624N845K43889o8486J04272q3801J40622m4790J52483
$$ 3341542 3008566 3284190 3290035 3533924 3465438 3569710 3485909 3626531 3581741 3734224
16815C734224K9943J12318N74713l46320Q729J47188K30670J20038l1208K04033
$$ 3734224 3764167 3876485 4451198 4104878 4113607 4260795 4491465 4611503 4580295 4784328
16805D784328P638j2383J55130m9597L26978J15006J68853J2838R1627M1004L0913
$$ 4784328 4791966 4779583 4934713 4885116 5212094 5327100 5495953 5508791 5600418 5641422 5672335
16794E672335M13067r8481J22130J70887K65464M36592N3909k37541K66331R8888
$$ 5672335 6085402 5986921 6109051 6279938 6545402 6981994 7035903 6798362 7064693 7163581
16784G163581K10485K74744J67349K17668J71573M14265o3994N44959j50578K41434
$$ 7163581 7374066 7648810 7816159 8033827 8205400 8619665 8555671 9100630 8950052 9191486
16774I191486j1276N20604M35579K94850L50993O93N65578K71343M69446K33898
$$ 9191486 9180210 9700814 10136393 10431243 10782236 10782929 11348507 11619850 12089296 12323194
16764A2323194L20708K89447O47408J08688Q32456K65187P23929M68846O26499
$$ 12323194 12643902 12933349 13580757 13689445 14521901 14787088 15511017 15979863 16606362
16755A6606362N23189O14076O25564Q79866K98487R44337Q05373P72391Q41197
$$ 16606362 17129551 17743627 18369191 19249057 19547544 20491881 21297254 22069645 22910842
16746B2910842J021116J296462Q33257J198906J055475J185906J415637J861479
$$ 22910842 23931958 25228420 26061677 27260583 28316058 29501964 30917601 32779080
16738C2779080J316236J463607K304505J650819J751616K419490K040679K289251
$$ 32779080 34095316 35558923 37863428 39514247 41265863 43685353 45726032 48015283
16730D8015283L054745K989555L222935L537910L513097L882371M124141M708042
$$ 48015283 51070028 54059583 57282518 60820428 64333525 68215896 72340037 77048079
16722G7048079M589829N928774N420843O329547O471547P159269P461334P454771
$$ 77048079 81637908 87566682 92987525 99317072 105788619 112947888 120409222 127863993
16714A27863993Q074846Q369063Q640638Q472423Q314088Q506290P779970P216675
$$ 127863993 135938839 144307902 152948540 161420963 169735051 178241341 186021311 193237986
16706A93237986O128572N261373L946802K557566R27551m32006k576945l721164
$$ 193237986 199366558 204627931 208574733 211132299 212059850 211627844 209050899 205329735
16698B05329735n313114o591191p125019p851014q383667r063291q544100q672215
$$ 205329735 200016621 193425430 186300411 178449397 170065730 161002439 152458339 143786124
16690A43786124q406020q244926p699709p517379o862411p037046o109333n534397
$$ 143786124 135380104 127135178 119435469 111918090 105055679 98018633 91909300 86374903
16682H6374903n316429m958479m638606m758314l414252m101789l731828l466924
$$ 86374903 81058474 76099995 71461389 66703075 63288823 59187034 55455206 51988282
16674E1988282k524250k806389k585484k515713k220424j962015j889325j661533
$$ 51988282 49464032 46657643 44072159 41556446 39336022 37374007 35484682 33823149
16666C3823149j844067j289892j738303j137878j356969j021933j241705j337714
$$ 33823149 31979082 30689190 28950887 27813009 26456040 25434107 24192402 22854688
16658B2854688n34340j213650q57334r74433q85325l19431j000704m14715o33619
$$ 22854688 22320348 21106698 20249364 19274931 18389606 18070175 17069471 16654756 16021137
16649A6021137o41829m16828n09238m22267o26658n97103k31101m14053o73172
$$ 16021137 15379308 14962480 14453242 14030975 13404317 12807214 12576113 12162060 11488888
16640A1488888J07165q74356R5758m27428m84476k605l00234l62907k41997l29510
$$ 11488888 11596053 10721697 10817455 10390027 9905551 9902946 9602712 9239805 8997808 8668298
16630H668298n21236j9875q38o82485r0167J52042k86925o6575j48631j7258l60887
$$ 8668298 8147062 8127187 8126349 7443864 7353697 7505739 7218814 7152239 7003608 6986350 6625463
16619F625463k83969j04435j85300l07962l11458k9766k59814P2623L6266m46345
$$ 6625463 6341494 6237059 6051759 5743797 5432339 5402573 5142759 5215382 5251648 4805303
16609D805303K71728l65920K21554j65245l90829k6695J5174k95594l46723Q15201
$$ 4805303 5077031 4711111 4932665 4767420 4376591 4349896 4365070 4069476 3722753 4537954
16599D537954p08914l2554r8707m908L627l43458R2194K76415m15791j13110L91279
$$ 4537954 3829040 3796486 3697779 3692871 3696498 3353040 3445234 3721649 3305858 3192748 3584027
16588C584027j72051k81855O7553J67091j65989k7203m26387M957M79618l43122
$$ 3584027 3411976 3130121 3197674 3364765 3198776 3171573 2745186 2750143 3229761 2886639
16578B886639l28190L93563j71771n18918L82585k22614j82224r6327J91872K00249
$$ 2886639 2558449 2952012 2780241 2261323 2643908 2421294 2239070 2142743 2334615 2534864
16568B534864m10760K60885k43954l41544M00181P0973l95820P2234o8306K2464
$$ 2534864 2124104 2384989 2141035 1799491 2199672 2270645 1874825 1947059 1878753 1901217
16558A901217L40021k67468K79544j67511j83271j40998j14437j55972j42536
$$ 1901217 2241238 1973770 2253314 2085803 1902532 1761534 1647097 1491125 1348589
16549A348589N20887n9129k17475j18390L06653k56691J40839k551L6786j28613
$$ 1348589 1869476 1810347 1592872 1474482 1781135 1524444 1665283 1662732 1699518 1570905
16539A570905j20977l44461L31916J75252k72561N9156j8659J65591k96906K09565
$$ 1570905 1449928 1105467 1437383 1612635 1340074 1399230 1380571 1546162 1249256 1458821
16529A458821m27379R5512N3708K78752j34272q5787K83099l91683K18658k01375
$$ 1458821 1031442 1126954 1180662 1459414 1325142 1239355 1522454 1130771 1349429 1148054
16519A148054K84741k51604k45631K33253K3416p9529J64791N554j97987l38349
$$ 1148054 1432795 1181191 935560 1168813 1192229 1112700 1277491 1283045 1085058 746709
16509G46709L97317k73925r2165L30793n0570k24631L96654k54258L3008k15026
$$ 746709 1144026 870101 777936 1108729 1058159 833528 1230182 975924 1008932 793906
16499G93906L61902k78967k30050L05430J52595k26916j58783q7410J87666j78411
$$ 793906 1155808 876841 646791 952221 1104816 877900 719117 631707 819373 640962
16489F40962K5839j04957K51185L38775l34199k50230m8751M04638k94256L2209
$$ 640962 666801 561844 813029 1151804 817605 567375 518624 923262 629006 661215
16479F61215J1216j77476K34224j08959q9858M89051k56319k47316k05126N3614
$$ 661215 672431 494955 729179 620220 530362 1019413 763094 515778 310652 364266
16469C64266L06365j02438L53363j91015l37502M25878k44839J40501k4321p6514
$$ 364266 670631 568193 921556 730541 393039 818917 574078 714579 690258 613744
16459F13744O6005p2471M91026D91828o2870Q1927M4203L34033j23505B63024
$$ 613744 679749 607278 1098304 491828 428958 510885 555088 889121 765616 263024
16448F98248k26476O6858l2905l3853m0919r325j27767K30199J12735M7521j50409
$$ 698248 471772 538630 505725 471872 430953 421628 293861 524060 636795 684316 533907
16437E33907j56203L4561N6599q4126L71097l18699k9542J83824m5430m5444O6232
$$ 533907 377704 412265 468864 384738 755835 437136 407594 591418 545988 500544 566776
16426E66776o8777r6474r5409l2609p6332J11989J21864k08696M06233B01426
$$ 566776 497999 401525 306116 273507 197175 309164 431028 222332 628565 201426
16415d0543B65218n3043O2977J02534N0377M4318F8325M14232j60191r9136N9948
$$ -40543 265218 212175 275152 377686 428063 472381 68325 482557 322366 223230 283178
16404B83178A33822K92950k1400N4640Q4020P6762B28145K91797j10189r3802
$$ 283178 133822 426772 405372 460012 544032 620794 228145 519942 409753 315951
16394C15951H4286L54756J48374j03364i0481D899L37091C9050K03082K46984
$$ 315951 84286 439042 587416 484052 -90481 4899 341990 39050 242132 489116
16384D89116k5038j41087O502K84658B66797Q6370J69110p6001k22529J14072
$$ 489116 464078 322991 329493 614151 266797 353167 522277 446276 223747 337819
16374C37819j03112r7324L72945B26073L30765k53287J42864j54462j7108j32490
$$ 337819 234707 137383 510328 226073 556838 303551 446415 291953 274845 142355
16364A42355K68480A65478n2420J72301j1193D3151N2776K52190j49419o322L75654
$$ 142355 410835 165478 113058 285359 274166 43151 95927 348117 198698 192376 568030
16353E68030B53311m9245J11555B5134J80193J17441J1111j54541C3098J96915
$$ 568030 253311 204066 315621 25134 205327 322768 333879 179338 33098 230013
16343B30013G3887L11921A20978r128M1520J06706j21994k1459K38491a80924
$$ 230013 73887 385808 120978 111850 153370 260076 138082 116623 355114 -180924
16332C34519F8953B1296a04934B10809I0656L77288m7425I7385a29662D8052J58972
$$ 334519 68953 21296 -104934 210809 90656 467944 420519 97385 -129662 48052 207024
16321B07024J72460A04384A8819d4673A52131b22081I6412J89111A39295J40844
$$ 207024 379484 104384 18819 -44673 152131 -222081 96412 285523 139295 280139
16311B80139E697J89837J33016e4250F0155K44193J20817A25147J87607I3679
$$ 280139 5697 195534 328550 -54250 60155 304348 425165 125147 312754 93679
16300C28121q7527b37006A27444J89503J182b33017H5351K07480I1199R5813K14585
$$ 328121 240594 -237006 127444 316947 318129 -233017 85351 292831 91199 187012 401597
16289D01597j1647H2652O0109n9776K30183G049h727A80176K65997f7039l2425
$$ 401597 389950 82652 142761 82985 313168 7049 -8727 180176 446173 -67039 -99464
16278i9464A44039o6971c253l9966A83412c2881A74132F548J94382J76850A78204
$$ -99464 144039 77068 -3253 -43219 183412 -32881 174132 6548 200930 377780 178204
16266B31939F9786L29315C9278F522J2432L11058j10766b06418B64367k5646C0750
$$ 231939 69786 399101 39278 6522 18954 330012 219246 -206418 264367 238721 30750
16254A12872l2842e9812B4435R6484N2642K14847C9077a46617H5726g5385J2054
$$ 112872 80030 -59812 24435 120919 173561 388408 39077 -146617 85726 -75385 -63331
16243f3331A98772a12407H6986L09499f9462J6819C09247j11088Q980a84510B11624
$$ -63331 198772 -112407 86986 396485 -69462 -52643 309247 198159 207139 -184510 211624
16231B79782a15086E2904b7567B12541R9991I3942j1193a14086B23296m6397m5123
$$ 279782 -115086 52904 -27567 212541 312532 93942 82749 -114086 223296 176899 131776
16220A31776J48643I3074K46749o3213H1237J23730Q0787a63191B49172q0496
$$ 131776 280419 93074 339823 276610 81237 204967 285754 -163191 249172 168676
16210A68676J0353o9895I593a51836A45401a58007A26862d091B25431o4677B2447
$$ 168676 179029 109134 9593 -151836 145401 -158007 126862 -4091 225431 160754 22447
16198A0094c791D31256a60851A50782g4935b3574B07703a92752F2669Q6986J08925
$$ 10094 -3791 431256 -160851 150782 -74935 -23574 207703 -192752 62669 149655 258580
16187B58580g5469G6368J34075E2221N8753e7178k9969a5851j43282C50942A46225
$$ 258580 -75469 76368 210443 52221 110974 -57178 -87147 -15851 -159133 350942 146225
16175D23313b05880A15614P8986d5303A81532D0183Q7008a6462C21182a66490
$$ 423313 -205880 115614 194600 -45303 181532 40183 127191 -16462 321182 -166490
16164g7952B81289A02534D9159M321a13666I0359K66202a53103B17291a24248
$$ -77952 281289 102534 49159 53480 -113666 90359 356561 -153103 217291 -124248
16153A17420N9247c2124j88927I9121a71006O6004B11641B292J85620P2472c29338
$$ 117420 176667 -32124 -221051 99121 -171006 -105002 211641 2292 187912 260384 -329338
16141A78715a09114c667H4969b10147f0528C03322a34027b5284A80950D8072O9225
$$ 178715 -109114 -3667 84969 -210147 -60528 303322 -134027 -25284 180950 48072 117297
16130A17297a51031D86560h9944l7981A54124a74311d5978B95209e6010A4618
$$ 117297 -151031 486560 -89944 -127925 154124 -174311 -45978 295209 -56010 14618
16119a08455A22435i3864j57525a03528C3308a48798B03205r2076h4624a1744
$$ -108455 122435 -93864 -251389 -103528 33308 -148798 203205 111129 -84624 -11744
16108E6122a22868B9424c22613a2384I9271L5503K5305D8958B2828a87731d8487
$$ 56122 -122868 29424 -322613 -12384 99271 134774 160079 48958 22828 -187731 -48487
16096a03250F0868b44191O5133B11503E8770d1734B32595p6581b6401C8593J78342
$$ -103250 60868 -244191 -179058 211503 58770 -41734 232595 156014 -26401 38593 216935
16085B16935B3332b15725C7639b36839I2308b07509B6171b52390B5329K42370
$$ 216935 23332 -215725 37639 -236839 92308 -207509 26171 -252390 25329 267699
16075B67699A9255a54209j7449H2913C971b4392B443g2665r8141d2440i880B9045
$$ 267699 19255 -154209 -171658 82913 3971 -24392 2443 -72665 -170806 -42440 -9880 29045
16062a45016A9934d4264k25375A8342g3145j86518D71263f0792A09055j1930a26020
$$ -145016 19934 -44264 -269639 18342 -73145 -259663 471263 -60792 109055 97125 -126020
16050a91828Q1035A08038P69d935j64928D53672j68414a71513A95016G5916K35800
$$ -191828 -110793 108038 108807 -4935 -169863 453672 285258 -171513 195016 75916 311716
16039C11716A10692e128H136e1447k6719A34764c44539b5533A53055k1822l2751
$$ 311716 110692 -5128 8136 -51447 -78166 134764 -344539 -25533 153055 131233 98482
16028I8482a06390G6514i3099l4576N6696j64055J11826m60692A00422J54966
$$ 98482 -106390 76514 -93099 -127675 -70979 -235034 -123208 -583900 100422 255388
16018B55388E9865B0406D911b6150l87731A30558b07467b5957E0909L7369P4132
$$ 255388 59865 20406 4911 -26150 -413881 130558 -207467 -25957 50909 88278 162410
16007A62410M7134a94398j10349J11069n5153j89762E275a05343F2495e15967
$$ 162410 209544 -194398 -304747 -193678 -248831 -438593 5275 -105343 62495 -515967
15996b7742p8929K5760A551d2922a8347F2440a36348l9526H0651J21745d8546
$$ -27742 -106671 -80911 1551 -42922 -18347 62440 -136348 -175874 80651 202396 -48546
15984b05646j6429E6121a08843F1114b10537D660c26122J17193j0421B3511a90029
$$ -205646 -222075 56121 -108843 61114 -210537 4660 -326122 -208929 -219350 23511 -190029
15972F1134A8655b36583h4062B26860a01158K7972A92205A4616J36013m8512Q7559
$$ 61134 18655 -236583 -84062 226860 -101158 -73186 192205 14616 150629 102117 189676
15961A89676c17590m0516A04287b25759C06406c9622A57369m2351e9302m5223
$$ 189676 -317590 -358106 104287 -225759 306406 -39622 157369 115018 -59302 -104525
15951a04525B53194j01799E4836I90f494B50601q0736c6181B5299J13063b1315
$$ -104525 253194 151395 54836 990 -6494 250601 169865 -36181 25299 138362 -21315
15939a42222A47059f6839j3801a3106A04877M5968a7959A37468c54661B8937d8869
$$ -142222 147059 -66839 -80640 -13106 104877 150845 -17959 137468 -354661 28937 -48869
15927D7019i140A27514a37800j73445h5994k4734M646A77174a43625I032L5626
$$ 47019 -9140 127514 -137800 -311245 -85994 -110728 -106082 177174 -143625 9032 44658
15916D4658d4641k5819j44579l1300J09016j8750A24387d571H3493b04243R2575
$$ 44658 -44641 -70460 -215039 -246339 -137323 -156073 124387 -4571 83493 -204243 -111668
15905a11668I6344a62180J4378l387l8141p1116Q2941Q5778o7456D4017e7199
$$ -111668 96344 -162180 -147802 -151189 -189330 -260446 -177505 -91727 -159183 44017 -57199
15893b88539D389b15104d5611B31986a07926c1220j1154O551p8392B70414I0075
$$ -288539 4389 -215104 -45611 231986 -107926 -31220 -42374 -35823 -114215 270414 90075
15881A57765c18842B7115J09023C9801e3517j02202B27559r0132e4271j717j76592
$$ 157765 -318842 27115 136138 39801 -53517 -155719 227559 137427 -54271 -55988 -232580
15870b32580l82J2051A30015E9894J28175a22233A48781J71874a43486C0261a57139
$$ -232580 -232962 -220911 130015 59894 188069 -122233 148781 320655 -143486 30261 -157139
15858b0942C9200b09973C68731g1304n4922k5944G7983p423R9958m8260j4544
$$ -20942 39200 -209973 368731 -71304 -126226 -152170 77983 70560 170518 122258 107714
15847A07714k1077C9390b99132b3144g180q7017c8069D0110M9847K04942b19978
$$ 107714 86637 39390 -299132 -23144 -7180 -94197 -38069 40110 89957 294899 -219978
15835a67176G2924j9375Q8481a24156I0806A7197c8154n4924k57347B59219D4059
$$ -167176 72924 53549 142030 -124156 90806 17197 -38154 -93078 -350425 259219 44059
15823C5908b11232A41370k9983a56402A0553a89606g4245H9911e5056k01838H2150
$$ 35908 -211232 141370 111387 -156402 10553 -189606 -74245 89911 -55056 -256894 82150
15811B32770c52618J44693R6151B08764a14632E203O5289N6475b5167m4382I8374
$$ 232770 -352618 -207925 -111774 208764 -114632 5203 70492 126967 -25167 -69549 98374
15799a32283l8638O1460h455l26781c4951j63863g8267l70164g3250E1678b83497
$$ -132283 -170921 -109461 -8455 -335236 -34951 -198814 -78267 -448431 -73250 51678 -283497
15787H7888L4218c58001a07763E5395Q2467c14850i5761k21457g6757l9608H4248
$$ 87888 122106 -358001 -107763 55395 137862 -314850 -95761 -317218 -76757 -116365 84248
15775H4977K74116i1185j34890D5785J39186H2420d12459a09634B08328d1425
$$ 84977 359093 -91185 -226075 45785 184971 82420 -412459 -109634 208328 -41425
15764b92532R852N3062F4564a00653j28140e7983J0642k20796a09083o8935m3494
$$ -292532 -282680 -229618 64564 -100653 -228793 -57983 -47341 -268137 -109083 -178018 -221512
15753b21512A33216b25083p8326a16748A81836a2871l7086o9989A39541b44325
$$ -221512 133216 -225083 -303409 -116748 181836 -12871 -49957 -119946 139541 -244325
15742F2586j2686K39680I9082a11436C98412A14176J47795I0584R1189a82499
$$ 62586 49900 289580 99082 -111436 398412 114176 261971 90584 181773 -182499
15731A87868H6984k9825b14249A5212c74481J63230B1275J96112g0428j64205
$$ 187868 86984 57159 -214249 15212 -374481 -211251 21275 217387 -70428 -234633
15721b34633A18837e7591k44789A66178h1206j91078B33581a43438A1242c779
$$ -234633 118837 -57591 -302380 166178 -81206 -272284 233581 -143438 11242 -3779
15710C91404i1297b5555m7878a7230G4421J14076F5815a59959p4418D02737H2439
$$ 391404 -91297 -25555 -73433 -17230 74421 188497 65815 -159959 -234377 402737 82439
15698A64949f2475a8465m378l44772J67154j31795A46796o6402a02723j24004
$$ 164949 -62475 -18465 -22843 -367615 -200461 -332256 146796 80394 -102723 -226727
15688b26727f5557C7916d4025B35046E9076L3314k625l4081e1515j68265A57832
$$ -226727 -65557 37916 -44025 235046 59076 92390 89765 55684 -51515 -219780 157832
15676g3739A43461o0619k6542a29900l7119N5498B66547a91500j19233J54455
$$ -73739 143461 82842 56300 -129900 -167019 -111521 266547 -191500 -310733 -156278
15666a56278A28955a19432a1508B21142a38065L2989K9959a28j4147j46147I614
$$ -156278 128955 -119432 -11508 221142 -138065 -105076 -75117 -128 -14275 -160422 9614
15654a53018B11943b57942A60044b68561B06675k1820G6443J4520L21515a89271
$$ -153018 211943 -257942 160044 -268561 206675 184855 76443 90963 412478 -189271
15643g9304j43265d6387D3339P4663e3026p4898G5262b10772f7690A17563J22778
$$ -79304 -222569 -46387 43339 118002 -53026 -127924 75262 -210772 -67690 117563 240341
15632B40341n7550G7215a07088d6037a5510q7197l40855B7173j2300a27143F6125
$$ 240341 182791 77215 -107088 -46037 -15510 -102707 -443562 27173 14873 -127143 66125
15620I7253A1052R1191a55291M2075A7726a76521G7437l5201b21768C2040J45170
$$ 97253 11052 102243 -155291 -113216 17726 -176521 77437 42236 -221768 32040 177210
15609A77210b80407I6980e6853l7413K6888F5441d56834E4685e6564j81669B6339
$$ 177210 -280407 96980 -56853 -94266 -67378 65441 -456834 54685 -56564 -238233 26339
15597c25639J31406P8525B13306a36855j82245G1532a9377B44486D2225c27104
$$ -325639 -194233 -115708 213306 -136855 -319100 71532 -19377 244486 42225 -327104
15586a85104O7655m376q1245n7982J10627B30581R1694C6698b20654C99147b1325
$$ -185104 -117449 -121825 -203070 -261052 -150425 230581 322275 36698 -220654 399147 -21325
15574a92211a6003B41491J41586f8372B02867d7658k6391A87410C589h6507M2493
$$ -192211 -16003 241491 383077 -68372 202867 -47658 -74049 187410 3589 -86507 -44014
15563d4014E08d37663b07341B29590f8621A28094l4831a90322e8753C8153a7394
$$ -44014 508 -437663 -207341 229590 -68621 128094 93263 -190322 -58753 38153 -17394
15551d8377j93080a18560H1841b8287G1112c12235P9803e3455k35292a37008G925
$$ -48377 -241457 -118560 81841 -28287 71112 -312235 -232432 -53455 -288747 -137008 7925
15539F6398a73088N0041j11706O7730d3002C0327c58205G266N23400h4274F9885
$$ 66398 -173088 -123047 -234753 -167023 -43002 30327 -358205 7266 530666 -84274 69885
15527a41148r3992H6347K3334a3786j55718j04890G4126k8896a32927F222c47595
$$ -141148 -235140 86347 109681 -13786 -169504 -274394 74126 45230 -132927 6222 -347595
15515b52290e4722D379g517A57431J41245a5714n8061B87628A0054J5664h0773
$$ -252290 -54722 4379 -7517 157431 298676 -15714 -73775 287628 10054 25718 -80773
15503i2901B72635a80435B05863p6452K52753A24229A4698a51608k7534A65495
$$ -92901 272635 -180435 205863 129411 382164 124229 14698 -151608 -179142 165495
15492b01405A42737l7371l5901a18455r2694d9997D5541F84L21382a13004D8393
$$ -201405 142737 105366 69465 -118455 -211149 -49997 45541 684 322066 -113004 48393
15480b61738E0360a37096O1984B46918D5654A0051Q8365b30087B50734L2276b74974
$$ -261738 50360 -137096 -75112 246918 45654 10051 98416 -230087 250734 283010 -274974
15468a52320C7098a8785B67229b4913q8892m34000J16797G8233h2085B71031a40816
$$ -152320 37098 -18785 267229 -24913 -113805 -547805 -431008 78233 -82085 271031 -140816
15456A69637K50128E1237a06708O522A2499b6329j16749j50599D0797c40292B31154
$$ 169637 419765 51237 -106708 -100186 12499 -26329 -143078 -293677 40797 -340292 231154
15444A12674b53019E7337f2119C6693a13849A76718h1657n34A92638E8831a26622
$$ 112674 -253019 57337 -62119 36693 -113849 176718 -81657 -82191 192638 58831 -126622
15432A82937Q0270n8727P9509b6026k41087a1416p5198a7878C22806A04545L26710
$$ 182937 263207 204480 283989 -26026 -267113 -11416 -86614 -17878 322806 104545 431255
15421D31255b6942k93375c8575B6459a58245H3057e5951A08962a18981C94871
$$ 431255 -26942 -320317 -38575 26459 -158245 83057 -55951 108962 -118981 394871
15410b2654A4403K1498i2957B75850d1612B06286a02059c0554J3095l45113E6698
$$ -22654 14403 35901 -92957 275850 -41612 206286 -102059 -30554 -17459 -362572 56698
15398c43846J21871b089m0471n1123A48353K6451J8063b93628I8498J34697h3309
$$ -343846 -221975 -2089 -42560 -93683 148353 174804 192867 -293628 98498 233195 -83309
15386B00915D0340a04320a7547A54203A0311J53265a28215N9832m9463B17381
$$ 200915 40340 -104320 -17547 154203 10311 163576 -128215 -68383 -117846 217381
15375B12778A0311c97557a55627e5197a6756j82846A28226a2475k94420b6945
$$ 212778 10311 -397557 -155627 -55197 -16756 -199602 128226 -12475 -306895 -26945
15364a68606A77503l6414e929k54598G962a58910H6357h105j47035G0075B9546
$$ -168606 177503 141089 -5929 -260527 7962 -158910 86357 -8105 -155140 70075 29546
15352a52919B87306f0541j06556c5619A16492a10213A49271b00541F1340g5861
$$ -152919 287306 -60541 -167097 -35619 116492 -110213 149271 -200541 61340 -75861
15341A45036g0123b6475j73972c6613k1304A46713L5349a84989b0471A14277O668
$$ 145036 -70123 -26475 -200447 -36613 -57917 146713 182062 -184989 -20471 114277 120945
15330A20945B1282J16680g6422B49403j16574A9J47324l3595m3824a4087D8257
$$ 120945 21282 137962 -76422 249403 132829 19 147343 113748 69924 -14087 48257
15318e1690H4620a6034L778j23001C1512J08191N7890K618N9172I8790Q8073a14522
$$ -51690 84620 -16034 -12256 -135257 31512 139703 197593 200211 259383 98790 186863 -114522
15305a10093F4234a20719A06868J5301l3653g453A28466a3850a394F6521a72949
$$ -110093 64234 -120719 106868 122169 88516 -7453 128466 -13850 -1394 66521 -172949
15293c87609A25746k8857c13543A5379g4462m9481D180a05536Q339G0573e9329
$$ -387609 125746 96889 -313543 15379 -74462 -123943 4180 -105536 -97197 70573 -59329
15281a5185j78264A13150j3745m7372f3638A77305c6880j87670B81956d9268A10077
$$ -15185 -193449 113150 99405 52033 -63638 177305 -36880 -224550 281956 -49268 110077
15269b43897C03113C6468a89516a38D06452A60728R1586p3248g2084A96490a1974
$$ -243897 303113 36468 -189516 -138 406452 160728 252314 179066 -72084 196490 -11974
15257A59707a46758L5052n9278B15859a83523A0961O9364a92886D4190b3226F3757
$$ 159707 -146758 -111706 -170984 215859 -183523 10961 80325 -192886 44190 -23226 63757
15245D45248j83965I4455A8269d9130J1960D21122h8357A65014a8770D41576L15556
$$ 445248 261283 94455 18269 -49130 -37170 421122 -88357 165014 -18770 441576 757132
15234G57132L7050K9124j2524B04657P5570j26341J62069l5602r6460O6605b3487
$$ 757132 794182 823306 810782 204657 280227 153886 315955 280353 183893 250498 -23487
15222E2586J04393b69963C92375A4589c18430B3310a93370C06932b1592B48889
$$ 52586 156979 -269963 392375 14589 -318430 23310 -193370 306932 -21592 248889
15211F3740K6455K56268a7901j21629C461M4085h5514C25979b72012B37113E3998
$$ 63740 90195 346463 -17901 -139530 3461 47546 -85514 325979 -272012 237113 53998
15199i3913B05292D6001b62482k5887A32538n1734J75197E7358K4668l9713a40364
$$ -93913 205292 46001 -262482 -288369 132538 80804 256001 57358 82026 42313 -140364
15187b10620A53647I970K48902R2555H0503j6564M1745e2089i12B94919a59173
$$ -210620 153647 9970 258872 351427 80503 63939 105684 -52089 -912 294919 -159173
15175d6918m20877C09687F5159K73583a28362A27487a90013c9395n2227j52787
$$ -46918 -467795 309687 65159 338742 -128362 127487 -190013 -39395 -91622 -244409
15165b44409G9296A6357K11228E5561b00635H1090K02242K8275A49734g9461B16273
$$ -244409 79296 16357 227585 55561 -200635 81090 283332 311607 149734 -79461 216273
15153C08192e6023l4038j51645A27916a08347A55518b5197B25005l5274g4395
$$ 308192 -56023 -90061 -241706 127916 -108347 155518 -25197 225005 189731 -74395
15142B6993a8892A51202J0982L31h3976J9044B58875D1855L01703j35373G6846
$$ 26993 -18892 151202 162184 162515 -83976 -64932 258875 41855 343558 208185 76846
15130e7997j6553j7414C92564a1096r6568A35418b74706H8504D4147h4291C35113
$$ -57997 -74550 -91964 392564 -11096 -107664 135418 -274706 88504 44147 -84291 335113
15118A35649M7974p8948a38215H969a30025C16644Q7928j6260K054l3779G3415
$$ 135649 183623 104675 -138215 8969 -130025 316644 404572 388312 390366 356587 73415
15106B66003a8145l55663G310f1975p5863m4960C71441E1587J86463d5428B56920
$$ 266003 -18145 -373808 7310 -61975 -137838 -182798 371441 51587 238050 -45428 256920
15094C9088J03687Q2287R7406A27175l6270n072h2941I5595g8532A14179M6577
$$ 39088 142775 225062 322468 127175 90905 85833 -82941 95595 -78532 114179 160756
15083A60756F4965J50442H4019J43464B9976J86469L00750b83230e7179B34557
$$ 160756 64965 215407 84019 227483 29976 216445 517195 -283230 -57179 234557
15072D23703A3097L37860F1848J0628l256J759j2449e4983B66927d2085j11098
$$ 423703 13097 350957 61848 72476 69220 70979 58530 -54983 266927 -42085 -153183
15061a53183F1617K22195A09603Q803c5732C6086K99353A67061J53155A35204
$$ -153183 61617 283812 109603 118406 -35732 36086 335439 167061 320216 135204
15050B02206H827e3478D9137J81305c2368B62805L9101j13415r877E6102K35181
$$ 202206 8827 -53478 49137 230442 -32368 262805 301906 188491 178614 56102 291283
15039B91283A10554M5337j0699B7887O4044a62223M6897B89213r8149p5450J30304
$$ 291283 110554 155891 145192 27887 91931 -162223 -115326 289213 191064 115614 245918
15028B45918C5828h1986C7752J46741J8323K28595P9704G2585J20675L2482i7606
$$ 245918 35828 -81986 37752 184493 202816 431411 511115 72585 193260 225742 -97606
15016C33810o3513I971J50571c1416D1696b23001k00699B99829n0483j09737l573
$$ 333810 270297 9971 160542 -31416 41696 -223001 -423700 299829 249346 139609 136036
15005A36036b6551E31087j18898a0141B42101J76323J22810I0a37572C45332o4836
$$ 136036 -26551 531087 412189 -10141 242101 418424 541234 90 -137572 345332 280496
14994B80496b17351B84504I3888B9396K82170F1101L66235q5343e1086A44386
$$ 280496 -217351 284504 93888 29396 311566 61101 427336 341993 -51086 144386
14983e6279A27405K00863I9163m780J54786M1148J33248c1938C05161k8129L7623
$$ -56279 127405 328268 99163 94383 249169 290317 423565 -31938 305161 277032 314655
14972C14655j0025A02624J39292j06731a89313B27491C4067L49636L5451H1646
$$ 314655 304630 102624 241916 135185 -189313 227491 34067 383703 419154 81646
14961B34850Q9407K08879j88190j07529k9556o3197J00519B0385J08109P0119
$$ 234850 324257 533136 344946 237417 207861 144664 245183 20385 128494 198613
14951A98613J18570r6982J8374n8881K7848K09088j96114l782n6166M0661j1278
$$ 198613 317183 220201 238575 179694 207542 416630 220516 216734 160568 201229 189951
14940A89951C5268K5208c7501D54008K7871A42642b0268B54624N6367g2656A63574
$$ 189951 35268 60476 -37501 454008 481879 142642 -20268 254624 310991 -72656 163574
14928D69947A96418q0253K30774j42419L54769A07321K89993n6347A65497K65925
$$ 469947 196418 116165 346939 204520 559289 107321 397314 340967 165497 431422
14918D31422A47039O9863a2285A46199a2937A40515L91214B28581K96342A83968
$$ 431422 147039 216902 -12285 146199 -12937 140515 531729 228581 524923 183968
14907B11414N2860K92153j41349J17064B20884q3031e6263E27962k16096I1529
$$ 211414 264274 556427 415078 532142 220884 137853 -56263 527962 311866 91529
14896G3198J22318j6745J00011q4820F2307d817B57669J16702j04975A1447J41600
$$ 73198 195516 178771 278782 193962 62307 -4817 257669 374371 269396 11447 153047
14885A53047K08185L1697j1465A30509e8993E06186J48345G4242J78222J00730
$$ 153047 361232 392929 381464 130509 -58993 506186 654531 74242 252464 353194
14875C53194A19982J35777J4616k0914r47O7297R6123J10481j66853j6028O4426
$$ 353194 119982 255759 270375 249461 248514 315811 411934 522415 355562 339534 403960
14864D03960p6481A38677J09687L82074k23136J3949m5064J90965B59348L65207
$$ 403960 327479 138677 248364 630438 407302 421251 376187 567152 259348 624555
14854F24555B18528K33510A93714K9978L6781q2524J64899l5690M614c1084B74995
$$ 624555 218528 452038 193714 223692 260473 177949 342848 307158 311772 -31084 274995
14842C90914K18247j25514k25247K52768J62690H7436K93596A68007J19011J19793
$$ 390914 609161 483647 258400 511168 673858 87436 381032 168007 287018 406811
14832D06811J5910A81678M2288L76523L8897j65643O1138q3420J89479B80082
$$ 406811 422721 181678 223966 600489 639386 473743 534881 451461 640940 280082
14821D49582J43428j31125L40220B21283L638o8911K88047j53074r7021M03283
$$ 449582 593010 461885 802105 221283 224921 156010 444057 290983 193962 597245
14811E97245j78447j89870K99113k17452j51010N08986B28677K22744J39690B45492
$$ 597245 418798 228928 528041 310589 159579 668565 228677 451421 591111 245492
14800E17220r4074K09942B21879K60367L5833k0521R9041k7562M7237j66203B7323
$$ 517220 423146 633088 221879 482246 518079 497558 596599 569037 616274 450071 27323
14788D61646k06608M22856B05867K29662K53480K8915j56286N8807j02604j45824
$$ 461646 255038 677894 205867 435529 689009 717924 561638 620445 517841 372017
14778C72017K41487q1404J9464Q6256j81151n5956J49818k29199L40153k66876
$$ 372017 613504 532100 551564 637820 456669 400713 550531 321332 661485 394609
14768C94609K87570J22393C06824M11412l03282J8921K88733j51722J35579R786
$$ 394609 682179 804572 306824 718236 414954 433875 722608 570886 706465 716251
14758G16251R1681B44624N6356K92172j18680J01360K28738C76560R316M0209
$$ 716251 807932 244624 300980 593152 474472 575832 804570 376560 385876 426085
14748D26085K01038K4981J07671p6827J57392j24921O2656k47923q8784K31952
$$ 426085 627123 652104 759775 682948 840340 715419 778075 530152 441368 673320
14738F73320N0184Q5767j48344j82444L7484K6341K06713k72683L88467j97694
$$ 673320 723504 809271 660927 478483 515967 542308 749021 476338 864805 667111
14728F67111l22758J40643K72200j34868K43718l10011j88136M53149k94272k3618
$$ 667111 344353 484996 757196 622328 866046 556035 367899 821048 526776 503158
14718E03158L61366D01803L32539j90053J43080j76614P3440J6540o3748K61114
$$ 503158 864524 401803 734342 544289 687369 510755 584195 600735 536987 798101
14708G98101j92040K34750q058j43552L66100m56826L070L90277k10569k03341
$$ 798101 606061 840811 832753 689201 1055301 598475 601545 991822 781253 577912
14698E77912K92737j58034J90779J04668l43422J50252P5266l9806J49239m23159
$$ 577912 870649 712615 903394 1008062 664640 814892 890158 850352 999591 576432
14688E76432J34056p4578O7871K21515K34733j20731k89791J61231k04534M91101
$$ 576432 710488 635910 703781 925296 1160029 1039298 749507 910738 706204 1197305
14678A197305r1793j52311j33203r8248M45964j37696n2999k56889J66070n9780
$$ 1197305 1105512 953201 819998 721750 1167714 1030018 977019 720130 886200 826420
14668H26420J99620n4534Q7073K09983q2805k87023j06957P4507R3762j84909
$$ 826420 1026040 971506 1058579 1268562 1185757 898734 791777 866284 960046 775137
14658G75137L72223n4435j48744J9111K229K72456j95261J65793J2510K9037j97625
$$ 775137 1147360 1092925 944181 963292 965521 1237977 1042716 1208509 1221019 1250056 1052431
14647A052431O3841k18415R8188K96886o27119K87438M58419m50972J99960N4644
$$ 1052431 1116272 897857 996045 1292931 665812 953250 1411669 960697 1160657 1215301
14637A215301j34079M78615k93181O324l32660J42653j33421K82308m5845K1524
$$ 1215301 1081222 1559837 1266656 1272980 940320 1082973 949552 1231860 1186015 1207539
14627A207539j09551M3966n6316j13270P3447Q1037k79826M03835R4102k75244
$$ 1207539 1097988 1141954 1085638 972368 1045815 1126852 847026 1250861 1344963 1069719
14617A069719M39277l29263K95561k06834L22306k39971l15104J58467K21131
$$ 1069719 1508996 1179733 1475294 1268460 1590766 1350795 1035691 1194158 1415289
14608A415289p8139J15897K6306k5586k4817n5796J18777j30214Q175L7415k5825
$$ 1415289 1337150 1453047 1479353 1453767 1428950 1373154 1491931 1361717 1369892 1407307 1381482
14597A381482j37559J53386L62957r4443J48938q4648k18222K3264N8071n8043
$$ 1381482 1243923 1397309 1760266 1665823 1814761 1730113 1511891 1535155 1593226 1535183
14587A535183K23602j96298p8252K33582m13349M23751M7361l30956K97417k36996
$$ 1535183 1758785 1562487 1484235 1717817 1304468 1728219 1775580 1444624 1742041 1505045
14577A505045K55443L11699m19388J3094r0704L83614j76018j26416N73293l07239
$$ 1505045 1760488 2072187 1652799 1665893 1575189 1958803 1782785 1656369 2229662 1922423
14567A922423K68032p2256k21460p5703k03268K94054J05146J54762j82902k59772
$$ 1922423 2190455 2118199 1896739 1821036 1617768 1911822 2016968 2171730 1988828 1729056
14557A729056L33779j41281M2999K09392M3966J43206k97585O26254j84017P0564
$$ 1729056 2062835 1921554 1964553 2173945 2217911 2361117 2063532 2689786 2505769 2576333
14547B576333K34622n25006L13831M18463M32760m6058K69567o2982N05119M26796
$$ 2576333 2810955 2285949 2599780 3018243 3451003 3404945 3674512 3611530 4116649 4543445
14537D543445O20574O72627J061277J976800L307823O158795R118208N484705
$$ 4543445 5164019 5836646 6897923 8874723 12182546 18341341 27459549 32944254
14529C2944254j2276091p616560m311719k608989j739794r18661q267n70731k79223
$$ 32944254 20668163 13051603 8739884 6130895 4391101 3472440 3464173 2893442 2614219
14520B614219j97459N97102o58078K57472k16138k04161j23002L96596L8766L7222
$$ 2614219 2416760 3013862 2355784 2613256 2397118 2192957 2069955 2466551 2505317 2542539
14510B542539k76090L9573L7587m8164L65242L35418p72069J87101J00799K25879
$$ 2542539 2266449 2306022 2343609 2295445 2660687 2996105 2224036 2411137 2511936 2737815
14500B737815l4586K73046m36216P8802M27968l06881Q5494J54719J38867j37580
$$ 2737815 2703229 2976275 2540059 2618861 3046829 2739948 2825442 2980161 3119028 2981448
14490B981448P1179R4124P4583k97067J81134j00202K9276P5615l0664M53280
$$ 2981448 3052627 3146751 3221334 2924267 3105401 3005199 3034475 3110090 3079426 3532706
14480C532706k59764J60872L576k00876J85419P4337q9388Q6693Q5489J64470
$$ 3532706 3272942 3433814 3437390 3236514 3421933 3496270 3406882 3493575 3579064 3743534
14470C743534k7539k3496r1442J60394K67333n9701j03295K38761O1338k54541
$$ 3743534 3715995 3692499 3601057 3761451 4028784 3969083 3865788 4104549 4165887 3911346
14460C911346J9552L28797K9791j65235L65675k56077M89757o02024M63882o9707
$$ 3911346 3930898 4259695 4289486 4124251 4489926 4233849 4723606 4121582 4585464 4515757
14450D515757j30591R4039M55207j41285j19210L9326L13630J51569L0950j64209
$$ 4515757 4385166 4479205 4934412 4793127 4673917 4713243 5026873 5178442 5209392 5045183
14440E045183J49100k60143J27580N8368N51469q9806j8373n1753J088P3030J7910
$$ 5045183 5194283 4934140 5061720 5120088 5671557 5581751 5563378 5511625 5512713 5585743 5603653
14429E603653J50839N9021N1537J5399M47101R618k73285K00246M67763k20864
$$ 5603653 5754492 5813513 5865050 5880449 6327550 6337168 6063883 6264129 6731892 6511028
14419F511028r9092K61204K8310K0336L47167K48768n37187K67804M33541j54284
$$ 6511028 6411936 6673140 6701450 6721786 7068953 7317721 6780534 7048338 7481879 7327595
14409G327595r5844L24500r402L6030M67491m39355L92579r208L85788J37713
$$ 7327595 7231751 7556251 7546849 7582879 8050370 7611015 8003594 7994386 8380174 8517887
14399H517887L89819k69906K67073o9327L90021j58461J82358Q3941N46452Q7578
$$ 8517887 8907706 8637800 8904873 8835546 9225567 9067106 9249464 9333405 9879857 9967435
14389I967435r8688J98127M84578p328J69163L14382J24445j4777M33276K28364
$$ 9967435 9868747 10066874 10551452 10544124 10713287 11027669 11152114 11137337 11570613 11798977
14379A1798977J60708J05098J74096K8747K92610j2976N47314J91765m2312L42272
$$ 11798977 11959685 12064783 12238879 12267626 12560236 12547260 13094574 13286339 13244027 13586299
14369A3586299J98296L90333L33035M3026M93372L10543L83090r407N75896N2838
$$ 13586299 13784595 14174928 14507963 14550989 15044361 15354904 15737994 15728587 16304483 16357321
14359A6357321K11262M11072K87249N76041L56142L22348M74060K31422P56370
$$ 16357321 16568583 16979655 17266904 17842945 18199087 18521435 18995495 19226917 19983287
14350A9983287R7200J86216P46516L02169P86728L13962J05105Q33222J63922
$$ 19983287 20080487 20266703 21013219 21315388 22102116 22416078 22521183 23354405 23518327
14341B3518327R63258M64197P24007O12807N29323N60329O93886L69579J209871
$$ 23518327 24481585 24945782 25669789 26282596 26811919 27372248 28066134 28435713 29645584
14332B9645584M40415J022879P44462Q13227P18429J059091Q62651J147235R78630
$$ 29645584 30085999 31108878 31853340 32666567 33384996 34444087 35306738 36453973 37432603
14323C7432603R06618J163677J201384J068314J625673R88118J290582J549043
$$ 37432603 38339221 39502898 40704282 41772596 43398269 44386387 45676969 47226012
14315D7226012J468336J718726J406650J656345J728618K323081J683644J727251
$$ 47226012 48694348 50413074 51819724 53476069 55204687 57527768 59211412 60938663
14307F0938663K607007K208206K258897K527737K900989K580975K964575L204094
$$ 60938663 63545670 65753876 68012773 70540510 73441499 76022474 78987049 82191143
14299H2191143L081756L523183L482074L690054M096554M282101M536612M687284
$$ 82191143 85272899 88796082 92278156 95968210 100064764 104346865 108883477 113570761
14291A13570761M902102N161400N682032O179285N924120O927298P238967P624247
$$ 113570761 118472863 123634263 129316295 135495580 141419700 148346998 155585965 163210212
14283A63210212Q092881Q510604R102345R521542R958217J0713460J1481028J2070368
$$ 163210212 171303093 179813697 188916042 198437584 208395801 219109261 230590289 242660657
14275B42660657J2770015J3062748J4053264J4476477J5097350J5640030J6021208
$$ 242660657 255430672 268493420 282546684 297023161 312120511 327760541 343781749
14268C43781749J5011839J4100078J3219227J2100260J1518920J0882178R854380
$$ 343781749 358793588 372893666 386112893 398213153 409732073 420614251 430468631
14261D30468631Q290557P956808P253551O662812M158237J383016L51823k151474
$$ 430468631 438759188 446715996 453969547 460632359 464790596 466173612 466525435 464373961
14253D64373961r232710p210608o584098r546618j0758464j2032283j3710699
$$ 464373961 455141251 447930643 441346545 431799927 421041463 409009180 395298481
14246C95298481j3724693j4496604j4209797j3783109j3813521j4272782j3817470
$$ 395298481 381573788 367077184 352867387 339084278 325270757 310997975 297180505
14239B97180505j3288162j3467764j2588057j2206458j1808169j1307382j0323915
$$ 297180505 283892343 270424579 257836522 245630064 233821895 222514513 212190598
14232B12190598j0238487r695682q930204q751899q840233q438207p929767p182330
$$ 212190598 201952111 192256429 183326225 174574326 165734093 157295886 149366119 142183789
14224A42183789o926969o070916o018761n647558n035492n137579m286271m176759
$$ 142183789 135256820 129185904 123167143 117519585 112484093 107346514 103060243 98883484
14216I8883484m004655m081661l711642l305313l034826l594857k532673k936102
$$ 98883484 94878829 90797168 87085526 83780213 80745387 77150530 74617857 71681755
14208G1681755k307986k456210k418966k207664k049282j948536k226499j861858
$$ 71681755 69373769 66917559 64498593 62290929 60241647 58293111 56066612 54204754
14200E4204754j615228j349687j329421j609648j810428j291550j482500j211932
$$ 54204754 52589526 51239839 49910418 48300770 46490342 45198792 43716292 42504360
14192D2504360q34190j075121j255123r11538j108033j048590j023739o88930
$$ 42504360 41670170 40595049 39339926 38428388 37320355 36271765 35248026 34559096
14184C4559096q21484j062907j110860o33862p94268l85792j121803q33018l55578
$$ 34559096 33737612 32674705 31563845 30929983 30135715 29749923 28628120 27795102 27439524
14175B7439524q19614o63377l77007p31894p73944l76531m10552o92923m32622
$$ 27439524 26619910 25956533 25579526 24847632 24073688 23697157 23286605 22593682 22161060
14166B2161060m11544n78997k94956n58999j00598j027742K79436q45463m91039
$$ 22161060 21749516 21170519 20875563 20316564 20215966 19188224 19467660 18622197 18131158
14157A8131158k17455m18870m04510k06516n50482J22893m56133k79086j241p71649
$$ 18131158 17913703 17494833 17090323 16883807 16333325 16456218 16000085 15720999 15719758 14948109
14147A4948109m6214k90991l55863K66305r49360n6490k49653n0065l46469j40756
$$ 14948109 14901895 14610904 14255041 14521346 13571986 13515496 13265843 13215778 12869309 12728553
14137A2728553j08864l00758l83253o3841m24026K20955N6327n98940M06653m72085
$$ 12728553 12619689 12318931 11935678 11871837 11447811 11668766 11725093 11126153 11532806 11060721
14127A1060721l78254m17211J55789l16867j13758J28989o44162J78744j27014
$$ 11060721 10682467 10265256 10421045 10104178 9990420 10119409 9475247 9653991 9526977
14118I526977k77736o1794o0366k69812O8564k61164j61510M8881j61310j4630
$$ 9526977 9249241 9187447 9127081 8857269 8925833 8664669 8503159 8552040 8390730 8376100
14108H376100l22415k19427j237j25418L05020p48571J65557k62147K43397o1419
$$ 8376100 8053685 7834258 7833021 7707603 8012623 7264052 7429609 7167462 7410859 7349440
14098G349440M8437n38030J48859m4967j09772k22378L92977n48597j76024J26582
$$ 7349440 7397877 6859847 7008706 6963739 6853967 6631589 7024566 6475969 6299945 6426527
14088F426527l2289k22111J61260k05491k33865J30701J41027o92113O298J01124
$$ 6426527 6394238 6172127 6333387 6127896 5894031 6024732 6165759 5473646 5479944 5581068
14078E581068n8j96302J0323M85288q07107K76874j58428k61095q6146J90112
$$ 5581068 5581010 5384708 5395031 5880319 5073212 5350086 5191658 4930563 4844417 5034529
14068E034529j83741J90948j82772j44734j05150L74200l87096J6315J95815r0917
$$ 5034529 4850788 5041736 4858964 4714230 4609080 4983280 4596184 4612499 4808314 4717397
14058D717397K8606k73283k04003Q6668r9500L5397j68021L23766q55389N69489
$$ 4717397 4746003 4472720 4268717 4355385 4255885 4291282 4123261 4447027 3591638 4161127
14048D161127k41615p8098M07756l35409J56938n1315j56218l5944q574l41074
$$ 4161127 3919512 3841414 4249170 3913761 4070699 4019384 3863166 3827222 3818648 3477574
14038C477574J65142K06246l23827L36740n29596O83098l36428l37580j3330J86142
$$ 3477574 3642716 3848962 3525135 3861875 3332279 4015377 3678949 3341369 3328039 3514181
14028C514181l14484L3684L46715l58542k76515M54344l88240M06401m64839K57963
$$ 3514181 3199697 3233381 3580096 3221554 2945039 3399383 3011143 3417544 2952705 3210668
14018C210668P0870k22315R806M4751N2119J6624l50999J6686j68544K29160k21611
$$ 3210668 3281538 3059223 3069029 3113780 3165899 3182523 2831524 2848210 2679666 2908826 2687215
14007B687215K48830p2029j80349J32203j64458J52593l01158J97864J1703r6598
$$ 2687215 2936045 2864016 2683667 2815870 2651412 2804005 2502847 2700711 2712414 2615816
13997B615816l42070M6433K82836l9136k08263j16043J94068r6647j43523J53780
$$ 2615816 2273746 2320179 2603015 2563879 2355616 2239573 2433641 2336994 2193471 2347251
13987B347251K1628j93546J36512j51218l4645K28029J57172K37558p9344M14288
$$ 2347251 2368879 2175333 2311845 2160627 2125982 2354011 2511183 2748741 2669397 3083685
13977C083685L11130O45572K52155J207542K465269M875610R064072J0097765
$$ 3083685 3394815 4040387 4292542 5500084 7965353 12840963 21905035 32002800
13969C2002800r062052o963301n109558k527136j813494j154331n67587n28432
$$ 32002800 22940748 15977447 10867889 8340753 6527259 5372928 4805341 4276909
13961D276909p39767J18173l61043P0893k26395l94725p4799r7215p8396J17794
$$ 4276909 3537142 3655315 3294272 3365165 3138770 2744045 2669246 2572031 2493635 2611429
13951B611429J78213j60911l3527m47695k0987J15639p8862J46083k45692K79036
$$ 2611429 2789642 2628731 2595204 2147509 2126522 2242161 2163299 2309382 2063690 2342726
13941B342726l86433J01475j25j14691K15044k46494K08751j96403k36930J81622
$$ 2342726 1956293 2057768 2057643 1942952 2157996 1911502 2120253 1923850 1686920 1868542
13931A868542j87330J62265J65522j20135k02766N5997L5609n8227M9413l59766
$$ 1868542 1681212 1843477 2008999 1888864 1686098 1742095 1777704 1719477 1768890 1409124
13921A409124L85281r0763m4074r479J36457K6275r6254k95010N54307l15575
$$ 1409124 1794405 1703642 1659568 1650089 1786546 1812821 1716567 1421557 1975864 1660289
13911A660289j98792K85028k12782O8237j1839J74577Q9035k01929l25332J73280
$$ 1660289 1461497 1746525 1533743 1601980 1590141 1764718 1853753 1651824 1326492 1499772
13901A499772k00334K42011O259L4721K3023k85015j50771j02119M32777j64956
$$ 1499772 1299438 1541449 1547708 1582429 1605452 1320437 1169666 1067547 1500324 1335368
13891A335368O2590K22499j80752o6603P7185n32633N56025n59454N47386l09907
$$ 1335368 1397958 1620457 1439705 1373102 1450287 917654 1473679 914225 1461611 1151704
13881A151704r4639K87863K72474l70279K424j86555J23494K21152l118k35494
$$ 1151704 1057065 1344928 1617402 1247123 1249547 1062992 1186486 1407638 1404520 1169026
13871A169026J79745k7685J46053k18388K40130k10809j31318J36789q6184N1612
$$ 1169026 1348771 1321086 1467139 1248751 1488881 1278072 1146754 1283543 1197359 1248971
13861A248971l53360M54224j90610K05883k91486L01686o3962P1412m5960k52214
$$ 1248971 895611 1349835 1159225 1365108 1073622 1375308 1311346 1382758 1336798 1084584
13851A084584P2311j97007Q313r6815L79621j95048l12179N75599m05566K16798
$$ 1084584 1156895 959888 968201 871386 1251007 1055959 743780 1319379 913813 1130611
13841A130611j84723j14567l0650K53727J04408J90914n74554R681L13940j58438
$$ 1130611 945888 831321 800671 1054398 1158806 1349720 775166 784847 1098787 940349
13831I40349J00879J06732j75632j7276P4380j06767P2674P4753o1578m42122
$$ 940349 1041228 1147960 972328 955052 1029432 922665 995339 1070092 1008514 566392
13821E66392Q05414l35384j50889q0063j98829Q7205L19619n9580O5307j49887
$$ 566392 1371806 1036422 885533 805470 606641 693846 1013465 953885 1019192 869305
13811H69305o0037k25386N0822L09103n7604J01652p4885J70285l421k41701Q7124
$$ 869305 809268 583882 634704 943807 886203 987855 912970 1083255 1079834 838133 925257
13800I25257Q8391j23507n401N0393j67465K5600j7935J80837l59662L30985k79509
$$ 925257 1013648 890141 884740 935133 767668 793268 775333 956170 596508 927493 647984
13789F47984J60957j56127L26403l16087Q9015P4904k54146L23273l15816J28251
$$ 647984 808941 652814 979217 663130 752145 827049 572903 896176 580360 708611
13779G08611k0048J71061l49295K62413J36752k3081k70263K97292r8537q6319
$$ 708611 688563 859624 510329 772742 909494 886413 616150 913442 814905 728586
13769G28586K32444j48774L75807k51038N3671l67534K74566m4439k48752J11258
$$ 728586 961030 812256 1188063 937025 990696 623162 897728 853289 604537 715795
13759G15795r9354J89765j59198Q6086j61546p3102M03252k81693L11074k83365
$$ 715795 616441 806206 647008 733094 571548 498446 901698 620005 931079 647714
13749F47714k8654P2344J05723l58984J9534K95778q4894j06361J86502K0982
$$ 647714 619060 691404 797127 438143 457677 753455 668561 562200 748702 769684
13739G69684k43183M64424Q6662D13803m2566M49872j03383P0132k04605J25332
$$ 769684 526501 990925 1077587 413803 371237 821109 717726 787858 583253 708585
13729G08585l50547L46735B31088K70753M5602N7041k6339J58803j49989J61008
$$ 708585 358038 704773 231088 501841 547443 604484 578145 736948 586959 747967
13719G47967j09263J19724l8100K00871j98310j34484l6288J52443B55526P0886
$$ 747967 638704 758428 720328 921199 722889 588405 552117 704560 255526 326412
13709C26412K57314J8266j96019N9810L9095L28720j52703k55049J24761J10855
$$ 326412 583726 601992 405973 465783 504878 833598 680895 425846 550607 661462
13699F61462j04970k59985K56643j98444j36292L95769j34515j37968J41852A14711
$$ 661462 556492 296507 553150 354706 218414 614183 479668 341700 483552 114711
13688C35564J49515K76505k47628q2763J03555A98857L55552k57213L41280k08312
$$ 335564 485079 761584 513956 431193 534748 198857 554409 297196 638476 430164
13678D30164K22093B37604R5125K53770j41575n3902J32373J41798j46569j92259
$$ 430164 652257 237604 332729 586499 444924 391022 523395 665193 518624 326365
13668C26365K48743R8764p8118j80357J92126k71398Q4775M705J91774R5812C39295
$$ 326365 575108 673872 595754 415397 607523 336125 420900 425605 617379 713191 339295
13656C87999J45744j05351Q6322N2451j15599P6333J38036o961k36451j50127
$$ 387999 533743 428392 514714 567165 451566 527899 665935 658974 422523 272396
13646B72396K59838P534M8031j68328m161L76726I5743K03891J59913L30206A99631
$$ 272396 532234 539768 587799 419471 415310 792036 95743 299634 459547 789753 199631
13634D96053M7637j50946P9381L00790l31943J71722N4116k31860J60257j49328
$$ 496053 543690 392744 472125 772915 440972 612694 666810 434950 595207 445879
13624D45879K4385k6788J1983M2273J9444m1982A69298J55280o66M9079P5051
$$ 445879 470264 443476 455459 497732 517176 475194 169298 324578 323912 372991 448042
13613D48042A23814K45096J03967A66770M43680k01173K76916A71457q321J35662
$$ 448042 123814 368910 472877 166770 610450 409277 686193 171457 163136 298798
13603B98798o883L43469q6279B53139J76044J94112J61761B68546K46655m3954
$$ 298798 291915 635384 549105 253139 429183 623295 785056 268546 515201 471247
13593D71247B32091L12719B44322K75508m8475j16357L0429l6895J7031K39163
$$ 471247 232091 544810 244322 519830 471355 354998 385427 348532 365563 604726
13583F04726j44083k0162J45854k67499j20273O4952l1777L08585i7086C41195
$$ 604726 460643 440481 586335 318836 198563 263515 231738 540323 -97086 341195
13572C81213N2643j75726q4051M71643A08356L7026Q9041K49715r8398j16340
$$ 381213 433856 258130 174079 645722 108356 145382 234423 484138 385740 269400
13562B69400a75663B78960R0965j42965K02015L42266a64097D88728J56060A59839
$$ 269400 -175663 278960 369925 226960 428975 771241 -164097 488728 644788 159839
13551B3070L98813J18028k55055K70624B59204p8275J38110M4005K63088o1843
$$ 23070 421883 539911 284856 555480 259204 180929 319039 363044 626132 564289
13541E64289B11144o3145J00594l8581J67762N6499q2396j67938L3108J90840
$$ 564289 211144 147999 248593 210012 377774 434273 351877 183939 217047 407887
13531D07887e1128A62915M74738K65109k37026B13048L21899j7373j77966n4102
$$ 407887 -51128 162915 637653 902762 665736 213048 534947 517574 339608 285506
13521B85506J13790A86678J75655A59719J30005A39067E4012L3421L41215A92206
$$ 285506 399296 186678 362333 159719 289724 139067 54012 87433 428648 192206
13510E62819k50059J87718k40295F9011P3029N4657c0254C61917A79475R4771
$$ 562819 312760 500478 260183 69011 142040 196697 -30254 361917 179475 274246
13500B74246j10374K13055R5224B14447K75947o3541r4731C0655L31625j12168
$$ 274246 163872 376927 472151 214447 490394 426853 332122 30655 362280 250112
13490B50112r7483L6003J12889d0322B04625c67869C46910j43247K23863A3764
$$ 250112 152629 188632 301521 -40322 204625 -367869 346910 203663 427526 13764
13479C81258A87608n3784J64865A11442Q8965D8258K26223E3936J01095A2696
$$ 381258 187608 133824 298689 111442 200407 48258 274481 53936 155031 12696
13468a6346D03227A75887K12269K0220e0537B44386J77039j38314A14307L21469
$$ -16346 403227 175887 388156 408376 -50537 244386 421425 283111 114307 435776
13458D35776p1564a9925E25744B12402O4402o7409K24760l5831j35180l2211K13098
$$ 435776 364212 -19925 525744 212402 276804 209395 434155 398324 263144 230933 444031
13447D44031m1696D0206R1704L8960J89077a6394C32933J29962B08844L9599n1229
$$ 444031 402335 40206 131910 170870 359947 -16394 332933 462895 208844 248443 197214
13436A97214M74968k11930A53957K0517J19224A06617K59846J88398A41710O1766
$$ 197214 672182 460252 153957 174474 293698 106617 366463 554861 141710 203476
13426B03476R4859j02612K21733b0569A48809d650A9294O196L32266A11466C5253
$$ 203476 298335 195723 417456 -20569 148809 -4650 19294 25490 357756 111466 35253
13414A55400f6770B10997j02795K82659K798j22262M5481n4579n4406C3524K15047
$$ 155400 -66770 210997 108202 390861 393659 271397 316878 262299 207893 33524 248571
13403B48571E8670Q7440j0539J60381I3501Q9935p2319l8442K13147N268L0699
$$ 248571 58670 146110 135571 295952 93501 183436 111117 72675 285822 291090 321789
13392C21789J4857m9359A03205J87908j16957J43167L5014A19903R3802F105K59302
$$ 321789 336646 287287 103205 291113 174156 317323 352337 119903 213705 6105 265407
13381B65407j31073K73161j23722A08375J57657K83805B14047L115G3745a2014
$$ 265407 134334 407495 283773 108375 266032 549837 214047 217162 73745 -12014
13370B74805H064c831A33201m4353K3202Q9278M7100l6970J91261A23176N8660
$$ 274805 8064 -3831 133201 88848 112050 201328 248428 211458 402719 123176 181836
13359A81836J75813j56717q4636E04K12831J47828j42065K4057K60785A70524
$$ 181836 357649 200932 116296 504 213335 361163 219098 243155 503940 170524
13348D20037a7655C0866K83319j56310K92404A54012J27420C0909M45439j78677
$$ 420037 -17655 30866 314185 157875 450279 154012 281432 30909 476348 297671
13338B97671f6070A07583a44839j02631C72170J4804L7754n4606p6131f3542C89613
$$ 297671 -66070 107583 -144839 -247470 372170 386974 424728 370122 293991 -63542 389613
13326F4433Q0066a35408B03203k3570J15048l0230I0029J78809q990b7241B72306
$$ 64433 144499 -135408 203203 179633 294681 264451 90029 268838 259848 -27241 272306
13314D89151B7608M03780j88231j552J36306K54637A9474L11917C6839b8878A07186
$$ 489151 27608 431388 243157 241605 377911 632548 19474 331391 36839 -28878 107186
13302h2206C50754j22654C1242Q1355n5028N1949K98603j84266J08974j52143
$$ -82206 350754 228100 31242 112597 57569 109518 408121 223855 332829 180686
13292A80686N4559L8055F5345J73536j09962j434J50376R9666A1927K86593k3365
$$ 180686 235245 273300 65345 238881 128919 127485 277861 377527 11927 298520 275155
13281B75155b37672B24703a50635e3050B21839F9143K11486A11620L94189l6360
$$ 275155 -237672 224703 -150635 -53050 221839 69143 280629 111620 505809 469449
13271D69449A44595o1020L281J71116K5477G2615g5915B61243e014A25688e1217
$$ 469449 144595 83575 86856 257972 283449 72615 -75915 261243 -5014 125688 -51217
13259a13082A31070J27119b91523B65606j30026i4314A15245J25703n5306f9357
$$ -113082 131070 258189 -291523 265606 135580 -94314 115245 240948 185642 -69357
13248C8585d5833A03051j9127g0329A26088m52a94470C32619G1643a00945C45919
$$ 38585 -45833 103051 83924 -70329 126088 125636 -194470 332619 71643 -100945 345919
13236A15290n4707e8093C44068C4307K12143g406A32486k3238N3273O5351D9770
$$ 115290 60583 -58093 344068 34307 246450 -7406 132486 109248 162521 227872 49770
13224A46404k2163a31481D21755k07741K8047j17856K1813J55851d9180E08346
$$ 146404 124241 -131481 421755 214014 242061 124205 146018 301869 -49180 508346
13213A93405o52p4086j1985K99147k2864R9078i6885A56717m1916J16345J19323
$$ 193405 192753 118667 106682 405829 382965 482043 -96885 156717 114801 231146 350469
13202C50469G1852b9722B13117f1920j47325F0200b8857A46746Q621J26985A04893
$$ 350469 71852 -29722 213117 -61920 -209245 60200 -28857 146746 155367 282352 104893
13190B0032p301K05375Q9432k5600m7447F9473K83516j63720M24311A06749d9907
$$ 20032 12731 218106 307538 281938 234491 69473 352989 189269 613580 106749 -49907
13178B65860H545L51266a89630C53252j02418a49137c876B43796c64949B04795
$$ 265860 8545 359811 -189630 353252 250834 -149137 -3876 243796 -364949 204795
13167E8955f423A72030L5805a85252D3985N6425m2194L64363A04599O163D7665
$$ 58955 -6423 172030 207835 -185252 43985 100410 58216 422579 104599 110762 47665
13155A6276J28859p1450a24402C44724A20428J07538A1438a84056A08794J92750
$$ 16276 145135 73685 -124402 344724 120428 227966 11438 -184056 108794 301544
13145C01544E9058Q8206D7207K34048r0721D3179e5773p1681J3919B91380A26897
$$ 301544 59058 147264 47207 281255 190534 43179 -55773 -127454 -113535 291380 126897
13133A21735Q2063O0969B8862M18292B9748J79615Q4736b6910C13473j31971l3732
$$ 121735 203798 264767 28862 447154 29748 209363 294099 -26910 313473 181502 147770
13122A47770a1463B11981H2201J14782o7139a20638e0242C51674G1773J92537
$$ 147770 -11463 211981 82201 196983 129844 -120638 -50242 351674 71773 264310
13112B64310a16600A45708c6808k9565A10586K24457A65326L0869g3027D1005
$$ 264310 -116600 145708 -36808 -66373 110586 335043 165326 196195 -73027 41005
13101G1896d55435A24595r761Q8928m2512b56819B70343a05670o0277L0905K7112
$$ 71896 -455435 124595 114834 203762 161250 -256819 270343 -105670 -165947 -135042 -107930
13090a07930C8855c1087O237A58907a13798l3343A87746a87873d7052B27815F3430
$$ -107930 38855 -31087 -24850 158907 -113798 -147141 187746 -187873 -47052 227815 63430
13078a80498Q1603H7958d040C61498d5013B96918a95172m3385A0948a68761C23329
$$ -180498 -98895 87958 -4040 361498 -45013 296918 -195172 -238557 10948 -168761 323329
13066I3991K23936d3181A32792a29301I5938J72135p4181E3546J02885b07640
$$ 93991 317927 -43181 132792 -129301 95938 268073 193892 53546 156431 -207640
13055A13725R1086E0880J37605o3002k736h6284C60983j01436F5246M5989J7656
$$ 113725 204811 50880 188485 125483 122747 -86284 360983 259547 65246 111235 128891
13044A28891o566J00125c3817B9360J17857d7838A89696p5756D2941J41269d8730
$$ 128891 122325 222450 -33817 29360 147217 -47838 189696 113940 42941 184210 -48730
13032A0385K02763J60811i4674F6718a55262d5266r8462B82042a9244A54684a88992
$$ 10385 213148 373959 -94674 66718 -155262 -45266 -143728 282042 -19244 154684 -188992
13020A18429J48655j33330L7415M6339o4140A4884K22033O9449j16961d6351H4886
$$ 118429 267084 133754 171169 217508 153368 14884 236917 306366 189405 -46351 84886
13008a45718C00771b24816A60220a53207A67975c09808J49484D17714q7795d049
$$ -145718 300771 -224816 160220 -153207 167975 -309808 -160324 417714 329919 -4049
12997A13882B737J57542a2250I7555a93762A32192L8311p1155l2152b3538m7539
$$ 113882 2737 160279 -12250 97555 -193762 132192 170503 99348 67196 -23538 -71077
12986g1077K5314I9415P0073J44951B2577a00392G3236M98011C9422a46604B27869
$$ -71077 -45763 99415 169488 314439 22577 -100392 73236 571247 39422 -146604 227869
12974b4724A07801a92564b4121C55953r5107B3879K79277A4642K09716c58997
$$ -24724 107801 -192564 -24121 355953 260846 23879 303156 14642 224358 -358997
12963b84512C2243h3517A08563a29301C9928M51329B01731a46104n5450A21274
$$ -284512 32243 -83517 108563 -129301 39928 491257 201731 -146104 -201554 121274
12952A98934J0320k6906l7516b67181b3A89042K14342b30160a06390j79500d6078
$$ 198934 209254 182348 144832 -267181 -23 189042 403384 -230160 -106390 -285890 -46078
12940D90222a72797G1657J476K09025p8634N0550E0396a51322C84640B5634J22706
$$ 490222 -172797 71657 73133 282158 203524 254074 50396 -151322 384640 25634 148340
12929A48340a80257o1267D05921A09277N065J64931A20494J99341e9898f424F040
$$ 148340 -180257 -241524 405921 109277 114342 279273 120494 319835 -59898 -6424 6040
12917f3601A71687O3465B5232a96518D5874b8948F8506J7333e9249j26249d6695
$$ -63601 171687 235152 25232 -196518 45874 -28948 68506 85839 -59249 -185498 -46695
12905C12695c28481J60605C63203b26268I3812J3409b5196o685j04713A33488
$$ 312695 -328481 -167876 363203 -226268 93812 107221 -25196 -31881 -136594 133488
12894e7077j40398B03684a19680m5142B9161p681J85741a61663j91723A74582
$$ -57077 -197475 203684 -119680 -164822 29161 21480 207221 -161663 -353386 174582
12883B02282a3115A14600O8402b06068C29645i4420k770a2779D2420J95862C1221
$$ 202282 -13115 114600 183002 -206068 329645 -94420 -97190 -12779 42420 238282 31221
12871A37640g0936A08976l4521b56480A19903a61688A78120J63927r0355f2022
$$ 137640 -70936 108976 74455 -256480 119903 -161688 178120 342047 251692 -62022
12860e188j8229E5946A6514g8183l5203H4638a49768K0178A34718i9137I1108
$$ -5188 -23417 55946 16514 -78183 -113386 84638 -149768 -129590 134718 -99137 91108
12848A18114n4024L7110d1700j76739D12924D8689M6306f4354A33386b32245B8806
$$ 118114 64090 101200 -41700 -218439 412924 48689 94995 -64354 133386 -232245 28806
12836B6653b3102A21929M8791J89020A27105D5315b0693A5289K05311L40104H3210
$$ 26653 -23102 121929 170720 359740 127105 45315 -20693 15289 220600 560704 83210
12824H3543e6080I0808k1298d4022P748H7985a94637a7778A25436h683j38928
$$ 83543 -56080 90808 69510 -44022 -36274 87985 -194637 -17778 125436 -8683 -147611
12813a47611j27815B04695a24202L3573C14955I0886B3030P5721L0813o0954b1038
$$ -147611 -275426 204695 -124202 -90629 314955 90886 23030 98751 129564 68610 -21038
12801G1755A8390M94784A23270a04318B33064F9121g2811o5036A94656c86158
$$ 71755 18390 513174 123270 -104318 233064 69121 -72811 -137847 194656 -386158
12790a05090A97379C9168h0584A18267K02359d00570B46986a63482C4825c7456
$$ -105090 197379 39168 -80584 118267 320626 -400570 246986 -163482 34825 -37456
12779B11867e1132q8574k2418G8056J69136o3946m9036a77124j38832I8285Q4192
$$ 211867 -51132 -139706 -162124 78056 247192 183246 134210 -177124 -315956 98285 182477
12768A82477m8869K33062A8245K72220q0703D1074L19375D1654a65578d1238o610
$$ 182477 133608 366670 18245 290465 209762 41074 360449 41654 -165578 -41238 -47848
12757d7848A11664c44036A74894B8199L5253j9965J83936M2843d4916C22005H5159
$$ -47848 111664 -344036 174894 28199 63452 43487 227423 270266 -44916 322005 85159
12745d5660r6938k92709H9695J26391F7367a78084H0542g1140O268r616C07628
$$ -45660 -142598 -435307 89695 216086 67367 -178084 80542 -71140 -64872 -74488 307628
12733C26905A22819a20176r926A46939b70987A48628a06247k6222I4111O8492
$$ 326905 122819 -120176 -130102 146939 -270987 148628 -106247 -132469 94111 162603
12723A62603P8072b18242B8J6313J41272k8671q374g8156C70466A71883m0561
$$ 162603 240675 -218242 28 16341 157613 128942 120568 -78156 370466 171883 131322
12712A31322h3400D35521q4852A42591a46866c7442A4102P5457A7995J18395a67505
$$ 131322 -83400 435521 350669 142591 -146866 -37442 14102 89559 17995 136390 -167505
12700a57617B20768g8406k1258A01570q112K07078b8317O79R09I1713K58008J73922
$$ -157617 220768 -78406 -99664 101570 93458 300536 -28317 -27638 -26729 91713 349721 523643
12688E23643A54105P2865k4194H8130E585L46994G9301b4388A8310g4921j23328
$$ 523643 154105 226970 202776 88130 5585 352579 79301 -24388 18310 -74921 -198249
12677a98249a1564k59949A0444a46719B16470a05022l5645j25244m6418i5118
$$ -198249 -11564 -271513 10444 -146719 216470 -105022 -140667 -265911 -312329 -95118
12666B46006a84389D8628b7701k530F35685A83837R8261L5143J08635E5903B7272
$$ 246006 -184389 48628 -27701 -30231 635685 183837 282098 317241 425876 55903 27272
12654A14026M42539c9755A31047o666a47447F3146R2408M1213p415l5225K9093
$$ 114026 556565 -39755 131047 124381 -147447 63146 155554 196767 189352 154127 183220
12643A83220i2859E49413k38543A22168M0544G4757J9519Q8303J0072c55203A26837
$$ 183220 -92859 549413 310870 122168 162712 74757 94276 182579 192651 -355203 126837
12631A97688c5529C3817h685C11459a61798L169c6152k1124A19668a81410F8130
$$ 197688 -35529 33817 -8685 311459 -161798 -158629 -36152 -57276 119668 -181410 68130
12619A30083a10415C36787j33599D7753K45236J43362j16687N4940A38526C6402
$$ 130083 -110415 336787 203188 47753 292989 436351 319664 374604 138526 36402
12608A00891D4066J6640J75761r4280O0643C017b3427H732J36614b9836F6593
$$ 100891 44066 60706 236467 142187 202830 3017 -23427 8732 145346 -29836 66593
12596e5143A82306a44036j2741k01940c277k49620I4492B6210a27041F1587k4647
$$ -55143 182306 -144036 -156777 -358717 -3277 -252897 94492 26210 -127041 61587 36940
12585C6940o357R7392J72785a01734A45889K70073H7024L72457C9240J20378J45970
$$ 36940 30583 127975 300760 -101734 145889 415962 87024 459481 39240 159618 305588
12574C05588e7543A52684l0119k0489J30162b34959A1441c2402a0094p5485B11871
$$ 305588 -57543 152684 122565 102076 232238 -234959 11441 -32402 -10094 -85579 211871
12562A68982i591A42761A8450f3883q5090q4005A36622K17954a66477B54513a54444
$$ 168982 -9591 142761 18450 -63883 -148973 -232978 136622 354576 -166477 254513 -154444
12550f0639j6078A55265a30861A27984a91906c1261o1081q6824F5823M4847K6453
$$ -60639 -76717 155265 -130861 127984 -191906 -31261 -92342 -179166 65823 110670 137123
12539A37123N5474K16782a30617g085H792g3389a4487j46654j76430H6666N550
$$ 137123 192597 409379 -130617 -7085 8792 -73389 -14487 -161141 -337571 86666 92216
12528I2216P8703g0754E3257J95285a2823m1901J0467l9611K612B08143a4678
$$ 92216 170919 -70754 53257 248542 -12823 -54724 -44257 -83868 -81256 208143 -14678
12516C8663a70092H2268J5895e9930A05243k9325L04979A64089k9419j0866J19730
$$ 38663 -170092 82268 98163 -59930 105243 75918 380897 164089 134670 123804 243534
12505B43534H134a19004A97687c2452q793B24533a17553B6702a34521j4550C53582
$$ 243534 8134 -119004 197687 -32452 -41245 224533 -117553 26702 -134521 -149071 353582
12493a76693O4612p3273r8940a9282B87074F3638d3293A24770n4242O7607F1722
$$ -176693 -112081 -185354 -284294 -19282 287074 63638 -43293 124770 70528 138135 61722
12481h63j6220k45324G0551F009c6337o31q8410A17327m9604c8313k0995b5533
$$ -863 -17083 -262407 70551 6009 -36337 -36968 -125378 117327 67723 -38313 -59308 -25533
12468a95049L8112I5889b0381B81392B5267N4344a49557C00783a75213B06814
$$ -195049 -156937 95889 -20381 281392 25267 79611 -149557 300783 -175213 206814
12457B73089C8064j0368K44470n8468H0740a48791j27087J8548Q7208B4928R9258
$$ 273089 38064 27696 272166 213698 80740 -148791 -275878 -257330 -170122 24928 124186
12446A24186a10776r317C682J81643f5038H4516L4457N4754a56101I9377R8253
$$ 124186 -110776 -120093 3682 185325 -65038 84516 118973 173727 -156101 99377 197630
12435A97630a50285J1015G1818c7366A09940b40002H5474J40680l8320c0347j56701
$$ 197630 -150285 -139270 71818 -37366 109940 -240002 85474 226154 187834 -30347 -187048
12424a87048j8382l8148A04266j2839k5972J66968a34247p1813R8755B20764E2778
$$ -187048 -205430 -243578 104266 91427 65455 232423 -134247 -206060 -107305 220764 52778
12412A75218g1243e204B1644M08256A22486a01207F5449a05198a0175E3750d037
$$ 175218 -71243 -5204 21644 429900 122486 -101207 65449 -105198 -10175 53750 -4037
12400C29486a25740A29163b00637f8294J1100B33511a36004N5883C7671a39167
$$ 329486 -125740 129163 -200637 -68294 -57194 233511 -136004 -80121 37671 -139167
12389a02934B17757N077b32157i7353D04336a57753E192e0973K598j14564B70920
$$ -102934 217757 222834 -232157 -97353 404336 -157753 5192 -50973 -48375 -162939 270920
12377a94603n0092a9673A83931n2039d6581B08970e0219D0811d3757A72393q0789
$$ -194603 -244695 -19673 183931 131892 -46581 208970 -50219 40811 -43757 172393 91604
12366I1604h0450j15264j60438A88961J676J30411a7597D51505B13983h7805j8567
$$ 91604 -80450 -195714 -356152 188961 190637 321048 -17597 451505 213983 -87805 -106372
12355a06372m1188o0035A16848a06652d4759j55664J1781d5617J7818k16964I6112
$$ -106372 -147560 -207595 116848 -106652 -44759 -200423 -188642 -45617 -27799 -244763 96112
12343C38294A65326H1820J53032e6310E82069A71721g4164E705b1953M408j78930
$$ 338294 165326 81820 234852 -56310 582069 171721 -74164 5705 -21953 -17545 -196475
12332a96475j7143g6656A62365K7082a66685H7451L5007k5649b93862A38685N4452
$$ -196475 -213618 -76656 162365 189447 -166685 87451 122458 96809 -293862 138685 193137
12321A93137d06q9795j96612A80903H6927c4247o4052A21746K8068p4562j0510
$$ 193137 -406 -90201 -286813 180903 86927 -34247 -98299 121746 149814 75252 64742
12310F4742n836a66298A35393d0869o1287r0876e4868G5715J87656G2742O7994
$$ 64742 58906 -166298 135393 -40869 -102156 -193032 -54868 75715 263371 72742 140736
12299A40736a14564D6448M1074a56740I3845f0460j06201F5869A1420h5100A23226
$$ 140736 -114564 46448 87522 -156740 93845 -60460 -166661 65869 11420 -85100 123226
12287E7449J90647H7299i7872C17088a00014A6896a2646p4018C99217b65864g0948
$$ 57449 248096 87299 -97872 317088 -100014 16896 -12646 -86664 399217 -265864 -70948
12275A86665a36823A03158f0804A02126a58849N0263H8223K2050a41197M5040
$$ 186665 -136823 103158 -60804 102126 -158849 -108586 88223 110273 -141197 -96157
12265i6157M6107I5644j0237M9372L30571B9772M17172A26585Q5252j0103C8410
$$ -96157 -50050 95644 85407 134779 465350 29772 446944 126585 211837 201734 38410
12253B37028j00636K878l508D1957J55619I7636h8029A57845Q6788b18897h6516
$$ 237028 136392 139270 135762 41957 197576 97636 -88029 157845 244633 -218897 -86516
12241b83425I3891K69951a06888J4398a8853d066j24865L1588B4367e0005J8015
$$ -283425 93891 363842 -106888 -92490 -18853 -4066 -128931 -97343 24367 -50005 -31990
12230c1990A23084J51670M5754G2283b19437O7956C88484C924J94244K33474A43963
$$ -31990 123084 274754 320508 72283 -219437 -151481 388484 3924 198168 431642 143963
12218i198A24380i535E3763f8029B06111J17185j07479B6182J21836I811J57521
$$ -9198 124380 -9535 53763 -68029 206111 323296 215817 26182 148018 9811 167332
12207A67332G8775M18847A80278J13997c6939E08910j34209A51010O8883L2687
$$ 167332 78775 497622 180278 294275 -36939 508910 374701 151010 219893 252580
12197B52580D7243J32848J8024G3150c55783g2491B89797j240K05880j31118A51635
$$ 252580 47243 180091 198115 73150 -355783 -72491 289797 288557 494437 363319 151635
12185d7340o0174F2949L01107K57937I4352J94522o4489G5644K75407j43794Q210
$$ -47340 -107514 62949 364056 621993 94352 288874 224385 75644 351051 207257 215467
12174B15467b8699a2993A07669j7442d04887A53384l5483L11710a9869B43288
$$ 215467 -28699 -12993 107669 90227 -404887 153384 117901 429611 -19869 243288
12163a30144k4665b9492B59625n1427o0991J03979P7910a4781D28477j89595i7345
$$ -130144 -154809 -29492 259625 208198 147207 251186 329096 -14781 428477 238882 -97345
12151F8130K23945B960e1331B74224F8081c7716B54394c2925A28737J5831a14759
$$ 68130 292075 2960 -51331 274224 68081 -37716 254394 -32925 128737 144568 -114759
12139b2324C34a15669q7066p6027a06205c2049n0188A13865J52804A21594j2915
$$ -22324 334 -115669 -202735 -278762 -106205 -32049 -82237 113865 266669 121594 108679
12128A08679J64890B0596N6096a4798A44102D9169J2566J18950a39849f8666K4049
$$ 108679 273569 20596 76692 -14798 144102 49169 61735 180685 -139849 -68666 -44617
12117d4617n3701j3804B68665b91766B425O8806J2192i2814C1574K15861E0480
$$ -44617 -98318 -112122 268665 -291766 2425 71231 83423 -92814 31574 247435 50480
12105C8318M4305B8365b39173A68940p7698M4893C4697c694A77493R6612c65399
$$ 38318 82623 28365 -239173 168940 91242 136135 34697 -3694 177493 274105 -365399
12093a31113n8863d0857F0808A2750K75159G4796b30557R4907j2146j60642C2289
$$ -131113 -189976 -40857 60808 12750 287909 74796 -230557 -135650 -147796 -308438 32289
12081a48564A50943a63836A4921a28807E7153a90768K4448n496c8257k16500C186
$$ -148564 150943 -163836 14921 -128807 57153 -190768 -166320 -171816 -38257 -254757 3186
12069A16112A0185c0135j02979l9776A5806a62914A94318D0456a85182A52959
$$ 116112 10185 -30135 -133114 -172890 15806 -162914 194318 40456 -185182 152959
12058I3004a53744G58Q4788J54975C1852M45778n2099J027104j14368F49995A7304
$$ 93004 -153744 758 85546 240521 31852 477630 425531 1452635 1338267 649995 17304
12046B15905C8677a3136k2153A67312B7284J65193p8274f8759n5339F8308g7899
$$ 215905 38677 -13136 -35289 167312 27284 192477 114203 -68759 -124098 68308 -77899
12034a61973G7430h8603H097b20119b8555B79738I6851a1935k28955R6582A07737
$$ -161973 77430 -88603 8097 -220119 -28555 279738 96851 -11935 -240890 -144308 107737
12022A8319c8006k05590R9029j48594a45711f2305j51602E9994B1934h0921B43038
$$ 18319 -38006 -243596 -144567 -293161 -145711 -62305 -213907 59994 21934 -80921 243038
12010D3377L91433A37259b63552h2659J3789e086j67655j86347B21959b75233
$$ 43377 434810 137259 -263552 -82659 -68870 -5086 -172741 -359088 221959 -275233
11999b23929N4117C20844I6915J23083a06471A19844J63385j30708L9722b15058
$$ -223929 -169812 320844 96915 219998 -106471 119844 283229 152521 192243 -215058
11988A87670K6678b96512J38578C32531d7493l5915b305H2708k4897e6412B95388
$$ 187670 214348 -296512 -157934 332531 -47493 -83408 -2305 82708 57811 -56412 295388
11976c9934B43467L9788c0951A43064p270L7946D8320i7661j13900A1654a96883
$$ -39934 243467 283255 -30951 143064 135794 173740 48320 -97661 -211561 11654 -196883
11964C9455K55823A03898B3165a06353J3442A76306d71523D9384J54434d6383
$$ 39455 295278 103898 23165 -106353 -92911 176306 -471523 49384 203818 -46383
11953D2844c9280l0296G8781J25787a16881n9527A22866A5783c31273A66298a55660
$$ 42844 -39280 -69576 78781 204568 -116881 -176408 122866 15783 -331273 166298 -155660
11941h0183A84957b61168Q3135Q4447k50994a1583D68053b95070J02326k27387
$$ -80183 184957 -261168 -178033 -93586 -344580 -11583 468053 -295070 -192744 -420131
11931d20131A90199G4282a9627L862A94449B5983f7963j59263C09550I5711b00767
$$ -420131 190199 74282 -19627 -15765 194449 25983 -67963 -227226 309550 95711 -200767
11919b07775A5592a13068B08448q7320J4132n0013b82112E1105d24595a1967D5920
$$ -207775 15592 -113068 208448 121128 135260 85247 -282112 51105 -424595 -11967 45920
11907B5497c4333n4236H4756a78036C6823i1448c5730k25955b7072B63967a07439
$$ 25497 -34333 -88569 84756 -178036 36823 -91448 -35730 -261685 -27072 263967 -107439
11895B1941e9180C42203a01448a0314l9723G5406J93308A08796b51804B72163
$$ 21941 -59180 342203 -101448 -10314 -50037 75406 268714 108796 -251804 272163
11884D98b35387A17149K11459g9551j66485A73027a65882K365A241J04129a13931
$$ 498 -235387 117149 328608 -79551 -246036 173027 -165882 -163517 1241 105370 -113931
11872a47362a2331m3940F9813N05633b9846j87900j1402A33362a19605j59508
$$ -147362 -12331 -56271 69813 575446 -29846 -217746 -229148 133362 -119605 -279113
11862b79113A10101J67257o3550c11805a43185F3496O271j8730G854c50379h0198
$$ -279113 110101 277358 213808 -311805 -143185 63496 69767 51037 7854 -350379 -80198
11850b76297b041B55454c66478a494j06347B7724a2401A6034K19905k084a5262
$$ -276297 -2041 255454 -366478 -1494 -107841 27724 -12401 16034 235939 233855 -15262
11838b22899P0426I3594a42686j38319k13033a40549j6415A98301g8116j01557
$$ -222899 -152473 93594 -142686 -281005 -494038 -140549 -156964 198301 -78116 -179673
11828a79673h443C12598E8767b60614A76784P8289b84277c2525B1112b43663D200
$$ -179673 -8443 312598 58767 -260614 176784 255073 -284277 -32525 21112 -243663 4200
11816A1488b1146r7012m5637A84861n8515b44263a8529j03380F7256a32272M7459
$$ 11488 -21146 -118158 -163795 184861 126346 -244263 -18529 -121909 67256 -132272 -84813
11805h4813j02739N8959j77781g9859J9749I9462a55874k64654E6258K48172a24731
$$ -84813 -187552 -128593 -306374 -79859 -60110 99462 -155874 -420528 56258 304430 -124731
11793A19319a51273B40505g5630q2022D861b01679B05422i833H6507a59764B3723
$$ 119319 -151273 240505 -75630 -157652 4861 -201679 205422 -9833 86507 -159764 23723
11781C39724f3317k7143A590a10343M6960o3202B50794l7540D6323e5229l88834
$$ 339724 -63317 -90460 1590 -110343 -63383 -126585 250794 213254 46323 -55229 -444063
11770d44063g34n809E5355J03839c3597A33190d1275f921D5538J06896k2442a85265
$$ -444063 -734 -6543 55355 159194 -33597 133190 -41275 -6921 45538 152434 129992 -185265
11757a38855l81691a76736D5660i3251E59951c12475A03021m463M4755d09181
$$ -138855 -520546 -176736 45660 -93251 559951 -312475 103021 98558 143313 -409181
11746b19198A0222b98473I1243J81968a57589l2421A96994o2601M9502G0342K0536
$$ -219198 10222 -298473 91243 273211 -157589 -190010 196994 134393 183895 70342 90878
11735I0878J10439b6914I0734L061b29432q879i9687A45178J51850b98121A3934
$$ 90878 201317 -26914 90734 93795 -229432 -238311 -99687 145178 297028 -298121 13934
11723h4367B67271a42112k78390A92284F286Q3873C1903c7105A19334J77386J27140
$$ -84367 267271 -142112 -420502 192284 6286 90159 31903 -37105 119334 296720 423860
11712D23860b33359e2961B83875b1915F3886J50334f9967H8445J89790H7458P9010
$$ 423860 -233359 -52961 283875 -21915 63886 214220 -69967 88445 278235 87458 166468
11701A66468k172A3849O1710L66334E0710Q8862M052l4097d37033A43504B1681
$$ 166468 164296 13849 75559 441893 50710 139572 143624 109527 -437033 143504 21681
11689A45178J13452b24699I8226C9574a40393c2138A62384i8495A35929l3043
$$ 145178 258630 -224699 98226 39574 -140393 -32138 162384 -98495 135929 102886
11679A02886m2729J73094n9203a95503R5811B3216K04948p3267K814a85536A7321
$$ 102886 60157 233251 174048 -195503 -99692 23216 228164 154897 157711 -185536 17321
11667c0142A87732a22735o1069a8131B47994A08803D2062K12475F8681r634h3713
$$ -30142 187732 -122735 -183804 -18131 247994 108803 42062 254537 68681 59047 -83713
11655i7092B59090p7844C9723a8418l4905K73m6909I3850c33405h5479G3800h1652
$$ -97092 259090 181246 39723 -18418 -53323 -53050 -99959 93850 -333405 -85479 73800 -81652
11642A61521h4764B27605J4781A00190A3146b82943A32853a53551j3894G6030
$$ 161521 -84764 227605 242386 100190 13146 -282943 132853 -153551 -167445 76030
11631b48488A64565K1275b03854b4320Q395A30692c53502R1930e1673a2698l1405
$$ -248488 164565 185840 -203854 -24320 -15925 130692 -353502 -261572 -51673 -12698 -44103
11620d4103a9590l27315J49652e7104b3586A88454D0403A3431K1847L8463R5311
$$ -44103 -19590 -346905 -197253 -57104 -23586 188454 40403 13431 35278 73741 169052
11609A69052i2380A15869A0672Q2388L147c5461d711E6364b5490A11273f1296
$$ 169052 -92380 115869 10672 93060 96207 -35461 -4711 56364 -25490 111273 -61296
11597b60177H2534i5717B29677m1666p2828e5780A29944N9786i7016k09133d2343
$$ -260177 82534 -95717 229677 188011 115183 -55780 129944 189730 -97016 -306149 -42343
11585B05281p4031L0508J69470ao7545D251L8764K00181j17601e4919B64023F595
$$ 205281 131250 161758 331228 -1 -67546 4251 43015 243196 125595 -54919 264023 6595
11572c8727H1931a14637J7694B88456a17413B70797K05917a81613B98083B6370
$$ -38727 81931 -114637 -96943 288456 -117413 270797 476714 -181613 298083 26370
11561B2873e2226C8134a29478l0921D49279g0120B10254G1601R0079a61989c5520
$$ 22873 -52226 38134 -129478 -160399 449279 -70120 210254 71601 161680 -161989 -35520
11549B90465H7765e1307B52014h4220R526b8914j41064A19747N2251h7698C42727
$$ 290465 87765 -51307 252014 -84220 -74694 -28914 -169978 119747 171998 -87698 342727
11537a99596d1681A75631a12252j25361b2177A26419E6697L5395L2753L3859b104
$$ -199596 -41681 175631 -112252 -237613 -22177 126419 56697 92092 124845 158704 -2104
11525E9059c57651Q5974h1863B15966f8853A6803a45174B45239F1135L85985A87052
$$ 59059 -357651 -271677 -81863 215966 -68853 16803 -145174 245239 61135 447120 187052
11513H6603L11829c85344B96382A09502l6463a00640H6393K18838J22929e9371
$$ 86603 398432 -385344 296382 109502 73039 -100640 86393 305231 428160 -59371
11502b28220A70727B067N1052j284a8374D32400A1243K81281H9815A1505N4769
$$ -228220 170727 2067 53119 51835 -18374 432400 11243 292524 89815 11505 66274
11491F6274J24241E6537J82366d7836A71834b19825c2570D36750A50000J83517
$$ 66274 190515 56537 238903 -47836 171834 -219825 -32570 436750 150000 333517
11481C33517a4713H0018P609M2626a32457A24005b3608E2512m387L60589A39873
$$ 333517 -14713 80018 87627 130253 -132457 124005 -23608 52512 48125 408714 139873
11469C05938b4610D78412J24137a91438P0809H7663K95896j08336l680j26187
$$ 305938 -24610 478412 602549 -191438 -120629 87663 383559 275223 271543 145356
11459A45356B8377M6795K30694D9235A3441L2400K09541h1262B7175J10798E4300
$$ 145356 28377 75172 305866 49235 13441 45841 255382 -81262 27175 137973 54300
11447D53443a6662m7763B74590A02013K21116b3414k9002D99541H0706b34678
$$ 453443 -16662 -64425 274590 102013 323129 -23414 -52416 499541 80706 -234678
11436a0000C9697J85662a4109A56165a29248B483K5923b26207A34993a47829p9860
$$ -10000 39697 225359 -14109 156165 -129248 2483 28406 -226207 134993 -147829 -227689
11425b27689b0476A42319c4021G469a59910E25072h0446k3384n3718A49970C0622
$$ -227689 -20476 142319 -34021 7469 -159910 525072 -80446 -103830 -157548 149970 30622
11413d34017e8900g94j8011I6002J38611C9192h1142A12345b59122B29183e8408
$$ -434017 -58900 -794 -18805 96002 234613 39192 -81142 112345 -259122 229183 -58408
11401b00049A04515a4127C5648m382J48908a18338j83229A4540a36705H2108a92460
$$ -200049 104515 -14127 35648 31266 180174 -118338 -301567 14540 -136705 82108 -192460
11389i373A24616a54919C09069A02438D503J01805N036J68685G8012k363e874
$$ -9373 124616 -154919 309069 102438 4503 106308 111344 280029 78012 75649 -5874
11377A01310a84407f0437C53201A16649K9091a1778k3922l2107E8287j7651P840
$$ 101310 -184407 -60437 353201 116649 145740 -11778 -35700 -67807 58287 40636 48476
11366D8476A7450J85262B4315R4983a59406k299A10725R9054M5014b7369j35323
$$ 48476 17450 202712 24315 119298 -159406 -161705 110725 209779 254793 -27369 -162692
11355a62692f0117G7186A1291b8536j21543a0372q3618q9148B21278k8169G2335
$$ -162692 -60117 77186 11291 -28536 -150079 -10372 -93990 -183138 221278 193109 72335
11343I0502J29534a04384B65847g5086A93617f989j47799N6201j71036C50898
$$ 90502 220036 -104384 265847 -75086 193617 -6989 -154788 -98587 -269623 350898
11332a66113B75191c9903r3975j5967M8308G2998k1423A3661a42117O1897K8653
$$ -166113 275191 -39903 -133878 -149845 -101537 72998 51575 13661 -142117 -80220 -51567
11321e1567r8992A48685a26788p6964B1486a6916B70053a28154B21174j07078
$$ -51567 -150559 148685 -126788 -203752 21486 -16916 270053 -128154 221174 114096
11311A14096N313b11722N980B64524I3823f433m26563Q8848O0263c4358D2176
$$ 114096 119409 -211722 -205742 264524 93823 -6433 -432996 -344148 -283885 -34358 42176
11299b04190f2257b5872G2016d1177k76095B5909K17528D7524f1771a8628B08745
$$ -204190 -62257 -25872 72016 -41177 -317272 25909 243437 47524 -61771 -18628 208745
11287A72289N9535B1714Q5988M7316E2486O1897o185a07951k9306m7015N2030
$$ 172289 231824 21714 107702 155018 52486 114383 108198 -107951 -137257 -184272 -132242
11276a32242H9665a89360j02702i8998j1916A25528d5048C06895a06121p4300
$$ -132242 89665 -189360 -292062 -98998 -110914 125528 -45048 306895 -106121 -180421
11266a80421r3425A10628a10451l7151A13988c57063C4033j5587J67154a87812
$$ -180421 -273846 110628 -110451 -147602 113988 -357063 34033 18446 185600 -187812
11255c1330o513j4024p5726l33272a24754B93922j7871E9545N2311m4774n522
$$ -31330 -37843 -51867 -127593 -460865 -124754 293922 276051 59545 111856 67082 61560
11244F1560a56710m4702A3799a91758g5177c1719A25375c82668c5773k38466d9935
$$ 61560 -156710 -201412 13799 -191758 -75177 -31719 125375 -382668 -35773 -274239 -49935
11232B12921p9219c10430j78305K20986D8396g5201D7471J46347b9747G3175P354
$$ 212921 133702 -310430 -488735 -267749 48396 -75201 47471 193818 -29747 73175 80529
11221H0529a53182k77128a08078j90880A11923E5711c51215g9968A05124K4223
$$ 80529 -153182 -430310 -108078 -298958 111923 55711 -351215 -79968 105124 129347
11211A29347m5579c99578A11800G623J29494a67662j30093J06525p4495J32434
$$ 129347 83768 -399578 111800 7623 137117 -167662 -297755 -191230 -265725 -133291
11201a33291C5492a23101A03631b55615D2667K12373b12858P5081A36732P5688
$$ -133291 35492 -123101 103631 -255615 42667 255040 -212858 -137777 136732 212420
11191B12420d5519B9567i6077l0289o2913p0686L8949O4730O1273B27632b97390
$$ 212420 -45519 29567 -96077 -126366 -189279 -259965 -221016 -156286 -95013 227632 -297390
11179c6401o3158M8590A80569g204k8525p9415B79775a45411k1712C31271d67017
$$ -36401 -99559 -50969 180569 -7204 -35729 -115144 279775 -145411 -167123 331271 -467017
11167f5682A2421b27737d6168c920A28705d8708C1419g7521C63644e55057b8933
$$ -65682 12421 -227737 -46168 -3920 128705 -48708 31419 -77521 363644 -555057 -28933
11155a07705j43025K9161O3936a6143E7712a5820f379D0220K30234d5535b428
$$ -107705 -250730 -221569 -157633 -16143 57712 -15820 -6379 40220 270454 -45535 -2428
11143f4619k28866o4668R0480L0137I3329b94462a5405r5039A47057d2643n0978
$$ -64619 -293485 -358153 -267673 -237536 93329 -294462 -15405 -110444 147057 -42643 -93621
11132i3621r7482O1806N6279j41517D1129h2466A7291M22726a67182B25410d4359
$$ -93621 -191103 -129297 -73018 -214535 41129 -82466 17291 440017 -167182 225410 -44359
11120a86986B07334d1350E2194L49501A54793J47428E9681a64972A4994K56078
$$ -186986 207334 -41350 52194 401695 154793 302221 59681 -164972 14994 271072
11110B71072n4884A0270i5273B67739a07432A6280c3327C61598a62131A70895
$$ 271072 216188 10270 -95273 267739 -107432 16280 -33327 361598 -162131 170895
11099a56818A65483b8178q2658m5078C55220A25896a63941Q226C73721A7241K28228
$$ -156818 165483 -28178 -110836 -155914 355220 125896 -163941 -155715 373721 17241 245469
11088B45469J08556j57072N0703G9705L85998C8866K69829j43881N3937J74037
$$ 245469 354025 196953 247656 79705 465703 38866 308695 164814 218751 392788
11078C92788A92734O9516O3473j60192Q7503d0019B52461J06338b7778A39564
$$ 392788 192734 262250 325723 165531 253034 -40019 252461 358799 -27778 139564
11067h5782C26827a82183C82024I874K20726A2894N22121k18233I9125C5755K74424
$$ -85782 326827 -182183 382024 9874 230600 12894 535015 316782 99125 35755 310179
11056C10179J3149A3068P9918K54140n1635J07831q4496E1620L11252N4113n9965
$$ 310179 323328 13068 92986 347126 295491 403322 318826 51620 362872 416985 357020
11045C57020K95453n7391N4276k06171B18991O86059j92424l33684j655L78823
$$ 357020 652473 595082 649358 443187 218991 905050 712626 378942 377287 756110
11035G56110J00077j63556N3907j28998k48198M09765K3531K13405k52761j86438
$$ 756110 856187 692631 746538 617540 369342 779107 802638 1016043 763282 576844
11025E76844n774M72609l02046R4685k32567r1284L0607Q5978P7731l39474K28046
$$ 576844 571070 1043679 741633 836318 603751 512467 543074 629052 706783 367309 595355
11014E95355N0758j58124J67104J04641j16575j05293J80441j93271J79736Q1121
$$ 595355 646113 487989 655093 759734 643159 537866 718307 525036 704772 785893
11004G85893n6926k13981J8236k63395L48868k03168K83965k65503R2838q1554
$$ 785893 728967 514986 533222 269827 618695 415527 699492 433989 526827 445273
10994D45273J53902j77727K14196n8685K9909n5755k1696K38248J4533l23723
$$ 445273 599175 421448 635644 576959 606868 551113 529417 767665 782198 458475
10984D58475L62738j76391k75202L87946k00092j2240j07215q6738O23144j90683
$$ 458475 821213 644822 369620 757566 557474 545234 438019 351281 974425 783742
10974G83742J4933K38907m10927R2042j7966K92473j58341J56246k68130P83836
$$ 783742 798675 1037582 626655 718697 700731 993204 834863 991109 722979 1506815
10964A506815j07627o6232N21630k46114L77721j6126R94068o20076L48674k81606
$$ 1506815 1399188 1332956 1854586 1608472 1986193 1970067 2964135 2344059 2692733 2411127
10954B411127j48676m9272n42615N0209j85272j93795L6834j54500o8939O8914
$$ 2411127 2262451 2213179 1670564 1720773 1535501 1341706 1378540 1224040 1155101 1224015
10944A224015m4711k71212J32718K02924k9246m41375j2156Q8568l5116j64558
$$ 1224015 1179304 908092 1040810 1243734 1214488 773113 760957 849525 814409 649851
10934F49851k1714P9699C38450P4647C121J41059d7931l27577D9868J38253P1563
$$ 649851 628137 707836 338450 413097 3121 144180 -47931 -375508 49868 188121 259684
10923B59684L19258H7925b0770C27452F5829I337R1178b59814f2944B98923I7647
$$ 259684 578942 87925 -20770 327452 65829 9337 100515 -259814 -62944 298923 97647
10911a23356C8904A4027L10601D4973a5658A35248E1416K66904A27177b41730
$$ -123356 38904 14027 324628 44973 -15658 135248 51416 318320 127177 -241730
10900b62927f3760j76439A16293J532b93352B25821a53187B09912a4792o1199
$$ -262927 -63760 -240199 116293 117825 -293352 225821 -153187 209912 -14792 -75991
10890g5991B54648g7187A5473a25800b4493A51298G3636f1538a8332j63419r8698
$$ -75991 254648 -77187 15473 -125800 -24493 151298 73636 -61538 -18332 -181751 -280449
10879b80449f9500B3174a83977b4178a765k66322M682J07109r9954b7329j7788
$$ -280449 -69500 23174 -183977 -24178 -1765 -268087 -263405 -156296 -256250 -27329 -45117
10868d5117k68231C8164Q681a49876k91643a89250m5599A89867c41746A06720
$$ -45117 -313348 38164 46845 -149876 -441519 -189250 -234849 189867 -341746 106720
10857c49401g8034A6717b67376B93589i5507a3229G6799i9754I9109i3138B70881
$$ -349401 -78034 16717 -267376 293589 -95507 -13229 76799 -99754 99109 -93138 270881
10845c89736A001e22j33116l6302A89037H2196b24555A17397A1961g2908p396
$$ -389736 1001 -522 -133638 -169940 189037 82196 -224555 117397 11961 -72908 -80304
10834h0304n2743A81562o8677a16695n4889A54668g1022A09863a33245d3164k38537
$$ -80304 -133047 181562 112885 -116695 -171584 154668 -71022 109863 -133245 -43164 -281701
10823b81701L8324B3448J13195g7159A83054H5220b07683E09021i9694p2327P8769
$$ -281701 -243377 23448 136643 -77159 183054 85220 -207683 509021 -99694 -172021 -93252
10812i3252M2333k34873I6775a91385B1537c96m4868k10763g8850r4999k84895
$$ -93252 -50919 -285792 96775 -191385 21537 -396 -45264 -256027 -78850 -173849 -458744
10801d58744a11029d5209j8329A39346g78l10989B0793k796J50240a20070c9513
$$ -458744 -111029 -45209 -63538 139346 -778 -311767 20793 17997 168237 -120070 -39513
10789D29727A0035b03278b732k94399g7859A9429O5288L22677a09896M2693k21612
$$ 429727 10035 -203278 -2732 -297131 -77859 19429 84717 407394 -109896 -67203 -288815
10778b88815C4708J81531H5614a47578d9916A53953K7571a83552A44298b08634
$$ -288815 34708 216239 85614 -147578 -49916 153953 181524 -183552 144298 -208634
10767E5220i7675j47199J18357a4222k17318b5544p4757m46010E5343a49099B96534
$$ 55220 -97675 -244874 -126517 -14222 -231540 -25544 -100301 -546311 55343 -149099 296534
10755a71339I1715J15238G0700k0759b65413f9067j51988R7710q9636C07117j50666
$$ -171339 91715 206953 70700 49941 -265413 -69067 -221055 -123345 -212981 307117 156451
10744A56451D3537a4615F9640b14706e0139b3065I2015a33426j54359Q3366C62701
$$ 156451 43537 -14615 69640 -214706 -50139 -23065 92015 -133426 -287785 -204419 362701
10732A74610O8303a36269j03740a9885I9631c28508a12943C35347I0883d7839
$$ 174610 242913 -136269 -240009 -19885 99631 -328508 -112943 335347 90883 -47839
10721C20064A7380J773a29377e0152b0368k73377c7489a594l6371H2401a14275
$$ 320064 17380 19153 -129377 -50152 -20368 -293745 -37489 -1594 -37965 82401 -114275
10709A16414a2465l38557j77870h0107c6773E147a11131j51022L7029A79497E7822
$$ 116414 -12465 -351022 -528892 -80107 -36773 5147 -111131 -262153 -225124 179497 57822
10697b19730g3332l050k39445L4460B15950a82313h1784E8970L9346J8249b39096
$$ -219730 -73332 -76382 -315827 -281367 215950 -182313 -81784 58970 98316 116565 -239096
10685c9556j31968j28956J19305I5937c0690A00934a91644A9907K22179i0362
$$ -39556 -171524 -300480 -181175 95937 -30690 100934 -191644 19907 242086 -90362
10674a37049c3988E9614L0359a7632G2499P1757a12534A8324b46732i1617I9069
$$ -137049 -33988 59614 89973 -17632 72499 144256 -112534 18324 -246732 -91617 99069
10662A38513a38980m70437K21996A93420p8609g7179c3574n5949j90965G1104
$$ 138513 -138980 -609417 -387421 193420 114811 -77179 -33574 -89523 -280488 71104
10651B12580n9254Q2854d3752j0844A47538i4624J6541A5955e7145A39250a40525
$$ 212580 153326 236180 -43752 -54596 147538 -94624 -78083 15955 -57145 139250 -140525
10639A51073f9368j3632C63464k7420A0133J63985l8627J18374b04549A69348
$$ 151073 -69368 -83000 363464 336044 10133 174118 135491 253865 -204549 169348
10628a46910M8282e667k86987c7531l81587f3453k2593j3508r6302B08576a05728
$$ -146910 -98628 -5667 -292654 -37531 -419118 -63453 -86046 -99554 -195856 208576 -105728
10616b81066g7554C5382a52635L141B80720I7788b35748a6902B6053M3510a96257
$$ -281066 -77554 35382 -152635 -149494 280720 97788 -235748 -16902 26053 69563 -196257
10604A21662g3400l188A9195P1479c2507G9751I16b8979A28749A9434a42380A176
$$ 121662 -73400 -76588 19195 90674 -32507 79751 916 -28979 128749 19434 -142380 1176
10591A60471C0912L6183i7721C14275a74222A8475d5452n5253I8593a17484j03585
$$ 160471 30912 67095 -97721 314275 -174222 18475 -45452 -100705 98593 -117484 -221069
10580b21069B4355H512e4028K5992B2194q124c36049f9078I2321K65239c07426
$$ -221069 24355 8512 -54028 -28036 22194 14070 -336049 -69078 92321 357560 -307426
10568i4982c8843H7606c3763B91038d52582c1290m5690j1743K0597A32361b59968
$$ -94982 -38843 87606 -33763 291038 -452582 -31290 -76980 -88723 -68126 132361 -259968
10556d5792E4308a36975l34775J95986h4296I4908a08022M0847A7469L5638R7812
$$ -45792 54308 -136975 -471750 -275764 -84296 94908 -108022 -67175 17469 53107 150919
10545A50919e3412n8980b3680G2784c18084A97291f5833A22131D6553F957a32996
$$ 150919 -53412 -112392 -23680 72784 -318084 197291 -65833 122131 46553 6957 -132996
10533A74734c54j71665e0054j83336R5726A23174h4671k06227G7108M010j7873
$$ 174734 -354 -172019 -50054 -233390 -137664 123174 -84671 -290898 77108 81118 63245
10522F3245A7752P6274N0406a85886D14530A74861c3413B52131j14875b84396
$$ 63245 17752 94026 144432 -185886 414530 174861 -33413 252131 137256 -284396
10511a08908H6545B7185M4678b89622J28117j06603A16719M3320b65664N6717
$$ -108908 86545 27185 71863 -289622 -161505 -268108 116719 160039 -265664 -208947
10501b08947H3166l0015b63727a05651L8217k03673d9755k38615L3858B8286J44244
$$ -208947 83166 53151 -263727 -105651 -67434 -271107 -49755 -288370 -254512 28286 172530
10490A72530J0535Q8370c8624a3979H5193Q1211J43415a28280J0855l24279J49620
$$ 172530 183065 271435 -38624 -13979 85193 166404 309819 -128280 -117425 -441704 -292084
10479b92084h161A62768J23519b82430f956D6522J80903C7526J90427j08505N3869
$$ -292084 -8161 162768 286287 -282430 -6956 46522 227425 37526 227953 119448 173317
10468A73317J05549a74916C71442O5511d5603A74699C2074J88425n3640K1821
$$ 173317 278866 -174916 371442 436953 -45603 174699 32074 220499 166859 188680
10458A88680J35793E0437J77462d0780o4670I6922Q7079B9898G180J92199K1002
$$ 188680 324473 50437 227899 -40780 -105450 96922 184001 29898 7180 199379 220381
10447B20381h4114b702m28943B86099g8717k71477J49536N6992e5424j5903j64671
$$ 220381 -84114 -2702 -431645 286099 -78717 -350194 -200658 -143666 -55424 -71327 -235998
10436b35998D1613f9711j8150k31544A22913L0383a87143m6773j46652g6254k5601
$$ -235998 41613 -69711 -87861 -319405 122913 153296 -187143 -233916 -380568 -76254 -101855
10425a01855L1525H2515f9090E5539b50032I2397a56220A7265b39573N2877M4050
$$ -101855 -70330 82515 -69090 55539 -250032 92397 -156220 17265 -239573 -186696 -142646
10414a42646B5931J32822g0269d839I6991O9886a24519B9281B808O4177b682F4394
$$ -142646 25931 158753 -70269 -4839 96991 166877 -124519 29281 2808 66985 -2682 64394
10401B40744d11192J14189A1130N5006d7696C8462b56915C4898c26564E8028e698
$$ 240744 -411192 -297003 11130 66136 -47696 38462 -256915 34898 -326564 58028 -5698
10389G7337c32443B55832b48759G4402J41532o5533i4956C52649I7711e1934B65324
$$ 77337 -332443 255832 -248759 74402 215934 150401 -94956 352649 97711 -51934 265324
10377B81065k3184Q1054j64554B232J15920J79290a43093A71879d8812A58381
$$ 281065 257881 338935 174381 2232 118152 297442 -143093 171879 -48812 158381
10366A16548J58150D3777J09745J66702A47843J63538H8243J44027K95724A12983
$$ 116548 274698 43777 153522 320224 147843 311381 88243 232270 527994 112983
10355G8971a83568B7743L03195J02561A86084m4138L44901j55653j52142J23607
$$ 78971 -183568 27743 330938 433499 186084 141946 486847 331194 179052 302659
10345C02659L0085E8872N2846Q6025J00769b7861B22585o2076K00682H0402M60334
$$ 302659 332744 58872 111718 197743 298512 -27861 222585 160509 361191 80402 540736
10334E40736B545J02862K43835H1358P9207K06759j29511F2725J10038b029B77631
$$ 540736 2545 105407 349242 81358 160565 367324 237813 62725 172763 -2029 277631
10322E11711A16036c8148C03635b6769p2642n5248L2453B47834o5018j0164G8305
$$ 511711 116036 -38148 303635 -26769 -99411 -154659 -122206 247834 182816 172652 78305
10310i2012j12184G7306j7027R281O3245K54076J1267A6628b4554B98595D0481
$$ -92012 -204196 77306 60279 69560 132805 386881 398148 16628 -24554 298595 40481
10298A23116c9085q756A18032b02228F9859Kb18808l99296B38066J42147A17518
$$ 123116 -39085 -47841 118032 -202228 69859 69861 -218808 -618104 238066 380213 117518
10286C03208E5780b08762C8354b07903j2571I7602e9322A74663a96122D08762
$$ 303208 55780 -208762 38354 -207903 -220474 97602 -59322 174663 -196122 408762
10275e45233h9686m2244D5312J1482A7676a20700K8142E8146J31048b43510M2155
$$ -545233 -89686 -131930 45312 56794 17676 -120700 -92558 58146 189194 -243510 -201355
10264b01355L2747A35141b82574a22402A50869b57109A22895d74455A72937a24806
$$ -201355 -168608 135141 -282574 -122402 150869 -257109 122895 -474455 172937 -124806
10253A52544E8074k6813J01783A5970J14161K09612A21850j8564J47903A21271
$$ 152544 58074 31261 133044 15970 130131 339743 121850 103286 251189 121271
10242C0851J40423O2151g7335H3833a1702j24367k7279a7664j03156j58952A39094
$$ 30851 171274 233425 -77335 83833 -11702 -136069 -163348 -17664 -120820 -279772 139094
10230A34106J40485b8728o7216I7347b67459j3058A50482p0911A5856c6256j13181
$$ 134106 274591 -28728 -95944 97347 -267459 -280517 150482 79571 15856 -36256 -149437
10219a49437D3675c5609j32346C1418c1770j10469O9881j86347i8237K942A74680
$$ -149437 43675 -35609 -167955 31418 -31770 -142239 -72358 -258705 -98237 -95295 174680
10207D8276K09785b73382A6917r77f2125A32025b45817B0293e9065B2012K0221
$$ 48276 258061 -273382 16917 15940 -62125 132025 -245817 20293 -59065 22012 42233
10196D2233a32430k72408C3633J90906A06191d2072C6677c3495j14466a7794F0301
$$ 42233 -132430 -404838 33633 224539 106191 -42072 36677 -33495 -147961 -17794 60301
10184a07559k585j17860n012B1227a15397R26a9658j6601d753B40254b49439R4372
$$ -107559 -110144 -228004 -233016 21227 -115397 -114471 -19658 -36259 -4753 240254 -249439 -155067
10172a55067j99211J21034F185J28976n5272a06221A11980h419q0717l74948a03386
$$ -155067 -354278 -233244 6185 135161 79889 -106221 111980 -8419 -89136 -464084 -103386
10160a32845N5104A10490M2692a90974F606a69249C13320B9791h0029I5599J09728
$$ -132845 -77741 110490 153182 -190974 6606 -169249 313320 29791 -80029 95599 205327
10149B05327F3834a66551l26407A78916b24098J05448A24325b52388F8034j6739
$$ 205327 63834 -166551 -492958 178916 -224098 -118650 124325 -252388 68034 51295
10139E1295a45644G4434e7283r6108c9990j0341d556B69773F6086a18103k6949
$$ 51295 -145644 74434 -57283 -153391 -39990 -50331 -4556 269773 66086 -118103 -145052
10128a45052a5818B644J09252b93659J20112A0038f15819A5070Q2880c4352l7352
$$ -145052 -15818 2644 111896 -293659 -173547 10038 -615819 15070 97950 -34352 -71704
10117g1704j40787R5133a0742l7971A61650D8746a60816h63k35657B553N6103
$$ -71704 -212491 -117358 -10742 -48713 161650 48746 -160816 -863 -236520 2553 58656
10106E8656a7660q2846A26305n1519k1592g7643c7378D5458j2413a6497k01501
$$ 58656 -17660 -100506 126305 74786 53194 -77643 -37378 45458 33045 -16497 -217998
10095b17998d1608m2996D1406h9087j18535Q6685b5721m93818e8119J592q8003
$$ -217998 -41608 -84604 41406 -89087 -207622 -120937 -25721 -519539 -58119 -56527 -144530
10084a44530G6880a83575C4932J82933b62467a04263E8523a19759J4535c0191
$$ -144530 76880 -183575 34932 217865 -262467 -104263 58523 -119759 -105224 -30191
10073B48893F7335R4279c87376c6812C20477j51635b53522J2481l9929A33704
$$ 248893 67335 161614 -387376 -36812 320477 168842 -253522 -241041 -280970 133704
10062e5545n2299E8115b13171K7747b3659k09291J10416b9432g837k76373A35851
$$ -55545 -107844 58115 -213171 -185424 -23659 -232950 -122534 -29432 -7837 -284210 135851
10050A46959b70222e0345J7512A66485a0j57125f98j04487k97236C4683c32065
$$ 146959 -270222 -50345 -32833 166485 -10 -157135 -698 -105185 -402421 34683 -332065
10038d5924j94376E8643k5830a02923A35817n5647A5207J2568g9136A069M6096
$$ -45924 -240300 58643 32813 -102923 135817 80170 15207 27775 -79136 1069 47165
10027D7165a0948l03779l5355J42974r9995M4125h6762F0813N5002C4447K8890
$$ 47165 -10948 -314727 -350082 -207108 -307103 -262978 -86762 60813 115815 34447 63337
10016F3337a64948a847B08362a53583H0461b41399k26569A3800a25067a0059j26866
$$ 63337 -164948 -1847 208362 -153583 80461 -241399 -467968 13800 -125067 -10059 -136925
10005a36925G8015d31662B0984a0973A5238P3680b33244M5649B13020a76231Q5659
$$ -136925 78015 -431662 20984 -10973 15238 88918 -233244 -187595 213020 -176231 -90572
9994i0572A05103a08601p9336r5618B6361J74857f8951R891o1310A6411J33697
$$ -90572 105103 -108601 -187937 -283555 26361 201218 -68951 -59060 -120370 16411 150108
9983A50108a55587A94402E8554A601j5a23029b6305j80316Q8619B89737D6369
$$ 150108 -155587 194402 58554 1601 1586 -123029 -26305 -206621 -118002 289737 46369
9971a21938j0383A7016J37164a60825j8893j75215a34515D636K7978N2342L0649
$$ -121938 -132321 17016 154180 -160825 -179718 -354933 -134515 4636 32614 84956 115605
9960A15605a43451O5552B64662c58168a2811F3158K95888b30739F0014d03797
$$ 115605 -143451 -77899 264662 -358168 -12811 63158 359046 -230739 60014 -403797
9949b84336d7027B34838d6701D3263a98952B0640b60107B5686a73516e5034k54612
$$ -284336 -47027 234838 -46701 43263 -198952 20640 -260107 25686 -173516 -55034 -309646
9938c09646D5054c27k9875p7491n9902i592F8393L17630G4587c8486j90384A83029
$$ -309646 45054 -327 -30202 -107693 -167595 -9592 68393 386023 74587 -38486 -228870 183029
9925B21852a14771m9305j4533g4508i555p0128A40209a93777N4392M7825B18957
$$ 221852 -114771 -164076 -178609 -74508 -9555 -79683 140209 -193777 -139385 -91560 218957
9913d2081B00792b75176B03990a39815D2761a5555m5969A66253B5055L09783d5567
$$ -42081 200792 -275176 203990 -139815 42761 -15555 -61524 166253 25055 334838 -45567
9901b2745l52092h7351k8345j49768a08705A00265N5803b08005o0172B63775E2652
$$ -22745 -374837 -87351 -115696 -265464 -108705 100265 156068 -208005 -268177 263775 52652
9889b238A66699c16570a8569B6868b85891J19208A17370N0880b341j26715o6587
$$ -2238 166699 -316570 -18569 26868 -285891 -166683 117370 168250 -2341 -129056 -195643
9878a95643J9806B10636F4075a05741G5999a3864l34723H6961b38578d1957j39453
$$ -195643 -175837 210636 64075 -105741 75999 -13864 -348587 86961 -238578 -41957 -181410
9867a81410J8004I8881C1361A3886N7630a69956A08579a34090B5962c7138A70771
$$ -181410 -163406 98881 31361 13886 71516 -169956 108579 -134090 25962 -37138 170771
9855A9840h7940A03764b45776F9845J39133a99363j68601I8205b38438g956A46321
$$ 19840 -87940 103764 -245776 69845 208978 -199363 -367964 98205 -238438 -7956 146321
9843e64079I1978b17746i640B70486A16758K04448e4038D797i2817l6543K4312
$$ -564079 91978 -217746 -9640 270486 116758 321206 -54038 4797 -92817 -129360 -105048
9832a05048h091A49492a6257j03048j33700B17680c5702F5088h2740l23032a46150
$$ -105048 -8091 149492 -16257 -119305 -253005 217680 -35702 65088 -82740 -405772 -146150
9820a71449P4969M5993j69188Q8135n2964Q1965A66842c91146a09198r0042A19797
$$ -171449 -96480 -50487 -219675 -131540 -184504 -102539 166842 -391146 -109198 -199240 119797
9808b57747J22221A64975b3259B82957b68575k6252J39159o1692F4032b94144
$$ -257747 -135526 164975 -23259 282957 -268575 -294827 -155668 -217360 64032 -294144
9797I5671a09229m3151J161L056b3700k475I2349K20182o7676C7105K03314j06590
$$ 95671 -109229 -152380 -151219 -148163 -23700 -26175 92349 312531 244855 37105 240419 133829
9785A33829a71195P8896B444Q1771a29015C810J51194a35222F8695R5917h9711
$$ 133829 -171195 -92299 2444 84215 -129015 3810 155004 -135222 68695 164612 -89711
9773A75777j5368b08839g7258A21169A1016K527L4716a03296A03652O857e57609
$$ 175777 160409 -208839 -77258 121169 11016 13543 48259 -103296 103652 110509 -557609
9761a36587C689b19269p9717A77343d0475k1275j4885r1395j1523k4268O1829
$$ -136587 3689 -219269 -298986 177343 -40475 -61750 -76635 -168030 -179553 -203821 -141992
9750a41992A89216r2834b06072l7530a9594n3473H569a5624D8520b52988f2474
$$ -141992 189216 96382 -206072 -243602 -19594 -73067 8569 -15624 48520 -252988 -62474
9738a81761J2264k2461R4943J2371a7831B46382a69135L005Q2017m9098j41188
$$ -181761 -169497 -191958 -97015 -84644 -17831 246382 -169135 -166130 -84113 -133211 -274399
9727b74399a02952l1723B54447F2784b09022D52060A72367b27463q4098c0294
$$ -274399 -102952 -134675 254447 62784 -209022 452060 172367 -227463 -311561 -30294
9716A59572c51274O7179Q610A72669a83139l51279D780J59785g8789H3792b7902
$$ 159572 -351274 -284095 -275485 172669 -183139 -534418 4780 164565 -78789 83792 -27902
9704a61417H5014c34488A6616K64090h1637C52611h2938M21a0617E4126J00356
$$ -161417 85014 -334488 16616 280706 -81637 352611 -82938 -82517 -10617 54126 154482
9693A54482a5079l19940f0879j9049l9878j17995a01523A5939c96536J50953R9401
$$ 154482 -15079 -335019 -60879 -79928 -119806 -237801 -101523 15939 -396536 -245583 -146182
9682a46182H3138P3726C1350d6005p9746p9113q2126J3979M5449C7404d3864M010
$$ -146182 83138 156864 31350 -46005 -125751 -204864 -286990 -273011 -227562 37404 -43864 -39854
9670c9854j19313c2437B43391d3718H6533c05497a43888l23360a4164F1629O2888
$$ -39854 -159167 -32437 243391 -43718 86533 -305497 -143888 -467248 -14164 61629 124517
9659A24517N6653j6503a1239l24767f7244G7632l2863a9864j54966G5349b34997
$$ 124517 181170 164667 -11239 -336006 -67244 77632 44769 -19864 -174830 75349 -234997
9647c6667o1934D38230d153A63876f1671B9933b73511C6993b29378A12913N0356
$$ -36667 -98601 438230 -4153 163876 -61671 29933 -273511 36993 -229378 112913 163269
9636A63269c03010c7667A0075f1590m3122j22471B82777d7795B5941f3028k40652
$$ 163269 -303010 -37667 10075 -61590 -104712 -227183 282777 -47795 25941 -63028 -303680
9625c03680G0273J41499l5932n265e0367l9566@I3142c34341a46037O4971g028
$$ -303680 70273 211772 175840 170575 -50367 -89933 0 93142 -334341 -146037 -81066 -7028
9612b25962N3420I3226b82823E5504e0290E8576F679J66434a29387k16240J44163
$$ -225962 -172542 93226 -282823 55504 -50290 58576 6679 173113 -129387 -345627 -201464
9601b01464C8603K4050a94739j48197h8918B28199C8783c02697I8404C0375M2868
$$ -201464 38603 62653 -194739 -342936 -88918 228199 38783 -302697 98404 30375 73243
9590G3243k6583i4660b9479k67171A93931b23954Q3114P119b2105m20675H9313
$$ 73243 46660 -94660 -29479 -296650 193931 -223954 -140840 -133721 -22105 -442780 89313
9578C93874a18701L8333A19909a97927G7776a94824A21554A4474a06658B79622
$$ 393874 -118701 -80368 119909 -197927 77776 -194824 121554 14474 -106658 279622
9567d03236B18594c4269j77026N0686J9865n8927C12839a21552j51781H9751h9223
$$ -403236 218594 -34269 -211295 -160609 -140744 -199671 312839 -121552 -273333 89751 -89223
9555a35929j13146Q1357f774l89478H6450a77435H8148O3908c27500A62130b50383
$$ -135929 -249075 -167718 -6774 -396252 86450 -177435 88148 152056 -327500 162130 -250383
9543b21357F3287a93152o8373K0999B9377O5365a84405N3064B04208J10011D321
$$ -221357 63287 -193152 -261525 -240526 29377 94742 -184405 -131341 204208 314219 4321
9531a37561K6717n4804A06305b09913P9475f3901F3063O8197M0211a85125Q5513
$$ -137561 -110844 -165648 106305 -209913 -130438 -63901 63063 131260 171471 -185125 -99612
9520i9612j39083N2309j5701M4539E4059K48331a61826B3476b45942A31123a94541
$$ -99612 -238695 -186386 -202087 -157548 54059 302390 -161826 23476 -245942 131123 -194541
9508C1741P9013g7616A06338L1524b30267c1699A70626a45102j8828F6516a33267
$$ 31741 110754 -77616 106338 137862 -230267 -31699 170626 -145102 -163930 66516 -133267
9496A04519a45351n0447I368a95539g0650F0517O3022a40012j90959A6351J21984
$$ 104519 -145351 -195798 9368 -195539 -70650 60517 123539 -140012 -330971 16351 138335
9485A38335o8855a11447k5257E3984O4067c29654a2866l41176a14451H1247j5029
$$ 138335 69480 -111447 -136704 53984 118051 -329654 -12866 -354042 -114451 81247 66218
9474F6218i1982m4688l4258e8829l0455k10678b2573l17168J536f7962A07118
$$ 66218 -91982 -136670 -170928 -58829 -89284 -299962 -22573 -339741 -338205 -67962 107118
9462A78977P1659a90040p2873D2640J89815M2356E9538e07155a55748j8770A9060
$$ 178977 250636 -190040 -262913 42640 232455 274811 59538 -507155 -155748 -174518 19060
9450a93977L1714j7258m7927l61289a32794C6029J74641a44582H3289l2335Q1021
$$ -193977 -162263 -179521 -227448 -588737 -132794 36029 210670 -144582 83289 50954 131975
9439A31975F2901a94344k07092a50102B03077b7795E3397a26902j1290A41962
$$ 131975 62901 -194344 -401436 -150102 203077 -27795 53397 -126902 -138192 141962
9428F3598J19820h2599A42195b05010N6925k985H3223C0032J8623b08430A99a67230
$$ 63598 183418 -82599 142195 -205010 -148085 -151070 83223 30032 48655 -208430 199 -167230
9415d2709p4573q0894B01696B2929c14248j5833a19888A44889b55989f440B19636
$$ -42709 -117282 -198176 201696 22929 -314248 -330081 -119888 144889 -255989 -6440 219636
9403b72758M8876M34I5148l8806K84359p5646c53541A91619p0845a67686A05670
$$ -272758 -223882 -223448 95148 56342 340701 265055 -353541 191619 120774 -167686 105670
9391g8815A57131F6740R4742c51002A58224K66010a31076l7156c5739j55096j21492
$$ -78815 157131 66740 161482 -351002 158224 424234 -131076 -168232 -35739 -190835 -312327
9380c12327J21504P4948r7014A74835d27846a3638C9393b32717J05092m1582j26526
$$ -312327 -190823 -115875 -212889 174835 -427846 -13638 39393 -232717 -127625 -169207 -295733
9369b95733d9166g729B2657a92975P7648I0494a13103j04189J9132L8176G5064
$$ -295733 -49166 -7729 22657 -192975 -115327 90494 -113103 -217292 -198160 -159984 75064
9357a05094A28413J95240B0318b69783E295J43338K77113H8069J48717f2273j06494
$$ -105094 128413 323653 20318 -269783 5295 148633 425746 88069 236786 -62273 -168767
9346a68767A48893a0777A9652c12899E5055J9850a49720B60750o1781b98961l98563
$$ -168767 148893 -10777 19652 -312899 55055 74905 -149720 260750 198969 -298961 -697524
9335f97524d2489o0791j84830B21180a20641j6753A56784a34530j00774B25302
$$ -697524 -42489 -103280 -288110 221180 -120641 -137394 156784 -134530 -235304 225302
9324G6184B2409J71992a8693k04545j74024C9879h8158q2831m79401C6041L9555
$$ 76184 22409 194401 -18693 -223238 -397262 39879 -88158 -170989 -650390 36041 75596
9313G5596e7036D38758c6370l46415g7612j85911b1368k67986K3163i1353j17767
$$ 75596 -57036 438758 -36370 -382785 -77612 -263523 -21368 -289354 -266191 -91353 -209120
9302b09120f0580b7265C536P0923c62198B52884a36477j7775g4931A503i3516
$$ -209120 -60580 -27265 3536 74459 -362198 252884 -136477 -154252 -74931 1503 -93516
9290b42371d3661o67j09988B8585a14852j75810a29046A63891a92731g6315A59659
$$ -242371 -43661 -44328 -154316 28585 -114852 -290662 -129046 163891 -192731 -76315 159659
9278e7739A88327a27025o1510b091j21016N0193d025j11803j41049j67073A42852
$$ -57739 188327 -127025 -188535 -2091 -123107 -72914 -4025 -115828 -256877 -423950 142852
9266c1569j03090M9223k46087e4786I764K65070e4042j82795j80310A20887d3832
$$ -31569 -134659 -85436 -331523 -54786 9764 274834 -54042 -236837 -417147 120887 -43832
9254a69622e5988l80136Q9430A7687K56281a59836l16943P3004g0116B78989L9954
$$ -169622 -55988 -436124 -346694 17687 273968 -159836 -476779 -403775 -70116 278989 318943
9243C18943A21884b16830c8506j0417k05357G9687i6098j483i088j3435k69275
$$ 318943 121884 -216830 -38506 -48923 -254280 79687 -96098 -97581 -9088 -22523 -291798
9232b91798J45169J8946j55620E1070K9451J16772I8348h4070A67266p8149i9285
$$ -291798 -146629 -127683 -283303 51070 80521 197293 98348 -84070 167266 89117 -99285
9220e8701a5402G6170O0272n554c4695D6891a30667A0563d3508C49915i3911r3049
$$ -58701 -15402 76170 136442 130888 -34695 46891 -130667 10563 -43508 349915 -93911 -186960
9208a86960K7453N6217a6556I820d17096i8918j36502P2685j65477i6346f604
$$ -186960 -159507 -103290 -16556 9820 -417096 -98918 -235420 -162735 -328212 -96346 -6604
9196a1621j35200q9839g0266i146j02383k52099J53853A50950a66351g4439C280
$$ -11621 -146821 -236660 -70266 -9146 -111529 -363628 -209775 150950 -166351 -74439 3280
9184g1218k50948J20357a9671C4468K19825e7455k05220B81589a80772H0679j0552
$$ -71218 -322166 -201809 -19671 34468 254293 -57455 -262675 281589 -180772 80679 70127
9173G0127g5201L2307a5045j27532r535k55416A87138b55703A9943a10931k5866
$$ 70127 -75201 -42894 -15045 -142577 -152112 -407528 187138 -255703 19943 -110931 -136797
9162a36797d4223q1273r2744g1572G9441b6533a2541H1280i3958c9787A2706d767
$$ -136797 -44223 -125496 -218240 -71572 79441 -26533 -12541 81280 -93958 -39787 12706 -4767
9149E1795N1165a88026k6593A14654d34751J86767F6876J51085a4279j0221C1575
$$ 51795 102960 -188026 -214619 114654 -434751 -247984 66876 217961 -14279 -24500 31575
9137d52016i9944M7632j97976b1541k94224c1419C1448a07606a9048C13312g7006
$$ -452016 -99944 -52312 -250288 -21541 -315765 -31419 31448 -107606 -19048 313312 -77006
9125A31122e22500a5400q438B8628b77335J04390A30519b19546B19593i5375d0778
$$ 131122 -522500 -15400 -23838 28628 -277335 -172945 130519 -219546 219593 -95375 -40778
9113b135p7942j94737A2974J19681a31795A90012m9609a96951D0183b02429F5571
$$ -2135 -80077 -274814 12974 132655 -131795 190012 140403 -196951 40183 -202429 65571
9101A79330E2629f2940B13106C1193a63391m4594e0884m2138b0760j72293D40519
$$ 179330 52629 -62940 213106 31193 -163391 -207985 -50884 -93022 -20760 -193053 440519
9089b8953B7035c062F7396a94864B4703b96722A26812a76481c7491m2548E245
$$ -28953 27035 -3062 67396 -194864 24703 -296722 126812 -176481 -37491 -80039 5245
9077B5723R2408b26064j90121f1359j36133H793b1394j60222H7851b2500A8705
$$ 25723 118131 -226064 -416185 -61359 -197492 8793 -21394 -181616 87851 -22500 18705
9065B98881l7747b8361k58265q072l3386H4764M2182J19959c50023e8849A38253
$$ 298881 261134 -28361 -286626 -294698 -328084 84764 126946 246905 -350023 -58849 138253
9053b06958A72452f5368p4160M4145R815I1176b57401A3245M6878J9538C4794
$$ -206958 172452 -65368 -139528 -95383 -85568 91176 -257401 13245 60123 79661 34794
9041b36660d2430a4474k31807F8554k2385A730J28273n9378a22784d6507j33988
$$ -236660 -42430 -14474 -246281 68554 46169 1730 130003 70625 -122784 -46507 -180495
9030a80495A29017c11102J22054B311b93793J1469a12376M2245c0807A3750J9723
$$ -180495 129017 -311102 -189048 2311 -293793 -282324 -112376 -70131 -30807 13750 33473
9019C3473J22443c77722g8736L2092j53307R9058A12036f0318C03540G3899M7717
$$ 33473 155916 -377722 -78736 -46644 -199951 -100893 112036 -60318 303540 73899 121616
9008A21616k013h9525l33120A77255D7760i4030A36956a70348f8857N580k54563
$$ 121616 119603 -89525 -422645 177255 47760 -94030 136956 -170348 -68857 -63277 -317840
8997c17840a48977L0657j08875F7739d9346j89045O6539H3417c51178g5483j63774
$$ -317840 -148977 -118320 -227195 67739 -49346 -238391 -171852 83417 -351178 -75483 -239257
8986b39257J02414o297d764B42431a3196B31678a42233c6233l5640C7840a45332
$$ -239257 -136843 -143140 -4764 242431 -13196 231678 -142233 -36233 -71873 37840 -145332
8974B00738I3678i1909l9544k6118F8016c40140c646r6981p654d065k7218q5361
$$ 200738 93678 -91909 -131453 -157571 68016 -340140 -3646 -100627 -108281 -4065 -31283 -116644
8962a16644j01499C1963a31170f1040B8157g3992B1089K0697b55578A42466f9595
$$ -116644 -218143 31963 -131170 -61040 28157 -73992 21089 41786 -255578 142466 -69595
8950a23423m392b2736p7368E1087a2492j20153o897L6226A33808b66827p7726
$$ -123423 -127815 -22736 -100104 51087 -12492 -132645 -139542 -103316 133808 -266827 -344553
8939c44553J24580L7697I0730c33298h3088b09F7208b6347F314g2368a1255j97234
$$ -344553 -219973 -182276 90730 -333298 -83088 -209 67208 -26347 6314 -72368 -11255 -208489
8927b08489F6705b64820A05757b37994O821A51375E2065K05158L0476a08507M1498
$$ -208489 66705 -264820 105757 -237994 -231173 151375 52065 257223 287699 -108507 -67009
8916f7009j89479A43148K0146b22149H2918d0387A65944R8776J03161J16289J477637
$$ -67009 -256488 143148 163294 -222149 82918 -40387 165944 264720 367881 484170 1961807
8905A961807o71304D88311n9116A20791Q8535A4429K9866K82190e4173l0315n0168
$$ 1961807 1290503 488311 429195 120791 209326 14429 44295 326485 -54173 -84488 -134656
8894a34656L6133A0091K04200c13910D7559a6397l02765A64827A7280b45099G2220
$$ -134656 -98523 10091 214291 -313910 47559 -16397 -319162 164827 17280 -245099 72220
8882A73851o9124a75545A40197K85002j63768a17462m2742j0365E3251b79872
$$ 173851 104727 -175545 140197 425199 261431 -117462 -160204 -170569 53251 -279872
8871B02908N4841f32001I3622b1685l5312K0566k620j14646f8217B8676K7634
$$ 202908 257749 -632001 93622 -21685 -56997 -36431 -39051 -153697 -68217 28676 56310
8860E6310L8176a47026j65806N7484a20867j61808h9927k83331B06719d43326
$$ 56310 94486 -147026 -312832 -255348 -120867 -282675 -89927 -373258 206719 -443326
8849a20733l60A46083F7363d625l9066p9345B20535h9875m0095A24820f0807o5912
$$ -120733 -121093 146083 67363 -4625 -43691 -123036 220535 -89875 -129970 124820 -60807 -126719
$$ [...]
##END NTUPLES=NMR SPECTRUM
##END=
