
##TITLE=AC1229_PANAH12122_6524299_wY3hrqstTx
##JCAMPDX= 6.0         $$ Bruker NMR JCAMP-DX V2.0
##DATA TYPE= NMR SPECTRUM
##DATA CLASS= NTUPLES
##ORIGIN= BRUKER
##OWNER= Administrator
$$ 1.72 TOPSPIN		Version 2.1
$$ 2012-07-14 19:47:53.906 -0500  Administrator@TOPSPIN
$$ Compression mode = diff/dup
##.OBSERVE FREQUENCY= 400.02188249412
##.OBSERVE NUCLEUS= ^1H
##.ACQUISITION MODE= SIMULTANEOUS (DQD)
##.ACQUISITION SCHEME= undefined
##.AVERAGES= 8
##.DIGITISER RES= 22
##SPECTROMETER/DATA SYSTEM= spect
##.PULSE SEQUENCE= zg30
##.SOLVENT NAME= COFFEE_meoh
##.SHIFT REFERENCE= INTERNAL, COFFEE_meoh, 1, 14.98509
##AUDIT TRAIL= $$ (NUMBER, WHEN, WHO, WHERE, PROCESS, VERSION, WHAT)
$$ ##TITLE= Audit trail, TOPSPIN		Version 2.1
$$ ##JCAMPDX= 5.01
$$ ##ORIGIN= Bruker BioSpin GmbH
$$ ##OWNER= Administrator
$$ $$ C:\Bruker\TOPSPIN/data/COFFEE/nmr/AC1229_PANAH12122_6524299_wY3hrqstTx/10/pdata/1/auditp.txt
$$ ##AUDIT TRAIL=  $$ (NUMBER, WHEN, WHO, WHERE, PROCESS, VERSION, WHAT)
(   1,<2012-07-14 19:47:43.203 -0500>,<Administrator>,<TOPSPIN>,<go>,<TOPSPIN 2.1>,
      <created by zg
	started at 2012-07-14 19:46:36.578 -0500,
	POWCHK enabled, PULCHK disabled,
       configuration hash MD5:
       6B 1B 68 BB D9 2E 58 E2 7F 35 AD 54 07 DF 0E 41
       data hash MD5: 64K
       5C 0B B5 D6 B8 3B 48 3E B5 05 D6 7E F2 27 39 4F>)
(   2,<2012-07-14 19:47:45.968 -0500>,<Administrator>,<TOPSPIN>,<proc1d>,<TOPSPIN 2.1>,
      <Start of raw data processing
       efp LB = 0 FT_mod = 6 PKNL = 1 PHC0 = 0 PHC1 = 0 SI = 32K 
       data hash MD5: 32K
       43 59 F0 37 28 13 41 C6 2B 9C 90 C2 AE 20 1A AF>)
(   3,<2012-07-14 19:47:46.328 -0500>,<Administrator>,<TOPSPIN>,<proc1d>,<TOPSPIN 2.1>,
      <pk PHC0 = 178.1543 PHC1 = 0 
       data hash MD5: 32K
       DB C1 E2 DF AC 09 FD C0 D1 22 3D 29 96 2B 82 7B>)
(   4,<2012-07-14 19:47:46.421 -0500>,<Administrator>,<TOPSPIN>,<proc1d>,<TOPSPIN 2.1>,
      <abs ABSG = 1 
       data hash MD5: 32K
       74 F2 C0 E4 7F C0 3F DE CC B2 86 42 5C 75 56 30>)
(   5,<2012-07-14 19:47:46.468 -0500>,<Administrator>,<TOPSPIN>,<proc1d>,<TOPSPIN 2.1>,
      <abs ABSG = 2 
       data hash MD5: 32K
       61 B6 52 89 9D A2 0D EA BE 60 5B C5 9C AA E8 AE>)
(   6,<2012-07-14 19:47:46.515 -0500>,<Administrator>,<TOPSPIN>,<proc1d>,<TOPSPIN 2.1>,
      <abs ABSG = 3 
       data hash MD5: 32K
       06 EB 05 E4 FA DF 86 AB 4A 8E 96 32 7B 8E 17 B8>)
(   7,<2012-07-14 19:47:46.562 -0500>,<Administrator>,<TOPSPIN>,<proc1d>,<TOPSPIN 2.1>,
      <abs ABSG = 4 
       data hash MD5: 32K
       DD 15 03 B6 06 1A 54 DB 11 3C C1 11 5E 12 A1 EE>)
(   8,<2012-07-14 19:47:46.640 -0500>,<Administrator>,<TOPSPIN>,<proc1d>,<TOPSPIN 2.1>,
      <abs ABSG = 5 
       data hash MD5: 32K
       C9 7E 5E 27 7E F4 9E 01 A5 0B B6 3C E9 12 B8 77>)
$$ ##END=
$$ 
$$ $$ hash MD5
$$ $$ 08 02 A3 2F 52 D8 52 BB 13 2B 19 C6 A3 47 83 80
##$RELAX= 
##$RELAX= 
##$RELAX= 
##$RELAX= 
##$RELAX= 
##$RELAX= 
##$RELAX= 
$$ Bruker specific parameters
$$ --------------------------
$$ [...]
##$TP= (0..7)
150 150 150 150 150 150 150 150
##$TP07= 0
##$TPNAME0= <>
##$TPNAME1= <>
##$TPNAME2= <>
##$TPNAME3= <>
##$TPNAME4= <>
##$TPNAME5= <>
##$TPNAME6= <>
##$TPNAME7= <>
##$TPOAL= (0..7)
0.5 0.5 0.5 0.5 0.5 0.5 0.5 0.5
##$TPOFFS= (0..7)
0 0 0 0 0 0 0 0
##$TUNHIN= 0
##$TUNHOUT= 0
##$TUNXOUT= 0
##$USERA1= <user>
##$USERA2= <user>
##$USERA3= <user>
##$USERA4= <user>
##$USERA5= <user>
##$V9= 5
##$VALIST= <valist>
##$VCLIST= <CCCCCCCCCCCCCCC>
##$VD= 0
##$VDLIST= <DDDDDDDDDDDDDDD>
##$VPLIST= <PPPPPPPPPPPPPPP>
##$VTLIST= <TTTTTTTTTTTTTTT>
##$WBST= 2048
##$WBSW= 25
##$XGAIN= (0..3)
0 0 0 0
##$XL= 0
##$YL= 0
##$YMAX_a= 477977
##$YMIN_a= -606099
##$ZGOPTNS= <>
##$ZL1= 120
##$ZL2= 120
##$ZL3= 120
##$ZL4= 120
##$ABSF1= 14.98509
##$ABSF2= -5.573092
##$ABSG= 5
##$ABSL= 3
##$ALPHA= 0
##$AQORDER= 0
##$ASSFAC= 0
##$ASSFACI= 0
##$ASSFACX= 0
##$ASSWID= 0
##$AUNMP= <proc_prof1d_extract_pilot.lims>
##$AXLEFT= 0
##$AXNAME= <>
##$AXNUC= <1H>
##$AXRIGHT= 0
##$AXTYPE= 0
##$AXUNIT= <>
##$AZFE= 0.1
##$AZFW= 0.1
##$BCFW= 0
##$BC_mod= 0
##$BYTORDP= 0
##$COROFFS= 0
##$CY= 15
##$DATMOD= 1
##$DC= 0
##$DFILT= <>
##$DTYPP= 0
##$F1P= 0
##$F2P= 0
##$FCOR= 0.5
##$FTSIZE= 32768
##$FT_mod= 6
##$GAMMA= 0
##$GB= 0
##$INTBC= 1
##$INTSCL= 1
##$ISEN= 128
##$LB= 0
##$LEV0= 0
##$LPBIN= 0
##$MAXI= 10000
##$MC2= 0
##$MEAN= 0
##$ME_mod= 0
##$MI= 0
##$NCOEF= 0
##$NC_proc= -8
##$NLEV= 6
##$NOISF1= 0
##$NOISF2= 0
##$NSP= 0
##$NTH_PI= 0
##$NZP= 0
##$OFFSET= 14.98509
##$PC= 1
##$PHC0= 178.1543
##$PHC1= 0
##$PH_mod= 1
##$PKNL= yes
##$PPARMOD= 0
##$PPDIAG= 0
##$PPIPTYP= 0
##$PPMPNUM= 2147483647
##$PPRESOL= 1
##$PSCAL= 4
##$PSIGN= 0
##$PYNMP= <proc.py>
##$REVERSE= no
##$SF= 400.02
##$SI= 32768
##$SIGF1= 0
##$SIGF2= 0
##$SINO= 400
##$SIOLD= 32768
##$SPECTYP= <>
##$SREGLST= <1H.CDCl3>
##$SSB= 0
##$STSI= 32768
##$STSR= 0
##$SW_p= 8223.68421052631
##$SYMM= 0
##$S_DEV= 0
##$TDeff= 65536
##$TDoff= 0
##$TI= <>
##$TILT= no
##$TM1= 0
##$TM2= 0
##$TOPLEV= 0
##$USERP1= <user>
##$USERP2= <user>
##$USERP3= <user>
##$USERP4= <user>
##$USERP5= <user>
##$WDW= 1
##$XDIM= 32768
##$YMAX_p= 472039946
##$YMIN_p= -748808
##$CURPLOT= <Network HP LaserJet P1505>
##$CURPRIN= <$Network HP LaserJet P1505>
##$DFORMAT= <normdp>
##$LAYOUT= <+/1D_H.xwp>
##$LFORMAT= <normlp>
##$PFORMAT= <normpl>
##$SURQMSG= 1
$$ End of Bruker specific parameters
$$ ---------------------------------
##NTUPLES= NMR SPECTRUM
##VAR_NAME=  FREQUENCY,     SPECTRUM/REAL,   SPECTRUM/IMAG
##SYMBOL=    X,             R,               I
##VAR_TYPE=  INDEPENDENT,   DEPENDENT,       DEPENDENT
##VAR_FORM=  AFFN,          ASDF,            ASDF
##VAR_DIM=   32768,         32768,           32768
##UNITS=     HZ,            ARBITRARY UNITS, ARBITRARY UNITS
##FACTOR=    0.250966925370066, 1,           1
##FIRST=     8223.43324360094, -121195,      -59227
##LAST=      0,             21535,           25211
##MIN=       0,             -748808,         0
##MAX=       8223.43324360094, 472039946,    0
$$ Real data points
##PAGE= N=1
##DATA TABLE= (X++(R..R)), XYDATA
$$ [...]
$$ plain form
19534 -68951 14697 66284 -298036 66382 83392 -423836 46098 -133244 16203 95711 180814
19523 180814 -180162 56455 -123089 52633 35797 -154377 179193 -485 10588 -87637 34491
19511 -187608 -169061 -261314 -83939 101582 -94249 27672 18008 -279668 -151834 -362934 -226640
19500 -226640 18837 -282506 241508 78124 -178907 25766 -279037 -127568 47633 70903
19490 70903 -28851 -180854 -196063 -118534 -117157 -82999 -192993 -218719 -52253 238178 -62918
19478 -279598 -141803 -30012 -109975 32130 -33698 -61584 -359681 -17521 98282 -283222 73857
19466 -359829 -94235 -316616 47068 -26295 -190765 147901 -480443 -166029 190762 -165659
19455 32560 -51273 -518145 -49937 -208749 -106127 -148874 37334 -55008 -223063 -62556 100300
$$ packed form
19534f8951A4697N1587b98036F6382J7010d23836D6098a33244A6203P9508Q5103
19523A80814a80162E6455a23089E2633j6836a54377A79193d85A0588h7637C4491
19511a87608J8547r2253h3939A01582i4249B7672r664b79668J27834k11100J36294
19500b26640A8837b82506B41508G8124a78907B5766b79037a27568D7633K3270
19490G0903b8851j52003j5209P7529J377L4158j09994k5726e2253B38178f2918
19478b79598J37795c0012p9963C2130c3698k7886k98097a7521I8282b83222G3857
19466c59829i4235k22381D7068b6295j64470A47901d80443a66029A90762a65659
19455C2560e1273m66872d9937j58812J02622m2747C7334e5008j68055f2556A00300
$$ plain form
19443 -45311 -161803 -34390 -160328 -107878 97749 -199371 142339 -144425 -341881 -20249
19432 -347209 -376513 -45856 255379 -397147 -301794 -121346 -13381 209784 -141701 -81124
19422 -81124 17919 14981 91430 -181264 -304483 -128902 108524 -343478 -69149 -105167 293512
19410 -45985 -65961 -172002 367599 -85393 169886 21130 -95966 -38427 293423 -38791 338536
19398 -61826 -159826 -404950 -107862 119283 -99231 -8501 -66357 25910 -369998 -82755 262845
19386 31801 197992 -195814 148772 -125780 -127815 68532 -55429 -396183 6412 129382 -99434
19374 -29900 9529 -107554 202232 -33668 -80888 -341509 -541804 -123365 159033 -81660 81454
19362 23664 -154662 162692 -388429 194905 8083 -35856 -210864 245804 -51875 221730
$$ packed form
19443d5311j16492c4390j25938N2450I7749a99371A42339a44425j97456b0249
19432c47209k9304d5856B55379c97147R5353a21346a3381B09784a41701O0577
19422h1124A7919k938P6449a81264j23219a28902A08524c43478f9149l6018B93512
19410d5985j9976j06041C67599h5393A69886B1130i5966c8427B93423c8791C38536
19398f1826r8000k45124a07862A19283i9231h501n7856B5910c69998h2755B62845
19386C1801J66191a95814A48772a25780k035F8532e5429l40754F412J22970i9434
19374b9900I529a07554B02232c3668m7220k60621k00295a23365A59033h1660H1454
19362B3664a54662A62692c88429A94905H083c5856j75008B45804e1875B21730
$$ plain form
19351 126389 -212889 -69393 -159920 -70571 -150621 106530 -326205 -81251 -408554 -301708
19341 -301708 70020 -27789 63663 -384014 67023 88224 -109579 -1179 -255011 -119615 -110862
19330 -110862 -303656 302131 47030 6032 -295200 -221883 72510 -192098 -119666 45924 -282737
19318 181461 -13008 -97994 83523 -176581 -278491 63726 -150171 -182529 -449830 -255111
19308 -255111 -158887 145614 -38188 -23278 -218086 -19988 -25636 -256450 -43007 -284703 -241461
19297 -241461 -81925 236999 -156163 29505 -178427 213764 -68815 -139185 95204 -141469
19286 131301 -72370 110622 19435 -108329 -90972 -22151 43060 -248669 57766 -211200 -212487
19275 -212487 -523575 169085 -365677 -263392 386 -217934 -477525 -14973 -182271 -37560
$$ packed form
19351A26389b12889f9393r0527g0571q0050A06530c26205h1251l27303J06846
19341c01708G0020b7789F3663c84014F7023K1201a09579a179k53832a19615Q753
19330a10862j92794C02131D7030F032b95200P3317G2510a92098P2432D5924b82737
19318A81461a3008q4986H3523a76581j01910F3726a50171l2358k67301J94719
19308b55111R6224A45614c8188J4910j94808a9988n648k30814d3007k41696M3242
19297b41461h1925B36999a56163B9505a78427B13764f8815p0370I5204a41469
19286A31301g2370A10622A9435a08329J7357b2151D3060b48669E7766b11200j287
19275b12487l11088A69085c65677J02285C86b17934k59591a4973j67298c7560
$$ plain form
19264 72942 175389 -389121 222707 -331297 38420 340278 -42352 -97093 -15373 144450
19253 -22324 -203547 -68587 87243 -91168 246256 -108286 -35908 -12748 -34805 203695 158086
19242 158086 -80007 43930 203116 6512 72591 -163900 -212850 -59073 -50039 -35081 -8873 -214292
19230 -214292 -172520 305780 175759 59642 411833 -43272 -152257 271118 19918 -135246
19219 -127147 300487 -131864 63553 -36901 -88770 -315283 -13721 15938 70226 -146328 63201
19207 142645 -318707 205543 -324086 -229494 -11003 -86500 -159482 464322 -42248 -241417
19197 -241417 -213523 116311 -404101 12798 -48296 -88772 -40398 -82645 113005 97924 -128855
19185 157521 373290 -211122 -69144 151427 262647 139679 9242 21495 33591 -334205
$$ packed form
19264G2942J02447c89121B22707c31297C8420L01858d2352n4741a5373A44450
19253b2324j81223f8587H7243i1168B46256a08286c5908a2748k2057B03695m5609
19242A58086h0007D3930J59186F512O6079a63900m8950e9073R034J4958h873k05419
19230b14292M1772C05780j30021E9642L52191d3272j08985B71118A9918a35246
19219a27147C00487a31864F3553c6901n1869k26513a3721A5938N4288a46328F3201
19207A42645c18707B05543c24086R4592a1003p5497p2982D64322d2248j99169
19197b41417K7894A16311d04101A2798d8296m0476d0398m2247A13005j5081a28855
19185A57521K15769b11122f9144A51427J11220j22968I242J2253J2096c34205
$$ plain form
19174 188179 -186254 110698 327340 -86950 -211992 -214722 20027 185488 162566 -91453 -45577
19162 -175419 -148833 152864 -249102 -150780 -53020 -388336 -14425 98962 39593 -39820 -69227
19151 -69227 -136555 -271496 224015 -61331 -202847 -307557 -42109 -482595 46220 -146911
19140 3266 -133207 -229675 67124 32947 27009 -216425 -45456 389541 -306129 78813 -70658
19128 -157148 -6700 210470 -270221 327337 -7584 -184169 -318558 -132023 -96392 -53977 -314730
19117 -314730 -79515 -347662 -19584 -9363 138113 -374476 74887 -125929 -250325 -49834 -53061
19106 -53061 28501 -100463 11313 -133116 232357 164413 108932 -325217 -15046 34698 195998
19095 195998 29738 -370724 -71967 -89804 64987 -101766 -54906 -188895 175092 77180 -86507
$$ packed form
19174A88179a86254A10698K16642h6950j25042k730B0027J65461k2922i1453d5577
19162a75419K6586A52864b49102R8322e3020l35316a4425I8962C9593c9820k9407
19151f9227o7328j34941B24015f1331j41516j04710d2109m40486D6220a46911
19140C266a33207r6468F7124C2947n938b16425d5456C89541c06129G8813g0658
19128a57148f700B10470b70221C27337g584j76585j34389a32023L5631M2415k60753
19117c14730g9515k68147a9584i363A38113c74476G4887a25929j24396d9834l227
19106e3061B8501a00463A1313a33116B32357o7944n5481c25217a5046C4698J61300
19095A95998B9738c70724g1967j7837F4987a01766M6860j33989A75092G7180h6507
$$ plain form
19083 210151 -160005 423240 -130617 -87072 -70551 -141450 39901 -32983 -3919 -9591 -212305
19072 -212305 70619 -48251 87762 -161534 141522 10292 -415062 -4702 293169 -185933 -152497
19061 -152497 -65868 -175989 -177822 -189162 42101 76391 -146153 -104262 -184951 -443582 -343187
19050 -343187 -12636 -149289 -208584 -98725 -271311 -377171 139689 -21682 94116 -93143 22954
19038 202006 -8635 102384 -51222 78530 -304915 67443 -119263 91582 361454 -58041 93555
19026 -61594 355813 -168370 120946 124626 -4544 18562 -60415 131310 -924 -103916 -388282
19015 -388282 -36670 86462 7273 -434908 -272888 -381802 10934 -106724 -154029 33956 -219963
19003 -97072 -44127 -52189 -160455 145990 132789 -186024 273172 225263 -242614 -276207 76631
$$ packed form
19083B10151a60005D23240a30617M3545J6521p0899C9901c2983c919n672k02714
19072b12305G0619d8251H7762a61534A41522A0292d15062d702B93169a85933L3436
19061a52497f5868j10121j833j1340D2101L4290a46153M1891q0689k58631J00395
19050c43187a2636j36653n9295i8725j72586j05860A39689b1682I4116i3143B2954
19038B02006h635A02384e1222G8530c04915F7443a19263I1582K69872e8041I3555
19026f1594C55813a68370A20946L680d544A8562f0415A31310i24j02992k84366
19015c88282c6670H6462G273d34908J62020j08914A0934a06724m7305C3956b19963
19003i7072d4127q062j08266A45990j3201a86024B73172m7909b42614l3593G6631
$$ plain form
18991 -213779 166691 40296 -158555 -218898 -200021 -201849 23533 -144044 54769 -313677 -230466
18980 -230466 68 198136 -299310 -400072 113139 -89687 -211829 82355 18076 -346549 -212274
18969 -212274 43894 -184402 -103253 38916 -148213 -53409 10584 126466 -135323 14016 -63939
18957 -263215 -124843 -35004 34158 -3458 35372 43775 -330152 -125464 138263 -28933 141023
18945 13585 57671 110298 176094 1178 -59352 -123397 104115 -64513 -108305 -197109 -82359 -18951
18932 97188 135075 47295 -185883 19320 12807 80433 117422 50667 -240926 -240948 -87695 -323020
18920 -323020 -158435 -233145 2967 59827 123542 61232 -126040 -150216 -292662 -37382 -174803
18909 -174803 -63828 32385 311467 416466 -161770 -199480 -250831 -67601 63780 89583 213830
$$ packed form
18991b13779A66691D0296a58555o0343J8877j828B3533a44044E4769c13677Q3211
18980b30466F8J98068b99310j00762A13139h9687j22142H2355A8076c46549J34275
18969b12274D3894a84402Q1149C8916a48213e3409A0584J15882a35323A4016f3939
18957b63215a24843c5004C4158c458C5372Q403c30152a25464A38263b8933A41023
18945A3585M4086N2627O5796A178e9352o4045A04115f4513m3792q8804h2359a8951
18932I7188L7887D7295a85883A9320o513O7626L6989E0667b40926k2h7695k35325
18920c23020a58435p4710B967N6860O3715F1232a26040k4176j42446c7382j37421
18909a74803f3828C2385K79082J04999a61770l7710n1351f7601F3780K5803J24247
$$ plain form
18898 213830 159310 -27010 -246872 -179219 142085 -191168 42943 -20253 28887 108592 -410
18886 -81218 232700 -192368 163557 8955 188035 -53558 46418 -8460 -90215 39676 298809
18875 298809 -66655 -55132 131263 -173802 -327259 -34516 -94909 -127004 -111150 -160959 -197456
18864 -197456 -285285 -170765 -248951 206880 -59908 -231179 242431 -140329 22837 -279498
18853 27720 -382673 17151 -273777 162830 -159502 154504 51522 -39682 283476 53579
18842 -92719 -127701 -95910 161539 -103361 91577 60571 14472 -136865 -154056 104458 6986
18830 39249 -509636 -219745 186389 71331 -267731 -3646 -50996 -79761 253345 -47598 130266
18818 -83182 287507 -36893 -113105 23304 -201723 224558 341728 10904 384594 201714
$$ packed form
18898B13830n4520b7010k19862O7653A42085a91168D2943b0253B8887P9705d10
18886h1218B32700a92368A63557H955J79080e3558D6418h460q1755C9676K59133
18875B98809f6655J1523A31263a73802j53457c4516o0393l2095J5854m9809l6497
18864a97456q7829J14520p8186B06880e9908j71271B42431a40329B2837b79498
18853B7720c82673A7151b73777A62830a59502A54504E1522c9682B83476E3579
18842i2719l4982L1791A61539a03361I1577l1006A4472a36865j7191A04458F986
18830C9249e09636b19745A86389G1331b67731c646m7350k8765B53345d7598A30266
18818h3182B87507c6893p6212B3304b01723B24558J17170A0904L73690j82880
$$ plain form
18808 201714 -25340 -170791 -211934 -287725 93605 -61195 -131451 246897 -279564 -4471 32793
18796 -159873 34659 -108775 -444836 81491 -27925 -371274 -212561 -53521 -99102 -135247 -137514
18785 -137514 -213378 97113 -193094 -74360 -215044 274904 -55563 57391 128430 -104853 53889
18773 45736 95692 390793 -279642 -202449 -297762 -445577 -178906 -183373 254814 98688 131158
18762 131158 41864 -202006 -228332 -61808 89652 -273456 -7753 -109289 -22177 -49091 -232317
18751 -232317 185778 57168 -108736 -309540 -373414 225688 -178713 88537 80411 -242495
18740 -90188 165340 -39005 -1900 -13515 -288052 277335 -109140 -56398 13704 220393 -279460
18728 61054 110497 21459 40276 72028 -382730 -120519 -231184 61704 -238331 170139 171835
$$ packed form
18808B01714b5340j45451m1143p5791I3605f1195p0256B46897b79564d471C2793
18796a59873C4659a08775l36061H1491b7925l43349J58713e3521m5581l6145k267
18785a37514p5864I7113a93094g4360j40684B74904e5563E7391P1039a04853E3889
18773D5736M9956K95101b79642P7193r5313j47815a78906m467B54814I8688L2470
18762A31158D1864b02006k6326f1808H9652b73456g753j01536b2177k6914j83226
18751b32317A85778E7168a08736k00804o3874B25688a78713H8537q126b42495
18740i0188A65340c9005a900j1615k74537B77335a09140N2742A3704K06689b79460
18728F1054M9443B1459J8817L1752c82730a20519j10665F1704b38331A70139J696
$$ plain form
18717 171835 77406 96513 16063 -73394 -23648 153966 -73022 51194 56972 26657 -10769
18705 -159653 277504 -33706 -56560 -129962 -74346 -250712 3365 -200114 17954 -300575 84523
18693 -405052 -1270 10603 -193938 -305793 -398455 -104166 -319865 -90482 12104 59727 74913
18682 74913 -8408 -99149 -426719 -63229 -206885 -109794 192830 381189 -182720 -290255 -135965
18670 58171 -322809 -191341 -378776 -308484 -10039 276889 -125722 -62080 -257920 187405
18659 -90029 252785 -109886 70000 -164015 -283732 14074 -305732 -318430 100887 -246698
18648 -413713 -161687 -165999 190864 39203 -103172 -74748 -187549 5081 38969 16900 -140045
18636 112553 -132556 -63630 -140598 -158194 175552 -89813 -348822 55831 16502 -336887 234525
$$ packed form
18717A71835G7406J9107A6063g3394b3648A53966g3022E1194N778B6657a0769
18705a59653B77504c3706k2854p3402N5616j76366C365b00114A7954c00575H4523
18693d05052a270A0603a93938j11855r2662a04166k15699i0482A2104M7623J5186
18682G4913h408r0741l27570f3229j43656R7091A92830J88359a82720j07535a35965
18670E8171c22809J31468j87435P0292a0039B76889a25722f2080j95840A87405
18659i0029B52785a09886G0000a64015j19717A4074c05732j2698A00887b46698
18648d13713a61687m312A90864C9203a03172K8424j12801E081L3888A6900a40045
18636A12553a32556f3630p6968j7596A75552h9813k59009E5831A6502c36887B34525
$$ plain form
18624 128399 216590 251926 199655 -237335 86994 -34745 69664 308052 -524496 196642 72449
18612 -45390 -279985 75501 -134011 385583 -164058 324458 -284199 175712 17075 -375040
18601 -63435 240776 -78179 -159273 347490 -163979 -323076 215998 28211 2850 85211 96346
18590 96346 -152318 -294640 104991 87516 -39416 -193901 -183511 -1558 -354143 -123740 -64385
18579 -64385 -154154 -28670 152237 21031 81810 -344194 172691 64508 90458 99381 183897
18568 183897 -30335 -89758 -410536 83743 162191 -195420 -112058 10287 -50983 -48107 5873
18556 -105686 -69103 76330 -213821 -24918 -411972 -55990 23314 -61371 -441376 -197909 170469
18544 32231 -171916 206655 -220703 -119818 -483257 -80154 -129917 95666 -132619 -264815
$$ packed form
18624A28399Q8191L5336n2271b37335H6994c4745F9664K38388e24496A96642G2449
18612d5390k34595G5501a34011C85583a64058C24458b84199A75712A7075c75040
18601f3435B40776g8179q1094C47490a63979j59097B15998B8211B850Q2361J1135
18590I6346a52318j42322A04991j7475c9416j54485J0390a558l52585a23740N9355
18579f4385q9769b8670A52237B1031O0779c44194A72691F4508K5950Q923Q4516
18568A83897c0335n9423l20778H3743P8448a95420Q3362A0287e0983K876E873
18556a05686L6583G6330b13821b4918l87054e5990B3314f1371l80005a97909A70469
18544C2231a71916B06655b20703J00885l63439h0154m9763I5666a32619j32196
$$ plain form
18534 -264815 40395 -184657 -33663 93210 -223864 -55385 -258209 -149327 -41256 90713 -445761
18522 43893 -98115 -159973 -179959 228429 -41895 -118008 -135391 -153946 -183374 -127853 -15555
18510 319309 56457 28772 -120825 -65189 -253898 80876 -246546 -285336 -233300 -191831 -270029
18499 -270029 29295 -18609 37966 -95151 -2205 -192840 373666 -193041 -173916 4319 192660
18488 192660 27861 -232018 -328948 -107345 78478 -27084 -53742 -190848 -457618 -71357 36589
18476 -105738 -191024 -126745 -88287 -72969 85868 -307738 78053 -78430 -151868 130431 134277
18465 134277 -340856 266538 124667 158149 137235 33915 -338953 -152961 -87722 -456004
18455 -456004 145880 -411934 -151873 75014 127780 -129684 -479454 251354 60084 53985
$$ packed form
18534b64815D0395a84657c3663I3210b23864e5385k02824J08882d1256I0713d45761
18522D3893i8115o1858j9986B28429d1895p6113j7383j8555k9428N5521a5555
18510C19309E6457k7685a20825N5636j88709H0876b46546l8790N2036M1469p8198
18499b70029B9295a8609C7966i5151b205j90635C73666a93041J9125D319J88341
18488A92660B7861b32018r6930a07345G8478b7084k6658j37106k66770g1357C6589
18476a05738q5286O4279L8458J5318H5868c07738G8053g8430p3438A30431L846
18465A34277c40856B66538A24667L3482k0914C3915c38953a52961O5239l68282
18455d56004A45880d11934a51873G5014N2766a29684l49770B51354F0084o099
$$ plain form
18445 53985 88817 -27278 161658 -271615 -363849 54015 427772 -61341 -137782 307881 -68722
18433 -165097 -214688 -86762 -340544 -266432 -110096 -148604 -210718 -207472 -186114 126132 56878
18421 207260 26910 -230427 -231918 131647 -146532 -352556 103258 33572 280761 -82301
18410 -26388 158533 135821 -8110 31373 284033 153736 4967 185612 54502 -25655 44457
18398 53900 -140130 -100982 78295 221781 64544 -64286 -194878 -206372 -163537 -75343 -218277
18387 -218277 120551 -34665 -100667 -251689 -181702 -213567 51278 79858 -210274 -254027 -100795
18375 -218455 -305390 -41867 -16352 58307 94043 -68800 -146707 -39392 38225 63492 -115498
18363 46397 -52843 186332 217113 -248047 95723 -113331 -86610 -173742 1826 18129 76000
$$ packed form
18445E3985L4832b7278A61658b71615r2234E4015L73757f1341p6441C07881f8722
18433a65097m9591h6762k53782P4112a10096l8508o2114L246K1358A26132E6878
18421B07260B6910b30427j491A31647a46532k06024A03258C3572K47189h2301
18410b6388A58533k2712h110C1373K52660j30297D967J80645E4502b5655D4457
18398E3900a40130L9148G8295J43486F4544f4286j30592j1494M2835g5343j42934
18387b18277A20551c4665o6002j51022O9987l1865E1278K8580b10274m3753a00795
18375b18455q6935d1867a6352E8307L5736f8800p7907c9392C8225K5267a15498
18363D6397e2843A86332L0781b48047I5723a13331K6721q7132A826J6303N7871
$$ plain form
18352 76000 94075 7949 -185799 -259817 -13418 -60886 -46488 -14939 142105 6120 -81975 6635
18339 20213 115508 -69525 -190979 -78836 -43595 -308816 -120427 -90721 -54627 -76580 157225
18327 -235144 -171841 -112591 -121546 -5254 -85102 -244923 187694 -200551 -13908 119424 109397
18316 109397 -195415 -33584 -165404 -19957 -245158 -242211 -250783 297378 -78545 -139848 -173913
18305 -173913 14303 -63343 69950 -100205 119690 -201356 -76300 83429 46391 -51996 -91875
18294 -91875 -408941 72058 38142 -7217 -179112 -75100 224668 13331 -44469 -33854 144755
18282 -55644 -36712 -209241 73705 -194209 242784 -196422 -24843 -199148 -168754 238406
18271 -331578 -65016 -80556 327826 78748 6650 -15963 254206 -224791 124846 -205660 29230
$$ packed form
18352G6000J8075G949a85799p4018a3418m7468J4398a4939A42105F120h1975F635
18339B0213R5295f9525j21454g8836L5241k65221a20427K9706L6094k1953A57225
18327b35144O3303N9250q955e254p9848j59821A87694b00551a3908A19424j0027
18316A09397a95415c3584j31820a9957k25201K947q572B97378g8545o1303l4065
18305a73913A4303f3343F9950a00205A19690b01356g6300H3429l7038e1996l9879
18294i1875l17066G2058l3916g217j71895g5100B24668A3331d4469J0615A44755
18282e5644J8932j72529G3705a94209B42784a96422b4843j74305L0394B38406
18271c31578f5016j5540C27826G8748F650a5963B54206b24791A24846b05660B9230
$$ plain form
18259 -85928 -300 126732 -40973 58115 -18472 255440 -143615 -210065 -271112 -421291 221197
18247 6927 -18303 28590 69873 104241 -246659 -490951 41113 -8589 21799 -452795 -34531
18235 -337917 24415 396657 -187838 -169618 121803 -15892 -55790 -391694 113464 -337095
18224 80242 -21751 43474 25450 -148548 167121 -11145 65004 -57244 -13974 -191465 -195154
18213 -195154 -181455 -211356 -57999 253297 63261 59440 24350 -76317 -99547 -78113 -123253
18202 -123253 306036 -56963 251747 -259174 -216673 96294 133593 -949 351719 -67099 -106421
18191 -106421 52640 34561 -148700 84294 -34605 33656 4503 -410056 -66757 201581 -262802
18179 -117188 -290422 112968 304305 189922 -120882 -190331 -467179 45901 -335569 87661
$$ packed form
18259h5928c00A26732d0973E8115a8472B55440a43615o6450o1047j50179B21197
18247F927a8303B8590M1283L4368b46659k44292D1113h589B1799d52795c4531
18235c37917B4415L72242a87838J8220A21803a5892l9898l35904A13464c37095
18224H0242b1751D3474j8024a48548A67121a1145F5004e7244a3974j77491l689
18213a95154J3699k9901e7999B53297F3261l821B4350g6317k3230K1434m5140
18202a23253C06036e6963B51747b59174M2501I6294L7299i49C51719f7099l9322
18191a06421E2640j8079a48700H4294c4605C3656D503d10056f6757B01581b62802
18179a17188j73234A12968J91337j14383a20882o9449k76848D5901c35569H7661
$$ plain form
18168 -217133 340985 -225833 -76773 130430 -119236 78036 -317353 187226 -103939 8976
18157 -120072 270902 -197136 15866 211772 293576 -291238 -239711 146358 256123 -298332
18146 -400496 -283262 153570 -21046 -197046 -153885 100016 45982 -278609 -169335 -223593
18136 -223593 118889 180999 190950 -198499 5669 26082 -306165 298169 -201505 128417 105487
18125 105487 -61076 -115918 -233805 122727 403273 -7513 146583 -207926 -194672 -36420 50333
18113 -250745 -36799 183576 -237822 -60043 76876 -41481 -198954 -221205 -5785 81317 -368486
18101 -110841 -26180 -287035 380832 -74266 -54407 -12703 -315184 71560 -142912 3548 -232497
18089 -437167 245339 -71264 -254888 -156274 110135 99361 94171 -154061 36569 -174640 51018
$$ packed form
18168b17133C40985b25833g6773A30430a19236G8036c17353A87226a03939H976
18157a20072B70902a97136A5866J95906Q1804b91238N1527A46358J09765b98332
18146d00496J17234A53570b1046j76000M3161A00016D5982b78609J09274n4258
18136b23593A18889O2110R951a98499E669K0413c06165B98169b01505A28417k2930
18125A05487f1076n4842j17887A22727K80546g513A46583b07926J3254c6420E0333
18113b50745c6799A83576b37822f0043G6876d1481j57473k2251e785H1317c68486
18101a10841b6180k60855C80832g4266J9859a2703l02481G1560a42912C548b32497
18089d37167B45339g1264j83624R8614A10135j0774n190a54061C6569a74640E1018
$$ plain form
18077 -297409 446740 111695 246784 -71196 51852 203122 65160 -228638 -127140 7746
18066 -274926 101197 -151852 113903 -457631 230635 13025 51003 -370890 23551 -186226
18055 444289 -35352 -98293 -200214 -242535 -135615 6954 -91782 106793 -160883 -437584 -214038
18043 132190 6901 -37715 158841 -221825 -15181 -145961 118923 -216953 303042 146532
18032 -50899 475112 97196 255494 -109947 -209107 -216627 -17239 -73480 239864 -307470 -182601
18021 -182601 -477 -263858 185222 -175899 253453 15296 283242 37695 -205260 -57927 45334
18009 99845 -47144 -36672 279375 -284775 -226345 27539 32072 -15285 19947 -58710 -173760
17998 -173760 -313852 320004 242121 -3492 -189471 128314 414807 273887 -164589 -65961
$$ packed form
18077b97409D46740A11695J35089g1196E1852J51270F5160b28638J01498G746
18066b74926A01197a51852A13903d57631B30635A3025L7978c70890B3551a86226
18055D44289c5352o2941j01921m2321J06920F954i1782A06793a60883k76701b14038
18043A32190F901c7715A58841b21825a5181j30780A18923b16953C03042A46532
18032e0899D75112I7196J58298a09947r9160p520a7239n6241B39864c07470J24869
18021a82601d77k63381A85222a75899B53453A5296K67946C7695b05260e7927D5334
18009I9845d7144J0472B79375b84775N8430B7539M533a5285A9947e8710j15050
17998a73760j40092C20004p7883c492j85979A28314K86493j40920a64589f5961
$$ plain form
17987 -323194 -407116 -7302 270643 -89028 6033 -89604 -172114 -377994 -63184 128825 217404
17976 217404 -153017 -24569 153526 61663 -111386 -468375 -40463 -242005 -14831 41274
17965 -146566 -42641 117990 144789 -228022 -44442 249329 -31500 67991 20326 -318147 -220121
17954 -220121 164577 94106 -124794 98204 -164644 131239 305013 -51965 -112559 -385833
17944 -385833 181640 -86852 -159954 -170754 9492 103583 -179963 272722 175097 -154660 -254076
17933 -254076 17258 -33102 413034 -42725 214139 194402 -181543 209829 -61275 -625411
17923 -625411 -8950 -177198 -40531 417162 59450 -52959 343466 -29470 -274882 85968 118432
17912 118432 -47781 254334 -84976 -221358 39193 185860 115730 -51947 186681 72138 96156
$$ packed form
17987c23194q3922g302B70643h9028F033h9604q2510k05880f3184A28825Q8579
17976B17404a53017b4569A53526F1663a11386l56989d0463k01542a4831D1274
17965a46566d2641A17990K6799b28022d4442B49329c1500F7991B0326c18147R8026
17954b20121A64577p0471a24794I8204a64644A31239J73774e1965o0594k73274
17944c85833A81640h6852p3102j0800I492R4091a79963B72722r7625a54660r9416
17933b54076A7258c3102D13034d2725B14139j9737a81543B09829f1275n64136
17923f25411h950j68248d0531D17162E9450e2959C43466b9470k45412H5968L2464
17912A18432d7781B54334h4976j36382C9193J46667p0130e1947A86681G2138K4018
$$ plain form
17901 96156 -26205 2440 -28208 -49439 283823 -329724 87368 -63245 -112736 -187802 -120928
17890 -120928 -204357 -115994 241820 137809 237912 -197981 184490 1739 -239466 -256212
17880 -256212 313747 335134 111028 -50127 -341456 78573 -58748 -149191 13906 -114460 25791
17868 -84165 -18964 48388 -195789 -69934 -82654 -212591 -185106 11792 276968 239326 -351339
17856 124491 -11849 -52941 -51785 -59583 58215 245742 -293438 -534167 -267673 -120034 -54042
17844 115678 142958 -93220 -8253 -329088 131216 229340 244978 131421 12635 196005 -189698
17832 272340 44659 199603 -93953 -328222 299606 -168345 -156637 -41133 -199991 88125
17821 187030 372487 -132324 117251 295662 -48616 -192170 92374 -19209 -199783 30062
$$ packed form
17901I6156b6205B440b8208k1231B83823c29724H7368f3245m9491p5066O6874
17890a20928q3429Q8363B41820j04011J00103a97981A84490A739b39466j6746
17880b56212C13747K1387A11028e0127k91329G8573e8748r0443A3906a14460B5791
17868h4165a8964D8388a95789f9934j2720j29937K7485A1792K65176l7642c51339
17856A24491a1849m1092J156p798E8215J87527b93438k40729K66494a20034e4042
17844A15678K7280i3220h253l20835A31216R8124J5638j13557A2635J83370a89698
17832B72340D4659J54944i3953k34269B99606a68345J1708d1133j58858H8125
17821A87030J85457a32324A17251J78411d8616j43554I2374a9209j80574C0062
$$ plain form
17810 11083 -38008 -184071 39410 35621 -20896 -310307 222153 -250400 -143564 44698 -112638
17798 -116958 -252323 145186 13361 -231319 112489 -337900 285781 131445 195261 127495
17788 127495 -557455 -112542 -268614 210930 -1966 -15075 -101713 -7529 218180 -293281 142430
17776 127645 -18853 -99606 -140258 98673 -322412 -353638 -136821 81432 124578 -32263 48277
17764 -251132 -160226 -82957 -108079 -9988 67991 -64669 -9970 -156137 -75594 189963 -71079
17752 -52007 22451 -10795 -71384 -83407 -65945 -335312 76411 113306 391895 -103364 9086
17740 -158656 1706 -55060 146515 136860 97775 -131220 126009 -337052 -199883 -75330 40395
17728 288806 -37652 -98082 241130 284204 216451 314669 -120737 153381 -283072 -83796 -16015
$$ packed form
17810A1083c8008j46063C9410l789b0896k89411B22153b50400J06836D4698a12638
17798a16958j35365A45186A3361b31319A12489c37900B85781A31445O3816o7766
17788A27495e57455a12542j56072B10930a966j3109q6638g529B18180b93281A42430
17776A27645a8853q0753m0652I8673c22412l1226a36821H1432M3146c2263D8277
17764b51132R0906P7269k5122i988F7991f4669i970j46167g5594A89963g1079
17752e2007B2451a0795o0589j2023J7462k69367G6411L6895K78589a03364I086
17740a58656A706e5060A46515r655l9085a31220A26009c37052J37169g5330D0395
17728B88806c7652o0430B41130M3074o7753R8218a20737A53381b83072h3796a6015
$$ plain form
17716 -275186 74132 -401581 157076 13582 74499 87210 169977 18828 -170824 -162424 10569
17704 67923 242969 70511 -52351 -117016 -87152 263646 103390 208213 -84260 -83984 -216219
17693 -216219 -123788 -145781 -334480 -15957 -59850 -128809 36706 125629 -69526 7323 -106049
17681 -286846 9262 15215 134611 63118 -309196 144930 11986 -258743 499050 -37420 90591
17669 -262077 -10523 267167 -52394 -180733 -62405 407526 -243437 16111 141199 -343366
17658 171842 344462 -339685 166941 203631 -229479 45000 -3357 -216320 1200 -121257 215790
17646 -47752 129644 60207 -418012 -195971 19815 -42279 -289406 216125 405468 -124665
17635 337533 69983 126860 22770 136794 35692 85289 -132528 316430 210604 96180 -280812
$$ packed form
17716b75186G4132d01581A57076A3582O0917J2711Q2767A8828a70824Q400A0569
17704F7923J75046G0511e2351o4665K9864B63646A03390J04823h4260K76j32235
17693b16219R2431k1993j88699a5957m3893o8959C6706Q8923f9526G323a06049
17681b86846I262N953J19396F3118c09196A44930A1986b58743D99050c7420I0591
17669b62077a0523B67167e2394j28339f2405D07526b43437A6111J25088c43366
17658A71842J72620c39685A66941L6690b29479D5000c357k12963A200a21257B15790
17646d7752A29644F0207d18012a95971A9815d2279k47127B16125J89343a24665
17635C37533F9983N6877B2770J14024C5692M9597a32528C16430j05826I6180b80812
$$ plain form
17623 -10428 147974 -42165 -359011 129178 186794 -28614 90100 -36802 59382 -175450 -184613
17612 -184613 -103281 -245867 1538 -251548 -189392 214224 -107359 -156644 -49096 166685 237062
17601 237062 -127629 14214 209478 55371 132272 271115 -90883 -58104 -197672 59863 117591
17590 117591 188729 -7475 39517 326287 165834 74077 72923 -117840 -275757 157222 -48815
17578 146379 145859 -29809 194500 67401 -137817 -180398 126824 -106646 -39899 -145250 -159499
17567 -159499 118051 96580 199293 145898 61594 87330 -102417 -58661 -38467 287317 -92100
17555 1419 146392 11386 -316065 19848 30622 389834 81031 23130 95997 -316640 -206019
17544 -206019 -3306 -252545 74082 237172 -31002 -51504 -260253 52390 225569 -150892 -128175
$$ packed form
17623a0428A47974d2165l16846A29178N7616b8614I0100c6802E9382a75450r163
17612a84613Q1332j42586A538b51548O2156B14224a07359m9285d9096A66685P0377
17601B37062a27629A4214J95264E5371P6901J38843i0883L2779j39568E9863N7728
17590A17591P1138g475C9517K86770j60453G4077j154a17840j57917A57222d8815
17578A46379n20b9809A94500F7401a37817m2581A26824a06646c9899j05351j4249
17567a59499A18051k1471J02713n3395F1594K5736a02417M3756K0194B87317i2100
17555A419J44973A1386c16065A9848J0774L59212H1031B3130P2867c16640J10621
17544b06019c306k49239G4082J63090c1002k0502k08749E2390J73179a50892K2717
$$ plain form
17533 -128175 216095 -35533 379319 -22783 8404 53363 -90663 91724 79658 -164227 -99185
17522 -99185 172017 43964 -27480 184552 3200 26178 467624 86834 197528 132226 59809
17510 -216608 321617 -258479 172594 193771 300009 406719 80881 -153503 115146 37429
17499 -167412 181863 185757 -1966 10996 -39931 118355 167111 179298 198725 -79665 -72450 8198
17486 -581 -237207 321116 89215 412256 112658 -32926 149172 -180596 103972 72734 276430
17475 276430 78573 197755 -193863 116502 316231 207775 103777 84873 183426 236387
17465 236387 187574 157051 211304 132755 241232 -131864 17602 34082 -44605 242024 126282
17454 126282 109107 127367 311306 262269 216139 338697 -40058 258494 474497 -27610 198125
$$ packed form
17533a28175B16095c5533C79319b2783H404M4959i0663I1724j2066a64227O5042
17522i9185A72017D3964b7480A84552C200K2978M41446H6834J10694o5302E9809
17510b16608C21617b58479A72594K1177J06238J06710H0881a53503A15146C7429
17499a67412A81863L894a966A0996c9931A18355M8756J2187J9427g9665P215H198
17486e81k36626C21116H9215L23041A12658c2926A49172a80596A03972l1238K03696
17475B76430G8573J19182a93863A16502J99729j08456A03777j8904R8553N2961
17465B36387m8813l0523N4253p8549J08477a31864A7602J6480d4605B42024j15742
17454A26282j7175J8260J83939m9037m6130J22558d0058B58494K16003b7610A98125
$$ plain form
17442 180748 21794 -46026 326359 85923 74136 429769 25958 174144 173167 183894 452895
17431 452895 174425 127223 273563 4631 -714 419813 28311 176729 26713 -91979 267532
17419 324535 264398 461228 287627 177561 224062 -11117 62688 309393 -72443 205459
17408 -137718 63073 -1925 180661 -262410 -250883 50769 108113 -824 293300 183197 115530
17397 115530 235077 84306 6178 -121445 -345700 218245 38811 270358 253985 150233
17387 150233 156152 -14162 122064 98258 172345 306307 -109665 11270 -255752 499766 143966
17375 -13079 130210 94622 91171 216217 28509 285987 191485 262850 10408 315179 207455
17364 207455 -251200 108432 136869 352869 168242 270227 183692 48127 129078 -126119
$$ packed form
17442A80748B1794d6026C26359H5923j1787L55633B5958J48186r77J0727K69001
17431D52895A74425m7202J46340D631g14D19813B8311J48418B6713i1979B67532
17419C24535o0137J96830j73601j10066M6501a1117F2688K46705g2443B05459
17408a37718F3073a925A80661b62410J1527E0769N7344h24B93300j10103o7667
17397A15530J19547H4306F178a21445k24255B18245C8811K31547j6373j03752
17387A50233N919a4162A22064k3806P4087J33962a09665A1270b55752D99766A43966
17375a3079A30210l5588l451J25046B8509K57478r4502P1365A0408L04771j07724
17364B07455b51200A08432K8437K16000A68242J01985q6535D8127Q0951a26119
$$ plain form
17353 518447 342034 279277 81093 9035 -186332 5769 217253 232451 213329 159717 134527
17342 134527 210569 -66508 -131194 553825 147604 165104 111594 9465 -157772 74443 105366
17331 105366 300310 -231634 114160 113694 221086 -3052 80606 7406 -6921 239535 -18985
17319 319055 283431 -115876 17711 45533 -90475 -463861 250833 14785 124263 116756 59421
17308 59421 148651 375064 269020 209442 9278 224208 107530 161894 -94011 268234 173783
17297 173783 275045 -262188 -161634 187329 202039 97491 80475 -113348 197520 276685
17287 276685 47129 -72074 326951 -55299 26409 -74061 59558 161497 329753 65910 49568
17276 49568 319241 240196 -81862 132023 -64661 268820 -150078 371393 122075 -117663
$$ packed form
17353E18447j76413o2757H1093I035a86332E769K11484J5198j9122n3612k5190
17342A34527P6042f6508o4686E53825A47604J7500n3510I465a57772G4443L0923
17331A05366J94944b31634A14160m66J07392c052H0606G406f921B39535a8985
17319C19055l5624a15876A7711K7822i0475l73386B50833A4785J09478p507n7335
17308E9421Q9230K26413j06044n9578I278K14930A07530N4364i4011B68234r4451
17297A73783J01262b62188J00554A87329J4710I7491j7016a13348A97520P9165
17287B76685D7129g2074C26951e5299B6409g4061E9558J01939J68256F5910j6342
17276D9568K69673p9045h1862A32023f4661B68820a50078C71393A22075a17663
$$ plain form
17265 371974 -14085 -4120 343380 -152844 64905 413131 89684 117842 387265 129720 91243
17254 91243 -47574 251541 240549 90308 53296 526848 41445 531787 167522 215648 -214181
17242 280536 56082 120767 487807 -11277 539421 13234 154968 250805 173384 219513 327374
17231 327374 -12659 159769 271010 163041 410111 266906 147512 176893 490767 25616
17220 200980 148777 -58782 9401 462168 117091 -334584 420415 -134672 356670 86360
17209 218939 142467 322410 -18042 122012 277537 328622 -30314 300363 70906 134979 44081
17197 216090 27968 219230 409319 -18864 229091 -118851 552027 347014 -561 369367
17186 206359 271185 277193 412487 372690 341223 296989 -113073 293278 16085 218935 -67558
$$ packed form
17265C71974a4085d120C43380a52844F4905L48226H9684K8158K69423A29720l8477
17254I1243d7574B51541j0992I0308l7012M73552D1445M90342A67522M8126b14181
17242B80536E6082O4685L67040a1277E39421A3234J41734R5837p7421M6129J07861
17231C27374a2659A59769J11241j07969K47070j43205j19394K9381L13874B5616
17220B00980n2203e8782I401M52767A17091c34584D20415a34672C56670H6360
17209B18939p6472J79943a8042A22012J55525N1085c0314C00363G0906O4073D4081
17197B16090B7968J91262J90089a8864B29091a18851E52027k05013e61C69367
17186B06359O4826O008J35294l9797l1467m4234a13073B93278A6085K02850f7558
$$ plain form
17174 14120 268413 -136240 443004 205893 15875 137005 251190 -12878 575501 329216
17164 329216 127439 187035 231128 398402 140481 -30782 199569 -147319 328624 -8045
17153 160485 507016 329838 118419 205617 309489 405268 551482 188288 283452 410319
17143 410319 479383 237802 235659 190766 418073 441454 -94966 269550 256036 405791 413674
17132 413674 258641 56386 -43486 443475 424600 101299 164676 199169 853 284003 344798
17121 344798 86540 467185 245198 124918 -64921 369256 75549 413946 196184 568675
17111 568675 392788 83296 253569 28302 274680 183838 63648 314027 121261 363674
17101 363674 522858 317448 169508 -17625 203579 401159 214624 503432 371528 139578
$$ packed form
17174A4120K54293a36240D43004B05893A5875J21130J14185a2878E75501k46285
17164C29216A27439N9596M4093J67274A40481c0782A99569a47319C28624h045
17153A60485L46531j77178A18419Q7198J03872R5779J46214A88288R5164J26867
17143D10319O9064B37802k143m4893K27307K3381i4966B69550j3514J49755P883
17132D13674j55033E6386d3486D43475j8875A01299O3377L4493H53K83150O0795
17121C44798H6540L80645k21987j20280f4921C69256G5549L38397A96184L72491
17111E68675j75887H3296J70273B8302K46378r0842F3648K50379A21261K42413
17101C63674J59184k05410j47940a7625B03579J97580j86535K88808j31904A39578
$$ plain form
17090 521596 321513 288128 221484 319654 312089 -42530 541501 230949 446957 241903 538551
17079 538551 -82068 360600 393777 392554 432632 432952 317414 12968 731935 414382 207141
17067 29676 361186 624772 722956 263262 333106 436224 631989 444318 432181 381469
17057 381469 273479 645367 511394 348247 -235071 101328 256378 664248 306677 403505
17047 403505 368806 448222 330440 387102 670391 547783 164482 542270 495923 435193
17037 435193 508996 311717 672477 392932 174390 388692 471293 326859 333296 587447
17027 587447 799368 706245 340685 685493 526507 584485 587282 493781 59945 562554 631991
17016 631991 322650 668057 636848 293221 749270 497910 603055 353942 621503 735579
$$ packed form
17090E21596k00083l3385o6644R8170p565d2530E41501B30949K16008k05054K96648
17079E38551h2068C60600L3177j223M0078L20j15538A2968P18967l17553B07141
17067B9676L31510K63586R8184B63262O9844J03118J95765j87671j2137n0712
17057C81469j07990L71888j33973j63147b35071A01328J55050M07870C06677R6828
17047D03505l4699P9416j17782N6662K83289j22608A64482L77788m6347o0730
17037D35193P3803j97279L60760k79545A74390K14302Q2601j44434O437K54151
17027E87447K11921r3123C40685L44808j58986N7978K797r3501E9945N02609O9437
17016F31991l09341L45407l1209B93221M56049k51360J05145k49113K67561J14076
$$ plain form
17006 735579 519746 783288 884285 451978 607422 633588 678982 675615 793459 630596
16996 630596 675734 372327 428456 659300 877245 453316 388626 274976 505374 587375
16986 587375 857663 911470 625228 785629 958155 557974 890191 445789 641819 824834
16976 824834 330218 996362 840326 764781 806213 952623 572741 651727 717424 884816
16966 884816 778213 1032450 1033095 858667 929782 737579 844970 1093138 868793 924326
16956 924326 671724 985749 832882 1051126 876946 941277 909881 834596 996354 440751
16945 671894 1047305 1070580 817162 546875 974847 833941 1054067 996953 1050513 1163707
16935 1163707 884750 898429 965637 1462865 1125078 1161285 947472 797237 970143 792905
$$ packed form
17006G35579k15833K63542J00997m32307J55444K6166M5394l367J17844j62863
16996F30596M5138l03407N6129K30844K17945m23929o4690j13650K30398Q2001
16986E87375K70288N3807k86242J60401J72526m00181L32217m44402J96030J83015
16976H24834C30218O66144j56036p5545M1432J46410l79882P8986O5697J67392
16966H84816j06603K54237O45j74428P1115j92203J07391K48168k24345N5533
16956I24326k52602L14025j52867K18244j74180O4331l1396p5285J61758D40751
16945F71894L75411K3275k53418k70287M27972j40906K20126n7114N3560J13194
16935A163707k78957J3679O7208M97228l37787L6207k13813j50235J72906j77238
$$ plain form
16925 792905 1057027 1024475 1109502 1193024 1062348 1234843 1119082 1230958 1400472 1104796
16915 1104796 1425789 1343425 1217320 1353307 1145015 1192498 1440023 1144847 1048216 1369232
16905 1369232 981861 1257635 1397642 1637195 1574940 1372754 1418171 1950075 1564380 1588084
16895 1588084 1340883 1612320 1699751 1376407 1735941 1478981 1464313 1853777 1978459 1819820
16885 1819820 1834001 1783552 2035196 1614616 1755375 1787335 1711351 1791390 2029170 2266179
16875 2266179 1803701 2063321 2069321 1968333 1778507 2028081 2193815 2139142 2286478 2057222
16865 2057222 2479875 2237210 2417414 2021504 2234888 2107513 2813304 2308041 2691296
16856 2691296 2471029 2800954 2874267 2500046 2929657 2600826 2734036 2853528 2989720 2771098
$$ packed form
16925G92905K64122l2552Q5027Q3522j30676J72495j15761J11876J69514k95676
16915A104796L20993q2364j26105J35987k08292M7483K47525k95176r6631L21016
16905A369232l87371K75774J40007K39553o2255k02186M5417N31904l85695K3704
16895A588084k47201K71437Q7431l23344L59534k56960j4668L89464J24682j58639
16885A819820J4181n0449K51644m20580J40759L1960p5984Q0039K37780K37009
16875B266179m62478K59620O000j00988j89826K49574J65734n4673J47336k29256
16865B057222M22653k42665J80204l95910K13384j27375P05791n05263L83255
16856B691296k20267L29925P3313l74221M29611l28831J33210J19492J36192k18622
$$ plain form
16846 2771098 2654402 3035118 2812279 2900915 2924192 3339715 3229437 3256983 3351368 3387344
16836 3387344 3665931 3678237 3758480 3700338 3696255 3902955 3862319 3968036 3897272 4134851 4012155
16825 4012155 4442088 4073377 4314243 4361309 4215639 4759341 4356408 4716146 4524400 5045798
16815 5045798 4958485 4956144 5024742 5114992 5283806 5660630 5314261 5724215 6193673 5877159
16805 5877159 6239119 6536251 6634783 6771522 6704713 7013700 7250617 7213409 7772410 7781165
16795 7781165 7751361 7960982 8207038 8388255 8571558 8741034 9073132 9138404 9674597 9967026
16785 9967026 10323913 10645216 10573329 10742446 11270338 11420946 11887273 12539774 12868434 13336410
16775 13336410 13798080 14422291 14582257 14880658 15215412 15880426 16331929 17034641 17713636
$$ packed form
16846B771098j16696L80716k22839Q8636K3277M15523j10278K7546R4385L5976
16836C387344K78587J2306Q0243n8142m083K06700m0636J05717p0764K37579j22696
16825D012155M29933l68711K40866M7066j45670N43702m02933L59738j91746N21398
16815E045798q7313k341O8598R0250J68814L76824l46369M09954M69458l16514
16805E877159L61960K97132R8532J36739o6809L08987K36917l7208N59001Q755
16795G781165k9804K09621K46056J81217J83303J69476L32098O5272N36193K92429
16785I967026L56887L21303p1887J69117N27892J50608M66327O52501L28660M67976
16775A3336410M61670O24211J59966K98401L34754O65014M51503P02712O78995
$$ plain form
16766 17713636 18689419 19090858 19861972 20354157 21274413 22305372 23061263 24314229 25143770
16757 25143770 26258090 27394148 28773535 29757314 31281043 32856902 34135993 35917979
16749 35917979 37814568 39940641 42227837 44136804 46920833 49097091 52343492 55098211
16741 55098211 58365405 61892911 65525781 69678712 73707084 78722878 83937456 89244909
16733 89244909 95212630 101202888 107969715 115302560 122612527 130238971 138410576 146845471
16725 146845471 154852017 163352753 171111693 178944527 185860319 191791319 196308565 199641093
16717 199641093 201708404 202266215 201324857 198646345 194354309 189158006 182652493 175446785
16709 175446785 167921528 159471489 150994952 142567303 134303106 126181890 118243091 110914948
$$ packed form
16766A7713636R75783M01439P71114M92185R20256J030959P55891J252966Q29541
16757B5143770J114320J136058J379387R83779J523729J575859J279091J781986
16749C5917979J896589K126073K287196J908967K784029K176258L246401K754719
16741E5098211L267194L527506L632870M152931M028372N015794N214578N307453
16733H9244909N967721N990258O766827P332845P309967P626444Q171605Q434895
16725A46845471Q006546Q500736P758940P832834O915792N931000M517246L332528
16717A99641093K067311N57811r41358k678512m292036n196303o505513p205708
16709A75446785p525257q450039q476537q427649q264197q121216p938799p328143
$$ plain form
16701 110914948 103966224 97214250 91808889 85699035 80274624 75361724 70558146 66483193
16693 66483193 62831674 58938205 55657077 52311176 49652153 46846766 44171885 41677463
16685 41677463 39949870 37573608 36234020 34343629 32465923 30800462 29523855 28241531
16677 28241531 27158342 25948313 24637291 23919127 22516782 21725066 20688673 20118866
16669 20118866 19264143 18328526 17867413 17361468 16540535 15847738 15655059 14824220 14958038
16660 14958038 13706841 13312512 13091030 12539017 12069481 11344232 11295258 10949101 10529673
16651 10529673 10275203 10374484 9701235 9512938 9444186 9085083 8925924 8677657 8135058 8252178
16641 8252178 7409178 7644752 7565079 7360304 6954505 7054977 6894919 6577330 6699047 6366085
$$ packed form
16701A10914948o948724o751974n405361o109854n424411m912900m803578m074953
16693F6483193l651519l893469l281128l345901k659023k805387k674881k494422
16685D1677463j727593k376262j339588j890391j877706j665461j276607j282324
16677B8241531j083189j210029j311022p18164j402345p91716j036393n69807
16669B0118866q54723r35617m61113n05945q20933o92797j92679q30839J33818
16660A4958038j251197l94329k21482n52013m69536p25249m8974l46157m19428
16651A0529673k54470R9281o73249j88297o8752l59103j59159k48267n42599J17120
16641H252178q43000K35574p9673k04775m05799J00472j60058l17589J21717l32962
$$ plain form
16631 6366085 6186148 5844523 5985050 5973193 5613160 5317602 5269537 5463668 4952385 5017734
16621 5017734 4824838 4553509 4317035 4563071 4543240 4154559 4321186 3942354 4302417 4085261
16611 4085261 4044509 3740226 3708735 3789587 3856170 3598420 3493218 3377721 3576412 3448401
16601 3448401 3552248 3214075 3265420 3232266 3013261 2971755 3033904 2976281 3050990 2897847
16591 2897847 2961799 2730181 2695012 2576301 2750061 2518133 2432930 2481524 2172035 2412778
16581 2412778 2240897 2478692 1990916 2335226 2293317 2376391 2094340 2151581 2101000 2203066
16571 2203066 1948939 1854602 1847901 2073490 1633663 1855811 1644981 1716875 1631532 2172200
16561 2172200 1630603 1590167 1678963 1921838 1514472 1609251 1630399 1614443 1674769 1734517 1318393
$$ packed form
16631F366085j79937l41625J40527j1857l60033k95558m8065J94131n11283O5349
16621E017734j92896k71329k36474K46036j9831l88681J66627l78832L60063k17156
16611D085261m0752l04283l1491Q0852O6583k57750j05202j15497J98691j28011
16601C448401J03847l38173N1345l3154k19005m1506O2149n7623P4709j53143
16591B897847O3952k31618l5169j18711J73760k31928q5203M8594l09489K40743
16581B412778j71881K37795m87776L44310m1909Q3074k82051N7241n0581J02066
16571B203066k54127r4337o701K25589m39827K22148k10830P1894q5343N40668
16561B172200n41597m0436Q8796K42875m07366R4779K1148j5956O0326N9748m16124
$$ plain form
16550 1318393 1292715 1653251 1547042 1410160 1611753 1085101 1384486 1610055 1273345 1589649
16540 1589649 1414803 1341875 1268790 1150802 1130829 1225722 1566939 1108343 1125528 1291338
16530 1291338 1211202 1022775 1354572 1010172 784597 1364908 1121639 1118701 892542 1144322
16520 1144322 852813 1278046 1222467 845399 877074 1165255 1308513 1260077 730298 726934
16510 726934 850430 1155807 1034615 987389 950881 1169784 1044830 952788 867972 879069
16500 879069 636076 987267 900090 1004107 762187 764891 1091357 775456 620977 617000
16490 617000 903928 443319 1006719 421971 596915 423183 796805 1014798 948349 1039730
16480 1039730 876277 718876 593085 858156 540835 594901 1016875 804762 650544 803766
$$ packed form
16550A318393k5678L60536j06209j36882K01593n26652K99385K25569l36710L16304
16540A589649j74846p2928p3085j17988j9973R4893L41217m58596J7185J65810
16530A291338q0136j88427L31797l44400k25575N80311k43269k938k26159K51780
16520A144322k91509M25233n5579l77068L1675K88181J43258m8436n29779l364
16510G26934J23496L05377j21192m7226l6508K18903j24954r2042q4816J1097
16500H79069k42993L51191q7177J04017k41920K704L26466l15901j54479l977
16490F17000K86928D43319N63400D21971J74944j73732L73622K17993o6449R1381
16480A039730j63453j57401j25791K65071l17321N4066M21974k12113j54218J53222
$$ plain form
16470 803766 706327 207155 733271 757346 916529 575150 632770 619960 547444 421202
16460 421202 792309 436328 749419 529704 370116 605794 464098 754187 267155 767431
16450 767431 416669 413494 693166 571626 653975 617737 619467 646613 414526 374878 155816
16438 437269 152798 339055 281988 601347 241320 568240 457528 307156 389023 422384
16428 422384 319373 497433 327052 265143 271968 720873 904051 428886 331323 401987
16418 401987 631931 502856 578447 364081 790440 219915 471050 450480 404303 438016
16408 438016 304089 757375 313875 199574 477686 400750 580319 508420 719695 460985
16398 460985 284779 382445 408672 412944 213232 333217 383816 190795 329300 -58160 350387
$$ packed form
16470H03766r7439B07155N26116K4075J59183l41379N7620j2810p2516j26242
16460D21202L71107l55981L13091k19715j59588K35678j41696K90089B67155N00276
16450G67431l50762l175K79672j21540Q2349l6238J730K7146k32087l9648A55816
16438D37269A52798J86257n7067L19359B41320L26920j10712j50372Q1867L3361
16428D22384j03011J78060j70381o1909O825M48905J83178D28886r7563P0664
16418D01987K29944j29075P5591k14366M26359B19915K51135k0570m6177L3713
16408D38016j33927M53286C13875j14301K78112p6936J79569p1899K11275k58710
16398D60985j76206R7666K6227M272j99712J19985N0599A90795J38505e8160C50387
$$ plain form
16386 497367 256409 164497 324342 471632 216551 414497 341287 290930 231242 448123
16376 448123 183541 208091 517239 72622 197729 145271 -7704 387143 189255 363866
16366 363866 365982 522050 430252 279103 -12434 610060 390875 364090 392193 131034 330122
16355 330122 191627 333716 231939 -57814 51596 328577 137561 559191 105269 181283
16345 181283 195860 130740 119595 596157 -74863 30336 183612 167149 355966 -12388 68217
16333 644115 431276 507663 97673 -1745 220245 121309 -100003 6667 232834 265003 234541
16322 234541 -162388 415294 135871 -32235 195940 371816 463601 211196 325054 -80573
16311 9875 154644 220390 381218 143573 341762 -104074 200274 377670 363977 456539
$$ packed form
16386D97367k40958r1912J59845J47290B16551J97946p3210n0357n9688K16881
16376D48123A83541K4550L09148G2622J25107n2458g704C87143A89255J74611
16366C63866K116J56068r1798j51149a2434F10060k19185k6785K8103A31034J99088
16355C30122j38495J42089j01777e7814E1596K76981A37561M21630A05269P6014
16345A81283J4577o5120j1145M76562g4863C0336J53276j6463J88817a2388F8217
16333F44115k12839P6387I7673a745B20245r8936a00003F667K26167L2169l0462
16322B34541a62388D15294A35871c2235A95940J75876R1785B11196J13858h0573
16311I875J44769O5746J60828A43573J98189a04074B00274J77396j3693R2562
$$ plain form
16301 456539 262075 149482 9847 312390 562132 -45369 43877 -79099 282687 79084 97301
16290 97301 24314 106468 138999 154712 254191 157437 374645 99082 214324 102438 406163
16279 406163 288975 327003 129975 210226 -38717 270635 242874 199459 225977 66973 200979
16268 200979 153968 -149453 -41484 315070 385287 12544 468910 405342 400170 434531 101583
16256 391154 215451 174382 66156 301501 -53747 72900 192655 448560 215974 58738
16245 17696 97275 36175 -3681 296428 194646 38582 384204 452746 -57021 660060 -20871
16233 330984 226106 -119697 -73219 -133994 114396 73132 -45572 -238031 417797 34665
16222 123490 -189428 89354 79356 272291 243722 112886 215804 203268 251109 -68572 19969
$$ packed form
16301D56539j94464j12593I847L02543K49742d5369D3877g9099B82687G9084J8217
16290I7301B4314Q2154L2531J5713R9479r6754K17208I9082J15242A02438L03725
16279D06163j17188L8028A29975Q0251c8717B70635k7761m3415K6518F6973J34006
16268B00979m7011a49453d1484C15070P0217A2544M56366o3568n172L4361A01583
16256C91154j75703m1069F6156K35345e3747G2900J19755K55905B15974E8738
16245A7696P9579C6175c681B96428j01782C8582L45622O8542e7021F60060b0871
16233C30984j04878a19697M6478o0775A14396m1264d5572j92459D17797C4665
16222A23490a89428H9354r998J92935k8569A12886J02918j2536M7841f8572A9969
$$ plain form
16210 70559 418315 241461 -96978 -163001 1427 -75791 157943 -11403 -74655 340253 -41907
16198 -229220 -116506 -61467 212204 -97382 40354 -207907 50233 -274528 214259 145253
16188 145253 41771 -44010 -134132 -53856 235181 -100797 68566 81875 28715 -189010 642781
16176 -259784 115825 128832 223091 -88291 84012 110262 168119 30823 30959 490435 178824
16164 116577 -104338 174232 -87409 82656 49180 353619 -433612 -38670 -82979 248566
16153 -160335 -146948 -20663 34282 100126 223305 -123192 251193 177077 -290286 -36749 -154315
16142 -154315 205802 246467 165285 106558 121943 349507 18928 116484 168650 13320 142677
16131 142677 -81007 159553 -65564 55069 119366 58222 189046 -48041 175780 -85592 18432
$$ packed form
16210G0559L47756j76854i6978o6023A427g5791A57943a1403o3252C40253d1907
16198b29220J12714N5039B12204i7382D0354b07907E0233b74528B14259o9006
16188A45253D1771d4010r0122e3856B35181a00797F8566J3309B8715a89010F42781
16176b59784A15825J3007R4259h8291H4012K6250N7857C0823J36M59476A78824
16164A16577a04338A74232h7409H2656l3476L04439d33612c8670m4309B48566
16153a60335J3387b0663C4282O5844J23179a23192B51193p4116b90286c6749j17566
16142a54315B05802M0665q1182n8727J5385K27564A8928R7556N2166A3320J29357
16131A42677h1007A59553f5564E5069O4297E8222J30824d8041A75780h5592A8432
$$ plain form
16119 40940 -43434 -146839 -121776 102648 -74438 290720 -200056 -178465 215922 217248 -61388
16107 55994 167669 218460 145897 74018 166311 169533 153835 408691 -196734 174274 176931
16096 176931 54271 286231 -223359 98095 177527 -87002 -140764 -233776 -175925 105618 -108969
16084 244336 -123101 437677 -176510 -282322 59095 152673 -80819 255847 19467 -268747
16073 58786 -134551 -48303 143029 83329 -174884 148370 -224265 -46107 -334106 -316753
16063 -316753 -54480 -184686 -296224 -90181 212220 -142520 -401362 44084 184562 72888
16052 -238048 118338 -6113 74783 16031 33789 -426177 -62154 -196279 -79233 226065 43457
16040 -90931 36273 238900 160632 36862 -126096 216114 -139956 -58527 -328375 101682
$$ packed form
16119D0940d3434j03405K5063A02648g4438B90720b00056K1591B15922J326f1388
16107E5994J11675N0791p2563p1879R2293L222j5698K54856a96734A74274K657
16096A76931E4271K31960b23359I8095P9432h7002n3762r3012N7851A05618a08969
16084B44336a23101D37677a76510j05812E9095R3578h0819B55847A9467b68747
16073E8786a34551d8303A43029n9700a74884A48370b24265d6107k87999J7353
16063c16753e4480j30206j11538i0181B12220a42520k58842D4084J40478G2888
16052b38048A18338f113G4783A6031J7758d26177f2154j34125g9233B26065D3457
16040i0931C6273K02627p8268C6862a26096B16114a39956e8527k69848A01682
$$ plain form
16029 31162 23372 202296 -322400 -22756 53409 297550 221063 147227 27725 78202 167777
16018 167777 125313 58168 63494 212393 109899 -384301 -123385 378829 -35513 -341784
16008 -341784 3897 -24831 -49855 220097 -165884 -121166 224057 -194557 147057 101732 -75910
15996 -76073 74912 -4008 -321602 -3261 -65150 47069 -336081 -73994 -59549 -29923 221732
15984 327388 -108143 392699 352625 63800 91237 58405 10386 193472 -16788 -273031 88631
15972 -162178 -169390 332135 -539768 -54232 72475 -116453 -728 388713 75445 -56026 178444
15960 172619 130463 103592 -18315 -241105 -65572 72799 43293 -1763 -294291 -18574 -186853
15949 -186853 -163229 58850 -168524 -94127 -59109 -6344 -394365 -130769 -91147 -51203 34818
$$ packed form
16029C1162p790J78924c22400b2756E3409K44141p6487p3836B7725N0477Q9575
16018A67777m2464E8168N326J48899j02494c84301a23385C78829c5513l06271
16008c41784C897b4831k5024B20097a65884M4718B24057a94557A47057m5325g5910
15996g6073G4912d008l17594c261o1889D7069c36081g3994J4445K9626B21732
15984C27388a08143C92699m0074F3800K7437l2832A0386J83086a6788k56243H8631
15972a62178p212C32135e39768e4232G2475a16453g28C88713G5445e6026A78444
15960A72619m2156k6871a8315k22790f5572G2799k9506a763k92528a8574j68279
15949a86853K3624E8850a68524P4397L5018f344l88021a30769L9622L9944C4818
$$ plain form
15937 -23415 -278467 -226697 -82655 3926 124833 -224310 82484 -52248 -102050 -201083 -215387
15926 -215387 -92424 -158485 86521 -50617 245713 85867 -312342 -64752 -125347 146299 -116412
15914 29204 149632 -157565 139727 2058 102860 -176722 -14332 98352 -140398 -326950
15904 -326950 -52588 -74146 -36843 -103222 66352 -47403 111865 43132 315452 -247266 -300636
15893 -300636 10025 -143627 -115170 -187601 -116231 -89113 -176205 -19929 147999 21764 26886
15882 26886 -174832 -224841 -15437 137404 189036 119405 -152448 363959 168405 206371 22483
15870 -116597 143259 93952 19257 -191333 30746 -247307 -76636 -166520 59890 -294486 -98554
15858 -286328 49286 -112797 39421 -164414 -176856 241283 -26506 204587 -89223 119313
$$ packed form
15937b3415k55052N1770h2655C926J20907b24310H2484e2248m9802r9033j4304
15926b15387i2424o6061H6521e0617B45713H5867c12342f4752o0595A46299a16412
15914B9204J20428a57565A39727B058J00802a76722a4332I8352a40398j86552
15904c26950e2588k1558c6843o6379F6352d7403A11865D3132K72320b47266n3370
15893c00636A0025a43627K8457p2431P1370K7118q7092a9929A47999B1764N122
15882B6886a74832n0009a5437A37404N1632o9631a52448C63959A68405L7966B2483
15870a16597A43259m9307A9257a91333C0746b47307g6636q9884E9890b94486i8554
15858b86328D9286a12797C9421a64414j2442B41283b6506B04587h9223A19313
$$ plain form
15847 -106426 97297 -58665 134775 67257 96439 -96299 59508 135317 293883 54500 75484
15836 75484 -97700 40584 507110 391914 -81834 204995 25030 339610 106262 251836
15826 251836 308208 158710 -86008 -182195 -410804 55255 -186571 49466 -195710 15122 -409831
15814 -12185 2810 165810 -85403 -263933 942 208460 -18931 -102564 26006 83376 140592 25856
15801 24074 -187847 134880 -283257 -75342 308820 131699 -126082 193274 15210 -338800
15790 227651 -63926 209510 -250344 -21395 -44831 7019 -21370 -218874 -182855 181226 -196185
15778 -147492 27371 -203353 -182710 162338 88480 -412001 -326483 -82724 -318780 -160568
15768 -160568 108267 4418 16018 46001 -102913 301208 -191357 144453 105053 96585 -16050
$$ packed form
15847a06426I7297e8665A34775F7257K9182i6299E9508P5809J58566E4500K0984
15836G5484i7700D0584M66526j15196h1834B04995B5030L14580A06262J45574
15826B51836N6372j49498h6008r6187k28609E5255a86571D9466a95710A5122d09831
15814a2185B810J63000h5403j78530I42K07518a8931q3633B6006N7370N7216B5856
15801B4074a87847A34880b83257g5342C08820A31699a26082A93274A5210c38800
15790B27651f3926B09510b50344b1395k3436G019b1370j97504L6019A81226a96185
15778a47492B7371b03353K0643A62338p3858d12001Q5518h2724k36056J58212
15768a60568A08267D418J1600K9983a02913C01208a91357A44453l9400q468a6050
$$ plain form
15756 46592 -93147 -22753 187156 -24034 -36061 -119007 -253995 -60145 145106 -143539 -101936
15745 -101936 98330 -47354 -161696 -88333 -241659 -153198 -14067 -162036 157505 -111339
15734 28810 -206063 -66006 40458 198710 -88739 -414784 91076 65368 -95479 23825 -54177
15722 -284500 -138803 -91627 -263303 -148842 -156754 41635 239208 -292613 110186 147686
15712 147686 125246 -9498 -108492 228691 -23259 -68008 -409897 100777 -185072 -307824 16270
15700 -78175 26594 -58393 -62953 -194536 156314 102488 -172272 -237281 283068 -358027 104518
15688 140817 -382738 126838 68275 -69008 94656 62070 -321596 -85124 -83165 -9505 95106
15676 -121819 -450705 -91069 -71932 23670 -112975 -101290 -20296 205954 18576 -271998 497144
$$ packed form
15756D6592i3147b2753A87156b4034j2027q2946j34988f0145A45106a43539M1603
15745a01936I8330d7354j14342P3363j53326Q8461a4067j47969A57505a11339
15734B8810b06063f6006D0458J58252h8739l26045I1076k5708i5479B3825e4177
15722b84500a38803M7176j71676J14461p912D1635J97573b92613A10186L7500
15712A47686k2440i498r8994B28691b3259m4749l41889A00777a85072j22752A6270
15700g8175B6594e8393m560j31583A56314n3826a72272o5009B83068c58027A04518
15688A40817c82738A26838n8563f9008I4656l2586c21596h5124J959i505I5106
15676a21819l28886i1069J9137B3670a12975J1685b0296B05954A8576b71998D97144
$$ plain form
15664 -59627 63023 64969 -55959 248486 -371894 -82283 261286 -111663 215694 -193900 -54949
15652 -533912 -58849 88337 66062 71042 -269096 -168878 -73119 160798 10754 -107871 -168748
15641 -168748 -172666 118521 -114429 5078 101919 246985 -262890 -99178 -364647 19192 155192
15630 155192 -45185 60037 179011 -86082 -139243 -30914 23346 -72425 -67779 -166023 -285582
15619 -285582 50775 112594 16330 -212595 80630 -172197 33299 62329 -94012 95626 57691
15608 57691 -50299 6231 -123682 176837 -218087 -120509 91685 57314 217427 -237578 188105
15596 -274451 100987 -489630 -335670 224401 -141799 207726 -92663 55540 -191729 69342
15585 -118569 198431 -319715 15484 68360 74005 -115229 -182357 68801 -391954 194264 70975
$$ packed form
15664e9627F3023J946e5959B48486c71894h2283B61286a11663B15694a93900e4949
15652e33912e8849H8337k2275M980b69096J00218g3119A60798A0754a07871o0877
15641a68748l918A18521a14429E078R6841J45066b62890i9178k65469A9192J36000
15630A55192d5185F0037J18974h6082n3161c0914B3346g2425M646r8244j19559
15619b85582E0775O1819A6330b12595H0630a72197C3299K9030i4012I5626l7935
15608E7691e0299F231a23682A76837b18087R7578I1685l4371J60113b37578A88105
15596b74451A00987d89630J53960B24401a41799B07726i2663E5540a91729F9342
15585a18569A98431c19715A5484N2876N645a15229o7128F8801c91954A94264G0975
$$ plain form
15573 -121398 -422313 -97210 27465 -136332 -318507 249356 60858 -148165 -129348 293741
15562 -138595 -135439 1819 -182591 175113 -373000 -134275 48357 -97207 -115777 451036 -382819
15550 185444 78579 257265 -152611 171355 130335 -71663 -57496 72154 52808 -143339 -16518
15538 -243849 -42208 114282 233859 270830 136967 164937 20580 53383 -239498 -77337 -5608
15526 54877 -274140 -8263 203766 -308885 -249535 -316234 102492 -44877 -78259 107097 14613
15514 -76429 -57018 96359 46964 96244 159120 -37592 -47135 28191 189213 8980 248787 -41069
15501 -55753 -234397 -182409 9317 -165271 319412 -223077 152333 235512 236013 458837 35822
15489 -136886 -298400 -231183 72015 -113893 156835 -79605 102613 16354 -12007 213542
$$ packed form
15573a21398l00915i7210B7465a36332j82175B49356F0858a48165J8817B93741
15562a38595L156A819a82591A75113c73000a34275D8357i7207j8570D51036c82819
15550A85444G8579J78686a52611A71355m1020g1663J4167G2154j9346a43339a6518
15538b43849d2208A14282J19577L6971j33863K7970B0580L2803b39498g7337e608
15526E4877b74140h263B03766c08885N9350o6699A02492d4877l3382A07097A4613
15514g6429J9411I6359D6964M9280O2876c7592r543B8191J61022H980K39807d1069
15501e5753j78644N1988I317a65271C19412b23077A52333Q3179N01K22824C5822
15489a36886j61514O7217G2015a13893A56835g9605A02613A6354a2007B13542
$$ plain form
15478 136855 156805 316995 -218645 -5115 9458 104968 126366 101801 76255 -303721 91911
15466 127707 -54777 -278214 -176321 199277 -22544 -285779 25984 -234995 13118 -233752
15455 -78512 -329186 81941 97818 134011 -162957 54857 -54217 165341 97501 107157 -344121
15443 -39519 199729 -46357 -286215 -87571 -38011 -16396 -116947 250613 -83500 -309871 10531
15431 280202 -40567 160235 -219392 -109752 -164614 20782 -241916 -298197 -265196 -66206 230448
15419 28411 -62550 -271091 225106 180059 -23727 160219 215466 -132629 -60227 -255954 140569
15407 -255939 156638 -161300 100885 -27945 -125622 -46900 -214784 163522 88761 -234825
15396 -293259 -45798 -19987 231446 -239568 -167881 -209699 108824 -38429 -42220 -77744 -107488
$$ packed form
15478A36855J9950J60190b18645e115I458R5510K1398k4565k5546c03721I1911
15466A27707e4777k23437J01893A99277b2544k63235B5984b34995A3118b33752
15455g8512k50674H1941J5877L6193a62957E4857e4217A65341o7840R656c44121
15443c9519A99729d6357k39858h7571c8011a6396j00551B50613h3500k26371A0531
15431B80202d0567A60235b19392J09640n4862B0782b41916n6281L3001f6206B30448
15419B8411f2550k08541B25106m5047b3727A60219N5247a32629f0227j95727A40569
15407b55939A56638a61300A00885b7945r7677d6900j67884A63522p4761b34825
15396b93259d5798a9987B31446b39568P1687m1818A08824c8429l791l5524k9744
$$ plain form
15385 -107488 -45059 -98853 10524 73579 177045 -215829 151007 -240471 -37952 -91351 -64995
15374 -64995 -3196 -288986 184574 -144004 95631 -30282 198800 76708 -175076 203061 -127836
15362 -174646 -44829 211211 2200 51110 3638 16841 -23090 -386797 153569 355044 -214064
15350 45816 71472 148547 -6354 43453 101402 202617 -234249 86435 -318513 175748 151589
15339 151589 -211244 13530 -284668 198835 -15568 106066 -60844 169670 276546 -29069
15328 -309797 -278711 12985 92947 -404862 188700 233209 -30261 -7224 -30626 36668 -9055
15316 28 -169588 94191 106730 93230 -344771 -406852 127918 51254 31635 343496 -61250
15304 -37677 -285682 -9440 -285289 259936 33527 -106758 44664 -28995 35814 113744 -77612
$$ packed form
15385a07488d5059n3794A0524O3055J03466b15829A51007b40471c7952n3399K6356
15374f4995c196k85790A84574a44004I5631c0282A98800G6708a75076B03061a27836
15362a74646d4829B11211B200M8910C638J3203b3090l63707A53569K01475b14064
15350D5816K5656P7075f354D3453N7949J01215b34249H6435c18513A75748k4159
15339A51589b11244A3530b84668A98835a5568A06066f0844A69670J06876b9069
15328c09797L1086A2985P9962d04862A88700M4509c0261g224k3402C6668i055
15316B8a69588I4191J2539j3500c44771o2081A27918E1254j9619L11861f1250
15304c7677k48005i440k75849B59936C3527a06758D4664b8995C5814P7930g7612
$$ plain form
15292 52199 -412793 119800 58946 -266521 7566 369410 -79997 8796 -14450 113879 118932
15281 118932 88680 332859 365769 -17548 -179900 -190523 197721 100271 -344765 148231
15270 232697 -36735 190677 132842 -153410 -76621 126998 250185 -467945 284299 -195846
15259 -90715 170196 36161 -44389 68116 36474 -406233 25066 455485 589727 380547 1353713
15248 1353713 1215418 1117663 935852 210906 525438 36130 37220 -3070 -270941 -321507 -228494
15237 -228494 -93527 274167 12834 236037 188251 323663 1227 93122 130960 -83421 162271
15225 72276 -178399 -112533 -320260 30052 300191 -234189 -88849 -42057 93643 -48711 -32980
15214 -32980 88831 -74145 94539 186632 306946 61029 81483 -44740 202387 275712 283247
$$ packed form
15292E2199d12793A19800E8946b66521G566L61844g9997H796a4450A13879N053
15281A18932l0252K44179L2910a7548j62352j0623A97721r7450c44765A48231
15270B32697c6735A90677n7835a53410g6621A26998J23187d67945B84299a95846
15259i0715A70196C6161d4389F8116l1642d06233B5066M30419J34242k09180R73166
15248A353713j38295r7755j81811B10906L14532C6130J090c070k67871n0566R3013
15237b28494i3527B74167A2834K23203m7786J35412A227R1895L7838h3421A62271
15225G2276a78399O5866k07727C0052K70139b34189h8849d2057I3643d8711J5731
15214c2980H8831g4145I4539R2093J20314F1029K0454d4740B02387P3325P535
$$ plain form
15203 283247 99026 41459 76282 86275 105035 -65545 59806 144576 264315 30367 191847
15192 191847 80614 -126649 -210984 -42583 34182 -58979 -284014 68041 -126579 285109 183704
15181 183704 107238 14583 201897 -51881 81280 280471 467179 56132 124989 -78068 -266316
15170 -266316 178526 63206 279097 45471 169563 21052 73662 -55936 -42032 211420 26288
15158 17639 -138272 71094 -199368 21933 98822 -242590 98024 -119521 -316054 -263898 -95146
15146 362022 354394 -341206 64982 108907 250249 234061 11309 -235246 330697 10867 7266
15135 7266 198975 14737 -37203 185214 34008 -48160 -64333 -6581 92614 94474 223455 100599
15122 153874 -76344 239597 606230 41274 -126876 142650 -84190 122871 290019 306136
$$ packed form
15203B83247I9026D1459L4823R993J8760f5545E9806Q4770J19739C0367J61480
15192A91847H0614a26649q4335d2583C4182e8979k25035F8041a26579B85109j01405
15181A83704p6466A4583J87314e1881H1280J99191J86708E6132O8857g8068j88248
15170b66316A78526F3206K15891D5471J24092B1052N2610e5936J3904B11420B6288
15158A7639a38272G1094a99368B1933P6889b42590I8024a19521j96533N2156i5146
15146C62022p628c41206F4982M3925J41342j6188A1309b35246C30697A0867l601
15135G266J91709A4737c7203A85214C4008d8160j6173f581I2614J860J28981A00599
15122A53874g6344B39597L66633D1274a26876A42650h4190A22871J67148J6117
$$ plain form
15112 306136 136058 224100 136307 331324 247946 -102168 37496 175517 87147 513451
15102 513451 -151794 -33343 90917 -55581 6088 -49278 -79140 65739 45931 -106183 -185561
15091 -185561 237196 -87495 216613 -68915 470070 -179738 300215 -25502 288331 4870
15080 208722 124601 61083 295170 -129114 130220 175658 55991 48952 57437 64577 197195
15069 197195 -42477 24566 -20840 -158236 15661 257623 -172010 191310 -209040 410458
15058 332070 278978 86951 42769 153684 1037 166597 149937 214270 -82212 -85071 -14817
15046 302937 -125029 32775 73573 -83040 -115812 238272 44803 -38429 -129241 -155691 26288
15034 -127988 328625 181205 125730 -106415 -197303 64449 55319 -16800 219362 169694 226867
$$ packed form
15112C06136A36058Q8042q7793J95017q3378a02168C7496J38021H7147M26304
15102E13451a51794c3343I0917e5581F088d9278k9862F5739j9808a06183p9378
15091a85561B37196h7495B16613f8915D70070a79738C00215b5502B88331D870
15080B08722q4121F1083K34087a29114A30220M5438E5991p039Q485P140J32618
15069A97195d2477B4566b0840j37396A5661K41962a72010A91310b09040D10458
15058C32070n3092H6951D2769J10915A037J65560j6660O4333h2212k859a4817
15046C02937a25029C2775M0798h3040l2772B38272D4803c8429r0812k6450B6288
15034a27988C28625j47420n5475a06415r0888F4449r130a6800B19362m9668N7173
$$ plain form
15023 226867 113140 83086 385845 341307 52269 457067 338680 200589 273316 231917
15013 231917 -753 211828 212071 399574 154291 262877 12158 432856 470746 180697 405676
15002 405676 259771 229796 282993 -22798 239459 69344 22799 64137 72751 298242 56086
14990 381009 99934 37183 310842 143544 -45899 56307 -209860 164560 315807 -20771
14979 227391 -92911 217835 273134 63274 173880 485282 73632 449537 170773 420616
14969 420616 38109 352211 66264 218748 94807 275593 58539 215684 257446 248887 604588
14958 604588 279718 287940 306915 487999 344437 153488 306348 190217 -20250 -8718 482898
14946 -291344 279701 267016 440494 325671 215759 185332 228065 264877 319948 474464
$$ packed form
15023B26867A13140l0054L02759m4538E2269M04798j18387j38091P2727m1399
15013B31917g53B11828K43J87503A54291J08586A2158M20698L7890A80697K24979
15002D05676j45905k9975N3197b2798B39459F9344B2799M1338Q614K25491E6086
14990C81009I9934C7183K73659A43544d5899E6307b09860A64560J51247b0771
14979B27391i2911B17835N5299F3274J10606L11402G3632L75905A70773K49843
14969D20616C8109L14102F6264J52484I4807J80786E8539J57145M1762q559L55701
14958F04588B79718Q222J8975J81084j43562A53488J52860j16131b0250h718D82898
14946b91344B79701j2685J73478j14823j09912l0427M2733L6812N5071J54516
$$ plain form
14936 474464 120229 199985 91950 561710 71191 412114 396458 63024 63798 541890 347826
14925 347826 667621 -177700 542580 398359 -88442 -227382 610928 526759 321475 396761
14915 396761 466699 172304 -191471 548472 94682 449492 -174349 476082 319623 234317
14905 234317 220436 -109962 283906 141126 429523 305954 423292 -60849 466146 238655
14895 238655 334478 390896 250000 475181 201805 345914 428300 456949 167662 172350 369634
14884 369634 372883 260465 297481 492768 265668 343821 292180 582218 455133 434910 341645
14873 341645 418138 287671 276001 166068 196223 1490 216845 237115 198360 230586 613514
14862 613514 357263 499404 318753 37980 284932 151560 281911 683647 539275 328014
$$ packed form
14936D74464A20229P9756I1950M69760G1191L40923j5656F3024P74M78092j94064
14925C47826L19795a77700E42580j44221h8442j38940F10928q4169k05284P5286
14915C96761O9938A72304a91471E48472I4682L54810a74349D76082j56459q5306
14905B34317j3881a09962B83906A41126K88397j23569J17338f0849D66146k27491
14895B38655R5823N6418j40896K25181B01805J44109Q2386K8649A67662M688J97284
14884C69634L249j12418L7016J95287k27100P8153n1641K90038j27085k0223r3265
14873C41645P6493j30467j1670j09933L0155A490K15355K0270l8755L2226L82928
14862F13514k56251J42141j80651C7980K46952j33372J30351M01736j44372k11261
$$ plain form
14852 328014 432514 410801 131117 482422 329605 500327 394375 193192 418106 271718
14842 271718 353512 558957 408839 470313 84180 194369 526080 333220 431200 403870
14832 403870 111275 144594 344369 314430 287818 206680 374862 492460 643842 574032
14822 574032 141023 164124 693427 389107 500440 431968 482475 398431 268738 421036
14812 421036 165624 192560 152141 116484 516615 459588 499652 475091 536554 460911 546485
14801 546485 342874 522648 315214 182817 545882 560652 242914 504698 300853 476160
14791 476160 584704 415148 583827 500192 460658 771346 450494 279765 328583 757471
14781 757471 366539 260452 222742 421379 662633 262278 469414 424388 765331 614144
$$ packed form
14852C28014J04500k1713A31117L51305j52817J70722j05952A93192K24914j46388
14842B71718Q1794K05445j50118O1474H4180J10189L31711j92860R7980k7330
14832D03870A11275L3319J99775k9939k6612q1138J68182J17598J51382o9810
14822E74032A41023K3101N29303l04320J11333o8472N0507q4044j29693J52298
14812D21036A65624K6936m0419l5657M00131n7027M0064k4561O1463p5643Q5574
14801E46485k03611J79774k07434j32397L63065J4770B42914K61784k03845J75307
14791D76160J08544j69556J68679q3635l9534L10688l20852j70729M8818M28888
14781G57471C66539j06087l7710J98637K41254B62278K07136m5026L40943j51187
$$ plain form
14771 614144 879301 450306 789559 861509 383446 506024 495923 440538 633985 918199
14761 918199 525189 694018 538158 889307 349333 468433 953954 789430 319756 189593
14751 189593 620069 685440 779077 575781 167685 605216 262564 614276 640966 554433
14741 554433 618055 534356 959395 761561 1024059 365464 663700 272557 885720 693753
14731 693753 783302 397390 607011 640143 686571 765221 413425 601117 836291 480624
14721 480624 782352 591720 763229 883511 400737 685223 582489 449275 794381 536342
14711 536342 1071508 513108 572198 550232 663751 741775 678940 826139 632578 667987
14701 667987 834080 623646 636688 500373 781369 1105571 899903 608309 536673 965946
$$ packed form
14771F14144K65157m28995L39253P1950C83446J22578j0101n5385J93447K84214
14761I18199l93010J68829j55860L51149C49333J19100M85521j64524C19756j30163
14751A89593M30476O5371R3637k03296A67685M37531B62564L51712K6690q6533
14741E54433O3622q3699M25039j97834K62498C65464K98236B72557O13163j91967
14731F93753Q9549l85912K09621L3132M6428P8650l51796J87692K35174l55667
14721D80624L01728j90632J71509J20282D00737K84486j02734j33214L45106k58039
14711E36342N35166E13108N9090k1966J13519P8024o2835J47199j93561L5409
14701F67987J66093k10434J3042j36315K80996L24202k05668k91594p1636M29273
$$ plain form
14691 965946 727122 816340 1035567 749988 849084 1171325 755557 773601 634733 1265998
14681 1265998 1030491 671154 889867 725929 1082431 908598 1138139 980466 1125626
14672 1125626 1276028 1001564 607944 524067 1011550 740885 770723 760152 843984 1128017
14662 1128017 819436 847146 718220 1174061 1011307 758691 943442 1157829 851720 996471
14652 996471 874605 729621 989399 1060205 1067112 990306 1151662 1088609 1010311 1358534 1228188
14641 1228188 1446355 996373 1063474 958755 1098389 1065946 871715 1323582 950566 1189703
14631 1189703 1116451 1233846 1032430 961797 1164620 1094208 1216508 1458693 1635116 1350712
14621 1350712 1432167 1316803 1400654 1217153 1414771 1222877 1229206 1634474 1415376 1534383
$$ packed form
14691I65946k38824Q9218K19227k85579R9096L22241m15768J8044j38868O31265
14681A265998k35507l59337K18713j63938L56502j73833K29541j57673J45160
14672A125626J50402k74464l93620q3877M87483k70665K9838j0571Q3832K84033
14662A128017l08581K7710j28926M55841j62754k52616J84751K14387l06109J44751
14652I96471j21866j44984K59778P0806O907p6806J61356o3053p8298L48223j30346
14641A228188K18167m49982O7101j04719J39634l2443j94231M51867l73016K39137
14631A189703p3252J17395k01416p0633K02823p0412J22300K42185J76423k84404
14621A350712Q1455j15364Q3851j83501J97618j91894O329M05268k19098J19007
$$ plain form
14611 1534383 1388231 1677167 1241036 1441912 1887709 1476925 1256115 1623838 1247844
14602 1247844 1356319 1583139 1346126 1507751 1697664 1339404 1612702 1398526 1479454 1250263
14592 1250263 1485253 1597092 1860995 1783252 1622675 1586789 1816355 1539907 1719841 1709358
14582 1709358 1549685 1856033 1791322 1870478 1889889 1888690 2067160 1727560 1856282 1829191
14572 1829191 2062195 1612735 1863716 2066026 2155037 1880006 2377852 2252392 2321200 2418461
14562 2418461 2007995 2394104 2572537 2357240 2935267 2676511 2747399 2891759 2962646 3320744
14552 3320744 3742569 4187491 5047320 6864815 10573312 18987700 34439768 42678313
14544 42678313 28183751 10019477 4741218 3266612 2471191 2097118 2092098 2444017 1940148
$$ packed form
14611A534383j46152K88936m36131K00876M45797m10784k20810L67723l75994
14602A247844J08475K26820k37013J61625J89913l58260K73298k14176Q0928k29191
14592A250263K34990J11839K63903p7743j60577l5886K29566k76448J79934j0483
14582A709358j59673L06348o4711P9156J9411j199J78470l39600J28722k7091
14572A829191K33004m49460K50981K02310Q9011k75031M97846j25460O8808R7261
14562B418461m10466L86109J78433k15297N78027k58756P0888J44360P0887L58098
14552C320744M21825M44922Q59829J817495L708497Q414388J5452068Q238545
14544D2678313j4494562A0019477D741218j474606p95421l74073n020L51919n03869
$$ plain form
14535 1940148 1820744 1854206 1804236 1805955 1569036 1748764 1629989 1641475 1804016 1895331
14525 1895331 2009520 1894213 2411018 2223525 2355322 2423197 2179323 2244332 2423280 2604451
14515 2604451 2415906 2225969 2252277 2507445 2654580 2294969 2548865 2332359 2440102 2386992
14505 2386992 2354436 2654144 2464826 2460051 2633977 2501608 2977817 2697043 2840660 2749122
14495 2749122 2675604 3223284 3120693 3432514 2948054 3283877 3196664 3159770 3221230 3338636
14485 3338636 3296213 3280465 3397767 2994970 3770929 3494999 3183134 3753182 3489197 3527707
14475 3527707 3367183 3621435 3813426 3977290 3881284 3680140 3936048 3803686 4116992 4061798
14465 4061798 4293801 3916739 4359597 4006825 4377782 4500103 4244681 4238992 4791080 4410054
$$ packed form
14535A940148j19404L3462m9970J719k36919J79728j18775J1486J62541R1315
14525A895331J14189j15307N16805j87493J31797O7875k43874O5009J78948J81171
14515B604451j88545j89937K6308K55168J47135l59611K53896k16506J07743n3110
14505B386992l2556K99708j89318m775J73926j32369M76209k80774J43617r1538
14495B749122p3518N47680j02591L11821m84460L35823q7213l6894O1460J17406
14485C338636m2423j5748J17302m02797P75959k75930l11865N70048k63985L8510
14475C527707j60524K54252J91991J63864r6006k01144K55908j32362L13306n5194
14465D061798K32003l77062M42858l52772L70957J22321k55422n689N52088l81026
$$ plain form
14455 4410054 4528390 4451470 4832170 4575523 4903591 4942326 5008706 5256307 5125712 5010285
14445 5010285 5119606 5000546 5481433 5453944 5668559 5510253 5435017 5770134 5831707 5874521
14435 5874521 6179049 6186861 5788578 5888380 6177749 6119669 6387441 6549042 6622786 6667122
14425 6667122 6515778 6931772 6777754 6830801 7061242 7233306 7329508 7346410 7602254 7511452
14415 7511452 7621109 7875882 7964055 7969783 8383392 8201307 8477645 8474760 8874390 8765742
14405 8765742 8993185 9069629 9182380 9533014 9318043 9576112 9879117 10192786 10219940 10319818
14395 10319818 10268798 10556161 10869251 11065642 10877149 11351047 11293727 11861689 12010549 12448319
14385 12448319 12502558 12746364 12560770 13331964 13330034 13569298 13714997 13908028 14690757 14610959
$$ packed form
14455D410054J18336p6920L80700k56647L28068L8735O6380K47601j30595j15427
14445E010285J09321j19060M80887k7489K14615j58306p5236L35117O1573M2814
14435E874521L04528P812l98283R9802K89369n8080K67772J61601P3744M4336
14425F667122j51344M15994j54018N3047K30441J72064R6202J6902K55844r0802
14415G511452J09657K54773Q8173N728M13609j82085K76338k885L99630j08648
14405H765742K27443P6444J12751L50634k14971K58069L03005L13669K7154R9878
14395A0319818n1020K87363L13090J96391j88493M73898n7320N67962J48860M37770
14385A2448319N4239K43806j85594P71194j930K39264J45699J93031P82729p9798
$$ plain form
14375 14610959 15072325 15024692 15784548 16040574 16219732 16344036 16566427 16975212 17330229
14366 17330229 17857213 18432012 18763304 19057281 19638226 19879526 20136028 20462151 21093052
14357 21093052 21525815 22097199 22460262 23144503 23745678 24030219 24636048 25227482 26470880
14348 26470880 26991052 27411379 28084219 28628915 29323981 30191550 31292425 31676652 32886231
14339 32886231 33918547 34701349 35760659 36873555 37653982 38806670 39988378 41499658
14331 41499658 42628807 43687384 45152331 46626302 48165278 49529806 51520329 53239040
14323 53239040 55093813 56985386 58770281 60938651 63373381 65707118 68203558 70740249
14315 70740249 73372684 76320760 79518303 82597164 85958674 89393217 93251197 97624668
$$ packed form
14375A4610959M61366m7633P59856K56026J79158J24304K22391M08785L55017
14366A7330229N26984N74799L31292K93977N80945K41300K56502L26123O30901
14357B1093052M32763N71384L63063O84241O01175K84541O05829N91434J243398
14348B6470880N20172M20327O72840N44696O95066Q67569J100875L84227J209579
14339C2886231J032316P82802J059310J112896P80427J152688J181708J511280
14331D1499658J129149J058577J464947J473971J538976J364528J990523J718711
14323E3239040J854773J891573J784895K168370K434730K333737K496440K536691
14315G0740249K632435K948076L197543L078861L361510L434543L857980M373471
$$ plain form
14307 97624668 101849855 106444803 111363522 116322742 121994204 127696994 133788760 140624380
14299 140624380 147374164 154658516 162787556 171258346 180470944 189861784 199661183 210904953
14291 210904953 222292315 234524923 247315178 260582687 274585298 289026328 304280198
14284 304280198 319802018 336084532 352279343 368575150 384823731 400543390 415870214
14277 415870214 429911434 443298461 454693171 464282888 470687717 472039946 470551080
14270 470551080 467961858 466768732 466084235 463035393 455130836 444193676 431642104 418312083
14262 418312083 403701063 387804113 371178163 354629482 337551442 321176841 305604213
14255 305604213 290243920 275621077 261235648 247400406 234616311 222336652 210863830
$$ packed form
14307I7624668M225187M594948M918719M959220N671462N702790O091766O835620
14299A40624380O749784P284352Q129040Q470790R212598R390840R799399J1243770
14291B10904953J1387362J2232608J2790255J3267509J4002611J4441030J5253870
14284C04280198J5521820J6282514J6194811J6295807J6248581J5719659J5326824
14277D15870214J4041220J3387027J1394710R589717O404829J352229j488866
14270D70551080k589222j193126o84497l048842p904557j0937160j2551572j3330021
14262D18312083j4611020j5896950j6625950j6548681j7078040j6374601j5572628
14255C05604213j5360293j4622843j4385429j3835242j2784095j2279659j1472822
$$ plain form
14248 210863830 200106606 190051424 180201819 171449841 163159384 155440317 147620605 140338235
14240 140338235 133892730 127470815 122088367 117173718 111341361 106730608 101797291 97669644
14232 97669644 93859772 90219154 86872313 82838480 79572326 76612744 73838166 71129204
14224 71129204 68273375 65740854 63360921 61189517 59273905 57318936 55617244 53162565
14216 53162565 51403197 49754611 48382971 46927793 45567054 44366572 42694907 41102903
14208 41102903 40499536 39803679 38661937 37185095 36231972 35001178 34545528 33303138 32736625
14199 32736625 31904361 30704154 29488674 29024258 28222770 27988070 27557448 26506215 25943698
14190 25943698 25144531 24602767 23893672 23214185 22727822 22319362 21783970 21508406 21133583
$$ packed form
14248B10863830j0757224j0055182r849605q751978q290457p719067p819712p282370
14240A40338235o445505o421915n382448m914649n832357m610753m933317m127647
14232I7669644l809872l640618l346841m033833l266154k959582k774578k708962
14224G1129204k855829k532521k379933k171404j915612j954969j701692k454679
14216E3162565j759368j648586j371640j455178j360739j200482j671665j592004
14208D1102903o03367o95857j141742j476842r53123j230794m55650j242390n66513
14199C2736625q32264j200207j215480m64416q01488k34700m30622j051233n62517
14190B5943698p99167n41764p09095o79487m86363m08460n35392k75564l74823
$$ plain form
14181 21133583 20338721 20104405 19367619 19308757 18731437 18348264 17818676 17618177 17178061
14172 17178061 17088458 16454457 16255312 15809608 15629233 15202787 15303667 14589944 14792848
14163 14792848 14617943 13840226 13816056 13397426 13182918 13228535 12691231 12460354 12460531 12571797
14153 12571797 11809386 11706731 11912199 11212004 11579057 10815123 11139416 10773872 10394283
14144 10394283 10222338 10454298 10380271 9958062 9646406 9393527 9346556 9538615 9344428 8787879
14134 8787879 9037015 9057218 8239638 8632119 8311684 8087738 8056256 8087972 7708246 8000126
14124 8000126 7608832 7853125 7384474 7690634 7701622 7385661 7357518 7110756 6862715 6816021
14114 6816021 6503984 6743536 6332614 6410256 6549112 6363817 6452384 6403277 6351724 6032754
$$ packed form
14181B1133583p94862k34316p36786n8862n77320l83173n29588k00499m40116
14172A7178061q9603o34001j99145m45704j80375m26446J00880p13723K02904
14163A4792848j74905p77717k4170m18630k14508M5617n37304k30877J77J11266
14153A2571797p62411j02655K05468p00195L67053p63934L24293l65544l79589
14144A0394283j71945K31960p4027m22209l11656k52879m6971J92059j94187n56549
14134H787879K49136K0203q17580L92481l20435k23946l1482L1716l79726K91880
14124H000126l91294K44293m68651L06160J0988l15961k8143k46762k48041m6694
14114F816021l12037K39552m10922P7642J38856j85295Q8567m9107n1553l18970
$$ plain form
14104 6032754 6069075 5893209 5988995 5402312 5883921 5914396 5642099 5593436 5207915 5374591
14094 5374591 5253414 5198986 5386371 5025815 5084892 4726218 4992925 4856469 4821270 4948312
14084 4948312 4474352 4756230 4468363 4724309 4687885 4463554 4437622 4307827 4226816 4562968
14074 4562968 4264892 4037211 4178053 4243420 4210014 4137730 4200349 4118514 4385817 3789581
14064 3789581 4121349 3737388 4227119 3948583 3763830 3723907 3869408 3703539 3658363 3764617
14054 3764617 3441745 3475523 3569321 3363683 3706120 3055767 3349946 3309110 3159427 3174463
14044 3174463 3123089 3121657 3168176 3336872 3277376 3225114 3065458 3208769 2949277 2711970
14034 2711970 2733103 2888939 3100619 3192561 2905496 2643094 2902586 2801119 2968360 2554544
$$ packed form
14104F032754L6321j75866R5786n86683M81609L0475k72297m8663l85521J66676
14094E374591j21177n4428J87385l60556N9077l58674K66707j36456l5199J27042
14084D948312m73960K81878k87867K55946l6424k24331k5932j29795q1011L36152
14074D562968k98076k27681J40842O5367l3406p2284O2619q1835K67303n96236
14064C789581L31768l83961M89731k78536j84753l9923J45501j65869m5176J06254
14054C764617l22872L3778R3798k05638L42437o50353K94179m0836j49683J5036
14044C174463n1374j432M6519J68696n9496n2262j59656J43311k59492k37307
14034B711970K1133J55836K11680R1942k87065k62402K59492j01467J67241m13816
$$ plain form
14024 2554544 2657550 2632679 2567346 2385840 2466833 2423299 2400788 2579800 2492906 2617357
14014 2617357 2487216 2241182 2361455 2294404 2379973 2234382 2436175 2678031 2149733 1963466
14004 1963466 2278640 1933450 2375565 2143119 1881766 1996564 2004253 2119815 1710519 1987588
13994 1987588 1928885 1910973 2127977 2318016 2825209 3201013 6079451 12366688 26934746
13985 26934746 39988454 32923930 15300039 8334567 6183072 4797815 4155300 3532556
13977 3532556 3057830 2948191 2920407 2771588 2551369 2545360 2467045 2547818 2416917 2540235
13967 2540235 2221755 2435635 2296736 2028388 2195335 2238789 2025565 1971856 1908484 1919627
13957 1919627 1968607 2021068 1610767 1781137 1902308 2089606 1871598 1969201 2005503 1721924
$$ packed form
14024B554544J03006k4871o5333j81506Q0993m3534k2511J79012q6894J24451
14014B617357j30141k46034J20273o7051Q5569j45591K01793K41856n28298j86267
14004A963466L15174l45190M42115k32446k61353J14798P689J15562m09296K77069
13994A987588n8703j7912K17004J90039N07193L75804K878438O287237J4568058
13985B6934746J3053708p064524A5300039o965472k151495j385257o42515o22744
13977C532556m74726j09639k7784j48819k20219o009p8315Q0773j30901J23318
13967B540235l18480K13880j38899k68348J66947M3454k13224n3709o3372J1143
13957A919627M8980N2461m10301J70370J21171J87298k18008R7603L6302k83579
$$ plain form
13947 1721924 2060659 1834392 1925111 1894165 1764512 1995245 1791710 1735656 1853073 1881758
13937 1881758 1489930 1558846 1748245 1826038 1443067 1516432 1630741 1535574 1643669 1504417
13927 1504417 1393079 1593838 1355824 1059064 1195454 1479437 1306065 1541507 1339453
13918 1339453 1708839 1427386 1477345 1673992 1327303 1461572 1627429 1294030 1566432 1417696
13908 1417696 1398984 1334625 1279170 1392487 1521486 1304721 1431108 1006236 1294108 1277717
13898 1277717 1216178 1024265 1150723 1194183 1466592 1007761 1263036 1305750 930725 1275482
13888 1275482 1267150 1323108 1259382 1320262 1215185 1230850 1381245 1250489 1105994 1424447
13878 1424447 1049331 1156277 1235493 1062502 1056721 1192570 1106759 1105775 1222751 773085 1060360
$$ packed form
13947A721924L38735k26267R0719l0946j29653K30733k03535n6054J17417K8685
13937A881758l91828O8916J89399P7793l82971P3365J14309r5167J08095j39252
13927A504417j11338K00759k38014k96760J36390K83983j73372K35442k02054
13918A339453L69386k81453M9959J96647l46689J34269J65857l33399K72402j48736
13908A417696j8712o4359n5455J13317J28999k16765J26387m24872K87872j6391
13898A277717o1539j91913J26458M3460K72409m58831K55275M2714l75025L44757
13888A275482q332N5958o3726O0880j05077J5665J50395j30756j44495L18453
13878A424447l75116J06946P9216j72991n781J35849q5811r84J16976m49666K87275
$$ plain form
13867 1060360 999422 1221171 1027003 925145 1078052 1123671 886834 1178642 899367 655174
13857 655174 1039401 1373095 845096 1014412 1036467 765735 847411 1150695 844077 607445
13847 607445 1134072 930565 716687 1323290 1027922 975600 1014687 1094953 612106 1180609
13837 1180609 930249 954039 846752 891555 972329 614344 610194 728153 502136 915094
13827 915094 1072386 804731 1027219 960987 1120133 747533 692845 785348 1127547 737822
13817 737822 1304476 890178 630662 887834 809608 741921 735280 729946 770280 788321 835712
13806 835712 830559 847859 942523 870323 669495 636408 723797 468616 651558 778950 342315
13794 928962 1023706 521153 838115 710762 655005 615792 564897 655452 868444 382294
$$ packed form
13867A060360o0938K21749j94168j01858J52907M5619k36837K91808k79275k44193
13857F55174L84227L33694n27999J69316K2055k70732Q1676L03284l06618k36632
13847F07445N26627k03507k13878O06603k95368n2322L9087Q0266m82847N68503
13837A180609k50360K3790j07287M4803Q0774l57985m150J17959k26017M12958
13827I15094J57292k67655K22488o6232J59146l72600n4688R2503L42199l89725
13817G37822N66654m14298k59516K57172p8226o7687o641n334M0334J8041M7391
13806H35712n153J7300R4664p2200k00828l3087Q7389k55181J82942J27392C42315
13794I28962R4744n02553L16962j27353n5757l9213n0895R0555K12992C82294
$$ plain form
13783 894518 415917 555961 588657 825860 786766 957773 732181 492195 731620 1087212
13773 1087212 668558 489366 772840 1110939 905611 842920 793892 555105 611703 915252
13763 915252 733786 352791 672610 696096 712852 603847 610817 718720 499586 844766
13753 844766 566603 716196 621733 505934 649399 559218 343061 757870 851421 319061
13742 321599 717696 439194 512572 606866 599940 484123 621641 525585 530170 606137 366228
13731 366228 523697 384644 765241 538052 666413 410820 302571 772831 475355 331217
13721 331217 618436 595490 561091 868863 403330 647173 494649 344126 593190 689804
13711 689804 487337 338681 586001 596097 776191 325348 669043 417641 718621 696466
$$ packed form
13783H94518D15917J40044L2696K37203l9094J71007k25592k39986K39425L55592
13773A087212m18654j79192K83474L38099k05328o2691m9028k38787N6598L03549
13763I15252j81466C52791L19819K3486J6756j09005O970J07903k19134L45180
13753H44766k78163J49593r4463j15799J43465r0181k16157M14809R3551C19061
13742C21599L96097k78502P3378R4294o926j15817J37518r6056M585P5967k39909
13731C66228J57469j39053L80597k27189J28361k55593j08249M70260k97476j44138
13721C31217K87219k2946l4399L07772D03330K43843j52524j50523K49064R6614
13711F89804k02467j48656K47320J0096J80094C25348L43695k51402L00980k2155
$$ plain form
13701 696466 594393 350052 674352 523264 256193 758538 548404 708750 650914 619785
13691 619785 478469 448435 525809 890052 571490 371767 426864 366870 647727 584324
13681 584324 573448 383859 553913 551444 364170 412875 363204 386629 462591 487824 441964
13670 441964 526757 419892 372215 155163 521515 730392 514823 461796 396031 153022
13659 583168 492738 347008 618314 578000 464540 447303 302599 545086 318003 117200
13648 328197 134263 845355 288339 518598 400893 50876 197459 513672 160557 353804
13638 353804 376840 424948 272235 509635 150648 353977 360617 480520 627853 363178
13628 363178 427388 607460 479925 372950 334902 316468 568496 377892 408963 540267
$$ packed form
13701F96466j02073k44341L24300j51088B56193N02345k10134J60346n7836l1129
13691F19785j41316l0034P7374L64243l18562j99723N5097n9994K80857o3403
13681E84324j0876j89589J70054k469j87274M8705m9671K3425P5962K5233m5860
13670D41964Q4793j06865m7677A55163L66352K08877k15569n3027o5765A53022
13659E83168r0430j45730K71306m0314j13460j7237j44704K42487k27083A17200
13648C28197A34263P11092B88339K30259j17705E0876J46583L16213A60557J93247
13638C53804K3036M8108j52713K37400A50648K03329O640J19903J47333k64675
13628C63178O4210J80072j27535j06975l8048j8434K52028j90604L1071J31304
$$ plain form
13618 540267 290656 568825 42366 392635 272501 352445 221880 358914 434360 643828
13608 643828 360232 436309 439840 318492 232920 534526 711911 393905 326371 312973 179710
13597 179710 431142 93394 311188 468187 368426 699387 535151 453235 369820 567545
13587 567545 83029 346318 240970 201538 247729 314589 157171 301140 136543 324286
13577 324286 441689 182515 310857 283287 272185 136173 162022 246627 378681 273881
13567 273881 306618 597504 595115 386114 324235 503458 421315 322462 332579 242745 266547
13556 266547 500133 279970 620469 318863 190352 398597 -121776 -2166 481290 398990
13546 398990 317179 393220 319680 351529 303800 136673 279882 81066 492691 330539 254227
$$ packed form
13618E40267k49611K78169D2366L50269j20134P9944j30565J37034P5446K09468
13608F43828k83596P6077L531j21348q5572L01606J77385l18006o7534j3398j33263
13597A79710K51432I3394K17794J56999r9761L30961j64236q1916q3415J97725
13587E67545H3029K63289j05348l9432M6191O6860A57171J43969A36543J87743
13577C24286J17403A82515J28342k7570j1102j36012K5849Q4605J32054j04800
13567B73881L2737K90886k389k09001o1879J79223q2143r8853J0117q9834K3802
13556B66547K33586k20163L40499l01606j28511K08245a21776b166D81290q2300
13546C98990q1811P6041p3540L1849m7729A36673J43209H1066M11625j62152p6312
$$ plain form
13535 254227 269368 276744 427005 402832 261250 365814 92380 376347 271252 246763 351919
13524 351919 532316 70774 175103 269208 250361 381455 57051 410465 243614 302674
13514 302674 271354 411720 592763 167099 407470 415864 258133 469789 210729 439161
13504 439161 287268 195374 115707 255659 290795 -17798 97639 111328 284485 139427 246216
13493 246216 536421 137415 338107 450420 137337 415485 -129232 446525 372173 441044
13483 441044 95250 363765 138767 553570 155406 298022 197114 562722 147543 506394
13473 506394 226678 156583 -348921 239821 217718 298960 211662 168213 234289 342060 184826
13462 184826 10587 302200 313946 227740 58167 332132 446436 94007 203802 460188
$$ packed form
13535B54227J5141P376J50261k4173j41582J04564I2380K83967j05095k4489J05156
13524C51919J80397G0774J04329R4105j8847J31094E7051L53414j66851N9060
13514C02674l1320J40366J81043A67099K40371Q394j57731K11656B10729K28432
13504D39161j51893r1894p9667J39952L5136a7798I7639J3689J73157A39427J06789
13493B46216K90205A37415K00692J12313A37337K78148a29232D46525p4352O8871
13483D41044I5250K68515A38767M14803A55406J42616j00908L65608A47543L58851
13473E06394B26678p0095c48921B39821k2103Q1242q7298m3449O6076J07771j57234
13462A84826A0587K91613J1746q6206E8167K73965J14304I4007J09795K56386
$$ plain form
13452 460188 151219 -54084 194307 177467 250072 184549 443072 432602 143385 -34526 -144118
13441 -144118 253793 461802 445778 -49480 303502 94311 -46206 218471 -16601 278344
13430 184415 -106015 208188 274288 101473 278196 27340 -40863 139841 258652 117522
13419 188493 68946 -110067 187637 332080 122887 470378 325831 135551 490804 336350
13409 336350 -106209 107171 -40955 73035 233781 142914 368656 219709 330053 263211
13399 263211 144563 -266943 206034 266315 272884 -88671 140398 436468 -23637 287702
13388 246356 237780 154263 204166 210621 245118 203321 265877 -157762 121277 338466 -72652
13376 220117 132769 173316 290335 510416 179044 143248 316412 126618 424984 133051
$$ packed form
13452D60188A51219e4084A94307j6840P2605o5523K58523j0470A43385c4526j09592
13441a44118B53793K08009j6024d9480C03502I4311d6206B18471a6601B78344
13430A84415a06015B08188O6100A01473J76723B7340d0863A39841J18811A17522
13419A88493F8946a10067A87637J44443A22887L47491j44547A35551L55253j54454
13409C36350a06209A07171d0955G3035J60746r0867K25742j48947J10344o6842
13399B63211j18648b66943B06034O0281O569h8671A40398K96070b3637B87702
13388B46356q576q3517M9903O455L4497m1797O2556a57762A21277K17189g2652
13376B20117q7348M0547J17019K20081A79044l5796J73164A26618K98366A33051
$$ plain form
13365 240767 299193 312544 95180 218160 683035 91440 302828 124539 531211 59440
13354 258314 88857 378748 250217 132268 391571 240980 130432 524206 587901 305611
13344 305611 175380 572288 70723 185743 378969 305962 95306 160044 140679 -5690 14000
13332 -279 92555 242833 157728 232944 90163 221269 340275 232805 132482 266302 540022
13321 540022 414317 130916 427882 260341 290589 277343 97481 -88338 120672 91275
13311 91275 -65529 41085 341926 220048 130075 626345 167513 162721 44632 98372 335751
13300 335751 68378 336286 291971 301683 360710 188592 158146 -118151 73590 -145655 187697
13288 -160575 349624 -110930 378010 412567 433906 -64658 382926 6909 -323324 137426
$$ packed form
13365B40767N8426J3351I5180J22980M64875I1440K11388A24539M06672E9440
13354B58314H8857K89891j28531j17949K59303j50591j10548L93774O3695k82290
13344C05611j30231L96908G0723J15020J93226p3007I5306O4738j9365e690A4000
13332b79I2555J50278q5105P5216I0163J31106J19006j07470j00323J33820K73720
13321E40022j25705A30916K96966j67541L0248j3246I7481h8338A20672k9397
13311I1275f5529D1085L00841j21878q9973M96270A67513m792D4632N3740K37379
13300C35751F8378K67908m4315R712N9027j72118l0446a18151G3590a45655A87697
13288a60575C49624a10930C78010L4557K1339f4658C82926F909c23324A37426
$$ plain form
13277 286356 150126 30686 -13517 123106 26138 -37884 95812 140616 215810 168520 17583
13265 -58497 124737 266559 51094 342723 303837 109765 247592 -69801 156135 -94640
13254 -111870 -69324 -128026 131538 74029 -19404 34838 -177273 282593 96115 29763 -141833
13242 125429 64773 231948 -50950 -99142 98902 136985 402757 -45858 62085 31489 41422
13231 41422 455401 221315 305350 240418 -88855 196277 -114883 346953 44547 10775 189563
13220 189563 -45079 169572 148210 302321 -25871 111607 76731 14538 192576 -22818 34658
13208 65798 54326 -57641 266750 -72895 250303 141564 234646 -166735 -177897 -113463 135402
13196 157876 28486 8452 1336 343311 -50287 209785 101613 223140 34793 -110017 -17360
$$ packed form
13277B86356j36230C0686a3517A23106B6138c7884I5812M4804P5194m7290A7583
13265e8497A24737J41822E1094K91629l8886A09765J37827f9801A56135i4640
13254a11870M2546n8702A31538n7509a9404C4838a77273B82593I6115B9763a41833
13242A25429o0656J67175e0950m8192I8902L8083K65772d5858F2085l0596R933
13231D1422M13979B21315Q4035o4932h8855A96277a14883C46953D4547A0775J78788
13220A89563d5079A69572k1362J54111b5871A11607l4876A4538J78038b2818C4658
13208F5798j1472e7641B66750g2895B50303j08739R3082a66735j1162O4434A35402
13196A57876B8486H452A336L41975e0287B09785A01613J21527C4793a10017a7360
$$ plain form
13184 -246841 269745 255230 -314481 -59086 253292 391720 -196266 -20498 124401 75157
13174 75157 255429 297798 9283 176737 48303 227900 288266 -243976 78683 235677 324194
13163 324194 -279344 316328 61200 -283998 206214 30607 525 186010 -384209 -76671 35056
13151 -12750 -24966 90067 279844 -5861 298669 334432 43731 387715 143094 -55007 96635
13139 -101217 438167 -19854 118068 138479 369080 -66813 386635 -11210 -27174 412561
13128 238257 -22039 244947 -4101 6035 29712 -7746 107151 -32687 259730 260925 108880
13116 -198451 -78328 332107 -76621 123989 162791 178502 134539 78913 311230 -184961 -105394
13105 -105394 -13972 222213 78210 273030 59641 191641 3363 280676 38792 16750 -41391
$$ packed form
13184b46841B69745j4515c14481e9086B53292J38428a96266b0498A24401m9244
13174G5157J80272M2369I283J67454D8303J79597O0366b43976G8683J56994Q8517
13163C24194b79344C16328F1200b83998B06214C0607E25J85485c84209g6671C5056
13151a2750j2216I0067J89777e861B98669L5763D3731L43984A43094e5007I6635
13139a01217D38167a9854A18068K0411K30601f6813C86635a1210j5964D12561
13128B38257b2039B44947d101F035K3677g746A07151c2687B59730J195A08880
13116a98451g8328C32107g6621A23989L8802J5711m3963n5626K32317a84961P9567
13105a05394a3972B22213G8210J94820E9641J32000C363K77313C8792A6750d1391
$$ plain form
13093 75653 184752 237577 164983 160623 50019 357369 390558 -401826 409821 63474 111186
13082 111186 -124216 233601 137933 40844 114957 -107894 -96783 188005 -116302 -33530
13071 229888 72760 22694 281762 -200878 153878 183368 267347 5227 -103519 192114 72752
13059 -214595 263927 -130063 166643 -124165 -15135 285128 48533 -97665 -348764 -50694
13048 373805 100346 82203 291141 468571 89489 -226493 -96726 119287 390191 152125
13037 135714 4085 -5808 180839 134322 194799 -114593 -21944 -21059 244895 45835 35601 125635
13025 125635 181209 -295428 75759 157297 96065 -127882 103680 148750 -132417 110093
13014 -135725 354677 82021 218549 76412 250205 146602 26524 218639 -229746 52239
$$ packed form
13093G5653J09099N2825p2594m360E0019L07350L3189d01826D09821F3474M7712
13082A11186a24216B33601r5668D0844P4113a07894J1111A88005a16302c3530
13071B29888G2760B2694K59068b00878A53878K9490Q3979E227a03519A92114G2752
13059b14595B63927a30063A66643a24165a5135B85128D8533i7665k51099e0694
13048C73805A00346j8143K08938J77430H9489b26493i6726A19287K70904A52125
13037A35714D085e808A80839m6517O0477a14593b1944Q85B44895D5835j0234R0034
13025A25635N5574b95428G5759Q1538o1232a27882A03680M5070a32417A10093
13014a35725C54677H2021J36528G6412J73793j03603B6524J92115b29746E2239
$$ plain form
13003 495235 33468 370337 -179097 74202 -10834 50068 5000 87178 132125 -26248 43035
12991 202465 57878 227614 96891 -150812 162216 101224 90868 267174 505662 348206
12981 348206 233056 -265853 -28186 -89407 96579 31247 104526 114618 -96699 -22149 80969
12969 40707 -176554 236595 341727 152916 -623 120204 27797 134395 223168 267914 -31761
12957 222245 -201502 197991 -133081 -3872 -26299 -170073 -261713 8127 -398363 26185 -286451
12945 -361047 101674 63204 68490 -122230 75780 -128046 77363 48927 75218 -134596 -33395
12933 24410 -83885 -151545 -12413 236913 13380 -273001 -161164 143867 111768 168559 -15698
12921 -127539 107726 -97318 283276 -119642 173771 107648 -62906 295091 22512 83749
$$ packed form
13003D95235C3468L36869a79097G4202a0834E0068E000Q2178M4947b6248D3035
12991B02465E7878J69736I6891a50812A62216o0992j0356J76306K38488j57456
12981C48206j15150b65853b8186o1221I6579C1247P3279J0092i6699b2149H0969
12969D0707a76554B36595J05132A52916f23A20204B7797J06598Q8773M4746c1761
12957B22245b01502A97991a33081c872k2427j43774r1640H127c98363B6185b86451
12945c61047A01674l8470N286a22230G5780a28046G7363k8436K6291a34596c3395
12933B4410h3885o7660a2413B36913A3380b73001J11837A43867l2099N6791a5698
12921a27539A07726i7318B83276a19642A73771o6123f2906B95091B2512O1237
$$ plain form
12911 83749 21712 70703 -75964 65531 41149 -75465 -140476 -139596 -60492 299791 187912 93822
12898 -43936 33333 24407 302680 119853 156533 -307862 26246 2726 196805 -258455 91596
12886 146857 451495 -40263 -52516 65153 163637 47885 -5164 36987 -142116 136481 252266
12875 252266 238307 -147185 185282 -46455 197231 286257 -175713 -211455 168765 346951
12865 346951 90121 2488 130599 -22744 24727 -131671 -402503 153579 -235180 136518
12854 183179 221349 350563 -44849 162957 10349 169886 -136346 -107033 194425 233123
12844 233123 347799 61434 321166 83572 111573 -3315 -88638 31571 -45933 54452 45018
12833 45018 221309 30691 -106974 24218 285255 -150296 -70513 12676 174292 295162
$$ packed form
12911H3749B1712M8991g5964F5531k4382g5465o5011Q80f0492B99791j11879I3822
12898d3936C3333q926K78273A19853L6680c07862B6246B726J94079b58455I1596
12886A46857L04638d0263j2253F5153R8484D7885e164C6987a42116A36481J15785
12875B52266j3959a47185A85282d6455A97231Q9026a75713l5742A68765J78186
12865C46951I0121B488J28111b2744B4727a31671k70832A53579b35180A36518
12854A83179L8170J29214d4849A62957A0349J59537a36346K9313A94425L8698
12844B33123J14676F1434K59732H3572K8001c315q5323C1571d5933E4452r434
12833D5018J76291C0691a06974B4218K61037a50296g0513A2676J61616J20870
$$ plain form
12823 295162 -101513 -188949 106865 -183992 -80813 40790 16128 215703 451220 13003
12812 449477 -232799 259498 108586 -89673 70474 -254773 41789 24566 99405 240260
12802 240260 -83571 -74338 -163488 -62100 -25048 -55085 -127827 -27380 106247 -264944 433274
12790 -261481 269844 118372 -139974 -172432 461786 -8304 186898 -265284 -86362 27519
12779 83676 137676 112762 212000 322780 -73565 -355865 44345 -80037 1660 38296 -149097
12767 139668 -132470 -107310 -181618 146025 -40184 164298 220958 112749 149978 202880 48368
12755 -102802 240199 -153179 -6895 72386 498057 -75301 -314243 258143 -215879 91793
12744 286177 71295 -259288 106009 -48050 -60021 193418 235065 -65820 249352 188285 -57712
$$ packed form
12823B95162a01513q7436A06865a83992h0813D0790A6128J99575K35517A3003
12812D49477b32799B59498A08586h9673G0474b54773D1789j7223P4839J40855
12802B40260h3571R233q9150f2100b5048l0037p2742b7380A06247b64944D33274
12790b61481B69844A18372a39974l2458D61786h304A86898b65284h6362B7519
12779H3676N4000k4914R9238J10780g3565k82300D4345h0037A660L6636a49097
12767A39668a32470K5160p4308A46025d0184A64298N6660j08209L7229N2902D8368
12755a02802B40199a53179f895G2386M25671g5301k38942B58143b15879I1793
12744B86177G1295b59288A06009d8050j1971A93418M1647f5820B49352o1067e7712
$$ plain form
12732 203353 -60512 91119 62792 -25327 -160790 84251 -14158 -37057 -1771 -32879 260964
12720 -70533 179503 274638 168065 -271640 -107279 -282202 408018 -97420 105930 -99152
12709 314892 143666 288357 214365 333586 151806 -52125 282523 -134291 222932 -78382
12698 -135859 161525 -123335 171033 186377 142472 86849 -30932 45279 273293 -153113
12687 -197039 -103129 -204218 130501 -7060 117002 309101 -31949 -25272 175277 460672 6622
12675 96328 147929 -17805 -76438 84320 -239115 -193876 -65287 -105963 -150287 211370 39894
12663 288496 184459 125036 24476 214855 -174917 92542 341213 149922 10785 3796 -71956
12651 267429 -170311 344932 20708 313477 131777 -82107 -130793 56066 -112418 65744
$$ packed form
12732B03353f0512I1119k8327b5327j35463H4251a4158k2899a771l1108B60964
12720g0533A79503R5135j06573b71640a07279j74923D08018i7420A05930i9152
12709C14892A43666J44691p3992J19221A51806e2125B82523a34291B22932g8382
12698a35859A61525a23335A71033J5344m3905n5623c0932D5279K28014a53113
12687a97039R3910j01089A30501g060A17002J92099c1949O677A75277K85395F622
12675I6328N1601a7805n8633H4320b39115M5239f5287m0676m4324B11370C9894
12663B88496j04037n9423B4476J90379a74917I2542K48671A49922A0785C796g1956
12651B67429a70311C44932B0708K92769A31777h2107m8686E6066a12418F5744
$$ plain form
12640 -196773 276987 254528 -108893 190732 131421 -184426 20440 301693 -127008 114849
12629 499978 -45976 239364 488058 157534 104789 -2423 365251 -33633 217546 24016 458084
12618 458084 118187 -201822 121169 195158 -336798 139928 -123985 -31425 125693 -221415
12607 -22845 69390 -68549 -20045 88045 -145137 -69470 -310132 -71425 235670 253681 203976
12596 203976 446694 138807 37397 78290 1158 150900 534606 73651 31919 206323 250885
12585 250885 -83085 62229 -238340 -65335 -6043 231580 351228 156129 -78236 89769 286350
12574 286350 -11973 47685 22528 239291 306971 208611 187778 47561 128767 -13623 185083
12562 67348 91802 221110 -228774 -191176 81979 -189103 -181999 -165594 -34503 -149305 -10569
$$ packed form
12640a96773B76987k2459a08893A90732n9311a84426B0440K81253a27008A14849
12629D99978d5976B39364K48694A57534n2745b423C65251c3633B17546B4016M34068
12618D58084A18187b01822A21169P3989c36798A39928a23985c1425A25693b21415
12607b2845F9390f8549b0045H8045a45137f9470k40662g1425B35670J8011m9705
12596B03976K42718A38807C7397M0893A158J49742L83706G3651C1919J74404M4562
12585B50885h3085F2229b38340f5335f043B31580J19648A56129g8236H9769J96581
12574B86350a1973D7685B2528K16763O7680r8360k0833D7561Q1206a3623A85083
12562F7348K4454J29308b28774L7598H1979a89103P104J6405c4503j14802a0569
$$ plain form
12550 169719 -84392 13947 127418 -272344 124134 -60259 222881 254120 66195 50358 -186984
12538 167296 307743 133393 -335021 -149995 116660 374630 176594 46483 -11016 132201
12527 409640 -276351 175476 212620 309409 253416 -301441 47985 -214600 -88538 -272705
12517 -272705 -20409 18529 105738 94924 74865 22089 -132999 111296 -24702 209949 125538
12506 125538 233974 -31475 231468 -31683 344553 143926 -13499 89950 -116295 -7142 54594
12494 70018 415576 310346 292779 152588 -215224 -263435 -213205 -74668 -47995 221823 -163741
12482 -158502 65787 -29822 227541 121474 179617 99546 24663 15986 22810 241416 -86515
12470 4166 92359 42052 304193 22128 74686 -387138 12764 111603 -149773 10213 407103
$$ packed form
12550A69719h4392A3947J13471b72344A24134f0259B22881L1239F6195j5837a86984
12538A67296J40447A33393c35021a49995A16660K57970A76594D6483a1016A32201
12527D09640b76351A75476L7144R6789n5993c01441D7985b14600h8538j84167
12517b72705b0409A8529Q7209j0814k0059B2089a32999A11296b4702B09949q4411
12506A25538J08436c1475B31468c1683C44553A43926a3499H9950a16295g142E4594
12494G0018L45558j05230j7567j40191b15224m8211N0230g4668K6673B21823a63741
12482a58502F5787b9822B27541j06067N8143q0071B4663q677O824K18606h6515
12470D166Q8193D2052K62141B2128N2558c87138A2764R8839a49773A0213L96890
$$ plain form
12459 407103 384459 -137017 73358 88473 34804 -295402 135225 -178259 96713 119237 144036
12448 144036 -57314 126319 5372 -98684 192580 -36740 239900 62564 74965 385921 -106552
12436 69664 -73078 -149454 72473 -5894 11662 -136505 62779 6606 254272 204344 200969 -161810
12423 195617 -25168 178899 -46330 -165749 154994 -287178 -96193 38771 72895 -25147 -224170
12412 -224170 -319182 38316 212255 333845 -6434 46397 -296127 -134608 -91885 -58418 63438
12400 -33542 195196 -411258 49123 -228277 -189384 -5178 83201 83017 -181271 -105251 -114717 -159764
12388 -159764 194744 163446 246023 91848 -129342 -95552 -218051 234476 95599 -278788
12377 64637 -21838 -197728 146606 110155 -150195 135051 -298932 -98707 93725 95384 -93998
$$ packed form
12459D07103k2644a37017G3358J5115C4804b95402A35225a78259I6713K2524K4799
12448A44036e7314A26319E372i8684A92580c6740B39900F2564J2401L10956a06552
12436F9664g3078p6376G2473e894A1662a36505F2779F606K47666m9928l375a61810
12423A95617b5168A78899d6330j19419A54994b87178i6193C8771L4124b5147j99023
12412b24170r5012C8316J73939J21590f434D6397b96127a34608M2723L3467F3438
12400c3542A95196d11258D9123b28277L8893e178H3201j84a81271P6020r466m5047
12388a59764A94744l1298Q2577I1848a29342L3790j22499B34476I5599b78788
12377F4637b1838j75890A46606l6451a50195A35051b98932i8707I3725J659i3998
$$ plain form
12365 -94588 177011 -103409 100624 -225726 131864 131152 -110789 242515 178567 39403 -222401
12353 233251 242141 -184502 -267319 -174044 -107106 -252155 -26732 83620 52524 9912 -26372
12341 -165807 105260 318509 238332 -74630 119498 -75281 -290723 96639 309928 172297
12331 172297 -110454 121455 -53877 87005 -103562 82420 -25697 173540 -54273 56453 -271536
12319 -124966 -104495 -74443 -195083 -161847 -189913 -237899 -13267 -165451 -64844 -24362 50925
12307 55089 254180 -17984 64665 247730 132209 247969 162444 -221949 -132397 27940 -101893
12295 212571 130274 79166 175778 -50566 -92727 32326 113639 26834 -184329 -29964 239570
12283 98616 152210 1469 112040 -64972 7269 -83530 79440 -19733 -91644 168282 455797
$$ packed form
12365i4588A77011a03409A00624b25726A31864p12a10789B42515o3948C9403b22401
12353B33251Q890a84502q2817R3275O6938j45049b6732H3620l1096I912b6372
12341a65807A05260K13249q0177g4630A19498g5281k15442I6639K13289j37631
12331A72297a10454A21455e3877H7005a03562H2420b5697A73540e4273E6453b71536
12319a24966K0471L0052j20640L3236k8066m7986a3267j52184f4844b4362E0925
12307E5089J99091a7984F4665J83065j15521J15760q5525b21949Q9552B7940a01893
12295B12571q2297n1108R6612e0566m2161C2326Q1313B6834a84329b9964B39570
12283I8616N3594A469J10571f4972G269h3530G9440a9733p1911A68282K87515
$$ plain form
12272 455797 -240360 -45333 171558 261866 295176 -192353 -156459 -325340 96727 -160738
12261 81630 39028 23378 82696 -71287 -79093 -113585 149692 -14826 91797 97600 -5451 268036
12248 442445 236259 176767 71012 -101214 290203 -79134 556 126340 64211 282168 191024
12237 191024 100755 116349 168701 129399 154149 77636 147608 -74525 117364 41639 -117441
12225 145243 99686 309152 375568 66135 186499 -110920 327282 112494 -326189 20629
12214 323437 8605 3563 170188 -17704 -121040 84067 17313 65640 165089 -228417 -34681
12202 -12002 245477 182331 -268465 232827 186511 1387 255883 109050 318803 73335 425758
12191 425758 511311 232958 250045 -111051 139705 439822 100070 105474 15605 232171
$$ packed form
12272D55797b40360d5333A71558R0308L3310a92353L5894j68881I6727a60738
12261H1630C9028j5650N9318g1287p806l4492A49692a4826I1797N803e451B68036
12248D42445k06186n9492G1012a01214B90203g9134E56J25784o2129K17957r1144
12237A91024r0269J5594N2352l9302K4750p6513O9972g4525A17364D1639a17441
12225A45243m5557K09466O6416F6135J20364a10920C27282A12494c26189B0629
12214C23437H605C563J66625a7704j03336H4067A7313M8327R9449b28417c4681
12202a2002B45477o3146b68465B32827m6316A387K54496A09050K09753G3335L52423
12191D25758Q5553B32958J7087a11051A39705L00117A00070N404A5605K16566
$$ plain form
12181 232171 122220 38180 366088 217188 31101 -178727 82782 -3249 49721 167268 36269
12169 200815 478952 132500 186698 95069 -40666 78630 115161 202828 -369261 285706 -275574
12157 -154722 123662 100430 159135 -200506 -19002 -82906 -234478 238714 97482 -9424 232908
12145 89238 -84331 -105538 -291719 174762 -262605 66110 303129 24607 -5992 -75000 28182
12133 41844 165490 287048 429688 77089 222805 -126762 96947 -399408 69156 479299
12123 479299 -110684 -223950 -84338 221904 297004 -117605 64693 336462 -241016 95505
12112 151012 -21588 -215810 61463 -57811 213751 11663 175329 -118460 -62408 -441567
12102 -441567 20680 124898 -210026 55696 -93149 58504 15431 132978 -212811 117508
$$ packed form
12181B32171j09951C8180L27908j48900C1101a78727H2782c249D9721J17547C6269
12169B00815K78137A32500N4198r1629d0666G8630L6531Q7667c69261B85706b75574
12157a54722A23662k3232N8705b00506a9002o3904j51572B38714I7482i424B32908
12145H9238h4331k1207j86181A74762b62605F6110K37019B4607e992o9008B8182
12133D1844J23646J21558J42640G7089J45716a26762I6947c99408F9156M10143
12123D79299a10684j13266h4338B21904P5100a17605F4693K71769b41016I5505
12112A51012b1588j94222F1463e7811B13751A1663J63666a18460N6052l79159
12102d41567B0680J04218b10026E5696i3149E8504A5431J17547b12811A17508
$$ plain form
12091 34674 36508 302315 24369 -45101 -198645 277820 304151 -216684 -135070 -154712 -318563
12080 -318563 -158598 98079 -241033 -92515 -41909 188750 191835 -297680 50838 -42478 308287
12068 343733 -40606 283099 302012 1145619 1748153 829635 225740 12402 254011 -103448
12057 27611 -135650 153708 64259 -153404 27990 -45907 29298 -152027 -119318 -155831 69529
12045 109363 -113184 -120437 -75189 77193 -162393 -107358 -236677 -64139 10730 138169 153044
12034 153044 -224443 -135550 108548 367196 -79359 -141384 24690 -260580 58619 115570 68696
12023 68696 -31420 -6484 -246790 345918 16897 19306 -359565 277933 146761 -317559 -415751
12012 -415751 -139231 142632 29979 -28438 -70397 -190732 80017 97028 -153934 -154468 213651
$$ packed form
12091C4674J834K65807B4369d5101j53544B77820K6331b16684Q1614j9642j63851
12080c18563a58598I8079b41033i2515d1909A88750L085b97680E0838d2478C08287
12068C43733d0606B83099J8913Q43607O02534H29635B25740A2402K41609a03448
12057B7611a35650A53708F4259a53404B7990d5907B9298a52027L2709l6513F9529
12045A09363a13184p253M5248G7193a62393N5035j29319f4139A0730J27439J4875
12034A53044b24443Q8893A08548K58648g9359o2025B4690b60580E8619N6951m6874
12023F8696c1420f484k40306C45918A6897K409c59565B77933j31172c17559r8192
12012d15751a39231A42632B9979b8438m1959j20335H0017J7011a53934n34B13651
$$ plain form
12000 -77674 146018 -135473 -44012 133067 -11177 -250061 81383 43298 212483 437248
11990 437248 -40498 -60876 -274955 -43732 45783 -73570 -82548 210776 5799 -70507 -133062
11979 -133062 52392 -37365 -191044 84043 -7467 -35079 -284710 259264 -251986 -26632 -86558
11968 -86558 74574 80323 181347 -25940 129357 -9183 -180649 27796 163847 -13734 60295
11956 -144415 -43800 185518 117573 115978 -57531 -95087 206033 174628 -5772 -229489 193218
11944 -97555 -223208 -170532 -186154 33342 -93581 256676 -14955 -108705 116280 46644 16656
11932 -117648 -3579 250003 92542 125322 31226 -29600 52575 -72087 -129853 13970 -197258
11920 -70953 109543 147351 -261881 575371 -188350 196519 66462 -342664 323152 218468
$$ packed form
12000g7674A46018a35473d4012A33067a1177k38884H1383l8085J69185K24765
11990D37248d0498k0378k14079d3732D5783g3570q978B10776E799g0507o2555
11979a33062E2392c7365j53679H4043g467k7612k49631B59264b51986b6632n9926
11968h6558G4574N749J01024b5940A29357i183j71466B7796J36051a3734F0295
11956a44415d3800A85518o7945j595e7531l7556B06033l1405e772k23717A93218
11944i7555j25653N2676j5622C3342i3581B56676a4955r3750A16280D6644A6656
11932a17648c579B50003I2542L2780C1226b9600E2575g2087n7766A3970a97258
11920g0953A09543L7808b61881E75371a88350A96519F6462c42664C23152j04684
$$ plain form
11910 218468 195720 -135812 -995 -366228 -37011 45974 195791 -44507 -40004 -133446 -424165
11899 -424165 -44624 178495 29755 -100302 -36765 10699 27866 -210863 35696 46329 73394
11888 73394 -42589 -173738 -84106 152939 60544 72712 -38999 17785 83019 -55347 -137053
11877 -137053 -175820 -186348 -301972 -40821 -135103 -5948 -395572 -50552 -137820 -201652 -228182
11866 -228182 38027 195508 -116147 190429 151882 -269135 -106123 18630 294053 -34296
11855 134179 -10224 -54718 72233 -115288 -72319 71305 159445 -115914 -342343 178798 84203
11843 20399 -29483 -184457 -195829 -112447 109553 -82721 243921 -121464 -150992 -103952 215104
11831 -365189 -148127 -227443 278343 -185169 -87201 -376329 -300492 202484 -358778 -104768
$$ packed form
11910B18468k2748a35812i95l65233c7011D5974J49817d4507M503r3442k90719
11899d24165d4624A78495B9755a00302c6765A0699J7167b10863C5696J0633K7065
11888G3394d2589j31149h4106A52939F0544J2168c8999A7785O5234e5347q1706
11877a37053l8767j0528j15624d0821r4282e948l89624e0552q7268o3832k6530
11866b28182C8027J57481a16147A90429l8547b69135a06123A8630K75423c4296
11855A34179a0224m4494G2233a15288M2969G1305Q8140a15914k26429A78798H4203
11843B0399b9483j54974j1372Q3382A09553h2721B43921a21464k9528M7040B15104
11831c65189a48127p9316B78343a85169h7201k89128P5837B02484c58778a04768
$$ plain form
11820 -56910 -195092 -102536 -68128 108877 179740 157478 -102361 -78849 276612 185185 -21074
11808 -48516 4034 -182912 -48389 144419 -229926 -258330 -105855 134080 -144805 -31937 3563
11796 -81376 -71193 -265364 74904 -282914 -304057 -89716 -227590 346324 231105 -187732
11785 1447 177199 -7127 94798 245288 -128376 106856 -293713 -322501 24986 -197283 -85770
11773 244955 -331412 -118335 -201212 -42087 -106958 -189454 149897 41232 -43477 26192 -65739
11761 -94985 -240353 -60655 202427 -209649 -301616 -322087 -190177 -192971 8840 102410 168055
11750 168055 -134355 96135 -133436 61296 -71665 97745 225848 18772 -25187 162229 198210
11739 198210 -71902 345743 -320400 -27697 -114431 353791 -102417 7476 -155714 -117217 45507
$$ packed form
11820e6910j38182R2556L4408A08877P0863k2262a02361K3512B76612r1427b1074
11808d8516D034a82912d8389A44419b29926k8404a05855A34080a44805c1937C563
11796h1376J0183j94171G4904b82914k1143h9716j37874C46324j15219a87732
11785A447J75752g127I4798J50490a28376A06856b93713k8788B4986a97283h5770
11773B44955c31412a18335q2877d2087o4871q2496A49897D1232d3477B6192f5739
11761i4985j45368f0655B02427b09649r1967k0471J31910k794H840R3570O5645
11750A68055a34355I6135a33436F1296g1665I7745J28103A8772b5187A62229L5981
11739A98210g1902C45743c20400b7697q6734C53791a02417G476a55714L8497D5507
$$ plain form
11727 -193658 356869 -321034 -285294 -69652 18124 141295 87559 -113257 -311089 106410
11716 100013 -60796 -72561 80961 -44325 -28290 -104309 197435 -57695 -148365 -161669 133375
11704 72414 -103302 -164744 354865 120085 195330 -218489 346627 -133482 -141913 -31136 152311
11692 40334 -284834 196275 204612 35886 103027 -208797 151631 196474 110226 126833 398462
11681 398462 229132 -117675 88841 -88254 -285461 32036 376385 -78308 76399 50038 299194
11670 299194 -24761 -175511 -43657 -83482 31977 94226 153301 58659 178198 -54483 -131138
11659 -131138 15311 -187194 193485 10065 183684 8421 -30979 -73640 -88039 -157890 -57232
11647 144325 -159544 76780 50464 106330 130921 -58349 -305495 -216128 -214383 -213098 -187345
$$ packed form
11727a93658C56869c21034L5740f9652A8124J23171n3736a13257j97832A06410
11716A00013f0796j1765H0961d4325J6035p6019A97435e7695r0670j3304A33375
11704G2414a03302o1442C54865A20085P5245b18489C46627a33482q431c1136A52311
11692D0334b84834A96275Q337C5886O7141b08797A51631M4843q6248J6607K71629
11681C98462j69330a17675H8841h8254j97207C2036L44349g8308G6399k6361K49156
11670B99194b4761j50750d3657l9825C1977O2249N9075E8659J19539e4483p6655
11659a31138A5311a87194A93485A0065J73619H421c0979m2661j4399o9851e7232
11647A44325a59544G6780k6316N5866K4591e8349k47146Q9367J745J285K5753
$$ plain form
11636 -187345 141141 -59189 49238 234245 232520 288819 -36759 104593 4585 12898 54143
11625 54143 76726 -76688 -111987 322585 228901 9465 129923 20460 -207284 -1972 -184936
11614 -184936 57300 -168 -247208 -143507 285227 -63690 -73237 -46197 7035 172259 -117225
11602 228451 89385 80682 -139296 -214431 -356596 -90504 259164 60876 -249194 40280 95288
11591 95288 -96712 118067 -116076 104791 287693 -268683 157333 -218069 -427247 -49432
11580 86703 -51740 -366244 -37016 18424 177109 -363923 -206246 212197 -62115 238111
11569 198317 90456 68638 49447 119835 -26839 -251301 185412 -20183 42760 349902 -87927
11557 101047 -37448 -150923 196304 24781 21300 31855 -80207 -264247 -110470 17150 5707
$$ packed form
11636a87345A41141e9189D9238J85007j725N6299c6759A04593D585Q313M1245
11625E4143K2583g6688l5299C22585r3684I465J20458B0460b07284a972j82964
11614a84936E7300a68k47040J03701B85227f3690r547K7040G035J65224a17225
11602B28451H9385q703a39296p5135j42165i0504B59164F0876b49194D0280N5008
11591I5288i6712A18067a16076A04791J82902b68683A57333b18069k09178d9432
11580H6703e1740l14504c7016A8424J58685c63923J57677B12197f2115B38111
11569A98317I0456k1818j9191P0388b6839k24462A85412b0183D2760L07142h7927
11557A01047c7448j13475A96304B4781l481J0555h0207j84040a10470A7150E707
$$ plain form
11545 170627 289160 267626 -195280 346030 -21609 306304 -338008 2057 111181 185364
11535 185364 141613 8268 253328 350212 222591 -69793 -35103 73094 183574 175824 174293
11524 174293 105233 19352 -308333 -2154 145859 -56651 59531 -175404 219531 36887 83885
11513 83885 349682 181029 -54665 68877 463922 212335 32174 30555 150141 41834 64452
11502 64452 -170279 107566 -227791 -5254 336751 63415 129906 72353 280 214169 76554
11490 134546 -145958 283877 274403 198426 -83820 387655 -179077 146342 240625 150338 259648
11479 259648 2942 -16132 177048 -284182 172087 140390 171544 28035 -113925 346032 -49482
11467 338657 242561 123458 78012 484930 114323 -173993 82680 96440 -92423 -37401 199944
$$ packed form
11545A70627J18533k1534a95280C46030b1609C06304c38008B057J09124P4183
11535A85364m3751H268K45060R6884j27621f9793L4690G3094J10480p750j531
11524A74293o9060A9352c08333b154A45859e6651E9531a75404B19531C6887M6998
11513H3885K65797j68653e4665F8877L95045B12335C2174j619J19586D1834K2618
11502F4452a70279A07566b27791e254C36751F3415O6491n7553B80K13889G6554
11490A34546a45958B83877r474p5977h3820C87655a79077A46342R4283r0287J09310
11479B59648B942a6132A77048b84182A72087l1697L1154B8035a13925C46032d9482
11467C38657r6096j19103m5446M06918A14323a73993H2680J3760i2423c7401A99944
$$ plain form
11455 -19687 39170 15088 -80089 181411 468289 109495 64176 -7113 250196 -52814 55080
11443 -68068 202638 125767 9820 185225 -145521 -57994 393352 -202419 234838 303241 232920
11432 232920 131406 -81294 109447 19258 190945 42694 -14973 4098 -63526 255996 -110496
11420 37806 149518 178064 -175456 -176553 109587 -39319 -214267 34029 -134129 -74878 359108
11408 -49336 -207361 -43133 143263 282834 -243550 -195511 -20012 -46917 -36325 392821 130369
11396 169872 -4785 57769 -42154 -119116 -123631 -27993 16257 -241206 -173092 68514 -93868 330563
11383 -195621 -41422 -18651 289511 -16227 -117016 -21998 168506 106932 30064 -174114 -52101
11371 67238 -159329 -60298 -264385 -203745 -515392 -192345 89934 129512 -71328 -191109 -236033
$$ packed form
11455a9687C9170A5088h0089A81411K86878A09495m5319g113B50196e2814E5080
11443f8068B02638p6871I820J75405a45521e7994C93352b02419B34838O8403p0321
11432B32920j01514h1294A09447A9258J71687D2694a4973D098f3526B55996a10496
11420C7806J11712K8546a75456j097A09587c9319j74948C4029a34129N9251C59108
11408d9336j58025d3133A43263J39571b43550M8039b0012k6905J0592C92821A30369
11396A69872d785E7769d2154p6962m515b7993A6257b41206O8114F8514i3868C30563
11383a95621d1422a8651B89511a6227j00789b1998A68506o1574C0064a74114e2101
11371F7238a59329f0298k04087O0640l11647a92345H9934L9578g1328j19781m4924
$$ plain form
11360 -236033 171227 -356823 25708 33827 -33503 18920 43129 -76934 -282767 -230987 56650
11348 -90317 139477 99752 120270 76814 -383579 251722 -87682 -339290 -328183 -180864 -145740
11337 -145740 -122141 6547 -186870 -71887 -196608 -381659 -150209 63160 -133482 43189 -154410
11325 220979 125558 -160222 239379 -180294 -9611 269486 106699 -16683 -76552 341332
11314 62160 208422 -256659 -56104 -312036 -38947 -290129 -106099 127181 -305035 276964
11303 79627 -75675 123360 258865 47844 -94829 156550 39433 -98526 -154826 -269252 24483
11291 141309 -147076 77172 -102242 161561 -67809 -2058 150442 120715 100005 311917 -239491
11279 -33289 153484 -218965 -43336 -258389 -109612 157912 20423 -58004 54562 149478 18457
$$ packed form
11360b36033A71227c56823B5708Q119c3503A8920K4209g6934k05833N1780E6650
11348i0317A39477l9725K0518m3456c83579B51722h7682k51608J1107J47319L5124
11337a45740K3599F547a86870g1887j24721j85051a50209F3160a33482D3189a54410
11325B20979r5421a60222B39379a80294i611B69486A06699a6683n9869C41332
11314F2160J46262b56659e6104k55932c8947k51182a06099A27181c05035B76964
11303G9627g5675A23360J35505D7844i4829A56550C9433i8526n6300j14426B4483
11291A41309a47076G7172a02242A61561f7809b058A50442k9727k0710K11912b39491
11279c3289A53484b18965d3336k15053a09612A57912B0423e8004E4562R4916A8457
$$ plain form
11267 120851 -100638 -46850 334008 -181720 -184993 -63934 205739 -95980 74186 -78368 33481
11255 -19822 96568 103990 -347797 -270947 59446 -127619 85754 -278203 155050 -86199 70482
11243 220026 333738 -188608 -24285 -73463 -7050 -24960 110364 111391 150389 -77218 -275877
11232 -275877 237876 -290308 148561 -155955 198604 -170649 187686 -19650 77053 382946
11222 382946 -182619 -45258 -192639 -29973 -23614 92567 -198547 262796 -188163 -26817 110499
11210 -77960 -361509 -124561 -206152 -306476 188505 -90839 122380 225917 -78869 -45679
11200 -45679 -272621 -138111 -91039 -162416 -270667 28821 -356524 -98237 -148663 -334475 -84743
11188 -15557 -259303 -98693 -24040 -91868 -245302 -350615 -235666 -15359 -176221 271991
$$ packed form
11267A20851a00638d6850C34008a81720l273f3934B05739i5980G4186g8368C3481
11255a9822I6568P422c47797P6850E9446a27619H5754b78203A55050h6199G0482
11243B20026J13712a88608b4285m9178g050j7910A10364J027L8998g7218j98659
11232b75877B37876b90308A48561a55955A98604a70649A87686a9650G7053L05893
11222C82946a82619d5258j47381b9973O359I2567a98547B62796a88163b6817A10499
11210g7960k83549a24561q1591j00324A88505i0839A22380J03537g8869L3190
11200d5679k26942J34510M7072p1377j08251B8821c56524i8237n0426j85812h4743
11188a5557k43746i8693b4040o7828j53434j05313J14949a5359j60862B71991
$$ plain form
11177 -336711 -155958 -198564 41826 -108363 12600 26112 -350997 -80505 16832 -23945 -210887
11166 -210887 149736 -24189 -97368 -188251 -40909 304408 245820 317959 -22195 -439666 -85340
11154 120723 93570 -85929 -100362 118834 -255075 3849 -323214 -8970 -119063 -37091 -147659
11143 -147659 -150048 -96735 206441 388725 -71683 109705 48043 -80394 277854 153988 -223313
11131 -61807 86570 -28417 -44693 334798 -152098 256408 -116239 63799 105626 7190 274321
11120 274321 39580 56403 -127678 -30081 314455 188842 -106365 -78502 177056 -83313
11109 237029 -264787 16040 46575 -50212 219679 196518 529561 287810 212166 147853 441464
11098 441464 218790 32497 279479 3804 -225094 339923 152741 83945 -65917 409872
$$ packed form
11177c36711a55958m2606D1826a08363A2600J3512c50997h0505A6832b3945j86942
11166b10887A49736b4189p3179r0883d0909C04408n8588P2139b2195m17471h5340
11154A20723k7153h5929j4433A18834b55075C849c23214h970j10093c7091j10568
11143a47659k389N3313B06441J82284g1683A09705D8043h0394B77854j23866b23313
11131f1807H6570b8417j6276C34798a52098B56408a16239F3799M1827G190K67131
11120B74321C9580J6823a27678c0081C14455j25613a06365K7863A77056h3313
11109B37029b64787A6040L0535e0212B19679k3161L33043k41751p5644o4313K93611
11098D41464B18790C2497K46982C804b25094C39923A52741o8796f5917D09872
$$ plain form
11087 562544 7396 360883 -236821 102505 234005 78861 -96374 122327 96536 144124 239117
11076 239117 339244 346338 500893 533350 143475 522799 264209 247847 171564 35159 167393
11065 167393 361971 316188 411602 298305 622059 356810 387817 159595 421800 744824
11055 744824 528582 536100 352510 393348 398831 754737 507240 535219 608857 1114779 774487
11044 774487 637555 721681 461303 1007291 490492 763903 730617 392194 635179 535779
11034 535779 509908 816407 415083 494968 663615 611969 896740 772241 657190 674544
11024 674544 672083 544038 624750 678025 244828 646745 736670 544167 640556 316365 525284
11013 525284 364259 707130 749320 506662 911648 692750 442208 523842 776766 462574
$$ packed form
11087E62544G396L53487b36821A02505J31500G8861i6374A22327k5791M7588R4993
11076B39117J00127P094J54555L2457A43475L79324k58590j6362p6283C5159J32234
11065A67393J94578m5783R5414j13297L23754k65249L1007A59595K62205L23024
11055G44824k16242P518j83590M0838N483L55906k47497K7979P3638N05922l40292
11044G74487j36932Q4126k60378N45988D90492K73411l3286l38423K42985r9400
11034E35779k5871L06499m01324P9885J68647n1646K84771j24499j15051J7354
11024F74544k461j28045Q0712N3275B44828M01917Q9925j92503R6389C16365K08919
11013E25284j61025L42871M2190k42658M04986k18898k50542Q1634K52924l14192
$$ plain form
11003 462574 406501 764612 558900 464240 593657 341666 647724 298863 816688 593360
10993 593360 613503 914977 390102 528240 599652 886183 958927 637669 808098 924573
10983 924573 926354 1005931 755098 1061837 1283151 1404097 1445916 1911870 2090631 2334850
10973 2334850 2578720 2340631 2653065 2505607 2432962 1777046 2093677 1772055 1435252 1121245
10963 1121245 1162462 1160265 1160979 978085 1226766 1244996 1252811 1294882 1221134 928534 754074
10952 754074 723357 487934 503354 595720 297815 70030 419155 469218 172569 -84153 -118918
10941 -118918 262697 48426 -29346 77654 39727 -134639 325132 -128457 -145268 -23683 -143780
10930 -143780 56691 19585 133423 47944 -24160 -121768 59851 -43684 358235 188047 255541
$$ packed form
11003D62574n6073L58111k05712r4660J29417k51991L06058B98863N17825k23328
10993E93360K0143L01474C90102J38138P1412K86531P2744l21258J70429J16475
10983I24573J781P9577k50833L06739K21314J20946M1819M65954J78761K44219
10973B334850K43870k38089L12434j47458p2645o55916L16631l21622l36803l14007
10963A121245M1217k197P14j82894K48681J8230P815M2071p3748k92600j74460
10952G54074l0717k35423J5420R2366B97815G0030L49125N0063A72569h4153l4765
10941a18918B62697D8426b9346G7654l7927a34639C25132a28457j6811b3683j20097
10930a43780E6691A9585J13838D7944b4160r7608E9851d3684C58235j70188O7494
$$ plain form
10919 255541 -189850 -90250 -114950 77465 -33039 -22916 420306 -241086 -258457 -163539 -159603
10908 -159603 215892 33770 1945 -323029 -63265 -79709 138382 -341252 38281 -207535 -137895
10897 -137895 -185819 -365355 176738 -118293 382430 74802 158973 -202012 246561 -18043
10886 -411571 -68051 -16828 -10418 230550 -48507 -328261 -373956 -274836 82866 243835 -467282
10874 374097 -79649 -232590 72783 117835 -175147 158983 60472 216246 114183 -158509
10863 -119261 -8106 160058 -211512 -27598 -1661 360774 51950 -262801 438731 52634 -78636
10851 -151890 127131 -71468 164052 211929 -6286 88314 53936 61639 -134820 81465 -142428
10839 -141649 -83260 14900 173231 248914 -259441 -50573 -124276 220208 80880 -169386 326986
$$ packed form
10919B55541a89850i0250k4700G7465c3039J0123D20306b41086j7371R4918L936
10908a59603B15892C3770A945c23029f3265j6444A38382c41252C8281b07535O9640
10897a37895m7924j79536A76738a18293C82430G4802Q4171b02012B46561a8043
10886d11571f8051a6828O410B30550d8507k79754m5695R9120H2866J60969d67282
10874C74097g9649j52941G2783M5052a75147A58983F0472J55774j02063a58509
10863a19261h106A60058b11512b7598a661C60774E1950b62801D38731E2634g8636
10851a51890A27131g1468A64052M7877f286H8314l4378P703a34820H1465a42428
10839a41649N8389A4900J58331P5683b59441e0573p3703B20208H0880a69386C26986
$$ plain form
10827 -306512 -288319 -283870 -131143 70897 25972 -215700 -142139 62855 -384264 45869 -73189
10815 175271 120736 -5053 252897 -117780 -33046 -127016 -102629 -17757 239163 -266608 191942
10803 122565 137608 -30495 -146034 -20425 36044 70240 48503 127020 -366168 163900 61350
10791 -119057 307786 -222355 15687 127956 -111271 -247336 -254066 143415 -133678 -247272
10781 -247272 -108524 -135688 -138889 112274 195621 21246 440868 10635 -125867 -244534 -85183
10769 133352 180613 85545 286880 157385 113897 151120 -148655 77768 336710 188479
10759 188479 -36980 60685 -104555 -114828 77466 -235323 230918 222575 -116989 -59377 -66486
10748 -66486 3874 -313306 -198628 112184 51049 -280330 81042 -41098 -169972 -34986 -35538
$$ packed form
10827c06512J8193M449a31143G0897B5972b15700P3561F2855c84264D5869g3189
10815A75271n4535e053B52897a17780c3046r3970K4387a7757B39163b66608A91942
10803A22565J5043c0495j15539b0425C6044L4196k1737P8517c66168A63900F1350
10791a19057C07786b22355A5687J12269a11271j36065o730A43415a33678j13594
10781b47272a08524k7164l201A12274Q3347B1246M19622A0635a25867j18667h5183
10769A33352M7261H5545K01335j29495m3488L7223a48655G7768K58942j48231
10759A88479c6980F0685a04555j0273G7466b35323B30918q343a16989N7612p109
10748f6486C874c13306J14678A12184E1049b80330H1042d1098j28874c4986n52
$$ plain form
10737 -35538 -365820 -49444 213376 -194118 -116603 -37115 61871 -146340 -187481 -297234 -264619
10726 -264619 -114980 -17678 148585 -24200 -219619 -256710 -42615 -177766 -166570 -99206 -117781
10715 -117781 -148717 18364 251595 138029 9070 -153984 216111 5539 -8582 -137877 209285
10703 225661 -225729 -23533 -65082 -87384 -247353 32381 58879 -334506 -50846 -38037 -179310
10692 -179310 -55986 185053 -89018 -310983 -60938 -241639 -484834 -17217 280480 -219705
10681 245099 116294 -48130 -123243 -463 -350199 44121 135424 99817 156956 57222 42141
10670 42141 230932 77087 328410 -251543 29007 -15001 -29735 405358 -163599 -81015 -55586
10659 -55586 47480 83489 -154332 -427122 -308497 -90489 -417518 -58487 315691 257528 -280977
$$ packed form
10737c5538l30282d9444B13376a94118P7515c7115F1871a46340m1141j09753L2615
10726b64619a14980a7678A48585b4200j95419l7091d2615j35151J1196O7364j8575
10715a17781l0936A8364K33231j13566I070a53984B16111E539h582j29295B09285
10703B25661b25729b3533m1549k2302j59969C2381K6498c34506e0846J2809j41273
10692a79310e5986A85053h9018k21965f0938j80701k43195a7217B80480b19705
10681B45099A16294d8130p5113d63l49736D4121R1303l5607N7139E7222j5081
10670D2141J88791G7087K51323b51543B9007a5001j4734D05358a63599h1015K5429
10659e5586D7480L6009a54332k72790J18625i0489l27029e8487C15691n8163b80977
$$ plain form
10647 -220067 -152812 -59898 25294 -392088 421557 -156319 -22100 -228907 12814 111475 -275275
10635 116350 190984 -4659 -351657 -372164 -479598 -129921 -26893 -157563 -36417 -50896 -228370
10624 -228370 -535389 102397 117281 -70830 166542 235388 -166246 -32650 -400589 -20014
10613 189854 -80347 79196 -87653 -233618 -135285 -165484 189379 -195232 131607 274347
10603 274347 200760 -176295 66691 -331729 163587 288223 165091 -110277 -54189 -123753
10593 -123753 160524 -245119 -133555 13141 74179 -184243 -3446 62219 57632 -162246 13634
10581 385756 51804 -195306 -162157 -77472 -39555 186888 -175602 -147644 230182 -342027
10570 -40786 132174 -81466 -130229 -102921 -10319 -279880 15270 -4001 -347871 -198581 19094
$$ packed form
10647b20067O7255e9898B5294c92088D21557a56319b2100k06807A2814R8661b75275
10635A16350P4634d659l46998k0507j07434a29921b6893j30670c6417j4479j77474
10624b28370l07019A02397J4884g0830A66542O8846a66246c2650l67939b0014
10613A89854h0347G9196h7653j45965R8333l0199A89379a95232A31607J42740
10603B74347p3587a76295F6691c31729A63587J24636j23132a10277e4189o9564
10593a23753A60524b45119J11564A3141O1038a84243c446F2219m587a62246A3634
10581C85756E1804a95306L3149g7472L7917A86888a75602K7958B30182c42027
10570d0786A32174h1466m8763K7308a0319k69561A5270d001l43870J49290A9094
$$ plain form
10558 99560 -114376 164802 -123819 -469727 83025 -74875 62199 -21281 -185257 91615 -120990
10546 -137072 -44361 29985 -78143 -5593 147040 -237881 -466905 -214701 79986 -407767 -222957
10535 -222957 -104357 -246512 -56285 -54153 -318759 3607 -56924 140725 123732 -7555 -179289
10524 -179289 89176 -22886 -116897 -33102 249565 -143163 -76810 -8620 -41148 -34169 242735
10512 -53396 57756 106458 101367 64560 -73720 -3038 -181806 -127947 33855 127408 -1918 103868
10499 -43965 -130249 -147188 -98120 -222814 -142141 7972 -1657 -376946 235319 -594090 -85483
10487 -112681 -158711 -9898 333000 72588 121239 -136584 437235 568720 612729 176421 -24882
10475 -164560 -21173 392675 -2317 64374 59409 102056 181810 334667 251277 -88118 -250520
$$ packed form
10558I9560a14376A64802a23819l45908H3025g4875F2199b1281j63976I1615a20990
10546a37072d4361B9985g8143e593A47040b37881k29024b14701G9986d07767J84810
10535b22957a04357j42155e6285K132k64606C607e6924A40725j6993g555j71734
10524a79289H9176b2886r4011c3102B49565a43163O6353h620l2528O979B42735
10512e3396E7756M8702n091l6807g3720c038j78768N3859C3855R3553a918A03868
10499d3965q6284j6939M9068j24694Q0673G972a657l75289B35319e94090h5483
10487a12681m6030i898C33000G2588M8651a36584D37235J31485M4009A76421b4882
10475a64560b1173C92675b317F4374m965M2647P9754J52857q3390h8118j62402
$$ plain form
10464 -250520 174552 138819 -45836 -16875 44124 -71486 -241563 67990 -213660 86475 -316769
10452 -17319 151237 -23624 -124155 -11642 -33591 -226887 53508 -4581 -22516 -169056 272686
10440 -103844 105540 501580 159407 -326407 -214766 87724 -104673 68388 35210 -427638
10429 -48159 -112545 -129270 142772 -246688 -5715 -224047 -147809 -138441 59086 11279 -32277
10417 -29651 -81656 18784 11775 -278007 -92449 77120 -121810 114823 -4668 -25901 7859 -136180
10404 438974 -253255 -29488 -32518 308724 -71872 176047 147279 5234 26707 5890 280700
10393 280700 116517 330465 457447 77623 208389 277818 373923 363767 -39187 41413 168961
10382 168961 -284031 79182 349842 -21725 111420 -4499 159539 338713 -84481 82604 148965
$$ packed form
10464b50520A74552l5733d5836a6875D4124g1486j70077F7990b13660H6475c16769
10452a7319A51237b3624j00531a1642k1949j93296E3508d581j7935j46540B72686
10440a03844A05540L96040A59407c26407J11641H7724a04673F8388l3178d27638
10429d8159o4386j6725A42772b46688e715k18332P6238R368E9086A1279c2277
10417b9651n2005A8784p009b78007i2449G7120a21810A14823d668k1233G859a36180
10404D38974b53255b9488l030C08724g1872A76047k8768E234K1473E890K74810
10393B80700A16517K13948J26982G7623J30766O9429R6105j0156c9187D1413J27548
10382A68961b84031G9182K70660b1725A11420d499A59539J79174h4481H2604O6361
$$ plain form
10371 148965 -233892 185664 376651 341502 518511 407506 359964 243377 337402 426685
10361 426685 236860 63839 117204 222901 71373 13569 -133543 -34326 99465 383170 466378
10350 466378 639352 440504 436802 58276 -278673 343422 608785 295499 357599 56034
10339 -42981 230366 85519 50233 371436 450841 406513 87800 250470 -317352 -33121 -3221
10327 -12668 -14493 308650 -31128 171621 98250 -98236 440867 110513 -132067 348935 -7812
10315 273497 -88322 -164971 -9705 -87153 257473 -89435 33258 -129218 232367 49940 89891
10304 89891 -289377 -328616 367836 -85818 19935 58170 23327 149043 104232 -288855 -243371
10293 -243371 -184162 325790 -207337 112662 -175817 -101646 -131116 40512 149259 274637
$$ packed form
10371A48965b33892A85664J90987l5149J77009j11005m7542j16587R4025Q9283
10361D26685j89825F3839N3365J05697G1373A3569a33543c4326I9465K83705Q3208
10350D66378J72974j98848l702E8276b78673C43422K65363B95499O2100E6034
10339d2981B30366H5519l5286L21203P9405m4328H7800J62670c17352c3121c221
10327a2668j825C08650c1128A71621p3371i8236D40867A10513a32067C48935g812
10315B73497h8322p6649i705p7448B57473h9435C3258a29218B32367D9940L9951
10304H9891b89377l9239C67836h5818A9935L8235B3327J25716m4811b88855M5484
10293b43371N9209C25790b07337A12662a75817P4171k9470D0512J08747J25378
$$ plain form
10283 274637 -247023 483 -103729 -92429 -134552 42012 174428 -163745 254620 -39952 -49014
10272 -49014 194318 99026 170264 -59733 102420 -68853 -75386 126855 67225 452106 185024
10260 113574 -89517 163731 172215 35185 38498 105236 214561 -150707 249674 88456 -63144
10248 119043 60999 -88202 21996 6216 -142921 -16471 64561 -280218 16217 -7681 -95883
10237 -95883 -404758 49595 -86658 -25466 -134426 -115403 77412 -110274 48142 -170121 175833
10225 -34214 160513 -104278 -59488 -36191 -312696 -211483 34722 -186153 5721 -59129 -12298
10213 164174 -69078 246128 81926 368443 -73027 -132357 -215602 86652 -281605 -279373 -213772
10202 -213772 114068 25537 -143625 -37759 13189 -290767 110493 -225106 -276012 -298645
$$ packed form
10283B74637b47023D83a03729J1300m2123D2012J32416a63745B54620c9952r062
10272d9014A94318r5292P1238e9733A02420f8853o533A26855n9630L84881A85024
10260A13574h9517A63731Q484C5185L313O6738J09325a50707B49674H8456f3144
10248A19043n8044h8202B1996F216a42921a6471F4561b80218A6217g681q8202
10237i5883l08875D9595h6658b5466j08960J9023G7412a10274D8142a70121A75833
10225c4214A60513a04278M4790K3297k76505J01213C4722a86153E721e9129a2298
10213A64174f9078B46128H1926K86517g3027n9330q3245H6652b81605K232O5601
10202b13772A14068B5537a43625c7759A3189b90767A10493b25106n0906k2633
$$ plain form
10192 -298645 185440 18968 -321587 108984 85458 77569 -308409 -258456 -123895 -327798
10182 -327798 57131 -263011 73521 -35854 205376 37507 -148226 -50023 -169428 -116578 -46020
10170 -320668 -18320 469854 74940 -89577 -253610 -61448 35400 -153136 157672 64298 -263820
10158 -191159 74150 -229696 215009 -281170 56703 326032 258032 5684 143336 44977 -239606
10146 90603 -108118 -314150 -31632 -75541 -91458 55960 -247597 -547460 -15274 -337089 182622
10134 -49738 242601 -27135 139011 129157 -250796 -151444 -99883 304847 -795 -351681 -16841
10122 -16991 -365536 28141 -358497 -317025 -95797 88934 -54105 -100032 -200789 183533 -97781
10110 -28953 -314671 -34459 -182264 -4302 5182 -34707 -431581 136860 -241388 151432 -84816
$$ packed form
10192b98645A85440A8968c21587A08984k3526p889c08409M9953a23895k03903
10182c27798E7131b63011G3521c5854B05376C7507a48226e0023j19405N2850d6020
10170c20668a8320D69854G4940h9577j64033f1448C5400a53136A57672F4298b63820
10158a91159G4150b29696B15009b81170E6703K69329o8000E684J37652D4977b39606
10146I0603a08118k06032c1632m3909j5917E5960b47597k99863a5274l21815A82622
10134d9738B42601b7135A39011r854b50796R9352N1561C04847g95l50886a6841
10122a6991l48545B8141c58497M1472i5797H8934e4105m5927j00757A83533i7781
10110b8953k85718c4459j47805d302E182c4707l96874A36860b41388A51432h4816
$$ plain form
10098 481775 -179840 -92543 184018 -274730 232836 -83809 168529 -89564 -376373 130101
10087 -124606 -154829 -14517 -290759 -24135 -160255 8888 111479 -300186 -281174 30497 -167602
10075 -123799 -55786 28459 -166750 -319384 114115 -377791 -274493 193617 -155041 -184582
10065 -184582 -90058 -102652 -157794 145112 35154 141456 421449 -326397 -232270 202828
10054 38655 -4194 -50700 -72717 105247 145407 -188680 -37677 -196856 227955 -99087 262927
10042 -311930 -246066 -93987 26025 -178265 30007 -166663 49187 22703 -99230 192709 75122
10030 -307305 -267378 -360086 -495272 -212263 -147094 -26600 90886 20317 53117 -195937 -114110
10019 -114110 -83295 67650 -264418 -33386 -374490 80702 -37905 203472 -14424 -108837 60528
$$ packed form
10098D81775a79840Q7297A84018b74730B32836h3809A68529h9564k86809A30101
10087a24606l0223a4517k76242b4135j36120H888J02591c00186J9012C0497a67602
10075a23799e5786B8459a66750j52634A14115c77791J03298A93617a55041k9541
10065a84582i0058j2594n5142A45112C5154J06302K79993c26397R4127B02828
10054C8655d194m6506k2017A05247M0160a88680c7677j59179B27955i9087B62927
10042c11930O5864i3987B6025a78265C0007a66663D9187B2703i9230A92709G5122
10030c07305L9927r2708j35186b12263O5169b6600I0886B0317L2800a95937Q1827
10019a14110L0815F7650b64418c3386l41104H0702c7905B03472a4424r4413F0528
$$ plain form
10007 354668 29783 115023 -166729 -312124 257437 -148553 -26360 -44735 -101871 -38739 -166875
9996 -166875 -1274 -15393 -101351 -243371 -344189 250449 136153 575581 56460 143322 -165861
9984 35117 -33250 -191268 159217 128738 -202214 63824 -44860 279645 96461 -77178 22527
9972 327874 -101741 -147366 28585 145177 46895 -48974 -202575 -208678 -29431 -113535 -124817
9961 -124817 -122358 25191 -490505 182841 83161 -193824 -19210 -81325 -59952 -16836 -257531
9950 -257531 -176674 -212037 105969 -134573 -183735 -75847 99327 4879 151526 78312 -19542
9938 76970 -92693 -20073 -226147 42844 -41220 -237632 -89377 -69395 48601 -17561 -202363
9927 -202363 147966 -62558 182889 -195070 -65233 -20144 167687 19752 -179589 212105
$$ packed form
10007C54668B9783Q5240a66729j45395B57437a48553b6360j8375n7136c8739j28136
9996a66875a274j4119q5958j42020j00818B50449j14296M39428E6460Q6862a65861
9984C5117c3250j58018A59217l0479b02214F3824d4860B79645I6461g7178B2527
9972C27874a01741m5625B8585J16592D6895d8974j53601o103b9431q4104j1282
9961a24817K459B5191d90505A82841H3161a93824a9210o2115K1373a6836k40695
9950b57531Q0857l5363A05969a34573m9162g5847I9327D879J46647p3214a9542
9938G6970i2693b0073k06074D2844d1220j96412h9377J9982D8601a7561j84802
9927b02363A47966f2558A82889a95070f5233b0144A67687A9752a79589B12105
$$ plain form
9916 16659 4966 -170817 -60001 -261737 69845 -169364 136533 31802 -477480 -404096 -244073
9905 -244073 -200198 -196701 192127 226071 435634 10017 -62724 -182377 -125965 30931 -182907
9893 294261 -23846 -83617 -178002 -146415 14512 78807 -146687 -321924 -91522 -66555 287978
9881 6947 9780 -120484 34398 103075 -385146 -32208 -47679 161034 -104737 -143023 -6343 216969
9868 -320935 109148 66793 -233648 -49056 92241 32019 -133954 -7172 -187732 231185 -83688
9856 -37008 -145213 -214880 53220 50173 140703 -261056 -278623 -121535 6567 172822 -99926
9844 -223781 147533 -78010 55518 -353195 -13020 -69445 -212448 -348982 18590 154676 -286495
9832 97553 148363 -24902 250881 -318716 17577 -107648 -161022 -277707 1723 60269 -62980
$$ packed form
9916A6659D966a70817f0001k01736F9845a69364A36533C1802d77480P3384J60023
9905b44073M3875L497A92127L3944K09563A0017f2724j19653N6412C0931a82907
9893B94261b3846n9771r4385L1587A4512O4295a46687j75237i1522K4967B87978
9881F947K833a20484C4398O8677c85146c2208j5471A61034a04737l8286f343B16969
9868c20935A09148m2355b33648d9056I2241C2019a33954g172j80560B31185h3688
9856c7008j08205o9667E3220l047R0530b61056j7567a21535F567J66255i9926
9844b23781A47533g8010E5518c53195a3020n6425j43003j36534A8590J36086b86495
9832I7553N0810b4902B50881c18716A7577a07648n3374j16685A723N8546f2980
$$ plain form
9820 -63499 91040 -61997 81980 -334377 -295173 238376 -1260 -77897 218608 -88757 -102975
9809 -102975 -224509 -253397 7156 294266 35758 -35054 -480038 53016 247283 -6443 -116304
9798 -116304 42072 -31625 -211893 -153218 -316555 -241709 69250 -316972 -58443 -224417 -3867
9786 -72858 -267983 272070 -77141 -62091 239715 -204285 147241 -360675 -254281 -9469 -135159
9775 -135159 -224244 -293115 176750 22243 -290908 -220601 -128869 -14980 -309749 -43921 -81025
9764 -81025 -557066 88094 -147283 -40447 -27271 -160692 -110894 64661 152826 107040 225268
9753 225268 -201114 -16353 121856 -212355 41041 323138 -157566 -31572 -245235 105598
9742 -278488 181306 -205908 -91690 -213255 320713 215283 -90119 133 -30635 -20754 219484
$$ packed form
9820f3499I1040f1997H1980c34377L9204B38376a260p6637B18608h8757j4218
9809a02975j21534k8888G156K87110C5758c5054m44984E3016J94267f443j09861
9798a16304D2072c1625j80268N8675j63337P4846F9250c16972e8443j65974c867
9786g2858j95125B72070g7141J5050B39715b04285A47241c60675J06394i469j25690
9775a35159q9085o8871A76750B2243b90908P0307R1732a4980k94769d3921l7104
9764h1025m76041H8094a47283d0447J3176j33421M9798F4661Q8165m5786J18228
9753B25268b01114a6353A21856b12355D1041K82097a57566c1572k13663A05598
9742b78488A81306b05908i1690j21565C20713j05430i0119A33c0635R881B19484
$$ plain form
9730 -94812 -477132 -251929 -421353 91981 -96421 111659 194453 -22433 123720 175650 -155971
9718 -65401 -154820 25700 -269663 -125130 157987 -107886 -284108 252252 39674 143886
9708 143886 186390 97961 -335695 31571 -369316 38339 290259 -307068 -192167 -123699 128107
9696 83016 -180996 33722 126298 -154239 90130 -25993 -140503 200281 30241 59716 273750
9685 273750 -86660 -151734 -111180 52133 245074 67797 -56943 132615 -238431 -114811 -93471
9674 -93471 128470 -47322 -73730 -185379 33552 -206475 172959 -127718 -207777 -342062 -53051
9662 -51706 79883 -14947 -133025 -169419 -266271 93505 -86450 106852 19117 239300 -55211
9650 15566 92883 -178575 -271035 -25190 117069 -37236 -150308 78511 -177419 -25057 -189036
$$ packed form
9730i4812l82320K25203j69424I1981i6421A11659Q2794b2433A23720N1930a55971
9718f5401q9419B5700b69663a25130A57987a07886j76222B52252C9674J04212
9708A43886M2504q8429c35695C1571c69316C8339K51920c07068J14901O8468A28107
9696H3016a80996C3722R2576a54239I0130b5993j14510B00281C0241K9475K14034
9685B73750h6660o5074M0554E2133J92941F7797e6943A32615b38431a14811K1340
9674i3471A28470d7322k6408j11649C3552b06475A72959a27718q0059j34285e3051
9662e1706G9883a4947j18078l6394r6852I3505h6450A06852A9117K20183e5211
9650A5566P7317a78575r2460b5190A17069c7236j13072G8511a77419b5057j63979
$$ plain form
9639 -189036 23254 -387701 -247159 154793 -58088 166043 -78867 54619 -63047 278347 -57612
9627 -285466 -72188 -299414 -2851 47985 -160117 -306723 -176335 -260403 -206129 -180806 79600
9615 -85578 -120658 96940 2436 -171204 -357157 29646 175595 -122838 37454 133612 -751 195328
9602 -148412 38782 -208047 -400548 83138 -94561 940 -130647 -138001 69978 166316 -262688
9590 24655 -46551 -72057 233770 -177016 176741 21849 242918 154905 117625 -209573 113986
9578 -303766 -66708 149091 32011 32026 56817 -185858 -127430 160576 155916 112000 -255257 -311533
9566 -311533 -341036 -13905 -115393 75233 -161666 66554 175382 -16055 -66010 -59171 -113635
9555 -113635 -51419 -9156 247252 95798 -182493 27806 -45561 59490 34314 -37307 2937 -164284
$$ packed form
9639a89036B3254c87701J40542A54793e8088A66043g8867E4619f3047B78347e7612
9627b85466g2188k27226b851D7985a60117j46606J30388q4068N4274K5323G9600
9615h5578l5080I6940B436a71204j85953B9646J45949a22838C7454R6158g51A95328
9602a48412C8782b08047j92501H3138i4561I40a30647p354F9978R6338b62688
9590B4655d6551k5506B33770a77016A76741B1849K21069q8013l7280b09573A13986
9578c03766f6708A49091C2011J5K4791a85858N8428A60576m660m3916b55257n6276
9566c11533k9503a3905j01488G5233a61666F6554J08828a6055m9955O839n4464
9555a13635e1419i156B47252I5798a82493B7806d5561E9490k5176c7307B937a64284
$$ plain form
9542 127001 -476300 -10271 -191909 129776 -118481 -40454 -268765 -141885 -78662 -62434
9532 -62434 -169927 349919 33599 -166081 -39696 12067 77660 -303323 -69293 -326023 53234
9520 -28618 -122854 -257719 -195496 296807 49181 -54374 -201127 175213 14483 87705 238211
9509 238211 -201761 -510353 -287743 -53630 25065 11503 30713 -106524 263903 30862 -310109
9497 -157231 121731 130675 -69970 -100881 -97926 -6605 -318984 73365 210611 -101234 -210559
9486 -210559 49194 -76803 150601 -69973 107115 -91646 21393 -49956 -352355 -163122 175643
9474 -17389 -27422 -296233 -156466 -28974 65084 -40583 -143242 -114723 76453 214259 -121333
9462 -15791 128715 -133089 79458 111568 -221856 24712 171874 70285 -184859 -80442 -378782
$$ packed form
9542A27001d76300a0271j81638A29776a18481d0454k28311J26880O3223J6228
9532f2434j07493C49919C3599a66081c9696A2067O5593c03323f9293k56730E3234
9520b8618r4236j34865O2223B96807D9181e4374j46753A75213A4483P3222J50506
9509B38211b01761l08592K22610e3630B5065A1503J9210a06524B63903C0862c10109
9497a57231A21731Q944f9970l0911K955f605l12379G3365J37246a01234j09325
9486b10559D9194g6803A50601f9973A07115i1646B1393d9956l02399a63122A75643
9474a7389j0033k68811J39767b8974F5084d0583j02659K8519G6453J37806a21333
9462a5791A28715a33089G9458L2110b21856B4712J47162G0285a84859h0442k98340
$$ plain form
9451 -378782 9309 129039 217770 165470 159724 -135627 -87405 -100267 -116356 -192062 -82014 136563
9438 -205598 -275872 -223405 180281 29894 191037 18164 115557 63776 -54703 -63323 -297072
9427 -297072 62305 -261920 76766 -94072 -163883 200140 -29843 -209658 -151723 225541 -45498
9415 135034 175733 114626 -207816 149041 72980 -66041 52344 -13663 27003 -87504 22550
9403 -202903 -110671 63752 -122436 -236393 -10926 27863 -174573 135379 -366732 -25206 -217958
9392 -217958 -442207 -259079 33985 -151221 -7827 -313604 125316 204709 -45641 -59226 -127833
9381 -127833 -5456 -217043 142876 -165870 -614900 -214851 -82233 -100341 -261798 -12620 52815
9369 -66057 42361 33773 3064 -22993 107056 185455 -181344 -191704 -299888 -103848 -77914
$$ packed form
9451c78782I309J19730Q8731n2300n746a35627M8222j2862j6089p5706h2014A36563
9438b05598p0274N2467A80281B9894J61143A8164R7393n1781e4703q620k33749
9427b97072F2305b61920G6766i4072o9811B00140b9843j79815N7935B25541d5498
9415A35034M0699o1107b07816A49041G2980f6041E2344a3663B7003h7504B2550
9403b02903R2232F3752a22436j13957a0926B7863a74573A35379c66732b5206j92752
9392b17958k24249J83128C3985a51221g827l05777A25316P9393d5641j3585o8607
9381a27833e456k11587A42876a65870m49030b14851h2233j8108j61457a2620E2815
9369f6057D2361q588C064b2993A07056P8399a81344j0360j08184a03848K5934
$$ plain form
9358 -77914 -80560 -170128 337350 -268793 159651 18158 155973 -131981 -229019 49788 -238137
9346 -166240 -130325 -174783 -186258 44792 104036 -51708 -310424 178796 183479 96516 -404714
9334 -83554 -212553 -60519 -144939 90569 124694 -212726 115802 -148525 165159 -319071 -53000
9322 14451 -45275 -363793 -255729 -163833 -50661 -122077 -161759 -37900 168325 -2683 159763
9310 -80304 -278756 130030 -66669 182867 90583 63969 50950 123676 95526 30385 56595
9299 56595 302434 -309959 245881 -68487 -192000 -139086 108967 -30518 -36729 -77135 -79123
9288 -79123 -227809 -146386 444822 117571 -482041 -202319 -250402 27594 -253350 69065 -4059
9276 60947 71613 -209172 -364396 176900 -92049 -88985 -488968 18039 139039 66329 -220662
$$ packed form
9358g7914k646q9568C37350b68793A59651A8158J37815a31981r7038D9788b38137
9346a66240L5915m4458j1475D4792N9244e1708k58716A78796M683q6963d04714
9334h3554j28999f0519q4420I0569L4125b12726A15802a48525A65159c19071e3000
9322A4451d5275l18518J08064R1896e0661p1416l9682c7900A68325b683A59763
9310h0304j98452A30030f6669A82867I0583k6614j3019P2726k8150C0385K6210
9299E6595K45839c09959B45881f8487j23513N2914A08967c0518o211m0406j988
9288g9123j48686Q1423D44822A17571d82041b02319m8083B7594b53350F9065d059
9276F0947J0666b09172j55224A76900i2049L064l99983A8039J21000F6329b20662
$$ plain form
9264 -205354 354212 -80198 -116452 -268972 161945 -31070 115668 -106941 -146806 88061 -193970
9252 216233 141694 -7266 -204884 -450430 56686 126602 -348843 -112320 -628 46211 -219401
9240 125139 260169 -74855 141009 -57348 -204680 85760 -34761 29458 52401 -69782 -51214
9229 -51214 82125 101954 -183604 -169332 -443284 -55915 -2937 -159363 -165799 -12987 251063
9217 -60321 -83056 -17271 -117487 -293988 354766 -217618 -284056 -180896 -193792 40740 13989
9205 -7680 203387 -386604 82281 -77044 106254 -50855 -165 -249455 -82609 224922 25575
9193 -158719 69114 -48007 -83418 -1947 1299 -119028 -122831 -98834 -169854 -93671 -184403 -44812
9180 147495 -104878 358360 -82755 98127 -156394 -9733 -195224 -77735 -79981 -300285 -30944
$$ packed form
9264b05354C54212h0198l6254j52520A61945c1070A15668a06941l9865H8061a93970
9252B16233p4539g266j97618k45546E6686O9916c48843a12320f28D6211b19401
9240A25139J35030g4855A41009e7348j47332H5760c4761B9458K2943f9782J8568
9229e1214H2125J9829a83604J4272k73952e5915b937j56426o436a2987B51063
9217f0321k2735a7271j00216j76501C54766b17618o6438J03160j2896D0740A3989
9205g680B03387c86604H2281g7044A06254e0855a65k49290h2609B24922B5575
9193a58719F9114d8007l5411a947A299a19028l803K3997p1020P6183r0732d4812
9180A47495a04878C58360h2755I8127a56394i733j85491g7735k246k20304c0944
$$ plain form
9168 -36053 -158283 -82730 -268780 81321 -157600 301625 -362870 -289578 -6737 -269497 95269
9156 -301994 200465 96997 -213237 -34695 137016 -123122 -177478 45156 -43960 -328614 -61729
9144 -139184 -58093 -38493 -99541 7477 -96401 96898 20326 -180017 -192158 -65952 -27313 -34156
9132 -34156 38539 89211 -28621 241380 -117864 -66719 465667 5239 -121250 212666 -404320
9120 -125241 50857 192310 -24090 -77231 33470 130218 -90000 -373744 311009 -185542 16052
9108 -90616 80039 -258637 143564 55424 -144132 -123866 -196158 -64697 -48663 91814 -353655
9096 -65938 99748 -222602 -338613 -156067 -112671 -229093 -162747 75602 -332811 427252 10254
9084 272359 -120016 -262808 81619 -24963 -52963 -101516 52508 7677 -188097 3319 -245946
$$ packed form
9168c6053j22230P5553j86050H1321a57600C01625c62870P3292f737k62760I5269
9156c01994B00465I6997b13237c4695A37016a23122n4356D5156d3960k84654f1729
9144a39184e8093J9600o1048G477i6401I6898B0326a80017j2141f5952b7313o843
9132c4156C8539N0672b8621B41380a17864N1145D65667E239a21250B12666d04320
9120a25241E0857J41453b4090n3141C3470R6748i0000k83744C11009a85542A6052
9108i0616H0039b58637A43564E5424a44132K0266p2292f4697J6034I1814c53655
9096f5938I9748b22602j16011a56067M3396j16422O6346G5602c32811D27252A0254
9084B72359a20016j42792H1619b4963k8000m8553E2508G677a88097C319b45946
$$ plain form
9072 -39920 -176171 -71940 -151583 78507 118242 81889 -623729 79761 -67164 11539 -61650
9060 -24242 95858 2454 -162927 124417 -186491 36294 -153120 -91974 -33003 153381 -468
9048 169974 -538591 -171885 -198383 -468664 34016 325014 259842 -78275 150372 -216547
9037 104421 -103969 -236606 56812 -124350 128172 265845 -14772 -93595 -92843 -9548 48955
9025 -194680 77074 -194213 -214971 217369 -46211 134645 66160 -56816 -11820 -125114 -47391
9013 -75346 -97709 -67191 -90884 76090 108062 102599 -235423 -235191 -486214 57617 -64434 -118249
9001 -118249 217501 73944 -207025 -291911 -123223 69120 -231381 200867 15887 140359
8991 140359 -186834 -127695 -96127 -263631 -11366 -170907 6268 -383620 -254445 -134314 -22005
$$ packed form
9072c9920j36251g1940p9643G8507L9735l6353f23729G9761f7164A1539f1650
9060b4242I5858B454a62927A24417a86491C6294a53120O1146c3003A53381d68
9048A69974e38591a71885k6498k70281C4016K90998o5172g8275A50372b16547
9037A04421a03969j32637E6812a24350A28172J37673a4772p8823P52i548D8955
9025a94680G7074a94213k0758B17369d6211A34645F6160e6816a1820j13294d7391
9013g5346k2363L0518k3693G6090L1972n463b35423K32k51023E7617f4434n3815
9001a18249B17501G3944b07025q4886a23223F9120b31381B00867A5887J24472
8991A40359a86834N9139L1568j67504a1366j59541F268c83620J29175J20131b2005
$$ plain form
8979 92961 265301 25172 60870 -56300 -150321 117942 -123606 -30414 -175553 -310839 99956
8967 -51430 -368935 -38641 -136290 -3103 -198986 -148149 -14890 -252136 -145789 -269796 242185
8955 -124008 259826 -107313 270702 151245 -159061 -249979 -79103 67465 -105690 -125272
8945 -125272 -429104 -185163 138141 -31381 -18807 100545 119827 233222 -347771 39292
8934 140742 18255 -139981 -181421 -492531 111365 -171004 -168093 17142 72284 674432 1159178
8923 1159178 3516380 9296260 8924243 1600197 407414 437907 454127 1573 73893 -11766
8912 157755 -46938 44741 164142 91502 118211 368119 130973 200190 -72097 163544 -52413
8900 3567 -196594 -86840 -34332 -19820 -165727 -39043 -132985 -83009 132247 64498 86418
$$ packed form
8979I2961J72340B5172L5698e6300r4021A17942a23606c0414j45139j35286I9956
8967e1430l17505c8641r7649c103j95883N0837a4890k37246J06347j24007B42185
8955a24008B59826a07313B70702j19457a59061r0918g9103F7465a05690j9582
8945a25272l03832a85163A38141c1381J2574A00545J9282J13395c47771C9292
8934A40742A8255a39981m1440l11110A11365a71004K911A7142N5142O02148M84746
8923A159178K357202N779880l72017A600197D07414L0493J6220A573P2320a1766
8912A57755d6938D4741J19401p2640K6709K49908A30973O9217g2097A63544e2413
8900C567a96594h6840c4332J4512j45907c9043r3942M9976A32247F4498K1920
$$ plain form
8889 86418 -216026 -100143 -45928 -60902 -82615 24551 -50866 -217900 182991 -78411 -208772
8878 -208772 -384080 356 -5207 -116571 118138 25136 -54755 -15042 -403823 -137897 -258328
8867 -258328 -273307 -1847 260024 -233063 74770 34776 59935 -260215 -129412 -90637 -57371
8856 -57371 -220555 -190838 -255835 -132453 -128264 64929 78405 -18481 -357143 -256010 45096
$$ packed form
8889H6418b16026a00143d5928j4974k1713B4551e0866j67034A82991g8411j30361
8878b08772j75308C56e207j11364A18138B5136e4755a5042l88781a37897j20431
8867b58328j4979a847B60024b33063G4770C4776K5159b60215a29412L8775L3266
8856e7371j63184K9717o4997J23382M189F4929J3476a8481l38662J01133D5096
$$ [...]
##END NTUPLES=NMR SPECTRUM
##END=
