
##TITLE=AC1230_PANAH12123_6074932_n4p4JGhNxu
##JCAMPDX= 6.0         $$ Bruker NMR JCAMP-DX V2.0
##DATA TYPE= NMR SPECTRUM
##DATA CLASS= NTUPLES
##ORIGIN= BRUKER
##OWNER= Administrator
$$ 1.72 TOPSPIN		Version 2.1
$$ 2012-05-08 00:27:51.812 -0500  Administrator@TOPSPIN
$$ Compression mode = diff/dup
##.OBSERVE FREQUENCY= 400.13188235
##.OBSERVE NUCLEUS= ^1H
##.ACQUISITION MODE= SIMULTANEOUS (DQD)
##.ACQUISITION SCHEME= undefined
##.AVERAGES= 8
##.DIGITISER RES= 22
##SPECTROMETER/DATA SYSTEM= spect
##.PULSE SEQUENCE= zg30
##.SOLVENT NAME= COFFEE_meoh
##.SHIFT REFERENCE= INTERNAL, COFFEE_meoh, 1, 14.98061
##AUDIT TRAIL= $$ (NUMBER, WHEN, WHO, WHERE, PROCESS, VERSION, WHAT)
$$ ##TITLE= Audit trail, TOPSPIN		Version 2.1
$$ ##JCAMPDX= 5.01
$$ ##ORIGIN= Bruker BioSpin GmbH
$$ ##OWNER= Administrator
$$ $$ C:\Bruker\TOPSPIN/data/COFFEE/nmr/AC1230_PANAH12123_6074932_n4p4JGhNxu/10/pdata/1/auditp.txt
$$ ##AUDIT TRAIL=  $$ (NUMBER, WHEN, WHO, WHERE, PROCESS, VERSION, WHAT)
(   1,<2012-05-08 00:27:44.375 -0500>,<Administrator>,<TOPSPIN>,<go>,<TOPSPIN 2.1>,
      <created by zg
	started at 2012-05-08 00:26:37.406 -0500,
	POWCHK enabled, PULCHK disabled,
       configuration hash MD5:
       AF F2 23 6B 01 CD 40 DD E5 A1 38 A0 06 EA F7 77
       data hash MD5: 64K
       31 27 A1 19 4A 82 A8 DD 38 E6 30 82 87 72 1B DF>)
(   2,<2012-05-08 00:27:47.375 -0500>,<Administrator>,<TOPSPIN>,<proc1d>,<TOPSPIN 2.1>,
      <Start of raw data processing
       efp LB = 0 FT_mod = 6 PKNL = 1 PHC0 = 0 PHC1 = 0 SI = 32K 
       data hash MD5: 32K
       E0 65 2B 63 00 2A CD 07 17 A1 F6 DE 28 E0 D6 BF>)
(   3,<2012-05-08 00:27:47.812 -0500>,<Administrator>,<TOPSPIN>,<proc1d>,<TOPSPIN 2.1>,
      <pk PHC0 = 212.4811 PHC1 = 0 
       data hash MD5: 32K
       4B 4F 91 51 88 30 A9 FC 35 3E C9 D4 6D 37 BC D1>)
(   4,<2012-05-08 00:27:47.906 -0500>,<Administrator>,<TOPSPIN>,<proc1d>,<TOPSPIN 2.1>,
      <abs ABSG = 1 
       data hash MD5: 32K
       C4 BD 54 31 D2 17 DA D1 67 21 48 9A 90 F9 17 60>)
(   5,<2012-05-08 00:27:47.968 -0500>,<Administrator>,<TOPSPIN>,<proc1d>,<TOPSPIN 2.1>,
      <abs ABSG = 2 
       data hash MD5: 32K
       F7 D4 74 04 F7 26 CE DB 21 DC 81 78 F8 CB B5 20>)
(   6,<2012-05-08 00:27:48.000 -0500>,<Administrator>,<TOPSPIN>,<proc1d>,<TOPSPIN 2.1>,
      <abs ABSG = 3 
       data hash MD5: 32K
       25 68 15 27 EC 97 63 B9 94 42 EA 06 34 07 7B 65>)
(   7,<2012-05-08 00:27:48.078 -0500>,<Administrator>,<TOPSPIN>,<proc1d>,<TOPSPIN 2.1>,
      <abs ABSG = 4 
       data hash MD5: 32K
       9F 04 31 8C 02 ED E3 29 8F 47 C5 2E 83 65 05 D6>)
(   8,<2012-05-08 00:27:48.109 -0500>,<Administrator>,<TOPSPIN>,<proc1d>,<TOPSPIN 2.1>,
      <abs ABSG = 5 
       data hash MD5: 32K
       76 9C 5D 72 A7 31 B5 D3 97 5B AB 26 B4 EE 76 17>)
$$ ##END=
$$ 
$$ $$ hash MD5
$$ $$ 7F 37 BD 50 19 07 AE 17 53 27 30 F7 81 3C 79 7B
##$RELAX= 
##$RELAX= 
##$RELAX= 
##$RELAX= 
##$RELAX= 
##$RELAX= 
##$RELAX= 
$$ Bruker specific parameters
$$ --------------------------
$$ [...]
##$TP= (0..7)
150 150 150 150 150 150 150 150
##$TP07= 0
##$TPNAME0= <>
##$TPNAME1= <>
##$TPNAME2= <>
##$TPNAME3= <>
##$TPNAME4= <>
##$TPNAME5= <>
##$TPNAME6= <>
##$TPNAME7= <>
##$TPOAL= (0..7)
0.5 0.5 0.5 0.5 0.5 0.5 0.5 0.5
##$TPOFFS= (0..7)
0 0 0 0 0 0 0 0
##$TUNHIN= 0
##$TUNHOUT= 0
##$TUNXOUT= 0
##$USERA1= <user>
##$USERA2= <user>
##$USERA3= <user>
##$USERA4= <user>
##$USERA5= <user>
##$V9= 5
##$VALIST= <valist>
##$VCLIST= <CCCCCCCCCCCCCCC>
##$VD= 0
##$VDLIST= <DDDDDDDDDDDDDDD>
##$VPLIST= <PPPPPPPPPPPPPPP>
##$VTLIST= <TTTTTTTTTTTTTTT>
##$WBST= 1024
##$WBSW= 4
##$XGAIN= (0..3)
0 0 0 0
##$XL= 0
##$YL= 0
##$YMAX_a= 528370
##$YMIN_a= -630833
##$ZGOPTNS= <>
##$ZL1= 120
##$ZL2= 120
##$ZL3= 120
##$ZL4= 120
##$ABSF1= 14.98061
##$ABSF2= -5.57192
##$ABSG= 5
##$ABSL= 3
##$ALPHA= 0
##$AQORDER= 0
##$ASSFAC= 0
##$ASSFACI= 0
##$ASSFACX= 0
##$ASSWID= 0
##$AUNMP= <proc_prof1d_extract_pilot.lims>
##$AXLEFT= 0
##$AXNAME= <>
##$AXNUC= <1H>
##$AXRIGHT= 0
##$AXTYPE= 0
##$AXUNIT= <>
##$AZFE= 0.1
##$AZFW= 0.1
##$BCFW= 0
##$BC_mod= 0
##$BYTORDP= 0
##$COROFFS= 0
##$CY= 15
##$DATMOD= 1
##$DC= 0
##$DFILT= <>
##$DTYPP= 0
##$F1P= 0
##$F2P= 0
##$FCOR= 0.5
##$FTSIZE= 32768
##$FT_mod= 6
##$GAMMA= 0
##$GB= 0
##$INTBC= 1
##$INTSCL= 1
##$ISEN= 128
##$LB= 0
##$LEV0= 0
##$LPBIN= 0
##$MAXI= 10000
##$MC2= 0
##$MEAN= 0
##$ME_mod= 0
##$MI= 0
##$NCOEF= 0
##$NC_proc= -8
##$NLEV= 6
##$NOISF1= 0
##$NOISF2= 0
##$NSP= 0
##$NTH_PI= 0
##$NZP= 0
##$OFFSET= 14.98061
##$PC= 1
##$PHC0= 212.4811
##$PHC1= 0
##$PH_mod= 1
##$PKNL= yes
##$PPARMOD= 0
##$PPDIAG= 0
##$PPIPTYP= 0
##$PPMPNUM= 2147483647
##$PPRESOL= 1
##$PSCAL= 4
##$PSIGN= 0
##$PYNMP= <proc.py>
##$REVERSE= no
##$SF= 400.13
##$SI= 32768
##$SIGF1= 0
##$SIGF2= 0
##$SINO= 400
##$SIOLD= 32768
##$SPECTYP= <>
##$SREGLST= <1H.CDCl3>
##$SSB= 0
##$STSI= 32768
##$STSR= 0
##$SW_p= 8223.68421052632
##$SYMM= 0
##$S_DEV= 0
##$TDeff= 65536
##$TDoff= 0
##$TI= <>
##$TILT= no
##$TM1= 0
##$TM2= 0
##$TOPLEV= 0
##$USERP1= <user>
##$USERP2= <user>
##$USERP3= <user>
##$USERP4= <user>
##$USERP5= <user>
##$WDW= 1
##$XDIM= 32768
##$YMAX_p= 468590131
##$YMIN_p= -689068
##$CURPLOT= <Network HP LaserJet P1505>
##$CURPRIN= <$Network HP LaserJet P1505>
##$DFORMAT= <normdp>
##$LAYOUT= <+/1D_H.xwp>
##$LFORMAT= <normlp>
##$PFORMAT= <normpl>
##$SURQMSG= 1
$$ End of Bruker specific parameters
$$ ---------------------------------
##NTUPLES= NMR SPECTRUM
##VAR_NAME=  FREQUENCY,     SPECTRUM/REAL,   SPECTRUM/IMAG
##SYMBOL=    X,             R,               I
##VAR_TYPE=  INDEPENDENT,   DEPENDENT,       DEPENDENT
##VAR_FORM=  AFFN,          ASDF,            ASDF
##VAR_DIM=   32768,         32768,           32768
##UNITS=     HZ,            ARBITRARY UNITS, ARBITRARY UNITS
##FACTOR=    0.250966925370066, 1,           1
##FIRST=     8223.43324360095, -110266,      -12142
##LAST=      0,             -41735,          -559105
##MIN=       0,             -689068,         0
##MAX=       8223.43324360095, 468590131,    0
$$ Real data points
##PAGE= N=1
##DATA TABLE= (X++(R..R)), XYDATA
$$ [...]
23796 -46026 188788 -150807 224197 -345944 -76591 207007 141636 -79786 14154 -68652 -237397
23785 -237397 -47816 -215254 -248462 126233 73723 -181382 -279632 -366069 25205 129574 110464
23774 110464 -92065 -223354 -231464 -106355 -1561 -317441 -129732 59679 97783 226862 -295070
23762 -82641 136487 15008 144103 240383 -30018 39110 203671 -32022 120282 72029 -13332
23750 95180 -20694 217447 -142862 -236 -80165 91144 -250359 -35852 104924 -101924 -200447
23739 -200447 -186331 -25787 -52945 -54723 125258 69702 181816 280128 88244 87129 -170754
23727 24265 177303 179213 196638 -40361 -147436 -23958 -46880 -426 -138373 111027 -83506
23715 244834 -92001 62712 -11771 -192166 215872 237846 244900 -12390 45986 525063 163606
23703 11536 -29486 -90142 10932 -103684 98131 73416 135053 -61325 -132123 -112889 123696
23691 -150308 5303 33630 184034 295365 142824 -44523 32344 -404520 59083 -69476 185737
23679 -78147 88511 288096 -66701 297623 116369 63748 -100128 223434 -59023 -219192
23669 -219192 -68960 -131637 273776 -172781 -212104 -128841 61357 -186273 -79378 -270438 -177842
23658 -177842 30812 -11300 -223100 213395 116086 49421 78969 -9072 -79992 -177012 -341640
23647 -341640 107508 -159426 -245054 -188127 19276 -46277 216207 -218342 44492 196318
23637 196318 -140563 -80351 -31654 -311331 89638 -46198 12307 134031 272125 -25935 -100973
23626 -100973 -347009 -57970 194405 131881 204972 188503 -57466 202781 -6383 -357449 -36373
23614 -44201 -4274 -55302 42563 -124262 32636 16488 -231955 -66467 -144044 174291 -158386
23602 353536 -64190 -282384 140766 41926 -97097 160636 -106170 -8531 127006 72777 -115849
23590 -236218 95150 114618 17004 -51914 -62726 263265 -40657 -111536 -3139 -37913 172698
23578 -380206 -109806 88848 44113 496088 -137453 436425 -175529 269775 -114061 -438520
23568 -438520 160777 -76315 22147 25607 -385228 -11210 143273 55681 -100492 -200449 200284
23556 -162590 131859 -221844 44775 -179102 107736 44895 196616 -328033 234337 134820
23546 134820 -64175 -136258 -143673 -272603 -194143 -151614 -235431 -288318 71083 -30455 177732
23534 96175 19211 132451 153593 -373143 -173706 5584 224510 -454833 328781 25926 -380138
23522 -287271 -122011 -42506 67955 -54570 44979 -192425 -40110 105274 -194766 -156048 174081
23510 136645 71089 53654 -70542 143875 -356228 97847 -64059 -51939 -100557 59364 161699
23499 161699 100390 67185 211904 -155216 233386 56676 232833 -3967 99642 -146905 256906
23487 -225251 -159041 71868 47638 -257321 85272 -66838 59942 -108738 21570 31407 86402
23476 86402 -305539 -56185 48028 34921 7149 -275236 -49901 23441 193700 -37523 30838
23464 -200351 -77029 -159032 122576 28104 151642 -121721 21265 -12074 -126331 194819
23453 -84140 -176947 67503 -134319 -64868 22597 291010 -68140 145027 -147923 95786 -42497
23441 101736 89993 -106790 -42081 -118511 -228057 145190 -278601 -19936 -329170 145868
23430 -60597 166605 -54322 -57059 -46876 48466 37167 94800 -92503 81508 50869 -78608 176097
23417 -69704 -94506 -32987 239686 63792 -243762 146360 20567 237768 48269 -196041 -19921
23405 -284862 -113436 153049 211093 97377 208827 -162905 -120247 -226622 -37435 44666
23394 -278504 135531 246161 -199664 28813 -41972 -121178 59457 -103704 -63190 95219 117918
23383 117918 152656 195137 -128287 242948 256589 487408 -189680 51229 246982 -92056
23372 294145 93945 -71060 -89032 149868 40779 24990 29903 33886 -50852 68811 -102528
23360 -54109 200726 -86277 -159619 -36654 -150678 172058 105921 -301692 58196 332233 130501
23348 44129 -316827 -105866 -118549 -196108 -61346 -1002 -138470 -95430 -87685 -588914 84833
23336 -56111 149715 -27809 114442 -110463 182646 211567 377279 -261578 -110140 -282081
23326 -282081 -153387 70335 -56792 220026 168422 -12910 -48478 203124 287624 -250432 21570
23314 -10433 -191408 39546 38899 15540 225416 -9486 623796 -186932 309675 17599 -340746
23302 4897 -54102 58477 54957 -50341 117336 308220 209850 -329673 92009 -269304 76675
23290 90831 -271476 -47277 -125152 -125740 -208787 -250365 19267 13048 -201546 -269462 5446 -25495
23277 -117746 -116021 -102806 154719 -7609 77860 37230 -229428 12547 51192 -4394 178118
23265 -201159 -54162 -190385 23320 -100886 -111452 191331 32657 197243 -4609 -99559 158275
23253 -265020 133013 298207 -48628 95293 59015 -119106 138904 -332632 -97028 177343
23242 -82622 -53134 205346 -234321 -138055 154315 238458 -448812 17085 -168310 -47368 285472
23230 -132783 147801 -101788 -12735 235285 132229 259827 73629 -94874 72343 -41124
23219 -409881 -3716 -18925 -86812 -189503 -82187 452292 -174519 -14636 143486 -203030 81004
23207 127471 136279 4226 -189744 1975 285093 -114518 46191 29649 -173778 -280888 -30488
23195 -6568 -232476 -260128 309401 -50594 14258 295981 39443 79760 -87618 -224348 -15585
23183 -40513 32449 231882 288086 -126110 74147 -163255 -525078 -364569 173486 105352
23173 105352 -61664 179341 181520 -162019 -6105 -344512 30732 -165983 9006 165858 304040
23162 304040 177580 -225149 293074 -21607 40009 158606 16171 122544 64006 170819
23152 170819 -67736 -86707 -147076 -19103 172166 147053 223162 -203063 -140494 37307 265997
23141 265997 186936 184005 -24466 -137077 -141103 -212304 24670 -155689 -178750 -229 8154 -131381
23128 115433 236166 -266298 110445 186525 -195506 49036 26476 61534 -107343 120269
23117 119308 -173615 -61039 -251813 -17456 43900 -222572 -470518 -12160 -271423 193814
23106 192371 24737 58862 -404718 100985 -227831 13217 84698 70167 -28596 78202 6657
23094 -406623 56040 81090 249447 80770 54424 197735 237828 91335 -279735 83748 -69373
23082 97867 -289178 88092 -197912 -11645 595271 94676 83445 -60920 165465 -171077 -175178
23071 -175178 -298104 140333 64565 -199888 -146259 -316103 67565 -253993 -90442 -145175
23061 -145175 -52955 -170827 336235 36091 225597 170845 -261128 -124334 -177346 -29064
23050 56128 130903 201938 -64582 227292 -143671 433056 109586 131417 36476 -39849 -239674
23039 -239674 -151714 14243 43016 29597 257156 -12713 -150471 100737 1078 -71309 -441060
23028 -441060 212797 -46282 203344 -24330 18373 -78294 99776 -79800 -195704 20953 349255
23017 349255 101707 63738 80792 -355389 -252614 539041 -127933 -30083 -183455 -254085
23007 -254085 76623 14094 -51155 -255825 152225 -111842 -73731 68465 30792 -111210 -216702
22996 -216702 148721 -163554 -103941 -292758 159455 86978 -11318 -306786 -186494 -270292
22986 -270292 -286574 -16098 25092 -71059 35356 25465 -230151 -143485 75477 -152881 -165095
22975 -165095 2227 -92895 -145437 96176 22304 -141040 21523 -12527 75917 103314 -183918
22963 -254532 57736 245628 -240936 -134097 238937 -102616 -11694 -104920 -94646 -34662
22952 67372 -115742 120953 -1453 121473 83243 -2883 269840 194890 296670 -140964 14013
22940 -240425 -107497 46018 -186075 118117 -95116 -237762 133412 -168586 96526 19624
22929 -195592 1093 29762 227474 55465 -238590 343649 46993 -31065 -464262 31403 79486
22918 79486 -199928 -249721 184379 21493 24319 -42082 -53973 -263123 -89585 143747 -33521
22906 -164181 83454 -93165 15948 164730 255323 53857 -313691 -117398 -29594 -51800 13955
22894 83802 -9268 29729 195194 -290005 92982 309249 -94757 -6764 214700 215432 24877 -169134
22881 113349 74555 -54279 -30686 -28430 -149682 -493625 73842 -98486 -109395 60054 -188032
22869 116923 -188606 5726 -231834 161294 114983 -36961 55904 -44152 -260315 18458 -128295
22857 -34211 75414 -173601 116741 202451 -93574 69467 -14931 -20938 -208073 -91329 223825
22845 168746 271152 29464 -153920 -612170 9186 27855 -168938 -148591 -207582 112167 -105906
22833 -93442 -95836 -37199 -398617 129455 217003 186275 214666 99483 -101742 115236 165030
22822 165030 -229887 31287 -61243 86370 187623 -45123 115690 -133508 -145624 -101081 -104899
22811 -104899 79245 -98153 63857 -48169 236921 -10395 -109778 205428 -98362 -234764 -435774
22800 -435774 -399577 107732 103539 -12181 -109894 46914 206677 103738 -19570 12088 21504
22789 21504 -16776 -257055 82619 -165795 -200254 -220278 34479 -300082 1718 79420 83155
22778 83155 44308 -406041 -185201 -319803 -11791 -83138 -252116 -26567 -123862 -112681 66593
22766 -346722 -115743 48293 114019 269039 -191822 140848 -286242 -106324 11645 -124019
22755 -286712 -104091 25785 30998 148688 -197877 168286 -220133 66308 220110 -156731
22744 -285955 -14928 -137246 336758 354774 -392101 -77917 -492859 23838 131779 -222043
22733 101207 74004 120627 423849 59483 -51035 -170848 -291898 -104597 3372 -104758 -44676
22721 -174901 -69752 -146329 -54133 -20925 -221586 150798 -328479 -36770 -32308 -67600 -13684
22709 -43456 -12370 163130 -123441 235410 46770 -224598 -432485 63958 -180382 -72247
22698 147017 223068 -131861 403287 69533 280323 278848 -58272 64977 -79502 -66124 -127934
22687 -127934 -189008 135212 305319 -178213 -15005 315050 161744 -78815 33463 -136097
22676 -106562 -11133 177479 -167329 88571 -49523 -2986 -305391 -235532 246199 243086 -276911
22664 -60549 -7898 114207 -431445 -152152 -77938 -20313 66444 -75013 24593 -16712 -131802
22653 -131802 147400 75555 -494170 66725 29893 -121267 -458214 -403324 34861 81214 -187974
22641 159443 -142813 7426 -40410 -278470 -108686 177682 -143864 -204418 114277 125585
22631 125585 26277 57275 44542 121579 87633 190771 -131208 -42036 -350896 -17770 150509
22619 142028 80696 361579 300115 -59248 226974 56130 -271371 -114855 129336 162985
22609 162985 -64199 9001 82343 -359739 -16064 -131167 74912 207965 -120993 -111200 86993
22597 -59094 -14877 65374 -180661 -104466 -11447 138359 -146851 -147523 34357 128962 226754
22586 226754 -147794 -251397 149633 -190897 128265 -55871 -171259 73641 304537 -261398
22575 -306884 -17266 -234179 -178711 -76209 391080 133329 43474 -53513 -191498 -67800 110080
22563 37063 39562 -226464 48413 301501 -170450 -124657 65927 -251870 -92210 -457941 -323603
22552 -323603 -192318 152934 122724 -16744 -81947 -45363 -50322 74252 161459 6754 -88367
22540 312121 -98886 67463 -15794 -109498 4228 40070 -119264 9753 39964 -108298 -117046 180618
22527 -146113 41690 7165 288020 -14306 -277911 -22819 214009 233069 -8072 -26454 -208560
22516 -208560 -3612 -42225 124573 -205729 -42397 -299256 44361 196652 -175549 -27052 -174297
22505 -174297 147671 93967 -12615 -26010 124839 -326754 -3135 -229084 -190168 90224 -46796
22493 43899 65573 -130643 -207842 56361 -16354 277114 36839 -10497 -5898 70478 -106340
22481 7718 -225869 -289149 -183341 -50000 76652 -116136 68057 -208240 -103493 140632 29609
22469 67797 -105994 -481180 -238478 -102369 350016 41856 -148901 135189 -68453 -272781
22459 -272781 163081 91782 237689 -343079 -100655 80681 -332405 -282948 412404 37126
22448 36714 -415739 453173 -43583 -213709 -115074 -289426 48198 231297 81800 56302 -26915
22436 -45249 -136166 100288 7631 -568844 158852 154718 41187 6460 -255119 -73335 64511
22424 167219 157955 -203806 -98851 -173754 -185885 172367 -58334 -186116 -193714 -44788 18424
22412 58650 -117116 48791 -147357 -27868 -172148 -262602 156165 316737 28765 -133235
22401 54936 -60207 238134 304207 88352 177692 -151239 120478 -43848 -9122 -12551 -183977
22390 -183977 147465 -108229 -136271 -191525 35788 253028 37217 -102228 -245002 -105787
22379 24183 -193849 -131129 -112675 21601 -231587 99506 183075 -407157 -244725 -72391 -36186
22367 -107936 99339 -183318 -99333 153690 109827 83192 -189738 173401 63781 95493 -312651
22355 -163486 216022 178811 209643 194384 -103634 -66618 300958 -327178 -66560 -217991
22345 -217991 -133032 -105377 116356 154132 -61112 16734 98589 88898 234313 -60309 -230732
22334 -230732 -19090 6109 105862 259525 -112621 -197655 274756 155392 -182831 144324
22323 143059 -185826 -100608 123141 -280121 -40054 -237185 3921 -166176 173714 46630
22312 -94008 -32808 -144476 258622 -224372 -309693 -383566 155581 -124575 253938 126327
22301 25364 175442 -22050 4307 -7915 20884 85229 52596 400625 113102 -46553 -40032 -108747
22289 -108747 -358562 -114503 189765 -142476 -129213 214212 283163 -71660 -166945 -45780
22278 71457 -115931 -15688 -104886 185343 216960 196286 -126717 112346 77235 254830 -279953
22266 -19779 -182259 -154338 13713 114296 -164196 66306 155955 -24932 78278 -95685 -436
22254 -97184 92521 78215 -182249 -312088 -268317 -137391 -166611 -66192 -135648 609555 -179424
22242 290181 -370610 4570 232556 14321 -117660 -126411 -295429 284857 202451 -256677 17570
22230 -372667 93976 -247919 76535 -25299 -30936 187795 81888 -243008 -754 -186702 -141273
22219 -141273 24856 -255778 -76267 -55896 -178994 -300065 -309500 240514 -477021 -286886
22209 -286886 -205556 30994 26758 274991 -148519 -17465 195556 -139136 -193805 -115788 -162000
22198 -162000 61928 -225564 -130610 153066 -197743 -242854 -255684 78409 -413650 251349
22187 83243 68635 44877 66647 -179706 -354122 -147472 -131501 -210808 164080 -66748 -47948
22176 -47948 233692 -90750 59183 -205325 40648 6287 -82206 -418380 -305406 146397 -16307
22164 -116989 152395 138411 -65637 -41143 -49715 -119726 -182772 -242289 -126298 87381 181415
22153 181415 -89209 -99135 -87986 145718 137745 -45235 -196773 -89525 -195045 58699 229138
22142 229138 -332438 -227410 47035 29520 248819 -276914 -34122 -238283 -63517 219249
22131 402911 146648 -31150 181182 -87893 -269655 89642 18524 329008 -253433 61104
22120 -235790 363216 -99045 16956 -101355 265747 218110 -20016 154052 -175379 11959
22109 -132875 -26753 -48953 -103536 175026 -232537 -106574 70208 150534 -45527 11045 212078
22098 212078 222190 285924 -86728 -69602 -193098 -63899 -138321 56179 167292 9196 -89642
22086 -110936 132317 -22276 -109572 -52559 -98955 72240 -29376 -298730 -35350 153715 164643
22075 164643 -329503 11488 -92063 -29509 36846 -147452 -431823 -262541 -193264 -85688 53371
22063 -144148 39844 -155732 -102566 23039 -65047 129941 -69524 -222138 64338 -85061 -160232
22052 -160232 129694 -146220 126836 -294477 33179 294490 -205947 267072 121747 -216797
22041 106344 -109665 -260126 202052 -94487 512059 -381597 -136342 -10911 85907 -128260
22030 -64838 -127421 140086 165902 -352036 -57940 -280297 142732 64844 133682 -3260 -142766
22019 -142766 57985 -40942 39563 -70596 -25482 -189668 287432 -46321 -200944 6229 282367
22008 282367 379022 -137711 -19044 -21237 -92010 123442 73483 -96447 88028 -182706 -471711
21997 -471711 -142634 -225171 -228113 -68823 -105419 -56308 187158 -81915 -221937 94595 97675
21986 97675 34937 192802 -2622 109698 -50424 132786 124125 -165024 -165851 -53134 -142435 -85379
21974 -85379 -301484 -118912 -42295 219514 -121556 -54402 -26483 -179761 -25857 135407
21963 19325 -142548 174855 -164677 -326546 136456 -9514 -378864 -209072 -251888 -226622
21953 -226622 -26545 -101794 45674 62592 -81871 -221474 -16865 -358569 -414398 -367639 -111788
21941 -334 -154628 -16606 -116723 -64706 -13739 -211035 11750 52036 -85320 -256102 245158
21929 126206 -65670 263687 -48491 152217 -144670 276634 -204792 194016 206419 -268073
21918 -45391 46054 78558 -64740 150682 137921 152180 -272907 -52093 51501 36769 -222378
21906 14011 117249 -45959 336609 125743 101464 -203880 -353815 76943 205680 124449
21896 124449 -156729 443003 -108199 -89954 -365287 -426869 40818 76746 -13923 49799 104931
21885 104931 -219616 -102079 122700 -135740 58505 -479775 36608 -489851 84318 -5620
21874 -242210 103222 -53888 196035 -552056 97335 -55374 66277 -284710 33095 -109597
21863 -57220 -190936 -137719 -24066 -107854 1380 252602 -116396 160582 -152507 -302971 136521
21851 -265743 112955 -155028 -78411 -179142 -130243 -148824 -270282 -179468 184347 16038
21840 -47616 370468 -332278 -176367 -16147 -298431 -101064 136297 129994 1389 40000 -14016
21828 302256 -129066 -6127 -73406 -340007 -156190 174063 -31549 -60631 88115 64975 39395
21817 39395 -60693 -87669 -4067 -80431 -110852 45323 -264119 78873 -156727 64021 11700
21805 -75563 -49042 -301795 -61318 14029 -35298 -291573 -187354 216647 284057 -40165 212796
21793 -64099 -319589 -5614 156993 111035 -86953 -197970 42803 -105907 22755 265825 89406
21781 313740 -227613 -160660 113334 -19661 249659 -196026 -149048 69161 243608 4503 5668
21770 5668 3138 -217325 207698 -386486 -10219 -173571 133633 -177479 -185170 -239406 -70558
21758 55346 -41231 -92616 -7095 230468 225816 114993 258095 -60545 81862 -206245 -369940
21747 -369940 -91205 -218767 115873 -236169 -50702 -38651 40671 193579 -56874 238828
21736 -95190 -114355 -103118 -278428 -19740 -79762 -90707 86 175413 -222134 -7989 186689 -71055
21723 -118479 174768 -184946 103519 -396424 -234909 -289980 -77033 117246 -152209 114204
21712 -118663 101037 -3789 5848 303410 72258 139120 181486 -97508 -127097 200478 -308223
21700 -54712 -60154 73905 40881 -21936 81698 -283687 -210689 -41414 127650 -125350 -31614
21688 131661 -45860 -42768 225892 15270 139571 180084 84504 -17502 94757 -27274 -47263
21677 -47263 -29067 253926 -43925 57049 7885 -66929 -179877 -356282 176867 -121382 292191
21665 32437 200202 44469 69580 45203 -67099 74805 -268040 -71258 -190139 180874 -82498
21653 -307209 -177612 13949 -130360 282334 -229927 -86241 91958 -82337 380787 -74395
21642 -54114 -388 -154643 -117753 -47743 -185564 -71680 -149792 -248326 -66154 -87320 -216748
21631 -216748 -91156 -135127 -164513 -61984 -304447 66260 332450 221855 -15058 -69283 -11501
21619 -18344 -90266 -69228 -55729 -390360 -82667 351848 12221 -97465 56856 12926 -127796
21607 -338264 -4775 -32856 -337815 -243182 30239 19113 102576 96344 -201045 -21819 -390945
21596 -390945 198922 226062 -247966 -60623 -23353 -79579 73442 -109327 -143241 221135 -29698
21584 -140813 -223214 -14759 -280720 186813 -62810 62762 117369 -83201 -87700 -245701 109842
21572 213556 73897 43286 194071 -341927 -287703 -164003 -166243 -19468 78028 135757 297062
21561 297062 -182612 122721 -391622 -367041 144550 169117 -107733 234979 -81209 -110514
21551 -110514 -144173 336279 61804 -267070 -202558 -380005 160228 -340701 -236523 -48407
21540 47499 -77470 45847 -403598 244855 -60061 -66071 -59841 -245899 74385 80592 -219118
21528 -34560 -75133 79120 -220991 -38940 -29814 -209859 -228936 8592 27246 -115607 172754
21516 -237478 -268569 235714 -1692 -141510 -214183 -407875 44919 -137180 -124296 -42767 137058
21504 -206441 -95415 83083 114495 -32772 -52470 67422 -289444 146425 41890 113007 119608
21493 119608 -190918 -109585 -184484 -257906 -288711 78577 -3356 -95570 -204455 56699 -182944
21481 81543 -11755 35033 226033 -129703 -188137 56278 -455205 25754 -129466 -86469 -215011
21470 -215011 -47707 -64660 3657 221244 99881 -390771 164441 -124571 199480 -454292
21459 -193004 168183 49278 -22109 -144959 -263361 19130 -345377 264829 -158854 -68290
21448 -264033 62652 165862 64237 62053 29146 -344567 39963 -255027 164716 98455 -25341
21436 75570 154251 -34361 243345 154858 -69785 34521 258119 338703 39148 375251 267007
21425 267007 338261 36340 245026 -11050 193329 187344 -191459 -23204 -181959 -108196 -185378
21414 -185378 -268988 -155348 -337258 208776 82034 147325 103792 358363 -160121 177563
21403 126460 7036 -150189 -322418 -228163 -268491 -210444 103059 -184038 210488 10767 -189694
21391 -226466 26818 -6691 14113 -247113 14731 -298638 45944 8791 -80837 120879 22755
21379 74408 -122469 -4870 -139889 -117815 145766 -16267 53536 81521 162276 -209121 -179144
21368 -179144 33524 7542 -41396 -288655 -455425 22558 -305229 -224188 -62845 -198436 -220332
21357 -220332 -24814 14312 -172659 338289 -73940 -260762 -52978 -307052 53117 309717
21347 309717 22785 -186263 -183469 -680681 -232120 62626 -54276 47327 171213 -178865 -210344
21336 -210344 -122831 89703 -375531 -318682 -304811 -17526 10821 7850 -371886 84393 -135446
21324 131212 105995 159236 -215309 -45903 -274629 348305 -79352 -243789 -232903 -106589
21313 146721 67722 -233062 110733 -73028 -149074 23108 112921 137291 -250734 122253 -201789
21301 156792 84682 109126 -340533 -22063 -49770 8716 -32684 118595 -265339 -72649 -263132
21290 -263132 -10172 3073 -79565 27819 -132574 209088 155963 76154 -77855 17081 247303
21279 247303 417935 33590 87833 -145531 -55462 -44397 115898 -134211 -281293 -31421
21268 -20588 -295104 -75069 152680 -187984 133649 120055 -240064 -235783 -203639 -50727 -56196
21257 -56196 -6309 -140315 -32714 -136957 -186888 143522 260871 95000 55511 -185254 -164056
21246 -164056 38543 -177307 -152953 47379 -169494 -329945 37167 160164 -15811 -492716
21236 -492716 -81247 45394 -106304 62143 54124 51165 118030 -144050 -219105 -8046 -151117
21225 -151117 -133484 -2838 -7352 202266 -200172 -16487 72996 -38278 76220 19040 -193488
21213 -188133 19176 1577 -198034 46988 -123492 -19176 -203534 226427 -248246 96998 -56796
21201 -131586 -153000 -88158 158628 -49104 101563 20863 48916 -303498 -111066 -53038 -130194
21190 -130194 199396 -258005 -215807 41495 -291592 -84200 -147628 -199235 305092 81619 64524
21179 64524 252037 74054 270965 90590 -95051 27399 298329 1665 168061 28416 120993
21168 120993 201028 13093 84156 132900 10129 -76911 -124447 128919 -205777 138324 -106596
21156 120501 125124 -197773 -437367 -90972 -7918 222053 273067 -75496 -33440 -195134 148022
21144 -131291 -209030 -16712 921 103382 21700 -182503 -366059 129574 -69366 -98689 -207276
21133 -207276 91757 -239530 -168588 -503531 152545 95917 -10610 -200859 23675 -154521
21122 -288122 -169973 -221670 41555 -46863 -110431 50956 -46446 -104381 -194438 81525 206221
21111 206221 132537 -63039 -117289 187415 121029 20267 139759 -189826 -168927 -57811 -66639
21100 -66639 4845 -99519 -147184 -27484 50712 34709 -118704 -193996 -284161 -411780 -144084
21088 -129433 106481 256328 -49360 233965 152329 71223 151099 79391 -338801 101393
21077 -39344 -179166 -184744 -111085 271938 -237440 -105459 -242429 -263650 134492 -112786
21066 34972 -239066 -291499 175736 183310 45701 -20019 -98176 -115996 145949 -213087 -372488
21055 -372488 -95210 -205888 -122641 -449723 -163008 70741 341082 111124 -44010 73388
21044 85794 103395 -98977 186401 249882 -193092 49321 6699 -69462 -41474 -72484 -153795
21033 -153795 15379 39221 -69959 238619 62689 -16396 361832 123804 130032 46224 -246557
21021 -226207 -288242 -122775 -136100 -63167 -44227 189352 308922 18648 -377818 -91062 -116860
21010 -116860 254596 168335 -112180 -270454 213208 303634 41194 139466 142643 111970 116450
20999 116450 153133 -387580 21770 -108451 -173126 -360637 -224964 -145914 -274640 -324033
20989 -324033 11644 200297 102158 -50856 -76318 -297414 257710 170972 -187037 -136600 -159251
20978 -159251 -278167 182791 42331 -203441 -89385 -326197 -99434 6 -205068 23859 86560
20967 86560 -77688 -1579 335890 162001 -119005 160202 -270575 -65809 -215216 -135689 202068
20955 162883 82641 59710 -61156 98752 -42110 -52875 -37526 81285 -409728 -128111 -270856
20944 -270856 -193199 -161976 -93217 -61663 138828 -95357 -384372 9365 -228087 -228118 134803
20932 -78806 127838 -240241 228229 -165121 -75627 328448 137786 -49684 373400 49204
20921 75213 -420103 -14335 26746 -97658 -184941 -344959 402783 386039 -211538 274969 104501
20909 -117394 23204 -34498 3171 -197599 265096 -22249 -204602 50836 11369 -207155 -210247
20898 -210247 -49487 155400 120834 -118704 -142329 -59078 208491 228611 -151548 80863 -616849
20886 -151142 -355021 -164707 -212015 -244515 246095 -387324 -118402 -97353 191706 -196230
20875 -252310 324123 -103865 -243426 -153561 -105750 -160636 2649 -59547 8462 -45825 83893
20863 -46420 -254250 3189 -40173 -214650 -186134 146824 -221330 -92454 -43979 -93937 -192500
20852 -192500 -227922 -242739 -276866 -57753 33048 9385 -255838 -100087 -202006 -297021 -338294
20841 -338294 268426 -245378 -183336 59605 -103567 205164 62706 46749 -203956 103641
20830 -177551 170849 -77049 135523 148523 109802 -83574 68373 120736 -368375 -65624 177764
20818 -85877 -86867 114475 -449934 88685 -113998 176904 -68298 -211536 -95925 -25166 -113449
20807 -113449 245231 -128884 -97085 261480 -88254 -259208 15890 -271569 -31917 94403
20796 -150259 16032 164269 96130 -260131 -98529 112688 124185 189714 -142469 -22627 17634
20784 -291252 -143884 -450987 -11634 -232413 65627 76841 -36246 -12959 -40529 19832 -108024
20772 32330 -429360 -214180 89870 -113515 -555902 -61289 -140831 103148 -89679 -61808 67582
20760 -183440 165698 109738 174686 155718 -13218 6591 192467 -113966 -279021 114466 -95372
20748 234771 -56685 -70432 -284181 -142754 227728 -227181 84544 -186664 -52354 68923
20737 310458 -333242 101001 -331220 161627 -149080 6735 -78310 183831 -42977 97428
20726 -313826 -9228 -35872 -51022 137936 5305 111238 108663 -93381 -105814 -37019 -189265
20715 -189265 -3675 194837 -4732 -179588 -69586 -100506 -33202 15132 175393 -133843 -102771
20704 -102771 60824 20928 -337707 -359473 196962 -264458 -155465 -294435 -279817 71060
20693 -44117 -140931 11467 -121628 -5017 -94609 144039 -420956 -49024 -27548 49607 185284
20682 185284 210562 -231785 -100425 -351581 -203726 -214893 -17134 -153878 20379 72380
20672 72380 -209960 97484 9049 -100701 -95280 -20598 -274211 -6935 -260536 -43115 34952
20660 -153129 -219371 182141 -53633 -323801 -173733 -140789 -211079 86191 102252 99241 148287
20649 148287 -243975 61446 12531 -201514 40150 -345023 119029 270338 172491 47815
20638 69081 3190 -2989 -103547 26240 78932 -17979 -257620 175114 -20155 -2399 -10002 -25418
20626 -25418 -286329 -359355 -417120 -60078 -137290 -217685 13967 244956 -144907 -56410 -24251
20614 54913 -50210 -215015 -186253 -186704 -121890 -199316 -315579 375348 -14903 -56641 -31114
20603 -31114 -268066 -236193 -80500 79608 -229797 315005 -23938 117346 -201445 -313415
20593 -313415 -279021 89601 -301755 152154 -28095 -371292 284114 -163696 -31003 -245270
20583 -245270 262020 6559 279177 -78018 -273827 141002 32955 97259 101439 -28827 -160750
20572 -160750 -9002 -59647 -281938 126251 -88547 225261 77493 -86073 -51144 30624 19214
20561 19214 5497 -11416 -280372 -65147 -243552 -161034 183044 -334729 -33672 117483 -168989
20549 -22952 -173206 -190628 77315 -137642 171824 -243346 -169283 44116 -244605 105214
20538 -22587 -123866 64809 59408 3032 -123523 -176384 -24662 107283 -196661 22433 -219069
20526 -170855 197073 176646 102081 197347 -163256 -258055 -12484 125123 -117324 -34441 145340
20514 -608937 113883 -135128 -53067 -170350 67864 -270873 -13290 -56931 -62255 349876 65463
20502 8400 -188800 418470 -157469 -286398 -262071 213310 -156322 -32880 108320 -58850
20491 -116605 -68115 65618 85301 -146388 91538 90838 47146 -154985 122546 -140693 253452
20479 -7562 -180354 -65714 -142282 58227 21406 -101037 -379889 22817 113578 -117991 -215356
20468 -215356 -223636 320817 239904 -301685 15583 -203086 -145175 64315 109494 -85759 54717
20456 -449021 -120028 -197060 216070 202559 -213771 -89716 17368 -320862 -24276 -18621 -53613
20445 -53613 111023 79083 -88094 -37877 -32559 -9078 109027 -91365 329399 -463521 -330838
20434 -330838 147260 -74566 2667 -281057 -54731 -132138 -183300 119255 15821 -114248 -302428
20423 -302428 -107039 26817 -129856 44665 5313 23177 -559231 -158016 124205 -320023
20412 169881 -40411 -223043 -271463 -228376 -26588 86106 -66632 -145400 66687 -91939 191412
20400 61880 -45423 7150 -124555 -118555 129280 -213290 -58321 -389285 115532 20444 -193400
20388 -176224 -4277 -140150 317133 -64497 -231968 145693 -294282 162245 259299 -12851
20377 165707 -171927 -329808 -178621 52478 179899 -211712 -31480 -299047 54214 -799 21232
20365 45893 224257 -36099 49618 44264 -374191 -54872 -111535 -340093 -197457 85772 -190386
20353 -166947 -230741 290979 85323 -55846 199960 65937 -123317 24618 202194 288635 -30447
20341 -93303 -52386 88861 -304326 -7701 130165 -128946 -33943 143650 -351643 -174237 -274011
20330 -274011 -30927 127862 26746 -74865 155362 -100194 297211 -135979 3504 -179699
20319 -407169 -219401 129599 58555 217700 -114152 547 87880 -10585 -240314 -68447 -212052
20308 -212052 -41244 128516 -178502 156281 -358815 -364225 155145 28435 8317 -259716 49431
20296 -410691 -151 7310 -41735 204429 -6797 -68444 -23808 61395 205486 41315 -342846 103023
20283 -290524 -231874 -338971 -303516 -40067 66090 25365 -112675 -163820 -288021 14333 182649
20272 182649 -261786 60665 -80229 224603 10052 -42488 -497280 166679 102963 74650 -19678
20260 -162682 44456 147820 99596 283519 -334951 -32680 -97609 58292 -9658 143516 -165735
20248 -54425 90217 88973 -105261 100775 -128330 -126365 36575 -35053 87494 -290702 331411
20236 -117145 -185865 -9152 -319996 -200115 -93690 199155 -152449 -301112 -257646 127623
20225 251588 38538 -152907 217096 204698 -231686 -113349 -104286 -27652 -184639 -251551 -186384
20214 -186384 -141249 -275849 -100051 105050 -61510 -128068 262078 -354702 -336136 -10603
20203 46783 -5928 -67220 52366 -133370 -159847 -5358 -177139 -56281 -63621 -46777 -152696 -177165
20191 -177165 55328 241827 -44109 -193081 138685 -28166 -225206 -90161 -59273 -82215 -60534
20180 -60534 -189976 -234206 -211254 26544 -281809 -33394 78725 -73102 170415 -171944 10958
20168 -129327 34672 -59712 -399574 -14600 -262380 383152 -171769 -226727 -133852 -14276 127134
20156 58055 28917 -49046 25017 132537 -130416 -44009 176327 -275157 -106455 185654
20145 255335 -69469 -103241 169189 9771 -98852 214901 -126774 -266265 -74647 -210976 105973
20133 -144594 63454 15461 -16299 -143369 78496 -237440 124615 -110821 -42678 44899 -115506
20121 59123 221290 97822 -188386 -115553 -261337 6096 110674 70700 -106475 -22809 19641
20109 -165060 42038 152838 -321725 -448721 175698 -50391 -199187 58709 133580 -251800
20098 180884 -350464 -108160 -159119 -38203 -105171 -79595 -75285 -102662 59475 -136953 -194212
20087 -194212 -87111 -250144 16907 -135587 -121908 -76946 -219636 -90670 14801 381795 -74025
20075 -337955 -23139 -12760 398768 160725 -110236 -67629 -287888 -279034 147269 32833 -69838
20063 79886 -120780 -37231 50061 45876 -101952 -231821 177334 -155499 11683 18806 -42160
20051 -50342 -208416 -74836 12186 113429 -56487 35450 -178818 15421 -34697 -91327 -177325
20040 -177325 -298560 28658 -215319 150160 30638 -338345 220438 43472 -416585 13059
20029 -113667 -142026 -275263 -70999 -193171 275477 157522 179594 47056 147908 -167550
20018 -180384 -217508 160209 -152093 29139 -305293 57872 -275827 -118288 227812 -366825
20007 15575 -153034 -282864 -161115 64207 -142812 -329878 -559440 -179267 -22972 -99796
19997 -99796 -124026 90759 -71127 143118 -45466 -230286 -60533 -18423 -129383 140899 -97583
19985 84571 52566 -154951 -248355 171075 -200207 -169448 -243716 -243324 211740 -77142 97 -219758
19972 -139944 81635 155955 151002 -249545 364302 -138230 718 116332 -72641 86926 -136325
19960 86671 5744 -159518 20041 -222919 -168685 64380 208578 -151924 -12600 211208 -69904
19948 -345390 -190633 -96708 -325864 -166964 33960 35075 64155 23249 217550 -57230 43075
19936 173767 52528 86959 -184553 -108462 23593 -63961 33390 -160947 -224316 24298 -28538
19924 5791 -363504 140036 -169697 -108649 -263299 -274291 -73081 168244 -127749 10496 207510
19913 207510 -67511 -253028 105036 -46526 -32999 -225208 -147608 -252606 81387 8551 -92232
19901 -122896 127006 -57307 -96182 5677 279067 -7459 -261159 -336030 -92596 -199808 14048
19889 46953 -118692 -34266 -110538 39842 38075 -136995 66862 250288 36832 -282459 -251434
19878 -251434 -76180 -114783 19545 -103528 -268401 48832 284210 -62898 17549 80445 306645
19867 306645 -140756 -146528 -99913 157633 171846 -289038 20452 -106139 -54126 -114746 -281086
19856 -281086 10385 -13006 229823 207087 -233882 -4995 -24946 -378467 552516 -222717 355107
19844 -101442 319432 -197176 50853 -74858 -373830 22219 -153733 -133853 65974 -601141
19833 44803 20887 -39891 112423 -184276 -18828 -43350 22225 165198 -140375 24969 -244334
19821 61981 -173473 109666 -252697 -5053 17420 -236487 -42114 -192140 -137164 221343 -299644
19809 -150211 -188687 -325707 -135326 123132 32522 -250578 -226552 -190218 -116080 183348
19798 6993 144740 -420687 28449 62547 156239 48872 -366672 69545 -283874 157772 -105015
19786 -65734 -136677 -76760 171885 -156852 12080 -120320 -9180 132476 142350 -213029 -159856
19775 -159856 52238 8476 -25780 68799 44233 -58313 -161689 -88140 125201 26581 39018
19764 39018 339589 -113204 -54433 56624 -252631 30809 306859 25335 -22405 -58707 -86770
19753 -86770 157438 348765 86429 -144963 -135479 121508 -52436 -189403 -131311 158302 5210
19741 -24683 109933 -338920 187866 -562429 -124382 15434 -421744 -325221 4280 -466388
19730 -129975 -395300 -18559 -64213 40706 -30738 67479 33771 -205215 -303005 -148326 -32329
19718 -168901 51982 56084 -158936 22254 -193899 -163493 -17662 165110 62966 -21702 -115526
19707 -115526 10313 -25879 -174262 -322556 108764 -223065 -315057 -85362 112860 -10460
19696 -57231 29221 -116291 -198788 -112792 -339187 -185948 -158776 -193064 -73366 -331901 1095
19684 -161092 -119740 -216576 -109047 -88558 -94572 -113431 -6287 177980 -76003 -410978 -219373
19673 -219373 -80629 56908 -237952 -116525 -67379 123702 -1929 166781 81322 -118716 -24006
19661 121465 -125095 -96083 -108754 -109344 -161310 93967 -237851 241524 -4537 86111 -163977
19649 -308938 -28476 -316269 58071 41121 116881 -106683 225679 -166074 71455 -76954 -122688
19638 -122688 -158547 -282274 -223738 -9554 -47990 -140893 -61142 -179103 -159571 -133038 408242
19626 -537304 -278948 -42993 -177310 -107029 -31677 -493937 244291 -131164 19453 -95770
19615 79555 117790 -102518 -204644 82371 85378 -29798 51042 19781 -76771 -731 -88508 210315
19602 -132536 -377661 102234 -108772 112868 91914 99855 192773 68885 -167887 22507 -227784
19590 -145993 -217679 -80124 -137410 -392795 -302671 31 57184 208946 30433 -26923 -358383
19579 -358383 110622 140687 -86802 59547 298967 169019 -57755 -454230 -46174 66686 -1870
19567 79847 -267260 -95370 -236113 223732 47445 -158097 -138700 -287092 -35477 -25163 188656
19555 -153629 -509497 -342286 -150480 -208664 146447 -184131 -95149 -73513 113878 177280
19545 177280 -16650 -84316 151541 -291353 -323959 -171433 136371 -304722 81891 -198497
19534 -53610 57664 -18420 -68660 4783 39421 24849 -53092 -46681 265805 4738 390030 -6193
19521 -40158 -58671 -128908 -244725 55354 -84901 177710 -575637 102493 -214816 -46087 -306428
19510 -306428 66496 40000 59566 -137386 -35220 39946 -354107 -119733 -100601 256952 -293655
19498 -15101 -345079 -7239 -59457 11727 -186201 -115048 380952 -68624 -326445 9669 -200336
19486 167716 14171 -21985 -315963 99344 -221883 -135202 167224 30037 215775 -70982 79875
19474 -238922 -280116 428029 -376995 -103090 47435 -355109 -123632 -545984 -36880 -212051
19464 -212051 -242354 105513 -159864 -470844 -271754 116335 -61284 -171747 26425 78303
19454 78303 -144833 -28890 58489 -104038 -156883 -30851 -116413 -158056 184766 -151051 17837
19442 50531 -86759 -181847 -22186 288847 65199 57554 -87843 -66645 87443 -189066 -199170
19431 -199170 -52609 6063 153620 -221773 124724 -69547 -128008 -134629 -20663 -99599 -9442
19419 -261755 -211301 15370 96505 -64413 40640 -107705 55554 -186058 18295 -184753 -434135
19408 -434135 -307842 259432 -117853 53362 -106429 160113 86270 -14205 -253819 135002
19397 27865 -151840 -339685 -434763 -273605 -186670 60542 -112400 -483965 76770 46464 -267321
19385 -390050 173711 15571 -40631 -129591 12490 165432 63697 221830 368104 44084 241779
19374 241779 -409364 -65869 -157996 -26949 113029 55577 -77457 -21260 -39949 159309 -252314
19362 -37769 -147933 -159927 -238039 -65321 24535 -45383 -91246 88884 -13424 -106057 -56220
19351 -56220 -124931 -331660 -254781 -248663 373590 -31003 -72196 -186040 -120595 -182722 -92132
19340 -92132 -260446 13634 177588 35946 -104371 31900 -184804 198535 -366647 -287790
19330 -287790 -322837 -249648 -163697 70477 108745 -101662 -212582 -157050 -31749 -67851 -127584
19319 -127584 4892 -301309 -175952 253598 126166 82995 -12823 171784 100897 -319385
19308 86857 98053 257889 -41979 -113985 112522 51379 -201522 87229 -386032 -185997 -146476
19297 -146476 -102419 -7492 -194382 -284773 28229 -80185 -136061 175456 -42975 -39083 67641
19285 53875 -8928 -381524 6249 -74951 -40112 -41890 -188181 -382905 -288258 -85684 -223004
19274 -223004 -77010 -1750 -237315 -147187 -206842 -330959 -360053 44105 -14905 177968 -181374
19262 -122324 -169744 -116528 -524514 -395754 -156109 210656 65128 -184582 1776 -174872
19251 -241824 -88771 -233288 103133 -53055 -315483 65360 -158197 69059 296334 -45374
19240 -470081 -192234 -10687 -15308 -200548 -32149 -122285 105894 125412 -209262 53719 126620
19229 126620 35412 -267997 136797 -205181 -219835 113728 57759 -40088 -388245 13930
19218 -59987 -352114 -205704 -299503 -106141 -114652 -132064 105326 -189068 -427188 -49778 -243225
19207 -243225 -53343 45800 -458796 -229802 -1105 -105361 -149562 138692 -5179 -194956 115634
19195 129915 -235004 321191 73435 -55687 9879 14450 -89636 -5988 -35584 99827 -46795 9152
19182 -205187 -135317 -196445 -62925 -88701 -450785 180141 -155539 261473 -62209 -184520
19172 -184520 -76761 325044 -23116 36558 -284528 -173731 -51555 -123992 82994 -52435 39490
19160 -66891 -96268 25929 -74338 -202513 -195444 -159835 18128 -39372 -113889 -335787 -80958
19148 112065 -50755 51023 141751 -314200 -27369 -108740 30892 -24930 -93970 69229 170487
19137 170487 -40502 -206538 -254154 -155797 -49116 -6981 108299 -385207 -173439 22784 -96609
19125 -172433 13182 -254945 207393 79686 -162018 -104168 -143037 -8594 21668 -201090 -170009
19114 -170009 -25 265856 237762 -272881 -75179 62390 105042 -15439 -400298 105708 -151595
19102 -292761 -313095 -76398 -138181 51298 -120478 -225789 -59902 10508 -14785 138327 84977
19091 84977 -136197 -384206 -202537 431220 -40911 32331 -94626 -48952 -290319 -21347 -511887
19080 -511887 60516 101280 182245 51329 88699 309111 -30061 34569 229463 -32180 -194767
19069 -194767 -301152 -132119 -32353 -267253 103965 4695 -79862 -178284 115308 -301651
19058 289779 -70205 -148598 -326855 -143594 -136910 174979 -84752 59447 -135038 54848 28974
19047 28974 -81465 -149353 248340 -72746 313065 154961 129520 182590 -186702 41516 -104250
19035 -183006 -267643 -316104 -105152 53339 -383448 -105204 -71065 -97729 106788 -151532
19024 -485214 175828 -220725 -18988 35889 -14940 -143713 21763 269879 158810 -108308
19013 -187477 83381 267127 -243199 19299 -47244 -50993 -112632 287001 -109337 241495 -234269
19001 92313 -135997 91445 54829 -241696 -8917 -215872 -297529 -240750 -176039 -271862 -154771
18990 -154771 9631 32018 123290 -28536 -27627 -104771 -185476 -254264 -70111 -157890 178998 -16536
18977 90898 155528 -1399 -336715 -64856 246306 -177618 185372 -408840 145551 129553 -303656
18965 -153187 96041 18598 -174829 -1189 296164 -38064 -264241 -208138 70472 -333163 -117031
18953 13145 -61194 -176520 -260068 -170533 85 -22845 -25315 -40562 219715 -124545 141660 -72174
18940 -213512 -384377 85738 -178962 -69653 -86673 -82956 -350658 279503 -153417 -104949 -201185
18929 -201185 -55172 34269 43178 211280 -1189 62739 86744 -198917 -167645 110579 -221751
18917 -166228 -87533 262233 31236 60765 232653 -16364 -125010 -152733 2550 6588 -43079
18905 -129009 -85214 -152250 -141333 -72891 -324506 -10485 -200746 -38227 -94279 -53549 81356
18893 -202561 36404 -365130 -104155 -64368 -197265 154661 -33125 -148192 -309484 11293
18882 279873 -455212 -273528 104012 -167863 -87653 -88363 -229636 410592 -267512 -223052
18872 -223052 140789 -86616 -143006 -58706 -241715 99680 -77023 29291 -184308 -23259 67200
18860 -321794 118863 161867 -282908 -223774 -175597 148089 138583 -93142 83391 -129734 -190290
18849 -190290 -116812 -132502 -120675 -358244 96419 -22468 -50390 -10472 -35504 27472 -120971
18837 -208658 77970 286209 21474 521584 282781 -65548 -141940 -150465 -117312 204107 64933
18825 -73192 -198162 222936 37950 181281 -163486 79752 -57445 135409 252252 409262
18815 409262 289799 -167694 155043 -79675 188129 26562 -180639 -72688 286993 95315
18804 45339 -210429 -148938 87838 -64206 145400 325015 143841 314417 101593 280015
18794 280015 230857 119683 -88242 -288648 -71764 -103292 -226386 -190611 -262006 -246059 335398
18782 100067 -372536 -33988 -17071 29600 -18037 -66055 96186 15712 80408 -204914 -269241
18771 -269241 -88277 -106545 7727 -239992 -20001 -157142 -123204 130457 -179211 243254 -12552
18759 63811 91093 -232625 -297765 358915 -159146 42989 247683 157944 125718 -233046 142188
18747 -58009 -277957 -10333 215516 -59154 48293 82926 -125061 -102875 -50462 309341 94712
18735 -54613 187797 -9325 249261 3450 -330351 -14858 -185609 3785 -514634 -130603 158922
18723 -10961 70713 129760 -310142 -265987 -141741 228936 -165579 7180 -111860 -7590 -144722
18712 -144722 -206034 -61900 -326277 3773 7561 22863 -170111 -226228 193136 -141971 -112997
18701 -112997 -204393 -353878 -34556 -142516 39706 -227710 -97452 241524 214848 304132 -237869
18689 -198536 -57692 -276436 303848 20988 -109966 -399034 -59368 -166646 -51006 -245177
18679 -245177 82477 71051 25972 82335 -213648 -141091 -248286 -175767 -45814 -212835 220697
18667 110563 377116 270990 -47278 -241361 53486 71445 -79283 -67812 -144288 -174877 -298815
18656 -298815 -87630 27502 49218 -110666 -132016 -49059 -323850 -67884 -29670 -124896 22563
18644 -291285 -170654 -450127 -279606 -88272 -146351 -294665 -55505 15618 204557 64794
18633 6899 -180546 -74053 -62567 -154734 -11757 329072 -187555 144222 -333994 -220364 -64042
18621 -220935 14293 129031 257069 59824 168226 297119 222873 -137442 425445 12848
18610 -344504 -149162 -45642 133775 -33010 -366890 105804 -108144 -277057 9190 -77372
18599 -268674 -131993 171556 -75752 -39252 -9896 -56654 18087 -121986 -175439 -244220 -142121
18588 -142121 207516 77862 -239408 -57848 -213236 188602 -175452 -320082 -45848 -3804
18577 152370 -219241 -228365 200794 42497 -109194 376232 -137239 -17070 -242845 -270546
18567 -270546 -350533 131074 -170745 -149145 52446 -261592 184514 -97320 21835 11178 -127796
18555 147662 7558 -12557 -120571 -137887 -95395 90800 -11619 -374885 54511 202042 214768
18544 214768 -53860 -42981 -96211 101654 104971 -135263 -13736 -106981 -92126 -310321 185345
18532 45621 -25938 -77010 -23505 -165635 -62957 165940 -132763 -227936 -89956 -97770 142981
18520 35217 90662 -121973 -181566 -103123 -207338 -191229 -122272 -18670 -331316 342079 -23452
18508 61467 -261114 235451 -82563 25455 222968 -496175 -71384 -93516 -189466 -119559 -143556
18497 -143556 81584 -106462 252457 -52123 41180 -379028 -39567 131789 -26960 -491481
18487 -491481 140958 -277317 -192311 -133196 -194366 49156 -88765 42789 -232072 -78529 363014
18475 -51070 -525 173835 -72666 -290133 -82003 93973 186159 241711 3694 -103838 93435 -69943
18462 -81819 249330 -3030 -9386 34682 133708 31733 -62433 30310 -311360 -219778 -67606 -1861
18449 157745 111115 -290917 -148857 -136707 -158373 -236697 148645 -136440 249657 253525 313114
18438 313114 12263 -44976 -53236 -157444 103551 45274 -177562 -168143 -49017 -425696 -123291
18426 -304917 -110895 288934 115838 42172 -342316 48039 40573 -89241 78433 -240853 121642
18414 -228865 -180399 -100683 -138035 3661 86067 -41143 -219744 -24446 271582 -56540 153992
18402 129867 -31666 233084 49047 -79326 -121362 90997 84718 -125418 -81367 129501 -200117
18390 7339 -28426 -138701 42734 46242 -156394 -80434 134915 -109530 -14549 33397 -39517
18378 -270376 53201 14782 -38106 16410 163703 -169482 105299 289519 5699 235159 -46144
18366 -20461 28583 -269088 -14660 236198 -26201 40503 -51011 102013 -77000 148153 30097
18354 162051 -231957 -68048 176876 134442 37202 -144933 25768 -67694 15732 -151112 167117
18342 -103591 83312 59320 190192 -165197 233121 -216785 -80722 19454 -40130 -30366 -26452
18331 -26452 -107769 -207720 -64621 137352 314934 -80831 -193460 302887 -68869 -114649 40045
18319 -366114 -112172 162114 -52144 -54815 172864 -182810 154440 -432299 65871 -48025
18308 -171431 -172409 -155234 -149035 221875 156382 -272010 -123014 -73616 211789 267937 -62535
18296 243731 4841 -173556 -21993 27872 81113 -409449 5791 -245850 -92583 -55113 -357906
18285 -357906 -193550 -200741 -99433 -192873 -212831 -285357 15131 -84033 107773 -38376 -295651
18274 -295651 -25242 -148509 -666360 -72637 -114848 -135659 270794 33113 336871 111530
18263 44771 112812 391881 216891 -65089 130527 -157073 -143199 279670 -29979 -251787
18253 -251787 273420 -257780 -528391 74624 117133 58025 21502 -188733 -1828 -200207 -18635
18241 128979 -221901 -120077 31860 -26362 -70920 173798 220096 254552 -74645 -10076 -33482
18230 -33482 95839 59131 -39537 49612 128274 -60516 -13665 -60425 -175130 240417 -528105
18218 -156884 -17279 -132561 -30403 9886 -178533 58538 -51513 119595 90568 37065 -246754
18206 -200888 -102141 35404 -116330 -85074 -59938 -187020 -136096 -62290 -157446 -203304 155672
18194 -273393 98556 -158139 144034 76237 -210571 -141232 -43354 -115322 -305167 49551 98774
18183 98774 -127172 -239336 298259 -22845 -72824 -198460 -399622 238016 -68134 33658
18172 -76037 180154 -177740 54567 -145676 49904 -75918 -79783 -130834 -264 -420109 12301
18160 -119634 83202 -250913 29835 -127998 78883 38997 38146 -4914 405791 152570 268745
18149 268745 18979 96111 -73812 -142141 -23969 -133805 -171764 -285302 194102 -124153 78043
18137 -317774 -268735 -170348 83284 70522 191615 -227411 72203 -6851 86937 -193525 -48022
18125 -211595 -271359 -133325 313747 13871 113202 305024 -50314 179046 -110692 -107473 -82000
18114 -82000 -69746 -2250 2965 47686 -280075 -284603 135612 -44554 40405 -309470 189969
18102 -94318 164751 -99186 149005 175474 195717 147003 44400 291349 69776 -140482 -213289
18091 -213289 220335 -115904 -135099 -254553 79717 -42016 -17758 312720 -26538 37374 275985
18080 275985 5853 202227 -266452 -2227 106023 189679 114261 -209197 -285528 -250232 -221196
18069 -221196 -21408 -281866 86670 20350 -175180 81189 -174881 -139490 -245470 139185
18058 -86262 -96446 46605 72245 -149992 50365 -139381 273338 -119549 198274 12485 260952
18047 260952 125879 21066 105043 103866 109875 111298 -98435 -71435 191992 162103 -134267
18035 300225 -134769 174762 76811 -5502 296521 -87057 132986 -206893 -326892 -57468
18024 64693 -67644 1461 -242403 165851 -221809 -203896 -226468 31305 17722 -71171 93148
18012 -120954 -223647 -122316 -207817 59688 22767 41997 30152 76764 -257211 -59177 -252424
18001 -252424 343572 24761 -129683 186624 172415 125483 -27846 -87509 249541 -331702
17990 -261398 -322151 -53841 -312317 -213844 -177051 -81348 -159510 -23904 116596 -172113 65792
17978 30433 195208 -334121 240418 -331885 -20146 78940 65708 25068 190462 -67135 184606
17966 -218215 -284282 375251 -214806 163538 143374 -89217 -255562 -104573 -200990 -69529
17955 -169538 -182629 -305290 -62128 -7003 60646 129628 -30671 -262223 46878 227273 -243026
17943 -106964 -287801 -43260 -2312 127873 -15413 -4214 20737 63646 -21086 319762 -158467
17931 -125116 93136 -452207 -48183 254539 98858 -205474 -45726 240212 -400070 86104
17920 37356 -132457 117501 179482 80637 -124451 174828 -149511 96581 -118141 458370
17909 -120126 -27711 254855 -78954 -44109 163590 -129771 55425 295588 -155868 46886
17898 16409 -84596 -119019 -111023 -116457 -4268 36971 52171 365303 -119688 -42873 23390 328268
17886 328268 63145 72392 -137517 146552 -162186 -135568 137853 192166 5020 -431053 -159289
17874 -149636 88563 -222439 -87519 208490 20487 175520 77756 -52129 39943 180092 -10495
17862 24966 -126169 -246319 130183 79943 -115317 22527 67140 87922 -137667 -84600 -70606
17851 -70606 -185288 466655 -143348 -156742 313806 -78253 60011 -228921 10580 -197828
17840 -60026 -80423 10911 -53889 168722 -121736 104229 -39336 6855 86666 336114 139872
17828 -137028 -133921 -16718 63895 -62447 -113643 -262796 41623 -137132 -22894 -205955 181871
17816 -192296 183892 -18940 -207771 -208097 71062 189860 42329 -239936 -161251 -80759 251305
17804 -15911 -333150 -49742 171526 57729 -413524 65479 114241 61847 112380 -15788 -96027
17793 -96027 -60668 -18250 -8148 -131685 -77970 -88072 -30706 225435 41904 36239 -155695
17781 -65424 -149788 -47240 -239676 127214 -42277 282244 -197070 215871 8294 246175 75870
17769 70199 31441 16535 -82200 -12038 239531 259390 -298722 -75318 337894 47152 -239716
17757 -311123 194097 -79380 149675 135453 -128622 109560 161661 109212 256171 311692
17747 311692 18448 -223369 -188738 -293602 -134201 64762 6468 -1368 -62284 -33805 -174914
17736 -174914 -56761 -330000 -131645 251693 220518 -58018 97436 96806 240726 -145368 16560
17724 -110238 -23182 -48390 61102 59132 101890 254751 -28769 123094 247836 -116679 -268485
17713 -268485 -212651 -97550 -97365 -177328 -124148 178752 -309185 -433433 -21478 -98134 160428
17701 369382 -254113 145285 69326 -42104 107670 -30174 -229759 20438 77501 107853 -214295
17689 13362 300734 -40421 -175031 53779 -39713 22932 -53357 312 135682 -175237 65752
17677 294722 207452 -252668 -124429 71524 243062 -135779 -42317 103780 253035 -101318
17666 -76198 -72591 -58286 144886 -32063 36978 51673 139008 -11166 77601 267630 31476
17654 -132668 -70442 -142068 -54470 26758 -303445 333436 -91943 -105924 -40291 -26046 -94903
17643 -94903 365995 31371 -228961 27552 -28222 65345 -246076 -148170 15250 -89435 -158436
17632 -158436 221434 -31195 398369 126756 86673 79498 330878 131662 216320 188623 -192113
17620 473339 80108 -91039 105561 88846 -257675 34513 -110368 -94487 66738 174053 5297
17608 50303 369775 117387 -132329 -201216 -246012 24262 -119404 292634 -47054 141346
17597 -181944 -161643 67695 200857 344196 192890 85831 -179254 -238883 49028 -161000
17586 -171428 -243679 -115419 -39068 -23868 -127293 34374 40128 -156853 94216 -460030 -352675
17575 -352675 200006 141497 41245 145571 -223454 -71700 174742 -386188 49322 219696
17565 219696 -101092 207062 -57296 -74186 -58708 133826 145911 -24425 11337 188074 186891
17554 186891 22409 48884 281812 198743 -232353 326456 36531 242261 230748 73638 25549
17542 -79184 149460 -51394 12919 23391 56616 91501 -194912 -146338 -101669 34941 -126846
17530 288937 221267 194073 -26778 -15767 -40569 -41717 -29413 -182147 -111850 95779 347350
17519 347350 -186028 132878 139017 541191 349047 221386 -68034 -168317 -31944 -65400
17509 -65400 62715 268707 111968 295725 47631 -21883 11925 135465 103922 49286 87640
17498 87640 -103953 -54757 251636 -36321 -19188 198880 -97988 -123726 388583 218316 80812
17486 -4570 68333 108912 120902 -198168 28579 97952 134985 -223621 304474 316112 110092
17474 -49974 167763 215713 263677 -33332 -33592 225922 12593 -225820 -172679 50519 293947
17463 293947 -32287 -145764 -7965 -141813 25281 420 226122 382534 236504 -205969 -16006
17451 -206548 391839 -83822 157925 213339 37583 411113 140078 189603 -83769 23093 325316
17440 325316 47091 176139 158261 379191 249001 271493 95980 392913 5115 119891 449458
17429 449458 250112 165145 -47879 179105 -19538 265577 344601 94302 257781 435894
17419 435894 -82670 99346 136269 350009 110305 180496 62184 248747 285092 282873 386453
17408 386453 230920 199142 126415 452646 365093 -93642 465305 -25052 184175 304653
17398 304653 212196 391198 92416 469486 312596 242532 -410946 5076 -19919 234158 330066
17387 330066 321596 169577 74564 -22093 -5168 -32651 228472 96946 243411 128547 366972
17376 366972 -2253 75481 162980 -32469 82684 90146 287679 109046 311448 65593 30242
17364 -148150 102854 123488 222954 105791 414219 272381 152599 36556 239873 206461
17354 206461 295903 232105 374832 187627 224058 349173 -43019 -13535 41469 -135483 526581
17342 45256 243463 490477 164640 -140373 77384 144555 414672 152128 468870 186594
17331 288520 443772 374572 312392 169855 315505 105055 177332 -86026 -120713 -98069 -64511
17320 -64511 96175 265777 -34337 295837 126394 167393 -53577 241118 19572 195946 -147548
17308 -51448 -86463 258674 149488 210409 320109 188873 56904 285927 81690 302235
17298 302235 111139 125665 241994 144570 -160527 256826 -88564 -110846 148141 464570
17288 464570 -246315 179237 103867 321935 23997 643106 -100944 192345 165710 423912
17278 423912 17208 454640 -63920 95257 72504 156335 140885 210085 100570 28127 316316
17267 316316 271133 261594 -64540 331115 206072 166156 190446 358776 324045 310732 -89663
17255 121222 364047 183818 376434 281382 221101 -73036 313465 89533 313419 312405 175804
17244 175804 127002 330428 127738 -169259 162791 133895 396411 224524 392963 -27719
17233 372827 269758 232833 192202 248112 213775 440769 441262 271172 130947 309920 84173
17221 414915 19753 222320 426226 135421 21763 -2765 64215 96968 273014 151806 248473
17210 248473 141270 322149 77872 68545 381789 406379 288103 -92375 295708 -11620 235755
17198 -124406 334266 141047 127454 441313 126759 400705 64322 113063 -119539 308537
17187 191850 400312 15867 266896 247828 346908 418797 -40412 514130 157302 -1986 496041
17175 214593 -14232 75919 335075 -93023 348430 142093 13967 346726 324683 118849
17164 135266 176858 269271 143971 116409 535254 354565 257884 372663 58882 -52002 293772
17152 87529 101935 300694 194216 185366 434962 51305 404228 -27548 163542 311946 220694
17141 220694 371226 640209 222014 385365 209961 445765 354998 228877 80661 458017
17131 458017 237567 39460 71138 393610 200366 194843 431762 346078 158126 83231 291999
17120 291999 181329 121302 567318 146281 348723 293166 307152 162750 18536 317389
17110 317389 583130 288486 739242 96978 410837 174882 413076 73719 313596 465655
17100 465655 182495 612346 124604 562969 262020 580772 -101310 611604 389046 530147
17090 530147 20547 478176 277927 176365 337907 -17654 335794 579968 262681 583715
17080 583715 601631 384863 489080 195580 398509 276638 533748 130905 596103 272429
17069 454071 379483 667865 657515 294347 436379 507671 525548 438883 712461 565502
17059 565502 156313 680214 420618 417063 512463 484497 557195 618145 583662 699761 503253
17048 503253 207243 653720 536666 635448 600411 442586 362619 502750 346069 473616
17038 473616 576419 484086 564988 399255 602038 467518 538883 640556 623327 183322
17027 580588 630940 784783 540809 383835 275754 449916 627351 838582 754709 410897
17017 410897 696609 686261 736318 678793 594693 728460 486094 686306 482887 582004
17007 582004 352071 835325 572731 673137 717064 482649 735176 408804 558562 510333
16997 510333 838564 480352 879977 673528 676361 427348 519651 834135 915523 634314
16987 634314 669964 594180 518763 912877 662401 65094 647917 846990 848021 512095 659202
16976 659202 672916 590336 641574 950400 839938 217023 871660 729114 798127 1192642
16966 1192642 524000 982822 771309 808625 1070926 892652 901158 707949 803941 968276
16956 968276 927439 721407 1010405 1062262 894747 889630 626179 974233 944189 702358
16946 702358 653744 954549 759020 1137595 1165894 816791 782607 865156 1090971 1065951
16936 1065951 1174410 1283873 1167115 1159976 1196820 1338094 1036145 1143140 1093527 1334644
16926 1334644 1087907 1106072 1030144 1365398 1199749 996603 1350258 961552 1519626 1183298
16916 1183298 1035370 1314543 1284304 1155376 1230533 1432004 1055007 1603548 1371583 1285081
16906 1285081 1135134 1184186 1483628 1359429 1151480 1449293 1498244 1734924 1739179 1841987
16896 1841987 1175113 1648663 1644115 1517265 1634570 1286218 1509486 1710050 1647375 1473767
16886 1473767 1787037 1698353 1766048 2090640 2323094 2069571 1806640 1869626 1536157 1873190
16876 1873190 1822919 1944403 2039592 2306953 1697137 1648994 1843080 2054377 2159751 2029206
16866 2029206 1938478 2174435 2269819 2325372 1954452 2347100 2351060 2421958 2335793 2615506 2467486
16855 2467486 2150485 2604080 2626952 2408132 2514583 2601408 2443811 2794167 2584123 2680438
16845 2680438 3002115 3183074 2793971 3146272 2894230 3085292 3379839 3089751 3112452 3314787
16835 3314787 3447221 3462824 3283936 3468167 3399844 3581227 3428724 3963628 3732096 3770348
16825 3770348 3691613 3898890 4159831 4269183 4098478 4428369 4016648 4444504 4476741 4172481
16815 4172481 4375271 4619011 4905755 4607997 4737765 4874645 4919412 5100555 5117762 5231682
16805 5231682 5557377 5542242 5454001 5641792 5731112 6204248 6086706 6132036 6068421 6322806
16795 6322806 6641904 6672550 6672895 6962293 7360514 7212642 8128806 7462160 7691598 8300443
16785 8300443 8092978 8459914 8481342 8968086 9461830 9143407 9489200 9529569 9766879 10601480
16775 10601480 10518533 10855190 11210675 11699501 11762799 12196462 11952931 12350073 13075535 13430450
16765 13430450 13857803 14440378 14969528 15188395 15752349 16521740 16938853 17367866 17820081
16756 17820081 18387212 19291325 20015382 20724731 21467783 22138946 22533496 23848663 24550334
16747 24550334 25652870 26866720 27761377 28679516 29935905 31182276 32676321 33962482
16739 33962482 35606560 36953685 38793443 40452749 42581117 44617338 46567353 48910936
16731 48910936 51784288 54038570 56894215 60063035 63472092 66755270 70498680 74454451
16723 74454451 78976105 83313181 88102493 93087017 98520762 104460130 110415168 116701561
16715 116701561 123207978 130060062 136860717 143911681 150631040 157452839 164010597 170146566
16707 170146566 175495474 180466346 184785870 187785842 189910841 190362540 190331865 188674763
16699 188674763 185892037 182285263 177629717 172192091 166196582 160129364 153188612 145820220
16691 145820220 139196702 131775828 124957349 118186734 111295619 105563584 99447078 93845749
16683 93845749 88302082 83615966 78386427 73727695 69849707 65739643 62021745 58686195
16675 58686195 55228405 52263959 49735417 47108790 44714533 42568154 40281588 38240040
16667 38240040 36286454 34835629 33024160 31832152 30366257 29290136 27704527 26275355
16659 26275355 25171443 24406181 23361994 22435723 21587700 20716271 19743814 19049302 18610562
16650 18610562 17687935 17434947 17065591 15864982 15517559 15065948 14371301 13944737 13522250
16641 13522250 13161365 12892704 12609831 11711625 11470690 11314922 11125198 10785297 10365176
16632 10365176 10345840 9901827 9655267 9315004 9164338 8971031 8514219 8346650 8496459
16623 8496459 7786559 7719179 7614316 7482705 7321267 7051602 7117810 6308331 6532303 6288469
16613 6288469 6472280 6215602 6082560 5818904 5607483 5555037 5603605 4952611 5280391 5420835
16603 5420835 5303694 5076160 4682050 4833096 5119865 4411416 4710096 4219827 4478496
16594 4478496 4461693 3931708 3990732 4420164 3914416 3728433 3903445 3478044 3727556 3867007
16584 3867007 3393755 3523737 3599902 3432962 3511383 3456152 3355844 3190092 2963473 3058213
16574 3058213 3258190 2926150 2840303 2777742 2630996 2857371 2761692 2803395 2540529 2570576
16564 2570576 2328601 2353195 2463891 2126266 2153723 2331192 2460262 2154541 2167450 2032523
16554 2032523 2105524 2018658 2208110 2086950 1974217 1956865 2063425 1811444 2108178 1930685
16544 1930685 1663238 1841209 1916437 2024245 1900444 1690786 1996308 1829741 1985690 1926507
16534 1926507 1604800 2010798 1494656 1336753 1493465 1571680 1464606 1263416 1666445 1329679
16524 1329679 1236611 1650348 1486142 1469820 1067685 1503173 1452127 1420847 1367099 1269518
16514 1269518 1354800 1293806 1216235 1239829 1102177 1303857 1452539 1453577 1352195 1278522 932935
16503 932935 1500573 1079050 1379815 1441699 1233195 1079524 1157445 980023 763821 1012336
16493 1012336 1026903 1166617 724348 960745 1184837 1070170 810282 626333 912322 1041522
16483 1041522 1168556 1027679 811477 963500 1496380 849478 1100141 925475 904028 924222
16473 924222 1172585 733980 589225 928290 853936 1046807 253790 351215 1027688 1014683
16463 1014683 665770 839620 635022 533320 778988 670463 936146 693747 786406 572335
16453 572335 674413 550544 761677 771970 407024 629448 639468 413936 706557 426482
16443 426482 691794 456032 615420 743219 761522 568618 908662 704329 814183 647719
16433 647719 908027 766592 599738 786923 577611 979700 606080 832141 514103 516975
16423 516975 487406 492017 294088 378758 394307 342972 780819 536904 345572 273459 699607
16412 699607 226025 509218 515215 478120 515249 338884 390106 544303 576160 712244 672058
16401 672058 633296 201273 572276 452379 218455 512511 563564 366171 597657 606538
16391 606538 501288 496358 343468 423492 586484 523040 119384 667679 169975 380900
16381 380900 362462 285171 331528 206487 269527 601646 180456 512492 184030 293617
16371 293617 473491 282182 431586 114813 473618 284752 122332 651379 191279 112275
16361 112275 666026 371644 447883 113764 496513 361400 94021 400049 153445 613657
16351 613657 426098 345573 285942 394010 516306 120017 410698 448078 275134 -31998
16340 103112 422609 344708 -6546 42703 275463 80832 108291 422641 249136 258908 294691
16329 294691 96 591567 299486 441055 25141 155582 213367 241865 200790 85044 381156
16318 381156 273945 187758 150331 273650 -37917 75030 255791 429359 464025 353491
16308 353491 47533 387382 379291 305390 429634 -7294 402125 144818 287368 25455 89327
16297 89327 138311 272418 429475 -25190 274925 160989 225160 343255 270084 496660
16287 496660 218980 294651 159452 385189 84214 253473 2476 109027 202646 79838 5514
16275 120125 280178 535179 40889 44402 377051 50761 187736 275410 303743 233209 93088
16263 145920 29788 -23020 17017 297295 206272 67836 105953 55363 176536 115684 190856
16252 190856 265369 -53367 -66911 35444 222549 595346 -209605 -52861 -98161 172097 52658
16240 -37584 433869 -13271 -45290 -32086 241515 -4158 64975 173732 187047 135160 -105001
16228 129226 250439 80249 140483 102051 -61076 -52190 70133 -19986 343104 334737 391934
16217 391934 152905 426621 -275543 -60206 322757 56558 229597 254354 77130 81748 132949
16206 132949 312484 -23676 115143 178787 216243 25820 -370598 -3237 193509 100763 55691
16195 55691 -39030 -5063 88906 79906 -75090 431887 51741 239115 228349 59635 136792 -113276
16182 -209981 132599 399563 126487 374829 225955 -123756 -74762 261021 -91044 -224823
16172 -224823 -74488 39340 369733 -221327 248351 -165306 -382675 257518 -488283 209134
16161 137543 13364 -33763 502713 16385 167430 252695 38336 252053 148580 83631 94924
16150 94924 37902 198923 -49794 331821 247571 482905 -2193 392984 155992 -165505 -235796
16139 -235796 231141 290557 314636 -206766 -245430 304396 -106649 -59167 76057 411359
16129 411359 88295 87865 -144488 508862 224387 165044 -100010 -140385 301417 144018 17047
16117 328783 179947 -218337 128832 204738 81050 -234492 155701 -232496 19684 137370
16107 137370 300436 -141458 356577 133752 -178666 21992 -188219 91696 18433 157762
16097 157762 69012 -6105 128935 -134724 -92617 -160595 117122 70358 -140168 83894 206146
16086 206146 367196 196708 19068 -16092 -442385 234083 -252656 -291452 -47579 59619
16075 240873 -170262 -147862 60697 -91866 127586 308259 222006 -159344 143534 162310
16065 162310 116033 -25801 1354 111631 -243999 -39741 -219389 25768 -157496 -3970 -206126
16054 -206126 55620 -89367 -307951 3423 183371 -45686 76028 32558 15760 -104834 -142315
16043 -142315 -169260 274612 110055 124189 -276107 -33678 -292348 -148377 -234645 237343
16032 -144132 -19032 80197 -209778 24998 -219208 -24460 -26593 -145663 5991 175434 -54553
16020 130395 -206805 -43853 121731 136282 -240901 -225972 66997 -180805 -1663 -142386 277129
16008 114679 -27399 -406660 -47456 231387 122001 -186513 68932 439034 -18891 112829
15997 162750 -148297 284605 -106414 38540 -129711 -263853 42768 -19306 258000 -166051
15986 -48852 -2597 -69623 -90257 229146 -16074 33280 182365 99083 -1437 -9090 -38362 -153638
15974 -153638 -125024 47641 88693 102033 -17020 242318 121009 28 285149 -7379 249734
15962 -11773 49612 13935 697 95825 259611 140473 55652 81783 189373 -109422 -149921
15951 -149921 -2345 -147485 -128623 36128 13354 64920 223659 190576 -165568 188516 -68270
15939 -231188 -132172 -164938 171927 178447 12768 -65928 -105453 69995 61334 -122704 -257661
15928 -257661 60914 -255067 260954 -130651 -460973 498911 -156751 296100 198567 -104572
15917 -90503 -221343 -73346 -413666 192622 -93965 47171 12770 -158401 200200 -92163 -16889
15905 -149678 3968 210690 -248188 45796 -32297 -229455 191710 56680 -84207 -100743 105762
15893 -202237 -59366 -297858 -29163 102397 -312114 -53700 195923 280507 -45522 -5583 -311033
15882 -311033 289020 256506 -91633 -316645 -29289 -2375 -185009 -129650 -223227 45973 82925
15871 82925 169693 -291605 -20744 -106717 -1805 -54755 -79212 -258639 120193 -41478 -62153
15860 -62153 -429131 27570 -134355 -221427 -186435 -57318 282913 -328010 92927 147793 -7943
15848 -28731 -127547 78881 -400083 -106159 -118308 255414 379474 -118310 -78832 -237461
15838 -237461 90918 -6858 -7657 3071 -199145 9258 -316530 149850 -334273 26461 -336880
15826 -48268 169015 -53455 215356 -114426 55549 -2967 -236817 205546 112070 -169117 -132070
15815 -132070 24092 13871 397985 -394733 -10351 -87131 -94874 -90314 -336425 53285 -157913
15803 290859 -107410 -109464 -191628 92597 -198528 -267458 -29862 -218725 282148 17044 -149104
15791 -496912 3673 102899 -63354 -172266 91547 -73615 133065 106430 74723 52813 -62247
15779 335668 282935 25333 -278580 60366 115139 -94271 20963 44663 -51125 94493 90979
15768 90979 115184 153432 18830 -374400 -56284 59255 181230 23349 -22132 138186 14224
15756 156895 -58304 193364 48171 152803 249679 63942 -88622 -90397 370052 28599 -15407
15744 -87737 311603 259134 -105617 119881 -44769 -125734 -7389 300357 321090 -65637 217051
15732 209343 -151353 168246 -91718 -116955 -32420 -149652 -19432 -140627 85654 -117974
15721 165039 -61371 -71668 -154487 -126817 203431 -362050 -115414 -30808 238069 47267 -125466
15709 122918 -63090 -28410 -94278 -161013 103655 -156897 -168968 100357 70006 -114718 10377
15697 -11225 -123533 -140109 -21644 -93433 -138085 26083 142554 38954 -263719 -9744 -520276
15686 -520276 61806 -178074 204 -16404 -211448 -354537 20060 -9688 -2581 -68313 91888 -135046
15673 13310 -233988 -108701 -14978 -170201 122831 3497 279252 65964 -484752 113212
15662 184358 8937 46024 -258099 118856 -249556 15808 283749 6894 -78198 -32407 -244740
15651 -244740 -97438 139267 -238420 96957 44946 -275726 -22013 534858 -349779 -199833
15641 -199833 -309959 14138 -135171 -132814 -186436 129708 -148762 47727 47553 264694 71620
15629 72662 -3641 -59970 -340439 22959 -16693 -1410 1471 68255 -251035 -160379 -42094 -13229
15616 121089 111938 93797 14024 -184287 -148381 -40134 -254833 62097 33257 268751 124397
15604 30801 124943 48389 74719 319529 389421 -55138 16733 8282 -187543 -66225 -155318
15593 -155318 -95110 -125819 -111220 -35953 -169966 -24249 62473 -242385 -150551 -15174 -246748
15582 -246748 46016 80383 109909 104861 15118 -72275 68272 117995 45418 51729 -48991 -120302
15570 -120302 381028 -75847 -113888 10043 -27939 223786 -224537 137339 155542 -67521 -236809
15559 -236809 289454 -253705 -288931 122955 -356946 -30314 198571 -47033 -278686 149500
15548 227055 119800 327426 145357 419417 165925 288279 -33048 -219050 192825 191260
15538 191260 -59985 -199961 82941 -279671 14237 -28115 113217 -157510 217816 1135 -68052
15526 -119432 -78186 87441 -67135 119465 32891 41192 68710 179439 146317 153871 44072
15514 -115122 158186 -106815 97192 45853 -24983 201711 108765 196804 -120784 9045 -173586
15502 -159317 -12312 -258802 98816 -118536 -227484 -248784 -62179 -238824 40737 115683 50803
15490 -386414 -224431 -200394 -143035 126680 115427 -59305 130319 -171574 15803 -154596
15479 -176536 -45309 -176563 137457 -137917 -168312 130319 32641 98795 19331 -3049 140687
15467 125860 315837 -144989 23847 204555 24973 39826 13837 -121347 29704 -73865 -146918
15456 -146918 52537 228246 -12707 -384285 -47173 -124745 50858 93537 -6006 288611 14499
15444 243574 -133797 61118 32152 -143465 74632 248633 157673 34075 -136537 -32026 174569
15432 -78804 211511 144132 -94020 -4317 -152552 22864 148364 -245094 -61828 99251 188423
15421 188423 -9854 -2596 56599 -67819 -23489 -117907 140379 -305091 -147726 28880 80726
15410 80726 -86557 110341 -51508 148402 -153198 43450 -72041 196098 -297849 -43323 -84525
15399 -84525 -35333 -84126 -352179 163868 -51457 -93362 122761 -68241 -128052 280376 -188673
15387 4886 -390203 74964 -103777 155884 39254 -104830 98469 247916 129316 -196178
15376 -252012 379080 -88063 -172920 -38867 131462 38084 -123442 -343718 -144666 95997
15365 71958 -74673 112866 -16129 182564 179694 -6988 231870 176604 238526 408560 171869
15353 -182584 -244352 -100783 183768 -203060 -175720 -157311 -323134 -107665 244696 -251856
15342 223321 -58010 -332216 121464 -10011 39820 19737 187167 136674 -193650 -155526 131608
15330 28526 21886 253292 128287 -35287 -229522 366923 451701 39193 95209 176480 236108
15319 236108 11937 245180 42872 1379 273765 63485 127000 -110644 318244 104197 -773
15307 118087 -83282 2631 93204 293948 100656 14638 -144771 -43958 152055 36294 128351
15296 128351 -21200 -113882 152518 -43907 -97997 62225 124472 -165588 21539 -176004 128783
15284 28091 -39121 240433 315112 -277765 82656 82570 23977 85781 -194145 -70094 -144552 125613
15271 -177985 324905 -173286 -92053 92362 205521 227307 202609 -49537 117173 -152335
15260 -145943 -46119 168070 -180795 234881 115326 117447 413500 -134116 129390 56743
15249 148669 -339931 -87688 -88845 -27793 125460 -67099 3084 410701 1290 -203669 85841
15237 116189 59556 494056 759774 753190 904623 924156 244796 390327 313159 412517 224467
15226 224467 41276 281851 53097 391402 84541 -77478 287878 -41049 -46980 -33133 203091
15214 38089 -195487 85543 -53973 -205411 293943 241451 33342 101299 191961 -208807 3253
15202 -174201 126686 -89608 46852 -126667 -90247 267320 -46282 -35493 313254 178498
15192 178498 -41582 254279 193354 138289 -321518 -11706 48110 139306 -77170 10903 306200
15181 306200 44341 74652 -312718 128929 62854 144489 222216 -244740 -112036 291587
15170 -66234 68148 320168 227357 64409 -13418 -72554 31894 148936 156779 -306002 166966
15158 129373 -24155 -159717 -282635 42391 230304 -22688 80100 251152 239259 -134676
15147 -57264 83450 68539 177341 85232 234631 201096 178600 -97120 202886 -99757 94676
15135 221063 213394 35531 -34430 296298 256206 -140725 -216233 338316 257695 92689 153494
15124 153494 143363 -5900 262276 174677 319593 -53020 129272 118567 108929 462700 213259
15112 206017 52825 200015 280694 154274 227233 72849 17280 -227984 246588 86420 -80598
15100 -94683 174304 50841 260272 -40 -178106 298343 -186468 34968 200129 92125 263852
15089 263852 116909 315993 221319 -60370 65362 121828 220278 -87281 -76082 -399617 160955
15077 623092 117521 354488 218861 -85252 375000 45173 145445 141060 328297 410701
15067 410701 380090 132617 47485 -111514 370803 220633 226037 269641 114913 118576 105870
15056 105870 75720 2100 289759 135763 172467 244365 340267 578998 389198 -150622 344318
15044 315845 157012 -36462 219607 245927 207229 145959 35787 157361 311364 40931 65765
15033 65765 301311 332341 -35841 88366 189744 -44261 295725 198223 274815 195216 202141
15022 202141 -94045 219503 -67350 288643 608972 -56395 372416 157386 43558 176338
15012 176338 168329 476526 -124010 -297183 109803 148789 80236 340008 173130 304476
15002 304476 -192605 -39801 316993 108984 169709 -105541 482919 99350 135498 170904
14992 170904 -348 120268 -88161 318305 276129 334196 139428 234894 271832 128096 115147
14981 115147 452007 345890 238620 333639 74133 250336 140303 147604 462129 138600
14970 31131 621218 150757 34081 -74401 455496 353005 77074 130552 342953 514708
14960 514708 223240 140352 173683 -168554 88609 382580 266854 143373 114326 177436
14950 177436 484539 121752 140991 316993 73242 184570 272069 235488 294799 330776 251624
14939 251624 108269 518313 59385 160025 -153816 439767 159465 83316 263537 162646
14929 162646 121142 477255 214069 264793 57846 548704 195451 220537 625250 419563
14919 419563 100588 344527 68618 74749 120082 99053 210383 308280 383692 429279 384474
14908 384474 358810 273719 216836 192605 583555 362720 306853 183238 231483 155027 431490
14897 431490 220073 287590 281685 472482 432092 -56234 367623 180758 28418 520440 583624
14886 583624 553773 -65359 388010 39108 365691 554031 279676 258895 98259 428456
14876 428456 -2584 177281 200917 455966 198794 304823 400721 211376 336546 632899
14866 632899 400470 307273 421008 227831 375561 236225 252762 357696 584600 189042
14855 362989 641900 566728 147132 110239 439346 449400 486903 -22036 683104 145881
14844 448961 255698 655829 325382 289756 347988 294043 46630 448947 240776 437972
14834 437972 376326 564933 361036 77242 324169 566234 426679 226460 546014 425095
14824 425095 376323 359491 528186 577047 486360 209399 555000 467432 583474 194232
14813 597485 327711 246385 263348 465279 148867 541890 649011 690256 202778 197208
14803 197208 337443 291515 588914 650595 442552 464753 556572 539384 661257 707772 702890
14792 702890 546770 269858 380427 647314 551394 329669 810473 494358 450169 554924
14782 554924 381676 687136 733796 377190 374697 695518 619627 506071 356078 279737
14772 279737 942975 576730 543014 635708 624374 423104 198388 205070 653530 455686
14762 455686 407837 889427 656573 562592 902222 858573 1062117 699411 796255 352375
14751 748599 679439 726923 934750 340726 543401 460669 543768 857368 609174 753110
14741 753110 664130 960905 636920 587415 415487 342739 448050 595659 730598 668794
14731 668794 546894 594769 495443 592639 337142 1047524 685144 618747 769892 905680
14721 905680 720015 802172 699646 732623 903075 689594 605530 611833 1073704 810742
14711 810742 867943 1082949 845085 562893 510091 854285 998926 793052 770144 1106451
14701 1106451 807056 661093 832854 746665 1097554 947199 956487 487774 892391 946076
14691 946076 582645 1172926 923632 989998 955334 1051251 764402 906563 774551 723998
14681 723998 890298 871828 787688 899516 761226 780137 561036 697563 835114 1172389
14671 1172389 937766 994372 636823 734831 820577 884711 879873 774306 1011115 1078045 1059865
14660 1059865 1221473 1176677 1006453 1107756 1055304 1271818 968127 895814 1130393 1209443
14650 1209443 1222248 777983 1043331 1037979 1331938 1103955 819203 1145805 1294668 1073533
14640 1073533 1026643 1176617 1252912 1228541 1379531 1301092 982594 1211446 1191435 1313427
14630 1313427 921777 898668 1542161 1216090 1054394 1419171 1182338 1076972 1236029 1440502
14620 1440502 1312345 1178183 1371226 1413522 1279554 1192399 1312035 1409048 1377455 1146731
14610 1146731 1306352 1851017 1520085 1711633 1435327 1465712 1558157 1760680 1744344 1394937
14600 1394937 1609780 1268373 1640793 1524065 1358909 1569809 1659975 1829970 1849705 1606625
14590 1606625 1790668 1611573 1605337 1873689 1746295 1636024 1505256 1586056 1921573 1851750
14580 1851750 1934599 1925761 1755588 1295857 1980921 2035982 1900315 1686168 1863168 1855259
14570 1855259 1847040 2060975 2175489 1974422 1832331 2048378 2194723 2285536 2158987 1892025
14560 1892025 2275443 2009794 2288907 2292641 2046589 2064712 2731810 2660588 2095513 2464917
14550 2464917 2256441 2602841 2962759 2966359 2880525 3239867 3075629 3200119 3492266 3798910
14540 3798910 3925639 4596937 4948160 5398567 6452663 7994037 10228148 15079280 22196398
14531 22196398 32997171 27674000 15857168 9160629 6694517 4941495 4064098 3486130
14523 3486130 2966262 2768823 2399203 2368837 2672826 2185850 2313006 2558782 2295206 2111340
14513 2111340 2326945 2278662 2324037 2370523 2215694 2565307 2628034 2527338 2323007 2526655
14503 2526655 2872368 2611506 2576124 2688985 2667046 2380185 2980450 3029271 3016635 2967077
14493 2967077 2708321 2930604 3125431 2852074 3194912 2786483 3028916 3374066 2969752
14484 2969752 3304028 2971461 3460057 3278364 3561011 3548917 3646901 3674066 3518680 3368612
14474 3368612 3632695 3809111 3501354 3449068 3434815 3855942 3932518 4214821 3920100 3923177
14464 3923177 3873922 4009847 4148189 4258465 3951715 4040842 4269191 4591367 4290232 4485097
14454 4485097 4479786 4684604 4689141 4366689 4668895 4364527 4879249 4851236 4585527 5017583
14444 5017583 4846510 5195945 4896652 5409802 5426667 5072875 5415661 5599891 5639699 5444814
14434 5444814 6063851 5690960 5593918 5788196 5724285 5812608 5908781 6158992 6086223 6246445
14424 6246445 6393323 6352387 6260515 6341831 6617622 7211448 6867854 6996258 7110250 7166163
14414 7166163 7412096 7368125 7494009 7503281 7590655 7728247 7763852 7897934 8419314 8145053
14404 8145053 8604687 8397110 8407548 8542190 8600242 8650198 8861884 8774414 9532414 9858004
14394 9858004 9478856 10015578 9573777 9931658 10327598 10168859 10624363 10625870 10679598 10901519
14384 10901519 11010705 11308537 11679246 11523966 12106242 11906215 12460309 12788842 13012696
14375 13012696 12905288 12860183 13288853 13399181 13732737 14097638 14420072 14750326 15125396
14366 15125396 15165680 15640757 15501564 15786937 16054568 16690574 16976449 17102298 17321396
14357 17321396 17729080 18142713 18574028 18886263 19581942 19997321 20443328 20782670 20961340
14348 20961340 21962138 22547372 22359767 23010427 23482568 24390792 24449277 25156524 25616800
14339 25616800 26434997 26904614 27667064 28292659 29121264 30030877 30880706 31500983 32198346
14330 32198346 33167383 33810923 34978449 35801627 36963703 37961073 38913120 39933915 41110045
14321 41110045 42484039 43315246 44882320 46090839 47378057 49203762 50593278 52492470
14313 52492470 53980728 55488934 57404905 59694620 61734367 63831140 65501099 68125267
14305 68125267 70356985 73262856 75727869 78153776 81727826 84727100 87682503 91308203
14297 91308203 95080703 98908062 102818193 107182390 111638522 116563420 121701745 127166630
14289 127166630 132941625 138864938 144883438 151715227 159122954 166446666 174545311 182916265
14281 182916265 192140449 201907780 211610975 222565624 233696016 245793705 258289523
14274 258289523 271346422 285099366 299755801 313982091 329056888 344059121 359180866
14267 359180866 373653412 387493695 400587468 412610727 424083472 434040907 442942787
14260 442942787 450749720 458004096 463783658 466851539 467654360 468590131 464002862 455739698
14252 455739698 446893167 436585605 426462862 414851320 403833940 390132383 376611415
14245 376611415 362965061 349284888 334968127 320875989 306787935 292571872 278786481
14238 278786481 265245902 252290072 239064110 226743560 214894654 203674269 193264897
14231 193264897 183048908 174022650 165200456 157017227 149380342 142067460 135365950 129254869
14223 129254869 123768324 118119454 112522765 107482711 102832562 98682329 94919511 91024353
14215 91024353 87011419 83711675 80730182 77306702 74208904 72025723 69290607 66608880
14207 66608880 64367124 62164743 60147993 57927519 56106198 54186780 52346105 50690181
14199 50690181 49694222 47896315 46032418 44975374 43737672 42283324 41477819 40664939
14191 40664939 39171019 38060611 36721027 35846379 35395319 34119732 33416943 32405255
14183 32405255 31488945 30574587 30165530 29080634 28909934 27708913 27350077 26723678 25893410
14174 25893410 25217251 24514358 24139008 23624661 23087060 22459233 22036595 21466576 21088225
14165 21088225 20557274 20015117 19683804 19647513 18905325 18538863 18243057 17689938 17471059
14156 17471059 17400649 17011720 16610685 16346689 16064552 15652690 15562770 15336955 14682151 14603937
14146 14603937 14445606 13936120 13950773 13616711 13254968 13097326 12954708 12673472 12425463
14137 12425463 12329657 12214085 12063438 11563141 11395678 11133362 10897498 10748630 10640050
14128 10640050 10643413 10666306 10427892 10044470 10128327 9832694 9588616 9456433 9294035 9253777
14118 9253777 9060981 8701748 9037533 8841696 8575576 8583435 8214442 8273995 8410493 7688630
14108 7688630 8003201 7584533 7745936 7701007 7388871 7394788 7343524 7067303 6956384 6896852
14098 6896852 6758996 7062989 6505483 6562054 6488413 6579755 6601933 6602563 6315362 6216151 5835632
14087 5835632 6071729 5979104 5836538 5772246 5551310 6099363 5735253 5166640 5648084 5295835
14077 5295835 5567610 5414306 5257408 5206084 5209425 5304985 5017216 5096576 5024980 4977893 4633149
14066 4633149 4597220 4759210 4587268 4718987 4406368 4609155 4335770 4582128 4403553 4263410
14056 4263410 4512573 4279907 4233732 4070062 4374475 4068623 4297666 4120336 4096754 3615037
14046 3615037 4128653 3943101 3849925 3788552 4062459 4004710 3478270 3489913 3765535 3506899
14036 3506899 3441032 3423125 3407522 3415180 3598048 3178150 3295886 3408404 3417661 3230408 3302384
14025 3302384 3186831 3078972 3177085 3023630 2954426 2988415 3344125 3044659 3011777 2822362
14015 2822362 2846718 2856884 2823246 2835241 3127026 2844584 2904435 2628108 2708161 2750437 2609285
14004 2609285 2625923 2784023 2581884 2414834 2529833 2295129 2076033 2536841 2544595 2567448
13994 2567448 2246432 2185338 2266885 2376873 2213200 2474239 2341645 2259324 2103634 2351932
13984 2351932 2326710 2387386 2400005 2321904 2634384 2501867 2992858 3336899 3864457 4550049
13974 4550049 6954602 9976010 16864287 28462330 29713721 18531465 12632124 9229106
13966 9229106 7178509 6100176 4990263 4237763 3982785 3803856 3495669 3226981 2990863
13957 2990863 3169073 2765267 2499241 2688523 2417287 2333451 2373475 2081293 2292062 2216599
13947 2216599 2034917 2465305 1930845 1851387 2010270 1965490 2204955 2092901 1930569 1877023
13937 1877023 1895650 2224175 1946151 2065724 1887801 1881873 1875928 2011067 1648150 1648228 1721371
13926 1721371 1962604 1856626 1338863 1742306 1451882 1698600 1573633 1747266 1301963
13917 1301963 1381297 1778279 1541456 1332323 1552377 1240608 1989475 1342866 1736355 1459726
13907 1459726 1571852 1426135 1587763 1255611 1351814 1671350 1414763 1681256 1478686 1530863
13897 1530863 1505570 1622507 1449749 1635569 1479361 1364498 1516027 1343129 1510020 1298200
13887 1298200 1374227 1451937 1440837 1563313 1205331 1120833 1568027 1449404 1323138 1260011
13877 1260011 1100875 1516851 1248348 1340351 1416080 1177415 1345590 1196750 1304738 1172443
13867 1172443 1335190 987292 945458 1246108 1116074 1169636 1052978 1332819 940851 1153490
13857 1153490 1329842 844963 1345820 1170955 1144762 921749 943627 995587 1021757 1048330
13847 1048330 793359 1026975 1113485 1077662 957628 1066218 1180831 1220456 1113885 647756
13837 647756 963449 1112934 592513 1045654 1151830 1146046 871093 1023137 843001 695546
13827 695546 1032437 864119 895155 1276125 757329 941208 1049892 839433 1124709 910785
13817 910785 872391 832868 809030 790540 1038098 1027822 830349 818720 804676 738282 975199
13806 975199 754240 894747 995093 907526 785164 1232055 921826 658111 1019178 422421
13795 810679 687733 812743 769813 763945 712392 1107808 614538 811041 870043 774901 839907
13784 839907 489905 666285 737543 821384 637338 1012540 502024 1048902 762100 828426
13774 828426 945749 875608 632341 580988 915206 791493 724386 924558 914071 737178
13764 737178 662822 794677 573906 575483 645913 508244 661228 477770 666434 717823
13754 717823 774498 499569 851532 799813 679885 532275 591011 798099 704045 403093
13744 403093 670125 451295 681373 600206 514172 603250 781297 700343 499070 927028
13734 927028 799470 300001 366921 368886 619989 815644 774393 596634 757826 600943
13724 600943 411635 678165 720912 370290 364761 619612 604599 581979 787399 680171
13714 680171 516119 662809 609011 841205 651934 615403 457250 463924 431565 502361 406796
13703 406796 706847 534868 386495 713558 478908 509320 415782 530329 609578 406574
13693 406574 878752 526155 362054 252009 654102 668616 165327 525039 305977 343281
13683 343281 386602 483698 375585 236825 553757 508564 633988 382331 422370 432588
13673 432588 595970 354364 316186 492936 907651 633210 379678 75745 704381 555743
13663 555743 385675 414055 180839 480792 138825 387665 385066 714254 205674 423776
13653 423776 600338 442851 382074 322005 465474 324347 500760 359179 162128 522828
13643 522828 500561 351831 381286 375942 404650 455044 257589 570013 429503 231641 382329
13632 382329 53927 438845 516406 394500 445638 528902 582351 549585 586804 198402 412058
13621 412058 658871 433582 492403 186 302648 -38865 316791 668605 115445 542217
13611 542217 359669 59604 218126 524283 667713 305807 234463 419501 491720 17399
13600 353568 222213 239354 329610 656399 277901 195306 623976 392073 391701 106517 294126
13589 294126 296736 489046 365479 209497 217516 482232 119584 764569 416135 444863
13579 444863 395139 413672 390655 524739 470425 210285 140719 278302 238101 478702 694418
13568 694418 368412 362738 98259 264045 180713 471632 145721 70545 -3866 587712 453650
13557 453650 148320 535034 88097 383713 445246 455538 512530 258225 -54733 164187
13546 561396 168867 481874 419512 409987 206565 78536 317817 178328 379786 54872
13535 385073 355533 586724 456414 431103 204631 527751 120068 297284 109060 355325
13525 355325 276209 412102 186874 261743 298082 214620 170191 583136 125643 177553 398076
13514 398076 349405 144353 235520 162981 695864 230628 293414 474343 287315 243347
13504 243347 409741 392724 539038 507163 288255 703068 65274 153872 114972 553166
13494 553166 378806 57698 183582 522483 253789 79844 -1322 318756 -57317 214198
13483 309198 70567 254030 85854 243777 -118582 247082 509382 218876 516542 303401
13473 303401 328975 1028 412224 366507 62320 337617 326725 22257 265737 76093 -24335
13461 193783 70568 298549 41472 267235 258462 170607 300316 362136 376511 210413 485709
13450 485709 35054 303497 227937 309523 284764 282898 119530 218663 -75567 25123 250071
13439 250071 379095 -3393 232726 -25718 259559 255070 212571 273158 472045 484035 -19854
13427 307000 20597 452667 363164 316338 226639 204076 -192075 33820 104810 -19645 107751
13415 450841 115332 -108576 347742 -29738 261909 14452 318054 221662 170395 10315
13404 204781 408973 363960 254969 -101168 25154 30750 63032 345844 203727 124827 262966
13393 262966 192233 264104 63645 238074 114535 344550 -58607 599989 314914 362621
13383 362621 295708 219825 117037 472678 -296897 36098 255584 14745 -19218 42149 106410
13372 106410 232412 240798 -5027 166078 146622 298688 259262 97060 67846 191665 -311718
13360 279191 281563 16907 189566 158673 108428 279785 454267 285656 191829 181683 6755
13348 55464 11829 147162 207637 250717 487270 78549 75658 525397 531558 85067 404458
13337 404458 258121 439860 41763 443352 -67608 443032 388709 317678 248675 302415 383718
13326 383718 233556 273781 332457 226644 371247 -71197 241299 245831 -156432 277118
13315 7463 -18233 92277 276490 -82579 20662 173464 -51659 311182 230460 294305 233670
13304 233670 168030 -64758 73936 304446 313212 -106565 110253 113269 151853 219611 -53278
13292 -118795 433932 301078 -37229 111819 -91161 -119738 197499 290483 -9121 38997 275581
13281 275581 189818 180506 136764 90231 64275 587721 215217 83699 26834 183133 92467
13270 92467 254288 12738 123805 -90394 -63067 137501 65201 105614 171889 247871 46742
13258 -155597 48662 -80059 7206 192598 130531 -146119 85070 26701 -99519 117083 493974
13247 493974 295464 249640 -136883 167038 217370 390826 148072 12065 101612 3003 267954
13236 267954 -31457 298577 91362 263496 62665 193969 -214380 148780 268135 -227136
13225 219637 -164431 131371 240563 443647 203892 90684 280680 25805 -170818 -40421
13214 -217224 167125 135304 -140314 -138956 -14759 -288463 86365 160349 88536 -87536 66539
13202 143741 408931 -312197 143454 -255981 26885 40769 191616 102621 -137708 182920
13191 113267 24119 38561 153142 -37127 160382 118609 284611 13303 2068 -134271 216996
13179 -77314 -293353 139606 121801 -7358 -109897 223157 152877 311670 -32469 -194818 67010
13167 46774 -239488 -110010 -113256 -75810 -190578 104694 349762 15126 -49014 197925 132405
13156 132405 -45329 238137 7013 228569 202164 -366281 -229882 74477 -64949 -16108 -69215
13145 -69215 251447 224432 60078 34789 136772 233162 106329 337226 193748 99070 30646
13133 148323 215050 -36076 -173336 -99752 425040 276547 271367 225642 81986 354337 448655
13122 448655 133239 265096 55822 35214 110430 -289037 266340 321050 144401 197627
13112 197627 393850 310022 128561 98770 295341 -55092 109250 199798 -189021 -38693
13101 287014 181561 220289 152669 448456 142446 -16210 -69505 162946 80129 90089 -47685
13089 -373937 -8852 278293 -99019 -301189 347333 67683 -201810 177535 631545 83502
13078 -89834 14126 6593 50438 331066 240652 21333 65235 104609 3001 170630 137365 -46679
13065 225341 -63178 149596 262178 526871 -67159 123480 229749 346737 312278 291149
13055 291149 249276 -87808 264320 670576 135388 17940 32800 491415 -66109 224756
13044 7339 -142075 74805 -29926 -154789 177365 54416 -144627 14406 291974 -175239 291858
13032 -35987 411625 -191612 -87490 275764 -13186 188996 44002 82186 -159075 7004 164489
13021 164489 -61953 293513 -110404 184297 224723 -41300 10431 107431 -3819 -28086 205069
13009 126304 331178 -21132 249407 -117752 -3417 344131 149744 195136 -15801 86695 -142643
12997 31288 67622 3565 364681 -172610 196685 -31038 115254 63206 -49602 -71427 -59731
12986 -59731 -34632 108151 -24225 -107664 191174 -93306 633397 -26650 -54915 14717 40571
12975 40571 -55445 -117762 167567 -265562 421026 56189 420845 123486 -118256 136200
12964 90659 -76746 212082 144149 76202 -65476 -214320 107672 32724 -19454 -108416 9638
12952 -73979 -174945 -112562 -246879 259502 20481 70276 162460 -136857 52276 55210 -135860
12940 91006 188361 30681 135989 103691 124344 -224816 -101775 216601 -11469 -97851 38452
12928 -171960 185932 191073 207055 102263 19161 262835 -1434 -252989 -51541 39657 233370
12917 233370 130994 -55375 -120606 237599 119498 -142352 109629 155730 -61194 9731 148175
12906 148175 -201714 729 242954 137132 50521 -38761 19775 -93376 -115314 143231 -166164
12894 -47824 147636 -22519 120894 47803 272826 52165 -12448 29922 -149624 41420 193861
12883 193861 208274 -95157 -6682 167538 76557 -151675 145681 32410 -261226 164039 7392
12871 33491 130934 -71356 202435 -44392 -122070 -22502 57991 235484 37303 -259095 -35930
12859 -186938 258128 36976 -229697 319790 53053 25078 317604 -129929 -168723 -66653
12848 -27084 234284 50200 -26476 -30222 299527 -294309 -3156 -40962 352280 -322655 -32644
12836 -47339 14875 83068 -76861 46058 310705 328129 32911 -88494 85871 -312063 230418
12824 203520 130537 364925 225771 -227818 -109291 95845 184116 175456 388155 12961 254797
12813 254797 97790 -173262 -313383 -61216 -127430 223326 -31069 30475 83491 87218 161932
12802 161932 -9270 306140 140688 380910 41736 2564 -71979 -5861 145601 -128328 157993
12790 -87276 98623 -44813 8741 -85415 -155926 -173879 -315935 10751 -224833 -9264 -157615
12779 -157615 -252845 -37912 16826 79164 512427 136935 55689 137487 -30930 -271309 -12060
12767 167095 414546 -21427 -104415 -270826 195357 162119 -289483 149958 209525 60284
12756 -156120 -256674 274030 10933 -220111 80025 -60687 -21200 -133473 28092 -161534
12745 -180223 112564 -75071 -117647 -103015 193753 222610 24963 116374 -128333 -228994 145117
12733 7900 313095 71058 -129315 -16365 -177753 73108 111436 28477 -68200 159804 201469
12722 201469 -135352 63104 205489 141762 465594 99824 45189 123214 -19718 -140127 -242471
12711 -242471 46890 11660 291273 157422 -143413 -124115 138832 272502 -229940 -219838
12701 -219838 90441 86884 187831 -5854 340048 90830 34610 207976 179098 115793 380227
12690 380227 144662 343482 268911 226668 145689 994 363149 122933 -128647 -7466 278592
12678 -251608 267592 -15719 -3656 61417 -143607 -65560 -53133 -40849 -65469 -72453 183758
12666 153856 -239609 185386 -160991 -97104 257769 263348 49060 34236 129775 79468 72612
12655 72612 273188 88813 385905 2411 -9186 -230366 239561 53990 40877 30030 -65843
12643 -11366 365680 62358 227273 56117 -128869 235040 264155 31764 223338 145263 110040
12632 110040 278007 940 120505 178022 -82009 -191853 194655 -22911 -11479 -144401 431390
12620 -140785 291639 -79074 312953 63240 -98998 55030 329401 68603 145962 258964 231182
12609 231182 429118 -32748 -106585 286184 287803 211204 280795 -139024 216184 306817 151611
12597 271402 314551 -71827 429176 -101166 257681 -76780 -40661 -216254 -23132 -306865
12587 -306865 138287 -75163 173587 -57721 329337 -428840 -182100 -265344 91214 -337126
12576 20304 -274568 20777 219766 -53440 111826 -61658 -2973 -168920 -235322 -149217 1029
12564 113504 -123221 100080 19501 -40171 -84695 106981 364596 -421487 -156129 118703
12553 133778 -195627 183760 -60362 47431 140265 107592 150841 -200386 111035 -111195
12542 -55793 65629 125695 -65631 52786 -94473 1065 -100987 305784 304522 -168765 36317
12530 18361 290792 -57367 82408 -17262 -35835 -270116 135612 39648 76035 35473 138635
12519 138635 130098 -74939 -238829 -160425 47779 260638 -178844 47509 91171 74130 -54639
12507 -33905 13707 446842 45033 34754 -267340 154357 8060 83801 -114899 -259853 -357754
12496 -357754 -89913 -74176 208606 54069 122755 51563 -330270 -213194 277924 22773 17031
12485 17031 93888 29155 84861 176107 -144538 -57438 91220 124807 106315 244949 43287
12473 12785 73925 -643 -125935 111511 285691 318302 -75512 -94953 -195225 63661 -71312
12461 -153325 102667 -144685 21182 114326 -62582 27215 34688 358556 88755 95244 -6200
12449 -62831 -47170 -24954 226747 -98644 -271124 -13690 53085 161763 -112015 107742 57820
12438 57820 41887 -266008 188037 169108 194836 80671 105459 -34733 107346 -85822 46387
12426 -126 -52896 15202 -5900 -184260 135256 -154124 42907 -15110 -145289 137593 -70091
12414 223959 -300492 -11265 -26970 -313985 41500 -100749 18146 37069 104966 173363 -25477
12402 -161694 -143540 29556 -110563 165687 -368550 236126 -30938 219119 45765 27289
12392 27289 -64272 111870 158447 -16873 -255355 151936 103377 -259377 250218 -19210 37963
12380 -232422 96977 -23081 -72822 -37419 -11356 189824 -18741 -78540 184793 -192985 -238564
12369 -238564 23395 -107967 170299 -97835 333383 -170036 -141348 -178195 50137 68470 7383
12357 304751 -172468 -94436 -147237 -132548 56770 70014 -98950 129342 173847 -35307 -16143
12345 182848 -59736 69721 -173548 43069 -148561 -199922 44642 268539 157332 142116 -252632
12333 39966 -36661 129711 41566 -191403 -23288 -49173 -19734 93513 123249 224546 121877
12322 121877 122978 260238 83582 116743 -50182 -234615 -202524 -15035 -157390 165591 -76531
12310 305463 -255806 -160298 156438 109784 -104636 8201 -195867 154338 -110229 -90387
12300 -90387 95086 341850 197688 102488 -91207 230632 -310056 147547 -150015 130513
12289 343565 -187105 -54049 -118274 34829 41724 96921 1507 -251922 239728 -200804 -94859
12277 -74726 67327 231869 -128740 14229 209979 64274 95804 55548 -32911 40811 73634
12266 73634 -82550 153469 114078 -44343 439226 -91040 239684 18909 271425 52609 37712
12255 37712 -29250 154439 80540 233013 44288 55824 223785 130340 106490 43582 133879
12244 133879 156657 131826 261602 96681 -238590 109130 167431 -147552 286189 5105 -193385
12232 -10690 68378 446054 132929 -92973 -179371 25017 -26041 322841 194468 37315 -28571
12220 179563 -171515 -1735 196981 -263735 309970 117140 130957 142250 364711 239856
12210 239856 607228 -17939 355733 164384 352263 -253158 475462 238549 181084 201495
12200 201495 228398 -69076 109203 208017 -175044 141456 26693 140286 -6390 271005 -129913
12188 348641 389707 605338 118213 166673 316483 367632 372881 648072 47337 103503 249948
12177 249948 -47068 -77703 133541 65697 -194719 142421 121183 165084 87622 33941 273209
12166 273209 262716 51469 237400 55701 151001 235406 357065 93096 16509 165842 257542
12155 257542 35887 -19981 2441 195798 61358 -26555 -54383 76171 -117382 5115 158623
12144 158623 190838 5668 -75622 522189 -309611 222489 120125 -106748 -119194 72941 262753
12133 262753 -29196 -221815 39948 25531 157397 58035 30325 11967 -136310 19166 -182573
12121 340073 70825 -2740 153752 135040 -244376 14833 347791 85170 -29194 18948 30050
12110 30050 262717 -129189 173575 -60650 4888 -273392 49630 211466 -21081 -122736 -50167
12098 268991 59709 29727 -115404 -208599 -18805 153 -111933 -8919 16725 -293612 -62884
12086 348392 11839 212969 368425 -52324 138535 -16161 48865 91373 -98379 -69775 -115158
12075 -115158 258088 79338 418380 80159 -88829 365424 220775 -268522 24395 -121950
12064 147404 180855 124698 136739 197555 40774 -57372 -42033 473294 506761 635421 1333048
12053 1333048 1170207 804763 45472 360745 -79311 275502 405992 -66552 48769 119350
12043 119350 48671 39110 -45318 -1709 9654 154507 225159 -171187 -36292 71985 295913
12032 295913 165668 -133252 -360219 34423 63664 226472 70906 93600 16190 195220
12022 195220 76887 189451 2968 133738 -137566 -263765 -373912 -83220 42049 -332859
12011 81814 -59442 -118603 -48447 -283919 37992 332082 -223103 139895 -328226 -206608
12001 -206608 29327 -139333 -165324 -99150 -99588 56624 -153763 139863 19101 -411214 207688
11989 140574 -219867 131720 -201899 44109 -312292 21098 -100615 -149686 -323410 244156
11978 99306 30798 34354 -82628 284292 -294901 111158 277444 -46225 -3732 -19106 236044
11966 -73999 508643 -272031 -23465 -32900 236667 157050 71489 187351 -200046 -116123 19313
11954 318757 -399238 1316 -22935 25307 15638 7095 -208441 16954 187672 73626 -72103
11942 -7142 -141554 30420 201357 -100267 251140 26672 195014 7139 248266 -189441 -230538
11931 -230538 -264487 -156357 -44853 280657 18314 -116284 204823 -174634 -190951 162592
11920 -163837 -461 -160965 133346 174839 -116158 -23428 -117579 86298 127991 -33897 -83192
11909 -83192 129715 -432967 -169716 -225020 74437 144721 -126473 95957 -275757 94580 -136834
11897 -434724 273977 -46254 175854 167665 -8982 174510 -22316 -222427 94235 -47844 -65162
11886 -65162 -102022 64615 -220282 23202 -144355 34587 180437 -32126 -241806 -135884 21394
11874 -132799 198791 -63715 -256612 -224208 -181254 -314421 -161861 -394947 12191 -225101
11863 -295872 -310706 -6807 57679 52125 152942 -453561 -191668 -16060 -103179 -74297 59544
11851 118643 106370 141483 -208047 -37330 -129656 -58722 -149583 75474 50417 -376459 29445
11839 -208598 178726 -243311 -46561 108673 -48743 -111878 164945 -3933 -159135 102156
11828 -399822 -15 7059 -125448 -89090 -300489 -180079 -30914 17353 -133280 -24949 -230614
11817 -230614 -148936 148913 46601 -152053 67586 126178 -12518 -76365 -357926 17783 -153907
11805 -121459 190134 -71846 36924 -359827 -317311 -187029 142259 -6221 -71886 -175151 -282344
11794 -282344 -349737 248424 68146 15525 -251306 -194575 -279775 -61291 145571 64380 241411
11783 241411 -341073 -37499 -217306 -66604 41416 -98750 99900 -166442 -302082 -106499
11772 234081 -36974 -35869 130607 212040 194358 143627 29985 192476 5268 177034 212120
11761 212120 -218255 -243332 93480 -156172 16185 264556 203807 56836 52943 45345 97456
11750 97456 124256 -203212 -126097 235564 31482 -212805 67755 148585 -214820 -35840 119015
11738 -215287 -9288 216119 -69424 104570 283861 -55319 131181 -353622 -12945 252752
11727 137268 202519 326306 -148979 -314775 -150189 13980 -52652 -84586 130530 65872
11717 65872 -44925 56937 191483 271052 -337715 -291314 106141 -288197 -291810 215024 39146
11705 258283 -158155 143177 105683 22308 -59217 -41269 -57129 -319601 27453 183616 227341
11694 227341 122291 -324829 -7785 112348 105787 32001 -8004 -45894 123136 60752 187717
11683 187717 253399 89435 -199410 229898 -207047 182550 184076 1960 -258697 31529 318767
11672 318767 72340 -370586 -295715 -106057 -92456 -32637 -118278 47177 -82470 -106317 202940
11660 124475 5574 -167149 48077 144396 -87326 -5797 34560 11819 178353 -294847 -52128
11648 -8561 10637 -178484 -94718 121778 -131613 72266 -184694 71032 64444 170209 -89983
11636 -59524 -309135 -97707 30956 -13510 232416 55602 27583 63803 -48098 -131800 -155308
11625 -155308 -390046 -133904 150443 -157035 -479943 26483 -265099 -137052 -90750 100091
11614 173287 -124334 103249 144266 126544 115686 315265 -225141 420517 -11 151473 -272284
11602 -30259 -273485 166435 -33766 -104910 119385 -15606 135442 -132016 -73975 142746
11591 90657 86013 475215 128210 -144926 -203499 -41544 446160 146800 163434 394908 -90377
11579 86714 149393 133539 82527 177387 205338 328027 -18950 -28895 -238640 78033 248903
11568 248903 -115836 -268636 89939 124633 44660 112024 33711 -382196 13683 -38193 128787
11556 220900 39386 114190 -146440 71529 61136 -33283 -50286 256822 -18138 10648 -8477
11544 33274 267559 -38376 2672 165983 -103706 -104979 5932 -139161 -70499 20783 -22772
11532 197373 174914 -42271 239321 -221797 28598 -91371 230409 -31029 41002 254790 48376
11520 263219 -33559 -140525 196238 240522 104185 -230914 38283 -54411 -206963 71281
11509 158119 59887 102450 -74965 -92174 160607 133698 -173308 241783 -234364 -11565 203594
11497 184968 175603 -203037 414840 130444 74751 -16646 5094 66107 253991 -14283 23628
11485 162934 31288 -48040 -215440 166492 -51754 -414653 -32058 86414 65914 2973 -359411
11473 -190517 168792 285024 116593 -119542 397453 79380 268297 83747 148152 124597
11463 124597 -156781 287582 193382 198262 24771 456203 92425 322148 323715 424257 315202
11452 315202 5104 -42324 26382 174903 233911 36412 -120605 -109908 43207 -66094 329987
11440 274157 256756 -142990 224693 -1286 76487 333790 -149462 -2839 58219 231966 198958
11429 198958 -17010 -98696 11553 34379 -157601 247856 202583 185767 121701 -52517 134430
11417 8289 -399960 319881 -197767 65014 -153746 167771 67766 124557 -122637 152636
11406 317345 513463 116630 84096 217978 70303 128422 -82517 63623 231147 46072 -109563
11394 -84940 269624 75445 297070 -110355 124929 -179032 60306 -79287 81931 -33148 -201524
11383 -201524 111141 -126645 -91458 -46730 -25120 -200953 432747 175687 -21410 148246
11372 209118 -127018 -249705 -24029 129537 -249292 -212388 168984 -30224 -18868 -32737
11362 -32737 -129274 223011 -4616 225614 187635 -100049 -284398 142386 200830 -139774 142779
11350 -199293 130173 233888 -139648 -226342 14719 -20642 74278 -342590 36623 8454 89714
11339 89714 374978 35650 82296 -79216 198781 298442 -212621 -37648 -103362 -198840 -381470
11328 -381470 50407 -117220 -181970 -274986 -102259 205329 -399319 -248674 -19408 -224406
11318 -224406 -86487 125888 -138981 -98181 -180644 -22353 101844 -149349 115436 62957
11308 62957 168595 -134362 30564 72221 -368059 -38712 54774 65025 -116421 101703 -132570
11296 -91461 -220447 -244478 -194799 280262 -71441 15377 -9979 -398256 -117632 170285 182286
11285 182286 -146470 -325397 194571 107409 -4924 -198739 -84158 -42073 -304464 45934 22616
11273 100731 -43192 64584 -61393 -5713 239056 -188532 -234354 -204786 -195401 -124147 89791
11261 102051 11783 -8718 -159360 50067 50081 -316998 66876 280794 -404393 17249 -57436
11249 -283965 -132118 116533 275272 96518 -51578 -68526 -95988 -469686 -206239 -323770
11239 -323770 95762 -306898 -64666 207097 -189159 -226869 -20311 95424 -38535 203912 23838
11227 55608 -61634 -280125 146400 115405 36646 -9394 -244953 46601 -316158 -219043 -126773
11216 -126773 -409193 -336551 -13222 32354 -112360 -67251 -157013 332858 104493 -26053 -293243
11205 -293243 -173573 66427 -151011 -65648 -9437 -81285 791 -148219 38451 -199713 211791
11193 26503 198959 -128747 446668 -116988 141918 182568 -55832 -144257 22979 -127065
11182 -69069 -486299 -72362 -218205 343016 -256398 16649 -200324 -221817 -32361 -66040 -64717
11171 -64717 141468 -101871 236162 -204045 146560 -201460 -349272 -140053 172729 -208613
11160 8048 -66963 -208382 -262272 188545 140332 133829 -16901 91969 -298182 -140563 -110584
11149 -110584 -140349 -247441 -1805 257959 18775 146305 171571 -58030 89979 258752 195763
11138 195763 -270816 232202 121210 2313 89085 12111 -16433 -142546 -20041 -206020 -107944
11127 -107944 76404 251453 -191654 -223114 -286905 39837 164874 219567 43509 291918 -17157
11115 194823 20850 81665 176701 78296 -58278 -102914 238675 -58425 114976 -126024 -19722
11103 -20600 163902 30444 50964 -78752 182523 51966 92944 95849 239112 511313 58020
11091 -28178 174886 188121 324554 258304 214732 -219955 277482 152504 110637 202730 265826
11080 265826 114444 167892 444055 389871 243412 -59899 -6506 317431 61371 354587 283644
11069 283644 91217 173455 307925 333660 410825 349861 169006 520560 329410 229582 -63645
11057 370656 174231 319241 716694 -32838 30648 538919 246291 324991 433219 186010
11046 596607 239158 537375 351658 566468 708080 532455 683225 512868 875620 805273
11036 805273 658257 872038 552723 559187 939000 820733 706758 619150 579255 715222
11026 715222 1015214 504833 437641 866207 367225 885945 648090 721407 518638 371933
11016 371933 719284 602387 654729 1122025 432449 481458 585167 570833 691267 550162
11006 550162 391120 562119 832721 556747 645347 553683 990524 285798 638407 682165
10996 682165 931104 184367 385922 785109 471865 476175 490915 415087 679002 877459
10986 877459 354726 661382 852122 380289 937348 726602 536879 641420 583517 954570
10976 954570 462076 826727 783886 724031 920412 825045 862591 1113071 869040 990978
10966 990978 1041428 1147895 1680130 1457268 1820881 1743741 2303374 2184667 2639957 2467117
10956 2467117 2328819 2992530 2419668 2387219 1952164 1861533 1573843 1699723 1906161 1418250
10946 1418250 1578410 1292910 1234364 914426 1379019 1439672 1570308 1086763 1366370 1110112
10936 1110112 1022639 722061 646532 589952 525658 218842 400551 -49649 192048 321341
10926 321341 197027 544991 196386 104831 268475 291266 366339 200482 355070 222728
10916 222728 -11974 11035 158601 -192630 -107879 139411 -327017 -76891 291527 71618
10905 182083 -102452 -436704 -128656 -100512 -98304 78984 -109349 -88756 -38741 -149359 172114
10893 236434 157957 232123 97779 -38942 115988 -252611 102408 144761 66534 73340 -57658
10881 3544 -191114 -229452 -225453 238630 -148875 82750 -156755 213433 -367644 -63793 -168350
10870 -168350 -132650 138418 -486051 -127216 -27471 10104 224858 -162501 -358237 19866
10859 -212054 -443610 -111336 -269819 74335 -114642 169463 166855 23665 99199 -379103
10848 65796 30306 -54058 462432 -233438 -30595 -75104 152127 48419 -383318 240231 -210822
10836 308661 -403450 238080 -30168 -132774 -213997 -119221 -375121 -566765 84859 -148481
10825 -135659 225817 -34871 103735 11538 -32155 171669 -138065 366323 -289930 -354350
10815 -354350 46017 -118774 49581 -131856 -5761 258083 -48992 246131 143853 -170636
10804 -170450 62011 31943 -200399 -112089 -225539 100932 148568 159374 -276607 -210473 -161786
10793 -161786 39320 -173887 -108961 143748 -118704 -40077 44522 -66188 94536 -13203 58041
10781 -404228 -252473 25199 120281 -129524 109109 -98267 -41602 -10611 603136 -229098
10770 -161593 116863 258116 -64389 -61890 92360 -39509 -277623 21450 -333797 -36084 -181372
10759 -181372 -35584 -218149 81858 155873 24688 -192585 -176856 -11912 -23025 -201481 287943
10747 -57059 51796 192532 256582 107679 133099 19835 -181063 -110497 17753 -41137 -571977
10736 -571977 254870 165910 26891 -315645 -301096 -263386 9548 -193484 -14018 190849 35983
10724 -134637 -145481 101928 -173503 -140923 -108132 4340 -7109 237881 118791 -59010 -106528
10713 -106528 36435 -73990 -323399 225855 -34574 -210815 243822 98809 -271581 102497
10702 51826 128789 -86638 -454470 -70229 -272954 26125 60873 39619 -53915 -1448 -128356
10691 -128356 -122872 -5434 160232 -32839 128561 74584 -103110 -195582 -90451 25706 -140571
10679 -167011 -222569 -340164 -262822 -104946 -256274 -15375 -169645 -279807 303563 74348
10668 51749 8005 -449134 -93763 -317064 -90266 -151137 -169873 -10679 68991 -66998 -40174
10657 -40174 -1427 -53777 -160311 -160769 -58327 -54679 175063 -63684 183070 86920 815 -23798
10644 -194932 -274790 101394 -433770 -420325 -155741 238558 217472 109590 -16121 160322
10633 150784 18085 -164833 -302837 56398 98816 -299187 40581 -261019 307049 -114663
10622 -102035 -60096 61304 45235 -45120 123471 89928 114158 217576 108709 -226053 -249430
10611 -249430 -333226 -185366 -18194 -308578 92775 -3318 69066 372984 -104045 -21249 61675
10599 -233453 -173248 -200410 -95686 -12947 -97810 -159867 -83164 -141052 113924 -135085 68067
10587 35945 -42220 -83400 25494 -233078 27428 120669 41837 328356 -12846 34640 144548
10576 144548 -126950 82240 231705 25119 -332539 90286 -138456 -71840 -4000 -344899 -263296
10565 -263296 -203855 302804 137734 -60256 -120547 -49656 -113676 -65861 24212 -146441 -21022
10553 103556 -228205 17957 189090 -258640 3952 -477953 82635 -133213 -84057 -22033 -76380
10542 -76380 57205 -291466 75413 36639 -363586 -124113 -191127 -317561 -268060 473540 26075
10530 93438 210109 98565 -237285 -267323 -41023 -294633 147273 -251345 -385588 43126
10519 -53509 19595 -294460 -398684 264834 -293998 -214079 -181373 -112363 -89442 55967 -44973
10507 -314883 105950 182708 -49407 229033 -219905 -9271 191415 57 -170040 207938 -14800
10495 -137092 -71419 -74654 -74953 -11315 -165989 -60902 -174015 39116 98000 -8477 100218 148698
10483 148698 40064 -310953 12514 -199091 -13665 141440 30325 28137 -78017 65532 -25723
10471 48765 249819 188294 239014 172048 278165 437153 281262 188781 115211 -267541 99528
10459 189468 -85175 69203 -7057 604 121298 -55890 45626 -99754 230837 12568 118537
10448 118537 339704 158507 -299813 333259 282898 -8898 28418 -62832 10427 -39335 -58251
10437 -58251 -23357 -172088 -75487 -162450 -67140 -213300 -385048 -56577 576 -58651 71199
10425 148527 -257311 199762 -128330 -82832 -207603 56132 -205538 -210473 123557 59403
10414 281529 -435451 -241039 -208212 74403 -215558 -92282 -516437 15199 46758 60261 211265
10403 211265 74634 -278696 143129 116417 331069 68724 198290 29558 -9981 -142655 -257329
10392 -257329 492014 154567 70339 -155743 120389 -100641 102980 307446 -77503 -139902
10382 -139902 10107 -157965 64235 47328 332124 143686 252194 -5626 54840 286360 30517
10370 8414 -81939 19260 73855 218956 39130 308444 -3413 443754 145434 205028 336069
10359 336069 49131 258716 174741 174070 185868 332917 378727 2819 300804 350594 35863
10347 481721 389051 432022 278564 198138 151461 339177 42032 -52702 218210 364288 367641
10336 367641 -126748 419721 255724 259913 579189 96531 200365 160670 138019 314293
10326 314293 46239 48421 65923 355233 397174 203592 298840 193786 387505 194225 -182407
10314 294246 -65293 249388 -84770 208369 354792 104626 131061 -34717 277047 130933
10303 50668 153778 85084 11447 6736 537125 102839 -472480 -19585 -303519 -160295 -87322
10292 -87322 -356345 -96513 -53081 49846 155072 59550 -251850 306005 112648 10837 -122374
10280 11239 42596 -131148 -205440 -39625 5006 -216414 137853 -10441 188302 94278 -47793
10268 331467 -209206 -72030 -167392 -391262 49001 416867 274474 -173893 -90748 35237
10257 -135848 -210628 -199414 -23181 36075 -23647 -105849 -241342 -159940 25348 60744 199482
10246 199482 146441 85618 88287 156318 346231 235557 -147446 -101856 -228081 36528 255003
10235 255003 32403 -297601 221665 -15037 -262707 -17076 -39106 106266 85090 -179945
10224 -149801 -314 -216640 -130880 -160311 -88288 -192810 -40830 105196 80070 -5102 -103530
10213 -103530 202232 -130892 63884 -58721 148995 -272305 39150 -239863 55398 -109192
10202 379784 92003 175112 116114 -128217 -50963 -92950 102356 -102051 -85489 -136338 -115520
10191 -115520 -204051 126415 -54109 178587 -341113 16441 -104211 89458 -160460 -139950
10181 -139950 -36096 -363044 86119 -135852 -31509 237959 163230 208863 -140959 -32454 42528
10169 82694 -195649 -224846 19314 -150160 -111379 213778 -278022 -7333 -188810 -70048 -210123
10158 -210123 32660 -25293 140636 208351 -87101 -20492 -16626 -256759 99690 -168021 -209381
10147 -209381 -139150 -10025 -239122 -244152 146072 -413803 -7767 -78468 118099 -374085 -118451
10135 68522 -92130 -109869 -489631 79447 -42726 45906 22874 -20065 21113 -277865 2622
10123 -11717 -46937 109525 148243 -88634 -146886 210075 -68813 -76007 216362 88406 120894
10112 120894 -189799 188705 -170384 -232158 100713 -140893 17289 193743 -134310 283125
10101 29115 -241891 -300298 -77360 46909 11496 127380 -148527 -293033 -22312 169266 5363
10089 89120 216884 -140790 -195514 -27452 -306092 -334324 62379 -193735 -125063 -176714 -131477
10078 -131477 -256261 212903 -230191 186195 -30818 -5327 -34340 76634 236165 146454 271607
10067 271607 -204715 125821 -59409 43311 -422478 56987 -354100 -89286 -98966 -210153 -123188
10056 -123188 -108381 -291757 -113888 -118812 -366829 301914 85981 -119692 -111933 61173 409398
10045 409398 36670 95605 -127061 -71470 414450 -283896 89691 253730 -134148 -7052 -72639
10034 -72639 -296233 -260003 261450 157091 114009 384198 -1305 -308207 39451 -112047 -86246
10023 -86246 -129715 -142206 -341874 -243012 -37674 108496 105406 162283 -122379 -469754 31206
10011 -227571 -39041 50910 39812 93848 -101320 32420 -327874 218996 -154807 -209622 -298049
10000 -298049 -205609 143748 -117423 -87366 -102712 52036 -90301 -176237 154174 -192724 -19119
9988 69742 -503561 7259 -4792 -51085 -236345 -239267 68341 -270197 76364 1156 -32466 129298
9975 -175530 -411000 35790 -53341 -71127 -129099 72336 -37231 -201511 38433 144770 142956
9964 142956 125351 -240896 -225801 207627 -228222 31981 -83650 -22215 -36661 57778 -124328
9952 94394 -68585 -428847 -167374 -187642 -71506 -251310 -12518 -20239 -144656 -138086 -828 -125865
9940 -125865 -102768 -125707 -39826 -207742 -2975 89884 369479 356828 -75086 383751 120106
9928 -58651 -139792 -38686 157082 -198079 51745 -107533 -50381 -100916 77538 47894 -32937
9916 -79008 169155 52245 -55086 290425 190863 -365998 -251003 -174965 -404796 279885 -224308
9904 -78374 -178083 -7903 -30344 -118313 -125173 -30090 -476401 188459 43752 -138676 -88294 -201295
9892 -201295 -117646 -58544 37122 -175371 12391 -196010 -184770 -22155 -363218 -24818 -168296
9881 -168296 -52229 182304 -20030 1118 -91032 123 18265 -68534 -101397 -140155 63718 91996
9869 91996 153834 -365416 -156892 -188353 -148053 -183998 -175415 -57389 124556 -12869 -134277
9858 -134277 -104613 62868 91211 74871 230657 38392 -453667 -471427 116898 27002 -86071
9846 -56666 -150159 -165221 -93148 105225 -73938 -282540 220705 -307201 -162821 -41756 -131524
9835 -131524 166976 -143599 249747 37252 10905 -114978 -269155 -65820 -14873 -204870
9825 -204870 291152 9467 34980 -11113 -147689 -34502 -64903 96318 -250145 -488331 -63317
9813 84898 -90391 110369 -228260 276292 43337 -296261 -131226 112709 -113028 -12233
9802 -338424 -475919 -535126 -33829 -236388 -203693 76643 179871 -183273 -58459 -312027 113856
9790 -366024 -333730 -129743 45016 -98392 -201363 63645 -116133 185078 -18979 15730 171684
9779 171684 125338 -128227 38275 526403 95103 -337136 -33738 -40567 1674 -348561 56871
9767 -155606 261072 381732 163824 -1732 -37684 -124530 -100573 -40154 -83712 -5076 -3529 -222993
9755 -222993 187562 -311420 209578 33517 150500 46818 17589 58303 -196101 42075 -14532
9743 175195 -66328 -173429 17992 -199311 -118264 35508 24144 -267415 -89254 -111351 93483
9731 -41190 -423237 -252192 4815 138161 43006 23206 -29503 -217250 -155040 -223666 51820
9719 108802 -164283 -138332 -165456 17441 -179126 317459 50951 211041 22234 -240699 -290467
9708 -290467 -164500 -108484 138075 -124138 -7326 -22849 -17409 82977 -255607 -80123 -105700
9697 -105700 -438322 -400466 -135801 -106241 -37902 -45466 -41340 141977 -170846 -370210 149390
9685 -120682 89775 -21614 -21012 134580 149178 -111708 201089 74669 -293936 -74092 -78902
9674 -78902 -196152 98574 80745 -189448 -71602 -187500 -71885 -67675 -15842 -178400 270424
9662 -73622 -18768 -177399 -357006 -189288 -42073 -88769 -234508 -178306 51687 163898 147968
9651 147968 -45387 -183442 -384438 -42670 -52999 206054 -140639 -277485 -370931 -143373
9640 -145023 -432449 -59314 -198141 -211599 188621 -314892 232708 388528 36182 40957 44148
9629 44148 -106465 183987 157116 -316045 -257443 145657 194268 -354612 2882 -220486 423444
9617 -63551 -185243 93515 -57529 342576 -79695 -19697 -31761 12340 -75676 83059 -283311
9605 101379 -107783 -39946 -44817 -274398 -24814 -31761 -350453 38550 -115366 -145632 -317866
9594 -317866 -153212 -359260 -249461 8519 -162530 -73105 47646 -188447 -30696 -5401 -527237
9583 -527237 146723 -213948 -283180 -215109 -138969 -89035 -248940 -197020 240855 -78676 197480
9571 -107015 68832 -210791 -157027 -99275 155989 93043 -203841 -301039 245433 -12229 -53260
9560 -53260 -376911 -113628 62919 102583 -185362 -103786 70519 -138008 -89108 145310 -89643
9548 -73452 33854 -332287 82998 1704 40271 -77484 61360 20410 61741 -211247 -306696 -348299
9536 -348299 -287761 -51904 -24298 -150803 -112904 -174697 -130414 -30729 -148090 -89258 15436
9524 -40838 -229168 -128111 -94648 18357 -188008 146371 261447 -181082 -52349 -163578
9514 -163578 -101646 -170738 -184218 -192929 121157 -50788 -125094 95286 -219004 119801 85919
9503 85919 -93981 -103816 -357359 -29825 -135304 38678 -210552 214531 191739 -327518 -332303
9492 -332303 184279 -114321 190430 -44110 -11875 -161844 129155 -140871 -161799 -153968 55280
9480 -137271 759 155466 -83012 199304 41190 177170 -69445 -132464 -39287 108213 92039
9469 92039 -79738 -61812 -16511 14031 116703 285748 -206282 -38084 32154 -75761 -172688
9458 -172688 -96382 145072 64669 -6458 411058 -100998 -62387 111239 -106610 -176724 -37667
9446 4069 -149584 83941 -34769 -89668 -378171 41014 -259961 95329 -60335 -294376 160860
9434 -262618 -39521 762 -241817 -293948 71637 -3739 -25467 137574 93688 6757 144975 -93250
9421 106880 32104 -3879 -109343 -617449 85017 -56254 297112 -137560 168161 -80847 95792
9409 -173787 335603 138549 177598 -262594 284719 -233526 227211 -267325 -28789 -156527
9399 -156527 -131654 130017 -302197 -153289 -130490 -139925 -388093 416662 -107308 -468411
9389 -468411 -455403 -14544 -75420 -135259 21298 -13219 -114619 -201751 65688 -241639 -88893
9377 282587 25001 64039 33085 -37167 153082 102518 -87603 -130526 -237110 202343 -42345
9365 -175404 -127249 -149667 -25344 -33830 79439 17164 193096 -72841 3357 222444 -347454
9353 -103840 -185433 -430687 99018 327797 268101 748 75238 228564 104196 -163451 -523963
9342 -523963 -204754 -18343 -206229 29848 169901 98482 -158945 -253805 -165060 -99997 -246886
9331 -246886 11802 -193981 -54786 -267669 64329 1647 -167169 213418 250125 22804 -28453
9319 176287 147752 -37376 -89559 -182640 -11864 -307052 -43850 -84935 -55819 -135511 10198
9307 -205057 -59806 -257550 -69715 -281241 228589 -93588 -278095 -268681 -479934 2951 -32365
9295 -97530 108129 29768 125155 5191 -177409 122046 -216830 8112 136947 -227854 -7904
9283 289666 -53435 -17778 20120 -273594 -389112 -12900 -50626 -18716 277669 -367481 -328280
9272 -328280 42838 -80111 34922 -44621 -64520 232971 7261 -51260 3007 -176431 -57252 -143719
9260 -143719 -372892 -89211 -462416 59902 148309 -260889 337686 8057 -54758 -27106 254721
9248 -61739 -19195 -194170 -323703 185286 -623120 67529 -198915 106936 241722 277723
9238 277723 67306 12476 -216966 -162893 -49294 -397750 -163238 3019 -122925 -367343 -44732
9226 36197 -68584 -69330 56962 53752 62867 -134811 -162975 -172894 102757 373401 -58534 -202841
9214 -202841 168237 -68263 -166174 98252 -15138 84888 194238 -59002 -85045 -66155 -55417
9203 -55417 77431 -290933 -83704 219132 64930 121319 -82775 227922 -10689 -440241 -196433
9191 -148858 4952 211984 85786 29186 11788 -5111 -91142 24726 35223 -201769 -74886 -285995
9179 -285995 152707 -155140 -201525 537639 60194 171525 153060 -67937 12388 -207593 -32545
9167 42201 -259841 -254919 30504 -428131 66709 -212629 57439 -17076 234743 -375774 85668
9155 -21506 -161772 -352068 46136 -117707 60552 -264829 9059 -48699 -372458 4502 -45622
9143 -104932 -81165 -14230 240407 220908 -260003 -258906 34084 109224 29711 -14036 78604
9131 -136765 6764 -161589 -281964 -133983 -230927 6027 -362803 -127758 -7470 -10584 95162
9119 24784 94375 -218506 -311181 125910 -93395 403292 -139088 -320154 -167339 249094
9108 -55988 -114332 -114732 215620 359980 -483139 -141034 -156095 -335197 -310531 -401799 -118716
9096 -121255 -119805 46125 109696 -63009 -57130 156068 -38698 236014 -36331 -169248 -37926
9084 -47195 -42640 -152864 76137 -188637 -262805 -165515 229801 -33363 -335193 44586 -125383
9072 163348 7886 -44771 -64544 -92136 136318 -219788 -206883 5723 -28702 -87400 -91142 224813
9059 68645 -299623 -74948 -126783 -27660 6956 201620 -109106 18385 -28287 -247947 -97616
9047 -86895 -16261 89999 -251675 -37727 -73093 101086 158735 42437 -110427 33459 -12178
9035 129916 -105135 -195497 -46892 -90453 -12403 -155564 -183942 -182718 -177729 -108312 91896 -164928
9022 -57435 -98190 -51903 32671 -105455 78496 167156 -625472 -566655 -128656 69777 -61615
9010 24320 -182110 237503 103965 -18888 -89280 -97002 7551 4458 -265769 -309401 -173614
8999 -173614 -216590 -30030 -171146 -92080 142574 -94293 -180258 60702 125915 223133 234414
8988 234414 -280080 163080 207396 -96378 -205372 -14966 -247947 26034 207906 288796 53021
8976 83922 -68283 -148063 58902 -34457 -36829 10705 142170 -54187 12057 -86707 203790 -280856
8963 105011 -233321 69953 -299049 134170 -24365 28328 46693 127406 242941 -40499 13821
8951 342524 -13620 1429 -46666 -240066 -358311 -90429 -76237 -196153 431506 -218985 119138
8939 285830 242448 -246837 67974 -299485 19001 -92046 -257952 -121406 -288969 80269 -181530
8927 -83141 109220 42951 74653 -30008 213562 -71519 -509050 -273556 81617 -85688 12474
8915 63021 75844 193797 -117086 300245 22993 -252798 144328 436702 656790 2366423
8905 2366423 1167346 323326 343894 245326 147994 201643 467423 179289 -66400 237096
8894 -103293 400268 -101756 -63574 57435 -162267 -61044 -141797 -264927 -319260 -150551 -180128
8883 -180128 -187348 -171791 22996 133216 -43511 -160198 -61014 120068 427838 74349 -238622
8871 -241626 -240000 -95009 131024 -229208 104902 -3523 -324271 -130903 -58789 -85059 -38653
8859 -60493 44827 119118 -344152 -31392 -322994 4997 -20500 -396171 -114453 -189734 120622
8847 272845 148433 -121125 -45170 89794 25421 230179 -114970 -132123 17452 -65330 -1731
8835 -104877 -37438 -336798 124878 -162335 -113207 271363 -213688 -153496 -58380 -47279 -26796
8824 -26796 -215001 39656 -86300 -216344 -187095 -193188 -289799 -55777 -8838 -16924 -350796 5338
8811 62415 44809 -159744 -154079 -71780 -379879 -55996 -101246 -4934 -143427 150714 -88084
8799 -14305 -284739 -114539 -415414 308010 255500 47317 -107302 289085 309050 143371
8788 -38630 -110752 -2879 -91498 52607 226119 -120566 -42912 -157024 -153979 59046 -34170 -173708
8776 -173708 77058 -114032 73778 246527 -179856 -51511 -58710 49710 -16221 22398 -98885
8764 135574 -118742 -328547 -8897 15162 -103029 10720 -51005 8011 -2851 108851 203142
8753 203142 -303957 -91023 138281 170273 -67646 -92894 25660 -187785 -367770 -403464 -248281
8742 -248281 71277 166798 -152091 -264917 54972 -84481 165163 31573 123735 -10741 -43812
8731 -43812 -77118 -156657 197985 -63588 195118 -85154 -97145 33983 -64629 -12876 -148659
8720 -148659 23942 -16224 -192442 -139929 265365 -252337 -184112 -180502 -53569 -47526 16936
8708 324674 36491 -37107 -221455 -83115 -211078 41625 -333391 69732 107234 -264374 -258769
8697 -258769 30479 62285 -266010 -352854 -30707 -180651 85164 -301511 137446 -39931 55319
8685 22331 236684 -90628 -296286 282199 257175 97175 240969 -255784 -437661 -372737 153021
8673 -156880 16779 -116190 19785 119807 -336768 239959 -142833 149327 26830 -10328
8662 106117 -179255 -106628 11182 -111280 71283 146352 -182151 -34932 -444213 -224617 -554253
8651 -554253 -183199 -11981 -341655 -185880 135106 34009 -126400 -149412 161077 -273228
8640 -200530 -326836 261589 -210426 228200 163402 320287 251665 52716 211349 -32892
8629 253552 -256368 17648 -422020 -102062 128 -120194 -21567 15699 -157064 250073 -384719
8617 -90765 254389 206331 76197 153557 184235 -33839 -107849 282951 -307281 -64653 -568778
8606 -568778 -51592 -83545 -31915 79303 -235156 -211125 305893 157711 -287836 -239719 125699
8594 78919 51465 -200330 -142618 138846 -90105 159840 38074 -111122 68378 -309791 -184230
8583 -184230 -5877 -214426 74757 -30776 88810 -93080 123492 -31890 -190338 -110144 -110121 -289809
8571 -289809 -32696 -177897 20111 -165904 -285008 -53314 38872 45339 -76032 -66520 154475
8559 -324392 -255900 -481333 -128273 -69210 -54786 216220 -233970 34627 -152250 92112 -434370
8547 -27292 79916 221284 -201065 -65922 -469521 108303 183997 -134356 -109527 58297 -1553
8535 -31116 153804 28635 -121893 -60158 151257 272474 -147755 115940 -52494 101871
8524 245367 39674 -31918 -193585 -203001 9684 -261905 -78692 -167182 -312737 -256332 -113503
8512 -306179 -275067 94170 228293 -281613 100144 -144202 188622 -404652 8716 -233851
8501 -56385 -276357 -268529 82982 98068 -4759 120950 8183 -152128 39578 -17615 -251747 82916
8488 -21162 -86825 122978 148191 -50304 156659 -80647 -139307 -184246 78432 -793 18281 8361
8475 101970 -71562 37106 39712 194599 45296 -91622 105230 46392 240606 -192920 46912
8463 114609 9928 142039 90008 -34839 -28563 11788 111612 90932 -242359 -272721 -137435
8452 -137435 -362901 -88558 -144358 -171457 -84806 -149912 52064 -127357 103718 -9466 101674
8440 -345947 -175498 -332675 -241412 -152277 100883 -137799 -143471 143510 -194918 98901 -192096
8428 -349525 -84614 92599 -262380 -151235 113180 -22697 -196382 179546 -263260 -69997
8417 -131362 -184964 56083 35713 197869 -321107 294629 -107972 -48216 95856 98616 -247051
8405 -41117 -78959 -96886 -65294 270776 -184167 -348427 161269 -193452 -256391 -24227 42823
8393 -36347 -115740 -171850 286743 33482 347209 -27341 -46627 -102094 -183940 97886 -106406
8381 -212320 269002 -32091 153168 125718 417072 -109885 88483 305353 -281729 156367
8370 -60778 6701 -222385 -187184 -82966 40333 91631 -13816 -26338 249716 -97481 41816 104073
8358 104073 -27413 -72128 66507 218105 -74701 -93222 47831 -41731 -63295 119404 -26464
8346 -71872 -150277 178340 -207905 -15981 -301667 -74960 105789 -281254 54256 -152711 218627
8334 -155649 152763 -193924 -71216 -48435 122869 299585 -22749 -165225 -209567 31920 -23108
8322 57438 -82537 -130390 -252929 13936 -303295 189625 1949 -674 -12846 -18972 117290 -141334
8309 -276296 -112184 41353 63424 -99584 -58523 220301 -141338 -44896 -487234 -399623 -41999
8297 143678 186115 150844 -206896 -406602 29491 -12294 71824 33845 -474786 -75169 230836
8285 -18838 296854 -76853 146589 -76782 340208 -57016 -52643 -20746 42009 57136 74503
8274 74503 -87034 -166481 -417031 -67336 -111984 57518 -179713 -4703 -259084 -40536 35570
8262 55624 -312213 -145097 42575 -236693 112040 16383 48125 -21551 -11135 -158650 -24756
8250 208520 -55393 105893 -243304 15206 100685 147635 189147 37968 -194359 -3224 -170768
8239 -170768 70741 196455 -43284 -87435 -257738 230408 20935 -52565 -11680 23363 -44563
8227 -482017 279363 110440 6726 -421519 6698 97424 -11146 -288094 -156902 -122040 7449
8215 110104 4954 46583 94660 123638 -42066 127545 95858 -13271 -37752 250528 -120778
8203 -256382 -145901 94689 -96164 -341212 176909 -332361 -65311 -104739 -102140 -205174 3997
8191 -140860 22070 -274458 -83292 -6745 -44823 -42693 44741 -31249 241938 -157560 -37441
8179 -168978 96968 75527 128017 119226 68049 32300 -197648 -326771 87952 -206878 -5422
8167 18959 197569 -273257 -36337 108378 -96226 -225626 -239560 -71308 52749 87030 -84594
8155 171999 -84222 -7145 -38699 -19026 -63698 26484 -130100 -126129 -202203 -216016 230841 -113603
8142 1976 -52392 -146420 -49077 -69995 -120439 48458 -65011 -3980 -155146 -54600 188107 -182476
8129 -6417 225082 -341291 13993 -114464 18748 -58777 -76415 -150534 17914 171611 -179582
8117 5009 248169 -29052 -15469 20361 -158305 -399268 -66210 178880 -27013 -51989 -71061
8106 -71061 -269471 -423269 52885 -72374 -357998 88755 -183432 12167 133334 -7624 -97837
8095 -97837 146113 -84494 5136 -43206 -81448 168630 -140387 13556 147551 7343 -23321
8083 6815 -56517 134732 293705 -72726 36224 127446 -182208 114320 -91808 -335135 -218108
8072 -218108 -84262 68646 -145533 -35429 31464 -163045 -108578 75801 178629 100461 16607
8060 -180676 -204497 -1640 -93045 -18043 -123046 215955 108699 -176653 -7926 307861 9307
8048 163368 -85632 50183 22316 -209139 230563 -164216 -50375 111523 -176788 -25098 4100
8036 -67406 -224064 126203 -74497 324997 -136242 -31772 140230 168652 94832 -117844 -88594
8025 -88594 -127909 40728 161802 23051 -30621 -63516 -246388 57095 -22226 -42493 271949
8013 -290536 -81481 -18482 -56878 -169291 -325704 134449 102154 -100164 -134045 -228689 -265868
8002 -265868 110180 -162621 133155 38429 -19581 -79549 -24173 163966 339040 -151176
7991 -21764 -159013 -64145 371283 82973 -395376 -138782 -266930 118931 74276 -341653
7980 41235 -24763 -202017 -355798 -53461 129657 -93099 89532 -139894 65874 -107896 -148144
7969 -148144 -97481 58077 84497 173442 106722 168378 -27418 -36429 22362 -126869 59752 288334
7957 288334 261092 119768 -79311 -102669 -249524 94022 112022 -244260 17744 42985 121959
7946 121959 -186794 -10574 -128243 -308988 -106720 -191583 -225736 -150565 373910 232514
7936 232514 -173076 -190865 42204 254445 228063 -211399 -73470 -139687 95642 308625 -14396
7924 83106 -96461 -190990 -28741 42665 -146197 -75415 178903 215441 -140283 -11142 -14366
7913 -14366 -74616 243004 63188 494874 -187722 -179850 21378 222587 -8217 -14929 31410 268692
7901 268692 10773 -253271 -559665 -159556 106438 -306098 -39448 -196953 204512 -356998
7890 71039 -106121 -185206 -338950 -237993 201340 72903 -20413 69140 -99562 -162462 -247520
7879 -247520 26463 -15633 -99324 -244561 47734 111421 -40644 -72598 4604 -8767 -397870 -78604
7866 311823 -217874 1421 -67867 -7606 -27468 341684 21489 61566 129166 26750 50324 -20515
7853 -69516 7243 -127351 -37264 -101998 -255171 -59857 54050 -26342 -65236 117093 -116570
7841 -436821 -182336 -6442 66946 142607 -8274 -191682 -230264 -245015 -187180 182831 -175155
7829 19333 71271 -36491 -130927 -42128 100554 200648 36950 195320 -127671 -55205 -86382
7818 -86382 -119387 -103217 -25974 -223229 -74128 33350 -109537 -168812 191045 414775 37397
7806 -120386 -388297 137989 -309938 -148790 -305057 -242973 417108 -59564 -49068 -288924
7796 -288924 28369 -3845 -152110 -134041 -53661 -59086 -268195 -264558 -7927 45073 -238483 -416890
7784 -416890 -236494 3359 -16445 -126142 161616 -9396 -17830 -236212 -219839 100436 141827
7773 141827 -272776 299442 -257496 -91133 -235667 -279766 18754 -113143 55509 -112186
7762 -169146 -39465 -67810 38236 -157057 -62822 434042 -189807 75433 223473 -129569 -132996
7751 -132996 -110282 192055 23993 -96395 -201673 -275194 -17730 140023 -23286 -119417 -244391
7740 -244391 -200900 -219739 -96279 120394 38448 -133711 6212 20475 221852 -249167 -160498
7729 -160498 -752 -27841 138501 116137 -171565 -160425 133180 89754 -171577 -200337 -282515
7718 -282515 126976 85554 66159 -308719 148784 -69047 10987 -93677 58717 159496 -35091
7706 -80006 -27260 40457 80011 163656 257168 -140890 28952 12740 36172 65760 -728 -179315
7694 -179315 -197352 -142141 32007 99344 -173704 -204068 -228473 -80957 63377 -413829 458119
7682 -413963 -65229 168104 -124891 -256028 50316 85024 -223462 -194361 -28943 -75970 -375119
7671 -375119 -161298 -372400 120639 47515 141415 126640 -19302 -309749 -232946 -175804 -60344
7659 421535 -109673 284276 -153287 -132674 82740 -196375 -257270 -126876 -64073 -301845
7649 -301845 -51909 -39401 106072 110727 -262660 269639 -241835 -120133 270319 138747
7639 138747 -27824 -177670 269114 -38603 408909 37345 -184533 -127033 -45464 -180273 261367
7627 -152404 -244670 16962 -269248 -54180 135025 70349 -2260 140978 120102 -65354 17711
7615 -44530 -266768 -31449 78147 -114686 -230136 -38088 -58286 -80178 -40134 -11651 -95897
7604 -95897 45153 31113 -363071 -113893 78645 139993 -75664 52259 85535 -100595 37173
7592 196039 -119957 -115557 -153198 -235806 -339077 -220111 -142428 -256855 59121 -42757 319196
7580 158566 137430 -60857 -10663 138564 -95268 48288 -71169 -114685 -238281 -51544 68488
7568 -107552 61624 139807 -363035 -146468 -21269 -128305 -140218 72850 9814 -180036 53033
7556 -103437 245999 40404 -101787 45014 -8097 149065 141028 153307 -175566 -87137 -466053
7545 -466053 -5556 56408 204898 -309601 93259 -199036 148292 256575 -250529 -459238
7535 -459238 -37178 -60242 -160 -154965 -232866 -22404 -147131 -95733 -222023 -393858 -249712
7524 -249712 309276 -112317 105703 -534945 -225046 313279 -36425 -299793 332828 -93569
7513 -271519 -221958 72005 -273951 17513 143009 -50517 -352235 -230210 -227550 -309526 -96290
7501 153824 -197859 6842 -71170 -96499 315802 2448 -188523 -91824 -29754 -188719 91906
7489 -185923 -100019 -20319 -57854 -23446 77817 11900 -92251 81867 -70374 51174 111526 -32795
7476 -92228 25991 -280362 -48455 192837 -56088 -286610 -119755 -181921 -327227 486 175442
7465 175442 41943 -47510 56156 -45879 14862 61865 48166 49578 215406 310525 66447 -252184
7452 -550504 -266791 -268007 -141867 -480000 -200163 -322988 -111839 205572 161225 -49485
7441 98417 -48586 -120002 162967 32941 -233465 69304 42704 -382585 -493 -434429 46808
7429 36576 -83106 2105 -30695 -138079 126318 -73109 -32100 -292405 316735 283944 142108
7418 142108 198400 -118450 57983 -345569 -238894 117735 24726 -334848 -248096 -105368
7407 31973 -192736 -295619 386984 -180319 -162073 219517 22825 185254 17391 -301612
7396 24429 17799 -81919 200633 132641 -204167 21539 9334 112852 229618 -38401 39735
7384 -124940 -68365 -222385 -219269 -89165 -305845 21145 -148404 137120 -135253 42712 -119010
7372 191241 -88532 -420192 -93410 -82705 -166421 100021 123190 -161471 -41005 96086 -230568
7360 60450 -182117 181515 -296342 205628 151486 2002 264061 67042 -300726 101347 -150183
7348 62615 19362 -398394 -392 117886 -279422 81172 69049 -112925 -161365 -145748 -64345
7336 -75543 2813 -99773 -52337 117704 -221314 8828 -147164 -43672 35889 234432 247942
7325 247942 10754 -113682 172410 11459 280284 329172 54928 -121485 333750 -50962 133765
7313 -247158 200890 -240681 -13303 126359 -61986 -213516 -79382 156952 -96556 -10969 -153644
7302 -153644 -81435 -14473 159154 -29627 -281791 309426 -101644 -70306 -117409 302374 -162125
7290 300517 -199091 -487989 -92662 40338 224335 143791 57830 -9026 -63024 -264144 345128
7278 -200989 -317239 -61954 118613 -323195 -60304 74776 -285325 179244 340045 -166878
7267 -420482 107380 -106178 -223328 163354 -66471 197363 -19147 -80664 112367 147312
7257 147312 -62710 -193887 -505716 -28401 56023 -343225 -65153 94738 -304066 -215516 39355
7245 5351 -453963 -141411 11475 -185087 -113390 112490 -134626 194491 -364341 5084 -172402
7233 -196167 19584 -150894 -71559 -18491 167408 -126938 -424128 -105059 -132196 -32011 -167403
7222 -167403 117604 247683 26242 -212727 44020 -14489 -87956 153738 214143 -253976 -185524
7211 -185524 -111693 67597 175397 299233 228226 -13006 -5885 -264959 -68672 5442 -44791
7199 208154 -319061 -70796 372645 -41184 127542 115992 -206642 -193024 -44014 107340 -97464
7187 -58516 -417309 26475 184038 29878 55029 -189049 227873 -216586 -147054 78210 144614
7176 144614 36275 286527 78527 -132064 -4465 294918 155226 43269 -107264 -28919 74957
7164 -65701 -229041 -14185 -105553 37925 75551 162359 -177887 -473878 160517 66360 -84208
7152 -197911 107515 -89418 32028 49221 -198200 14752 190693 -61828 56616 27177 6931
7140 149663 141828 374073 102518 198372 -19821 -41327 293963 134193 83045 -90161 -64481
7129 -64481 -232554 -364371 62364 -178866 -258679 29890 -64410 -232038 -160882 233464 -300333
7117 -101079 -238196 34250 152435 31247 -437303 166353 -60466 -100255 12771 383231 -184639
7105 -30504 -111882 187233 -358801 -157742 -33545 -30638 -176457 -171133 -74573 -106374 -190808
7094 -190808 -160777 -102770 -187067 -205669 -185 -115963 61709 127152 -49065 267462 119094
7082 -218922 375519 -48317 84403 132391 167951 -256792 -98349 10230 -293262 -57069 -117690
7071 -117690 -95134 -116653 -172894 -137684 149245 129783 -415991 -243765 -19703 -247912 -320132
7060 -320132 25813 -30777 279364 -210415 -37659 225802 -46365 61718 28251 -166999 10106
7048 285312 -99731 142531 -408062 -85428 -36905 -66674 -113447 158893 -113767 111410 -133786
7036 186873 5150 -257619 154719 -212060 -79047 258031 20152 -59050 130443 -245591 361330
7024 -64454 72295 -459040 167163 91358 -355720 201634 -173909 -67185 -391244 -271735
7014 -271735 46483 149944 -101766 7657 105052 16509 -158274 -89951 -205065 -124811 45695
7002 -257787 5515 42425 397989 -317575 -170680 -59697 -70217 -39920 -154817 -145816 -79998
6991 -79998 26302 -133759 104604 39212 33410 338694 109909 -127184 -278156 -83217 -368325
6980 -368325 14738 56185 69861 30659 -71972 175104 75139 -15468 67923 78867 213280
6969 213280 -100171 33790 129127 9328 -89442 -86023 -268072 -115239 -67280 10272 88274
6958 88274 -82056 -157257 182613 139847 75440 -26232 -83179 -172875 -238475 -147427 -105879 -57196
6946 -57196 230315 -117478 39722 36856 -20268 187240 -393497 -298536 20871 189520 275450
6935 275450 54608 94807 179120 127604 282321 -172925 5116 73230 13449 -288478 -83782
6923 68155 -89847 -33788 54735 -81453 -7136 60849 234822 -182186 204442 -62653 -80826
6912 -80826 7912 -162210 -133491 39097 -296039 -302801 -208443 167807 60211 -260806 -207570
6901 -207570 -20130 -258440 31130 55517 25143 -266601 -7827 -46953 100502 -220251 -6275
6889 -146830 86523 -291987 -235491 12261 342508 10670 115187 89697 -238034 216347 -380931
6877 108286 379573 152917 339348 34301 -16411 65540 -21528 189071 -151669 260988
6866 23701 -182061 -43388 113529 33279 -109190 -294539 73803 -33332 -108321 61588 57868
6855 57868 172394 85494 -45921 -84667 -172775 -254435 59422 81857 -8537 -96343 -440034 -202795
6842 -56123 138783 -168276 -207847 177009 74929 -123532 -73292 -68233 -6849 -121243 -80101
6831 -80101 113557 -307702 271630 239403 -24579 184192 226025 101315 57195 -89436 226037
6819 34072 -316002 274416 -100586 72820 -196571 353919 -110618 52133 231873 334592
6809 334592 131162 53131 -136665 141657 -59120 -193206 -314654 -222784 -71568 -215383
6799 -215383 18228 129052 -152459 -371125 28103 153901 -93119 -19541 97688 -367668 62371
6787 -70730 115439 -147155 -54906 -453894 259188 -1421 -220857 39369 -345626 -56765 -229806
6776 -229806 215212 46399 -176017 -50911 80864 -372595 -50849 -11716 -68062 68213 -54995
6764 206946 73813 165660 101580 -19224 26799 187585 189525 -294464 326408 -149632 -69082
6752 75351 441549 135511 -62208 65116 -77403 -176507 -126300 -18188 -84866 -242163 105268
6740 -48661 -358660 155264 3811 151682 309816 313109 78053 -254828 20487 352792 421195
6729 421195 58135 24844 -95356 -303197 -62588 20759 -29776 -165151 -260708 109947 -104021
6717 -85259 92168 78270 -134238 322238 76171 -98860 273526 278319 -255741 -6838 48439
6705 60247 153797 33032 -166046 135903 226839 -238721 -181413 319113 -292297 123042 80607
6694 80607 311132 -52569 -164771 -68914 234586 -63034 -115666 378229 -27402 -14336 -317777
6683 -317777 -32799 57511 -117232 161224 71131 -307547 59324 -404057 -227319 14609 -221131
6671 -13256 -46746 232945 -31082 156336 -96481 -315826 202641 -86054 -25342 -244346 15838
6659 108507 -308124 252221 -16295 -50745 -9101 -282494 -228851 219224 87458 43295 81127
6648 81127 218781 -67307 -31810 -268396 85844 -1803 149346 -11512 -36565 99906 -178270
6636 141928 85597 267814 36736 6089 -209285 -25712 36653 -15757 183748 -251587 1092
6624 145194 -115252 -132734 -310975 -478121 79910 41215 2590 24631 230712 -329046 -93700
6612 170356 -67265 -148740 -208300 -57183 178650 -5761 253054 144370 -269415 -229055 135373
6600 233523 -155106 -97492 149182 -164446 -148641 -156045 29927 -57763 160187 94350 169275
6589 169275 -123673 -230046 -193019 -54847 -85423 -207508 231778 173367 -108635 -160718 164058
6577 -132464 -94686 -102190 -82946 45036 143675 1510 19847 -97415 -111436 98820 56832 -204841
6564 -170529 -44113 92732 -42106 29283 -20682 192585 -21615 356459 -45320 -40131 174033
6552 118980 -104535 130438 -238763 -174800 -352 -14536 -88686 123142 -150566 -104865 134537
6540 -160897 23354 -184639 -204857 -246766 -197401 -15183 119038 181983 282952 188038 -149377
6528 -148478 -161097 -270823 -370028 213181 11507 130528 173482 -152994 -128985 -45195 33106
6516 -536556 212856 166590 252251 31100 177727 -190933 -98404 74637 -106839 -82958 -36809
6504 24978 -81704 186987 127347 -448753 108535 -81643 -230971 10660 29922 -23937 -122069
6493 -122069 32872 87402 70155 -132908 -150713 -205600 -384794 106674 -5245 -44295 -230750
6482 -230750 14819 -8631 -57040 177144 306760 -141659 59485 204903 -225118 -56849 -54115
6471 -54115 227953 -206246 54858 -176956 -298559 -143502 -79164 16003 43548 -157757 190579
6459 -79262 14220 41710 -167640 123757 90482 -165825 -179088 239114 165084 183641 -254824
6447 -14169 126095 -24435 -20979 1889 880 132967 6904 -29222 -28173 1160 261602 -95648 119287
6433 190508 99025 57245 318619 159976 -238734 19091 62162 211924 -27764 -167454 -103417
6422 -103417 -195046 43514 257563 -89735 -121017 52786 39014 -111412 115103 -268643 -227292
6411 -227292 98798 179544 788 -146126 -244756 53752 7235 -89730 -119204 -545353 -186749 -209261
6399 -209261 -263006 -290641 60087 -203809 -176735 151215 328441 309475 8282 247491 -182986
6387 114678 113279 -5652 66515 -425789 -77478 -295727 -268531 132051 -55917 -172646 205506
6375 36623 184779 251389 141242 -89099 -91795 -93990 89703 94631 -172820 -101713 155674 -6685
6362 -266232 -88872 31660 21347 -103268 -25739 -17030 276891 47211 75424 58458 -15975
6350 146810 134457 115509 334967 349127 369753 62813 133469 -271872 5418 459812 178695
6338 58288 166297 -400579 -290120 279741 -190026 -125717 93988 44634 -266450 -84171 -41919
6326 -196812 -303778 -79619 -126187 -287120 -78643 -64524 -93627 132680 142804 -251132 -22757
6314 48733 -172250 -170815 78458 50080 110412 230861 -110784 118973 -26360 255151 164116
6303 164116 6512 -15979 -65413 -120668 476821 -295893 201248 -157815 -81304 -245146 112155
6291 -59420 -75124 -160850 92188 -34730 -80535 62305 -15573 289468 73181 159872 -143809
6279 -420971 -275979 -10782 -145793 -43733 -183251 -54399 -113036 94056 -403465 -107413 23403
6267 130661 299281 -39082 29135 -299447 -350495 -392868 -168121 -176046 291929 6733 -35425
6255 167199 -179767 3361 552215 -116188 147882 -269103 -310261 -330554 -161318 -192594 -270922
6244 -270922 -227245 -221924 -85958 -245745 -22801 -86320 18452 109960 -114844 278116 -140241
6232 -367235 -236512 -41380 182683 -81689 -44337 -81453 15835 425590 152452 -223917 126
6220 -301411 186036 308543 -167945 146774 89701 30062 85277 -321533 203992 183894
6210 183894 24297 202773 -7547 186507 136657 -233905 -379095 -49642 287924 -172334 -88323
6199 -88323 -56415 81830 -157864 149379 47096 44426 83285 -203814 -57104 -229737 -299815
6188 -299815 6960 -227587 164756 -145722 -78832 -136913 68847 -457933 89394 57628 -25761
6176 111712 -50075 -476081 78302 -273347 -207573 -189678 70462 -141457 6933 -176987 160018
6164 -190269 10993 -245872 99398 -73366 -221567 13281 -64234 -169667 185502 -223580 -246871
6153 -246871 116925 272520 -82034 80301 77127 -158252 -155339 72625 -104679 -13312 129769
6141 71496 144018 -202204 -47050 -24366 99118 -45149 217218 171039 -170696 31202 106132
6130 106132 42 162578 -278505 131731 244047 -133532 11 306702 53865 -121266 202618
6118 227585 103258 84299 11343 106984 -60053 -283483 99275 155270 71510 106754 -251478
6106 144189 370454 120053 368239 -119975 136658 390630 -69628 193024 -150255 -29425
6095 288428 -143528 183207 -29086 -44794 -49227 45920 158808 -11797 6323 -191242 -132634
6084 -132634 200728 -308698 178760 -372350 -65942 -250126 -136326 138761 132356 344521
6074 344521 -18231 -616084 -59174 199813 75129 -72297 39436 -110470 -200774 381486 103113
6062 40862 1769 -208129 52886 98268 306084 110835 134655 -243655 -160803 -129373 -68367
6051 -68367 5086 265056 101469 183610 -54748 42843 -110267 -85341 -309061 9246 -51963
6039 -392670 84983 -15789 204379 105929 194808 1030 234368 -33165 103659 20522 187230
6028 187230 -360435 155953 146368 -165380 -366435 -47575 -135120 -57401 44258 144850 -151396
6016 68000 -136881 273820 -126919 158494 21292 -238413 198753 -229998 -95592 -184068
6006 -184068 -24872 -70750 -112934 -120520 80813 72405 -95287 -229006 -307505 -33160 147134 -8317
5993 -52147 -30489 46231 241875 191430 -99894 93161 25712 -67634 -194174 -380170 57782
5981 80572 172688 -14255 167383 -50920 -194000 153983 -110901 174500 146211 250992 -337267
5969 30903 -29911 -4221 33112 -87000 140439 95136 -122728 87188 -161348 -187511 -38551
5957 -165617 165866 -187437 38755 80377 140952 237138 -131708 -46732 31984 250118 -22372
5945 154762 -33097 -341641 107065 47297 28870 -206904 99075 -110810 -212026 161061
5934 6249 -20678 -97203 126357 185059 101133 292956 -246960 -109898 74577 108653 117434
5923 117434 -20002 -506347 84535 -17589 -144011 -148890 78010 -197959 102747 -76126 -102495
5912 -102495 21945 -202461 -50862 60917 118344 -242706 268877 -259216 -33748 257396 165244
5901 165244 -156584 -13490 289856 -18090 299568 75944 75160 -53498 -406630 259802 196079
5890 196079 35623 190730 91928 -40535 -256695 201581 107451 232384 -183474 462165
5879 -240936 -261414 -6150 -231773 19028 -50420 -149276 59444 -107578 -175729 -442157 27448
5867 -79476 31603 315697 154790 23783 377836 -80303 -138834 23222 -11791 -166452 -171322
5856 -171322 -46831 -130704 -47502 -233194 242992 -114282 163032 92759 -84544 32644 67558
5845 67558 -231408 -16334 319917 250706 338441 -157323 -101181 -37501 54807 185809 -703
5833 -245011 -22699 105445 173873 -242955 -112208 131701 108506 -4250 55312 -86140 54007
5821 -147021 58168 49875 -115230 93862 43956 240225 -6562 -303664 107894 191297 -29170
5809 13757 -236496 217885 -204831 25871 467292 295289 -56389 3477 -152411 -28104 33509
5797 -169556 -117849 -218279 -292713 -226309 -125184 -266020 -69959 -197964 -136613 119475 -240005
5785 -342448 133195 68733 -42425 317201 151974 -187456 -294116 41571 -36360 -57500 198078
5773 1582 -84875 385321 -28628 -337823 43708 17462 81055 50456 15683 -95161 119958
5761 -80310 3562 22029 -47864 372893 241408 151423 -99124 87197 -201573 168268 277910
5750 277910 439453 160452 -259277 6466 214915 -217768 -142803 40108 -94901 -19947 -173506
5739 -173506 -236006 -263768 -119167 27079 112454 -94022 -62987 -426955 -179597 -207598 338949
5727 26219 -82666 -68929 278526 129935 204262 -185870 124248 -275879 225177 126023 31914
5715 199202 466153 -87173 68085 -420747 -187745 -131077 60233 273088 173652 45904 30813
5704 30813 80562 -111724 118777 -31937 56735 -74490 2466 380985 -86716 -279717 -207792
5693 -207792 -149192 57732 -298761 78445 -81847 12306 370314 95518 117434 -33653 125381
5681 -47465 147479 84306 314046 -146951 -40125 47685 486634 21862 204795 -44686 -283823
5670 -283823 17045 150370 187091 2110 101447 -96771 -265652 -130194 -147098 339286 -11380
5658 -393524 -483451 -63299 187749 -218086 76714 79005 -123486 -42277 -78897 345090 -118619
5646 163330 -1034 -82002 -48197 107381 -119325 -171131 -36209 70234 87509 -71374 282765
5634 -268303 4428 332702 7117 -167473 -135568 -460041 -38697 -17287 -102466 -25567 -223235
5623 -223235 -51161 -191162 -137359 8194 -57207 -74107 -154420 44685 66871 -85630 -26409 -122714
5611 -122714 -227142 78813 -165163 134659 -290897 196336 -252587 -132838 64229 -13126
5600 166446 105089 -24359 -176992 -72426 -67600 -141649 -6118 -81451 -56013 166507 162515 65559
5587 -160940 -216676 987 -76297 26970 -175115 203774 -220992 -182789 -42454 -202647 330136
5575 -239029 249253 -27878 -273587 85816 -184967 -209223 -319245 38644 19631 5701 -39967
5563 -247460 -147134 -85195 290400 84673 154314 130616 18869 82411 -82083 -141788 21965
5551 -261960 -71321 -277897 -146752 -250353 -129440 169518 -154424 -131879 370328 -125934
5540 256766 254711 57929 -220958 -135128 -131734 -105837 155409 -273072 301501 63374 378374
5529 378374 188995 187563 171390 48157 -8254 -42552 212239 78989 157395 6220 70547 165530
5517 165530 129506 127305 -147924 226596 206429 73190 143035 90350 -21414 37419 267420
5506 267420 88169 44843 -82092 542380 -246318 244791 145780 5363 -71053 42557 -365681
5494 -7438 -265945 43437 183549 146519 -261145 -282738 103437 -122631 397177 -298551 -101936
5482 10948 117436 -256968 -57032 -178015 201545 177824 84226 166775 19495 -85469 -58011
5471 -58011 -67158 127243 -32885 -576 339407 63519 -1753 51361 -71936 45842 -91300 186569
5458 177688 12846 -270269 196294 64083 -181317 39031 20461 -368802 -28028 21008 142555
5447 142555 168995 335224 236936 52711 -57487 -39371 -213167 -23905 90961 226121 -222168
5435 166178 -81864 -119794 -204966 -12550 -9257 -126007 156 143000 -44468 -53247 144712 143555
5423 143555 321628 -270849 41397 23570 98403 28210 153424 -123414 19630 41758 -120825
5411 25088 -199391 -56893 -72489 81444 -260143 63174 -24548 -196109 175051 -163118 -73468
5399 195278 -144651 -217453 7940 210115 -99916 -43968 -65188 47042 -218048 157139 -53431
5387 -401983 -19688 206203 -78272 -433 156445 -107737 67401 309816 -174843 -128088 -240255
5376 -240255 164342 -37292 182382 -88402 127364 -119572 110284 -225956 181046 -111047
5365 150801 -9129 141070 -1159 -3411 79300 -80886 -16727 -114941 -16717 73983 117186 -167517
5352 -85900 -45668 -158978 -98422 31585 38556 -138966 -280759 -249437 302924 44612 -175123
5340 -175209 -62060 -83095 -210535 -130703 -11102 -39501 164563 -31606 28840 283893 30581
5328 -82647 1206 -1107 -213300 82222 -229827 -231230 -16130 289564 -57732 11978 -73123 231718
5315 -233404 40558 -203363 -171792 45088 -25848 -304331 159934 -103451 -376791 310197
5304 48091 53722 -62688 237340 252816 -230951 89332 60251 180835 18150 410651 -328716
5292 88882 126136 -121218 207179 330578 173478 276956 -86203 305125 -35241 -91798 18059
5280 327601 124539 -39954 96747 145102 -130976 158037 -266411 -62361 -85990 145608 -58564
5268 230736 -93262 -319823 -59805 105004 -16613 -214183 150981 -139419 -829 -354162 -111271
5256 90937 494500 6802 70672 -197755 144593 -50635 202689 -182922 215574 -8706 16535
5244 228446 302889 -94893 12731 -129747 -363318 261003 3076 -132815 -115866 -100739 -39164
5232 64742 175604 -49583 99852 -139977 -217632 -32412 68923 -82701 90849 -71950 -219970
5221 -219970 16824 267360 28202 121865 26649 -100668 -143126 -139364 -5003 -199393 134569
5209 98058 -149936 108251 -1163 -40493 -8952 -65804 -48201 1830 -88944 62041 -141516 -243067
5197 -243067 -95095 -274536 232822 368744 -335755 21435 108902 -92609 -180866 -124929 -111014
5186 -111014 213659 -218559 21001 18140 66363 -9853 -112391 -243418 -234485 271959 -394212
5174 -125720 84600 78593 -89953 166668 -324801 223285 25005 -196437 89232 -1444 164545
5162 312257 -119553 3009 -93755 91259 -134123 -201311 96040 107208 172470 -334082 73025
5150 21751 -274207 190143 36630 171278 69628 -54498 -58650 91065 21470 235676 114721
5138 -58487 410412 121678 -25040 -130474 284474 -196456 -10758 -51094 70670 138789 -182939
5126 79122 -72185 122944 18847 -209382 115393 66273 176524 -83671 -285445 -149550 177337
5114 -13743 -105654 -16750 -14343 -20533 -134845 -226479 108302 -194620 -288135 -32299 -211502
5103 -211502 25741 -154115 -38243 -38725 7855 181299 -126870 -104867 4059 -534304 1080 -219454
5090 40313 44202 118341 8710 -242015 298929 -122592 -102093 209203 67435 271807 258278
5079 258278 -24875 -71846 52957 3170 123112 -217850 92917 -268583 -202324 100194 241255
5068 241255 43622 83317 -166919 -192443 -54960 168007 43969 216090 -84947 -136515 -37598
5056 -200597 105907 -257502 -92565 157887 -193393 251659 188553 -372878 262599 236423
5046 236423 67354 -271597 -2033 -164629 -221830 182542 -88411 312269 -331667 126614 387868
5035 387868 200359 50666 32423 116923 80958 187037 -69345 69876 -152220 4721 -91739
5023 -1487 -45278 273462 -244954 316798 -119975 95425 -210307 -9681 -14048 -26707 -222564
5012 -222564 -127649 -4718 84899 122897 188363 -106672 114905 511278 -24308 19474 32433
5001 32433 -25009 196756 63002 64618 -108574 -79770 -314678 -84722 -104638 -105905 -128367 171726
4988 493609 78688 57781 -252522 11255 -22361 287839 -30810 -116102 147213 174567 122240
4977 122240 -23635 102949 352463 -83700 95591 225147 300280 185767 35835 -164088 79176
4965 32925 58947 -168931 99495 312306 121395 201060 245041 92206 -87465 -34871 -170806
4954 -170806 61965 -303822 -83426 -102303 -88604 -38779 134845 232913 -246192 230351 -134083
4942 -228036 114962 -4078 -26939 105688 -125863 -2456 -57107 89213 -27691 18802 139044
4931 139044 108405 48067 130722 68922 56282 122975 71356 -78475 372673 58159 16490
4919 -73314 -314496 172864 92317 173649 -30387 -166101 -177084 239369 -96415 -22206 1989
4907 -10716 -98568 329423 83586 188269 208849 43269 -8578 -304276 -30474 47104 -35002
4895 47867 -325836 -76196 123982 261923 -50026 -8482 -54319 62548 -100884 313378 -62644
4883 -25153 72872 -219231 43125 -132492 66214 42104 -110529 56786 11663 50447 103081
4872 103081 -117127 -237686 -124234 327205 -30578 -100338 -74447 -92631 -174809 147718 282367
4861 282367 58797 -54728 -89730 -238004 -85553 -206391 158930 31747 -221571 29229 107024
4850 107024 -441890 -160922 -160455 -12961 45142 -71624 -67278 98507 223869 -9508 -240368 -137523
4838 -137523 -232202 -32809 12105 -69753 -10255 121501 85585 -234547 293452 39009 5249
4826 -246269 399664 46055 91194 177427 -208073 62343 -186442 -43970 83746 20404 -16178
4814 83163 -46331 173321 137436 30780 -327080 163382 -64730 221607 48106 -65963 -46049
4803 -46049 -303216 -85321 -84430 105236 -25021 -118167 82388 10278 -34097 288316 21168 -228758
4790 262566 -112898 -102446 -139938 270300 134472 -124838 -17593 -226865 -61902 59305 -277442
4778 134639 47672 -79894 45237 -86611 155468 -427764 47191 -505586 162040 -205156 9067
4766 156824 -66565 -99858 64262 97856 -92086 -61478 8140 105445 -138931 -11100 -239004
4755 -239004 141490 -94881 108939 128974 25167 168325 -131214 -93501 -237241 167819
4744 50299 174157 301272 -74828 135893 217254 137955 275842 -64483 -550138 153091 -24343
4732 319631 -206607 289151 161904 -201964 9252 150557 259208 99390 62078 463055
4722 463055 3249 -30339 -144089 10973 -62182 180190 605874 -107836 -153159 -16833 100420
4710 -22807 325153 -1240 -107193 83418 343753 -176546 58663 -14268 183090 -11573 338094
4698 77862 -42205 -173644 110848 -74227 -98919 138671 -11931 -24553 -39926 -124176 108652
4686 -173987 345611 32901 -263694 -345647 -158992 -172226 513475 -186278 -45259 116979
4675 65227 -53329 -15181 109735 -69778 -16186 35111 -57659 -43411 -167326 -35980 29333
4663 178390 -213830 86652 161287 -79361 49628 69137 245897 224172 420695 -221897 185764
4651 101887 109558 81708 -177731 43459 -115457 26674 -163686 -27768 85783 57036 62148
4640 62148 -186647 4011 129967 -2647 -36854 -201621 208761 -169802 185917 -85843 180111
4628 259814 -172341 20679 -22454 88474 -198823 -284940 -29105 -305818 -6354 -6034 -407970
4617 -407970 143125 -86780 -125437 -81302 239525 -11638 -70792 -309078 -34391 60458 257332
4606 257332 191327 120233 -21934 67206 -143492 136501 8251 20039 121648 92336 -441663
4594 170703 -3145 -156890 -10742 144298 -39017 182428 -235506 -15902 207137 -188198 176096
4582 -51518 15951 -116546 47439 278462 -170379 -145822 -339929 158422 -123665 195914
4571 166702 -16965 17867 94987 -63962 -64157 130042 -169350 -136753 403076 -238972 158209
4559 81612 143089 95553 201768 50640 -7162 -280057 27050 421004 262133 203194 131732
4548 131732 224807 -70548 192509 -44706 -5334 412566 23824 26098 -70595 124540 -55978
4536 204995 -163604 38916 -109645 379015 -439526 -403870 -68632 103481 -47641 -103106 135108
4524 605 37044 -11514 -25678 -212543 170106 -73549 341537 137476 34639 320712 138376
4512 12166 46847 14618 31980 -75369 6540 327926 -33447 -42776 -65742 74697 59483 -105473
4499 11448 -19446 60354 91644 220209 79705 -161602 -107298 63107 128078 62851 201081
4488 201081 239770 62458 166795 -116124 38993 89327 -341468 -127435 41143 -177835 -115786
4477 -115786 -6281 -7060 210168 35882 152642 -230388 182499 155134 -85332 -17164 211194
$$ [...]
##END NTUPLES=NMR SPECTRUM
##END=
