
##TITLE=AC1230_PANAH12123_6074932_n4p4JGhNxu
##JCAMPDX= 6.0         $$ Bruker NMR JCAMP-DX V2.0
##DATA TYPE= NMR SPECTRUM
##DATA CLASS= NTUPLES
##ORIGIN= BRUKER
##OWNER= Administrator
$$ 1.72 TOPSPIN		Version 2.1
$$ 2012-05-08 00:40:56.578 -0500  Administrator@TOPSPIN
$$ Compression mode = diff/dup
##.OBSERVE FREQUENCY= 400.13188235
##.OBSERVE NUCLEUS= ^1H
##.ACQUISITION MODE= SIMULTANEOUS (DQD)
##.ACQUISITION SCHEME= undefined
##.AVERAGES= 64
##.DIGITISER RES= 22
##SPECTROMETER/DATA SYSTEM= spect
##.PULSE SEQUENCE= noesygpps1d.comp
##.SOLVENT NAME= COFFEE_meoh
##.SHIFT REFERENCE= INTERNAL, COFFEE_meoh, 1, 14.96655
##AUDIT TRAIL= $$ (NUMBER, WHEN, WHO, WHERE, PROCESS, VERSION, WHAT)
$$ ##TITLE= Audit trail, TOPSPIN		Version 2.1
$$ ##JCAMPDX= 5.01
$$ ##ORIGIN= Bruker BioSpin GmbH
$$ ##OWNER= Administrator
$$ $$ C:\Bruker\TOPSPIN/data/COFFEE/nmr/AC1230_PANAH12123_6074932_n4p4JGhNxu/12/pdata/1/auditp.txt
$$ ##AUDIT TRAIL=  $$ (NUMBER, WHEN, WHO, WHERE, PROCESS, VERSION, WHAT)
(   1,<2012-05-08 00:40:51.421 -0500>,<Administrator>,<TOPSPIN>,<go>,<TOPSPIN 2.1>,
      <created by zg
	started at 2012-05-08 00:29:20.656 -0500,
	POWCHK enabled, PULCHK disabled,
       configuration hash MD5:
       AF F2 23 6B 01 CD 40 DD E5 A1 38 A0 06 EA F7 77
       data hash MD5: 64K
       D0 4B A5 B6 21 D1 32 1E 56 86 06 EB 79 B6 4B 7F>)
(   2,<2012-05-08 00:40:54.250 -0500>,<Administrator>,<TOPSPIN>,<proc1d>,<TOPSPIN 2.1>,
      <Start of raw data processing
       efp LB = 0.3 FT_mod = 6 PKNL = 1 PHC0 = 0 PHC1 = 0 SI = 128K 
       data hash MD5: 128K
       D5 0A D9 6C 34 EC 5D EF 26 EE D7 9F 98 EC 65 38>)
(   3,<2012-05-08 00:40:55.531 -0500>,<Administrator>,<TOPSPIN>,<proc1d>,<TOPSPIN 2.1>,
      <pk PHC0 = 34.552 PHC1 = 0 
       data hash MD5: 128K
       1A D1 03 CC 53 85 3E AB 26 34 A8 5F 98 18 94 C2>)
(   4,<2012-05-08 00:40:56.234 -0500>,<Administrator>,<TOPSPIN>,<proc1d>,<TOPSPIN 2.1>,
      <abs ABSG = 1 
       data hash MD5: 128K
       F3 0E 27 B8 F5 F7 71 29 AE 08 A0 CE C6 93 E5 35>)
(   5,<2012-05-08 00:40:56.312 -0500>,<Administrator>,<TOPSPIN>,<proc1d>,<TOPSPIN 2.1>,
      <abs ABSG = 2 
       data hash MD5: 128K
       32 56 B6 C6 DC C8 F6 09 BB 7E A1 9C BF 10 8F 0E>)
(   6,<2012-05-08 00:40:56.359 -0500>,<Administrator>,<TOPSPIN>,<proc1d>,<TOPSPIN 2.1>,
      <abs ABSG = 3 
       data hash MD5: 128K
       A3 06 D5 94 9D A8 02 7D 1C E5 BE 26 DE 71 3E 0E>)
(   7,<2012-05-08 00:40:56.421 -0500>,<Administrator>,<TOPSPIN>,<proc1d>,<TOPSPIN 2.1>,
      <abs ABSG = 4 
       data hash MD5: 128K
       A0 23 A7 80 FF A7 B0 CF B6 F7 22 B4 76 32 3E D7>)
(   8,<2012-05-08 00:40:56.484 -0500>,<Administrator>,<TOPSPIN>,<proc1d>,<TOPSPIN 2.1>,
      <abs ABSG = 5 
       data hash MD5: 128K
       EA 4E 88 77 D9 8E 94 1A FC 11 A8 40 ED B9 86 72>)
$$ ##END=
$$ 
$$ $$ hash MD5
$$ $$ 3E F3 10 C4 53 16 5A 98 84 AC 65 65 6C 93 1F C1
##$RELAX= 
##$RELAX= 
##$RELAX= 
##$RELAX= 
##$RELAX= 
##$RELAX= 
##$RELAX= 
##$RELAX= 
$$ Bruker specific parameters
$$ [...]
##$TP07= 0
##$TPNAME0= <>
##$TPNAME1= <>
##$TPNAME2= <>
##$TPNAME3= <>
##$TPNAME4= <>
##$TPNAME5= <>
##$TPNAME6= <>
##$TPNAME7= <>
##$TPOAL= (0..7)
0.5 0.5 0.5 0.5 0.5 0.5 0.5 0.5
##$TPOFFS= (0..7)
0 0 0 0 0 0 0 0
##$TUNHIN= 0
##$TUNHOUT= 0
##$TUNXOUT= 0
##$USERA1= <user>
##$USERA2= <user>
##$USERA3= <user>
##$USERA4= <user>
##$USERA5= <user>
##$V9= 5
##$VALIST= <valist>
##$VCLIST= <CCCCCCCCCCCCCCC>
##$VD= 0
##$VDLIST= <DDDDDDDDDDDDDDD>
##$VPLIST= <PPPPPPPPPPPPPPP>
##$VTLIST= <TTTTTTTTTTTTTTT>
##$WBST= 1024
##$WBSW= 4
##$XGAIN= (0..3)
0 0 0 0
##$XL= 0
##$YL= 0
##$YMAX_a= 10964662
##$YMIN_a= -5738372
##$ZGOPTNS= <>
##$ZL1= 120
##$ZL2= 120
##$ZL3= 120
##$ZL4= 120
##$ABSF1= 14.96655
##$ABSF2= -5.58598
##$ABSG= 5
##$ABSL= 3
##$ALPHA= 0
##$AQORDER= 0
##$ASSFAC= 0
##$ASSFACI= 0
##$ASSFACX= 0
##$ASSWID= 0
##$AUNMP= <proc_prof1d_extract.lims>
##$AXLEFT= 0
##$AXNAME= <>
##$AXNUC= <1H>
##$AXRIGHT= 0
##$AXTYPE= 0
##$AXUNIT= <>
##$AZFE= 0.1
##$AZFW= 0.1
##$BCFW= 0
##$BC_mod= 0
##$BYTORDP= 0
##$COROFFS= 0
##$CY= 15
##$DATMOD= 1
##$DC= 0
##$DFILT= <>
##$DTYPP= 0
##$F1P= 0
##$F2P= 0
##$FCOR= 0.5
##$FTSIZE= 131072
##$FT_mod= 6
##$GAMMA= 0
##$GB= 0
##$INTBC= 1
##$INTSCL= 1
##$ISEN= 128
##$LB= 0.3
##$LEV0= 0
##$LPBIN= 0
##$MAXI= 10000
##$MC2= 0
##$MEAN= 0
##$ME_mod= 0
##$MI= 0
##$NCOEF= 0
##$NC_proc= -3
##$NLEV= 6
##$NOISF1= 0
##$NOISF2= 0
##$NSP= 0
##$NTH_PI= 0
##$NZP= 0
##$OFFSET= 14.96655
##$PC= 1
##$PHC0= 34.552
##$PHC1= 0
##$PH_mod= 1
##$PKNL= yes
##$PPARMOD= 0
##$PPDIAG= 0
##$PPIPTYP= 0
##$PPMPNUM= 2147483647
##$PPRESOL= 1
##$PSCAL= 4
##$PSIGN= 0
##$PYNMP= <proc.py>
##$REVERSE= no
##$SF= 400.130005625309
##$SI= 131072
##$SIGF1= 0
##$SIGF2= 0
##$SINO= 400
##$SIOLD= 131072
##$SPECTYP= <>
##$SREGLST= <1H.CDCl3>
##$SSB= 0
##$STSI= 131072
##$STSR= 0
##$SW_p= 8223.68421052632
##$SYMM= 0
##$S_DEV= 0
##$TDeff= 65536
##$TDoff= 0
##$TI= <>
##$TILT= no
##$TM1= 0
##$TM2= 0
##$TOPLEV= 0
##$USERP1= <user>
##$USERP2= <user>
##$USERP3= <user>
##$USERP4= <user>
##$USERP5= <user>
##$WDW= 1
##$XDIM= 131072
##$YMAX_p= 464976950
##$YMIN_p= -137973907
##$CURPLOT= <Network HP LaserJet P1505>
##$CURPRIN= <$Network HP LaserJet P1505>
##$DFORMAT= <normdp>
##$LAYOUT= <+/1D_H.xwp>
##$LFORMAT= <normlp>
##$PFORMAT= <normpl>
##$SURQMSG= 1
$$ End of Bruker specific parameters
$$ ---------------------------------
##NTUPLES= NMR SPECTRUM
##VAR_NAME=  FREQUENCY,     SPECTRUM/REAL,   SPECTRUM/IMAG
##SYMBOL=    X,             R,               I
##VAR_TYPE=  INDEPENDENT,   DEPENDENT,       DEPENDENT
##VAR_FORM=  AFFN,          ASDF,            ASDF
##VAR_DIM=   131072,        131072,          131072
##UNITS=     HZ,            ARBITRARY UNITS, ARBITRARY UNITS
##FACTOR=    0.0627417313425165, 1,          1
##FIRST=     8223.62146879498, 1431,         -98606
##LAST=      0,             3608,            -98143
##MIN=       0,             -137973907,      0
##MAX=       8223.62146879498, 464976950,    0
$$ Real data points
##PAGE= N=1
##DATA TABLE= (X++(R..R)), XYDATA
$$ [...]
$$ plain form
63570 728851 744409 761724 781105 802222 823828 844649 865039 886841 911275 937917 966194
63559 966194 996626 1029735 1064872 1101387 1140228 1183008 1229854 1279357 1330422 1382809 1435809
63548 1435809 1487513 1535723 1578608 1614264 1640702 1657020 1664134 1663982 1658523 1649680 1639344 1628570
63536 1628570 1617051 1603972 1589176 1572887 1554486 1532261 1504712 1471874 1435272 1396775 1357713
63525 1357713 1318918 1281131 1244956 1210577 1178097 1148282 1122387 1100913 1083227 1069087 1059787
63514 1059787 1056579 1058201 1061383 1064085 1067113 1072148 1079542 1088951 1100994 1116796 1136173 1157482 1179302
63501 1179302 1201470 1224569 1249317 1276669 1307747 1343173 1382683 1425614 1471674 1521310 1575534
63490 1575534 1635105 1699432 1766010 1830847 1889181 1935998 1967092 1980923 1979557 1967248 1948059
$$ packed form
63570G28851J5558J7315J9381K1117K1606K0821K0390K1802K4434K6642K8277
63559I66194L0432L3109L5137L6515L8841M2780M6846M9503N1065N2387N3000
63548A435809N1704M8210M2885L5656K6438J6318P114j52n459q843j0336j0774
63536A628570j1519j3079j4796j6289j8401k2225k7549l2838l6602l8497l9062
63525A357713l8795l7787l6175l4379l2480k9815k5895k1474j7686j4140r300
63514A059787l208J622L182K702L028N035P394R409J2043J5802J9377K1309K1820
63501A179302K2168K3099K4748K7352L1078L5426L9510M2931M6060M9636N4224
63490A575534N9571O4327O6578O4837N8334M6817L1094J3831j366j2309j9189
$$ plain form
63479 1948059 1924976 1900476 1876612 1854258 1832957 1811861 1790388 1767952 1743494 1715442 1681954
63468 1681954 1641619 1594611 1542996 1489194 1434288 1378459 1322671 1268721 1217644 1169316 1123858
63457 1123858 1082092 1044062 1008411 974135 942058 913569 888686 866406 846284 828467 812520
63446 812520 797440 782815 769083 756658 745620 736174 728489 721997 715629 708975 702626 697255 692966
63433 692966 689636 687222 685441 683723 681873 680487 680437 682148 685395 689479 693581 697318 701071 705478 710535
63418 710535 715442 719252 721383 721766 721093 720856 722267 724847 726651 726218 723897 721035 718516 716634 715854
63403 715854 716839 719677 723602 727721 731884 736818 743502 752326 762776 773979 785615 798166 812336
63390 812336 828416 846317 865945 887391 910881 936661 964892 995661 1029236 1066229 1107321
$$ packed form
63479A948059k3083k4500k3864k2354k1301k1096k1473k2436k4458k8052l3488
63468A681954m0335m7008n1615n3802n4906n5829n5788n3950n1077m8328m5458
63457A123858m1766l8030l5651l4276l2077k8489k4883k2280k0122j7817j5947
63446H12520j5080j4625j3732j2425j1038r446p685o492o368o654o349n371m289
63433F92966l330k414j781j718j850j386n0J711L247M084M102L737L753M407N057
63418G10535M907L810K131L83o73k37J411K580J804m33k321k862k519j882p80
63403G15854R85K838L925M119M163M934O684Q824J0450J1203J1636J2551J4170
63390H12336J6080J7901J9628K1446K3490K5780K8231L0769L3575L6993M1092
$$ plain form
63379 1107321 1152956 1203443 1258864 1318061 1377680 1433004 1480239 1517859 1546098 1566133 1580134
63368 1580134 1591168 1602267 1615903 1634547 1660672 1695169 1736306 1781356 1829080 1879736 1932894
63357 1932894 1986292 2036787 2081370 2117238 2142217 2155944 2159995 2156344 2146269 2131113 2113135 2094536
63345 2094536 2075829 2055847 2033210 2007148 1976998 1941636 1899879 1851460 1797684 1741137 1684420
63334 1684420 1628812 1574264 1520749 1469245 1421133 1377152 1337489 1302404 1271873 1244754 1219327
63323 1219327 1195184 1174104 1158648 1150025 1147472 1149274 1154082 1161467 1171598 1184517 1199876 1217483
63311 1217483 1237885 1261877 1289504 1320205 1354148 1392632 1436570 1485090 1536395 1589688 1645363
63300 1645363 1703386 1762546 1821625 1880346 1938250 1993048 2040971 2078774 2104913 2119164 2122315
$$ packed form
63379A107321M5635N0487N5421N9197N9619N5324M7235L7620K8239K0035J4001
63368A580134J1034J1099J3636J8644K6125L4497M1137M5050M7724N0656N3158
63357A932894N3398N0495M4583L5868K4979J3727M051l651j0075j5156j7978j8599
63345B094536j8707j9982k2637k6062l0150l5362m1757m8419n3776n6547n6717
63334A684420n5608n4548n3515n1504m8112m3981l9663l5085l0531k7119k5427
63323A219327k4143k1080j5456q623k553J802M808P385J0131J2919J5359J7607
63311A217483K0402K3992K7627L0701L3943L8484M3938M8520N1305N3293N5675
63300A645363N8023N9160N9079N8721N7904N4798M7923L7803K6139J4251L151
$$ plain form
63289 2122315 2116646 2105579 2091719 2075475 2056354 2035121 2013444 1991458 1967078 1938198 1904236
63278 1904236 1864777 1818362 1764597 1706682 1649503 1594943 1541045 1486525 1434153 1388282 1350431
63267 1350431 1319025 1292642 1271537 1256072 1245151 1236342 1226289 1211063 1187780 1156615 1120405
63256 1120405 1081964 1042682 1003805 967414 935023 906173 879513 854618 831779 810730 790950
63245 790950 772939 757762 745020 732478 718434 703871 691612 683383 678065 672771 665459 656484
63233 656484 647765 640705 635202 630419 625814 621152 616181 611038 606659 603952 602530 600880 597991 594407
63219 594407 591509 590120 589997 590437 591049 591918 593088 594103 594424 594334 595000 597396 601532 606951 613357 620260
63203 620260 626692 632241 638014 645540 654819 664479 673841 683626 694343 705264 715696 726255 737900
$$ packed form
63289B122315n669j1067j3860j6244j9121k1233k1677k1986k4380k8880l3962
63278A904236l9459m6415n3765n7915n7179n4560n3898n4520n2372m5871l7851
63267A350431l1406k6383k1105j5465j0921q809j0053j5226k3283l1165l6210
63256A120405l8441l9282l8877l6391l2391k8850k6660k4895k2839k1049j9780
63245G90950j8011j5177j2742j2542j4044j4563j2259q229n318n294p312q975
63233F56484q719p060n503m783m605m662m971n143m379k707j422j650k889l584
63219E94407k898j389j23M40O12Q69J170J015L21r0O66K396M136N419O406O903
63203F20260O432N549N773P526R279R660R362R785J0717J0921J0432J0559J1645
$$ plain form
63190 737900 750575 763891 778595 795996 816039 837236 858763 881490 906387 932864 959621
63179 959621 986628 1015265 1046474 1079568 1113074 1146069 1178408 1210249 1242088 1274930 1309555
63168 1309555 1345405 1380830 1414778 1447832 1481252 1515447 1549797 1583550 1616197 1647077 1675231
63157 1675231 1699800 1720181 1735719 1745528 1748631 1744186 1731797 1711961 1685943 1654858 1619215 1579863
63145 1579863 1538893 1498697 1460307 1423539 1388669 1356995 1329677 1306999 1288812 1274562 1262745
63134 1262745 1251855 1242579 1237692 1238729 1243855 1250219 1257520 1267778 1282159 1299620 1318490 1337835
63122 1337835 1357030 1375331 1392567 1409490 1426908 1444772 1462179 1477876 1490794 1500615 1507862 1513069
63110 1513069 1516107 1516665 1514779 1509955 1500346 1484058 1461206 1433484 1401838 1366042 1326759 1286415
$$ packed form
63190G37900J2675J3316J4704J7401K0043K1197K1527K2727K4897K6477K6757
63179I59621K7007K8637L1209L3094L3506L2995L2339L1841L1839L2842L4625
63168A309555L5850L5425L3948L3054L3420L4195L4350L3753L2647L0880K8154
63157A675231K4569K0381J5538R809L103m445j2389j9836k6018l1085l5643l9352
63145A579863m0970m0196l8390l6768l4870l1674k7318k2678j8187j4250j1817
63134A262745j0890r276m887J037N126O364P301J0258J4381J7461J8870J9345
63122A337835J9195J8301J7236J6923J7418J7864J7407J5697J2918R821P247N207
63110A513069L038N58j886m824r609j6288k2852k7722l1646l5796l9283m0344
$$ plain form
63098 1286415 1247267 1209851 1174137 1140870 1110621 1082478 1055100 1028609 1004245 982420 962283
63087 962283 943138 925266 909186 894941 882377 871625 863088 857176 853964 852782 852179 850611 847213
63074 847213 842053 836236 831831 830773 833065 836573 839347 841722 845431 851200 858207 865396 872102 877646
63060 877646 881758 885614 891078 898378 905584 911009 915199 919802 925290 930769 935597 940151 945017 950223
63046 950223 955625 961654 969238 978746 989084 998292 1005462 1011730 1018690 1026066 1031873 1034954 1036399 1038150
63032 1038150 1041148 1045263 1050065 1054931 1059189 1062977 1067357 1072853 1078601 1083868 1089697 1097884 1108726 1121026
63018 1121026 1133989 1147838 1162632 1177920 1193850 1211418 1231201 1252778 1275759 1300483 1327427
63007 1327427 1356925 1389850 1427378 1469428 1514384 1561174 1610722 1664479 1722437 1783698 1848253
$$ packed form
63098A286415l9148l7416l5714l3267l0249k8143k7378k6491k4364k1825k0137
63087I62283j9145j7872j6080j4245j2564j0752q537n912l212j182o03j568l398
63074H47213n160n817m405j058K292L508K774K375L709N769P007P189O706N544
63060H77646M112L856N464P300P206N425M190M603N488N479M828M554M866N206
63046I50223N402O029P584R508J0338R208P170O268O960P376N807L081J445J751
63032A038150K998M115M802M866M258L788M380N496N748N267N829Q187J0842J2300
63018A121026J2963J3849J4794J5288J5930J7568J9783K1577K2981K4724K6944
63007A327427K9498L2925L7528M2050M4956M6790M9548N3757N7958O1261O4555
$$ plain form
62996 1848253 1916851 1989514 2065415 2144081 2225515 2309276 2394580 2481258 2569345 2657673 2744266
62985 2744266 2828664 2912602 2997605 3082939 3166794 3248656 3329310 3408823 3485594 3557348 3622169
62974 3622169 3678383 3724140 3757559 3777164 3782143 3772347 3747988 3709155 3655808 3588659 3510032 3423550
62962 3423550 3332782 3240131 3146757 3053317 2961013 2872281 2790399 2717997 2655803 2602893 2557995
62951 2557995 2520409 2490088 2467500 2453366 2447879 2449888 2457287 2468521 2483394 2502116 2523885 2546869
62939 2546869 2569587 2591998 2615127 2639692 2665104 2689849 2712926 2734769 2756291 2776933 2794163
62928 2794163 2805343 2809655 2807592 2798813 2781454 2753811 2715982 2669562 2616306 2557583 2494463 2427455
62916 2427455 2356429 2281702 2205295 2130286 2058658 1990327 1924585 1861898 1803795 1751356 1704227
$$ packed form
62996A848253O8598P2663P5901P8666Q1434Q3761Q5304Q6678Q8087Q8328Q6593
62985B744266Q4398Q3938Q5003Q5334Q3855Q1862Q0654P9513P6771P1754O4821
62974C622169N6214M5757L3419J9605M979r796k4359l8833n3347o7149p8627q6482
62962C423550r0768r2651r3374r3440r2304q8732q1882p2402o2194n2910m4898
62951B557995l7586l0321k2588j4134n487K009P399J1234J4873J8722K1769K2984
62939B546869K2718K2411K3129K4565K5412K4745K3077K1843K1522K0642J7230
62928B794163J1180M312k063q779j7359k7643l7829m6420n3256n8723o3120o7008
62916B427455p1026p4727p6407p5009p1628o8331o5742o2687n8103n2439m7129
$$ plain form
62905 1704227 1660868 1619424 1578701 1538839 1501048 1466379 1434826 1405619 1377918 1350941 1323960
62894 1323960 1296842 1270290 1244908 1220266 1195568 1171015 1147642 1125780 1104543 1083063 1061523
62883 1061523 1040664 1020956 1002573 985683 970416 956940 945642 936511 928143 918384 906698 895248
62871 895248 886714 881419 877363 872771 867670 863051 859429 856589 854130 851787 849389 846814 844125 841786
62857 841786 840570 840764 841344 840548 837725 834099 831111 828428 824350 818026 810519 803727 798908 796169 794633
62842 794633 792990 790557 788003 786550 786435 786770 786943 787285 787975 788071 786403 783128 779793 777913 777865 779071
62826 779071 780864 782997 785480 788185 790829 793275 795497 797136 797558 796785 795869 795741 796027 795719 794717 793661
62810 793661 792426 790085 786709 783906 782897 783039 783104 783103 783749 784870 785708 786498 788360 791477 794557 796526
$$ packed form
62905A704227m3359m1444m0723l9862l7791l4669l1553k9207k7701k6977k6981
62894A323960k7118k6552k5382k4642k4698k4553k3373k1862k1237k1480k1540
62883A061523k0859j9708j8383j6890j5267j3476j1298r131q368r759j1686j1450
62871H95248q534n295m056m592n101m619l622k840k459k343k398k575k689k339
62857H41786j216J94N80p96k823l626k988k683m078o324p507o792m819k739j536
62842G94633j643k433k554j453j15L35J73L42O90R6j668l275l335j880m8J206
62826G79071J793K133K483K705K644K446K222J639M22p73r16j28K86l08j002j056
62810G93661j235k341l376k803j009J42O5jO46J121Q38P90J862L117L080J969
$$ plain form
62794 796526 797789 799239 800820 801900 802643 804056 806575 809279 810866 811093 810843 810991 811722 813072 815491
62779 815491 819267 823538 826534 827070 825586 823676 822916 824078 826934 830671 834908 840447 848428 858463
62765 858463 868295 875827 881059 885547 890555 896544 904047 913870 926092 939526 952538 964283 975226
62752 975226 986768 1000187 1015533 1031592 1047275 1062777 1078951 1096025 1113875 1133391 1156357
62741 1156357 1183538 1213708 1245062 1276979 1309957 1344628 1381628 1422020 1466918 1516692 1571089
62730 1571089 1630137 1694469 1764814 1841601 1925143 2015797 2113728 2218578 2329403 2444889 2563831
62719 2563831 2685478 2809022 2932443 3052143 3164220 3265880 3355151 3429575 3486142 3522802
62709 3522802 3539373 3536671 3515274 3475615 3418758 3346457 3260675 3163572 3057803 2946248 2831393
$$ packed form
62794G96526J263J450J581J080P43J413K519K704J587K27k50J48P31J350K419
62779H15491L776M271K996N36j484j910p60J162K856L737M237N539P981J0035
62765H58463R832P532N232M488N008N989P503R823J2222J3434J3012J1745J0943
62752I75226J1542J3419J5346J6059J5683J5502J6174J7074J7850J9516K2966
62741A156357K7181L0170L1354L1917L2978L4671L7000M0392M4898M9774N4397
62730A571089N9048O4332P0345P6787Q3542R0654R7931J04850J10825J15486J18942
62719B563831J21647J23544J23421J19700J12077J01660Q9271P4424N6567L6660
62709C522802J6571k702k1397l9659n6857p2301q5782r7103j05769j11555j14855
$$ plain form
62698 2831393 2715236 2599561 2485686 2373986 2264326 2157265 2054483 1957897 1868647 1786860
62688 1786860 1711839 1642359 1577416 1517059 1462038 1412409 1367108 1325225 1287030 1253144 1223433
62677 1223433 1197461 1175350 1156951 1140514 1123674 1106118 1090220 1078537 1071415 1067356 1064820 1063025
62665 1063025 1061794 1061617 1063675 1069056 1077781 1088865 1101205 1114285 1128352 1144317 1163359 1186336
62653 1186336 1213552 1244881 1279736 1317020 1355886 1396870 1441778 1492177 1548479 1610565 1678330
62642 1678330 1750986 1826601 1903285 1980523 2058643 2137265 2214899 2289756 2360244 2424902 2482440
62631 2482440 2531588 2570332 2595833 2605963 2600815 2581959 2550513 2506808 2451694 2387053 2314902
62620 2314902 2236945 2155172 2071922 1988855 1906472 1825041 1745512 1669250 1597282 1529940 1466862
$$ packed form
62698B831393j16157j15675j13875j11700j09660j07061j02782r6586q9250q1787
62688A786860p5021o9480o4943o0357n5021m9629m5301m1883l8195l3886k9711
62677A223433k5972k2111j8399j6437j6840j7556j5898j1683p122m059k536j795
62665A063025j231j77K058N381Q725J1084J2340J3080J4067J5965J9042K2977
62653A186336K7216L1329L4855L7284L8866M0984M4908N0399N6302O2086O7765
62642A678330P2656P5615P6684P7238P8120P8622P7634P4857P0488O4658N7538
62631B482440M9148L8744K5501J0130n148j8856l1446m3705n5114o4641p2151
62620B314902p7957q1773q3250q3067q2383q1431p9529p6262p1968o7342o3078
$$ plain form
62609 1466862 1407352 1351232 1299286 1252267 1209610 1170048 1133502 1101210 1073546 1048811 1025062
62598 1025062 1002341 982092 964700 948583 931744 913535 894855 877229 861929 849579 840024
62587 840024 832379 825418 818461 812160 808028 806699 806941 806950 806393 806342 807280 808250 808281 807679 807232 806773 805341 802554
62569 802554 799303 797151 797155 798986 801093 802240 803071 805630 811155 819023 828178 838745 851485 866300
62555 866300 882157 898173 914052 929748 945554 962459 981618 1003286 1026757 1051437 1077582
62544 1077582 1105957 1137214 1171828 1210301 1253112 1300393 1351643 1405878 1462168 1519996 1578814
62533 1578814 1637308 1693413 1745142 1791142 1830464 1862196 1885305 1898450 1900153 1889822 1868640
62522 1868640 1838784 1801799 1758550 1710654 1660595 1609952 1558674 1506637 1454722 1403663 1353218
$$ packed form
62609A466862n9510n6120n1946m7019m2657l9562l6546l2292k7664k4735k3749
62598A025062k2721k0249j7392j6117j6839j8209j8680j7626j5300j2350r555
62587H40024p645o961o957o301m132j329K42Rn57n1R38R70L1o02m47m59j432k787
62569H02554l251k152MJ831K107J147Q31K559N525P868R155J0567J2740J4815
62555H66300J5857J6016J5879J5696J5806J6905J9159K1668K3471K4680K6145
62544A077582K8375L1257L4614L8473M2811M7281N1250N4235N6290N7828N8818
62533A578814N8494N6105N1729M6000L9322L1732K3109J3145J703j0331k1182
62522A868640k9856l6985m3249m7896n0059n0643n1278n2037n1915n1059n0445
$$ plain form
62511 1353218 1303680 1256977 1214711 1175915 1138475 1102304 1069357 1040693 1015283 991928 970770
62500 970770 952381 936623 923018 911296 901027 891421 881892 872295 862486 852490 843269 836486 833040
62487 833040 832325 833004 833889 834129 833479 832666 832839 834503 837559 842154 848458 855667 862508 869010 876580 886004
62471 886004 896584 907719 920057 934400 950612 968433 988364 1010937 1036095 1064116 1096119
62460 1096119 1132672 1172868 1215831 1262052 1311843 1363375 1413993 1463040 1511699 1560214 1606956
62449 1606956 1650307 1689848 1725227 1755268 1778957 1796396 1808151 1814322 1814879 1810387 1801994 1791109
62437 1791109 1779311 1768015 1757913 1749150 1742278 1738657 1739762 1746456 1758979 1777181 1800796 1829935
62425 1829935 1865202 1906639 1952692 2001172 2051263 2103511 2157541 2210844 2260290 2303679 2339094
$$ packed form
62511A353218m9538m6703m2266l8796l7440l6171l2947k8664k5410k3355k1158
62500I70770j8389j5758j3605j1722j0269r606r529r597r809r996r221o783l446
62487H33040p15O79Q85K40o50q13J73J664L056M595O304P209O841O502P570R424
62471H86004J0580J1135J2338J4343J6212J7821J9931K2573K5158K8021L2003
62460A096119L6553M0196M2963M6221M9791N1532N0618M9047M8659M8515M6742
62449A606956M3351L9541L5379L0041K3689J7439J1755O171N57m492q393j0885
62437A791109j1798j1296j0102q763o872l621J105O694J2523J8202K3615K9139
62425A829935L5267M1437M6053M8480N0091N2248N4030N3303M9446M3389L5415
$$ plain form
62414 2339094 2364034 2376753 2377959 2369794 2353136 2326887 2289746 2241553 2182881 2114669 2038878 1958656
62402 1958656 1877094 1796119 1716806 1640107 1566792 1497241 1431890 1371614 1317142 1268366 1224688
62391 1224688 1185853 1151912 1122550 1096913 1074123 1053648 1035406 1019890 1007901 999480 993261 987598
62379 987598 982309 978425 976036 973352 968460 961251 952899 944149 935088 926118 917808 909680 900253 888831
62365 888831 876515 864996 854934 846000 837960 830932 824780 818878 812610 805769 798514 791281 784797
62352 784797 779802 776481 774192 771866 768842 765367 762217 759811 757910 756391 755958 757497 760805 764648
62338 764648 768254 772130 777057 782911 788972 794875 800635 806198 811778 818391 827117 837799 849255 860945
62324 860945 873629 888069 903732 919327 934253 949059 964773 982244 1001975 1024156 1048758
$$ packed form
62414B339094K4940J2719J206q165j6658k6249l7141m8193n8672o8212p5791q0222
62402A958656q1562q0975p9313p6699p3315o9551o5351o0276n4472m8776m3678
62391A224688l8835l3941k9362k5637k2790k0475j8242j5516j1989q421o219n663
62379I87598n289l884k389k684m892p209q352q750r061q970q310q128r427j1422
62365H88831j2316j1519j0062q934q040p028o152n902o268o841p255p233o484
62352G84797m995l321k289k326l024l475l150k406j901j519m33J539L308L843
62338G64648L606L876M927N854O061N903N760N563N580O613Q726J0682J1456J1690
62324H60945J2684J4440J5663J5595J4926J4806J5714J7471J9731K2181K4602
$$ plain form
62313 1048758 1075718 1104992 1136367 1169449 1204061 1240590 1279889 1323012 1371065 1424911 1484781
62302 1484781 1550466 1622070 1700089 1784267 1872716 1962802 2052669 2141213 2226635 2305911 2375892
62291 2375892 2434283 2479423 2510288 2527543 2533783 2531390 2520124 2497695 2462721 2416255 2360489 2297213
62279 2297213 2228087 2155387 2081442 2007725 1935275 1865653 1800612 1740938 1686347 1636480 1591271
62268 1591271 1550318 1512707 1477763 1445394 1415341 1386517 1357425 1327075 1295339 1262780 1230290
62257 1230290 1198647 1168295 1139690 1113631 1090647 1070067 1050377 1030743 1011652 993926 977848
62246 977848 963627 951849 942696 935269 928525 922560 918115 914989 911914 908185 904694 903043 904049 907373
62232 907373 912187 917824 923859 929868 935496 941026 947708 956843 968297 980570 992791 1005927 1021234
$$ packed form
62313A048758K6960K9274L1375L3082L4612L6529L9299M3123M8053N3846N9870
62302A484781O5685P1604P8019Q4178Q8449R0086Q9867Q8544Q5422P9276O9981
62291B375892N8391M5140L0865J7255O240k393j1266k2429l4974m6466n5766o3276
62279B297213o9126p2700p3945p3717p2450o9622o5041n9674n4591m9867m5209
62268A591271m0953l7611l4944l2369l0053k8824k9092l0350l1736l2559l2490
62257A230290l1643l0352k8605k6059k2984k0580j9690j9634j9091j7726j6078
62246I77848j4221j1778r153p427o744n965m445l126l075l729l491j651J006L324
62232I07373M814N637O035O009N628N530O682R135J1454J2273J2221J3136J5307
$$ plain form
62219 1021234 1038117 1054684 1070221 1085934 1103209 1122282 1142889 1165064 1188743 1213692 1240679
62208 1240679 1271932 1309443 1353120 1401316 1452814 1507685 1566761 1631189 1702189 1780207 1864222
62197 1864222 1952568 2044225 2138291 2232142 2321190 2401037 2469275 2524922 2567048 2594732 2607882
62186 2607882 2607223 2593582 2567736 2530729 2483689 2427258 2361672 2287466 2205751 2118027 2026429 1934298
62174 1934298 1845639 1763204 1687065 1615500 1547270 1482918 1423973 1371330 1324516 1282291 1243697
62163 1243697 1208509 1176832 1148598 1123674 1102309 1085019 1071790 1061626 1053117 1045344 1038095 1031479
62151 1031479 1025693 1021044 1017776 1015863 1015280 1016446 1019941 1025693 1032903 1041134 1051109 1063927 1079580 1096779
62137 1096779 1114485 1133277 1154727 1179344 1205503 1230734 1253876 1275531 1296431 1316103 1333693
$$ packed form
62219A021234J6883J6567J5537J5713J7275J9073K0607K2175K3679K4949K6987
62208A240679L1253L7511M3677M8196N1498N4871N9076O4428P1000P8018Q4015
62197A864222Q8346R1657R4066R3851Q9048P9847O8238N5647M2126K7684J3150
62186B607882o59j3641k5846l7007m7040n6431o5586p4206q1715q7724r1598r2131
62174A934298q8659q2435p6139p1565o8230o4352n8945n2643m6814m2225l8594
62163A243697l5188l1677k8234k4924k1365j7290j3229j0164q509p773p249o616
62151A031479n786m649l268j913n83J166L495N752P210Q231R975J2818J5653J7199
62137A096779J7706J8792K1450K4617K6159K5231K3142K1655K0900J9672J7590
$$ plain form
62126 1333693 1349618 1365592 1382962 1401562 1420218 1437728 1453137 1465844 1476149 1485507 1495840
62115 1495840 1508674 1525169 1546556 1573882 1607230 1645717 1688551 1735965 1788844 1847393 1910266
62104 1910266 1974937 2038606 2098580 2152155 2197020 2232093 2257403 2272852 2277834 2272707 2259591 2240275
62092 2240275 2213746 2177446 2131161 2078089 2021630 1962801 1901674 1839755 1779497 1722451 1669241
62081 1669241 1620495 1576381 1536043 1499125 1467295 1442510 1424177 1409858 1398506 1390846 1386381 1382467
62069 1382467 1377452 1372815 1370868 1371869 1374884 1380106 1388148 1397581 1405298 1409623 1411600 1412766 1412972 1411241
62055 1411241 1407906 1404716 1402745 1400829 1396455 1388036 1376130 1362543 1348681 1335054 1322017 1310356
62043 1310356 1301047 1294834 1292098 1292788 1296418 1302430 1310546 1320415 1331164 1342020 1353330 1366158 1380738
$$ packed form
62126A333693J5925J5974J7370J8600J8656J7510J5409J2707J0305R358J0333
62115A495840J2834J6495K1387K7326L3348L8487M2834M7414N2879N8549O2873
62104A910266O4671O3669N9974N3575M4865L5073K5310J5449M982n127j3116j9316
62092B240275k6529l6300m6285n3072n6459n8829o1127o1919o0258n7046n3210
62081A669241m8746m4114m0338l6918l1830k4785j8333j4319j1352p660m465l914
62069A382467n015m637j947J001L015N222Q042R433P717M325J977J166K06j731
62055A411241l335l190j971j916m374q419j1906j3587j3862j3627j3037j1661
62043A310356r309o213k736O90L630O012Q116R869J0749J0856J1310J2828J4580
$$ plain form
62030 1380738 1396099 1411518 1427518 1445018 1464277 1485156 1507625 1531196 1554568 1576878 1599127
62019 1599127 1623602 1651844 1683689 1718109 1754408 1792598 1833105 1876296 1922175 1970450 2020710
62008 2020710 2072259 2124037 2175401 2226883 2279210 2331331 2380340 2423661 2460210 2488920 2507646
61997 2507646 2514924 2512044 2502010 2486795 2466470 2440127 2406276 2363129 2310494 2251307 2189564 2126569
61985 2126569 2060831 1991871 1922224 1854852 1790137 1726671 1663955 1603058 1545183 1490729 1439610
61974 1439610 1391687 1347020 1306133 1269825 1238343 1210920 1186306 1163387 1141274 1119528 1098582
61963 1098582 1079133 1060725 1041771 1021592 1001589 983549 967448 951931 936413 921604 908178
61952 908178 896115 885429 876583 869858 865005 861728 859988 859705 860660 862760 865718 868423 869433 868548
$$ packed form
62030A380738J5361J5419J6000J7500J9259K0879K2469K3571K3372K2310K2249
62019A599127K4475K8242L1845L4420L6299L8190M0507M3191M5879M8275N0260
62008B020710N1549N1778N1364N1482N2327N2121M9009M3321L6549K8710J8726
61997B507646P278k880j0034j5215k0325k6343l3851m3147n2635n9187o1743o2995
61985B126569o5738o8960o9647o7372o4715o3466o2716o0897n7875n4454n1119
61974A439610m7923m4667m0887l6308l1482k7423k4614k2919k2113k1746k0946
61963A098582j9449j8408j8954k0179k0003j8040j6101j5517j5518j4809j3426
61952I08178j2063j0686q846o725m853l277j740k83R55K100K958K705J010q85
$$ plain form
61938 868548 867296 867272 868354 869040 868292 866412 864157 861556 857892 852593 845819 838113 829672 820152 809383
61923 809383 798046 787399 778299 770788 764674 760029 756790 754295 751954 750326 750777 753639 757263 759504
61909 759504 759951 760179 761950 765749 771014 776963 782760 787559 791105 794101 797537 801723 806324 811069 816063
61894 816063 821648 828472 837354 848430 860546 872263 883503 895580 909627 925891 944653 966671
61882 966671 991988 1019111 1046300 1073275 1100869 1129434 1158448 1187368 1215752 1242446 1265684
61871 1265684 1284428 1299002 1310149 1318169 1323339 1326423 1328031 1327958 1325849 1322226 1318004 1313160 1306819 1298937
61857 1298937 1291158 1285504 1282682 1282176 1283630 1287565 1294768 1305442 1318917 1333875 1348839 1362788 1375266
61844 1375266 1385781 1393331 1397010 1396869 1393561 1387138 1376889 1362571 1345043 1325290 1303490 1279656
$$ packed form
61938H68548j252k4J082O86p48j880k255k601l664n299o774p706q441r520j0769
61923H09383j1337j0647r100p511o114m645l239k495k341j628M51K862L624K241
61909G59504M47K28J771L799N265N949N797M799L546K996L436M186M601M745M994
61894H16063N585O824Q882J1076J2116J1717J1240J2077J4047J6264J8762K2018
61882I66671K5317K7123K7189K6975K7594K8565K9014K8920K8384K6694K3238
61871A265684J8744J4574J1147Q020N170L084J608p3k109l623m222m844o341p882
61857A298937p779n654k822n06J454L935P203J0674J3475J4958J4964J3949J2478
61844A375266J0515P550L679j41l308o423j0249j4318j7528j9753k1800k3834
$$ plain form
61832 1279656 1254721 1230228 1207108 1185335 1164547 1144403 1124565 1105041 1086497 1069505 1053471
61821 1053471 1037160 1020547 1005318 992949 982753 972544 961155 949792 940810 935455 932941 931550
61809 931550 930372 929855 930891 933863 938694 945452 954527 966509 982087 1001620 1024377 1048716 1073709
61796 1073709 1100231 1129695 1162060 1196040 1231099 1267991 1307120 1347529 1387952 1427860 1466862
61785 1466862 1503894 1537671 1567258 1591675 1609844 1621723 1628757 1632244 1631943 1627405 1620235 1613640 1609780
61772 1609780 1608742 1610209 1614853 1623408 1635320 1649206 1664318 1680722 1698036 1714524 1727708 1735771
61760 1735771 1738268 1735597 1727895 1714430 1693891 1665309 1629121 1587682 1544328 1501197 1457896 1412897
61748 1412897 1366273 1320341 1277468 1238075 1201230 1166394 1133921 1104460 1078607 1056670 1038045
$$ packed form
61832A279656k4935k4493k3120k1773k0788k0144j9838j9524j8544j6992j6034
61821A053471j6311j6613j5229j2369j0196j0209j1389j1363q982n355k514j391
61809I31550j178n17J036K972M831O758R075J1982J5578J9533K2757K4339K4993
61796A073709K6522K9464L2365L3980L5059L6892L9129M0409M0423L9908L9002
61785A466862L7032L3777K9587K4417J8169J1879P034L487l01m538p170o595l860
61772A609780j038J467M644Q555J1912J3886J5112J6404J7314J6488J3184Q063
61760A735771K497k671p702j3465k0539k8582l6188m1439m3354m3131m3301m4999
61748A412897m6624m5932m2873l9393l6845l4836l2473k9461k5853k1937j8625
$$ plain form
61737 1038045 1021189 1004813 988785 973449 958811 945147 933524 924347 915795 905109 891546 877075
61725 877075 864267 854489 847873 843517 839513 834199 827962 822694 819099 815766 811501 807237 804615 803583
61711 803583 802557 800371 797158 793765 791179 790183 790765 792063 793373 794734 796104 796747 796312 795756 796083 796728
61695 796728 796446 795431 795050 795478 795165 793128 790384 788316 786766 784750 782346 780668 780286 780791 781911 783981
61679 783981 786956 789768 791348 791886 792481 793669 794952 795869 796891 798813 801657 804809 808078 811902 816357
61664 816357 820625 823895 826366 828860 831751 834754 837569 840138 842391 844346 846437 849117 851984 853989
61650 853989 854866 855749 857717 860048 860636 858097 852831 845964 837989 828980 819600 811075 804079 798235 792836
61635 792836 787519 781904 775143 766614 757066 748423 742097 737717 733735 729158 724532 721271 720005 719597
$$ packed form
61737A038045j6856j6376j6028j5336j4638j3664j1623r177q552j0686j3563j4471
61725H77075j2808r778o616m356m004n314o237n268l595l333m265m264k622j032
61711H03583j026k186l213l393k586r96N82J298J310J361J370O43m35n56L27O45
61695G96728k82j015l81M28l13k037k744k068j550k016k404j678l82N05J120K070
61679G83981K975K812J580N38N95J188J283R17J022J922K844L152L269L824M455
61664H16357M268L270K471K494K891L003K815K569K253J955K091K680K867K005
61650H53989Q77Q83J968K331N88k539n266o867p975r009r380q525o996n844n399
61635G92836n317n615o761q529r548q643o326m380l982m577m626l261j266m08
$$ plain form
61621 719597 717969 714180 709553 706436 705889 706876 707559 706903 705065 702893 701274 700476 699848 698526 696504 694449
61605 694449 692378 689469 685683 682680 682215 684103 686664 688745 690328 691410 691561 690837 690191 690508 691693
61590 691693 692953 693539 693288 693004 694230 697816 702680 706831 709764 712756 716526 719844 721301 721448 721982
61575 721982 723390 724501 723969 721185 716087 709414 703167 699435 698202 697240 694745 691362 688953 687959 686861
61560 686861 684023 679366 674173 669829 666953 665316 664113 662296 659013 654149 648520 643254 638722 634202
61546 634202 628809 622562 616237 610376 604921 599636 594251 588120 580533 571745 563194 556195 550752 546042
61532 546042 541635 537661 534119 530734 527397 524046 520058 514560 507757 501414 497402 495868 495254 494067
61518 494067 492263 490737 489837 488808 486748 483778 480930 478987 477818 476837 475692 474341 472953 472140 472806
$$ packed form
61621G19597j628l789m627l117n47R87O83o56j838k172j619p98o28j322k022k055
61605F94449k071k909l786l003m65J888K561K081J583J082J51p24o46L17J185
61590F91693J260N86k51k84J226L586M864M151K933K992L770L318J457J47N34
61575G21982J408J111n32k784n098o673o247l732j233r62k495l383k409r94j098
61560F86861k838m657n193m344k876j637j203j817l283m864n629n266m532m520
61546F34202n393o247o325n861n455n285n385o131p587q788q551o999n443m710
61532E46042m407l974l542l385l337l351l988n498o803o343m012j534o14j187
61518D94067j804j526r00j029k060k970k848j943j169r81j145j351j388q13O66
$$ plain form
61503 472806 475076 477632 478967 479330 480535 483500 486825 488466 488203 487617 488070 489736 492422 496002 499538
61488 499538 501153 499975 497755 497373 499614 502435 503801 504249 505814 509007 512080 513299 512908 512408 512685
61473 512685 513561 514648 515751 516555 516702 516376 516178 516155 515429 513234 510066 507409 506334 506641 507314 507515 507004
61456 507004 505858 504296 503011 503191 505449 508554 509953 508154 504253 500631 498504 497368 496462 495731 495303
61441 495303 495057 495077 495775 497078 498052 497844 496560 494908 493438 492455 492104 492146 492231 492763 494701 497908 500514
61424 500514 501026 500493 501346 504289 507621 509740 511132 513341 516861 520726 523767 525717 527208 529029 531438
61409 531438 534161 537002 540019 542791 544098 543129 540791 538971 538464 538476 538200 537955 538401 539429 540313 540457
61393 540457 539650 538098 536498 535656 535830 536906 539111 542666 546617 549187 549891 550266 551790 554073 556069
$$ packed form
61503D72806K270K556J335L63J205K965L325J641k63n86M53J666K686L580L536
61488D99538J615j178k220l82K241K821J366M48J565L193L073J219l91n00K77
61473E12685Q76J087J103Q04J47l26j98k3p26k195l168k657j075L07O73K01n11
61456E07004j146j562j285J80K258L105J399j799l901l622k127j136r06p31m28
61441D95303k46K0O98J303R74k08j284j652j470r83l51M2Q5N32J938L207K606
61424E00514N12n33Q53K943L332K119J392K209L520L865L041J950J491J821K409
61409E31438K723K841L017K772J307r69k338j820n07J2k76k45M46J028Q84J44
61393E40457q07j552j600q42J74J076K205L555L951K570P04L75J524K283J996
$$ plain form
61378 556069 558084 561161 565064 568513 571278 574555 579048 584007 588523 592463 595565 596861 596054 594660
61364 594660 594665 596419 598738 600714 602412 604064 605736 607939 611374 615562 618701 619724 619829 620940 623029
61349 623029 624073 622688 619649 616428 613292 609677 605742 602537 600764 600151 600004 599726 598779 596805 594004
61334 594004 591115 589029 588578 590293 593704 597148 599137 599869 600657 601954 602934 603167 603486 604758 606763 608956
61318 608956 611377 613948 615684 615733 614884 615050 617383 621528 626417 630900 633849 634690 634180 634030 635501 638660
61302 638660 642966 648048 653759 659857 665978 671920 678034 685201 694096 704404 715188 726207 738209
61289 738209 751590 765460 778618 790801 802147 812047 819709 825673 831596 838308 844884 849906 853098
61276 853098 855497 858408 862238 866085 868610 869570 870071 870814 870729 868224 863411 858173 854295 852491 852820 854698
$$ packed form
61378E56069K015L077L903L449K765L277M493M959M516L940L102J296q07j394
61364E94660NJ754K319J976J698J652J672K203L435M188L139J023J05J111K089
61349F23029J044j385l039l221l136l615l935l205j773o13j47k78r47j974k801
61334E94004k889k086m51J715L411L444J989P32P88J297R80K33L19J272K005K193
61318F08956K421K571J736M9q49J66K333M145M889M483K949Q41n10j50J471L159
61302F38660M306N082N711O098O121N942O114P167Q895J0308J0784J1019J2002
61289G38209J3381J3870J3158J2183J1346R900P662N964N923O712O576N022L192
61276H53098K399K911L830L847K525R60N01P43q5k505m813n238l878j804L29J878
$$ plain form
61260 854698 856649 857570 858503 861746 867850 874910 881386 888110 896558 906547 917046 928254 941181 955565
61246 955565 969745 982701 995008 1007439 1019528 1029912 1037535 1042166 1044107 1043763 1041439 1037404 1032014
61233 1032014 1025572 1018074 1009431 1000035 990737 982072 973885 965904 958267 951254 944991 939757 936076 933991
61219 933991 932646 931093 929314 928032 927804 928651 930274 932205 934098 936280 939615 944296 949205 953171 956632
61204 956632 961307 968305 977164 986622 995628 1003651 1010771 1017741 1025440 1034007 1042832 1051360 1059364 1066349
61190 1066349 1071428 1074321 1076073 1078060 1080233 1080797 1077997 1072197 1065953 1061907 1060646 1060686 1060310 1059020 1057254
61175 1057254 1055401 1053630 1052438 1052766 1055356 1060176 1066507 1073470 1080492 1087352 1093912 1100041 1106097 1113238
61161 1113238 1122571 1133679 1144521 1153278 1160093 1166586 1173907 1181732 1189041 1195432 1201586 1208590 1216753
$$ packed form
61260H54698J951R21R33L243O104P060O476O724Q448R989J0499J1208J2927J4384
61246I55565J4180J2956J2307J2431J2089J0384P623M631J941l44k324m035n390
61233A032014o442p498q643r396r298q665q187p981p637p013o263n234l681k085
61219I33991j345j553j779j282k28Q47J623J931J893K182L335M681M909L966L461
61204I56632M675O998Q859R458R006Q023P120O970P699Q567Q825Q528Q004O985
61190A066349N079K893J752J987K173N64k800n800o244m046j261M0l76j290j766
61175A057254j853j771j192L28K590M820O331O963P022O860O560O129O056P141
61161A113238R333J1108J0842Q757O815O493P321P825P309O391O154P004Q163
$$ plain form
61148 1216753 1224991 1231628 1236074 1239531 1243869 1250138 1258451 1268815 1281301 1295419 1310105 1324809 1340474
61135 1340474 1359001 1381455 1406618 1431336 1452552 1469152 1481873 1491826 1499674 1506132 1512289 1518805
61123 1518805 1525180 1530337 1533652 1535067 1534520 1531796 1526819 1519905 1511988 1504621 1498949 1494206 1487905 1478237
61109 1478237 1465886 1452771 1439575 1425419 1409553 1392200 1373801 1354568 1335003 1315934 1297676
61098 1297676 1279872 1262461 1246104 1231325 1217901 1205627 1195169 1187480 1182510 1178940 1175250 1170856
61086 1170856 1166210 1161928 1157911 1153337 1147412 1139944 1131317 1122372 1114473 1109047 1106500 1105969 1106619 1108784
61072 1108784 1113245 1119808 1127421 1135518 1144411 1154525 1166169 1180145 1197637 1219095 1243838 1270956
61060 1270956 1300076 1331080 1363728 1397867 1433479 1470312 1507904 1546179 1585414 1625392 1665119
$$ packed form
61148A216753Q238O637M446L457M338O269Q313J0364J2486J4118J4686J4704J5665
61135A340474J8527K2454K5163K4718K1216J6600J2721R953P848O458O157O516
61123A518805O375N157L315J415n47k724m977o914p917p367n672m743o301r668
61109A478237j2351j3115j3196j4156j5866j7353j8399j9233j9565j9069j8258
61098A297676j7804j7411j6357j4779j3424j2274j0458p689m970l570l690m394
61086A170856m646m282m017m574n925p468q627q945p899n426k547n31O50K165
61072A108784M461O563P613Q097Q893J0114J1644J3976J7492K1458K4743K7118
61060A270956K9120L1004L2648L4139L5612L6833L7592L8275L9235L9978L9727
$$ plain form
61049 1665119 1703693 1740925 1776786 1810760 1842196 1870881 1896670 1918699 1935469 1945836 1949728
61038 1949728 1947878 1941044 1929627 1914029 1895122 1873890 1850580 1824711 1796159 1765712 1734180 1701650
61026 1701650 1668230 1634925 1602850 1572054 1542115 1513481 1486984 1462303 1438364 1415400 1395123
61015 1395123 1378392 1364140 1351353 1340893 1334342 1331862 1332241 1334473 1338338 1343781 1350638 1358851 1368377
61002 1368377 1379080 1391255 1406009 1424561 1447178 1473102 1501403 1531723 1564388 1599966 1638462
60991 1638462 1679008 1720979 1765610 1815760 1873483 1938134 2007285 2079229 2154296 2234117 2320115
60980 2320115 2412601 2511043 2615112 2725332 2842483 2966581 3096837 3232433 3372947 3518486
60970 3518486 3670182 3830265 4000783 4182487 4375880 4582890 4806137 5046838 5305020
$$ packed form
61049A665119L8574L7232L5861L3974L1436K8685K5789K2029J6770J0367L892
61038A949728j850o834j1417j5598j8907k1232k3310k5869k8552l0447l1532l2530
61026A701650l3420l3305l2075l0796k9939k8634k6497k4681k3939k2964k0277
61015A395123j6731j4252j2787j0460o551k480L79K232L865N443O857Q213R526
61002A368377J0703J2175J4754J8552K2617K5924K8301L0320L2665L5578L8496
60991A638462M0546M1971M4631N0150N7723O4651O9151P1944P5067P9821Q5998
60980B320115R2486R8442J04069J10220J17151J24098J30256J35596J40514J45539
60970C518486J51696J60083J70518J81704J93393K07010K23247K40701K58182
$$ plain form
60961 5305020 5581884 5880649 6205508 6561997 6958681 7406489 7916288 8499547 9171362
60952 9171362 9949089 10846626 11873080 13037621 14350734 15820033 17454002 19273323
60944 19273323 21297015 23480974 25654665 27543094 28895376 29624145 29834842 29733661
60936 29733661 29518725 29342348 29317294 29487006 29757976 29886941 29586093 28682165 27198988
60927 27198988 25309104 23221885 21105597 19071903 17187662 15483663 13962457 12612269
60919 12612269 11418980 10368463 9445162 8634194 7923778 7303033 6758843 6277286 5847250
60910 5847250 5460850 5111375 4792854 4501206 4234074 3989425 3765265 3560447 3374659
60901 3374659 3207406 3057335 2922362 2800098 2688361 2585399 2489483 2398736 2312219 2230856
$$ packed form
60961E305020K76864K98765L24859L56489L96684M47808N09799N83259O71815
60952I171362P77727Q97537J026454J164541J313113J469299J633969J819321
60944A9273323K023692K183959K173691J888429J352282P28769K10697j01181
60936B9733661k14936j76377k5054J69712K70970J28965l00848r03928j483177
60927B7198988j889884k087219k116288k033694j884241j703999j521206j350188
60919A2612269j193289j050517r23301q10968p10416o20745n44190m81557m30036
60910E847250l86400l49475l18521k91648k67132k44649k24160k04818j85788
60901C374659j67253j50071j34973j22264j11737j02962r5916r0747q6517q1363
$$ plain form
60891 2230856 2156036 2087320 2022870 1962282 1907318 1859183 1816567 1777262 1740448 1706292 1674399
60880 1674399 1643898 1614520 1586556 1560139 1535123 1511194 1487724 1464311 1441831 1421953 1405032
60869 1405032 1389568 1374264 1359357 1345245 1331291 1317283 1304745 1295208 1288009 1281372 1274973 1269866
60857 1269866 1266385 1263783 1261833 1261314 1262808 1266159 1271216 1278286 1287963 1301137 1318661 1339946 1362424
60844 1362424 1383699 1404017 1425458 1449031 1474057 1500239 1528537 1559428 1591694 1623760 1655369
60833 1655369 1687242 1719737 1752477 1784807 1816130 1846035 1874321 1900712 1924488 1944768 1961127
60822 1961127 1973498 1981544 1984628 1982445 1975260 1963613 1948179 1929756 1908822 1885173 1858421 1828733
60810 1828733 1796802 1763473 1729849 1697195 1666003 1635674 1605849 1577360 1550700 1524218 1495508
$$ packed form
60891B230856p4820o8716o4450o0588n4964m8135m2616l9305l6814l4156l1893
60880A674399l0501k9378k7964k6417k5016k3929k3470k3413k2480j9878j6921
60869A405032j5464j5304j4907j4112j3954j4008j2538r537p199o637o399n107
60857A269866l481k602j950n19J494L351N057P070R677J3174J7524K1285K2478
60844A362424K1275K0318K1441K3573K5026K6182K8298L0891L2266L2066L1609
60833A655369L1873L2495L2740L2330L1323K9905K8286K6391K3776K0280J6359
60822A961127J2371Q046L084k183p185j1647j5434j8423k0934k3649k6752k9688
60810A828733l1931l3329l3624l2654l1192l0329k9825k8489k6660k6482k8710
$$ plain form
60799 1495508 1464519 1433652 1404629 1376910 1349696 1323698 1299748 1276825 1252883 1227150 1200618
60788 1200618 1174553 1149405 1125016 1101272 1078471 1057220 1037701 1018995 999768 979855 960513
60777 960513 942757 926243 910393 895819 883644 873758 864654 854938 844321 833263 822407 812476
60765 812476 804093 797301 791477 785870 780128 774382 769071 764690 761466 759070 756767 754034 751176 749315
60751 749315 749490 751585 754230 755999 756656 757066 758183 760439 763803 767782 771463 774144 775906 776978 776693
60736 776693 774017 769375 764949 762493 761523 760305 758080 755457 753027 750547 747532 743902 739891 735763
60722 735763 731761 727897 723768 718941 713625 708517 703924 699499 695112 691494 689500 688855 688125 686112 683004
60707 683004 680086 678555 678714 679912 680899 680450 678171 674809 671473 668507 665401 661730 657774 654251 651938
$$ packed form
60799A495508l0989l0867k9023k7719k7214k5998k3950k2923k3942k5733k6532
60788A200618k6065k5148k4389k3744k2801k1251j9519j8706j9227j9913j9342
60777I60513j7756j6514j5850j4574j2175r886r104r716j0617j1058j0856r931
60765H12476q383o792n824n607n742n746n311m381l224k396k303k733k858j861
60751G49315J75K095K645J769O57M10J117K256L364L979L681K681J762J072k85
60736G76693k676m642m426k456r70j218k225k623k430k480l015l630m011m128
60722G35763m002l864m129m827n316n108m593m425m387l618j994o45p30k013l108
60707F83004k918j531J59J198R87m49k279l362l336k966l106l671l956l523k313
$$ plain form
60692 651938 651475 652724 654143 653893 652248 652051 655825 662996 670913 677830 683524 687465 688396 686190 682596
60677 682596 679316 676376 673140 669801 666825 663679 659350 653893 648465 643855 639780 635646 631282 626774
60663 626774 622159 617552 613240 609344 605558 601429 596901 592411 588370 584650 580877 577221 574430 572754
60649 572754 571303 569046 566119 563450 561298 559118 556803 555013 554032 553394 553099 554170 557119 560648 562874
60634 562874 563430 563451 563762 564112 564262 564909 567081 570912 575358 579157 582129 585480 590546 597153 603625 608633
60618 608633 612615 617061 622824 629536 636329 642556 648069 653207 658440 663717 668446 672325 675797 679259
60604 679259 682268 684150 685052 685726 686397 686518 685662 684190 683000 682939 684311 686541 688470 689476 690233 691902
60588 691902 694627 697307 698881 699270 698903 697753 695210 690784 684705 677815 670936 664372 658061 651964 646088
$$ packed form
60692F51938m63J249J419k50j645j97L774P171P917O917N694L941R31k206l594
60677F82596l280k940l236l339k976l146m329n457n428m610m075m134m364m508
60663F26774m615m607m312l896l786m129m528m490m041l720l773l656k791j676
60649E72754j451k257k927k669k152k180k315j790r81o38k95J071K949L529K226
60634E62874N56K1L11L50J50O47K172L831M446L799K972L351N066O607O472N008
60618F08633L982M446N763O712O793O227N513N138N233N277M729L879L472L462
60604F79259L009J882R02O74O71J21q56j472j190o1J372K230J929J006P57J669
60588F91902K725K680J574L89l67j150k543m426o079o890o879o564o311o097n876
$$ plain form
60573 646088 640279 634446 629006 624573 621108 618019 615309 613910 614393 615971 617394 618358 619357 620594 621774
60558 621774 622715 623411 623691 623546 623625 624609 626067 626597 625260 622437 619353 617283 617132 619134 622729 627061
60542 627061 631581 635862 639143 640762 641079 641361 642612 644956 648103 651741 655236 657473 657503 655339 652039
60527 652039 649084 647564 647722 649227 651768 655107 658686 661992 665591 670977 678775 687832 696921 706628
60513 706628 718431 732449 747375 762360 777524 792529 806008 816744 824290 828299 828561 826198
60501 826198 823523 821844 820346 817883 814953 813002 812547 813034 814084 815830 818292 821350 825337 830904 838257
60486 838257 847039 856894 867715 879350 891548 904259 917609 931405 944816 956615 965813 972230
60474 972230 976546 979657 981897 982992 982699 981264 979380 977964 977748 978607 979425 979227 978380 978100 978893 980318
$$ packed form
60573F46088n809n833n440m433l465l089k710j399M83J578J423R64R99J237J180
60558F21774R41O96K80j45P9R84J458N30j337k823l084k070j51K002L595M332
60542F27061M520M281L281J619L17K82J251K344L147L638L495K237L0k164l300
60527F52039k955j520J58J505K541L339L579L306L599N386P798R057R089R707
60513G06628J1803J4018J4926J4985J5164J5005J3479J0736P546M009K62k363
60501H26198k675j679j498k463k930j951m55M87J050J746K462L058L987N567P353
60486H38257Q782R855J0821J1635J2198J2711J3350J3796J3411J1799R198O417
60474I72230M316L111K240J095k93j435j884j416k16Q59Q18j98q47k80P93J425
$$ plain form
60458 980318 982236 985161 989035 992739 995519 998092 1001696 1006783 1013379 1021962 1033112 1046911 1063622
60445 1063622 1084418 1110306 1140569 1173438 1208283 1246066 1287544 1332025 1378082 1424348 1468968
60434 1468968 1509158 1542361 1567669 1585399 1595301 1595895 1585823 1565351 1536033 1499153 1455248 1405429
60422 1405429 1352582 1300498 1251802 1207052 1165577 1126480 1088934 1052524 1017865 986360 958878
60411 958878 935034 913972 895248 878519 863068 848296 834217 820822 807471 793816 780952
60400 780952 770532 762709 755896 748799 741783 735738 730344 724277 716920 709175 702505 697633 694336 692038
60386 692038 690139 687938 684905 681265 677846 674948 671876 668158 664745 663064 663116 663594 663827 664355 665197 664927
60370 664927 662388 658424 655010 653284 653249 654596 656793 658868 660163 661042 662011 662677 662550 662338 663243 665308
$$ packed form
60458I80318J918K925L874L704K780K573L604N087O596Q583J1150J3799J6711
60445A063622K0796K5888L0263L2869L4845L7783M1478M4481M6057M6266M4620
60434A468968M0190L3203K5308J7730R902N94j0072k0472k9318l6880m3905m9819
60422A405429n2847n2084m8696m4750m1475l9097l7546l6410l4659l1505k7482
60411I58878k3844k1062j8724j6729j5451j4772j4079j3395j3351j3655j2864
60400G80952j0420p823o813p097p016o045n394o067p357p745o670m872l297k298
60386F92038j899k201l033l640l419k898l072l718l413j681N2M78K33N28Q42k70
60370F64927k539l964l414j726l5J347K197K075J295Q79R69O66j27k12R05K065
$$ plain form
60354 665308 667676 670170 673249 676580 679155 680894 682597 684091 684120 682760 682365 684974 689856 694687 698295
60339 698295 701054 703305 704839 705800 706886 708444 710129 711701 713672 716992 722304 729440 737367 744684
60325 744684 750466 754621 757497 759536 761430 764045 767683 771688 775201 778138 781097 784476 787981 790854
60311 790854 792491 793126 794001 796368 800086 803766 806625 809515 813617 818863 824522 830780 838537 847775 857252
60296 857252 866086 874830 884669 896205 909258 923230 937223 950190 961292 969874 975140 976494 974409
60283 974409 970224 964641 956974 946608 934846 924531 917761 914334 912364 909967 906437 902343 898738
60270 898738 896043 893601 890434 886385 882248 878830 876271 874279 872583 870999 869504 868584 869209 872036 876739
60255 876739 882490 889080 897228 907720 920464 934528 949024 963969 980328 999107 1020207 1042091
$$ packed form
60354F65308K368K494L079L331K575J739J703J494K9j360l95K609M882M831L608
60339F98295K759K251J534R61J086J558J685J572J971L320N312P136P927P317
60325G44684N782M155K876K039J894K615L638M005L513K937K959L379L505K873
60311G90854J637O35Q75K367L718L680K859K890M102N246N659O258P757R238R477
60296H57252Q834Q744R839J1536J3053J3972J3993J2967J1102Q582N266J354k085
60283I74409m185n583p667j0366j1762j0315o770l427j970k397l530m094l605
60270H98738k695k442l167m049m137l418k559j992j696j584j495r20O25K827M703
60255H76739N751O590Q148J0492J2744J4064J4496J4945J6359J8779K1100K1884
$$ plain form
60243 1042091 1062648 1080262 1093938 1102678 1105243 1100759 1089469 1072772 1052605 1030703 1008267 986177
60231 986177 965322 946464 929789 915115 902824 894000 888963 885946 882183 876422 869732 863834 859426
60218 859426 856266 853773 850926 846458 840043 832816 825930 819081 811352 803117 795960 790724 786704 783033
60204 783033 779851 777600 775921 774041 771955 770537 770472 771423 772270 771986 770399 768412 767459 768373 770556 772394
60188 772394 772825 772508 773084 775123 777279 777919 777198 776730 777432 778720 779966 781495 783495 785038 785326 785251 786511
60171 786511 789480 793027 796225 799099 801747 803964 806011 808711 812384 816524 820832 825716 831396 837389
60157 837389 843417 850064 857977 867071 877133 888411 900717 912536 922251 930258 938816 949490 961444
60144 961444 972693 982504 991928 1002046 1012349 1021132 1027275 1031240 1034401 1037788 1041488 1044788 1046709
$$ packed form
60243A042091K0557J7614J3676Q740K565m484j1290j6697k0167k1902k2436k2090
60231I86177k0855j8858j6675j4674j2291q824n037l017l763n761o690n898m408
60218H59426l160k493k847m468o415p227o886o849p729q235p157n236m020l671
60204G83033l182k251j679j880k086j418o5R51Q47k84j587j987r53R14K183J838
60188G72394M31l17N76K039K156O40p21m68P02J288J246J529K000J543K88p5J260
60171G86511K969L547L198K874K648K217K047K700L673M140M308M884N680N993
60157H37389O028O647P913R094J0062J1278J2306J1819R715Q007Q558J0674J1954
60144I61444J1249R811R424J0118J0303Q783O143L965L161L387L700L300J921
$$ plain form
60131 1046709 1046810 1045688 1044225 1042180 1038242 1031916 1024490 1017337 1010177 1002173 993946 986812 980387 972865
60117 972865 963798 954809 947085 940007 933060 927232 923236 919854 915648 911186 907907 905637 903065 900133
60103 900133 898062 897074 895877 893757 891712 891008 891823 893836 897083 901444 906001 909661 912223 914435 917242
60088 917242 921136 925967 931191 936434 941704 946990 952105 957475 964592 974753 987392 1000440 1012259
60075 1012259 1022445 1030944 1037576 1042681 1047172 1051397 1054853 1057499 1060409 1064364 1068627 1072088 1075044 1078705
60061 1078705 1083187 1087165 1089678 1091305 1093179 1095596 1098159 1100775 1103668 1106503 1108132 1107528 1104696 1100547
60047 1100547 1096125 1092192 1089181 1086996 1084750 1081212 1075858 1069423 1063240 1058104 1053845 1049847 1045838 1042261
60033 1042261 1039877 1038886 1038548 1038019 1037482 1037829 1039105 1040051 1039791 1039294 1040264 1042760 1044892 1044980 1043288 1041304 1039890
$$ packed form
60131A046709J01j122j463k045l938o326p426p153p160q004q227p134o425p522
60117I72865r067q989p724p078o947n828l996l382m206m462l279k270k572k932
60103I00133k071r88j197k120k045p04Q15K013L247M361M557L660K562K212K807
60088I17242L894M831N224N243N270N286N115N370P117J0161J2639J3048J1819
60075A012259J0186Q499O632N105M491M225L456K646K910L955M263L461K956L661
60061A078705M482L978K513J627J874K417K563K616K893K835J629o04k832m149
60047A100547m422l933l011k185k246l538n354o435o183n136m259l998m009l577
60033A042261k384r91l38n29n37L47J276R46k60m97R70K496K132Q8j692j984j414
$$ plain form
60016 1039890 1038619 1036657 1033796 1030473 1026880 1022253 1015311 1005466 993419 980420 967419 955212 944873
60003 944873 937125 931277 925496 918470 910495 902867 896581 891706 887603 883512 879215 875358 873012 872708
59989 872708 873920 875648 877507 880272 885137 892226 900030 906819 912633 919173 927483 936554 944742 951702
59975 951702 958003 963520 967430 969506 970142 969153 965891 960773 955373 950348 944325 935613 924314 912012
59961 912012 900011 888698 878206 868731 860202 852211 844418 836765 829401 822637 816767 811668 806748
59948 806748 801529 796212 791476 787905 785657 784460 783736 782936 781867 780600 779121 777440 775975 775355 775749
59933 775749 776817 778462 781100 784991 789754 794801 799791 804366 807918 810091 811328 812507 814134 816003
59919 816003 817456 817840 816946 815158 812981 810470 807358 803648 799726 796057 793274 792281 793461 795856 798044
$$ packed form
60016A039890j271j962k861l323l593m627o942r845j2047j2999j3001j2207j0339
60003I44873p748n848n781p026p975p628o286m875m103m091m297l857k346l04
59989H72708J212J728J859K765M865P089P804O789N814O540Q310R071Q188O960
59975I51702O301N517L910K076O36r89l262n118n400n025o023q712j1299j2302
59961I12012j2001j1313j0492r475q529p991p793p653p364o764n870n099m920
59948H06748n219n317m736l571k248j197p24q00j069j267j479j681j465o20L94
59933G75749J068J645K638L891M763N047M990M575L552K173J237J179J627J869
59919H16003J453L84q94j788k177k511l112l710l922l669k783r93J180K395K188
$$ plain form
59904 798044 799807 801858 803836 804128 802335 800465 800533 802041 803174 803644 804687 806711 808666 809848 810841
59889 810841 812247 813660 814523 815142 816264 818231 820881 823692 825702 825968 824685 823358 823170 823416 822174
59874 822174 818601 814070 810825 809823 810227 810888 811713 813212 815205 816950 818652 821832 827505 834553 840655
59859 840655 844554 846822 848838 851828 856627 863382 871314 879478 887825 896875 906348 914890 921362 925624
59845 925624 927854 927930 926030 923263 921070 920218 920690 922216 924557 927617 931601 936756 942687 948390 953427
59830 953427 958640 965060 972450 979704 986521 993676 1001380 1008395 1013548 1017561 1022295 1028348 1034441 1039369
59816 1039369 1043401 1046943 1048764 1046937 1041395 1034296 1027714 1022079 1017191 1013393 1010781 1008297 1004851 1000886
59802 1000886 997774 996084 995607 996686 1000041 1005160 1010354 1014924 1020052 1026796 1034191 1040292 1044377 1047105
$$ packed form
59904G98044J763K051J978K92j793j870O8J508J133M70J043K024J955J182R93
59889H10841J406J413Q63O19J122J967K650K811K010K66j283j327j88K46j242
59874H22174l573m531l245j002M04O61Q25J499J993J745J702L180N673P048O102
59859H40655L899K268K016K990M799O755P932Q164Q347R050R473Q542O472M262
59845I25624K230P6j900k767k193q52M72J526K341L060L984N155N931N703N037
59830I53427N213O420P390P254O817P155P704P015N153M013M734O053O093M928
59816A039369M032L542J821j827n542p099o582n635m888l798k612k484l446l965
59802A000886l112j690m77J079L355N119N194M570N128O744P395O101M085K728
$$ plain form
59788 1047105 1048951 1049644 1049147 1048180 1047409 1046749 1045785 1044289 1041762 1036827 1028063 1015856 1002938 992324 984717
59773 984717 978545 972563 967438 964205 962165 959624 956347 953764 952455 950876 947366 942398 937676 933626
59759 933626 928996 922923 916295 910671 906446 902617 898188 893477 889871 888274 887938 887142 885067 882487 880390
59744 880390 878455 875541 871393 867098 863684 860840 857354 852562 847103 842350 839298 837911 837428 837212 837185
59729 837185 837495 838012 838424 838727 839216 839910 840265 839649 838032 836039 834382 833305 832450 831053 828401 824447
59713 824447 820238 817490 817350 819528 822820 826325 829718 832523 833969 834074 834180 835665 838412 841337 844176
59698 844176 847792 852629 857891 862720 867482 873276 880596 888976 897591 905722 912925 919259 925219 931013
59684 931013 936103 939849 942434 944752 947447 950416 953143 955097 955842 955199 953538 951763 950906 951703 954332
$$ packed form
59788A047105J846O93m97r67p71o60r64j496k527m935q764j2207j2918j0614p607
59773I84717o172n982n125l233k040k541l277k583j309j579l510m968m722m050
59759I33626m630o073o628n624m225l829m429m711l606j597l36p96k075k580k097
59744H80390j935k914m148m295l414k844l486m792n459m753l052j387m83k16k7
59729H37185L10N17M12L03M89O94L55o16j617j993j657j077q55j397k652l954
59713H24447m209k748j40K178L292L505L393K805J446J05J06J485K747K925K839
59698H44176L616M837N262M829M762N794P320Q380Q615Q131P203O334N960N794
59684I31013N090L746K585K318K695K969K727J954P45o43j661j775q57P97K629
$$ plain form
59669 954332 958278 962377 965167 965501 963282 959906 957687 958047 960050 961251 960256 958002 956260 955614 955475
59654 955475 955495 956030 957338 959025 960377 960830 960285 959390 959319 960693 962929 965172 967598 970920 974806 977882
59638 977882 979617 981280 984496 989462 995051 1000046 1003618 1005065 1004017 1001049 997657 995396 994959 995932 997324
59623 997324 998534 999856 1001862 1004307 1006021 1005999 1004135 1000698 995687 989197 982106 975725 970679 966396 961708
59608 961708 955873 949210 942900 937962 934253 930765 927035 923857 922248 922138 922604 923033 923446 923952 924683 926291
59592 926291 929656 934700 940085 944534 948148 951978 956512 960940 963857 964448 962958 960230 956870 952881
59578 952881 948069 942652 937255 932362 928084 924513 921996 920828 920793 921204 921405 921205 920854 920535 919821 917770
59562 917770 913832 908591 903289 898604 894227 889672 885072 880946 877501 874488 871567 868598 865747 863512
$$ packed form
59669I54332L946M099K790L34k219l376k219L60K003J201r95k254j742o46j39
59654I55475K0N35J308J687J352M53n45q95p1J374K236K243K426L322L886L076
59638I77882J735J663L216M966N589M995L572J447j048k968l392k261m37R73J392
59623I97324J210J322K006K445J714k2j864l437n011o490p091o381n046m283m688
59608I61708n835o663o310m938l709l488l730l178j609j10M66M29M13N06P31J608
59592I26291L365N044N385M449L614L830M534M428K917N91j490k728l360l989
59578I52881m812n417n397m893m278l571k517j168l5M11K01k00l51l19p14k051
59562I17770l938n241n302m685m377m555m600m126l445l013k921k969k851k235
$$ plain form
59548 863512 862406 862415 862911 863207 862957 862006 860466 859222 859596 861707 863658 863383 861172 859316 859159 859702 859544
59531 859544 858963 859059 859644 859280 857275 854512 852196 850713 849973 849920 850113 849463 847247 844145 841568 839936 838234
59514 838234 835471 832075 829495 828644 829100 829708 829596 828631 827315 826458 826661 827747 828754 828780 827920 827309 828275
59497 828275 831454 836383 841595 845465 847589 849372 852680 857791 863328 868408 874042 881787 891698 902614
59483 902614 914197 927607 944046 963571 985635 1009710 1034355 1056052 1070154 1073749 1067727 1056056
59471 1056056 1043069 1031254 1021239 1013312 1008371 1007223 1009427 1013449 1017980 1022737 1028007 1033913 1040210
59458 1040210 1046246 1050863 1052782 1051467 1047424 1041535 1034402 1026395 1017782 1008436 997964 986617 975681
59445 975681 966399 958727 951626 944292 936634 928998 922200 917468 915265 914200 912144 908795 906186 906254 908767
$$ packed form
59548H63512j106RM96K96k50r51j540j244L74K111J951k75k211j856j57N43j58
59531H59544n81R6N85l64k005k763k316j483p40n3J93o50k216l102k577j632j702
59514H38234k763l396k580q51M56O08j12r65j316q57K03J086J007K6q60o11R66
59497H28275L179M929N212L870K124J783L308N111N537N080N634P745R911J0916
59483I02614J1583J3410J6439J9525K2064K4075K4645K1697J4102L595o022j1671
59471A056056j2987j1815j0015p927m941j148K204M022M531M757N270N906O297
59458A040210O036M617J919j315m043n889p133q007q613r346j0472j1347j0936
59445I75681r282p672p101p334p658p636o798m732k203j065k056l349k609O8K513
$$ plain form
59430 908767 912171 915550 918885 922123 925168 928525 932862 938019 943365 949137 956360 965267 974914 984728
59416 984728 995322 1007005 1018494 1028180 1036077 1043199 1049277 1052555 1052174 1049690 1047644 1047411 1048978 1052034
59402 1052034 1056432 1061950 1068386 1075832 1084469 1094283 1105334 1117876 1131635 1145357 1157869 1169447
59390 1169447 1181376 1194208 1207140 1219010 1228992 1236203 1239595 1238753 1234212 1226689 1216634 1204775 1192221
59377 1192221 1179523 1166534 1153738 1142669 1133961 1125938 1116579 1106458 1098249 1093552 1091787 1092300 1095783
59364 1095783 1103005 1113612 1127129 1144035 1164831 1188979 1215675 1244779 1276137 1309159 1344340
59353 1344340 1383630 1426737 1467429 1496281 1508134 1505406 1493842 1477324 1457905 1438270 1421344
59342 1421344 1408349 1399687 1397139 1402179 1411202 1414871 1404361 1378002 1341200 1300913 1261340 1223957
$$ packed form
59430I08767L404L379L335L238L045L357M337N157N346N772P223Q907R647R814
59416I84728J0594J1683J1489R686P897P122O078L278l81k484k046k33J567L056
59402A052034M398N518O436P446Q637R814J1051J2542J3759J3722J2512J1578
59390A169447J1929J2832J2932J1870R982P211L392q42m541p523j0055j1859j2554
59377A192221j2698j2989j2796j1069q708q023r359j0121q209m697j765N13L483
59364A095783P222J0607J3517J6906K0796K4148K6696K9104L1358L3022L5181
59353A344340L9290M3107M0692K8852J1853k728j1564j6518j9419j9635j6926
59342A421344j2995q662k548N040R023L669j0510k6359l6802m0287l9573l7383
$$ plain form
59330 1223957 1189434 1158513 1131655 1108645 1088751 1071377 1056774 1045914 1039236 1035522 1032468 1028623
59318 1028623 1024578 1022023 1021744 1022770 1023540 1023693 1024428 1027091 1031806 1037766 1044486 1052092 1060379 1068423 1075541
59303 1075541 1082164 1089239 1097181 1105918 1115675 1126957 1139732 1153257 1166993 1181270 1196812 1213789
59291 1213789 1231630 1249743 1268243 1287825 1308853 1330700 1352241 1372969 1393238 1413259 1432251
59280 1432251 1448876 1462213 1471993 1478300 1481516 1482321 1481093 1477274 1469690 1457532 1440936 1420967 1399362
59267 1399362 1377823 1356958 1336177 1315219 1295328 1278071 1263366 1249871 1237295 1226967 1219788
59256 1219788 1214943 1211387 1209501 1210179 1213013 1216561 1220123 1224220 1229418 1235638 1242684 1250482 1258177 1263517
59242 1263517 1263810 1257788 1246543 1232573 1217828 1202718 1187019 1171368 1157150 1144924 1133740 1122455
$$ packed form
59330A223957l4523l0921k6858k3010j9894j7374j4603j0860o678l714l054l845
59318A028623m045k555k79J026P70J53P35K663M715N960O720P606Q287Q044P118
59303A075541O623P075P942Q737R757J1282J2775J3525J3736J4277J5542J6977
59291A213789J7841J8113J8500J9582K1028K1847K1541K0728K0269K0021J8992
59280A432251J6625J3337R780O307L216Q05j228l819p584j2158j6596j9969k1605
59267A399362k1539k0865k0781k0958j9891j7257j4705j3495j2576j0328p179
59256A219788m845l556j886O78K834L548L562M097N198O220P046P798P695N340
59242A263517K93o022j1245j3970j4745j5110j5699j5651j4218j2226j1184j1285
$$ plain form
59230 1122455 1111131 1100620 1091341 1083185 1076296 1071178 1068006 1066393 1065844 1066055 1066796 1067818 1068848 1069588
59216 1069588 1070200 1072087 1077482 1087395 1100267 1113577 1126564 1140436 1155892 1171591 1185534 1197086
59204 1197086 1206903 1215282 1221325 1223770 1222326 1218015 1212167 1205075 1195970 1184572 1172168 1160551 1150166
59191 1150166 1140204 1130420 1121705 1114567 1108175 1101723 1096060 1093030 1093445 1096375 1100202 1103737 1106546 1108934
59177 1108934 1111761 1115765 1120905 1126533 1132133 1137578 1142741 1147196 1150296 1151351 1150011 1146851 1143323 1140476
59163 1140476 1137680 1133212 1126302 1118186 1110910 1105552 1101857 1099117 1096761 1094269 1091167 1087437 1083651 1080429
59149 1080429 1077797 1075238 1072294 1068982 1065636 1062556 1059920 1057911 1056712 1056309 1056429 1056695 1056821 1056705 1056610 1057340
59133 1057340 1059828 1064061 1068421 1070614 1069673 1066885 1064498 1063611 1063703 1063995 1064655 1066358 1069120 1072212 1075166
$$ packed form
59230A122455j1324j0511r279q156o889n118l172j613n49K11P41J022J030P40
59216A069588O12J887N395R913J2872J3310J2987J3872J5456J5699J3943J1552
59204A197086R817Q379O043K445j444m311n848p092r105j1398j2404j1617j0385
59191A150166r962r784q715p138o392o452n663l030M15K930L827L535K809K388
59177A108934K827M004N140N628N600N445N163M455L100J055j340l160l528k847
59163A140476k796m468o910q116p276n358l695k740k356k492l102l730l786l222
59149A080429k632k559k944l312l346l080k636k009j199m03J20K66J26j16r5P30
59133A057340K488M233M360K193r41k788k387q87R2K92O60J703K762L092K954
$$ plain form
59118 1075166 1078325 1082235 1086861 1091660 1096202 1100547 1105284 1111360 1119562 1129727 1140608 1150961 1160708
59105 1160708 1170720 1181544 1192784 1203701 1213778 1222448 1228891 1232702 1234530 1235479 1235931 1235348 1233152
59092 1233152 1229286 1223853 1216705 1207657 1196924 1185195 1173428 1162524 1152858 1144051 1135571 1127485 1120051
59079 1120051 1112465 1103068 1091443 1079508 1069388 1060780 1051782 1042185 1034251 1029733 1027611 1025734 1023574
59066 1023574 1022085 1021711 1022023 1023012 1025351 1029403 1035139 1043026 1053711 1066510 1079287 1090409 1100088 1109532
59052 1109532 1119590 1130578 1142489 1154755 1166434 1177171 1187435 1197451 1206676 1214813 1222503 1230166
59040 1230166 1236793 1240832 1241964 1241236 1239740 1237898 1235778 1233367 1230603 1227665 1225121 1223425 1222509 1222169 1222223
59025 1222223 1221784 1219192 1213637 1206346 1199052 1191682 1182816 1172269 1161755 1152772 1145121 1138034 1131641 1126482
$$ packed form
59118A075166L159L910M626M799M542M345M737O076Q202J0165J0881J0353R747
59105A160708J0012J0824J1240J0917J0077Q670O443L811J828R49M52n83k196
59092A233152l866n433p148r048j0733j1729j1767j0904r666q807q480q086p434
59079A120051p586r397j1625j1935j0120q608q998r597p934m518k122j877k160
59066A023574j489l74L12R89K339M052N736P887J0685J2799J2777J1122R679R444
59052A109532J0058J0988J1911J2266J1679J0737J0264J0016R225Q137P690P663
59040A230166O627M039J132p28j496j842k120k411k764k938k544j696r16l40N4
59025A222223m39k592n555p291p294p370q866j0547j0514q983p651p087o393n159
$$ plain form
59011 1126482 1122302 1118214 1113723 1109018 1104480 1100337 1096617 1093155 1089866 1087164 1085697 1085431 1085459 1085241 1085706
58996 1085706 1088517 1094103 1100819 1106378 1109999 1112873 1116414 1120450 1123707 1125836 1127986 1130901 1133426 1133970
58982 1133970 1132983 1132728 1134505 1137192 1138917 1139284 1139398 1140287 1141983 1143985 1146151 1149002 1153188 1158727 1165156
58967 1165156 1172632 1182275 1194686 1208567 1221926 1234565 1248189 1263715 1279621 1293642 1305329 1316202
58955 1316202 1327861 1340575 1353204 1363878 1371115 1374937 1376818 1378186 1379276 1379736 1379894 1380760 1383076 1387027
58941 1387027 1392764 1400482 1409750 1419308 1428025 1435961 1444111 1452945 1461510 1468408 1473578 1478485 1484218 1490001
58927 1490001 1494221 1496426 1497465 1497917 1497471 1495998 1494258 1493192 1493234 1494589 1497372 1501150 1505195 1509795 1516520
58912 1516520 1526453 1538670 1551269 1563557 1576389 1590431 1604888 1618123 1629083 1637845 1645042 1651174
$$ packed form
59011A126482m180m088m491m705m538m143l720l462l289k702j467k66K8k18M65
58996A085706K811N586O716N559L621K874L541M036L257K129K150K915K525N44
58982A133970r87k55J777K687J725L67J14Q89J696K002K166K851M186N539O429
58967A165156P476R643J2411J3881J3359J2639J3624J5526J5906J4021J1687J0873
58955A316202J1659J2714J2629J0674P237L822J881J368J090M60J58Q66K316L951
58941A387027N737P718R268R558Q717P936Q150Q834Q565O898N170M907N733N783
58927A490001M220K205J039M52m46j473j740j066M2J355K783L778M045M600O725
58912A516520R933J2217J2599J2288J2832J4042J4457J3235J0960Q762P197O132
$$ plain form
58900 1651174 1656600 1661882 1667516 1673060 1676985 1677880 1675449 1669841 1660569 1647024 1629827 1610687 1590986
58887 1590986 1571487 1553251 1537504 1524259 1512208 1500431 1489191 1478740 1468554 1458366 1448853
58876 1448853 1440512 1432766 1424939 1417247 1410060 1403140 1396558 1391567 1389448 1389936 1391583 1393184 1394299 1395148
58862 1395148 1396790 1400583 1406567 1413054 1418688 1424151 1430992 1439740 1450318 1463199 1478501 1494576 1509332
58849 1509332 1522758 1536648 1552033 1568401 1585232 1602511 1619539 1634974 1648614 1661737 1675013
58838 1675013 1687274 1697093 1704655 1711407 1718662 1727190 1737567 1750224 1765446 1783589 1804918 1829083
58826 1829083 1855201 1882445 1909933 1936167 1959480 1979216 1995647 2008548 2016797 2019798 2018340 2013394
58814 2013394 2004690 1991095 1971940 1947429 1918241 1885357 1850136 1814049 1778267 1743564 1710312
$$ packed form
58900A651174N426N282N634N544L925Q95k431n608r272j3545j7197j9140j9701
58887A590986j9499j8236j5747j3245j2051j1777j1240j0451j0186j0188r513
58876A448853q341p746p827p692p187o920o582m991k119M88J647J601J115Q49
58862A395148J642L793N984O487N634N463O841Q748J0578J2881J5302J6075J4756
58849A509332J3426J3890J5385J6368J6831J7279J7028J5435J3640J3123J3276
58838A675013J2261R819P562O752P255Q528J0377J2657J5222J8143K1329K4165
58826A829083K6118K7244K7488K6234K3313J9736J6431J2901Q249L001j458m946
58814B013394q704j3595j9155k4511k9188l2884l5221l6087l5782l4703l3252
$$ plain form
58803 1710312 1678411 1647498 1617385 1588108 1559625 1531969 1505761 1481906 1460339 1439486 1417568
58792 1417568 1394394 1371524 1350634 1331999 1314741 1298332 1283272 1269952 1257350 1243717 1228677
58781 1228677 1213792 1200624 1188995 1177721 1166299 1155020 1143965 1132987 1122543 1113571 1106482 1100897
58769 1100897 1096278 1092173 1088042 1083619 1079440 1076459 1075184 1075679 1078079 1082328 1087557 1092476 1096362 1099156
58755 1099156 1100960 1102129 1103526 1105826 1108756 1111704 1114652 1117653 1119845 1120176 1118834 1116880 1114699 1112006
58741 1112006 1109013 1106140 1102675 1097321 1090254 1083172 1077045 1071353 1065880 1061673 1059544 1058994 1059440 1061224
58727 1061224 1064533 1068403 1071860 1075375 1080334 1087556 1096831 1107352 1118291 1129647 1142672 1158415 1175536
58714 1175536 1190757 1201893 1209087 1212518 1210601 1201872 1187514 1170498 1152890 1135293 1118275 1102653
$$ packed form
58803A710312l1901l0913l0113k9277k8483k7656k6208k3855k1567k0853k1918
58792A417568k3174k2870k0890j8635j7258j6409j5060j3320j2602j3633j5040
58781A228677j4885j3168j1629j1274j1422j1279j1055j0978j0444q972p089n585
58769A100897m619m105m131m423m179k981j275M95K400M249N229M919L886K794
58755A099156J804J169J397K300K930K948K948L001K192L31j342j954k181k693
58741A112006k993k873l465n354p067p082o127n692n473m207k129n50M46J784
58727A061224L309L870L457L515M959P222R275J0521J0939J1356J3025J5743J7121
58714A175536J5221J1136P194L431j917q729j4358j7016j7608j7597j7018j5622
$$ plain form
58702 1102653 1088325 1074133 1059415 1045177 1033446 1025682 1021739 1020222 1019889 1020598 1022586 1025303 1027897
58689 1027897 1030640 1034618 1039852 1044990 1049188 1052890 1056271 1058516 1059647 1061654 1066458 1073679 1081663 1089792
58675 1089792 1098531 1107866 1117024 1125360 1132591 1138768 1144874 1152563 1162141 1171553 1178663 1183853 1189059 1194991
58661 1194991 1200826 1206032 1210689 1214221 1215644 1215363 1215291 1216930 1220521 1226095 1233809 1242679 1250280 1254588 1255549
58646 1255549 1254376 1251925 1248108 1242319 1233985 1222883 1209072 1192502 1173145 1151890 1130632 1110613
58634 1110613 1091129 1070982 1050913 1033283 1019252 1007514 996130 984598 973678 964133 956270 950078
58622 950078 945136 940671 936189 931986 928914 927747 928627 930901 933722 937197 942570 950759 961088 972251
58608 972251 984204 998171 1014929 1034123 1055304 1078446 1102842 1126229 1145577 1158505 1163916 1162074
$$ packed form
58702A102653j4328j4192j4718j4238j1731p764l943j517l33P09J988K717K594
58689A027897K743L978N234N138M198L702L381K245J131K007M804P221P984Q129
58675A089792Q739R335R158Q336P231O177O106P689R578R412P110N190N206N932
58661A194991N835N206M657L532J423k81p2J639L591N574P714Q870P601M308R61
58646A255549j173k451l817n789q334j1102j3811j6570j9357k1255k1258k0019
58634A110613j9484k0147k0069j7630j4031j1738j1384j1532j0920r545p863o192
58622I50078m942m465m482m203l072j167Q80K274K821L475N373Q189J0329J1163
58608I72251J1953J3967J6758J9194K1181K3142K4396K3387J9348J2928N411j842
$$ plain form
58596 1162074 1154492 1143226 1129796 1114881 1098965 1082686 1066442 1050322 1034786 1020896 1009435
58585 1009435 1000096 991807 983585 974914 965791 956898 949558 944978 943239 943126 943133 942836 943217 945430 949263
58570 949263 953149 955806 957348 958426 958793 957373 953632 948388 943324 940069 939595 941973 946564 952607 959562
58555 959562 966997 974666 982968 992775 1004186 1015890 1026311 1035086 1042875 1050133 1056768 1062658 1067660
58542 1067660 1071139 1072324 1071267 1068952 1066391 1063947 1061434 1058487 1055042 1051924 1050723 1052505 1056810 1062413
58528 1062413 1068778 1076177 1084749 1094325 1105137 1117804 1132492 1148621 1165494 1182637 1199567 1215881
58516 1215881 1231684 1247389 1262949 1277846 1291976 1306104 1321201 1337657 1355329 1374137 1394472
58505 1394472 1417061 1442398 1470336 1500410 1532504 1566688 1602269 1637545 1670923 1701891 1730566
$$ packed form
58596A162074p582j1266j3430j4915j5916j6279j6244j6120j5536j3890j1461
58585A009435r339q289q222q671r123q893p340m580j739j13Pk97L81K213L833
58570I49263L886K657J542J078L67j420l741n244n064l255m74K378M591O043O955
58555I59562P435P669Q302R807J1411J1704J0421Q775P789P258O635N890N002
58542A067660L479J185j057k315k561k444k513k947l445l118j201J782M305N603
58528A062413O365P399Q572R576J0812J2667J4688J6129J6873J7143J6930J6314
58516A215881J5803J5705J5560J4897J4130J4128J5097J6456J7672J8808K0335
58505A394472K2589K5337K7938L0074L2094L4184L5581L5276L3378L0968K8675
$$ plain form
58494 1730566 1756701 1779447 1797748 1810726 1818197 1820980 1820162 1815921 1807909 1796851 1784439 1771180
58482 1771180 1755724 1737172 1716608 1695101 1671611 1644628 1614905 1584669 1554722 1524337 1493705
58471 1493705 1464541 1438106 1414280 1392806 1373970 1357879 1344333 1333576 1325848 1320206 1315199 1310706
58459 1310706 1307521 1304941 1300685 1293918 1286748 1281725 1278984 1276760 1273692 1269665 1265189 1260959 1257558 1254896
58445 1254896 1252297 1249493 1246944 1244817 1242468 1239611 1237366 1237281 1239454 1242216 1243723 1243650 1243354 1244522 1247653
58430 1247653 1251963 1256727 1262226 1269062 1277074 1285523 1294137 1303493 1314697 1328991 1347019 1367861 1389385
58417 1389385 1410305 1431196 1452770 1474076 1493516 1510603 1525156 1535576 1540038 1539348 1536702 1534313
58405 1534313 1531666 1527308 1520857 1513011 1504989 1498499 1495104 1495030 1497292 1501057 1506185 1512740 1520998 1531543
$$ packed form
58494A730566K6135K2746J8301J2978P471K783q18m241q012j1058j2412j3259
58482A771180j5456j8552k0564k1507k3490k6983k9723l0236k9947l0385l0632
58471A493705k9164k6435k3826k1474j8836j6091j3546j0757p728n642n007m493
58459A310706l185k580m256o767p170n023k741k224l068m027m476m230l401k662
58445A254896k599k804k549k127k349k857k245q5K173K762J507p3k96J168L131
58430A247653M310M764N499O836Q012Q449Q614R356J1204J4294J8028K0842K1524
58417A389385K0920K0891K1574K1306J9440J7087J4553J0420M462o90k646k389
58405A534313k647m358o451p846q022o490l395p4K262L765N128O555Q258J0545
$$ plain form
58391 1531543 1543981 1555823 1564226 1568732 1570722 1570339 1565962 1557044 1545547 1533790 1522298 1510429 1497851
58378 1497851 1484802 1472162 1461729 1455203 1452314 1451045 1450069 1449914 1451520 1454980 1460130 1467158 1476115 1486755
58364 1486755 1499041 1512743 1526521 1538645 1548720 1557493 1565044 1570549 1573697 1574772 1573407 1568998 1562293
58351 1562293 1554740 1546261 1535663 1523416 1511897 1502531 1494698 1487743 1481868 1476734 1471607 1467557 1467059
58338 1467059 1470480 1475215 1479222 1483182 1488253 1494126 1500555 1508449 1517860 1526823 1533662 1538772 1543081 1546728
58324 1546728 1550409 1555825 1563384 1571511 1579513 1588844 1600046 1610959 1619949 1628682 1639522 1652134 1664924
58311 1664924 1677999 1692280 1707192 1721732 1736660 1753438 1771923 1791007 1810484 1830582 1850790
58300 1850790 1870923 1892160 1915234 1938758 1960900 1981433 2000557 2017304 2031068 2043330 2055822
$$ packed form
58391A531543J2438J1842Q403M506J990l83m377q918j1497j1757j1492j1869j2578
58378A497851j3049j2640j0433o526k889j269r76j55J606L460N150P028Q957J0640
58364A486755J2286J3702J3778J2124J0075Q773P551N505L148J075j365m409o705
58351A562293p553q479j0598j2247j1519r366p833o955n875n134n127m050m98
58338A467059L421M735M007L960N071N873O429P894R411Q963O839N110M309L647
58324A546728L681N416P559Q127Q002R331J1202J0913Q990Q733J0840J2612J2790
58311A664924J3075J4281J4912J4540J4928J6778J8485J9084J9477K0098K0208
58300A850790K0133K1237K3074K3524K2142K0533J9124J6747J3764J2262J2492
$$ plain form
58289 2055822 2068163 2079157 2089163 2099299 2109549 2119684 2130924 2144782 2161268 2179836 2200775
58278 2200775 2223937 2247675 2271066 2295765 2323573 2353464 2383091 2411907 2440779 2469870 2499008
58267 2499008 2528631 2558116 2584653 2606329 2625105 2644339 2664522 2683853 2701708 2718892 2735491
58256 2735491 2751188 2767040 2784598 2804081 2825476 2850162 2878990 2909867 2939999 2969684 3001342
58245 3001342 3035588 3070875 3106335 3142368 3178797 3214961 3251545 3290399 3332632 3378071 3425866
58234 3425866 3474541 3522854 3571833 3624276 3680878 3738996 3796867 3856483 3920277 3987827 4058348
58223 4058348 4133380 4213609 4295768 4376456 4456885 4540251 4626677 4714671 4805296 4900379 4998240
58212 4998240 5095691 5193276 5294626 5401833 5515150 5635710 5764531 5900216 6041559 6190945
$$ packed form
58289B055822J2341J0994J0006J0136J0250J0135J1240J3858J6486J8568K0939
58278B200775K3162K3738K3391K4699K7808K9891K9627K8816K8872K9091K9138
58267B499008K9623K9485K6537K1676J8776J9234K0183J9331J7855J7184J6599
58256B735491J5697J5852J7558J9483K1395K4686K8828L0877L0132K9685L1658
58245C001342L4246L5287L5460L6033L6429L6164L6584L8854M2233M5439M7795
58234C425866M8675M8313M8979N2443N6602N8118N7871N9616O3794O7550P0521
58223D058348P5032Q0229Q2159Q0688Q0429Q3366Q6426Q7994R0625R5083R7861
58212D998240R7451R7585J01350J07207J13317J20560J28821J35685J41343J49386
$$ plain form
58202 6190945 6351416 6522221 6701265 6889697 7089398 7298096 7512136 7732437 7962604
58193 7962604 8202932 8451660 8710441 8982686 9267751 9562834 9869833 10194584 10540064
58184 10540064 10906001 11294356 11709122 12151157 12618963 13114440 13642679 14206903 14808606
58175 14808606 15451016 16136544 16862529 17625841 18430184 19282580 20184913 21136220 22141253
58166 22141253 23208901 24344106 25549556 26833298 28205578 29669895 31226896 32885920
58158 32885920 34662943 36568723 38609824 40800196 43159995 45702869 48435514 51369241
58150 51369241 54520500 57901741 61526332 65424426 69643078 74233786 79256074 84793554
58142 84793554 90951935 97844839 105602566 114396087 124433319 135932920 149122632 164252965
$$ packed form
58202F190945J60471J70805J79044J88432J99701K08698K14040K20301K30167
58193G962604K40328K48728K58781K72245K85065K95083L06999L24751L45480
58184A0540064L65937L88355M14766M42035M67806M95477N28239N64224O01703
58175A4808606O42410O85528P25985P63312Q04343Q52396R02333R51307J005033
58166B2141253J067648J135205J205450J283742J372280J464317J557001J659024
58158C2885920J777023J905780K041101K190372K359799K542874K732645K933727
58150E1369241L151259L381241L624591L898094M218652M590708N022288N537480
58142H4793554O158381O892904P757727Q793521J0037232J1499601J3189712J5130333
$$ plain form
58134 164252965 181563904 201209747 223232404 247624565 274414156 303674104 335363547
58127 335363547 368886283 402420841 432520932 454685774 464976950 461721514 446077923
58120 446077923 421181237 390710410 357862468 324998891 293660695 264689295 238412268
58113 238412268 214859351 193911192 175359740 158950941 144436680 131594970 120214121
58106 120214121 110089481 101044004 92934376 85634557 79030683 73034178 67583113 62626210
58098 62626210 58115995 54015128 50292886 46911954 43829708 41012820 38438891 36083437
58090 36083437 33917236 31917479 30070027 28359032 26764640 25272585 23876435 22569045
58082 22569045 21341029 20188857 19114876 18116945 17185679 16313014 15495425 14727594 14001443
$$ packed form
58134A64252965J7310939J9645843K2022657K4392161K6789591K9259948L1689443
58127C35363547L3522736L3534558L0100091K2164842J0291176l255436j5643591
58120D46077923k4896686l0470827l2847942l2863577l1338196k8971400k6277027
58113B38412268k3552917k0948159j8551452j6408799j4514261j2841710j1380849
58106A20214121j0124640r045477q109628p299819o603874n996505n451065m956903
58098F2626210m510215m100867l722242l380932l082246k816888k573929k355454
58090C6083437k166201j999757j847452j710995j594392j492055j396150j307390
58082B2569045j228016j152172j073981r97931r31266q72665q17589p67831p26151
$$ plain form
58073 14001443 13313544 12666074 12058592 11485867 10945204 10438477 9964821 9518213 9094548
58064 9094548 8694677 8318249 7960908 7620151 7298196 6996336 6711547 6441038 6185391
58055 6185391 5944948 5717612 5502313 5300389 5111718 4933495 4764289 4605256 4456034
58046 4456034 4313660 4176854 4047151 3924610 3806684 3692498 3583682 3479657 3376906
58037 3376906 3274753 3177231 3087033 3002012 2920020 2842855 2772534 2707463 2645452 2587379 2534742
58026 2534742 2486230 2439682 2395253 2353858 2314284 2274408 2233998 2194317 2156089 2119520 2085175
58015 2085175 2053427 2023724 1995055 1966263 1936013 1904055 1872383 1843224 1815969 1788329 1760298
58004 1760298 1734237 1710928 1688540 1665979 1644305 1624054 1604015 1583638 1564045 1545707 1527601
$$ packed form
58073A4001443o87899o47470o07482n72725n40663n06727m73656m46608m23665
58064I094548l99871l76428l57341l40757l21955l01860k84789k70509k55647
58055F185391k40443k27336k15299k01924j88671j78223j69206j59033j49222
58046D456034j42374j36806j29703j22541j17926j14186j08816j04025j02751
58037C376906j02153r7522r0198q5021q1992p7165p0321o5071o2011n8073n2637
58026B534742m8512m6548m4429m1395l9574l9876m0410l9681l8228l6569l4345
58015B085175l1748k9703k8669k8792l0250l1958l1672k9159k7255k7640k8031
58004A760298k6061k3309k2388k2561k1674k0251k0039k0377j9593j8338j8106
$$ plain form
57993 1527601 1509570 1492945 1477908 1462743 1446673 1431014 1416632 1402783 1389379 1377637 1367255
57982 1367255 1355568 1341074 1325623 1311694 1299489 1287923 1276421 1264531 1251679 1238461 1226417
57971 1226417 1215711 1204872 1193309 1181740 1169549 1154601 1136979 1120288 1107656 1098549 1090865 1083851
57959 1083851 1077500 1071235 1064905 1059178 1053574 1046044 1035966 1025665 1017560 1011664 1007097 1003853 1001497
57946 1001497 998274 993403 988485 984950 981895 978239 975260 974989 977434 981116 985055 988669 991142 992599
57932 992599 994672 998342 1002379 1005143 1006492 1006685 1005174 1002063 999160 997767 996885 995263 993731 993655 994579
57917 994579 995311 996003 997070 997309 995341 991981 989025 986530 983455 980320 978944 979708 981057 981765 982097 982763
57901 982763 984037 985810 987351 987187 984244 979005 972889 967017 962204 959169 957735 956599 954840 952895
$$ packed form
57993A527601j8031j6625j5037j5165j6070j5659j4382j3849j3404j1742j0382
57982A367255j1687j4494j5451j3929j2205j1566j1502j1890j2852j3218j2044
57971A226417j0706j0839j1563j1569j2191j4948j7622j6691j2632r107p684p014
57959A083851o351o265o330n727n604p530j0078j0301q105n896m567l244k356
57946A001497l223m871m918l535l055l656k979k71K445L682L939L614K473J457
57932I92599K073L670M037K764J349J93j511l111k903j393q82j622j532p6R24
57917I94579P32O92J067K39j968l360k956k495l075l135j376P64J349P08L32O66
57901I82763J274J773J541j64k943n239o116n872m813l035j434j136j759j945
$$ plain form
57887 952895 951342 950025 949358 950976 955545 961209 965915 970159 975610 982255 989118 996886 1007114 1018964
57873 1018964 1029252 1036320 1041883 1048351 1055823 1062532 1067105 1069580 1070833 1071523 1071239 1068616 1062677 1053959
57859 1053959 1043956 1033786 1023966 1014925 1006794 998894 990292 980914 971633 963464 957083 952745 950072
57846 950072 948170 946283 944068 941193 937493 933809 931594 931044 930609 928996 926706 924793 923315 922146 922292
57831 922292 924849 929190 933493 936782 939384 941773 944104 946643 949607 952633 955170 957169 958785 959763
57817 959763 959789 959105 958285 957789 958057 959200 960151 959207 956226 953271 952158 952328 952172 951442 951019 951148 951352 951640
57799 951640 952490 953990 956026 958820 962217 965035 966277 966573 967332 968920 970585 971614 971594 970349 968719
57784 968719 968524 970319 971855 970316 965601 959984 955165 951267 948258 946466 945683 945363 945801 947749 950868
$$ packed form
57887I52895j553j317o67J618M569N664M706M244N451O645O863P768J0228J1850
57873A018964J0288P068N563O468P472O709M573K475J253O90k84k623n939q718
57859A053959j0003j0170r820r041q131p900q602r378r281q169o381m338k673
57846I50072j902j887k215k875l700l684k215n50m35j613k290j913j478j169J46
57831I22292K557M341M303L289K602K389K331K539K964L026K537J999J616R78
57817I59763K6o84q20m96K68J143R51r44k981k955j113J70j56p30m23J29K04K88
57799I51640Q50J500K036K794L397K818J242K96P59J588J665J029k0j245j630
57784I68719j95J795J536j539m715n617m819l898l009j792p83l20M38J948L119
$$ plain form
57769 950868 953943 956680 959942 964187 968913 973718 978602 983131 986568 988990 991223 993626 996023 998658
57755 998658 1001788 1004317 1004396 1001772 998252 995438 993205 990772 987995 984991 981721 978710 977264 978063 980133
57740 980133 982021 983598 986039 990143 995194 999538 1002174 1003719 1005721 1009033 1013203 1017440 1021457 1025070
57726 1025070 1027850 1029948 1032451 1036025 1039912 1043335 1047083 1052330 1058355 1063081 1065709 1067372 1069258 1071667
57712 1071667 1074987 1079772 1085205 1088978 1089732 1088675 1087974 1088339 1089006 1089390 1089672 1090049 1090335 1090547 1091372 1093663
57696 1093663 1097462 1101748 1105355 1108107 1110775 1114021 1117815 1121826 1125573 1128167 1128906 1128561 1129083 1131387 1134338
57681 1134338 1136483 1137621 1137825 1136372 1133127 1129952 1129006 1130252 1132144 1134058 1136404 1139001 1141345 1144106
57667 1144106 1148323 1153228 1156962 1159582 1163280 1169072 1175157 1179373 1181762 1183822 1186414 1189268 1191722 1193355
$$ packed form
57769I50868L075K737L262M245M726M805M884M529L437K422K233K403K397K635
57755I98658L130K529P9k624l520k814k233k433k777l004l270l011j446P99K070
57740I80133J888J577K441M104N051M344K636J545K002L312M170M237M017L613
57726A025070K780K098K503L574L887L423L748N247O025M726K628J663J886K409
57712A071667L320M785N433L773P54j057p01L65O67L84K82L77K86K12Q25K291
57696A093663L799M286L607K752K668L246L794M011L747K594P39l45N22K304K951
57681A134338K145J138K04j453l245l175r46J246J892J914K346K597K344K761
57667A144106M217M905L734K620L698N792O085M216K389K060K592K854K454J633
$$ plain form
57653 1193355 1194469 1196040 1198431 1200486 1201152 1201708 1204583 1209818 1214633 1217023 1217950 1219185 1220872 1222553 1225066
57638 1225066 1229733 1236394 1243683 1250826 1258035 1265347 1272033 1277235 1280825 1283674 1287125 1291873 1297483 1303527
57624 1303527 1310844 1320731 1333058 1346377 1359888 1374060 1389301 1405585 1423754 1445554 1471634 1500897
57612 1500897 1532697 1568392 1609668 1656321 1706483 1757679 1806165 1846049 1870936 1877144 1865375
57601 1865375 1839987 1807036 1771978 1737834 1705260 1674388 1646110 1621509 1600984 1584441 1571608
57590 1571608 1561709 1553566 1546527 1540726 1536261 1532987 1531247 1531553 1533098 1533980 1533752 1534543 1538577 1545470 1552889
57575 1552889 1559043 1563548 1566772 1569470 1572580 1576395 1580305 1583910 1587673 1591843 1595719 1598898 1602329 1607056
57561 1607056 1612671 1618069 1623001 1627845 1632585 1637212 1642375 1648343 1654039 1658560 1663024 1669200 1676711 1683470
$$ packed form
57653A193355J114J571K391K055O66N56K875N235M815K390R27J235J687J681K513
57638A225066M667O661P289P143P209P312O686N202L590K849L451M748N610O044
57624A303527P317R887J2327J3319J3511J4172J5241J6284J8169K1800K6080K9263
57612A500897L1800L5695M1276M6653N0162N1196M8486L9884K4887O208j1769
57601A865375k5388l2951l5058l4144l2574l0872k8278k4601k0525j6543j2833
57590A571608r899q143p039n801m465l274j740L06J545Q82k28P91M034O893P419
57575A552889O154M505L224K698L110L815L910L605L763M170L876L179L431M727
57561A607056N615N398M932M844M740M627N163N968N696M521M464O176P511O759
$$ plain form
57547 1683470 1688899 1694780 1702433 1710836 1718486 1725752 1734094 1743666 1752999 1760907 1767759 1774601 1781635 1788038
57533 1788038 1793286 1798240 1804484 1812555 1821219 1828805 1834936 1840681 1847234 1854805 1862632 1869809 1876142 1882339
57519 1882339 1889281 1897135 1905383 1913501 1921161 1928039 1934316 1941340 1950673 1962176 1974057 1985218 1996320
57506 1996320 2007842 2018502 2026954 2034148 2042446 2052838 2064467 2076581 2089374 2102726 2115547 2127060
57494 2127060 2137947 2149683 2163093 2177681 2191975 2204557 2215329 2225775 2237450 2250347 2263360
57483 2263360 2276126 2289363 2303251 2316571 2328153 2338476 2349016 2360357 2371740 2382441 2392731
57472 2392731 2403099 2413161 2422143 2430325 2439149 2449546 2460823 2471840 2482645 2494075 2506062 2517551
57460 2517551 2528124 2538542 2549324 2559962 2570220 2581268 2594593 2610276 2627087 2643808 2659823
$$ packed form
57547A683470N429N881P653Q403P650P266Q342R572R333P908O852O842P034O403
57533A788038N248M954O244Q071Q664P586O131N745O553P571P827P177O333O197
57519A882339O942P854Q248Q118P660O878O277P024R333J1503J1881J1161J1102
57506A996320J1522J0660Q452P194Q298J0392J1629J2114J2793J3352J2821J1513
57494B127060J0887J1736J3410J4588J4294J2582J0772J0446J1675J2897J3013
57483B263360J2766J3237J3888J3320J1582J0323J0540J1341J1383J0701J0290
57472B392731J0368J0062Q982Q182Q824J0397J1277J1017J0805J1430J1987J1489
57460B517551J0573J0418J0782J0638J0258J1048J3325J5683J6811J6721J6015
$$ plain form
57449 2659823 2674942 2689511 2704387 2720042 2735931 2751371 2766641 2782417 2798366 2813341 2827069
57438 2827069 2840732 2855467 2870836 2885325 2898227 2910650 2924525 2940713 2958297 2975744 2992453
57427 2992453 3008849 3025331 3041781 3058070 3074405 3091037 3108128 3125904 3144435 3163274 3181911
57416 3181911 3200361 3218532 3235312 3249582 3262187 3275430 3290260 3305425 3319986 3335075 3352112
57405 3352112 3370616 3389107 3407096 3424790 3441777 3457648 3473409 3490720 3509872 3529721 3549407
57394 3549407 3568959 3588490 3608076 3628310 3649732 3671608 3692359 3711410 3729744 3748576 3768318
57383 3768318 3788914 3810259 3832002 3853638 3875061 3896497 3917753 3938053 3956853 3974484 3991966
57372 3991966 4010401 4030460 4052193 4075358 4099887 4125562 4151267 4175424 4197647 4219214 4241371
$$ packed form
57449B659823J5119J4569J4876J5655J5889J5440J5270J5776J5949J4975J3728
57438B827069J3663J4735J5369J4489J2902J2423J3875J6188J7584J7447J6709
57427B992453J6396J6482J6450J6289J6335J6632J7091J7776J8531J8839J8637
57416C181911J8450J8171J6780J4270J2605J3243J4830J5165J4561J5089J7037
57405C352112J8504J8491J7989J7694J6987J5871J5761J7311J9152J9849J9686
57394C549407J9552J9531J9586K0234K1422K1876K0751J9051J8334J8832J9742
57383C768318K0596K1345K1743K1636K1423K1436K1256K0300J8800J7631J7482
57372C991966J8435K0059K1733K3165K4529K5675K5705K4157K2223K1567K2157
$$ plain form
57361 4241371 4263989 4286449 4308826 4331211 4352892 4373523 4394405 4417048 4440900 4464097 4486371
57350 4486371 4509510 4534674 4560791 4586270 4611085 4636261 4662032 4687458 4711669 4734868 4758028
57339 4758028 4781857 4806109 4829958 4853001 4875656 4898523 4921727 4945024 4968133 4990798 5013023
57328 5013023 5035397 5058471 5081593 5103281 5123285 5143376 5165343 5189040 5213178 5237271 5261778
57317 5261778 5286962 5312589 5338435 5364346 5390268 5416710 5444350 5472520 5499182 5523420 5546959
57306 5546959 5572033 5598702 5625503 5651707 5677388 5702256 5726217 5750368 5775583 5800748 5824392
57295 5824392 5847502 5872477 5899496 5926392 5952324 5979134 6008181 6037901 6065790 6091541 6117073
57284 6117073 6144213 6173016 6201745 6228205 6251762 6274129 6297508 6322267 6347482 6373211 6400516
$$ packed form
57361D241371K2618K2460K2377K2385K1681K0631K0882K2643K3852K3197K2274
57350D486371K3139K5164K6117K5479K4815K5176K5771K5426K4211K3199K3160
57339D758028K3829K4252K3849K3043K2655K2867K3204K3297K3109K2665K2225
57328E013023K2374K3074K3122K1688K0004K0091K1967K3697K4138K4093K4507
57317E261778K5184K5627K5846K5911K5922K6442K7640K8170K6662K4238K3539
57306E546959K5074K6669K6801K6204K5681K4868K3961K4151K5215K5165K3644
57295E824392K3110K4975K7019K6896K5932K6810K9047K9720K7889K5751K5532
57284F117073K7140K8803K8729K6460K3557K2367K3379K4759K5215K5729K7305
$$ plain form
57273 6400516 6429201 6457246 6482966 6506449 6528635 6550364 6572569 6595922 6619741 6642576 6664339
57262 6664339 6686604 6710315 6734411 6757282 6778482 6798552 6818226 6838276 6859100 6879943 6899391
57251 6899391 6916989 6933697 6950767 6969094 6989451 7011976 7035311 7057597 7078480 7098958 7119324
57240 7119324 7138731 7156782 7173993 7190703 7207216 7224948 7245307 7267096 7287244 7304768 7322000
57229 7322000 7341185 7362038 7383590 7406178 7430061 7453853 7476075 7497047 7517891 7538920 7560191
57218 7560191 7582449 7606189 7630870 7656055 7682079 7708550 7733599 7755919 7776320 7796005 7814592
57207 7814592 7831233 7846561 7861962 7877822 7893685 7909190 7923584 7935425 7944210 7951421 7958634 7965534
57195 7965534 7971140 7975931 7981112 7986567 7991192 7994772 7998007 8001134 8003953 8007046 8011794 8019357 8030441 8045589
$$ packed form
57273F400516K8685K8045K5720K3483K2186K1729K2205K3353K3819K2835K1763
57262F664339K2265K3711K4096K2871K1200K0070J9674K0050K0824K0843J9448
57251F899391J7598J6708J7070J8327K0357K2525K3335K2286K0883K0478K0366
57240G119324J9407J8051J7211J6710J6513J7732K0359K1789K0148J7524J7232
57229G322000J9185K0853K1552K2588K3883K3792K2222K0972K0844K1029K1271
57218G560191K2258K3740K4681K5185K6024K6471K5049K2320K0401J9685J8587
57207G814592J6641J5328J5401J5860J5863J5505J4394J1841Q785P211P213O900
57195G965534N606M791N181N455M625L580L235L127K819L093M748P563J1084J5148
$$ plain form
57181 8045589 8064818 8087447 8113109 8142446 8176117 8213777 8254562 8297717 8342194 8386775 8431205
57170 8431205 8475960 8520153 8561237 8597712 8630433 8660135 8685639 8706234 8723912 8740905 8756444
57159 8756444 8768379 8776902 8784082 8790500 8794978 8797302 8798684 8799501 8798837 8796458 8793289 8789736 8785342 8780276
57145 8780276 8775497 8771227 8766808 8762332 8758962 8757361 8756989 8757106 8757430 8757890 8758706 8760425 8762796 8764152 8763219
57130 8763219 8760973 8759178 8757596 8754399 8748984 8742509 8735684 8727860 8718377 8707026 8692845 8673963 8649051
57117 8649051 8617884 8580612 8537850 8491263 8442361 8390496 8333573 8271079 8205090 8138051 8070826
57106 8070826 8003107 7934361 7863866 7790691 7714049 7633341 7548337 7460114 7371309 7284533 7201123
57095 7201123 7122152 7049312 6983295 6922641 6866186 6815572 6772940 6736938 6703616 6670636 6637709
$$ packed form
57181H045589J9229K2629K5662K9337L3671L7660M0785M3155M4477M4581M4430
57170H431205M4755M4193M1084L6475L2721K9702K5504K0595J7678J6993J5539
57159H756444J1935Q523P180O418M478K324J382Q17o64k379l169l553m394n066
57145H780276m779m270m419m476l370j601l72J17L24M60Q16J719K371J356r33
57130H763219k246j795j582l197n415o475o825p824r483j1351j4181j8882k4912
57117H649051l1167l7272m2762m6587m8902n1865n6923o2494o5989o7039o7225
57106H070826o7719o8746p0495p3175p6642q0708q5004q8223q8805q6776q3410
57095G201123p8971p2840o6017o0654n6455n0614m2632l6002l3322l2980l2927
$$ plain form
57084 6637709 6603064 6562791 6514511 6459301 6399391 6336333 6272037 6209014 6148145 6087753 6025629
57073 6025629 5960536 5891440 5817135 5737065 5650588 5555049 5446517 5322684 5182782 5024217
57063 5024217 4841887 4631890 4393792 4128220 3834078 3508764 3148806 2749224 2304433
57054 2304433 1811082 1268333 674419 24611 -687081 -1466991 -2324023 -3270927 -4321941
57045 -4321941 -5490704 -6791200 -8238673 -9848437 -11635075 -13612628 -15792675 -18181270
57037 -18181270 -20780194 -23592146 -26623035 -29880636 -33376338 -37129975 -41168562 -45517714
57029 -45517714 -50198650 -55241045 -60707958 -66720962 -73464251 -81131942 -89800617 -99281139
57021 -99281139 -109061064 -118399865 -126516117 -132748683 -136639977 -137973907 -136797242 -133401278
$$ packed form
57084F637709l4645m0273m8280n5210n9910o3058o4296o3023o0869o0392o2124
57073F025629o5093o9096p4305q0070q6477r5539j08532j23833j39902j58565
57063E024217j82330k09997k38098k65572k94142l25314l59958l99582m44791
57054B304433m93351n42749n93914B4611f87081p79910q57032r46904j051014
57045d321941j168763j300496j447473j609764j786638j977553k180047k388595
57037a8181270k598924k811952l030889l257601l495702l753637m038587m349152
57029d5517714m680936n042395n466913o013004o743289p667691q668675r480522
57021i9281139r779925r338801q116252o232566l891294j333930J176665L395964
$$ plain form
57013 -133401278 -128241942 -121829176 -114637145 -107053023 -99354215 -91711912 -84224353 -76961743
57005 -76961743 -69991383 -63373678 -57148572 -51331782 -45921163 -40905157 -36269966 -32004703
56997 -32004703 -28102628 -24558634 -21365992 -18513744 -15984273 -13752502 -11788676 -10062510
56989 -10062510 -8544678 -7206312 -6020405 -4965162 -4025209 -3189163 -2446562 -1786820 -1199710
56980 -1199710 -676001 -207613 213000 593770 942551 1265275 1565102 1843516 2100577
56971 2100577 2332710 2531953 2690422 2806566 2886365 2938861 2971831 2990951 3000324 3002286 2997706
56960 2997706 2987274 2971751 2950521 2921179 2881559 2831674 2773054 2706980 2634221 2555914 2473433
56949 2473433 2387265 2296784 2201441 2101846 1999521 1895897 1791811 1688024 1586110 1488504
$$ packed form
57013a33401278N159336O412766P192031P584122P698808P642303P487559P262610
57005g6961743O970360O617705O225106N816790N410619N016006M635191M265263
56997c2004703L902075L543994L192642K852248K529471K231771J963826J726166
56989a0062510J517832J338366J185907J055243R39953Q36046P42601O59742N87110
56980a199710N23709b07613B13000L80770L48781L22724K99827K78414K57061
56971B100577K32133J99243J58469J16144P9799N2496L2970J9120R373J962m580
56960B997706j0432j5523k1230k9342l9620m9885n8620o6074p2759p8307q2481
56949B473433q6168r0481r5343r9595j02325j03624j04086j03787j01914r7606
$$ plain form
56939 1488504 1397226 1312392 1232368 1155656 1082464 1014179 951584 894018 840168 789152 740669
56928 740669 694596 650967 610412 574181 543246 517160 493757 470144 444223 415532 384988
56917 384988 354131 324514 297155 271982 247930 224161 201214 180426 162254 146079 132040
56906 132040 122056 117907 118833 122304 127137 134559 145944 160742 177350 194865 212783 229455 242111
56893 242111 248597 248643 243651 235952 228107 221984 217948 215042 212043 208390 204367 200707 197959 196189 195649
56878 195649 197587 203542 213442 225314 237674 251445 268452 288532 309290 328210 343538 353247
56866 353247 355115 348769 336546 321450 304902 287120 268759 251058 234697 219411 204680 190307
56854 190307 176514 164018 153813 146334 140983 136902 133976 132492 131967 131085 128982 126027 123056 120401
$$ packed form
56939A488504r1278q4834q0024p6712p3192o8285o2595n7566n3850n1016m8483
56928G40669m6073m3629m0555l6231l0935k6086k3403k3613k5921k8691l0544
56917C84988l0857k9617k7359k5173k4052k3769k2947k0788j8172j6175j4039
56906A32040r984m149R26L471M833P422J1385J4798J6608J7515J7918J6672J2656
56893B42111O486M6m992p699p845o123m036k906k999l653m023l660k748j770n40
56878A95649J938N955R900J1872J2360J3771J7007K0080K0758J8920J5328R709
56866C53247J868o346j2223j5096j6548j7782j8361j7701j6361j5286j4731j4373
56854A90307j3793j2496j0205p479n351m081k926j484n25q82k103k955k971k655
$$ plain form
56840 120401 118177 117156 118558 122680 128344 134387 141555 152141 167362 185712 204485 222590 241096
56827 241096 261179 282486 303641 323334 340339 353308 361640 366308 368926 369971 368652 364641 359186
56814 359186 354192 350785 349156 349390 351876 357125 365644 377839 393566 411861 431646 452850 476463
56801 476463 503300 532942 563810 593676 619753 638782 647947 646223 635053 617801 598274 579125
56789 579125 561244 544733 530468 520205 515094 514896 519200 528580 543644 563568 586924 613818
56777 613818 645838 683680 726035 771165 817970 864259 904914 933358 945165 939964 920490 890890
56765 890890 855688 818919 783163 749365 717763 688924 663861 643355 627437 615803 608827 607737
56753 607737 613305 624570 639608 657471 678471 702431 727689 752213 774403 791850 800395 796112
$$ packed form
56840A20401k224j021J402M122N664O043P168J0586J5221J8350J8773J8105J8506
56827B41096K0083K1307K1155J9693J7005J2969Q332M668K618J045j319m011n455
56814C59186m994l407j629K34K486N249Q519J2195J5727J8295J9785K1204K3613
56801D76463K6837K9642L0868K9866K6077J9029R165j724j1170j7252j9527j9149
56789E79125j7881j6511j4265j0263n111j98M304R380J5064J9924K3356K6894
56777F13818L2020L7842M2355M5130M6805M6289M0655K8444J1807n201j9474k9600
56765H90890l5202l6769l5756l3798l1602k8839k5063k0506j5918j1634o976j090
56753F07737N568J1265J5038J7863K1000K3960K5258K4524K2190J7447Q545m283
$$ plain form
56741 796112 778491 750979 718545 685171 653061 622950 594916 569419 547552 529854 515344
56730 515344 502583 491555 483678 479944 479794 481816 484941 489111 495424 505311 518542 531992 541291
56717 541291 543934 540098 530693 516017 496788 475124 453342 432279 411655 391646 373189 356876
56705 356876 342374 329159 317205 306592 296824 287092 277261 268099 260159 252755 244681 235947 227979
56692 227979 221787 216684 211481 206289 202193 199555 197693 196068 194636 192853 189547 184458 179163 175722
56678 175722 174667 174794 174672 173891 172978 172545 172618 172619 171835 169894 166953 163703 161147 159942 159696 159354 158625 158638
56660 158638 160700 164668 169000 172130 173469 173484 173369 174214 175844 176830 176254 175052 174824 175906 177607 179831
56644 179831 183031 186674 189298 190442 191218 192519 193844 194588 195391 197221 199765 201634 201959 201213 200586 200846
$$ packed form
56741G96112j7621k7512l2434l3374l2110l0111k8034k5497k1867j7698j4510
56730E15344j2761j1028p877l734j50K022L125M170O313R887J3231J3450R299
56717E41291K643l836r405j4676j9229k1664k1782k1063k0624k0009j8457j6313
56705C56876j4502j3215j1954j0613r768r732r831r162p940p404q074q734p968
56692B27979o192n103n203n192m096k638j862j625j432j783l306n089n295l441
56678A75722j055J27j22p81r13m33P3Jp84j941k941l250k556j205k46l42p29J3
56660A58638K062L968M332L130J339J5j15Q45J630R86n76j202k28J082J701K224
56644A79831L200L643K624J144P76J301J325P44Q03J830K544J869L25p46o27K60
$$ plain form
56628 200846 201615 201666 200267 198181 196804 196392 195870 194377 192110 189594 187225 185846 186515 188835 190434 189176
56612 189176 185447 181501 179054 178263 178582 179546 180701 181573 181890 181482 179974 177038 173084 169415 167443 167615
56596 167615 168962 169886 169648 168926 168546 168000 165855 161528 155878 150133 145190 142024 141567 143645 146916 150451
56580 150451 154631 159971 165975 171823 177362 182593 186957 190193 193296 197532 202784 207755 211594 214433
56566 214433 216570 218089 219225 220272 221155 221808 222893 225192 228229 230357 230535 229282 227607 225803 223868
56551 223868 222488 222673 224504 226858 228560 229361 229651 229675 229466 229278 229417 229589 229008 227520 226159 226096 227362
56534 227362 229013 230232 230795 230910 231244 232742 235592 238659 240830 242561 244895 247255 247817 246307 244794
56519 244794 245048 246470 247503 247747 247599 247026 246078 245762 246918 248752 249968 251028 253836 259241 266209 273607
$$ packed form
56628B00846P69N1j399k086j377m12n22j493k267k516k369j379O69K320J599j258
56612A89176l729l946k447p91L19R64J155Q72L17m08j508k936l954l669j972J72
56596A67615J347R24k38p22l80n46k145m327n650n745m943l166m57K078L271L535
56580A50451M180N340O004N848N539N231M364L236L103M236N252M971L839K839
56566B14433K137J519J136J047Q83O53J085K299L037K128J78j253j675j804j935
56551B23868j380J85J831K354J702Q01K90K4k09j88J39J72n81j488j361o3J266
56534B27362J651J219N63J15L34J498K850L067K171J731K334K360N62j510j513
56519B44794K54J422J033K44j48n73r48l16J156J834J216J060K808N405O968P398
$$ plain form
56503 273607 281414 289708 297635 304318 310212 316661 324162 331603 337365 340823 342452 342658 341234 338412
56489 338412 335674 334313 333315 330128 324010 317289 312463 309279 305961 302297 299781 299006 298661 297450 295750
56474 295750 294826 295168 296021 296057 294339 291126 287880 286118 286168 287214 288240 288572 288059 287447 288124 290496 292790
56457 292790 292532 289263 285026 282160 281488 282634 284951 287770 290609 293585 297034 300518 302946 303926 304149
56442 304149 304055 303048 300642 297646 295347 293961 292677 290980 289084 287168 285029 282759 281139 280810 281195
56427 281195 280673 278097 274180 271221 271239 274163 277854 279942 279717 278363 277612 278268 279897 281593 282768 283337
56411 283337 283527 283788 284622 286166 288061 289987 292087 294397 296171 296544 295818 295279 295579 296162 296492 296806 297119
56394 297119 296615 295011 293761 294644 297536 300694 303001 304770 306384 307403 307382 306704 306180 306445 307938 310726
$$ packed form
56503B73607P807Q294P927O683N894O449P501P441N762L458J629K06j424k822
56489C38412k738j361r98l187o118o721m826l184l318l664k516p75l45j211j700
56474B95750r24L42Q53L6j718l213l246j762N0J046J026L32n13o12O77K372K294
56457B92790k58l269m237k866o72J146K317K819K839K976L449L484K428R80K23
56442C04149r4j007k406k996k299j386j284j697j896j916k139k270j620l29L85
56427B81195n22k576l917k959J8K924L691K088k25j354p51O56J629J696J175N69
56411B83337J90K61Q34J544J895J926K100K310J774L73p26n39L00N83L30L14L13
56394B97119n04j604j250Q83K892L158K307J769J614J019k1o78n24K65J493K788
$$ plain form
56378 310726 313910 315844 315569 313747 311828 310610 309994 309907 310849 313305 316804 319874 321139 320477 318975 317835
56362 317835 317586 318246 319530 320627 320485 318967 317368 317055 317853 318447 318272 318252 319588 322469 326105 329524
56346 329524 332149 334004 335613 337449 339413 341078 342342 343535 344946 346625 348612 350903 353131 354702
56332 354702 355419 355706 356066 356574 357013 357317 357678 358210 358659 358660 358448 359042 361233 364374 366779 367541 367445 367828 369167
56313 369167 371249 373986 377195 379879 380766 379818 378683 379363 382486 386800 390251 391758 392162 393183 395430
56298 395430 397934 399782 401388 403552 405969 407601 408194 408518 409201 410181 411314 412747 414434 415847 416574
56283 416574 417012 418199 421002 425440 430761 436185 441379 446114 449909 452763 455960 461095 468070 474989
56269 474989 480307 484143 487118 489129 489995 490296 490706 491327 492443 494885 498640 502045 503584 503714 503829 504275
$$ packed form
56378C10726L184J934k75j822j919j218o16q7R42K456L499L070J265o62j502j140
56362C17835k49O60J284J097j42j518j599l13P98N94j75k0J336K881L636L419
56346C29524K625J855J609J836J964J665J264J193J411J679J987K291K228J571
56332C54702P17K87L60N08M39L04L61N32M49Jk12N94K191L141K405P62r6L83J339
56313C69167K082K737L209K684Q87r48j135O80L123M314L451J507M04J021K247
56298C95430K504J848J606K164K417J632N93L24O83R80J133J433J687J413P27
56283D16574M38J187K803M438N321N424N194M735L795K854L197N135O975O919
56269D74989N318L836K975K011Q66L01M10O21J116K442L755L405J539J30J15M46
$$ plain form
56253 504275 504734 505782 508439 512590 517320 522445 528314 534475 540086 545431 551551 558573 565922 574042
56239 574042 584148 596027 607668 617480 625669 633142 640357 647594 655209 663134 671004 678978 687584
56226 687584 696799 706347 716780 729087 743204 758197 773866 790721 808442 826070 844030 864236
56214 864236 887560 912751 938512 965091 992944 1021331 1049480 1078138 1108894 1142697 1179890
56203 1179890 1220829 1265507 1313219 1363489 1416909 1474588 1537405 1606306 1682444 1766302 1857373
56192 1857373 1955414 2061247 2175625 2297928 2426654 2560456 2697867 2836603 2974208 3109156
56182 3109156 3240460 3366160 3482787 3586442 3674103 3743921 3794559 3824502 3832439 3818543 3784991
56171 3784991 3734615 3669203 3589638 3497346 3394675 3283996 3167449 3047580 2927166 2808058
$$ packed form
56253E04275M59J048K657M151M730N125N869O161N611N345O120P022P349Q120
56239E74042J0106J1879J1641R812Q189P473P215P237P615P925P870P974Q606
56226F87584R215R548J0433J2307J4117J4993J5669J6855J7721J7628J7960K0206
56214H64236K3324K5191K5761K6579K7853K8387K8149K8658L0756L3803L7193
56203A179890M0939M4678M7712N0270N3420N7679O2817O8901P6138Q3858R1071
56192A857373R8041J05833J14378J22303J28726J33802J37411J38736J37605J34948
56182C109156J31304J25700J16627J03655Q7661O9818N0638K9943P937j3896l3552
56171C784991n0376o5412p9565r2292j02671j10679j16547j19869j20414j19108
$$ plain form
56161 2808058 2690912 2576193 2464699 2357027 2253432 2154436 2060857 1973125 1891286 1815619
56151 1815619 1746374 1682881 1623906 1568915 1518050 1470869 1426300 1384019 1344756 1308942 1276075
56140 1276075 1245712 1218096 1193506 1171825 1152857 1136191 1120811 1105921 1092105 1080430 1070513
56129 1070513 1060991 1051942 1045084 1041048 1038116 1034421 1029978 1025765 1022059 1018684 1015874 1014003 1013171 1013659
56115 1013659 1016042 1020346 1025736 1031399 1037142 1043118 1049775 1057870 1067451 1077149 1085872 1094968 1106994 1122421
56101 1122421 1139339 1156442 1174156 1192704 1211493 1231241 1254378 1282169 1313289 1346370 1382160
56090 1382160 1422070 1466400 1515253 1569611 1630347 1697686 1772563 1856533 1948928 2045961 2144339
56079 2144339 2244211 2346762 2450141 2549455 2639767 2717821 2782352 2834823 2879244 2919563 2957271
$$ packed form
56161B808058j17146j14719j11494j07672j03595r8996r3579q7732q1839p5667
56151A815619o9245o3493n8975n4991n0865m7181m4569m2281l9263l5814l2867
56140A276075l0363k7616k4590k1681j8968j6666j5380j4890j3816j1675r917
56129A070513r522r049o858m036k932l695m443m213l706l375k810j871q32M88
56115A013659K383M304N390N663N743N976O657Q095R581R698Q723R096J2026J5427
56101A122421J6918J7103J7714J8548J8789J9748K3137K7791L1120L3081L5790
56090A382160L9910M4330M8853N4358O0736O7339P4877Q3970R2395R7033R8378
56079B144339R9872J02551J03379R9314R0312P8054O4531N2471M4421M0319L7708
$$ plain form
56068 2957271 2991984 3023043 3049425 3069472 3082387 3089330 3091819 3089627 3080996 3063927 3036349 2996245
56056 2996245 2942895 2877422 2801609 2717388 2628070 2538449 2452566 2372393 2299238 2234729 2179467
56045 2179467 2132277 2091757 2057035 2026437 1997734 1971081 1949648 1935748 1927972 1923388 1920408 1918029
56033 1918029 1914719 1910513 1908447 1911455 1918948 1928310 1938390 1949514 1961406 1973281 1985162 1997433
56021 1997433 2010079 2023741 2040242 2060529 2083364 2107266 2132139 2157805 2183029 2207746 2234162
56010 2234162 2263672 2294587 2324846 2354976 2386262 2418046 2449207 2480451 2512755 2545385 2577943
55999 2577943 2612437 2650651 2691115 2731372 2771689 2813928 2858254 2903573 2949728 2996810 3043928
55988 3043928 3091210 3141287 3196096 3253950 3312425 3372322 3435910 3503111 3572461 3644044 3718298
$$ packed form
56068B957271L4713L1059K6382K0047J2915O943K489k192q631j7069k7578m0104
56056B996245n3350o5473p5813q4221q9318q9621q5883q0173p3155o4509n5262
56045B179467m7190m0520l4722l0598k8703k6653k1433j3900p776m584k980k379
56033A918029l310m206k066L008P493R362J0080J1124J1892J1875J1881J2271
56021A997433J2646J3662J6501K0287K2835K3902K4873K5666K5224K4717K6416
56010B234162K9510L0915L0259L0130L1286L1784L1161L1244L2304L2630L2558
55999B577943L4494L8214M0464M0257M0317M2239M4326M5319M6155M7082M7118
55988C043928M7282N0077N4809N7854N8475N9897O3588O7201O9350P1583P4254
$$ plain form
55977 3718298 3793570 3868110 3943045 4020331 4099384 4178928 4260535 4347059 4438991 4535413 4636968
55966 4636968 4744804 4858316 4977000 5102644 5236553 5376844 5521898 5674225 5837099
55957 5837099 6009552 6188531 6373886 6567396 6769247 6979659 7201708 7438096 7687112
55948 7687112 7945836 8214999 8496817 8791254 9099294 9426685 9778823 10154636 10551005
55939 10551005 10970398 11418213 11895408 12400076 12933697 13499267 14095891 14722167 15382597
55930 15382597 16083588 16825369 17605049 18425569 19294543 20216671 21194786 22235811 23347671
55921 23347671 24532650 25791709 27132899 28567695 30102455 31742179 33498819 35386447
55913 35386447 37412351 39583307 41916333 44432273 47143936 50063435 53217031 56640825
$$ packed form
55977C718298P5272P4540P4935P7286P9053P9544Q1607Q6524R1932R6422J01555
55966D636968J07836J13512J18684J25644J33909J40291J45054J52327J62874
55957E837099J72453J78979J85355J93510K01851K10412K22049K36388K49016
55948G687112K58724K69163K81818K94437L08040L27391L52138L75813L96369
55939A0551005M19393M47815M77195N04668N33621N65570N96624O26276O60430
55930A5382597P00991P41781P79680Q20520Q68974R22128R78115J041025J111860
55921B3347671J184979J259059J341190J434796J534760J639724J756640J887628
55913C5386447K025904K170956K333026K515940K711663K919499L153596L423794
$$ plain form
55905 56640825 60369624 64447332 68944053 73947652 79546634 85841660 92967578 101083505
55897 101083505 110351497 120952721 133115550 147091810 163101743 181319276 201882858
55890 201882858 224868551 250257326 277926618 307476516 337685768 365918244 388291201
55883 388291201 400981575 401909843 391530521 372255749 347206559 319244825 290594000
55876 290594000 262797844 236784962 213006315 191611592 172572794 155740280 140895992
55869 140895992 127815774 116292636 106122481 97105720 89072052 81886050 75428723
55862 75428723 69592956 64297486 59486546 55112332 51130260 47508519 44224132 41246129
55854 41246129 38534785 36057747 33794178 31722490 29816689 28056270 26428186 24917362
$$ packed form
55905E6640825L728799M077708M496721N003599N598982O295026P125918Q115927
55897A01083505R267992J0601224J2162829J3976260J6009933J8217533K0563582
55890B01882858K2985693K5388775K7669292K9549898L0209252K8232476K2372957
55883C88291201J2690374R28268j0379322j9274772k5049190k7961734k8650825
55876B90594000k7796156k6012882k3778647k1394723j9038798j6832514j4844288
55869A40895992j3080218j1523138j0170155r016761q033668p186002o457327
55862G5428723n835767n295470m810940m374214l982072l621741l284387k978003
55854D1246129k711344k477038k263569k071688j905801j760419j628084j510824
$$ plain form
55846 24917362 23505797 22182786 20946415 19793343 18715749 17709038 16773151 15904346
55838 15904346 15093431 14333328 13620781 12950069 12313265 11708312 11139441 10607898 10108828
55829 10108828 9638167 9195482 8778438 8381281 8000898 7638711 7295128 6967737 6656222
55820 6656222 6363261 6088912 5829247 5581931 5348093 5127428 4916605 4714053 4521642
55811 4521642 4340220 4167940 4004184 3850673 3707483 3572279 3444604 3326489 3217477
55802 3217477 3113302 3011009 2911600 2816456 2724886 2636255 2550758 2467156 2383706 2302246 2227307
55791 2227307 2159950 2096422 2034103 1974626 1919634 1867742 1817840 1771571 1730049 1691226 1652942
55780 1652942 1615915 1581538 1549126 1517390 1486472 1456668 1427132 1397579 1369501 1344169 1320945
$$ packed form
55846B4917362j411565j323011j236371j153072j077594j006711r35887q68805
55838A5904346q10915p60103p12547o70712o36804o04953n68871n31543m99070
55829A0108828m70661m42685m17044l97157l80383l62187l43583l27391l11515
55820F656222k92961k74349k59665k47316k33838k20665k10823k02552j92411
55811D521642j81422j72280j63756j53511j43190j35204j27675j18115j09012
55802C217477j04175j02293r9409r5144r1570q8631q5497q3602q3450q1460p4939
55791B227307o7357o3528o2319n9477n4992n1892m9902m6269m1522l8823l8284
55780A652942l7027l4377l2412l1736l0918k9804k9536k9553k8078k5332k3224
$$ plain form
55769 1320945 1298565 1276446 1253961 1230436 1206808 1185316 1166584 1148801 1130514 1112330 1095087
55758 1095087 1078363 1061681 1045328 1029218 1012744 996445 981954 969622 958000 946229 935022
55747 935022 924773 914822 905329 897836 893097 890120 888082 887343 887837 888313 888060 887721 887759 887790 888057 889674
55731 889674 892495 894413 893671 890544 886124 880885 875024 868700 861286 851635 839587 826044 811552 796356
55717 796356 781858 770118 761484 754459 748345 744260 743020 743477 743448 740843 733799 721527 705627 689154
55703 689154 674073 660763 649702 641627 635954 630986 625957 621127 615947 609224 601285 593749 586894
55690 586894 579443 571281 564026 558215 552197 544786 537159 531299 528051 527038 526730 524515 518955 512295
55676 512295 508396 507703 506753 503154 498340 494427 491174 487543 483781 480254 476163 471072 466010 461682 457204
$$ packed form
55769A320945k2380k2119k2485k3525k3628k1492j8732j7783j8287j8184j7243
55758A095087j6724j6682j6353j6110j6474j6299j4491j2332j1622j1771j1207
55747I35022j0249r951r493p493m739k977k038p39M94M76k53l39L8L1K67J617
55731H89674K821J918p42l127m420n239n861o324p414r651j2048j3543j4492j5196
55717G96356j4498j1740q634p025o114m085j240M57k9k605p044j2272j5900j6473
55703F89154j5081j3310j1061q075n673m968n029m830n180o723p939p536o855
55690E86894p451q162p255n811o018p411p627n860l248j013l08k215n560o660
55676E12295l899o93r50l599m814l913l253l631l762l527m091n091n062m328m478
$$ plain form
55661 457204 451802 446051 440356 434185 428118 424595 424988 427645 430377 433188 436920 440869 443530 444415 443519
55646 443519 440330 435051 429583 425492 421876 416701 409405 400961 392338 384217 377312 371761 366963 362959
55632 362959 360872 360979 361527 360610 358204 355357 352508 349774 347776 346963 346971 347550 349141 351709 354153 355667
55616 355667 356437 356291 354368 351136 348945 349103 349860 348809 345968 342962 340498 338483 337525 338418 340630 342742
55600 342742 343932 344019 342879 340997 339732 339895 340727 341042 340466 338946 336345 333451 331874 331961 332330 332477 333951
55583 333951 337580 341393 343039 342512 340661 336901 330794 324356 320077 317549 314459 310051 305205 299982
55569 299982 293756 287370 282566 279422 276641 274185 273276 273758 273763 272323 270356 268731 267192 265563 264273
55554 264273 263278 261828 259618 256896 253504 249321 245660 244476 245768 247209 246790 244646 241989 239573 237734
$$ packed form
55661D57204n402n751n695o171o067l523L93K657K732K811L732L949K661Q85q96
55646D43519l189n279n468m091l616n175p296q444q623q121o905n551m798m004
55632C62959k087J07N48r17k406k847k849k734j998q13QN79J591K568K444J514
55616C55667P70j46j923l232k191J58P57j051k841l006k464k015r58Q93K212K112
55600C42742J190Q7j140j882j265J63Q32L15n76j520k601k894j577Q7L69J47J474
55583C33951L629L813J646n27j851l760o107o438m279k528l090m408m846n223
55569B99982o226o386m804l144k781k456r09M82Nj440j967j625j539j629j290
55554B64273r95j450k210k722l392m183l661j184J292J441m19k144k657k416j839
$$ plain form
55539 237734 236877 237179 238241 239202 238924 236495 232241 227801 224541 222484 221438 222027 224341 226701 227520 227584
55523 227584 228584 230138 230562 230223 231615 235752 240684 244176 246065 247403 249041 251734 256136 261872 267698
55508 267698 272905 277448 280652 281470 280302 278800 277276 274052 268138 260879 253981 247465 240707 234188
55494 234188 228872 224933 222316 221546 222630 223936 223603 221705 219832 218849 218233 217447 216815 216813 217276 217605 217312
55477 217312 216229 214516 212631 211058 209934 208955 207690 206049 204502 203694 203793 204539 206029 208831 212746
55462 212746 216037 216830 215118 212563 210388 208449 206357 204416 203067 202243 201814 202044 203135 204666 205801
55447 205801 205669 203487 199040 193516 189206 187623 187970 187898 185811 182097 178166 174802 171939 169835 169560
55432 169560 171584 174415 175744 175123 174476 175598 178089 180254 180996 180108 177721 174587 172151 171142 170581
$$ packed form
55539B37734q57L02J062R61k78k429m254m440l260k057j046N89K314K360Q19O4
55523B27584J000J554M24l39J392M137M932L492J889J338J638K693M402N736N826
55508B67698N207M543L204Q18j168j502j524l224n914p259o898o516o758o519
55494B34188n316l939k617p70J084J306l33j898j873r83o16p86o32kM63L29k93
55477B17312j083j713j885j573j124r79j265j641j547q08R9P46J490K802L915
55462B12746L291P93j712k555k175j939k092j941j349q24m29K30J091J531J135
55447B05801j32k182m447n524m310j583L47p2k087l714l931l364k863k104k75
55432A69560K024K831J329o21o47J122K491K165P42q88k387l134k436j009n61
$$ plain form
55417 170581 169277 167868 168166 170722 174189 176981 178585 179395 180114 181138 181849 180987 178524 176414 176362 177533
55401 177533 177827 176688 174962 172630 168871 164392 161491 161274 162546 163992 165745 168049 170002 170673 170348
55386 170348 169824 169360 168982 168829 168593 167644 166371 166399 168712 172301 175366 177131 177953 178372 178740 179242 179798
55369 179798 180252 180676 180940 180262 178143 175582 174075 173549 172760 171720 171852 173391 174628 174594 174565 175747 177224
55352 177224 177634 177345 177403 177629 177531 177917 179637 181481 181343 179164 176927 175900 175561 175251 175276 175949 176682 176532
55334 176532 175115 172968 171510 172217 175114 178503 180915 182605 184118 184399 182132 178490 176433 176993 178018
55319 178018 177103 174224 170888 168245 166940 167410 169036 169952 168937 166953 165763 165653 165589 165146 164900 165082
55303 165082 165180 165119 165704 167392 169552 171523 173611 176236 178688 179767 179539 179480 180615 182273 183080 182689 181946
$$ packed form
55417A70581j304j409K98K556L467K792J604Q10P19J024P11q62k463k110n2J171
55401A77533K94j139j726k332l759m479k901k17J272J446J753K304J953O71l25
55386A70348n24m64l78j53k36r49j273K8K313L589L065J765Q22M19L68N02N56
55369A79798M54M24K64o78k119k561j507n26p89j040J32J539J237l4k9J182J477
55352A77224M10k89N8K26r8L86J720J844j38k179k237j027l39l10K5O73P33j50
55334A76532j417k147j458P07K897L389K412J690J513K81k267l642k057N60J025
55319A78018r15k879l336k643j305M70J626R16j015j984j190j10o4m43k46J82
55303A65082R8o1N85J688K160J971K088K625K452J079k28n9J135J658Q07l91p43
$$ plain form
55286 181946 181559 181149 179745 176977 173666 171116 169762 168694 166923 164944 164409 166068 168734 170640 171208
55271 171208 171039 170898 171408 173053 175450 177051 176713 175381 175148 176667 178548 179360 179064 178269 177215 176043
55255 176043 175089 174342 173386 172341 172099 173052 174351 174945 174684 173871 172601 171320 171263 173233 176364 179050 180763
55238 180763 182055 183012 182854 181187 178756 176588 174974 173641 172575 172345 173641 176444 179600 181501 181547
55223 181547 180689 180196 180179 179931 179458 179753 181314 183186 184058 183907 183859 184617 185675 186198 186001 185286 183988 182008
55205 182008 179841 178234 177251 176397 175731 175977 177246 178541 179163 179793 181314 183170 183970 183335 182081 180834
55189 180834 179579 178552 178360 178929 179288 178812 178008 177825 178691 180269 181504 181072 178713 176152 175650 177461
55173 177461 179649 180636 180839 181438 182571 183346 182776 180210 175771 170911 167716 167041 167916 169089 170219 171172
$$ packed form
55286A81946l87m10j404k768l311k550j354j068j771j979n35J659K666J906N68
55271A71208j69j41N10J645K397J601l38j332k33J519J881Q12k96p95j054j172
55255A76043r54p47r56j045k42R53J299N94k61q13j270j281n7J970L131K686J713
55238A80763J292R57j58j667k431k168j614j333j066k30J296K803L156J901M6
55223A81547q58m93j7k48m73K95J561J872Q72j51m8P58J058N23j97p15j298j980
55205A82008k167j607r83q54o66K46J269J295O22O30J521J856Q00o35j254j247
55189A80834j255j027j92N69L59m76q04j83Q66J578J235m32k359k561n02J811
55173A77461K188R87K03N99J133P75n70k566m439m860l195o75Q75J173J130R53
$$ plain form
55157 171172 171381 170806 170520 171331 172503 172807 172155 171304 170544 169753 169269 169615 170545 171271 171505 171604 171876 172375 173167
55138 173167 174154 174918 175259 175688 176855 178666 180372 181247 180983 179922 179136 179580 180794 181298 180661 180149 180569
55121 180569 180579 178336 174076 169877 167447 167208 168919 171812 174472 175940 176885 178646 181276 183551 184655
55106 184655 184773 184166 182938 181728 181489 182310 183270 183511 182785 181148 179094 177809 178182 179532 180363 180393 180753
55089 180753 182083 183677 184771 185493 186068 186174 185747 185565 186276 187385 187798 187014 185418 183897 183538 185118
55073 185118 188269 191338 192546 191387 188907 186836 186382 187487 189111 190305 190782 190348 188427 184907 181064
55058 181064 178667 178176 178670 179483 180906 183048 185045 185927 185723 185260 185353 186477 188655 191245 193144 193631
55042 193631 192898 191716 190838 190752 191585 193112 195011 197077 199029 200434 201214 201922 203000 204086 204652 204935
$$ packed form
55157A71172K09n75k86Q11J172L04o52q51p60p91m84L46R30P26K34R9K72M99P92
55138A73167R87P64L41M29J167J811J706Q75k64j061p86M44J214N04o37n12M20
55121A80569J0k243m260m199k430k39J711K893K660J468R45J761K630K275J104
55106A84655J18o07j228j210k39Q21R60K41p26j637k054j285L73J350Q31L0L60
55089A80753J330J594J094P22N75J06m27j82P11J109M13p84j596j521l59J580
55073A85118L151L069J208j159k480k071m54J105J624J194M77m34j921l520l843
55058A81064k397m91M94Q13J423K142J997Q82k04m63R3J124K178K590J899M87
55042A93631p33j182q78q6Q33J527J899K066J952J405P80P08J078J086N66K83
$$ plain form
55026 204935 205470 206077 206233 206078 205874 204812 201912 198301 196944 199347 203736 207187 208496 208110 206457 203684
55010 203684 200436 197526 195001 192482 190289 189207 189093 188593 186676 183991 182322 182825 184881 186762 187387
54995 187387 187336 187886 189182 189900 188894 186640 184731 184352 185668 188314 191830 195511 198337 199448 198882 197656
54979 197656 196814 196208 194659 191673 188551 187109 187579 188622 189259 189717 190284 190558 190411 190670 191959 193483
54963 193483 193815 192505 190209 187761 185880 185389 186617 188620 189882 189985 189948 190725 191990 192656 192102 190566
54947 190566 188708 187192 186485 186671 187452 188561 190215 192989 197068 201651 205202 206468 205406 203275 201779
54932 201779 201884 203178 204416 204859 205118 206391 208854 211190 211968 211140 209825 208985 208841 209344 210457 211821
54916 211821 212706 212649 211899 211088 210722 211079 212203 213661 214542 214167 212940 212199 212974 214946 216848 217862 218253
$$ packed form
55026B04935N35O07J56j55k04j062k900l611j357K403M389L451J309l86j653k773
55010B03684l248k910k525k519k193j082j14n00j917k685j669N03K056J881O25
54995A87387n1N50J296P18j006k254j909l79J316K646L516L681K826J111n66j226
54979A97656q42o06j549k986l122j442M70J043O37M58N67K74j47K59J289J524
54963A93483L32j310k296k448j881m91J228K003J262J03l7P77J265O66n54j536
54947A90566j858j516p07J86P81J109J654K774M079M583L551J266j062k131j496
54932B01779J05J294J238M43K59J273K463K336P78q28j315q40j44N03J113J364
54916B11821Q85n7p50q11l66L57J124J458Q81l75j227p41P75J972J902J014L91
$$ plain form
54899 218253 218478 218298 217395 216516 217007 219068 221290 222138 221228 219075 216652 215477 216821 219992 222472 222748
54883 222748 222055 222190 222620 221370 218142 214718 212443 210983 209712 208823 208689 209307 210749 213258 216724 220917
54867 220917 226029 231899 236978 239673 240713 242545 246181 250424 254518 259525 266190 273363 279798 285800
54853 285800 291558 295348 295331 292230 288425 285055 281730 278457 275783 273115 268870 262856 257002 253074 250785
54838 250785 248807 246654 244735 243221 241817 240400 239065 237489 235022 231859 229642 230098 232991 236187
54824 236187 238073 239203 240897 243055 244620 245779 248042 251955 256288 260129 264404 270354 277609 284886
54810 284886 291768 298515 304485 307928 307494 303465 297626 292159 288158 284838 280618 275193 269840 265493
54796 265493 261650 257827 254838 253526 253066 251646 248247 242826 235644 227777 221582 218984 219376 220461 221081
$$ packed form
54899B18253K25j80r03q79M91K061K222Q48r10k153k423j175J344L171K480K76
54883B22748o93J35M30j250l228l424k275j460j271q89j34O18J442K509L466M193
54867B20917N112N870N079K695J040J832L636M243M094N007O665P173O435O002
54853B85800N758L790j7l101l805l370l325l273k674k668m245o014n854l928k289
54838B50785j978k153j919j514j404j417j335j576k467l163k217M56K893L196
54824B36187J886J130J694K158J565J159K263L913M333L841M275N950P255P277
54810B84886O882O747N970L443m34m029n839n467m001l320m220n425n353m347
54796B65493l843l823k989j312m60j420l399n421p182p867o195k598L92J085O20
$$ plain form
54781 221081 221930 223528 224893 224694 222832 220468 218913 218542 218360 216829 213592 209984 207376 205673 204238
54766 204238 203408 203800 204696 204742 204058 204064 205215 206527 207585 209360 212321 215124 216111 215155 213258 211196 209471
54749 209471 208909 210280 213414 217191 220373 222320 223316 224322 225943 227489 227601 225958 223790 222528 222572
54734 222572 223560 225051 226496 227174 226767 225765 225007 225007 225758 226766 227319 227304 227730 229619 232270 233631 232888
54717 232888 231705 232156 234196 236242 237781 240228 245012 251743 258724 264719 269649 273823 277256 280177
54703 280177 283707 289194 296650 304420 310766 315247 318169 319332 318187 314870 310200 304865 299441 294947
54689 294947 292214 290550 288089 283802 278428 273234 268829 265450 263346 262220 261124 259585 258245 257755
54675 257755 257586 256626 254584 252213 250508 250148 251326 253534 255839 257832 260051 263116 266839 270682 274654
$$ packed form
54781B21081Q49J598J365j99j862k364j555l71j82j531l237l608k608j703j435
54766B04238q30L92Q96M6o84OJ151J312J058J775K961K803R87r56j897k062j725
54749B09471n62J371L134L777L182J947R96J006J621J546J12j643k168j262M4
54734B22572R88J491J445O78m07j002p58%P51J008N53j5M26J889K651J361p43
54717B32888j183M51K040K046J539K447M784O731O981N995M930M174L433K921
54703B80177L530N487P456P770O346M481K922J163j145l317m670n335n424m494
54689B94947k733j664k461m287n374n194m405l379k104j126j096j539j340m90
54675B57755j69r60k042k371j705l60J178K208K305J993K219L065L723L843L972
$$ plain form
54660 274654 279107 283861 288195 291695 294719 297980 301831 305765 308449 308508 305573 300420 294030 286909 279422
54645 279422 272227 266001 261176 258209 257432 258142 258425 256681 253092 249084 245689 243020 240869 238961 236784
54630 236784 234004 231058 228721 227144 225948 225061 224625 224162 222842 220821 219340 218983 218674 217106 214585
54615 214585 212678 212424 213698 216056 219173 222315 224317 224640 223966 223381 223364 223983 225551 228317 231661 234309
54599 234309 235505 235512 235017 234579 234606 235053 234800 232283 227451 222515 219908 219756 220218 220030 219786 220660 222763 225128
54581 225128 226675 226872 226008 225119 225204 226120 226562 225434 223012 220651 219633 220354 222055 223131 222263 219789
54565 219789 217663 217553 219099 220425 220244 219093 218490 219150 220240 220343 219087 217569 217054 217517 217890 217558
54549 217558 216974 216734 216736 216624 216585 217228 218878 221240 223561 224979 225116 224672 225023 226761 228772 229168 227178
$$ packed form
54660B74654M453M754M334L500L024L261L851L934K684N9k935n153o390p121p487
54645B79422p195o226m825k967p77P10K83j744l589m008l395k669k151j908k177
54630B36784k780k946k337j577j196q87m36m63j320k021j481l57l09j568k521
54615B14585j907k54J274K358L117L142K002L23o74n85j7O19J568K766L344K648
54599B34309J196Pm95m38K7M47k53k517m832m936k607j52M62j88k44Q74K103K365
54581B25128J547J97q64q89Q5R16M42j128k422k361j018P21J701J076q68k474
54565B19789k126j10J546J326j81j151o03O60J090J03j256j518n15M63L73l32
54549B17558n84k40Kj12l9O43J650K362K321J418J37m44L51J738K011L96j990
$$ plain form
54532 227178 223936 221462 220977 222020 223038 222928 222070 221714 222441 223601 224290 224344 224161 224116 224622 226288 229351
54515 229351 233025 235923 237151 236768 235341 233508 231900 231081 231376 232906 235617 238895 241248 241045 238027
54500 238027 233909 231057 230584 231965 234292 237194 240238 242141 241618 238963 235922 233789 232462 231688 232099
54485 232099 233985 235924 236148 235123 235319 238179 242482 246103 248266 249393 249731 249123 247688 245914 244245
54470 244245 243130 243236 245052 248289 251925 254736 255829 255108 253432 251893 250738 249430 247868 246841 246904
54455 246904 247473 247629 247293 247042 247076 246915 245872 243499 239949 236239 233649 232456 231776 231113 231359 233510 236986
54438 236986 240220 242626 244893 247245 248441 247104 243694 240615 240157 242320 244826 245501 244487 243638 244014
54423 244014 244959 245727 246811 248999 252124 255542 258987 261993 263417 262777 261463 261234 261925 261928 260604 258829
$$ packed form
54532B27178l242k474m85J043J018j10q58l56P27J160O89N4j83m5N06J666L063
54515B29351L674K898J228l83j427j833j608q19K95J530K711L278K353k03l018
54500B38027m118k852m73J381K327K902L044J903n23k655l041k133j327p74M11
54485B32099J886J939K24j025J96K860M303L621K163J127L38o08j435j774j669
54470B44245j115J06J816L237L636K811J093p21j676j539j155j308j562j027O3
54455B46904N69J56l36k51L4j61j043k373l550l710k590j193o80o63K46K151L476
54438B36986L234K406K267K352J196j337l410l079m58K163K506O75j014q49L76
54423B44014R45P68J084K188L125L418L445L006J424o40j314k29O91Lj324j775
$$ plain form
54407 258829 257438 256692 257189 259518 262651 264457 264477 264766 267083 270558 273149 274212 274370 273744 271818 268671
54391 268671 265117 261791 259068 257592 257714 258446 258104 256230 254038 252789 252622 253264 254868 257375 259660
54376 259660 260332 259258 257720 256996 257280 257971 258420 258215 257265 256044 255513 256317 258061 259675 260543 261006 261722
54359 261722 262813 263866 264704 265939 268520 272502 276375 278075 277029 274794 273350 273037 272794 272009 271200
54344 271200 270873 270675 270108 269323 268858 269169 270595 272916 274652 274003 271311 269583 271372 275787 279719 281427
54328 281427 281520 280875 279411 277257 275579 275391 276442 277866 279190 280149 280285 279521 278710 278883 280087 281392
54312 281392 281848 281104 279425 277564 276625 277595 280682 284926 288534 290021 289470 288487 288534 289581 290857 292464
54296 292464 295220 299010 302498 304913 307121 310236 313926 316977 319055 320974 323337 325698 327151 327157 325627
$$ packed form
54407B58829j391p46M97K329L133J806K0K89K317L475K591J063J58o26j926l147
54391B68671l554l326k723j476J22P32l42j874k192j249j67O42J604K507K285
54376B59660O72j074j538p24K84O91M49k05r50j221n31Q04J744J614Q68M63P16
54359B61722J091J053Q38J235K581L982L873J700j046k235j444l13k43p85q09
54344B71200l27j98n67p85m65L11J426K321J736o49k692j728J789M415L932J708
54328B81427R3o45j464k154j678j88J051J424J324R59J36p64q11J73J204J305
54312B81392M56p44j679j861r39R70L087M244L608J487n51r83M7J047J276J607
54296B92464K756L790L488K415K208L115L690L051K078J919K363K361J453Oj530
$$ plain form
54281 325627 322734 318968 315078 311526 308073 304251 300336 297502 296642 297195 297646 297176 296213 295216 293814 291759
54265 291759 289936 289319 289291 288201 285608 282864 281286 280768 280558 280315 279732 278023 274714 270566 266930 264469
54249 264469 263072 262681 263440 265055 266661 267435 267100 265893 264387 263333 263328 264452 266187 267681 268218 267749
54233 267749 267078 267235 268485 270115 271237 271592 271511 271400 271391 271334 271059 270618 270102 269091 266865 263635 261067 260668
54215 260668 261912 262949 263016 262982 263496 263986 263953 263917 264219 264019 262587 260835 260492 262178 265134 268420 271499
54198 271499 274070 276205 278398 280768 282504 282828 282148 281566 281614 282106 282709 282875 281873 280002 279191 280973
54182 280973 284070 285463 283956 281358 279886 279770 279934 279816 279595 279297 278553 277061 274933 272801 271533 271363
54166 271363 271364 270546 269474 269788 271975 274596 276124 276522 276422 275809 274455 272907 271997 271710 271369 270684 269982
$$ packed form
54281C25627k893l766l890l552l453l822l915k834q60N53M51m70r63r97j402k055
54265B91759j823o17k8j090k593k744j578n18k10k43n83j709l309m148l636k461
54249B64469j397l91P59J615J606P74l35j207j506j054nJ124J735J494N37m69
54233B67749o71J57J250J630J122L55q1j11rn7k75m41n16j011k226l230k568l99
54215B60668J244J037O7l4N14M90l3l6L02k00j432j752l43J686K956L286L079
54198B71499K571K135K193K370J736L24o80n82M8M92O03J66j002j871q11J782
54182B80973L097J393j507k598j472j16J64j18k21k98p44j492k128k132j268j70
54166B71363Jq18j072L14K187K621J528L98j00o13j354j548r10k87l41o85p02
$$ plain form
54149 269982 269695 270215 271821 274103 275880 276450 276604 277594 279347 280582 280596 280002 279673 279836 280454 281725 283635
54132 283635 285407 285885 284492 281787 279204 278060 278515 279560 280141 280026 279399 278290 277040 276601 277285 277708
54116 277708 276365 274198 273954 276642 280180 282367 283666 285750 288489 290076 289563 287510 284360 279997 275275
54101 275275 272308 272205 273444 273465 271462 268859 267345 267176 267397 267200 266782 266926 267892 268968 269220 268370 266700
54084 266700 264592 262844 263010 266212 271437 276007 278210 278734 279217 280306 281706 283222 284799 286082 286849
54069 286849 287532 288529 289249 288641 286542 283868 281614 280271 280052 280972 282725 284987 287684 290494 292506 293171
54053 293171 293365 294591 297127 299747 301265 301535 300911 299725 298643 298592 299691 300737 300295 298120 295255 293033
54037 293033 292189 292639 293828 295300 296862 298203 298836 298889 299382 300928 302539 302779 301960 301936 303601 305823 307192
$$ packed form
54149B69982k87N20J606K282J777N70J54R90J753J235J4n94l29J63O18J271J910
54132B83635J772M78j393k705k583j144M55J045N81j15o27j109j250m39O84M23
54116B77708j343k167k44K688L538K187J299K084K739J587n13k053l150m363m722
54101B75275k967j03J239K1k003k603j514j69K21j97m18J44R66J076K52q50j670
54084B66700k108j748J66L202N225M570K203N24M83J089J400J516J577J283P67
54069B86849O83R97P20o08k099k674k254j343k19R20J753K262K697K810K012O65
54053B93171J94J226K536K620J518K70o24j186j082n1J099J046m42k175k865k222
54037B93033q44M50J189J472J562J341O33N3M93J546J611K40q19k4J665K222J369
$$ plain form
54020 307192 307529 307084 305529 302902 300724 300944 303979 308559 313214 317243 320514 323017 324652 325167 324642
54005 324642 324175 325407 328844 333226 337112 340493 344230 348607 353355 358660 365153 373127 382476 393123
53991 393123 404530 414942 422032 424553 422986 418830 413838 409528 406442 403850 400966 398380 397520 398706
53977 398706 400726 402561 404653 407931 412136 415725 417323 417035 416417 417103 419347 421945 423737 424830 426007
53962 426007 427474 428856 430092 431312 431856 430419 426641 421910 418088 415744 413875 411053 406614 401023
53948 401023 395320 390230 385789 381899 378843 376859 375469 373822 371663 369496 367819 366635 365654 364503
53934 364503 362872 360945 359530 359120 358935 357628 354925 351779 348872 345921 342860 340822 341131 343650 346796
53919 346796 349125 350502 351646 352868 353624 353414 352781 352797 353527 353846 353242 352946 354320 356756 358359 358500 358521
$$ packed form
54020C07192L37m45j555k627k178K20L035M580M655M029L271K503J635N15n25
54005C24642m67J232L437M382L886L381L737M377M748N305O493P974R349J0647
53991C93123J1407J0412P090K521j567m156m992m310l086k592k884k586q60J186
53977C98706K020J835K092L278M205L589J598k88o18O86K244K598J792J093J177
53962D26007J467J382J236J220N44j437l778m731l822k344j869k822m439n591
53948D01023n703n090m441l890l056j984j390j647k159k167j677j184r81j151
53934C64503j631j927j415m10j85j307k703l146k907k951l061k038L09K519L146
53919C46796K329J377J144J222P56k10o33J6P30L19o04k96J374K436J603J41K1
$$ plain form
53902 358521 359943 363051 367230 371559 374940 376850 378349 381297 386196 391729 396682 401210 405909 410909
53888 410909 416530 423429 431145 437563 441061 442506 444158 447138 450845 454118 455980 455813 453985 452079
53874 452079 451642 452942 455513 459294 464417 470474 476957 483836 490678 495869 498005 497756 497191 497610 499265
53859 499265 502699 508700 516864 525664 534134 542271 549900 556701 563519 571881 581745 591283 599604 608050
53845 608050 617919 628363 637662 645035 649790 650078 644477 634181 621825 608547 593948 578592 564480
53832 564480 552672 542117 531455 520620 510011 499366 488413 477755 468214 459792 451916 444156
53820 444156 436306 428463 421509 416642 413656 410549 405832 400552 396860 395089 393625 391364 388741 386177
53806 386177 383126 379339 375883 373961 373467 373498 373597 373668 373254 371874 369840 367926 366386 364956 363618 362579
$$ packed form
53902C58521J422L108M179M329L381J910J499K948M899N533M953M528M699N000
53888D10909N621O899P716O418L498J445J652K980L707L273J862j67j828j906
53874D52079m37J300K571L781N123O057O483O879O842N191K136k49n65M19J655
53859D99265L434O001Q164Q800Q470Q137P629O801O818Q362R864R538Q321Q446
53845F08050R869J0444R299P373M755K88n601j0296j2356j3278j4599j5356j4112
53832E64480j1808j0555j0662j0835j0609j0645j0953j0658r541q422p876p760
53820D44156p850p843o954m867k986l107m717n280l692j771j464k261k623k564
53806C86177l051l787l456j922m94L1R9P1m14j380k034j914j540j430j338j039
$$ plain form
53790 362579 361605 360143 358260 356844 356726 357910 359636 360851 360798 359759 359119 360115 362460 364669 365715 365835
53774 365835 365819 366117 366710 367182 366898 365717 364567 364613 365791 366897 367161 366857 366283 365303 364265 364187 365359 366750
53756 366750 367594 368529 370330 372532 374523 377053 381066 385719 389311 391918 395169 399388 403146 406361 411647
53741 411647 420846 431536 439106 441962 442911 445261 449185 452609 454442 455655 457585 460280 462734 464122
53727 464122 464376 463894 463107 462367 461865 461442 460535 458467 454840 449786 443946 438143 432870 428053 423429 419058
53711 419058 415097 411179 406663 401771 397817 395682 394466 392437 389167 385937 384081 383696 384165 385053 386052
53696 386052 386665 386507 385551 383761 380998 377815 375790 376182 378394 380516 381375 381379 381301 381093 380325 379232 378698
53679 378698 379361 381015 382758 383671 383717 384189 386742 391567 396917 401016 403944 406824 409606 411020 411013 411796
$$ packed form
53790C62579r74j462j883j416j18J184J726J215n3j039o40R96K345K209J046J20
53774C65835j6K98N93M72k84j181j150M6J178J106K64l04n74r80j038p8J172J391
53756C66750Q44R35J801K202J991K530M013M653L592K607L251M219L758L215N286
53741D11647R199J0690P570K856R49K350L924L424J833J213J930K695K454J388
53727D64122K54m82p87p40n02m23r07k068l627n054n840n803n273m817m624m371
53711D19058l961l918m516m892l954k135j216k029l270l230j856l85M69Q88R99
53696C86052O13j58r56j790k763l183k025L92K212K122Q59Mp8k08p68j093n34
53679C78698O63J654J743R13M6M72K553M825N350M099K928K880K782J414pP83
$$ plain form
53663 411796 415417 421013 425640 427594 427872 428390 429807 431466 432782 434093 436354 440248 445353 450175 453381
53648 453381 455035 456318 458032 459966 461818 464039 467349 471884 477268 483153 489211 494851 499452 502894
53634 502894 505584 508037 510574 513260 515968 518610 521277 523947 526135 527321 527695 527911 528004 527344 525871
53619 525871 524477 523569 522180 519447 516359 514883 515580 517137 518207 518704 519143 519582 519687 519256 518357 517209
53603 517209 516069 514997 513798 512438 511325 510747 510267 509244 507816 506834 507041 508795 512146 516294 519351
53588 519351 519860 518637 517994 518963 520381 520930 520828 520943 521459 522238 523535 525374 526989 527911 529012 531467
53572 531467 535154 539109 543114 547710 552867 557862 562500 567392 572802 578166 583053 587825 592952 598349
53558 598349 603708 608819 613297 616764 619897 624603 632266 642035 651514 659109 665165 670986 677436 684607
$$ packed form
53663D11796L621N596M627J954K78N18J417J659J316J311K261L894N105M822L206
53648D53381J654J283J714J934J852K221L310M535N384N885O058N640M601L442
53634E02894K690K453K537K686K708K642K667K670K188J186L74K16R3o60j473
53619E25871j394r08j389k733l088j476O97J557J070M97M39M39J05m31q99j148
53603E17209j140j072j199j360j113n78m80j023j428r82K07J754L351M148L057
53588E19351N09j223o43R69J418N49j02J15N16P79J297J839J615R22J101K455
53572E31467L687L955M005M596N157M995M638M892N410N364M887M772N127N397
53558E98349N359N111M478L467L133M706P663R769R479P595O056N821O450P171
$$ plain form
53544 684607 692187 699694 706652 712912 718696 724182 729282 734050 738941 744181 749013 752146 753020 752151 750134
53529 750134 746977 742794 738462 734811 731355 726706 720361 713489 707701 703559 700517 697826 695055 692023
53515 692023 688701 685221 681786 678591 675907 674095 673453 674030 675567 677477 679033 679864 680213 680463 680592 680546
53499 680546 681029 683183 687330 692593 697925 702883 707204 710482 712889 715554 719543 724940 731573 740053
53485 740053 751099 764104 777391 789917 801845 813489 824780 836128 848811 863851 880992
53474 880992 899317 918368 938087 958043 977515 996464 1016011 1037720 1062394 1089419 1117293
53463 1117293 1144990 1172916 1202180 1232942 1264074 1294834 1326327 1360587 1398406 1438746 1480229
53452 1480229 1522458 1565684 1609904 1654740 1699771 1744466 1788080 1830148 1870974 1911196 1950902
$$ packed form
53544F84607P580P507O958O260N784N486N100M768M891N240M832L133Q74q69k017
53529G50134l157m183m332l651l456m649o345o872n788m142l042k691k771l032
53515F92023l322l480l435l195k684j812o42N77J537J910J556Q31L49K50J29m6
53499F80546M83K154M147N263N332M958M321L278K407K665L989N397O633Q480
53485G40053J1046J3005J3287J2526J1928J1644J1291J1348J2683J5040J7141
53474H80992J8325J9051J9719J9956J9472J8949J9547K1709K4674K7025K7874
53463A117293K7697K7926K9264L0762L1132L0760L1493L4260L7819M0340M1483
53452A480229M2229M3226M4220M4836M5031M4695M3614M2068M0826M0222L9706
$$ plain form
53441 1950902 1989521 2026519 2061774 2095389 2127667 2159333 2191136 2223017 2254204 2284538 2315175
53430 2315175 2347406 2381046 2414416 2445700 2473984 2499427 2523092 2546322 2569569 2591857 2612007
53419 2612007 2630071 2646804 2661881 2673725 2681194 2684403 2683691 2678966 2670616 2659932 2647702 2633148
53407 2633148 2615118 2593744 2570160 2545275 2519681 2494012 2468172 2440771 2410639 2378664 2346839
53396 2346839 2315628 2283729 2250435 2216690 2183441 2150519 2117919 2086917 2058832 2033553 2010278
53385 2010278 1988961 1970025 1953295 1938352 1925577 1915774 1909001 1904766 1903207 1904935 1909645 1915963 1923037
53372 1923037 1931472 1942333 1955969 1972233 1991092 2012348 2035267 2059345 2085300 2114559 2147689
53361 2147689 2183880 2222102 2262267 2304857 2349686 2395657 2442003 2489577 2540601 2596946 2658621
$$ packed form
53441A950902L8619L6998L5255L3615L2278L1666L1803L1881L1187L0334L0637
53430B315175L2231L3640L3370L1284K8284K5443K3665K3230K3247K2288K0150
53419B612007J8064J6733J5077J1844P469L209p12m725q350j0684j2230j4554
53407B633148j8030k1374k3584k4885k5594k5669k5840k7401l0132l1975l1825
53396B346839l1211l1899l3294l3745l3249l2922l2600l1002k8085k5279k3275
53385B010278k1317j8936j6730j4943j2775r803o773m235j559J728M710O318P074
53372A923037Q435J0861J3636J6264J8859K1256K2919K4078K5955K9259L3130
53361B147689L6191L8222M0165M2590M4829M5971M6346M7574N1024N6345O1675
$$ plain form
53350 2658621 2723957 2791168 2859625 2929730 3001970 3076517 3153624 3233822 3317286 3403165 3490034
53339 3490034 3577142 3664927 3754155 3844855 3936250 4027405 4117599 4206340 4293429 4378893 4462395
53328 4462395 4542814 4618978 4690800 4759084 4823947 4884015 4937613 4984254 5024453 5058376 5085310
53317 5085310 5104378 5115211 5117910 5112759 5100047 5079743 5051275 5013968 4967691 4912738 4849146 4776938
53305 4776938 4697297 4612735 4525378 4435507 4342610 4247612 4152998 4060497 3969583 3878916 3788653
53294 3788653 3700504 3615795 3534347 3455379 3378750 3304862 3233730 3164642 3096746 3029852 2964659
53283 2964659 2902156 2842634 2785402 2729806 2676302 2626044 2579497 2536297 2496608 2461581 2431823
53272 2431823 2406235 2383267 2362567 2344126 2326269 2306221 2283089 2259044 2236990 2218104 2202246
$$ packed form
53350B658621O5336O7211O8457P0105P2240P4547P7107Q0198Q3464Q5879Q6869
53339C490034Q7108Q7785Q9228R0700R1395R1155R0194Q8741Q7089Q5464Q3502
53328D462395Q0419P6164P1822O8284O4863O0068N3598M6641M0199L3923K6934
53317E085310J9068J0833K699n151j2712k0304k8468l7307m6277n4953o3592p2208
53305D776938p9641q4562q7357q9871r2897r4998r4614r2501r0914r0667r0263
53294C788653q8149q4709q1448p8968p6629p3888p1132o9088o7896o6894o5193
53283B964659o2503n9522n7232n5596n3504n0258m6547m3200l9689l5027k9758
53272B431823k5588k2968k0700j8441j7857k0048k3132k4045k2054j8886j5858
$$ plain form
53261 2202246 2189444 2179645 2171645 2163828 2156097 2150060 2147002 2146409 2146866 2147890 2150481 2156225 2166122 2180023
53247 2180023 2196789 2214961 2233639 2253129 2274901 2300593 2330450 2362730 2395194 2427387 2460890
53236 2460890 2497093 2535499 2574795 2614692 2655540 2696628 2736313 2773894 2810053 2845079 2877766
53225 2877766 2906626 2931102 2950907 2965224 2973566 2976630 2975098 2968183 2954766 2935817 2914191 2891695
53213 2891695 2867453 2839593 2807540 2772085 2734190 2694622 2654078 2612706 2569723 2524337 2476839
53202 2476839 2428118 2378410 2327430 2275646 2224298 2173890 2123561 2072475 2021072 1970402 1920890
53191 1920890 1872459 1825262 1779360 1734103 1688893 1644476 1602366 1562845 1524673 1487210 1451603
53180 1451603 1418983 1388444 1358193 1328319 1300932 1277380 1256524 1236340 1216153 1196468 1177339
$$ packed form
53261B202246j2802r799q000p817p731o037l058n93M57J024K591N744R897J3901
53247B180023J6766J8172J8678J9490K1772K5692K9857L2280L2464L2193L3503
53236B460890L6203L8406L9296L9897M0848M1088L9685L7581L6159L5026L2687
53225B877766K8860K4476J9805J4317Q342L064j532o915j3417j8949k1626k2496
53213B891695k4242k7860l2053l5455l7895l9568m0544m1372m2983m5386m7498
53202B476839m8721m9708n0980n1784n1348n0408n0329n1086n1403n0670m9512
53191A920890m8431m7197m5902m5257m5210m4417m2110l9521l8172l7463l5607
53180A451603l2620l0539l0251k9874k7387k3552k0856k0184k0187j9685j9129
$$ plain form
53169 1177339 1158037 1138148 1118041 1098232 1079051 1061067 1044845 1029721 1013425 993750 970581
53158 970581 945882 921935 900101 880884 864117 848704 832935 815830 798034 781050 765772
53147 765772 752145 739858 728670 718034 707085 695283 682796 670086 657463 645135 633338
53136 633338 622166 611463 601067 590954 581115 571687 563301 556808 552274 548635 544779 540678 536966
53123 536966 533824 530905 528212 526196 524933 523923 522944 522380 522242 521511 519214 515838 512892 511069 509561
53108 509561 507448 505109 503681 503365 502958 501171 497999 494539 491722 489521 487245 484234 480333 476016 472173
53093 472173 469416 467433 465211 462082 458417 455203 453153 452370 452588 453406 454417 455374 456223 456838 456890 456224
53077 456224 455250 454667 454814 455392 455726 455237 453906 452540 452281 453492 455244 456235 456013 455045 453934 453066 452796
$$ packed form
53169A177339j9302j9889k0107j9809j9181j7984j6222j5124j6296j9675k3169
53158I70581k4699k3947k1834j9217j6767j5413j5769j7105j7796j6984j5278
53147G65772j3627j2287j1188j0636j0949j1802j2487j2710j2623j2328j1797
53136F33338j1172j0703j0396j0113r839r428q386o493m534l639l856m101l712
53123E36966l142k919k693k016j263j010r79n64j38p31k297l376k946j823j508
53108E09561k113k339j428l16m07j787l172l460k817k201k276l011l901m317l843
53093D72173k757j983k222l129l665l214k050p83K18Q18J011R57Q49O15N2o66
53077D56224r74n83J47N78L34m89j331j366k59J211J752R91k22r68j111q68k70
$$ plain form
53060 452796 453223 453806 453828 453368 453300 454259 456120 458482 460969 462893 463424 462468 460744 458585 455428 451103 446978
53043 446978 444815 444736 445248 445290 445237 445600 445624 444061 440976 437859 435786 434215 432148 429876 428590 428369 427726
53026 427726 425693 423408 422715 423805 425283 426194 426766 427302 427665 428100 429321 431396 433558 435580 438184 441528
53010 441528 444445 445968 446557 446838 446160 443663 440103 437380 436671 437960 440766 444130 446399 446398 444624 442314
52994 442314 439853 437308 435826 436641 438880 440154 439523 438187 437046 435422 432725 429608 426569 422959 418434
52979 418434 414091 411093 409311 408362 408697 410406 412116 412648 412946 414689 417550 419417 419095 417295 415115
52964 415115 413051 411517 410871 410591 409644 408047 406964 406938 407172 407062 407344 408912 411282 413111 413781 413694 413355
52947 413355 412934 412604 412611 412950 413422 414124 415492 417712 420308 422531 423988 424747 424953 424675 424286 424613 426275
$$ packed form
53060D52796M27N83K2m60o8R59J861K362K487J924N31r56j724k159l157m325m125
53043D46978k163p9N12M2n3L63K4j563l085l117k073j571k067k272j286k21o43
53026D27726k033k285o93J090J478R11N72N36L63M35J221K075K162K022K604L344
53010D41528K917J523N89K81o78k497l560k723p09J289K806L364K269jj774k310
52994D42314k461k545j482Q15K239J274o31j336j141j624k697l117l039l610m525
52979D18434m343k998j782r49L35J709J710N32K98J743K861J867l22j800k180
52964D15115k064j534o46k80r47j597j083k6K34j10K82J568K370J829O70q7l39
52947D13355m21l30PL39M72P02J368K220K596K223J457P59K06k78l89L27J662
$$ plain form
52930 426275 428819 430925 431672 431350 430956 431328 433002 436397 441330 446411 449588 449807 448043 446438 446342 447327
52914 447327 448193 448770 450201 453255 456969 459680 461133 462622 465124 468380 471974 476037 480135 482611 482204
52899 482204 479721 476965 474479 471570 468285 465951 465508 466246 466624 465664 463362 460321 457275 454555 451906
52884 451906 449106 446549 444646 442937 440595 437692 435167 433503 432326 431337 430663 430006 428493 425967 423636
52869 423636 422728 422984 423156 422666 422184 422703 424540 427098 429264 430095 429511 428382 427783 428059 428587 428430 427261
52852 427261 425638 424214 422849 421019 419150 418671 420135 422047 422510 421533 420638 420441 420004 418717 417559 417838
52836 417838 419502 421284 422085 421858 421476 421965 423579 425709 427869 430300 432943 434508 433785 431575 429911
52821 429911 429440 429025 428077 427558 428204 429404 430695 432840 436253 439571 441129 441139 441359 443206 446970 452071
$$ packed form
52930D26275K544K106P47l22l94L72J674L395M933N081L177K19j764j605r6R85
52914D47327Q66N77J431L054L714K711J453J489K502L256L594M063M098K476m07
52899D82204k483k756k486k909l285k334m43P38L78r60k302l041l046k720k649
52884D51906k800k557j903j709k342k903k525j664j177r89o74o57j513k526k331
52869D23636r08K56J72m90m82N19J837K558K166Q31n84j129n99K76N28j57j169
52852D27261j623j424j365j830j869m79J464J912M63r77q95j97m37j287j158K79
52836D17838J664J782Q01k27l82M89J614K130K160K431K643J565p23k210j664
52821D29911m71m15r48n19O46J200J291K145L413L318J558J0K20J847L764N101
$$ plain form
52805 452071 457052 459992 459941 457723 454924 452801 452445 454578 458174 460490 459697 456631 452979 449110 445116
52790 445116 442554 442856 444553 444328 440851 435818 431232 427429 424024 421091 418814 417133 416170 416077 416319 416109
52774 416109 415624 415723 416354 416379 415157 413293 411689 410850 411202 412966 415414 417178 417540 416816 415611 414472 413896
52757 413896 413626 412334 409334 406217 405178 406011 406639 406551 407513 410527 414258 417276 419757 421861 422467 421006
52741 421006 418900 417534 416126 413349 409926 407714 406793 405292 401926 397417 393504 391604 392168 394350 396475
52726 396475 397569 398111 398749 399054 398473 397736 398058 399356 400452 400751 400653 400378 399456 397403 394336 390997 388598
52709 388598 388066 388950 389785 390202 391663 395096 398890 400781 400902 401078 401667 401312 399939 399650 401788 404821
52693 404821 406338 405967 405177 405111 405787 406841 407886 408283 407568 406291 405938 407700 411369 415400 418034 418612
$$ packed form
52805D52071M981K940n1k218k799k123l56K133L596K316p93l066l652l869l994
52790D45116k562L02J697k25l477n033m586l803l405k933k277j681r63r3K42k10
52774D16109m85R9O31K5j222j864j604q39L52J764K448J764L62p24j205j139n76
52757D13896k70j292l000l117j039Q33O28q8R62L014L731L018K481K104O06j461
52741D21006k106j366j408k777l423k212r21j501l366m509l913j900N64K182K125
52726C96475J094N42O38L05n81p37L22J298J096K99r8k75r22k053l067l339k399
52709C88598n32Q84Q35M17J461L433L794J891J21J76N89l55j373k89K138L033
52693D04821J517l71p90o6O76J054J045L97p15j277l53J762L669M031K634N78
$$ plain form
52677 418612 418003 417725 418645 420473 422240 423025 422569 421639 421630 423241 425496 426487 425224 422589 420501 420295 421750
52660 421750 423366 423622 422097 419363 416037 412532 409618 408240 408278 408407 407818 407338 408028 409486 410529 410885
52644 410885 411073 411103 410595 409876 409693 409918 409752 409161 409054 410020 411897 414463 417602 420900 424103 427714 431948
52627 431948 435494 436811 436482 436527 437320 437049 434630 431225 428214 425518 423042 422055 423648 426908 429960 431960
52611 431960 433000 433068 432290 431452 431033 430427 429122 427907 427691 427898 427410 426667 427430 430610 435372 440177 443823
52594 443823 445805 446730 448133 450908 454086 455974 456145 455453 454596 453875 454013 455771 458582 460746 461239 460567
52578 460567 459708 459117 458929 459338 460484 462501 465832 471057 478471 488152 500036 513316 526126 536680
52564 536680 544455 549503 551089 548203 541253 532170 522849 514336 507255 501727 496987 492329 488450 486556
$$ packed form
52677D18612o09k78R20J828J767P85m56r30rJ611K255R91j263k635k088k06J455
52660D21750J616K56j525k734l326l505k914j378L8J29n89m80O90J458J043L56
52644D10885J88L0n08p19j83K25j66n91j07R66J877K566L139L298L203L611M234
52627D31948L546J317l29M5P93k71k419l405l011k696k476r87J593L260L052K000
52611D31960J040O8p78q38m19o06j305j215k16K07m88p43P63L180M762M805L646
52594D43823J982R25J403K775L178J888J71o92q57p21J38J758K811K164M93o72
52578D60567q59n91j88M09J146K017L331N225P414R681J1884J3280J2810J0554
52564E36680P775N048J586k886o950r083r321q513p081n528m740m658l879j894
$$ plain form
52550 486556 486098 484928 482006 478502 475788 473929 472802 473003 474485 475718 475681 475606 477180 479785 481213 480732
52534 480732 479756 479413 479056 477699 475729 474391 474240 474822 475553 476250 476850 477119 476974 476930 477831 479915 482319
52517 482319 483845 484060 483381 482301 481003 479507 477573 474687 471007 468198 468214 470923 473978 475373 475179
52502 475179 474393 473374 472300 471946 472699 473499 472973 471173 469156 467362 465597 464169 463657 463679 463129 461710
52486 461710 460211 459264 458850 458959 459673 460580 461202 461996 463712 465740 466535 466063 466342 468812 472480 475575 477860
52469 477860 480120 482267 483482 483776 484009 484399 484290 483646 483611 485006 487046 488211 488060 487522 487578 488354 489682
52452 489682 491912 495495 500040 504679 509583 516158 524959 534017 540275 542471 541632 538996 534790 529304
52438 529304 523703 518916 514599 510099 505726 502159 499191 496135 493247 491718 492167 493806 495305 496032 496313
$$ packed form
52550D86556m58j170k922l504k714j859j127K01J482J233l7p5J574K605J428m81
52534D80732r76l43l57j357j970j338j51N82P31O97O00K69j45m4R01K084K404
52517D82319J526K15o79j080j298j496j934k886l680k809J6K709L055J395j94
52502D75179p86j019j074l54P53Q00n26j800k017j794j765j428n12K2n50j419
52486D61710j499r47m14J09P14R07O22P94J716K028P95m72K79K470L668L095K285
52469D77860K260K147J215K94K33L90j09o44l5J395K040J165j51n38N6P76J328
52452D89682K230L583M545M639M904O575Q801R058O258K196q39k636m206n486
52438E29304n601m787m317m500m373l567k968l056k888j529M49J639J499P27K81
$$ plain form
52423 496313 496697 497090 496740 495354 494051 494367 496172 497563 497436 497210 499032 503085 507883 512622 517672 522898
52407 522898 527092 529488 530660 531396 531736 531722 532186 533948 536723 539478 541572 542979 543616 542998 540559 536268
52391 536268 531008 526170 522352 518513 513105 506185 499738 495589 493681 492774 492082 491648 491650 492116 492958 493674
52375 493674 493344 491661 489681 488740 488724 488312 487092 486594 488636 493152 498222 502040 504252 505387 505719 505208
52359 505208 504289 504033 505342 508318 512595 517914 524220 531624 540658 552114 566114 581552 597032 611983
52345 611983 626209 638580 647164 650725 649352 643699 634673 623971 613718 604876 596742 588466 580212
$$ packed form
52423D96313L84L93l50j386j303L16J805J391j27k26J822M053M798M739N050N226
52407E22898M194K396J172P36L40j4M64J762K775K755K094J407O37o18k439m291
52391E36268n260m838l818l839n408o920o447m149j908r07o92m34KM66Q42P16
52375D93674l30j683j980r41j6m12j220m98K042M516N070L818K212J135L32n11
52359E05208r19k56J309K976M277N319O306P404R034J1456J4000J5438J5480J4951
52345F11983J4226J2371Q584L561j373n653r026j0702j0253q842q134q276q254
$$ [...]
##END NTUPLES=NMR SPECTRUM
##END=
