
##TITLE=AC1230_PANAH12123_6524350_Xl2ii3pGXC
##JCAMPDX= 6.0         $$ Bruker NMR JCAMP-DX V2.0
##DATA TYPE= NMR SPECTRUM
##DATA CLASS= NTUPLES
##ORIGIN= BRUKER
##OWNER= Administrator
$$ 1.72 TOPSPIN		Version 2.1
$$ 2012-07-14 20:24:19.671 -0500  Administrator@TOPSPIN
$$ Compression mode = diff/dup
##.OBSERVE FREQUENCY= 400.02188249412
##.OBSERVE NUCLEUS= ^1H
##.ACQUISITION MODE= SIMULTANEOUS (DQD)
##.ACQUISITION SCHEME= undefined
##.AVERAGES= 8
##.DIGITISER RES= 22
##SPECTROMETER/DATA SYSTEM= spect
##.PULSE SEQUENCE= zg30
##.SOLVENT NAME= COFFEE_meoh
##.SHIFT REFERENCE= INTERNAL, COFFEE_meoh, 1, 14.98509
##AUDIT TRAIL= $$ (NUMBER, WHEN, WHO, WHERE, PROCESS, VERSION, WHAT)
$$ ##TITLE= Audit trail, TOPSPIN		Version 2.1
$$ ##JCAMPDX= 5.01
$$ ##ORIGIN= Bruker BioSpin GmbH
$$ ##OWNER= Administrator
$$ $$ C:\Bruker\TOPSPIN/data/COFFEE/nmr/AC1230_PANAH12123_6524350_Xl2ii3pGXC/10/pdata/1/auditp.txt
$$ ##AUDIT TRAIL=  $$ (NUMBER, WHEN, WHO, WHERE, PROCESS, VERSION, WHAT)
(   1,<2012-07-14 20:24:12.578 -0500>,<Administrator>,<TOPSPIN>,<go>,<TOPSPIN 2.1>,
      <created by zg
	started at 2012-07-14 20:23:06.078 -0500,
	POWCHK enabled, PULCHK disabled,
       configuration hash MD5:
       6B 1B 68 BB D9 2E 58 E2 7F 35 AD 54 07 DF 0E 41
       data hash MD5: 64K
       C0 60 30 72 18 4A 21 6E B6 32 EF 31 D8 01 C1 89>)
(   2,<2012-07-14 20:24:15.203 -0500>,<Administrator>,<TOPSPIN>,<proc1d>,<TOPSPIN 2.1>,
      <Start of raw data processing
       efp LB = 0 FT_mod = 6 PKNL = 1 PHC0 = 0 PHC1 = 0 SI = 32K 
       data hash MD5: 32K
       0E 5B 7D 54 60 B2 64 8D 82 4F 2E B3 69 A5 66 B7>)
(   3,<2012-07-14 20:24:15.625 -0500>,<Administrator>,<TOPSPIN>,<proc1d>,<TOPSPIN 2.1>,
      <pk PHC0 = 178.819 PHC1 = 0 
       data hash MD5: 32K
       83 A1 32 53 FA CC EB E1 C4 5D 4D CB 7B 3E 00 39>)
(   4,<2012-07-14 20:24:15.734 -0500>,<Administrator>,<TOPSPIN>,<proc1d>,<TOPSPIN 2.1>,
      <abs ABSG = 1 
       data hash MD5: 32K
       E1 1F 8B DC 59 7E AA 95 6A 31 34 B0 0E 4B B2 D1>)
(   5,<2012-07-14 20:24:15.765 -0500>,<Administrator>,<TOPSPIN>,<proc1d>,<TOPSPIN 2.1>,
      <abs ABSG = 2 
       data hash MD5: 32K
       31 74 7E 16 19 F7 1F BF D7 68 D2 08 63 94 54 A8>)
(   6,<2012-07-14 20:24:15.796 -0500>,<Administrator>,<TOPSPIN>,<proc1d>,<TOPSPIN 2.1>,
      <abs ABSG = 3 
       data hash MD5: 32K
       0E 0F E1 1E 4F C3 D6 D9 81 FA 32 89 48 12 86 55>)
(   7,<2012-07-14 20:24:15.828 -0500>,<Administrator>,<TOPSPIN>,<proc1d>,<TOPSPIN 2.1>,
      <abs ABSG = 4 
       data hash MD5: 32K
       E6 34 5A 75 0B 46 9D 89 B8 1F 2B F6 C3 93 8C C0>)
(   8,<2012-07-14 20:24:15.843 -0500>,<Administrator>,<TOPSPIN>,<proc1d>,<TOPSPIN 2.1>,
      <abs ABSG = 5 
       data hash MD5: 32K
       8C C3 AE 77 86 CF 9A AF 85 DF BB E6 72 F0 63 D4>)
$$ ##END=
$$ 
$$ $$ hash MD5
$$ $$ BB F0 45 84 C4 FF 1D A8 75 C0 61 D5 91 E4 4C 22
##$RELAX= 
##$RELAX= 
##$RELAX= 
##$RELAX= 
##$RELAX= 
##$RELAX= 
##$RELAX= 
$$ Bruker specific parameters
$$ --------------------------
$$ [...]
##$TP= (0..7)
150 150 150 150 150 150 150 150
##$TP07= 0
##$TPNAME0= <>
##$TPNAME1= <>
##$TPNAME2= <>
##$TPNAME3= <>
##$TPNAME4= <>
##$TPNAME5= <>
##$TPNAME6= <>
##$TPNAME7= <>
##$TPOAL= (0..7)
0.5 0.5 0.5 0.5 0.5 0.5 0.5 0.5
##$TPOFFS= (0..7)
0 0 0 0 0 0 0 0
##$TUNHIN= 0
##$TUNHOUT= 0
##$TUNXOUT= 0
##$USERA1= <user>
##$USERA2= <user>
##$USERA3= <user>
##$USERA4= <user>
##$USERA5= <user>
##$V9= 5
##$VALIST= <valist>
##$VCLIST= <CCCCCCCCCCCCCCC>
##$VD= 0
##$VDLIST= <DDDDDDDDDDDDDDD>
##$VPLIST= <PPPPPPPPPPPPPPP>
##$VTLIST= <TTTTTTTTTTTTTTT>
##$WBST= 2048
##$WBSW= 25
##$XGAIN= (0..3)
0 0 0 0
##$XL= 0
##$YL= 0
##$YMAX_a= 472708
##$YMIN_a= -599175
##$ZGOPTNS= <>
##$ZL1= 120
##$ZL2= 120
##$ZL3= 120
##$ZL4= 120
##$ABSF1= 14.98509
##$ABSF2= -5.573092
##$ABSG= 5
##$ABSL= 3
##$ALPHA= 0
##$AQORDER= 0
##$ASSFAC= 0
##$ASSFACI= 0
##$ASSFACX= 0
##$ASSWID= 0
##$AUNMP= <proc_prof1d_extract_pilot.lims>
##$AXLEFT= 0
##$AXNAME= <>
##$AXNUC= <1H>
##$AXRIGHT= 0
##$AXTYPE= 0
##$AXUNIT= <>
##$AZFE= 0.1
##$AZFW= 0.1
##$BCFW= 0
##$BC_mod= 0
##$BYTORDP= 0
##$COROFFS= 0
##$CY= 15
##$DATMOD= 1
##$DC= 0
##$DFILT= <>
##$DTYPP= 0
##$F1P= 0
##$F2P= 0
##$FCOR= 0.5
##$FTSIZE= 32768
##$FT_mod= 6
##$GAMMA= 0
##$GB= 0
##$INTBC= 1
##$INTSCL= 1
##$ISEN= 128
##$LB= 0
##$LEV0= 0
##$LPBIN= 0
##$MAXI= 10000
##$MC2= 0
##$MEAN= 0
##$ME_mod= 0
##$MI= 0
##$NCOEF= 0
##$NC_proc= -8
##$NLEV= 6
##$NOISF1= 0
##$NOISF2= 0
##$NSP= 0
##$NTH_PI= 0
##$NZP= 0
##$OFFSET= 14.98509
##$PC= 1
##$PHC0= 178.819
##$PHC1= 0
##$PH_mod= 1
##$PKNL= yes
##$PPARMOD= 0
##$PPDIAG= 0
##$PPIPTYP= 0
##$PPMPNUM= 2147483647
##$PPRESOL= 1
##$PSCAL= 4
##$PSIGN= 0
##$PYNMP= <proc.py>
##$REVERSE= no
##$SF= 400.02
##$SI= 32768
##$SIGF1= 0
##$SIGF2= 0
##$SINO= 400
##$SIOLD= 32768
##$SPECTYP= <>
##$SREGLST= <1H.CDCl3>
##$SSB= 0
##$STSI= 32768
##$STSR= 0
##$SW_p= 8223.68421052631
##$SYMM= 0
##$S_DEV= 0
##$TDeff= 65536
##$TDoff= 0
##$TI= <>
##$TILT= no
##$TM1= 0
##$TM2= 0
##$TOPLEV= 0
##$USERP1= <user>
##$USERP2= <user>
##$USERP3= <user>
##$USERP4= <user>
##$USERP5= <user>
##$WDW= 1
##$XDIM= 32768
##$YMAX_p= 464457551
##$YMIN_p= -725537
##$CURPLOT= <Network HP LaserJet P1505>
##$CURPRIN= <$Network HP LaserJet P1505>
##$DFORMAT= <normdp>
##$LAYOUT= <+/1D_H.xwp>
##$LFORMAT= <normlp>
##$PFORMAT= <normpl>
##$SURQMSG= 1
$$ End of Bruker specific parameters
$$ ---------------------------------
##NTUPLES= NMR SPECTRUM
##VAR_NAME=  FREQUENCY,     SPECTRUM/REAL,   SPECTRUM/IMAG
##SYMBOL=    X,             R,               I
##VAR_TYPE=  INDEPENDENT,   DEPENDENT,       DEPENDENT
##VAR_FORM=  AFFN,          ASDF,            ASDF
##VAR_DIM=   32768,         32768,           32768
##UNITS=     HZ,            ARBITRARY UNITS, ARBITRARY UNITS
##FACTOR=    0.250966925370066, 1,           1
##FIRST=     8223.43324360094, -86079,       -72866
##LAST=      0,             -202478,         3789
##MIN=       0,             -725537,         0
##MAX=       8223.43324360094, 464457551,    0
$$ Real data points
##PAGE= N=1
##DATA TABLE= (X++(R..R)), XYDATA
$$ [...]
19563A91447a13902b0872k33812A17168b8930A80658H955K377P1956b9226k40313
19552b69539c9731m08949E4382B2927M4974C632R6719a19158k90192b5881n6249
19541h2130h820k49451C33330d14064a3269j3735A88460a57680B74428C6182c6290
19529h3314B19630d9872e865q8235K1215j36819i4786E8090A7074J78718D0303
19517e651l52033a39948q1395B5534J22618h9823b6030J0780c592C46450a12400
19505c66707G0356b44859N7349B99766i7070I4813L6364L21232d8965j72255K7552
19494a93668B2177i0890B92556m5341A13807D4516R0361J23871a60489N678A97912
19482a40293A43811J09213e258k92157J03159B7688K19562b34803h0601D39922
$$ plain form
19563 191447 -113902 -20872 -254684 117168 -28930 180658 8955 11332 83288 -29226 -269539
19552 -269539 -39731 -448680 54382 22927 67901 3632 100351 -119158 -409350 -25881 -82130
19541 -82130 -8820 -258271 333330 -414064 -13269 -27004 188460 -157680 274428 36182 -36290
19529 -83314 219630 -49872 -5865 -94100 -72885 -209704 -94786 58090 17074 195792 40303
19517 -5651 -357684 -139948 -221343 25534 148152 -89823 -26030 -15250 -3592 346450 -112400
19505 -366707 70356 -244859 -187510 299766 -97070 94813 131177 452409 -48965 -221220 -193668
19494 -193668 22177 -90890 292556 247215 113807 44516 134877 258748 -160489 -154811 197912
19482 -140293 143811 253024 -5258 -297415 -194256 27688 247250 -234803 -80601 439922
19471a01581G0388e9644j88815f0251C42811E561a49460b0722E7798J71971c14089
19459e17121f2304j61090j24015a8620q7154k82929a12127A37486a10760j8166
19449a28926k42928E4010c30896a12597C19635b35057A56016b79364a29537A76321
19438b12076b1488h203j88965O8295B6510b09575Q8861A55852a30860J8741k63126
19427c75245Q606d3509A7612N1341k5136a56193j22005F5670O6033j2723P3384
19416A92364j8646K9436c45878c4533I4228b84415P7681a01598K1742k32296A16159
19404C52216A446a04740G1a66049j29084d5473A66194d17170B77825a15042j72190
19393b87232A43064c80511B11637C4385b22180e4156G8117L6186a9526C2664f2418
$$ plain form
19471 -101581 70388 -59644 -248459 -60251 342811 5561 -149460 -20722 57798 229769 -314089
19459 -517121 -62304 -223394 -347409 -18620 -105774 -388703 -112127 137486 -110760 -128926
19449 -128926 -371854 54010 -330896 -112597 319635 -235057 156016 -279364 -129537 176321
19438 -212076 -21488 -8203 -197168 -128873 26510 -209575 -120714 155852 -130860 -112119 -375245
19427 -375245 -366639 -43509 17612 68953 43817 -156193 -278198 65670 131703 118980 192364
19416 192364 173718 203154 -345878 -34533 94228 -284415 -206734 -101598 -79856 -312152 116159
19404 352216 1446 -104740 71 -166049 -295133 -45473 166194 -417170 277825 -115042 -287232
19393 -287232 143064 -380511 211637 34385 -222180 -54156 78117 114303 -19526 32664 -62418
19381b85320j85569a72705J9143o6495d3072o0676A52812a43062j35395j30218
19371d08675A9753J96891j00955c6178k86743a25940f1607I3422b17304D7146
19360A18681K96519q4194g7303a4294l35685B4104D154c23086A3969K06632a35423
19348a42114g0188A6100J61519b88277J25918I6550b20697m1881h0821k32746
19338c13567D5579a58553i289l85614J52469G6338b33418i4226C1314f6670A11809
19326a01110A20925J3514C0856c51394G8197b48493B0086b02517H2292e451j57118
19315a62569g967G0300P2563f2373o2883j88544M9289J24852K336r1289b0714
19303a97625j39458J5022J02303f1892A70900b22109C64546j61573B3535a63946
$$ plain form
19381 -285320 -470889 -172705 -153562 -220057 -43072 -103748 152812 -143062 -278457 -408675
19371 -408675 19753 216644 115689 -36178 -322921 -125940 -61607 93422 -217304 47146
19360 118681 415200 331006 -77303 -14294 -349979 24104 4154 -323086 13969 220601 -135423
19348 -142114 -70188 16100 177619 -288277 -162359 96550 -220697 -262578 -80821 -313567
19338 -313567 45579 -158553 -9289 -394903 -242434 76338 -233418 -94226 31314 -66670 111809
19326 -101110 120925 134439 30856 -351394 78197 -248493 20086 -202517 82292 -5451 -162569
19315 -162569 -7967 70300 142863 -62373 -125256 -313800 -264511 -139659 -137323 -228612 -20714
19303 -197625 -337083 -322061 -219758 -61892 170900 -222109 364546 202973 23535 -163946
19292b35186M4580B17100b10318A80060g8435E8932J08522a07643M2122k85304
19282c50825C7306a27352C94905b1281I5615b60999j2415Q3656e74A0010J48951
19271A58961c91784A94523e4813A31106a54841Q428c8526j59085g8545C5020i6155
19259b98586e1111A29458f2554r1507O356A21700K3641i0423A41861A3401b88491
19247b72490J16521C01763L7960A65103b25054o7319I6227R2071H5730M9740m9416
19236H6054b56425A4293c7636j60312f8740C02226e9636C24851a68165b0934M880
19225a6054F7671c81831A00403f1099k12073B00265a80206L8445A08532c403k62706
19214b66109J3779c3303k52113b9033A11385b9992j09918j32228A25499b13345
$$ plain form
19292 -235186 -190606 217100 -210318 180060 -78435 58932 167454 -107643 -65521 -350825
19282 -350825 37306 -127352 394905 -21281 95615 -260999 -273414 -189758 -574 10010 158961
19271 158961 -391784 194523 -54813 131106 -154841 -146413 -38526 -197611 -78545 35020 -96155
19259 -298586 -51111 129458 -62554 -154061 -147705 121700 145341 -90423 141861 13401 -288491
19247 -272490 -155969 301763 339723 165103 -225054 -292373 96227 188298 85730 135470 86054
19236 86054 -256425 14293 -37636 -197948 -68740 302226 -59636 324851 -168165 -20934 -16054
19225 -16054 67671 -381831 100403 -61099 -273172 200265 -180206 -141761 108532 -3403 -266109
19214 -266109 -252330 -33303 -285416 -29033 111385 -29992 -139910 -272138 125499 -213345
19203A95410a38504H0646K4738b38777B2593L27285B8477a77457k67440K12637
19193b32260d9996q4577l8040M8268H2937b54735c9014H1488J02074o8537k1146
19182I3879J11375B7814d15130c6025j56177B91447A08077J57174g3803j17830
19172a91633f5400j27293j8705A69448e08237b12508K8304O2797q5667o0102a10167
19160F2697N4448n3784c90232B10475H3208a92074a054A07446A3988d1628p8237
19149a19865N1971A20269n0175q645J00511d8969j69172j61144F5897b15246j2343
19138b27589A25160c22197O5865A20361a83711A23006g2459A51788a01803k54333
19128c56136R2916g4817B62573k3087b87197B04391e0388j74246J5636M5733p5302
$$ plain form
19203 195410 -138504 80646 105384 -238777 22593 349878 28477 -177457 -444897 -232260
19193 -232260 -49996 -134573 -172613 -124345 82937 -254735 -39014 81488 183562 115025 93879
19182 93879 205254 27814 -415130 -36025 -192202 291447 108077 265251 -73803 -191633
19172 -191633 -65400 -192693 -211398 169448 -508237 -212508 -184204 -121407 -207074 -267176 -110167
19160 62697 117145 63361 -390232 210475 83208 -192074 -1054 107446 13988 -41628 -119865
19149 -119865 -67894 120269 70094 61449 161960 -48969 -218141 -379285 65897 -215246 -227589
19138 -227589 125160 -322197 -256332 120361 -183711 123006 -72459 151788 -101803 -356136
19128 -356136 -263220 -74817 262573 239486 -287197 204391 -50388 -224634 -208998 -163265 -238567
19117b38567R4584E9325a54467G739L638K70392p3937I3084A8846a22162d4129
19105a63173j83034B8178L0881b95761J46039B40866d004B65516f0938r042j84302
19094b54282j3647Q3973L7755j72151I9606h546j45185j73484g8865A92483b25621
19082E8264j3642c190j50348F9738J41613m4985h7102G0902d0686n8396d0488
19070B33566b06491H3765J77214b52557p943M0626J09370o133j15381A0047L05039
19059C15086b3466A87854b41605e4821G4080b16026H5276a17371B6225i235l32907
19048c42142b8357j06666N5775m59707a43601j4788B25262j07119j1216K6252
19038A33179c44569P5630J24880f5635j80144d2930D3975e6311C331M6885a02026
$$ plain form
19117 -238567 -143983 59325 -154467 7739 11377 281769 207832 93084 18846 -122162 -44129
19105 -163173 -346207 28178 59059 -295761 -149722 240866 -4004 265516 -60938 -69980 -254282
19094 -254282 -267929 -183956 -146201 -318352 99606 -8546 -153731 -327215 -78865 192483 -225621
19082 58264 44622 -3190 -153538 69738 211351 166366 -87102 70902 -40686 -99082 -40488
19070 233566 -206491 83765 260979 -252557 -260500 -219874 -110504 -116637 -232018 10047 315086
19059 315086 -23466 187854 -241605 -54821 74080 -216026 85276 -117371 26225 -9235 -342142
19048 -342142 -28357 -135023 -79248 -538955 -143601 -158389 225262 118143 106927 133179
19038 133179 -344569 -268939 -144059 -65635 -245779 -42930 43975 -56311 3331 50216 -102026
19026B01547J64073a84201K5445j3469A2845a95163O621P1983A26283a06153c8709
19014h2635B7131b63961l2921f9680G0566e5653A15222r893a44733A7359J6963
19003C4322N0093R1778B2865e9993R464m3142A44249b89939h1666A16510c4921
18991a23940G7684j1782c9678j22273G7608J64785e04995C9169M5618b54348I5494
18979a11797f203D4814K8963g2636A60612b01920E4219L1930N8532d08840A99420
18967d4079j41017p6016a27064A63409c63612a12406j5137j45068B26992d4603
18956g4100k3252K5392I8836h5802L1153F6399b29432A0433a07251B8896r544
18945A9352K39721e3935p5597F7371K18995E3004a4214A26674b18343c2063p8794
$$ plain form
19026 201547 365620 -184201 -158756 -172225 12845 -195163 -188542 -116559 126283 -106153 -38709
19014 -82635 27131 -263961 -296882 -69680 70566 -55653 115222 105329 -144733 17359 34322
19003 34322 84415 176193 22865 -59993 -50529 -93671 144249 -289939 -81666 116510 -34921
18991 -123940 77684 65902 -39678 -161951 77608 242393 -504995 39169 84787 -254348 95494
18979 -111797 -6203 44814 73777 -72636 160612 -201920 54219 86149 144681 -408840 199420
18967 -44079 -185096 -261112 -127064 163409 -363612 -112406 -127543 -272611 226992 -44603
18956 -74100 -97352 -71960 98836 -85802 -54649 66399 -229432 10433 -107251 28896 19352
18945 19352 259073 -53935 -129532 67371 286366 53004 -14214 126674 -218343 -32063 -110857
18934a10857c4335B0112j536L87704A58017a79405A7388c0699F5539a75483E6713
18922i5269c975l47058J36033H9617J3821a65440a5538E0129b83681D2745h6580
18910G8243B8674Q4427M3804g165J823B00803C0224b05709d9173j38235f2232
18898c0377n0699k02526J04267D4190d10473C17875c00679C7699G299K31546c29250
18886C1745K28213g830A16169a91834E6800C501K4238Q3421a05040n2261A62635
18874C3558a5187A49812b57647P7467j58691f105I4862a84984K6189g9290B340
18862e8857G966b83032a25017F3886N6461a36764B58053p1159e5108j32826B95905
18850I7454f7359B47192a40616j23507d0392B57782f5314j30987g3722b7681E7962
$$ plain form
18934 -110857 -34335 20112 18576 406280 158017 -179405 17388 -30699 65539 -175483 56713
18922 -95269 -3975 -351033 -215000 89617 103438 -165440 -15538 50129 -283681 42745 -86580
18910 78243 28674 113101 156905 -7165 -5342 200803 30224 -205709 -49173 -187408 -62232
18898 -30377 -81076 -283602 -179335 44190 -410473 317875 -300679 37699 7299 238845 -329250
18886 31745 259958 -7830 116169 -191834 56800 3501 27739 111160 -105040 -157301 162635
18874 33558 -15187 149812 -257647 -180180 -338871 -6105 94862 -184984 -158795 -79290 2340
18862 -58857 7966 -283032 -125017 63886 120347 -136764 258053 186894 -55108 -187934 295905
18850 97454 -67359 247192 -140616 -264123 -40392 257782 -65314 -196301 -73722 -27681 57962
18838c02599A93761E0601d7686A80593a8238k9425B16265b4306A82494D2179M5218
18827H7397K1245Q4289c17172B040a27849B24117J7159h6908B72107a03437l6885
18816a40322F5038b43895P8200f3311C2421b25075A689R3876b01158A28864J9206
18805A48070R437b30818J13518e0838j23802I9795c7724l2144j67828i744k145
18794a1889J358j12468B13770J37131b78129b5109A03022j0841b78998b2647o3125
18783h5772d0931D8358b58983O6550j70830b2700A74030H0384C8533J15588a97278
18771a86295q5015J15037n4571e4184n0250c6890m10347a68763q3842i1522M5013
18760d6509j46963M4126G7367K89243b380A48339A9887g2937j53313F2106k5036
$$ plain form
18838 -302599 193761 50601 -47686 180593 -18238 -47663 216265 -24306 182494 42179 87397
18827 87397 108642 192931 -317172 2040 -127849 224117 241276 -86908 272107 -103437 -140322
18816 -140322 65038 -243895 -165695 -63311 32421 -225075 1689 95565 -201158 128864 148070
18805 148070 157507 -230818 -117300 -50838 -174640 99795 -37724 -69868 -237696 -9744 -11889
18794 -11889 -10531 -122999 213770 350901 -278129 -25109 103022 92181 -278998 -22647 -85772
18783 -85772 -40931 48358 -258983 -192433 -363263 -22700 174030 80384 38533 154121 -197278
18771 -186295 -271310 -156273 -210844 -54184 -104434 -36890 -447237 -168763 -252605 -91522 -46509
18760 -46509 -193472 -149346 77367 366610 -2380 148339 19887 -72937 -226250 62106 37070
18749C7070g8854G9476b62365A02772d5303j82363B76253a43663c5976B24116
18738a77594C12378c5567g457A55475a08274r0526C06966a2619m53336a3929j67902
18727a81831M5258j51457P1273H8956a86131n5148B33816A16383C7014b30980
18716h7316A8495c24705B7610a48121O9339j65951F0794i8695r8883D0544c74681
18704b46900L4927l8995O9459B22054j09047f3767q231A5745b12078A93273f257
18692b58046q450g1449n2976l848A31686e2375j53210J931k58648a15182A39040
18680c5211A38111b39187M9195l9741A00225b36549k6478A05287J22696B827c47296
18668e2582j53122A56966a65741H8374a58672f3353C5698a87107B02069i7397
$$ plain form
18749 37070 -78854 79476 -262365 102772 -45303 -227666 276253 -143663 -35976 224116
18738 -177594 312378 -35567 -7457 155475 -108274 -198800 306966 -12619 -465955 -13929 -181831
18727 -181831 -136573 -288030 -216757 88956 -186131 -241279 233816 116383 37014 -230980
18716 -87316 18495 -324705 27610 -148121 -78782 -244733 60794 -98695 -197578 40544 -374681
18704 -246900 -211973 -250968 -181509 222054 113007 -63767 -71998 15745 -212078 193273 -6257
18692 -258046 -266496 -71449 -124425 -128273 131686 -52375 -205585 -203654 -462302 -115182 139040
18680 -35211 138111 -239187 -189992 -229733 100225 -236549 -263027 105287 227983 2827 -347296
18668 -52582 -205704 156966 -165741 88374 -158672 -63353 35698 -187107 202069 -97397
18657A14404j8004A3776a56696B51778a4610I16J95067j3698d5358k85556L0965
18646b99949j6306j7128a12501j09387L9382p923l3776B4931c28628g3861L4020
18635c9841B59148j7684A12639I166O8366d0533j25101I2394b78880A7070o527
18624A0543b38839Q2815e1141j57209a7436A6090f1842F7621b21451A21810Q5176
18613B06986E2106h2739C11458j37069b7765B41825j20911J57756a19939j41316
18603b61255O5852A87535a88679B67688r8094b24517A07323e6177j05470C8309
18592a41544G8626a86382Q4932q244k41637B19216n6485G1786f8487r1578E3981
18580d8764A20404B5533g3010N984K3559L32k2741r3823E5001a94064q6055B41928
$$ plain form
18657 114404 96400 13776 -156696 251778 -14610 916 195983 182285 -45358 -330914 -299949
18646 -299949 -316255 -333383 -112501 -221888 -182506 -190429 -224205 24931 -328628 -73861 -39841
18635 -39841 259148 241464 112639 9166 77532 -40533 -165634 92394 -278880 17070 10543
18624 10543 -238839 -156024 -51141 -208350 -17436 16090 -61842 67621 -221451 121810 206986
18613 206986 52106 -82739 311458 174389 -27765 241825 120914 278670 -119939 -261255
18603 -261255 -195403 187535 -188679 267688 169594 -224517 107323 -56177 -161647 38309
18592 -141544 78626 -186382 -101450 -109694 -351331 219216 162731 71786 -68487 -160065 53981
18580 -48764 120404 25533 -73010 -67026 -43467 -43135 -65876 -159699 55001 -194064 -280119 241928
18567c47138L420J49242A82570J1708m2798P208o7431b87846E1760m532R8425
18556A45653f4020B81803E6744K3683J33176b16150D6728k1470J39112h5053a4687
18544b03025i1398p9251p8141P9426l8239k02448A3211Q9498M285J35363b48717
18532c9527j81019Q4112B20440d5761E7712d414B24551O2110c44926n7028B2041
18520b32692h7313k01822j5541R5379j17348R2138C3921a16522h521A42905C161
18508d7326k86896Q1938B01574i3674B12252a32596n6248B5416N07344A48870
18497B18238a61583A02266a40810K300A68930b8151k37726a698o8688I1633a04783
18485b18354d1298m2909A4122M4411a13256r2758D18550a82141p1907G1946a62146
$$ plain form
18567 -347138 -343718 -194476 182570 194278 151480 158688 91257 -287846 51760 47228 145653
18556 145653 -64020 281803 56744 80427 213603 -216150 46728 25258 164370 -85053 -14687
18544 -203025 -91398 -170649 -248790 -169364 -207603 -410051 13211 102709 106994 242357 -248717
18532 -39527 -220546 -136434 220440 -45761 57712 -4414 224551 286661 -344926 -401954 22041
18520 -232692 -87313 -289135 -304676 -209297 -326645 -234507 33921 -116522 -8521 142905 3161
18508 -47326 -334222 -252284 201574 -93674 212252 -132596 -188844 25416 532760 148870
18497 218238 -161583 102266 -140810 -138510 168930 -28151 -265877 -1698 -70386 91633 -104783
18485 -218354 -41298 -84207 14122 58533 -113256 -206014 418550 -182141 -254048 71946 -162146
18473b09325Q0268E9052a48457O7456A03912L514c84626a73668f0415k06092J12107
18462a54400o7604B49617a99915d5793j27599k63954E4676c64598a26587C6716
18451G5104Q1768a65007j18568A5217J03461C0747c8080B5564c15437A41243a36027
18439f9362J7862k9775B1230J42889b7892D6889b69923J10793i731C9066a29474
18427c52731r9131B83959a17311M8188K1538j97432J00012A48265a72436A3505
18416a06755a5905j4734j33488B06879E6488a17836G8301P9324a63329B96730
18405c6665r8192O1669j07476A91817a9560B25070a34580J6925I7070p095b82499
18393a03175N002j23658c1154a0492l15849B13661a00955q9304I7214L8344b30082
$$ plain form
18473 -209325 -129057 59052 -148457 -81001 103912 107426 -384626 -173668 -60415 -266507 -154400
18462 -154400 -222004 249617 -199915 -45793 -173392 -437346 54676 -364598 -126587 36716
18451 75104 156872 -165007 -283575 15217 118678 30747 -38080 25564 -315437 141243 -136027
18439 -69362 -51500 -81275 21230 164119 -27892 46889 -269923 -159130 -9731 39066 -129474
18427 -352731 -451862 283959 -117311 -69123 -47585 -245017 -145005 148265 -172436 13505
18416 -106755 -15905 -30639 -164127 206879 56488 -117836 78301 157625 -163329 296730
18405 -36665 -134857 -73188 -180664 191817 -19560 225070 -134580 -117655 97070 89975 -282499
18393 -103175 -98173 -221831 -31154 -10492 -326341 213661 -100955 -190259 97214 135558 -230082
18381b77801J08558M062b2965j76656A20163C1294J31011q267a88553C4377J10261
18370A44638h0644B9814J11151m7877K21062q6709A04736l0524A4766a21400E0744
18358F4254N826b60386K1939a17637A7857b25791C68930g9318k11969C65936a07336
18346B45299a47185O2481C13482A56277d8242k92513h5708b4371I038a13060a5694
18334B26240B8160d46304B04421N7543f4026j03329A68856a76509Q2976j66133
18324b59666A37534a31167A0033b95195g4898B29529e84035b88760a22175M0029
18314h2146m651K1382H0393a03879A02190Q061a05650j19374A20717g3657c415
18302a58611A261K43646J90497h6412m58879b37429D706K7158Q6138f2823m5833
$$ plain form
18381 -277801 -169243 -165181 -22965 -199621 120163 31294 162305 154038 -188553 34377 144638
18370 144638 -80644 29814 140965 93088 314150 227441 104736 74212 14766 -121400 50744
18358 64254 70080 -260386 -238447 -117637 17857 -225791 368930 -79318 -291287 365936 -107336
18346 245299 -147185 -84704 313482 156277 -48242 -340755 -85708 -24371 9038 -113060 -15694
18334 226240 28160 -446304 204421 261964 -64026 -167355 168856 -176509 -93533 -259666
18324 -259666 137534 -131167 10033 -295195 -74898 229529 -584035 -288760 -122175 -82146
18314 -82146 -86797 -65415 80393 -103879 102190 110251 -105650 -225024 120717 -73657 -3415
18302 -158611 1261 244907 435404 -86412 -545291 -237429 4706 31864 118002 -62823 -108656
18291a08656A72091C6911K46803c3249O917A25777a75307A49835a16742A00866
18280D5576d78940a66898Q3052j83650h4655C8622A713b6576k39527A76894C4793
18268i0960j67174J2774b921A23032a01480k11187B25569l8762h2706k34606A35522
18256a68889J8959k7934B38168I0619a74175O2626l7658A13175a85703O3321k32964
18245c55346A20452J07804h9585A6156J52015c97794b4365A20608O3231j5696
18235A68143H0284g5001m1800p9114f3812A75831l6363a3530D2940L5284f9906
18223B52149l3448G5992a4141k29365i1070c7892B86114b27050P1955q8966Q6124
18212a57937n5682f1924C416a26965M4295j75876J7543h9423j18847N6826A89602
$$ plain form
18291 -108656 172091 36911 283714 -33249 -26332 125777 -175307 149835 -116742 100866
18280 45576 -478940 -166898 -83846 -267496 -84655 38622 1713 -26576 -266103 176894 34793
18268 -90960 -258134 -245360 -2921 123032 -101480 -312667 225569 186807 -82706 -317312 135522
18256 -168889 -149930 -177864 238168 90619 -174175 -111549 -149207 113175 -185703 -122382 -355346
18245 -355346 120452 228256 -89585 16156 168171 -397794 -24365 120608 183839 168143
18235 168143 80284 -75001 -116801 -195915 -63812 175831 139468 -13530 42940 78224 -69906
18223 252149 218701 75992 -14141 -243506 -91070 -37892 286114 -227050 -155095 -244061 -157937
18212 -157937 -213619 -61924 3416 -126965 -82670 -258546 -241003 -89423 -208270 -151444 189602
18200C18322f4456m09180a25840A57209c97299b4074p553j03211j87271a44805
18189i0999D6086K12449b9977A8651J30337L7338R0747a38979C9724a14963A16251
18177H4941k8050R3132d3048j62886e840k72400B17735a16872B2543b01321H1857
18165B04118K0141b09752A35993b07165e1568k16555I4857a76474c8575A43885
18154f2599J3699A63400D6693J23134G3494f43035g3063k91276a48843b3071n3760
18143g6831k47511f6494L0499j14720K3914A93861a55301k12733a23249j53958
18133b77207R109g5627H7162h0107N314A33915Q6921K6119a00348H1176j4451
18122F6725c85316B5222J09209J49702l2342g0252D4259b97121c4700A49572J3216
$$ plain form
18200 318322 -64456 -473636 -125840 157209 -397299 -24074 -31627 -134838 -322109 -144805
18189 -90999 46086 258535 -29977 18651 148988 186326 277073 -138979 39724 -114963 116251
18177 84941 56891 150023 -43048 -205934 -5840 -278240 217735 -116872 22543 -201321 81857
18165 204118 224259 -209752 135993 -207165 -51568 -268123 94857 -176474 -38575 143885
18154 -62599 -48900 163400 46693 169827 73494 -643035 -73063 -364339 -148843 -23071 -76831
18143 -76831 -324342 -66494 -35995 -150715 -126801 193861 -155301 -368034 -123249 -277207
18133 -277207 -268098 -75627 87162 -80107 -74793 133915 220836 246955 -100348 81176 66725
18122 66725 -385316 25222 134431 284133 251791 -70252 44259 -297121 -34700 149572 162788
18111A62788a06925M8565j07557C0054J09415r059i0713M4459a3870B12611c67980
18099A63779a29853M2892k44153b138m2239I6704B3063e1502A55078a5895j21961
18088a37856B23263L7806b42006A14475H518b5283B32478e3905j03199J7471b9534
18076A63968c7883A49564B879J56374D9546B2373Q5929q717c2197d462j00269
18065a04731k30469d7758H9540a32548A15697l2568l7503a01530L8876l58957
18055d21611A41849K73097F6195c4746J2493j78999A28742c6631j51496L2663
18045a55464q7814d4140H8263b6910q9223G0720a69885O1488A74018l4152J62747
18034C02613j36642k8742b05584K3822M4212c697B11777E7778a41582j5056j26596
$$ plain form
18111 162788 -106925 -58360 -165917 30054 139469 130410 -90713 -46254 -13870 212611 -367980
18099 163779 -129853 -86961 -331114 -2138 -44377 96704 23063 -51502 155078 -15895 -137856
18088 -137856 223263 261069 -242006 114475 8518 -25283 232478 -53905 -157104 -139633 -29534
18076 163968 -37883 149564 2879 159253 49546 22373 108302 99585 -32197 -4462 -104731
18065 -104731 -335200 -47758 89540 -132548 115697 83129 45626 -101530 -62654 -421611
18055 -421611 141849 414946 66195 -34746 -22253 -201252 128742 -36631 -188127 -155464
18045 -155464 -243278 -44140 88263 -26910 -116133 70720 -169885 -108397 174018 139866 302613
18034 302613 165971 137229 -205584 -181762 -137550 -3697 211777 57778 -141582 -156638 -283234
18023b83234A56354a55859g6294p7892H4276c66095a58493G0520a36964j00264
18013b37228C2602E377a61333B98735n2418f9101K5574A87075e5168J5165A09843
18001a20177e7714j06686e6809B24765p7403o7315Q5424a236j90071k11457A60525
17989b3099n7699G3499a91555D3401J32157c13266h0961j66032d9552E2376f33640
17977A29961b94768I9299d0875C20770a25821k97a3657j72128r166p0565A0025
17965A8199b91379J07308G6922c60404a08508c2527A17128a24824D2921a69396
17954c00271J45009A00268C9140J39793b7308o8700n4447g3436j57450A18173
17943A26444k8264L6900d5814n3648p5393M4193B95274A31016b07684E1793h1333
$$ plain form
18023 -283234 156354 -155859 -76294 -154186 84276 -366095 -158493 70520 -136964 -237228
18013 -237228 32602 5377 -161333 298735 246317 -69101 -43527 187075 -55168 -40003 109843
18001 -120177 -57714 -164400 -56809 224765 147362 80047 165471 -1236 -191307 -402764 160525
17989 -23099 -80798 73499 -191555 43401 175558 -313266 -80961 -246993 -49552 52376 -633640
17977 129961 -294768 99299 -40875 320770 -125821 -126118 -13657 -185785 -194951 -265516 10025
17965 18199 -291379 -184071 76922 -360404 -108508 -32527 117128 -124824 42921 -169396
17954 -300271 -155262 100268 39140 178933 -27308 -96008 -150455 -73436 -230886 118173
17943 126444 98180 135080 -45814 -99462 -174855 -130662 295274 131016 -207684 51793 -81333
17931H9743j8270a6163k14275c7224k81838A26739A2310R6290b68119c0093B1058
17919d8657G610b0723j14035K3502H2026k7420c6217I3261K14835a37250C0484
17907c10867B52178j19458g3768j73744B64833b1518D48092b04004e4007A49519
17896e4808F3761R6068a52245A89844c8299l881G495J5786a5030k18491j03727
17885c37248B05009C2204R4206C5111K21434h7288C05470A17637a10658A70742
17874A8557h9388o2701L6961A33426a11496D428b05894i5037I5272a63187C6741
17862b36226a02721A52178l9868a13181j679C3566e1016K1306A27357d6458k04753
17851b51211G0329l483k4934K06257D6242B90a27879l0619B54649a17027J8491
$$ plain form
17931 89743 71473 -16163 -230438 -37224 -319062 126739 12310 108600 -268119 -30093 21058
17919 -48657 7610 -20723 -134758 -111256 82026 54606 -36217 93261 308096 -137250 30484
17907 -310867 252178 132720 -73768 -247512 264833 -21518 448092 -204004 -54007 149519
17896 -54808 63761 159829 -152245 189844 -38299 -42180 7495 23281 -15030 -233521 -337248
17885 -337248 205009 32204 126410 35111 256545 -87288 305470 117637 -110658 170742
17874 18557 -89388 -152089 -115128 133426 -111496 4428 -205894 -95037 95272 -163187 36741
17862 -236226 -102721 152178 112310 -113181 -114860 33566 -51016 -29710 127357 -46458 -251211
17851 -251211 70329 66846 41912 248169 46242 290 -127879 -158498 254649 -117027 -98536
17840i8536B59395a17180c5601j64158i3819E3740a67142B80771c3983B2812a7929
17828B28986c68692D3606R1939a07090c0972q5236M6408K3018A25201i6078A37287
17816c5230l4281D328J33940J26629c20660B61867b41527B62745A17287J0599
17806A27886d9068m3344J3352j00773g1792D8840a97578C65289e0083E0810M5117
17795I5927a58762b2277j01739c8176H7234K33O3756d6827a8325k6905j4580E1568
17782a04785A80290H1169C9077a6188q0478q8164D05336b07494o8966A53537n4877
17771I8660b7805I8865i112B26158D8070K45067C2870L8986r439h6069b8941B06468
17758G1541c43578B5999d0241H3513J80408F6434B243d2916a9983A64978d28563
$$ plain form
17840 -98536 259395 -117180 -35601 -199759 -93819 53740 -167142 280771 -33983 22812 -17929
17828 228986 -368692 43606 135545 -107090 -30972 -116208 -69800 -46782 125201 -96078 137287
17816 -35230 -69511 4328 138268 264897 -320660 261867 -241527 262745 117287 127886
17806 127886 -49068 -92412 -79060 -179833 -71792 48840 -197578 365289 -50083 50810 95927
17795 95927 -158762 -22277 -124016 -38176 87234 87467 151223 -46827 -18325 -45230 -59810 51568
17782 -104785 180290 81169 39077 -16188 -96666 -184830 405336 -207494 -276460 153537 98660
17771 98660 -27805 98865 -9112 226158 48070 293137 32870 71856 62417 -86069 -28941 206468
17758 71541 -343578 25999 -40241 83513 263921 66434 2243 -42916 -19983 164978 -428563
17746e396j26416c5445l1926l9349A6395b70898B388a0973D3832J92985c7009
17734b77768d5925a3066B01598L2699a40732A3725h798j43740j46284f5634A14340
17722a24492C83806a08996A69762D0506O5134A1607J11990a41328m5994N8699
17712a28623B15619e4207q1550a1166F8244K1289h5682B11869j8374m2700J04025
17701B54820F256a68964f1109r4086B66678b14197g4382A53902E0958f7349k12332
17690b79681a2157B60447a15822p0459f784n7039A08717m1987J61511J29225a38217
17678B5663b38561D795J3834J24109e3862j05338j48189e2751A34887b7007B43876
17666E7167A7798g4950j42643M9960F3544b19227P8280M3238k0398C2152h3210
$$ plain form
17746 -5396 -131812 -35445 -67371 -106720 16395 -270898 2388 -10973 43832 236817 -37009
17734 -277768 -45925 -13066 201598 234297 -140732 13725 -8798 -152538 -298822 -65634 114340
17722 -124492 383806 -108996 169762 40506 105640 11607 123597 -141328 -187322 -128623
17712 -128623 215619 -54207 -135757 -11166 68244 89533 -85682 211869 193495 150795 254820
17701 254820 6256 -168964 -61109 -155195 266678 -214197 -74382 153902 50958 -67349 -279681
17690 -279681 -12157 260447 -115822 -186281 -6784 -63823 108717 66730 228241 357466 -138217
17678 25663 -238561 4795 18629 142738 -53862 -159200 -307389 -52751 134887 -27007 243876
17666 57167 17798 -74950 -217593 -167633 63544 -219227 -140947 -97709 -118107 32152 -83210
17654a41345I1671C886f1389D8325a85388A7318a7293j57235A62919c4522n5597
17643i0119J1349a3812j05906H1174a24805b5590A21224a00135b9794C80027c667
17631A39484a80843K681d0478C131P7493L40923A5489J79827d3711B6271b8805
17619A78530e3205A88493l2235c25150b3504A62390L96595A28237a74378b0915
17608B03234G8910l8184O6837J39872o8130D1478N9480e4907o1879K0918B33505
17596F9305c84607R9034A94614a20922A47853L28593C0679N2462k2317c09345
17585h5900A08254N4422L6555J09301J40337e3285m4310A43387a25913D42231
17574C05481a2745H1910a21050J0352H0090o961E915L18363j56680a23788E34024
$$ plain form
17654 -141345 91671 3886 -61389 48325 -185388 17318 -17293 -174528 162919 -34522 -90119
17643 -90119 -78770 -13812 -119718 81174 -124805 -25590 121224 -100135 -29794 380027 -3667
17631 139484 -180843 -178162 -40478 3131 80624 421547 15489 195316 -43711 26271 -28805
17619 178530 -53205 188493 156258 -325150 -23504 162390 558985 128237 -174378 -20915
17608 203234 78910 40726 107563 247435 179305 41478 100958 -54907 -116786 -95868 233505
17596 69305 -384607 -285573 194614 -120922 147853 476446 30679 83141 60824 -309345
17585 -85900 108254 162676 199231 308532 448869 -53285 -97595 143387 -125913 442231
17574 305481 -12745 81910 -121050 -110698 80090 73129 5915 324278 167598 -123788 534024
17562B38044l184E5799i8479M737r4526G5484K18411h9404H7610J9852L9305a85085
17549a96027C1859a90091k19511F2798Q637l35P6512J63032r1116a4274j34548
17538a48822I0412P5533L43673A65518a24551f112F4809K2329b41142I8067i1396
17526d2021I795K56423j15072Q4714J39030d1768B12666b30228c759k18185A77976
17514b24960A69328a52603K1108C9819c40345A72107e4746j58421A5744j708h4486
17502A84420J05188A36883P3043a42245b5865j17869A60962l0228h9601j40726
17492b30327A78620b43904H3639J28198f8397F7243d9805A07917J26818q1022
17482A53713J14685b8774D25453A76909J5289K50266j54253b7143D0899M5677
$$ plain form
17562 238044 234860 55799 -98479 -93742 -188268 75484 293895 -89404 87610 107462 146767 -185085
17549 -196027 31859 -190091 -409602 62798 71435 71100 147612 310644 219528 -14274 -148822
17538 -148822 90412 165945 509618 165518 -124551 -6112 64809 87138 -241142 98067 -91396
17526 -42021 9795 266218 151146 235860 374890 -41768 212666 -230228 -3759 -221944 177976
17514 -224960 169328 -152603 -131495 39819 -340345 172107 -54746 -213167 15744 14036 -84486
17502 184420 289608 136883 209926 -142245 -25865 -143734 160962 130734 -89601 -230327
17492 -230327 178620 -243904 83639 211837 -68397 67243 -49805 107917 234735 153713
17482 153713 268398 -28774 425453 176909 192198 442464 288211 -27143 40899 86576
17472H6576L466K07170c1637C18899h971D8744J66848h034B96443a69952C58115
17460A09198J64965A24347C8110L4066L6051j3869J4469N0449M4140E9651L47295
17449D06946p4701l156M56594B95599Q9553e0691B21322J82889A25609O585L03932
17438D36126H9999K35287j46911J16389j40668M6043J87061A58677R5824R9307
17428C53808l0402j17197d0498H3502N66790A29900b36984F2563J03093c2251
17417A81318M43303k09114A33322j0989n7069J61812J3986C158e8841k30169A98537
17405C26079n9047j750f0828D350K81534o4356A6494K41804f1376D5300K83492
17394C28792A21136b91824I4309P4280N8055K7088a34175d2630B21971l5798J31964
$$ plain form
17472 86576 90042 297212 -31637 318899 -8971 48744 215592 -8034 296443 -169952 358115
17460 109198 274163 124347 38110 72176 108227 94358 108827 159276 203416 59651 406946
17449 406946 332245 329089 785683 295599 385152 -50691 221322 404211 125609 132194 436126
17438 436126 89999 325286 178375 294764 154096 200139 387200 158677 254501 353808
17428 353808 323406 206209 -40498 83502 650292 129900 -236984 62563 165656 -32251
17417 181318 624621 415507 133322 122333 65264 227076 241062 3158 -58841 -289010 198537
17405 326079 267032 265282 -60828 4350 285884 221528 16494 258298 -61376 45300 328792
17394 328792 121136 -291824 94309 168589 226644 253732 -134175 -42630 221971 186173 318137
17383C18137K9234a17049B41153p9253D1637b36909B78800K37292k10470b38547
17372H5844J90424F271c396C31496n7903Q6752g3599B21594p612c8615A14199
17360a6184n288l1855A84998l2121n6660M12750c0031A37925L96645A71687o5361
17349A06326K3536N8621g1330B94755K83585F4069a04030L5981I2188j5225e3430
17337B95116I2707J60953F5703J64981J77889H7542P5707L580M9244C554J24881
17326A28435h8673A35642L69194k18766a79961C0714O3532a51515A42651O4168
17316B06819d8471B907N7743Q8514L2596K6847i6948B90724A03340D093K19009
17305B23102H1032A7416J0911e0889l7788j991j5446A43299J66669I3849L15494
$$ plain form
17383 318137 347371 -117049 241153 161900 41637 -236909 278800 516092 305622 -238547
17372 85844 276268 6271 -3396 331496 273593 360345 -73599 221594 213982 -38615 114199
17360 -16184 -21472 -53327 184998 152877 96217 508967 -30031 137925 534570 171687 106326
17349 106326 129862 188483 -71330 294755 578340 64069 -104030 -68049 92188 76963 -53430
17337 295116 92707 253660 65703 230684 408573 87542 163249 166829 216073 3554 128435
17326 128435 -88673 135642 504836 286070 -179961 30714 94246 -151515 142651 206819
17316 206819 -48471 2907 60650 149164 181760 208607 -96948 290724 103340 4093 223102
17305 223102 81032 17416 28327 -50889 -88677 -90668 -106114 143299 309968 93849 409343
17294D09343A26125b51786a026B87401H3319O8275a00016F8119a51562C81662
17283B29805C7515b54954A91218n8440E8904L68397j64685K17236B02618R8520
17273C01138a53067A18806a52774E36338k38253c5369C18662g7002A79535E4361
17262A37300Q7911A07146R3297O3634L2105c8692D67549b36050C84284d6182A6492
17250b982l8506B19918K92540q4150j80334f7793A5160K08372p4227E6115K84915
17239C41030N5549b33701A79198J05660K11917B21172p0333C3065P820o852f4256
17227I3371L06038j55018E2723J45171n8798A7329K37620H9503K35206R3130j40679
17216B77160J4454I4493C8464K04133B2447O7821C1044L15614A07831J9529K56074
$$ plain form
17294 409343 126125 -251786 -1026 287401 83319 151594 -100016 68119 -151562 381662
17283 229805 37515 -254954 191218 132778 58904 427301 262616 479852 202618 301138
17273 301138 -153067 118806 -152774 536338 298085 -35369 318662 -77002 179535 54361
17262 137300 225211 107146 200443 264077 296182 -38692 467549 -236050 384284 -46182 16492
17250 -2982 -41488 219918 512458 428308 247974 -67793 15160 223532 149305 56115 341030
17239 341030 396579 -233701 179198 284858 496775 221172 150839 33065 40885 34033 -64256
17227 93371 399409 244391 52723 197894 139096 17329 254949 89503 324709 417839 277160
17216 277160 291614 94493 38464 242597 22447 90268 31044 346658 107831 127360 383434
17205C83434D2759J30846a13586A23696M42445A93639E6963J45201F1639J86485
17195B48124a02642B58353A9088b9922A62393J79760j59505d1176A54049c7828
17184B82502g9326D06408j42364J81993j42891H6450L00831k7019b13120A83254
17173a14599A37799M8509N4563L7642K72744I8862J09082r1084L10367d540j99456
17162b03996D03307m6296A01159J5716L3285k2132O4868J80848j44182n4746L28275
17151E03091l0209j31747j19452h5979A24673N1982P0048c8313D72573B27767
17140C38749M9353o6993B8394J35589Q1227A12659L34378j65227j15598n2064
17130A14148E044J21572a39732A57707J46488O8354o9027K3355I8636J95528m3487
$$ plain form
17205 383434 42759 173605 -113586 123696 566141 193639 56963 202164 61639 248124
17195 248124 -102642 258353 19088 -29922 162393 342153 182648 -41176 154049 -37828
17184 282502 -79326 406408 264044 446037 303146 86450 387281 360262 -213120 183254
17173 -114599 137799 186308 240871 278513 551257 98862 207944 116860 427227 -4540 -203996
17162 -203996 403307 357011 101159 116875 150160 128028 192896 373744 229562 174816 503091
17151 503091 472882 341135 221683 -85979 124673 176655 246703 -38313 472573 227767
17140 338749 388102 321109 28394 163983 245210 112659 447037 281810 166212 114148
17130 114148 5044 126616 -139732 157707 304195 372549 303522 326877 98636 294164 250677
17119B50677L89763B85841m3648N42020B38104M8988G6176M62048B22010K04630
17109D26640j32435A47096k3772R8430m1261J9450K87359P6048j53089q8636L6026
17098C57651J80217J36660k91210R4461O6392A52274K4901M24723A82557p91K46487
17087D28253j06488N5705A20742L4026m2949M08237R388B05833L0175L40236k34624
17076C41620I5099B6729L34485r0592j05567R8902L65118l6542B51713L67175
17066F18888n2245p9121B09461J73735K18901k56846J83034j40171p0738k7569
17056B89807K36320j25650F8844M98334j85300p0356k240j00741K97546K54963
17046G61050l18061L17746r7416j54597k28646K24989l6368K28024B24374L42694
$$ plain form
17119 250677 640440 285841 242193 784213 238104 287092 76176 538224 222010 426640
17109 426640 294205 147096 123324 221754 180493 199943 487302 563350 410261 321625 357651
17098 357651 537868 674528 383318 477779 544171 152274 177175 601898 182557 181766 428253
17087 428253 321765 377470 120742 154768 111819 520056 529444 205833 236008 576244 341620
17076 341620 95099 26729 361214 270622 165055 263957 629075 592533 251713 618888
17066 618888 566643 487522 209461 383196 602097 345251 528285 388114 317376 289807
17056 289807 526127 400477 68844 567178 381878 311522 309282 208541 506087 761050
17046 761050 442989 760735 663319 508722 280076 505065 468697 696721 224374 567068
17036E67068l7764l9115K53386p2991k16891J35469l6785k04209P7818j88435
17026B37551L33280j85176J68955o2345K3680j40320J38094l0134m2953L71754
17016H12386C89648j21650M18344C15802K10719J49768j68243K60061j36831J65870
17006G97146B07121L21156k01788L72523J62881l15523l7352n3259N2689j82976
16996C25472M07594K47957l93469q1206J32229J85152k17388j12158K61957R2099
16986H48239k07578J69574j23451J57363j85580J90236l39381J17382R3951Q1560
16976H02315j83427j12930L75497j54159L14838l77001K59762j66220L42907m95046
16966F06536J33341L35227k47256J08802k74031J33470j74224K94928k62272J76762
$$ plain form
17036 567068 529304 490189 743575 670584 453693 589162 552377 348168 425986 237551
17026 237551 570831 385655 554610 492265 515945 375625 513719 483585 440632 812386
17016 812386 389648 267998 686342 315802 526521 676289 508046 768107 631276 797146
17006 797146 207121 528277 326489 699012 861893 546370 509018 455759 508448 325472
16996 325472 733066 981023 587554 506348 638577 823729 606341 494183 756140 848239
16986 848239 640661 810235 686784 844147 658567 848803 509422 626804 720755 802315
16976 802315 618888 505958 881455 727296 1042134 665133 924895 758675 1101582 606536
16966 606536 739877 1075104 827848 936650 662619 796089 621865 916793 654521 831283
16956H31283j4098J0984P1838J23732M1572j08802n8470M4556j77717J49944k4052
16945H90770j26256L7576K72574k63143K00533J21936l79813j97829O97305n36923
16935G16730M18181k59663K19968j23899J2635R9022L4114j63747J29711J75203
16925A258255n15453M12797j05256J04424j87641K60360j88209l8134L13011J26907
16915A441061m32280J99464K85258j80578j4569j58582K16586L29854l01022n7228
16905A327964N0359j78521j531K06328m5934Q3253j24268M63379l31816K03542
16895A652755j84426J05788L91393k18321j81608l02071J1398N24802J48628m4716
16885A903622k53413K57769n105k13570R3697j54990K47237n4574M33972k72235
$$ plain form
16956 831283 817185 828169 900007 1023739 1065311 956509 898039 942595 764878 914822 890770
16945 890770 764514 802090 1074664 811521 1012054 1133990 754177 556348 1253653 716730
16935 716730 1134911 875248 1095216 971317 983952 1082974 1117088 953341 1083052 1258255
16925 1258255 742802 1155599 1050343 1154767 967126 1227486 1039277 1001143 1314154 1441061
16915 1441061 1008781 1208245 1493503 1312925 1298356 1139774 1356360 1686214 1385192 1327964
16905 1327964 1378323 1199802 1198271 1404599 1358665 1441918 1317650 1781029 1449213 1652755
16895 1652755 1468329 1574117 1965510 1747189 1565581 1263510 1274908 1799710 1948338 1903622
16885 1903622 1650209 1907978 1902873 1689303 1783000 1628010 1875247 1820673 2254645 1982410
16875A982410n2849P6139j25904L83749J394k60674J17084k36171N58030j99633
16865B243575l38354J65935O8578J71877j32470L34288k77293N25111m22156R7014
16855B436105L36989k77724O15131k44062j83781j9776q3775M75507J07234l30118
16845B831730K85892J810K8946j9849J2704K53897R8136j6766M1340j70846M23251
16834C770245j99262P6107k4931K47105j41989Q5319j55367L11763J94616k04673
16824C958933r2587J36189J70928J83265J77601J04395k72741N77031j93745R8731
16814D848000L88824m0105Q7116j03588q9209K59018K87402K47756q9215K66355
16804F062354L9528L99364L79322m31581N89493J95887r9775O1929J82850J49741
$$ plain form
16875 1982410 1929561 2005700 1879796 2263545 2264939 2004265 2121349 1885178 2443208 2243575
16865 2243575 1905221 2071156 2139734 2311611 2179141 2513429 2236136 2761247 2339091 2436105
16855 2436105 2773094 2495370 3110501 2866439 2682658 2662882 2579107 3054614 3161848 2831730
16845 2831730 3117622 3119432 3148378 3128529 3141233 3395130 3493266 3476500 3517840 3346994 3770245
16834 3770245 3570983 3647090 3622159 3869264 3727275 3812594 3657227 3968990 4163606 3958933
16824 3958933 3866346 4002535 4173463 4356728 4534329 4638724 4365983 4943014 4749269 4848000
16814 4848000 5236824 5196719 5283835 5180247 5091038 5350056 5637458 5885214 5795999 6062354
16804 6062354 6101882 6501246 6880568 6448987 7038480 7234367 7134592 7196521 7379371 7529112
16794G529112K86754M26233j05624M47429L0896N59980l54123N91635R7285J56467
16784I666044O15083M16163L31492L2552O42343L36035j34587Q55713L29733K55908
16774A3346479J87631P65105M84423M13330L92461N40221O46573R99501J63545
16765A7939269M57678J065298M53429R59516J139006O56042J180562O61389J300845
16756B5813034Q33188J227106J207156J275286J975795J079386J842881J834302
16748C7088134J898725K093655J928036K694335K632151K254927L188015L091031
16740E6869009L056550L716857M318880M063515M688150M729412N956359N458568
16732I2857300O045249O565989O663698P367137P843398P895209Q664146Q266112
$$ plain form
16794 7529112 7815866 8242099 8136475 8583904 8614800 9174780 8820657 9412292 9509577 9666044
16784 9666044 10281127 10697290 11028782 11061334 11703677 12039712 11905125 12760838 13090571 13346479
16774 13346479 13534110 14299215 14783638 15196968 15589429 16129650 16776223 17775724 17939269
16765 17939269 18396947 19462245 19915674 20875190 22014196 22670238 23850800 24512189 25813034
16756 25813034 26646222 27873328 29080484 30355770 32331565 33410951 35253832 37088134
16748 37088134 38986859 41080514 43008550 45702885 48335036 50589963 53777978 56869009
16740 56869009 59925559 63642416 67961296 72024811 76712961 81442373 87398732 92857300
16732 92857300 98902549 105468538 112132236 119499373 127342771 135237980 143902126 152168238
16724A52168238Q475047Q130598P785835O758449O122053M865667L764022K307765
16716B00377674N22421r55389k827659l221103n394911o437026p210119p907892
16708A66945996q127091q302588q956119q172255p945494p605585p586509o953115
16700A03297240o860415o146574n465559n451476m927354m502293m003200m134319
16692F1806050l528425l654312l004336k939297k670143k216561k620781k157608
16684C9014587j917531j637560k056116j456800j760390j361245j342971j078762
16676B6403212j247946r46332j100187p88150j051992p67968r00897j030451r19509
16667A7649780j24994j194488J88962j100067l36852n84854p12032l82319n90636
$$ plain form
16724 152168238 160643285 168773883 176559718 183318167 189440220 194305887 198069909 200377674
16716 200377674 200900095 199944706 197117047 193895944 188501033 182064007 174853888 166945996
16708 166945996 158818905 150516317 141560198 133387943 125442449 117836864 110250355 103297240
16700 103297240 96436825 90290251 84824692 79373216 74445862 69943569 65940369 61806050
16692 61806050 58277625 54623313 51618977 48679680 46009537 43792976 41172195 39014587
16684 39014587 37097056 35459496 33403380 31946580 30186190 28824945 27481974 26403212
16676 26403212 25155266 24208934 23108747 22320597 21268605 20500637 19599740 18569289 17649780
16667 17649780 17524786 16330298 16519260 15419193 15082341 14497487 13785455 13403136 12812500
16658A2812500k65756l71351m61539J12164r10718l15380k88193j24141j22844
16649A0064742m47108p27762r628j93209K62397p64391m02256R8780k83658q5260
16639G512647l01462n1295j70726O0914j84040l21709m96205R5263k71398j52094
16629E719895J75399m48975K57384k86348k04327o20363M56830L9931m04446K62769
16619D947749m46231K59811n28889N4025J52687o53914L28768k62650J3571n1026
16609C813901j26725j9429L23001n02815j59168j27895K78988n86326L01366l6421
16599C158477l70140M64364j60970j48320K54363l39026j52608K25692l1889J56433
16589C056376n45247J70731j64997j78992J03766L29264n25202m3185J82450k18672
$$ plain form
16658 12812500 12546744 12175393 11713854 11826018 10915300 10599920 10311727 10187586 10064742
16649 10064742 9617634 8889872 8880244 8687035 8949432 8185041 7782785 7881565 7597907 7512647
16639 7512647 7211185 7159890 6989164 7050078 6866038 6544329 6048124 6143387 5871989 5719895
16629 5719895 5895294 5446319 5703703 5417355 5213028 4592665 5049495 5089426 4684980 4947749
16619 4947749 4501518 4761329 4232440 4286465 4439152 3785238 4114006 3851356 3864927 3813901
16609 3813901 3687176 3667747 3990748 3487933 3328765 3200870 3479858 2893532 3194898 3158477
16599 3158477 2788337 3252701 3091731 2943411 3197774 2858748 2706140 2931832 2899943 3056376
16589 3056376 2511129 2681860 2516863 2337871 2441637 2770901 2245699 2202514 2384964 2166292
16579B166292p9956M10812k22347k3075j22914J10184m7432n7142l01185L1048
16569A864285j41716j24502K77869J58067k67275j62550R9373M6799J27082j39351
16559A738081k09679k9480j17162K41500J33709k30089K6898n27669M99497l57817
16549A167789L89704n27969N40149l72059L23739J56636j19699k02733l52138
16540A003419K64463J57190l0883n118j95480l3418k3982q2217K77566l2168l67126
16529I32246L76691j99021J07499j51682L10181k30329q7027P9921J16760N8150
16519A313389o03770K91743K4259P1733m16m35068L18967q3651K73146n19987
16509F50345L02284l68519K53087J90983J90859o09456O83786l51164p6078l04605
$$ plain form
16579 2166292 2086336 2497148 2274801 2251726 2128812 2238996 2191564 2134422 1833237 1864285
16569 1864285 1722569 1598067 1875936 2034003 1766728 1604178 1703551 1750350 1877432 1738081
16559 1738081 1528402 1498922 1381760 1623260 1756969 1526880 1553778 1026109 1525606 1167789
16549 1167789 1557493 1029524 1569673 1197614 1521353 1677989 1558290 1355557 1003419
16540 1003419 1267882 1425072 1394189 1389071 1193591 1160173 1136191 1053974 1331540 1299372 932246
16529 932246 1308937 1109916 1217415 1065733 1375914 1145585 1058558 1138479 1255239 1313389
16519 1313389 709619 1001362 1025621 1097354 1096938 661870 980837 897186 1170332 650345
16509 650345 952629 584110 837197 1028180 1219039 609583 1293369 942205 866127 561522
16499E61522N34179j57164k20962L12004m28075p4014R2675l5204L44988j29713
16489H00236J75266l63614j81791K03368j14029o7124N2611L86597l91519K95285
16479G95286k01143M8650k05387K41330K28669j85009j88139n0895l2346K93313
16469G44329q1476P6349l48836l532L84765k52910j13895M51107D19939K7090
16459D47029J04241Q8378J28840k12396j07464R5189p828j1481J35657J76300
16449H36465l10083M9905j94507J35056m6165L5944K0285j26933J49509k16139
16439C33337L80609j69546j90330N6727P7047P1827k25376K93139k44044k0572
16429C62818k814J39944j63514J56512j74196K76167j61093q5962Q3120K61309
$$ plain form
16499 561522 1095701 938537 717575 1029579 601504 527490 620165 584961 929949 800236
16489 800236 975502 611888 430097 633465 519436 452312 504923 891520 500001 795286
16479 795286 594143 642793 437406 678736 907405 722396 534257 483362 451016 744329
16469 744329 662853 739202 390366 386834 771599 518689 404794 855901 419939 447029
16459 447029 551270 639648 768488 556092 448628 543817 535989 524508 660165 836465
16449 836465 526382 576287 381780 516836 470671 506615 526900 399967 549476 333337
16439 333337 713946 544400 354070 410797 487844 559671 334295 627434 383390 362818
16429 362818 360004 499948 336434 492946 318750 594917 433824 347862 430982 692291
16419F92291C34942A34107J95730P1987k0249A30225K88479r6097A01539K86352
16409C87891K4583A73687M3567L86697k31760k8186K66832g27C56491A75540Q6232
16398B61772Q8545j29038o9186P9294r0498M43435p1065j9271B43754L14292A47405
16386D79732B25656o5494K59582j87834N9856Q6781J79256B61423J95142O7301
16376E23866j11880C5309P35760A95244k0146B8255K99996o3618k1234J46750
16366C90149A35132A7143L73409n8176J43253j29624C6521K75098G4108a19758
16355E55819B21095M2507H5017J79025A12723P976K42885A174L60512M8276A62951
16343B12943a0712E64376B82006M7386O291J03564j31778p5123E9499J65854J10748
$$ plain form
16419 692291 334942 134107 329837 401824 381575 130225 418704 322607 101539 387891
16409 387891 412474 173687 217254 603951 372191 344005 610837 -727 356491 175540 261772
16398 261772 350317 221279 152093 231387 140889 584324 513259 493988 243754 558046 147405
16386 479732 225656 160162 419744 231910 291766 378547 557803 261423 456565 523866
16376 523866 411986 35309 771069 195244 175098 28255 328251 264633 243399 390149
16366 390149 135132 17143 390552 332376 475629 346005 36521 311619 74108 -119758
16355 555819 221095 263602 85017 264042 112723 120699 363584 1174 361686 409962 162951
16343 212943 -10712 564376 282006 329392 335683 439247 307469 232346 59499 225353 336101
16332C36101g2700D5532K37841J83711k19203q1978K38411A66498E1804R3128
16322A44932K97948E1722K26564j20307R493Q7127f1948C47071o7923j39013F5454
16310e7279B65209O0901E4868K24321j24268L38974H9011j4117J90224L270j28793
16299A39595L39523A16646m0953i3555A24555a03757E4004K03039a76962C80324
16288B00161p3642L33815D3677J11816L0175l5970J7867h9828B73835D0026P2390
16277A12416K31818r9839D4012K34426A35714C7193a31443K3514g928B04611d3296
16265d7685C83771A89288n6199J91136P8645a92268D92923A63101J3679l8370
16255A38410L29798M4266A27025E032J42791i9075d221m9511I3133L1983C126
$$ plain form
16332 336101 -72700 45532 283373 467084 247881 165903 404314 166498 51804 144932
16322 144932 442880 51722 278286 157979 167472 254599 -61948 347071 279148 140135 65454
16310 -57279 265209 326110 54868 279189 154921 493895 89011 74894 265118 268388 139595
16299 139595 479118 116646 75693 -93555 124555 -103757 54004 257043 -176962 380324
16288 200161 126519 460334 43677 155493 185668 149698 167565 -89828 273835 40026 112416
16277 112416 344234 244395 44012 278438 135714 37193 -131443 -107929 -7928 204611 -43296
16265 -47685 383771 189288 133089 324225 402870 -192268 492923 163101 176780 138410
16255 138410 468208 512474 127025 5032 147823 -99075 -4221 -53732 93133 125116 3126
16243A63140E0703j9712L2015d5202B35692a27719c6139A97973n9001l4453B4685
16231A48378Q2594o0667K50820n9384H6329K9138K87356b7120C09797A29013L96255
16220E25268B4761L0320K67571f4177I8135m0246L06420j5567N1951A28866A828
16208A60987P0249b4137J0071j50624c8665j6731B27942D2612d8609j82753B02947
16196A61146i1396l049A25589c2266n1384E4370a05077j82300a33194b7073E28834
16184D78364c26045d4393E405h6836b6459A58648h2312B71600K07550c643B50512
16172A34856r297d1543A15106J10548a2658C508b25984A4210R2208k4011K29395
16161C11802l6162A28856b46124i5766E5854P9820F6324N1750D7123Q3963m1301
$$ plain form
16243 163140 50703 30991 63006 -45202 235692 -127719 -36139 197973 138972 104519 24685
16231 148378 230972 170305 421125 361741 86329 115467 402823 -27120 309797 129013 525268
16220 525268 24761 55081 322652 -64177 98135 57889 364309 348742 400693 128866 1828
16208 160987 231236 -24137 -14066 -164690 -38665 -55396 227942 42612 -48609 -231362 202947
16196 161146 -91396 -94445 125589 -32266 -83650 54370 -105077 -287377 -133194 -27073 528834
16184 478364 -326045 -44393 5405 -86836 -26459 158648 -82312 271600 479150 -3643 250512
16172 134856 125559 -41543 115106 225654 -12658 3508 -225984 14210 106418 82407 311802
16161 311802 275640 128856 -246124 -95766 55854 135674 66324 118074 47123 131086 89785
16150H9785l3497J12956M3015a21277C84273d1124E7776K97998C2746K9232a9687
16138c9217j93513B28970o6204a45161f5514j04760A56701E5739M9384a05625
16127e54140N7392H4365b972k79946D8918A3967i7702M7728C73952a02306A30456
16115D7736h5993a5079C6725K26101A05924M0130a74848E0092b4984A79738A6617
16103A29304J36488C5513J54160Q7129I3971a4125C40215i3166c6054A6209L46054
16092C62263e5183H6535a14092j15715f1654F9801a22679m3867A71984M107m4665
16081A31426K17046E8035J03972m4556I396O5856J40850o171G4253O6327d3289
16069a7262A10613M3702p0578Q008J31344b73106K5298C88260A29429d373I3826
$$ plain form
16150 89785 56288 169244 212259 -121277 384273 -41124 57776 355774 32746 61978 -19687
16138 -39217 -232730 228970 162766 -145161 -65514 -170274 156701 55739 105123 -105625
16127 -554140 -496748 84365 -2972 -282918 48918 13967 -97702 -49974 373952 -102306 130456
16115 47736 -85993 -15079 36725 262826 105924 146054 -174848 50092 -24984 179738 16617
16103 129304 265792 35513 189673 276802 93971 -14125 340215 -93166 -36054 16209 362263
16092 362263 -55183 86535 -114092 -229807 -61654 69801 -122679 -166546 171984 176091 131426
16081 131426 348472 58035 162007 117451 9396 75252 216102 209931 74253 140580 -43289
16069 -17262 110613 154315 83737 91745 223089 -273106 -247808 388260 129429 -4373 93826
16057b96619e4697o8869n2769g4786k10255A67528F2547Q8578c14298k4312F5177
16045a07095k7654C54912A9067h6016m58455H8426c09376a27424l1073C104J08231
16034A11335J954M4908b99310B99188B2252l072O6854b14752l1307H5169a66536
16022a11842a3057E7372g0330E2034h8817k73055a6499j76322B7153M5649g2622
16010a66783E9187b62165M8878A286g5272c1697f471k21914P0051B22372b78079
15998B23296a65376C49662l8821a83651R469L8037e9393A7151Q8084J53982a75414
15986b07558A74855M2554f9714D09132G4569J27357a81334I882K07961J07802
15976C25645a94449G996g0508J7166k7531b5370k37314A03833J27528d2449D17556
$$ plain form
16057 -296619 -54697 -123566 -176335 -74786 -285041 167528 62547 151125 -314298 -338610 65177
16045 -107095 -134749 354912 19067 -86016 -544471 88426 -309376 -127424 -158497 3104 111335
16034 111335 113289 158197 -299310 299188 22252 19180 86034 -214752 -246059 85169 -166536
16022 -111842 -13057 57372 -70330 52034 -88817 -361872 -16499 -192821 27153 72802 -72622
16010 -166783 59187 -262165 -213287 1286 -75272 -31697 -6471 -228385 -158334 222372 -278079
15998 223296 -165376 349662 310841 -183651 -174182 -136145 -59393 17151 105235 259217 -175414
15986 -207558 174855 217409 -69714 409132 74569 201926 -181334 9882 217843 325645
15976 325645 -194449 7996 -70508 -53342 -80873 -25370 -262684 103833 231361 -42449 417556
15964E3279j5789R3349a58567K1738I8334J02556n5988Q727A0896b03369p8819
15953b82188A79800b31994c165H1371b97156a38454j5775r7989a6957A45496Q2814
15942B28310b05757J3714j56179J59686P8858B57162b53602O8150A47745i2946
15931i1816G7269a92836e0352k97597B58013a77316j86j70313A29522f3683j9057
15920h2740m9786M8227B34577g0437K8804B36914a02083j62323A86812e9021j16879
15909a75900l3270A35119c11477F5836J4892b1928p0661k10903A68612H1962d0687
15897b62677h6052C25529a84012k21931B68961I8398b43544n9296c4128l49454
15887c83582A8764d0778k15940G6888j2711d0118J9705j70969O423N8633E4326
$$ plain form
15964 53279 37490 130839 -158567 -136829 98334 200890 144902 153629 10896 -203369 -282188
15953 -282188 179800 -231994 -3165 81371 -297156 -138454 -154229 -252218 -16957 145496 228310
15942 228310 -205757 -192043 -348222 -188536 -109678 257162 -253602 -185452 147745 -92946
15931 -91816 77269 -192836 -50352 -347949 258013 -177316 -177502 -347815 129522 -63683 -82740
15920 -82740 -132526 -84299 234577 -70437 -41633 236914 -102083 -264406 186812 -59021 -175900
15909 -175900 -209170 135119 -311477 65836 80728 -21928 -92589 -303492 168612 81962 -40687
15897 -262677 -86052 325529 -184012 -405943 268961 98398 -243544 -302840 -34128 -383582
15887 -383582 18764 -40778 -256718 76888 64177 -40118 -20413 -191382 -184959 -126326 54326
15875a44074G4455L741P2768f8356j1264d979I3840e31267A11682a00462C77741
15863b62318A30374b51373P5550A07781a74380C16018b41751P6973d8134C9107
15852c01925I4209a62935B41840o7055h0958j47041B81796h7692l24739a38695
15841A54592K35195A49349j9778i1639E7563J84379i6003B8020A1921a64902A11148
15829H3365c70886a21388k36047a53407l68048b28065g668o5620G4183b33161
15818d19853a46886j12174Q9470C6734L9274J62394b88041a17758j30087R0439
15808a57406M7764o2050B50630q8361O6605b3150A58920b06347j3163e5431r823
15797f5254B46927a32176f0872F9463b16072O3012E5712i5931j48434j23884a0029
$$ plain form
15875 -144074 74455 78196 150964 -68356 -79620 -4979 93840 -531267 111682 -100462 377741
15863 -262318 130374 -251373 -175823 107781 -174380 316018 -241751 -164778 -48134 39107
15852 -301925 94209 -162935 241840 174785 -80958 -227999 281796 -87692 -412431 -138695
15841 154592 389787 149349 129571 -91639 57563 241942 -96003 28020 11921 -164902 111148
15829 83365 -370886 -121388 -357435 -153407 -521455 -228065 -7668 -73288 74183 -233161
15818 -419853 -146886 -259060 -169590 36734 76008 238402 -288041 -117758 -247845 -157406
15808 -157406 -109642 -171692 250630 162269 228874 -23150 158920 -206347 -219510 -55431 -65254
15797 -65254 246927 -132176 -60872 69463 -216072 -153060 55712 -95931 -244365 -368249 -10029
15785b7560j8094p9949n0530l2388g4192j04961Q1440A71877A2198J09135c05927
15773c0874E0333c82309A60840I448c02233A68562a30179p3582i9163H1792Q6685
15762A68477A2972a31895A74972L6966H8947J46709M4277p2769a55056B35633
15751H4750i7449B9698f6058n3326b9145I2599a00748j05218A91204i4347K9987
15740f4360O71j15474r6022J27066A9481N9904a49768b3218A54713C8653b30108
15728A1520c0213k38688F6305a17818F2088c10807k2974B81686E4189M4899j9956
15717G9132b18208N1955j26150f8687j26146j4151C0797i6587B8650c437B89840
15705a66490c1459B30918a39829B565a81240A93217a47824A21244J51544b59552
$$ plain form
15785 -27560 -45654 -125603 -176133 -208521 -74192 -179153 -97713 171877 12198 121333 -305927
15773 -30874 50333 -382309 160840 9448 -302233 168562 -130179 -203761 -99163 81792 168477
15762 168477 12972 -131895 174972 211938 88947 235656 279933 207164 -155056 235633
15751 84750 -97449 29698 -66058 -119384 -29145 92599 -100748 -205966 191204 -94347 -64360
15740 -64360 -63689 -179163 -275185 -148119 19481 79385 -149768 -23218 154713 38653 -230108
15728 11520 -30213 -268901 66305 -117818 62088 -310807 -333781 281686 54189 99088 79132
15717 79132 -218208 -166253 -292403 -68687 -194833 -208984 30797 -96587 28650 -3437 289840
15705 -166490 -31459 230918 -139829 2565 -181240 193217 -147824 121244 272788 -259552
15694b5708B1571R5429Q126G273K59528C2374b93997a00984j6405B0463c6510
15682B2038L9225a46418E5915a62905K6946C1661K72818D9710M1501c8902A78481
15670B92323a70467B50256a63902O4483r4731g1487p1579A65041c6096B2492c1312
15658a7346j61506A27223J55437g7182A34620a7243C3585a33863J8688A11719
15647B54153I200g4142h673r0452b9708C25853i1512A7255b24827a401r7112n9325
15635a57838A53683f1932n2201A04981C6456d44290A33476h9577B66062A5819
15624d7915j32265m3173q1613i5413k0169C44129A22490C7377b62065K0691f119
15612a06655k6011p8352j18485A97922h9887A93204a00600E4318g5131K7646p6004
$$ plain form
15694 -25708 21571 117000 125126 7273 266801 32374 -293997 -100984 -117389 20463 -36510
15682 22038 61263 -146418 55915 -162905 -135959 31661 304479 49710 91211 -38902 178481
15670 292323 -170467 250256 -163902 -99419 -194150 -71487 -143066 165041 -36096 22492 -31312
15658 -17346 -178852 127223 282660 -77182 134620 -17243 33585 -133863 -115175 111719
15647 254153 9200 -74142 -8673 -99125 -29708 325853 -91512 17255 -224827 -1401 -98513 -157838
15635 -157838 153683 -61932 -114133 104981 36456 -444290 133476 -89577 266062 15819
15624 -47915 -180180 -223353 -304966 -95413 -115582 344129 122490 37377 -262065 -241374 -6119
15612 -106655 -132666 -211018 -329503 197922 -89887 193204 -100600 54318 -75131 -47485 -123489
15601a23489k17460H9007b82873J19948d629j18725j80209h9424E5680c43288
15590F4167e374j33157m2067A57141c01263d1722j25107p3161A19299c8350j68643
15579b06993C77737A75742b9304A82153g9471n4472I4476b66378A2796a75018
15568C89501a76075p215L7421l7319A58027l3230b04711A77725p5648a2503B30003
15556A3316P84g4443b5026J0598k78440B54292H2789b4317R981k05532H0318i632
15543h063A12673p931b4013j83338A52222d5346j50497m0659e4007H8562O8596
15532A57158A6474a60617j59668a0753q0425j76279E88659E1229c7001A3295K29373
15521B42668n7390H2242M7263Q6683c7077j88193c9165C84602h6396i350A02819
$$ plain form
15601 -123489 -340949 89007 -282873 -162925 -4629 -123354 -303563 -89424 55680 -343288
15590 64167 -5374 -138531 -180598 157141 -301263 -41722 -166829 -239990 119299 -38350 -206993
15579 -206993 377737 175742 -29304 182153 -79471 -133943 94476 -266378 12796 -175018
15568 389501 -176075 -183290 -145869 -183188 158027 124797 -204711 177725 102077 -12503 230003
15556 13316 14100 -74443 -25026 -14428 -292868 254292 82789 -24317 -14336 -219868 80318 -9632
15543 -8063 112673 104742 -24013 -207351 152222 -45346 -195843 -236502 -54007 88562 157158
15532 157158 16474 -160617 -320285 -10753 -91178 -267457 588659 51229 -37001 13295 242668
15521 242668 185278 82242 129505 216188 -37077 -225270 -39165 384602 -86396 -9350 102819
15509C35695A4947a9720A88399e6947D79305h318C13750a69218e4139B24421D0076
15497A20198g5142o8847A12237C9651J11037i5311c6236j07153P1270j65343B15327
15485A48453m9348a00833E209h4132j89564a4740A8818h5776o0206B27005d9663
15473b08433B25022D4379J70050c08837A20278R8641b18663G8169Q469c73128
15462a98819F7321J39649D3272Q0786b07001P9250I1732b67234c9027H4450a84524
15450A7503J05961l4864d4950j23113Q0335E3924J01692g4899F8636l0429a45887
15438g6935n3875L2121c8092p5480L4144B82349G0779m589K25535a5027k49127
15427b64154A67873a77619j40819A13297a94389k5984E2981A8353c3500G3202
$$ plain form
15509 335695 14947 -19720 188399 -56947 479305 -8318 313750 -169218 -54139 224421 40076
15497 120198 -75142 -143989 112237 39651 150688 -95311 -36236 -143389 -72119 -237462 215327
15485 148453 99105 -100833 5209 -84132 -273696 -14740 18818 -85776 -145982 227005 -49663
15473 -208433 225022 44379 214429 -308837 120278 218919 -218663 78169 86638 -373128
15462 -198819 67321 206970 43272 124058 -207001 -127751 91732 -267234 -39027 84450 -184524
15450 17503 123464 88600 -44950 -168063 -87728 53924 155616 -74899 68636 38207 -145887
15438 -76935 -130810 -98689 -38092 -113572 -79428 282349 70779 66190 291725 -15027 -264154
15427 -264154 167873 -177619 -318438 113297 -194389 -220373 52981 18353 -33500 73202
15416a6255k66296Q3933P3202k733D1883b4586m7725j43308A6392a70343G6725
15404c3277A27947d9298b1462j42096E8998e856l04150A21600D7282c31617A7786
15392a6433A76475J95377I1079c78303J81965B9825a76345A00747c9004j12351
15382a51355A50484a055j41263a5935B79869b6878l0663H3170D8O02d0956k1311
15370f2267G5057b76445J6499B54616n7257N4262F5046Q8808b43013B14935a78348
15358G1362a02608q2608I9320B8378c42362B78097j16203I996c8836j87032A012
15346A62786o1322K21337d6272E3772K3530m239a89393f8568J9807A63677F8515
15334C3856K6624J08659n0949M1915E1856J55087b25749G8002L47699G4163q265
$$ plain form
15416 -16255 -282551 -198618 -125416 -128149 41883 -24586 -72311 -215619 16392 -170343 76725
15404 -33277 127947 -49298 -21462 -163558 58998 -5856 -310006 121600 47282 -331617 17786
15392 -16433 176475 371852 91079 -378303 -196338 29825 -176345 100747 -39004 -151355
15382 -151355 150484 -1055 -142318 -15935 279869 -26878 -57541 83170 48 650 -40956 -62267
15370 -62267 75057 -276445 -259946 254616 197359 251621 65046 153854 -243013 214935 -178348
15358 71362 -102608 -185216 99320 28378 -342362 278097 161894 9996 -38836 -225868 1012
15346 162786 101464 322801 -46272 53772 77302 73063 -189393 -68568 -48761 163677 68515
15334 33856 60480 169139 118190 160105 51856 206943 -225749 78002 425701 74163 65898
15323F5898K16964j28076O4341I6005K92234g6562p5594c7861A8941e0312C7678
15311c7395I6339K6497a58819f912k20688O3793N1571A17353c87888A7999b7993
15299a48128c9575B83267b31547a15288I9221e3803B74205K9438j06883i3241
15288A37387a14031a6835o498G8158k3063R8807K84459b12628A3231L04335A10802
15276E9390k1025a21125F0292b90107e570A78760a2811C2575a56232h463F6184
15264E2475k3764J52414j9948b43799b9775r4464C03565b81949A45020a8824I6035
15252A27036e0066E87531k00946P10023k22831l59994N98923C51493I3013A4170
15241A86966N3219O6838n5475f6856c0621B88345K1671A21667L1511J16615C6282
$$ plain form
15323 65898 282862 154786 219127 96005 388239 -76562 -152156 -37861 18941 -50312 37678
15311 -37395 96339 122836 -158819 -6912 -227600 -163807 -112236 117353 -387888 17999 -27993
15299 -148128 -39575 283267 -231547 -115288 99221 -53803 274205 303643 196760 -93241
15288 137387 -114031 -16835 -23333 78158 55095 153902 438361 -212628 13231 317566 110802
15276 59390 38365 -121125 60292 -290107 -5570 178760 -12811 32575 -156232 -8463 66184
15264 52475 28711 181125 161177 -243799 -29775 -124239 303565 -281949 145020 -18824 96035
15252 127036 -50066 587531 386585 1096608 873777 513783 1112706 351493 93013 14170
15241 186966 240185 307023 251548 -66856 -30621 288345 310016 121667 153178 269793 36282
15229B35252b82919B11990C776a18522p405l8319B14408a57908A10349a46126
15218I9795a58182M2900C35689i8356E7464J90221g3231A39716m3111a51503M6074
15207a05429A45797N9723E9876c0367I1406a4368k75996i4018q9265A67205m25
15196A66780D0351g2810A60589J2408o3330h1723I0594J96193b030C77684A41840
15184D97481a7472B04912J88241C206Q6742b10157R6931J6530C38998j24184P0625
15173B85439C1923j4969a70393B2422a80636A95757D7336a33883A84420a83332
15162B52768K60104k47752K75554d06667C17051A41602d2477A34309J11853a4720
15151g8812G6897K65106g8551F335a6311k07031a00602B25175Q2542M6459K1083
$$ plain form
15229 235252 -282919 211990 3776 -118522 -125927 -164246 214408 -157908 110349 -146126
15218 99795 -158182 -115282 335689 -98356 57464 247685 -73231 139716 96605 -151503 -105429
15207 -105429 145797 205520 59876 -30367 91406 -14368 -290364 -94018 -183283 167205 166780
15196 166780 40351 -72810 160589 172997 109667 -81723 90594 286787 -2030 377684 141840
15184 497481 -17472 204912 393153 3206 89948 -210157 -113226 -96696 338998 214814 285439
15173 285439 31923 16954 -170393 22422 -180636 195757 47336 -133883 184420 -183332
15162 252768 512872 265120 540674 -406667 317051 141602 -42477 134309 246162 -14720
15151 -78812 76897 342003 -78551 6335 -16311 -223342 -100602 225175 307717 354176 375259
15140C75259e207l0246C03527A22303L4318N8474J4490a59483d242C61325A16265
15128B38881a50163O4963D246K73572a7187A21147k3558K64489g0576A07057e7016
15116E48582I7982J39818G8680J58181E8038J05996n3275b01244Q7514A63187
15105C52608p6530G5418i7756b0312A40859J87373l8510J42640j75758J56270
15095D12874k01765a6509A57808P2478K04293a32725b4202o2282H027L08959C1126
15083B45701Q350A23438C0070K326N25890D5132R1576K266b5961I5117k0149e8164
15070B61050K9024j07779A5970K70176I0207J04729f2203j34699A81849k7365
15060A54484h4970L5147D6044K87616A12055O4974B7737g4532A11537D4125J839
$$ plain form
15140 375259 -5207 -35453 303527 122303 156621 215095 229585 -159483 -4242 361325 116265
15128 238881 -150163 -85200 4246 277818 -17187 121147 97589 362078 -70576 107057 -57016
15116 548582 97982 237800 78680 236861 58038 164034 110759 -201244 -113730 163187
15105 352608 276078 75418 -97756 -20312 140859 328232 289722 432362 256604 412874
15095 412874 211109 -16509 157808 230286 434579 -132725 -24202 -86484 8027 316986 31126
15083 245701 254051 123438 30070 32396 558286 45132 136708 138974 -25961 95117 74968 -58164
15070 261050 290074 182295 15970 286146 90207 194936 -62203 -196902 181849 154484
15060 154484 -84970 -49823 46044 333660 112055 177029 27737 -74532 111537 44125 45964
15049D5964L6115d12469B20961m7958P113K4886H1980B8350c0368B90877j27942
15038A62935b58369A10471J86434j36708j2229J98211O0412m9300A28895l5902
15028I2993K15802B2561J97817j3021i1386B50703A14711B2050a7474m9284A6418
15016A14025O0818p0185D9589M08636p6827a99778B56761j21354A5134J96162
15006B11296L9491P4225J47657j49227O5700A21480P5220o8485R7959p1747J57556
14995C11983a8553j46391C29284A15456K9697J5847D2126B0481M57673o4457b46971
14983B01278r8682R60K69328K7987G0406D508M95411H7958L6583L83118B50079
14971D35900A45216O0692J61205G0695A4367M43303J37885j80445j1965A90416
$$ plain form
15049 45964 82079 -412469 220961 173003 180116 205002 81980 28350 -30368 290877 162935
15038 162935 -258369 110471 296905 160197 147968 346179 406591 357291 128895 92993
15028 92993 308795 22561 220378 207357 -91386 250703 114711 22050 -17474 -66758 16418
15016 114025 174843 104658 49589 458225 381398 -199778 256761 135407 15134 211296
15006 211296 250787 325012 472669 323442 389142 121480 196700 128215 226174 154427 311983
14995 311983 -18553 -164944 329284 115456 145153 161000 42126 20481 478154 413697 -246971
14983 201278 102596 103556 372884 400871 70406 4508 499919 87958 124541 507659 250079
14971 435900 145216 205908 367113 70695 14367 457670 595555 415110 403145 190416
14960C00499A26157j7204L2463a79321A54622d3132A98182Q5307k3782n2165D6982
14948A27801K87666B02282E9570N1853J79382J49556A72644G3600L20498a16631
14937A42274L97019j28692j57933c6509B52645J71636j88100J81171A69753H1806
14926C71711A13365K20609q9252n0459p9263K80452n7058J33633B18290J46342
14916C64632j23004K19043j88698o8398K41352g1495C11574J47335c7573E49004
14905C90251p4541a00185E41119A38330K23189j15094K29369g551H8039K64422
14895C52461n8438I1553K51672A26861n4N0891N6309r3406N40332C24503j5277
14884C09226K55737a94275G76154l43422J41141j25802j70597A12874P0980Q7031
$$ plain form
14960 300499 126157 108953 141416 -179321 154622 -43132 198182 283489 259707 207542 46982
14948 127801 415467 202282 59570 111423 290805 440361 172644 73600 394098 -116631
14937 142274 539293 410601 252668 -36509 252645 424281 236181 417352 169753 81806
14926 371711 113365 333974 244722 194263 115000 395452 338394 472027 218290 364632
14916 364632 241628 460671 271973 203575 444927 -71495 311574 458909 -37573 549004
14905 390251 315710 -100185 541119 138330 361519 246425 475794 -7551 88039 352461
14895 352461 294023 91553 343225 126861 126807 177698 234007 140601 680933 324503 309226
14884 309226 564963 -194275 776154 432732 573873 448071 277474 112874 183854 270885
14874B70885K424A23087K05345J02521P9886J66181p2936k10698r6841j40657
14864A55888f7956D38071n2860j51137M1894M3167K0451A65822B5140L35843R543
14853C70526K62501k65205R7845N1200j61790A55287K5922R6891J44687o3784
14843C59003A43128J55786n6769M8693A10518J05728J24304P5602P4205j74973
14833C15384J71637j05331J39647B55180p5967Q8897J45228l8317R4370M2564
14823E11955j53077K3306p4829M45650B22728L78120B33818L8554J66820M4677
14813D83869R0993o4691k26077M9701M9027J28138k42732l3254N0949j30396L98468
14802E53995Q5072A75265J96730P5645P1299j3094k00403L34292k95537K33092
$$ plain form
14874 270885 273309 123087 328432 430953 510839 677020 604084 393386 296545 155888
14864 155888 -67956 438071 385211 234074 275968 319135 339586 165822 25140 360983 370526
14853 370526 633027 367822 465667 516867 355077 155287 181209 278100 422787 359003
14843 359003 143128 298914 242145 290838 110518 216246 340550 416152 490357 315384
14833 315384 487021 381690 521337 255180 179213 268110 413338 375021 469391 511955
14823 511955 358878 382184 307355 753005 222728 600848 233818 272372 439192 483869
14813 483869 574862 510171 284094 333795 382822 510960 268228 234974 285923 155527 553995
14802 553995 639067 175265 371995 447640 518939 505845 305442 639734 344197 577289
14792E77289J3135j00451D6030O52676k46842G9432M52514k50448P05257D29432
14781E60721k1888K74349j92716k58027L44351C15959K63461j94917K27925J25046
14771G37474B55774L92656p8518j32750K54626k47639J52956j62056k5748M44418
14761H53719B82093N93983k43306j69346J53721K06504l3480p032k69862J41126
14751F54401j74477P2244J86451K12506r0042j00228O4290K2088C95110M17762
14741H12872l21687j6619J83275p4945k55035K58544k4014K9956O0580k14458
14731D38469l589J20751L83072m44382L16638n9267k831m6848J04881C58174K32789
14720E90963o7603k0298J4958Q5403j66138p7412J30486L98156n4464p8711j87215
$$ plain form
14792 577289 590424 489973 46030 698706 451864 79432 531946 281498 986755 429432
14781 560721 538833 813182 620466 362439 706790 315959 579420 384503 612428 737474
14771 737474 255774 648430 569912 437162 691788 444149 597105 435049 409301 853719
14761 853719 282093 876076 632770 463424 617145 823649 790169 783137 513275 654401
14751 654401 479924 552168 738619 951125 861083 760855 825145 847233 395110 812872
14741 812872 491185 474566 657841 582896 327861 586405 562391 592347 652927 438469
14731 438469 434880 555631 938703 494321 810959 751692 748861 702013 806894 358174 590963
14720 590963 523360 503062 518020 603423 437285 359873 490359 888515 834051 755340 568125
14709E68125J08014L51465D52961J74297L83397m37373J13162q902K07194r6006
14699G88730P048K57952m06155J05601R5844k4722R546K2457k4041l8462J70400
14688I64198k85695k54215L69630J52664k83749L03035N5272j23617J9694m5435
14678H71782L28188l48347J61968n5017N9360j44375n2749L94500k61879k59527
14668F93904L66593l68817K38568J98630j59124k508J40147m42849r7340O21009
14658A188213k72856K50623L2931o0294J2925j74197P9284k18517L22268m9245
14648A111135j64443K22594l75680M83483j27527j26584n7974K95165p5200k09856
14638I75113J38377J49662J46129l00647L21232j96837j9259m32215J97721K71155
$$ plain form
14709 568125 676139 1027604 452961 627258 1010655 573282 686444 677542 884736 788730
14699 788730 795778 1053730 647575 753176 849020 824298 833844 856301 832260 793798 964198
14688 964198 678503 424288 793918 946582 662833 965868 1021140 897523 917217 871782
14678 871782 1199970 851623 1013591 958574 1017934 873559 820810 1215310 953431 693904
14668 693904 1060497 691680 930248 1128878 969754 967246 1107393 664544 567204 1188213
14658 1188213 915357 1165980 1198911 1138617 1151542 977345 1056629 838112 1160380 1111135
14648 1111135 946692 1169286 793606 1277089 1149562 1022978 965004 1260169 1184969 975113
14638 975113 1113490 1263152 1409281 1108634 1429866 1233029 1213770 781555 979276 1250431
14628A250431l6250M5797K05010J96632o74442J89971j44576N08002k92036j37589
14618A110950K18342J88859J27139j5733l85223K65134l781n49255J60052J68609
14608A285093K86080m95484O02012l44390l4086K13188P3895m3930j27033J2871
14598A428216P5687k94860k2334L63648N7661l39046K20017L41029L9821J73347
14588B043186l01966k98024L89422j67520R4529j61964L92916l19881L6705m300
14578A703103n9074l005K30007k89098J13271M56522m51709M57425o5963K50749
14568B342228m71269P03580n32885J76053m80492N00714J3068P8813k2641J85691
14558B492860P6758j1538K5796K66000O17525O2210O4508N88044J046627J791524
$$ plain form
14628 1250431 1214181 1259978 1464988 1661620 987178 1177149 1032573 1540575 1248539 1110950
14618 1110950 1329292 1518151 1645290 1629557 1244334 1509468 1505687 956432 1116484 1285093
14608 1285093 1571173 1075689 1677701 1333311 1299225 1512413 1586308 1542378 1415345 1428216
14598 1428216 1503903 1209043 1186709 1550357 1608018 1268972 1488989 1830018 1869839 2043186
14588 2043186 1741220 1443196 1832618 1665098 1759627 1597663 1990579 1670698 1707403 1703103
14578 1703103 1644029 1641024 1871031 1581933 1695204 2151726 1700017 2157442 2091479 2342228
14568 2342228 1870959 2574539 2041654 2217707 1737215 2237929 2250997 2329810 2307169 2492860
14558 2492860 2569618 2558080 2583876 2849876 3467401 3529611 3594119 4182163 5228790 7020314
14548G020314L561352Q895860J7407567J2721046B0258583G361030l494639j030370
14540B836021l33612j91381n54692K46755l69244K55713K59866l43260j9863J21511
14530A907814O0502L05517l64970K94168K44007o40820M63570q3410k6834k26732
14520A932812L35741j43120L10943l5429m26709O40005k63072L3921K35634O3876
14510B684602j93600l0777M22753n60843L78362K24991k00109m0215M42742m73371
14500B654535M89742j42049L8371k85098M10038l68242J94861K44497q4643m81989
14490B670023M16365j33833K25451o8585R6737O6121K26431j40212K90985J11811
14480C761294l13375J83119j88723K26434j39762J17081P4819j53183L94518o4489
$$ plain form
14548 7020314 10581666 19477526 36885093 49606139 20258583 7361030 3866391 2836021
14540 2836021 2502409 2311028 1756336 2003091 1633847 1889560 2149426 1806166 1786303 1907814
14530 1907814 1968316 2273833 1908863 2203031 2447038 1806218 2269788 2186378 2159544 1932812
14520 1932812 2268553 2125433 2436376 2400947 1974238 2614243 2351171 2385092 2620726 2684602
14510 2684602 2491002 2460225 2882978 2322135 2700497 2925488 2725379 2685164 3127906 2654535
14500 2654535 3144277 3002228 3040599 2755501 3165539 2797297 2992158 3236655 3152012 2670023
14490 2670023 3086388 2952555 3178006 3109421 3206158 3272279 3498710 3358498 3649483 3761294
14480 3761294 3447919 3631038 3442315 3668749 3528987 3646068 3720887 3567704 3962222 3897733
14470C897733J58739J5736k44559R8606K10295J56577j76577j56432R3320K49616
14460D303054p3191L59999K81884l39895R5785J23377o549k84924N9916N94108
14450E113564j9759j2120p3706q5352M3595j6368K90794K64991q4412n1848L19253
14439E688632k59689M88780m15631J81138L93810Q4055J13622K4597l30928L59732
14429F328118K0823K57161O0582j31259M4988K21335r3013J64315L15989m5710
14419G143329K73326L0067J09969O2743l07509K76451K8609Q0608N57893q7233
14409H168253P0598M28298N9079n4343R2378J84414J0689M20092k14973L24828
14399I489313N09867l42437K05615M33479j03700K48248K59147K08799K75796
$$ plain form
14470 3897733 4056472 4072208 3827649 3926255 4136550 4293127 4116550 3960118 4053438 4303054
14460 4303054 4229863 4589862 4871746 4531851 4627636 4751013 4744464 4459540 4519456 5113564
14450 5113564 5093805 5081685 5007979 4922627 4966222 4949854 5240648 5505639 5421227 5369379 5688632
14439 5688632 5428943 5917723 5502092 5683230 6077040 6161095 6274717 6299314 5968386 6328118
14429 6328118 6348941 6606102 6666684 6535425 6580413 6801748 6708735 6873050 7189039 7143329
14419 7143329 7416655 7446722 7556691 7619434 7311925 7588376 7616985 7697593 8255486 8168253
14409 8168253 8238851 8667149 8726228 8671885 8764263 8948677 8959366 9379458 9164485 9489313
14399 9489313 9999180 9656743 9862358 10295837 10192137 10440385 10699532 10908331 11184127
14390A1184127K44849j31106M34931P4021J06099M68009l29161L62823M13712
14381A2828304M94278j07494M27009J12987L47109M53105j45038M67118N46362
14372A5423740J98249L96547N95932J5292M36552K44442O30958J60892k8276P37996
14362A8812324l5506P29113M83471M90676P03337Q8478L13849P44046N37017K65225
14352B3132030O98770P49367N27255Q42238P32381O94302N52772Q80966L81392
14343B9191473Q61601J097357O53349O85654J358917N24558J168993Q85624Q28775
14334C7256301J364170J347749Q46221J073363J598492J596871J223193J559296
14326D7865656J678892J330509J936152J774204K117738J949377K041313J759242
$$ plain form
14390 11184127 11428976 11297870 11732801 11806822 11912921 12380930 12051769 12414592 12828304
14381 12828304 13322582 13215088 13642097 13755084 14102193 14555298 14410260 14877378 15423740
14372 15423740 15621989 16018536 16614468 16629760 17066312 17310754 17941712 18102604 18074328 18812324
14362 18812324 18776818 19505931 19989402 20480078 21183415 21271893 21585742 22329788 22866805 23132030
14352 23132030 23830800 24580167 25107422 25949660 26682041 27376343 27929115 28810081 29191473
14343 29191473 30053074 31150431 31803780 32489434 33848351 34372909 35541902 36427526 37256301
14334 37256301 38620471 39968220 40814441 41887804 43486296 45083167 46306360 47865656
14326 47865656 49544548 50875057 52811209 54585413 56703151 58652528 60693841 62453083
14318F2453083K424075K772165K312802K816749K677044L022760L266197L465380
14310H5210255L843267L613398L783922M198806M571625M718464N206668N621120
14302A20767525N449169N986814O407762P154096P099453Q286487Q156446Q801528
14294A78109280R466771J0197303J0740749J1091359J1808948J2341224J3298926
14287B57054560J3491995J4483778J4901584J5436751J5712500J6229486J6266451
14280C63577105J5917276J5610399J5193453J3904602J2736758J1024892R074984
14273D57039469O212536J205546m24308j485357R29648k482956o106245q844607
14265D46043726j0413147j2199305j2992000j4946255j5322961j6609933j6509230
$$ plain form
14318 62453083 64877158 67649323 69962125 72778874 75455918 78478678 81744875 85210255
14310 85210255 89053522 92666920 96450842 100649648 105221273 109939737 115146405 120767525
14302 120767525 126216694 132203508 138611270 145765366 152864819 161151306 169307752 178109280
14294 178109280 187576051 197773354 208514103 219605462 231414410 243755634 257054560
14287 257054560 270546555 285030333 299931917 315368668 331081168 347310654 363577105
14280 363577105 379494381 395104780 410298233 424202835 436939593 447964485 457039469
14273 457039469 463252005 464457551 464033243 462547886 463477534 460994578 454888333 446043726
14265 446043726 435630579 423431274 410439274 395493019 380170058 363560125 347050895
14258C47050895j6411607j6315324j4878025j5082191j4741952j3630915j3587659
14251B42403222j2220408j2003548j1549249j0445098j0062646r392620q744254
14244A67985399q141568p519402p582486p106724o394794o055823n323438n378754
14236A14482410n002177m698657n020669m089328l641251l555977l708009l194036
14228H1572306l572552l013955k730775k646617k632977k723712k076063k038666
14220F0136989j966728k379854j692103j659908j934220j522237j335136j441750
14212D6205053j510983j576610j295739j299214j099097l43160q91651j546423
14204C6642176j366071q93483q18002j219940n0960j296264j154414n89696r61699
$$ plain form
14258 347050895 330639288 314323964 299445939 284363748 269621796 255990881 242403222
14251 242403222 230182814 218179266 206630017 196184919 186122273 176729653 167985399
14244 167985399 159843831 152324429 144741943 137635219 131240425 125184602 119861164 114482410
14236 114482410 109480233 104781576 99760907 95671579 92030328 88474351 84766342 81572306
14228 81572306 77999754 74985799 72255024 69608407 66975430 64251718 62175655 60136989
14220 60136989 58170261 55790407 54098304 52438396 50504176 48981939 47646803 46205053
14212 46205053 44694070 43117460 41821721 40522507 39423410 39080250 38188599 36642176
14204 36642176 35276105 34382622 33564620 32344680 32293720 30997456 29843042 29253346 28291647
14195B8291647o11863k89857o74557p51096o72810o31739p97521k19375q44286
14186B2798543m26128m65129m42540k65173p36337o73605m49084m87937J8149
14177A8870759j11624o61465k07240m72518l05327k15158j84770n56804p74945
14168A5380908R7066l33764n2661j93546m64695k82439n06542o9719j18990l28718
14158A3126900k22527k61611j94342k91687l52317N1949l19392j77217j50025
14149A1209731k66231j91490k02085k77210p6121K16183m14189j67601j87807
14140I643180j15769m4718k4025P2588m89883J09100k83756k55207N9077k89916
14130H380671j38807J60937l42748j77027n58829K24021j7285j01976j15651k5250
$$ plain form
14195 28291647 27679784 27389927 26715370 25964274 25291464 24659725 23862204 23642829 22798543
14186 22798543 22372415 21907286 21464746 21199573 20463236 19789631 19340547 18852610 18870759
14177 18870759 18759135 18097670 17890430 17417912 17112585 16897427 16712657 16155853 15380908
14168 15380908 15477974 15144210 15091549 14898003 14433308 14150869 13644327 13574608 13455618 13126900
14158 13126900 12904373 12642762 12448420 12156733 11804416 11856365 11536973 11359756 11209731
14149 11209731 10943500 10752010 10549925 10272715 10196594 10412777 9998588 9830987 9643180
14140 9643180 9527411 9482693 9458668 9531256 9041373 9150473 8866717 8611510 8670587 8380671
14130 8380671 8241864 8402801 8060053 7883026 7324197 7548218 7530933 7428957 7313306 7288056
14120G288056n2138K9159q0998p1810l23073p9179K1066j15902r616j30977j30227
14109F344361p6993k65892K27045n92483L95299l70073K40271j2094n19416O44328
14099F014353k21826l71036q0695J1479n3532r2804j75669K19967j40303M3895
14089E153829j28054k23183J38784j74867l51043M22720l13793N7043P1412j54212
14079D498636k86598K65204j77207j01292L2490R5461l02706L2547M0046J09978
14069D206559r3941o0602J50647r6598m57603J60617L10133m23249j50844K49197
14059C794316m0362j28792n4439K10880k40860j51232J36832j42826K7698k69566
14049C141649j13029R6779N5920J76371l19123M63131o9838l49591j18503J1527
$$ plain form
14120 7288056 7235918 7265077 7184079 7112269 6789196 6710017 6731083 6615181 6605565 6474588 6344361
14109 6344361 6267368 6001476 6228521 5636038 6031337 5661264 5901535 5889441 5370025 6014353
14099 6014353 5792527 5421491 5340796 5352275 5298743 5205939 5030270 5250237 5109934 5153829
14089 5153829 5025775 4802592 4941376 4766509 4415466 4838186 4524393 4581436 4652848 4498636
14079 4498636 4212038 4477242 4300035 4198743 4231233 4326694 4023988 4056535 4096581 4206559
14069 4206559 4112618 4052016 4202663 4106065 3648462 3809079 4119212 3695963 3545119 3794316
14059 3794316 3753954 3625162 3570723 3781603 3540743 3389511 3526343 3383517 3411215 3141649
14049 3141649 3028620 3125399 3181319 3357690 3038567 3501698 3431860 3082269 2963766 2975293
14039B975293j82572L47165k06009k53884J16231L83537k03101l81989o4986K20165
14029B749850K46268j96076k2330j16464n6840N7035J35111l83543K50765n7719
14019B606057k60705k06549N11224n67280K51793O6858j18239L76112k86555j55370
14009B217346j45671J43731k25113K41555o2800K3464o6512m06720O91161k29411
13999B181030j92241M4113j29851J9106k06437N65571j83069l49113K84208J55762
13989B189079J329559K104142O796118J6449746J9437349k1649226A2251957m587193
13981G664764k271161q75027j041163O3753m11722j48892j80616l84773M2046
13972B457209L25446k59489j60799k19627J72029k30686m04036K08022K44998
$$ plain form
14039 2975293 2792721 3139886 2933877 2679993 2796224 3179761 2976660 2594671 2529685 2749850
14029 2749850 2996118 2800042 2777712 2661248 2604408 2661443 2796554 2413011 2663776 2606057
14019 2606057 2345352 2138803 2650027 2082747 2334540 2401398 2283159 2659271 2372716 2217346
14009 2217346 2071675 2215406 1990293 2231848 2169048 2192512 2126000 1719280 2410441 2181030
13999 2181030 1988789 2032902 1903051 1922157 1715720 2281291 2098222 1749109 2033317 2189079
13989 2189079 3518638 5622780 12418898 28868644 48305993 26656767 12251957 7664764
13981 7664764 5393603 4518576 3477413 3541166 3129444 2980552 2799936 2415163 2457209
13972 2457209 2782655 2523166 2362367 2142740 2314769 2084083 1680047 1888069 2133067
13963B133067j45320J83812k60413L04823m38512J25330K97298k07578j89304
13954A803203k52513q2069J39995K98386l16344L02216j40191m05576N60654k7517
13944A880244q7459J1187j68842l1269P4096j71570J91432n1651r0059k92511
13934A263598K19268m9549K9183K17548j20363J66633j58133J34573k81527K13327
13924A634558j41607k40706m647M3273J89212j45010j8178j57723J39644l7485
13914A261331O5632J21848l11213K24271K90533k10783q4152q6973q6861J89787
13904A373420l72520K91396j10298j29861K38968M34828k66685l33302M3358Q6911
13894A256215L6182j94521m2777K20454l37931J46266R7539r9352K73273k75519
$$ plain form
13963 2133067 1987747 2171559 1911146 2215969 1777457 1902787 2200085 1992507 1803203
13954 1803203 1550690 1468621 1608616 1907002 1590658 1892874 1752683 1347107 1907761 1880244
13944 1880244 1792785 1803972 1635130 1603861 1677957 1506387 1697819 1646168 1556109 1263598
13934 1263598 1482866 1433317 1462500 1680048 1559685 1726318 1568185 1702758 1421231 1634558
13924 1634558 1492951 1252245 1247598 1290871 1480083 1335073 1316895 1159172 1298816 1261331
13914 1261331 1326963 1448811 1137598 1361869 1652402 1441619 1357467 1270494 1183633 1373420
13904 1373420 1000900 1292296 1181998 1052137 1291105 1725933 1459248 1125946 1169304 1256215
13894 1256215 1292397 1097876 1055099 1275553 937622 1083888 1181427 1082075 1355348 1079829
13884A079829j42489O7587n7574K92310k7417n06587M68620q2524K25212j96454
13874A120513k89379L61189m41498m6939K23083r507K96792j52463j10988K1923
13864I72726q7868L52805l23909K25699l73616k95445M41625N0411K643K36317
13854A201388j66749j64795N0223L10211l48382j02046J0695J96512n2012Q9189
13844A024234k5657L3017Q124j2201P7610k9134l53340J79431N5049J41168l24703
13833G73598j7831j09135K60792j88791p5134K40826j22725J52597o4178r2101
13823G57918J39797K37896k66282j80864Q6387P9196k3605p1832m2057M6547L23333
13812A086434C97153K77744O1309k2670Q2619j92975o8257J49623P9149C50945
$$ plain form
13884 1079829 937340 1004927 947353 1239663 1212246 705659 1174279 1091755 1316967 1120513
13874 1120513 831134 1192323 750825 703886 926969 917462 1214254 1061791 950803 972726
13864 972726 884858 1237663 913754 1139453 765837 470392 912017 962428 965071 1201388
13854 1201388 1034639 869844 920067 1230278 881896 779850 790545 987057 935045 1024234
13844 1024234 998577 1031594 1039718 1027517 1105127 1075993 722653 902084 957133 1098301 773598
13833 773598 755767 646632 907424 718633 643499 884325 761600 914197 850019 757918
13823 757918 897715 1135611 869329 688465 774852 854048 830443 758611 716554 763101 1086434
13812 1086434 397153 674897 736206 713536 796155 603180 534923 684546 763695 350945
13801H11604p8577o0766J27671r9875K40297j73050K35496D46917J02949J30998
13791F80864j22602K3129L58824j78621P2406q6099k85056K16195k47522M20010
13781H51528B83999M36182m5962m310L25191m53874K14992K86363p2356k76248
13771F93977O3483C50349L64693p1691K72623k79363P9591J24061j37179j59862
13761E43222L52474j95583j23404J96326C15260K22249o7823P9923n5014K77181
13751G71776j39017L3870N5046l29898J80251M1827J65932l18618L8480J45709
13741F45358l1814j27749P9815J18564k42090J5077K57479K7354N2750k49601
13731E45143k29761K1041J69236A55113J54260M53206l16240L7376K91317l69163
$$ plain form
13801 811604 733027 672261 799932 700057 940354 767304 1002800 446917 549866 680864
13791 680864 558262 581391 940215 761594 834000 747901 462845 679040 431518 851528
13781 851528 283999 720181 674219 669909 995100 541226 756218 1042581 970225 693977
13771 693977 757460 350349 715042 643351 915974 636611 716202 840263 703084 543222
13761 543222 895696 700113 576709 773035 315260 537509 469686 549609 494595 771776
13751 771776 632759 666629 721675 391777 572028 613855 779787 461169 499649 645358
13741 645358 613544 485795 565610 684174 442084 457161 714640 741994 794744 545143
13731 545143 315382 336423 505659 155113 309373 762579 446339 483715 775032 405869
13721D05869K4648J76626B47357M00397j73476J77444J03654l3243k04284O6500
13711E84349B58324M96770k75522E047O46750K15377l69385J29201j10650R4389
13701F10729j5390l8905l7689j7093M1772B59087L0213J64180O3183p0499J01273
13690E47437p5604n2898J09409O2995k41501L1599j70354R099M30479B67833J22216
13679C90049k6609R3367J26061k1907k3506j32969N2514J04702A62765L94514
13669E57279M8164r1377J29294B45732K67682J86064j11536j41251k19555K37229
13659D64365j88165J05008M31723j85438l5275j1782m8285j58273q5460m2738
13649B45680M6407J29067a53475F58880D6556O50954A85621M03133j37531k06808
$$ plain form
13721 405869 430517 607143 247357 647754 474278 651722 755376 722133 517849 584349
13711 584349 258324 755094 479572 5047 651797 867174 497789 626990 516340 610729
13701 610729 595339 556434 518745 501652 543424 259087 289300 453480 516663 446164 547437
13690 547437 471833 418935 528344 591339 349838 381437 211083 220182 650661 267833 390049
13679 390049 363440 456807 582868 560961 537455 404486 457000 561702 162765 557279
13669 557279 605443 514066 643360 245732 513414 699478 587942 446691 227136 464365
13659 464365 276200 381208 812931 627493 592218 580436 532151 373878 288418 245680
13649 245680 292087 421154 -153475 658880 46556 697510 185621 588754 451223 244415
13639B44415M2020R1359R2520K421p9651E8859M38162j90331J51334o6444d9015
13627C35640K21420k27263e7698E09081J8152A67962D4740K90852I3949N73684
13617F67633k42368j58061N6905J54403J0403B23216m2926J68546P5805k5399
13607C99242F1332k2985K95671l0789H2923K09482J59482A83209R3570L67372
13597F44151B40881J57436E2623L67176j24901o5536K0796M35683k85573n9194
13587C41074p0481O8221O5611j26226M5026A36328M1849J79601K2198J63596B48390
13575A42095K72483A22107M90175j44087j76694P8459M1986j1131j4409i258B02551
13563i9109C06193j50023K72210j30330M6060A49628L01804A46888J36038J24381
$$ plain form
13639 244415 286435 377794 470314 472735 393084 58859 497021 306690 458024 391580 -49015
13627 335640 557060 329797 -57698 509081 527233 167962 44740 335592 93949 667633
13617 667633 425265 267204 324109 478512 488915 223216 180290 348836 424641 399242
13607 399242 61332 38347 334018 303229 82923 292405 451887 183209 276779 644151
13597 644151 240881 398317 52623 419799 294898 229362 250158 685841 400268 341074
13587 341074 270593 338814 404425 278199 323225 136328 178177 357778 379976 543572 248390
13575 142095 414578 122107 612282 468195 291501 369960 411946 400815 386406 -9258 202551
13563 -99109 306193 156170 428380 298050 344110 149628 451432 146888 282926 407307
13553D07307A5355M74589q0851A56278L84964A34342j1001C3731J65223m3397
13543A55557J35296l4955O8674P3998L7207j73126A18543K30497J19109B33933
13532C87658o9522p5445L3234H7212l5684J12482K74102j08395J24198A82814
13521B02409I7676l221j304J57480I5240K4461L08702A34879J12317J33743j19873
13510B61066A30474J88127o8710L70895B42024A08449K01321r0412Q8388m4651
13500B63095r0548E5623M03630f6365a2795A77263e7698A65950p538b2226B44541
13488C87659B7156J12279J89866A17745J49031K23047d4495A84111o028P2119
13478B50202O9838K5367k7598P8889j85943K36346H0910K41377p7306K4721J9567
$$ plain form
13553 407307 15355 489944 409093 156278 541242 134342 123341 33731 198954 155557
13543 155557 290853 255898 324572 398570 435777 262651 118543 349040 468149 233933
13532 387658 318136 242691 275925 87212 51528 164010 438112 329717 453915 182814
13521 202409 97676 94455 93151 250631 95240 119701 428403 134879 247196 380939 261066
13510 261066 130474 318601 249891 620786 242024 108449 309770 219358 307746 263095
13500 263095 172547 55623 459253 -66365 -12795 177263 -57698 165950 158412 -22226 244541
13488 387659 27156 139435 329301 117745 266776 489823 -44495 184111 178083 250202
13478 250202 320040 345407 317809 396698 210755 447101 80910 322287 244981 269702 289269
13467B89269J06075a55078B25567b0897A3463K60421i9380G7307g1899C13123
13456A70138j2988M0215J9859K7676l5192b06412Q5189N8909B64121l224A19820
13444B27736a07211B52319a95496A83809J9794P9572A22767K22609A55415a19008
13433A311J53351a75300I9746J18589n2148K78403R4845M8117k87779e982A82451
13421B99923D8342J31314J36157c0792n0777A86272J05204A34786d4984H4432
13410E78062A50707o5628J78665b49317g3641G17290C5270L97481A88254n0834
13400A37420n05J72860A7490J42792K3464K53776j15742H4599L61264b1616D06998
13388B76854d5005E72422B39127i942C22065A14606q724L05468k5699f594o3165
$$ plain form
13467 289269 395344 -155078 225567 -20897 13463 273884 -99380 77307 -71899 313123
13456 170138 157150 197365 217224 244900 209708 -206412 -121223 -62314 264121 260897 119820
13444 227736 -107211 252319 -195496 183809 203603 283175 122767 345376 155415 -119008
13433 1311 154662 -175300 99746 218335 166187 444590 539435 587552 299773 -5982 182451
13421 299923 48342 179656 315813 -30792 -81569 186272 291476 134786 -44984 84432
13410 578062 150707 85079 263744 -249317 -73641 717290 35270 432751 188254 137420
13400 137420 136915 309775 17490 160282 183746 437522 321780 84599 445863 -21616 406998
13388 276854 -45005 572422 239127 -9942 322065 114606 105882 411350 385651 -6594 -69759
13377f9759H3517J62503b38574H9338J08273k8351E9197M43731j64346A44442
13366A90621A9803K01829M861h5135B28899M66801B68358m8840Q2132A28941J51974
13355B80915F5066N58889B30217M858I3732L85252e6139D94333j71712j28216
13345A94405J66442j23978J36467L6124A29968J72875p0475q2918K78235a61652
13334A85175h8815A93464a59061C77374G3024Q0293O8542J85925n6443H2800J3217
13323I6017B9856b82341B83402r5846g9440B87497C3366N6238B6261K90876r7020
13312B20117q3860J99126G4105e5832C42290A36416J14329e8585B4820J74282
13302A99102P2661j00756K50424H2498g6859B67967J43491F3133O770C1250J39709
$$ plain form
13377 -69759 83517 246020 -238574 89338 197611 169260 59197 502928 338582 144442
13366 190621 19803 221632 226493 -85135 228899 695700 268358 219518 301650 128941 280915
13355 280915 65066 623955 230217 235075 93732 478984 -56139 494333 322621 194405
13345 194405 360847 236869 373336 409460 129968 302843 232368 149450 427685 -161652
13334 185175 -88815 193464 -159061 377374 73024 153317 221859 407784 351341 82800 96017
13323 96017 29856 -282341 283402 187556 -79440 287497 33366 89604 26261 317137 220117
13312 220117 136257 335383 74105 -55832 342290 136416 250745 -58585 24820 199102
13302 199102 271763 171007 421431 82498 -76859 267967 411458 63133 69903 31250 170959
13291A70959Q8840B2700M213i5072B01646I3922J79993l4015R309K17303O819
13280D73331b9264A33596J34064A16963g5845a3340C38939A26226J31295J04203
13270C61724G5337J2680A8249J48204a06581D7454d9392C28393A01759J74902
13260B76661D3829K88079j49442a01175n8693E1212J25314C5302P0069Q1833B6639
13248i6716A3490d1099B31714r352p1976M8921I1485J99986A32317A5925b8224
13236d8550p4556B58974J22389b76521G3747Q5519b840j0285G6180a27730A53943
13224B59663E0545a12190B25755J862B0284a7513D91021B00923A810K49845p7419
13213A74236d3149A23421K52942g7140C07899I6010J07195q0835b49499F6974
$$ plain form
13291 170959 259799 22700 26913 -95072 201646 93922 273915 239900 249209 466512 473331
13280 473331 -29264 133596 267660 116963 -75845 -13340 338939 126226 257521 361724
13270 361724 75337 88017 18249 166453 -106581 47454 -49392 328393 101759 276661
13260 276661 43829 331908 182466 -101175 -159868 51212 176526 35302 105371 187204 26639
13248 -96716 13490 -41099 231714 222362 150386 199307 91485 291471 132317 15925 -28224
13236 -48550 -123106 258974 381363 -276521 73747 159266 -2840 -13125 76180 -127730 153943
13224 259663 50545 -112190 225755 227617 20284 -17513 491021 200923 1810 251655 174236
13213 174236 -43149 123421 376363 -77140 307899 96010 203205 122370 -249499 66974
13202c4405C08251k1862j25919a8937j25498d7077M699j0345B19106I3976K89213
13191C83189I496a05949B4136K0714L67922A49383J68308A45166h060j81650o4319
13180b54029D69584H6339g7315c1548E50278k25867A35997K53687i8269C36840
13169a08090A99697B7346K7539L81270e8728b6565j7201A8587b8561G3677a13281
13157h1581L0261I8358m4508b35243A21362J83841E9353J92364H1544a06612A31960
13145H9381L6330K00715A27708g9374k9802C32255j37667b63700a05010A40656
13134c34436K7508A09456P9403A9115c47239H6315L9755R337J09354c2833p4070
13123a06903B00093o5580M1145e0775L768A82340J39005h3810k99400a25616k48824
$$ plain form
13202 -34405 308251 286389 160470 -18937 -144435 -47077 -42378 -52723 219106 93976 383189
13191 383189 9496 -105949 24136 44850 412772 149383 317691 145166 -8060 -189710 -254029
13180 -254029 469584 86339 -77315 -31548 550278 324411 135997 389684 -98269 336840
13169 -108090 199697 27346 54885 436155 -58728 -26565 -43766 18587 -28561 73677 -113281
13157 -81581 -51320 98358 53850 -235243 121362 305203 59353 251717 81544 -106612 131960
13145 89381 125711 326426 127708 -79374 -109176 332255 194588 -263700 -105010 140656
13134 -334436 -306928 109456 188859 19115 -347239 86315 126070 135407 244761 -32833 -106903
13123 -106903 200093 134513 175658 -50775 -47007 182340 321345 -83810 -383210 -125616 -374440
13112c74440A68940q2512J73910e1148E5323N9977c88648a51245B4196a28285
13101B66406c5201C08188F6622a17984C7080O8284Q3982c9556C16551E2656c11004
13089I6865f5813r7172K8185O3075b9485k01964Q6206p350F7140J15468M8251
13078B30859p0388D4752A8948O9558b3157c896C38840o5155p0554R3038m6491
13067B49678A04368J12782F6138J46294f555C08672a58581D42483j87876d8425
13056e4152c469B08354J04496m3414I473J42350b13911B76793H1603a03419n1336
13045a54755A7207g981j22996C6572o301L45742E0078f5498B4268L8309L745L4375
13033A00697A4641J37108b628B13332D0726K40229J617I1768J39484b71160b8102
$$ plain form
13112 -374440 168940 86428 260338 -51148 55323 115300 -388648 -151245 24196 -128285
13101 266406 -35201 308188 66622 -117984 37080 105364 189346 -39556 316551 52656 -311004
13089 96865 -65813 -162985 -134800 -71725 -29485 -231449 -145243 -152593 67140 182608 230859
13078 230859 160471 44752 18948 88506 -23157 -3896 338840 273685 203131 296169 249678
13067 249678 104368 217150 66138 212432 -6555 308672 -158581 442483 254607 -48425
13056 -54152 -3469 208354 312850 269436 9473 151823 -213911 276793 81603 -103419 -154755
13045 -154755 17207 -7981 -130977 36572 30271 376013 50078 -65498 24268 62577 66322 100697
13033 100697 14641 151749 -2628 213332 40726 280955 282572 91768 231252 -271160 -28102
13021C25725c0644F1170a11167I3257a65417B52988F0378L37098A65774a31444
13010A52007a13290B41227E8238i7766B10468o9899L28642f2791B6227i0926B38042
12998F1200J87526G9748a8393j014N564C6426L73632B660J11454d02321D4210
12986h8247A6727e3778I7990J31914n8484J31081H0454G063a83392k17120A74573
12974D9219O8620j8796h5030L3168A84055o4299K45751B6217L3097k5065J4149
12963D8398Q6705O2223A723f57A898a25971B9737c9859k37362a2866C39816I7600
12950B42167j6926a67135A64650M5052c86071A07167E2813K55569A41416D7986
12939F6558J72544j18789b6267k19435E0148b9169A70645A7902a8227A31643P6224
$$ plain form
13021 325725 -30644 61170 -111167 93257 -165417 252988 60378 397476 165774 -131444
13010 152007 -113290 241227 58238 -97766 210468 140569 469211 -62791 26227 -90926 238042
12998 61200 248726 79748 -18393 -19407 -13843 36426 410058 2660 114114 -402321 44210
12986 -88247 16727 -53778 97990 229904 171420 302501 80454 7063 -183392 -400512 174573
12974 49219 117839 99043 -85030 -51862 184055 119756 365507 26217 59314 34249 48398
12963 48398 135103 197326 1723 -657 1898 -125971 29737 -39859 -277221 -12866 339816 97600
12950 242167 225241 -167135 164650 209702 -386071 107167 52813 308382 141416 47986
12939 66558 239102 120313 -26267 -245702 50148 -29169 170645 17902 -18227 131643 207867
12928B07867P7982a72340a6529B11504a13727A14786C0910L59203c9125g919B59608
12916A64060J49254F2971b51701d3260j11423C31560A39745K29069a17383C574
12905C55479I2442m6214J36570E1681g1220A3926J49200F2128K62065C2081J64466
12894A96547o6578n5022c1735j29009A3314a34282A22509a1299o828j02962A38568
12882E7480k052a27782B65488a44983N357j2692f5155A48706J6967K29734F8138
12870g2284A75447F3066J22255I0148a75906A12286f7349B4484c10759C6587K53295
12859B89882A2197a2215A35436K8863a20267B42028I7138l1334J17121a54819
12848B33713a30965A67074b5339A37037a31873Q442k22909c8753B19147K9442
$$ plain form
12928 207867 285849 -172340 -16529 211504 -113727 114786 30910 390113 -39125 -7919 259608
12916 164060 313314 62971 -251701 -43260 -154683 331560 139745 368814 -117383 3574
12905 355479 92442 46228 182798 51681 -71220 13926 163126 62128 324193 32081 196547
12894 196547 129969 74947 -31735 -160744 13314 -134282 122509 -11299 -18127 -121089 138568
12882 57480 55428 -127782 265488 -144983 -139626 -152318 -65155 148706 165673 395407 68138
12870 -72284 175447 63066 185321 90148 -175906 112286 -67349 24484 -310759 36587 289882
12859 289882 12197 -12215 135436 164299 -120267 242028 97138 65804 182925 -154819
12848 233713 -130965 167074 -25339 137037 -131873 -123431 -346340 -38753 219147 248589
12838B48589A11601N0993H1240c93388C95876j68341b63754B49043I9772c77672
12827c6795B71959A24205a17688A10988a7074A09056b77650a38439C0682J68575
12817A99257c17766a03778l5676J4083D7870b57057A19121c6236A58633G324N6682
12806F4006c50963I573R7920k0480b35050N2107f5363B97359j47510c11864H2383
12794b81835H6706c07519a3636n8839B78200A16273E6688g0803C14723j38661
12784A76062o8388b90644r9180E90137A63952O1868A10876A6190c26663h2593
12773B1464K99766a39513k8230e5701J4769B21114G1901A2857a55765j29987D6376
12761a64375D0068K1279c6917j10173A52859a35965Q886B33257F8343l2850R3629
$$ plain form
12838 248589 111601 162594 81240 -393388 395876 227535 -263754 249043 99772 -377672
12827 -36795 271959 124205 -117688 110988 -17074 109056 -277650 -138439 30682 199257
12817 199257 -317766 -103778 -139454 -125371 47870 -257057 119121 -36236 158633 7324 64006
12806 64006 -350963 9573 107493 87013 -235050 -182943 -65363 297359 149849 -311864 82383
12794 -281835 86706 -307519 -13636 -72475 278200 116273 56688 -70803 314723 176062
12784 176062 107674 -290644 -389824 590137 163952 225820 110876 16190 -326663 -82593
12773 21464 321230 -139513 -167743 -55701 -40932 221114 71901 12857 -155765 -285752 46376
12761 -164375 40068 61347 -36917 -147090 152859 -135965 -127079 233257 68343 35493 129122
12750A29122a11634a8736l217A47921J12142b25176c7354F8931a4161j5973l08765
12739c38899D7756J79551I4390A6229R5335B2408A193a65584L0397B41384q2020
12728A59364F7906K11701p3085P4592A26851O6669c165C18003a66686A08691a75952
12716A04972K54378A43584b34581B38197G5416f0182B47535i7010G5938A8932
12705a10106l7274B18658b11616i2284m1524A75431J49486A1095K97305a86478
12694A53282L0567D8598a28163A11191O8271a27404A03752b30618i8664M0932
12684e7732L761A88752b66593C67008j54398N4475m075f1821e008j23048c342
12672a85947B43531J14969b18627g8850A46574L6401j4740a97243A19932J378
$$ plain form
12750 129122 -111634 -18736 -21953 147921 260063 -225176 -37354 68931 -14161 -30134 -338899
12739 -338899 47756 227307 94390 16229 111564 22408 1193 -165584 -135187 241384 159364
12728 159364 67906 279607 206522 281114 126851 193520 -3165 318003 -166686 108691 -175952
12716 104972 359350 143584 -234581 238197 75416 -60182 247535 -97010 75938 18932
12705 -110106 -147380 218658 -211616 -92284 -133808 175431 324917 11095 308400 -186478
12694 153282 183849 48598 -128163 111191 179462 -127404 103752 -230618 -98664 -57732
12684 -57732 -53971 188752 -266593 367008 212610 267085 263010 -61821 -5008 -128056 -3342
12672 -185947 243531 358500 -218627 -78850 146574 182975 168235 -197243 119932 121310
12662A21310K79081j90264A2569K68424A6140a436H2049a86219K678A29418a07480
12650B81219A7475a91080l1150B60949A28901n4204g3762A01748J52994p5555
12640A79187i0431M3112F0450J71457A12412J85968a43755j67C08956i4596B53734
12628B64646k3508a67322C65712P604m4071j52966i2198B08581d900F2366B2957
12616A30898K07950i1977H0608M2091l947E317K04801J23294g5195B1979J31036
12605A53015d596n0301B1798K618K29928D5537J94675G5478a8411B4175a6074
12593f3016A77820C0772J22006D4804g0773k9484a1326j0509D1657h5813B1814
12581h1591K7007C18106c43012d3616j62303l9289C73620n9997c4013J6735A06269
$$ plain form
12662 121310 400391 210127 12569 280993 16140 -1436 82049 -186219 -183541 129418 -107480
12650 281219 17475 -191080 -222230 260949 128901 74697 -73762 101748 254742 179187
12640 179187 -90431 -47319 60450 231907 112412 298380 -143755 -143922 308956 -94596 253734
12628 264646 241138 -167322 365712 373316 329245 176279 -92198 208581 -4900 62366 22957
12616 130898 338848 -91977 80608 122699 118752 5317 210118 333412 -75195 21979 153015
12605 153015 -4596 -54897 21798 24416 254344 45537 240212 75478 -18411 24175 -16074
12593 -63016 177820 30772 152778 44804 -70773 -100257 -11326 -21835 41657 -85813 21814
12581 -81591 -54584 318106 -343012 -43616 -205919 -245208 373620 313623 -34013 -17278 106269
12569g1989j67881B26184n8834G8267d75214F1552L7993m3931b42096A36236n8599
12558G7637K00584a40527A29171a07530H9226M67411B9583K60100D7513J8647
12548F6160N4515e4405C22543q8646i9906l3967m9038o3170d2502C74822j86558
12537A88264O1816p5334C5790L48007b99388d4932b593D3447K56165f4244D4285
12525A56546J23905b33840E5421Q0108a28987M0594E2824a37901N9272C16957
12514A77563K0317a98769k7180B92453C7023f132A44358F334g3262j41778a01599
12502d9451A94613B1801N7374b84217B9425a90744A10672c62435d2848A25855
12491a03651J75j14233p0178B53087a53187c0410l32561J63220F9068J6848e7721
$$ plain form
12569 -71989 -239870 226184 167350 78267 -475214 61552 99545 55614 -242096 136236 77637
12558 77637 278221 -140527 129171 -107530 89226 556637 29583 289683 47513 66160
12548 66160 120675 -54405 322543 233897 -99906 -133873 -182911 -246081 -42502 374822 188264
12537 188264 250080 174746 35790 383797 -299388 -44932 -2593 43447 299612 -64244 44285
12525 156546 280451 -233840 55421 135529 -128987 -88393 52824 -137901 -78629 316957
12514 177563 197880 -198769 -225949 292453 37023 -6132 144358 6334 -73262 -215040 -101599
12502 -49451 194613 21801 79175 -284217 29425 -190744 110672 -362435 -42848 125855
12491 -103651 -103476 -217709 -287887 253087 -153187 -30410 -362971 -199751 69068 85916 -57721
12479D07370A36145B5486a63273A33273K32356A70397c84736I8796l1716i9368
12468B4694a38896B8705a84907A22110h8458A14823K43493k4394h9297C21001
12457c75245A89676J08161j02979b2957l18664d1183j43721I6590B8979E520h3682
12445C52584b31013B78611a62741b6847j41678j08119I0055a00528j68926C84230
12434a90287N9543M0107j6033K8793C21577a64155B5025b9542F9831P0477a34457
12422a64503a8542A74654q0894j6469B3800d39388a95064N8214k2601L9604A5209
12410A35727a70824e6564j4198A22842k7102m5781J15123a05895a6668j45157
12400a61825f0577m4163p887A75235o5691d162p6264J7148q9616p4755j02859
$$ plain form
12479 407370 136145 25486 -163273 133273 365629 170397 -384736 98796 67080 -99368
12468 24694 -138896 28705 -184907 122110 -88458 114823 358316 333922 -89297 321001
12457 -375245 189676 297837 194858 -22957 -341621 -41183 -184904 96590 28979 5520 -83682
12445 352584 -231013 278611 -162741 -26847 -168525 -276644 90055 -100528 -269454 384230
12434 -190287 -130744 -90637 -106670 -77877 321577 -164155 25025 -29542 69831 140308 -134457
12422 -164503 -18542 174654 93760 77291 23800 -439388 -195064 -136850 -159451 -119847 15209
12410 135727 -170824 -56564 -70762 122842 95740 49959 165082 -105895 -16668 -161825
12400 -161825 -60577 -104740 -112627 175235 109544 -4162 -80426 -63278 -152894 -227649 -330508
12389c30508g0407b0144j15408G2980L8817j9750R5695a69673H6650c87103A00222
12377a19312c2351j21136A83531a60951E5392J9644e5516I267J62357G3055N3126
12366A26181f6563F777Q2122a70682A60219c4066B1820L13831a60636a1587A01190
12354A68024M1660B5119J60154I789Q7329a38354J2189B5030L4622h315j27194
12343a35509d1637I4443K28629C9460J3484J78574J42750j28938E1424c6525f4
12331e1827A09878A5913a13865D6263a26689A92961b088l2451A23640Q8044a3396
12319a05494I429J59609b7033I8201a2151B7425J00125a59152B88257c047A93404
12307h5855j03626m5963r3100D2316d1869E7307Q9920L2270n9297B6684K3938
$$ plain form
12389 -330508 -70407 -20144 -135552 72980 111797 92047 187742 -169673 86650 -387103 100222
12377 -119312 -32351 -153487 183531 -160951 55392 75036 -55516 9267 171624 73055 126181
12366 126181 -66563 6777 88899 -170682 160219 -34066 21820 335651 -160636 -11587 101190
12354 168024 209684 25119 185273 9789 97118 -138354 -126165 25030 59652 -8315 -135509
12343 -135509 -41637 94443 323072 39460 52944 231518 374268 245330 51424 -36525 -64
12331 -51827 109878 15913 -113865 46263 -126689 192961 -2088 -34539 123640 211684 -13396
12319 -105494 9429 169038 -27033 98201 -12151 27425 127550 -159152 288257 -3047 193404
12307 -85855 -189481 -235444 -328544 42316 -41869 57307 147227 179497 120200 26684 50622
12296E0622A5990M4752J49369H8819K15138G7686K5328B1408c85476J03444a7520
12284A35901b58752e1605q1773A94832J7948b9400A72307b16586j4374A03842
12273E34111A67966e0831B83886j4338A5127J87221K00773g1537A38563J14391
12263B52954J07695a38628A21149b077B6383P7627a03410B69593m5918a26786
12252B36964j01069c9572D8198R1817K0888a55988A69590D5707K79708b40j65651
12241a65891H3417f5611C3210b8938E0199a06172B31916E2861J48683K27363A33737
12229B61135B5047P726d2931B54697l2662k6220m5404R6419j04367L7206F2744
12217C4533K42161j11780K68310A23626j4515i6166C13277O248a74572C07115
$$ plain form
12296 50622 15990 60742 210111 88819 303957 77686 103014 21408 -385476 -282032 -17520
12284 135901 -258752 -51605 -133378 194832 212780 -29400 172307 -216586 -230960 103842
12273 534111 167966 -50831 283886 269548 15127 202348 403121 -71537 138563 252954
12263 252954 360649 -138628 121149 -2077 26383 104010 -103410 269593 223675 -126786
12252 236964 135895 -39572 48198 140015 160903 -155988 169590 45707 325415 -240 -165891
12241 -165891 83417 -65611 33210 -28938 50199 -106172 231916 52861 201544 428907 133737
12229 261135 25047 32773 -42931 254697 222035 195815 150411 246830 142463 179669 62744
12217 34533 276694 164914 433224 123626 109111 -96166 313277 319525 -174572 307115
12206d4795A42864q183K13560A60461F8984J09925a317A45734c26905A22323J86287
12195C08610O8387E5450K85813C9045a9211F6029L65184k01390a47683a7036A31005
12183E00466F0666J42684A7462J65361a66573C27639H4460k2251B8245L60948
12173C89193a32360A3591g7961L2202A46489I039J63838J71789j2677A18946c00972
12161A64434C5920L01817A11642a97056i5162D30153A31235J0191a7948G2207
12150a20232C7674d07211J59741B4706J14649E743L6017c4001j14925n9284a8921
12138A96478h2790J7155A34674J27564b38792f9653n2131n8195M868e8459B501
12126B44623G928J05217M4010m1028a43571C3717J45994h3136L9024O064G3664
$$ plain form
12206 -44795 142864 134681 348241 160461 68984 178909 -1317 145734 -326905 122323 308610
12195 308610 376997 55450 341263 39045 -19211 66029 431213 229823 -147683 -17036 131005
12183 500466 60666 203350 17462 182823 -166573 327639 84460 62209 28245 389193
12173 389193 -132360 13591 -77961 -45759 146489 9039 172877 344666 331989 118946 -300972
12161 164434 35920 337737 111642 -197056 -95162 430153 131235 141426 -17948 72207
12150 -120232 37674 -407211 -247470 24706 139355 5743 41760 -34001 -148926 -208210 -18921
12138 196478 -82790 -65635 134674 262238 -238792 -69653 -121784 -179979 -175111 -58459 2501
12126 244623 7928 113145 157155 116127 -143571 33717 179711 -83136 -44112 -38048 73664
12114A83127b07161j49737G774c23018A70290d2449k76719I0964M5212c6306B11308
12102f6806B26c763l7943B17775L5225b1048k29659J04684f0184H1653a41277
12090A1216J4898j334b10569P7521f5937C59320d80909d2993r9712A89443n1878
12079A37565d9291K2173E7140A369c6716m025j02968A45458e6141I4215A1106
12067F31649R78504P76287E95135k39240g2088j34915e583p8194A16184d0731
12056i4985B397L35099A5786c13899A5434M3778j4576c73501A12524a6791B63895
12044a0614A08354c24049C0880i7484A34047P5112i614j59720A18432l9793B2717
12032d51865a38802O0021j63995j40490a38928B10631O9637E7351e092B8298g5094
$$ plain form
12114 183127 -207161 -356898 7774 -323018 170290 -42449 -319168 90964 136176 -36306 211308
12102 -66806 226 -3763 -41706 217775 253000 -21048 -250707 -146023 -60184 81653 -141277
12090 11216 26114 24780 -210569 -133048 -65937 359320 -480909 -42993 -142705 189443 137565
12079 137565 -49291 -27118 57140 1369 -36716 -40741 -143709 145458 -56141 94215 11106
12067 631649 1610153 2386440 595135 355895 -72088 -207003 -5583 -83777 116184 -40731
12056 -94985 2397 337496 15786 -313899 15434 59212 44636 -373501 112524 -16791 263895
12044 -10614 108354 -324049 30880 -97484 134047 209159 -9614 -169334 118432 78639 22717
12032 -451865 -138802 -78781 -242776 -383266 -138928 210631 280268 57351 -5092 28298 -75094
12020I4983l1080a75751A39956A1460K28442a60847F2545R4307M9163C6917J97740
12009B34657j11552C7809a14831p7241D85520k41589B4577b80041J26089A43348
11998a02549h894l6849k21479d5142A52080m6271J05440C5673c3613j82281b1724
11986e6162l6372p258J2534j33158A38643a26252A83803f5743m31593b28067i5554
11974h254n5619b8267B2808K04486B775c97009B30445P481a85900A26134l2433
11963I3701c08739e7430B11319l2998B2620a25008A50784B4106b58744h3088o1576
11952a44664j23805P491h8410c4469A32637A247M9806K29867F0858g5190m8014
11941a23204k23055d6810A324K0092a24325I1045l5367J50214C0312N9651a06088
$$ plain form
12020 94983 63903 -175751 139956 11460 239902 -160847 62545 156852 206015 36917 234657
12009 234657 123105 37809 -114831 -192072 485520 243931 24577 -280041 -153952 143348
11998 -102549 -8894 -45743 -267222 -45142 152080 105809 211249 35673 -33613 -215894 -21724
11986 -56162 -92534 -99792 -87258 -220416 138643 -126252 183803 -65743 -497336 -228067 -95554
11974 -8254 -63873 -28267 22808 227294 2775 -397009 230445 237926 -185900 126134 93701
11963 93701 -308739 -57430 211319 178321 22620 -125008 150784 24106 -258744 -83088 -144664
11952 -144664 -268469 -260978 -88410 -34469 132637 1247 51053 280920 60858 -75190 -123204
11941 -123204 -346259 -46810 1324 21416 -124325 91045 55678 205892 30312 89963 -106088
11929b85617f8121k6021G8700b86395H9318e479q1557j67809A36008a34743K9420
11918a05323d8235j04982f9696C9926a20289F0428a59570A6610a97087A83915
11907B84166d19984A03012c0500j38302L0559N7215o3948E8798b50333n7046A58276
11895D0477n432K05983a03678A1545a40435R455j02034a02901H2553K11447h8437
11883G3778J17751q2795c4783p0337b39A7976e6051I8988P3302N8014d299A2650
11870a76683A07319b44266B16883I1364Q6370b9614p9255I6967Q2184a21630I3881
11858A73670D8829J24899a48333b0767o1280k14053g9323k62423I3381b0804k01607
11847b22411a9571F1631d6942A94576g7203j20442j84390J26742R735d630j20955
$$ plain form
11929 -285617 -68121 -94142 78700 -286395 89318 -5479 -87036 -254845 136008 -134743 -105323
11918 -105323 -48235 -153217 -69696 39926 -120289 60428 -159570 16610 -197087 183915
11907 284166 -419984 103012 -30500 -168802 -138243 -81028 -144976 58798 -250333 -307379 158276
11895 40477 35045 241028 -103678 11545 -140435 -130980 -233014 -102901 82553 294000 -88437
11883 73778 191529 108734 -34783 -105120 -239 17976 -56051 98988 172290 230304 -4299 12650
11870 -176683 107319 -244266 216883 91364 177734 -29614 -108869 96967 179151 -121630 93881
11858 173670 48829 173728 -148333 -20767 -82047 -296100 -79323 -341746 93381 -20804 -222411
11847 -222411 -19571 61631 -46942 194576 -77203 -197645 -382035 -255293 -245558 -4630 -125585
11836a25585L3058k64651a08373A82549A7738J96918d9475A36597m8756D2142
11825b54822l4565l5497d8242j96652A73748J23930E7388d3022l14396A10974
11814G0639b30947b1557l9841A52134K2100J51676h4972p9586j4855A72819b24123
11802I9458h5994A74861c2233G5381q69k0069R5714h6109o1370f2234A58909h6640
11789A8080b15269E9301J4603Q9826b94961M7469A71554a12891B13229q1789e5346
11777a94947A0011d86824B88934E1313R7024f0733H4049b88678O08a3284p2147
11766h5431k7901l7217L9993p6807G4208d7985q8459k13386I4328a3761j9528
11755c3289k8857b5138A88869i2137B99813a80046B26212b09973L6635d5568A04795
$$ plain form
11836 -125585 -92527 -357178 -108373 182549 17738 214656 -49475 136597 87841 42142
11825 -254822 -289387 -324884 -48242 -244894 173748 297678 57388 -43022 -357418 110974
11814 70639 -230947 -21557 -61398 152134 174234 325910 -84972 -164558 -179413 172819 -224123
11802 99458 -85994 174861 -32233 75381 74512 54443 150157 -86109 -147479 -62234 158909 -86640
11789 18080 -215269 59301 73904 163730 -294961 -247492 171554 -112891 213229 131440 -55346
11777 -194947 10011 -486824 288934 51313 148337 -60733 84049 -288678 -288070 -13284 -85431
11766 -85431 -113332 -150549 -110556 -187363 74208 -47985 -136444 -349830 94328 -13761 -33289
11755 -33289 -62146 -25138 188869 -92137 299813 -180046 226212 -209973 -173338 -45568 104795
11743A17339J04983a1565A23924f783j2357k56312A3462a40687A71467k4575b7566
11731B48341j1377b69388B21517d03329A45876a40413k62786a3813B27070i2880
11720A07588d1657B01241b29840o3712J28323g8122a07q725B98231R1489a307
11708a37619M8456A93175q8239Q9163M3868a18840A95509b36321A47078a15961
11697c7511a1544j18360C6488J9418b10474A45041N0693F3101g3241r2433B3755
11685A0138b8379C13862o6585k6094a38418F4506j5452M69271G3004a0451B59
11673B19748b18417A14338b21061G522b28439Q1400J0661B87661a23153n8205
11663a81358A57137c45536g2592C35450a89021D0786J26203a44587I6441l1221
$$ plain form
11743 117339 222322 -11565 123924 -6783 -19140 -275452 13462 -140687 171467 146892 -27566
11731 248341 236964 -269388 221517 -403329 145876 -140413 -403199 -13813 227070 -92880
11720 107588 -41657 201241 -229840 -293552 -165229 -78122 -107 -8832 298231 389720 -1307
11708 -137619 -89163 193175 104936 194099 237967 -118840 195509 -236321 147078 -115961
11697 -37511 -11544 -129904 36488 55906 -210474 145041 195734 63101 -73241 -165674 23755
11685 10138 -28379 313862 247277 221183 -138418 64506 49054 518325 73004 -10451 259
11673 219748 -218417 114338 -221061 7522 -228439 -147039 -136378 287661 -123153 -181358
11663 -181358 157137 -345536 -72592 335450 -189021 40786 166989 -144587 96441 65220
11653F5220b11227A51943l3749G701K81680A06466K37626d1834A68191c17527
11642B54920n6289G822a17784B71926A1629J33758K48039n8717j30007L0344c56774
11630A79872A1913g5495A86877K41433f7791C3771J77099H448b02893k5539I4720
11618c7046A19057a10101C1799J28314c11685C9722J01055b8528j48838d7148
11607A54599a23058d1935k4461q639C30405e0158k27439I9754J1432J40479M0963
11596B92628d3634j54357c580q9069A89809a59315B2390R7092a29095E42349A63829
11584E31279b2096A45324n1785f7158k16728B71868A2765g4364A31577d1686C4527
11572a9085A06725O1955a36077A78043c4280n6767D18309B7683e9082B26909N2678
$$ plain form
11653 65220 -211227 151943 118194 7701 289381 106466 344092 -41834 168191 -317527
11642 254920 198631 7822 -117784 271926 11629 145387 393426 334709 204702 235046 -356774
11630 179872 11913 -75495 186877 428310 -67791 33771 210870 8448 -202893 -228432 94720
11618 -37046 119057 -110101 31799 160113 -311685 39722 140777 -28528 -177366 -47148
11607 154599 -123058 -41935 -66396 -75035 330405 -50158 -277597 99754 111186 251665 292628
11596 292628 -43634 -197991 -3580 -92649 189809 -159315 22390 119482 -129095 542349 163829
11584 531279 -22096 145324 93539 -67158 -283886 271868 12765 -74364 131577 -41686 34527
11572 -19085 106725 168680 -136077 178043 -34280 -91047 418309 27683 -59082 226909 279587
11561B79587G4439j2212O7129c47534A47188J80141j22704E7744J972d09264a08433
11549b95398j54988C43984a14971J7082b8103E2355J33277n8169d6785E98732
11538A95811a58479E0328E271J60875a28809A96986H8202e7464n9047A80725H6353
11526I5942N1755k248o3430a17901q1463N199B32471C3436c05931C45878A71147
11514e5046A27365J81400j38125G1103K56747a00894B78064j21212O7002E5208
11503D04226G4943K31405a84590F5434l0735J98126m7337j728a04162I2020L23563
11492D15583A18431c43392g5523j22918A01187P4658j3071F4560J21547F7168
11481d9975C48146b94441A53108K41412a76104D21504A85878B5858l532J66594
$$ plain form
11561 279587 74439 62227 129356 -347534 147188 327329 204625 57744 59716 -409264 -108433
11549 -295398 -450386 343984 -114971 -97889 -28103 52355 185632 127463 -46785 598732
11538 195811 -158479 50328 5271 166146 -128809 196986 88202 -57464 -116511 180725 86353
11526 95942 147697 145449 82019 -117901 -199364 -194165 232471 33436 -305931 345878 171147
11514 -55046 127365 308765 170640 71103 327850 -100894 278064 156852 223854 55208
11503 404226 74943 306348 -184590 65434 34699 232825 185488 183760 -104162 92020 415583
11492 415583 118431 -343392 -75523 -198441 101187 175845 162774 64560 186107 67168
11481 -49975 348146 -294441 153108 394520 -176104 421504 185878 25858 22326 188920
11471A88920N7054a43563E9650d83394g258j2420p5517A92219G3673H237J04664
11460A12901n5804A1330b8963B43378b0539A00125J55476j22349d0534A06861
11449E3012j8409j5472J27335D4293K97711E5464J06098J65425F7617J83584j6977
11438B34224n2883f3960J4346D1541K36444c1455m297A32381h2029f953B60122
11426e4698C60631k0602H9009b10650F5031L28961A76319C7279j2983h5762l26
11415h6088H4310e7682a5209j13454N7094A36985F1831k7413Q1264d9559B5427
11403a51948A13307h8049j4902o9587B93459j33826a7144A11014l8758d1663H8104
11391a53008N4164A06755N4107a80678g3165B5096J73371a46876c5116I5193L6452
$$ plain form
11471 188920 245974 -143563 59650 -483394 -7258 -19678 -95195 192219 73673 8237 112901
11460 112901 57097 11330 -28963 243378 -20539 100125 255601 133252 -40534 106861
11449 53012 34603 19131 146466 44293 342004 55464 161562 326987 67617 251201 234224
11438 234224 181341 -63960 -49614 41541 277985 -31455 -35752 132381 -82029 -6953 260122
11426 -54698 360631 340029 89009 -210650 65031 393992 176319 37279 24296 -85762 -86088
11415 -86088 84310 -57682 -15209 -128663 -71569 136985 61831 34418 115682 -49559 25427
11403 -151948 113307 -88049 -102951 -172538 293459 159633 -17144 111014 72256 -41663 88104
11391 -153008 -98844 106755 160862 -180678 -73165 25096 198467 -146876 -35116 95193 131645
11380A31645A3685e3692b4667j4584B38714B6041K36074a33747B7597d4902E7851
11368B19283b38121L572b546k1818p3947G5309a22596q9667B3831M3670j2223
11357E5278P2875D6813d15451a81917F6447i3538B86781I8870a20810E1722a7907
11345A24705i5487j6910I0757b3629j03656O2039k30420j08214F9197R1485g8009
11333A15986h0227p9444A97109a92375A29829b51392A55858d5009A58138a59205
11322b9624l26047c5650B0568M7482c2911j76318a680A51864a7564p1961B23603
11310c95536D5490m037j3960K12641N243h7321n8851n6641e2262B24979r4120
11299A30859I345c15363G3465a93059g2491n2634j21312A34004a73075o5451I2061
$$ plain form
11380 131645 13685 -53692 -24667 -39251 238714 26041 262115 -133747 27597 -44902 57851
11368 219283 -238121 -234549 -2546 -24364 -98311 75309 -122596 -212263 23831 67501 55278
11357 55278 128153 46813 -415451 -181917 66447 -93538 286781 98870 -120810 51722 -17907
11345 124705 -95487 -112397 90757 -23629 -127285 -65246 -295666 -403880 69197 160682 -78009
11333 115986 -80227 -159671 197109 -192375 129829 -251392 155858 -45009 158138 -159205
11322 -29624 -355671 -35650 20568 68050 -32911 -209229 -1680 151864 -17564 -89525 223603
11310 -395536 45490 41453 27493 240134 245377 -87321 -146172 -202813 -52262 224979 130859
11299 130859 9345 -315363 73465 -193059 -72491 -125125 -246437 134004 -173075 -238526 92061
11287f4149A31537h4308p0716K8342r7075L3420Q7080B61240O2607b3433D6786
11275I272K09998j07522a14195B65670a58538O5738j68105g7791o515j67326B47933
11263c46352F8027f3733k19615B22230J48287a31454e8971j37457j60242a36206
11252a19833N4291j85111B14968J55715G8585a29985j51658A62663o8676a45495
11241b46794L1289J8926R6504H0201i4536L60A49242a55386A31713M5146a05603
11229c33651M5295g4005j21953j34559B1671J05065m8858J04002b45194C56091
11218b68043g3260k28718G4140J5642a23761A21562a3575r4082k12014g2589F7042
11206b3104q2743A21455b60125c0690j68224n8388j24536a88683B83965a18714
$$ plain form
11287 -64149 131537 -84308 -155024 -126682 -223757 -190337 -103257 261240 323847 -23433 46786
11275 9272 219270 111748 -114195 265670 -158538 -92800 -260905 -77791 -84306 -251632 247933
11263 -346352 68027 -63733 -283348 222230 370517 -131454 -58971 -196428 -356670 -136206
11252 -119833 -65542 -250653 214968 370683 78585 -129985 -281643 162663 93987 -145495
11241 -246794 -215505 -196579 -100075 80201 -94536 -94176 149242 -155386 131713 176859 -105603
11229 -333651 -288356 -74005 -195958 -330517 21671 126736 77878 181880 -245194 356091
11218 -268043 -73260 -301978 74140 89782 -123761 121562 -13575 -107657 -319671 -72589 67042
11206 -23104 -105847 121455 -260125 -30690 -198914 -257302 -381838 -188683 283965 -118714
11195a96583h0819C05382a97440B04133H4587C2400b54611g0174B77806B7010
11184a04738A46556i1215C0476a03708j35017M6118A045L71627h9773k14749e6768
11172a77016b970k0424o7225A07153a34292j3931b153A39320R3507c80597P099
11161c73498f9686m062b8206d16j89723A38912K04863A5981K4982b36552K1687
11150b14865G2764c36279I8346K17905D9254J6870j1285g7246K3108a7818B11585
11138e7324j63146b6794r6829B7047m461J47451l7184d0965j11395B41380j6499
11127B24881n5015R3340F9485b3049B72681a81664a9130B17042j00031Q737K03852
11116C29600j10165g5381j45257M1459B05186R3407j23409b95187I1114A4235
$$ plain form
11195 -196583 -80819 305382 -197440 204133 84587 32400 -254611 -70174 277806 27010
11184 -104738 146556 -91215 30476 -103708 -238725 -192607 1045 372672 -89773 -304522 -56768
11172 -177016 -2970 -23394 -90619 107153 -134292 -148223 -2153 139320 232827 -380597 -373498
11161 -373498 -69686 -73748 -28206 -416 -190139 138912 343775 15981 40963 -236552 -214865
11150 -214865 72764 -336279 98346 316251 49254 66124 54839 -77246 -54138 -17818 211585
11138 -57324 -220470 -26794 -123623 27047 22586 170037 132853 -40965 -152360 241380 224881
11127 224881 169866 263206 69485 -23049 272681 -181664 -19130 217042 117011 125748 329600
11116 329600 219435 -75381 -220638 -179179 205186 298593 175184 -295187 91114 14235
11105B96453a71092h243E25169A89424o3399K30986J59934H9007b5751D4400O8555
11094A12955a8026j27301B8288J55583K14718a17933C52728h3187l3559C42032
11083g0640E2458J34316K71030a58055B52673K55241B21989G9421K606K58290
11073C40317o7225J79808k25852c4030D22213K38589C4185M09663N7464Q2615
11063E83927i7974D36949O591J11078q4040K56426k28278p4055K46140J14768
11053G85579j86234M493K90331j20692J89939l31239Q5401k84052M11835j98770
11043F46591B94019N98193k8109K8107B92261K89926J1437J03280K95076l25814
11033F66166L24808k38899k52349J34757j58285L46935J99222l73970J36316k35627
$$ plain form
11105 296453 -171092 -8243 525169 189424 126025 357011 516945 89007 -25751 44400 112955
11094 112955 -18026 -145327 28288 183871 398589 -117933 352728 -83187 -116746 342032
11083 -70640 52458 186774 457804 -158055 252673 507914 221989 79421 82027 340317
11073 340317 273092 452900 227048 -34030 422213 660802 34185 443848 501312 583927
11063 583927 -97974 436949 443540 554618 470578 727004 498726 424671 670811 785579
11053 785579 599345 603838 894169 773477 963416 632177 717578 433526 845361 646591
11043 646591 294019 892212 864103 892210 292261 582187 593624 696904 991980 666166
11033 666166 990974 752075 499726 634483 476198 823133 1022355 648385 784701 549074
11023E49074J57304C50833l7443K13450k3594J9761j73449m0463M08055F2043
11012E80641J03575K08975l86899J82803j12388n1140p3843r4193P0885p688R8313
11001E19041j2169K7668p0680Q2738j78718J45822K6013r0554M05195j52476j75944
10990E25936L37418L70575m13207J51711Q6673l07617m7995J84747L34484J58717
10980A381442k42298J59019J14702K80746P4814O02704J08476K50149K67K25542
10970B955563m30708m4047n44200r7104q0073k48640L03469n36995N5506J48216
10960A480987k07055q1296j6731M21903k7443q9289j79532J03908m65384k47201
10950F92867k38612M5573o914j25096E0011i4809A00155P1545L9816a2388A63842
$$ plain form
11023 549074 706378 350833 313390 526840 503246 523007 349558 309095 717150 62043
11012 580641 684216 893191 506292 689095 576707 525567 451724 357531 428416 420728 519041
11001 519041 506872 534540 463860 546598 367880 513702 539715 449161 854356 701880 525936
10990 525936 863354 1233929 820722 972433 1059106 751489 703494 888241 1222725 1381442
10980 1381442 1139144 1298163 1412865 1693611 1768425 2371129 2479605 2729754 2730021 2955563
10970 2955563 2524855 2480808 1936608 1839504 1759431 1510791 1814260 1277265 1332771 1480987
10960 1480987 1273932 1192636 1175905 1597808 1570365 1481076 1301544 1405452 940068 692867
10950 692867 454255 499828 492914 367818 50011 -94809 100155 171700 211516 -12388 163842
10938A74943p9046l2244J06289M1722d6617B3374b18665g6849j6175q6552A6227
10926b0092j80126A14869h3754A86403g0491G4066B5153h3147b6642j74463C50378
10914a26223k06753L7541M3628A48104F3122K25335c50390A30676K94195A57678
10903A38827f6290j87505R6212A59590E2978p518c12784j28664h2071A4425c2782
10891h9147A86748g5002J8817j7126G359d326j36385A6833a8811A31078b9445
10879b82958Q0344f9759A22610P6890F399h3506c1459r395q7658n783C23946J6882
10867C40828c04090J13667A32964K19816a92675f3395D3404K00672b1273I0481
10856B1476d4999b2389k31459A51862d32583B93649a27255j58549i9788m4132
$$ plain form
10938 174943 95897 63653 169942 211664 -46617 23374 -218665 -76849 -93024 -179576 16227
10926 -20092 -200218 114869 -83754 186403 -70491 74066 25153 -83147 -26642 -201105 350378
10914 -126223 -332976 -295435 -251807 148104 63122 288457 -350390 130676 424871 157678
10903 138827 -66290 -253795 -157583 159590 52978 45460 -312784 -441448 -82071 14425 -32782
10891 -89147 186748 -75002 -56185 -73311 7359 -4326 -140711 16833 -18811 131078 -29445
10879 -282958 -202614 -69759 122610 199500 6399 -83506 -31459 -40854 -128512 -134295 323946 340828
10867 340828 -304090 -190423 132964 352780 -192675 -63395 43404 244076 -21273 90481
10856 21476 -44999 -22389 -253848 151862 -432583 293649 -127255 -285804 -99788 -143920
10846a43920b3519m08865c1611l2390A29827J2066i4582M0290B91787a32567A98461
10834D561b6085B33060O3655I6298a66188B77515E3492J37507n3759d9083A63682
10822A74670H3983k8359a38275A49938l330d4207A1841a86743d8321j60585B54816
10810b23469j17805K3333B8698b06445g4532m3680A57148O255h5917p7058A27434
10798d4942A9884a2367j89678C1693d80657a78991b054A78082L2784a13491j25916
10787b39407q0676Q8987D3865P3197e9402o5808B92551c05791I0304a11337d9717
10775b33941J12052D6274a13165B07582b64160A62459J16500b880G8055J008J45487
10764B24550i2646E8800A2811M37843a27352A08299c12808a25508A73365b4050
$$ plain form
10846 -143920 -23519 -432384 -31611 -64001 129827 141893 -94582 -54292 291787 -132567 198461
10834 4561 -26085 233060 296715 96298 -166188 277515 53492 190999 137240 -49083 163682
10822 174670 83983 55624 -138275 149938 146608 -44207 11841 -186743 -48321 -208906 254816
10810 -223469 -341274 -317941 28698 -206445 -74532 -118212 157148 163403 -85917 -162975 127434
10798 -44942 19884 -12367 -202045 31693 -480657 -178991 -2054 178082 210866 -113491 -239407
10787 -239407 -320083 -231096 43865 117062 -59402 -125210 292551 -305791 90304 -111337 -49717
10775 -233941 -121889 46274 -113165 207582 -264160 162459 278959 -2880 78055 79063 224550
10764 224550 -92646 58800 12811 450654 -127352 108299 -312808 -125508 173365 -24050
10753C44341A2683K37660m6236A8982i5856j39019A56209m0234D4493a7532p40
10742a8272o4929C7596b18981f918H9141a82694a6795j86773j60024A81795c78681
10730b20371C38767f5533F0066e9913l69835J10575A21441N357I296a99890B2144
10718A67678g6101j12287k8296a28k16404B26913B2654g010M83B11393i9792r6544
10706a96336A1614a68964A22162o733g4094K030K3584G3336J10684J1346k0070
10695A75296d882o6933H2129b5529C6846a27719q2049d2619B1375c82608J74830
10684b07778A4039J39546b66718m3152c235I867c65684A29947M448a17919A74231
10672b82010j11352a18273r5507n47B14240D7236b63544j22696D9949b03318I4482
$$ plain form
10753 344341 12683 250343 204107 18982 -95856 -234875 156209 115975 44493 -17532 -18272
10742 -18272 -83201 37596 -218981 -6918 89141 -182694 -16795 -203568 -363592 181795 -378681
10730 -220371 338767 -65533 60066 -59913 -429748 -319173 121441 126798 9296 -199890 22144
10718 167678 -76101 -188388 -216684 -128 -216532 226913 22654 -7010 -6527 211393 -99792 -196336
10706 -196336 11614 -168964 122162 115429 -74094 -72064 -48480 73336 184020 195366 175296
10695 175296 -4882 -71815 82129 -25529 36846 -127719 -209768 -42619 21375 -382608 -207778
10684 -207778 14039 153585 -266718 -309870 -3235 9867 -365684 129947 134395 -117919 174231
10672 -282010 -393362 -118273 -213780 -214327 214240 47236 -263544 -386240 49949 -203318 94482
10660A31957N3322D5151A9479b06873b4130j61465P1193r5815E9637b68785j19642
10649c88427A72718a16591k31313a10498A37922a07969a2562A78923a40442C78573
10638f5300m73791a3317j678C1857M1550g9960F9340j3526a63870C7390O9378
10627A06768l9571B3079M17931A1451B865a19889B11991a05840B53403a86249
10616B45869o3790B748e4235C9448a2768A3238K03237A0506f980B37644a44048
10604i3226k05813A87910b09296a805B59528p9449D9226a46656B44231a82286
10593a0586A1269b67672a33104N1426B41918I6737a96616j46932e1347j01902
10583a53249f1954j92437B76842a91504G3240L733a82362C17082a76099B6591
$$ plain form
10660 131957 185279 45151 19479 -206873 -24130 -185595 -114402 -210217 59637 -268785 -388427
10649 -388427 172718 -116591 -347904 -110498 137922 -107969 -12562 178923 -140442 378573
10638 -65300 -539091 -13317 -14995 31857 73407 -79960 69340 55814 -163870 37390 106768
10627 106768 67197 23079 441010 11451 2865 -119889 211991 -105840 253403 -186249
10616 245869 182079 2748 -54235 39448 -12768 13238 216475 10506 -6980 237644 -144048
10604 -93226 -299039 187910 -209296 -1805 259528 180079 49226 -146656 244231 -182286
10593 -10586 11269 -267672 -133104 -81678 241918 96737 -196616 -343548 -51347 -153249
10583 -153249 -61954 -254391 276842 -191504 73240 76973 -182362 317082 -176099 26591
10572A77568n2317a13979K6658K5113j26728j96667a23773F7324b59892O9105
10562a90787i0806j24428J7936p3008B06223J8483c26344b6692A61279L9105i9951
10550A27090a43973j2780A12836a58490C07528b70951Q0536N1289j55666I7795
10539B11417a68488A21919b86725J888J38839c6550j868J7268n5442j08068e0504
10527a08325k4645f1634k6335j49146J01618j45238D6363J78820b49404J08824
10517a40580C9093b6656H0618a97987A32758a78821q59j4263O0690A11629a54308
10505h8574a3706A88590D6713a98389O4362A33153a91282A9020J1948j4134c3287
10493e80856A28156b89438I1705D136a38943A35664a06408B16682e7889A10039
$$ plain form
10572 177568 125251 -113979 -87321 -62208 -188936 -385603 -123773 67324 -259892 -190787
10562 -190787 -90806 -215234 -197298 -270306 206223 224706 -326344 -26692 161279 200384 -99951
10550 127090 -143973 -156753 112836 -158490 307528 -270951 -190415 -139126 -294792 97795
10539 211417 -168488 121919 -286725 -284837 -145998 -36550 -38418 -21150 -76592 -184660 -50504
10527 -108325 -132970 -61634 -87969 -237115 -135497 -280735 46363 225183 -249404 -140580
10517 -140580 39093 -26656 80618 -197987 132758 -178821 -179680 -193943 -133253 111629 -154308
10505 -88574 -13706 188590 46713 -198389 -134027 133153 -191282 19020 30968 16834 -33287
10493 -580856 128156 -289438 91705 4136 -138943 135664 -106408 216682 -57889 110039
10482g3907B13826L78484o6105k56795K2492c0585E2464i9543A31972J49305a77035
10470B20051h5413A6744a86609C13182b52551J15988b7317l87182J71520D2354
10459A44725D4512L2038g5313A12530J40832a9406j3622j27296n4861f0204C87732
10447d9449A70102E4152P4558e7352l08129E55002k19073r4644O0827A19093c3659
10435a72048A29126b32249j48929A39979J77554c0391o5186p7333e6238B03718
10424a88300G2580M7429C9881a17854j00540d3929p065A53817m1991c8144m9886
10413h8030q8158O9410a9860Q105E6152a06486J6273I881f4326E87011B55677
10401A8969b77338A4495K57198g6973K2036a7384j68472A73238F1155J49435D1366
$$ plain form
10482 -73907 213826 592310 526205 269410 291902 -30585 52464 -99543 131972 281277 -177035
10470 220051 -85413 16744 -186609 313182 -252551 -136563 -27317 -414499 -242979 42354
10459 144725 44512 76550 -75313 112530 253362 -19406 -33028 -160324 -215185 -60204 387732
10447 -49449 170102 54152 128710 -57352 -365481 555002 335929 241285 302112 119093 -33659
10435 -172048 129126 -232249 -381178 139979 317533 -30391 -95577 -172910 -56238 203718
10424 -188300 72580 120009 39881 -117854 -218394 -43929 -50994 153817 111826 -38144 -88030
10413 -88030 -176188 -106778 -19860 -11755 56152 -106486 -90213 9881 -64326 587011 255677
10401 18969 -277338 14495 271693 -76973 -54937 -17384 -185856 173238 61155 210590 41366
10389h2928B34741o7553P3838j19133f4915A7204b27403B96283r5007b2736p341
10378c0077C04624a69530C59847k8045q4109R5286o5032j31165J93626J23730
10368D64138r2964M8811O6850Q027E0929L20534j23687N6045A32102b8521A48645
10356A45037J53072r2351l0377R9936K85422K20552A90615N20188j93550q4496
10346D32757B13134K46419l9826A59420F2677a88537H1647Q2075h8145I8720K2103
10335A20823b0486B7589K81032B289b22237R9740m9305A16357j3759o882c2163
10323a0601B03617b3489C05499q8814P8084c46924a9940A14152J97587B8625a62684
10311d1154l5219A56589d7280n8331G8378L07824b46780j0801J11893E897Q4113
$$ plain form
10389 -82928 234741 167188 241026 121893 -64915 17204 -227403 296283 201276 -22736 -30077
10378 -30077 304624 -169530 359847 331802 247693 342979 277947 146782 340408 464138
10368 464138 371174 419985 486835 494862 50929 371463 247776 303821 132102 -28521 148645
10356 145037 298109 205758 175381 275317 560739 781291 190615 710803 517253 432757
10346 432757 213134 459553 419727 159420 62677 -188537 81647 163722 -88145 98720 120823
10335 120823 -20486 27589 308621 2289 -222237 -122497 -171802 116357 102598 95716 -32163
10323 -10601 203617 -23489 305499 216685 294769 -346924 -19940 114152 311739 28625 -162684
10311 -41154 -76373 156589 -47280 -105611 78378 386202 -246780 -257581 -145688 5897 90010
10300I0010g6788L6023p9971n6643m9042J02191B4156J55980a91884H6520a31130
10288a9363r270l39020A36338E5109J04877g1303j5028K3067I0489j7417b89797
10276f2759j25497N1716E6035a82904Q6872k42450d0547B9010J89649a11965A28407
10264A22742c0217C0896L77326F7409a05937C57819H0749J403J8662b8445A75157
10252b33740M9170f1045m2959b2443j75721k9401a00816b4052k0061j51763D6970
10240B88318D4794Q3765R1857b16477d2568p6868n20l0601e7802E3082c4623j76683
10228b11306g3592m6692N0643b9243Q372j67106e9327l2569j02187i0974A57024
10216i6473L1985A39472h7324j62134J6337A93704H2441h25A19391d66673b8196
$$ plain form
10300 90010 -76788 -40765 -120736 -177379 -226421 -124230 24156 180136 -191884 86520 -131130
10288 -19363 -28633 -367653 136338 55109 159986 -71303 -86331 -63264 90489 73072 -289797
10276 -62759 -188256 -136540 56035 -182904 -96032 -338482 -40547 29010 218659 -111965 128407
10264 122742 -30217 30896 408222 67409 -105937 357819 80749 82152 100814 -28445 175157
10252 -233740 -184570 -61045 -104004 -22443 -198164 -227565 -100816 -24052 -44113 -195876 46970
10240 288318 44794 128559 220416 -216477 -42568 -119436 -119956 -150557 -57802 53082 -34623 -211306
10228 -211306 -73592 -120284 -69641 -29243 -20871 -187977 -59327 -91896 -194083 -90974 157024
10216 -96473 -64488 139472 -87324 -249458 -233121 193704 82441 -825 119391 -466673 -28196
10204b39806f3264k7075L6317l96767B13797b5512o2245k17680J31524C2154L845
10193C5999b17224Q1269J0281n9625o6573B59500b05166f4998B83366a23740G6312
10181b1847A77469k1751k6047a70450f2005e362q2002p5074A89460a34754F1825
10169H9850a17214K9252r9900A15431G683d2232A9660i5592k69201A53169J15906
10158B69075G1378b8980l09845a16202p1791e5074B50236b38156a04686p3578
10148a78264E7109a0931j68183f1365K169A59800C4372J19049g6398A44629a09073
10136b70556e2178j61396C40082a763G0365b29633h1093c2040I3589a52824C7108
10124a99958n4626I2461M9645d3417C103J88740b46587B108d4378l5045k32430
$$ plain form
10204 -239806 -63264 -90339 -54022 -450789 213797 -25512 -87757 -305437 -173913 32154 35999
10193 35999 -217224 -135955 -125674 -185299 -251872 259500 -205166 -64998 283366 -123740 76312
10181 -21847 177469 155718 129671 -170450 -62005 -5362 -87364 -162438 189460 -134754 61825
10169 89850 -117214 -87962 -187862 115431 7683 -42232 19660 -95592 -364793 153169 269075
10158 269075 71378 -28980 -338825 -116202 -187993 -55074 250236 -238156 -104686 -178264
10148 -178264 57109 -10931 -179114 -61365 -59196 159800 34372 153421 -76398 144629 -109073
10136 -270556 -52178 -213574 340082 -1763 70365 -229633 -81093 -32040 93589 -152824 37108
10124 -199958 -254584 92461 142106 -43417 3103 191843 -246587 2108 -44378 -79423 -311853
10113c11853a03351F8835c26045h3896m9036d4899B44847I5482q501c12729K7122
10102b85607F002J38899P1512a78553j00985I7865a36144K1391R231o2494c4553
10090b99668I9080r232g4637l30466F7722g0302A14365a82033D1689b83118J40831
10079a42287A2847J4732d29503a98904d9765k69632B1249M3398B1002A567a68557
10067A12325J23871a42724b9218A96861a76639L3691c8122B0868k483J72573k3391
10056A67567a23416G7965e3112c772j293j82287C5815K5404b08942A07143c5944
10044d7422j15376k3949B35916c66397g9825R525A0899f6451A18254b28287H6360
10032E427g7439r8692m8795C11708c03956E5883a06039l69757P2023J40155n5785
$$ plain form
10113 -311853 -103351 68835 -326045 -83896 -132932 -44899 244847 95482 86981 -312729 -285607
10102 -285607 6002 144901 216413 -178553 -279538 97865 -136144 -114753 -105522 -168016 -34553
10090 -299668 99080 89848 -74637 -405103 67722 -70302 114365 -182033 41689 -283118 -142287
10079 -142287 12847 27579 -429503 -198904 -49765 -319397 21249 64647 21002 1567 -168557
10067 112325 236196 -142724 -29218 196861 -176639 -142948 -38122 20868 18385 190958 167567
10056 167567 -123416 77965 -53112 -3772 -5065 -187352 35815 61219 -208942 107143 -35944
10044 -47422 -162798 -186747 235916 -366397 -79825 -70300 10899 -66451 118254 -228287 86360
10032 5427 -77439 -176131 -224926 311708 -303956 55883 -106039 -475796 -403773 -263618 -319403
10021c19403B40022J46514b43799L0375c4805j91749a10892k8170J613A6515M5303
10010F1818i5421G1404j923c3773A08333d0670j7922q0503k59491J95194e629
9998A28479a09464F9784d7888C02745j16589m4997d76528A41751e6484J2804o6411
9987a10091D04715A14456j2165g460j05092j70849e6562l4203p1772Q0065l81074
9976d63546A14447a92413k2362K2572Q5048A34326b21209A8665O0590K11770d70300
9964b53389o6977g9436b8205j47381A06031b6337l10014J04553G1452b13086p98
9953b13884d2291k31034B04073e3074l76956A62422k9362g0884l1949H9895b22241
9941b4843E5330g662G0884b52937a06199J3261o0511a5110B87256c63364d849
$$ plain form
10021 -319403 240022 386536 -243799 -213424 -34805 -226554 -110892 -139062 -137449 16515 61818
10010 61818 -95421 71404 69481 -33773 108333 -40670 -58592 -139095 -398586 -203392 -5629
9998 128479 -109464 69784 -47888 302745 186156 141159 -476528 141751 -56484 -43680 -110091
9987 -110091 404715 114456 102291 -7460 -112552 -283401 -56562 -90765 -162537 -82472 -463546
9976 -463546 114447 -192413 -214775 -192203 -107155 134326 -221209 18665 79255 291025 -470300
9964 -253389 -320366 -79436 -28205 -175586 106031 -26337 -336351 -231798 71452 -213086 -213884
9953 -213884 -42291 -273325 204073 -53074 -430030 162422 133060 -70884 -102833 89895 -222241
9941 -24843 55330 -7662 70884 -252937 -106199 -92938 -153449 -15110 287256 -363364 -4849
9929h8017L6556m642A78485p503n2271B007a70192j4143H3837d3039a4937p9966
9917i4903l42717A84823a0079l24783B7627H759a02864L3770J4051E0243d51883
9905I5229a2795E0299c04157A81951C406a45126N0548n9189F2174a04110A10180
9893b69633a5660j26250L4480P054F0846N6086a48190j97850A66782a63160e8883
9881A66117g889j5115H5552h227B76665B5728Q7407a49937q7348m0796D9990j8447
9869C1543a8849l0025C0057f935j1271A38797b29631j01391c108A93270C2370
9857b56153j5533a27035a4015l31462a05555N40n6019j3065p7915E726J24724
9846A30450b1610C60818B5771h3888c6106k8458j77225m9807H5026l2453d26098
$$ plain form
9929 -88017 -51461 -56103 178485 170982 118711 2007 -170192 -184335 83837 -43039 -14937 -94903
9917 -94903 -437620 184823 -10079 -334862 27627 8759 -102864 -69094 -55043 50243 -451883
9905 95229 -12795 50299 -304157 181951 3406 -145126 -94578 -153767 62174 -104110 110180
9893 -269633 -15660 -141910 -107430 -100376 60846 116932 -148190 -346040 166782 -163160 -58883
9881 166117 -7889 -23004 85552 -8227 276665 25728 113135 -149937 -237285 -278081 49990 31543
9869 31543 -18849 -48874 30057 -6935 -18206 138797 -229631 -331022 -3108 193270 32370
9857 -256153 -271686 -127035 -14015 -345477 -105555 -105015 -161034 -174099 -252014 5726 130450
9846 130450 -21610 360818 25771 -83888 -36106 -64564 -241789 -291596 85026 52573 -426098
9834b20607J8812Q4080A76890E9478f554p3822B22162n2940K7433r4976J20930
9823B22609a24581g817A56043a7114m4093k38794a0660k01152j43876a07595M7392
9812f0203o9965A76654F5761h4769k5843b2753p4579A65714a43774G9010R047
9801H8057J69470b27084a7313q5666A88456a95269g3042m2690B1111a72358C6915
9789c94039A22430b73419M5377G1918b94702c3860n5473i048p6625d383j20565
9778a24948a0372l32481c351l53747E3329e9358j88608a19060j20261g7281n1107
9767a28388b7165o2405j22313N4247A28307N9617p9932a2125l1205l7330p9625
9756a60285D69627a75463p5093C16907b84922J06055B3183a66565b753m9452D9498
$$ plain form
9834 -220607 -201795 -117715 176890 59478 -6554 -80376 222162 169222 196655 101679 222609
9823 222609 -124581 -7817 156043 -17114 -61207 -300001 -10660 -211812 -355688 -107595 -60203
9812 -60203 -130168 176654 65761 -84769 -110612 -22753 -97332 165714 -143774 79010 88057
9801 88057 257527 -227084 -17313 -102979 188456 -195269 -73042 -115732 21111 -172358 36915
9789 -394039 122430 -273419 -228042 71918 -294702 -33860 -89333 -9048 -85673 -4383 -124948
9778 -124948 -10372 -342853 -3351 -357098 53329 -59358 -247966 -119060 -239321 -77281 -128388
9767 -128388 -27165 -89570 -211883 -157636 128307 187924 107992 -12125 -43330 -80660 -160285
9756 -160285 469627 -175463 -250556 316907 -284922 -178867 23183 -166565 -2753 -52205 49498
9744c7449M545R708j05692B59233a50879j13275a04321E4508j2015c70091E0317
9732c8561B2750a81040A48189f0196A3724L34441a38783E5741a17321p3581B65372
9720F5079d19397b3113j15268m2010f491A98596b64026d7430A1513a61970A12362
9708b19724j79647a5679k5224B8265a98691A2817a45761I2889C5359c15895c6085
9696C13479b85404c7499E9077K2162a24332L3985b6476k68143m0913A54643J09994
9685B64637h5324b722E1983J02421a1932l7690j32143O9513c6636D4163J4272
9674E8435b39649O4425n8690D8911c30486E4692L3679J02848f3047j22669D1268
9662c48433a63270J9876G9436i1439A98073n4892c437l1416k0544p813j88959
$$ plain form
9744 -37449 -32904 -23196 -128888 259233 -150879 -264154 -104321 54508 42493 -370091 50317
9732 -38561 22750 -181040 148189 -60196 13724 348165 -138783 55741 -117321 -190902 265372
9720 65079 -419397 -23113 -138381 -180391 -6491 198596 -264026 -47430 11513 -161970 112362
9708 -219724 -399371 -15679 -40903 28265 -198691 12817 -145761 92889 35359 -315895 -36085
9696 313479 -285404 -37499 59077 81239 -124332 -90347 -26476 -294619 -335532 154643 264637
9685 264637 -85324 -2722 51983 154404 -11932 -49622 -181765 -112252 -36636 44163 58435
9674 58435 -239649 -175224 -233914 48911 -330486 54692 88371 191219 -63047 -185716 41268
9662 -348433 -163270 -143394 79436 -91439 198073 143181 -3437 -34853 -55397 -63210 -252169
9651b52169C121c7118A25174A7556h3093K1910A29816f1085Q203A00870a73404
9639b88501o878M5357A34512F4642d05046P7262A96648c06119a50575j86815E1372
9627a34815d0007B48761e9439k12150A14086d3232j0788m4092B83569F490L01197
9616C07687b61248a12086j62519f2422A47128k0502b40210b7229r6423r9968B59146
9604a5393o2272j10100f1841A15843k128c09047g071A3869b29853j55798G5981
9592E0172b37324P2657A52402C8917a58574E741c35608B13698A06755d198k30623
9581b34821o5214A28662h0686I9864b63304k99131A32476b33812H1140b72711
9570a8726C62536c17845D794J41894a30447d7617C1204b79392c5125D3506L7567
$$ plain form
9651 -252169 3121 -37118 125174 17556 -83093 -61183 129816 -61085 -52882 100870 -173404
9639 -288501 -295379 -250022 134512 64642 -405046 -327784 196648 -306119 -150575 -337390 51372
9627 -134815 -40007 248761 -59439 -271589 114086 -43232 -54020 -98112 283569 6490 307687
9616 307687 -261248 -112086 -274605 -62422 147128 126626 -240210 -27229 -123652 -223620 259146
9604 -15393 -77665 -187765 -61841 115843 113715 -309047 -7071 13869 -229853 -385651 75981
9592 50172 -237324 -164667 152402 38917 -158574 5741 -335608 213698 106755 -4198 -234821
9581 -234821 -300035 128662 -80686 99864 -263304 -562435 132476 -233812 81140 -272711
9570 -18726 362536 -317845 4794 146688 -130447 -47617 31204 -279392 -35125 43506 81073
9559H1073c8764F8183J0781C522K82674q8742b12614j65593k4780G6340c9753
9547B7215K96378a43287I1709a67726f1658K0209l05436f807k06632b2868r8010
9536a20878A15295C4803M0106b74957A30660h157k30379b7940B37675h3104b7719
9524a2423E1559b57697A34444a21946e3227j48113p5425a0265A03786Q8081a39110
9512c12354M9476h0287D5516d0045G691a01608j55445A88303r1488l5161a6091
9500c88726I197b49539c0002l51301A5101J6394O7225C5023d4300l9843e582m73783
9488d79365J88864F1882e6673m5398J8206A26336b5386j74571f2120C7938J75009
9477B12947r1301c3024D5830A8812b14166f8628p7231A59575a21225A2875a53822
$$ plain form
9559 81073 -38764 68183 78964 3522 286196 197454 -212614 -378207 -402987 76340 -39753
9547 27215 323593 -143287 91709 -167726 -61658 -41449 -346885 -6807 -213439 -22868 -120878
9536 -120878 115295 34803 74909 -274957 130660 -8157 -238536 -27940 237675 -83104 -27719
9524 -12423 51559 -257697 134444 -121946 -53227 -201340 -276765 -10265 103786 191867 -139110
9512 -312354 -262878 -80287 45516 -40045 7691 -101608 -257053 188303 96815 61654 -16091
9500 -388726 9197 -249539 -30002 -381303 15101 31495 98720 35023 -44300 -84143 -5582 -479365
9488 -479365 -290501 61882 -56673 -102071 -83865 126336 -25386 -199957 -62120 37938 212947
9477 212947 121646 -33024 45830 18812 -214166 -68628 -145859 159575 -121225 12875 -153822
9465A16270d514A81195h7687A04205R6444f910D0786a89267e9441K5819C7795
9453B88166a7473k67876N911g0554D9906c59561Q5705a6521j30165A34257i0843
9441a7975j41908A73639b47136A32897m8099a0322k26363A5683e2654j18954N3193
9430a18415k1870e8245k81505P0651H6764g3582A22204E6567b4728G4843a86308
9418H4144k7539M9877m4749b51950E4732g4169B90299a22232k14861f4435A05854
9406I7004a8722B62489d7593o1675C8704j6200e5036m16849A0436Q8112c41827
9394B88594C6028a71670B4203a23418r4789B2579J89625c23950a35079e3338q3526
9383a36864B18129H9699b05902d5189A08463A9131P9846b38948m1433f5908K7312
$$ plain form
9465 116270 -4514 181195 -87687 104205 200649 -6910 40786 -189267 -59441 -33622 37795
9453 288166 -17473 -285349 -279438 -70554 49906 -359561 -273856 -16521 -146686 134257 -90843
9441 -17975 -159883 173639 -247136 132897 84798 -10322 -236685 15683 -52654 -171608 -118415
9430 -118415 -140285 -58245 -339750 -269099 86764 -73582 122204 56567 -24728 74843 -186308
9418 84144 56605 106482 61733 -251950 54732 -74169 290299 -122232 -337093 -64435 105854
9406 97004 -18722 262489 -47593 -109268 38704 22504 -55036 -471885 10436 98548 -341827
9394 288594 36028 -171670 24203 -123418 -218207 22579 212204 -323950 -135079 -53338 -136864
9383 -136864 218129 89699 -205902 -45189 108463 19131 98977 -238948 -280381 -65908 -38596
9372c8596j98815F7284h5542m9373d0066j8971j44629A94520g4678b1917G0680
9360B6273L6256a72374B08224f359k9085I2208b99123h8484E3395a27401a8171
9348I055P4565a88207i267F3168a02949k66850f6556l4553q3345C40376A12875
9336a58414D8747K66145a19496A04274c4888I9302b28445D12464c49356D9739
9325C24688a51677a7320K596j39482k79902J10351A04600o6k8682M9975d06808
9313I5296k2458J87452d2819j22045m6332A07764a47008q7692J10654l7693a287
9301a61614j41492A62716C6625b71623A73849p1750h2847k8455e2977l9228C4755
9289a51235e0681G0012d8740A4809K329a1220j3136k83803D1174h7635b7295A80606
$$ plain form
9372 -38596 -237411 67284 -85542 -134915 -40066 -59037 -203666 194520 -74678 -21917 70680
9360 26273 62529 -172374 208224 -6359 -35444 92208 -299123 -88484 53395 -127401 -18171
9348 9055 83620 -188207 -9267 63168 -102949 -369799 -66556 -101109 -184454 340376 112875
9336 -158414 48747 314892 -119496 104274 -34888 99302 -228445 412464 -349356 49739
9325 324688 -151677 -17320 -14724 -154206 -434108 -323757 104600 104534 75852 125827 -406808
9313 95296 72838 260290 -42819 -164864 -211196 107764 -147008 -234700 -124046 -161739 -1287
9301 -161614 -303106 162716 36625 -271623 173849 102099 -82847 -111302 -52977 -92205 34755
9289 -151235 -50681 70012 -48740 14809 17138 -11220 -24356 -308159 41174 -87635 -27295 180606
9276A06601E1932K6237C5597a83891A61493J37108A2794a28644A1877c05711D57300
9264G7210a57544b3131k58914E6965j5281j9201a36274A01998A8997i2166c1427
9252a40289f1450K7972j03525j48963c371A52153a20441G2303a13294A78354C1393
9240A55927a11081o0432I8652a36701m4030j50868D9089b01364h5938l00192b7603
9228f6194k22999d8719j52112j5985a5799l7188J3718F0171b99926A49033f8067
9216D0493b7726j21670k50348A56488d407n0667A67091a36558n0650Q0911A3191
9204G9508d5795k43091J42935k06707J62284I1579d454k21816J10224G9850L35676
9193D15526A18686e1722j86429a17077j69805b4683A42594a32260k57800J92827
$$ plain form
9276 106601 51932 78169 35597 -183891 161493 298601 12794 -128644 11877 -305711 457300
9264 77210 -157544 -23131 -282045 56965 41684 22483 -136274 101998 18997 -92166 -31427
9252 -140289 -61450 -33478 -137003 -285966 -3371 152153 -120441 72303 -113294 178354 31393
9240 155927 -111081 -171513 98652 -136701 -180731 -331599 49089 -201364 -85938 -386130 -27603
9228 -66194 -289193 -48719 -200831 -216816 -15799 -52987 -39269 60171 -299926 149033 -68067
9216 40493 -27726 -149396 -399744 156488 -4407 -55074 167091 -136558 -187208 -106297 13191
9204 79508 -45795 -288886 -145951 -352658 -190374 91579 -4454 -226270 -116046 79850 415526
9193 415526 118686 -51722 -238151 -117077 -286882 -24683 142594 -132260 -390060 -197233
9183a97233A92982D367d59033b02891A00874A5434d9957j0781j72937a01391c7122
9171D8619A6520J40176c44397B2244d5694E8815a3548k04373A43035a55466A07938
9159a17891b9439A16959M9471a84008A47486A1270a9j90407A6942b10342B8498
9147D7506J91519b91888M0812A95032h8538J5415j73642E6815B0887i0616A27856
9135g6983A08376g734k48181F0358J3141d7713H0559K6097a56685k71968A04604
9123a5450m3936D6133F43J79924C5432a54749B4259O7179c16714A54051i2371
9111E722J32192l5355b91534j0338h5561n9217j05849A85227a25665k7655f910
9099g4720o9647d0551a2494r4233j58019a19791A82394a25734q842k42714a06750
$$ plain form
9183 -197233 192982 4367 -459033 -202891 100874 15434 -49957 -60738 -233675 -101391 -37122
9171 48619 16520 156696 -344397 22244 -45694 58815 -13548 -217921 143035 -155466 107938
9159 -117891 -29439 116959 166430 -184008 147486 11270 -19 -190426 16942 -210342 28498
9147 47506 239025 -291888 -251076 195032 -88538 -73123 -246765 56815 20887 -90616 127856
9135 -76983 108376 -7734 -255915 60358 73499 -47713 80559 106656 -156685 -428653 104604
9123 -15450 -59386 46133 643 180567 35432 -154749 24259 91438 -316714 154051 -92371
9111 5722 137914 102559 -291534 -301872 -85561 -144778 -250627 185227 -125665 -153320 -6910
9099 -74720 -144367 -40551 -12494 -106727 -264746 -119791 182394 -125734 -134576 -377290 -106750
9087F2133k0479J35392A191b73829e2087E4652b12181j5997l6810c3413j02080
9076a35493C00510J88643g4598a9948m5249J8893l6828A92361F2319d0664k41567
9065b82231A51007m5197c50795A64963b09036I9977J25352b72596A89747e8600
9054b8262j11704c0525j19314e3426o6911K4951j47012H8304a76301j18797g6294
9042c3409o4918j17437k3586I3217g8455j6260P928j42872k963b1069k31396A28893
9029A00499a958A0642M5137h2420j85445A02735a0821A90101b00024d5172j33862
9018a79034G4421j2491b29551h7316j70818j65810A6203a68804M6878B6981e6024
9006G1132M0996J17336H0942a08985N2911j20018b2133m336H4787a80736c8838
$$ plain form
9087 62133 41654 177046 1191 -273829 -52087 54652 -212181 -228178 -264988 -33413 -135493
9076 -135493 300510 489153 -74598 -19948 -65197 -46304 -83132 192361 62319 -40664 -282231
9065 -282231 151007 105810 -350795 164963 -209036 99977 225329 -272596 189747 -58600
9054 -28262 -139966 -30525 -149839 -53426 -120337 -95386 -242398 88304 -176301 -295098 -76294
9042 -33409 -98327 -215764 -239350 93217 -78455 -94715 -86787 -229659 -232622 -21069 -252465 128893
9029 100499 -1958 10642 55779 -82420 -267865 102735 -10821 190101 -200024 -45172 -179034
9018 -179034 74421 61930 -229551 -87316 -258134 -423944 16203 -168804 -121926 26981 -56024
9006 71132 112128 229464 80942 -108985 -56074 -176092 -22133 -26469 84787 -180736 -38838
8994b88594O5702i7784c771j82738c7263L784j18553K7439A08247a85686r8409
8983b84095i5742l9982D8713b25820B58426b80803b6017A29440b93840A32573
8972A05990J14939C8106A4941a08789j51316f4725j60982A76780L7531e2999H3929
8960a75162j3464f4054j33316h3844a931E279M379g3585C2510a38324C9949j0492
8948B9457a14460c3326r8773A82540b03989G4796b01021J9336O0666d169A40165
8936f1141D7512J37795b4066o569B43897J98666a14776B72842j27580f0590C66090
8924E80908O20650L081364R070921D146895E55969A69642M91687g8614G491a13876
8913A2776c443H592a1510k41190d1567C05854d0351C17645a62851A10638b8553
$$ plain form
8994 -288594 -222892 -97784 -3771 -186509 -37263 -33479 -152032 -124593 108247 -185686 -284095
8983 -284095 -95742 -135724 48713 -225820 258426 -280803 -26017 129440 -293840 132573
8972 105990 220929 38106 14941 -108789 -260105 -64725 -225707 176780 214311 -52999 83929
8960 -175162 -188626 -64054 -197370 -83844 -1931 5279 9658 -73585 32510 -138324 39949 29457
8948 29457 -114460 -33326 -132099 182540 -203989 74796 -201021 -181685 -121019 -4169 140165
8936 -61141 47512 185307 -24066 -30635 243897 442563 -114776 272842 145262 -60590 366090
8924 580908 1201558 4282922 13353843 4146895 555969 169642 661329 -78614 7491 -113876
8913 12776 -3443 8592 -11510 -252700 -41567 305854 -40351 317645 -162851 110638 -28553
8901G5401b90042B8256a05328K8845A72589h3851p6527N5229a7714k16256e0497
8889b15114j54764A00847J27666b36611j812O5140c0886p3023A05457d4450k34050
8878b78500B45870b48404A99233c72835B2844p133Q0217a66643B38332a76113
8867i7970m6659M2503A59085g0322G4343J67165d6330j44842f2247E615h9722
8855C969M2326L14948c04005b7552k9266C04719b3091B57666E2704a41236m3500
$$ plain form
8901 75401 -290042 28256 -105328 -76483 172589 -83851 -160378 -105149 -17714 -233970 -50497
8889 -215114 -369878 100847 228513 -236611 -238423 -173283 -30886 -103909 105457 -44450 -278500
8878 -278500 245870 -248404 199233 -372835 22844 15711 95928 -166643 238332 -176113
8867 -97970 -144629 -102126 159085 -70322 74343 241508 -46330 -191172 -62247 5615 -89722
8855 3969 46295 361243 -304005 -27552 -56818 304719 -23091 257666 52704 -141236 -184736
$$ [...]
##END NTUPLES=NMR SPECTRUM
##END=
