
##TITLE=AC1230_PANAH12123_6524350_Xl2ii3pGXC
##JCAMPDX= 6.0         $$ Bruker NMR JCAMP-DX V2.0
##DATA TYPE= NMR SPECTRUM
##DATA CLASS= NTUPLES
##ORIGIN= BRUKER
##OWNER= Administrator
$$ 1.72 TOPSPIN		Version 2.1
$$ 2012-07-14 20:37:24.000 -0500  Administrator@TOPSPIN
$$ Compression mode = diff/dup
##.OBSERVE FREQUENCY= 400.02188249412
##.OBSERVE NUCLEUS= ^1H
##.ACQUISITION MODE= SIMULTANEOUS (DQD)
##.ACQUISITION SCHEME= undefined
##.AVERAGES= 64
##.DIGITISER RES= 22
##SPECTROMETER/DATA SYSTEM= spect
##.PULSE SEQUENCE= noesygpps1d.comp
##.SOLVENT NAME= COFFEE_meoh
##.SHIFT REFERENCE= INTERNAL, COFFEE_meoh, 1, 14.96074
##AUDIT TRAIL= $$ (NUMBER, WHEN, WHO, WHERE, PROCESS, VERSION, WHAT)
$$ ##TITLE= Audit trail, TOPSPIN		Version 2.1
$$ ##JCAMPDX= 5.01
$$ ##ORIGIN= Bruker BioSpin GmbH
$$ ##OWNER= Administrator
$$ $$ C:\Bruker\TOPSPIN/data/COFFEE/nmr/AC1230_PANAH12123_6524350_Xl2ii3pGXC/12/pdata/1/auditp.txt
$$ ##AUDIT TRAIL=  $$ (NUMBER, WHEN, WHO, WHERE, PROCESS, VERSION, WHAT)
(   1,<2012-07-14 20:37:19.171 -0500>,<Administrator>,<TOPSPIN>,<go>,<TOPSPIN 2.1>,
      <created by zg
	started at 2012-07-14 20:25:48.875 -0500,
	POWCHK enabled, PULCHK disabled,
       configuration hash MD5:
       6B 1B 68 BB D9 2E 58 E2 7F 35 AD 54 07 DF 0E 41
       data hash MD5: 64K
       24 D8 41 B9 BC 34 97 1F 20 43 47 71 A1 1D E6 33>)
(   2,<2012-07-14 20:37:22.203 -0500>,<Administrator>,<TOPSPIN>,<proc1d>,<TOPSPIN 2.1>,
      <Start of raw data processing
       efp LB = 0.3 FT_mod = 6 PKNL = 1 PHC0 = 0 PHC1 = 0 SI = 128K 
       data hash MD5: 128K
       CE 18 AC AA BD 12 CC 7B E6 6F D5 00 C5 CF 1A 80>)
(   3,<2012-07-14 20:37:23.250 -0500>,<Administrator>,<TOPSPIN>,<proc1d>,<TOPSPIN 2.1>,
      <pk PHC0 = 0.9283447 PHC1 = 0 
       data hash MD5: 128K
       FE 09 B2 56 AC 0D 97 77 95 52 12 D2 C1 2B A7 44>)
(   4,<2012-07-14 20:37:23.484 -0500>,<Administrator>,<TOPSPIN>,<proc1d>,<TOPSPIN 2.1>,
      <abs ABSG = 1 
       data hash MD5: 128K
       C1 B5 16 05 0C B4 86 18 B9 CF 9D 82 B0 93 B7 D2>)
(   5,<2012-07-14 20:37:23.562 -0500>,<Administrator>,<TOPSPIN>,<proc1d>,<TOPSPIN 2.1>,
      <abs ABSG = 2 
       data hash MD5: 128K
       2C 62 6C E7 9B 4E 24 79 97 3D EE AF EC 69 D4 4C>)
(   6,<2012-07-14 20:37:23.796 -0500>,<Administrator>,<TOPSPIN>,<proc1d>,<TOPSPIN 2.1>,
      <abs ABSG = 3 
       data hash MD5: 128K
       3C 9E E9 E4 A2 1F 1D 72 D1 20 D0 7D 84 C7 51 0F>)
(   7,<2012-07-14 20:37:23.859 -0500>,<Administrator>,<TOPSPIN>,<proc1d>,<TOPSPIN 2.1>,
      <abs ABSG = 4 
       data hash MD5: 128K
       7D 26 BA 67 0A 96 67 FA BE 29 BD F1 0A E9 28 0F>)
(   8,<2012-07-14 20:37:23.921 -0500>,<Administrator>,<TOPSPIN>,<proc1d>,<TOPSPIN 2.1>,
      <abs ABSG = 5 
       data hash MD5: 128K
       C6 34 D1 49 B0 1B F2 2C 76 7B 0D 92 40 45 05 E5>)
$$ ##END=
$$ 
$$ $$ hash MD5
$$ $$ AE FA C6 9C 21 41 81 32 1A 34 46 AD 19 DD D9 59
##$RELAX= 
##$RELAX= 
##$RELAX= 
##$RELAX= 
##$RELAX= 
##$RELAX= 
##$RELAX= 
##$RELAX= 
$$ Bruker specific parameters
$$ [...]
##$TP07= 0
##$TPNAME0= <>
##$TPNAME1= <>
##$TPNAME2= <>
##$TPNAME3= <>
##$TPNAME4= <>
##$TPNAME5= <>
##$TPNAME6= <>
##$TPNAME7= <>
##$TPOAL= (0..7)
0.5 0.5 0.5 0.5 0.5 0.5 0.5 0.5
##$TPOFFS= (0..7)
0 0 0 0 0 0 0 0
##$TUNHIN= 0
##$TUNHOUT= 0
##$TUNXOUT= 0
##$USERA1= <user>
##$USERA2= <user>
##$USERA3= <user>
##$USERA4= <user>
##$USERA5= <user>
##$V9= 5
##$VALIST= <valist>
##$VCLIST= <CCCCCCCCCCCCCCC>
##$VD= 0
##$VDLIST= <DDDDDDDDDDDDDDD>
##$VPLIST= <PPPPPPPPPPPPPPP>
##$VTLIST= <TTTTTTTTTTTTTTT>
##$WBST= 2048
##$WBSW= 25
##$XGAIN= (0..3)
0 0 0 0
##$XL= 0
##$YL= 0
##$YMAX_a= 10460882
##$YMIN_a= -8205841
##$ZGOPTNS= <>
##$ZL1= 120
##$ZL2= 120
##$ZL3= 120
##$ZL4= 120
##$ABSF1= 14.96074
##$ABSF2= -5.597442
##$ABSG= 5
##$ABSL= 3
##$ALPHA= 0
##$AQORDER= 0
##$ASSFAC= 0
##$ASSFACI= 0
##$ASSFACX= 0
##$ASSWID= 0
##$AUNMP= <proc_prof1d_extract.lims>
##$AXLEFT= 0
##$AXNAME= <>
##$AXNUC= <1H>
##$AXRIGHT= 0
##$AXTYPE= 0
##$AXUNIT= <>
##$AZFE= 0.1
##$AZFW= 0.1
##$BCFW= 0
##$BC_mod= 0
##$BYTORDP= 0
##$COROFFS= 0
##$CY= 15
##$DATMOD= 1
##$DC= 0
##$DFILT= <>
##$DTYPP= 0
##$F1P= 0
##$F2P= 0
##$FCOR= 0.5
##$FTSIZE= 131072
##$FT_mod= 6
##$GAMMA= 0
##$GB= 0
##$INTBC= 1
##$INTSCL= 1
##$ISEN= 128
##$LB= 0.3
##$LEV0= 0
##$LPBIN= 0
##$MAXI= 10000
##$MC2= 0
##$MEAN= 0
##$ME_mod= 0
##$MI= 0
##$NCOEF= 0
##$NC_proc= -2
##$NLEV= 6
##$NOISF1= 0
##$NOISF2= 0
##$NSP= 0
##$NTH_PI= 0
##$NZP= 0
##$OFFSET= 14.96074
##$PC= 1
##$PHC0= 0.9283447
##$PHC1= 0
##$PH_mod= 1
##$PKNL= yes
##$PPARMOD= 0
##$PPDIAG= 0
##$PPIPTYP= 0
##$PPMPNUM= 2147483647
##$PPRESOL= 1
##$PSCAL= 4
##$PSIGN= 0
##$PYNMP= <proc.py>
##$REVERSE= no
##$SF= 400.02000973967
##$SI= 131072
##$SIGF1= 0
##$SIGF2= 0
##$SINO= 400
##$SIOLD= 131072
##$SPECTYP= <>
##$SREGLST= <1H.CDCl3>
##$SSB= 0
##$STSI= 131072
##$STSR= 0
##$SW_p= 8223.68421052631
##$SYMM= 0
##$S_DEV= 0
##$TDeff= 65536
##$TDoff= 0
##$TI= <>
##$TILT= no
##$TM1= 0
##$TM2= 0
##$TOPLEV= 0
##$USERP1= <user>
##$USERP2= <user>
##$USERP3= <user>
##$USERP4= <user>
##$USERP5= <user>
##$WDW= 1
##$XDIM= 131072
##$YMAX_p= 422558512
##$YMIN_p= -11776
##$CURPLOT= <Network HP LaserJet P1505>
##$CURPRIN= <$Network HP LaserJet P1505>
##$DFORMAT= <normdp>
##$LAYOUT= <+/1D_H.xwp>
##$LFORMAT= <normlp>
##$PFORMAT= <normpl>
##$SURQMSG= 1
$$ End of Bruker specific parameters
$$ ---------------------------------
##NTUPLES= NMR SPECTRUM
##VAR_NAME=  FREQUENCY,     SPECTRUM/REAL,   SPECTRUM/IMAG
##SYMBOL=    X,             R,               I
##VAR_TYPE=  INDEPENDENT,   DEPENDENT,       DEPENDENT
##VAR_FORM=  AFFN,          ASDF,            ASDF
##VAR_DIM=   131072,        131072,          131072
##UNITS=     HZ,            ARBITRARY UNITS, ARBITRARY UNITS
##FACTOR=    0.0627417313425164, 1,          1
##FIRST=     8223.62146879497, -4116,        -52599
##LAST=      0,             -2703,           -54291
##MIN=       0,             -11776,          0
##MAX=       8223.62146879497, 422558512,    0
$$ Real data points
##PAGE= N=1
##DATA TABLE= (X++(R..R)), XYDATA
$$ [...]
61791E07676o391n774n125m024k996k733l186l765m056m056l939l886l890l567
61777D50288k563j261o07r88j750k119k066j983k042k261k688l106l017k352j689
61762D19796j344q58R2R11R37N05L83N59N20L23M33P24N63n6m26k78j85o04j224
61743D20771j613j871k318k915l385l579l495l153k623k027j339m11O93J573J810
61728C96118J412Q23N71Q08J252J580J831K207K549K515K300K630L683M541M265
61713D29085L235K737L346M225M177K903J094m23j349j867k272k728l294l936
61699D34933m432m511m235l991l866l459k710k460l355m603m769l806l081l269
61685C82386l427k685j637j249j279q24J87R98J208J099R61Q28O83M58j7o33r19
$$ plain form
61791 507676 501285 495511 490386 486362 483366 480633 477447 473682 469626 465570 461631 457745 453855 450288
61777 450288 447725 446464 445857 444869 443119 441000 438934 436951 434909 432648 429960 426854 423837 421485 419796
61762 419796 418452 417594 417686 418597 419534 420039 420422 420981 421501 421824 422257 422981 423544 423488 423062 422784 422599 421995 420771
61743 420771 419158 417287 414969 412054 408669 405090 401595 398442 395819 393792 392453 392042 392735 394308 396118
61728 396118 397530 398353 398924 399732 400984 402564 404395 406602 409151 411666 413966 416596 420279 424820 429085
61713 429085 432320 435057 438403 442628 446805 449708 450802 450379 449030 447163 444891 442163 438869 434933
61699 434933 430501 425990 421755 417764 413898 410439 407729 405269 401914 397311 392542 388736 385655 382386
61685 382386 378959 376274 374637 373388 372109 371285 371472 372470 373678 374777 375738 376566 377249 377707 377690 377057 376138
61668C76138o51j56K89Q30J453J695J374R54O71J33o79q70K7J045J081M47R9K8
61650C83908l85r14p50O6P07R15J165J605J842J755J656J721J993K649L414L214
61634D04561J472p24j871k113k690l760m256l798l176k868k552k239k427k806
61620C70753k377j193n96j134j604q42P43K093K803K769J641m55k494l654m223
61605C62230m751n096m932m505m199l962l726l770m104m209l922l854m358m819
61591C02023m579l906l346k819k093j513j461j631j608j697k343l164l446l243
61577B65174l151l179k701j523l12K00j00p93j309j243o38pJ15k97p78q30m07
61560B48221l1l43j237j686q84N76J394J271J141J624K219K286J943J495Q85K24
$$ plain form
61668 376138 375487 375331 375620 376450 377903 379598 380972 381926 382597 382730 382051 381181 381208 382253 383334 383781 383880 383908
61650 383908 383523 382609 381859 381925 382632 383547 384712 386317 388159 389914 391570 393291 395284 397933 401347 404561
61634 404561 406033 405309 403438 401325 398635 394875 390619 386821 383645 380777 378225 375986 373559 370753
61620 370753 368376 367183 366587 365453 363849 363007 363750 365843 368646 371415 373056 372601 370107 366453 362230
61605 362230 357479 352383 347451 342946 338747 334785 331059 327289 323185 318976 315054 311200 306842 302023
61591 302023 297444 293538 290192 287373 285280 283767 282306 280675 279067 277370 275027 271863 268417 265174
61577 265174 262023 258844 256143 254620 254308 254508 254408 253615 252306 251063 250425 250418 250533 250236 249458 248628 248221
61560 248221 248190 247847 246610 244924 244040 244616 246010 247281 248422 250046 252265 254551 256494 257989 258874 259098
61544B59098J02P58J601K135K580L020K821J697O10N34R09N15n30q78qJ011J028
61527B77003J66o73r71q81p63q22j012j139j104j014r67r57j090j598k335k595
61511B59248j861n37M57O71L07l10r65j431j559j490j430j266q56m36m15p58r95
61494B46374r01p44p91q49n16K68J005J083M26l19m30Q3N67N95M12M00N05M62
61476B47630L20M40J016J792K265K147J699J461J517J325N75j49j89P5j81p28
61460B61015m78O64J396R02P1M6M91L07n78j223j119o58k34K24Q00J327J662J780
61442B66395J621J181O92L79K08J91O85J907L360M161L955L163K431K100K096
61427B94525K097J921J780J953K146J761Q69L73Q63J862K582K841K833K592K232
$$ plain form
61544 259098 259200 259958 261559 263694 266274 269294 272115 273812 274422 274956 275865 276380 275850 274972 274964 275975 277003
61527 277003 277169 276496 275525 274644 273881 273059 272047 270908 269804 268790 267823 266866 265776 264178 261843 259248
61511 259248 257387 256850 257307 257978 258285 257975 257010 255579 254020 252530 251100 249834 248978 248542 248127 247369 246374
61494 246374 245473 244729 243938 243089 242573 242841 243846 244929 245355 245036 244606 244689 245256 245851 246263 246663 247168 247630
61476 247630 247950 248390 249406 251198 253463 255610 257309 258770 260287 261612 262187 262038 261849 261924 261743 261015
61460 261015 260537 261201 262597 263499 263570 263616 264107 264414 263836 262613 261494 260836 260602 260826 261626 262953 264615 266395
61442 266395 268016 269197 269889 270268 270476 270667 271352 273259 276619 280780 284735 287898 290329 292429 294525
61427 294525 296622 298543 300323 302276 304422 306183 307052 307425 308288 310150 312732 315573 318406 320998 323230
61412C23230K147K317J976O49q95j525j203q10q93j330j927k478k518j897j435
61397C13408k031l251l794l346k866k866k538j165N14J163N47l54o34k63L12P83
61381B93619J122J399J721K166K588K575J747L85m79O0J675K994L001J977Q88
61366C17438K89J66L96Q09J025P58K27o6J16P17J679K883L964M620M961N259N530
61349C50771N740O149P003P958Q303P783O813N973N563N575N700N499M864M190
61335D37884L825L545K981K294J951J959J884J517J073O23j20j354k808l913m272
61320D47069l952l514l458l512k790r93Q90J662J395J257K000L313M609N732O710
61305D56418P438Q002Q834J0149J1411J1776J0961R453P911O479M827K708L82
$$ plain form
61412 323230 325377 327694 329670 330319 329424 327899 326696 325886 324993 323663 321736 319258 316740 314843 313408
61397 313408 311377 308126 304332 300986 298120 295254 292716 291551 292065 293228 293775 293421 292787 292524 292836 293619
61381 293619 294741 296140 297861 300027 302615 305190 306937 307322 306843 306903 308578 311572 314573 316550 317438
61366 317438 317727 317893 318289 319098 320123 320881 321108 321042 321158 321875 323554 326437 330401 335021 339982 345241 350771
61349 350771 356511 362660 369663 377621 385924 393707 400520 406493 412056 417631 423331 428830 433694 437884
61335 437884 441709 445254 448235 450529 452480 454439 456323 457840 458913 459536 459416 458062 455254 451341 447069
61320 447069 443117 439603 436145 432633 429843 428850 429740 431402 432797 434054 436054 439367 443976 449708 456418
61305 456418 463856 471858 480692 490841 502252 514028 524989 534442 542353 548832 553659 556367 556749
61292E56749j676l355m925o454p542p772p276o588o113n888n710n360m822m314
61278D78954l983l615k899j889q98M6J144K284L069L462L782L998L648K671J713
61263D91487J334J490K050L092M362N188N319N284N501N760N865O013O109N569
61249E54423M407L564L507L427K609J608J147P10n50k277l502m143m671m906m457
61234E50896l903m043m394l892k820k480k994l059k023o69L14J260K433L326L621
61219E31573L743M007M161M200M595N337N762N707N832O280O176N153M262M444
61205F01232N012M613L129J595P11L86M78J123K310L811N537P520R593J1495J3160
61190F71705J4623J5654J5865J5078J3457J1342R115P084N329L817K728K415K842
$$ plain form
61292 556749 555073 551718 546793 540339 532797 525025 517749 511161 505048 499160 493450 488090 483268 478954
61278 478954 474971 471356 468457 466568 465670 465716 466860 469144 472213 475675 479457 483455 487103 489774 491487
61263 491487 492821 494311 496361 499453 503815 509003 514322 519606 525107 530867 536732 542745 548854 554423
61249 554423 558830 562394 565901 569328 571937 573545 574692 575402 574852 572575 569073 564930 560259 555353 550896
61234 550896 546993 542950 538556 534664 531844 529364 526370 523311 521288 520619 520933 522193 524626 527952 531573
61219 531573 535316 539323 543484 547684 552279 557616 563378 569085 574917 581197 587373 592526 596788 601232
61205 601232 606244 610857 613986 615581 616292 616678 617156 618279 620589 624400 629937 637457 647050 658545 671705
61190 671705 686328 701982 717847 732925 746382 757724 766839 773923 779252 783069 785797 788212 791054
61177G91054L262K755J091j040k681l495l931m503n086n221m999n145o065p375
61163G48621q551r568j0531j1324j1969j2771j3565j3558j2565j1711j1937j2535
61151F08036j2131j0596q820p034m810k537j321j247j152n16m37k075n109q222
61137E42029j0350j1005j0185q543p057o052m996l422j532K86J849K892L145L057
61123D90116L675N479P848R978J1786J3549J5300J6988J8753K0660K2497K4142
61111F60771K5756K7357K8504K8658K7733K6201K4845K4227K4145K3717K2341
61100I44255K0283J8048J5590J2586R067N144O31m360q919j2299j4889j7373j9493
61087I48271k0727k1610k3085k4920k6121k6572k6801k6466k4732k2153k0416
$$ plain form
61177 791054 794316 797071 798162 797122 794441 790946 787015 782512 777426 772205 767206 762061 755996 748621
61163 748621 740070 730502 719971 708647 696678 683907 670342 656784 644219 632508 620571 608036
61151 608036 595905 585309 576489 569455 564645 562108 560787 559540 558388 557872 557435 555360 550251 542029
61137 542029 531679 520674 510489 501946 494889 488837 483841 480419 478887 479173 481022 483914 487059 490116
61123 490116 493791 499270 507118 517096 528882 542431 557731 574719 593472 614132 636629 660771
61111 660771 686527 713884 742388 771046 798779 824980 849825 874052 898197 921914 944255
61100 944255 964538 982586 998176 1010762 1019829 1024973 1025604 1021244 1012325 1000026 985137 967764 948271
61087 948271 927544 905934 882849 857929 831808 805236 778435 751969 727237 705084 684668
61076F84668j9995j9641j8454j6908j5470j3794j1853j0359r448q251o379m605
61064E29511l501k601j491n50j17Q4K53M02J040K665M445M952M449M776O543Q323
61048E59183R181J0071J1829J3696J4910J6060J7752J9425K0698K2299K4581K6583
61036G66268K7794K9302L1935L4728L6617L8156M0167M2010M2653M2319M1878
61025A173827M1783M2666M5481N0048N4898N9630O5568P3140Q0905Q8625R8904
61014A875475J14257J35060J62178J98379K44758K99209L61672M37736N33848
61005D362572O53135P99381R76847J175693J362802J502057J582497J605986J539708
60996A5560678J309016Q74994L23303j54982l97674l86894k27838l4703J32598
$$ plain form
61076 684668 664673 645032 626578 609670 594200 580406 568553 558194 548746 540495 534116 529511
61064 529511 526010 523409 521918 521368 521251 521335 521588 521990 523030 525695 530140 535092 539541 544317 550860 559183
61048 559183 568364 578435 590264 603960 618870 634930 652682 672107 692805 715104 739685 766268
61036 766268 794062 823364 855299 890027 926644 964800 1004967 1046977 1089630 1131949 1173827
61025 1173827 1215610 1258276 1303757 1353805 1408703 1468333 1533901 1607041 1687946 1776571 1875475
61014 1875475 1989732 2124792 2286970 2485349 2730107 3029316 3390988 3828724 4362572
61005 4362572 5015707 5815088 6791935 7967628 9330430 10832487 12414984 14020970 15560678
60996 15560678 16869694 17744688 18067991 17913009 17515335 17128441 16900603 16865900 16998498
60987A6998498K26152J59408j47284o64567j229379j646537j816084j765526j584420
60978H530261j351800j115401r02719p26984n87100m75066l85571l15880k61043
60969B408697k15419j77502j48748j28566j13866j02415r3392q5460p7258o9183
60959A196888o2265n5904m8829m1539l5547l0920k6730k3336k1996k2452k2970
60948H04400k2609k1663k0136j7575j4437j1927j0313q855p395o650o810p153
60936F48877p233p388p813q158q222q276q507q790r010r041q514p276n903n180
60922E39566n194n486n749n838n487m665l888l541l284k727k225k245k507k552
60908D84178k652l209l637l054j810j200j593j924j256lQ22R12Q42J241K032K503
$$ plain form
60987 16998498 17224650 17384058 17236774 16572207 15342828 13696291 11880207 10114681 8530261
60978 8530261 7178461 6063060 5160341 4433357 3846257 3371191 2985620 2669740 2408697
60969 2408697 2193278 2015776 1867028 1738462 1624596 1522181 1428789 1343329 1266071 1196888
60959 1196888 1134623 1078719 1029890 988351 952804 921884 895154 871818 849822 827370 804400
60948 804400 781791 760128 739992 722417 707980 696053 685740 676885 669490 662840 656030 648877
60936 648877 641644 634256 626443 618285 610063 601787 593280 584490 575480 566439 557925 550649 544746 539566
60922 539566 534372 528886 523137 517299 511812 507147 503259 499718 496434 493707 491482 489237 486730 484178
60908 484178 481526 478317 474680 471626 469816 468616 467023 465099 463843 463840 464662 465574 466416 467657 469689 472192
60892D72192K103J177N58M45K85r3JQ85J673J374K81n88q77q86o26J69J326K435
60874D81834L562M943O221O811O874P138P886Q874J0006J1299J2346J2711J2784
60861E93289J3412J4697J5890J6479J6616J6556J6510J6994J8573K1096K3862
60850G83974K6462K8848L0696L1601L1809L1966L2138L1957L1649L1852L2304
60839A125256L1805K9763K6737K3091J8161J1419L544m324j1737j8680k4892l0106
60827A180037l4489l8095m0387m0972m0411l9636l8870l7818l6546l5396l4168
60816G63249l2205k9363k6290k3683k1735k0315j9157j7790j5845j3640j2015
60805E31211j1302j0870r911q380o841n602m506l441k636k284k187k044j866j825
$$ plain form
60892 472192 474295 475472 476030 476475 476760 476667 476668 477553 479226 480600 480881 480293 479416 478530 477904 478073 479399 481834
60874 481834 485396 490339 496560 503371 510245 517383 525269 534143 544149 555448 567794 580505 593289
60861 593289 606701 621398 637288 653767 670383 686939 703449 720443 739016 760112 783974
60850 783974 810436 839284 869980 901581 933390 965356 997494 1029451 1061100 1092952 1125256
60839 1125256 1157061 1186824 1213561 1236652 1254813 1266232 1269776 1265452 1253715 1235035 1210143 1180037
60827 1180037 1145548 1107453 1067066 1026094 985683 946047 907177 869359 832813 797417 763249
60816 763249 731044 701681 675391 651708 629973 609658 590501 572711 556866 543226 531211
60805 531211 519909 509039 499128 490748 483907 478305 473799 470358 467722 465438 463251 461207 459341 457516
60791D57516j816j516r34n28n95q48r54j136j812k738l119k668k020j880k176
60776D32776k410k432k448k483k378k169k022j857j516j283j682k623l293l236
60762D00944l018l444m457n294n526n407n277n127m800m237l481k740k399k571
60748C43166k694k011n21J014J977K359K282J819J452J923L085L575K327j7j892
60733C57844k610k625k372j773q56K5P47J464J996J844J051L37J15m7o07j307
60717C53226j680j837k174k617k719k441k332k871l893m778n093m981m858m760
60703C06192m224l037j823j425j733j790j139n07p60j627k039j501n89j51l50
60688B83497o71o17k14J08R0p8j2M06J007J651K303K876L214L267L128K916K727
$$ plain form
60791 457516 455700 454184 453250 452722 452127 451279 450325 449189 447377 444639 441520 438852 436832 434952 432776
60776 432776 430366 427934 425486 423003 420625 418456 416434 414577 413061 411778 410096 407473 404180 400944
60762 400944 397926 394482 390025 384731 379205 373798 368521 363394 358594 354357 350876 348136 345737 343166
60748 343166 340472 338461 337940 338954 340931 343290 345572 347391 348843 350766 353851 357426 359753 359736 357844
60733 357844 355234 352609 350237 348464 347608 347633 348380 349844 351840 353684 354735 355072 355187 355140 354533 353226
60717 353226 351546 349709 347535 344918 342199 339758 337426 334555 330662 325884 320791 315810 310952 306192
60703 306192 301968 298931 297108 295683 293950 292160 291021 290514 289754 288127 286088 284587 283998 283847 283497
60688 283497 282826 282209 281995 282103 282193 282115 282103 282509 283516 285167 287470 290346 293560 296827 299955 302871 305598
60671C05598K645K661K682K797L228L796L743K576R21j03j56J96N62J162K140
60656C34448L122L739M041M157M096M052M383M978N190M706L974L482L085K428
60642C89881J541N50p14k281l592m045l831l708m042m509m672m465m105l809l662
60627C44537l592l472l250k921k450j873j422j254j039l40O36J148R57O39O23
60612C26927N06j80j001j125n52j19k81m90k5R86J719J613R39L32O0r0l44o62
60594C28213q80q72m56M19J259J282M45k72p8N97Q54O37M61L23m9k10N60J840
60576C34073K332J818J652K832M643N718N710N255N094N703P117Q579R070Q532
60562D08128P887P508O578M474J807o35l051n832q280r158q080n719l037r40O2
$$ plain form
60671 305598 308243 310904 313586 316383 319611 323407 327150 329726 330647 330544 330388 330584 331146 332308 334448
60656 334448 337570 341309 345350 349507 353603 357655 362038 367016 372206 376912 380886 384368 387453 389881
60642 389881 391422 391972 391258 388977 385385 381340 377509 373801 369759 365250 360578 356113 352008 348199 344537
60627 344537 340945 337473 334223 331302 328852 326979 325557 324303 323264 322924 323560 324708 325665 326304 326927
60612 326927 327433 327253 326252 325127 324575 324456 324175 323685 323660 324646 326365 327978 328917 329249 329309 329219 328875 328213
60594 328213 327333 326461 326005 326424 327683 328965 329410 329138 329060 329657 330511 331148 331609 331932 331883 331673 332233 334073
60576 334073 336405 338223 339875 342707 347350 353068 358778 364033 369127 374830 381947 390526 399596 408128
60562 408128 416015 423523 430101 434575 436382 435747 432696 426864 418584 409426 401346 395627 392590 391650 391712
60547C91712M75J565L716N757O662P042P957R077R346Q883Q761R099Q780P140
60533D85972M799K627Q44o14j721k528l129l306k844k096j669j636j648j724k174
60518D69153k867l265l109k453j231M71J866K129J546J248J772K673L578M763
60504D76274O485Q549J0731J3103J5698J8402K1212K4151K6987K9486L1796L3935
60492G16809L5145L4422L1594K7058K0723J2159J815q913j8910k7745l4789l9045
60480G50323m0290l9423l7317l4048k9725k5254k1660j9113j7121j5236j3263
60469D57873j1223r448q352p842p335o529n677n047m575m157l747l156k383k026
60455C76376k637l580l547k370j349j389j884j933j656j521j313p80n66j336k390
$$ plain form
60547 391712 392187 393752 397468 403225 409887 416929 424886 433963 443309 452192 460953 470052 478832 485972
60533 485972 490771 493398 494242 493628 491907 489379 486250 482944 480100 478004 476335 474699 473051 471327 469153
60518 469153 466286 463021 459912 457459 456228 456699 458565 460694 462240 463488 465260 467933 471511 476274
60504 476274 482759 491308 502039 515142 530840 549242 570454 594605 621592 651078 682874 716809
60492 716809 751954 786376 817970 845028 865751 877910 879725 870812 851902 824157 789368 750323
60480 750323 710033 670610 633293 599245 569520 544266 522606 503493 486372 471136 457873
60469 457873 446650 437202 428850 421008 413673 407144 401467 396420 391845 387688 383941 380785 378402 376376
60455 376376 373739 370159 366612 364242 362893 361504 359620 357687 356031 354510 353197 352417 351851 350515 348125
60440C48125k321r55L41M43k71o79l02L39M34k99j331j813j417o19l1K65N23Q12
60422C41244J013J124J197J088O91L16M43J114J835K134J951J499R84M83k2n04
60406C56590p33l89M88J346J598J215O89N07Q20J437J962J980J466R45R88J492
60390C72401J733J246M69K51Q31J585J847J649J432J340J157R29J054J631K115
60375C91670J978J405J005J050J321J607J899K153K246K192K144K137K065J922
60361D16794J839J856J883J905K060K489L192M017M754N297N781O426P286Q268
60347D73847R351J0384J0757R721P256M167J200j453l686n306o514p825r020r039
60333D83840p520n627m501l804k790j974k303l203l111j848q96j141j824k083
$$ plain form
60440 348125 345804 344849 345190 345633 345362 344683 344381 344720 345154 344855 343524 341711 340294 339675 339644 339909 340432 341244
60422 341244 342257 343381 344578 345666 346357 346673 347116 348230 350065 352199 354150 355649 356633 357116 357094 356590
60406 356590 355857 355468 355956 357302 358900 360115 360804 361311 362131 363568 365530 367510 368976 369921 370909 372401
60390 372401 374134 375380 375849 376100 376931 378516 380363 382012 383444 384784 385941 386870 387924 389555 391670
60375 391670 393648 395053 396058 397108 398429 400036 401935 404088 406334 408526 410670 412807 414872 416794
60361 416794 418633 420489 422372 424277 426337 428826 432018 436035 440789 446086 451867 458293 465579 473847
60347 473847 483198 493582 504339 514060 521316 525483 526683 525230 521544 516238 509724 501899 492879 483840
60333 483840 476320 470693 466192 462388 459598 457624 455321 452118 449007 447159 446263 445122 443298 441215
60319D41215k180k555k791k315j288j37J071K286L155L609M136N017N916O684
60305D61823P851R838J2239J4367J5914J6602J5872J3567J0331O762K714j993
60293E85887o725j0614j3465j5434j6264j5701j4225j2545j0584p915m979k951
60281D54485k252k062j545r00q25j503k404k894k717k138j769k076k827l271l002
60266D22300k515k614l312l720l143k040j564k199l197l484k739j487m95k79q65
60251C88647j632j669p29L71O72J65m07n33j76N43J266J286K99q43r83j53O26
60234C86750R33J337K036K328J807J181J199J547J471R36M86L75M83P58J250J856
60218D06733K408K841L108L162L181L446L850L991L848L912M460N192N788O220
$$ plain form
60319 441215 439035 436480 433689 431374 430086 429949 431020 433306 436461 440070 444206 449223 455139 461823
60305 461823 469674 479512 491751 506118 522032 538634 554506 568073 578404 585166 587880 585887
60293 585887 579162 568548 555083 539649 523385 507684 493459 480914 470330 462415 457436 454485
60281 454485 452233 450171 448626 447726 446901 445398 442994 440100 437383 435245 433476 431400 428573 425302 422300
60266 422300 419785 417171 413859 410139 406996 404956 403392 401193 397996 394512 391773 390286 389791 389512 388647
60251 388647 387015 385346 384617 384988 385660 385825 385418 384885 384709 385252 386518 387804 388103 387260 386277 386124 386750
60234 386750 387683 389020 391056 393384 395191 396372 397571 399118 400589 401525 402011 402386 402869 403627 404877 406733
60218 406733 409141 411982 415090 418252 421433 424879 428729 432720 436568 440480 444940 450132 455920 462140
60204D62140O427O343O363P022P888P732O267M856M793N648O054N529M595L643
60190E45300K604J561P92K26m93j438k386l249m133n037n874o580o950o713o096
60175E01534n880o433p002o590n211l737k785k302k089k128k357k586k655k478
60161D47301k061j626j446j394j014k86J96J35R4O33J380J581J181P57O29P57
60145D46817J196K054L024L560L509L131K742K730L635N553P596Q590Q367P834
60131E10338P778Q026P850O796M990L004J506Q24P26P01M42O3m3M56J406K151
60115E57014K249K084K323K819K749J907J083Q45P62K46n89j439k425l529m080
60100E62019l647k889k753l214l593l726l951m230m147l660l124k702k314j978
$$ plain form
60204 462140 468567 474910 481273 488295 496183 503915 510182 515038 519831 525479 531533 537062 541657 545300
60190 545300 547904 549465 550257 550483 549990 548552 546166 542917 538784 533747 527873 521293 514343 507630 501534
60175 501534 495654 489221 482219 475629 470418 466681 463896 461594 459505 457377 455020 452434 449779 447301
60161 447301 445240 443614 442168 440774 439760 439474 439670 439805 439899 440532 441912 443493 444674 445431 446060 446817
60145 446817 448013 450067 453091 456651 460160 463291 466033 468763 472398 477951 485547 494137 502504 510338
60131 510338 518116 526142 533992 540788 545778 548782 550288 551112 551838 552539 552981 553044 553001 553457 554863 557014
60115 557014 559263 561347 563670 566489 569238 571145 572228 573073 573835 574081 573492 572053 569628 566099 562019
60100 562019 558372 555483 552730 549516 545923 542197 538246 534016 529869 526209 523085 520383 518069 516091
60086E16091j686j192m89p6j14J61J394K939L616L401L259L525L544K911J990
60071E39274J010l59k184l835m765n240n869o882p992q650q360p106n585m627
60057D68830m434m641m889m897m293l024j786j331j420j194m14L36P21J085J746
60042D40395K561L382M342N467O478P121P282O854N994N315N250N261M457K925
60028E13084J666J108N42p90k726m554n745o145o058o309p521r158r894r186p831
60013D40483o789o190n776n518n270m504k944j117J77O23L35m99j487j994j733
59998C97797j139p69o31l60J44O44R27J006J116J607K561L455L568K917K394K733
59982D17970L670M395M502M199L836L516L062K185P80q43k261l415m423n002m650
$$ plain form
60086 516091 514405 513213 512724 512648 512534 512695 514089 517028 520644 524045 527304 530829 534373 537284 539274
60071 539274 540284 539925 537741 533906 529141 523901 518032 511150 503158 494508 486148 479042 473457 468830
60057 468830 464396 459755 454866 449969 445676 442652 440866 439535 438115 436921 436507 436843 437564 438649 440395
60042 440395 442956 446338 450680 456147 462625 469746 477028 483882 489876 495191 500441 505702 510159 513084
60028 513084 514750 515858 516400 515610 512884 508330 502585 496440 490382 484073 476552 467394 457500 448314 440483
60013 440483 433694 427504 421728 416210 410940 406436 403492 402375 402552 403175 403510 403011 401524 399530 397797
59998 397797 396658 395889 395258 394898 395042 395686 396613 397619 398735 400342 402903 406358 409926 412843 415237 417970
59982 417970 421640 426035 430537 434736 438572 442088 445150 447335 448115 447272 445011 441596 437173 432171 427521
59967D27521l518k546k311k282j613l27P83J186J090R47R59J034J003Q03O24P71
59951D24124J263J687J664J366J335J779K236K044J085N8j26P10J724J815P08
59936D43472q45j899k193k184k462l167l935m308m149l633k892j950r66l32k73
59921D08284n38o64m06K47J240K387L347L959M409M852N077M863M473M475N142
59906D51147O220P212P632P249O269N053L547J410j054k707k855k240k057k318
59892D82508k005o72R31J892K088J996K099K625L457M098M130L729L397L255L046
59877E16574K766K812L381M099M339L700K237M23j161k350l366m209m480m166
59863E20599m016m596n357n329m414l234k109r28J97J081K155M046O479Q382R157
$$ plain form
59967 427521 424003 421457 419146 416864 415251 414924 415707 416893 417983 418930 419889 420923 421926 422729 423353 424124
59951 424124 425387 427074 428738 430104 431439 433218 435454 437498 438583 438641 438515 439225 440949 442764 443472
59936 443472 442627 440728 438535 436351 433889 430722 426787 422479 418330 414697 411805 409855 408889 408557 408284
59921 408284 407746 407082 406676 406923 408163 410550 413897 417856 422265 427117 432194 437057 441530 446005 451147
59906 451147 457367 464579 472211 479460 485729 490782 494329 495739 494685 491978 489123 486883 484826 482508
59892 482508 480503 479831 480762 482654 484742 486738 488837 491462 494919 499017 503147 506876 510273 513528 516574
59877 516574 519340 522152 525533 529632 533971 537671 539908 540331 539170 536820 533454 529245 524765 520599
59863 520599 516583 511987 506630 501301 496887 493653 491544 490616 490813 491894 494049 498095 504574 512956 522113
59848E22113R010Q074O123L300M36j664k735k805k129j359j100j310j745k819
59834E31390n043p656q945q202o466m963l798k572j378n11J43P64J119Q65M0j079
59818D83708k236l130l609l956m470m691l859k259j206j275j486q29K74Q03P72
59803D52551J044J775K067J208l61j575j906j823k112k938l740m087m232m488
59789D31383m509l722k310j034k69J37J66l78j217j775k074k580l095k789j565
59774D04369m53k11l89k28K40N77P76J184J937K852L463L125J660m1p10k62J94
59757D18083Jk20K89J350K378L093L267K612J560J394K806M851N935N414L845
59742D56658K249J585K306L845M902M694L584K310J194L56j14m50r66j276o40
$$ plain form
59848 522113 531123 539197 545320 548620 549056 547392 544657 541852 539723 538364 537264 535954 534209 531390
59834 531390 526347 518691 509746 501544 495078 490115 486317 483745 482367 481856 481999 482763 483882 484747 484787 483708
59818 483708 481472 478342 474733 470777 466307 461616 457757 455498 454292 453017 451531 450702 450976 451779 452551
59803 452551 453595 455370 457437 458645 458284 456709 454803 452980 450868 447930 444190 440103 435871 431383
59789 431383 426874 423152 420842 419808 419539 419676 419842 419464 418247 416472 414398 411818 408723 405934 404369
59774 404369 403916 403705 403316 403088 403328 403905 404681 405865 407802 410654 414117 417242 418902 418861 418151 417889 418083
59757 418083 418084 417864 418153 419503 421881 424974 428241 430853 432413 433807 436613 441464 447399 452813 456658
59742 456658 458907 460492 462798 466643 471545 476239 479823 482133 483327 483683 483569 483119 482153 480877 480237
59727D80237N77Q86l29j828k198j559q73m79k53l52q18j084p69l90m64n42qQ27
59709D70581J340J617J969K025J414P29P49J139J002L39r6p8O9L77J117J916K082
59692D88291J715J559J791J855J437P74O1o25r31n78j2P6k09j30N08J129J295
59675D98006J105P16J47m92j112j945l119m171m591m628m798m895m301l155k310
59660D60457k093j972j515r38n33j95L27J117K073K824K871K227J661J767K123
59645D70201K041J758J963K448K265J153j49j119j937k666k834k234j397r02p31
59630D67860n52j76M51J197J577J138R2q62j353j478j263o42j5j31j180k574l761
59613D58328m638n039m527l083j457l93J76P90J535J892J444M67k70l47j83m70
$$ plain form
59727 480237 480814 481700 481371 479543 477345 475786 474913 474434 474181 473829 473011 471927 471158 470768 470304 469762 469754 470581
59709 470581 471921 473538 475507 477532 478946 479675 480424 481563 482565 482904 482808 482730 482799 483176 484293 486209 488291
59692 488291 490006 491565 493356 495211 496648 497422 497483 496858 495927 495349 495337 495413 495204 495074 495582 496711 498006
59675 498006 499111 499827 499974 499482 498370 496425 493306 489135 484544 479916 475118 470223 465922 462767 460457
59660 460457 458364 456392 454877 453939 453406 453211 453538 454655 456728 459552 462423 464650 466311 468078 470201
59645 470201 472242 474000 475963 478411 480676 481829 481680 480561 478624 475958 473124 470890 469493 468591 467860
59630 467860 467308 467132 467583 468780 470357 471495 471587 470725 469372 467894 466631 465989 465974 465843 464663 462089 458328
59613 458328 453690 448651 444124 441041 439584 439191 439367 440157 441692 443584 445028 445495 445225 444878 444695 444225
59597D44225j143j404r22m56p61j411j395n44L61P55P97P60N82J47n05j279j912
59580D35895j925j176l58l32j023j543j431j142j295j987k869l418l168k131j030
59565D11067n69o15n45k69k12l74k64J72L80J38m9J99O19R38J427K292L034L032
59547D20401K438J965J961K203K579L428N036P112R147J1099J3311J5709J7585
59534E13974J8477J8598J7666J3960N999m494j2816j5397j3018r118n873l102
59522E24856l18J918K998L324L730M454N084N116M264K562L81j809l747n380o711
59507E40722p861q974r831r867q944p715o877o340n685m957m445m000l237k281
59493D49708j617j365j216r59n94r9M89Q89R51R33J135J552K223L344M584N001
$$ plain form
59597 444225 443082 441678 440756 440300 439539 438128 436733 436189 436550 437305 438102 438862 439444 439591 439086 437807 435895
59580 435895 433970 432794 432436 432104 431081 429538 428107 426965 425670 423683 420814 417396 414228 412097 411067
59565 411067 410498 409883 409338 409069 408857 408483 408219 408391 408771 408909 408860 409059 409678 410616 412043 414335 417369 420401
59547 420401 422839 424804 426765 428968 431547 434975 440011 447123 456270 467369 480680 496389 513974
59534 513974 532451 551049 568715 582675 588674 584180 571364 555967 542949 533831 527958 524856
59522 524856 524538 526456 529454 532778 536508 540962 546046 551162 555426 557988 558369 556560 552813 547433 540722
59507 540722 532861 523887 514056 504189 495245 487530 480653 474313 468628 463671 459226 455226 451989 449708
59493 449708 448091 446726 445510 444551 443957 443858 444347 445236 446187 447120 448255 449807 452030 455374 459958 464959
59477D64959M319L672M264N742O836P055O828O415N742M992M368L473J894J69
59463E30728q20j116j374j548j060r6N38Q48J784L758O040P857R143J0022J0439
59448E75143J0570J0814J1137J1071J0361R116P230M404O74l568p900j1653j3829
59435F13570j4052j3252j2511j1695j0181q352p136o424n350l951l047k546j368
59422E13705Q59L310N411P498R811J2076J4279J6789J9616K2439K5204K7648K8727
59409G07372K7855K6063K3984J9367R293m871j7406k3798k4139k0550j4301o897
59397G01972j026K047M068O241N747j296j4044k6693l3947l4838l1446k6218k0978
59384E29589j6747j3436j0361p451n358m343l796k940j554lJ057J182P21N96J154
$$ plain form
59477 464959 469278 472950 477214 482956 489792 496847 503675 510090 515832 520824 525192 528665 530559 530728
59463 530728 529908 528792 527418 525870 524810 524714 525252 526100 527884 531642 537682 545539 554682 564704 575143
59448 575143 585713 596527 607664 618735 629096 638212 645442 649846 650520 646952 639052 627399 613570
59435 613570 599518 586266 573755 562060 551879 543527 536391 529967 524617 520666 517619 515073 513705
59422 513705 514564 517874 523285 530783 540594 552670 566949 583738 603354 625793 650997 678645 707372
59409 707372 735227 761290 785274 804641 813934 809063 791657 767859 743720 723170 708869 701972
59397 701972 700946 702993 707061 713302 719049 717753 703709 677016 643069 608231 576785 550567 529589
59384 529589 512842 499406 489045 481594 476236 471893 468097 465157 463603 463600 464657 465839 466560 467156 468310
59369D68310J704J615J263J319J695J904K002K330K758K952L126L757M747N557
59355E05039O074O679P561Q522R392J0250J1237J2384J3584J4626J5488J6502
59343F37338J7850J8940J9015J8318J7804J7598J6642J4303J1290Q552O149L730
59331H07529J228j545n090r235j2798j4907j5970j6724j7133j6990j6684j6465
59319F65216j5772j4207j2470j1301j0267q634o752n384m254k536l98J262K422
59306E76925L946O080Q034R262J0014J0435R877P493L105k530p892j1317j2137
59293F11295j1229j0023r108q193p071n864m532k885j172l0K74J53J86O42J390
59278E53833K044K265K159K269K946L976M978N819O536P176P883Q739R422R563
$$ plain form
59369 468310 470014 471629 472892 474211 475906 477810 479812 482142 484900 487852 490978 494735 499482 505039
59355 505039 511113 517792 525353 533875 543267 553517 564754 577138 590722 605348 620836 637338
59343 637338 655188 674128 693143 711461 729265 746863 763505 777808 789098 797650 803799 807529
59331 807529 808757 807212 802122 792887 780089 765182 749212 732488 715355 698365 681681 665216
59319 665216 649444 635237 622767 611466 601199 592565 585813 580429 576175 573639 573241 574503 576925
59306 576925 580871 586951 594985 604247 614261 624696 634573 642066 645171 642641 634749 623432 611295
59293 611295 600066 590043 580935 572742 565671 559807 555275 552390 551218 551188 551462 551615 551801 552443 553833
59278 553833 555877 558142 560301 562570 565516 569492 574470 580289 586825 594001 601884 610623 620045 629608
59264F29608R439R616R761Q700N997K628k83k555m409n898p389r524j1920j3029
59250F20742j2203j0863j0549j0801j0224q727p199n665l429p59J106J695J715
59237E44839J768J876K281L432M952N732N362M571L987L319K092N09q22j590k009
59222E80299k686m170o235p788q032p566p652q536r106q299o196l797k149j688
59208D96399j926j799p54O16J332J203Q28P14R01J179J220O86k69q90o65pL77
59191D99145L87L49M00O69J546L110M606N282N356N466N538N075M239L742L796
59176E48706L937L817L433K743J837J312J713K704L470L810M182M791N446O116
59162E98017O924P593P636P112O504N888M793K925N68j747l485m261m275m464
$$ plain form
59264 629608 639047 648663 658424 667124 673121 675749 675466 672911 668502 662604 655215 645691 633771 620742
59250 620742 608539 597676 587127 576326 566102 557375 550176 544511 541082 540323 541429 543124 544839
59237 544839 546607 548483 550764 554196 559148 564880 570242 574813 578800 582119 584211 584720 583898 582308 580299
59222 580299 577613 573443 567208 559420 551388 543822 536170 527634 518528 510229 504033 500236 498087 496399
59208 496399 494473 492674 491920 492536 493868 495071 495899 496613 497514 498693 499913 500599 500330 499440 498775 498768 499145
59191 499145 499532 499881 500281 500950 502496 505606 510212 515494 520850 526316 531854 536929 541168 544910 548706
59176 548706 552643 556460 559893 562636 564473 565785 567498 570202 573672 577482 581664 586455 591901 598017
59162 598017 604941 612534 620170 627282 633786 639674 644467 647392 647960 646213 642728 638467 634192 629728
59148F29728n617p424q844r234q712p694o578n700n056m323l487l096l387l696
59134E46880l338k649k409k671k842k579j960j042j4O55Q31J093J847K564K637
59119E37003K486K889L738M437N103O281P790Q854R247R305R045Q246P168O287
59105F27879N464M302L062K309J885J284P38Q29J228R92M7p74j148j588k228k506
59089F41775k225j909j841j692j375j371j890k501k843l031l170l234l565m790
59075F06338o861q765r504q937p694o532n915n678n232m325l427l001k804k453
59061E25210k192k436k955l193l094k890k476j799j388j625j933j560p95m83p12
59046D95679r31r86j001o87J66Q23L65r22j964k357k280j522J27J806K317J807
$$ plain form
59148 629728 624111 616687 607843 598609 589897 582203 575625 569925 564869 560546 557059 553963 550576 546880
59134 546880 543542 540893 538484 535813 532971 530392 528432 527390 527376 528031 528862 529955 531802 534366 537003
59119 537003 539489 542378 546116 550553 555656 561937 569727 578581 587828 597133 606178 614424 621592 627879
59105 627879 633343 637645 640707 643016 644901 646185 646923 647752 648980 649972 650019 649245 648097 646509 644281 641775
59089 641775 639550 637641 635800 634108 632733 631362 629472 626971 624128 621097 617927 614693 611128 606338
59075 606338 599477 590712 581208 572271 564577 558045 552130 546452 541220 536895 533468 530467 527663 525210
59061 525210 523018 520582 517627 514434 511340 508450 505974 504175 502787 501162 499229 497669 496874 496391 495679
59046 495679 494748 493762 492761 492074 492240 493063 493428 492506 490542 488185 485905 484383 484510 486316 488633 490440
59030D90440J432J566J654J695K385L803N229O346P399Q242Q561Q812R682J0700
59016E67946J0874J0559J0895J1525J0679P858M651K422Q37p22j932k492k913
59003F30187l492l609k766j339K24K004L871N188N666N668N401M695L785L170
58989F58653K597J432J24j61M62M98o24j821k440l284m757n627m841l180j957
58974F35074j160q2J269K507L866N708P689R244J0307J0859J0533R461Q720R102
58960G23097J0113J0802J0921J0539R338P141M564K340L52k043n087q417j1350
58947G62310j3185j3729j3712j3996j4398j4049j2939j1924j1182r944q126o722
58935F18404o084n289l965l303m177n535n817n066m391m159l867l241k306r20
$$ plain form
59030 490440 491872 493438 495092 496787 499172 502975 508204 514550 521949 530191 538752 547564 557246 567946
59016 567946 578820 589379 600274 611799 622478 630336 634987 637409 638246 637524 635592 633100 630187
59003 630187 626695 623086 620320 618981 619205 621209 625080 630268 635934 641602 647003 651698 655483 658653
58989 658653 661250 662682 662806 662645 663107 663605 662981 661160 658720 655436 650679 645052 640211 637031 635074
58974 635074 633914 633832 635101 637608 641474 647182 654871 664115 674422 685281 695814 705275 713995 723097
58960 723097 733210 744012 754933 765472 774810 781951 786515 788855 789207 787164 782077 773660 762310
58947 762310 749125 735396 721684 707688 693290 679241 666302 654378 643196 633252 625126 618404
58935 618404 612320 607031 603066 599763 595586 590051 584234 579168 574777 570618 566751 563510 561204 560284
58921E60284P69J801J342j32j334j593j219p50m63l71k39K23J008J896K899M095
58905E68216N120N666O395Q275J0916J2746J3203J3409J4184J4722J4095J2814
58893F99761J1896J1314J0524R786R861J0837J2256J4056J6557J9622K2477K4234
58881H73181K4299K2581J9574J5994J2168Q130M121M14l216p153j1113j4490j7324
58868I27166j9906k1720k1919k0756j9206j7341j4576j1527r786r566r351q404
58856G43108p870q657r956j0773j1345j2054j2345j1723j0645r547q226o870o287
58843F16810o367n879m572l862m451n034m589m239n293o948p613p218o594n691
58829E38460m141k649k185k418k381j940j416o04N72J303J146J050J907L009L349
$$ plain form
58921 560284 561053 562854 564196 564064 562730 561137 559918 559168 558705 558334 558095 558318 559326 561222 564121 568216
58905 568216 573336 579002 585397 593672 604588 617334 630537 643946 658130 672852 686947 699761
58893 699761 711657 722971 733495 743281 753142 763979 776235 790291 806848 826470 848947 873181
58881 873181 897480 920061 939635 955629 967797 975927 980048 980462 977246 970093 958980 944490 927166
58868 927166 907260 885540 863621 842865 823659 806318 791742 780215 770429 760863 751512 743108
58856 743108 735238 726581 716625 705852 694507 682453 670108 658385 647740 638193 629967 623097 616810
58843 616810 610443 604564 599992 596130 591679 586645 582056 577817 572524 565576 557963 550745 544151 538460
58829 538460 534319 531670 529485 527067 524686 522746 521330 520726 521298 522601 523747 524797 526704 529713 533062
58814E33062L385M012M739M570L874L699L823L217J975J154J034J020R38J031
58800E71533R23l9j576k741l192l205k818k102j809k612l948m639m325l368j917
58785E34165o1J564K427K989L939N056N749O265P286Q715R784J0001R243P381
58771F14503M622J638j284m528p992j0573j1651j2027j2468j2387j1029r022p438
58758E20364o261m981l859l347k976k103j013j84P41K138L390L836L893M072L919
58743E17629L107K542L000L756L954M227N371O516O420N670N696O345O318N468
58729E86019M798M639M503M393M643M838M426L866L799L684K786J801J874K683
58715F38752L152L415M266N329N702N919P193R050R656Q490O838N605M286K211
$$ plain form
58814 533062 536447 540459 545198 549768 553642 557341 561164 564381 566356 567510 568544 569564 570502 571533
58800 571533 572456 572417 570841 568100 564908 561703 558885 556783 554974 552362 548414 543775 539450 536082 534165
58785 534165 534104 535668 538095 541084 545023 550079 555828 562093 569379 578094 587878 597879 607122 614503
58771 614503 619125 620763 619479 614951 606959 596386 584735 572708 560240 547853 536824 527802 520364
58758 520364 514103 509122 505263 501916 498940 496837 495824 495640 496381 498519 501909 505745 509638 513710 517629
58743 517629 520736 523278 526278 530034 533988 538215 543586 550102 556522 562192 567888 574233 580551 586019
58729 586019 590817 595456 599959 604352 608995 613833 618259 622125 625924 629608 632394 634195 636069 638752
58715 638752 641904 645319 649585 654914 660616 666535 673728 682778 692434 700924 707762 713367 717653 719864
58701G19864o18l903p103r463j1036j3064j6088j8513j8697j7501j6849j6650
58689E70379j5335j2871j0813r596q163o312n187n170n288m964m604m257l475
58676D74344k605k492k745k060m10Q57J342K186L982N827O962P884R271J1066
58662E13409J2957J4644J5417J4554J2296R426N960J490l376p234r459j0380j0134
58649E59570q716p027o302o520o593o104n589n242m663l818l065k414j737j368
58635D90412j443j196r2J115J634K052L013L554K618J258J240K141K098R06P7
58620E09387J27J30j58N0Q13J361J771K816M296N313N986O968P692P074N621M652
58604E63899L880K080j38q80j34J71o20j226j139j402k277k682k528l168m776
$$ plain form
58701 719864 719246 715343 708240 698777 687741 674677 658589 640076 621379 603878 587029 570379
58689 570379 555044 542173 531360 521764 513601 507289 502102 496932 491644 486680 482076 477819 474344
58676 474344 471739 469247 466502 464442 464032 464889 466231 468417 472399 478226 485188 493072 502343 513409
58662 513409 526366 541010 556427 570981 583277 592703 598663 600153 596777 589543 580084 569704 559570
58649 559570 550854 543827 537525 531005 524412 518308 512719 507477 502814 498996 495931 493517 491780 490412
58635 490412 488969 487773 487681 488796 490430 492482 495495 499049 501667 502925 504165 506306 508404 509310 509387
58620 509387 509514 509644 509486 509536 510349 511710 513481 516297 520593 525906 531892 538860 546552 553626 559247 563899
58604 563899 567779 569859 569721 568841 568707 568878 568258 567032 565893 564491 562214 559532 557004 553836 549060
58589E49060n491m052j394J061K876L960M261M575N953P926Q997R029R291J0061
58575F06113J0204R357Q436P789O821N765N745O841P962Q912J0586J2992J5115
58562G22638J6909J9294K2084K4123K5541K7596K9993L0666K8685K5211K1286
58551I94026J6819J1966P431L123j387n209p105p872r242j0689j0205q225p584
58538I65847r287j1505j3193j5510j8839k1584k2943k3939k4715k3748k0856j8156
58526G41572j6801j5360j2597r343o485l691j160q5l43j90P34Q28k25m83P84J601
58510F78756O68n33o09n66j525k526k410j864j942k343k513k679k748k018p98
58495F54350m05r54j249j205j920k921k247O6J595J366J122J928K686L077M631
$$ plain form
58589 549060 543569 539517 538123 539184 542060 546020 550281 554856 560809 568735 577732 586761 596052 606113
58575 606113 616317 625674 634110 641899 648720 654485 660230 667071 675033 683945 694531 707523 722638
58562 722638 739547 758841 780925 805048 830589 858185 888178 918844 947529 972740 994026
58551 994026 1010845 1022811 1030242 1033365 1031978 1026769 1019664 1011792 1002550 991861 981656 973431 965847
58538 965847 956560 945055 931862 916352 897513 875929 852986 829047 804332 780584 759728 741572
58526 741572 724771 709411 696814 687471 680986 677295 676135 676050 675707 675517 676251 677079 676854 676371 677155 678756
58510 678756 679424 678891 678282 677716 676191 673665 671255 669391 667449 665106 662593 659914 657166 655148 654350
58495 654350 653945 652991 651742 650537 648617 645696 643449 643515 645110 646476 647598 649526 652212 655289 659920
58480F59920P523R530R708J0060J2072J4470J5940J7037J7966J7399J5048J2468
58468H19141J0001N953K01m656p182q893j0727j1237r887q540p857n912k210P04
58454G58899J819L843Q293J2311J3210J2512J2418J1865R300O169M101J647k825
58441H53562p655j0570j2240j4030j4791j3124j0449q616o785l668n50R15J659
58428G53658L031M090L933M289O728R635J0900J1370J2603J3575J2661J0755R374
58415H66602P788M818J456j103l745p160r677r997r668j0222j0437r142p950q340
58401G93223q807p798o628o508n719k911j96L45L10J762L460L715L902N419O260
58386G79829M484K149J771J905L68j121k0K050K022O72O74J604J423Q90K059M202
$$ plain form
58480 659920 667443 676973 686681 696741 708813 723283 739223 756260 774226 791625 806673 819141
58468 819141 829142 835095 835296 830640 823458 814565 803838 792601 782714 774174 766317 760405 758195 758899
58454 758899 760718 764561 772854 785165 798375 810887 823305 835170 844470 850639 854740 856387 853562
58441 853562 845907 835337 823097 809067 794276 781152 770703 762087 755302 751634 751084 751999 753658
58428 753658 756689 760779 764712 769001 775729 785364 796264 807634 820237 833812 846473 857228 866602
58415 866602 874390 879208 880664 879561 875816 868656 858979 848982 839314 829092 818655 809513 801563 793223
58401 793223 784416 776618 769990 763482 757763 754852 754656 755001 755311 757073 760533 764248 768150 773569 779829
58386 779829 784313 786462 788233 790138 790506 789385 789365 791415 793437 794109 794783 796387 797810 798700 800759 804961
58370H04961N328N926P310Q327P662P110Q647J0625J0808J0637J2329J4388J4514
58357I28572J4202J5860J7818J7050J4508J2941J1713Q779N493M394M195K021
58345A057546j140k202j335q39m18J687M534O027O873Q746J0590J0937J1500J4072
58331A126578J6601J6811J6719J8674K0177J8006J4404J3394J3909J2390R497
58320A297160Q078P207M445J587J930M070M532M094N394O966O129N143P711J1807
58306A376253J2887J1843J2770J5146J5443J4437J5610J8163J8746J8142J9295
58295A548735K0786J9429J7073J7516J9062J7760J5458J6681J9966K0542J9386
58284A752394K1086K4828K6148K5702K7530L0487L0310K8395K9592L2971L3833
$$ plain form
58370 804961 810289 816215 823525 831852 839514 846624 855271 865896 876704 887341 899670 914058 928572
58357 928572 942774 958634 976452 993502 1008010 1020951 1032664 1041443 1046936 1051330 1055525 1057546
58345 1057546 1056406 1054204 1052869 1052030 1051612 1053299 1057833 1063860 1070733 1079479 1090069 1101006 1112506 1126578
58331 1126578 1143179 1159990 1176709 1195383 1215560 1233566 1247970 1261364 1275273 1287663 1297160
58320 1297160 1305238 1312445 1316890 1318477 1320407 1324477 1329009 1333103 1338497 1345463 1351592 1356735 1364446 1376253
58306 1376253 1389140 1400983 1413753 1428899 1444342 1458779 1474389 1492552 1511298 1529440 1548735
58295 1548735 1569521 1588950 1606023 1623539 1642601 1660361 1675819 1692500 1712466 1733008 1752394
58284 1752394 1773480 1798308 1824456 1850158 1877688 1908175 1938485 1966880 1996472 2029443 2063276
58273B063276L3086L5424L9915M1750M1611M3870M7361M7678M6656M9577N4841
58262B545045N6658N6056N8684O3688O5628O5471O8463P3090P3670P1906P3976
58251C272335P8204P8033P5189P6977Q2448Q4615Q4704R0132R9834J06010J09153
58240D237634J16672J27654J34269J37386J45317J57732J66598J72458J83539
58231E579259J99403K12043K22332K38388K58751K75073K89980L13441L43021
58222G931691L67795L90104M22184M62936N00898N38674N90051O53977P17273
58213A2575583P82328Q64862R64819J068639J180098J317875J482753J660931
58205B1897888J860794K111352K424730K799983L265129L871832M644728N579758
$$ plain form
58273 2063276 2096362 2131786 2171701 2213451 2255062 2298932 2346293 2393971 2440627 2490204 2545045
58262 2545045 2601703 2657759 2716443 2780131 2845759 2911230 2979693 3052783 3126453 3198359 3272335
58251 3272335 3350539 3428572 3503761 3580738 3663186 3747801 3832505 3922637 4022471 4128481 4237634
58240 4237634 4354306 4481960 4616229 4753615 4898932 5056664 5223262 5395720 5579259
58231 5579259 5778662 5990705 6213037 6451425 6710176 6985249 7275229 7588670 7931691
58222 7931691 8299486 8689590 9111774 9574710 10075608 10614282 11204333 11858310 12575583
58213 12575583 13357911 14222773 15187592 16256231 17436329 18754204 20236957 21897888
58205 21897888 23758682 25870034 28294764 31094747 34359876 38231708 42876436 48456194
58197D8456194O693162Q023459R589778J1412546J3580069J6227636J9439129
58190A33421973K3207500K7415206L1687852L5285062L7371656L7473277L5404914
58183C61267440L0600789K1922527Q767756p463658k3377223l5412923m1797643
58176C14507065m2941182m0428081l5920110l0702693k5632424k1145805j7349039
58169A00387731j4208346j1671665r656188q040680o727689n671152m828239m136171
58161C5447601l553000l073638k687757k361256k072241j827161j627285j452592
58153A6792671j290739j150771j036387r33588q35012p50253o82644o20094n57529
58144H935654n05187m66754m31306l94309l65300l47331l29106l04843k82913
$$ plain form
58197 48456194 55149356 63172815 72762593 84175139 97755208 113982844 133421973
58190 133421973 156629473 184044679 215732531 251017593 288389249 325862526 361267440
58183 361267440 391868229 413790756 422558512 415094854 391717631 356304708 314507065
58176 314507065 271565883 231137802 195217692 164514999 138882575 117736770 100387731
58169 100387731 86179385 74507720 64851532 56810852 50083163 44412011 39583772 35447601
58161 35447601 31894601 28820963 26133206 23771950 21699709 19872548 18245263 16792671
58153 16792671 15501932 14351161 13314774 12381186 11546174 10795921 10113277 9493183 8935654
58144 8935654 8430467 7963713 7532407 7138098 6772798 6425467 6096361 5791518 5508605
58135E508605k67704k51362k30373k12788k02081j90364j74132j60943j54161
58126C664697j46321j33818j23545j18931j13469j03912r6376r3681q9722q1940
58116B562982p6642p6538p5221o9310o4202o2769o0078n4258n1121n2878n3381
58105A866584m9516m6548m7317m6984m3201m0943m2220m1550l6683l3540l5187
58094A402895l5981l2198k8762k9627l0655k7971k4778k4077k2789j8801j6073
58083A111183j7185j8213j6282j4930j6860j8492j6987j5708j7479j9120j7782
58072I22145j6372j7614j8859j7662j6542j7503j7660j4967j2599j3026j3301
58061G46040j0794q215q429r388q647p942q994r582p962o607p597q740p987p146
$$ plain form
58135 5508605 5240901 4989539 4759166 4546378 4344297 4153933 3979801 3818858 3664697
58126 3664697 3518376 3384558 3261013 3142082 3028613 2924701 2828325 2734644 2644922 2562982
58116 2562982 2486340 2409802 2334581 2265271 2201069 2138300 2078222 2023964 1972843 1919965 1866584
58105 1866584 1817068 1770520 1723203 1676219 1633018 1592075 1549855 1508305 1471622 1438082 1402895
58094 1402895 1366914 1334716 1305954 1276327 1245672 1217701 1192923 1168846 1146057 1127256 1111183
58083 1111183 1093998 1075785 1059503 1044573 1027713 1009221 992234 976526 959047 939927 922145
58072 922145 905773 888159 869300 851638 835096 817593 799933 784966 772367 759341 746040
58061 746040 735246 727031 718602 709214 700567 692625 683631 674049 666087 659480 651883 643143 635156 628010
58047F28010p767p906o376n527o501o513m118k384l425m729m265m241o249p651
58033E50358o564n593o839p888o710n805p487r493r307q586r296r700q170o889
58019D42031p680q217o357m334m599n399m579l914n338o545m833j981j048j316
58005C75891o90j13j323k842k287m20P31J437K531K665P49j250j205j89M2J99
57989C73926J185J500O3j149m62L21p11j965j409l99r46j922j527r14j833l116
57973C60642l059k835m002m991l748j690j434k473k582j674r53j20J417K352J573
57958C36423O11J090J752Q97l89m94m33j624k708j978q21j308k381j920o47l64
57942C25706j48J908M782O067O106P007Q682R412R286R726J0513J0418R912J0184
$$ plain form
58047 628010 620243 612337 605961 600434 593933 587420 583302 580918 577493 572764 568499 564258 558009 550358
58033 550358 543794 538201 531362 523474 516764 510959 503472 493979 484672 476086 466790 457090 448920 442031
58019 442031 434351 426134 419777 415443 410844 405445 400866 396952 391614 385069 380236 378255 377207 375891
58005 375891 375201 375088 373765 370923 368636 368216 368947 370384 372915 375580 376329 375079 373874 373685 373727 373926
57989 373926 375111 376611 376674 375525 375063 375384 374673 372708 371299 370900 369954 368032 366505 365591 363758 360642
57973 360642 357583 354748 350746 345755 342007 340317 338883 336410 333828 332154 331201 331081 332498 334850 336423
57958 336423 337034 338124 339876 340773 340384 339890 339457 337833 335125 333147 332326 331018 328637 326717 326070 325706
57942 325706 325558 327466 332248 338315 344421 351428 360110 369522 378808 388534 399047 409465 419377 429561
57928D29561J0397Q872O061L550J166k071n194o546o880q274j0712j2415j2850
57915C94665j2809j2326j1018r676r138q520o778m969m595m875m090k401j021
57902C02449O3J142J036j004l048k930j628j455k204k038r45k01N36K369M327
57887B96469M484L300K821L241L194K796L301M129L341R68r82j784k618l965m884
57872C13811m985m868m664m093l794m568n638n545m421l532l141k707k435k649
57858B56771k362n87J626K565K519K971L906M139L613L200K877K174J710K159
57844B87281K449J164j076k709l655m517m529k917j193j367k683k872j867j429
57830B60080j743j406l62N8j88J53J088J529J760L105N235O418O379O435O823
$$ plain form
57928 429561 439958 448830 454891 458441 459607 457536 452342 445796 438916 430642 419930 407515 394665
57915 394665 381856 369530 358512 348836 339698 331178 324400 319431 314836 309961 305871 303470 302449
57902 302449 302512 303654 304690 303686 300638 297708 296080 294625 292421 290383 289438 289237 289773 292142 296469
57887 296469 300953 304253 307074 310315 313509 316305 319606 323735 327076 328044 327062 325278 322660 318695 313811
57872 313811 308826 303958 299294 295201 291407 286839 281201 275656 271235 267703 264562 261855 259420 256771
57858 256771 254409 253822 255448 258013 260532 263503 267409 271548 275161 278361 281238 283412 285122 287281
57844 287281 289730 290894 289818 287109 283454 278937 274408 271491 270298 268931 266248 263376 261509 260080
57830 260080 258337 256931 256569 256627 256439 256592 257680 259209 260969 264074 269309 275727 282106 288541 295364
57815B95364O373M760K729K17l231o392p248o047n007n019n012m502m275m372
57801B58338l913l108l142l908m062l399k928k688j884j046j568k933l099j773
57787B18887q08j004j069k10P18J259K132L457M284M511N106O032O040N014M345
57772B58694M543M593M141M130M671M425K844J010k75j431k583l096l118l676
57758B74872m696m869m009l517l979m200l383k357j916j696j406j514k030k108
57744B33192j499r22o63l46k95j357l041l637k712j715j626j796j579j367j454
57729B09183j402j138j143j233o29M97J084R40Q56R13M36l36m53j57o24j714k101
57712B02979j677j677k239k210j623j850k909l106j911p74m21J00J008J070J67
$$ plain form
57815 295364 301737 306497 309226 309443 306212 299820 292572 286525 281518 276499 271487 266985 262710 258338
57801 258338 254425 251317 248175 244267 240205 236806 233878 231190 229306 228260 226692 223759 220660 218887
57787 218887 218079 217075 216006 215796 216514 217773 219905 223362 227646 232157 237263 243295 249335 254349 258694
57772 258694 263237 267830 271971 276101 280772 285197 288041 289051 288776 287345 284762 281666 278548 274872
57758 274872 270176 265307 261298 257781 253802 249602 246219 243862 241946 240250 238844 237330 235300 233192
57744 233192 231693 230771 230108 229762 229467 228110 225069 221432 218720 217005 215379 213583 212004 210637 209183
57729 209183 207781 206643 205500 204267 203638 204135 205219 206159 207015 207928 208364 208028 207575 207418 206794 205080 202979
57712 202979 201302 199625 197386 195176 193553 191703 188794 185688 183777 183003 182582 182682 183690 184760 184927
57697A84927k9R56J389M28k94L67J028L32p97j150j300j927k123j131J9M53J175
57680A82323L061M916N442N569O871R172J1630J4760J9375K4760K9953L5638M2664
57667C96134M9639N4042N5084N3344M7983L6450J7407p001l1692n0907o0892o1844
57655D97747n7182n0326m2614l4447k6930k1223j7270j4366j2227j0628q905o831
57643A94798n146m352l796k790j686r96m75O4O3o93j340j166o21k28L19J111J279
57626A74345L94n44o54n62j142j961k196k057k079j963j379r37j227j761j947
57611A54330k168k713k779j800p78q80j574j565p71o9K88O59R79R71P77M70l91
57594A42986j736k451j912j112j116j420j121o30p35r25l34M11N1j104j582j036
$$ plain form
57697 184927 184898 185854 187243 187671 187377 187744 188772 189104 188307 187157 185857 183930 181807 180676 180695 181148 182323
57680 182323 185384 190300 195742 201311 208182 217354 228984 243744 263119 287879 317832 353470 396134
57667 396134 445773 499815 554899 608243 656226 692676 710083 703082 671390 620483 559591 497747
57655 497747 440565 390239 347625 313178 286248 265025 247755 233389 221162 210534 201629 194798
57643 194798 189652 185300 181504 178714 177028 176032 175557 175621 175684 174991 173651 172485 171864 171636 171955 173066 174345
57626 174345 174739 174195 173541 172979 171837 169876 167680 165623 163544 161581 160202 159265 158038 156277 154330
57611 154330 152162 149449 146670 144870 144092 143212 141638 140073 139302 139233 139521 140180 141159 142130 142907 143377 142986
57594 142986 141250 138799 136887 135775 134659 133239 132118 131488 130753 129828 129494 129905 129956 128852 127270 126234
57578A26234n12n36n01l5L50K04k64o91r23q93o75n50n60m05j39l19r68j231o81
57559A16905p1o3j10M70J262J539J481J573J637J442J432J889K182J839J457J560
57543A36424J552R12L59O05R52N26j28p4L45L74L84R86J456P99l64p71o31r79
57525A42727j557j308n63o43j495j695q55j84m51j050j367j585j870k035k204
57510A23865k703l161k889k086j577j502j422j422j872k324k080j590j790k297
57496I5150j863n89N5m51j021q98o20o05l09N08J100R20M61L24M20O21J165J941
57478I6309K231J745J069O90L31l62j190j832k220k239j650o18L19Q97J243J319
57462I6042R62L91K4j78m22l36N64J710J907R82M6j14O0r7n19q26r53r77q69o45
$$ plain form
57578 126234 125722 125186 124685 124650 125000 125204 124940 124249 123326 122433 121758 121208 120648 120243 120104 119785 118817 117586 116905
57559 116905 116834 116771 116661 117131 118393 119932 121413 122986 124623 126065 127497 129386 131568 133407 134864 136424
57543 136424 137976 138888 139247 139852 140804 141330 141202 141128 141473 141847 142231 143217 144673 145472 145108 144337 143706 142727
57525 142727 141170 139862 139299 138656 137161 135466 134611 134427 133976 132926 131559 129974 128104 126069 123865
57510 123865 121162 118001 115112 113026 111449 109947 108525 107103 105231 102907 100827 99237 97447 95150
57496 95150 93287 92698 92753 92302 91281 90383 89763 89158 88849 89357 90457 91377 91838 92162 92582 93203 94368 96309
57478 96309 98540 100285 101354 102044 102375 102013 100823 98991 96771 94532 92882 92264 92583 93480 94723 96042
57462 96042 97004 97395 97419 97241 96819 96483 97047 98757 100664 101646 101692 101578 101638 101541 101022 100196 99243 98266 97397 96752
57442I6752l37K41J130J712J333L33k41j1M45O92R43J306J302N04q10j853j925
57425A01516r21M34J060P12K70M35O98L29k51j44M86P03L62J92L88K72n11j384
57407A04646j587q91L90J418J289J43o42k19L96j23j222j302j73R25J438J904
57391A06390K324J976J015N50Q28R77Q46J403K798L702L350K706K741K882K143
57376A36631O95o23j465j818j548q63n34j021j918k702l224l180k056j57J253
57361A17470J392P81K12k49p40r58o53j33J64J15k66p15m44R98K538K508R66k39
57343A22747j22J97m60j479j611q35K8O27J038J173J111J268J511R66m86j482
57327A24191q80O13J471J276P04K17j80l52j81O2J26J39Q7m27j272j547q73j21
$$ plain form
57442 96752 96415 96656 97786 99498 100831 101164 100923 100912 101357 102049 102992 104298 105600 106104 105294 103441 101516
57425 101516 100595 101029 102089 102801 103071 103506 104204 104533 104282 104138 104624 105327 105689 105881 106269 106541 106030 104646
57407 104646 103059 102168 102558 103976 105265 105408 104766 104547 104943 104820 103598 102296 102123 103048 104486 106390
57391 106390 108714 110690 111705 112255 113083 114060 114906 116309 119107 122809 126159 128865 131606 134488 136631
57376 136631 137326 136703 135238 133420 131872 131009 130475 129454 127536 124834 121610 118430 116374 116217 117470
57361 117470 118862 119643 119855 119606 118866 117908 117255 117122 117286 117401 117135 116420 115976 116974 119512 122020 122986 122747
57343 122747 122625 122822 122362 120883 119272 118437 118465 119092 120130 121303 122414 123682 125193 126159 125673 124191
57327 124191 123311 123924 125395 126671 127375 127592 127412 127060 126879 126941 127067 127206 127293 126866 125594 124047 123174 123053
57309A23053k6n7M01P04Q2p20m60N11P22j38r39j012q68q49m80M17J106J029O53
57290A23129O43Q61P49K40j92j44L76J061J510J573J546J796K191K150J423N80
57274A39492M51J154J889J819J020L92N11J000J156R06O57M73M0o05r68p40m6
57257A48601R22J900K265J566M07l9M58R67R13Q18J186J641J728J736K000K151
57241A69220J782J266J158J269J061N21l1n15r21r62n39j11m2RM56R82J043P57
57223A76403O21P24Q99J294K082K841K934K359J644J098O82M53N87J072J718K293
57207A99704K489K124J643J863K781L339K911K334K673L547L710K898K087K011
57193B36114K452K985L507L862L697L019K418K427L006L740M282M511M573M734
$$ plain form
57309 123053 123027 122970 123371 124075 124157 123437 122977 123488 124210 124072 123133 122121 121253 120404 119924 120341 121447 122476 123129
57290 123129 123772 124633 125382 125622 125430 125286 125662 126723 128233 129806 131352 133148 135339 137489 138912 139492
57274 139492 139943 141097 142986 144805 145825 146217 146728 147728 148884 149790 150447 150920 150960 150355 149387 148647 148601
57257 148601 149523 151423 153688 155254 155661 155622 156080 157047 157960 158778 159964 161605 163333 165069 167069 169220
57241 169220 171002 172268 173426 174695 175756 176277 176246 175731 174810 173848 173309 173198 173156 173165 173621 174603 175646 176403
57223 176403 177024 177748 178647 179941 182023 184864 187798 190157 191801 192899 193581 194034 194621 195693 197411 199704
57207 199704 202193 204317 205960 207823 210604 213943 216854 219188 221861 225408 229118 232016 234103 236114
57193 236114 238566 241551 245058 248920 252617 255636 258054 260481 263487 267227 271509 276020 280593 285327
57179B85327N109N592O198P207Q700J0224J1288J1927J2505J3130J3714J4305
57167D05226J5038J5873J6672J7384J7842J7711J6924J5952J5363J5295J5621
57156E84901J6253J6997J7478J7552J7515J7610J7701J7654J7662J7840J7991
57145G77154J8053J8317J8852J9270J9439J9785K0451K0846K0677K0702K1625
57134I95171K2893K3478K3436K3655K4353K4854K4783K4544K4571K4949K5900
57123A262587K7774L0385L2974L5071L6893L8723M0383M1686M3109M5817N0892
57112A686294N8308O6299P2078P3792P2224P0522P2284P9616R2479J09382J28852
57101B582130J50706J76134K06866K44629K91217L48005M14453M87169N61069
$$ plain form
57179 285327 290436 296028 302226 309433 318133 328357 339645 351572 364077 377207 390921 405226
57167 405226 420264 436137 452809 470193 488035 505746 522670 538622 553985 569280 584901
57156 584901 601154 618151 635629 653181 670696 688306 706007 723661 741323 759163 777154
57145 777154 795207 813524 832376 851646 871085 890870 911321 932167 952844 973546 995171
57134 995171 1018064 1041542 1064978 1088633 1112986 1137840 1162623 1187167 1211738 1236687 1262587
57123 1262587 1290361 1320746 1353720 1388791 1425684 1464407 1504790 1546476 1589585 1635402 1686294
57112 1686294 1744602 1810901 1882979 1956771 2028995 2099517 2171801 2251417 2343896 2453278 2582130
57101 2582130 2732836 2908970 3115836 3360465 3651682 3999687 4414140 4901309 5462378
57092E462378O31696O96496P54313Q04009Q43469Q69388Q77639Q64204Q27719
57083A2631311P74231P20773O90915P00099P40108P76541P63144O62869M62943
57074A8922934J78739j52584m85812p82867j021077j191558j293566j331715j315492
57065A1527002j257343j169697j063981r50859q39096p33895o37561n51613m77182
57056C845775m13919l60215l14625k76188k43693k15878j92213j72396j55311
57047A501337j39693j25452j13179j02520r2379q2451p3220o4531n5578m6333
57037F06001l7671k9854k2099j3887n731J592P777J2896J7116J9898J8725R804
57025E84567p874k9415m6862n5579n6589n3170m7374m0308l3305k7289k2040j7143
$$ plain form
57092 5462378 6094074 6790570 7544883 8348892 9192361 10061749 10939388 11803592 12631311
57083 12631311 13405542 14126315 14817230 15517329 16257437 17033978 17797122 18459991 18922934
57074 18922934 19101673 18949089 18463277 17680410 16659333 15467775 14174209 12842494 11527002
57065 11527002 10269659 9099962 8035981 7085122 6246026 5512131 4874570 4322957 3845775
57056 3845775 3431856 3071641 2757016 2480828 2237135 2021257 1829044 1656648 1501337
57047 1501337 1361644 1236192 1123013 1020493 928114 845663 772443 707912 652334 606001
57037 606001 568330 538476 516377 502490 496759 498351 506128 519024 536140 556038 574763 584567
57025 584567 576693 547278 500416 444837 388248 335078 287704 247396 214091 186802 164762 147619
57013A47619j2846r423o686m606l469k917j999o31J17k84r75j133j082j307j478
56998I8900j243r92j040r48m60k21p19j275q97N15K406M356N989O856P091P505
56982A25823Q404Q960Q334O640M183O28m121q807j1588j1745j0111q094o674n841
56968I5991m624k168R76L206L903M266N666Q025J0437J2548J4520J6207J7231
56955A86184J7425J6543J3938R228K962l774j0045j5012j7858j8396j7274j5178
56943A48743j2361r213o529m524k340P31M196P226R953J3015J6324J9157K1225
56930B05603K2770K3719K3323K0551J4561N249n981j6341k3239k5921k5441k3436
56918A95417k1153j9094j7085j4774j2306j0183q470o739m999l864l494l185k418
$$ plain form
57013 147619 134773 125350 118664 114058 110589 107672 105673 105042 105159 104875 103900 102767 101685 100378 98900
56998 98900 97657 96665 95625 94677 94217 93996 93277 92002 91105 91620 94026 98382 104371 111227 118318 125823
56982 125823 134227 143187 151521 158161 162344 162972 158851 150044 138456 126711 116600 108506 101832 95991
56968 95991 91367 89199 90175 93381 97284 101550 107216 115241 125678 138226 152746 168953 186184
56955 186184 203609 220152 234090 243318 246280 242506 232461 217449 199591 181195 163921 148743
56943 148743 136382 127169 120640 116116 113776 114507 118703 125929 135882 148897 165221 184378 205603
56930 205603 228373 252092 275415 295966 310527 315776 309795 293454 270215 244294 218853 195417
56918 195417 174264 155170 138085 123311 111005 100822 92352 85613 80614 76750 73256 70071 67653
56905F7653j576j111p58j11O87J404K159K912L232L163L538M776O170P074P997
56890A07209R693J1923J4042J6096J8339K0208K0790J9874J7673J3994Q589K062
56878B80492m475j0107j3909j4717j2325q467n425l756k271N2L184O810J0901
56865B25987J5418K0297K5728L1761L7704M2547M5823M7435M6692M2304L3260
56854F14956J9497K199j5842l0791l9834m2793m1324l6909l0337k2511j4517o849
56842C54945O26P956J5104K2481L0675L9686M8981N8108O6532P3108P6541P6023
56830H70766P0634N8395L7411Q491k3774n2878p3331q2714q2163p5182o5272n4276
56818E36107m2855l1770k1834j3048m825L084J0603J8152K6404L5172M3233M9376
$$ plain form
56905 67653 66077 64966 64208 64097 64784 66188 68347 71259 74491 77654 81192 85968 92138 99212 107209
56890 107209 116902 128825 142867 158963 177302 197510 218300 238174 255847 269841 278430 280492
56878 280492 276017 265910 252001 237284 224959 216492 211067 207311 205040 205092 208276 215086 225987
56865 225987 241405 261702 287430 319191 356895 399442 445265 492700 539392 581696 614956
56854 614956 634453 636652 620810 590019 550185 507392 466068 429159 398822 376311 361794 354945
56842 354945 355571 363527 378631 401112 431787 471473 520454 578562 645094 718202 794743 870766
56830 870766 941400 999795 1037206 1045697 1021923 969045 895714 813000 730837 655655 590383 536107
56818 536107 493252 461482 439648 426600 421775 424859 435462 453614 480018 515190 558423 607799
56806F07799N2997N3626N0480M2534K8889R515j3625l6406n4348o4806o7494o3727
56794E45434n5858m6717l8208l0476k3033j6233j0688n853n57N239J0554J5124
56782C48728J9661K4189K7428K8233K6623K2825J6321O533n932j9146l0626l8318
56770D26519m1428m0680l7472l2903k7744k2897j9018j5944j3202j0887r394q551
56758A46399p854p284p040o760n933m850m167l769l157k607k748l149k726j550
56744H2805r00j289j802j691j301j013n24K66P18N15L31P59J372J455J062P03
56728H1466N36L91J86m9k42k25J20N45P24P32P91P40M02J76N17J053J118Q88R86
56709I0855J281J160Q26J016J535J447P51M04N62L19n15r05l80J32r1m60l00N9
$$ plain form
56806 607799 660796 714422 764902 807436 836325 845840 832215 795809 741461 676655 609161 545434
56794 545434 489576 442859 404651 374175 351142 334909 324221 318368 317811 323050 333604 348728
56782 348728 368389 392578 420006 448239 474862 497687 514008 520541 514609 495463 464837 426519
56770 426519 385091 344411 306939 274036 246292 223395 204377 188433 175231 164344 154950 146399
56758 146399 138545 131261 124221 117461 111528 106678 102511 98742 95585 92978 90230 87081 84355 82805
56744 82805 81905 80616 78814 77123 75822 74809 74285 74551 75269 75784 76115 76874 78246 79701 80763 81466
56728 81466 82002 82393 82579 82530 82288 82063 82183 82728 83452 84184 84975 85715 86117 86293 86810 87863 88981 89869 90855
56709 90855 92136 93296 94122 95138 96673 98120 98871 99275 99837 100156 99641 98736 98356 98488 98397 97937 97637 97696
56691I7696J80L55P71Q39K07m55m18J27O55J079J375J209N02l08q97j191q85J72
56673A01013J055O09n62o11O79J394M86n61k67N39M50n6L03J259J562J120P86
56656A09198O68K92J0N87J684K200K035K107K688K994K430J263J6q90j029l35
56640A25918N57R87J075J152R13L6q24o82L67J327J702J748J588J052L80J43L75
56623A37814M74M9p29j514k063k219k070j866j577r58m10r70k738m142l773k300
56607A11008j465j563j319j00J078J015k02j519k079j751r90l58J5M21R11J057
56591A04159P16N32J067J908K269K132K037K074J871J374R37O86M90L71M42N80
56575A23645O51P92R76P70L6m84J1J270K396L036L445L708L701L711M372N881
$$ plain form
56691 97696 97876 98231 99002 99841 100048 99593 99175 99302 99957 101036 102411 103620 104122 103814 102917 101726 100841 101013
56673 101013 102068 102677 102115 101504 102183 103577 104063 103502 103235 103774 104224 104168 104471 105730 107292 108412 109198
56656 109198 109866 110158 110168 110755 112439 114639 116674 118781 121469 124463 126893 128156 128172 127282 126253 125918
56640 125918 126475 127462 128537 129689 130602 130638 129814 129132 129499 130826 132528 134276 135864 136916 137296 137439 137814
56623 137814 138288 138337 137608 136094 134031 131812 129742 127876 126299 125341 124931 123961 121223 117081 113308 111008
56607 111008 109543 107980 106661 106561 107639 108654 108452 106933 104854 103103 102113 101755 101770 102191 103102 104159
56591 104159 104875 105407 106474 108382 110651 112783 114820 116894 118765 120139 121076 121762 122252 122623 123065 123645
56575 123645 124296 125088 126064 126834 126870 126386 126397 127667 130063 133099 136544 140252 143953 147664 152036 157917
56559A57917P730R151R536Q701P082N374L656J389j401l580m102l252k119j373
56545A94709j140j480k203k691k594k292k139j861j300j043j480j963j710j024
56531A69789o57o16n23n68j068j595j581j287j174q80J3P72M66l89n36q6l70j734
56513A57976k931k997k398j994j905j903j865j539n68P79J595J356M83k79n72
56498A43238l86J12M96L03m70j275j471q43J94Q46P30M12O66J250J170L16k89
56481A44999j69q5m73n06L35J011N17l50k02P79J362J190Q30M71J7q0N70J315
56463A51531J344J049J177J372R46M28O80J098M94o58q14O3M46k22q45o34n5M17
56445A57817R00J208Q73K87L79R51Q69on50l10j14m29n65l0O94J194J681K068
$$ plain form
56559 157917 165647 174798 184334 193035 200117 205491 209147 210536 209135 205555 201453 198201 196082 194709
56545 194709 193569 192089 189886 187195 184601 182309 180170 178309 177009 175966 174486 172523 170813 169789
56531 169789 169132 168516 167993 167425 166357 164762 163181 161894 160720 159840 159853 160625 161091 160702 160166 160080 159710 157976
56513 157976 155045 152048 149650 147656 145751 143848 141983 140444 139876 140655 142250 143606 144089 143810 143238
56498 143238 142852 142964 143460 143763 143293 142018 140547 139704 139898 140744 141474 141886 142552 143802 144972 145288 144999
56481 144999 144830 144745 144272 143766 144101 145112 145629 145279 145077 145856 147218 148408 149238 149709 149726 149646 150216 151531
56463 151531 152875 153924 155101 156473 157419 157847 158527 159625 160119 159461 158647 158710 159156 158934 158089 157455 157400 157817
56445 157817 158717 159925 160798 161085 161464 162415 163284 163278 162728 162418 162304 161875 161310 161280 161974 163168 164849 166917
56427A66917J698N06n83q58n36n7L86N10J09l01oP81J252J259J211J021M90L70
56409A74169J468K857K713J016l67l89N5Lk83l31k06K03J189K120J844N55j83
56392A86433L13J042J130Q88O52J22n93p14j42L13M87J189K473L119K479J508
56376B00699J251J549J811J848J486N23m95o10J18P36R50J186J141N0j479j796
56360B08968p10K23L68Q32K057K740K105J279J322J654J493J238J276J036K21
56345B26102m69p51j306k074j700K72K312L078L053K996K548J582J211K027K849
56330B41730K579J928J995K510K779K983L268K881J583N42N68P49J29n88m30P6
56314B65282p1o27q50q14q04m27M51R99Q10P78J545K396K752L287M347M819M026
$$ plain form
56427 166917 168615 169121 168538 167680 167144 167087 167473 167983 168092 167791 167785 168566 169818 171077 172288 173309 173799 174169
56409 174169 175637 178494 181207 182223 181856 181467 181522 181525 181242 180911 180705 180908 182097 184217 186061 186616 186433
56392 186433 186746 187788 188918 189806 190458 190580 189987 189273 189131 189444 189931 191120 193593 196712 199191 200699
56376 200699 201950 203499 205310 207158 208644 209167 208672 208062 208180 208916 209866 211052 212193 212243 210764 208968
56360 208968 208258 208481 208849 209681 211738 214478 216583 217862 219184 220838 222331 223569 224845 225881 226102
56345 226102 225633 224882 223576 221502 219802 220074 222386 225464 228517 231513 234061 235643 236854 238881 241730
56330 241730 244309 246237 248232 250742 253521 256504 259772 262653 264236 264778 265346 266095 266224 265636 265206 265282
56314 265282 265211 264584 263734 262920 262116 261689 262140 263139 263949 264727 266272 268668 271420 274707 279054 283873 287899
56297B87899L187L413L710K757J285Q41J292J533J678K605M021M761M610M243
56283C27835L897L480L457M285N428O077O302O547O674O463O368O848P676Q607
56269D09944R802J0964J1281J0914J1240J2794J4421J5333J6394J8324K0379K2000
56257E83790K4148K7563L1372L4840L8969M4685N0978N6560O1992O8479P5712
56246A099088Q2565Q8869R4993J00603J05183J08681J10585J09679J05700R9699
56236B105645R1762Q0316O4925M7723L0539J2717o467k5374m2050n6663o9768
56225B233305q0119q6552r0367r3457r5545r5574r4163r2359q9449q4390p8141
56214A253189p2295o6777o0952n5523n1102m6590m1227l6520l3813l1700k8445
$$ plain form
56297 287899 291086 294499 298209 300966 302251 303092 304384 305917 307595 310200 314221 318982 323592 327835
56283 327835 331732 335212 338669 342954 348382 354459 360761 367308 373982 380445 386813 393661 401337 409944
56269 409944 419746 430710 441991 452905 464145 476939 491360 506693 523087 541411 561790 583790
56257 583790 607938 635501 666873 701713 740682 785367 836345 892905 954897 1023376 1099088
56246 1099088 1181653 1270522 1365515 1466118 1571301 1679982 1790567 1900246 2005946 2105645
56236 2105645 2197407 2277723 2342648 2390371 2420910 2433627 2427160 2401786 2359736 2303073 2233305
56225 2233305 2153186 2066634 1976267 1882810 1787265 1691691 1597528 1505169 1415720 1331330 1253189
56214 1253189 1180894 1114117 1053165 997642 946540 899950 858723 822203 788390 756690 728245
56203G28245k5081k3325k2204j9745j6564j4618j3768j2545j1019r982q619o070
56191E44705l955m170n392n022l430k945l665l732k941k674k834k117q55m91p63
56176D99719l20N23N68M29J460K796K574J351J160J930K056J734K460L857M343
56161E26640M365N684P900Q965Q675Q622R195R642J0423J2367J4306J4748J5014
56148F56546J7459K1559K5167K8543L3504L9720M5699N2411O1749P2209Q0385
56137A134951Q5998R1158R5307R5513R1357Q4982P6589O4802N1514M1513L6568
56126A950252L4172L2295L0826K8134K1104R821j942j1746k0210k7422l2060l5000
56114A978224l9650m7726n8042o9649q2089r2436r6517r3952q8008q0222o9454
$$ plain form
56203 728245 703164 679839 657635 637890 621326 606708 592940 580395 569376 559394 550775 544705
56191 544705 540750 536580 531188 526166 522736 519791 516126 512394 509453 506779 503945 501828 500973 500482 499719
56176 499719 499399 499922 500490 500919 502379 505175 507749 509100 510260 512190 514246 515980 518440 522297 526640
56161 526640 531005 536689 544589 553554 562229 570851 580046 589688 600111 612478 626784 641532 656546
56148 656546 674005 695564 720731 749274 782778 822498 868197 920608 982357 1054566 1134951
56137 1134951 1220949 1312107 1407414 1502927 1594284 1679266 1755855 1820657 1872171 1913684 1950252
56126 1950252 1984424 2016719 2047545 2075679 2096783 2106604 2104662 2092916 2072706 2045284 2013224 1978224
56114 1978224 1938574 1890848 1832806 1763157 1681068 1588632 1492115 1398163 1310155 1229933 1160479
56103A160479n6562m5191l6905k9784k2864j7633j4365j1079p233m489l122j549
56091I09703J55L57k50P51K865L144J635J483L308M418M175N007P303Q440P813
56076I60307P849R068R181P990Q142J0122J1464J1663J2757J4407J3952J1952
56064A088854J2010J4339J5405J4726J5704J8718J9886J8141J7056J8097J8491
56053A271427J7443J7884K0169K0651J8557J7669J9139J9333J7071J6200J8483
56042A474026K0581K0573K0990K2962K3955K3534K4726K7584K8347K6930K7812
56031A742020L1586L3496L2534L3544L7813M0314L9298L9616M3197M5251M3780
56020B162449M3691M7370N0258N0073N1213N5604N8632N8784O1607O9049P4765
$$ plain form
56103 1160479 1103917 1058726 1021821 992037 969173 951540 937175 926096 918863 914374 911252 909703
56091 909703 909858 910215 909965 910716 913581 916725 918360 919843 923151 927569 931744 936751 944054 952494 960307
56076 960307 968156 977224 986405 994395 1002537 1012659 1024123 1035786 1048543 1062950 1076902 1088854
56064 1088854 1100864 1115203 1130608 1145334 1161038 1179756 1199642 1217783 1234839 1252936 1271427
56053 1271427 1288870 1306754 1326923 1347574 1366131 1383800 1402939 1422272 1439343 1455543 1474026
56042 1474026 1494607 1515180 1536170 1559132 1583087 1606621 1631347 1658931 1687278 1714208 1742020
56031 1742020 1773606 1807102 1839636 1873180 1910993 1951307 1990605 2030221 2073418 2118669 2162449
56020 2162449 2206140 2253510 2303768 2353841 2405054 2460658 2519290 2578074 2639681 2708730 2783495
56009B783495P5448P6889Q2933Q8501Q9752R1254R6576J01610J03765J07913J16567
55998C814703J24197J27879J33294J43475J52496J57155J63825J76413J89107
55989E182544J98428K10584K29022K47119K61281K78479L02557L26555L47178
55980G583747L72578M06851M42028M74942N15737N69464O26413O81903P47510
55971A2421173Q30757R22969J020248J136024J279070J441224J622315J844111
55963B2517891K123904K460864K867095L383708M044531M852644N813894O960768
55955E5025299Q322279R913799J1788493J4055046J6804449K0042416K3673522
55948A59625303K7424978L0730445L2844951L3222549L1651888K7819923K0930440
$$ plain form
56009 2783495 2858943 2935832 3018765 3107266 3197018 3288272 3384848 3486458 3590223 3698136 3814703
55998 3814703 3938900 4066779 4200073 4343548 4496044 4653199 4817024 4993437 5182544
55989 5182544 5380972 5591556 5820578 6067697 6328978 6607457 6910014 7236569 7583747
55980 7583747 7956325 8363176 8805204 9280146 9795883 10365347 10991760 11673663 12421173
55971 12421173 13251930 14174899 15195147 16331171 17610241 19051465 20673780 22517891
55963 22517891 24641795 27102659 29969754 33353462 37397993 42250637 48064531 55025299
55955 55025299 63347578 73261377 85049870 99104916 115909365 135951781 159625303
55948 159625303 187050281 217780726 250625677 283848226 315500114 343320037 364250477
55941C64250477J0292370l405648j7625419k9161868l5970811l7967134l6392334
55934B14019633l2753725k8259326k3737393j9658453j6179069j3282560j0920626
55927F9228481r034329p527788o303972n311164m518687l876724l336181k881662
55919B6437974k510635k201201j928544j691757j496972j331846j180540j046533
55911A3049946r38035q46389p59404o81119o19053n65876n11900m62532m25979
55902G239659l96051l63485l32544l10605k92487k70333k48496k33975k21919
55893D569764k04770j86481j74231j64689j51483j37920j29691j23080j12685
55884C184734j03261j01698j04098j02418r7534r4660r2092q5449p7505p3361
$$ plain form
55941 364250477 374542847 371137199 353511780 324349912 288379101 250411967 214019633
55934 214019633 181265908 153006582 129269189 109610736 93431667 80149107 69228481
55927 69228481 60194152 52666364 46362392 41051228 36532541 32655817 29319636 26437974
55919 26437974 23927339 21726138 19797594 18105837 16608865 15277019 14096479 13049946
55911 13049946 12111911 11265522 10506118 9824999 9205946 8640070 8128170 7665638 7239659
55902 7239659 6843608 6480123 6147579 5836974 5544487 5274154 5025658 4791683 4569764
55893 4569764 4364994 4178513 4004282 3839593 3688110 3550190 3420499 3297419 3184734
55884 3184734 3081473 2979775 2875677 2773259 2675725 2581065 2488973 2403524 2326019 2252658
55874B252658p0954o5864o0478n9251n9999n8615n7228n9198o1195n8688n4206
55863A586982n2048n0033m4552l8557l6309l5241l1190k6812k6590k8166k6867
55852A190617k4301k4430k5386k3396k0796k1946k4861k4797k2798k2897k4046
55841I30963k2571j9721j9258k0138j8861j6541j6690j8248j7587j5236j4256
55830G31856j4118j2424j0446j0881j2242j1349r197q729r208q363p597r344j1696
55817E96262j1390r684r690j0433r206p253p379q304p230n571o244p600o103k952
55803D87223j868k303r74J546J990Q19J393L668M513L448K732K526J233k39M55
55788E06162K582L560L602M420M822K546q72k339l087o920j3435j8242j9439j8874
$$ plain form
55874 2252658 2181704 2115840 2055362 1996111 1936112 1877497 1820269 1761071 1699876 1641188 1586982
55863 1586982 1534934 1484901 1440349 1401792 1365483 1330242 1299052 1272240 1245650 1217484 1190617
55852 1190617 1166316 1141886 1116500 1093104 1072308 1050362 1025501 1000704 977906 955009 930963
55841 930963 908392 888671 869413 849275 830414 813873 797183 778935 761348 746112 731856
55830 731856 717738 705314 694868 683987 671745 660396 651199 642470 633262 624899 617302 607958 596262
55817 596262 584872 575188 565498 555065 545859 538606 531227 522923 515693 510122 503878 496278 490175 487223
55803 487223 485355 483052 482078 483624 485614 486433 487826 491494 496007 499455 502187 504713 505946 505707 506162
55788 506162 508744 512304 515906 520326 525148 527694 526822 524483 521396 514476 501041 482799 463360 444486
55774D44486j7493j4444j0551p971o396l779m07J677K431K929J867k503p932j0280
55760C71634r347q172p450n437k619j522k056j798o82r47k661l796m512o695r453
55745C04487r704p404n749n932o014n159m652m398k801n46l39k250l368k651k210
55730B41310l033l346k164r04n94o65j137k860n067n758m968m632m968m158j925
55715A95131j76L15P86J707K074J843K140K870K813K171K222K592J835M70K21
55700B19014N57p10l414n107n160n319o052n860m558l841m064l680k367j611j784
55685A66044j677j137j159j220K15K419L030K055J840K753K595P91n55n89j032
55670A74373k557l377k617j881k191k342j552q88r23o77R7K00n05n26M67R25L07
$$ plain form
55774 444486 426993 412549 401998 394027 387631 383852 383445 385122 387553 390482 392349 389846 381914 371634
55760 371634 362287 354115 346665 341228 338609 337087 335031 333233 332551 331604 328943 325147 320635 313940 304487
55745 304487 294783 287379 281630 275698 269684 264525 259873 255475 252674 252128 251789 249539 246171 243520 241310
55730 241310 238277 234931 232767 231863 231269 230604 229467 226607 221540 215782 210814 206182 201214 197056 195131
55715 195131 194955 195270 196056 197763 199837 201680 203820 206690 209503 211674 213896 216488 218323 218793 219014
55700 219014 219571 218861 215447 210340 205180 199861 193809 187949 183391 179550 175486 171806 169439 167828 166044
55685 166044 164367 163230 162071 160851 161066 163485 166515 168570 170410 173163 175758 176549 175994 175405 174373
55670 174373 171816 168439 165822 163941 161750 159408 157856 156968 156045 155368 155465 155665 155160 154634 155101 156026 156333
55653A56333J4O74J180J217J910L189L275J765M65L43K78k63j64Q14J184M32j42
55636A72504j62j034l043m433m416m413n139n280m220l357l403l079j751q16j052
55621A26906j173m00N5n05q48k65m9r47j531p37J61k45j357k095k610l029k586
55604A08745j292n77r55j026p3N19k94j386j554j408j762j986j380m73K31J043
55588I6372J624P76j182k016p98O57Q31P00J386J915J178J58L73J632K960M139
55572A10705M943M486K919K094L016M225M081L012K047R54o64k021k537l076m272
55557A29912n127m710l818l496l323k652k074k213k390j929j467j683k000j777
55543I1253j432j314q52M8L53k42m71L02Q37K32m16K3P97R37J024J740K203J509
$$ plain form
55653 156333 156347 157021 158201 159418 161328 164517 167792 169557 170022 170365 170643 170380 170216 171030 172214 172646 172504
55636 172504 172342 171308 168265 163832 159416 155003 149864 144584 140364 137007 133604 130525 128774 127958 126906
55621 126906 125733 125333 125388 124883 124035 123770 123721 122774 121243 120506 120667 120422 119065 116970 114360 111331 108745
55604 108745 107453 106876 105921 104895 104822 105341 105047 103661 102107 100699 98937 96951 95571 95098 95329 96372
55588 96372 97996 98772 97590 95574 94776 95433 96264 96964 98350 100265 101443 101601 101974 103606 106566 110705
55572 110705 115648 120134 123053 125147 128163 132388 136469 139481 141528 142482 141818 139797 137260 134184 129912
55557 129912 124785 120075 116257 112761 109438 106786 104712 102499 100109 98180 96713 95030 93030 91253
55543 91253 89821 88507 87655 87703 88056 87814 87343 87645 88482 88714 88298 88321 89118 90055 91079 92819 95022 96531
55525I6531N03L35O78Q61J303K194K275P79q77j129p22j273k585l309l287l343
55509H8934l536l373l040k955k724j906j019o53m21N4K10k66m15N06J554J448
55493G2398M13m60p44n04K66J064Q93j98q53n79n51j289j384M4J491J330L10k4
55475G1623J30k67q86p50p8L09N05Q59R03L12r2K77N92J96j01L18M72l17q07N9
55455G3257J069Q14J84N23Q58l74k122k088m59M99P4l38k2J95q8k54j16r9M2R10
55435G2465J990K081J180L48p5o25j289j464j159r06p02k23K61L22K17J80k76
55418G2325j238j478j25J686K360K067J822J427K42j008j199q55j146j547p61
55403G2572O71R72K5n63k19L6k09j07O26J089P72J76l18p90r87n50J0o3l80o7
$$ plain form
55525 96531 97034 97369 98047 98908 100211 102405 104680 105459 104582 103453 102731 101458 98873 95564 92277 88934
55509 88934 85398 82025 78985 76030 73306 71400 70381 69728 69307 69361 69571 69305 68890 69396 70950 72398
55493 72398 72811 72351 71607 71103 71369 72433 73326 73128 72275 71696 71145 69856 68472 68516 70007 71337 71647 71623
55475 71623 71753 71486 70600 69850 69772 70081 70586 71445 72348 72660 72568 72845 73437 73633 73532 73850 74322 74005 73198 73257
55455 73257 74326 75140 75324 75847 76705 76331 74209 72121 71662 72161 72235 71897 71875 72070 71982 71728 71612 71513 71555 72465
55435 72465 74455 76536 77716 78064 77989 77364 76075 74611 73452 72546 71844 71621 71882 72204 72421 72601 72325
55418 72325 71087 69609 69484 71170 73530 75597 77419 78846 79088 78080 76881 76026 74880 73333 72572
55403 72572 73243 74215 74240 73677 73458 73494 73285 73178 73804 74893 75665 75841 75523 74733 73746 73196 73206 73143 72763 72696
55383G2696N45M00l75p20n17n77q84o20J36M20J43J92O98P81J53m82p33q79q92
55364F9485m49Q1%m59m77j36j90n56m87r6j88o29m12N58J165P17k63j000j151
55345F5513o34K61P65N75M64J007J381O91m08p75o68q93r95j29R41Q30p5k97J36
55326F7690M2m04Q8J287J585P97M10P92O01n49j181m21O82J047Q92N39k71j220
55308G2406j328o33k58l88M6J120J383K54r21j032o68n10p1R68J720J481Q35L95
55290G4799j63r83j245m56O08J114J166R75L10n45o02L07R85O39p2m22p82j486
55272G4147j853j285l51J43K25K05L7j27K02P97O68l08q79k78N61N28n2k64l2
55253G2084J86L35M86M00L1j90j58l67r01j120p90n18n75m01J16J42o01j031l33
$$ plain form
55383 72696 73241 73641 73266 72546 72029 71452 70568 69948 70084 70504 70647 70839 71537 72318 72471 71989 71256 70377 69485
55364 69485 69036 69117 69117 68658 68181 68045 67855 67299 66812 66716 66528 65899 65487 66045 67210 67927 67664 66664 65513
55345 65513 64879 65140 65905 66480 66944 67951 69332 70023 69615 68840 68172 67279 66284 66155 67096 67926 67851 67554 67690
55326 67690 67732 67328 67416 68703 70288 71085 71495 72287 72888 72339 71158 70737 71419 72466 73358 73897 73626 72406
55308 72406 71078 70445 70187 69799 69845 70965 72348 72602 71681 70649 69981 69471 69400 70368 72088 73569 74404 74799
55290 74799 74636 73653 72408 71952 72560 73674 74840 75815 76125 75580 74978 75285 76270 76909 76837 76415 75633 74147
55272 74147 72294 71009 70658 70801 71026 71231 71268 71141 71343 72140 72808 72500 71621 71343 71904 72432 72380 72116 72084
55253 72084 72270 72605 73091 73491 73522 73332 73174 72807 71906 70786 69996 69478 68903 68502 68618 68760 68159 67128 66795
55234F6795P30J054P85O74P56O59N39O86Q52P53O68Q73J044Q83O11L02m65j670
55216G6529k456k315j833j595j211k41Q14J280J389J603J622R41j01o53m24K27
55200G3576P69O80k58j364j440k76R58J267R30N24p9j009j609j308n71n9M01J109
55182G2241J479Q34l03q16n27j57RL99J125J558J158J76o19p31m06l49q29j153
55164G3089n07P91J557J285O48L60L84N11Q05J039O26m03j182j260j241j629j949
55147G2924j671j178r39n34N65J827K251J759J155Q93P14M03J81K51M07K60k72
55130G8996p25m62M76J104N15r64k125k240j506l70P50J308J051N65N40O63K56
55113G7832k53J10J003R94j61j053q04j32K50O71J242J186L69L6Q62J630J092
$$ plain form
55234 66795 67525 68579 69364 70038 70794 71453 71992 72678 73530 74283 74951 75824 76868 77751 78362 78664 78199 76529
55216 76529 74073 71758 69925 68330 67119 66878 67692 68972 70361 71964 73586 74527 74426 73773 73349 73576
55200 73576 74345 75025 74767 73403 71963 71687 72645 73912 74842 75366 75287 74278 72669 71361 70790 70731 71132 72241
55182 72241 73720 74554 74251 73435 72908 72751 72760 73159 74284 75842 77000 77176 76557 75826 75420 75071 74242 73089
55164 73089 72582 73373 74930 76215 76863 77223 77607 78118 78923 79962 80588 80185 79003 77743 76502 74873 72924
55147 72924 71253 70075 69136 68602 69167 70994 73245 75004 76159 77052 77766 78169 78350 78601 79008 79268 78996
55130 78996 78271 77809 78285 79389 79904 78940 76815 74575 73069 72699 73449 74757 75808 76373 76913 77576 77832
55113 77832 77579 77689 78692 79686 79525 78472 77668 77536 77786 78457 79699 80885 81254 81290 82152 83782 84874
55096H4874k7k66K81L96k60q19n99K78J300J835J414L70l08k57j70n01p29m99
55078H6313m61j101j743j632j127q33m84L32J189J587J870K347K333J221k62r68
55062H8581q04l48K47Q42P20l60j265r26J01O97R92J577J838Q01p79j164k34L63
55044I0879k45j176j478j346j163p23Q9Q63J316J572J536Q53l07j194j453j430
55028H6593j404j211p85l87j28J11K47O5j83O0P95J301J026K09m82n84j15M54
55010H5582N46J47j40J18N78O70L36j52o82j040o78N60J823K143J623J087Q14
54993I3335M34j22m02j97J28J96Rk15k55J8M52O46L95n8l92n50m71m0M94N46J5
54972I3966m52l99j18J7J55L98M29J77J72N82O70m0q28p88j17M55Q50J372J802
$$ plain form
55096 84874 84847 84581 84862 85258 84998 84179 83580 83858 85158 86993 88407 88777 88469 88212 88042 87541 86812 86313
55078 86313 85852 84751 83008 81376 80249 79416 78932 79264 80453 82040 83910 86257 88590 89811 89549 88581
55062 88581 87777 87429 87676 88518 89238 88878 87613 86687 86788 87485 88477 90054 91892 92693 91914 90750 90516 90879
55044 90879 90634 89458 87980 86634 85471 84748 84837 85700 87016 88588 90124 90977 90670 89476 88023 86593
55028 86593 85189 83978 83193 82806 82678 82789 83036 83101 82918 82978 83773 85074 86100 86309 85827 85243 85128 85582
55010 85582 86128 86275 86135 86253 86831 87501 87837 87685 87003 85963 85285 85845 87668 89811 91434 92521 93335
54993 93335 93769 93647 93245 93048 93176 93372 93381 93166 92911 92929 93381 94027 94422 94364 93972 93422 92951 92911 93405 93951 93966
54972 93966 93514 93115 92997 93014 93169 93567 93996 94173 94345 94927 95597 95557 94729 93941 93824 94279 95129 96501 98303
54953I8303J766J486J340J073L13n53r19q55p83o83m10k83n37p77p19q23j280
54936I5659j269k73O90M59l61k93P18J409J256R10P75N92M38Q03J574K087K189
54919A07363K301K544K780L359M615N831N950N197M703M648M137K873J499J86
54905A57986j666l983n615n913n546n261m899m175l389k862k364j714j164q57
54891A08578n51j96j23l52m45k42j20k16j21L90R59J224J219J013N68J87M86J617
54873A13875L009M059M689N089N378N596N662N293M348L078J679q3k305m351n502
54858A49514n912o200o334n799m637l497k770k413k457k821k898k168j117o51
54844I9840q11r39q63r05q94l12O25J101Q89M29j20q74j422j169m90k70l80J34
$$ plain form
54953 98303 100069 101555 102895 103968 104281 103728 102809 101954 101171 100488 100078 99795 99258 98481 97762 96939 95659
54936 95659 94390 94117 94807 95266 94905 94612 95330 96739 97995 98905 99680 100272 100710 101513 103087 105174 107363
54919 107363 109664 112208 114988 118347 122962 128793 134743 139940 144643 149291 153428 156301 157800 157986
54905 157986 156320 152337 146722 140809 135263 130002 125103 120928 117539 114677 112313 110599 109435 108578
54891 108578 108027 107831 107708 107356 106911 106669 106549 106333 106212 106602 107561 108785 110004 111017 111585 111772 112258 113875
54873 113875 116884 120943 125632 130721 136099 141695 147357 152650 156998 160076 161755 161672 159367 155016 149514
54858 149514 143602 137402 131068 125269 120632 117135 114365 111952 109495 106674 103776 101608 100491 99840
54844 99840 99029 98090 97227 96322 95428 95116 95741 96842 97731 98160 98040 97166 95744 94575 94085 93815 93435 93569
54826I3569J203J554O26o11j197j286j259r11j68L87L42J5k22l69k61M63J474
54809I3349J771R76j28p81j073j269j186p68l61o0M83J189J402R66N93P31R27
54792I6761P33L64Ko33j467j686q60L40J093J398J567J487J059O91O73O09J18
54775A02249m44n33k57j9K56R79K215L509M297M299L783L489L895M620M958M928
54759A42224N093N478N504M967M243L418K177O16p26j806l080m493n459o016o774
54744A45366p528p168n442l529k336j488n83j20m02o97m97m88j229j889j439k93
54728A10238M29N40O10P23N78M08P36J469K140K751L592M479N003N208N330N195
54712A49429M502L409K251R70m83j706k444l153m269n280n401m782m294m266m244
$$ plain form
54826 93569 94772 96326 96952 96341 95144 93858 92599 91688 91520 91907 92249 92264 92042 91673 91412 91875 93349
54809 93349 95120 96096 95968 95187 94114 92845 91659 90891 90530 90470 90953 92142 93544 94510 95103 95834 96761
54792 96761 97494 97858 97860 97227 95760 94074 93214 93554 94647 96045 97612 99099 100158 100849 101522 102131 102249
54775 102249 101805 101272 101015 100996 101252 102231 104446 107955 112252 116551 120334 123823 127718 132338 137296 142224
54759 142224 147317 152795 158299 163266 167509 170927 173104 173720 172994 171188 168108 163615 158156 152140 145366
54744 145366 137838 130670 125228 121699 119363 117875 117292 117172 116770 116073 115576 115088 113859 111970 110531 110238
54728 110238 110667 111207 111817 112540 113118 113526 114262 115731 117871 120622 124214 128693 133696 138904 144234 149429
54712 149429 153931 157340 159591 160561 160078 158372 155928 152775 148506 143226 137825 133043 128749 124483 120239
54697A20239l831l078k072q37L95J236J494J152K38r53j822k009j731j330q84
54682A06207n38n79q73p87j90J42k91q13o33j60l25j033j403j237j154j264q66
54665I4203K55J195J110M16K12Q32J497J430Q31N21P93J056P17L0l82m39n31o89
54647A03057n68k05k7p6P2M40N17J93K4K02J80k62m70j4N01L90K7J56N86M89l13
54626A04899j083j165o69k19k77o67o86MO78L64o91j174m99M75Q78Q93R38P64
54608A02763J73l14k88k03m40m84R0N81K27m28l76K03L61L0l0L46N46L89L80O60
54588A04186P57M77J81L8k01n46o43m08r1K88Q79J298Q41l88j286j086k65J87
54570A04218K8j71O3N25P04M79K99N47R33Q18J95j81J55O47M84k87q38n39M74
$$ plain form
54697 120239 116408 113330 111258 110421 110816 112052 113546 114698 114936 113983 112161 110152 108421 107091 106207
54682 106207 105669 105090 104217 103430 103240 103382 103091 102278 101645 101485 101160 100127 98724 97487 96333 95069 94203
54665 94203 94458 95653 96763 97179 97391 98223 99720 101150 101981 102502 103295 104351 105068 105098 104716 104277 103746 103057
54647 103057 102489 102284 102257 102181 102253 102693 103210 103403 103427 103629 103809 103547 103077 103063 103564 103954 103981 104137 104723 105212 104899
54626 104899 103816 102651 101982 101763 101486 100819 100133 100137 100815 101179 100488 99314 98815 99290 100168 101061 101999 102763
54608 102763 102936 102622 102334 102131 101691 101207 101297 101878 102105 101677 101301 101504 101865 101895 101865 102211 102757 103146 103526 104186
54588 104186 104943 105420 105601 105639 105438 104892 104249 103841 103750 104038 104917 106215 107056 106668 105382 104296 104031 104218
54570 104218 104246 104075 104138 104663 105367 105846 106145 106692 107625 108443 108638 108457 108612 109259 109743 109456 108618 108079 108553
54551A08553J458J582N53q73j444p74J92M26R7O9N87J107J195J000Q49Q97J150
54534A16624J515J791J815J521R01J27k83P5P90R44K59o10j132j478j816j776
54518A19267j176n18l12m12n22p23r82q89m58m35j178j864j563n10M33R27J037
54501A10122O41j52n70q1P06R07O03L82J65m23r97q11OO80R50J112J052M26l44
54482A14374l59M43J112J035O07M45O24Q59Q58M15l47q16m43N15J258J345R80
54465A22905N28J32k70p91j300j230j72J262J832J241M85L15L17M6l3M05O29L6
54447A26337o47n59k09n42j196j129m16K8M3J71L58J54j74r5m8p21j479j054L53
54428A19175J279J201R04O83j4j027j282o06n2j8M40J699K591K127R64K64J85
$$ plain form
54551 108553 110011 111593 112146 111273 109829 109055 109247 109673 109770 109839 110426 111533 112728 113728 114577 115474 116624
54534 116624 118139 119930 121745 123266 124167 124294 124011 124086 124876 125820 126079 125469 124337 122859 121043 119267
54518 119267 118091 117573 117261 116849 116327 115604 114622 113733 113275 112840 111662 109798 108235 107725 108158 109085 110122
54501 110122 110763 110611 110041 109960 110666 111573 112176 112558 112723 112300 111303 110492 110498 111178 112128 113240 114292 114718 114374
54482 114374 114015 114458 115570 116605 117212 117657 118281 119140 119998 120413 120066 119250 118807 119322 120580 121925 122905
54465 122905 123433 123565 123295 122504 121204 119974 119802 121064 122896 124137 124622 124937 125254 125300 125267 125672 126301 126337
54447 126337 125690 125131 124922 124380 123184 122055 121639 121667 121710 121881 122239 122393 122219 122124 122076 121355 119876 118822 119175
54428 119175 120454 121655 122559 123242 123228 122201 120919 120313 120261 120243 120683 122382 124973 127100 128064 128328 128513
54411A28513K59K99J61m65j348j615j010l76k42M6J052J960J632L17o25m16M67
54394A28609J113J068N90M09J038K130K719K300J221Rj161k151k555k079r50K67
54378A32577R92Q52J3p84r50o98n11k68L67J029J025N32L68O79Q30O06M36L74
54360A37469J0m87l92K13L50k51o16j76L17J36k17P2Q26J352J495J498J434J385
54342A44418J576J824J563R05Q86J899K737K054J82j409k017k132k287k356k054
54327A45789j503j131j288j903k436k378j860j397j079m82M30J005P82R9m76q26
54311A31346j039r96o56l64m46p46q44n41K7N35O94N26L43K24j94r74j375p64
54293A24756L36R93J228J579J688P68o16q39L99J498J256L37k32o06j209j507
$$ plain form
54411 128513 128772 129071 129232 128767 127419 125804 124794 124418 124176 124222 125274 127234 128866 129183 128558 128142 128609
54394 128609 129722 130790 131380 131789 132827 134957 137676 139976 141197 141206 140045 137894 135339 133260 132310 132577
54378 132577 133569 134421 134434 133650 132700 132002 131491 131223 131590 132619 133644 134176 134544 135223 136053 136659 137095 137469
54360 137469 137479 136992 136600 136813 137163 136912 136296 136120 136437 136573 136356 136428 137254 138606 140101 141599 143033 144418
54342 144418 145994 147818 149381 150286 151172 153071 155808 157862 158044 156635 154618 152486 150199 147843 145789
54327 145789 144286 143155 141867 139964 137528 135150 133290 131893 130814 130332 130762 131767 132549 132648 132172 131346
54311 131346 130307 129311 128655 128291 127845 127099 126255 125714 125741 126276 126970 127496 127839 128063 127869 126895 125520 124756
54293 124756 125092 126085 127313 128892 130580 131348 130732 129893 130292 131790 133046 133383 133151 132545 131336 129829
54277A29829q75J47N84M15L00M06L77M1m44q82r30k69O93J002M54j9K43O49M55
54258A32176l1j39K4J5K4M73J102J327J188J185J435J595J322L97j163k662l041
54241A35227k140j037o14m48K07J101J442J050K95n99j348j302k60Q61J026M07
54225A33868j03l24p39j323j361n80L48N91N5n46m01N31J263Q10n09j395j269
54208A28916q52p43n46J04O22M62J57M72J162J478J331J078O97P6l91l35q0o6
54190A33542j17n9l46j231j929j602o48j1K09M71P00N58L38M04L11m00j028o49
54172A28513J85J88n33o84k1K75k69n72J17Q89N68n45j217q96r0N53Q08P53M69
54153A28491n4p31j146q10J02O80L65k73l99p2J31J66L68N65L58P1M34J337J854
$$ plain form
54277 129829 128954 129101 129685 130100 130400 130806 131183 131224 130780 129898 128968 128699 129392 130394 130848 130829 131072 131721 132176
54258 132176 132145 132006 132030 132045 132069 132542 133644 134971 136159 137344 138779 140374 141696 142093 140930 138268 135227
54241 135227 133087 132050 131436 130988 131195 132296 133738 134788 135083 134484 133136 131834 131574 132435 133461 133868
54225 133868 133765 133441 132702 131379 130018 129438 129786 130377 130432 129886 129485 130016 131279 132089 131580 130185 128916
54208 128916 128064 127321 126775 126879 127501 127963 128120 128592 129754 131232 132563 133641 134338 134414 134023 133688 133608 133542
54190 133542 133425 133366 133020 131789 129860 128258 127610 127599 127808 128279 128979 129537 129875 130279 130590 130190 129162 128513
54172 128513 128698 128886 128353 127669 127648 127923 127654 127082 127199 128088 128656 128111 126894 125998 125908 126461 127269 128022 128491
54153 128491 128437 127706 126560 125750 125852 126532 126897 126624 126225 126153 126284 126450 126818 127383 127741 127812 128246 129583 131437
54134A31437J575J078R14R56Q65N27l7o34p43p4Q31J145Q37N19M46M19M74P55
54116A41290Q77L84k68k06M19O51L70M61J079J124L3j097j015l1O52O11K97m6
54098A45585o28j397j901j893j605j331j023m52L57R49P98n4r15j176r16n12l6
54081A33850N63R24O76J40N4N35R92J051R48R32R41R04Q58O56J68j99J75J143
54063A45311J777J508P19K3m71q45r20m90L14J220K070K704K855K427J724J270
54047A61196J428K145K941L323L404L840M984O403P547Q449R266R695R449Q919
54033B42989Q493P605N347J899j585m289o050o536n441l510k249k177k369k055
54019B30072j667j803k175k262k276k644l063k909k255j843k141k860l429l564
$$ plain form
54134 131437 133012 134090 135004 135960 136825 137352 137315 136681 135938 135864 136695 137840 138677 139196 139642 140061 140535 141290
54116 141290 142167 142551 142283 142077 142496 143147 143517 143978 145057 146181 146214 145117 144102 144071 144723 145334 145631 145585
54098 145585 144957 143560 141659 139766 138161 136830 135807 135355 135712 136661 137459 137405 136490 135314 134398 133886 133850
54081 133850 134413 135337 136013 136153 136207 136742 137734 138785 139733 140665 141606 142510 143368 144024 144192 143993 144168 145311
54063 145311 147088 148596 149315 149338 148867 148022 147102 146612 146926 148146 150216 152920 155775 158202 159926 161196
54047 161196 162624 164769 167710 171033 174437 178277 183261 189664 197211 205660 214926 224621 234070 242989
54033 242989 251482 259087 264434 266333 264748 260459 254409 247873 242432 238922 236673 234496 232127 230072
54019 230072 228405 226602 224427 222165 219889 217245 214182 211273 209018 207175 205034 202174 198745 195181
54005A95181l419l331l355l159k520j793j502j594j568j242q74n41p5L67L19k61
53989A70633q34j073j229j539j814j811j595j249o90N1O70R32Q35M51o7l51j19
53972A61201M01P34P37N44J36m44p60n21j84k58k92M18J404J427L73n49o35m37
53954A63295l64P2J020J571J143O08J053K205L003L106K937K711K327J923J802
53939A88412J978K331K934L752M424M711M778M661M020K926K189K319K700K551
53925B34686K134K178K559K494J894J559K021K925L691M252M973O125P540Q517
53911B87548Q282O803M982L736L081K371J184l92k056l438m142m079l735l721
53897B96424m121m468m297l556k704k423k947l593l328j978l71Q23J818K990M151
$$ plain form
54005 195181 191762 188431 185076 181917 179397 177604 176102 174508 172940 171698 170824 170283 170208 170575 170894 170633
53989 170633 169799 168726 167497 165958 164144 162333 160738 159489 158799 158850 159520 160452 161287 161738 161671 161320 161201
53972 161201 161602 162336 163073 163617 163753 163309 162549 162028 161844 161586 161294 161712 163116 164543 164916 164367 163732 163295
53954 163295 162931 163003 164023 165594 166737 167345 168398 170603 173606 176712 179649 182360 184687 186610 188412
53939 188412 190390 192721 195655 199407 203831 208542 213320 217981 222001 224927 227116 229435 232135 234686
53925 234686 236820 238998 241557 244051 245945 247504 249525 252450 256141 260393 265366 271491 279031 287548
53911 287548 295830 302633 307615 311351 314432 316803 317987 317595 315539 312101 307959 303880 300145 296424
53897 296424 292303 287835 283538 279982 277278 274855 271908 268315 264987 263009 262638 263461 265279 268269 272420
53882B72420M952N366N134L344m98n340r326j1556j2386j2228j0941q597o050
53869B14294m305l601l424l173k736k439k530k735k536j901j392j329j316r22
53855A79955m72n71j172j638j617j323r90o27k77q1L4K98O34O27R4o24j091j207
53837A69952j118r14o24l55k23k27k67l16m61p18q71n57L29J355J809J315K21
53820A68330o08m70N80J724K156J901J700J969K251J985J448J315J586J699J609
53805A89175K001L099M041L897K927K225K368K900L059K670K127J801J620J363
53791B25273J107J114J240R68K13l26j14L75L69n4k54k43o81j697k660l162l417
53774B18051l497l115k437k211k653l008k671k097j988k277k420k257j971j664
$$ plain form
53882 272420 277372 282738 287872 291216 290718 285378 276052 264496 252110 239882 228941 220344 214294
53869 214294 209989 206388 202964 199791 197055 194616 192086 189351 186815 184914 183522 182193 180877 179955
53855 179955 179483 178912 177740 176102 174485 173162 172172 171545 171268 171187 171221 171519 172153 172780 172874 172250 171159 169952
53837 169952 168834 167920 167296 166941 166718 166491 166224 165908 165447 164729 163858 163301 163630 164985 166794 168109 168330
53820 168330 167722 167252 167832 169556 171712 173613 175313 177282 179533 181518 182966 184281 185867 187566 189175
53805 189175 191176 194275 198316 202213 205140 207365 209733 212633 215692 218362 220489 222290 223910 225273
53791 225273 226380 227494 228734 229702 229915 229589 229475 229850 230219 230165 229911 229668 228987 227290 224630 221468 218051
53774 218051 214554 211439 209002 206791 204138 201130 198459 196362 194374 192097 189677 187420 185449 183785
53760A83785j438j537j896j927j238k35L68M19K32kl33o85p38j52J092K398K774
53743A80887J831M56r8K32L82j77p60o60j52J48J56J25K35P23J682K506K325J382
53725A91223R75J562K042J573R76J277J942J778R15N02Q60J247J253J238J419
53710B10782J509J444J583K063K611L017L352L678L912L904L421K400J403J256
53696B46335J878K154J553J030J528K419K482J811J478J742J785J145J98p09j577
53681B65252k214k257j845j438j048m47K7k32j044j601j650j550j343p48q7q8
53665B47687o47q13k68K07O1k58k21o6k01n21p81j022j172q69o2O60P66L48k33
53646B42595p95j129r16j43P15J279J607J829J885J850K015K350K370J780R51
$$ plain form
53760 183785 182347 180810 178914 176987 175749 175514 175882 176301 176533 176531 176198 175513 174775 174623 175715 178113 180887
53743 180887 182718 183174 183076 183308 183690 183513 182753 182093 181941 182089 182245 182370 182605 183328 185010 187516 189841 191223
53725 191223 192198 193760 195802 197375 198351 199628 201570 203348 204263 204765 205625 206872 208125 209363 210782
53710 210782 212291 213735 215318 217381 219992 223009 226361 230039 233951 237855 241276 243676 245079 246335
53696 246335 248213 250367 251920 252950 254478 256897 259379 261190 262668 264410 266195 267340 267538 266829 265252
53681 265252 263038 260781 258936 257498 256450 256003 256030 255798 254754 253153 251503 249953 248610 247862 247775 247687
53665 247687 247040 246227 245959 246166 246227 245969 245748 245682 245481 244960 244179 243157 241985 241116 241054 241714 242480 242828 242595
53646 242595 241800 240671 239755 239612 240327 241606 243213 245042 246927 248777 250792 253142 255512 257292 258243
53631B58243M30M11Q45J642K500K894K612K062J765J789J873J943K203K822L688
53616B87722M401M594M290L935L891M054M125M013L768L351K806K393K225K110
53602C37678K053K482L413L892L090J598P23O89N65o4m58l3O81Q60M63mk29k15
53584C57184lK90N06O33P59P45L54l46j153k208l665m974n237m446l603l371l290
53567C28175k695j759j165j213j579j668j018K77J405J576J035P51J058J279R17
53552C25376M30M87R95J461J728J943K171K507L174M145N024N564N886N964N429
53537C72284M381L803M519O090P363P924Q409R432J0762J1697J1913J1807J2031
53524D82415J2757J3479J3719J3775J4433J5903J7493J8489J8915J9320K0172
$$ plain form
53631 258243 258673 259084 259929 261571 264071 266965 269577 271639 273404 275193 277066 279009 281212 284034 287722
53616 287722 292123 296717 301007 304942 308833 312887 317012 321025 324793 328144 330950 333343 335568 337678
53602 337678 339731 342213 345626 349518 352608 354206 354929 355618 356183 356119 355661 355628 356309 357169 357632 357628 357399 357184
53584 357184 357181 357471 357977 358610 359369 360114 360468 360122 358969 356761 353096 348122 342885 338439 334836 331465 328175
53567 328175 325480 323721 322556 321343 319764 318096 317078 317355 318760 320336 321371 322122 323180 324459 325376
53552 325376 325806 326293 327288 328749 330477 332420 334591 337098 340272 344417 349441 355005 360891 366855 372284
53537 372284 376665 380468 384987 391077 398440 406364 414773 424205 434967 446664 458577 470384 482415
53524 482415 495172 508651 522370 536145 550578 566481 583974 602463 621378 640698 660870
53513F60870K1680K3790K5982K7461K7834K7487K7061K6783K6401K5610K4402
53502I45361K3210K2641K2765K2765K1793K0167J9123J9281J9941K0125J9655
53491A176827J8917J8155J7516J7307J7655J8156J8280J7923J7365J6860J6558
53480A371519J6432J6031J4664J2153R134O373M032J866k31k217m096n949p911
53467A431800j0249j3084j5922j7993j9146j9860k0212j9666j8341j7607j8628
53456A241092k0855k2845k4066k4929k5354k4595k2636k0718j9917j9887j9486
53445I95804j8193j6415j4688j3059j1285r245p070m989l167j707p10j82J90R41
53431H96225K359M188N943P475Q945J0391J1570J2359J3059J4078J5469J6919
$$ plain form
53513 660870 682550 706340 732322 759783 787617 815104 842165 868948 895349 920959 945361
53502 945361 968571 991212 1013977 1036742 1058535 1078702 1097825 1117106 1137047 1157172 1176827
53491 1176827 1195744 1213899 1231415 1248722 1266377 1284533 1302813 1320736 1338101 1354961 1371519
53480 1371519 1387951 1403982 1418646 1430799 1439933 1446306 1450338 1452204 1451973 1449756 1445660 1439711 1431800
53467 1431800 1421551 1408467 1392545 1374552 1355406 1335546 1315334 1295668 1277327 1259720 1241092
53456 1241092 1220237 1197392 1173326 1148397 1123043 1098448 1075812 1055094 1035177 1015290 995804
53445 995804 977611 961196 946508 933449 922164 912919 905849 900860 897693 895986 895276 895094 895284 896225
53431 896225 898584 902772 908715 916190 925135 935526 947096 959455 972514 986592 1002061 1018980
53419A018980J8225J9543K1070K2717K4277K5801K7498K9292L0850L2122L3507
53408A303882L5334L7504L9786M2110M4349M6237M7872M9874N2556N5247N6967
53397A811718N7524N7478N7239N6879N6604N6747N7256N7747N7954N7665N6385
53386B441196N3769N0272M6741M3368L9714L5693L1726K7922K3915J9600J5302
53375B829218J1037O422J388l769r228j5623k2914l0085l6418m2271m8186n3880
53363B585691n8551o1655o3023o2854o1883o0997o0345n9423n8126n6830n5313
53352A926691n2659m8793m5109m2875m1925m1490m1420m1706m1685m0692l8918
53341A449419l6816l4270l1212k8353k6268k4369k1775j8755j6240j4393j2747
$$ plain form
53419 1018980 1037205 1056748 1077818 1100535 1124812 1150613 1178111 1207403 1238253 1270375 1303882
53408 1303882 1339216 1376720 1416506 1458616 1502965 1549202 1597074 1646948 1699504 1754751 1811718
53397 1811718 1869242 1926720 1983959 2040838 2097442 2154189 2211445 2269192 2327146 2384811 2441196
53386 2441196 2494965 2545237 2591978 2635346 2675060 2710753 2742479 2770401 2794316 2813916 2829218
53375 2829218 2840255 2846677 2848065 2844296 2835068 2819445 2796531 2766446 2730028 2687757 2639571 2585691
53363 2585691 2527140 2465485 2402462 2339608 2277725 2216728 2156383 2096960 2038834 1982004 1926691
53352 1926691 1874032 1825239 1780130 1737255 1695330 1653840 1612420 1570714 1529029 1488337 1449419
53341 1449419 1412603 1378333 1347121 1318768 1292500 1268131 1246356 1227601 1211361 1196968 1184221
53330A184221j1376j0711j0533j0286j0218j1025j2401j3107j2561j1327r978
53319A060698q545p163o232n559m390k578r18Q8J015K602M782O926Q592R615J0092
53304A069025J0613J1991J4353J6934J9040K0757K2430K4037K5450K6888K8554
53293A290072L0158L1213L1621L1581L1067K9766K7528K4675K1865J9645J7972
53282A587163J6146J3444R876O126K677o47m230q038j1603j4475j6521j7997j9404
53269A542517k1154k3193k5101k6564k7638k8545k9445l0345l1110l1483l1356
53258A236583l1009l0861l0954l0917l0472k9773k9104k8441k7553k6412k5369
53247I15718k4795k4678k4631k4359k3905k3343k2450k1030j9473j8440j7941
$$ plain form
53330 1184221 1172845 1162134 1151601 1141315 1131097 1120072 1107671 1094564 1082003 1070676 1060698
53319 1060698 1052153 1044990 1038758 1033199 1028809 1026231 1025313 1025401 1026416 1029018 1033800 1040726 1049318 1058933 1069025
53304 1069025 1079638 1091629 1105982 1122916 1141956 1162713 1185143 1209180 1234630 1261518 1290072
53293 1290072 1320230 1351443 1383064 1414645 1445712 1475478 1503006 1527681 1549546 1569191 1587163
53282 1587163 1603309 1616753 1626629 1632755 1635432 1634785 1630555 1622517 1610914 1596439 1579918 1561921 1542517
53269 1542517 1521363 1498170 1473069 1446505 1418867 1390322 1360877 1330532 1299422 1267939 1236583
53258 1236583 1205574 1174713 1143759 1112842 1082370 1052597 1023493 995052 967499 941087 915718
53247 915718 890923 866245 841614 817255 793350 770007 747557 726527 707054 688614 670673
53236F70673j7191j5638j3582j1529r452p276n546m892n104n471n906o901q386
53223E53799r482r684r638j0256j1528j2699j3322j3552j3532j2976j1626r819
53211D15685q375p879q174q635q716q172o925n185l707l410m431n803o457o359
53197C23457o314o844p574p750p046n823m759m225l988l567k914k450k357k197
53183B55649j604r20p57j065j186p60j35J51p7o68j355j808j690r39M8O06L84
53166B43874k70o15l80j36m62j012r55k99l8p48j799k297k153j711r98p7L89k04
53148B30109j425k178j930j029q1M06Q3p94j223n28O02Q89J67n17m77j14Q7L86
53130B22433J127J874J760N79q66j452p89L20O47n8p87o80k01k49o25m10L31M69
$$ plain form
53236 670673 653482 637844 624262 612733 603281 596005 590459 585567 580463 574992 569086 562185 553799
53223 553799 544317 534633 524995 514739 503211 490512 477190 463638 450106 437130 425504 415685
53211 415685 407310 399431 391257 382622 373906 365734 358809 353624 349917 346507 342076 336273 329816 323457
53197 323457 317143 310299 302725 294975 287929 282106 277347 273122 269134 265567 262653 260203 257846 255649
53183 255649 254045 253125 252368 251303 250117 249357 249222 249373 249296 248628 247273 245465 243775 242836 242884 243490 243874
53166 243874 243604 242989 242609 242473 242011 240999 240044 239745 239707 238959 237160 234863 232710 230999 230001 229924 230313 230109
53148 230109 228684 226506 224576 223547 223466 223872 223955 223161 221938 221410 222012 222901 223068 222551 222074 221960 222047 222433
53130 222433 223560 225434 227194 227773 226907 225455 224666 224986 225633 225575 224788 224108 223907 223658 223033 222623 222954 223423
53112B23423l95j186q92N1N42L08n1r6Pj60q43j868k568k348j481r45j173j494
53094B08831j182n20k35l49k93K8Q8l18o08k03O50J185J043N99L68L79K28k73
53076B09418p37o18J52J118J808K084J985J469M73q45k015k469j976r98l76m86
53060B07987p60l76O61J476J342M34n00r41q95o15l26j19J6J79M58Q07R63N90
53042B10381m36j805k996l613l544k892k003j366j149q93j46O88P42n3o90m04
53026A89821M16R62R99P31K60j93r3O75J355J269P78N73N05pp61r94o24k83j56
53007A95233J89P59Q87K84m09m66K01J208J988J867O24q71j388q49m01p26j173
52990A96957r27j82L94O56Q29Q95P81P68J057J259Q46O0k81J69P88P09j49r52
$$ plain form
53112 223423 223028 221842 220950 221001 221543 221851 221800 221704 221711 221551 220708 218840 216272 213924 212443 211498 210325 208831
53094 208831 207649 207129 206894 206545 206252 206280 206368 206050 205442 205239 205889 207074 208117 208716 209084 209463 209691 209418
53076 209418 208681 208063 208215 209333 211141 213225 215210 216679 217152 216307 214292 211823 209847 208849 208473 207987
53060 207987 207227 206851 207512 208988 210330 210764 210264 209323 208428 207813 207487 207368 207384 207563 208021 208828 209791 210381
53042 210381 209945 208140 205144 201531 197987 195095 193092 191726 190577 189684 189538 190226 190968 190915 190225 189821
53026 189821 190237 191199 192198 192929 193189 192996 192903 193578 194933 196202 196980 197553 198058 198051 197290 196296 195672 195389 195233
53007 195233 195422 196181 197068 197352 196943 196477 196678 197886 199874 201741 202365 201494 200106 199257 198856 198130 196957
52990 196957 196030 195848 196242 196898 197727 198622 199403 200171 201228 202487 203333 203393 203112 203281 204069 204778 204629 203677
52972B03677q41Q8R35J175J285J968L086L897M045L710K974J825O73J04J0l17
52956B28294j088j754j952j944j865j341k62P24R67N39j84j051j856k105j570
52941B13552p50k48j07o5m7m7J26M87O14J47o73j327j602j577j390j234j277j303
52923B03279q60m0L89M3m13k14K98J64p23j380j044j02M91L47j29l84l36k78l76
52904A98732m83m24k88k40k56k86m56q09r36l40Q76J987K300J659M50n69o44K18
52886B00491J054R23L0o30n14J26R01J598J911J646J168R71R17N99L11O56J296
52869B13454J219L70j56J73N83M23K12N85J199J415J305J205R71L57l84r22j278
52852B20731j402r23M7O45L70j57k32j81p13j729k583l031l208l065k497j758
$$ plain form
52972 203677 202836 202924 203859 205034 206319 208287 211373 215270 219315 223025 225999 227824 228497 228601 228611 228294
52956 228294 227206 225452 223500 221556 219691 218350 218088 218812 219779 220318 220134 219083 217227 215122 213552
52941 213552 212802 212554 212447 212382 212335 212288 212414 212901 213515 213662 212989 211662 210060 208483 207093 205859 204582 203279
52923 203279 202419 202379 202768 202811 202398 202184 202482 202646 201923 200543 199499 199397 199888 200235 200106 199722 199386 199108 198732
52904 198732 198249 197825 197537 197297 197041 196755 196299 195490 194554 194214 195090 197077 199377 201036 201486 200917 200273 200491
52886 200491 201545 202468 202498 201868 201354 201480 202381 203979 205890 207536 208704 209675 210592 211191 211502 212158 213454
52869 213454 214673 215043 214887 215060 215643 216066 216278 216863 218062 219477 220782 221987 222958 223315 222931 222009 220731
52852 220731 219329 218406 218453 219098 219468 219311 219079 218898 218185 216456 213873 210842 207634 204569 202072 200314
52836B00314j149o44k56k35n14n60k57k10o06n78N02J854K272J621M63j052k817
52819A98148l894l289j458Q0N39L88K77L37M97O98Q22R49J414K132K342J727J142
52802B02851J359J658Q41q51k047k233k132k241k281k129k159k375k271j733j203
52787A83054q73n44l12m06l72M93J785K220J457N91M21L80k28r67r92l70K15N05
52769A86057P53J020J004M74m14j204j461j175p96o79o33l80j09q5RN65J138R47
52751A85031K11k9N22J011P98L08J39K59M30O33O86K69l39l28M25J109J310J623
52733A94068K324K548J644N15M12J122J454J131Q94R58O14m11j362j564j321j214
52717B01812j161q01l00k20o82j235j493j545j624j685j584j419j432j630j789
$$ plain form
52836 200314 199165 198521 198265 198030 197516 196956 196699 196489 195883 195305 195807 197661 199933 201554 202017 200965 198148
52819 198148 194254 190965 189507 189587 190126 190514 190791 191128 191625 192323 193145 194094 195508 197640 199982 201709 202851
52802 202851 204210 205868 206709 205858 203811 201578 199446 197205 194924 192795 190636 188261 185990 184257 183054
52787 183054 182181 181637 181325 180919 180547 181040 182825 185045 186502 187093 187514 187894 187666 186699 185707 185337 185552 186057
52769 186057 186810 187830 188834 189308 188894 187690 186229 185054 184258 183579 182946 182566 182457 182372 182381 182946 184084 185031
52751 185031 185242 185213 185735 186746 187544 187852 187991 188250 188680 189313 189999 190268 189929 189601 190026 191135 192445 194068
52733 194068 196392 198940 200584 201099 201511 202633 204087 205218 206112 207070 207684 207273 205911 204347 203026 201812
52717 201812 200651 199850 199550 199330 198648 197413 195920 194375 192751 191066 189482 188063 186631 185001 183212
52702A83212j809j776j553q15L33J206J437J600K340L159K924J533K52J46R06
52687A93095J568J722J518R83N1r35j356j006k61M37R63J333J418J057L71j80
52671B00778j58M08J016J195R65O75N12L38K4k63j42N78J578K171J968J394J259
52654B14296J732K152K008J579J347J237R33M58j10j019k244k968k503j519j330
52639B14049j993k124q48J068K349K690K592K393K079J753J770K495M063O112
52625B38448P798Q503Q506Q430P902N618J068m367q503j0235r921q433o378m130
52611B34306k094p73n62j318k240k507k024j246l61Q04K021K559K128J336Q15
52596B30844M44j45p48p76r2P92J228Q92J0p18o57O1O09M32j19l14O7N75N93j44
$$ plain form
52702 183212 181403 179627 178074 177259 177592 178798 180235 181835 184175 187334 190258 191791 192043 192189 193095
52687 193095 194663 196385 197903 198886 198937 198002 196646 195640 195379 195816 196779 198112 199530 200587 200958 200778
52671 200778 200620 201028 202044 203239 204204 204879 205391 205729 205753 205490 205348 205926 207504 209675 211643 213037 214296
52654 214296 216028 218180 220188 221767 223114 224351 225284 225742 225632 224613 222369 219401 216898 215379 214049
52639 214049 212056 209932 209084 210152 212501 215191 217783 220176 222255 224008 225778 228273 232336 238448
52625 238448 246246 254749 263255 271685 279587 285205 286273 281906 273403 263168 253247 244814 238436 234306
52611 234306 232212 231439 230877 229559 227319 224812 222788 221542 221181 221985 224006 226565 228693 230029 230844
52596 230844 231288 231143 230395 229619 229527 230319 231547 232439 232449 231731 231074 231135 231744 232176 232057 231743 231810 232385 232978 232834
52576B32834j206j684j055J10P75P90R92J761K269J610M4j409k194k369k028j198
52560B28042j95N20P87O98K44n60j332j570j197o36l70o20j271j860j868j248
52544B17564n05k5L40P85J015O87J47J62R16J733J902J449R42P21N85J95k70k32
52526B28111M69J141J016K48l70o26j016j644j836j215l28K77R07J897K657K454
52510B32142J792J962L249M549M856M291L499K808K279J900J275k29k507m321
52496B57545m582l701l019k981k725j656o02p47j879k564j998q91k42MM85J201
52480B31648J565J434J263J249J075O55M51P49J117R92L91k01l35K15J315K314
52464B45897K496K027J960K913M186M685M282L643L021J933O3k129l889m838n054
$$ plain form
52576 232834 231628 229944 228889 228999 229774 230564 231556 233317 235586 237196 237240 235831 233637 231268 229240 228042
52560 228042 227847 228367 229154 229852 230096 229536 228204 226634 225437 224801 224431 223811 222540 220680 218812 217564
52544 217564 217059 217034 217374 218159 219174 219861 220008 220170 221086 222819 224721 226170 227112 227833 228418 228613 228343 228111
52526 228111 228580 229721 230737 230985 230615 229989 228973 227329 225493 224278 223950 224227 225134 227031 229688 232142
52510 232142 233934 235896 239145 243694 248550 252841 256340 259148 261427 263327 264602 264373 261866 257545
52496 257545 252963 249262 246243 243262 240537 238881 238279 237532 235653 233089 231091 230200 229958 229962 230447 231648
52480 231648 233213 234647 235910 237159 238234 238889 239340 240089 241206 242198 242589 242388 242053 242268 243583 245897
52464 245897 248393 250420 252380 255293 259479 264164 268446 272089 275110 277043 277106 274977 271088 266250 261196
52449B61196m760m109l198k213j548j568k109k480k231j687j450j554j547j299
52435B29443j226j557j788j236QJ027J054L22k54r7N40J121J458J649J654J353
52419B33471Q75N16L85M27O82J200J833K511L572N261P046Q067Q341Q822J0107
52404B93116J1621J2352J1736R521N536J63n315r401j1382j1430j0145q277o505
52391B81590n090l841k677j807j260o80P9N99N02K0l78n33m05K65J524K812L453
52374B74173L432L258L331L713M325M943N218M998M499L946L312K606K060J733
52360C25547J349P23Rp35j621k342k171j046Q3M55N04R20J458J514J371J789K753
52343C30560L610M253N137O244P011P328P675Q207Q631R039R890J1013J1582J1501
$$ plain form
52449 261196 256436 252327 249129 246916 245368 243800 241691 239211 236980 235293 233843 232289 230742 229443
52435 229443 228217 226660 224872 223636 223644 224671 225725 226047 225793 225696 226236 227357 228815 230464 232118 233471
52419 233471 234346 234862 235247 235674 236356 237556 239389 241900 245472 250733 257779 265846 274187 283009 293116
52404 293116 304737 317089 328825 338346 343882 344045 338730 329329 317947 306517 296372 288095 281590
52391 281590 276500 272659 269982 268175 266915 266235 266314 266913 267415 267435 267057 266524 266119 266384 267908 270720 274173
52374 274173 277605 280863 284194 287907 292232 297175 302393 307391 311890 315836 319148 321754 323814 325547
52360 325547 326896 327619 327628 326893 325272 322930 320759 319713 319796 320251 320755 321675 323133 324647 326018 327807 330560
52343 330560 334170 338423 343560 349804 356815 364143 371818 380025 388656 397695 407585 418598 430180 441681
52329D41681J1819J3276J5247J6791J8019J9616K1451K2609K2692K2320K2202
52318F47723K2267K1930K0872J9232J7256J5109J3007J1260R997R020Q155P576
52306H23404P468P434O764N336L827K822K153J402N52k60j197k389l446l900l961
52291H46009m289n178o442p862r192r863r311p690n767m034k368m84J678M032
52277G79239O379Q388R873J1138J2563J3970J4799J4882J4658J4636J5038J5743
52265I31306J6154J5228J2453Q814O183N482N888O014N327M245L259K447J610
52252A024410N88m75j202j423j551k255l782n827q033j0260j2427j4318j5665
52239I47780j6239j5994j5280j4621j4102j3257j1876j0427r232p781n629l570
$$ plain form
52329 441681 453500 466776 482023 498814 516833 536449 557900 580509 603201 625521 647723
52318 647723 669990 691920 712792 732024 749280 764389 777396 788656 798653 807673 815828 823404
52306 823404 830872 838306 845070 850406 854233 857055 859208 860610 861162 860902 859705 857316 853870 849970 846009
52291 846009 841720 836542 830100 822238 813046 803183 793872 786182 780415 776381 774013 773529 775207 779239
52277 779239 785618 794006 803879 815017 827580 841550 856349 871231 885889 900525 915563 931306
52265 931306 947460 962688 975141 983955 990138 995620 1001508 1007522 1012849 1017094 1020353 1022800 1024410
52252 1024410 1024998 1024523 1023321 1021898 1020347 1018092 1014310 1008483 1000450 990190 977763 963445 947780
52239 947780 931541 915547 900267 885646 871544 858287 846411 835984 826752 818971 813342 809772
52227H09772k802l139l155k246j357j323j590j195k09O25J087J566K260K972L558
52212H04824M073M638N427O582P799Q300P581O035M535L615L253L122K782J929
52198H74495Q02J16K94J044J925K908M028M866M980M573M176L859L347K717K335
52183I16465K030J154m19j939k793l314m183n418o487p137p511p657p419o879
52169H58493o317n600m220k219n35M7m7K60J311K486L235L698M198M750N276N752
52153H70568N903N221L672J957O84k83j255j898j572k70J299K550L424M085M645
52138H98730N169N643N867N763N730O401P956R921J1666J2988J4227J5963J8466
52125A024490K1349K3876K5729K7242K8785L0248L1264L1596L1057K9501K7239
$$ plain form
52227 809772 806970 803831 800676 798430 797073 795750 794160 792965 792756 793381 794468 796034 798294 801266 804824
52212 804824 808897 813535 818962 825544 833343 841643 849224 855259 859794 863409 866662 869784 872566 874495
52198 874495 875297 875413 875707 876751 878676 881584 885612 890478 895458 900031 904207 908066 911413 914130 916465
52183 916465 918495 919649 919230 917291 914498 911184 907001 901583 895096 887959 880448 872791 865372 858493
52169 858493 852176 846576 842356 840137 839602 839649 839602 839862 841173 843659 846894 850592 854790 859540 864816 870568
52153 870568 876471 881692 885364 887321 888005 887722 886467 884569 882997 882727 884026 886576 890000 894085 898730
52138 898730 903899 909542 915409 921172 926902 933303 941259 951180 962846 975834 990061 1006024 1024490
52125 1024490 1045839 1069715 1095444 1122686 1151471 1181719 1212983 1244579 1275636 1305137 1332376
52114A332376K5013K3129K0938J7721J3768R984O655L275n04m334p632j0161j2065
52101A418163j3590j4728j5062j4244j2695j1325j0360r158p586o657p071p921
52089A287766p925p319p295q062q833r376j0059j0388r107o100k733J24L025O352
52075A210070R168J0627J1416J2710J4426J5580J5799J5565J5319J5190J5211
52064A361081J5113J4232J2338J0165Q412O638M015Q59j625l104m556o763r189
52051A407616j0823j1483j1812j2309j3017j3994j5474j7406j9230k0405k1069
52040A240594k1781k2668k3163k2726k1431j9668j7623j5419j3411j1830j0315
52029A040559q330n979l928k608j994k056k819l968n005n921p134q616r664r778
$$ plain form
52114 1332376 1357389 1380518 1401456 1419177 1432945 1442929 1449584 1452859 1452355 1448021 1440389 1430228 1418163
52101 1418163 1404573 1389845 1374783 1360539 1347844 1336519 1326159 1317001 1309415 1302758 1295687 1287766
52089 1287766 1279841 1272522 1265227 1257165 1248332 1238956 1228897 1218509 1209402 1203302 1200569 1200693 1203718 1210070
52075 1210070 1219238 1229865 1241281 1253991 1268417 1283997 1299796 1315361 1330680 1345870 1361081
52064 1361081 1376194 1390426 1402764 1412929 1421341 1427979 1431994 1432853 1431228 1428124 1423568 1416805 1407616
52051 1407616 1396793 1385310 1373498 1361189 1348172 1334178 1318704 1301298 1282068 1261663 1240594
52040 1240594 1218813 1196145 1172982 1150256 1128825 1109157 1091534 1076115 1062704 1050874 1040559
52029 1040559 1032229 1026250 1022322 1019714 1017720 1015664 1012845 1008877 1003872 997951 990817 982201 972537 962759
52015I62759r279q842q776q974r153r008q466p991q251r365j0887j2495j4203
52002H37069j5708j6216j5363j3873j2903j2893j3323j3412j2861j1995j1302
51991F87220j0760r757p931n815m304l649l445l404l486l480l257l408m777p142
51977F12605r200j0076j0234j0613j1501j2476j2854j2055j0127q102p045o602
51965D91720n226k257J116L362M328M941N895P219Q588R429R160P824O180M784
51951E57063L325J226j548m530p160q820r032p923o125l973j361J542M107O115
51937E22906Q069J0348J2631J4486J5774J6178J5250J3243J0971Q392M413j252
51925F51409p018j1205j3863j5917j7358j7557j6789j6092j5846j5532j4793j3744
$$ plain form
52015 962759 953480 944638 935862 926888 917735 908727 900261 892270 884019 874654 863767 851272 837069
52002 837069 821361 805145 789782 775909 763006 750113 736790 723378 710517 698522 687220
51991 687220 676460 666703 658772 652957 648653 645004 641559 638155 634669 631189 627932 624524 619747 612605
51977 612605 603405 593329 583095 572482 560981 548505 535651 523596 513469 505367 498322 491720
51965 491720 486494 484237 485353 488715 493043 497984 503879 511098 519686 529115 538275 546099 552279 557063
51951 557063 560388 561614 560066 555536 548376 539556 530524 522601 516476 512503 511142 512684 516791 522906
51937 522906 530975 541323 553954 568440 584214 600392 615642 628885 639856 648248 652661 651409
51925 651409 644391 633186 619323 603406 586048 568491 551702 535610 519764 504232 489439 475695
51913D75695j2410j0731r081p928p044n719l792j794j30J397L172N298P509R369
51899D43811J0781J2401J4998J8201K0615K1491K1543K1512K0828J8399J3970
51888F38550P837N0q915j7306k3082k5650k5710k3854k0364j6088j2245r313o890
51875D57020m570k185N41L614O245P521P509O922N957M399K556J064j49j708l688
51860D91048n577p182q605r426r027p630n988m083j251K262N087O358O488O045
51846D58519M865K752J36k448m751o406o853o158n264m987n236n479n404m843
51832D08443l665k075o29L18Q43J110J246J488J863J836R22m35j415k219l807
51817D03824o158p780p455n594l426j676m88J35M67J112K264L385L991M293M569
$$ plain form
51913 475695 463285 452554 443473 435545 428501 422782 418990 417196 417066 418463 421635 426933 434442 443811
51899 443811 454592 466993 481991 500192 520807 542298 563841 585353 606181 624580 638550
51888 638550 646387 646437 637522 620216 597134 571484 545774 521920 501556 485468 473223 463910 457020
51875 457020 452450 450265 450806 454420 460665 468186 475695 482617 488574 492973 495529 496593 496444 494736 491048
51860 491048 485471 478289 469684 460258 451231 443601 437613 433530 432279 434541 439628 445986 452474 458519
51846 458519 463384 466136 466272 463824 459073 452667 445814 439656 434392 429405 424169 418690 413286 408443
51832 408443 404778 402703 402074 402392 403235 404345 405591 407079 408942 410778 411700 411265 409850 407631 403824
51817 403824 397666 389886 382431 376837 373411 371735 371247 371382 371849 372961 375225 378610 382601 386894 391463
51802C91463M416L249J204r09k388l040l105l075l323l679l608l055k676k965
51788C68509l522l542k798j790j089p76n18rO23R15O66K88K87N45N25P8l91n38
51770C57463l92KQ49K328M298O372Q089R241J0152J1353J2610J2760J1066Q332
51756D54523N955M137J861j490n367q827j1270j2398j2292j1604j0939j0026q267
51743C73996o008m287l234j789O70L357N243O326P277Q480R878J1218J1950J1417
51729D34494R536O965M440K339R95P19J283J865J680L21k355n895q894r898q939
51714D28656p357o048m793l416k504k477k946l415l789l744k585k86K155L968
51700C91419N385O658P138O057L623P55j627k680j971k52R20J057J303K399L114
$$ plain form
51802 391463 395879 399128 400332 399423 397035 393995 390890 387815 384492 380813 377205 374150 371474 368509
51788 368509 364987 361445 358647 356857 355768 354992 354474 354465 355088 356003 356669 356957 357244 357789 358314 358392 358001 357463
51770 357463 357071 357073 357922 360250 364548 370920 379009 388250 398402 409755 422365 435125 446191 454523
51756 454523 460478 464615 466476 464986 459619 450792 439522 427124 414832 403228 392289 382263 373996
51743 373996 367988 363701 360467 358678 359348 362705 367948 374274 381551 390031 399909 411127 423077 434494
51729 434494 444030 450995 455435 457774 458769 459488 460771 462636 464316 464637 462282 456387 447493 437595 428656
51714 428656 421299 415251 410458 407042 404538 402061 399115 395700 391911 388167 385582 385296 387451 391419
51700 391419 396804 403462 410600 416657 420280 421035 419408 416728 414757 414505 415425 416482 417785 420184 423298
51685D23298J762j485m841o978p788p585o651n398m103k610q62O33J492K177L350
51670C84411M972O618Q207R636J0307R856Q938Q365P921O802M801K138j280n295
51656D66397q593r594q259n957l658j244J522M345O803Q328P860M670k33m573
51642D57814p116q587j0013j1162j1211j0243r155q462p866o921n606m249l141
51629C54082k291j460m01R17K295L367L693L031J639M9j463k870l758l426j989
51614C51415p26o47j248j379r65r04j551k242k341j913j266n36J21N74J100K235
51598C39727M080O205Q217R983J1337J2143J2568J2731J2073R745N751J122l089
51585D42593o443q656r344q500o712m546k145L66K637M532O414Q651J1192J3800
$$ plain form
51685 423298 425060 423575 418734 411756 403968 396383 389732 384334 380231 377621 376759 377392 378884 381061 384411
51670 384411 389383 396001 404208 413844 424151 434007 442945 451310 459231 466033 470834 472972 471692 466397
51656 466397 457804 448210 439951 433994 430336 429092 430614 434959 441762 450090 457950 462620 462387 457814
51642 457814 450698 442111 432098 420936 409725 399482 390327 381865 373999 367078 361472 357223 354082
51629 354082 351791 350331 349930 350847 353142 356509 360202 363233 364872 364921 363458 360588 356830 353404 351415
51614 351415 350689 350042 348794 347415 346450 345546 343995 341753 339412 337499 336233 335697 335818 336392 337492 339727
51598 339727 343807 350012 358229 368212 379549 391692 404260 416991 429064 438809 444560 445682 442593
51585 442593 436150 427494 418150 409650 402938 398392 396247 396613 399250 403782 410196 418847 430039 443839
51571D43839J6306J8316J9185J8725J7688J7172J7632J8683J9583J9657J8635
51560F45421J7133J6700J8854K3794L0217L6396M1283M4478M5522M3566L7817
51549A001181K8157J5412J289j1932k2317k9432l4533l9148m3401m6118m6443
51538G72715m4811m2183l8971l5113l0704k6181k2020j8571j5977j3974j2136
51527D72074j0437r259q632p989o967n934n389n256n286n543o008o068n199l828
51513C80279k913k807l078l248l145k725k155j834j908j921j473q29m12p8M24
51498C52177P57O09O45J789L715N093N343N187N366N785O133O414O502N925M488
51483D15928K556M34j929m391o348p366p589p364o945o620o558o411n710m752
$$ plain form
51571 443839 460145 478461 497646 516371 534059 551231 568863 587546 607129 626786 645421
51560 645421 662554 679254 698108 721902 752119 788515 829798 874276 919798 963364 1001181
51549 1001181 1029338 1044750 1046039 1034107 1011790 982358 947825 908677 865276 819158 772715
51538 772715 727904 685721 646750 611637 580933 554752 532732 514161 498184 484210 472074
51527 472074 461637 452378 443746 435757 428790 422856 417467 412211 406925 401382 395374 389306 384107 380279
51513 380279 377366 374559 371481 368233 365088 362363 360208 358374 356466 354545 353072 352243 351831 351753 352177
51498 352177 352934 353543 354188 355977 359692 364785 370128 375315 380681 386466 392599 399013 405515 411440 415928
51483 415928 418484 418918 416989 412598 406250 398884 391295 383931 376986 370366 363808 357397 351687 346935
51469C46935m292m286l895k984k608l381m313m113k943j972j703j661j387q07
51455C06590J52J463K578K904K742L012L916M694M870N055O085P888R794J1528
51441C73271J3224J4632J5073J4368J3120J1710R519N806J170k578m098l562k001
51428D59654m19K28j007m225q142j1065j2325j2209j0938q548n760l942l741m269
51414C73292m077k655p56N44Q54P16R45J679K210J890R76K20j11l18n34n47k56
51397C74072K15R88K313L921N050N380N472O066P311Q927J0632J2271J3816J5468
51383D71902J7544K0142K3165K6674L0871L5819M1457M7714N4032N9121O1843
51372H90284O2199O0538N6026M7154L4168J9724O506m960j5474k5247l3902m1554
$$ plain form
51469 346935 342643 338357 334462 331478 328870 325489 321176 317063 314120 312148 310445 308784 307397 306590
51455 306590 306742 308205 310783 313687 316429 319441 323357 328051 332921 337976 344061 351949 361743 373271
51441 373271 386495 401127 416200 430568 443688 455398 464917 470723 471893 469315 465217 461655 459654
51428 459654 459235 459463 458456 454231 446089 435024 422699 410490 399552 391004 385244 381302 377561 373292
51414 373292 369215 366560 365804 366348 367202 367918 368863 370542 372752 374642 375618 375838 375727 375409 374875 374328 374072
51397 374072 374287 375275 377588 381509 386559 391939 397411 403477 410788 419715 430347 442618 456434 471902
51383 471902 489446 509588 532753 559427 590298 626117 667574 715288 769320 828441 890284
51372 890284 952483 1013021 1069047 1116201 1150369 1170093 1176599 1171639 1156165 1130918 1097016 1055462
51360A055462m8558n4416n8097n9459n9310n8011n4947m9705m3066l6389l0465
51349E03039k5341k0859j6967j3628j0832q630p052n970n135m356l636l150l043
51336C74440l238l494l611l502l079k278j282m84j21p5j31k46m83q46j327j947
51320C48296k603l041l112k963k819k705k487k098j604j109o77l33j03l4r5r2
51304C22421J46M23L92K36O67J855K839K634J600R12R08R25O96P97J461K022K085
51287C43019K260L032L716L488K776K565K742K265R03k88l68L93J118J212L94
51272C69227j404l665n263n342m109k449r69K76J393K391L221L675L295J789l34
51257C61732j907k220j803j801k647l609l692k657j181j95j92q48j203n57O39
$$ plain form
51360 1055462 1006904 952488 894391 834932 775622 717611 662664 612959 569893 533504 503039
51349 503039 477698 456839 439872 426244 415412 406782 399730 393760 388625 384269 380633 377483 374440
51336 374440 371202 367708 364097 360595 357516 355238 353956 353472 353351 353276 353145 352899 352416 351570 350243 348296
51320 348296 345693 342652 339540 336577 333758 331053 328566 326468 324864 323755 323078 322745 322642 322608 322513 322421
51304 322421 322567 322990 323382 323618 324285 326140 328979 331613 333213 334125 335033 335958 336654 337451 338912 340934 343019
51287 343019 345279 348311 352027 355515 358291 360856 363598 365863 366766 366478 366110 366503 367621 368833 369227
51272 369227 367823 364158 358895 353553 349444 346995 346026 346302 347695 350086 353307 356982 360277 362066 361732
51257 361732 359825 357605 355802 354001 351354 347745 344053 341396 340215 340020 339828 338980 337777 337220 337859
51242C37859J097J59j364k110j655o72K2J18k65p35q16m46j48k71l03M27J612
51225C32509K278K106J582J031L53k16j52K80R2r11j658j376o38j69L76J486K494
51208C39467K399J473R23J161J505J507J438J437J157N71K64N86J067J139Q77
51193C56971O99P07O83N06K46M3Q4N36J268J777J598P76j74p85j004j119j375
51176C61437j754k057k143j994j627j071m12K85R25J205P70j50n96J33J472K302
51160C56725K499K995M091M748M054K595J584J204P08j62p78o92k98k60o84j151
51144C77178j283j155j215j824k743l308l123k400j502n39L56Q32P69O16Q31J290
51128C62780J544J420J007M32J7K25R56J305O25m94r49n53o1L6J3K33P34J487
$$ plain form
51242 337859 338956 339115 337751 335641 333986 333314 333336 333454 333189 332454 331638 331192 331044 330773 330470 330897 332509
51225 332509 334787 336893 338475 339506 339859 339643 339491 339771 339863 338952 337294 335918 335280 335111 335487 336973 339467
51208 339467 341866 343339 344262 345423 346928 348435 349873 351310 352467 353038 353302 353888 354955 356094 356971
51193 356971 357670 358377 359060 359566 359812 359855 359939 360475 361743 363520 365118 365894 365720 364935 363931 362812 361437
51176 361437 359683 357626 355483 353489 351862 350791 350379 350664 351589 352794 353564 353414 352818 352951 354423 356725
51160 356725 359224 362219 366310 371058 375112 377707 379291 380495 381203 381041 380263 379571 379273 379013 378329 377178
51144 377178 375895 374740 373525 371701 368958 365650 362527 360127 358625 358086 358442 359274 360043 360659 361490 362780
51128 362780 364324 365744 366751 367183 367200 367425 368381 369686 370311 369817 368868 368315 368254 368290 368303 368536 369270 370757
51110C70757K397L051L048K636K448K569K468J966J588J792K351K756K789K529
51096D05145K140J795J502J042M11K26J006K131K260J031m14r23o45m23n37p57
51080D14990j148j981k967l278k488j032L07J050J079N49o0q2Q22K287L615M484
51064D16147N144N969P017Q173R482J1066J2839J4500J5692J5833J4051J0079
51052E45992N387K665L564P254J1587J5067J7187J7540J5920J3180J0772R039
51040F75154O856L376o60l889n924p246q093q416q873j0817j4828j9770k3696
51027E73174k5448k5052k2880j9151j4406r805o328l878j668N08K038K637K995
51014D52736L864M984N584N551N498N793O260O714P168P430P248O982P525R166
$$ plain form
51110 370757 373154 376205 379253 381889 384337 386906 389374 391340 392928 394720 397071 399827 402616 405145
51096 405145 407285 409080 410582 411624 412035 412261 413267 415398 417658 418689 418275 417352 416707 416284 415747 414990
51080 414990 413842 411861 408894 405616 403128 402096 402403 403453 404532 405081 405021 404939 405761 408048 411663 416147
51064 416147 421291 427260 434277 442450 451932 462998 475837 490337 506029 521862 535913 545992
51052 545992 551379 554044 557608 564862 576449 591516 608703 626243 642163 655343 666115 675154
51040 675154 682010 685386 684726 680837 674913 667667 659574 651158 642285 631468 616640 596870 573174
51027 573174 547726 522674 499794 480643 466237 456432 450104 446226 444558 445066 447104 449741 452736
51014 452736 456600 461584 467168 472719 478217 484010 490270 496984 504152 511582 518830 525812 533337 542503
51000E42503J1080J2308J2818J3174J3526J3494J3007J2673J3072J3893J4060
50989F85608J2817J0570Q474P313P017P234P800Q424Q475P703O743O275N905M724
50975G95082K866J695K292M545P830J1804J6206K0720K5454L0860L6659M1591
50963I97604M4994M7911N1824N6663O0997O3862O5347O5556O4179O1401N8171
50952A638509N4918N0760M4725L7253K9711K2774J6153R837M581Q20k070m791
50940A903180o937p673p479q300j1591j6730k1602k4457k4875k3591k2009k1604
50928A706332k3066k5823k8789l1456l3965l6370l8502m0549m2914m5322m6775
50917A312801m6813m6119m5349m3998m1203l7291l3585l0699k7987k4845k1735
$$ plain form
51000 542503 553583 565891 578709 591883 605409 618903 631910 644583 657655 671548 685608
50989 685608 698425 708995 717469 724782 731799 739033 746833 755257 763732 771435 778178 784453 790358 795082
50975 795082 797948 799643 801935 806480 814310 826114 842320 863040 888494 919354 956013 997604
50963 997604 1042598 1090509 1142333 1198996 1259993 1323855 1389202 1454758 1518937 1580338 1638509
50952 1638509 1693427 1744187 1788912 1826165 1855876 1878650 1894803 1904640 1909221 1910041 1907971 1903180
50940 1903180 1896243 1888570 1881091 1872791 1861200 1844470 1822868 1798411 1773536 1749945 1727936 1706332
50928 1706332 1683266 1657443 1628654 1597198 1563233 1526863 1488361 1447812 1404898 1359576 1312801
50917 1312801 1265988 1219869 1174520 1130522 1089319 1052028 1018443 987744 959757 934912 913177
50906I13177j9433j7852j6250j4310j2406j0918r808q950q409q197q063p716p079
50893G63786o210n229m408m024l913l452k321j015k64o1K54J100K265L363M165
50878G44036M453M166L801M077M994N796O212P013Q801J0845J1949J2130J2585
50865H40858J4047J6070J7981J9785K1836K4206K6767K9579L2908L7006M1995
50854A123038M7732N3798N9882O6249P3464Q1672R0477R9478J08447J16979J24492
50843B045708J30803J36195J40691J43722J44702J43505J40003J33631J23703
50834C282663J09968R2529P1845M9204K6774O410j1475k7430m1413n2377n9224
50823C447474o1689o0214n5515m8433l9828l0418k1070j3176q305p255r837j5732
$$ plain form
50906 913177 893744 875892 859642 845332 832926 822008 812200 803250 794841 786644 778581 770865 763786
50893 763786 757576 752347 747939 743915 740002 736550 734229 733214 732950 732889 733143 734243 736508 739871 744036
50878 744036 748489 752655 756456 760533 765527 771323 777535 784548 793349 804194 816143 828273 840858
50865 840858 854905 870975 888956 908741 930577 954783 981550 1011129 1044037 1081043 1123038
50854 1123038 1170770 1224568 1284450 1350699 1424163 1505835 1596312 1695790 1804237 1921216 2045708
50843 2045708 2176511 2312706 2453397 2597119 2741821 2885326 3025329 3158960 3282663
50834 3282663 3392631 3485160 3557005 3606209 3632983 3639393 3627918 3600488 3559075 3506698 3447474
50823 3447474 3385785 3325571 3270056 3221623 3181795 3151377 3130307 3117131 3108826 3101571 3091734 3076002
50811C076002k4931l7015n0524o3785p6186q7965r8892j07858j13927j17117j17852
50800B179950j16156j11820j05073r6604q7186p7526o8148n8955m9270l8898k9023
50789A341291k1302j6029j1823p270k351J941M760N819N203L333R73j164k798
50776A300583l986m894n833p131q729j0160j1208j2345j4130j6458j8723k0519
50764A166467k1817k2694k3252k3633k3798k3360k2019k0081j8215j6659j5000
50753I35939j2753r995p345n300l625j498J519M820P491R596J2091J5363J8669
50740I64972K1392K4137K7943L2879L8146M3174M7895N2226N6081N9814O3998
50729A432657O8647P3034P6313P8071P8442P7906P6785P4822P1622O7468O2942
$$ plain form
50811 3076002 3051071 3014056 2963532 2899747 2823561 2735596 2636704 2528846 2414919 2297802 2179950
50800 2179950 2063794 1951974 1846901 1750297 1663111 1585585 1517437 1458482 1409212 1370314 1341291
50789 1341291 1319989 1303960 1292137 1284867 1282516 1284457 1289217 1295036 1300239 1303572 1304545 1303381 1300583
50776 1300583 1296597 1291703 1285870 1278739 1270010 1259850 1248642 1236297 1222167 1205709 1186986 1166467
50764 1166467 1144650 1121956 1098704 1075071 1051273 1027913 1005894 985813 967598 950939 935939
50753 935939 923186 913191 905846 900546 896921 895423 896942 901762 909253 918849 930940 946303 964972
50740 964972 986364 1010501 1038444 1071323 1109469 1152643 1200538 1252764 1308845 1368659 1432657
50729 1432657 1501304 1574338 1650651 1728722 1807164 1885070 1961855 2036677 2108299 2175767 2238709
50718B238709N7510M9516L8303K5308J2104j600j6579l1475m3361n0732n4300
50707B223403n4858n2124m6129l8250l0016k1962j4283p654k733M10J765R46k298
50694A956217p686j4885k3664l3258m2390n0256n6794o1699o4030o3307o0180
50683A478068n5521m9628m2753l5509k8152k0249j1723l515L527R704J5737K1676
50671A281662K7232L2458L7258M0773M2233M1924M0510L7882L3701K8630K4018
50660A668281K0488J7736J5570J4164J3387J2806J2535J3140J4524J5634J5686
50649A833951J5119J5008J5956J7868K0522K3855K7853L2346L7029M1544M5557
50638B126608M8868N1444N3364N4573N4711N3353N0542M6894M3108L9593L6559
$$ plain form
50718 2238709 2296219 2345735 2384038 2409346 2421450 2419850 2403271 2371796 2328435 2277703 2223403
50707 2223403 2168545 2116421 2070292 2032042 2002026 1980064 1965781 1958127 1955394 1955804 1957569 1958515 1956217
50694 1956217 1948531 1933646 1909982 1876724 1834334 1784078 1727284 1665585 1601555 1538248 1478068
50683 1478068 1422547 1372919 1330166 1294657 1266505 1246256 1234533 1231018 1234545 1244249 1259986 1281662
50671 1281662 1308894 1341352 1378610 1419383 1461616 1503540 1544050 1581932 1615633 1644263 1668281
50660 1668281 1688769 1706505 1722075 1736239 1749626 1762432 1774967 1788107 1802631 1818265 1833951
50649 1833951 1849070 1864078 1880034 1897902 1918424 1942279 1970132 2002478 2039507 2081051 2126608
50638 2126608 2175476 2226920 2280284 2334857 2389568 2442921 2493463 2540357 2583465 2623058 2659617
50627B659617L3925L0884K6305J9898J2019J492j4811l8055o3407q2275q9201
50616B496391q5260p4737o0813m5348l0342j7287o069L804J1558J5984J7073J5395
50604B240349J0665K463q245j9789l1607m3883n5881o6145p4045p9628q2291q1353
50592A710610p7843p3957p0425o5992n9830n2911m6457m0425l4361k8598k3687
50581A136124j9454j5402j1536q186n507l619k745k799l222l538l674l532k727
50568A050183j120Q18K516L970N730Q300J1503J4385J6100J7154J9178K2921K7169
50555A198807L0362L2661L5291L8403M0945M2339M2799M2138L9837L6463L3496
50544A613541L1370K9233K7076K6508K8621L2588L7290M2881M9649N6603O2707
$$ plain form
50627 2659617 2693542 2724426 2750731 2770629 2782648 2784140 2769329 2731274 2667867 2585592 2496391
50616 2496391 2411131 2336394 2275581 2230233 2199891 2182604 2176535 2180339 2191897 2207881 2224954 2240349
50604 2240349 2251014 2253477 2245232 2225443 2193836 2149953 2094072 2027927 1953882 1874254 1791963 1710610
50592 1710610 1632767 1558810 1488385 1422393 1362563 1309652 1263195 1222770 1188409 1159811 1136124
50581 1136124 1116670 1101268 1089732 1081546 1076039 1072420 1069675 1066876 1063654 1060116 1056442 1052910 1050183
50568 1050183 1049063 1049881 1052397 1056367 1062097 1070397 1081900 1096285 1112385 1129539 1148717 1171638 1198807
50555 1198807 1229169 1261830 1297121 1335524 1376469 1418808 1461607 1503745 1543582 1580045 1613541
50544 1613541 1644911 1674144 1701220 1727728 1756349 1788937 1826227 1869108 1918757 1975360 2038067
50533B038067O8578P5514Q3482R1501R9459J08058J17203J25789J33161J39513
50523C080325J44732J47980J48662J46869J42599J35316J24672J10961R4467P5009
50513D351592N2591K8181L262k1261m5341o8936r1070j10018j24474j34351j40074
50502C700101j41298j36906j26522j11390r3329p3263n1328k8037m674J7325L6755
50491B987434N2343O2738O7001O4834N6136M0751J8875q266l8286o8178r5163
50480C140219j17295j33568j43700j48027j47534j43501j36921j28403j18637
50471A922633j08581r8952q9770q0696p1643o2903n4884m7922m2198l7629l3907
50460A193548l0662k7463k3786j9395j4820j0996q283o207m309k647j225M35K637
$$ plain form
50533 2038067 2106645 2182159 2265641 2357142 2456601 2564659 2681862 2807651 2940812 3080325
50523 3080325 3225057 3373037 3521699 3668568 3811167 3946483 4071155 4182116 4276583 4351592
50513 4351592 4404183 4432364 4435626 4414365 4369024 4300088 4209018 4099000 3974526 3840175 3700101
50502 3700101 3558803 3421897 3295375 3183985 3090656 3017393 2966065 2938028 2933354 2950679 2987434
50491 2987434 3039777 3102515 3169516 3234350 3290486 3331237 3350112 3341846 3303560 3235382 3140219
50480 3140219 3022924 2889356 2745656 2597629 2450095 2306594 2169673 2041270 1922633
50471 1922633 1814052 1715100 1625330 1544634 1472991 1410088 1355204 1307282 1265084 1227455 1193548
50460 1193548 1162886 1135423 1111637 1092242 1077422 1066426 1058143 1051936 1047627 1044980 1043755 1044190 1046827
50447A046827M864O379P210Q037R350J1141J3153J4895J5646J4933J2952J0155
50435A175542O722K988J4j049j44J792M077O695R383J1331J2277J3175J5131J7989
50421A275923K0704K2918K5446K9111L3679L8332M2837M7746N3517N9855O6072
50410A716140P1734P6673Q0589Q3008Q3646Q2510P9549P4614O7898O0133N2068
50399B528562M3810L4919K5020J4057K041j1192k5684m0923n5797o9063p9858
50388B365892q7679r2020r2328q8556q1493p2290o1758n0343l8525k6714j4902
50377A659284k912Q800J9012K6611L1217L2852L1367K6477J8145O785o709k1028
50365A829901l4821m7099n7168o4314o8050o8687o7162o4225o0217n5648n1293
$$ plain form
50447 1046827 1051691 1058070 1065280 1073317 1082667 1093808 1106961 1121856 1137502 1152435 1165387 1175542
50435 1175542 1182264 1185252 1185266 1184217 1184073 1185865 1189942 1196637 1206020 1217351 1229628 1242803 1257934 1275923
50421 1275923 1296627 1319545 1344991 1374102 1407781 1446113 1488950 1536696 1590213 1650068 1716140
50410 1716140 1787874 1864547 1945136 2028144 2111790 2194300 2273849 2348463 2416361 2476494 2528562
50399 2528562 2572372 2607291 2632311 2646368 2648409 2637217 2611533 2570610 2514813 2445750 2365892
50388 2365892 2278213 2186193 2093865 2005309 1923816 1851526 1789768 1739425 1700900 1674186 1659284
50377 1659284 1656372 1665172 1684184 1710795 1742012 1774864 1806231 1832708 1850853 1857638 1850929 1829901
50365 1829901 1795080 1747981 1690813 1626499 1558449 1489762 1422600 1358375 1298158 1242510 1191217
50354A191217m7527m4181m1294l9291l8010l6326l3353k9470k5568k1861j8197
50343H16139j4938j2640j1029r217o839m309j995N7J729K873L816N101O642P748
50329G83138Q199Q611R544J0776J1823J2740J4108J6382J9391K2216K3606K2807
50317I63341K0062J5959J0435K956o125j4916k1038k3161k1580j7699j3168r155
50305H85911n986l451j417l7N80O42N64O87J100J605K015K617L960N976P721Q477
50289I10964Q623Q806Q781Q005O938O605P051P623Q698J1402J5183J7603J7656
50276A043938J7434J8631J8554J2241j406j7509k9621l4825l4243l0416k5412
50265I37366k0449j5905j1681p988n443m023k707p67J175K168K482L248M770O110
$$ plain form
50354 1191217 1143690 1099509 1058215 1018924 980914 944588 911235 881765 856197 834336 816139
50343 816139 801201 788561 777532 768315 761476 757167 755172 755229 756958 759831 763647 768748 775390 783138
50329 783138 791337 799948 809492 820268 832091 844831 858939 875321 894712 916928 940534 963341
50317 963341 983403 999362 1009797 1012753 1006628 991712 970674 947513 925933 908234 895066 885911
50305 885911 879925 876474 875057 875020 875600 876242 876806 877493 878593 880198 882213 884830 888790 894766 902487 910964
50289 910964 919587 928393 937174 945179 952117 958722 965773 973396 982094 993496 1008679 1026282 1043938
50276 1043938 1061372 1080003 1098557 1110798 1109392 1091883 1062262 1027437 993194 962778 937366
50265 937366 916917 901012 889331 881343 875900 871877 869170 868403 869578 871746 874228 877476 882246 888356
50251H88356O340N487M212L199K943L519M348M698M520M424M717N066N275N788
50237I52892P017Q651J0059J1165J2486J4434J6916J9440K1346K2083K1523J9992
50225A138004J7853J5244J2329R518P281O002O081P625R685J0296Q031L328k289
50212A248988q035j4219k0883k7056l1638l4324l5269l4382l1443k6588k0369
50201I64782j3599p409k951o07K53J65j567o222j3816k2342k9090l2521l2789
50188H02287l0854k7566k3598j9822j7192j5990j5412j4328j2438j0429q931p797
50176E97930o626n597n230n488n617n026l920k876k091j317l77O00J392J974K460
50161E60191K968L626M535N579O374O675O827P530R053J0868J2213J2777J2694
$$ plain form
50251 888356 894696 900183 904395 907594 910537 914056 918404 923102 927622 932046 936763 941829 947104 952892
50237 952892 959909 968560 978619 989784 1002270 1016704 1033620 1053060 1074406 1096489 1118012 1138004
50225 1138004 1155857 1171101 1183430 1192948 1200229 1206231 1212312 1219937 1229622 1239918 1247949 1251277 1248988
50212 1248988 1240953 1226734 1205851 1178795 1147157 1112833 1077564 1043182 1011739 985151 964782
50201 964782 951183 943774 940823 940216 940469 940634 939067 932845 919029 896687 867597 835076 802287
50188 802287 771433 743867 720269 700447 683255 667265 651853 637525 625087 614658 605727 597930
50176 597930 591304 585707 580477 574989 569372 564346 560426 557550 555459 554142 553765 554365 555757 557731 560191
50161 560191 563159 566785 571320 576899 583273 589948 596775 604305 613358 624226 636439 649216 661910
50148F61910J2116J1053R510P559N376L323J787O81o27k522m523n708n604m316
50134F90015k160L58K549M245O226R083J1855J2864J2028J1295J2320J4701J7046
50121H02425J8920K0935K3608K6978L0976L5362L9585M3346M7020N0905N4422
50110A194482N6645N7324N6650N4473N0700M6297M2984M1693M1996M2858M3231
50099A729333M1891L7703L0360K0323P959o515k2070l6679m8531n6966o1998o3755
50087A571055o2789o0254n7086n3304m8605m3265l7947l2989k8473k4688k1934
50076A099721k0052j8770j8355j9259k1119k2761k3342k3048k2384k1401j9886
50065H69344j7946j5893j3758j1409r095p408o593o241n863n410n046m639l857
$$ plain form
50148 661910 674026 685079 694589 702148 707524 710847 712634 713315 712688 710166 705643 699935 694331 690015
50134 690015 687855 688213 690762 695007 701233 710316 722171 735035 747063 758358 770678 785379 802425
50121 802425 821345 842280 865888 892866 923842 959204 998789 1042135 1089155 1140060 1194482
50110 1194482 1251127 1308451 1365101 1419574 1470274 1516571 1559555 1601248 1643244 1686102 1729333
50099 1729333 1771224 1808927 1839287 1859610 1867569 1861054 1838984 1802305 1753774 1696808 1634810 1571055
50087 1571055 1508266 1448012 1390926 1337622 1289017 1245752 1207805 1174816 1146343 1121655 1099721
50076 1099721 1079669 1060899 1042544 1023285 1002166 979405 956063 933015 910631 889230 869344
50065 869344 851398 835505 821747 810338 801243 793835 787242 781001 775138 769728 764682 760043 756186
50052G56186k629j193K39J559K649L499M404N595O680P019O761O827P620Q316
50038H13532P957O710N468M583L763K885K183J622Q33k41j133j379q73K01J299
50023H47410J523M06j322k410k530k399k496k572k575k962l585l372j947p83j609
50008H18777m179o488p060o024m218k200l10J321L233O498J1686J8181K4754L0537
49994H84508L5376L9603M3518M6791M8316M7034M3016L7472L1646K6133K1240
49983A304653J7443J5021J3578J2203R934O018O5p678j6456k5669l5244m5002
49971A248866n3800n9758o1579n9607n5474n0688m5655m0070l4134k8865k5020
49960G34216k2137j9113j5571j2058r101o755n020l818k432R9L568O420P700Q402
$$ plain form
50052 756186 753557 752364 752603 754162 756811 760310 764714 770309 776989 784008 790769 797596 805216 813532
50038 813532 821489 828199 833667 838250 842013 844898 847081 848703 849536 849295 848162 846783 845910 846111 847410
50023 847410 848933 849339 848017 845607 843077 840678 838182 835610 833035 830073 826488 823116 821169 820386 818777
50008 818777 814598 808110 801050 795026 790808 788608 788298 789619 792852 799350 811036 829217 853971 884508
49994 884508 919884 959487 1003005 1049796 1098112 1145146 1188162 1225634 1257280 1283413 1304653
49983 1304653 1322096 1337117 1350695 1362898 1372832 1378850 1378915 1371237 1354781 1329112 1293868 1248866
49971 1248866 1195066 1135308 1073729 1014122 958648 907960 862305 822235 788101 759236 734216
49960 734216 712079 692966 677395 665337 656236 649481 644461 640643 638211 638310 641878 648298 655998 664400
49946F64400J0028J2378J3865J3684J2528J1189R583P482N237L319J756L66r75
49933G64840k614n209r060j3687j8199k1754k3592k3308k1387j9032j6939j4725
49921E75334j1774q256m964k509r87j02O93J746K681K717J801Q93Q74J735L071
49906E62953M672O206P102P340P690Q559R353R725J0533J2512J4790J5940J5914
49893F93289J5542J4620J2149Q332M659J873o08l007m571n268o539r327j2595
49880G08549j4730j5565j6030j6634j7276j7889j8246j7690j5933j3727j1865
49869E32964j0032p528m745k851k155j679m82J347L105M335N102N771O632P627
49855E37411Q523R402J0565J1922J2940J3480J4076J5034J5793J5636J4391J2110
$$ plain form
49946 664400 674428 686806 700671 714355 726883 738072 747655 755137 760374 763693 765449 765815 764840
49933 764840 762226 757017 747957 734270 716071 694317 670725 647417 626030 606998 590059 575334
49921 575334 563560 555304 550340 547831 546844 546742 547435 549181 551862 554579 556380 557273 558147 559882 562953
49906 562953 567625 573831 580933 588273 595963 604522 613875 623600 634133 646645 661435 677375 693289
49893 693289 708831 723451 735600 743932 748591 750464 749856 746849 742278 737010 730471 721144 708549
49880 708549 693819 678254 662224 645590 628314 610425 592179 574489 558556 544829 532964
49869 532964 522932 515404 510659 507808 505653 503974 503492 504839 507944 512279 517381 523152 529784 537411
49855 537411 545934 555336 565901 577823 590763 604243 618319 633353 649146 664782 679173 691283
49843F91283Q744M792J506l15j286k452l945n405p035r162j1222j2334j2598j2704
$$ plain form
49843 691283 700027 704819 706325 706010 704724 702272 698327 692922 685887 676725 665503 653169 640571 627867
$$ [...]
##END NTUPLES=NMR SPECTRUM
##END=
