
##TITLE=AC1231_PUEHDE124_6075312_jV922I8Z65
##JCAMPDX= 6.0         $$ Bruker NMR JCAMP-DX V2.0
##DATA TYPE= NMR SPECTRUM
##DATA CLASS= NTUPLES
##ORIGIN= BRUKER
##OWNER= Administrator
$$ 1.72 TOPSPIN		Version 2.1
$$ 2012-05-08 01:01:16.515 -0500  Administrator@TOPSPIN
$$ Compression mode = diff/dup
##.OBSERVE FREQUENCY= 400.13188235
##.OBSERVE NUCLEUS= ^1H
##.ACQUISITION MODE= SIMULTANEOUS (DQD)
##.ACQUISITION SCHEME= undefined
##.AVERAGES= 8
##.DIGITISER RES= 22
##SPECTROMETER/DATA SYSTEM= spect
##.PULSE SEQUENCE= zg30
##.SOLVENT NAME= COFFEE_meoh
##.SHIFT REFERENCE= INTERNAL, COFFEE_meoh, 1, 14.98061
##AUDIT TRAIL= $$ (NUMBER, WHEN, WHO, WHERE, PROCESS, VERSION, WHAT)
$$ ##TITLE= Audit trail, TOPSPIN		Version 2.1
$$ ##JCAMPDX= 5.01
$$ ##ORIGIN= Bruker BioSpin GmbH
$$ ##OWNER= Administrator
$$ $$ C:\Bruker\TOPSPIN/data/COFFEE/nmr/AC1231_PUEHDE124_6075312_jV922I8Z65/10/pdata/1/auditp.txt
$$ ##AUDIT TRAIL=  $$ (NUMBER, WHEN, WHO, WHERE, PROCESS, VERSION, WHAT)
(   1,<2012-05-08 01:01:08.218 -0500>,<Administrator>,<TOPSPIN>,<go>,<TOPSPIN 2.1>,
      <created by zg
	started at 2012-05-08 01:00:01.578 -0500,
	POWCHK enabled, PULCHK disabled,
       configuration hash MD5:
       AF F2 23 6B 01 CD 40 DD E5 A1 38 A0 06 EA F7 77
       data hash MD5: 64K
       C7 1F 0E 14 56 82 F6 B7 55 C4 F0 ED 69 8C 66 EB>)
(   2,<2012-05-08 01:01:12.078 -0500>,<Administrator>,<TOPSPIN>,<proc1d>,<TOPSPIN 2.1>,
      <Start of raw data processing
       efp LB = 0 FT_mod = 6 PKNL = 1 PHC0 = 0 PHC1 = 0 SI = 32K 
       data hash MD5: 32K
       3F 7E BD CA 74 06 2F C7 E5 C5 B9 BA BB BB 7D F1>)
(   3,<2012-05-08 01:01:12.593 -0500>,<Administrator>,<TOPSPIN>,<proc1d>,<TOPSPIN 2.1>,
      <pk PHC0 = 213.2336 PHC1 = 0 
       data hash MD5: 32K
       6B B7 EC 4D 23 E3 20 02 72 45 17 1F 94 C2 CF A8>)
(   4,<2012-05-08 01:01:12.687 -0500>,<Administrator>,<TOPSPIN>,<proc1d>,<TOPSPIN 2.1>,
      <abs ABSG = 1 
       data hash MD5: 32K
       FF F7 DD 3C 0A DD AD EF E4 CD FA 2E ED A9 95 38>)
(   5,<2012-05-08 01:01:12.703 -0500>,<Administrator>,<TOPSPIN>,<proc1d>,<TOPSPIN 2.1>,
      <abs ABSG = 2 
       data hash MD5: 32K
       AD A3 FF 6B FD 95 AB 7B DA 41 C4 A2 B7 0B 95 9A>)
(   6,<2012-05-08 01:01:12.734 -0500>,<Administrator>,<TOPSPIN>,<proc1d>,<TOPSPIN 2.1>,
      <abs ABSG = 3 
       data hash MD5: 32K
       1A F3 69 1C D6 F5 8A D9 3E 97 8D 80 CD B0 2F AD>)
(   7,<2012-05-08 01:01:12.796 -0500>,<Administrator>,<TOPSPIN>,<proc1d>,<TOPSPIN 2.1>,
      <abs ABSG = 4 
       data hash MD5: 32K
       4B 4F 00 29 A5 19 17 03 04 56 35 25 2A 7A B8 22>)
(   8,<2012-05-08 01:01:12.828 -0500>,<Administrator>,<TOPSPIN>,<proc1d>,<TOPSPIN 2.1>,
      <abs ABSG = 5 
       data hash MD5: 32K
       35 98 6B 84 8C 95 C2 FD A5 DF 17 FF 08 AE 2B 59>)
$$ ##END=
$$ 
$$ $$ hash MD5
$$ $$ BF C6 5D 82 F4 EE 4E 19 50 71 A8 43 C4 A7 FC 46
##$RELAX= 
##$RELAX= 
##$RELAX= 
##$RELAX= 
##$RELAX= 
##$RELAX= 
##$RELAX= 
$$ Bruker specific parameters
$$ --------------------------
$$ [...]
150 150 150 150 150 150 150 150
##$TP07= 0
##$TPNAME0= <>
##$TPNAME1= <>
##$TPNAME2= <>
##$TPNAME3= <>
##$TPNAME4= <>
##$TPNAME5= <>
##$TPNAME6= <>
##$TPNAME7= <>
##$TPOAL= (0..7)
0.5 0.5 0.5 0.5 0.5 0.5 0.5 0.5
##$TPOFFS= (0..7)
0 0 0 0 0 0 0 0
##$TUNHIN= 0
##$TUNHOUT= 0
##$TUNXOUT= 0
##$USERA1= <user>
##$USERA2= <user>
##$USERA3= <user>
##$USERA4= <user>
##$USERA5= <user>
##$V9= 5
##$VALIST= <valist>
##$VCLIST= <CCCCCCCCCCCCCCC>
##$VD= 0
##$VDLIST= <DDDDDDDDDDDDDDD>
##$VPLIST= <PPPPPPPPPPPPPPP>
##$VTLIST= <TTTTTTTTTTTTTTT>
##$WBST= 1024
##$WBSW= 4
##$XGAIN= (0..3)
0 0 0 0
##$XL= 0
##$YL= 0
##$YMAX_a= 528505
##$YMIN_a= -626774
##$ZGOPTNS= <>
##$ZL1= 120
##$ZL2= 120
##$ZL3= 120
##$ZL4= 120
##$ABSF1= 14.98061
##$ABSF2= -5.57192
##$ABSG= 5
##$ABSL= 3
##$ALPHA= 0
##$AQORDER= 0
##$ASSFAC= 0
##$ASSFACI= 0
##$ASSFACX= 0
##$ASSWID= 0
##$AUNMP= <proc_prof1d_extract_pilot.lims>
##$AXLEFT= 0
##$AXNAME= <>
##$AXNUC= <1H>
##$AXRIGHT= 0
##$AXTYPE= 0
##$AXUNIT= <>
##$AZFE= 0.1
##$AZFW= 0.1
##$BCFW= 0
##$BC_mod= 0
##$BYTORDP= 0
##$COROFFS= 0
##$CY= 15
##$DATMOD= 1
##$DC= 0
##$DFILT= <>
##$DTYPP= 0
##$F1P= 0
##$F2P= 0
##$FCOR= 0.5
##$FTSIZE= 32768
##$FT_mod= 6
##$GAMMA= 0
##$GB= 0
##$INTBC= 1
##$INTSCL= 1
##$ISEN= 128
##$LB= 0
##$LEV0= 0
##$LPBIN= 0
##$MAXI= 10000
##$MC2= 0
##$MEAN= 0
##$ME_mod= 0
##$MI= 0
##$NCOEF= 0
##$NC_proc= -8
##$NLEV= 6
##$NOISF1= 0
##$NOISF2= 0
##$NSP= 0
##$NTH_PI= 0
##$NZP= 0
##$OFFSET= 14.98061
##$PC= 1
##$PHC0= 213.2336
##$PHC1= 0
##$PH_mod= 1
##$PKNL= yes
##$PPARMOD= 0
##$PPDIAG= 0
##$PPIPTYP= 0
##$PPMPNUM= 2147483647
##$PPRESOL= 1
##$PSCAL= 4
##$PSIGN= 0
##$PYNMP= <proc.py>
##$REVERSE= no
##$SF= 400.13
##$SI= 32768
##$SIGF1= 0
##$SIGF2= 0
##$SINO= 400
##$SIOLD= 32768
##$SPECTYP= <>
##$SREGLST= <1H.CDCl3>
##$SSB= 0
##$STSI= 32768
##$STSR= 0
##$SW_p= 8223.68421052632
##$SYMM= 0
##$S_DEV= 0
##$TDeff= 65536
##$TDoff= 0
##$TI= <>
##$TILT= no
##$TM1= 0
##$TM2= 0
##$TOPLEV= 0
##$USERP1= <user>
##$USERP2= <user>
##$USERP3= <user>
##$USERP4= <user>
##$USERP5= <user>
##$WDW= 1
##$XDIM= 32768
##$YMAX_p= 463425033
##$YMIN_p= -670529
##$CURPLOT= <Network HP LaserJet P1505>
##$CURPRIN= <$Network HP LaserJet P1505>
##$DFORMAT= <normdp>
##$LAYOUT= <+/1D_H.xwp>
##$LFORMAT= <normlp>
##$PFORMAT= <normpl>
##$SURQMSG= 1
$$ End of Bruker specific parameters
$$ ---------------------------------
##NTUPLES= NMR SPECTRUM
##VAR_NAME=  FREQUENCY,     SPECTRUM/REAL,   SPECTRUM/IMAG
##SYMBOL=    X,             R,               I
##VAR_TYPE=  INDEPENDENT,   DEPENDENT,       DEPENDENT
##VAR_FORM=  AFFN,          ASDF,            ASDF
##VAR_DIM=   32768,         32768,           32768
##UNITS=     HZ,            ARBITRARY UNITS, ARBITRARY UNITS
##FACTOR=    0.250966925370066, 1,           1
##FIRST=     8223.43324360095, 79396,        -179261
##LAST=      0,             54187,           -145867
##MIN=       0,             -670529,         0
##MAX=       8223.43324360095, 463425033,    0
$$ Real data points
##PAGE= N=1
##DATA TABLE= (X++(R..R)), XYDATA
$$ [...]
19549b11505g5542G7251C5751a04478G3410g0685C0546M7120a45783N600D6887
19537b6163B31414b04686C9964O7186c19799i9042A56989b47199d826j94176q6474
19526b85476i5501b5131A22671a68939G1533b16729g0586m56464B01396B2747
19515a25181J7424A29282d7841j50371A6327c44167c570n07988K54417A28842
19504a7444e13n95861B09345a0593A63568a04744k7871G6839c6636A7551a21997
19492F4942e4489A51b4570j83033g4345b1690J0734A53228g4001A59327J29266
19481B88593c1072j30757j85791m4453B05088I4485K7293f6591j7655A11295a8287
19469a09472H2676O4587m7455a19483M2901m5595j01550L6073h5180j09826g8558
$$ plain form
19549 -211505 -75542 77251 35751 -104478 73410 -70685 30546 77666 -145783 -140183 46887
19537 -26163 231414 -204686 39964 107150 -319799 -99042 156989 -247199 -4826 -199002 -285476
19526 -285476 -95501 -25131 122671 -168939 71533 -216729 -70586 -527050 201396 22747
19515 -125181 -107757 129282 -47841 -198212 16327 -344167 -3570 -511558 -257141 128842
19504 -17444 -513 -596374 209345 -10593 163568 -104744 -132615 76839 -36636 17551 -121997
19492 64942 -54489 151 -24570 -207603 -74345 -21690 -10956 153228 -74001 159327 288593
19481 288593 -31072 -161829 -347620 -392073 205088 94485 121778 -66591 -84246 111295 -18287
19469 -109472 82676 147263 99808 -119483 -76582 -122177 -223727 -187654 -85180 -195006 -78558
19457F1826j3825c21886k8277a47090n552e1585j09981A6639J51235f9435J8498
19446e0937C4793b36607d2338j57575D53140a45736E4858f6318B91747b19812
19435c07368o709E3772J0768a06251B21419j08389h2090j15352i2815l6046B0854
19423b94125a20204J9997C8236k335b30536g2847F2544b11125e9724a8561B24219
19411a37460J099G3908k6471B3223e34368H7632i4261A42752L6420b21505B04214
19399b84556R3896j41196a46323A86431q6938a76601Q415l3195B02310n1323b85913
19387b64804c0153H1955a25454C45617C0020r068a43239A6983a73459r3689B0120
19375D2409c19507F0753n800a22703N0569A13524a53879e6295G1823R3801e08
$$ plain form
19457 61826 48001 -321886 -350163 -147090 -152642 -51585 -161566 16639 167874 -69435 -50937
19446 -50937 34793 -236607 -42338 -199913 453140 -145736 54858 -66318 291747 -219812
19435 -307368 -314077 53772 64540 -106251 221419 113030 -82090 -197442 -92815 -128861 20854
19423 -294125 -120204 -100207 38236 35901 -230536 -72847 62544 -211125 -59724 -18561 224219
19411 -137460 -136361 73908 47437 23223 -534368 87632 -94261 142752 179172 -221505 204214
19399 -284556 -190660 -331856 -146323 186431 99493 -176601 -168186 -201381 202310 150987 -285913
19387 -264804 -30153 81955 -125454 345617 30020 20952 -143239 16983 -173459 -267148 20120
19375 42409 -319507 60753 54953 -122703 -72134 113524 -153879 -56295 71823 165624 -508
19363A89028a97840l466A84058a77733A49051m3868k4321i3798H7253b64301O0045
19352b04256G5384f6748n3291D2635I630a50235l8452J7510Q09l01920C73709
19340a15051E5449h2351D3626e7007A2117B200J66600b06668h8488A3486c20456
19328b95635R2806A70737b25723R2014B525L06395A07511h5313j7682m6097A0571
19316b18811j41926A90496c00768J9297I9841a00103p5050B08905o9690f6395
19305H6875A2702a24410k75726a92986n2915G1565J1536a21929c0307A4329d8
19293H7118d19100A58259k2381B5087a94316F554N0658B3224i0554A14517a42242
19281F6315J96984c28050o1316d4099j59961j960E917J94687N65c50053i4037
$$ plain form
19363 189028 -197840 -201306 184058 -177733 149051 105183 80862 -93798 87253 -264301 -204256
19352 -204256 75384 -66748 -120039 42635 9630 -150235 -188687 -171177 -170368 -472288 373709
19340 -115051 55449 -82351 43626 -57007 12117 2200 168800 -206668 -88488 13486 -320456
19328 -295635 -202829 170737 -225723 -133709 2525 308920 107511 -85313 -102995 -149092 10571
19316 -218811 -360737 190496 -300768 -281471 99841 -100103 -175153 208905 139215 -66395
19305 86875 12702 -124410 -400136 -192986 -245901 71565 83101 -121929 -30307 14329 -48
19293 87118 -419100 158259 135878 25087 -194316 6554 57212 23224 -90554 114517 -142242
19281 66315 263299 -328050 -389366 -44099 -204060 -206020 5917 200604 201169 -350053 -94037
19269A04133h0084p2556A66159d01741i2167q374j98398D51R5007c2071c158B40394
19256h5227m4631B3747a32969j5452N3494A0045e4010A8411c6258o5429C96566
19244i6166A16966A7151e7969B02268b44171i7104H5318j7149B0048f7647G5216
19232a36004p4426I9177C7929a07389j17336R5438A56941d0314B1165K52229D1921
19220A35249f9943A12108a03237C03434b15656h8817f512l1898j18960B9800a40418
19208C7891a84715m9421j0517a19603m0024E5874a1813l18174D4273O1138b71454
19196d41152H0508l7896h5102j83180D4835j8523a95155E3988O5366B452b40451
19184e9331j21876B34043a67891D6026R3509c5331q2391A08070b77078B9782J18743
$$ plain form
19269 104133 -80084 -152640 166159 -401741 -92167 -100541 -298939 451 95458 -32071 -3158 240394
19256 -85227 -129858 23747 -132969 -148421 -94927 10045 -54010 18411 -36258 -101687 396566
19244 -96166 116966 17151 -57969 202268 -244171 -97104 85318 68169 20048 -67647 75216
19232 -136004 -210430 99177 37929 -107389 -224725 -129287 156941 -40314 21165 273394 41921
19220 135249 -69943 112108 -103237 303434 -215656 -88817 -6512 -38410 -157370 29800 -140418
19208 37891 -184715 -234136 -244653 -119603 -159627 55874 -11813 -329987 44273 105411 -271454
19196 -441152 80508 42612 -85102 -268282 44835 26312 -195155 53988 119354 2452 -240451
19184 -59331 -181207 234043 -167891 46026 139535 -35331 -117722 108070 -277078 29782 148525
19173A48525a27572j571b3049j82778R1781r4816H7943d497F4646a30706F4342
19161c24335a23971n0931e1292B8332R0187i2952I7809c96178A83063c37051D63671
19149e5887B3221h8174e703C7164j0344a73716G9019J32957a99282D7371f5427
19137B98790a76310P8544j19562L0734E9807a0695l50445P5060f3004D69286A72765
19125d7777A1777J34087j8992f4667A00890c51569c9670A4459a94621A28858n1862
19114G6996b61443F7271J08050o3967J30376g030A13596K1118C1097g1204P722
19103f3482l65308a18968A71580o0357d2698p0621M5979m9433c3891m3774j27267
19092b04932a00097j39589J03955r0575a3164j81999J3064B09474f1172j40907
$$ plain form
19173 148525 -127572 -129143 -23049 -205827 -114046 -208862 87943 -4497 64646 -130706 64342
19161 -324335 -123971 -174902 -51292 28332 118519 -92952 97809 -396178 183063 -337051 463671
19149 -55887 23221 -88174 -5703 37164 26820 -173716 79019 211976 -199282 47371 -65427
19137 298790 -176310 -97766 -217328 -186594 59807 -10695 -361140 -286080 -63004 469286 172765
19125 -47777 11777 145864 126872 -64667 100890 -351569 -39670 14459 -194621 128858 76996
19114 76996 -261443 67271 175321 111354 241730 -7030 113596 134714 31097 -71204 -63482
19103 -63482 -428790 -118968 171580 111223 -42698 -113319 -67340 -116773 -33891 -77665 -204932
19092 -204932 -100097 -239686 -135731 -226306 -13164 -195163 -182099 209474 -61172 -202079
19082b02079A87200c84728a38230Q782B82830A4507N666b71969B7503b76230d2852
19070B5398b13918E5920a91386m7336l047k07667J66737A28555e0987A2677d1921
19058c95911F2697f2150J7124j26223B2610b12785i1756m7953k8343I137b80206
19046A56430K8842q4717D5069a78259k02665a9671Q541A87425m4214a52320B69287
19034B05952a33822A9048h148j41664c9920j0566B7666L02799b1546j35608B58822
19022A60070b13578j51364A99100J1442a01897q8048g2856C15073A51252a03826
19011c04832a27158o2860A09516j6300N0714g7393I5147b51949i6305C95366a61738
18999i5663B0168h3137G3844J05875a84265l0220j91308h4061A5384L67412a12281
$$ plain form
19082 -202079 187200 -384728 -138230 -129448 282830 14507 20173 -271969 27503 -276230 -42852
19070 25398 -213918 55920 -191386 -238722 -241769 -449436 -282699 128555 -50987 12677 -41921
19058 -395911 62697 -62150 -45026 -171249 22610 -212785 -91756 -139709 -168052 9137 -280206
19046 156430 185272 100555 45069 -178259 -380924 -19671 -11130 187425 143211 -152320 269287
19034 205952 -133822 19048 -8148 -149812 -39920 -50486 27666 330465 -21546 -157154 258822
19022 160070 -213578 -364942 199100 210542 -101897 -189945 -72856 315073 151252 -103826
19011 -304832 -127158 -190018 109516 93216 143930 -77393 95147 -251949 -96305 395366 -161738
18999 -95663 20168 -83137 73844 179719 -184265 -214485 -405793 -84061 15384 382796 -112281
18987c9742j45574j619p8280Q4673d8653C382L2382d2473e520m9793b2167E2819
18974a3805k59183A45280f9677b7638l68466H345Q9630b50138h1367H1962O8446
18963A50408C4782b86489E9577J77540c10257O6046i6949F5755b80319I2604K18198
18952C10802g9727A02574J70509a5988j68947d9547C0029h8251q8248b1295D8504
18940b05683k2425I6896M480L6443b43144m1692E363b93217A9025a81834J5793
18929a66041r9279A10135a30018a2231B00422r1597a61650G921c8127A3524a40084
18917d25029J74887F3990K44287b06917E4158K21611q1334a37868M4585A20417
18906a84015H989C89J27193a03695D2165a37213A17258H726b39874J8893a04010
$$ plain form
18987 -39742 -185316 -186935 -265215 -180542 -48653 3382 35764 -42473 -5520 -55313 -22167 52819
18974 -13805 -272988 145280 -69677 -27638 -396104 8345 97975 -250138 -81367 81962 150408
18963 150408 34782 -286489 59577 237117 -310257 -244211 -96949 65755 -280319 92604 310802
18952 310802 -79727 102574 273083 -15988 -184935 -49547 30029 -88251 -176499 -21295 48504
18940 -205683 -228108 96896 101376 137819 -243144 -284836 5363 -293217 19025 -181834 -166041
18929 -166041 -265320 110135 -130018 -12231 200422 108825 -161650 7921 -38127 13524 -140084
18917 -425029 -250142 63990 308277 -206917 54158 275769 194435 -137868 -93283 120417
18906 -184015 8989 389 127582 -103695 42165 -137213 117258 8726 -239874 -220981 -104010
18894b93135b3259L098k69845E4390J60939e25125a06320C26823b05702i373k72703
18883b82076e0513F9697j5924b0656A24685b94005a17748N7164A66808a7856l74761
18872c92617g1921B44131h3008a5663j1937A10340d32055c3307j72699A14337
18861a14061k04740e0243A3143j097b49011a09454A82782f665H459h7815j17275
18850b05090A01113P097b24378A78418i3012N502j68566D2221K15531c00559B66749
18838a40338N4624A3386g771j9298j65259q1842a11620k7610n2467H9748M0207
18827A29955o1264N2778b16926m6018F1621a14541o6430A4774a5728A14229l0657
18816H3572J27033g9484c0364l29824A13723P8171E6437b39292D8140M1766J6821
$$ plain form
18894 -293135 -23259 -20161 -290006 54390 215329 -525125 -106320 326823 -205702 -9373 -282076
18883 -282076 -50513 69697 53773 -20656 124685 -294005 -117748 -60584 166808 -17856 -392617
18872 -392617 -71921 244131 -83008 -15663 -27600 110340 -432055 -33307 -206006 114337
18861 -114061 -318801 -50243 13143 12046 -249011 -109454 182782 -6665 8459 -87815 -205090
18850 -205090 101113 108210 -224378 178418 -93012 -87510 -256076 42221 257752 -300559 266749
18838 -140338 -85714 13386 -7771 -27069 -192328 -274170 -111620 -139230 -191697 89748 129955
18827 129955 68691 121469 -216926 -262944 61621 -114541 -180971 14774 -15728 114229 83572
18816 83572 210605 -79484 -30364 -360188 113723 191894 56437 -239292 48140 89906 106727
18805A06727b0432G8173I674J73590H2517K61060I0930b49354G4561a60208L736
18794a56472M8695j14247F4083b80261B17179b81395B46814b73076h3253j4212
18784i7465f126A94873a75862P028j08254Q3968l7544H5505a24135H5607a30775
18772A34262b29071E7317b84205J05198L5908K8299e4459A2898L21763A08884
18761B37156j02020j0843a41995F6486P3333P9557i3965j47376I077J46271h1524
18749b07546p6737C8983P4800h0328A95133a67733A79811f3802b1556p2815F5797
18737B19518O8329c66750J33537j28563c3356k07134C40828A46756a94264A47621
18726a66401m1740O3838A31929b65192a00740A53884m7442m4669A7849K32053
$$ plain form
18805 106727 -20432 78173 9674 183264 82517 343577 90930 -249354 74561 -160208 -156472
18794 -156472 -107777 -222024 64083 -280261 217179 -281395 246814 -273076 -83253 -97465
18784 -97465 -6126 194873 -175862 -168834 -277088 -193120 -230664 85505 -124135 85607 -130775
18772 134262 -229071 57317 -284205 -179007 -143099 -114800 -54459 12898 334661 108884
18761 237156 135136 124293 -141995 66486 139819 219376 -93965 -241341 9077 155348 -81524
18749 -207546 -284283 38983 113783 -80328 195133 -167733 179811 -63802 -21556 -94371 65797
18737 219518 287847 -366750 -233213 -361776 -33356 -240490 340828 146756 -194264 147621
18726 -166401 -208141 -144303 131929 -265192 -100740 153884 106442 61773 17849 249902
18716B49902a64444L9177G4155c68184B5789b13577p0368A52238a92424P6599
18706a15825n3552H28J01434a70352A26259a60260A5J81891b27881P226F9122
18694b88777B52273d29826e3093k32922J38458M2573A39805a56958A2249M4982
18684E7231a85414m9539j74049E4592a16769J6718d8375A98335a55695m0186O3423
18673a32458B726g3920B09236I5210c5524n6564C4874a26995j29861E2345A0019
18661b81270J25223D2368Q1160C4652J54042b11870K3596M1124o1976f8025j30055
18650a98080F6267b14615j37468A8859k62a92856m4252e851q3616r1524E7170
18638A68452a46865B43619L3001F5907e6666l43040N5037F42098A59333c32492
$$ plain form
18716 249902 -164444 -125267 74155 -368184 25789 -213577 -283945 152238 -192424 -115825
18706 -115825 -169377 828 102262 -170352 126259 -160260 15 181906 -227881 -220655 69122
18694 -288777 252273 -429826 -53093 -286015 -147557 -104984 139805 -156958 12249 57231
18684 57231 -185414 -234953 -409002 54592 -116769 -100051 -48375 198335 -155695 -195881 -132458
18673 -132458 2726 -73920 209236 95210 -35524 -92088 34874 -126995 -256856 52345 10019
18661 -281270 -156047 42368 123528 34652 188694 -211870 -188274 -147150 -209126 -68025 -198080
18650 -198080 66267 -214615 -352083 18859 18597 -192856 -237108 -5851 -89467 -180991 57170
18638 168452 -146865 243619 276620 65907 -56666 -399706 -344669 642098 159333 -332492
18627A13844a93727c60A01966i7314D48706A95477m4114F1671K02604A20132d3904
18615d5533C5282b95792F3756c33703a2598N481q261n7247J0079l86H8658A7168
18602a88232F5225c9362F9279b60741J10734c3508C1O4148a49879d29l5620j08460
18590a44509B2888b16107f5693I1252R7514b06763k448F9298m820K00891a06220
18578F4766E855K76877I9791L9157f1389k86160c0848q5835j5715k4651d9148
18566g508j36573J9055L647o8059j53669P6235h6905D9163a17636M2885d326l03339
18554c07665R0127J01496r2849c5457n0007C53714A28424g5929B56657r5440a83706
18542d9917p1723G4058C4860b46472L2923H1085f0735G2301a95686D7573c21053
$$ plain form
18627 113844 -193727 -360 101966 -97314 448706 195477 151363 61671 264275 120132 -43904
18615 -45533 35282 -295792 63756 -333703 -12598 -7117 -15378 -72625 -62546 -62932 88658 17168
18602 -188232 65225 -39362 69279 -260741 -150007 -33508 31 64179 -149879 -429 -36049 -144509
18590 -144509 22888 -216107 -65693 91252 188766 -206763 -209211 69298 64478 265369 -106220
18578 64766 5855 282732 99791 138948 -61389 -347549 -30848 -116683 -132398 -157049 -49148
18566 -7508 -144081 -125026 -121379 -189438 -343107 -266872 -86905 49163 -117636 -74751 -4326 -307665
18554 -307665 -217538 -116042 -208891 -35457 -85464 353714 128424 -75929 256657 161217 -183706
18542 -49917 -121640 74058 34860 -246472 -213549 81085 -60735 72301 -195686 47573 -321053
18530C3518A2932K32526a70838A41177l5819b90142j5752a6265k4012A03055K2492
18519A25547a91565h3687c3670J4452j43526j51847H2107d6774a1441A54986h5759
18507f8194m15178a30057n3901J31C14713o8043g2983L2619j94138B25871i6537
18495A4303g4088A50625k8268a6227l15016A101J1276J89940d9998A25135K38811
18484C63946g8595A04329a01318d8955I3432J67909q6698n3413a00816j04173
18474b04989I3295A3119i8549D455P3611b38449A09566a24583j93152A22652a57567
18462a59149P7884I4941a03234H1264c35364a07975d8471o6049A26122A1240a94470
18450a01534C14348a08063A8673a43588k02343B74030H2124a7543j07427G4615
$$ plain form
18530 33518 12932 245458 -170838 141177 105358 -290142 -305894 -16265 -40277 103055 125547
18519 125547 -191565 -83687 -33670 -19218 -162744 -314591 82107 -46774 -11441 154986 -85759
18507 -68194 -483372 -130057 -183958 -183827 314713 246670 -72983 -40364 -234502 225871 -96537
18495 14303 -74088 150625 122357 -16227 -331243 1101 12377 202317 -49998 125135 363946
18484 363946 -78595 104329 -101318 -48955 93432 261341 174643 121230 -100816 -204989
18474 -204989 93295 13119 -98549 4455 78066 -238449 109566 -124583 -317735 122652 -157567
18462 -159149 -81265 94941 -103234 81264 -335364 -107975 -48471 -114520 126122 11240 -194470
18450 -101534 314348 -108063 18673 -143588 -345931 274030 82124 -17543 -124970 74615
18439c10579R5715B54228b42272c1771C0717a04327D9612A2255b29661J01902
18429a27759F2981e2353J3612k2054n7565j50769D0940M8188I353c86950J44763
18418b42187P7568a278j81098b2202m3689C70732b17953j03395b5614j60093A6399
18406B98621a34374o9843N2933B31787a00239b9931a1951A00601a17073A20895
18395A714a37963I5819D3387J14040h3909a2954B34400b30705J03033J267n4616
18384a81021P1657c0950q1620j12197D3861J72232I1975a15185D572b00608A48192
18372A25730N511b49281A34356b38691A74264a40097n614B26718E6488c99936
18361A11306f7499E8660d11922J37178A5297a9883B85833l1459J30867a34035
$$ plain form
18439 -310579 -214864 254228 -242272 -31771 30717 -104327 49612 12255 -229661 -127759
18429 -127759 62981 -52353 -38741 -60795 -118360 -269129 40940 89128 9353 -386950 -242187
18418 -242187 -164619 -1278 -182376 -22202 -65891 370732 -217953 -321348 -25614 -185707 16399
18406 298621 -134374 -204217 -151284 231787 -100239 -29931 -11951 100601 -117073 120895
18395 1714 -137963 95819 43387 157427 -83909 -12954 234400 -230705 -127672 -126405 -181021
18384 -181021 -109364 -30950 -112570 -224767 43861 216093 91975 -115185 4572 -200608 148192
18372 125730 131241 -249281 134356 -238691 174264 -140097 -145711 226718 56488 -399936
18361 111306 -67499 58660 -411922 -274744 15297 -19883 285833 254374 385241 -134035
18350d5742l08903f9298e093A67998a47001I0706K7272J08015K9533I0602M9589
18339A40191C025M1928J87797a74685A22587c861l99656A94856b62644k8965B65807
18327g8198D4661R8998m4333b10360J1532f6837n7281B9282c92256a5651A23033
18315G6980I432h8967l89A9781q80K23248I2433f7683j14781C43165b05711F397
18302c40466h5450c3485I6749b53367c4483m6761A09717a38088A84331g9469B26596
18290H9166K5854a29350o4800D6308K7322a44536k3419j30326a05553A74700a8037
18278A96953a97807k09059a18647B6894P0903e1954F5804b28622j10156a26352
18267b33568J04122j13025N3388B32918c3220j10010H1746L17512b22926A74185
$$ plain form
18350 -45742 -354645 -69298 -5093 167998 -147001 90706 117978 225993 255526 90602 140191
18339 140191 3025 44953 232750 -174685 122587 -3861 -403517 194856 -262644 -291609 265807
18327 -78198 44661 143659 99326 -210360 -198828 -66837 -124118 29282 -392256 -15651 123033
18315 76980 9432 -88967 -89356 19781 18901 242149 92433 -67683 -182464 343165 -205711 6397
18302 -340466 -85450 -33485 96749 -253367 -34483 -81244 109717 -138088 184331 -79469 226596
18290 89166 115020 -129350 -194150 46308 73630 -144536 -167955 -298281 -105553 174700 -18037
18278 196953 -197807 -406866 -118647 26894 97797 -51954 65804 -228622 -338778 -126352
18267 -233568 -129446 -242471 -189083 232918 -33220 -143230 81746 399258 -222926 174185
18256A72285o3146c2549o9480G8023J32925i3167M3167D5835A9902c10744A00607
18244D4280a72573C4425b56269G5924b57781F4246c55185A64515g1618B90262
18233c280E3326b5566B70043a94854C46224A19904D1731b52245E6030Q9703j1631
18222A34102A3218b3874l3895J7146n2536G1051a79738Q3693C34238e7770k21057
18211b78827g2361B7952c04691C7781K73213m3715b67037l7534G2739g5594p0451
18200a46045M6003j24478O3308B69290j16359L6917c8611h673k5246A07993b25462
18188H5232b04794j2564B23568f8871J9263A60165c52341l5618A02992a43009
18177a3011C46886d20246A53394g8439A53517f4193C8569J21264o7171a36191
$$ plain form
18256 172285 109139 -32549 -102029 78023 210948 -93167 -50000 45835 19902 -310744 100607
18244 44280 -172573 34425 -256269 75924 -257781 64246 -355185 164515 -71618 290262
18233 -3280 53326 -25566 270043 -194854 346224 119904 41731 -252245 56030 145733 134102
18222 134102 13218 -23874 -57769 -40623 -93159 71051 -179738 -96045 334238 -57770 -278827
18211 -278827 -72361 27952 -304691 37781 310994 267279 -267037 -304571 72739 -75594 -146045
18200 -146045 -100042 -224520 -161212 269290 152931 189848 -38611 -8673 -33919 107993 -225462
18188 85232 -204794 -217358 223568 -68871 -49608 160165 -352341 -387959 102992 -143009
18177 -13011 346886 -420246 153394 -78439 153517 -64193 38569 159833 92662 -136191
18166I9988l3453g7838b729k78479b1312j81453c7167J8533n0285k09891a8661
18154c24219H5855a88092A0750K78426A14802O8653b10060i7073b441A34944a6954
18142A18628a38062F6378J21177c5324o1343B67327a96200A3299P671a84294f4497
18130A6701b6297n1506j06905j11430A57948h9269L3309l0340k7993A32945A5973
18118D5129a68142M6929j11572L3035Q1378j14947A74750b13346A52736h383j26224
18107a34607A9817b50369A18625b90854B07731C3630R3619K068a97666A07448
18096A08740B8114J21859b42632d3662C148c639A56293A1349g9628p7066A17831
18084c27244D2599R4731Q5332d08898B21494a01057H6437Q4297g9369k36826K769
$$ plain form
18166 99988 66535 -77838 -2729 -281208 -21312 -202765 -37167 -18634 -68919 -278810 -18661
18154 -324219 85855 -188092 10750 289176 114802 183455 -210060 -97073 -2441 134944 -16954
18142 118628 -138062 66378 187555 -35324 -96667 267327 -196200 13299 20970 -184294 -64497
18130 16701 -26297 -77803 -184708 -296138 157948 -89269 -55960 -86300 -114293 132945 15973
18118 45129 -168142 -121213 -232785 -199750 -118372 -233319 174750 -213346 152736 -8383 -134607
18107 -134607 19817 -250369 118625 -290854 207731 33630 127249 129317 -197666 107448
18096 108740 28114 149973 -242632 -43662 3148 -3639 156293 11349 -79628 -156694 117831
18084 -327244 42599 137330 222662 -408898 221494 -101057 86437 170734 -79369 -316195 -313426
18073c13426b1336E9581J33257H3716N1278f1314B04452f9946I7549B7334J89508
18062B16842l9360b85279h0398J4533j82970I751f3786A78875f6219A49352a11717
18050B27822d4355k08922N6308f2970B6845J258J0472b04644Q4734A65659E0095
18038G5953n298a16209A98853b90350M4870C00120H9796P2305L0793R9158e5016
18026a12197L9891j02897O3215k639K7745A46642d2444A70872a43068B71606i5844
18014e7118b3687j17406d311j80940G4949k1582P9547a38218B2422a61028B54276
18002D1401d10223D6350h3197F8332J86520o2751b86436J1270h240A18139D8550
17990a79248l18276a35275j87599I0791a26333d3887A38001a83195b9843j35246
$$ plain form
18073 -313426 -21336 59581 192838 83716 134994 -61314 204452 -69946 97549 27334 216842
18062 216842 177482 -285279 -80398 -65865 -248835 9751 -63786 178875 -66219 149352 -111717
18050 227822 -44355 -253277 -196969 -62970 26845 28103 38575 -204644 -119910 165659 50095
18038 75953 70655 -116209 198853 -290350 -245480 300120 89796 162101 192894 292052 -55016
18026 -112197 -72306 -175203 -111988 -114627 -86882 146642 -42444 170872 -143068 271606 -95844
18014 -57118 -23687 -141093 -4311 -185251 74949 53367 132914 -138218 22422 -161028 254276
18002 41401 -410223 46350 -83197 68332 254852 192101 -286436 -275166 -8240 118139 48550
17990 -179248 -497524 -135275 -322874 90791 -126333 -43887 138001 -183195 -29843 -165089
17980a65089k07949a07739j36045I9060B9129R9920c53650J56294j19766B22505
17969f8548l7154d4433a2730j97232E08974H0251B9307K195a88557F089a25570
17957a73164M1460I6361c4043F0783K2349J43414c92529C9136b0276A74420c74265
17945A91106c30393E7881b75200A86958c21073A71842f2327A22087i4460o9469
17935a63929B89470b5152h287q8053O990K5818A540K02404H1672J5213a69708
17923C4377d3854a8719m8490C36303b72119A50471Q7578e669k17840D8446K09200
17912B57646a28793B01589F2469J46084r2311b10250A90471C6361d93673A9103
17901A93972a44146B02155h2864j1489B68537H0079c0929l72028D861J51455f72
$$ plain form
17980 -165089 -373038 -107739 -243784 99060 29129 129049 -353650 -197356 -317122 222505
17969 -68548 -105702 -44433 -12730 -209962 508974 80251 29307 31502 -188557 6089 -125570
17957 -173164 -131704 96361 -34043 60783 83132 226546 -392529 39136 -20276 174420 -374265
17945 191106 -330393 57881 -275200 186958 -321073 171842 -62327 122087 -94460 -163929
17935 -163929 289470 -25152 -8287 -96340 -89350 -63532 1540 203944 81672 96885 -169708
17923 34377 -43854 -18719 -67209 336303 -272119 150471 238049 -5669 -223509 48446 257646
17912 257646 -128793 201589 62469 208553 116242 -210250 190471 36361 -493673 19103
17901 193972 -144146 202155 -82864 -94353 268537 80079 -30929 -402957 4861 156316 -672
17889A98016a3369F9920m384a98225C56721g8817k64845B399h6035G8383R2958
17878A71341M330c49196B8497J23794D3095K97567b48789j07663I3328M2778f6140
17866b15520R9202i751k2318N737k07357k7955O8676A94480K91101b3831G9008
17854A40028D1899J33656G4906e6258A55100c13279K6899K4753h5768C05754c5081
17842G7504A8298a3506q7260a7298r0811j529A84406b26277B96621G7696c7715
17830a78223H9584e2281j09186K8603B41148J1228o7797a00910M4322p7189B34325
17818e9043A14453b39796G0573a22977B1778c7933a941G2335h7587b8206B78986
17806c40174A16769a81182g3710B9495h5392A46629k3745J24954H3320a27483
$$ plain form
17889 198016 -13369 69920 65536 -198225 356721 -78817 -343662 2399 -86035 78383 171341
17878 171341 175671 -349196 28497 152291 43095 340662 -248789 -356452 93328 136106 -66140
17866 -215520 -116318 -9751 -32069 -26332 -233689 -261644 -192968 194480 485581 -23831 79008
17854 140028 41899 175555 74906 -56258 155100 -313279 -286380 -261627 -85768 305754 -35081
17842 77504 18298 -13506 -100766 -17298 -108109 -109638 184406 -226277 296621 77696 -37715
17830 -178223 89584 -52281 -161467 -132864 241148 252376 184579 -100910 -56588 -133777 234325
17818 -59043 114453 -239796 70573 -122977 21778 -37933 -1941 72335 -87587 -28206 278986
17806 -340174 116769 -181182 -73710 29495 -85392 146629 122884 247838 83320 -127483
17795b9485j45954L5111A24557f2325r2978a6701G2399a05031j03774D13270l5235
17784C78035i7685B87655a72751A20190h2711C0864a44265n7028Q6167M3194A778
17772A01354J63655f6450A32090G883a19421d6949G3256a06338a678B95786G3988
17760H385h7088b5423F9308F739P0656J98190l6955K11230c46818A18097a25836
17748a64454B05682b88259a06226A11745b02617A36066a50159c8397B60046A04527
17737e4073C15934g3570n3183p506k0073A30441g4043D8878i1391K4759F6329
17725B5510J09059a83012A65829J76442a69846b5095A33633J65449L0227f2576
17714F3348c2042j21517A67176J14675j39825J01391d0614m8259k58560J60945
$$ plain form
17795 -29485 -175439 -140328 124557 -62325 -155303 -16701 72399 -105031 -208805 413270 378035
17784 378035 -97685 287655 -172751 120190 -82711 30864 -144265 -201293 -115126 -71932 1778
17772 101354 265009 -66450 132090 7883 -119421 -46949 73256 -106338 -1678 295786 73988
17760 8385 -87088 -25423 69308 6739 77395 275585 238630 449860 -346818 118097 -125836
17748 -164454 205682 -288259 -106226 111745 -202617 136066 -150159 -38397 260046 104527
17737 -54073 315934 -73570 -126753 -134259 -154332 130441 -74043 48878 -91391 -66632 66329
17725 25510 134569 -183012 165829 342271 -169846 -25095 133633 299082 329309 -62576
17714 63348 -32042 -153559 167176 281851 142026 243417 -40614 -88873 -347433 -186488
17704a86488J1180B68619a97425B16174c10970A71542h0794F703R5479P9699F9159
17692A07911a37257M3812C16465j28292K4973I7866a11406C30615c6805E0423
17681c28263a17488K6616D04344d8317B57147l5293l4616a97177B25992a4149
17670A32232M4726C6211N7733M084P6528a39455o8518c9819p9588A51371E6902
17658c00012J4992g4233b8946A88724Q274p3995e5125B35337b36329B68736j11285
17647A57451a25312o4944k8258r4574K4755B44354b31526N9650A76025J2450J0517
17636A98992m0569b25958i6584F7876a5716D1764J4423j6238c95D8837K00896
17625B49733a91193L3458D2352F379h0564L8677D3613R1210e8850i000A91308
$$ plain form
17704 -186488 -175308 268619 -197425 216174 -310970 171542 -80794 6703 102182 181881 69159
17692 107911 -137257 -93445 316465 188173 213146 97866 -111406 330615 -36805 50423
17681 -328263 -117488 -90872 404344 -48317 257147 221854 187238 -197177 225992 -14149
17670 132232 176958 36211 93944 98028 174556 -139455 -207973 -39819 -119407 151371 56902
17658 -300012 -285020 -74233 -28946 188724 196998 123003 -55125 235337 -236329 268736 157451
17647 157451 -125312 -190256 -218514 -313088 -288333 244354 -231526 -171876 176025 188475 198992
17636 198992 158423 -225958 -96584 67876 -15716 41764 56187 39949 -395 48837 249733
17625 249733 -191193 -157735 42352 6379 -80564 -41887 43613 134823 -58850 -9000 191308
17613F5754m8a86052C2166j4838c10607c6970l11551a44752C687J53278L8732
17602A95697H379J42654a11822a722D3530K32863I785K27389j07316i0814A98187
17590E3162R2214L0705N760g9870B09975R3407C0532c0909B45669O3121d65744
17578A8056a89749d985k1947p7330a6709D3531K67176H9119J1015l0239b62071
17566I0865D2713K49772e4994A88836J43724A08975B1138a60044B31533r8200
17556A33333K6255B8942h7130A0712L73005a92102B79597e057F4584d5772A50015
17544a43341N6701A2809K07948a87714c3264m0843m051A50326G0922N0422b20928
17532d15342C0822L16430k0489A18274B3349L7058K2450d9647G6305b58153D27390
$$ plain form
17613 65754 65706 -186052 32166 17328 -310607 -36970 -348521 -144752 3687 156965 195697
17602 195697 8379 151033 -111822 -1722 43530 276393 9785 237174 129858 -90814 198187
17590 53162 145376 176081 181841 -79870 209975 303382 30532 -30909 245669 308790 -465744
17578 18056 -189749 -4985 -26932 -104262 -16709 43531 310707 89119 100134 69895 -262071
17566 90865 42713 292485 -54994 188836 332560 108975 21138 -160044 231533 133333
17556 133333 159588 28942 -87130 10712 383717 -192102 279597 -5057 64584 -45772 150015
17544 -143341 -86640 12809 220757 -187714 -33264 -74107 -78158 150326 70922 121344 -220928
17532 -415342 30822 347252 326763 118274 23349 60407 82857 -49647 76305 -258153 427390
17520B51033i1441p6048o840A80056J08056J46934A15048D6434N2206j5373J06314
17509A89581C2873a72769A13866O6173D0988J79813m9286N2098o1512J01293a12434
17497c14950d17B35313g0205E163d8295C18751d0550o4824a5998k4314e224a683
17484i4260m2989B04399c52552B39955d8730A83928O4913c08749G4490K51870
17474C26360a06697A83818Q8556M9868q7746D0872a95861F3783K64217M3053j75671
17463A95382J9802J45904j10684D7973M9520A660i6727C54580N9653h7319F25368
17451C19240j56605P9732a61599K981A50692l0955a07300A61966k7095N1591J73065
17440C59527N6801j9524D5822J1203J63274d2079F29245j76142J75890b5512j17366
$$ plain form
17520 251033 -91441 -167489 -174329 180056 288112 435046 115048 46434 98640 83267 189581
17509 189581 32873 -172769 113866 180039 40988 220801 171515 223613 162101 263394 -112434
17497 -314950 -417 235313 -70205 5163 -48295 318751 -40550 -105374 -15998 -40312 -5224 -1683
17484 -94260 -137249 204399 -352552 239955 -48730 183928 248841 -308749 74490 326360
17474 326360 -106697 183818 272374 322242 234496 40872 -195861 63783 328000 371053 195382
17463 195382 215184 361088 250404 47973 97493 1660 -96727 354580 414233 -87319 625368
17451 319240 162635 242367 -161599 -158618 150692 119737 -107300 161966 134871 186462 359527
17440 359527 416328 396804 45822 57025 220299 -42079 629245 453103 628993 -25512 -142878
17429a42878C09379Q9069K11651o7936B34362P8117f5104C07112j49357E9442
17418C2975c4894F57104k68210a37264B39769K34790j47887F479k217J29845J03141
17407B37248K3748q937l7276k2377B311J46639L87354k18081a5851C74536A09033
17395A20384a30162a672A11766J31043A2066a78030d4833G1243M18335k14570
17385B75008K9589a5423C17011j09433K25141a37444F7718N9854h5940B25875
17374C25420i9697I1590m1312J16535m4353k6893J55160H2310M13339A0501J39889
17363A50390J23711B9867L4109L60450j35020a58504D84454k20434o1888I6924
17352a18638A25066K67198p5932K07412a24595G5418J19270a01505m7116L8742
$$ plain form
17429 -142878 309379 398448 610099 542163 234362 312479 -65104 307112 157755 59442
17418 32975 -34894 657104 388894 -137264 239769 474559 326672 6479 4262 134107 237248
17407 237248 260996 252059 214783 192406 2311 148950 536304 318223 -15851 374536 109033
17395 120384 -130162 -1672 111766 242809 12066 -178030 -44833 71243 489578 275008
17385 275008 304597 -15423 317011 207578 432719 -137444 67718 127572 -85940 225875
17374 325420 -99697 91590 50278 166813 122460 95567 250727 82310 495649 10501 150390
17363 150390 274101 29867 63976 424426 289406 -158504 484454 264020 202132 96924
17352 -118638 125066 392264 316332 523744 -124595 75418 194688 -101505 -148621 -109879
17342a09879H0663f6177E77071I0508P2590J47924a54565E5902J54420L4594J77024
17331D21940A19199d9033A47407C8513N1533Q5260J15127D8871K8689C8322L90198
17320D28520d2316C85267P4380B22887A8081J03970l7176J34811A04717m442K61605
17309C61880j10777K10505B05291B59a82678B74758A14479L7355J56333a27092
17298C64717G8933L09319j85708b05644G4521L68800L9539A2990J23030J53825
17288B89845A09132d1642D04948H3603A8129J77510e9794B03803M6488b8914G2481
17276B07535p1434a25173o6432A96145a57773A94696D5569J71806H4669J1428
17266I6097L67642B04027K65238A2905Q8080a09154J929e666B26388j00040J8912
$$ plain form
17342 -109879 80663 -66177 577071 90508 163098 311022 -154565 55902 210322 244916 421940
17331 421940 119199 -49033 147407 38513 90046 175306 290433 48871 77560 38322 428520
17320 428520 -42316 385267 459647 222887 18081 122051 84875 219686 104717 100275 361880
17309 361880 251103 461608 205291 259 -182678 274758 114479 151834 308167 -127092
17298 364717 78933 388252 202544 -205644 74521 443321 482860 12990 136020 289845
17288 289845 109132 -41642 404948 83603 18129 195639 -59794 203803 250291 -28914 72481
17276 207535 136101 -125173 -191605 196145 -157773 194696 45569 217375 84669 96097
17266 96097 463739 204027 469265 12905 100985 -109154 -107225 -5666 226388 126348 145260
17255A45260J05862c4283B23330A07846J04797K254J48743h3046j5253A73439
17244B72777Q1410m8013D8319K76047C2895P2693K63899A37176N9942q9202P3258
17233A81174K21050K0062A54537b04183A27148i6544G1714L68781A4280M19448
17223D33728A94501J14626H895M72839A69440C4654L02324q9844J75486E7751
17212A46365J17050o9917a77968D38504j88129L0412j9816o5863I3435L67742
17202D61177o7946j16412b34299C01687r834Q5434d1068B88873r9675F445R0063
17191I6508B7998N09078a66037i1E00457B29112M9947a56376A21335K6520F8617
17179a1904A08389K08227J5081J70810B16727J70706J71818k56558j51079J24327
$$ plain form
17255 145260 251122 -34283 223330 107846 212643 214897 363640 -83046 -98299 173439
17244 272777 354187 306174 48319 324366 32895 105588 369487 137176 197118 107916 181174
17233 181174 402224 422286 154537 -204183 127148 -96544 71714 440495 14280 433728
17223 433728 194501 309127 8895 481734 169440 34654 336978 247134 422620 57751
17212 146365 263415 193498 -177968 438504 250375 280787 260971 195108 93435 461177
17202 461177 393231 276819 -234299 301687 291853 377287 -41068 288873 189198 6445 96508
17191 96508 27998 537076 -166037 -91 500457 229112 279059 -156376 121335 147855 68617
17179 -11904 108389 316616 331697 502507 216727 387433 559251 302693 151614 275941
17169B75941B3891L94010j06896A53281L25253k06466m9525d353B72665p5431
17159A97234C0653J75031M6863K2090J82294b24426b6819A55190J66055J58148
17149D79393a70569D03358A89786K26245j91820J70253A58911k3459n4288K72082
17139C53246K48426j63720c9660D35725o0881A55221J2531M02131B56438I1981
17128B90461a82791H5550J75354q907o9252K3692R7721Q9955K2087j85181J45441
17117C76460A08023M546M21762n2411j69486K095j3622r8652P4664J67211l5905
17106D08225q7727J71920A97750R475K98950j82751A22211J61502I4136d091A27482
17094D63787j94696J34193q4412M24803A92171a07206A27121A273K09907k7675
$$ plain form
17169 275941 23891 417901 311005 153281 478534 272068 222543 -4353 272665 197234
17159 197234 30653 205684 252547 274637 456931 -224426 -26819 155190 321245 479393
17149 479393 -170569 403358 189786 416031 224211 394464 158911 135452 81164 353246
17139 353246 601672 437952 -39660 435725 374844 155221 167752 569883 256438 91981
17128 290461 -182791 85550 260904 251997 182745 206437 304158 394113 416200 231019 376460
17117 376460 108023 112569 534331 481920 312434 314529 300907 202255 276919 444130 408225
17106 408225 320498 492418 197750 207225 506175 323424 122211 283713 94136 -4091 127482
17094 463787 269091 403284 318872 743675 192171 -107206 127121 1273 211180 183505
17084A83505J19359B7646N15393A60615L51424k09982R5325K06923A17836L45233
17074D63069k13079J45591Q8106O7928m6205r2014J2072r4776J55928R3302j37607
17063D42315J50686j82073l9657o0251N3700L7981j59704R1799O4829J6778K16748
17052F33151k95134K75539H6077J66287Q147K19740M2724j86015R8629j21215
17042C14374o756Q8117J3463M00137j83546J15189C32008l2403K2041F0268M14594
17031D74862l0817L5847A06441K53803q3814K64597m4884J1425k10329L11500
17021F08739r6732A66654M02347K7542j38313N07364C91568K98873k76175J08683
17011E22949M7577k2615N0310J48198q6237j53936M79204j77085k98069k04394
$$ plain form
17084 183505 302864 27646 543039 160615 512039 302057 397382 604305 117836 463069
17074 463069 249990 395581 483687 551615 505410 413396 425468 330692 486620 579922 442315
17063 442315 593001 410928 371271 311020 364720 402701 242997 334796 399625 416403 633151
17052 633151 338017 613556 86077 252364 260511 480251 522975 336960 435589 314374
17042 314374 307618 395735 409198 809335 625789 740978 332008 299605 321646 60268 474862
17031 474862 444045 479892 106441 360244 276430 541027 496143 507568 297239 608739
17021 608739 512007 166654 569001 596543 458230 965594 391568 690441 414266 522949
17011 522949 570526 547911 598221 746419 660182 506246 985450 808365 510296 305902
17001C05902K49990J43941O9527C78795J64661J82910n7090k08405L57272j74847
16991F43296O6761k04619j2258J19111K2736K17205k75670J5998L7813K82202
16981I12575P7194l93061J28712o8261L18448k04076k24710L22486k23431j21416
16971E24460M5045j7468N07334j91982j17638k6537j28414J24249Q9405J90814
16961I99268j52849k19428M01904k87745L2503k92719L37376l0700o1019j46812
16951E79779N77337j29735l06945R6035j75579J75215L09212L4961q4184k56687
16941H19409J85538j83914J04073K2500k72477K01689k3696R1899P4796j45785
16931H74032M9705K97202k62899J54986k38725L35526N1928P8510k50260J38757
$$ plain form
17001 305902 555892 699833 769360 378795 543456 726366 669276 460871 818143 643296
16991 643296 710057 505438 493180 612291 635027 852232 576562 592560 630373 912575
16981 912575 989769 596708 725420 657159 975607 771531 546821 869307 645876 524460
16971 524460 569505 552037 1059371 867389 749751 723214 594800 719049 808454 999268
16961 999268 846419 626991 1028895 741150 773653 480934 818310 787610 726591 579779
16951 579779 1157116 1027381 720436 816471 640892 816107 1125319 1160280 1076096 819409
16941 819409 1004947 821033 925106 947606 675129 876818 853122 945021 1019817 874032
16931 874032 923737 1220939 958040 1113026 874301 1209827 1261755 1340265 1090005 1228762
16921A228762j05546r1837m1032K31469J65997K0305j26338J07777k62101L19901
16911A447357k4594j62000J7320k46377j01331M21821m1857k65155M47015K48046
16901A740245q2719n01374J26744N31493m27618K5473j60170J57995n7522Q3335
16891A435882J44131P6107p9218k90797N18450j20913j30178J91651p4510O3360
16881A733965K96395j66848l2716L81998m17400o2749M7680m9582j18488N28577
16871B140832j60252J4198n1342k90067N31860j20308k90757K39480K13487L19393
16861B546524k75247k2083j99329r2888M06064K31256l86267K76824k73646N20488
16851B731696l21309L59183j31727k91531L08611P0744M0995K15216j01664O608
$$ plain form
16921 1228762 1123216 1031379 990347 1221816 1387813 1408118 1281780 1389557 1127456 1447357
16911 1447357 1422763 1260763 1278083 1031706 930375 1352196 1310339 1045184 1492199 1740245
16901 1740245 1657526 1156152 1282896 1814389 1386771 1412244 1252074 1410069 1352547 1435882
16891 1435882 1580013 1656120 1576902 1286105 1804555 1683642 1553464 1745115 1670605 1733965
16881 1733965 2030360 1863512 1830796 2212794 1795394 1732645 1780325 1730743 1612255 2140832
16871 2140832 1980580 1994778 1943436 1653369 2185229 2064921 1774164 2013644 2227131 2546524
16861 2546524 2271277 2249194 2049865 1956977 2363041 2594297 2208030 2484854 2211208 2731696
16851 2731696 2410387 2769570 2637843 2346312 2654923 2725667 2766662 2981878 2880214 2886822
16841B886822R6959R4344o6738k1843q5050J22323P9138L49077P9464l54184k2373
16830C157939j08610J21017K99022N3520k15327M02076L21136l26021J75056J6576
16820C896384J11726j17592M61884k85053L8942K47846K4839L1128M38432j23980
16810D724556r4961K03170N0538K93510M8854k47657N69973L6907J8572j42188
16800E461274K59628J75768L3980R5130n3863M71044K34490J70118J74323j92439
16790F829453O8447N79650o6383L51136K33822P0667N33991l04298M20828J63315
16780H880628K58556q0336N95913J64278K0151K12082P69790r3499M38679L63521
16770A1529763K07330K62769N4080P93638K20498M47093O31708O3318P74863K26874
$$ plain form
16841 2886822 2983781 3078125 3011387 2989544 2904494 3026817 3105955 3455032 3534496 3180312 3157939
16830 3157939 3049329 3170346 3469368 3522888 3307561 3709637 4030773 3704752 3879808 3896384
16820 3896384 4008110 3890518 4352402 4067349 4106291 4354137 4378976 4410104 4848536 4724556
16810 4724556 4629595 4832765 4883303 5176813 5225667 4978010 5547983 5584890 5603462 5461274
16800 5461274 5720902 5896670 5930650 6025780 5971917 6442961 6677451 6847569 7021892 6829453
16790 6829453 6897900 7477550 7411167 7762303 7996125 8066792 8600783 8296485 8717313 8880628
16780 8880628 9139184 9058848 9654761 9819039 9839190 10051272 10821062 10727563 11166242 11529763
16770 11529763 11737093 11999862 12053942 12847580 13068078 13515171 14146879 14210197 14985060 15211934
16760A5211934Q08992M67290L69504O07028J10806P65636R98137M99790J092225
16751B0931342K81625J203247N38288R23231J462831R96950P57313J435695Q77690
16742B9408212J494650J239175J493387J672617J544941J756525K147175J770521
16734D2527203K188423K386136J810861L380966K996411K999726L284219L024148
16726F4598093M131150L796142M518155M665224M941354N506544O121075N590957
16718A03868694O818513O475002P358443P054140P960761P958790P818127P702474
16710A63014944P920542P158618P184601N990138M902631M209862K355049J141596
16702B03877981l8463k185798l019813m567857n369141o369694p463243p415159
$$ plain form
16760 15211934 16020926 16488216 16857720 17464748 17575554 18341190 19339327 19839117 20931342
16751 20931342 21212967 22416214 22954502 23877733 25340564 26337514 27094827 28530522 29408212
16742 29408212 30902862 32142037 33635424 35308041 36852982 38609507 40756682 42527203
16734 42527203 44715626 47101762 48912623 52293589 55290000 58289726 61573945 64598093
16726 64598093 68729243 72525385 77043540 81708764 86650118 92156662 98277737 103868694
16718 103868694 110687207 117162209 124520652 131574792 139535553 147494343 155312470 163014944
16710 163014944 170935486 178094104 185278705 191268843 196171474 200381336 202736385 203877981
16702 203877981 203839518 201653720 198633907 194066050 188696909 182327215 174863972 167448813
16694A67448813q009455q286634q464171p585953p982059q087521p213530o731794
16686A05087696o230801o475937n880064n307731n142037m132062m711305l809303
16678F3398456l737352l602455l376728k874196k723813k585106k241626k071685
16670D0185495k168366k239793j397246j793563j605510j490055r93538j382813
16662B7114611r37052j257094j141034j000765r57284r66889q29921m44039r95409
16653A8585124o89754n44237p63396m68785q94845n55411l42730n19980l88728
16644A3417258o32546k44348l14638n13958l36665m45693J06725p03368l66399
16635I966368j67681l59475l28869J85213p81735l193m82556j24302l130m28625
$$ plain form
16694 167448813 159439358 151152724 142688553 135102600 127120541 119033020 111819490 105087696
16686 105087696 98856895 92380958 86500894 81193163 76051126 71919064 67207759 63398456
16678 63398456 59661104 56058649 52681921 49807725 47083912 44498806 42257180 40185495
16670 40185495 38017129 35777336 34380090 32586527 30981017 29490962 28497424 27114611
16662 27114611 26177559 24920465 23779431 22778666 21821382 20854493 20024572 19580533 18585124
16653 18585124 17895370 17351133 16587737 16118952 15224107 14668696 14325966 13805986 13417258
16644 13417258 12784712 12540364 12225726 11711768 11375103 10929410 11036135 10332767 9966368
16635 9966368 9798687 9439212 9110343 9295556 8513821 8510628 8028072 7903770 7900640 7472015
16625G472015J62257l63012l03773k90575m6985j74006K21900o12317k63863J31961
16615E933602j17233j86133j75369j55848r7170m31421N9310K72813n2270j51346
16605D898935k64096m221m51263J49456L3693j36962k13592j38015P8952k07735
16595C745152j1654k28951j88146n233o7201O4583m1388j71509K20018J49194
16585C464865m57509k42070L74985r4734k67366M41067n25245m3663J01910k28616
16575B523624k88960K66813j35393K53K12353O617l8011J62198o37947N9743J14788
16564B246078p9864P3616j53130L5924k20466K87145l51683J62856J54849k0837
16554B134488m66014J82108r771N7818k5694M9336l45842K59290m09110J43541
$$ plain form
16625 7472015 7634272 7271260 6967487 6676912 6629927 6455921 6677821 6065504 5801641 5933602
16615 5933602 5816369 5630236 5454867 5299019 5201849 4770428 4829738 5102551 5050281 4898935
16605 4898935 4634839 4630618 4179355 4328811 4362504 4225542 4011950 3873935 3952887 3745152
16595 3745152 3733498 3504547 3316401 3311168 3243967 3308550 3267162 3095653 3315671 3464865
16585 3464865 3007356 2765286 3140271 3045537 2778171 3219238 2693993 2650330 2752240 2523624
16575 2523624 2234664 2501477 2366084 2366337 2578690 2585307 2547296 2709494 2071547 2131290 2246078
16564 2246078 2166214 2239830 2086700 2122624 1902158 2189303 1837620 2000476 2155325 2134488
16554 2134488 1668474 1850582 1840811 1898629 1872935 1922271 1576429 1835719 1426609 1570150
16544A570150J09386l55761L90900j46117j137j64651k93879P0076J35987M7010
16534A361964K24437k12J38475k24708j88265R2522j93544q0587K05017R8668
16524A433767K34688l39493n5994J0776o0665p3465K71260k31660q9903o5335
16514A033976l5373k9215L33591l02542J88210l08515j19228K28274k04859K87398
16504A071717p8110m33451O46130k04320L06843l87879K70197j23695j14233J44955
16494A098154l57003J85054j26256K45696l57681L02157j81433R4459k21849M8670
16484G29968N9030k9285l1533R999K06950k60273J31914P6436A23731M16356J14711
16473F54798o812L79946m95110j29899M92787j16875j01035k02830K45415k0353
$$ plain form
16544 1570150 1679536 1323775 1714675 1568558 1567421 1402770 1108891 1178967 1314954 1361964
16534 1361964 1586401 1586189 1724664 1499956 1311691 1404213 1210669 1130082 1335099 1433767
16524 1433767 1668455 1328962 1272968 1283744 1223079 1149614 1420874 1189214 1099311 1033976
16514 1033976 998603 969388 1302979 1000437 1188647 880132 760904 989178 784319 1071717
16504 1071717 993607 560156 1206286 1001966 1308809 920930 1191127 1067432 953199 1098154
16494 1098154 741151 926205 799949 1045645 687964 990121 808688 903147 681298 729968
16484 729968 788998 759713 728180 738179 945129 684856 816770 893206 123731 540087 654798
16473 654798 647986 1027932 532822 402923 895710 778835 677800 474970 720385 700032
16463G00032k49579L11060l14982O09325B99812J97905K42621k06742L53902l46406
16453E41092j54537P22933m90097K2149B72517L47311J52578k14849p4176Q8286
16443E71667k1770B22656N30510k07557j06117j2427P5814J57207L4309k52549
16433D41846j25435p3982M4102K85675A46019N76647A78422N20726J05179C44142
16422E60678j04411K19929k07302J88469J15339k13923j17738A49412M45059M6743
16412F41214k27443J27701r3990r1006J4802A66861K96276k23313J65956A24063
16401C22642R9444j71922j00440L25495o3728I2926N83614A44995L02609j3608
16391D33996K91441k98784A69578N42816B75069K10001k1432l9242o9404k7449
$$ plain form
16463 700032 450453 761513 446531 1055856 299812 497717 740338 533596 887498 541092
16453 541092 386555 1109488 619391 641540 272517 619828 772406 557557 483381 571667
16443 571667 549897 222656 753166 545609 439492 427065 502879 660086 694395 441846
16433 441846 316411 242429 286531 572206 146019 722666 178422 699148 804327 344142
16422 560678 456267 676196 468894 657363 772702 558779 441041 149412 594471 641214
16412 641214 413771 541472 447482 356476 371278 166861 463137 239824 405780 124063
16401 322642 422086 250164 149724 475219 411491 92926 676540 144995 447604 433996
16391 433996 725437 426653 169578 712394 275069 485070 463638 424396 354992 327543
16381C27543M07674k57520B24188K57716j06682J57447P5679r0497A38699J74370
16371C13069O4664j86009K72232r8672j16642I9669K71466a9681D49910j00874
16361C49036J9673A13844K20644q970a1445A42018J57320K26169A946R6819J62507
16350B61272o7756Q4629g1416B00136L8647r7966J5263M47930A64558J09391r1601
16339A82348R1837L25160k95246j32457O8549K19852A61939Q3006Q5827j32527
16329A98245J87891A7487M2309K16104j14498K6093J08131j11870G156b10684
16318D58858B18248k5328a45588A48137J8381O4278D9332J36414L0649P2880P6488
16307C65763J0236j6812h335A5638L26846p4330j18987B9455K46831K23976I3610
$$ plain form
16381 327543 735217 477697 224188 481904 375222 532669 608348 517851 138699 313069
16371 313069 377733 191724 463956 365284 248642 99669 371135 -19681 449910 349036
16361 349036 368709 113844 334488 325518 -11445 142018 299338 525507 1946 98765 261272
16350 261272 193516 278145 -71416 200136 238783 140817 156080 604010 164558 273949 182348
16339 182348 274185 599345 304099 171642 240191 460043 161939 244945 330772 198245
16329 198245 386136 17487 59796 275900 161402 187495 295626 183756 7156 -210684
16318 458858 218248 192920 -145588 148137 166518 230796 49332 185746 216395 289275 365763
16307 365763 375999 359187 -8335 15638 342484 268154 149167 29455 276286 500262 93610
16295B60444k0612k1477J27354b5145C48937A39862N9626D6169J82231J03312
16285C31712K5929p108j61409k7124J73651j60572J00027g8304l0328A34554j9453
16274A15101K42642b9909G1493a05605B16183j6048C8059d8393A28714P3952L02766
16263E05432j65023k7130B5660J0520a18179D60481F6861d6030j97364A46260
16252C87461A57498E7341f2340A89184L7506A7258J53494B7419H402M3293L21822
16241C73517i122j77838D70240p0053c0595o3956C59845A76377J88666A61575
16230A70497h1481A37743m649m343o3582b4803B47295C5976J00387Q8666c4579
16218f114A44862p0052J20991a29438C74071A09439K07674A7842J17739J12276
$$ plain form
16295 260444 239832 218355 345709 -25145 348937 139862 199488 46169 228400 331712
16285 331712 357641 350533 189124 162000 335651 175079 275106 -78304 -108632 134554 115101
16274 115101 357743 -29909 71493 -105605 216183 200135 38059 -48393 128714 202666 505432
16263 505432 340409 313279 25660 36180 -118179 460481 66861 -46030 -243394 146260
16252 387461 157498 57341 -62340 189184 226690 17258 170752 27419 8402 51695 373517
16241 373517 -9122 -186960 470240 400187 -30595 -94551 359845 176377 365043 161575
16230 170497 -81481 137743 133094 128751 65169 -24803 247295 35976 136363 225029 -34579
16218 -6114 144862 74810 195801 -129438 374071 109439 317113 17842 135581 247857
16208B47857R9492j17972C1610J19746F0019L3419c96528A62591G1873f069A18628
16196B03174J16295j17704J69435a19052C82144b52741B34558A3653K11636G4525
16185C27633A31332j2291a45681A76721E2761J65513b4798D1305J09453b47849
16174C8170Q1451n7810A5337F956L2346g6128K3142j7019A66468C1264c1490B33405
16161a96335d6149A65770a18964A2262g0220A56557m6514a76944H2694J03359
16151A86053Q8092a40313A69020q0435b71037D8271d7815C38647j0020l5068i6771
16139G8967Q1713o321F8272e9007F2842a15528A753L87543d04621J55780j27942
16128c76783a79906B19078J58179r7677A14507C0048a03519A67325e1530C053
$$ plain form
16208 247857 347349 229377 31610 151356 60019 93438 -396528 162591 71873 -6069 118628
16196 203174 319469 201765 371200 -119052 382144 -252741 234558 13653 225289 74525
16185 327633 131332 119041 -145681 176721 52761 218274 -24798 41305 150758 -247849
16174 38170 119621 61811 15337 6956 39302 -76128 -52986 -70005 166468 31264 -31490 233405
16161 -196335 -46149 165770 -118964 12262 -70220 156557 110043 -176944 82694 186053
16151 186053 274145 -140313 169020 88585 -271037 48271 -47815 338647 328627 293559 -96771
16139 78967 160680 154359 68272 -59007 62842 -115528 1753 389296 -404621 -248841 -376783
16128 -376783 -179906 219078 377257 279580 114507 30048 -103519 167325 -51530 3053
16117a67207A21084d39432d0813A06889c6341Q773E496d8840Q546A2281c15768
16105a73194Q0536P883C45067I1433B7710K34667c49848C1165A4246a35407F7590
16093d5292m4209A3915K08621a95326D05186o8829b9210B42255D5105J10929O2626
16082B18660a08009j85355J17688B67218A01271A9230h4379o043A68539a57666
16071A09976L6390a15697L2431m0772L4637a1282q4882G2760b64570h9288c6214
16059C7971b36192e6354q6401G7209n581B7389K13116e1370j76624G3668M538
16048G8206l4253A5453b27647A85779k5058k1181J2379a47982M4601k70730A29928
16036C0209O0343h349q4032j29469G0476a36110N1987R879r950j46261A57996
$$ plain form
16117 -167207 121084 -439432 -40813 106889 -36341 -27568 5496 -48840 -40294 12281 -315768
16105 -173194 -92658 -84775 345067 91433 27710 262377 -349848 31165 14246 -135407 67590
16093 -45292 -89501 13915 222536 -195326 405186 336357 -29210 242255 45105 156034 218660
16082 218660 -108009 -293364 -175676 267218 101271 19230 -84379 -90422 168539 -157666
16071 109976 146366 -115697 -83266 -124038 -89401 -11282 -96164 72760 -264570 -89288 -36214
16059 37971 -236192 -56354 -142755 77209 71628 27389 240505 -51370 -227994 73668 78206
16048 78206 43953 15453 -227647 185779 160721 139540 151919 -147982 -103381 -374111 129928
16036 30209 90552 -8349 -92381 -221850 70476 -136110 -84123 -74244 -84194 -230455 157996
16024b06048a473l5751j51386L881e6737B7536K96545A11955d2166A7101g336
16012a7956j83695B36745a42755o9947A10770C3523c14370a45111D066N7908b64222
16000B09894k9586b53347o087B21410a7947A85532D2939K33291j05704c36815
15989E3516a18730k79994a21259A42325k64F4684O6103R9B3170b59764J02642
15978a57122G1669d64016d8185F0730Q3753p0729J11388F0410j1299Q9178b6906
15966A17621E0913J5803K79502m8524h5524L9452A2474c48940A24400P2477m2745
15955A54132b85522G4659d27044a14024j093K6929D38261k10971a93667B5012
15944b15345j7763B11426g2810A08223K4582a06390A79135d12204a57704j5834
$$ plain form
16024 -206048 -1473 -37224 -188610 -184729 -56737 27536 324081 111955 -42166 17101 -7336
16012 -17956 -201651 236745 -142755 -212702 110770 33523 -314370 -145111 4066 61974 -264222
16000 209894 180308 -253347 -259434 221410 -17947 185532 42939 276230 170526 -336815
15989 53516 -118730 -398724 -121259 142325 142061 64684 130787 130886 23170 -259764 -157122
15978 -157122 71669 -464016 -48185 60730 144483 73754 185142 60410 49111 138289 -26906
15966 117621 50913 66716 346218 297694 -85524 -46072 12474 -348940 124400 196877 154132
15955 154132 -285522 74659 -427044 -114024 -115117 -88188 438261 227290 -193667 25012
15944 -215345 -233108 211426 -72810 108223 132805 -106390 179135 -412204 -157704 -173538
15934a73538l8668j71089e3740k39735e0232P536j45588Q3353E3718a12206F5376
15922d76033J82056h7702M2081k886D4567c36799A51619g2175A81214p3073a0916
15910a29089l82849f1202d355B59836a83188D6202a00529A30056J9146g8360A07191
15898B18192c5922n6026B8980R2048a249j7945j73779D328b13221d4431P369k8011
15886f5073A13595k2593B0620d4650D2285c2164r8717k92766a90455B23171b06186
15874a46158l9009f9008D3295M49281h0229B07290C9341M394J59557E4361a03038
15862I786N4437a50483j14387k901A72638h0186B02514i2583k4123C2283b01137
15850a51672o0270A73625a19604B47185o4622b84286B99869d3633B79461a76450
$$ plain form
15934 -173538 -212206 -383295 -53740 -293475 -50232 -42696 -188284 -104931 53718 -112206 65376
15922 -476033 -293977 -87702 -45621 -48507 44567 -336799 151619 -72175 181214 108141 -10916
15910 -129089 -511938 -61202 -4355 259836 -183188 46202 -100529 130056 149202 -78360 107191
15898 218192 -35922 -91948 28980 121028 -1249 -19194 -192973 4328 -213221 -44431 -37062 -65073
15886 -65073 113595 91002 20620 -44650 42285 -32164 -130881 -423647 -190455 223171 -206186
15874 -146158 -185167 -69008 43295 492576 -80229 207290 39341 43735 203292 54361 -103038
15862 9786 64223 -150483 -264870 -267771 172638 -80186 202514 -92583 -116706 32283 -201137
15850 -151672 -211942 173625 -119604 247185 182563 -284286 299869 -43633 279461 -176450
15839A56251J62571c49057J52324f3353j796B2650b03244r3531d976G088d3709
15827i9018l7311D4030d6688M305A39718b32421i3455B60937b14287m3236B1645
15815B6519J39532i7164E0851a74945N4630N4559l088B67019g9315b3857j10873
15804a34730K2772j94850a14581k2866b2930p8736d4184G7420l831O3091g6650
15792C06069a51437J052d4679l01884a13377B94492a13920D5531a66814j17905
15782b84719H2047J01672a45763g2709A43313K9341h0349A68509a10591M4962
15772f5629A03466L31937a49755G1702e9109l0961B50595G2142C1854d72691J33156
15761c39535A76647A0804a58928I0555a80563h8020j80433B41098G0309c33521
$$ plain form
15839 156251 318822 -349057 -196733 -63353 -65149 22650 -203244 -296775 -4976 7088 -43709
15827 -99018 -136329 44030 -46688 -42383 139718 -232421 -93455 260937 -214287 -257523 21645
15815 26519 166051 -97164 50851 -174945 -120315 -65756 -68844 267019 -79315 -23857 -134730
15804 -134730 -111958 -306808 -114581 -137447 -22930 -101666 -44184 77420 73589 136680 -76650
15792 306069 -151437 -150385 -44679 -346563 -113377 294492 -113920 45531 -166814 -284719
15782 -284719 82047 183719 -145763 -72709 143313 172654 -80349 168509 -110591 -65629
15772 -65629 103466 435403 -149755 71702 -59109 -90070 250595 72142 31854 -472691 -339535
15761 -339535 176647 10804 -158928 90555 -180563 -88020 -268453 241098 70309 -333521
15750a18966e6801j23252C9144b2500H4313b72161A05050f2859D5177i5273A41808
15738F5585a51457C002c36010B17885G3867c20496E1453L6377e5152B52931c3401
15726c97791f6625j56892C40448j49927A9904a41215B05762e139j45492k76077
15716d26708C9909j7557a46715k46975A47435h9611B08898B8122c27576a42737
15705C92047B3915a71114j68623J55730n1843h4385a2351k65524A50552d9917
15694d7631j40256H693a50265A53967J97374H4717a60791d5634K2527j71714j40099
15683c34920A80177c228j83437D09622k04523b67292b4704k3432A08862a06645
15672a19030K4776M5234l8728j5706A3228d32017a09402A09933J24964F7569R8817
$$ plain form
15750 -118966 -56801 -180053 39144 -22500 84313 -272161 105050 -62859 45177 -95273 141808
15738 65585 -151457 3002 -336010 217885 73867 -320496 51453 87830 -55152 252931 -33401
15726 -397791 -66625 -223517 340448 190521 19904 -141215 205762 -5139 -150631 -426708
15716 -426708 39909 22352 -146715 -393690 147435 -89611 208898 28122 -327576 -142737
15705 392047 23915 -171114 -339737 -184007 -235850 -84385 -12351 -277875 150552 -49917
15694 -47631 -187887 8693 -150265 153967 351341 84717 -160791 -45634 -23107 -194821 -334920
15683 -334920 180177 -3228 -186665 409622 205099 -267292 -24704 -48136 108862 -106645
15672 -119030 -94254 -49020 -87748 -103454 13228 -432017 -109402 109933 234897 67569 166386
15661A66386c43759h218j06867n1021B85980A18697b05978A4464a10670h197m05032
15650d13229B24296G4945R2796H2721b52538A38209r162c23805i0376L4868k8572
15639h4080I6864N2232B7274J5587N0088a38130H7623B7437d1706A04778a61521
15627a8295E2921e2910C7633a87263k5194a1801A5897b2943o6588E3566c0695
15615b93266B29455p594A2719K63797a49207D0597a66436b340B5304J48562F8690
15603G8095c36951A51795c33213h7138k6671B52690B6852b02935A40870c44758
15592a56584p1066Q4531j80123h165E1661a01849k35988J06237d5390H2339C391
15580G6217b74662G7917a94259A55263i7447o6969D9812J74637a05876B12479
$$ plain form
15661 166386 -343759 -8218 -115085 -166106 285980 118697 -205978 14464 -110670 -8197 -413229
15650 -413229 224296 74945 167741 82721 -252538 138209 129047 -323805 -90376 -55508 -84080
15639 -84080 96864 149096 27274 42861 92949 -138130 87623 27437 -41706 104778 -161521
15627 -18295 52921 -52910 37633 -187263 -212457 -11801 15897 -22943 -89531 53566 -30695
15615 -293266 229455 221861 12719 276516 -149207 40597 -166436 -2340 25304 173866 68690
15603 78095 -336951 151795 -333213 -87138 -113809 252690 26852 -202935 140870 -344758
15592 -156584 -227650 -143119 -323242 -8165 51661 -101849 -337837 -231600 -45390 82339 3391
15580 76217 -274662 77917 -194259 155263 -97447 -164416 49812 224449 -105876 212479
15569g502E939b96200O7061B42585a20152B63908p1819a0777D6026e0892A76885
15557D7638a60293N1197k3369a3442A26007m4399J82937A00371e3259F3800K4842
15546H8642a29759A13492a5305G1065A5481a05806A13376f29588B1194a58933
15535h8295B3382b95117A01601J93371b27972A8930h8629A1724e7156A60199K3130
15524A83329D3806P4655a06951d917D2763A3839N6880i6342k63294A10231a09291
15512b8882l7538I4606J42704j15893a46359k17050A84518q3629d6130k4573j0036
15501h0739G8427K45804j42200A6797M7468M9736a15352b9727j46585k6101A64667
15489a32367B26744n3479a85320A21449R5691c4594B24728b39317c0972m1747
$$ plain form
15569 -7502 5939 -296200 -229139 242585 -120152 263908 192089 -10777 46026 -50892 176885
15557 47638 -160293 -109096 -132465 -13442 126007 81608 264545 100371 -53259 63800 88642
15546 88642 -129759 113492 -15305 71065 15481 -105806 113376 -629588 21194 -158933
15535 -88295 23382 -295117 101601 294972 -227972 18930 -88629 11724 -57156 160199 183329
15524 183329 43806 118461 -106951 -4917 42763 13839 70719 -96342 -359636 110231 -109291
15512 -28882 -66420 94606 237310 121417 -146359 -363409 184518 100889 -46130 -70703 -80739
15501 -80739 78427 324231 182031 16797 64265 114001 -115352 -29727 -176312 -202413 164667
15489 -132367 226744 173265 -185320 121449 217140 -34594 224728 -239317 -30972 -72719
15479g2719A6724K37236p5340e6550j99472m9997B426J15169J88315j09058h337
15467h9891B4592K53439a29117b8846i865A88498h6612B90742h1334n7275f8414
15455D1514J17523k7429J60084e5430j27417e2231l44976A06394a58689j29483
15445b88172A5680K0429i9112L2573A41173n6850k9552J19134c30119d7010q3189
15434a30199j48482J25999q1776b9257m22722K23863a2424n431j13616L5845j81317
15423b76943d3246j23031I5973d7761k17216A98017l1944d7102j23748A9929L10405
15412C30334A369c32497a15536F7346P8406c9729p1409A08705e0809j61067P1408
15401a40468A6188a39231I5647C8544e5014B4661b805A8471L07113E2985A1246
$$ plain form
15479 -72719 16724 253960 178620 -56550 -256022 -306019 2426 117595 305910 196852 -8337
15467 -89891 24592 278031 -129117 -28846 -9865 188498 -86612 290742 -81334 -138609 -68414
15455 41514 159037 131608 291692 -55430 -182847 -52231 -397207 106394 -158689 -288172
15445 -288172 15680 36109 -99112 -66539 141173 84323 54771 173905 -330119 -47010 -130199
15434 -130199 -278681 -152682 -234458 -29257 -451979 -228116 -12424 -17855 -131471 -95626 -276943
15423 -276943 -43246 -166277 95973 -47761 -264977 198017 166073 -47102 -170850 19929 330334
15412 330334 1369 -332497 -115536 67346 145752 -39729 -111138 108705 -50809 -211876 -140468
15401 -140468 16188 -139231 95647 38544 -55014 24661 -2805 18471 325584 52985 11246
15389d9583A38675Q61B969R5039a02176p3310c7798A39642a55695a3306A33940
15377H5183J10442I2961M0781K33292b2439j33153A17717R2830a87572A01434
15366g0395q7398k92699C719b82761G4623N1247a66520J6738F369i36l479G7751
15353B9804K51217f9162H997c0091F161b38623B9056b9067j18643G0903O9360
15342A40263R349O361m7436K88276d2640D8529c7552D6773J7878a72022J5173
15331a56849a4745A40402f7740H5275f0520e059C055R4519a23952A29001c2209
15319G6652C7610a6050J736A47501L4010d9631b688I163a29367J2578e5795j63890
15307b19685A64885m9760f5639k6382A53499J88752B9293J95433r2881l9139L6657
$$ plain form
15389 -49583 138675 139536 2969 98008 -102176 -175486 -37798 139642 -155695 -13306 133940
15377 85183 195625 92961 133742 367034 -22439 -155592 117717 210547 -187572 101434
15366 -70395 -157793 -450492 3719 -282761 74623 125870 -166520 -149782 6369 -936 -4415 77751
15353 29804 281021 -69162 8997 -30091 6161 -238623 29056 -29067 -147710 70903 140263
15342 140263 149612 155973 108537 396813 -42640 48529 -37552 46773 64651 -172022 -156849
15331 -156849 -14745 140402 -67740 85275 -60520 -5059 3055 97574 -123952 129001 -32209
15319 76652 37610 -16050 -14314 147501 181511 -49631 -2688 9163 -129367 -116789 -55795 -219685
15307 -219685 164885 115125 -65639 -92021 153499 342251 29293 224726 131845 92706 129363
15296A29363a89684A76287C8166K05230m7423G1797b76359J27564i370C44865
15285A4514e0455C29840A29554L44500b25183G986b8089l46671D7557O448K75314
15274C29319a90765H1062J88549k4798D6094j4503R5899a41060q5993n5880H6481
15262B37602C9182K03871a53014G365d2401l294A38105e7841B66712a39583d2576
15250F6228h7090l8668I7244b65312g4194b8947D17910A00171K5952K48637d7597
15238B03873R2528a93244f2055B23527a37607P660A99087d0700B88315A21930
15227a86690j18776A52228a97545j24360a48641q9884j36067a9357E8705j5331
15217D3374A5141a92329B18308B6839J608K4216J7184a96756C65529j31221i4810
$$ plain form
15296 129363 -189684 176287 38166 243396 195973 71797 -276359 -148795 -9370 344865
15285 14514 -50455 329840 129554 474054 -225183 7986 -28089 -374760 47557 54005 329319
15274 329319 -190765 81062 269611 244813 46094 31591 127490 -141060 -227053 -282933 86481
15262 237602 39182 243053 -153014 7365 -42401 -45695 138105 -57841 266712 -139583 -42576
15250 66228 -87090 -125758 97244 -265312 -74194 -28947 417910 100171 126123 374760 -47597
15238 203873 296401 -193244 -62055 223527 -137607 -129947 199087 -40700 288315 121930
15227 -186690 -305466 152228 -197545 -321905 -148641 -238525 -374592 -19357 58705 43374
15217 43374 15141 -192329 218308 26839 28447 52663 69847 -196756 365529 234308 -94810
15205A39224a76998A67301a6396H3133A0646M15806a53341M6994K4985C320a7970
15193a66328C81874c39462e2617G0424J95966b0534B99768b1655k2866A31820
15182B66040q041d090D36102j95420K17671A34740F0310Q7816N5310A00742L0810
15171A31552N6525k2900a37420K3381F4946L6118k4698c6582B26855f4539A74319
15159B89683A4380c9958D03790j31380A7861K25606j5715j2328g5120j0435j61253
15148b46808A08423e6133A39140l2210C4151b21388A84545a86061h9986A30476
15137A56256N78777i8888A39244o7724J9499J5529J10488M3202Q580D3760j1622
15126C2138M2532g42B62019A15713b40358D71283k11082j17232K74787a85829
$$ plain form
15205 139224 -176998 167301 -16396 83133 10646 426452 -153341 -106347 -81362 3320 -17970
15193 -166328 381874 -339462 -52617 70424 266390 -20534 299768 -21655 -44521 131820
15182 266040 257999 -4090 436102 240682 458353 134740 60310 148126 203436 100742 131552
15171 131552 188077 165177 -137420 -114039 64946 101064 76366 -36582 226855 -64539 174319
15159 289683 14380 -39958 403790 272410 17861 243467 227752 215424 -75120 -85555 -246808
15148 -246808 108423 -56133 139140 106930 34151 -221388 184545 -186061 -89986 130476
15137 156256 735033 -98888 139244 71520 91019 106548 217036 260238 268818 43760 32138
15126 32138 74670 -742 262019 115713 -240358 471283 260201 142969 417756 -185829
15115b22896i675H4863D1815Q5116Q6066M588M9599L1270F1261P2317M6733A0679
15102b9366j02443H8472b0500A16681E8056L9514k7931L862Q6929k3796K12022
15091C48656e98A43802a28924B09921B6427J82503l295C3708M32376A82283a12415
15079b73276A9206a22374D96172k05606a32346B32700E1328O7802g4376B40438
15068A99935J44631D0792g5270I2877K92J57897J43445e2452Bd3015j32255A81650
15055a97270I6270O3127a46430A7472J25849J78052a31989A42271F9635M19116
15045D88751g4103A8622J6892j960L0492N9981K73685k830j23216j10297K7265
15034A88634P4861m7277Q0635I0290b18450B57440A6900i5605E7607R9806P0449
$$ plain form
15115 -222896 -9675 84863 41815 126931 212997 217585 267184 298454 61261 133578 180311 10679
15102 -29366 -131809 88472 -20500 116681 58056 97570 69639 73501 160430 136634 348656
15091 348656 -598 143802 -128924 209921 26427 208930 205635 33708 466084 182283 -112415
15079 -273276 19206 -122374 496172 290566 -132346 232700 51328 119130 -74376 240438
15068 199935 344566 40792 -75270 92877 93169 251066 394511 -52452 2 -43015 -175270 181650
15055 -197270 96270 159397 -146430 17472 143321 321373 -131989 142271 69635 488751
15045 488751 -74103 18622 35514 33554 64046 124027 397712 394882 271666 161369 188634
15034 188634 263495 216218 296853 90290 -218450 257440 16900 -95605 57607 157413 227862
15023B27862K00237j63349a17380E27188j77234j12276J17333A00398L2019N9045
15013A91462p7560j3228J67464D9698Q8882C2123f0693E0054J11290K4340m0124
15002A45560h6342A35235k6726I303a51914O5892b5864A06717L4539J86641c95447
14990H8507g3944B53719r9258J22298a147r0160B45194o9252p0498L88654B23495
14978C21792K5416A66457l2013J12606j10214Q1371J37041l9132j39784i7285
14967B62521G9074K96638j66861l5727P7562E7586J32853R1951J4097J03377P0595
14956D70459A97520M38711B56591a06460E40495B236L22990a42309p0828E0335
14945A53041K29521E5211J29107K06991K6516j47327q7701K37748o3329k6934
$$ plain form
15023 227862 428099 264750 -117380 527188 349954 237678 355011 100398 132417 191462
15013 191462 113902 100674 268138 49698 138580 32123 -60693 50054 161344 185684 145560
15002 145560 -86342 135235 108509 9303 -151914 -86022 -25864 106717 141256 327897 -395447
14990 88507 -73944 253719 154461 276759 -1147 -91307 245194 175942 105444 494098 223495
14978 321792 347208 166457 134444 247050 136836 218207 355248 316116 176332 -97285
14967 262521 79074 375712 208851 173124 250686 57586 190439 282390 296487 399864 470459
14956 470459 197520 636231 256591 -106460 540495 2236 325226 -142309 -213137 50335
14945 153041 382562 55211 184318 391309 417825 270498 182797 420545 357216 330282
14935C30282A56766E1936K03265j25648J84301f2045E35351B04952o3734L01223
14925D42441A79065n3445o0817M4949L8704J22240K92296A60986L07035j86139
14915B81882J26944I3356K94961j12544j29477L33698O335k1474r8120j9616j32449
14904B14670p798M02879j59114B13130j0473J27345j33503O0475E6951J22241
14894A79192L68026j97316l3378F8289R3332k916J4667K60268A07042K8251N8361
14883A93654M00197B20283Q4046D9843N93797c7598F11491A83199J01565K80489
14873E65253M891o8626j81719J3965g2196E17509F1424K93877J62741J71320k78256
14862D11106k04401K89967l356j4659o0059k1824j71305J35432r1516J43880j23486
$$ plain form
14935 330282 156766 51936 255201 129553 313854 -62045 535351 204952 141218 442441
14925 442441 179065 125620 64803 109752 148456 270696 562992 160986 468021 281882
14915 281882 408826 93356 388317 275773 146296 479994 486329 464855 366735 347119 214670
14904 214670 206872 609751 450637 213130 202657 330002 196499 256974 56951 179192
14894 179192 547218 349902 316524 68289 161621 158705 173372 433640 107042 135293 193654
14883 193654 593851 220283 304329 49843 643640 -37598 611491 183199 284764 565253
14873 565253 570144 501518 319799 333764 -72196 517509 61424 355301 518042 689362 411106
14862 411106 206705 496672 493316 478657 418598 396774 225469 360901 269385 413265 289779
14851B89779R2974M8039d1290C09853K62877l7504R6193j28420j72889M1895A14215
14839E24810P1456A7265N03099J63261j10946j6465n3587J14990j97274L7468
14829D57811B27553Q3059J3124L7556J198k4299l7238J63798j27518j62040K37272
14818D12465J34691L9384j69624Q3422p892r7670j25770J77879j49828J23304
14808D20361Q1091R1340o5441A66691K63598j4n4279J77392N7242j00776J55264
14797F65118k81049L02587C14216K56855j42961J84195q9662J40323B12773J73029
14787C85802A88285K39254A09687O63124j6190B67524L86274o8306J50867C08879
14776C55540L47694l4309J44786B34237M06171B04406Q2508M60206C24636J50397
$$ plain form
14851 289779 382753 430792 -41290 309853 572730 535226 631419 502999 330110 372005 114215
14839 524810 596266 17265 520364 683625 572679 556214 502627 617617 420343 457811
14829 457811 227553 310612 323736 361292 362490 338191 300953 464751 337233 175193 412465
14818 412465 547156 586540 416916 500338 492446 394776 269006 446885 297057 420361
14808 420361 501452 592792 527351 166691 430289 430275 375996 553388 610630 509854 665118
14797 665118 384069 686656 314216 571071 428110 612305 522643 662966 212773 385802
14787 385802 188285 427539 109687 772811 756621 267524 653798 585492 736359 308879
14776 355540 703234 668925 813711 234237 640408 204406 286914 747120 324636 475033
14766D75033J16925B82898L14118j24526J22688j75409J16457K97063l13877L6874
14756E56286J49515j24933K58820J05797j79535k85778J48390k83958N11898B83592
14745D14649M03983r231L6170r5303K224j82468J87241P2493C53952M39039j38961
14734F54030J0970j05142L48575j44868j29438k54232M40660m2974N576K08919
14724I92076p2855p2466k33890K97809j61274j72365K86107k53441j7902K42669
14714H34468M9530n1589J8823j74456L4285J12756j32232J34986k34284L10491
14704I02778l0247j65715j34752L76466n4849j64732j74641J95640K11206j37768
14694H23386l2405J85449J88955k18820l85373J14166j51018L17798o4483M7065
$$ plain form
14766 475033 591958 282898 597016 472490 595178 419769 536226 833289 519412 556286
14756 556286 705801 580868 839688 945485 765950 480172 628562 344604 856502 283592
14745 414649 818632 809401 845571 750268 752492 570024 757265 829758 353952 792991 654030
14734 654030 665000 559858 908433 763565 634127 379895 820555 777581 783157 992076
14724 992076 919221 846755 612865 910674 749400 577035 863142 609701 591799 834468
14714 834468 883998 832409 851232 676776 711061 823817 691585 826571 592287 902778
14704 902778 872531 706816 572064 948530 893681 728949 554308 749948 961154 823386
14694 823386 790981 976430 1165385 946565 561192 675358 524340 842138 777655 824720
14684H24720J79667M1042l05373J40089N3463r2042j01695J28425j01898K72037
14674A038435j61390J91818K5597j39719l3991P5877N5004j11826l7283N586K69305
14663A177413j86558n4835J25138o259k11168K78675k27970J04132j50222K10641
14653A058987J74614K64259l94318j83301L37907k10268K57745k15752q8209Q2553
14643A084217j39161K42872P5434j46189P3727J3631j64241J58121j82385Q9400
14633A105426m7637K687M47889k79638M09980l68681L81654k51330q6424k46800
14623A067126L87861m2918M8109j24124M0935j8317J58011l52339L74608j78846
14613A360106r7355K68997l33306K49728J7080J4749k06608J94760n4844j434
$$ plain form
14684 824720 1004387 1045429 740056 880145 933608 841566 739871 868296 766398 1038435
14674 1038435 877045 1068863 1094460 954741 920750 996627 1051631 939805 902522 908108 1177413
14663 1177413 990855 936020 1061158 1054899 843731 1122406 894436 998568 848346 1058987
14653 1058987 1233601 1497860 1103542 920241 1258148 1047880 1305625 1089873 1001664 1084217
14643 1084217 945056 1187928 1263362 1117173 1190900 1204531 1040290 1198411 1016026 1105426
14633 1105426 1057789 1060476 1508365 1228727 1638707 1270026 1651680 1400350 1313926 1067126
14623 1067126 1454987 1412069 1460178 1336054 1376989 1358672 1516683 1164344 1538952 1360106
14613 1360106 1262751 1531748 1198442 1448170 1465250 1479999 1273391 1468151 1413307 1411873
14603A411873N39270m95370m8424J18116K7859j61440L03082j66109O7158K34228
14593A830243r9385M953k88757N49678l56336j3573r6337O8525J62963k8033M3034
14582A776975j50442L64084m28364N48397k226m27173J72971J64681j37374m16335
14572A465194N23846l65166K77189O183M4713q1602J20240J59497k92782L64267
14562B221579j68041L77659l34338k5565P1968R2912J17733K29076k76234J11192
14552B417941j09738P9081K40306j70007Q7660P2754L20112k67111O00312J31141
14542C402451r5223N54953j31345M04123O64893M80986J004660J128835J970986
14533I385319L769056N807080Q104471K236998j1386923o602823l598042k322862
$$ plain form
14603 1411873 1951143 1455773 1407349 1525465 1553324 1391884 1694966 1528857 1596015 1830243
14593 1830243 1730858 1735811 1447054 1996732 1640396 1626823 1530486 1599011 1761974 1733941 1776975
14582 1776975 1626533 1990617 1562253 2110650 2108424 1681251 1854222 2018903 1881529 1465194
14572 1465194 1989040 1623874 1901063 1907246 1951959 1870357 1990597 2150094 1857312 2221579
14562 2221579 2053538 2431197 2096859 2071294 2143262 2236174 2353907 2582983 2306749 2417941
14552 2417941 2308203 2387284 2627590 2457583 2545243 2617997 2938109 2670998 3271310 3402451
14542 3402451 3307228 3862181 3730836 4134959 4799852 5280838 6285498 7414333 9385319
14533 9385319 13154375 18961455 27065926 29302924 17916001 11313178 7715136 5392274
14525E392274j032033n62696k38895l70342m33972k3128m99049N16568m58396
14516B290331k23234L68476k7136l7749L97221n06837P39309m10856L42359k47303
14506B684581k86929K66655q8504M55176l12962K16919l36598O78299l58919k7092
14496B890626J73833k52963R5773q0075K91710J8346k31296N69391l12982k05447
14486B956916K20710O4376K47113j64221K06903k76404J63335K20121K31140n71006
14476C298983O36099k10548j64772M095L68129l53787L54079L1012m6711j16670
14466C799909J16028M08991k79087L51657j12100k87877K60495k13430K78879
14457D323465J54979j40446M58033j53539P7186O6267J18525Q7202l58677L11035
$$ plain form
14525 5392274 4360241 3797545 3558650 3188308 2754336 2731208 2232159 2748727 2290331
14516 2290331 2067097 2435573 2408437 2370688 2767909 2261072 3000381 2589525 2931884 2684581
14506 2684581 2397652 2664307 2575803 3030979 2718017 2934936 2598338 3276637 2917718 2890626
14496 2890626 3064459 2811496 2907269 2827194 3118904 3137250 2905954 3475345 3162363 2956916
14486 2956916 3177626 3242002 3489115 3324894 3531797 3255393 3418728 3638849 3869989 3298983
14476 3298983 3935082 3724534 3559762 3563857 3931986 3578199 3932278 3963290 3916579 3799909
14466 3799909 3915937 4324928 4045841 4397498 4285398 3997521 4258016 4044586 4323465
14457 4323465 4478444 4337998 4796031 4642492 4719678 4785945 4904470 4991672 4632995 4944030
14447D944030J83149l34035J12706L25714K7573J01688J68957m65243N25474k17841
14437E372172J39841L38656j04262L7109n11502O33654K20961k22237L19581J48388
14427F372361l977K13889m64115M20685l34501M39741M10767n22579L09839J18374
14417F960484m7556J78417K26858K12953L6547J49726j584K41335K62421k06315
14407H013286K70158K56982l40557j91847P44620L02217L6074k06861L16406o127
14397I194351k11631M33218L14160K496P5107K30080J42533K53292K32947J83572
14387A0850125K00988L80753o660J23368N9087J99024K5965N92081k16459P42915
14377A2951187k79456L95113K38414J46802M29853L73385k43581O27145L21497
$$ plain form
14447 4944030 5127179 4793144 4905850 5231564 5259137 5360825 5529782 5064539 5590013 5372172
14437 5372172 5512013 5850669 5746407 5783516 5272014 5905668 6126629 5904392 6223973 6372361
14427 6372361 6368384 6582273 6118158 6538843 6204342 6644083 7054850 6532271 6842110 6960484
14417 6960484 6912928 7091345 7318203 7531156 7567703 7717429 7715845 7957180 8219601 8013286
14407 8013286 8283444 8540426 8199869 8008022 8752642 9054859 9090933 8884072 9200478 9194351
14397 9194351 8982720 9415938 9730098 9732594 9807701 10037781 10180314 10433606 10666553 10850125
14387 10850125 11051113 11431866 11425206 11548574 11607661 11806685 11832650 12424731 12208272 12951187
14377 12951187 12671731 13066844 13305258 13452060 13881913 14255298 14011717 14638862 14960359
14368A4960359K04075L46615K71650k24377M65501O05521o7641M87854M78861
14359A7528418J51089N45192L00264L16292L81499K44769N41769N07450L14033
14350B0830775N02287N88475K65230K55585N48064P53220M34703M70731L06297
14341B4955367R15428N02265P11844L35273Q65956O55844J078046Q33267N76066
14332C1429356O11310R26923N62960P94162J156434J076123N31193J329162J005144
14323C9422767J071050J276086J201076J046261J301062J059510J610330J292209
14315D9280351J763268J372043J832139J741750J629157J976258K073706J848397
14307F3517069K336543K050747K219783K768384K687696K887563K829550L055782
$$ plain form
14368 14960359 15164434 15511049 15782699 15558322 16023823 16629344 16561703 17049557 17528418
14359 17528418 17679507 18224699 18524963 18841255 19222754 19467523 20009292 20516742 20830775
14350 20830775 21333062 21921537 22186767 22442352 22990416 23743636 24178339 24649070 24955367
14341 24955367 25870795 26373060 27084904 27420177 28286133 28941977 30020023 30853290 31429356
14332 31429356 32040666 32967589 33530549 34324711 35481145 36557268 37088461 38417623 39422767
14323 39422767 40493817 41769903 42970979 44017240 45318302 46377812 47988142 49280351
14315 49280351 51043619 52415662 54247801 55989551 57618708 59594966 61668672 63517069
14307 63517069 65853612 67904359 70124142 72892526 75580222 78467785 81297335 84353117
14299H4353117L291209L255102L910915L625237L713014M284592M327448M758835
14291A15519469M996433N063331N404597N957964O025911O600066P186807P006482
14283A63761060P515962Q219102Q887678R126556J0150611R674173J0801839J1428270
14275B39565251J1929556J2377983J3103054J3462039J3789633J4200352J4530222
14268C32958090J4119722J4123337J3579953J3926521J3099268J2248835J0832639
14261D24888365J0020448R075214Q044456O379081K609069J122263J286137j469898
14253D61955135p617484p060713q081710r586503j0073696j1838831j1869766
14246C95826432j3381152j3481051j3670193j4611700j4561735j4503274j4317280
$$ plain form
14299 84353117 87644326 90899428 94810343 98435580 102148594 106433186 110760634 115519469
14291 115519469 120515902 125579233 130983830 136941794 142967705 149567771 156754578 163761060
14283 163761060 171277022 179496124 188383802 197510358 207660969 217335142 228136981 239565251
14275 239565251 251494807 263872790 276975844 290437883 304227516 318427868 332958090
14268 332958090 347077812 361201149 374781102 388707623 401806891 414055726 424888365
14261 424888365 434908813 443984027 452028483 458407564 461016633 462138896 463425033 461955135
14253 461955135 454337651 447276938 439195228 429608725 419535029 407696198 395826432
14246 395826432 382445280 368964229 355294036 340682336 326120601 311617327 297300047
14239B97300047j4114405j4091922j3754694j3074642j2517968j2135951j1050949
14232B06559516j0678387j0212122r095723q629963q229131p506946p348573o625055
14224A38233616o249345n931414n485535n452368m884617m763545m514890l689574
14216I7262328l742425l709578l942597l398320k719891l285263k865184k607675
14208G0991395k602757k428462k126898k318558j753541k180521j990048k004909
14200E3585701j526845j475099j189010j607344j683402j598371j337650j033209
14192D2134771o83555j344694j036318j223123r70487q59258j263550n58570j308014
14183C2887202q72927r79104m14848o83617m66860n77182j287518p46237n59327
$$ plain form
14239 297300047 283185642 269093720 255339026 242264384 229746416 217610465 206559516
14232 206559516 195881129 185669007 176573284 167943321 159714190 152207244 144858671 138233616
14224 138233616 131984271 126052857 120567322 115114954 110230337 105466792 100951902 97262328
14216 97262328 93519903 89810325 85867728 82469408 79749517 76464254 73599070 70991395
14208 70991395 68388638 65960176 63833278 61514720 59761179 57580658 55590610 53585701
14200 53585701 52058856 50583757 49394747 47787403 46104001 44505630 43167980 42134771
14192 42134771 41451216 40106522 39070204 37847081 36876594 36017336 34753786 34195216 32887202
14183 32887202 32014275 31035171 30620323 29936706 29469846 28892664 27605146 26858909 26299582
14174B6299582o90897n36773l24879q22226n36912o46635n13166n49580j85658
14165B1492856n95839q10095m5499l77414k44841m22420p36778l24603k81496
14156A7653871l48701l46912j68093j75501m99141k43965m71685j9923n61069
14147A4818881j94623n3349k80650o97033K36756m32761j07997o05236R9560l68103
14137A2415445q7792l26659k64492L8107j59158j97615m56244L05224o52763l5047
14127A0579006L4809j69808l7725n1841o33608m5765k51540J56835j12597m52621
14117I015145N2174k8157m12887J30664j73636K187k15529J41841n08120k6384
14107G977298j56901J97687o78287J86973K8412j02025J03325m12560j5655j58202
$$ plain form
14174 26299582 25608685 25071912 24747033 23924807 23387895 22741260 22228094 21678514 21492856
14165 21492856 20897017 20086922 20041423 19664009 19419168 18996748 18259970 17935367 17653871
14156 17653871 17305170 16958258 16790165 16614664 16115523 15871558 15399873 15379950 14818881
14147 14818881 14624258 14570909 14290259 13593226 13829982 13397221 13289224 12683988 12783548 12415445
14137 12415445 12327653 12000994 11736502 11774609 11615451 11417836 10961592 11266816 10614053 10579006
14127 10579006 10613815 10444007 10406282 10354441 9720833 9675068 9423528 9580363 9467766 9015145
14117 9015145 9067319 9039162 8626275 8756939 8583303 8585490 8369961 8511802 8003682 7977298
14107 7977298 7820397 8018084 7339797 7526770 7555182 7453157 7556482 7143922 7128267 6970065
14097F970065k8282k61j01926o04979K86818N1782k05055J70852k64721Q0681
14087F354974l68536J58070p2961j02923j44870J31291k04075k00024m8895K74447
14077E776498j09351j27049m03297K22317J99767n55076J56902m22385J02823
14068D841149k37397J27968J93456k54460k66482M33558m87390J90072O530L1157
14058D578161k28564K49758k63352j19305m009K45380l72025L51589l86229j48630
14048C902774K83665l59171J94368k75511N32556m90079k5733K4022j41090L8702
14038C684503L4486k48820m87759M66232J02313J1122l26072L57651o73859M46472
14028C366269j41184Q0698J87923p5335n46281M72525m01051L34848m83338M02336
$$ plain form
14097 6970065 6941783 6941522 6839596 6234617 6521435 6573217 6368162 6539014 6274293 6354974
14087 6354974 5986438 6144508 6071547 5968624 5823754 5955045 5750970 5550946 5502051 5776498
14077 5776498 5667147 5540098 5136801 5359118 5558885 5003809 5160711 4738326 4841149
14068 4841149 4603752 4731720 4925176 4670716 4404234 4837792 4350402 4540474 4547004 4578161
14058 4578161 4349597 4599355 4336003 4216698 4212689 4458069 4086044 4437633 4051404 3902774
14048 3902774 4186439 3827268 4021636 3746125 4278681 3788602 3762869 3786891 3645801 3684503
14038 3684503 3718989 3470169 2982410 3448642 3550955 3562077 3236005 3593656 2919797 3366269
14028 3366269 3225085 3305783 3493706 3418371 2872090 3344615 2943564 3278412 2795074 3197410
14018C197410j97741r4220Q544m4520K33778k5624j35551K78529k22843l21952
14008B675810J85267j68959q6814K16754O0456n30463L54943j91151L13396n35971
13998B293268M24231j83856j49185K34867J25916j59811l5296j37488j97537K95292
13988B510401j41016m1872J97515j07814m0786L7517k3050K07127K86214j47023
13978B737213L07532N02178L14526J025204J374647L217944N523547Q921222N746795
13969B9670808q452799o940856m213206k515924j334397j012968m98886o02271
13961D099501l48646r2735l49880k47945J44934m87647n4736l74259J62851K83546
13951B734984l73333L20074l21541J28932m38600K85611l54817J93353k6556q9829
$$ plain form
14018 3197410 2999669 2905449 2913993 2869473 3103251 3077627 2942076 3220605 2997762 2675810
14008 2675810 2861077 2692118 2605304 2822058 2882514 2352051 2706994 2515843 2829239 2293268
13998 2293268 2717499 2533643 2384458 2619325 2745241 2585430 2550134 2412646 2215109 2510401
13988 2510401 2369385 2327513 2525028 2417214 2376428 2413945 2390895 2598022 2884236 2737213
13978 2737213 3044745 3546923 3861449 4886653 6261300 9479244 15002791 23924013 29670808
13969 29670808 21218009 14277153 10063947 7548023 6213626 5200658 4701772 4099501
13961 4099501 3750855 3658120 3308240 3060295 3205229 2717582 2662846 2288587 2451438 2734984
13951 2734984 2361651 2681725 2360184 2489116 2050516 2336127 1981310 2174663 2148107 2058278
13941B058278J83499j3831l71115J01977J68300j7344n00420K16652K40925n98469
13931A468452N89130q5712l19706o3705k175K51783j86656K19617j34104J13026
13921A849950J26206j76725m68887N84778m69842k508P3934N8839j30059K29392
13911A675078j30635K25478k82937j33182K7127J79271K5030J53437J05607n54006
13901A290268O1156J3542K80513n27165K40186K38603j08968q8577J54252m61764
13891A092046L78524k54429o2808J09676N8665J47896j63112J9725n850K7432
13881A347765k7022p0169j87765M21224p1821l32803J25249J7376L06873n27158
13871A001749J45213K0035J78125j80723p1402J7142J56603j15328j58167K99749
$$ plain form
13941 2058278 2241777 2227946 1856831 1958808 2127108 2109764 1609344 1825996 2066921 1468452
13931 1468452 2057582 1971870 1652164 1588459 1586284 1838067 1651411 1871028 1736924 1849950
13921 1849950 1976156 1799431 1330544 1915322 1445480 1442972 1516906 1575745 1445686 1675078
13911 1675078 1544443 1769921 1486984 1353802 1380929 1560200 1585230 1738667 1844274 1290268
13901 1290268 1351424 1364966 1645479 1118314 1358500 1597103 1488135 1399558 1553810 1092046
13891 1092046 1470570 1216141 1153333 1263009 1321674 1469570 1306458 1326183 1320333 1347765
13881 1347765 1320743 1250574 1062809 1484033 1412212 1079409 1204658 1222034 1528907 1001749
13871 1001749 1146962 1166997 1345122 1164399 1092997 1110139 1266742 1151414 993247 1292996
13861A292996k7912K8670j6607k9610k68862J79435r3978P6164m15568O30165
13851A354893m9519N234j10835L4821m28797J83662j67628L41633M034l53059
13841H14439J49541K55193j18437J49976o2409j22185J13603l42401O51699k48032
13831A240987k72926J38092K1859J94665m73375J89519O5516N8238E47605N56242
13821A103847j39341o7854l14347L48928L38783m77489k1697J73677l35537L02141
13811I11111k12138L72799r4328O2787k50939j75432K53863K64854m9153j32383
13801I51041k7373j32218K56533n14079L82031Q4264j25589j50402p7558J47019
13791G93669M2630K35769m52741L6492k5355K49046l62k55831O2193M03857l85706
$$ plain form
13861 1292996 1265084 1293754 1277147 1247537 978675 1158110 1064132 1140296 724728 1354893
13851 1354893 1305374 1310608 1199773 1234594 805797 989459 821831 1163464 1167498 814439
13841 814439 963980 1219173 1100736 1250712 1188303 1066118 1179721 837320 1489019 1240987
13831 1240987 968061 1106153 1128012 1322677 849302 1038821 1104337 1162575 547605 1103847
13821 1103847 964506 896652 582305 931233 1270016 792527 770830 944507 608970 911111
13811 911111 698973 1071772 977444 1040231 789292 613860 867723 1132577 1083424 951041
13801 951041 923668 791450 1047983 533904 915935 1000199 874610 724208 646650 793669
13791 793669 836299 1072068 619327 655819 630464 879510 879148 623317 685510 1089367 703661
13780G03661K01466N3185j94322P1127k8370r2105j33470L95845J42109l11807
13770H07319o7320R2417K3578D11676O47803l38561J31237n3444l43862R2236
13760E47085k0923J00740J79643K15529l79419J35892P1660m00137J32715j03318
13750D79467K82487j55978j72744L49155K5071k11894R526J02965k79643Q7686
13740E16098J25973J44616k42763K53556l37982L533L37803l01553R7177R2537
13730F88995K2782r0518N6982j73141K73350o9105r9929P1312L3027k15110L38848
13719H37493B57996L44371j20104J36471n0888K09630j81550r5895j14928N3341
13709D38444M6623K08060k24617J79240R4262k43385N46323C99049q8106K09934
$$ plain form
13780 703661 905127 958312 763990 835117 806747 714642 581172 977017 1119126 807319
13770 807319 739999 832416 855994 411676 1059479 720918 852155 798711 454849 547085
13760 547085 526162 626902 806545 1022074 642655 778547 850207 450070 582785 479467
13750 479467 761954 605976 433232 782387 807458 595564 605090 708055 428412 516098
13740 516098 642071 786687 543924 797480 459498 463031 800834 499281 596458 688995
13730 688995 711777 621259 678241 505100 778450 709345 609416 680728 713755 498645 837493
13719 837493 257996 602367 482263 618734 567846 777476 595926 500031 385103 438444
13709 438444 485067 693127 468510 647750 742012 498627 1044950 399049 310943 520877
13699E20877m3185J39654n1168j44976j51235K85224K23970C45531L30999Q8216
13689G64746j96300k13430K99730j15016k1631L05093k15237o8277J97258n8701
13679F78235n931k60365R5626k01086q4290P6785O16260l04704O1744j87895j99482
13668B84897P3757j71429M36165B23379K92810N4980J60126l25655r837M38162
13658H33965l19339P7105B60759K35101m8478q6111q9533K18781R903k16542L0919
13647C14799K6845M24957j46159k88547J30560A35759n3757K61945A25466c6589
13636B85178P3444A46744M36695O0030B60791L78050J9314j48406k2996j42581
13626C44172m288R78K4627K69713j34257J96018B90923m4069J54186K69072A20958
$$ plain form
13699 520877 477692 617346 566178 421202 269967 555191 779161 345531 676530 764746
13689 764746 568446 355016 654746 539730 518099 823192 607955 539678 736936 678235
13679 678235 672304 411939 507565 306479 222189 298974 915234 610530 672274 484379 284897
13668 284897 358654 187225 623390 223379 516189 571169 731295 405640 395803 833965
13658 833965 514626 591731 260759 495860 447382 361271 271738 490519 500422 283880 314799
13647 314799 341644 766601 620442 331895 462455 135759 82002 343947 125466 -36589
13636 285178 358622 146744 583439 643469 260791 638841 658155 509749 486753 344172
13626 344172 339884 340862 365489 635202 500945 696963 290923 246854 401040 670112 120958
13614D18219J87983j73870Q0456Q3990a3574C29053N35045C94486O0367P3876
13604E28729k11028K32561j68051R5440K96360B78162M2881L0043J50516j97484
13594C04118K62249G6647J05598K65145K1582j47433Q666M37419B30712M90337
13584G21049E8147K74576G8532L67237r3392J39474B0098K91375A24961N07486
13574F32447k3584d1716D12383k4575A15860J69923J71146k10930m3864J09137
13564C11272D0936K87229K1533n0263O9909A31148M2443L42670l946A71489K82137
13553D53626k7531K8548j67274J6209m9845P9341J96208j54679J52232q9063K38350
13542F76122B3528K64524J66172k17315J41586m2902n3130M23505k76133H7479
$$ plain form
13614 418219 606202 432332 512788 596778 -13574 329053 864098 394486 454853 528729
13604 528729 317701 550262 382211 477651 774011 278162 321043 351086 501602 304118
13594 304118 566367 76647 182245 447390 468972 321539 330205 767624 230712 721049
13584 721049 58147 332723 78532 445769 352377 491851 20098 311473 124961 632447
13574 632447 608863 -41716 412383 387808 115860 285783 456929 245999 202135 311272
13564 311272 40936 328165 349698 299435 369344 131148 173591 516261 512315 171489 453626
13553 453626 426095 454643 287369 303578 253733 333074 529282 374603 526835 437772 676122
13542 676122 23528 288052 454224 236909 378495 335593 282463 705968 429835 87479
13531E19491B39427Q8911K03384A90864K62471K43078B29778L6940J09517F4140
13520E84882k71964J59657R9231k31299E3303M43104j06014G9438L05971j04332
13510B81077k0931l9515J91239K3909A31794J90551k5606i1729E91366A09709
13499C33057e411C35080k9213K45198J46624B52573f3731A87619d301B16914K60416
13488D77330a62837F2696M50286k47292P9936g0110C69449j81292N0105j10339
13478A27923J7723L15606A33404M89791h6423C72885A78921L8890K23926A86870
13467H2818L15885o0057K79117A27612K27888a9362C11287M1158j08167J04909
13457C49187A48006l9436J57093h2822B41854F9049J8517d0425B26955r4346J92116
$$ plain form
13531 519491 239427 328338 531722 190864 453335 696413 229778 266718 376235 64140
13520 584882 312918 472575 571806 340507 53303 496407 390393 79438 385409 281077
13510 281077 260146 220631 411870 435779 131794 322345 296739 -91729 591366 109709
13499 333057 -5411 335080 305867 551065 697689 252573 -63731 187619 -4301 216914 477330
13488 477330 -162837 62696 512982 265690 345626 -70110 369449 188157 238262 127923
13478 127923 145646 461252 133404 623195 -86423 372885 178921 217811 441737 186870
13467 82818 398703 338646 617763 127612 355500 -19362 311287 352445 244278 349187
13457 349187 148006 108570 265663 -82822 241854 69049 87566 -40425 226955 132609 324725
13446C24725J8466F1914L78233A39417D9155M16805p6422A58666P634k5045n5159
13435H6096K1874K39552k1145j04726L71290c5906A04684K79226F281J22093r088
13424A19286M88000k48678A01662k9037K37164A49781E6617K82182a03301j25775
13414b29076D07271O6244B00684J23398j00039J88823n283A97326K03453A40578
13403B37213R5915l5041L66290B01256B1018J31807o2983K14244H3345b07087
13392B87674f9739B9974R5585J05588j10559J69455A13317J11508G2615c19746
13381H718K1921L02666p2575J5508R1130j07953F5944J76748n9986o1014J43325
13370B65017K1442K25885B26799j09837K023J31379j02053J96349j34731J53817
$$ plain form
13446 324725 343191 61914 440147 139417 49155 465960 389538 158666 166300 141255 86096
13435 86096 107970 347522 326377 221651 592941 -35906 104684 383910 6281 128374 119286
13424 119286 607286 358608 101662 72625 309789 149781 56617 338799 -103301 -229076
13414 -229076 407271 473515 200684 324082 224043 412866 407583 197326 400779 140578
13403 237213 333128 298087 664377 201256 21018 152825 89842 304086 83345 -207087
13392 287674 -69739 29974 125559 231147 120588 290043 113317 224825 72615 -319746
13381 8718 30639 333305 260730 276238 367368 259415 65944 242692 182706 121692 265017
13370 265017 286459 512344 226799 116962 118985 250364 148311 344660 209929 363746
13360C63746j31865J69159A90541J56448E0533M82713B03376K35402l3873K1720
13350D26625M2529a22210B68811n7868n1952K32051n1692L8281j05887I8810O2758
13339A61568E6457B4830K62454L5935q4724l2301J52906J75523j25919A98045
13328A03313J05632L46142B09523E3738A9450M79628j24535C8250a1144C05612
13317C71638c8228A55622J66233b44774F9379K95774J07556A24035J04324J94977
13307D23336p826A18761a2499A82240e8163A44852n2210L79122j12883K01358
13297E60239d2526g376B81264n8619q336B4397K22546I0277J32600a86792A12663
13285i9895A51743K27450A39039O1985A8499K50197A08422n035b054A79224A7961
$$ plain form
13360 363746 231881 401040 190541 346989 50533 533246 203376 438778 404905 426625
13350 426625 469154 -122210 268811 210943 158991 391042 339350 377631 271744 98810 161568
13339 161568 56457 24830 287284 323219 238495 206194 359100 534623 408704 198045
13328 103313 208945 555087 209523 53738 19450 499078 374543 38250 -11144 305612
13317 371638 -38228 155622 321855 -244774 69379 365153 472709 124035 228359 423336
13307 423336 415510 118761 -12499 182240 -58163 144852 92642 471764 358881 560239
13297 560239 -42526 -7376 281264 222645 214309 24397 246943 90277 222877 -186792 112663
13285 -99895 151743 379193 139039 201024 18499 268696 108422 103387 -2054 179224 17961
13273C29303o2411o9287q6019K5567K688l0769J17977a27897e2767E7819O2865
13262A20684A3722J25707b06441H9000f263B10724f6021B26024A6745K12055n0109
13251A78691J4828a73807A12501h0499A07021a27596B91871p8687J82863A70170
13240d4512r6029A19431a43447D67104g0718j34812B75324A24580J21797L181
13230B49558j14132K00565A35414K68523A41750f4922B25427H1523J14481a07267
13219C76826A33608J35248I1355D3680J9644L29737a29879B1259K45458k604j16745
13208A47368a44638A67583m4563J443m1993B6714d4419B33638h1503C88542D0377
13196A73889a68146B56587b9163A31972l7532j2845B1526a09897m7217D26067
$$ plain form
13273 329303 266892 197605 111586 137153 139841 109072 227049 -127897 -52767 57819 120684
13262 120684 13722 139429 -206441 89000 -6263 210724 -66021 226024 16745 228800 178691
13251 178691 193519 -173807 112501 -80499 107021 -127596 291871 213184 396047 170170
13240 -44512 -140541 119431 -143447 467104 -70718 -205530 275324 124580 246377 249558
13230 249558 135426 335991 135414 403937 141750 -64922 225427 81523 196004 -107267
13219 376826 133608 268856 91355 43680 63324 393061 -129879 21259 266717 264113 147368
13208 147368 -144638 167583 123020 124463 82470 26714 -44419 233638 -81503 388542 40377
13196 173889 -168146 256587 -29163 131972 94440 81595 21526 -109897 -157114 426067
13185a9849B5312J84535P3176A16875Q2834J36824A39117F440a56567D63792G4290
13173A61730J44954p8774h3609b8305r2397A80073p2959a68072A4268O70a89692
13161F9774K57690A17633J15093k5959G5991M71101C3994K7161a2855o1946C44568
13149C86288j25912l8798A3031c5459A51829K10397a53457H2737K43195E7779
13138A6828K80694r2362a56840C5191N7189l5724K40698k5233D9618L2110P1473
13127A53201a29691I4883l363O812k2466J69958a2807A19804l0085K25106j23658
13116A91167B0690K69439A35488D6640L44539B3033N3974b26855q3637A34122
13105I4863f0929A53701J3975D7529J17148B6237L70437j23005D4991c4603A31847
$$ plain form
13185 -19849 25312 209847 283023 116875 199709 336533 139117 6440 -156567 463792 74290
13173 161730 306684 227910 -83609 -28305 -120702 180073 107114 -168072 14268 14938 -189692
13161 69774 327464 117633 232726 206767 75991 547092 33994 61155 -12855 -74801 344568
13149 386288 260376 221578 13031 -35459 151829 362226 -153457 82737 325932 57779
13138 16828 297522 205160 -156840 35191 92380 56656 297354 272121 49618 81728 153201
13127 153201 -129691 94883 91520 98332 75866 245824 -12807 119804 89719 314825 191167
13116 191167 20690 290129 135488 46640 391179 23033 77007 -226855 -310492 134122
13105 94863 -60929 153701 167676 47529 164677 26237 396674 273669 44991 -34603 131847
13093I9806K02425b69188a18388D3931g7209C01764A41245a85955A73066b56273
13082D8699K35885d45115a1591A54902L00049k10904a90401C56496E0069N4539
13072A04608M092i2845j18020C70164H2896e7831D7821a25055B18366Q7247A05218
13060d6958B37558F2984B1202R3466m8396L17834A27608I154i0342B47909J44425
13049C92334a57930d0580I9784M8761F4546b49781J08978I2224b71231B72164
13038G9320h8904j55139B86973A20482n9526K636J5589d087B22365L98098j37780
13027D82683g1557A86826B2719J71507K28293B11069P1818N1332f6193D48574
13016A46203F8875b93277C6534K56224L59085H7107D1351K12184d8782B22329
$$ plain form
13093 99806 302231 -269188 -118388 43931 -77209 301764 141245 -185955 173066 -256273
13082 48699 284584 -445115 -11591 154902 454951 244047 -190401 356496 50069 104608
13072 104608 108700 -92845 -210865 370164 82896 -57831 47821 -125055 218366 305613 105218
13060 -46958 237558 62984 21202 114668 66272 384106 127608 9154 -90342 247909 392334
13049 392334 -157930 -40580 99784 148545 64546 -249781 -140803 92224 -271231 272164
13038 79320 -88904 -244043 286973 120482 60956 63592 79181 -4087 222365 620463 482683
13027 482683 -71557 186826 22719 194226 422519 211069 282887 334219 -66193 448574
13016 146203 68875 -293277 36534 292758 651843 87107 41351 253535 -48782 222329
13005e0795C06148b1425B30347N5800k0102b22917A37419a53198K0122j1648A515
12993B20390g3275A55246o7927a00016B01190h7678A33815A9657K80306I8647
12982A96934B5838J35727a62552j7850A822h6499A00881J9640K7585L5634J64550
12971C48290a11367l4876A40097M0156K28327i9923j0728C5907b02275b6194k29776
12960b55970A06318c7252a12B07884a45983i938A77885n4082C0767F44d1443A95586
12947a06155A0868J59388N9905K81337A52150R7665n8922M900A1136J80119a87580
12935C2986M1316J62366a80422B74374F6560L3040m5489J40029F1487K3820B4173
12923a84455m1754a05340B58988a79856A42417b68892C5020a62039A8975a9239
$$ plain form
13005 -50795 306148 -21425 230347 286147 266045 -222917 137419 -153198 -133076 -144724 1515
12993 220390 -73275 155246 87319 -100016 201190 -87678 133815 19657 299963 98647
12982 196934 25838 161565 -162552 -180402 1822 -86499 100881 120521 148106 183740 348290
12971 348290 -111367 -146243 140097 180253 408580 -99923 -110651 35907 -202275 -26194 -255970
12960 -255970 106318 -37252 -112 207884 -145983 -9938 177885 123803 30767 644 -41443 195586
12947 -106155 10868 170256 230161 511498 152150 249815 190893 195793 11136 191255 -187580
12935 32986 74302 236668 -180422 274374 66560 99600 54111 194140 61487 85307 24173
12923 -184455 -226209 -105340 258988 -179856 142417 -268892 35020 -162039 18975 -19239
12912B8915K913a84001B23155c89641f2075o3576B461L15368b67496C61451o4955
12901B96496j02160h7103A63562J29289a0171B90829o4572b21587B2800c09400
12890D1780A6159a42269C2047J2082O4330k5297J462g2070A7672d86959D0755
12878B7740J3062h8866k3003A60911h8866L6191L105A35100o1203M7771a79965
12866A29287J63766j5649b68341h4609C39694A4426a98480a7383r5492A59993
12855i5608M4119I1003j453k788c0751B99931e464j4779A23717B3913a8855p0321
12843h9176H0616K1642b88597a503I8464a39624B75052G1660c83239E620R0527
12832I6147b58341A57952E230N66001A12141M4962C6403a88718C48609B5328a52343
$$ plain form
12912 28915 31828 -184001 223155 -389641 -62075 -125651 2461 317829 -267496 361451 296496
12901 296496 194336 -87103 163562 292851 -10171 290829 226257 -221587 22800 -309400
12890 41780 16159 -142269 32047 44129 108459 83162 84624 -72070 17672 -486959 40755
12878 27740 40802 -88866 -111869 160911 -88866 -52675 -49570 135100 73897 121668 -179965
12866 129287 293053 277404 -268341 -84609 339694 14426 -198480 -17383 -112875 159993
12855 -95608 -51489 91003 89550 86762 -30751 299931 -5464 -20243 123717 23913 -18855 -89176
12843 -89176 80616 102258 -288597 -1503 98464 -139624 275052 71660 -383239 5620 96147
12832 96147 -258341 157952 5230 571231 112141 157103 36403 -188718 348609 25328 -152343
12820A08056i4396C19337A12017d85273b33943b4938A9325a88438A93019a18349
12809A2072K22367q3652c329H0552b7213k8532B20201a25380q9491f6265E7449
12797a55873D0394Q5889a30741j01308B7183C496O0393K14356A30986J24625J75713
12786D31324i6012A45813a13156D77324A82211J36137A32238a45953A6289J74254
12776A90543a0485j85308A79928F189J1142J559J29004D124i5919k43172H3912
12764A21331a29782j53069A72148g9069A61908g3589j23316C8609L3542E680J98320
12753B04000b46855L5928a0944G5885a83523E1513K70569B1997L38766I2913L8924
12742A31837f003k21589C03958A04486d1354A9432c16870B38835e0355B99M14635
$$ plain form
12820 108056 -94396 319337 112017 -485273 -233943 -24938 19325 -188438 193019 -118349
12809 12072 234439 150787 -3329 80552 -27213 -55745 220201 -125380 -214871 -66265 57449
12797 -155873 40394 126283 -130741 -232049 27183 3496 63889 278245 130986 255611 431324
12786 431324 -96012 145813 -113156 477324 182211 318348 132238 -145953 16289 190543
12776 190543 -10485 -195793 179928 6189 17331 18890 147894 4124 -95919 -339091 83912
12764 121331 -129782 -282851 172148 -79069 161908 -73589 -196905 38609 72151 5680 204000
12753 204000 -246855 -210927 -10944 75885 -183523 51513 322082 21997 360763 92913 131837
12742 131837 -6003 -227592 303958 104486 -41354 19432 -316870 238835 -50355 299 414934
12731D14934H055b50737A70602a13741A1102a60549L5351C0464c18321c0089B8072
12719a05561A29532b521l70506E6064M3187l1856J23643a37269q6766j79173B85495
12707H2639L29948j57430b61951B29648C8005J29380a74851k9476C13875I8803
12696B40433H4666J19138j2521b56630D95728A81976B4535J18842o4759a78188
12685H3140L0316L02234G5424b39758A61549n715a51084C4996c26458i2436j35503
12674b27939d7396D2083a88033B79992o7979I3088K10130a11170A81052j6011
12664A65041K47455a32787C96270A88652a38795A07162d9120I3628k3004L50038
12654D20662b54163B26417a05650A0819J36480P1045h7559C1656i5360D65814
$$ plain form
12731 414934 8055 -250737 170602 -113741 11102 -160549 -125198 30464 -318321 -30089 28072
12719 -105561 129532 -2521 -373027 56064 99251 67395 191038 -137269 -224035 -403208 285495
12707 82639 412587 255157 -261951 229648 38005 167385 -174851 -204327 313875 98803
12696 240433 84666 203804 191283 -256630 495728 181976 24535 143377 78618 -178188
12685 83140 113456 415690 75424 -239758 161549 155834 -151084 34996 -326458 -92436 -227939
12674 -227939 -47396 42083 -188033 279992 212013 93088 303218 -111170 181052 165041
12664 165041 412496 -132787 396270 188652 -138795 107162 -49120 93628 70624 420662
12654 420662 -254163 226417 -105650 10819 147299 218344 -87559 31656 -95360 465814
12643C66035r8783D7224K64336A35171J5729l9440P0066p9220F430L06210j9281
12632B93359A44572f6498p1759m8693A62389b14104P2939B52162J21748j24428
12622B49482G6906l3073d1282C61642j69646K77317B04537a26584F39782E1206
12611I4014N4813b9241A63135K96044A20556K33405J94147a0884F4930i7415C8047
12599C89513F0103a73645Q6328I1360l9567Q6246k4905a19705A58041c7365j34246
12588a71611e1493A63278m2802K18459R712c22225B06282l858F441J41464j6825
12577A31080Q8860a5774A8101L06659A36079A4475J43694E9423N7036h8166A10954
12565C31590c9023j91771G681K51550p568c07608a37582c2166A43752b0781j64896
$$ plain form
12643 366035 267252 47224 311560 135171 150900 111460 181526 102306 6430 312640 293359
12632 293359 144572 -66498 -138257 -186950 162389 -214104 -141165 252162 373910 249482
12622 249482 76906 43833 -41282 361642 191996 469313 204537 -126584 639782 51206
12611 94014 148827 -29241 163135 459179 120556 353961 548108 -10884 64930 -97415 38047
12599 389513 60103 -173645 -87317 91360 51793 138039 113134 -119705 158041 -37365 -171611
12588 -171611 -51493 163278 120476 338935 348647 -322225 206282 202424 6441 147905 131080
12577 131080 219940 -15774 18101 324760 136079 14475 158169 59423 116459 -88166 110954
12565 331590 -39023 -230794 7681 259231 251663 -307608 -137582 -32166 143752 -20781 -185677
12554a85677B552c5261k56190J08004h9820B41303H7068a70125D754d8658j40920
12543a89578p5848q0345D27299h193C6476R8953n6532O0754K6024e580e76A78746
12530e6512A51025R9638g0971m22070H4612d809B65362E6593c02948A6206M46212
12519D62418A4431R4078g1803l5296m6936j753B97181b7592A18200b02345G1828
12507a2371A10096K77422F4415g8742a414D00246d0092H7730F057J5076g2381
12495B44291F6262a29975A5429a47391A67054o1591j7690h1334C4932J17587J03792
12484B56311b30882G7061B4316b1223k41080a30676F1811a66190J2976j02206
12474b55420C6803b11449j59235A1607J88198n1730a94534b9617k81054F2489
$$ plain form
12554 -185677 2552 -35261 -291451 -183447 -89820 241303 87068 -170125 4754 -48658 -189578
12543 -189578 -265426 -345771 427299 -8193 36476 135429 78897 139651 165675 -5580 -576 178746
12530 -56512 151025 250663 -70971 -493041 84612 -4809 265362 56593 -302948 16206 462418
12519 462418 14431 108509 -71803 -107099 -154035 -155788 297181 -27592 118200 -202345 71828
12507 -12371 110096 387518 64415 -78742 -1414 400246 -40092 87730 6057 21133 -72381
12495 244291 66262 -129975 15429 -147391 167054 105463 87773 -81334 34932 152519 256311
12484 256311 -230882 77061 24316 -21223 -262303 -130676 61811 -166190 -153214 -255420
12474 -255420 36803 -211449 -370684 11607 199805 148075 -194534 -29617 -310671 62489
12463I419c31854b4853j8151H2612b12181I5560a06234P71A26842l1881e07515
12451d82866K36654a01085l0043b1578o2570K4533B15379j01592c1304B58404
12440g6946G9750L19609b45748P4644C69898D5029f7691q7372r8633H730b43807
12428G727J88035a51380o7478c9024j12411r9206B86462i6043n4877c5297B21207
12416B538b74388C16539d8762D8042L3891b62852A43363a39149E6462J66935p2227
12405A51170f9623n2068p2637F3437c9341A36026i9604d8449D7652L72451d2864
12393D0103h0985A87446k5568d1179J4307A30850B9992J01016J81047G8981J13661
12382A92642F1732J66987d9346B51669j08832K0172A3014J83626d0382l71897
$$ plain form
12463 9419 -331854 -24853 -43004 82612 -212181 95560 -106234 -105463 126842 94961 -507515
12451 -482866 -246212 -101085 -131128 -21578 -84148 -59615 215379 113787 -31304 258404
12440 -76946 79750 399359 -245748 -171104 369898 45029 -67691 -155063 -253696 8730 -243807
12428 7727 195762 -151380 -218858 -39024 -151435 -250641 286462 -96043 -150920 -35297 221207
12416 2538 -274388 316539 -48762 48042 81933 -262852 143363 -139149 56462 223397 151170
12405 151170 -69623 -121691 -194328 63437 -39341 136026 -99604 -48449 47652 420103 -42864
12393 40103 -80985 187446 161878 -41179 -26872 130850 29992 131008 312055 78981 192642
12382 192642 61732 228719 -49346 251669 142837 163009 13014 196640 -40382 -412279
12372d12279J29392H8056R6833a99271C544O7040J1676p424A7368a4403C01847
12360I4423h501E9000b60234I1500P5766F0309b17015B48083G5924R3425F3201
12348B64101b82210L6713A76738b26784B56536A0496Q4358b73770I5807a21742
12337a41099e1080n0783C3275a13032B28679h5079H702a01404k60120i3787j26170
12326b19957G0022I263K11953a59680B17400i2208b5629G9882a72421g8658a4056
12314I9264d6033B3481A0315a90900A6778f8922A31588c90618a9328n8454j53739
12303b31521d1268I8828a06051I7513f0758C98522H8054K59494l9136m5469p6901
12292A86042L9628A0637a91638d1476j55356D5541O8313C7976J08821K9287g8547
$$ plain form
12372 -412279 -282887 88056 184889 -199271 3544 70584 82260 74836 17368 -14403 301847
12360 94423 -8501 59000 -260234 91500 167266 60309 -217015 248083 75924 169349 63201
12348 264101 -282210 -245497 176738 -226784 256536 10496 94854 -273770 95807 -121742
12337 -141099 -51080 -101863 33275 -113032 228679 -85079 8702 -101404 -361524 -93787 -219957
12326 -219957 70022 9263 221216 -159680 217400 -92208 -25629 79882 -172421 -78658 -14056
12314 99264 -46033 23481 10315 -190900 16778 -68922 131588 -390618 -19328 -77782 -231521
12303 -231521 -41268 98828 -106051 97513 -60758 398522 88054 347548 308412 262943 186042
12292 186042 225670 10637 -191638 -41476 -196832 45541 113854 37976 146797 176084 -78547
12280B17791l3432d28803a0381A28640b16030J6998j95487g9469l1183B83525
12269A18917b7543r388A52236N5738D3427J27162K01756F9772K20728A9409J21876
12258A41285K51637b48160B15978a36892A638J34915G126J53679Q5258A15532
12247h4527A13802L24544r2017A07596K09601j18415J45603A25167n2345A4919
12236B27067I2543f90A20451K30336j47432f787A92673k5471J28344a1783H427
12224A83798b88537E5208a83549D1339O1877J4585L9273J90301A02489R6000d171
12212C24704A59260J86468H2165J78129L6946j30011B9026P9167K67728o9013
12202C06908N2896E7970k0717b276C29760p1029a29665A98975J01013a42500B90641
$$ plain form
12280 217791 184359 -428803 -10381 128640 -216030 -199032 -394519 -79469 -110652 283525
12269 118917 -27543 -36931 152236 207974 43427 170589 372345 69772 290500 19409 141285
12258 141285 392922 -248160 215978 -136892 1638 136553 7126 160805 246063 115532
12247 -84527 113802 438346 346329 107596 317197 198782 344385 125167 72822 14919
12236 227067 92543 -690 120451 350787 203355 -6787 192673 167202 295546 -11783 8427
12224 183798 -288537 55208 -183549 41339 103216 117801 157074 347375 102489 198489 -4171
12212 324704 159260 345728 82165 260294 297240 167229 29026 108193 375921 306908
12202 306908 359804 57970 37253 -2276 329760 258731 -129665 198975 299988 -142500 290641
12190D11707b35805J08767A12674N9836j8154i1238j53610C76635j30067J48313
12180C94881A41698D9707K1525R6163K92079a52395C0387K39767K50107a35879
12169i5866B95208a4585B03429J32949q1865a14574j0798A8168J82199B1965M23174
12158D45139A53456P0307J00231a23428D81913A73756l7309P4808k9710c5501
12147G2641b74234R8845B86729H2365N9562a17747A54822o058d2592C91280A65312
12135a08053j01796C79643f3349B71723b17103A33635f2000J6597C0169b59487
12124A65999p5295O4613g5361D60152H7736J88520b15046K4443B94316d6553j42949
12113a89502B08713p8473l2184b23524B3409b0451k48978A46751b17778D7635
$$ plain form
12190 411707 -235805 -127038 112674 172510 154356 -91238 -244848 376635 246568 394881
12180 394881 141698 49707 71232 167395 459474 -152395 30387 270154 520261 -135879
12169 -95866 295208 -14585 203429 336378 254513 -114574 -125372 18168 200367 21965 445139
12158 445139 153456 223763 323994 -123428 481913 173756 136447 211255 181545 -35501
12147 72641 -274234 -175389 286729 82365 141927 -117747 154822 148764 -42592 391280 165312
12135 -108053 -209849 379643 -63349 271723 -217103 133635 -62000 -45403 30169 -259487
12124 165999 90704 155317 -75361 460152 87736 276256 -215046 -190603 294316 -46553 -189502
12113 -189502 208713 130240 98056 -223524 23409 -20451 -269429 146751 -217778 47635
12102A66101e0051A39861B0131M1577J35033J48492r0634I5198b32770A40693
12091B2432K38327a17353m2564H3519c2439k6618a8890E2291K3903A7023e6591
12079A03982D2097j7098a97104e3651A64955a63292l4670M5116A26166d54179
12068a23001K8340c1796o9930B92848g2994a0722j82022L7613A12184f3259A48371
12056D71023A27859j9283J43067j5964L13743R5670Q33103E64058k69251a94955
12045B01979I1312h6714l9134C40966r0152c37322J16930C03730h7623A19448
12034a61269H4711b7178J2145n6320j07391d8748A28301J08119a54728L5514r8834
12023b18048A25193j6667c8585H4660c5100E9768a40245A98927e8102j65183A37921
$$ plain form
12102 166101 -50051 139861 20131 61708 196741 345233 254599 95198 -232770 140693
12091 22432 260759 -117353 -159917 83519 -32439 -59057 -18890 52291 76194 17023 -56591
12079 103982 42097 24999 -197104 -53651 164955 -163292 -197962 -152846 126166 -454179
12068 -123001 -94661 -31796 -101726 292848 -72994 -10722 -192744 -155131 112184 -63259 148371
12056 471023 127859 108576 251643 235679 549422 645092 1478195 564058 294807 -194955
12045 201979 91312 -86714 -125848 340966 250814 -337322 -220392 303730 -87623 119448
12034 -161269 84711 -27178 -15033 -71353 -178744 -48748 128301 236420 -154728 -119214 -218048
12023 -218048 125193 108526 -38585 84660 -35100 59768 -140245 198927 -58102 -223285 137921
12011h3965b3024l9029F2253b07562r2174L993D0189A1319a43600a2887B32317
11999b65735N6491Q931Q3228A54943O330j9205g9854k12577J01327A9236m301
11988A4935N9843a14147a5827j54144c6266B493a47780K7331A16793a7849j54719
11977a72568B21450H7522d0038B46873I3899A0946b64537H9705b23549A30798
11966A64883D9036c2138A90307j6105h3086q0751A20901K45311c10471E2215f6358
11954a98415c3013j73925E1654a57939n7449r3398J22378a1023m6411G4178a25283
11942A787g6530j22278j5600a5978n8081F1759K4192b8095e157j76193A11963
11930e9159B17174F2945a135o5912A11023J52850a41705k3141f202A49068A3581
$$ plain form
12011 -83965 -23024 -62053 62253 -207562 -299736 -295743 40189 11319 -143600 -12887 232317
11999 -265735 -209244 -200313 -117085 154943 161273 142068 -79854 -292431 -191104 19236 14935
11988 14935 74778 -114147 -15827 -169971 -36266 2493 -147780 -120449 116793 -17849 -172568
11977 -172568 221450 87522 -40038 246873 93899 10946 -264537 89705 -223549 130798
11966 164883 49036 -32138 190307 174202 -83086 -163837 120901 366212 -310471 52215 -66358
11954 -198415 -33013 -206938 51654 -157939 -215388 -308786 -186408 -11023 -57434 74178 -125283
11942 1787 -76530 -198808 -214408 -15978 -74059 61759 85951 -28095 -5157 -181350 111963
11930 -59159 217174 62945 -1135 -67047 111023 263873 -141705 -164846 -6202 149068 13581
11918a36578e8250A6730J26061o0549b0616E3652O3557b36382g0538e915l12650
11907c18565I7369a24364B06419a66602B79046c44570F6344a913E2901i0380n6884
11896a47264A39532J10498A4115i8097C2883f7268p552o4456J3101G4314a12556
11884g2263C81688b40816B0403K5446e5985q2692I004Q1561i034F908e2681j04941
11872a57622B56a66097B59645j23628F5536c8131k8318B62800b83334B94686A39612
11860d5774q1109A26545D8683K4836J8561b10778P943G1956b3438j87627a5037
11848a1955q9169C2736d7814F5480K3643J53486a69358G407b45240N4331J7275
11837a73634j03133c6551k603j59960B8737a0790j50383A46613f2573B29091a72340
$$ plain form
11918 -136578 -58250 16730 142791 82242 -20616 53652 117209 -236382 -70538 -5915 -318565
11907 -318565 97369 -124364 206419 -166602 279046 -344570 66344 -1913 52901 -90380 -147264
11896 -147264 139532 250030 14115 -98097 32883 -67268 -74820 -139276 -126175 74314 -112556
11884 -72263 381688 -240816 20403 45849 -55985 -138677 9004 90565 -9034 6908 -52681 -157622
11872 -157622 256 -166097 259645 136017 65536 -38131 -66449 262800 -283334 294686 139612
11860 -45774 -126883 126545 48683 73519 92080 -210778 -202835 71956 -23438 -211065 -15037
11848 -11955 -101124 32736 -47814 65480 89123 242609 -169358 7407 -245240 -190909 -173634
11837 -173634 -276767 -36551 -39154 -199114 28737 -10790 -161173 146613 -62573 229091 -172340
11825C30441j33406I3551L1777g0941b3472p4955A75926J1154k9134a27226m0347
11814a67573C08394A17271E5783a24808C79307G8525a40847A03307M43167b01468
11803A9952J54158b2092k4777B75440m3701a42695c1132A71812a60885c716C14696
11791B08190j7682a21313l12516a21444E3058B1484g4393a4060l2105l3427D8364
11779H0641c01047B7913a31185A60071b61432b9362j72624D524J25920E5836b23974
11767A14537m3936L70177C8756b81354e4489J5672k22151e2802j9430l9931j44012
11756b56175b7808A6705b76030e551j40676j00562b5291j3792E8203c89714H7061
11744d5515A29227E1558a15378b4082r8797n08349i6279A93699b40196B04934
$$ plain form
11825 330441 197035 93551 125328 -70941 -23472 -98427 175926 187080 157946 -127226 -167573
11814 -167573 308394 117271 55783 -124808 379307 78525 -140847 103307 546474 -201468
11803 19952 174110 -22092 -46869 275440 231739 -142695 -31132 171812 -160885 -3716 314696
11791 208190 190508 -121313 -433829 -121444 53058 21484 -74393 -14060 -46165 -79592 48364
11779 80641 -301047 27913 -131185 160071 -261432 -29362 -201986 4524 130444 55836 -223974
11767 114537 70601 440778 38756 -281354 -54489 -38817 -260968 -52802 -72232 -112163 -256175
11756 -256175 -27808 16705 -276030 -5551 -146227 -246789 -25291 -39083 58203 -389714 87061
11744 -45515 129227 51558 -115378 -24082 -122879 -631228 -96279 193699 -240196 204934
11733C36284D6357L14357j30034K63081A85668a04237k65758a0751k03287i7667
11722C531b1552B11180a2987n6663c2581j13994H5890c31087A94520b9646F1678
11710b1294j23463B04661k0855B998b32885p270B8459a17952A43258b587G9452
11698A97557b9161C05858a0314B40515F3628J20295p1772D3608h2463C31235C1709
11686a8737A9009h1058C2274J95987D612J99515H318M8801P6467O5059i9294R81
11674i8313j6966k34073I3129A5460c63043e3961A29948h7837r0676E5109K8339
11663H3448b28235P8292M9174A90095b76810C78012C8211a62039C7684b17361
11652d1026A3908b3233P511D0125L27611A35076l9871B9228R8254J26539a30945
$$ plain form
11733 336284 46357 360714 230680 493761 185668 -104237 -369995 -10751 -214038 -97667
11722 3531 -21552 211180 -12987 -69650 -32581 -146575 85890 -331087 194520 -29646 61678
11710 -21294 -144757 204661 183806 2998 -232885 -240155 28459 -117952 143258 -2587 79452
11698 197557 -29161 305858 -10314 240515 63628 183923 112151 43608 -82463 331235 31709
11686 -18737 19009 -81058 32274 228261 4612 204127 8318 57119 133586 198645 -99294 -98313
11674 -98313 -115279 -349352 93129 15460 -363043 -53961 129948 -87837 -178513 55109 83448
11663 83448 -228235 -149943 -100769 190095 -276810 378012 38211 -162039 37684 -217361
11652 -41026 13908 -23233 -15722 40125 367736 135076 95205 29228 127482 254021 -130945
11640f8426j75344I0928a67338A13541f619B7680a29063B94306C211J42333p1059
11629G4485e1301A26648h3929C6582J92665P885e6360A68817C0278e2564n7120
11618a09684k6785G5698e6801I7047e2193B37084r3694E634N33858B31897C2260
11606a32527J9328N48j29873A46619J73723F56L34712b32230C4154J30541F9496
11594D77311A68587n0795a30585G3428c23952B8508K09334l4802q9537a02342
11583F2059f1006I1753b17390H9880c1434A22911l9566b3220A55362c11874G6310
11571H9291B8624J97094m2853J9942B8346a50617b8017j49014A6814N441K81440
11560C03695I8441j4007g777E3387J22874J64486c7656k42531A39579l5057O5923
$$ plain form
11640 -68426 -243770 90928 -167338 113541 -6619 27680 -129063 294306 3211 145544 74485
11629 74485 -51301 126648 -83929 36582 229247 237132 -56360 168817 30278 -52564 -109684
11618 -109684 -136469 75698 -56801 97047 -52193 237084 143390 5634 539492 231897 32260
11606 -132527 -113199 -112651 -242524 146619 320342 656 335368 -232230 34154 164695 69496
11594 477311 168587 117792 -130585 73428 -323952 28508 237842 203040 113503 -102342
11583 62059 -61006 91753 -217390 89880 -31434 122911 83345 -23220 155362 -311874 76310
11571 89291 28624 225718 182865 202807 28346 -150617 -28017 -177031 16814 22255 303695
11560 303695 98441 84434 -7777 53387 176261 340747 -37656 -280187 139579 104522 170445
11549A70445o0325b2735l3218n7481I194R9511N5294b51818R1350N9171A20340
11537A93653a63680A68590D5863f8460D33111A34239J0016a01040B01769l8489
11527A63280i5472J8963C50230A25722a03464c9259H3476J83262C0564g5069C1695
11515E7940j9327d6029B70472E6224j9799a11045B29776G0454L4044m6156q034
11504E0308b4481j27905L6193A71244q3804J20259N3620n601b9792j23151A92205
11492A32388P1370p8911K16569D4904J01181a10016C38286H45J8472J39738G1087
11480F5728M2341K98747o7141H4923J06703J41231L5487l1773j2947a29723A94529
11468b0242A44147E4217L64187j38524j670l899A16138J20574B9998a00630A21208
$$ plain form
11549 170445 110120 -22735 -55953 -113434 9194 108705 163999 -251818 -160468 -101297 120340
11537 193653 -163680 168590 45863 -68460 433111 134239 144255 -101040 201769 163280
11527 163280 -95472 -76509 350230 125722 -103464 -39259 83476 266738 30564 -75069 31695
11515 57940 38613 -46029 270472 56224 36425 -111045 229776 70454 104498 58342 50308
11504 50308 -24481 -152386 -116193 171244 87440 207699 261319 255718 -29792 -152943 192205
11492 132388 203758 124847 341416 44904 146085 -110016 338286 845 19317 159055 71087
11480 65728 108069 406816 339675 84923 191626 332857 368344 336571 323624 -129723 194529
11468 -20242 144147 54217 418404 279880 278210 274311 116138 236712 29998 -100630 121208
11456B62464K40974A55561g904m482D71891B18990m6708B7803J46576J91778C9427
11444A09629C7598L23924c1144j60242B70626A26711L4905k9935O2025q5070J44709
11433B53345m9265h2017B64782D9183b15241B2103J33407a19785A09149a13660
11422G626b91138a6442L599B15562C3815e9909A73540f4916B6114i9912k25G3235
11409F141P5715a11739j79737n616J05499A78061b60633N9549d5893A81727A7476
11397C22336i1839B16797I7824b53692B07494a1822D6485L1637k3345J39331d1373
11385c2508E3669M0830J06324H616Q2090C1840P1109O2283b41665h0135F0662
11373d07648a95206A41734K3236K57661b48573J20824A2707a8289A75574a2376
$$ plain form
11456 262464 503438 155561 -7904 -12386 471891 218990 172282 27803 174379 366157 39427
11444 109629 37598 361522 -31144 -191386 270626 126711 161616 131681 193706 108636 253345
11433 253345 204080 -82017 264782 49183 -215241 22103 155510 -119785 109149 -113660
11422 7626 -291138 -16442 -12843 215562 33815 -59909 173540 -64916 26114 -99912 -100137 73235
11409 6141 81856 -111739 -291476 -297092 -191593 178061 -260633 -201084 -45893 181727 17476
11397 322336 -91839 216797 97824 -253692 207494 -11822 46485 78122 54777 194108 -41373
11385 -32508 53669 94499 200823 8616 90706 31840 102949 165232 -241665 -80135 60662
11373 -407648 -195206 141734 164970 422631 -248573 -127749 12707 -18289 175574 -12376
11362A09407m2642J40202h1209B74863d0328B00871K0405H0472C2448Q3518b20444
11350A5532P8992R2118E0507a17734B41256a69138M7712b209r5149I2070j9059
11339G3011a30251l8971h2377l07518B09168h6510A32061a20656D0753J43377
11329A84130K7004p1226J2790E4413R8388A9614R5728a03364I0050O1090d40135
11317f1976B12619m1488G7265b81514o7035O1502F1998a34824A2563J81332C0241
11305c8381A25292k9186L8633j8742J35687d0254H8971h490j10414H0511K6158
11294A06669b15075n6638A44695a02020C0187k356c49088a6737B75949a4907C7664
11282E4864d1193E088a74726A52225f2289j79920b1957k78497M0440E9481J3134
$$ plain form
11362 109407 66765 206967 -81209 274863 -40328 200871 221276 80472 32448 115966 -220444
11350 15532 94524 186642 50507 -117734 241256 -169138 -121426 -2209 -97358 92070 73011
11339 73011 -130251 -169222 -82377 -389895 209168 -86510 132061 -120656 40753 184130
11329 184130 211134 139908 152698 54413 152801 19614 115342 -103364 90050 151140 -440135
11317 -61976 212619 171131 77265 -281514 -348549 -287047 61998 -134824 12563 193895 30241
11305 -38381 125292 96106 134739 115997 251684 -40254 88971 -8490 -118904 80511 106669
11294 106669 -215075 -271713 144695 -102020 30187 27831 -349088 -16737 275949 -14907 37664
11282 54864 -41193 5088 -174726 152225 -62289 -242209 -21957 -300454 -260014 59481 72615
11271G2615c81147i8139q1004N2090B61079A8004J94603m8206O9021m6344a52968
11259B753a55918G5630a0330j34001F3591i7121A11223a02664B15332a82905A77124
11247c2108B65575d8082p1660M8672J4001D5592N8109b40107A62183a22288e8001
11235a26671L1281A8970N3823b35358G5371k5914h9436E3714a27638E0746R9239
11224A49985K4593R3633a8704j99721C6628Q4453E6432P985a14343j3784B61753
11212a27203H6221M196K04180a89879O0279n9379A83782c44213a62609j19225
11202b81834a40167o1964o5520H884b3250c827F2209h4422j08078n4195A33978
11190b15875B1872a76111c1282r2153c6196j8648F8985O1796b3603k39281A37930
$$ plain form
11271 72615 -381147 -98139 -179143 -127053 261079 18004 212607 164401 233422 187078 -152968
11259 2753 -155918 75630 -10330 -144331 63591 -97121 111223 -102664 215332 -182905 177124
11247 -32108 265575 -48082 -119742 -71070 -57069 45592 103701 -240107 162183 -122288 -58001
11235 -126671 -95390 18970 72793 -235358 75371 49457 -89436 53714 -127638 50746 149985
11224 149985 174578 268211 -18704 -218425 36628 121081 56432 64417 -114343 -128127 261753
11212 -127203 86221 90417 294597 -189879 -129600 -188979 183782 -344213 -162609 -281834
11202 -281834 -140167 -202131 -267651 8884 -23250 -3827 62209 -84422 -192500 -246695 133978
11190 -215875 21872 -176111 -31282 -123435 -36196 -54844 68985 130781 -23603 -262884 137930
11178E23684A4378c01384d9532l204j51365H3230c80408a7674p0786L4744l25874
11167c79590i511A4636a57536a9035j72485M4949N5230B4267d6731l7279k7066
11156a11076e3127H109b77368B2144K77732b0974B6868O5309m2008a1919l9836
11145e1755B6654J52557G9428K70276a69263C5666M81674b90447A83849a49332
11134B7955i0415j68624Q5546k5260Q2272B14754o2751Q6077q4559A1531e0208
11122A72249l7070l7543J33578b6974D61130A48651b40644D76653b14684a0172
11111f9503A01407L97489A07398a5385n2104k65300A13567J73810K4161A54272
11100A10785c24867B25153b5243A2914b84200I8357C8228K72377G2525J24748
$$ plain form
11178 523684 14378 -301384 -49532 -52736 -204101 83230 -380408 -17674 -88460 -53716 -379590
11167 -379590 -9511 14636 -157536 -19035 -191520 -146571 -91341 24267 -46731 -84010 -111076
11156 -111076 -53127 8109 -277368 22144 299876 -20974 26868 92177 50169 -11919 -51755
11145 -51755 26654 179211 79428 349704 -169263 35666 517340 -290447 183849 -149332
11134 27955 -90415 -259039 -173493 -198753 -116481 214754 152003 238080 153521 11531 -50208
11122 172249 135179 97636 231214 -26974 461130 148651 -240644 476653 -214684 -10172
11111 -69503 101407 498896 107398 -15385 -67489 -332789 113567 287377 311538 154272
11100 110785 -324867 225153 -25243 12914 -284200 98357 38228 310605 72525 197273
11090A97273b41417h3671F4931P8840F4540J04961k7753L5392L18283A39300L46038
11079D85338A24609Q853m6146J64678D4731j0741J90716l9228H4391l6880N45285
11068E92796C5562a120A45966P7453d6088B23774J99762o0720l2118j56144K2229
11057A96783K06604A30388E4400J83088M2820A5837N03885L7118J106J07293m9576
11046F15663B94265L23064j76105J98379J62320j39211n8398L08616m16853O3256
11036E59333K84535l43251K43558J41151j23881M6741J47446j26893j687k88655
11026E38397K72757M8401N5029N9017P938J1326l86826K15753j03410Q259P3190
11015G99831j90883K53024n5696k30124K86428j40042j4621R775P432j21461J34666
$$ plain form
11090 197273 -241417 -83671 64931 143771 64540 169501 141748 177140 495423 139300 485338
11079 485338 124609 133462 87316 251994 44731 33990 224706 185478 84391 47511 592796
11068 592796 35562 -1120 145966 223419 -46088 223774 423536 362816 330698 174554 196783
11057 196783 403387 130388 54400 237488 280308 15837 519722 556840 557946 665239 615663
11046 615663 294265 617329 441224 639603 801923 662712 604314 912930 496077 559333
11036 559333 843868 500617 744175 885326 761445 808186 955632 828739 827052 538397
11026 538397 811154 859555 914584 973601 981539 992865 606039 821792 718382 726641 799831
11015 799831 608948 861972 806276 576152 862580 722538 707917 717692 725124 603663 738329
11004G38329k7279j39049p4117M61713k36038j36910A83321N98799C46269P65048
10994A111317j62768l57657K32013k41693J63236j95687J45088k20765K50925
10985G24009J20054j28907N522K06231k8921K26605E18146J76851R3412P2847
10975H61256m9766l40991P34261k38520J83062P6137j53460J92502k49983K94323
10965A308821L34548L4752N04856j9486r5334L71010M23744j9033j48959K16059
10955B910978j23052j82188n12289m3659k17100k53428L0020M5607p4888l31156
10945A248845K49632o7863K49833o14565J88699k54455R6101l44653j71324J53962
10935G34212j78047k2157p0258K8149A92416H9208J88863q7841r4286g9154E46540
$$ plain form
11004 738329 711050 572001 497884 959597 723559 586649 183321 782120 346269 1111317
10994 1111317 948549 590892 822905 581212 744448 548761 693849 473084 724009
10985 724009 844063 715156 720678 926909 897988 1124593 518146 694997 788409 861256
10975 861256 811490 470499 1204760 966240 1149302 1225439 1071979 1264481 1014498 1308821
10965 1308821 1643369 1678121 2182977 2163491 2068157 2439167 2862911 2843878 2694919 2910978
10955 2910978 2787926 2605738 2093449 2049790 1832690 1579262 1609282 1654889 1580001 1248845
10945 1248845 1498477 1430614 1680447 1065882 1254581 1000126 1096227 751574 580250 734212
10935 734212 556165 534008 463750 491899 192416 89208 278071 190230 95944 -79154 546540
10923D13292j44729n4199b14556B36060h2690r4889d7214A36988R9898m8781C4627
10911A43877o7381K73734p8633I3963B3945C893J49052p6010j5150d90957A4612
10899b1513k06527G4273a48430a7739I1080f4806A69887e3182j47267A8274a79058
10887B14898a6328j58977N6276A60005b7537G5350d9149H0448G517N8783b2404
10875h7346O346r28o7847K9237a6636m1998j19508Q4277l03895a0685k96005M1960
10863b64730F3346Q8844Q9524r5874b52119e9079I3045f826A20344i5545m04844
10852e00389B40497n8591J01596J5922d1764F8319f3920a4439G1910a07314A94216
10840a53850K7692G9145a03403B83703b07044i8198B25149I0962h6645j89524
$$ plain form
10923 413292 268563 214364 -214556 236060 -82690 -177579 -47214 136988 236886 188105 34627
10911 143877 76496 350230 271597 93963 23945 3893 152945 76935 61785 -490957 14612
10899 -21513 -228040 74273 -148430 -17739 91080 -64806 169887 -53182 -200449 18274 -179058
10887 214898 -16328 -175305 -119029 160005 -27537 75350 -49149 80448 7517 66300 -22404
10875 -87346 -81000 -81928 -149775 -120538 -16636 -58634 -178142 -93865 -397760 -10685 -306690 -264730
10863 -264730 63346 152190 241714 145840 -252119 -59079 93045 -6826 120344 -95545 -500389
10852 -500389 240497 181906 283502 299424 -41764 68319 -63920 -14439 71910 -107314 194216
10840 -153850 -126158 79145 -103403 283703 -207044 -98198 225149 90962 -86645 -276169
10830b76169A01811c65779k35329d2132p7444k00074E4727d0468B72603c7239
10819b62809A4774c11012h240C10886D0723a98285P549M3486K6644L1927q6530
10808a75209c3235k65936A88383c35066J35343I1765c14380f9584j05022C898
10797A0193l750K24892J25077a32551C5302N5535k6838a16451j89723F8031a08541
10785A26502b05326m8100R5637O4177j09840P1351B6101b0492k31164I1061c72075
10773a35953A83055a72822G7358b11568H121d7991H5635b31003e0927B07309b10959
10761a7033k57283A87363b03590B25455b17263g271q0548A57750b99450A32872
10750a8165q5042H8251h7911C9620b15213M3584c4775j34690N7525r6458R8313
$$ plain form
10830 -276169 101811 -365779 -601108 -42132 -119576 -319650 54727 -40468 272603 -37239
10819 -262809 14774 -311012 -8240 310886 40723 -198285 -190736 -147250 -120606 -88679 -175209
10808 -175209 -33235 -299171 188383 -335066 -199723 91765 -314380 -69584 -174606 3898
10797 10193 6443 231335 356412 -132551 35302 90837 63999 -116451 -306174 68031 -108541
10785 126502 -205326 -253426 -157789 -93612 -203452 -132101 26101 -20492 -251656 91061 -372075
10773 -135953 183055 -172822 77358 -211568 8121 -47991 85635 -231003 -50927 207309 -210959
10761 -17033 -274316 187363 -203590 225455 -217263 -7271 -87819 157750 -299450 132872
10750 -18165 -103207 88251 -87911 39620 -215213 -171629 -34775 -169465 -111940 -208398 -110085
10739a10085L5144A96804J8440l1325b1456j32318a0683k30329d6645I8432J57192
10728B55624O172b85366A77072a40171e1930k60292J32549B08959i9603l2628
10718a32231O2455C09502e697C9837a34802E528J53979g897j273D5813L02302
10707C48115A73436c11252k4660G5393a24413j77749C9791N0681K5736e9934I0006
10695c03208e5509k47224A97742h6039j12210j387E355M8433B0052a64522A5281
10683g9943d08j75610d71k18018B01810a75539G5857c27706a41596b0374k05126
10672b25500j25628B30700e7700A44531c13704A0531a47927J3898B07082A0932
10661A07806d2311A08618R1364a44559m5666A16533J40471c41617f6099K2539
$$ plain form
10739 -110085 -74941 196804 215244 183919 -21456 -153774 -10683 -241012 -46645 98432 255624
10728 255624 261796 -285366 177072 -140171 -51930 -312222 -179673 208959 -99603 -132231
10718 -132231 -69776 309502 -5697 39837 -134802 5528 159507 -7897 -9170 45813 348115
10707 348115 173436 -311252 -335912 75393 -124413 -302162 39791 90472 116208 -59934 90006
10695 -303208 -55509 -302733 197742 -86039 -198249 -199636 5355 53788 20052 -164522 15281
10683 -79943 -408 -176018 -471 -218489 201810 -175539 75857 -327706 -141596 -20374 -225500
10672 -225500 -351128 230700 -57700 144531 -313704 10531 -147927 -134029 207082 10932
10661 107806 -42311 108618 199982 -144559 -190225 116533 257004 -341617 -66099 -43560
10651d3560o437j73116P633J8590c7061l21749A12025b15249e1029A48016a75998
10639G4182a58803L0124b0713k87859R9744D8527b74048C29391A45620l2103n1641
10628F1876b85978c251j06890d5503o8202D69203b01799A46518m9923a09749F2335
10616F2944e5721r7544F8573A8740a09207b0625C1092J51473p1391g7852a16D19692
10603d29663A19014D9112b39815A45453k7309j9970b92007J14101C15740o9291
10593B46449a88892j71426a26877r8544d7533l2472r5638E0778O6985c02726a1284
10581c28477a19640R975A4577J69371b43640b822j62084q8155C70218a92856d961
10569B17361P500a71381B83652D6422K4069a21341c4127B41338d0083j09886A36839
$$ plain form
10651 -43560 -49997 -223113 -215480 -196890 -37061 -358810 112025 -215249 -51029 148016 -175998
10639 74182 -158803 -128679 -20713 -308572 -208828 48527 -274048 329391 145620 113517 61876
10628 61876 -285978 -3251 -110141 -45503 -113705 469203 -201799 146518 96595 -109749 62335
10616 62944 -55721 -153265 68573 18740 -109207 -20625 31092 182565 111174 -77852 -116 419692
10603 -429663 119014 49112 -239815 145453 118144 98174 -292007 -177906 315740 246449
10593 246449 -188892 -360318 -126877 -225421 -47533 -80005 -175643 50778 117763 -302726 -11284
10581 -328477 -119640 -109665 14577 183948 -243640 -2822 -164906 -253061 370218 -192856 -4961
10569 217361 224861 -171381 283652 46422 70491 -121341 -34127 241338 -40083 -149969 136839
10557C5284b23004A0891L7311b33722g2508l0138J9421A8024b2268B58325a00793
10545c5873A16429N3480n9399d09739A19390l7619f5378k45172B14167i0989F4210
10533C244M570b47055e2463E4844b87458A0913c38066a29297F2090L971b88870
10521I9689q961b18833O642j25523J25505j28873a13120D81866g7996r705B24103
10509f6350k52205N4396I2704l7626b53185i7678J9580j07522h2566A115N9478
10498F0593a75208F526a06003B7661n145b13198E2965b9170m0651A00804K45164
10487C45968H1498b79274F4484f3938b1425Q455A55167b18370a00315b1968A53009
10475a4242C50824b6680B34710j8917J78308A62147O4456a38080A71112a43516
$$ plain form
10557 35284 -223004 10891 48202 -233722 -72508 -102646 -83225 18024 -22268 258325 -100793
10545 -35873 116429 169909 110510 -409739 119390 81771 -65378 -310550 214167 -90989 64210
10533 3244 7814 -247055 -52463 54844 -287458 10913 -338066 -129297 62090 66061 -288870
10521 99689 90728 -218833 -212191 -337714 -212209 -341082 -113120 481866 -77996 -87701 224103
10509 -66350 -318555 -264159 92704 55078 -253185 -97678 -78098 -185620 -82566 1115 60593
10498 60593 -175208 6526 -106003 27661 22516 -213198 52965 -29170 -69821 100804 345968
10487 345968 81498 -279274 64484 -63938 -21425 -12970 155167 -218370 -100315 -21968 153009
10475 -14242 350824 -26680 234710 215793 394101 162147 226603 -138080 171112 -143516
10464B47573o6108e7446j39050c9031k11762B35485a19897k81779d9006A23547
10453c10066l7827b3885p9985G4671L6703h0973c5976J3159k72273f1199A4315
10441h0663a1719j96609i256A63140b2644j39161C30307a52409B00988J25055
10431C26043B3945N7060f7013J4964m759A53560o9948j9041j9084N8969b36658
10419E7844J06117E8000K23170B3952J9263a77903C82917A35868a2471G8604P6268
10408A54872a25315m40072b44152B2033J57174b71704a21990L5577F2535e2953
10397a6197A00645k9764a05466j32456J10542a0121A0523a20811n2845A29883
10386c30468E5474i2143n386A47959J62357I0428L6975d7288k5992g016A08158
$$ plain form
10464 247573 181465 -57446 -196496 -39031 -250793 235485 -119897 -401676 -49006 123547
10453 -310066 -347893 -23885 -103870 74671 111374 -80973 -35976 -22817 -295090 -61199 14315
10441 -80663 -11719 -208328 -9256 163140 -22644 -161805 330307 -152409 200988 326043
10431 326043 23945 81005 -67013 -52049 -56808 153560 83612 64571 45487 104456 -236658
10419 57844 163961 58000 281170 23952 43215 -177903 382917 135868 -12471 78604 154872
10408 154872 -125315 -565387 -244152 22033 179207 -271704 -121990 -86413 62535 -52953
10397 -16197 100645 70881 -105466 -237922 -127380 -10121 10523 -120811 -173656 129883
10386 -330468 55474 -92143 -97529 147959 310316 90428 127403 -47288 -73280 -7016 108158
10374C66758a10496B57174j6812C9526a08863A62688B7383J621R2926K65256r6175
10363B91011A20646g5005E0424H377K20361r4115K9905n7978J25430L3859K72541
10352E38380B49809K06516j33970K19520B33918G1960J00267K8400J55620e4894
10341c0753D21753D9999K15724r2145K60386N52655l86442B74514P10604B02878
10330E41172A53715k8423L17290J49995A67098J20281l4313J65436h5875B60076
10319A13114K51189G7780L2139m0566K4657J69837q0519F5495M04462j13493J0757
10308C67221B7648R7807J04769r5349m40K77469a10132l1524I0634e580A59756
10296B89397H7895a12831E9717J03393b9644C2955J01857c8690a1216n9737j39000
$$ plain form
10374 366758 -110496 257174 240362 39526 -108863 162688 27383 29004 121930 387186 291011
10363 291011 120646 -75005 50424 8377 228738 134623 164528 106550 231980 265839 538380
10352 538380 249809 456325 322355 541875 233918 71960 172227 200627 356247 -54894
10341 -30753 421753 49999 265723 173578 433964 986619 600177 274514 985118 202878
10330 541172 153715 125292 442582 592577 167098 287379 253066 418502 -85875 260076
10319 113114 364303 77780 109919 69353 94010 263847 183328 65495 469957 356464 367221
10308 367221 27648 125455 230224 134875 134435 411904 -110132 -141656 90634 -5580 159756
10296 289397 87895 -112831 59717 163110 -29644 32955 134812 -38690 -11216 -70953 -209953
10285b09953c8993B7550J17941D7569b02413A9927R6400b69450R9331E8231a33763
10273e5508A02648K4661d57B41353a73532b471n2475o9742d8310o0283C44841
10261d2831A76224a16827Q117l9316a708E4451c5332l8811B49441r6635a31803
10249B3073L52279j74667o9338L88442A76623M84761E9283a19284J9740G7146
10238A79716o5434n0255b25650M5111M4717A20333a75786j35621F1386P9482a98227
10226a23681j686l6206j74059J66285B54548F9968a18622k5656j05600J15367
10216a34511d1024A28620B1015g2990n8988H8488i7444B14777A2408J94500H2871
10204B00075a49448A26936O4412g4162L4914k024C6422b41208J16582G0567M7449
$$ plain form
10285 -209953 -38993 27550 145491 47569 -202413 19927 116327 -269450 -170119 58231 -133763
10273 -55508 102648 127309 -457 241353 -173532 -2471 -54946 -124688 -48310 -108593 344841
10261 -42831 176224 -116827 -108710 -148026 -1708 54451 -35332 -74143 249441 152806 -131803
10249 23073 375352 200685 131347 519789 176623 661384 59283 -119284 -99544 77146
10238 179716 114282 64027 -225650 -180539 -135822 120333 -175786 -311407 61386 140868 -198227
10226 -123681 -125367 -161573 -335632 -169347 254548 69968 -118622 -144278 -249878 -134511
10216 -134511 -41024 128620 21015 -72990 -131978 88488 -97444 214777 12408 206908 82871
10204 200075 -149448 126936 191348 -74162 -39248 -41272 36422 -241208 -124626 70567 118016
10193A18016f4825j32903E5251a57337j0311m1579g3416C2823a0642H2406b87548
10181E9351g681A46845J23573g6986B21063b66296Q7547B25065d0782a0488r9879
10170a10367A2286K91097a01263b3253C21533c19964I872b07751g910j0074k18557
10159b36541I6034c57759O8696J30850C1873J06609f4165f888A32107l3998b98470
10147A31045A5339e9856o0268j15440A70924J06790c25514c624j29685j74685
10137c07994A57396c5789k48726M9024d9468j00020E225b53067j6717A42488c34783
10125H1351b01467O345Q0455B55065n2199E1789D35c32030e7872j38140e0774
10113a26931A55429a71593a4238k31251A74570b37489a05107m39935K54627E489
$$ plain form
10193 118016 -64825 -197728 55251 -157337 -167648 -209227 -73416 32823 -10642 82406 -287548
10181 59351 -7681 146845 270418 -76986 221063 -266296 -178749 225065 -40782 -10488 -110367
10170 -110367 12286 303383 -101263 -23253 321533 -319964 9872 -207751 -7910 -17984 -236541
10159 -236541 96034 -357759 -289063 -158213 31873 138482 -64165 -6888 132107 98109 -298470
10147 131045 15339 -59856 -120124 -235564 170924 277714 -325514 -3624 -133309 -307994
10137 -307994 157396 -35789 -284515 -235491 -49468 -149488 5225 -253067 -269784 142488 -334783
10125 81351 -201467 -195122 -114667 255065 202866 51789 435 -332030 -57872 -196012 -50774
10113 -126931 155429 -171593 -14238 -245489 174570 -237489 -105107 -545042 -290415 5489
10102B21866a59650j17905J30350C9282a54655I0837c49490h7728r5936A13377
10091D0143b31749R6133E2500b00814B63788c16847B09946b3108A99282C9174
10080a82638N1438j44682J24671f5857F5686E658f1134j58092j3742c8222M894
10069c3328q9788N606j9555B538i3283k34076f2198p4698A47116R5832n5046a26286
10056H8518e2399k20344o1942a55718D7405a48253A12124c49113A3273P3917k2137
10045F5053J50858q5871b84521G9088N9264M2983b39278j27973B75962a79697
10034c29718j5059D6000J04994i5842B0827J77317b66314A96961a15687j3535
10024a29222k83066B8265e2159j1722o4803C51355E0135a6107D0068P57L307a5628
$$ plain form
10102 221866 -159650 -277555 -147205 39282 -154655 90837 -349490 -87728 -183664 113377
10091 40143 -231749 -135616 52500 -200814 263788 -316847 209946 -23108 199282 39174
10080 -182638 -131200 -275882 -151211 -65857 65686 5658 -61134 -219226 -232968 -38222 -33328
10069 -33328 -123116 -117510 -137065 2538 -93283 -327359 -62198 -136896 147116 242948 187902 -126286
10056 88518 -52399 -272743 -334685 -155718 47405 -148253 112124 -349113 13273 87190 65053
10045 65053 215911 130040 -284521 79088 138352 181335 -239278 -367251 275962 -179697
10034 -329718 -344777 46000 150994 -95842 20827 198144 -266314 196961 -115687 -129222
10024 -129222 -412288 28265 -52159 -63881 -128684 351355 50135 -16107 40068 40825 44132 -15628
10011d0309j65418B39332a27139d8815C3796c24844B67095b85051J41985B38309
10000A91330f2875j58947C6062b78617L2266A31721c6133D337f1586j96391N9348
9989a98629E0677e2698l77133B24900g637j35635k74748A47514j431a53623k09345
9978c62968A72251d0360C58037I5375l2882K9672J98200d9765r9284D0502a20561
9966A87456F4051b8054l3113l96283a15854B09196h4442A00444O5977k7773b47245
9954A62761B2004c23731C62811a34902j34629i0622A39662b30857a13606o9033
9944a82639B05134g4190J4896B2257b2212A8615e5569e173A94526b00104J0468
9933a89636j65480H5466K12460f2000m5260F6264b44622c2049j23005a4387A02095
$$ plain form
10011 -40309 -205727 239332 -127139 -48815 33796 -324844 267095 -285051 -143066 238309
10000 191330 -62875 -221822 36062 -278617 -246351 131721 -36133 4337 -61586 -257977 -198629
9989 -198629 50677 -52698 -429831 224900 -7637 -143272 -418020 147514 146083 -153623 -362968
9978 -362968 172251 -40360 358037 95375 62493 92165 290365 -49765 -149049 40502 -120561
9966 187456 64051 -28054 -61167 -457450 -115854 209196 -84442 100444 166421 138648 -247245
9954 162761 22004 -323731 362811 -134902 -269531 -90622 139662 -230857 -113606 -182639
9944 -182639 205134 -74190 -59294 22257 -22212 18615 -55569 -5173 194526 -200104 -189636
9933 -189636 -355116 85466 297926 -62000 -107260 66264 -244622 -32049 -155054 -14387 102095
9921b18518r2868A00025Q9868c7032m03228K09442G3590b11425P4265B45179b89100
9909b15363j26458A86427k4549K31688f1395A18424C0441a0137C35605e2259k72439
9898c24698J62139J4475a4132A29156d9211j27872P5543q1756b546l8896j80470
9887b21912g6100G7061K070b73912A19310b75044J31696O1626D5538P0484a62860
9875b50012c5404A87288B8173a18191A21564f6490K9017f699l82132R0844f9670
9863A48107C584J85909R2394B1188a78556A24369J48263g2578l733A13611N2646
9852A66257b33732B20633c22596A2194b4457N908F6739i7121G8815c3481A58961
9840D4433h7248F624J30185l005c2778l15952l6981J32009C3271b2083A58219
$$ plain form
9921 -218518 -311386 100025 189893 -37032 -440260 -230818 73590 -211425 -137160 245179 -289100
9909 -215363 -341821 186427 161878 393566 -61395 118424 30441 -10137 335605 -52259 -324698
9898 -324698 -162559 -148084 -14132 129156 -49211 -177083 -101540 -183296 -2546 -41442 -221912
9887 -221912 -76100 77061 79131 -273912 119310 -275044 -143348 -81722 45538 116022 -162860
9875 -250012 -35404 187288 28173 -118191 121564 -66490 -37473 -6699 -388831 -297987 -69670
9863 148107 3584 189493 281887 21188 -178556 124369 272632 -72578 -76311 113611 166257
9852 166257 -233732 220633 -322596 12194 -24457 -18549 66739 -97121 78815 -33481 158961
9840 44433 -87248 6624 136809 133804 -32778 -348730 -385711 -253702 33271 -22083 158219
9828B06456a41595J9050d5057j63379L0011N7022L3647A0936f7412n1056j18878
9817b37346L9009B04442a2620k06602A22386j1329A3428L9078q027a4765E2953
9805c36629a06802c6069Q267k29607j7580J931B01337E6171a79486C509a18442
9793C8059J25387h7444I6415a73645n1979c4553D9359j9624J1967b38015J11073
9782a26942F7323J26059d4380q996J0574j48133G5346c82076a55856k04228a13068
9770E3049J580e1134G7360c1214k04658A48450f62l74083a83306B81807a08911
9758a97633F5562a04713m909k6571f990j98133M214O734J4459j18506E180P5139
9746H0319i3000n7301M8590j77172A41555B4999a11466A99226e08818A05389b8302
$$ plain form
9828 206456 -141595 -122545 -45057 -208436 -178425 -121403 -87756 10936 -67412 -118468 -237346
9817 -237346 -198337 204442 -12620 -219222 122386 111057 13428 52506 44479 -14765 52953
9805 -336629 -106802 -36069 -27802 -257409 -274989 -273058 201337 56171 -179486 3509 -118442
9793 38059 163446 -87444 96415 -173645 -225624 -34553 49359 29735 41702 -238015 -126942
9782 -126942 67323 193382 -44380 -53376 -42802 -190935 75346 -382076 -155856 -360084 -113068
9770 53049 54629 -51134 77360 -31214 -235872 148450 -662 -374745 -183306 281807 -108911
9758 -197633 65562 -104713 -109622 -136193 -6990 -205123 -200909 -194175 -179716 -298222 5180 80319
9746 80319 -93000 -150301 -101711 -278883 141555 24999 -111466 199226 -508818 105389 -28302
9734G1450a98837E7466K35511E3662d9383J5975j03345D2067P1530b07238h1072
9722g9717L2358p3412J6382B01434c90186c8992D19789B6439J87025b49946A93020
9710A59699e8741O576j51671A3942a11544d6955A99215B6210l53b96738e6387
9698F9711J94850a96690i4710A81043p2584P6644b1269l31624H5023d5566q1148
9687a26714I9302c1126A98679l3684a33865A24439a24923l6190C0380o860a7265
9675c30656A60718a38020k41800G895K78944B250h8808j3816A91241R9040b25269
9663G5352C7324N3107a09311o7475G9974a24333A57542a05043j67154B6779a32753
9651f8023A29303b373H7930L0611a59371D2566a59106K2103B18169a96234j07050
$$ plain form
9734 71450 -198837 57466 292977 53662 -49383 -33408 -136753 42067 113597 -207238 -81072
9722 -79717 -47359 -120771 -104389 201434 -390186 -38992 419789 26439 213464 -249946 193020
9710 159699 -58741 -52165 -203836 13942 -111544 -46955 199215 26210 25857 -296738 -56387
9698 69711 264561 -196690 -94710 181043 108459 185103 -21269 -352893 85023 -45566 -126714
9687 -126714 99302 -31126 198679 164995 -133865 124439 -124923 -161113 30380 23520 -17265
9675 -330656 160718 -138020 -379820 7895 286839 2250 -88808 -102624 191241 290281 -225269
9663 75352 37324 90431 -109311 -176786 79974 -124333 157542 -105043 -272197 26779 -132753
9651 -68023 129303 -2373 87930 118541 -159371 42566 -159106 -137003 218169 -196234 -303284
9640c03284c3986B94416f2202k06280n8200J12916O7497oj1563A12777j8754p667
9628H6356A8170D473J94541a96001c3529k40962A27307g7513r2430D8484J52702
9617B01186B7514d56519b20175j45274A0649n176h3910j37977j9962e6661E9710
9605b78358G99e62119g5444L2276A3662N8296J41446D5478c82832D6609j1170
9594C5439e7302m54639D1995a10153F4179a90819E6073K61041r0023a14339B53568
9582i9320k53877Q9685f1558k36014F1921g2387B46965a38595f778j57030A16281
9570A1115b5928k74119a21720K5268M5832b4566k01037H6617Q0389b53287h9278
9558A78476F7620a85931k46318h7056C6388a19022F8225h4944A41241J7525c08924
$$ plain form
9640 -303284 -33986 294416 -62202 -268482 -326682 -213766 -146269 -146275 -157838 112777 94023 86356
9628 86356 18170 4473 199014 -196001 -33529 -274491 127307 -77513 -169943 48484 201186
9617 201186 27514 -456519 -220175 -365449 10649 5473 -83910 -221887 -241849 -56661 59710
9605 -278358 799 -562119 -75444 -43168 13662 71958 213404 45478 -382832 46609 35439
9594 35439 -57302 -511941 41995 -110153 64179 -190819 56073 317114 227091 -114339 253568
9582 -99320 -353197 -263512 -61558 -297572 61921 -72387 246965 -138595 -6778 -163808 116281
9570 11115 -25928 -300047 -121720 -96452 -50620 -24566 -225603 86617 167006 -253287 -89278
9558 178476 67620 -185931 -432249 -87056 36388 -119022 68225 -84944 141241 158766 -308924
9546g1325j33950d9736a266A09124b81891C1275J9095b71751A14882d3226A53256
9534a50921a2207A43403a91631r2217R0846A51161b83258g5377R711k07340G9177
9522b37212a14900q738I0526e0896k48264l6316A28306b15730i9510B3719J00063
9511A23782b10753G3280a45880q6307D8747Q4176a21531D6721L8433J17857o0745
9500A42266P6323c38301g9319l6547d8532j37b1990A00427J07484b04970n1203
9489b56173e6770n5031k86288i1274n3713C3167K48398A32559b54285b9640j82888
9478b12528g0159C6616h1336k14257c3294l14771e2232k10063a08758j99095G8714
9466a35822K9422F6094K04737a16630D9509R1363e6643k1378I631a44207j4833
$$ plain form
9546 -71325 -205275 -49736 -1266 109124 -281891 31275 50370 -271751 114882 -43226 153256
9534 -150921 -12207 143403 -191631 -283848 -193002 151161 -283258 -75377 -65666 -273006 79177
9522 -237212 -114900 -123638 90526 -50896 -299160 -335476 128306 -215730 -99510 23719 123782
9511 123782 -210753 73280 -145880 -232187 48747 132923 -121531 46721 85154 203011 142266
9500 142266 218589 -338301 -79319 -115866 -48532 -48669 -21990 100427 207911 -204970 -256173
9489 -256173 -56770 -111801 -398089 -91274 -144987 33167 281565 132559 -254285 -29640 -212528
9478 -212528 -70159 36616 -81336 -295593 -33294 -348065 -52232 -262295 -108758 -307853 78714
9466 -135822 -106400 66094 270831 -116630 49509 140872 -56643 -78021 9631 -144207 -159040
9455a59040o8537L369B05723a31477A93108D4253J22353p6030L41379a02667n300
9444a07967A16813a54209H4661j0957b9242D4921a79072L2509j3337e4333m889
9433e9222n903l9850l04572F7259r090g6599j98651C48701F0671a08070B21208
9421c97625g452j57981k17642i4622B26200a76963A96207r7949M1598a10852j37798
9410b48650A31384a26163j01742Q7510B5344a98380J3898J8719a9276j69083F2387
9398a79888B8700b02679a808j04142B2463a24086d1388p5518r4713Q278L1352
9387a71989k0594j80939g0816c0830l03419C38555G9593J26265f7274k33369a44589
9375A40832b89067e1430C6957a46298G1949c221m0673l0058b2463G6279g9567
$$ plain form
9455 -159040 -227577 -224208 205723 -131477 193108 44253 166606 90576 431955 -102667 -107967
9444 -107967 116813 -154209 84661 73704 -29242 44921 -179072 -146563 -159900 -54333 -59222
9433 -59222 -65125 -104975 -409547 67259 58169 -76599 -275250 348701 60671 -108070 221208
9421 -397625 -7452 -165433 -383075 -94622 226200 -176963 196207 98258 139856 -110852 -248650
9410 -248650 131384 -126163 -227905 -140395 25344 -198380 -184482 -165763 -19276 -188359 62387
9398 -179888 28700 -202679 -1808 -105950 22463 -124086 -41388 -116906 -211619 -203341 -171989
9387 -171989 -192583 -373522 -70816 -30830 -334249 338555 79593 205858 -67274 -300643 -144589
9375 140832 -289067 -51430 36957 -146298 71949 -3221 -43894 -73952 -22463 76279 -79567
9363a06030j71594g0815j11186J4367A53413L2893n3256j2283a09376a4686j70545
9352a85231A12137i1581A16791a41351o1017j5596F0900c01216A24753b94354
9341a04516b0828k1191q7214j53498a13378B8632i4269A64107b54450i4466p4863
9330a69329r614a0378q0883J8031B7421c04390C2596i7172r6900f0547E7111a22381
9317d66795g3906K576J8244k22595A5434j559N0650a30255f4496B19009a1964
9305A11770e4437A2159N6488a36238J5827A88639a66809l14581C24688I0616A9263
9293b05511i4138A2129J1064j0121b0269B55039r4053a2801n4279A44418c14061
9281e112n8884M682H9444a21491E427J200a60572A93206a6643k7143A9291c58597
$$ plain form
9363 -106030 -277624 -70815 -182001 -167634 153413 186306 133050 120767 -109376 -14686 -185231
9352 -185231 112137 -91581 116791 -141351 -202368 -217964 60900 -301216 124753 -294354
9341 -104516 -20828 -42019 -129233 -282731 -113378 28632 -94269 164107 -254450 -94466 -169329
9330 -169329 -178943 -10378 -91261 -73230 27421 -304390 32596 -97172 -194072 -60547 57111 -122381
9317 -466795 -73906 -71330 -53086 -275681 15434 13875 64525 -130255 -64496 219009 -11964
9305 111770 -54437 12159 68647 -136238 -120411 188639 -166809 -481390 324688 90616 19263
9293 -205511 -94138 12129 23193 13072 -20269 255039 160986 -12801 -67080 144418 -314061
9281 -5112 -63996 -59314 89444 -121491 5427 6627 -160572 193206 -16643 -43786 19291 -358597
9268a01641M2853A3658a99531f6768j09619d8281g472j20722N6096J7187B2144
9256A44885a89832E0430a31070f4256G0588N4705J30157H1242o978i1531k27464
9245c18995a52256j13938a04119a2314l02523c0307J5004D3966a43114L9720B05677
9233a51235D0149a20088c7502A49949l6964k3799j3652b86686H6499h0520l67816
9222d48336h7263j55065N1833R2071d5566o7128A51062N8005c19919B43569q6287
9211A57282a15228m05423a69383n3489j28713D7359a9845q4769L0800b4077r1146
9200a15223L212G2685J59562a0101A53625a72846A51136d8076A69042b9546r7286
9189a26832j1331a7975m6437p3889B34276a26583e9642N45b6393A02992J08172
$$ plain form
9268 -101641 -58788 13658 -199531 -66768 -176387 -48281 -7472 -128194 -72098 -54911 22144
9256 144885 -189832 50430 -131070 -64256 70588 125293 255450 81242 74264 -91531 -318995
9245 -318995 -152256 -266194 -104119 -12314 -314837 -30307 -15303 43966 -143114 -103394 205677
9233 -151235 40149 -120088 -37502 149949 112985 89186 75534 -286686 86499 -80520 -448336
9222 -448336 -87263 -242328 -190495 -98424 -45566 -112694 151062 209067 -319919 243569 157282
9211 157282 -115228 -520651 -169383 -222872 -351585 47359 -19845 -104614 -73814 -24077 -115223
9200 -115223 -112011 72685 232247 -10101 153625 -172846 151136 -48076 169042 -29546 -126832
9189 -126832 -138163 -17975 -64412 -138301 234276 -126583 -59642 -59097 -26393 102992 211164
9178B11164G3407R8303f9566j17872j14382f3473A7875M17963c03007F1073A2336
9166a3507M500j74953h1170j14181E8171P2119b6117I6294a6919l60815A40271
9154a10775j89471G3349A0702h8977C04553A0853b00817N7665p0028e9532B06067
9142a96160A30864a27799l5002B2428a00781E3376A6578Q9411B3484P3141O7070
9131A63695K46874a26988a3966I6506M2855E4181b45333g6890A63695d4858l58742
9120d03600a51732p9347A52035a29303N9534B7817g3786C2609a62856M5553D827
9108C1989a29883B0121c14546B24779o7742a17908l79283A49355b77659e4192
9097e0650A13557c5498C30871a47387d8732p5232k96169a47454G9809e7507j45189
$$ plain form
9178 211164 73407 171710 -69566 -187438 -301820 -63473 17875 435838 -303007 61073 12336
9166 -13507 -9007 -183960 -81170 -195351 58171 130290 -26117 96294 -16919 -377734 140271
9154 -110775 -300246 73349 10702 -88977 304553 10853 -200817 -143152 -213180 -59532 206067
9142 -196160 130864 -127799 -162801 22428 -100781 53376 16578 105989 23484 96625 163695
9131 163695 410569 -126988 -13966 96506 139361 54181 -245333 -76890 163695 -44858 -403600
9120 -403600 -151732 -231079 152035 -129303 -69769 27817 -73786 32609 -162856 -117303 4827
9108 31989 -129883 20121 -314546 224779 157037 -117908 -497191 149355 -277659 -54192
9097 -50650 113557 -35498 330871 -147387 -48732 -123964 -420133 -147454 79809 -57507 -202696
9086b02696M2629j3510a2299F243i2230a4839A75989B5587Q5697C6182d9818k36433
9074b86251f2621d019k5807j48733h5090j14581c7165j34631Q1661K8250k35503
9063b97388Q4446F2706a61814K4577I6252b78430C01875a89173B41526a5268m8745
9052f4013A99530H8602a6716j27175D47250F5895a50240h722q2995B1501a29178
9040b86879A34724b8644A35498J68669e3844B92196j43847a0911C156a39455j38361
9029b77816B5655e24155C48708b11242L827B1388j567J668e6849E7249P4641a3677
9016B01893a98020L5005A58608b85646J37595a1110l7581C1391a93069A39040
9005A01132a25129A86005c2294D00047a74185A18975C2474a0624j52760g1766
$$ plain form
9086 -202696 -160067 -173577 -12299 6243 -92230 -14839 175989 25587 111284 36182 -49818 -286251
9074 -286251 -62621 -4019 -29826 -178559 -85090 -199671 -37165 -171796 -90135 -61885 -297388
9063 -297388 -212942 62706 -161814 -137237 96252 -278430 301875 -189173 241526 -15268 -64013
9052 -64013 199530 88602 -16716 -143891 447250 65895 -150240 -8722 -91717 21501 -129178
9040 -286879 134724 -28644 135498 304167 -53844 292196 148349 -10911 3156 -139455 -277816
9029 -277816 25655 -524155 348708 -211242 -207415 21388 19821 21489 -56849 57249 131890 -13677
9016 201893 -198020 -163015 158608 -285646 -148051 -11110 -48691 31391 -193069 139040
9005 101132 -125129 186005 -32294 400047 -174185 118975 32474 -10624 -163384 -71766
8994A03518K4469e5671j3151A58217b38867k1948h933A95905g7990C19104a03787
8982a79178g7857o6524M2626H6429a17900A74545l1044b318m6683j64971i3102
8970A79260a58910C3961b45116a11418m8862c4339A88293e8895A02138j3766b04997
8958c4155k31085F5910J36853b42197a8936l15416A18971g8027J8382j97406R8808
8947a58243G9877b49862O9345A95543f4260B55155b62895j9435J02292I9562k6699
8936G2863C0469b37772E9866J88312c16291b7591l3182j1817j06934C8450Q0126
8925A18576b06832A4712b82366P1870F223J71822j4840h0736A08702a77126B71357
8913c3673E5360O0804J1386R3162L2362N89578N23162J285143A003651k93781
$$ plain form
8994 103518 127987 -55671 -68822 158217 -238867 -260815 -8933 195905 -77990 319104 -103787
8982 -179178 -77857 -144381 -101755 86429 -117900 174545 143501 -2318 -49001 -213972 -93102
8970 179260 -158910 33961 -245116 -111418 -160280 -34339 188293 -58895 102138 88372 -204997
8958 -34155 -265240 65910 202763 -242197 -18936 -334352 118971 -78027 -59645 -257051 -158243
8947 -158243 79877 -249862 -180517 195543 -64260 255155 -262895 -282330 -180038 99562 72863
8936 72863 30469 -237772 59866 248178 -316291 -27591 -60773 -72590 -179524 38450 118576
8925 118576 -206832 14712 -282366 -210496 6223 178045 163205 -80736 108702 -177126 271357
8913 -33673 55360 116164 127550 220712 253074 842652 1365814 2650957 1003651 709870
8903G09870A66947L86397B62546o8378d9309O405j44604F8032K33896a30832l7171
8892a68003E2789B0300J2913i5382D4510L1458a2461k86844B6439a15358N1582
8881f3776k05448D9043g1625a713o0836k358B73869H7021J66668D0532P6632m8322
8869F8842b41537A57677g8985r0237B7907a08500o4279f3353m5022J711k1186
8858a27850e8539l40361a74972n5793G7318J99043d6384A47052a462j73961M2914
$$ plain form
8903 709870 166947 553344 262546 194168 -49309 -42904 -187508 68032 301928 -130832 -168003
8892 -168003 52789 20300 33213 -95382 44510 75968 -12461 -299305 26439 -115358 -63776
8881 -63776 -269224 49043 -71625 -1713 -62549 -64907 273869 87021 253689 40532 117164 68842
8869 68842 -241537 157677 -78985 -169222 27907 -108500 -172779 -63353 -108375 -106664 -127850
8858 -127850 -58539 -398900 -174972 -230765 77318 276361 -46384 147052 -1462 -175423 -132509
$$ [...]
##END NTUPLES=NMR SPECTRUM
##END=
