
##TITLE=AC1231_PUEHDE124_6075312_jV922I8Z65
##JCAMPDX= 6.0         $$ Bruker NMR JCAMP-DX V2.0
##DATA TYPE= NMR SPECTRUM
##DATA CLASS= NTUPLES
##ORIGIN= BRUKER
##OWNER= Administrator
$$ 1.72 TOPSPIN		Version 2.1
$$ 2012-05-08 01:14:19.812 -0500  Administrator@TOPSPIN
$$ Compression mode = diff/dup
##.OBSERVE FREQUENCY= 400.13188235
##.OBSERVE NUCLEUS= ^1H
##.ACQUISITION MODE= SIMULTANEOUS (DQD)
##.ACQUISITION SCHEME= undefined
##.AVERAGES= 64
##.DIGITISER RES= 22
##SPECTROMETER/DATA SYSTEM= spect
##.PULSE SEQUENCE= noesygpps1d.comp
##.SOLVENT NAME= COFFEE_meoh
##.SHIFT REFERENCE= INTERNAL, COFFEE_meoh, 1, 14.96634
##AUDIT TRAIL= $$ (NUMBER, WHEN, WHO, WHERE, PROCESS, VERSION, WHAT)
$$ ##TITLE= Audit trail, TOPSPIN		Version 2.1
$$ ##JCAMPDX= 5.01
$$ ##ORIGIN= Bruker BioSpin GmbH
$$ ##OWNER= Administrator
$$ $$ C:\Bruker\TOPSPIN/data/COFFEE/nmr/AC1231_PUEHDE124_6075312_jV922I8Z65/12/pdata/1/auditp.txt
$$ ##AUDIT TRAIL=  $$ (NUMBER, WHEN, WHO, WHERE, PROCESS, VERSION, WHAT)
(   1,<2012-05-08 01:14:14.765 -0500>,<Administrator>,<TOPSPIN>,<go>,<TOPSPIN 2.1>,
      <created by zg
	started at 2012-05-08 01:02:44.593 -0500,
	POWCHK enabled, PULCHK disabled,
       configuration hash MD5:
       AF F2 23 6B 01 CD 40 DD E5 A1 38 A0 06 EA F7 77
       data hash MD5: 64K
       19 04 9E 8E 89 96 21 23 DE D3 23 65 E6 CE D7 7A>)
(   2,<2012-05-08 01:14:17.500 -0500>,<Administrator>,<TOPSPIN>,<proc1d>,<TOPSPIN 2.1>,
      <Start of raw data processing
       efp LB = 0.3 FT_mod = 6 PKNL = 1 PHC0 = 0 PHC1 = 0 SI = 128K 
       data hash MD5: 128K
       49 D9 EA 8B 32 8C 93 F9 E6 40 A5 AB FC CA 2F 9B>)
(   3,<2012-05-08 01:14:18.734 -0500>,<Administrator>,<TOPSPIN>,<proc1d>,<TOPSPIN 2.1>,
      <pk PHC0 = 35.13428 PHC1 = 0 
       data hash MD5: 128K
       C1 A4 6A 4E BB E7 23 9C F1 5A FD 52 FE A5 92 B0>)
(   4,<2012-05-08 01:14:19.468 -0500>,<Administrator>,<TOPSPIN>,<proc1d>,<TOPSPIN 2.1>,
      <abs ABSG = 1 
       data hash MD5: 128K
       DD 1E 0F ED 3D 0B CA 56 43 9F F9 61 DD 57 EF 1C>)
(   5,<2012-05-08 01:14:19.531 -0500>,<Administrator>,<TOPSPIN>,<proc1d>,<TOPSPIN 2.1>,
      <abs ABSG = 2 
       data hash MD5: 128K
       99 40 00 BA 40 06 66 17 00 CD 87 3A 01 D5 39 04>)
(   6,<2012-05-08 01:14:19.593 -0500>,<Administrator>,<TOPSPIN>,<proc1d>,<TOPSPIN 2.1>,
      <abs ABSG = 3 
       data hash MD5: 128K
       80 04 7F B3 19 8A 18 ED 5A AB 77 DF 33 20 D5 88>)
(   7,<2012-05-08 01:14:19.656 -0500>,<Administrator>,<TOPSPIN>,<proc1d>,<TOPSPIN 2.1>,
      <abs ABSG = 4 
       data hash MD5: 128K
       6A 23 47 BB 26 D2 8A CD 3F 98 4B 60 AF 42 1A FD>)
(   8,<2012-05-08 01:14:19.718 -0500>,<Administrator>,<TOPSPIN>,<proc1d>,<TOPSPIN 2.1>,
      <abs ABSG = 5 
       data hash MD5: 128K
       86 C9 81 C4 14 94 A6 49 F3 AD AC 04 2C 04 0E 6C>)
$$ ##END=
$$ 
$$ $$ hash MD5
$$ $$ 8F F4 92 27 3E E2 36 4A 09 C8 4E 75 A1 AA 0C 63
##$RELAX= 
##$RELAX= 
##$RELAX= 
##$RELAX= 
##$RELAX= 
##$RELAX= 
##$RELAX= 
##$RELAX= 
$$ Bruker specific parameters
$$ [...]
##$TP07= 0
##$TPNAME0= <>
##$TPNAME1= <>
##$TPNAME2= <>
##$TPNAME3= <>
##$TPNAME4= <>
##$TPNAME5= <>
##$TPNAME6= <>
##$TPNAME7= <>
##$TPOAL= (0..7)
0.5 0.5 0.5 0.5 0.5 0.5 0.5 0.5
##$TPOFFS= (0..7)
0 0 0 0 0 0 0 0
##$TUNHIN= 0
##$TUNHOUT= 0
##$TUNXOUT= 0
##$USERA1= <user>
##$USERA2= <user>
##$USERA3= <user>
##$USERA4= <user>
##$USERA5= <user>
##$V9= 5
##$VALIST= <valist>
##$VCLIST= <CCCCCCCCCCCCCCC>
##$VD= 0
##$VDLIST= <DDDDDDDDDDDDDDD>
##$VPLIST= <PPPPPPPPPPPPPPP>
##$VTLIST= <TTTTTTTTTTTTTTT>
##$WBST= 1024
##$WBSW= 4
##$XGAIN= (0..3)
0 0 0 0
##$XL= 0
##$YL= 0
##$YMAX_a= 10967399
##$YMIN_a= -6038526
##$ZGOPTNS= <>
##$ZL1= 120
##$ZL2= 120
##$ZL3= 120
##$ZL4= 120
##$ABSF1= 14.96634
##$ABSF2= -5.58619
##$ABSG= 5
##$ABSL= 3
##$ALPHA= 0
##$AQORDER= 0
##$ASSFAC= 0
##$ASSFACI= 0
##$ASSFACX= 0
##$ASSWID= 0
##$AUNMP= <proc_prof1d_extract.lims>
##$AXLEFT= 0
##$AXNAME= <>
##$AXNUC= <1H>
##$AXRIGHT= 0
##$AXTYPE= 0
##$AXUNIT= <>
##$AZFE= 0.1
##$AZFW= 0.1
##$BCFW= 0
##$BC_mod= 0
##$BYTORDP= 0
##$COROFFS= 0
##$CY= 15
##$DATMOD= 1
##$DC= 0
##$DFILT= <>
##$DTYPP= 0
##$F1P= 0
##$F2P= 0
##$FCOR= 0.5
##$FTSIZE= 131072
##$FT_mod= 6
##$GAMMA= 0
##$GB= 0
##$INTBC= 1
##$INTSCL= 1
##$ISEN= 128
##$LB= 0.3
##$LEV0= 0
##$LPBIN= 0
##$MAXI= 10000
##$MC2= 0
##$MEAN= 0
##$ME_mod= 0
##$MI= 0
##$NCOEF= 0
##$NC_proc= -3
##$NLEV= 6
##$NOISF1= 0
##$NOISF2= 0
##$NSP= 0
##$NTH_PI= 0
##$NZP= 0
##$OFFSET= 14.96634
##$PC= 1
##$PHC0= 35.13428
##$PHC1= 0
##$PH_mod= 1
##$PKNL= yes
##$PPARMOD= 0
##$PPDIAG= 0
##$PPIPTYP= 0
##$PPMPNUM= 2147483647
##$PPRESOL= 1
##$PSCAL= 4
##$PSIGN= 0
##$PYNMP= <proc.py>
##$REVERSE= no
##$SF= 400.130005711089
##$SI= 131072
##$SIGF1= 0
##$SIGF2= 0
##$SINO= 400
##$SIOLD= 131072
##$SPECTYP= <>
##$SREGLST= <1H.CDCl3>
##$SSB= 0
##$STSI= 131072
##$STSR= 0
##$SW_p= 8223.68421052632
##$SYMM= 0
##$S_DEV= 0
##$TDeff= 65536
##$TDoff= 0
##$TI= <>
##$TILT= no
##$TM1= 0
##$TM2= 0
##$TOPLEV= 0
##$USERP1= <user>
##$USERP2= <user>
##$USERP3= <user>
##$USERP4= <user>
##$USERP5= <user>
##$WDW= 1
##$XDIM= 131072
##$YMAX_p= 388386719
##$YMIN_p= -90888387
##$CURPLOT= <Network HP LaserJet P1505>
##$CURPRIN= <$Network HP LaserJet P1505>
##$DFORMAT= <normdp>
##$LAYOUT= <+/1D_H.xwp>
##$LFORMAT= <normlp>
##$PFORMAT= <normpl>
##$SURQMSG= 1
$$ End of Bruker specific parameters
$$ ---------------------------------
##NTUPLES= NMR SPECTRUM
##VAR_NAME=  FREQUENCY,     SPECTRUM/REAL,   SPECTRUM/IMAG
##SYMBOL=    X,             R,               I
##VAR_TYPE=  INDEPENDENT,   DEPENDENT,       DEPENDENT
##VAR_FORM=  AFFN,          ASDF,            ASDF
##VAR_DIM=   131072,        131072,          131072
##UNITS=     HZ,            ARBITRARY UNITS, ARBITRARY UNITS
##FACTOR=    0.0627417313425165, 1,          1
##FIRST=     8223.62146879498, 3855,         -99324
##LAST=      0,             4499,            -99835
##MIN=       0,             -90888387,       0
##MAX=       8223.62146879498, 388386719,    0
$$ Real data points
##PAGE= N=1
##DATA TABLE= (X++(R..R)), XYDATA
$$ [...]
61381D48237O128O035N059L846L134L334L874L738L031K944L843M629M532M097
$$ 448237 454365 460400 465459 469305 472439 475773 479647 483385 486416 489360 493203 497832 502364 506461
61367E06461L629K333J61j046n6J484J208m88j232j74J577L502O082Q522Q673
$$ 506461 510090 512423 512584 511538 511482 512966 514174 513686 512454 512280 513857 517359 523441 531963 540636
61352E40636O018K745Q24k67j850l589m141l332k358k268l044l927m113l508k955
$$ 540636 546654 549399 550223 549956 548106 544517 540376 537044 534686 532418 529374 525447 521334 517826 514871
61337E14871l273m007l951k922j989j786j754j397j098j054n95O00J555J215N1
$$ 514871 511598 507591 503640 500718 498729 496943 495189 493792 492694 491640 491045 491645 493200 494415 494466
61322D94466l79R24L619O360P506O248L573J512J090J656K375L344M690N712N736
$$ 494466 494087 495011 498630 504990 512496 518744 522317 523829 524919 526575 528950 532294 536984 542696 548432
61307E48432N082M409L904L691M117M906M987M067L439M223N644O228N975O077
$$ 548432 553514 557923 561827 565518 569635 574541 579528 583595 587034 591257 596901 603129 609104 615181
61293F15181P066Q363R416J0123J0412J0255R932R573Q870P841P231P389P426
$$ 615181 622247 630610 640026 650149 660561 670816 680748 690321 699191 707032 714263 721652 729078
61280G29078O420M762L410K610K299K881M336N500N571N393N651M936J737k383
$$ 729078 735498 740260 743670 746280 748579 751460 755796 761296 766867 772260 777911 782847 784584 782201
61266G82201m146k955j475j638k566l031l504m521n103m242k571j240l08O21J264
$$ 782201 778055 775100 773625 771987 769421 766390 762886 758365 753262 749020 746449 745209 744901 745522 746786
61251G46786J403J771L049M717N837O261O249N806N234N349O065N706K957j131
$$ 746786 748189 749960 753009 757726 763563 769824 776073 781879 787113 792462 798527 804233 807190 806059
61237H06059m322n744o128o159n974n929o325o481n369l329j986k137k746k418
$$ 806059 801737 795993 789865 783706 777732 771803 765478 758997 753628 750299 748313 746176 743430 741012
61223G41012j097J92P13O70Q98K127M374O770Q262Q623Q613R013R655R610Q348
$$ 741012 739915 740107 740820 741490 742388 744515 748889 755659 763921 772544 781157 790170 799825 809435 817783
61208H17783O682O261P841J0279J1698J1603J1190J1585J2522J3020J2663J1638
$$ 817783 824465 830726 838567 848846 860544 872147 883337 894922 907444 920464 933127 944765
61196I44765J0184Q616P427O700N800M237K588J903K431L404L935L652K672J387
$$ 944765 954949 963565 970992 977692 983492 987729 990317 992220 994651 998055 1001990 1005642 1008314 1009701
61182A009701Q1j506l835o443p797p058n550n558p761j0605j2206j2123j1137
$$ 1009701 1009782 1008276 1004441 997998 990201 983143 977593 972035 964274 953669 941463 929340 918203
61169I18203j0018q914p720o637o131o153n716l891j385j73j216l294m784n518
$$ 918203 908185 899271 891551 884914 878783 872630 866914 863023 861638 861465 860249 856955 852171 846653
61155H46653n895n159k263J842M529M365K418N07o07r15m14O02J442J960K898
$$ 846653 840758 835599 833336 835178 839707 844072 846490 846997 846390 845475 845061 845663 847105 849065 851963
61140H51963M763P141R556J2098J4497J5631J5064J4313J5279J7637J8956J7414
$$ 851963 856726 863867 873423 885521 900018 915649 930713 945026 960305 977942 996898 1014312
61128A014312J3541R263O180M823M759N028N015N052N684O456O296N157M245M149
$$ 1014312 1027853 1037116 1043296 1048119 1052878 1057906 1062921 1067973 1073657 1080113 1086409 1091566 1095811 1099960
61114A099960L811K166Jj061j016j503l260m864m751l543l323n004p393q950r544
$$ 1099960 1103771 1105937 1105938 1104877 1103861 1102358 1099098 1094234 1089483 1085940 1082617 1077613 1070220 1061270 1051726
61099A051726j0053j0857j1419j1305j0912j0830j0788r806p534m960l400l144
$$ 1051726 1041673 1030816 1019397 1008092 997180 986350 975562 965756 958222 953262 949862 946718
61087I46718l616m617o573r414j2147j4023j5405j6793j7641j7093j5481j4027
$$ 946718 943102 938485 931912 922498 910351 896328 880923 864130 846489 829396 813915 799888
61075G99888j3109j1948j0179q653q122p912o649l945p96J484K391K468K776M071
$$ 799888 786779 774831 764652 755999 747877 739965 733316 729371 728575 730059 732450 734918 737694 741765
61061G41765O378R281J2369J5101J6691J6894J6799J7947K0428K2722K3591K3359
$$ 741765 748143 757424 769793 784894 801585 818479 835278 853225 873653 896375 919966 943325
61049I43325K3025K3005K3210K3509K3503K2610K1038J9861J9390J8223J4898
$$ 943325 966350 989355 1012565 1036074 1059577 1082187 1103225 1123086 1142476 1160699 1175597
61038A175597R975N400K108p76m397q675j2320j3902j3201j1904j2451j5467j8837
$$ 1175597 1185572 1190972 1193080 1192304 1187907 1179232 1166912 1153010 1139809 1127905 1115454 1099987 1081150
61025A081150k0141j9470j8897j9662k1129k2254k2809k3004k2937k2640k1976
$$ 1081150 1061009 1041539 1022642 1002980 981851 959597 936788 913784 890847 868207 846231
61014H46231k0509j8236j6139j5156j4909j4511j4165j4524j4786j3276j0158
$$ 846231 825722 807486 791347 776191 761282 746771 732606 718082 703296 690020 679862
61003F79862p644o858o323m559k459j614j636r10Q14K293K782K643K159J322Q19
$$ 679862 672218 665360 659037 654478 652019 650405 648769 647859 648673 650966 653748 656391 658550 659872 660691
60988F60691J825M409P216R138J0364J1512J2596J3486J4597J6343J8262J9463
$$ 660691 662516 666925 674141 683279 693643 705155 717751 731237 745834 762177 780439 799902
60976G99902J9752J9799K0101K0374K0189J9923K0622K2826K5841K8438L0276
$$ 799902 819654 839453 859554 879928 900117 920040 940662 963488 989329 1017767 1048043
60965A048043L2287L5517L9735M3529M5909M7679N0918N6988O5421P5091Q5725
$$ 1048043 1080330 1115847 1155582 1199111 1245020 1292699 1343617 1400605 1466026 1541117 1626842
60954A626842R6811J04630J02278Q5001N5789K4374J03j3513j7649j4194n089
$$ 1626842 1723653 1828283 1930561 2015562 2071351 2095725 2095828 2082315 2064666 2050472 2045383
60943B045383N155R087M28k1021m8826p4278r1661j00055j01254r7052q8842p8702
$$ 2045383 2050538 2059625 2060053 2039032 1990206 1915928 1824267 1724212 1622958 1525906 1437064 1358362
60931A358362o9213o1733n5555m9329m2773l6652l1705k8129k5716k3948k2271
$$ 1358362 1289149 1227416 1171861 1122532 1079759 1043107 1011402 983273 957557 933609 911338
60920I11338k0702j9776j9583j9328j8349j7014j5937j4824j3094j1346j1056
$$ 911338 890636 870860 851277 831949 813600 796586 780649 765825 752731 741385 730329
60909G30329j2535j4148j4033j2041r517p721p000p114p528p390n972l605j740
$$ 730329 717794 703646 689613 677572 668055 660334 653334 646220 638692 631302 625330 621725 619985
60896F19985j468k122k064r79m14j453k604j405K101M860M397J782J25Q47K643
$$ 619985 618517 616395 614331 613352 612938 611485 608881 607476 609577 614437 618834 620616 620741 621588 624231
60881F24231L784M131M518N118N278M627L564K507J258l69j592j186O98K054J149
$$ 624231 628015 632146 636664 641782 647060 651687 655251 657758 659016 658647 657055 655869 656567 658621 659770
60866F59770j383l519m539n389o345n957l206N08K732K745J892J516J689J780
$$ 659770 658387 654868 650329 644940 638595 632638 629432 629940 632672 635417 637309 638825 640514 642294
60852F42294J332L38p26j043k65R41J603J618J622J939K281K449K653L026L361
$$ 642294 643626 643964 643238 642195 641930 642871 644474 646092 647714 649653 651934 654383 657036 660062 663423
60837F63423L396K986K001M40j359k954m182n013n284m907m134l298k603k369
$$ 663423 666819 669805 671806 672246 670887 667933 663751 658738 653454 648547 644413 641115 638512 636143
60823F36143k944l858l815k254k90Q51J531K658L543K677N65j79J804M722O150
$$ 636143 633199 629341 625526 623272 622982 623833 625364 628022 631565 634242 634807 634628 636432 641154 647304
60808F47304O067O208P341Q650R358R596R662R386Q535P230N833M778M502N154
$$ 647304 653371 659579 666920 675570 684928 694524 704186 713572 722107 729337 735170 739948 744450 749604
60794G49604O339P459Q255Q741Q777Q172P272O948P675Q799R104Q164O904O540
$$ 749604 755943 763402 771657 780398 789175 797347 804619 811567 819242 828041 837145 845309 852213 858753
60780H58753P139P602P083N841M524L259J992J220J593L068N125P541J0194J2388
$$ 858753 865892 873494 880577 886418 890942 894201 896193 897413 899006 902074 907199 914740 924934 937322
60766I37322J3435J3844J4879J6848J8856K0376K1915K3804K5506K6723K7991
$$ 937322 950757 964601 979480 996328 1015184 1035560 1057475 1081279 1106785 1133508 1161499
60755A161499K9470L0200K9509K8164K7042K5494K2359J7910J3414R079M010j935
$$ 1161499 1190969 1221169 1250678 1278842 1305884 1331378 1353737 1371647 1385061 1394140 1398150 1396215
60743A396215p716j2785j7746k2781k6597k7879k7089k6038k5912k6343k6228
$$ 1396215 1388499 1375714 1357968 1335187 1308590 1280711 1253622 1227584 1201672 1175329 1149101
60732A149101k5054k3440k2468k2388k2062k0168j6927j4101j3044j3422j4047
$$ 1149101 1124047 1100607 1078139 1055751 1033689 1013521 996594 982493 969449 956027 941980
60721I41980j4336j4325j3783j2252j0025q320q085q894r346q573p110o264o715
$$ 941980 927644 913319 899536 887284 877259 868939 860854 851960 842614 834041 826931 820667 813952
60708H13952p897q795r055r137r566j0397j1385j2227j2572j2182j1313j0560
$$ 813952 806055 797260 788205 779068 769502 759105 747720 735493 722921 710739 699426 688866
60696F88866j0128r618q847q406q795r305q657o784n192n028n524n146l789k801
$$ 688866 678738 669120 660273 651867 643072 633767 625110 618326 613134 608106 602582 597436 593647 590846
60682E90846k845k915k102j317k158m420o006n544l942k796k142q90R76J967J223
$$ 590846 588001 585086 582984 581667 579509 575089 569083 563539 559597 556801 554659 553769 554745 556712 557935
60667E57935j0J94K036L852M243L460K520J779R74J29m11p42j397k394l076l136
$$ 557935 557925 558119 560155 564007 568250 571710 574230 576009 576983 577112 576701 575959 574562 572168 569092 565956
60651E65956l332m519o365p571p332o143n219n367o277o778o023m624m016m443
$$ 565956 562624 558105 551740 544169 536837 530694 525475 520108 513831 507053 501030 496406 492390 487947
60637D87947m391k801r95j092k908m150l658k708k460j933J48K732L349J206j918
$$ 487947 483556 480755 479760 478668 475760 471610 467952 465244 462784 460851 460999 463731 467080 468286 466368
60622D66368l672l038n99J976K804J257j289k783k516j229L54K019L319L625L120
$$ 466368 462696 459658 459059 461035 463839 465096 463807 461024 458508 457279 457633 459652 462971 466596 469716
60607D69716K678K524J952P14k69K8J637L890O012P199P045O263O108O679O757
$$ 469716 472394 474918 476870 477584 477315 477343 478980 482870 488882 496081 503126 509389 515497 522176 528933
60592E28933N754M725M739N382N821O292P228P819P012N457M701M583L145m60
$$ 528933 534687 539412 544151 549533 555354 561646 568874 576693 583705 589162 593863 598446 601591 601131
60578F01131m460o587o570n804n360n274n265n270n343n504n687n700n402m950
$$ 601131 596671 590084 583514 577710 572350 567076 561811 556541 551198 545694 540007 534307 528905 523955
60564E23955m593m249l723l284l299l322k365m35J097J105M9q83j296j535j708
$$ 523955 519362 515113 511390 508106 504807 501485 499120 498685 499782 500887 500936 500053 498757 497222 495514
60549D95514j668j576j653j530p57K46N80K88M71J700L023L050J640J01j85Q65
$$ 495514 493846 492270 490617 489087 488330 488576 489156 489444 489915 491615 494638 497688 499328 499429 499244 500109
60533E00109K007J993R44K30R14K590M012M403L814K783K302L579O770J0072J1171
$$ 500109 502116 504109 505053 505283 506197 508787 512799 517202 521016 523799 526101 529680 536450 546522 557693
60518E57693R821Q141Q255J0426J3531J6142J6888J5014J1447Q330O636N024J994
$$ 557693 567514 575655 583910 594336 607867 624009 640897 655911 667358 675688 682324 687348 689342
60505F89342j711m069m572m525m665l960j357K349N208O295O570P560R578J1485
$$ 689342 687631 683562 678990 674465 669800 665840 664483 666832 672040 678335 684905 692465 702043 713528
60491G13528J2256J2524J3969J7039K0000K0740J8986J6114J3276J0552P521L796
$$ 713528 725784 738308 752277 769316 789316 810056 829042 845156 858432 868984 876505 880301
60479H80301p78n508q695r197q117p737q598q956p465n029l254k320j491p81o84
$$ 880301 879523 874015 865320 856123 848006 840269 831671 822715 815250 810221 806967 804647 803156 802375 801691
60464H01691p19K45K191L763M165M234N111O711Q260R815J2319J6185K0608K4610
$$ 801691 800972 801217 803408 807171 811336 815570 820681 827392 835652 845467 857786 873971 894579 919189
60450I19189K8277L2401L7108M1448M4554M6714M8835N1087N2645N2677N1021
$$ 919189 947466 979867 1016975 1058423 1102977 1149691 1198526 1249613 1302258 1354935 1405956
60439A405956M7736M2428L4510K3810J0741l987j9393l4000m6086n4576n9671
$$ 1405956 1453692 1496120 1530630 1554440 1565181 1561194 1541801 1507801 1461715 1407139 1347468
60428A347468o2392o3266o1856n7836n2288m7181m3501m0516l7222l3736l0842
$$ 1347468 1285076 1221810 1159954 1102118 1049830 1002649 959148 918632 881410 847674 816832
60417H16832k8776k7157k5506k3158j9434j4873j1605j1125j2129j2030j0346
$$ 816832 788056 760899 735393 712235 692801 677928 666323 655198 643069 631039 620693
60406F20693q819q257p375n418l946m580o441p372o725n572m820m532m595m805
$$ 620693 611874 603617 596242 590824 586878 582298 575857 568485 561760 556188 551368 546836 542241 537436
60392E37436m595l777l146l382l808l380k419k073k412k436j903j655j969j942
$$ 537436 532841 529064 525918 522536 518728 515348 512929 510856 508444 506008 504105 502450 500481 498539
60378D98539r65K25N76K8o85j006r13o70l81K84J662L097L065J098j029j255M7
$$ 498539 497574 497799 498375 498403 497718 496712 495799 495129 494748 495032 496694 499791 502856 503954 502925 501670 501717
60361E01717O96j40j047q30j56j19n76r44j380k125k469j507N19K448L388L059
$$ 501717 502413 502273 501226 500396 500240 500121 499545 498601 497221 495096 492627 491120 491639 494087 497475 500534
60345E00534J598j88r33O4J978L487M226M579M506L534J801K84j12P12K142L289
$$ 500534 502132 501944 501011 501075 503053 506540 510766 515345 519851 523385 525186 525470 525358 526070 528212 531501
60329E31501L632L541L865M640M742L510K080K149L623M602L888K489K158L108
$$ 531501 535133 538674 542539 547179 551921 555431 557511 559660 563283 567885 571773 574262 576420 579528
60315E79528L914L375J808M72J32N04R18J092J150J230J367J615J935K016J617
$$ 579528 583442 586817 588625 589097 589229 589733 590651 591743 592893 594123 595490 597105 599040 601056 602673
60300F02673R99O91R03J547K556L595L813K821J761K211L897M756L605J470k41
$$ 602673 603672 604363 605266 606813 609369 612964 616777 619598 621359 623570 627467 632223 635828 637298 637057
60285F37057j420k236j938j83J555J533J15r61j057q53n60K33J128J077J25o54
$$ 637057 635637 633401 631463 631280 632835 634368 634483 633522 632465 631612 631052 631285 632413 633490 633615 632961
60269F32961j031j714k380j554P78K352J553k24l45K018N677R144J1303J1486
$$ 632961 631930 630216 627836 626282 627060 629412 630965 630741 630396 632414 638091 647235 658538 670024
60255F70024J0278R597J0690J2717J4420J6288J9279K2156K2227J8855J4135R689
$$ 670024 680302 689899 700589 713306 727726 744014 763293 785449 807676 826531 840666 850355
60243H50355M673j879q429j2340j3268j3463j4758j6550j7218j6494j5527j4943
$$ 850355 855028 853149 844720 832380 819112 805649 790891 774341 757123 740629 725102 710159
60231G10159j3866j1364q157n995n477n443m886m342m564m769l555j238J91l32
$$ 710159 696293 684929 676772 670777 665300 659857 654971 650629 646065 641296 637741 636503 636694 636362
60217F36362j702k366k104j502p30J28L39q02k845m590n405n385m554k890j043
$$ 636362 634660 632294 630190 628688 627958 628086 628425 627623 624778 620188 614783 609398 604844 601954 600911
60202F00911o7j81m94k59K60L64k19j367k915m431n106m497l246k455k304j766
$$ 600911 600844 600663 600169 599910 600170 600534 600315 598948 596033 591602 586496 581999 578753 576298 573994 572228
60186E72228M8K626M494M737L674K124N31q05j143K10K727M663M756L459K173
$$ 572228 572276 574902 579396 584133 587807 589931 590462 589657 588514 588724 591451 596114 600870 604329 606502
60171F06502J546J253J162J788L276M617M554L090J612J462K723M433N612N800
$$ 606502 608048 609301 610463 612251 615527 620144 624698 627788 629400 630862 633585 638018 643630 649430
60157F49430M891L109J378J047K540M468N014M264M158N747P621P908O850O097
$$ 649430 654321 657430 658808 659855 662395 666863 671877 676141 680299 686046 693667 701575 708425 714522
60143G14522O055N708M914M974O320P314O443M536L542L905M528M814N289O224
$$ 714522 720577 726285 731199 736173 742493 749807 756250 760786 764328 768233 772761 777575 782864 789088
60129G89088O802O043L863J101j054j677q36K70M00m87j483j944j888j462q29
$$ 789088 795890 801933 805796 806897 805843 804166 803330 803600 804000 803513 802030 800086 798198 796736 795907
60114G95907n55j217k409k931k253j294j426k986m841n209l222j56J308j55k748
$$ 795907 795352 794135 791726 788795 786542 785248 783822 780836 775995 770786 767564 767408 768716 768561 765813
60099G65813l642k496j616k476l786l616j968j95R95J698J875J550J465K310L646
$$ 765813 762171 759675 758059 755583 751797 748181 746213 746018 747013 748711 750586 752136 753601 755911 759557
60084G59557M555N024N580O007N660M886M816N560N843M813L146J988J623J653
$$ 759557 764112 769136 774716 780723 786383 791269 796085 801645 807488 812301 815447 817435 819058 820711
60070H20711J760J758J471J018Q15R68J138J137J125R67J85j001j397k67J473
$$ 820711 822471 824229 825700 826718 827533 828501 829639 830776 831901 832868 833053 832052 830655 830388 831861
60055H31861K318K103K033K906M103M484L701K337J238R87J739L120M309M470
$$ 831861 834179 836282 838315 841221 845324 849808 853509 855846 857084 858071 859810 862930 867239 871709
60041H71709L426J975J367K156L514L908K630N07r86j151m96Pj51p72j347j568
$$ 871709 875135 877110 878477 880633 884147 888055 890685 891192 890206 889055 888559 888566 888415 887643 886296 884728
60025H84728j453j023j34J100J874J342k05j379j285o43p83j956l331m384n340
$$ 884728 883275 882252 882118 883218 885092 886434 886229 884850 883565 882922 882139 880183 876852 872468 867128
60010H67128o204o393n884n854p322r500j0566r993r105r047r174q248o499n377
$$ 867128 860924 854531 848647 842793 835471 825971 815405 805412 796307 787260 778086 769838 763339 757962
59996G57962n378n413m639l823m025m725m431k905j528j316j699j765j685k068
$$ 757962 752584 747171 742532 738709 734684 729959 725528 722623 721095 719779 718080 716315 714630 712562
59982G12562k528k044m95J067J806K038K529L478M360M402L140J012o33p49P5
$$ 712562 710034 707990 707495 708562 710368 712406 714935 718413 722773 727175 730315 731327 730694 729945 730020
59967G30020J80j032k409k885k940l429l993l946m008n437p635q453p281n967
$$ 730020 730200 729168 726759 723874 720934 717505 713512 709566 705558 700121 692486 684033 676752 670785
59953F70785n896n861m228j851r56j874k864k889k594k443j814n74J61k41q32
$$ 670785 664889 659028 654800 652949 651993 650119 647255 644366 641772 639329 637515 636941 637102 636861 636029
59938F36029p50p16j577k430j813j05R26P73P86J872L070L011J851J039J619L248
$$ 636029 635279 634563 632986 630556 628743 628638 629564 630337 631123 632995 636065 639076 640927 641966 643585 646833
59922F46833M618M698L748L005L060L028K142J508K857N553O665M643J365n60
$$ 646833 651451 656149 659897 662902 665962 668990 671132 672640 675497 681050 687715 692358 693723 693163
59908F93163j120j909k983k826j299l02r45j759q74J238K487J996Q56L94P98J605
$$ 693163 692043 690134 687151 684325 683026 682724 681779 680020 679146 680384 682871 684867 685723 686117 686915 688520
59892F88520K533L450M095M222L720K599J184L17P04J862K417J797R80J072J778
$$ 688520 691053 694503 698598 702820 706540 709139 710323 710640 711344 713206 715623 717420 718400 719472 721250
59877G21250K028J588J076O37k77j718k834k981k371j374j7J375J953J419N58
$$ 721250 723278 724866 725942 726579 726302 724584 721750 718769 716398 715024 715007 716382 718335 719754 720312
59862G20312R9j67l98K55K418N029O418O486O471O793O673N907N445N798O315
$$ 720312 720411 720244 719846 720101 722519 727548 733966 740452 746923 753716 760389 766296 771741 777539 783854
59847G83854O609P375Q927J0067R488P500N372L591J688o07k915m617n167m457
$$ 783854 790463 797838 806765 816832 826320 833820 839192 842783 844471 843864 840949 836332 831165 826708
59833H26708l311k984l556l655k433r18m03m41J70J262J853K247L683N796O466
$$ 826708 823397 820413 816857 813202 810769 809851 809448 809007 809177 810439 812292 814539 818222 824018 830484
59818H30484M675J944K38j87j50k5J78K21n6m81j228k807m761n473m252k655k572
$$ 830484 835159 837103 837341 837154 837004 836979 837157 837378 837322 836841 835613 832806 828045 822572 818320 815665 813093
59801H13093l717m306l699l022l236l888l889k792j163k06q79k805m301m090k618
$$ 813093 809376 805070 801371 798349 795113 791225 787336 784544 783381 783175 782296 779491 775190 771100 768482
59786G68482j200n45q44k377m715o086n173l178k285k450j805k11K40j105j885
$$ 768482 767282 766737 765893 763516 758801 752715 747542 744364 742079 739629 737824 737613 737853 736748 734863
59771G34863l36J826K140J112P26P63m92k566k969j176M05J71n49j83N14K34m08
$$ 734863 734527 736353 738493 739605 740331 741094 740602 738036 735067 733891 734296 734467 733918 733735 734249 734483 734075
59754G34075p5P79O64l33n37P71K389K883K088P56k77m10L96J379J643J110L55
$$ 734075 734000 734779 735443 735110 734573 735344 737733 740616 742704 743460 743183 742773 743169 744548 746191 747301 747656
59737G47656l63j256k332l354m281n078n237m340k994k248k211k190k081k311
$$ 747656 747293 746037 743705 740351 736070 730992 725755 721415 718421 716173 713962 711772 709691 707380
59723G07380k443j437K62O38r98k558j991k40K92p77j840k201k697l305k341R55
$$ 707380 704937 703500 703762 704400 703402 700844 698853 698613 698905 698128 696288 694087 691390 688085 685744 686699
59707F86699M619O002M707K542J193R37J160J277J223J500K519L760M253M176
$$ 686699 691318 697320 702027 704569 705762 706699 707859 709136 710359 711859 714378 718138 722391 726567
59693G26567N079P685J0305J0610Q657O925P172Q421Q395O297L634K570L727N644
$$ 726567 731646 739331 749636 760246 768903 775828 783000 791421 799816 806113 809747 812317 816044 821688
59679H21688O389N718N013N006M509K379j89r55P0N29p28j911j123O73J132j19
$$ 821688 828077 833795 838808 843814 848323 850702 850513 849558 849628 850157 849429 847518 846395 847068 848200 848081
59663H48081j344j410q49k85M36J238J339M25o78j161j198j167p56M57K155L746
$$ 848081 846737 845327 844478 844193 844629 845867 847206 847631 846953 845792 844594 843427 842671 843128 845283 849029
59647H49029N185O579P391P007N929N565O631Q352R394R133P921O546N717N803
$$ 849029 854214 860793 868184 875191 881120 886685 893316 901668 911062 920195 928116 934662 940379 946182
59633I46182O680P733Q120P242N186K783R30k14j134j971k101j121J54K99j158
$$ 946182 952862 960595 968715 975957 981143 983926 984856 984642 983508 981537 979436 978315 978469 978768 977610
59618I77610l276m801n283n102m895n115n676n978n542m774m674n535o384o013
$$ 977610 974334 969533 964250 959148 954253 949138 943462 937484 931942 927168 922494 916959 910575 904562
59604I04562m342k374j049m90k55Q6N87Q62M56m52q13M13L041N725P279P508O706
$$ 904562 900220 897846 896797 896307 896052 896138 896725 897587 898043 897591 896778 897191 900232 905957 913236 920744 927450
59587I27450N047L008J708J833K354J379j475m483o075o732p884r688j1041j1349
$$ 927450 932497 935505 937213 939046 941400 942779 941304 936821 930746 924014 916130 906442 895401 884052
59573H84052j0992j0186q761p301p098q272r092q092o042m816n022n798o468p109
$$ 884052 873060 862874 854113 846812 839714 831442 822350 814258 808216 803400 798378 792580 786112 779003
59559G79003p596p413o712o645q096j0486j2096j1487q670n211k908j981r79R46
$$ 779003 771407 763994 757282 750637 742541 732055 719959 708472 699802 694591 691683 689702 688723 689669
59545F89669K405J569r20k409j671l01j76j062j722j991k387k638k115j305j306
$$ 689669 692074 693643 692723 690314 688643 688342 688166 687104 685382 683391 681004 678366 676251 674946 673640
59530F73640j931j791m40Q22P71k09j101j898l236m853n493m509k833j945k254
$$ 673640 671709 669918 669478 670300 671071 670862 669761 667863 664627 659774 654281 649772 646939 644994 642740
59515F42740k965l231l009k704k556k566k749k975k773j738j56J166J728J757
$$ 642740 639775 636544 633535 630831 628275 625709 622960 619985 617212 615474 615318 616484 618212 619969
59501F19969J838K365L302M075L911K733J596J594K436K899K729L110M808O829
$$ 619969 621807 624172 627474 631549 635460 638193 639789 641383 643819 646718 649447 652557 657365 664194
59487F64194P653P212O839P683R850J2773J5784J8531K1213K3906K5226K2555
$$ 664194 671847 679059 685898 693581 703431 716204 731988 750519 771732 795638 820864 843419
59475H43419J4733M182m687r188r766q189n667k897o60M94P15O22Q06J598K793
$$ 843419 858152 862334 857647 848459 838693 830504 824837 821940 821280 821774 822489 823111 823917 825515 828308
59460H28308L608L344K175Q06m40j696k848l545l885m401n337o550p898q962q814
$$ 828308 831916 835260 837435 838241 837801 836105 833257 829712 825827 821426 816089 809539 801641 792679 783865
59445G83865p175n613o146q514j0408j0567r901r089p235m142j832j816k406j091
$$ 783865 776690 771077 764931 756417 746009 735442 725541 716452 709217 705075 703243 701427 699021 697930
59431F97930J484K522J581J150K470L656L091K184L002M904N633M737L826L832
$$ 697930 699414 701936 703517 704667 707137 710793 713884 716068 719070 723974 729607 734344 738170 742002
59417G42002M137M479N814Q516J1009J1336R425O807M448J943r12k780j957J258
$$ 742002 746139 750618 756432 764948 775957 787293 796718 803525 807973 809916 809004 806224 804267 805525
59403H05525M232M560K504M46J45J268K584L681N008O728Q261Q992R066R275J0211
$$ 805525 809757 814317 816821 817267 817412 818680 821264 824945 829953 836681 844942 853934 863000 872275 882486
59388H82486J1559J2231J1454R607P736O193M261J266k399n677p913r198r916
$$ 882486 894045 906276 917730 927337 935073 941266 945527 946793 944394 938717 930804 921606 911690
59375I11690j0340j0606j0698j0548j0251r975r500q188n656k315R28L242M166
$$ 911690 901350 890744 880046 869498 859247 849272 839772 831584 825928 823613 824541 827783 831949
59362H31949L968M025N989R960J3993J6232J7098J8662K2271K7564L3111L6619
$$ 831949 835917 839942 845931 855891 869884 886116 903214 921876 944147 971711 1004822 1041441
59350A041441L5004K6284J2287j750j1203j5198j5656j4412j2007q239k882L548
$$ 1041441 1076445 1102729 1115016 1113266 1102063 1086865 1071209 1056797 1044790 1036551 1033669 1037217
59338A037217Q835R536L650p203j8859k7626l1920l1975k9298k6109k3917k2355
$$ 1037217 1046052 1055588 1059238 1052035 1033176 1005550 973630 941655 912357 886248 862331 839976
59326H39976k0165j7223j4705j3254j2142j0591q881p545o272m338j745O48J969
$$ 839976 819811 802588 787883 774629 762487 751896 743015 735470 729198 724860 723115 723763 725732
59313G25732J949R74k26j083j468j356m22J416L183L546K648K332L877O195P200
$$ 725732 727681 728655 728429 727346 725878 724522 724100 725516 728699 732245 734893 737225 741102 747297 754497
59298G54497O549N922O678Q333R647J0312J0847J1487J2068J2815J4180J5845
$$ 754497 761046 766968 773646 781979 791626 801938 812785 824272 836340 849155 863335 879180
59286H79180J6759J6678J6781J7897J8941J8428J7088J7217J9127K0176J8371
$$ 879180 895939 912617 929398 947295 966236 984664 1001752 1018969 1038096 1058272 1076643
59275A076643J5222J3377J2616J0487O460K977J929K158J470m89k615m407o215
$$ 1076643 1091865 1105242 1117858 1128345 1134805 1137782 1139711 1141869 1143339 1142850 1140235 1135828 1129613
59262A129613q062r502j0385j0806j0513r231p489o384o515p512q609r238r270
$$ 1129613 1121551 1112049 1101664 1090858 1080345 1071114 1063625 1057241 1050726 1043214 1034605 1025367 1016097
59249A016097r040r033r308r512r533r707j0089j0152r623q967q507p700o099
$$ 1016097 1007057 998024 988716 979204 969671 959964 949875 939723 930100 921133 912626 904926 898827
59236H98827m510m141m810m924l460j279k12j123l039l992k829k81J941L076L779
$$ 898827 894317 890176 885366 880442 876982 875703 875491 874368 871329 867337 864508 864227 866168 869244 873023
59221H73023M647N201M939M579N256O900Q435R364J0158J1232J2463J3647J4659
$$ 873023 877670 882871 887810 892389 897645 904545 912980 922344 932502 943734 956197 969844 984503
59208I84503J5057J4461J3387J2837J2884J2483J1022R147P533N630K471j612
$$ 984503 999560 1014021 1027408 1040245 1053129 1065612 1076634 1085781 1093314 1098944 1101415 1099803
59196A099803n082p045q328j0282j2886j4677j4593j3280j2152j1635j1026r951
$$ 1099803 1094721 1087676 1079348 1069066 1056180 1041503 1026910 1013630 1001478 989843 978817 968866
59184I68866q981q606q409p760o717n748n033m453l787k602n80J587K429J395
$$ 968866 959885 951279 942870 935110 928393 922645 917612 913159 909372 906770 906190 907777 910206 911601
59170I11601l78j648k664m359o655q529r275q841p527o131n751o449o841o042
$$ 911601 911223 909575 906911 902552 895897 887368 878093 869252 861725 855594 849843 843394 836553 830511
59156H30511n213n752o908o904n837n403n988o119n018l711l074k557j417J78
$$ 830511 825298 819546 812638 805734 799897 794494 788506 782387 777369 773658 770584 768027 766610 766788
59142G66788J787L090L403K225O77O40K056K830J957Q40P05P75L34O25K900O078
$$ 766788 768575 771665 775068 777293 777970 778610 780666 783496 785453 786293 786998 787773 788107 788732 791632 797710
59126G97710Q221R198R965J0248R121P347O930Q274R531R154P724O905P582R343
$$ 797710 805931 815129 825094 835342 844463 851810 858740 867014 876545 885699 893423 900328 907910 917253
59112I17253J1028J1580J0873R744Q868Q010O827N818N654O091O412O572O933
$$ 917253 928281 939861 950734 960478 969346 977356 984183 990001 995655 1001746 1008158 1014730 1021663
59099A021663P201O690N511M520M045L412J814q59l903o145o733o069n542n907
$$ 1021663 1028864 1035554 1041065 1045585 1049630 1053042 1054856 1053997 1050094 1043949 1037216 1031147 1025605 1019698
59085A019698o555o861p329q429r181q262o068m362m027m346m348l742k649j402
$$ 1019698 1013143 1006282 998953 990524 981343 973081 967013 962651 958624 954278 949930 946188 943539 942137
59071I42137n97l58J72J660L270L776L648M588O991R419J0771J1517J2418J3429
$$ 942137 941540 941182 941354 943014 946284 950060 953708 958296 965287 974706 985477 996994 1009412 1022841
59057A022841J4443J5835J7509J8550J8512J8153J8115J7817J6531J4839J3995
$$ 1022841 1037284 1053119 1070628 1089178 1107690 1125843 1143958 1161775 1178306 1193145 1207140
59046A207140J4248J4632J4234J2977J1283R519P796O017M107K235O66o17j848
$$ 1207140 1221388 1236020 1250254 1263231 1274514 1284033 1291829 1297846 1301953 1304188 1304854 1304237 1302389
59033A302389l030l935m488m823n002n133n659o956q619r724r856r378q786q428
$$ 1302389 1299359 1295424 1290936 1286113 1281111 1275978 1270319 1263363 1254744 1245020 1235164 1225786 1217000 1208572
59019A208572q716r882j1497j2939j4284j5914j7317j7361j5816j3609j1468r513
$$ 1208572 1199856 1189974 1178477 1165538 1151254 1135340 1118023 1100662 1084846 1071237 1059769 1050256
59007A050256q423r377j2014j3780j2658r686p538p172p177o149m441l423l902
$$ 1050256 1041833 1032456 1020442 1006662 994004 984318 976780 969608 962431 956282 951841 948418 944516
58994I44516n360o224n033k040N02M77j704l625l748k808k118j654o24P50J262
$$ 944516 939156 932932 927899 925859 926361 926838 925134 921509 917761 914953 912835 911181 910557 911307 912569
58979I12569M55n72m24J120L231N012N795N073L099J485K099M995Q139R680R833
$$ 912569 913024 912452 912028 913148 916379 921391 927186 932259 935358 936843 938942 943937 952076 961756 971589
58964I71589R990J0719J1469J1845J2161J2822J3915J5322J6612J7013J6222J5065
$$ 971589 981579 992298 1003767 1015612 1027773 1040595 1054510 1069832 1086444 1103457 1119679 1134744
58952A134744J4532J4260J2914J0061O773M238K680J829J483J268O78j44l37N51
$$ 1134744 1149276 1163536 1176450 1186511 1193284 1197522 1200202 1202031 1203514 1204782 1205460 1205316 1204979 1205530
58938A205530J885K666K468J513M44J47R88J930J312j147l910n537o175o714p436
$$ 1205530 1207415 1210081 1212549 1214062 1214506 1214653 1215641 1217571 1218883 1217736 1213826 1208289 1202114 1195400 1187964
58923A187964q256r375j0762j1583j1084r695q427p528o528n307m248l382k179
$$ 1187964 1179708 1170333 1159571 1147988 1136904 1127209 1118782 1111254 1104726 1099419 1095171 1091789 1089610
58910A089610l70J537K706K856K667L241M906O687P422P224P017O773N443K998
$$ 1089610 1089240 1090777 1093483 1096339 1099006 1102247 1107153 1113840 1121262 1128486 1135503 1142276 1147719 1150717
58896A150717J138J028J426L07k420n122o853q122r401j0213j0061r387r179j0003
$$ 1150717 1151855 1152883 1154309 1154616 1152196 1147074 1140221 1132099 1122698 1112485 1102424 1093037 1083858 1073855
58882A073855j1402j1981j0531p568n337n489p106p902p004n529m711m628m833
$$ 1073855 1062453 1050472 1039941 1032373 1027036 1021547 1014441 1006539 999535 994006 989295 984667 979834
58869I79834n015m770l727k285j388j238j069n37l34q70j217k22J787L323L534
$$ 979834 974819 970049 966322 964037 962649 961411 960342 959805 959471 958601 957384 957162 958949 962272 965806
58854I65806K950K490K333K075J628J716L245O195R262J0892J0682R589Q788Q696
$$ 965806 968756 971246 973579 975654 977282 978998 982243 988438 997700 1008592 1019274 1028863 1037651 1046347
58840A046347Q970Q978Q188O564M815L858L845M088M275N200P732J1278J4054
$$ 1046347 1055317 1064295 1072483 1079047 1083862 1087720 1091565 1095653 1099928 1105128 1112860 1124138 1138192
58827A138192J5026J5095J5939J7969J9865K0177J8934J7421J6523J5810J4287
$$ 1138192 1153218 1168313 1184252 1202221 1222086 1242263 1261197 1278618 1295141 1310951 1325238
58816A325238J1728Q919O660M842K585p40m811q684j1756j4182j6212j7471j7426
$$ 1325238 1336966 1345885 1352545 1357387 1359972 1359232 1354421 1345737 1333981 1319799 1303587 1286116 1268690
58803A268690j6443j5686j5679j5530j4178j2123j1248j2770j5747j7875j7745
$$ 1268690 1252247 1236561 1220882 1205352 1191174 1179051 1167803 1155033 1139286 1121411 1103666
58792A103666j6108j4922j5177j5976j5807j4406j2785j1805j1380j1085j0691
$$ 1103666 1087558 1072636 1057459 1041483 1025676 1011270 998485 986680 975300 964215 953524
58781I53524r929q563p109o575p004p018n644l869l375m239n032m940m636m999
$$ 953524 943595 935032 927923 921348 914344 907326 901682 897813 894438 890199 885167 880227 875591 870592
58767H70592o035p208p998p893o694n070m045l651k892j347J0K25k47l42l0k05
$$ 870592 864557 857349 849351 841458 834764 829694 825649 821998 819106 817759 817769 817994 817747 817405 817375 817170
58751H17170j192k175k185j027Q18K616L592L342K331J648J894K556K718K189
$$ 817170 815978 813803 811618 810591 811409 814025 817617 820959 823290 824938 826832 829388 832106 834295
58737H34295J590J451J635J719J674J800K243K733K906K666K187J684J299J240
$$ 834295 835885 837336 838971 840690 842364 844164 846407 849140 852046 854712 856899 858583 859882 861122
58723H61122J865L463N852Q281R920J0425J0013R103Q188P787P932P694N946K922
$$ 861122 862987 866450 872302 880583 890503 900928 910941 920044 928232 936019 943951 951645 957591 960513
58709I60513L10p45j055k043l682m894n526o387p345p013m961k850k331k876k833
$$ 960513 960823 960078 959023 956980 953298 948404 942878 936491 929146 922133 917172 914322 911991 909115 906282
58694I06282j908j295j598j973j522n22K21O06J306K702M226M916M566M037M251
$$ 906282 904374 903079 901481 899508 897986 897464 897685 898291 899597 902299 906525 911441 916007 920044 924295
58679I24295N117N865O177O356O565O777P488R348J1729J2783J1617R536Q323
$$ 924295 929412 935277 941454 947810 954375 961152 968640 977988 989717 1002500 1014117 1023653 1031976
58666A031976Q130P909P103N844M170K201O76J02k93j611l493m472l930k518q60
$$ 1031976 1040106 1048015 1055118 1060962 1065132 1067333 1068009 1068111 1067818 1066207 1062714 1058242 1054312 1051794 1050934
58651A050934Q29J878J484K55L0J423K727K151J85j251j450j678l515p146j1284
$$ 1050934 1051763 1053641 1055125 1055380 1055410 1056833 1059560 1061711 1061896 1060645 1059195 1057517 1054002 1046856 1035572
58636A035572j4292j5439j5380j5278j5462j5304j4579j4139j4700j5485j4991
$$ 1035572 1021280 1005841 990461 975183 959721 944417 929838 915699 900999 885514 870523
58625H70523j2922j0494q730p433o229n718o602p996p862n386j984N16J797K382
$$ 870523 857601 847107 838377 830944 824715 818997 812395 804399 796537 791151 789167 789683 791480 793862
58611G93862K079N72r07l46K262M599N149N226O712R113J0322R539P824O117M246
$$ 793862 795941 796513 795606 795260 797522 802121 807270 812496 819208 828321 838643 848182 856006 862123 866369
58596H66369J987k24j904k968l391l191k856l030l629l910l496k706j981j545
$$ 866369 868356 868132 866228 863260 859869 856678 853822 850792 847163 843253 839757 837051 835070 833525
58582H33525j588k157k822l040k823k540k339k210k254k192j126J226L490L984
$$ 833525 831937 829780 826958 823918 821095 818555 816216 814006 811752 809560 808434 809660 813150 817134
58568H17134K888J915J972K432K752L354M521N621O053O052O160O560P259Q059
$$ 817134 820022 821937 823909 826341 829093 832447 836968 842589 848642 854694 860854 867414 874673 882732
58554H82732Q213P097N418M661N025N083L945K501J765J287K17j036j504j277
$$ 882732 890945 898042 903460 908121 913146 918229 922174 924675 926440 927727 927944 926908 925404 924127
58540I24127j206j383j216p88q48j259p07J445L850M600L629K733L127L900L601
$$ 924127 922921 921538 920322 919534 918686 917427 916720 918165 922015 926615 930244 932977 936104 940004 943605
58525I43605K661L000N315Q144J0122J1825J4184J6183J5837J3195J0727J0475
$$ 943605 946266 949266 954581 962725 972847 984672 998856 1015039 1030876 1044071 1054798 1065273
58513A065273J2009J3447J3535J2398J1047J0466J0687J0796J0438J0795J3114
$$ 1065273 1077282 1090729 1104264 1116662 1127709 1138175 1148862 1159658 1170096 1180891 1194005
58502A194005J6585J9051J9710J9766K0387K1485K2756K4278K5530K5170K2686
$$ 1194005 1210590 1229641 1249351 1269117 1289504 1310989 1333745 1358023 1383553 1408723 1431409
58491A431409J9138J5720J2533R329O340L689R59j966m523o424q169j0105j2047
$$ 1431409 1450547 1466267 1478800 1488129 1494469 1498158 1499117 1497151 1492628 1486204 1478035 1467930 1455883
58478A455883j4077j6667j9489k1474k2570k3928k5600k5647k2841j8932j6659
$$ 1455883 1441806 1425139 1405650 1384176 1361606 1337678 1312078 1286431 1263590 1244658 1227999
58467A227999j6380j6133j4502j2062j0166r366q946p580m820k083j307k385l131
$$ 1227999 1211619 1195486 1180984 1168922 1158756 1149390 1140444 1132864 1128044 1125961 1124654 1122269 1119138
58454A119138k363j491k133l568l885k485j90K033L189K297j04j554m31J719K318
$$ 1119138 1116775 1115284 1113151 1109583 1105698 1103213 1103023 1105056 1108245 1110542 1110438 1108884 1108453 1110172 1112490
58439A112490J263M21M16K10m65n23M55J560K212K761L165K747J749J564K871
$$ 1112490 1113753 1114174 1114590 1114800 1114335 1113812 1114267 1115827 1118039 1120800 1123965 1126712 1128461 1130025 1132896
58424A132896M818O490P958R375J0310J0609J0918J1757J2948J4385J6391J8766
$$ 1132896 1137714 1144204 1152162 1161537 1171847 1182456 1193374 1205131 1218079 1232464 1248855 1267621
58412A267621K0360K0213J8489J5839J2531Q672M688J121j666l425m168m487m914
$$ 1267621 1287981 1308194 1326683 1342522 1355053 1363725 1368413 1369534 1367868 1364443 1360275 1355788 1350874
58399A350874m904l391o34J513J793J068R25J501J838J846K605M593O641P162
$$ 1350874 1345970 1342579 1341945 1343458 1345251 1346319 1347244 1348745 1350583 1352429 1355034 1359627 1366268 1373430
58385A373430N855L696J649o7j551k718l423l755l926m005l868l271j977j10J610
$$ 1373430 1379285 1382981 1384630 1384563 1383012 1380294 1376871 1373116 1369190 1365185 1361317 1358046 1356069 1355959 1357569
58370A357569K557L225M809P338R171R247Q949J0365J3288J5478J5653J4632J3445
$$ 1357569 1360126 1363351 1368160 1375498 1384669 1393916 1402865 1413230 1426518 1441996 1457649 1472281 1485726
58357A485726J2113J0612R357Q149O123L405J288K13q81k445l278k669j774j591
$$ 1485726 1497839 1508451 1517808 1525957 1532080 1535485 1536773 1536986 1536105 1533660 1530382 1527713 1525939 1524348
58343A524348j210K60J597J314M06J102L528N706O485O634P164Q202R539J0869
$$ 1524348 1523138 1523398 1524995 1526309 1526715 1527817 1531345 1537051 1543536 1550170 1557334 1565536 1575075 1585944
58329A585944J1538J1239J0685J0580J0357R230P988Q217R969J1533J1486R766
$$ 1585944 1597482 1608721 1619406 1629986 1640343 1649573 1657561 1665778 1675747 1687280 1698766 1708532
58317A708532P069M356K743K651L320M070N485Q086J0638J1399J0678J0382J1196
$$ 1708532 1715601 1719957 1722700 1725351 1728671 1732741 1738226 1746312 1756950 1768349 1779027 1789409 1800605
58304A800605J2022J2235J2740J4341J6462J8052J8737J8739J8506J8686J9678
$$ 1800605 1812627 1824862 1837602 1851943 1868405 1886457 1905194 1923933 1942439 1961125 1980803
58293A980803K1087K2106K2376K2014K1168K0131J9339J8680J7562J6345J6588
$$ 1980803 2001890 2023996 2046372 2068386 2089554 2109685 2129024 2147704 2165266 2181611 2198199
58282B198199J8792K1062K1326K0009J9050J9324K0546K2667K5514K7807K8411
$$ 2198199 2216991 2238053 2259379 2279388 2298438 2317762 2338308 2360975 2386489 2414296 2442707
58271B442707K8022K7981K8180K7917K7812K8830L0162L0297K9532K9189K9015
$$ 2442707 2470729 2498710 2526890 2554807 2582619 2611449 2641611 2671908 2701440 2730629 2759644
58260B759644K7814K6100K5492K5885K5886K5737K6971K9120K9851K8698K7900
$$ 2759644 2787458 2813558 2839050 2864935 2890821 2916558 2943529 2972649 3002500 3031198 3059098
58249C059098K8958L1015L3263L6264L9875M2423M3097M3141M3641M4089M4041
$$ 3059098 3088056 3119071 3152334 3188598 3228473 3270896 3313993 3357134 3400775 3444864 3488905
58238C488905M4296M5400M6709M7832M9467N1889N4189N5737N7077N8749O0524
$$ 3488905 3533201 3578601 3625310 3673142 3722609 3774498 3828687 3884424 3941501 4000250 4060774
58227D060774O2252O4218O6298O8062O9829P2311P5313P8169Q1088Q4596Q8107
$$ 4060774 4123026 4187244 4253542 4321604 4391433 4463744 4539057 4617226 4698314 4782910 4871017
58216D871017R0863R3657R7545J01589J04265J06365J09877J14617J18841J22701
$$ 4871017 4961880 5055537 5153082 5254671 5358936 5465301 5575178 5689795 5808636 5931337
58206E931337J27911J34290J40034J45281J51880J59595J66128J71373J77930
$$ 5931337 6059248 6193538 6333572 6478853 6630733 6790328 6956456 7127829 7305759
58197G305759J86795J95959K04004K11713K19462K26501K33527K42594K53698
$$ 7305759 7492554 7688513 7892517 8104230 8323692 8550193 8783720 9026314 9280012
58188I280012K64772K75569K88066L02523L17030L31546L48414L68122L88489
$$ 9280012 9544784 9820353 10108419 10410942 10727972 11059518 11407932 11776054 12164543
58179A2164543M08808M30646M53911M76570M99167N25176N56004N90055O27115
$$ 12164543 12573351 13003997 13457908 13934478 14433645 14958821 15514825 16104880 16731995
58170A6731995O68504P12192P53547P92227Q32840Q77815R25717R77618J038153
$$ 16731995 17400499 18112691 18866238 19658465 20491305 21369120 22294837 23272455 24310608
58161B4310608J108403J184888J267785J362620J471094J587829J709397J838754
$$ 24310608 25419011 26603899 27871684 29234304 30705398 32293227 34002624 35841378
58153C5841378J977330K121355K270811K434144K619001K825997L056872L321330
$$ 35841378 37818708 39940063 42210874 44645018 47264019 50090016 53146888 56468218
58145E6468218L630308L988668M397881M858973N372933N951180O629069P454483
$$ 56468218 60098526 64087194 68485075 73344048 78716981 84668161 91297230 98751713
58137I8751713Q456258R634531J0980767J2484314J4113737J5820515J7577991
$$ 98751713 107207971 116842502 127823269 140307583 154421320 170241835 187819826
58130A87819826J9394757K1274809K3176035K4965974K6283204K6356712K4104327
$$ 187819826 207214583 228489392 251665427 276631401 302914605 329271317 353375644
58123C53375644J8724628J0427846O03391q833541j6381223k1438274k4155172
$$ 353375644 372100272 382528118 383131509 374297968 357916745 336478471 312323299
58116C12323299k5030248k4622023k3423907k1805535k0000857j8152603j6362435
$$ 312323299 287293051 262671028 239247121 217441586 197440729 179288126 162925691
58109A62925691j4699433j3192476j1844393j0651611r602707q672041p831536
$$ 162925691 148226258 135033782 123189389 112537778 102935071 94263030 86431494
58102H6431494p065860o369719n738259n168174m661097m216901l827215l480884
$$ 86431494 79365634 72995915 67257656 62089482 57428385 53211484 49384269 45903385
58094D5903385l171326k894243k643929k417014k215236k039591j885538j747580
$$ 45903385 42732059 39837816 37193887 34776873 32561637 30522046 28636508 26888928
58086B6888928j624022j513366j410560j311262j216486j129090j048575r72621
$$ 26888928 25264906 23751540 22340980 21029718 19813232 18684142 17635567 16662946
58078A6662946r00951q34495p73160p16828o66321o21472n80692n43844n12673
$$ 16662946 15761995 14927500 14154340 13437512 12771191 12149719 11569027 11025183 10512510
58069A0512510m87097m64156m41996m21542m02811l83205l61326l39215l18924
$$ 10512510 10025413 9561257 9119261 8697719 8294908 7911703 7550377 7211162 6892238
58060F892238k99962k81777k65517k51362k37309k22569k09304j99056j90237
$$ 6892238 6592276 6310499 6044982 5793620 5556311 5333742 5124438 4925382 4735145
58051D735145j81022j71869j63328j54160j43750j33817j25781j18759j11913
$$ 4735145 4554123 4382254 4218926 4064766 3921016 3787199 3661418 3542659 3430746
58042C430746j06254j02221r8051r2503q6999q3067p9751p5318o9693o3700n7860
$$ 3430746 3324492 3222271 3124220 3031717 2944718 2861651 2781900 2706582 2636889 2573189 2515329
58031B515329n3223n1167n0958m9771m6351m2412l9314l6186l2716l0730l1102
$$ 2515329 2462106 2410939 2359981 2310210 2263859 2221447 2182133 2145947 2113231 2082501 2051399
58020B051399l1810l1049k9701k8853k7694k5970k5520k6890k7232k4532k1350
$$ 2051399 2019589 1988540 1958839 1929986 1902292 1876322 1850802 1823912 1796680 1772148 1750798
58009A750798k1148k3130k4080k3527k3397k3978k3795k2818k2413k2482k1549
$$ 1750798 1729650 1706520 1682440 1658913 1635516 1611538 1587743 1564925 1542512 1520030 1498481
57998A498481j9599j8234j8035j8016j7556j6970j6317j5491j5206j6165j7557
$$ 1498481 1478882 1460648 1442613 1424597 1407041 1390071 1373754 1358263 1343057 1326892 1309335
57987A309335j7948j7230j6192j4866j2965j1276j0822j1069j0670r619r010r117
$$ 1309335 1291387 1274157 1257965 1243099 1230134 1218858 1208036 1196967 1186297 1176678 1167668 1158551
57975A158551r278r321r532r533q711p486o853p074p793q853r744r255p157n370
$$ 1158551 1149273 1139952 1130420 1120887 1112176 1104690 1097837 1090763 1082970 1074117 1064373 1055118 1047961 1042591
57961A042591n798p651q653q101o946n616l891k547k875m597o092o612o469n367
$$ 1042591 1036793 1029142 1020489 1012388 1005442 999826 995935 993388 990513 985916 979824 973212 966743 961376
57947I61376k713K98J235l42k076j883k91J028J526J695J893K228K745L144L020
$$ 961376 958663 958961 960196 959854 957778 955895 955604 956632 958158 959853 961746 963974 966719 969863 972883
57932I72883K761L267M305M176J754j814m222m401l285k365k095j735o89K97l01
$$ 972883 975644 978911 983216 987392 989146 987332 983110 978709 975424 973059 970964 969229 968540 968837 968536
57917I68536k796n518o533n709m226k694r20P33J190K91n79j76R88J454Q03Nj53
$$ 968536 965740 960222 953689 947980 943754 941060 940140 940873 942063 942354 941775 941599 942587 944041 944844 944849 944696
57900I44696j44o55r66N04L758O344N945L261J079Q40J584K155K584K884K433
$$ 944696 944552 943897 942931 943435 947193 953537 959482 962743 963822 964662 966246 968401 970985 973869 976302
57885I76302J583K092M624P217P790O929O626P333Q140Q869J0012J1098J1152
$$ 976302 977885 979977 984601 991818 999608 1006537 1013163 1020496 1028636 1037505 1047517 1058615 1069767
57872A069767J0472J0160J0090R171P407N731L885O32l604o446o737o078o298
$$ 1069767 1080239 1090399 1100489 1109660 1117067 1122798 1126683 1127315 1123711 1117265 1110528 1104450 1098152
57859A098152p062p257p219q011r326r735q702p109n787m609l257k123j912k546
$$ 1098152 1091090 1083833 1076614 1068603 1059277 1049542 1040840 1033731 1027944 1023335 1020078 1017955 1016043 1013497
57845A013497k962k199n14R83J686J911J919J550J190J987M066N509M523K102
$$ 1013497 1010535 1008336 1007822 1008805 1010491 1012402 1014321 1015871 1017061 1019048 1023114 1028623 1033146 1035248
57831A035248R58K166M338N853O262N465L531J664J504K709K924J039j153j677
$$ 1035248 1036206 1038372 1042710 1048563 1054825 1060290 1063821 1065485 1066989 1069698 1072622 1073661 1072508 1070831
57817A070831j143j253j953k078j916k850m615n106l407j180k14j82mk02j940
$$ 1070831 1069688 1068435 1066482 1064404 1062488 1059638 1055023 1049917 1046510 1045330 1045116 1044934 1044930 1044728 1042788
57802A042788m290m452j302K839N079N444O072P690Q882Q812Q583Q948Q517N949
$$ 1042788 1038498 1034046 1032744 1035583 1040662 1046106 1052178 1059868 1068750 1077562 1086145 1095093 1103610 1109559
57788A109559K644J251K015K614J659L24L5L19m5j044j714j544o89N13J429J247
$$ 1109559 1112203 1113454 1115469 1118083 1119742 1120066 1120101 1120420 1120375 1119331 1117617 1116073 1115384 1115897 1117326 1118573
57772A118573J76j56J444L970N393N321N295O414P849Q111O942N352M319M043
$$ 1118573 1118749 1118593 1120037 1124007 1129400 1134721 1140016 1146430 1154279 1162390 1169332 1174684 1179003 1183046
57758A183046M218M447M381L887L176K723K896L603M263M208L271J995J057M79
$$ 1183046 1187264 1191711 1196092 1199979 1203155 1205878 1208774 1212377 1216640 1220848 1224119 1226114 1227171 1227650
57744A227650k97j419k047j306L95J683J970K100K724K971J788O3r3J779L778
$$ 1227650 1227353 1225934 1223887 1222581 1222976 1224659 1226629 1228729 1231453 1234424 1236212 1236275 1236182 1237961 1241739
57729A241739M253L785L752M241M623N124O322P606P814P153O957P547P903P697
$$ 1241739 1245992 1249777 1253529 1257770 1262393 1267517 1273839 1281445 1289259 1296412 1303369 1310916 1318819 1326516
57715A326516P907Q836R126P764N849N007N045M587L448K799L075L300K746J928
$$ 1326516 1334423 1343259 1352385 1360149 1365998 1371005 1376050 1380637 1384085 1386884 1389959 1393259 1396005 1397933
57701A397933J339L78j470l208l343k098j255j615j780j87K613M773N644O131
$$ 1397933 1399272 1399650 1398180 1394972 1391629 1389531 1388276 1386661 1384881 1384694 1387307 1392080 1397724 1403855
57687A403855O732O777O018N599O381P326O747M736L046K784L428M123M783N497
$$ 1403855 1410587 1417364 1423382 1428981 1435362 1442688 1449435 1454171 1457217 1460001 1463429 1467552 1472335 1477832
57673A477832N915N843N741O027O250N590M031K602K424L712N642P093P627P750
$$ 1477832 1483747 1489590 1495331 1501358 1507608 1513198 1517229 1519831 1522255 1525967 1531609 1538702 1546329 1554079
57659A554079Q147Q772Q942Q305P410P215Q060R220R440Q209O516O009P191Q882
$$ 1554079 1562226 1570998 1579940 1588245 1595655 1602870 1610930 1620150 1629590 1637799 1644315 1650324 1657515 1666397
57645A666397R681R460R042R043R635J0854J2206J2486J1080R161Q460Q980R196
$$ 1666397 1676078 1685538 1694580 1703623 1713258 1724112 1736318 1748804 1759884 1769045 1777505 1786485 1795681
57632A795681Q571Q268R007R631Q825P225O615P661R468J1051J2292J3540J5110
$$ 1795681 1804252 1812520 1821527 1831158 1839983 1847208 1853823 1861484 1870952 1882003 1894295 1907835 1922945
57619A922945J7248K0027K3165K6239K9063L1727L4571L8283M3546N0004N6076
$$ 1922945 1940193 1960220 1983385 2009624 2038687 2070414 2104985 2143268 2186814 2236818 2292894
57608B292894O0305O2351O1794N6456M3538K3218J41j9574l2582l9189m1003l9178
$$ 2292894 2353199 2415550 2477344 2533800 2577338 2600556 2600697 2581123 2548541 2509352 2468349 2429171
57596B429171l4924l0144k6383k3627k0886j7698j4470j1686r532p971o444l850
$$ 2429171 2394247 2364103 2337720 2314093 2293207 2275509 2261039 2249353 2239821 2231850 2225406 2221556
57584B221556P2L603M618L426K580L502M940N512N983P543R368R817R200R258
$$ 2221556 2221628 2225231 2229849 2233275 2235855 2239357 2244297 2249809 2255792 2263335 2272703 2282520 2291720 2300978
57570B300978J0279J0766R985Q903Q339P902P359P435Q568J0024J0937J1226J0957
$$ 2300978 2311257 2322023 2332008 2340911 2349250 2357152 2364511 2371946 2380514 2390538 2401475 2412701 2423658
57557B423658J0003Q863Q651R578J0517J0780J1186J2434J3539J3078J1376J0124
$$ 2423658 2433661 2442524 2451175 2460753 2471270 2482050 2493236 2505670 2519209 2532287 2543663 2553787
57545B553787J0248J1188J2134J2942J3706J4134J3810J2902J2399J3251J4990
$$ 2553787 2564035 2575223 2587357 2600299 2614005 2628139 2641949 2654851 2667250 2680501 2695491
57534B695491J5733J4311J1986J0946J1391J1595J0889J0736J2186J4117J5110
$$ 2695491 2711224 2725535 2737521 2748467 2759858 2771453 2782342 2793078 2805264 2819381 2834491
57523B834491J5459J5883J5728J4228J2524J2440J3772J4742J4805J5117J6141
$$ 2834491 2849950 2865833 2881561 2895789 2908313 2920753 2934525 2949267 2964072 2979189 2995330
57512B995330J6651J5694J4141J3584J4541J6149J7014J6288J4480J3289J3889
$$ 2995330 3011981 3027675 3041816 3055400 3069941 3086090 3103104 3119392 3133872 3147161 3161050
57501C161050J5513J6444J6093J5135J4022J2791J2243J3573J6390J8530J8548
$$ 3161050 3176563 3193007 3209100 3224235 3238257 3251048 3263291 3276864 3293254 3311784 3330332
57490C330332J7244J6112J5463J4911J4577J4731J4992J4976J5220J6420J8075
$$ 3330332 3347576 3363688 3379151 3394062 3408639 3423370 3438362 3453338 3468558 3484978 3503053
57479C503053J8963J8739J8248J8258J8643J8816J8437J7653J7105J7481J8595
$$ 3503053 3522016 3540755 3559003 3577261 3595904 3614720 3633157 3650810 3667915 3685396 3703991
57468C703991J9158J8157J6372J5737J7098J9307K0641K0560J9665J8654J7854
$$ 3703991 3723149 3741306 3757678 3773415 3790513 3809820 3830461 3851021 3870686 3889340 3907194
57457C907194J7480J7660J8191J8647J8803J8785J8864J9321K0394K1950K3278
$$ 3907194 3924674 3942334 3960525 3979172 3997975 4016760 4035624 4054945 4075339 4097289 4120567
57446D120567K3588K2959K2384K2550K2868K2159K0303J8621J8357J9198J9690
$$ 4120567 4144155 4167114 4189498 4212048 4234916 4257075 4277378 4295999 4314356 4333554 4353244
57435D353244J9040J8025J8063J9690K2113K4012K4525K3714K2469K1950K2705
$$ 4353244 4372284 4390309 4408372 4428062 4450175 4474187 4498712 4522426 4544895 4566845 4589550
57424D589550K4154K5181K5294K4961K4764K4730K4768K5140K5905K6314K5607
$$ 4589550 4613704 4638885 4664179 4689140 4713904 4738634 4763402 4788542 4814447 4840761 4866368
57413D866368K4202K3120K2383K1168J9698J9549K1390K3594K4284K3786K3768
$$ 4866368 4890570 4913690 4936073 4957241 4976939 4996488 5017878 5041472 5065756 5089542 5113310
57402E113310K4651K5317K5082K4457K3945K3443K2944K2671K2349K1491K0544
$$ 5113310 5137961 5163278 5188360 5212817 5236762 5260205 5283149 5305820 5328169 5349660 5370204
57391E370204K0524K1364K1938K1993K2524K3690K4023K2720K1230K1250K2323
$$ 5370204 5390728 5412092 5434030 5456023 5478547 5502237 5526260 5548980 5570210 5591460 5613783
57380E613783K2961K3211K4277K6117K7234K6881K5897K5114K4311K3195K2285
$$ 5613783 5636744 5659955 5684232 5710349 5737583 5764464 5790361 5815475 5839786 5862981 5885266
57369E885266K2103K2338K2417K2483K3200K4824K6697K7659K6927K4868K2857
$$ 5885266 5907369 5929707 5952124 5974607 5997807 6022631 6049328 6076987 6103914 6128782 6151639
57358F151639K2104K2640K3669K4536K4991K4842K4025K2988K2423K2638K3618
$$ 6151639 6173743 6196383 6220052 6244588 6269579 6294421 6318446 6341434 6363857 6386495 6410113
57347F410113K5328K7330K8346K7290K4844K3017K2826K3351K3495K3677K4832
$$ 6410113 6435441 6462771 6491117 6518407 6543251 6566268 6589094 6612445 6635940 6659617 6684449
57336F684449K6593K7692K7830K7897K8238K8048K7036K6453K7367K8740K8610
$$ 6684449 6711042 6738734 6766564 6794461 6822699 6850747 6877783 6904236 6931603 6960343 6988953
57325F988953K6943K5773K6343K7580K8029K7826K7707K7301K6003K4800K5291
$$ 6988953 7015896 7041669 7068012 7095592 7123621 7151447 7179154 7206455 7232458 7257258 7282549
57314G282549K7130K8131K7141K5282K4036K3567K3483K3819K4545K5140K5432
$$ 7282549 7309679 7337810 7364951 7390233 7414269 7437836 7461319 7485138 7509683 7534823 7560255
57303G560255K5867K6315K5748K3831K1936K1665K3086K5006K6173K5834K4082
$$ 7560255 7586122 7612437 7638185 7662016 7683952 7705617 7728703 7753709 7779882 7805716 7829798
57292G829798K2326K2183K3377K3996K3331K2717K2775K2057K0008J8969K0790
$$ 7829798 7852124 7874307 7897684 7921680 7945011 7967728 7990503 8012560 8032568 8051537 8072327
57281H072327K3251K2812J9858J8005J8649J9570J9087J8436J9048K0119K0215
$$ 8072327 8095578 8118390 8138248 8156253 8174902 8194472 8213559 8231995 8251043 8271162 8291377
57270H291377J9312J8095J6861J6066J6459J7754J8638J8827J9470K0721K0789
$$ 8291377 8310689 8328784 8345645 8361711 8378170 8395924 8414562 8433389 8452859 8473580 8494369
57259H494369J8683J6153J5356J5973J6261J5900J5940J6585J6841J6075J4681
$$ 8494369 8513052 8529205 8544561 8560534 8576795 8592695 8608635 8625220 8642061 8658136 8672817
57248H672817J3313J2541J2929J4340J5437J4929J3226J1929J1755J1859J1212
$$ 8672817 8686130 8698671 8711600 8725940 8741377 8756306 8769532 8781461 8793216 8805075 8816287
57237H816287R895Q818Q629R103R488R463R707J1089J3316J5047J5547J5462J5737
$$ 8816287 8826182 8835000 8843629 8852732 8862220 8871683 8881390 8892479 8905795 8920842 8936389 8951851 8967588
57224H967588J6614J8061K0243K2862K4826K5333K4687K3508K1929K0210J9084
$$ 8967588 8984202 9002263 9022506 9045368 9070194 9095527 9120214 9143722 9165651 9185861 9204945
57213I204945J8593J7464J4807J1658R519Q063N774K516k15j555k243k964l160
$$ 9204945 9223538 9241002 9255809 9267467 9276986 9285049 9290823 9293339 9293124 9291569 9289326 9286362 9283202
57200I283202k153m26J025K040L376N728R042J2648J5855J8539K1055K3380K4704
$$ 9283202 9281049 9280623 9281648 9283688 9287064 9292792 9301834 9314482 9330337 9348876 9369931 9393311 9418015
57187I418015K4405K3265K2872K3773K4850K4757K3397K1755K0695K0179J9390
$$ 9418015 9442420 9465685 9488557 9512330 9537180 9561937 9585334 9607089 9627784 9647963 9667353
57176I667353J7437J4178J0284O360K338j813n164o637o736p461j0020j3409j5788
$$ 9667353 9684790 9698968 9709252 9715612 9717950 9716137 9710973 9704336 9697600 9690139 9680119 9666710 9650922
57163I650922j6568j6497j6218j5807j5445j5533j5961j6014j5431j4841j4772
$$ 9650922 9634354 9617857 9601639 9585832 9570387 9554854 9538893 9522879 9507448 9492607 9477835
57152I477835j4852j4566j4302j4699j5248j4574j2310r670p928p199p258q414
$$ 9477835 9462983 9448417 9434115 9419416 9404168 9389594 9377284 9367614 9359686 9352487 9345229 9336815
57140I336815j0557j2211j1954j0534j0155j1609j3414j4104j3969j4045j4567
$$ 9336815 9326258 9314047 9302093 9291559 9281404 9269795 9256381 9242277 9228308 9214263 9199696
57129I199696j5295j6390j7848j8713j8039j6427j5616j6516j8364j9789k0103
$$ 9199696 9184401 9168011 9150163 9131450 9113411 9096984 9081368 9064852 9046488 9026699 9006596
57118I006596j9549j8951j9273k1012k3727k6456k8740l1127l4521l9249m4820
$$ 9006596 8987047 8968096 8948823 8927811 8904084 8877628 8848888 8817761 8783240 8743991 8699171
57107H699171n0591n6517o3005o9976p6392q1157q4367q7046q9771r2208r4069
$$ 8699171 8648580 8592063 8529058 8459082 8382690 8301533 8217166 8130120 8040349 7948141 7854072
57096G854072r5498r6075r4252q8765q0223p0602o1551n4012m8969m7348m8941
$$ 7854072 7758574 7662499 7568247 7479482 7399259 7328657 7267106 7213094 7164125 7116777 7067836
57085G067836n2391n6702o1999o8409p5060q0865q5789r0425r4695r8130j01432
$$ 7067836 7015445 6958743 6896744 6828335 6753275 6672410 6586621 6496196 6401501 6303371 6201939
57074F201939j06483j14225j23502j32728j41763j51123j60219j68080j75429
$$ 6201939 6095456 5981231 5857729 5725001 5583238 5432115 5271896 5103816 4928387
57065D928387j84237j95182k07220k19975k34457k50635k66377k80298k94010
$$ 4928387 4744150 4548968 4341748 4121773 3887316 3636681 3370304 3090006 2795996
57056B795996l09915l28158l47591l68507l92228m18949A82472b98167n17591
$$ 2795996 2486081 2157923 1810332 1441825 1049597 630648 182472 -298167 -815758
57047h15758n58608o02554o50318p04394p65961q34805r12166j001295j104714
$$ -815758 -1374366 -1976920 -2627238 -3331632 -4097593 -4932398 -5844564 -6845859 -7950573
57038g950573j222904j355912j504540j670103j854998k063631k301575k574859
$$ -7950573 -9173477 -10529389 -12033929 -13704032 -15559030 -17622661 -19924236 -22499095
57030b2499095k890597l253443l655633m072547m473658m835739n139700n361689
$$ -22499095 -25389692 -28643135 -32298768 -36371315 -40844973 -45680712 -50820412 -56182101
57022e6182101n483734n512085n458212n280268m856483m049280k814784j251440
$$ -56182101 -61665835 -67177920 -72636132 -77916400 -82772883 -86822163 -89636947 -90888387
57014i0888387M52619K109933L584467M792911N692051O271582O546933O549838
$$ -90888387 -90435768 -88325835 -84741368 -79948457 -74256406 -67984824 -61437891 -54888053
57006e4888053O322751N917029N389481M797858M198088L639827L157660K764833
$$ -54888053 -48565302 -42648273 -37258792 -32460934 -28262846 -24623019 -21465359 -18700526
56998a8700526K456516K217986K029687J870627J724432J584056J448806J317983
$$ -18700526 -16244010 -14026024 -11996337 -10125710 -8401278 -6817222 -5368416 -4050433
56990d050433J189856J064964h49552a4993G14982O32915N45460M68083L98547
$$ -4050433 -2860577 -1795613 -849552 -14993 714982 1347897 1893357 2361440 2759987
56981B759987L34680K76230K23427J75708J32728R5183O3697L7856J6805Nj2921
$$ 2759987 3094667 3370897 3594324 3770032 3902760 3997943 4061640 4099496 4116301 4116306 4103385
56970D103385k2405k8973l3703l8403m4508n2024o0295o9172p8488q7214r4571
$$ 4103385 4080980 4052007 4018304 3979901 3935393 3883369 3823074 3753902 3675414 3588200 3493629
56959C493629j01372j08558j14864j17936j17653j16403j15700j14516j11633
$$ 3493629 3392257 3283699 3168835 3050899 2933246 2816843 2701143 2586627 2474994
56950B474994j07823j04566j02078r9794r7734r6142r4485r2049q9067q6187q3234
$$ 2474994 2367171 2262605 2160527 2060733 1962999 1866857 1772372 1680323 1591256 1505069 1421835
56939A421835p9497p5059p0697o6425o1154n4266m6799m0473l5910l2398k9054
$$ 1421835 1342338 1267279 1196582 1130157 1069003 1014737 967938 927465 891555 859157 830103
56928H30103k5483k1375j6471j1352p462n486m405l048k167l519o971j0073j0954
$$ 830103 804620 783245 766774 755422 747960 742474 738069 735021 732854 729335 722364 712291 701337
56915G01337j0385j0162j0600j0621r471p358m961l155k569k651j810N89L187
$$ 701337 690952 680790 670190 659569 650098 642740 637779 634624 632055 629404 627594 628183 631370
56902F31370M461M828N644O947P714P828Q040Q081O609L285o72m375q306j2854
$$ 631370 635831 640659 646303 653250 660964 668792 676832 684913 691522 694807 694135 689760 681454 668600
56888F68600j7097j9758k0422j9234j6391j2665r516p796o916n827m220k168N38
$$ 668600 651503 631745 611323 592089 575698 563033 553517 545721 538805 532978 528758 526590 527128
56875E27128L848O812Q551R537J0961J2907J4047J3211J0578P070L149j280o043
$$ 527128 530976 537788 546339 555876 566837 579744 593791 607002 617580 624650 627799 626519 620476
56862F20476j0295j3139j4536j5256j5857j6009j5198j3740j2473j1568j0408
$$ 620476 610181 597042 582506 567250 551393 535384 520186 506446 493973 482405 471997
56851D71997q840p726p772q455q701q184p281o174m724l056j530j32J398K944
$$ 471997 463157 455431 447659 439204 430503 422319 415038 408864 404140 401084 399554 399422 400820 403764
56837D03764M131N099O379P956R246J0208J1623J3790J5843J7026J7844J9021
$$ 403764 407895 412994 419373 427329 436575 446783 458406 472196 488039 505065 522909 541930
56825E41930J9963J9475J7581J5336J2883R234M318j82k811m059n124n895n346
$$ 541930 561893 581368 598949 614285 627168 636402 640720 640538 637727 633668 628544 622649 617303
56812F17303l357r39J118K862M585O445Q591J0924J3020J4918J7597K1676K5992
$$ 617303 613946 613007 614125 616987 621572 628017 636608 647532 660552 675470 693067 714743 740735
56799G40735K8554K8675K7058K4025J9034J2105M344l208j0064j5387j7931j7542
$$ 740735 769289 797964 825022 849047 868081 880186 884530 881322 871258 855871 837940 820398
56787H20398j5551j3107j0095o194j792K772P697J2746J6948K0201K4020K9571
$$ 820398 804847 791740 781645 775451 773659 776431 784128 796874 813822 834023 858043 887614
56775H87614L5914M1278M4992M6897M5709L9733K8943J5164M91j3266k4285l1417
$$ 887614 923528 964806 1009798 1056695 1102404 1142137 1171080 1186244 1186735 1173469 1149184 1117767
56763A117767l5277l7374l8169l7016l3751k9069k3392j6796j0212n316k567l78
$$ 1117767 1082490 1045116 1006947 969931 936180 907111 883719 866923 856711 851395 848828 848450
56751H48450L196Q532J4522J9810K3434K4806K3626J9754J3128M124o108j6051
$$ 848450 851646 860178 874700 894510 917944 942750 966376 986130 999258 1003382 997274 981223
56739I81223k4548l0872l4421l4999l3284l0439k7329k4385k1771j9077j5483
$$ 981223 956675 925803 891382 856383 823099 792660 765331 740946 719175 700098 684615
56728F84615j1081p492n885m821j565M330J0171J3156J2953J0779P288K389l588
$$ 684615 673534 666042 660157 655336 653771 658101 668272 681428 694381 705160 712448 714837 711249
56715G11249r661j4873j8730k1176k2496k3033k2911k2284k1645k1170j9916j6843
$$ 711249 701588 686715 667985 646809 624313 601280 578369 556085 534440 513270 493354 476511
56703D76511j2854j0466j0810j1985j1478r337p752p917q728q664p646o477n360
$$ 476511 463657 453191 442381 430396 418918 409581 401829 393912 385184 376520 368874 362397 357037
56690C57037l850k013p79r48k247l618m195l790k804j984k079l110m010l574j855
$$ 357037 353187 351174 350395 349447 347200 343582 339387 335597 332793 330809 328730 325620 321610 318036 316181
56675C16181o4R80J530J864J475K3j742k807l149l315l269k529j186Q3Q48J115
$$ 316181 316117 317097 318627 320491 321966 321989 320247 317440 314291 310976 307707 305178 303992 304075 304923 306038
56659C06038J016R25J344J865J002j808m654n057l021q11M8r2n85j367j922j276
$$ 306038 307054 307979 309323 311188 312190 310382 305728 300671 297650 296839 296887 296795 296210 294843 292921 291645
56643B91645L12J192N91l41m94l75p43r95k33J000J300K29j411k621k784j812
$$ 291645 291957 293149 293740 293399 292905 292530 291787 290792 290559 291559 292859 293088 291677 289056 286272 284460
56627B84460m69L5n27r93m31O46J389J938K629K856K097J420K295M198M979L724
$$ 284460 283991 284026 283499 282506 282075 282721 284110 286048 288677 291533 293630 295050 297345 301543 306522 310246
56611C10246J843R41Q58M74m95j329j460j073o58l96J0R62K409L643L864L033
$$ 310246 312089 313030 313888 314362 313867 312538 311078 310005 309347 308951 308961 309923 312332 315975 319839 322872
56595C22872K005J752K513L709M555M710M322L628K756K021J902K348K439J475
$$ 322872 324877 326629 329142 332851 337406 342116 346438 350066 352822 354843 356745 359093 361532 363007
56581C63007J71n3R81J877J595P78O32J233J669J373O00k10q53j334j736k086
$$ 363007 363178 363125 364106 365983 367578 368356 368988 370221 371890 373263 373863 373653 372800 371466 369730 367644
56565C67644k080j444p24j119k944m764m819l087j255q32j877l452m575m721m034
$$ 367644 365564 364120 363396 362277 359333 354569 349750 346663 345408 344576 342699 339247 334672 329951 325917
56550C25917l364l555m391m588l253j163j11q88k354k746j639j30P27R66J131
$$ 325917 322553 318998 314607 310019 306766 305603 305492 304604 302250 299504 297865 297735 298462 299428 300559
56535C00559J478K085K986L659L089J171o63j081n46k77k11O25K017K542J650
$$ 300559 302037 304122 307108 310767 313856 315027 314364 313283 312737 312460 312249 312874 314891 317433 319083
56520C19083K56q50j668j830n22J816L299K997K120K058K685L510M978P177Q592
$$ 319083 319339 318489 316821 314991 314469 316285 319584 322581 324701 326759 329444 332954 337932 345109 353701
56505C53701P854N970N304O703Q918J0459J0777J0018Q699P473O276M188R98j640
$$ 353701 361555 367525 372829 379532 388450 398909 409686 419704 428403 435876 442152 446340 447338 445698
56491D45698j801K48K242K433J002o61j287n50O11Q09j43j052j374k267m474o324
$$ 445698 443897 444145 446387 448820 449822 449161 447874 447324 447935 448744 448601 447549 446175 443908 439434 433110
56475D33110n730l421k143k822l613l027j917j602j734j207j59J72r16k897m693
$$ 433110 427380 423959 421816 418994 415381 412354 410437 408835 407101 405894 405735 405907 404991 402094 397401
56460C97401n517n230m263l141k221j913k652m086m782l703j756q81j585k421
$$ 397401 391884 386654 382391 379250 377029 375116 372464 368378 363596 359893 358137 357256 355671 353250
56446C53250j998n91M76L26q12j816j549r1J059P43k13j99O45N64r76k264j772
$$ 353250 351252 350661 351137 351463 350651 348835 347286 347195 348254 348997 348784 348585 349230 349794 348818 346554 344782
56429C44782k33O53N48K95K18r0o22q06m59q6k0J1L61R77J703K608L700M513M348
$$ 344782 344549 345202 345750 346045 346263 346173 345551 344745 344286 344200 344180 344191 344552 345529 347232 349840 353540 358053 362401
56410C62401L060J383L13K07O68J174J520J608J297O79J79N2Nk99o74o17qP35
$$ 362401 365461 366844 367157 367364 368032 369206 370726 372334 373631 374310 374489 374541 374546 374247 373573 372956 372948 373683
56392C73683J060O54k89j064j028l18K85M27M83P46R10P14M58M13M12M15P12J101
$$ 373683 374743 375397 375108 374044 373016 372698 372983 373410 373893 374639 375549 376263 376721 377134 377546 377961 378673 379774
56374C79774O80p49j993j922q99J21R67J704J634L23j014p27R45K150J879P89
$$ 379774 380454 379705 377712 375790 374891 375012 375979 377683 379317 379640 378626 377899 378844 380994 382873 383662
56358C83662j84o28j53J466L303L698K061m68k263k505j435j28K77n7L90K236
$$ 383662 383478 382850 382697 384163 387466 391164 393225 392757 390494 387989 386554 386426 386703 386646 387036 389272
56342C89272L684K832P00JJ194K158J829J700K949M417M709M472N031O049O158
$$ 389272 392956 395788 396488 396489 397683 399841 401670 403370 406319 410736 415445 419917 424948 430997 437155
56327D37155N000L360J895Q92P10J380K188K532K872M056N951P426P483O015L709
$$ 437155 442155 445515 447410 448302 449012 450392 452580 455112 457984 462040 467991 475417 482900 488915 492624
56312D92624J593L92K2o5r5L1O2n47j732k716k977k758k478k282k237k364k343
$$ 492624 494217 494609 494631 494566 494471 494502 494564 494017 492285 489569 486592 483834 481356 479074 476837 474473 472130
56295D72130j840j030k46O48J813K691K723K395K459K492J606L25J13J128K071
$$ 472130 470290 469260 469014 469662 471475 474166 476889 479284 481743 484235 485841 486166 486279 487407 489478
56280D89478K352K660L236L383L064L103L373K619P93l93J6R00J158J290J949
$$ 489478 491830 494490 497726 501109 504173 507276 510649 513268 514061 513668 513684 514584 515742 517032 518981
56265E18981K665L091L764M628M526L360K753L265L041R37j073q07O15P77k5L78
$$ 518981 521646 524737 528501 533129 537655 541015 543768 547033 550074 551011 549938 549131 549746 550523 550498 550876
56249E50876K155L370L402L601M470M643L310J605R38J431K479L513L867L208
$$ 550876 553031 556401 559803 563404 567874 572517 575827 577432 578370 579801 582280 585793 589660 592868
56235E92868K363K536L436L424J898L31M18K059L827M754N048N272N308M428K536
$$ 592868 595231 597767 601203 604627 606525 606856 607274 609333 613160 617914 622962 628234 633542 637970 640506
56220F40506R75J263L080M579N007N568P041Q146P637O627P029Q617R572R428
$$ 640506 641481 642744 645824 650403 655410 660978 668019 676165 683802 690429 697458 706075 715647 725075
56206G25075R415J0087J0526J0187R929J0760J2687J5044J6968J7495J6303J4561
$$ 725075 734490 744577 755103 765290 775219 785979 798666 813710 830678 848173 864476 879037
56194H79037J4191J6133J9818K4047K7598K9537L0077L0741L2551L4472L4980
$$ 879037 893228 909361 929179 953226 980824 1010361 1040438 1071179 1103730 1138202 1173182
56183A173182L4649L5487L7832L9644L9129L6490L2818K8840K5195K2393J9694
$$ 1173182 1207831 1243318 1281150 1320794 1359923 1396413 1429231 1458071 1483266 1505659 1525353
56172A525353J5344Q908K405j897m202o733j0943j5950j9698k1185k1330k1812
$$ 1525353 1540697 1549605 1552010 1550113 1545911 1539178 1528235 1512285 1492587 1471402 1450072 1428260
56160A428260k3187k4492k4621k3507k1725j9778j8359j8423j9921k1076k0143
$$ 1428260 1405073 1380581 1355960 1332453 1310728 1290950 1272591 1254168 1234247 1213171 1193028
56149A193028j7608j5491j4701j4336j3448j2222j1110r993q582o936n323m098
$$ 1193028 1175420 1159929 1145228 1130892 1117444 1105222 1094112 1084119 1075537 1068601 1063278 1059180
56137A059180l706m103m333l416j619j17N41Q76J567K842M627O399P098O099M303
$$ 1059180 1055474 1051371 1047038 1043622 1042003 1041886 1042427 1043303 1044870 1047712 1052339 1058738 1065836 1071935 1076238
56122A076238L412M099N586O855P516P632P588Q066R346J0761J1444J1484J1593
$$ 1076238 1079650 1083749 1089335 1096190 1103706 1111338 1118926 1126992 1136338 1147099 1158543 1170027 1181620
56109A181620J2050J2753J3934J5809J7786J8997J9461J9859K0479K1279K2612
$$ 1181620 1193670 1206423 1220357 1236166 1253952 1272949 1292410 1312269 1332748 1354027 1376639
56098A376639K4815K7401K9696L1970L4953L8532M2036M5524M9714N4909O0956
$$ 1376639 1401454 1428855 1458551 1490521 1525474 1564006 1606042 1651566 1701280 1756189 1817145
56087A817145O7832P5392Q3185R1560J02028J14971J27747J36714J40486J39581
$$ 1817145 1884977 1960369 2043554 2135114 2237142 2352113 2479860 2616574 2757060 2896641
56077B896641J33943J23296J09495R5795Q3592P2359O2904N7661N6570N5232M9005
$$ 2896641 3030584 3153880 3263375 3359170 3442762 3515121 3578025 3635686 3692256 3747488 3796493
56066C796493L7582K4269J2109K088n956j2410j7864k3507l1489m4378o2883q3898
$$ 3796493 3834075 3858344 3870453 3872541 3866585 3854175 3836311 3812804 3781315 3736937 3674054 3590156
56054C590156j02099j14014j19668j20399j16746j09064r8707q7454p6484o6463
$$ 3590156 3488057 3374043 3254375 3133976 3017230 2908166 2809459 2722005 2645521 2579058
56044B579058n7777n0146m2767l5333k8346k2213j6691j1508o888l358j373p83
$$ 2579058 2521281 2471135 2428368 2393035 2364689 2342476 2325785 2314277 2307389 2304031 2302658 2301875
56032B301875k54K011O049R513J0558J0362J1192J2926J3654J3141J3218J4757
$$ 2301875 2301621 2303632 2309681 2319194 2329752 2340114 2351306 2364232 2377886 2391027 2404245 2419002
56020B419002J6615J7777J8495J9031J9333K0199K2604K5618K7119K7055K7794
$$ 2419002 2435617 2453394 2471889 2490920 2510253 2530452 2553056 2578674 2605793 2632848 2660642
56009B660642L0566L3649L4965L4570L3755L3401L4020L5965L8773M1613M4487
$$ 2660642 2691208 2724857 2759822 2794392 2828147 2861548 2895568 2931533 2970306 3011919 3056406
55998C056406M7687N0178N0568M9701N0132N2750N6049N8889O1568O3920O4948
$$ 3056406 3104093 3154271 3204839 3254540 3304672 3357422 3413471 3472360 3533928 3597848 3662796
55987C662796O4995O5750O7454O8475O8402O8913P0847P3021P4878P7605Q1523
$$ 3662796 3727791 3793541 3860995 3929470 3997872 4066785 4137632 4210653 4285531 4363136 4444659
55976D444659Q5040Q7444R0215R4284R8443J01770J05158J09147J12624J15089
$$ 4444659 4529699 4617143 4707358 4801642 4900085 5001855 5107013 5216160 5328784 5443873
55966E443873J17877J21976J26832J32301J39103J46365J51665J54922J59318
$$ 5443873 5561750 5683726 5810558 5942859 6081962 6228327 6379992 6534914 6694232
55957F694232J66837J75674J83581J90890J98758K07354K17321K29814K43465
$$ 6694232 6861069 7036743 7220324 7411214 7609972 7817326 8034647 8264461 8507926
55948H507926K54765K63453K73993K89388L07135L23982L41054L60891L82508
$$ 8507926 8762691 9026144 9300137 9589525 9896660 10220642 10561696 10922587 11305095
55939A1305095M03086M22456M42542M64248M87634N13519N42501N74041O08133
$$ 11305095 11708181 12130637 12573179 13037427 13525061 14038580 14581081 15155122 15763255
55930A5763255O45673O85681P24995P62484Q00691Q41938Q86289R34911R91339
$$ 15763255 16408928 17094609 17819604 18582088 19382779 20224717 21111006 22045917 23037256
55921B3037256J057328J131344J213044J304927J407586J518099J635142J760577
$$ 23037256 24094584 25225928 26438972 27743899 29151485 30669584 32304726 34065303
55913C4065303J893960K031797K175144K331801K508166K705611K927784L183601
$$ 34065303 35959263 37991060 40166204 42498005 45006171 47711782 50639566 53823167
55905E3823167L479508L817505M205471M660832N199885N833781O579555P462157
$$ 53823167 57302675 61120180 65325651 69986483 75186368 81020149 87599704 95061861
55897I5061861Q497693R686130J1025845J2519106J4155604J5911488J7776586
$$ 95061861 103559554 113245684 124271529 136790635 150946239 166857727 184634313
55890A84634313J9757487K1831778K3907613K5801252K7142122K7216516K5022248
$$ 184634313 204391800 226223578 250131191 275932443 303074565 330291081 355313329
55883C55313329J9771484J1582960J718946p954713j5867284k1294239k4298459
$$ 355313329 375084813 386667773 388386719 380432006 364564722 343270483 318972024
55876C18972024k5357933k5051056k3896949k2284444k0460965j8578006j6742494
$$ 318972024 293614091 268563035 244666086 222381642 201920677 183342671 166600177
55869A66600177j5028104j3468743j2071572j0836432r755221q804626p955666
$$ 166600177 151572073 138103330 126031758 115195326 105440105 96635479 88679813
55862H8679813p188625o492814n859858n286082m775096m328431l936913l587189
$$ 88679813 81491188 74998374 69138516 63852434 59077338 54748907 50811994 47224805
55854D7224805l272108k988977k733011k499583k289244k104126j941815j797354
$$ 47224805 43952697 40963720 38230709 35731126 33441882 31337756 29395941 27598587
55846B7598587j668171j552510j446125j345169j249922j161885j079704j001408
$$ 27598587 25930416 24377906 22931781 21586612 20336690 19174805 18095101 17093693
55838A7093693r27827q60443p98423p40866o89188o44230o03774n66015n32657
$$ 17093693 16165866 15305423 14507000 13766134 13076946 12432716 11828942 11262927 10730270
55829A0730270n05333m81660m58123m34443m11925l89846l66773l43540l21869
$$ 10730270 10224937 9743277 9285154 8850711 8438786 8048940 7682167 7338627 7016758
55820G016758l01847k83395k68045k56430k46093k34774k23911k15822k09224
$$ 7016758 6714911 6431516 6163471 5907041 5660948 5426174 5202263 4986441 4777217
55811D777217k00917j90550j80485j71801j63474j54877j46397j37890j28877
$$ 4777217 4576300 4385750 4205265 4033464 3869990 3715113 3568716 3430826 3301949
55802C301949j19985j12355j05980j00121r4705q9837q4766p8914p3121o8501
$$ 3301949 3181964 3069609 2963629 2863508 2768803 2678966 2594200 2515286 2442165 2373664
55792B373664o4869o1510n8555n6256n3935n1011m8083m5879m4099m2382m1134
$$ 2373664 2308795 2247285 2188730 2132474 2078539 2027528 1979445 1933566 1889467 1847085 1805951
55781A805951m0387l9123l6984l5220l4747l4585l3432l1450k9281k6785k4063
$$ 1805951 1765564 1726441 1689457 1654237 1619490 1584905 1551473 1520023 1490742 1463957 1439894
55770A439894k2244k1856k1794k1157k0600k0612k0243j9031j8361j9209k0301
$$ 1439894 1417650 1395794 1374000 1352843 1332243 1311631 1291388 1272357 1253996 1234787 1214486
55759A214486k0295k0020k0499k0609j8974j6658j5548j5358j4657j3567j2969
$$ 1214486 1194191 1174171 1153672 1133063 1114089 1097431 1081883 1066525 1051868 1038301 1025332
55748A025332j2226j0391q697r034j0666j1200j0292r606r451q443o498n314n438
$$ 1025332 1013106 1002715 994018 984984 974318 963118 952826 943220 933769 925326 918828 913514 908076
55735I08076n455m661m107m277l911k146O5J604K747M027M892M447K562m03m107
$$ 908076 902621 897960 893853 889576 885665 883519 883584 885188 887935 891962 896854 901301 903863 903460 899353
55720H99353p834j0415j1252j0908j0366j0062r664q349n544k031M9r36m502q893
$$ 899353 891519 881104 869852 858944 848578 838516 828852 820503 814959 812928 812977 812041 807539 798646
55706G98646j2836j5566j6313j5259j4231j4568j4773j2404q111n456o264q312
$$ 798646 785810 770244 753931 738672 724441 709873 695100 682696 674585 669129 662865 654553
55694F54553q545o728m840m410n737q577j2005j4227j3786j1062p909n937n417
$$ 654553 646008 639280 634440 630030 624293 615716 603711 589484 575698 564636 556727 550790 545373
55681E45373n515n239m385l693l832m392m440l973m043n212o640p074o268n143
$$ 545373 539858 534619 530234 526541 522709 518317 513877 509904 505861 500649 494009 486935 480667 475524
55667D75524m891n911p377p993p502o978p123o937n158k462q32q78j247q56j74
$$ 475524 470633 464722 457345 449352 441850 434872 427749 420812 415654 413192 412360 411482 410235 409379 409205
55652D09205J74O57J794K932K942J534q24l523n722o347n079l032j838k132l293
$$ 409205 409379 410036 411830 414762 417704 419238 418414 414891 409169 402822 397743 394711 392873 390741 387448
55637C87448m294m574m350m334m902n466n192m175l265k783k336k014k503l596
$$ 387448 383154 378580 374230 369896 364994 359528 354336 350161 346896 344113 341777 339763 337260 333664
55623C33664l766k092K75J568J585J453J810K324K666K856K703J850M93o85j381
$$ 333664 329898 327806 328081 329649 331234 332687 334497 336821 339487 342343 345046 346896 347389 346704 345323
55608C45323j876k350k517k075j111p1M84K74k12JJ058J663N64j630k975k456
$$ 345323 343447 341097 338580 336505 335394 335323 335807 336081 335869 335870 336928 338591 339155 337525 334550 332094
55592C32094q54O53J713K368K435J783O13r10k584l536k709o20N28n43k391k927
$$ 332094 331240 331893 333606 335974 338409 340192 340805 339895 337311 333775 331066 330446 330974 330431 328040 325113
55576C25113k412k784m438n642n239m125l448l102k888l663n769p587p190m948
$$ 325113 322701 319917 315479 309837 304598 300473 297025 293923 291035 287372 281603 274016 266826 261878
55562B61878k936k211k093j919j918k195k297k229k643l522l774k851j882k313
$$ 261878 258942 256731 254638 252719 250801 248606 246309 244080 241437 237915 234141 231290 229408 227095
55548B27095l905m906m025j731L39Q84J0j015j109m34J8l15j146j823j755n44
$$ 227095 223190 218284 214259 212528 212867 213751 213761 212746 211637 211203 211221 210906 209760 207937 206182 205638
55532B05638J428K799K510J311R20J708K319J886J203J245J759K250L126M759
$$ 205638 207066 209865 212375 213686 214606 216314 218633 220519 221722 222967 224726 226976 230102 234861
55518B34861O229O298N233M511M944N971O636O392N122L106R51j058l294n986
$$ 234861 241090 247388 252621 257132 262076 268047 274683 281075 286197 289303 290254 289196 285902 279916
55504B79916q297q986p831n830m120l191l002l274l681m059m380m442m005l438
$$ 279916 271619 262633 254802 248972 244852 241661 238659 235385 231704 227645 223265 218823 214818 211380
55490B11380l553m398m895m266l078k250j714r58k72l13q20q72k74K68K79%j18
$$ 211380 207827 203429 198534 194268 191190 188940 187226 186268 185996 185683 184863 183991 183717 183985 184264 184264 184146
55473A84146L06J545L124L507J586j611l724l685k611k072k422l110l649l891
$$ 184146 184452 185997 189121 192628 194214 192603 188879 185194 182583 180511 178089 174979 171330 167439
55459A67439l979m286m979n551n398m709m145l641k496p46M74L82l85o20Q4J159
$$ 167439 163460 159174 154195 148644 143246 138537 134392 130751 128255 127509 127983 128365 127980 127360 127444 128603
55443A28603J795J485K16j449k614k655j595mJ387K077K087J752J271P46O11J182
$$ 128603 130398 131883 132099 130650 128036 125381 123786 123782 125169 127246 129333 131085 132356 133102 133713 134895
55427A34895J707R82n21n57J713L781K819k55j883o83J257J929J868K196K410
$$ 134895 136602 137584 137063 136506 138219 142000 144819 144564 142681 141998 143255 145184 147052 149248 151658
55412A51658J530kr80j083p32k02J33m52j919k845k025k56M69p44k877m140l448
$$ 151658 153188 153186 152206 151123 150391 150189 150322 149870 147951 145106 143081 142825 143294 142550 139673 135533 132085
55395A32085j183J002J650J030N97Q23Q11K79K73J007Q40j053k518j258J321J686
$$ 132085 130902 131904 133554 134584 135181 136004 136815 137094 137367 138374 139214 138161 135643 134385 135706 137392
55379A37392p02k529j371J200K248J215l12j079q68K79J835K325O43k175l664
$$ 137392 136690 134161 132790 133990 136238 137453 137141 136062 135194 135473 137308 139633 140276 138101 134437
55364A34437k643m49P38J88r71j182l3J415J751O71p66j389j032k00P67J638J799
$$ 134437 131794 131345 132083 132271 131300 130118 130085 131500 133251 133922 133156 131767 130735 130535 131302 132940 134739
55347A34739Q69k46P1K035L728L195Q03j295j773j336j362k144k842k565j046
$$ 134739 135608 135362 135433 137468 141196 144391 145194 143899 142126 140790 139428 137284 134442 131877 130831
55332A30831J214L076L302J574j030k873l087j962l45J045J925K465K889K933
$$ 130831 132045 135121 138423 139997 138967 136094 133007 131045 130700 131745 133670 136135 139024 141957
55318A41957J957l5j961k751k602k442k379j660k68N06k20j462j510k37P25J27
$$ 141957 143914 143879 141918 139167 136565 134123 131744 130084 129816 130322 130102 128640 127130 126893 127618 127745
55302A27745j470k683k956k567j564K69K363L290K312L64j095j717j962j735m96
$$ 127745 126275 123592 120636 118069 116505 116774 119137 122427 124739 125103 124008 122291 120329 118594 118098
55287A18098J282K191J814J471K204L003K163k45k351k729j608j1J269J803J498
$$ 118098 119380 121571 123385 124856 127060 130063 132226 131981 129630 126901 125293 125282 126551 128354 129852
55272A29852P78K58O1r9k72j67K50O62Q53P84K95p81k134l045k987j876jJ988
$$ 129852 130630 130888 130949 130850 130578 130411 130661 131323 132176 132960 133255 132474 130340 127295 124308 122432 122431 124419
55254A24419L314L766L771L413K120Rj388j001q6n73j998j963K25K383K511J252
$$ 124419 127733 131499 135270 138683 140803 140812 139424 138423 138337 137764 135766 133803 134028 136411 138922 140174
55238A40174L28P6k08o01o27l67k98l18P1P89J177Q18j22j172j778j609r31l96
$$ 140174 140502 140578 140370 139769 139142 138775 138477 138159 138230 139019 140196 141014 140892 139720 137942 136333 135402 135006
55220A35006j75J37O87J036R51P08L52m65j451j514l28Q46P84p0n01k97j16j50
$$ 135006 134831 134968 135655 136691 137642 138350 138702 138237 136786 135272 134944 135790 136574 136504 136003 135706 135590 135440
55202A35440o3Q2j20n66p69p26q53j183j334j203j088j175j367j421r33M13K093
$$ 135440 135377 135459 135339 134773 134004 133278 132425 131242 129908 128705 127617 126442 125075 123654 122721 123134 125227
55185A25227K804J938N27o0O4k47j298k116j869p72M87J429J753J325M31l83p58
$$ 125227 128031 129969 130496 130436 130500 130253 128955 126839 124970 124198 124685 126114 127867 129192 129623 129240 128482
55168A28482o15J04J222K076K067J405Q39O76M97j20r86j473j115j60M86K48k32
$$ 128482 127867 127971 129193 131269 133336 134741 135580 136256 136753 136633 135647 134174 133059 132899 133385 133633 133401
55151A33401K42J663K556J905M74l99n32n67o57n04j70Q9M28R10R53K22n11m89
$$ 133401 133643 135306 137862 139767 140241 139842 139310 138743 138086 137582 137412 137501 137929 138839 139792 140014 139503 139014
55133A39014l99j302k555k408n97J219J819J708J729J763J453J103J107J281J303
$$ 139014 138615 137313 134758 132350 131753 132972 134791 136499 138228 139991 141444 142547 143654 144935 146238
55118A46238J145Q32M10L35R92J580P15j427k765j982n47q80l104m852m172j641
$$ 146238 147383 148215 148625 148960 149952 151532 152247 150820 148055 146073 145526 144646 141542 136690 132518 130877
55102A30877O17J263P03J62L04R00J503J975K171J715N91m06n07r1j37p55j030
$$ 130877 131494 132757 133460 133622 133926 134826 136329 138304 140475 142190 142781 142375 141868 141777 141640 140885 139855
55085A39855l99O99J552J751J005o25j976j445R97L286L470J777j27j178j369
$$ 139855 139456 140155 141707 143458 144463 143838 141862 140417 141414 144700 148170 149947 149820 148642 147273
55070A47273q22L96J609J762O15q29j410r84l50k53p11j220j380j157o78m2M76
$$ 147273 146451 146847 148456 150218 150833 150004 148594 147610 147260 147007 146296 145076 143696 142539 141861 141819 142295
55053A42295M12l22j040r20KQ97J237J361J862K707L160K494P98q72j395p66M1
$$ 142295 142707 142385 141345 140425 140427 141324 142561 143922 145784 148491 151651 154145 154943 154071 152676 151910 151951
55036A51951N06J054J776J721M47o39o9J130N92j779l351k504q23m83j120r08
$$ 151951 152457 153511 155287 157008 157455 156816 156747 157877 158469 156690 153339 150835 150012 149529 148409 147501
55020A47501L33R96K90p33r40o25p39j336j492n88P58J288O37o4M05J633K004
$$ 147501 147834 148830 149120 148387 147447 146822 146083 144747 143255 142667 143425 144713 145350 145286 145691 147324 149328
55003A49328Q79n56r32l48K23M48P17J156J382J197Q36N26J81l64r89j240p35
$$ 149328 150207 149651 148719 148371 148594 149042 149759 150915 152297 153494 154330 154856 155037 154673 153684 152444 151709
54986A51709K64Q96O57J8l11l65m30p8J112K115J316r68k422j788m28Nj59M2O8
$$ 151709 151973 152869 153526 153544 153233 152868 152438 152360 153472 155587 156903 155935 153513 151725 151297 151302 151143 151185 151253
54967A51253r91k130j375J113K877K408J009P20J516J540k88k635l046q11J841
$$ 151253 150262 148132 146757 147870 150747 153155 154164 154884 156400 157940 157652 155017 151971 151160 153001
54952A53001K093K8j370j40K036K224J61j753j804o13L50M18k77j120j101L22
$$ 153001 155094 155122 153752 153612 155648 157872 158033 156280 154476 153863 154213 154631 154354 153234 152133 152455
54936A52455K242L140K777K226K042J654P84J90M31R33R31N15K54M15R57J527
$$ 152455 154697 157837 160614 162840 164882 166536 167320 167510 167941 168874 169805 170320 170574 170989 171946 173473
54920A73473J339j27k037k778j893m47P40J853K674K131K58q92J78J971J934P1
$$ 173473 174812 174685 172648 169870 167977 167530 168270 170123 172797 174928 175186 174294 174472 176443 178377 178448
54904A78448j253p60L68P55O10O26N65r2j121j952k416k364j361M54J812J607
$$ 178448 177195 176435 176803 177558 178168 178794 179359 179267 178146 176194 173778 171414 170053 170507 172319 173926
54888A73926L39n33m16J52P62J616K686L376L326K824J993M72j559k794k149l52
$$ 173926 174265 173732 173316 173468 174230 175846 178532 181908 185234 188058 190051 190523 188964 186170 184021 183669
54872A83669P63L40q31j577j357r5J913L598L625J974K93L7R52K019L205N109
$$ 183669 184432 184772 183941 182364 181007 180912 182825 186423 190048 192022 192315 192352 193304 195323 198528 203637
54856B03637P260Q071O782M591L434M145O058P854Q480P666N895L857J822k94
$$ 203637 210897 218968 225750 230341 233775 237920 243978 251832 260312 267978 273873 277730 279552 279258
54842B79258k375l986m796m786m260l919m654o497p926p191m466j818p81q20o65
$$ 279258 276883 272897 268101 263315 259055 255136 250482 243985 236059 228868 224402 222584 221803 220983 220318
54827B20318p6L76N10L57m96k203l616l314j757r84j681j842O39M901P928Q112
$$ 220318 220242 220618 221128 221485 220989 218786 215170 211856 210099 209115 207434 205592 206231 211132 219060 227172
54811B27172O738N810N604N117M063L435M073N520O526O169M318J416j795m495
$$ 227172 233910 239720 245324 250441 254504 257939 262012 267532 274058 280227 284545 285961 284166 279671
54797B79671o140o707o581o291o337o880p408p128o009n077n188n762n442l914
$$ 279671 273531 266824 260243 253952 247615 240735 233327 226199 220190 215113 209925 204163 198721 194807
54783A94807k316j720j935k161k066j665p75N35J290L95j805l563l615k507j577
$$ 194807 192491 190771 188836 186675 184609 182944 182169 182704 183994 184389 182584 179021 175406 172899 171322
54768A71322j214p90m7K99l50j396j627p86P8Jn58l62P89J611R45o62j563q62
$$ 171322 170108 169318 169271 169570 169220 167824 166197 165411 165489 165490 164932 164570 165359 166970 167915 167253 165690 164828
54750A64828Q69K558L561L623K721J431P89J205J841J579L26j197k532l572l864
$$ 164828 165697 168255 171816 175439 178160 179591 180380 181585 183426 185005 185331 184134 181602 178030 174166
54735A74166k839q74P68J334J203Q88L47l18m18L06J041J105J119J928K943K803
$$ 174166 171327 170453 171221 172555 173758 174646 174993 174675 174257 174563 175604 176709 177828 179756 182699 185502
54719A85502J427J49j99m8J26N19J161J558J710K356L630M557M672N003O371P689
$$ 185502 186929 187078 186879 186831 186957 187476 188637 190195 191905 194261 197891 202448 207120 212123 218494 226183
54703B26183P323N514L991L521L431L524M782P483J0055J0706R457P602N742L363
$$ 226183 233506 239020 243011 246532 249963 253487 258269 265752 275807 286513 295970 303572 309314 312677
54689C12677Q9l497o382p861p728o399n024m891o220p695p633n639k996j414j610
$$ 312677 312766 309269 302887 295026 287298 280899 275875 270984 264764 257069 249436 243797 240801 239387 237777
54674B37777k965m300m758m203l037j837j099j143j887k461j532J338M632O081
$$ 237777 234812 230512 225754 221551 218514 216677 215578 214435 212548 210087 208555 209893 214525 220606
54660B20606N183L817L785M663M991M829N616P657R252Q907P144N518M634L822
$$ 220606 225789 229606 233391 238054 243045 247874 253490 261147 270399 279306 286450 291968 296602 300424
54646C00424K172o95m368p571q887q081o347m987m333m223m603n137n015l977
$$ 300424 302596 301901 297533 289962 281075 272994 266647 261660 257327 253104 248501 243364 238349 234372
54632B34372k992l132m201n170n471n177m323k925j382k84Jo75k053k970k096
$$ 234372 231380 228248 224047 218877 213406 208229 203906 200981 199599 199315 199316 198641 196588 193618 191522
54617A91522R9J229p4k161k559j185J87P79J154J247L23j121j564r32q12j725
$$ 191522 191621 192850 192776 190615 188056 186871 187058 187837 188991 190238 190561 189440 187876 186944 186132 184407
54601A84407k222j472p26j019j235m7J658K069J144K62j37p19j381r85P33K442
$$ 184407 182185 180713 179987 178968 177733 177686 179344 181413 182557 182819 182682 181963 180582 179597 180330 182772
54585A82772K862K214J485R94L03p67j575j294j0J138J207O69P62J700K379K038
$$ 182772 185634 187848 189333 190327 190630 189863 188288 186994 186984 188122 189329 189998 190760 192460 194839 196877
54569A96877J219N01o50k722m646m753l023j131k74j03Rj55q11j139j65J572K169
$$ 196877 198096 198597 197947 195225 190579 185826 182803 181672 181398 181295 181304 181149 180338 179199 179034 180606 182775
54552A82775N36k166l696l110j443r1P48J611K419K476J621N19k99q66j017m3
$$ 182775 183311 181145 177449 174339 172896 172805 173553 175164 177583 180059 181680 182199 181900 181034 180017 179974
54536A79974K229M604N388M045J616k39m78O42J843K018J319O60K85l11j028q88
$$ 179974 182203 186807 192195 196240 197856 197617 197139 197781 199624 201642 202961 203621 203906 203595 202567 201679
54520B01679L49J348R83k3l80l01q98j947j951n44Q31J017O09O91J150J239J013
$$ 201679 202028 203376 204359 204336 203956 203655 202757 200810 198859 198315 199146 200163 200772 201463 202613 203852 204865
54503B04865J139J684K013J810J465J378J441J339R94N38J34l9K02Q71J782K620
$$ 204865 206004 207688 209701 211511 212976 214354 215795 217134 218128 218666 218800 218761 218963 219834 221616 224236
54487B24236K991K532J270j26r10j098j375j881j704p7K304L916M164L629K719
$$ 224236 227227 229759 231029 230903 229993 228895 227520 225639 223935 223858 226162 230078 234242 237871 240590
54472B40590J256m02j144o75j70l93l21J005K284J408j323l343l167j840r05p18
$$ 240590 241846 241444 240300 239625 239455 239062 238741 239746 242030 243438 242115 238772 235605 233765 232860 232142
54456B32142j148k161k917k082L0J221L46r68q36J65M48K21Q39K164K704K112
$$ 232142 230994 228833 225916 223834 223864 225085 225431 224463 223627 223792 224240 224461 225300 227464 230168 232280
54440B32280J524J474J201K28r02j771k510k809j941j74J225J836K634M063M834
$$ 232280 233804 235278 236479 236707 235805 234034 231524 228715 226774 226600 227825 229661 232295 236358 241192
54425B41192L690J394j14j06M59N34K08J82O18Q74L18o78r11K77K049L004K771
$$ 241192 244882 246276 246162 246056 246515 247049 247257 247439 248057 248931 249249 248571 247660 247937 249986 252990 255761
54408B55761K114J657J361J246J683K609L275L183K731K496K390J961J064j17
$$ 255761 257875 259532 260893 262139 263822 266431 269706 272889 275620 278116 280506 282467 283531 283414
54394B83414j352k217k059o12J454K913K877J332r81l050m187m392m063l432k455
$$ 283414 282062 279845 277786 277174 278628 281541 284418 285750 284769 281719 277532 273140 269077 265645 263190
54379B63190j236k19Q9m86j591k369k085j025m37r48j543q52Q62J909J319k31
$$ 263190 261954 261735 261824 261338 259747 257378 255293 254268 253831 252883 251340 250488 251350 253259 254578 254347
54363B54347j622k301j935k82J927L055K309P70o5r8j89m67j73R92K255K629J801
$$ 254347 252725 250424 248489 248207 250134 253189 255498 256268 256203 256105 255916 255449 255276 256268 258523 261152 262953
54346B62953J77j470k324j985p73N93J600K126K278K333K657L261L492K561N48
$$ 262953 263130 261660 259336 257351 256578 257171 258771 260897 263175 265508 268165 271426 274918 277479 278027
54331B78027j488k589k865l098l457l081j329R35K002J369L62L57J095J462J265
$$ 278027 276539 273950 271085 267987 264530 261449 260120 261055 263057 264426 264788 265145 266240 267702 268967
54316B68967J193J361J102K50m86o43n20l12K30R58J165P60N31O66K41j001j650
$$ 268967 270160 271521 272623 272873 272387 271744 271224 270912 271142 272100 273265 274025 274556 275222 275463 274462 272812
54299B72812p16K98p58l278m366k796o35j12n50L12K795M610L675M98k514l535
$$ 272812 272096 272394 271636 268358 263992 261196 260561 260449 259899 260211 263006 267616 271291 271789 269275 265740
54283B65740k795j885j948k667k910k212j265q85r00m27Q67K181K447J491J80
$$ 265740 262945 261060 259112 256445 253535 251323 250058 249173 248273 247846 248713 250894 253341 254832 255012
54268B55012m88l11K5l35j563k920l482l073k334j772j140q3R88J370J259J594
$$ 255012 254524 254213 254238 253903 252340 249420 245938 242865 240531 238759 237619 237536 238524 239894 241153 242747
54252B42747K501K819J726J2j038j338j651k052j943j412j251j469j098J07Q60
$$ 242747 245248 248067 249793 249805 248767 247429 245778 243726 241783 240371 239120 237651 236553 236660 237520
54237B37520K4j724k738k284q39R11K451L154K665J627J190J581J802R91m33j436
$$ 237520 237544 235820 233082 230798 229959 230870 233321 236475 239140 240767 241957 243538 245340 246331 245898 244462
54221B44462j680j640j621j340o22K7R6p8K23Q91J007K55m45j69P66J365J239
$$ 244462 242782 241142 239521 238181 237559 237586 237682 237604 237827 238718 239725 239980 239535 239366 240132 241497 242736
54204B42736O49k12j158j607j115j14P33J615L005M298M248K780J089k07j607
$$ 242736 243385 243173 242015 240408 239293 239179 239912 241527 244532 248830 253078 255858 256947 256740 255133
54189B55133l029l164j356Q74J461J83j471k270k260k176k640l666m474m108k538
$$ 255133 252104 248940 247584 248458 249919 250102 248631 246361 244101 241925 239285 235619 231145 227037 224499
54174B24499o70Q92K282L128K255n21l284l982k820j463m87Q40K543L388K585
$$ 224499 223829 224721 227003 230131 232386 231865 228581 224599 221779 220316 219829 220669 223212 226600 229185
54159B29185Q01r08k133k629j843K32K241K423M51j996k651p21K430M640M955
$$ 229185 229986 229078 226945 224316 222473 222705 224946 227369 227820 225824 223173 222452 224882 229522 234477
54144B34477M085L026J936O66l73o62n33q41j728k409k245j467p63n11o46r26
$$ 234477 238562 241588 243524 244190 243817 243155 242622 241781 240053 237644 235399 233932 233169 232658 232012 231086
54128B31086j196j372j256n27P44J769J749R19L03L31M68L96O03J317J726J062
$$ 231086 229890 228518 227262 226735 227479 229248 230997 231916 232219 232550 233018 233414 234017 235334 237060 238122
54112B38122k13j081j220r82o58m83q08j596k165k059j604j060j66Q08O07j202
$$ 238122 237909 236828 235608 234626 233968 233485 232677 231081 228916 226857 225253 224193 224027 224835 225442 224240
54096B24240k895k516n40P39K06j066j507o27R21J780P88j586l151k474o95M07
$$ 224240 221345 218829 218289 219028 219234 218168 216661 216034 216955 218735 219523 217937 214786 212312 211617 212024
54080B12024J140K814M740M727K452J7j165j702k077j488J78J295O75p33j431
$$ 212024 213164 215978 220718 225445 227897 227914 226749 225047 222970 221482 221660 222955 223630 222897 221466
54065B21466j320r98m58L72Q99Q01P54J283J848J914J883K098J933Q58m21q65
$$ 221466 220146 219148 218690 219062 219961 220762 221516 222799 224647 226561 228444 230542 232475 233333 232912 232047
54049B32047l38P73K152L027K231j93k360k616j404k13L24M12K02J09R28K495
$$ 232047 231709 232482 234634 237661 239892 239699 237339 234723 233319 233106 233430 233842 234044 234153 235081 237576
54033B37576L154J855j55r99n77M7O47J466J717M67j453k273j795j336j294p15
$$ 237576 240730 242585 242430 241431 240854 240901 241548 243014 244731 245198 243745 241472 239677 238341 237047 236332
54017B36332N73J241M89o73r01k65J50l46j452k198j714j45J360K059K524L295
$$ 236332 236905 238146 238635 237962 237061 236796 236946 236600 235148 232950 231236 231091 232451 234510 237034 240329
54001B40329L416J698r19k080j197k63r29k192j856O88L981O104O128M452K305
$$ 240329 243745 245443 244524 242444 241247 240984 240055 237863 236007 236695 240676 246780 252908 257360 259665
53986B59665Q45M34Q08J538K024J593L49n66l39L96P78J318K861M559M693L454
$$ 259665 260510 260944 261752 263290 265314 266907 267256 266690 266351 266747 267525 268843 271704 276263 280956 284410
53970B84410K954M216N966O839P019P024O542N326L735J553k046o353q714p694
$$ 284410 287364 291580 297546 304385 311404 318428 324970 330296 334031 335584 333538 327185 318471 310777
53956C10777n238m018l981l419k362k535m245n678n546m626m036l483k079K2J681
$$ 310777 305539 301521 297540 294121 291759 289224 284979 279301 273755 269129 265093 261610 259531 259553 261234
53941B61234K048J286K54k65j90j07m32q62r24o82m05N5Q96J604J318oj429k117
$$ 261234 263282 264568 264822 264557 264367 264260 263828 262966 262042 261360 260955 261010 261906 263510 264828 264822 263393 261276
53923B61276k084j881j932k254k462k076j100j18M55R06J669K537K832K164O46
$$ 261276 259192 257311 255379 253125 250663 248587 247487 247369 247824 248730 250399 252936 255768 257932 258578
53908B58578j177k244j483R16L183L770L037K321J909J143K18K40J262J698L70
$$ 258578 257401 255157 253674 254590 257773 261543 264580 266901 268810 269953 270171 270411 271673 273371 273741
53893B73741j812k870j813Q73L981O166O482N110L368K545K906L983N088N256
$$ 273741 271929 269059 267246 268119 272100 278266 284748 289858 293226 295771 298677 302660 307748 313004
53879C13004L632P54j178l85K406M803N526N275M934M158K309q1j754k232k073
$$ 313004 316636 317390 316212 315827 318233 323036 328562 333837 338771 342929 345238 345157 343403 341171 339098
53864C39098j731j067j72J69n22j397j144J88J091N75m94o66Q4M47l61j685k489
$$ 339098 337367 336300 336128 336297 335775 334378 333234 333422 334513 335088 334594 333928 334012 334459 334098 332413 329924
53847C29924k525k213j919j726j487q66L26J578J846O37j401l117l873l669k827
$$ 329924 327399 325186 323267 321541 320054 319188 319514 321092 322938 323575 322174 319057 315184 311515 308688
53832C08688j824j009o2J845M748P168P430N618L594K985L845N302O819Q291R394
$$ 308688 306864 305855 305793 307638 312386 319554 326984 332602 336196 339181 343026 348328 355147 363438 372832
53817C72832R605Q940Q178P994P866O279K322l008p508r825j0421j0393r991r017
$$ 372832 382437 391377 399555 407549 415415 421694 424016 421008 413500 403675 393254 382861 372870 363853
53803C63853q000p966q953r742r343q014o440m801l295k762l686m955m727k634
$$ 363853 355853 347887 338934 329192 319849 311835 305395 300594 297299 294537 290851 285896 281169 278535
53789B78535j43J294J513Q24p67k780l743k692o08Q34J465K228K847J875n71k036
$$ 278535 278392 279686 281199 282023 281256 278476 274733 272041 271433 272267 273732 275960 278807 280682 280111 278075
53773B78075r24J105J536O04M45J293J055j084l002k661r35Rj24J19J484L182
$$ 278075 277151 278256 279792 280396 280841 282134 283189 282105 279103 276442 275507 275516 275392 275511 276995 280177
53757B80177M233M194K859O16r84l71J995L853L738K355J126M72Q3o3J80N67P84
$$ 280177 284410 288604 291463 292079 291095 290724 292719 296572 300310 302665 303791 304263 304346 304283 304463 305030 305814
53740C05814J038J717K674L274L103K309J401Q82Q41Q22K98n98j145q98o6R07
$$ 305814 306852 308569 311243 314517 317620 319929 321330 322212 323053 323875 324173 323575 322430 321532 321466 322373
53724C22373J651J708Q14m17q52k29M01Q4q24j410j476j400j307j119j015j135
$$ 322373 324024 325732 326546 326129 325277 325048 325449 325533 324709 323299 321823 320423 319116 317997 316982 315847
53708C15847j183r53q47j108j145m71J25m41j715k038q48N64P67l36j905l042
$$ 315847 314664 313711 312864 311756 310611 310140 310265 309824 308109 306071 305223 305787 306554 306218 304313 301271
53692C01271k857q17K291M494M492K862R77m50j175p28R37K550K539J087J26R94
$$ 301271 298414 297597 299888 304382 308874 311736 312713 312263 311088 310360 311297 313847 316386 317473 317599 318593
53676C18593K925M245M423M200M073L578K297Q43K36O52J423K133K924L695L939
$$ 318593 321518 325763 330186 334386 338459 342037 344334 345177 345413 346065 347488 349621 352545 356240 360179
53661C60179L806M424O266P925P591N411L297K587L046M033N264O226O125M977
$$ 360179 363985 368409 374675 382600 390191 395602 398899 401486 404532 408565 413829 420055 426180 431157
53647D31157L786L068K317J425J405K847M668N489N438N455N516M847L520K478
$$ 431157 434943 438011 440328 441753 443158 446005 450673 456162 461600 467055 472571 477418 480938 483416
53633D83416K146K090K037K084J891Q45o64j175R1K106L200K828J759Q74L23k45
$$ 483416 485562 487652 489689 491773 493664 494509 493845 492670 492761 494867 498067 500895 502654 503528 503851 503606
53617E03606r45j345r67k2O46M91j92q99j658k665l585l819l209k093q67K4J47
$$ 503606 502661 501316 500349 500327 500973 501464 501272 500373 498715 496050 492465 488646 485437 483344 482477 482501 482648
53600D82648k70j95Q80J918J636M53q6K96K97o47j217p9K197L990M561M280L574
$$ 482648 482378 482183 483063 484981 486617 487070 486984 487280 487577 486930 485713 485634 487831 491821 496382 500662 504236
53583E04236K704K115K109K234J798R36M98Q90J625K150K627L589N029O078N715
$$ 504236 506940 509055 511164 513398 515196 516132 516630 517520 519145 521295 523922 527511 532540 538618 544333
53568E44333L904J905J242K261L954N227N924O433O685O145M754L492L655N556
$$ 544333 548237 550142 551384 553645 557599 562826 568750 575183 581868 588013 592767 596259 599914 605470
53554F05470Q028R392Q977P561O257N435M917M724M940N094M441K962J499Q52
$$ 605470 613498 622890 631867 639428 645685 651120 656037 660761 665701 670795 675236 678198 679697 680549
53540F80549J185K241L419L642K046q20l093l334j793K11J651K336K637K982L252
$$ 680549 681734 683975 687394 691036 693082 692262 689169 685835 684042 684253 685904 688240 690877 693859 697111
53525F97111K672Q37j249k076j723j904l525n263n378l990k565j935j888k150
$$ 697111 699783 700620 699371 697295 695572 693668 690143 684880 679502 675512 672947 671012 669124 666974
53511F66974k575k618j721k10R86J515J745J920J942J963K330K920L214L100K971
$$ 666974 664399 661781 660060 659850 660836 662351 664096 666016 667958 669921 672251 675171 678385 681485 684456
53496F84456K994K936K804L040L948N370O962Q309Q944Q899R149J0660J2885J4091
$$ 684456 687450 690386 693190 696230 700178 705548 712510 720819 729763 738662 747811 758471 771356 785447
53482G85447J3583J2831J3743J6346J8897K0067K0292K0846K2125K3312K3596
$$ 785447 799030 811861 825604 841950 860847 880914 901206 922052 944177 967489 991085
53471I91085K3242K3226K4091K5618K7474K9556L1599L3137L4137L5134L6396
$$ 991085 1014327 1037553 1061644 1087262 1114736 1144292 1175891 1209028 1243165 1278299 1314695
53460A314695L7649L9023M1284M4359M6588M6641M5559M5404M6322M6598M5684
$$ 1314695 1352344 1391367 1432651 1477010 1523598 1570239 1615798 1661202 1707524 1754122 1799806
53449A799806M5164M6157M7471M7415M6202M5208M4733M3973M2822M2223M2575
$$ 1799806 1844970 1891127 1938598 1986013 2032215 2077423 2122156 2166129 2208951 2251174 2293749
53438B293749M2900M1976L9773L7388L5887L5430L5269L4537L3030L1197K9454
$$ 2293749 2336649 2378625 2418398 2455786 2491673 2527103 2562372 2596909 2629939 2661136 2690590
53427B690590K7864K6543K5789K5381K4192K1302J7271J3678J1224Q972N733J634
$$ 2690590 2718454 2744997 2770786 2796167 2820359 2841661 2858932 2872610 2883834 2892806 2898539 2900173
53415B900173k222n436q922j3549j8682k2672k4733k5673k6596k7533k7921k7947
$$ 2900173 2897951 2892515 2883593 2870044 2851362 2828690 2803957 2778284 2751688 2724155 2696234 2668287
53403B668287k8637l0581l3238l5672l7417l8449l8844l8740l8297l7517l6294
$$ 2668287 2639650 2609069 2575831 2540159 2502742 2464293 2425449 2386709 2348412 2310895 2274601
53392B274601l4778l3351l2150l0958k9551k7761k5199k1452j6768j2178q722
$$ 2274601 2239823 2206472 2174322 2143364 2113813 2086052 2060853 2039401 2022633 2010455 2001733
53381B001733o838o371o552n942l292J218O076J0121J3563J7076K0606K3562K5618
$$ 2001733 1994895 1988524 1981972 1976030 1972738 1973956 1980032 1990153 2003716 2020792 2041398 2064960 2090578
53368B090578K6859K7671K8884L1363L4967L8564M1650M5060M9344N3248N5125
$$ 2090578 2117437 2145108 2173992 2205355 2240322 2278886 2320536 2365596 2414940 2468188 2523313
53357B523313N5404N6336N9333O3761O8322P2461P6086P9027Q1448Q4111Q7637
$$ 2523313 2578717 2635053 2694386 2758147 2826469 2898930 2975016 3054043 3135491 3219602 3307239
53346C307239R1814R5889R9180J01290J02168J02278J02298J02455J02476J02195
$$ 3307239 3399053 3494942 3594122 3695412 3797580 3899858 4002156 4104611 4207087 4309282
53336D309282J01760J01141R9980R8094R5595R2319Q7758Q1948P5868P0507O5789
$$ 4309282 4411042 4512183 4612163 4710257 4805852 4898171 4985929 5067877 5143745 5214252 5280041
53325E280041O0870N5191M8823M2021L4905K7611K0316J3030N466k808j2174k2808
$$ 5280041 5340911 5396102 5444925 5486946 5521851 5549462 5569778 5582808 5588274 5585466 5573292 5550484
53313E550484l4575m6994n9301p0598q0228q8062r4234r8548j00625j00950j01127
$$ 5550484 5515909 5468915 5409614 5339016 5258788 5170726 5076492 4977944 4877319 4776369 4675242
53302D675242j02339j03959j04581j04076j03406j02415r9559r4629r0297q9383
$$ 4675242 4572903 4468944 4364363 4260287 4156881 4054466 3954907 3860278 3769981 3680598
53292C680598r1179r2112q9948q5979q2716q0705p8464p4864p0535o6882o4337
$$ 3680598 3589419 3497307 3407359 3321380 3238664 3157959 3079495 3004631 2934096 2867214 2802877
53281B802877o1884n8278n3446m8491m4273m0471l6439l2571l0013k9008k8448
$$ 2802877 2740993 2682715 2629269 2580778 2536505 2496034 2459595 2427024 2397011 2368003 2339555
53270B339555k7421k6339k5774k4861k2059j7529j3504j1701j1246j0033p516
$$ 2339555 2312134 2285795 2260021 2235160 2213101 2195572 2182068 2170367 2159121 2149088 2141572
53259B141572n039l495j953R21N040R236J2809J5797J8115J9507K0446K2169K5363
$$ 2141572 2136533 2133038 2131085 2132006 2137046 2146282 2159091 2174888 2193003 2212510 2232956 2255125 2280488
53246B280488K9313L2703L4949L6476L8054M0148M2668M5106M6937M7948M8083
$$ 2280488 2309801 2342504 2377453 2413929 2451983 2492131 2534799 2579905 2626842 2674790 2722873
53235B722873M7228M5534M3727M2452M1268L9031L5344L0979K6736K2680J8749
$$ 2722873 2770101 2815635 2859362 2901814 2943082 2982113 3017457 3048436 3075172 3097852 3116601
53224C116601J5097J1384O728J135m036p960j1769j6829k2422k6788l0030l4068
$$ 3116601 3131698 3143082 3149810 3150945 3146909 3138949 3127180 3110351 3087929 3061141 3031111 2997043
53212B997043l9539m4561m7289m8222m9093n0632n2488n4324n5896n6734n6806
$$ 2997043 2957504 2912943 2865654 2817432 2768339 2717707 2665219 2610895 2554999 2498265 2441459
53201B441459n7079n8299n9575n9275n7235n5078n4193n4314n4319n3698n2713
$$ 2441459 2384380 2326081 2266506 2207231 2149996 2094918 2040725 1986411 1932092 1878394 1825681
53190A825681n1645n0458m9185m8285m8205m8527m7804m4842m0199l5906l3373
$$ 1825681 1774036 1723578 1674393 1626108 1577903 1529376 1481572 1436730 1396531 1360625 1327252
53179A327252l2041l0425k7934k5170k2888k1427k0818k0798k0831k0657k0573
$$ 1327252 1295211 1264786 1236852 1211682 1188794 1167367 1146549 1125751 1104920 1084263 1063690
53168A063690k0711k0542j9829j9557k0725k2502k2939k1664k0458k0695k1496
$$ 1063690 1042979 1022437 1002608 983051 962326 939824 916885 895221 874763 854068 832572
53157H32572k1316k0263j9616j9582j8818j6391j3248j1304j1324j2192j2356
$$ 832572 811256 790993 771377 751795 732977 716586 703338 692034 680710 668518 656162
53146F56162j1773j1827j3201j4571j4298j2776j1783j1722j1165r466q060q277
$$ 656162 644389 632562 619361 604790 590492 577716 565933 554211 543046 533580 525520 517243
53134E17243r280r501q880q283p557n992m092l211l501l777l375k695j903o95
$$ 517243 507963 498462 489582 481299 473742 467750 463658 460447 456946 453169 449794 447099 445196 444501
53120D44501L69q6k264m567n488n093m039k462o54L07k18j264j347j73J444K836
$$ 444501 444870 444784 442520 437953 432465 427372 423333 420871 420217 420524 420306 419042 417695 417522 418966 421802
53104D21802L701L567K041m49k887m543n229m964l922k494j050O9K65q53k424
$$ 421802 425503 429070 431111 430662 427775 423232 418003 413039 409117 406623 405573 405642 405907 405054 402630
53089D02630k655r74J017J582J036P14O19l43k132l243k767j439l01L41M09k68
$$ 402630 399975 399001 400018 401600 402636 403350 403969 403626 401494 398251 395484 394045 393744 394085 394494 394226
53073C94226j143j013L45J550J442O71N05P36J18j443k438j864o49l46j038j424
$$ 394226 393083 392070 392415 393965 395407 396078 396583 397319 397437 395994 393556 391692 391043 390697 389659 388235
53057C88235q65l26r21k164k627j973j287j093l67J643L518L007Rl070m117l299
$$ 388235 387370 387044 386123 383959 381332 379359 378072 376979 376612 378255 381773 384780 384789 381719 377602 374303
53041C74303j963o95P16K101K606J576o74k965m104l823k840j779m35J410K882
$$ 374303 372340 371645 372361 374462 377068 378644 377970 375005 370901 367078 364238 362459 362024 363434 366316
53026C66316K712R77q83j854k100j861r17M03R88N08Q9N81J240J126P05P76P18
$$ 366316 369028 370005 369122 367268 365168 363307 362390 362793 363781 364289 364378 364959 366199 367325 368030 368806 369524
53009C69524n86k608l539k639q50Q63K274K997K283K62j748k652k524j851p81
$$ 369524 368938 366330 362791 360152 359302 360165 362439 365436 367719 367981 366233 363581 361057 359206 358425
52994C58425M87J445J813J717J100k26j668k084j339p15j083j561r31L52O16p81
$$ 358425 358912 360357 362170 363887 364987 364761 363093 361009 359670 358955 357872 356311 355380 355732 356348 355567
52978C55567k591l134j934K8J262R16o16k130k775k599j999j038L46J809K719
$$ 355567 352976 349842 347908 347936 349198 350114 349498 347368 344593 341994 339995 338957 339303 341112 343831
52963C43831K712J950J018N78P82R63L52q14j455j056j46P80J884L007L038J289
$$ 343831 346543 348493 349511 350089 350871 351834 352186 351372 349917 348861 348715 349495 351379 354386 357424 358713
52947C58713j203k725k792k111j188n3R31J224J039J067J324J247Q69P75R52R03
$$ 358713 357510 354785 351993 349882 348694 348641 349572 350796 351835 352902 354226 355473 356342 357117 358069 358972
52931C58972Q58J461K119J314r05k335j533K28J023R22J091J498J395J242K056
$$ 358972 359830 361291 363410 364724 363819 361484 359951 360179 361202 362124 363215 364713 366108 367350 369406
52916C69406L232L193K145K023L207L530J589q63j351m5J003J029J081J807K492
$$ 369406 372638 375831 377976 379999 383206 386736 388325 387462 386111 386066 387069 388098 389179 390986 393478
52901C93478K491K146J921J614R52J68m08q93j631k739l982m800m615l510k428
$$ 393478 395969 398115 400036 401650 402602 402770 402362 401469 399838 397099 393117 388317 383702 380192 377764
52886C77764k121k151j610n65L8j74o88j172j830k506k628k309k337k664k226
$$ 377764 375643 373492 371882 371317 371355 371181 370493 369321 367491 364985 362357 360048 357711 355047 352821
52871C52821r03j62o84q61Q38L096L292J168j070k021k389k881k923k172j548
$$ 352821 351918 351756 351072 350211 351049 354145 357437 358605 357535 355514 353125 350244 347321 345149 343601
52856C43601j699j770q09O20J293R42Q6j002j989j950k78K096L506L333K151N05
$$ 343601 341902 340132 339323 339943 341236 342178 342264 341262 339273 337323 337045 339141 342647 345980 348131 348636
52840C48636j344k616k248l22J583J966Q02q64k172k796k493j077R80K355J955
$$ 348636 347292 344676 342428 342106 343689 345655 346457 345593 343421 340625 338132 337055 338035 340390 342345
52825C42345K88p78j75J018J088J19l92j11l74j531j733L09K835L198J582N53
$$ 342345 342633 341855 341680 342698 343786 343905 343513 343402 343028 341497 339764 340073 342908 346106 347688 348241
52809C48241J288K324K120R45k36j051j274n91N43J041Q16R74J743J642k15k364
$$ 348241 349529 351853 353973 354918 354682 353631 352357 351766 352309 353350 354166 355140 356883 358525 358310 355946
52793C55946k860j937j380j904k671l008l135l241l059k517j945j491j054q10
$$ 355946 353086 351149 349769 347865 345194 342186 339051 335810 332751 330234 328289 326798 325744 324934
52779C24934j020j331r54K75J639K316K014R19l71j015o10K86P91P53N45J35p59
$$ 324934 323914 322583 321629 321904 323543 325859 327873 328792 328421 327406 326796 327082 327873 328626 329171 329306 328547
52762C28547j688j605k85J195J697J183K85n71j249j550j409j140j105j106m90
$$ 328547 326859 325254 324969 326164 327861 329044 329329 328758 327509 325959 324550 323410 322305 321199 320709
52747C20709J057K870L696K949J532R08J249J212j10j839k709l059m100n568n629
$$ 320709 321766 324636 328332 331281 332813 333721 334970 336182 336072 334233 331524 328465 324365 318797 313168
52732C13168l429m12J394J425M62n36p86J62J847K988K810J761M99r70k488k990
$$ 313168 309739 309327 310721 312146 312608 312072 311286 311448 313295 316283 319093 320854 321353 320383 317895 314905
52716C14905j753J90J034M74j34J59P26M81o78j927k442j944p20N41J213J256
$$ 314905 313152 313342 314376 314850 314716 314875 315601 316082 315404 313477 311035 309091 308371 308912 310125 311381
52700C11381J177J442K030K460K122P90r13j730q73J104K803L291K695J753J149
$$ 311381 312558 314000 316030 318490 320612 321402 320489 318759 317886 318990 321793 325084 327779 329532 330681
52685C30681J124J439J668J743J922K134J851J025N79J250K424K933K751K843
$$ 330681 331805 333244 334912 336655 338577 340711 342562 343587 344166 345416 347840 350773 353524 356367
52671C56367L496L813L140J976J155Q65R69J473K181K405J623J04j560l126m552
$$ 356367 359863 363676 366816 368792 369947 370812 371781 373254 375435 377840 379463 379567 378007 374881 370329
52656C70329n502n453m171j964K58J233L52j314j825o18P27N43q00j706j657j463
$$ 370329 364827 359374 355203 353239 353497 354730 355082 353768 351943 351325 352052 352595 351795 350089 348432 346969
52640C46969j491r42O78K362K645J380j40p13l83L1J89O15J708K735K439O71j162
$$ 346969 345478 344536 345214 347576 350221 351601 351461 350748 350365 350396 350585 351200 352908 355643 358082 358753 357591
52623C57591j707j173p54r80j395j649k017k777l657m079l548j870N02K389K806
$$ 357591 355884 354711 353957 352977 351582 349933 347916 345139 341482 337403 333855 331985 332487 334876 337682
52608C37682K063J290R44N99K43O87K098L223K968J999J770K460L002K853K462
$$ 337682 339745 341035 341979 342578 342821 343508 345606 348829 351797 353796 355566 358026 361028 363881 366343
52593C66343J938O55j320k589k120q73o35j562j942n98J405J995O29j025r84Q71
$$ 366343 368281 368936 367616 365027 362907 362034 361399 359837 357895 357297 358702 360697 361326 360301 359317 360188
52577C60188K670K566O26j351j782p43N43J216J367J349J183Q65P05R22J185J065
$$ 360188 362858 365424 366050 364699 362917 362174 362717 363933 365300 366649 367832 368697 369402 370324 371509 372574
52561C72574Q60J335K557L473K957R59j650l986n526n879m853k844p34P47J422
$$ 372574 373434 374769 377326 380799 383756 384715 383065 379079 373553 367674 362821 359977 359243 359990 361412
52546C61412J548J675K413L829N018M855L275J290l43j682k553k018J68K314K322
$$ 361412 362960 364635 367048 370877 375895 380750 384025 385315 384972 383290 380737 378719 378887 381201 383523
52531C83523L30j396j272k9Q23R40R12J022J187J511J943J720K16j840k884k339
$$ 383523 383853 382457 381185 381156 381979 382919 383831 384853 386040 387551 389494 391214 391430 389590 386706 384367
52515C84367j128l03pj5l88j117j694j689j374j259j342j243q85n22k86j37j49
$$ 384367 383239 382936 382929 382914 382526 381409 379715 378026 376652 375393 374051 372808 371923 371401 371115 370978 370829
52498C70829l68n14l21j38m94j027n95J107K648K344M61q43j03J616K012M15j362
$$ 370829 370461 369947 369626 369488 368994 367967 367372 368479 371127 373471 373932 373089 372986 374602 376614 377029 375667
52481C75667j220Q48K936L351J993j00j780k316j652n83j87p16j372j470j313
$$ 375667 374447 375295 378231 381582 383575 383475 381695 379379 377727 377144 376957 376241 374869 373399 372086
52466C72086j537k071k350k140j570p27N2l2j180k050j131J006K205J709J213
$$ 372086 370549 368478 366128 363988 362418 361691 361743 361711 360531 358481 357350 358356 360561 362270 363483
52451C63483K224L889M517M105L815L738L010J796J386K109K680K124R74rj058
$$ 363483 365707 369596 374113 378218 382033 385771 388781 390577 391963 394072 396752 398876 399850 399841 398783
52436C98783k465l502l278k057q32j66k06j102k370k500n20K347L885L588K878
$$ 398783 396318 392816 389538 387481 386649 386483 386277 385175 382805 380305 379785 382132 386017 389605 392483
52421C92483K647K229J226P17J577K802K824J721Q13N71L92K35R00K386L349K906
$$ 392483 395130 397359 398585 399302 400879 403681 406505 408226 409039 409610 410002 410237 411137 413523 416872 419778
52405D19778J887J489J487Q36n05j388j051L1J000J577J946K182K113J510K89
$$ 419778 421665 423154 424641 425477 424972 423584 422533 422564 423564 425141 427087 429269 431382 432892 433181
52390D33181j316k704l394l549l699l967l972l489k716j837q75k04m77j570k155
$$ 433181 431865 429161 425767 422218 418519 414552 410580 407091 404375 402538 401663 401459 400982 399412 397257
52375C97257j071J174K958L401L024K611K259J758J250R78P96M21R2M73J793L260
$$ 397257 396186 397360 400318 403719 406743 409354 411613 413371 414621 415599 416395 416816 416908 417381 419174 422434
52359D22434L656K673J526J873L937O079O577N577M738N083O020O480O182N321
$$ 422434 426090 428763 430289 432162 436099 442178 448755 454332 459070 464153 470173 476653 482835 488156
52345D88156L652Q57k405m514m367k558q62n28j162j340l07J145J728J275Q67
$$ 488156 491808 492665 490260 485746 481379 478821 477959 477431 476269 474929 474622 475767 477495 478770 479637
52330D79637J321K229K691K501K205K343L016L952M660M781M483M247M162L889
$$ 479637 480958 483187 485878 488379 490584 492927 495943 499895 504555 509336 513819 518066 522228 526117
52316E26117L605M279O379Q880J0309J0369R799R093Q303P808Q114Q804Q866Q244
$$ 526117 529722 534001 540380 549260 559569 569938 579737 588830 597133 604941 613055 621859 630725 638969
52302F38969Q036Q778R567R501R029R157J0043J1183J2383J3704J4842J5482J6033
$$ 638969 647005 655783 665350 674851 683880 693037 703080 714263 726646 740350 755192 770674 786707
52289G86707J7090J8398J9166J9432K0110K1563K3017K3909K4914K6886K9177
$$ 786707 803797 822195 841361 860793 880903 902466 925483 949392 974306 1001192 1030369
52278A030369L0144K9407K8663K9562L1373L1760K9874K7592K7050K7814K7593
$$ 1030369 1060513 1089920 1118583 1148145 1179518 1211278 1241152 1268744 1295794 1323608 1351201
52267A351201K5319K2258J9962J8511J7302J6419J6104J5537J3489J0047O695
$$ 1351201 1376520 1398778 1418740 1437251 1454553 1470972 1487076 1502613 1516102 1526149 1532844
52256A532844M502L022J274q01k312k593k089k059l394n716p653q103p050n186
$$ 1532844 1537346 1540368 1541642 1540841 1538529 1535936 1533847 1531788 1528394 1522678 1515025 1506922 1499872 1494686
52242A494686l065q87J288L494N799Q009R646J0509J1011J1735J2931J4616J6588
$$ 1494686 1491621 1490734 1492022 1495516 1501315 1509324 1518970 1529479 1540490 1552225 1565156 1579772 1596360
52229A596360J8087J8141J6826J5526J5231J5306J4806J4253J4781J6017J6315
$$ 1596360 1614447 1632588 1649414 1664940 1680171 1695477 1710283 1724536 1739317 1755334 1771649
52218A771649J5004J2898J0525P470L979J508P18J37k041n674r164j1531j2922
$$ 1771649 1786653 1799551 1810076 1817546 1821525 1823033 1823751 1823888 1821847 1816173 1807009 1795478 1782556
52205A782556j3662j3853j3752j3660j3667j3975j5018j6511j6929j5083j1867
$$ 1782556 1768894 1755041 1741289 1727629 1713962 1699987 1684969 1668458 1651529 1636446 1624579
52194A624579r397q387p474n343k510n14l8n10j067j293j134o33O1P35J365K196
$$ 1624579 1615182 1606795 1599321 1593978 1591468 1590954 1590916 1590406 1589339 1588046 1586912 1586279 1586340 1587075 1588440 1590636
52178A590636L318M231M276L677L688N133P182Q271Q028P414P094O816O566P017
$$ 1590636 1593954 1598185 1602461 1606138 1609826 1614959 1622141 1630412 1638440 1645854 1652948 1659764 1666330 1673347
52164A673347Q239R222R475R939J1196J1983J1063R665J0061J2072J3076J1747
$$ 1673347 1681586 1690808 1700283 1710222 1721418 1733401 1744464 1754129 1764190 1776262 1789338 1801085
52152A801085R801R236R598R175P636O012M851L804K794K276K233J947J070K22
$$ 1801085 1810886 1820122 1829720 1838895 1846531 1852543 1857394 1861198 1863992 1866268 1868501 1870448 1871518 1871740
52138A871740P9L32M3j165k581l119k276l59J901L575L599J378k179m705m210
$$ 1871740 1871819 1872151 1872194 1871029 1868448 1865329 1863053 1862694 1864595 1868170 1871769 1873147 1870968 1866263 1862053
52123A862053j023K455L978L135J152m37q86o39q70k273m107m801l669j662k48
$$ 1862053 1861030 1863485 1867463 1870598 1871750 1871313 1870427 1869788 1868918 1866645 1862538 1857737 1854068 1852406 1852158
52108A852158J37K27Q08J805K648L219M120N766P606Q811R657J1325J3987J6041
$$ 1852158 1852295 1852522 1853330 1855135 1857783 1861002 1865122 1870888 1878494 1887305 1896962 1908287 1922274 1938315
52094A938315J6057J4735J3939J4324J5110J5842J6885J8111J8611J8187J7943
$$ 1938315 1954372 1969107 1983046 1997370 2012480 2028322 2045207 2063318 2081929 2100116 2118059
52083B118059J8676J9657J9778J9096J8428J8087J7809J7484J7149J6549J5445
$$ 2118059 2136735 2156392 2176170 2195266 2213694 2231781 2249590 2267074 2284223 2300772 2316217
52072B316217J4198J3496J3561J4047J4470J4456J3769J2496J0982R448P983P088
$$ 2316217 2330415 2343911 2357472 2371519 2385989 2400445 2414214 2426710 2437692 2447140 2455123 2462211
52060B462211P601R534J1426J1505R446O532M154K542Q64j604m508o578o892n886
$$ 2462211 2469812 2479346 2490772 2502277 2511723 2518255 2522409 2524951 2525815 2524211 2519703 2513125 2506233 2500347
52046B500347m805m423m728n557o686p292o360l863p64K364N789R474J2646J4982
$$ 2500347 2495542 2491119 2486391 2480834 2474148 2466856 2460496 2456633 2455869 2458233 2464022 2473496 2486142 2501124
52032B501124J7096J9192K0321J9945J9188J9509K0802K1827K1832K0742J8514
$$ 2501124 2518220 2537412 2557733 2577678 2596866 2616375 2637177 2659004 2680836 2701578 2720092
52021B720092J5442J2453J0043P507M397J820Q97N46j405n218r176j2352j5524
$$ 2720092 2735534 2747987 2758030 2765537 2769934 2771754 2772651 2773197 2771792 2766574 2757398 2745046 2729522
52008B729522j9123k2178k4050k5613k7774l0027l1437l2209l3265l4794l6115
$$ 2729522 2710399 2688221 2664171 2638558 2610784 2580757 2549320 2517111 2483846 2449052 2412937
51997B412937l6690l6679l6510l6173l5072l2825l0250k8847k8755k8106k5499
$$ 2412937 2376247 2339568 2303058 2266885 2231813 2198988 2168738 2139891 2111136 2083030 2057531
51986B057531k2238k0552k0200j8873j5832j2932j1590j0966j0033r387r709j0131
$$ 2057531 2035293 2014741 1994541 1975668 1959836 1946904 1935314 1924348 1914315 1904928 1895219 1885088
51974A885088r574q356p046n120k414o52j555m170o025o422o789q115r931j1779
$$ 1885088 1875514 1867158 1860112 1854992 1852578 1851926 1850371 1846201 1840176 1833754 1826965 1818850 1808919 1797140
51960A797140j3821j5805j7080j7985j9723k2333k4252k4536k4287k5074k6927
$$ 1797140 1783319 1767514 1750434 1732449 1712726 1690393 1666141 1641605 1617318 1592244 1565317
51949A565317k8848l0341l1467l1980l1545l0611l0097l0181l0015k8864k7028
$$ 1565317 1536469 1506128 1474661 1442681 1411136 1380525 1350428 1320247 1290232 1261368 1234340
51938A234340k5364k4183k3045k1548j9958j8698j7547j5986j4315j3594j4052
$$ 1234340 1208976 1184793 1161748 1140200 1120242 1101544 1083997 1068011 1053696 1040102 1026050
51927A026050j4362j3269j1286r736q584o614l824k147l134n992q792j0813j2629
$$ 1026050 1011688 998419 987133 977397 968813 962199 958375 956228 953094 947102 938310 927497 914868
51914I14868j4339j4983j3939j2036j0818j0957j1677j1538r635o236k552J75
$$ 914868 900529 885546 871607 859571 848753 837796 826119 814581 804946 798710 796158 796333
51902G96333J544K087K614L504M640N768O675P057O643N596M543M000L940M143
$$ 796333 797877 799964 802578 806082 810722 816490 823165 830222 836865 842461 847004 851004 854944 859087
51888H59087M467M375K833l77l446l941j669R57J894J748K451M676P540R926J1057
$$ 859087 863554 867929 870762 870385 866939 862998 861329 862286 864180 865928 868379 873055 880595 890521 901578
51873I01578J0549R069Q288Q658Q065M384j063m791n881o962r926j3180j4563
$$ 901578 912127 921196 929484 938142 946207 950591 949528 944737 938856 931894 921968 908788 894225
51860H94225j4853j6110j8046j8518j7067j5575j5326j5429j4680j3180j1515
$$ 894225 879372 863262 845216 826698 809631 794056 778730 763301 748621 735441 723926
51849G23926r681p632n847m564l280j680k72O37J820M125P090R388J0325J0205
$$ 723926 714245 706613 700766 696202 692922 691242 690970 691607 693427 697552 704642 714030 724355 734560
51835G34560R720R753J1340J4735J8482K0370J9530J6991J4093J1068P491L384
$$ 734560 744280 754033 765373 780108 798590 818960 838490 855481 869574 880642 888133 891517
51823H91517o58m151p094r698j1856j2936j2299j0285q299p307o564m755k185
$$ 891517 890859 886708 879614 869916 858060 845124 832825 822540 814241 806934 800370 795615 793430
51810G93430o68q97j427r43l41j299l579n249n278m525m200m580n394o340p046
$$ 793430 792762 791865 790438 789495 789154 787855 784276 779027 773749 769224 765024 760444 755050 748710 741664
51795G41664p410q026r188r499p028k321J326J612nn04Q64K396K790K274J115
$$ 741664 734254 726228 717040 707541 700513 698192 699518 701130 701125 700621 701485 703881 706671 708945 710060
51780G10060j014l663n176m676l510l609m972n807n066l786l516m263m662l918
$$ 710060 709046 705383 700207 695531 692021 688412 683440 677633 672567 668781 665265 661002 656340 652422
51766F52422k710k072k055k072j870j506o76P64J787Q95j807m314m998m190k902
$$ 652422 649712 647640 645585 643513 641643 640137 639461 640225 642012 642907 641100 636786 631788 627598 624696
51751F24696j170J201L212L527K381J319J118J221J115J032J052P32l9q15j537
$$ 624696 623526 624727 627939 631466 633847 635166 636284 637505 638620 639652 640704 641436 641397 640582 639045
51736F39045k798m692o334o897o369m961k788p25m56k568n205n802l924j468l01
$$ 639045 636247 631555 625221 618324 611955 606994 604206 603481 603025 600457 595252 589450 585526 584058 583757
51721E83757n94j449k034j721nK829N252N557L563R48l95k9J164K376L573M837
$$ 583757 583163 581714 579680 577959 577954 580783 586035 591592 595155 596103 595708 595679 596843 599219 602792 607629
51705F07629N850O396O900P886R144R889R656Q582P038N368L909K767J642K22
$$ 607629 613479 619875 626775 634661 643805 653694 663350 671932 678970 684338 688247 691014 692656 692878
51691F92878j341k644l516m088m657n656p172q135o866l198P82L073M167N850
$$ 692878 691537 688893 685377 681289 676632 670976 663804 655669 648803 645605 646387 649460 653627 659477
51677F59477Q386J0498J1662J2480J2894J2072J0441R826J0850J2055J2328J2348
$$ 659477 667863 678361 690023 702503 715397 727469 737910 747736 758586 770641 782969 795317
51665G95317J2430J0870O116p31p160j1890j4633j4588j1340o782m036m311o238
$$ 795317 807747 818617 824733 824002 816842 804952 790319 775731 764391 757609 753573 749262 743024
51652G43024q088r235r583r139q432q161q216p807o522m410j505J551L000J632
$$ 743024 734936 725701 716118 706979 698547 690386 682170 674363 667841 663431 661926 663477 666477 668109
51638F68109j186k756k266j152l08J046L131M317L286J065m18q12j178k106l232
$$ 668109 666923 664167 661901 660749 660441 661487 664618 668935 672221 673286 672868 672056 670878 668772 665540
51623F65540m130m533l989k343n18J77l04m60J112M112O965Q719J0120J2455J5502
$$ 665540 661410 656877 652888 650545 650027 650204 649900 649440 650552 654664 661629 670348 680468 692923 708425
51608G08425J7532J7659J7101J7143J6659J3233O452j449q135j2643j4412j3052
$$ 708425 725957 743616 760717 777860 794519 807752 814204 812755 804620 791977 777565 764513
51596G64513r976q223r203j1017j1383j0824j1209j2328j2197j0217p856o204
$$ 764513 754537 746314 737111 726094 714711 703887 692678 680350 668153 657936 650080 643876
51584F43876m847l472k756l013l455l555l895m817n426m918m067m180n063n262
$$ 643876 639029 635557 632801 629788 626333 622778 618883 614066 608640 603722 599655 595475 590412 585150
51570E85150m154k689j917j770j739j974k940m317n023m469l129j609K05K467
$$ 585150 580996 578307 576390 574620 572881 570907 567967 563650 558627 554158 551029 549420 549625 552092
51556E52092M340M620L446K407K647L589M049L890L753L654K866J159n49j048
$$ 552092 556432 561052 564498 566905 569552 573141 577190 581080 584833 588487 591353 592512 591963 590915
51542E90915k1J712L007L581M377O323Q604R041O748L559J904J862J623L35r16
$$ 590915 590894 592606 595613 599194 603571 609894 618498 627539 634287 637846 639750 641612 643235 643570 642654
51527F42654j075m66L54J703L869N958O761O389O199P211R075J0653J1382J2052
$$ 642654 641579 641113 641467 643170 647039 652997 659758 666147 672346 679557 688632 699285 710667 722719
51513G22719J4069J7565K0596K1076J9445J8295J9085K0500K0628J9422J7896
$$ 722719 736788 754353 774949 796025 815470 833765 852850 873350 893978 913400 931296
51502I31296J6249J4436J3861J6493K2175K8439L3289L6679L8882L8945L5995
$$ 931296 947545 961981 975842 992335 1014510 1042949 1076238 1112917 1151799 1190744 1226739
51491A226739L0934K5564K0327J4017N686l907j2821j9454k3649k6603k9744l3402
$$ 1226739 1257673 1283237 1303564 1317581 1323267 1319360 1306539 1287085 1263436 1236833 1207089 1173687
51479A173687l6665l8499l8639l7353l4960l2038k9389k7278k5159k2976k1900
$$ 1173687 1137022 1098523 1059884 1022531 987571 955533 926144 898866 873707 850731 828831
51468H28831k2637k3463k1636j6977j2430j0393r987r091p794p963r945j1673
$$ 828831 806194 782731 761095 744118 731688 721295 711308 702217 694423 686460 676515 664842
51456F64842j1327r372p321n795m640l934l757l535k660j522r94j082r86m29k
$$ 664842 653515 644143 636822 631027 626387 622453 618696 615161 612501 610979 609985 608903 607917 607488 607486
51441F07486k8m0L30O80N71K64K12L90O89J473K887L943L315J113r77j639j278
$$ 607486 607458 607418 607748 608428 608999 609263 609475 609865 610554 612027 614914 618857 622172 623285 622308 620669 619391
51424F19391r53o70M62K543M183L751R58l041o720r088r891r523q757q091p186
$$ 619391 618438 617768 618230 620773 624956 628707 629665 626624 619904 610816 600925 591402 582645 574554 567368
51409E67368n345k835j277k018m299n794n179l446k308k039j611m55P94J219M56
$$ 567368 562023 559188 557911 555893 551594 545800 540621 537175 534867 532828 531217 530762 531556 532775 533231
51394E33231j209k882l225j612P43J831J375J301L117N825P409P555P812R402
$$ 533231 532022 529140 525915 524303 525046 526877 528252 529553 532670 538495 545904 553459 561271 570673
51380E70673J2016J4446J5412J3993J0490O830N021N007N070M316L491L045J993
$$ 570673 582689 597135 612547 626540 637030 643860 648881 653888 658958 663274 666765 669810 671803
51367F71803m49l302n080n688n950n880m829l122k181k795m154m904m462l101
$$ 671803 671354 668052 662972 657284 651334 645454 640625 637503 635322 632527 628373 623469 619007 615906
51353F15906j397M0P09M34m92j336j282j25J270J736J327J416K764M259M329L083
$$ 615906 614509 614549 615258 615692 615200 613864 612582 612457 613727 615463 616790 618206 620970 625229 629558 632641
51337F32641K085K441M013O137Q089R129R227R557J1143J3255J4546J5485J7922
$$ 632641 634726 637167 641180 647317 655406 664535 673762 683319 694462 707717 722263 737748 755670
51324G55670K2106K6055K8568L0910L4417L8196M0784M2661M5119M7491M7662
$$ 755670 777776 803831 832399 863309 897726 935922 976706 1019367 1064486 1111977 1159639
51313A159639M5151M1767L8879L5733L1010K4713J7707J0324K305o412j5559k4802
$$ 1159639 1204790 1246557 1285436 1321169 1352179 1376892 1394599 1404923 1407228 1400816 1385257 1360455
51301A360455l3527m0610m5096m7198m8227m9284n0194m9976m8258m5711m2892
$$ 1360455 1326928 1286318 1241222 1194024 1145797 1096513 1046319 996343 948085 902374 859482
51290H59482l9244l3989k7757k2376j8938j6966j5649j4861j4413j3459j1511
$$ 859482 820238 786249 758492 736116 717178 700212 684563 669702 655289 641830 630319
51279F30319r274p621o488n690n860p292q591q028n878l880k752j903j449k432
$$ 630319 621045 613424 606936 601246 595386 588094 579503 571475 565597 561717 558965 557062 555613 553181
51265E53181m587n846n023l412k680k538j886j104j515l070m143l650k181r16
$$ 553181 548594 542748 537725 534313 531633 529095 527209 526105 524590 521520 517377 513727 511546 510630
51251E10630l40k67l97n16n13m73n75q19r99r37o70m83o27q32l22J180K641K626
$$ 510630 510290 510023 509626 509110 508597 508124 507549 506730 505731 504794 504124 503641 503014 502182 501860 503040 505681 508307
51233E08307J146k23j85J049K654M184N272N382M762M758O171P969Q583P883O787
$$ 508307 509453 509230 509045 510094 512748 516932 522204 527586 532348 537106 543277 551246 559829 567712 574499
51218E74499N498L484Q49j598l479m861n298m316k860k619l519l511j563O93J382
$$ 574499 579997 583481 584330 582732 579253 574392 569094 564778 561918 559299 555780 552269 550706 551399 552781
51203E52781J078J513K616K664J113o47j594k419l825m836m120k236j199j926
$$ 552781 553859 555372 557988 560652 561765 561118 559524 557105 553280 548444 544324 542088 540889 538963
51189E38963l268l784l466l151k990k310p71J028K050J614r0j819j990l56J271
$$ 538963 535695 531911 528445 525294 522304 519994 519223 520251 522301 523915 523825 522006 520016 519660 520931
51174E20931Q29j398l035k630j221m31k98K7N32P46J128K472M130M519L445K406
$$ 520931 521760 520362 517327 514697 513476 513045 512747 512774 513306 514052 515180 517652 521782 526301 529746 532152
51158E32152K328K422J908J344J383J461P99j43m16j05K7j20j59k84r94j922k159
$$ 532152 534480 536902 538810 540154 541537 542998 543797 543654 543238 543133 543160 543040 542881 542597 541603 539681 537522
51141E37522j642j042l69J028K909L926L524K766K534K090N24j220j247O94K729
$$ 537522 535880 534838 534469 535497 538406 542332 545856 548622 551156 553246 553770 552550 551303 551997 554726
51126E54726L070J723m5j038p16O39J913K054J342J086J694J811J12k624m182
$$ 554726 557796 559519 559474 558436 557720 558359 560272 562326 563668 564754 566448 568259 568371 565747 561565
51111E61565l429j405N5J22o67j116l39J434K896K979K152J869K658L492L304
$$ 561565 558136 556731 556786 556908 556241 555125 554786 556220 559116 562095 564247 566116 568774 572266 575570
51096E75570K369J709J719J922J732Q89m58j694k049j433o09j47K85J035J456
$$ 575570 577939 579648 581367 583289 585021 585910 585452 583758 581709 580276 579667 579520 579805 580840 582296
51081E82296P07q15j857k004k012k322k346j522k81O14J036J376J867K458K999
$$ 582296 583003 582188 580331 578327 576315 573993 571647 570125 569844 570458 571494 572870 574737 577195 580194
51066E80194L297L217K979K861K538J275r57l025l721k815r02J265K866L186K364
$$ 580194 583491 586708 589687 592548 595086 596361 595404 592379 588658 585843 584941 586206 589072 592258 594622
51051E94622J581J904L120M146M296L684K813K313K804M276N789O372O039N428
$$ 594622 596203 598107 601227 605373 609669 613353 616166 618479 621283 625559 631348 637720 643759 649187
51037F49187M703L609K469K248L373N054N987N433L659J844J415K808M701N204
$$ 649187 653890 657499 659968 662216 665589 670643 676630 682063 685722 687566 688981 691789 696490 701694
51023G01694L912K178J154M72p08k162k961k879k462j929r61M01J572K460L844
$$ 701694 705606 707784 708938 709410 708702 706540 703579 700700 698238 696309 695348 695749 697321 699781 703625
51008G03625O106Q216Q935Q660R140J1274J4087J6238J7486J7952J6895J3655
$$ 703625 709731 717947 726882 735542 744682 755956 770043 786281 803767 821719 838614 852269
50996H52269R554P354Q367J1160J3647J5288J6419J6585J5071J2669J1293J1540
$$ 852269 861823 869177 877544 888704 902351 917639 934058 950643 965714 978383 989676 1001216
50984A001216J1724R859N817J262j983l107k608j996k885n827j0033j4329j8058
$$ 1001216 1012940 1022799 1028616 1029878 1027895 1024788 1022180 1020184 1017299 1011472 1001439 987110 969052
50971I69052k0928k2554k2554k1030j8717j6625j5332j4282j1990p743l003k46
$$ 969052 948124 925570 903016 881986 863269 846644 831312 817030 805040 797297 794294 794048
50959G94048n4l75Q13L025M371M383M527O058Q639J1118J2706J3135J2599J1855
$$ 794048 793994 793619 794432 797457 801828 806211 810738 816796 825435 836553 849259 862394 874993 886848
50945H86848J1745J2320J3061J4112J6303J9523K2066K2572K1930K2148K3701
$$ 886848 898593 910913 923974 938086 954389 973912 995978 1018550 1040480 1062628 1086329
50934A086329K5217K5732K5906K6642K7501K7343K5882K3844K1915K0198J8582
$$ 1086329 1111546 1137278 1163184 1189826 1217327 1244670 1270552 1294396 1316311 1336509 1355091
50923A355091J7019J5469J3911J2462J1252J0444J0550J2360J5976K0303K4138
$$ 1355091 1372110 1387579 1401490 1413952 1425204 1435648 1446198 1458558 1474534 1494837 1518975
50912A518975K7585L1720L6941M2557M8012N3565N9372O4792O9194P2830P6350
$$ 1518975 1546560 1578280 1615221 1657778 1705790 1759355 1818727 1883519 1952713 2025543 2101893
50901B101893P9923Q3362Q6647Q9634R1702R2311R1574Q9573Q5570P8910P0508
$$ 2101893 2181816 2265178 2351825 2441459 2533161 2625472 2717046 2806619 2892189 2971099 3041607
50890C041607O2540N6370N1479M6559M1007L5150K9573K4583K0037J5471J0541
$$ 3041607 3104147 3160517 3211996 3258555 3299562 3334712 3364285 3388868 3408905 3424376 3434917
50879C434917N361K60m501q438j0864j1893j3145j6372k1341k6198l0096l4340
$$ 3434917 3440278 3440538 3436037 3427599 3416735 3404842 3391697 3375325 3353984 3327786 3297690 3263350
50867C263350m0373m7773n5042o1616o7960p4052p8925q1823q2996q3080q2265
$$ 3263350 3222977 3175204 3120162 3058546 2990586 2916534 2837609 2755786 2672790 2589710 2507445
50856B507445q0445p7793p4753p1397o7188o1740n5776n0871m7821m5602m2511
$$ 2507445 2427000 2349207 2274454 2203057 2135869 2074129 2018353 1967482 1919661 1874059 1831548
50845A831548l8194l3892l0674k8153k5285k1846j8776j7216j7418j8269j7869
$$ 1831548 1793354 1759462 1728788 1700635 1675350 1653504 1634728 1617512 1600094 1581825 1563956
50834A563956j5108j0908p439o000o025o096n354l852k209j093l69J215M577Q512
$$ 1563956 1548848 1537940 1530501 1524501 1518476 1512380 1507026 1503174 1500965 1499872 1499503 1500718 1505295 1513807
50820A513807J0520R848Q486Q607J0268J2476J5053J8089K0666K1921K2824K5216
$$ 1513807 1524327 1534175 1542661 1551268 1561536 1574012 1589065 1607154 1627820 1649741 1672565 1697781
50808A697781K9148L2779L4947L6602L9335M3575M8494N3058N6963O1085O6750
$$ 1697781 1726929 1759708 1794655 1831257 1870592 1914167 1962661 2015719 2072682 2133767 2200517
50797B200517P4017Q1235Q7160R2875J00364J09709J19336J28766J39209J51172
$$ 2200517 2274534 2355769 2442929 2535804 2636168 2745877 2865213 2993979 3133188 3284360
50787C284360J63223J73811J82815J90578J96718K00764K02972K03596K02135
$$ 3284360 3447583 3621394 3804209 3994787 4191505 4392269 4595241 4798837 5000972
50778E000972J97899J90594J79855J65220J47132J27110J06410Q5484O5096M6622
$$ 5000972 5198871 5389465 5569320 5734540 5881672 6008782 6115192 6200676 6265772 6312394
50768F312394L0525J5932K737p169j2077j2713j0999p657k689K594N943O194L343
$$ 6312394 6342919 6358851 6361588 6354419 6342342 6329629 6318630 6310973 6308284 6310878 6316821 6323015 6326358
50755F326358l003j3482k7610m4159o2856q3772j05178j24253j40380j55612j70909
$$ 6326358 6323355 6309873 6282263 6238104 6175248 6091476 5986298 5862045 5721665 5566053 5395144
50744E395144j83854j91506j93884j92924j89290j82225j71927j59972j47347
$$ 5395144 5211290 5019784 4825900 4632976 4443686 4261461 4089534 3929562 3782215
50735C782215j33744j19160j04772r1639p9571o7991n7082m7417l9081l1856k5947
$$ 3782215 3648471 3529311 3424539 3332900 3253329 3185338 3128256 3080839 3041758 3009902 2983955
50724B983955k1835j9609j8934j9515k0958k2324k2604k1878k1513k2717k5138
$$ 2983955 2962120 2942511 2923577 2904062 2883104 2860780 2838176 2816298 2794785 2772068 2746930
50713B746930k7358k8669k9949l2599l6888m1528m4884m6393m6735m6695m6222
$$ 2746930 2719572 2690903 2660954 2628355 2591467 2549939 2505055 2458662 2411927 2365232 2319010
50702B319010m4867m2869m1173m0206l9197l7101l3759k9769k5580k1375j7375
$$ 2319010 2274143 2231274 2190101 2149895 2110698 2073597 2039838 2010069 1984489 1963114 1945739
50691A945739j3569r300m065J349N488Q107J0543J3933J8058K2351K6990L2288
$$ 1945739 1932170 1922870 1918805 1920154 1925642 1933749 1944292 1958225 1976283 1998634 2025624 2057912
50679B057912L7859M3344M9308N6495O4636P2815Q0490Q7290R2465R5951R9509
$$ 2057912 2095771 2139115 2188423 2244918 2309554 2382369 2462859 2550149 2642614 2738565 2838074
50668B838074J05131J12045J16824J17100J14081J10700J08172J05228J00071
$$ 2838074 2943205 3055250 3172074 3289174 3403255 3513955 3622127 3727355 3827426
50659C827426R2048Q1616O9460N5949M1257K5955J1323j325j1543j9484k4773
$$ 3827426 3919474 4001090 4070550 4126499 4167756 4193711 4205034 4203709 4192166 4172682 4147909
50648D147909k6396k3960j8506j1792n332k21L034N077P273R917J1381R619L861
$$ 4147909 4121513 4097553 4079047 4067255 4061923 4061702 4064736 4069813 4077086 4087003 4098384 4108003 4111864
50635D111864n761j9216l5763n2663o6471p5965q2574q7624r0371q9438q5103
$$ 4111864 4106103 4086887 4051124 3998461 3931990 3856025 3773451 3685827 3595456 3506018 3420915
50624C420915p9023p2146o3867n3292m0815k8209j7236q025J130J1962K4239L6047
$$ 3420915 3341892 3269746 3205879 3152587 3111772 3083563 3066327 3058302 3059432 3071394 3095633 3131680
50612C131680M5984N4166O0888O5479O7285O6901O5296O2416N7890N2671M8326
$$ 3131680 3177664 3231830 3292718 3358197 3425482 3492383 3557679 3620095 3677985 3730656 3778982
50601C778982M4839M0722L5732L1882L0868L1698L2020L0946K9352K8053K6940
$$ 3778982 3823821 3864543 3900275 3932157 3963025 3994723 4026743 4057689 4087041 4115094 4142034
50590D142034K5892K5367K5888K7621L0584L4654L9303M3823M7889N1597N5094
$$ 4142034 4167926 4193293 4219181 4246802 4277386 4312040 4351343 4395166 4443055 4494652 4549746
50579D549746N8422O1426O3227O2379N8285N2274M6293M0683L4231K6378J8277
$$ 4549746 4608168 4669594 4732821 4795200 4853485 4905759 4952052 4992735 5026966 5053344 5071621
50568E071621J1035L651o762k2713m3997o6941q6057r7458j00925r8418r1180
$$ 5071621 5082656 5086307 5079545 5056832 5012835 4945894 4859837 4762379 4661454 4563036 4471856
50557D471856p9587o5356n1752m0598l0603j9758q396J166P070Q817O553Q99o877
$$ 4471856 4392269 4326913 4275161 4234563 4203960 4184202 4175806 4176972 4184042 4192859 4199412 4200311 4193434
50544D193434j5795k6214l8925n3384o7685q0229r0530r8591j04417j08183j10122
$$ 4193434 4177639 4151425 4112500 4059116 3991431 3911202 3820672 3722081 3617664 3509481 3399359
50533C399359j10144j08110j04429r9809r4583q8766q2459p5631o7986n9774n2334
$$ 3399359 3289215 3181105 3076676 2976867 2882284 2793518 2711059 2635428 2567442 2507668 2455334
50522B455334m6694m2017l6570l0106k4112j9608j5983j2259q359m611j018K321
$$ 2455334 2408640 2366623 2330053 2299947 2275835 2256227 2240244 2227985 2219626 2215015 2213997 2216318
50510B216318M778N967O659Q284J1622J6148K0637K4477K8456L3904M0861M7757
$$ 2216318 2221096 2227063 2233722 2242006 2253628 2269776 2290413 2314890 2343346 2377250 2418111 2465868
50498B465868N3419N8588O4444P0479P5447P9793Q5129R1109R5090R5641R4543
$$ 2465868 2519287 2577875 2642319 2712798 2788245 2868038 2953167 3044276 3139366 3235007 3329550
50487C329550R4030R3724R2012Q9341Q8223R0296R4968J00868J07337J14236J21537
$$ 3329550 3423580 3517304 3609316 3698657 3786880 3877176 3972144 4073012 4180349 4294585 4416122
50476D416122J29453J38297J47873J57535J66998J76586J86450J95907K03908
$$ 4416122 4545575 4683872 4831745 4989280 5156278 5332864 5519314 5715221 5919129
50467E919129K09925K14210K17189K18709K18002K14365K07544J97269J82766
$$ 5919129 6129054 6343264 6560453 6779162 6997164 7211529 7419073 7616342 7799108
50458G799108J63376J39490J12223Q2196M9399J4392k1217n5752q8345j18420
$$ 7799108 7962484 8101974 8214197 8296393 8345792 8360184 8338967 8283215 8194870 8076450
50448H076450j45063j67211j84003j94582j98279j95324j86753j73283j55096
$$ 8076450 7931387 7764176 7580173 7385591 7187312 6991988 6805235 6631952 6476856
50439F476856j33041j08987q4277n8796l2624p776J2800K7492L6135L8312L2861
$$ 6476856 6343815 6234828 6150551 6091755 6059131 6051355 6064155 6091647 6127782 6166094 6198955
50428F198955J9134k317l0106o2031r4694j24488j49654j70519j87336j98831
$$ 6198955 6218089 6215772 6185666 6123635 6028941 5904453 5754799 5584280 5396944 5198113
50418E198113k03813k03466k00788j97605j93195j86236j77263j68213j59913
$$ 5198113 4994300 4790834 4590046 4392441 4199246 4013010 3835747 3667534 3507621
50409C507621j51246j41124j30180j19811j10416j01562r3222q5625p8281p0531
$$ 3507621 3356375 3215251 3085071 2965260 2854844 2753282 2660060 2574435 2496154 2425623
50399B425623o2873n6314n0490m4063l7114l1369k7528k4219k0416j7015j4738
$$ 2425623 2362750 2306436 2255946 2211883 2174769 2143400 2115872 2091653 2071237 2054222 2039484
50388B039484j2345q607m571j829L21L648P635R818R475Q788R882J2542J5434
$$ 2039484 2027139 2018532 2013961 2012132 2012453 2016101 2023736 2033554 2043029 2051817 2061699 2074241 2089675
50375B089675J8051K0719K3750K7342L1545L5871L9568M2506M5235M8115N1130
$$ 2089675 2107726 2128445 2152195 2179537 2211082 2246953 2286521 2329027 2374262 2422377 2473507
50364B473507N4506N8612O3173O7488P1501P5874Q1045Q6920R3478J00765J08291
$$ 2473507 2528013 2586625 2649798 2717286 2788787 2864661 2945706 3032626 3126104 3226869 3335160
50353C335160J15264J21294J26112J29030J29711J29160J28480J26828J22105
$$ 3335160 3450424 3571718 3697830 3826860 3956571 4085731 4214211 4341039 4463144
50344D463144J13721J03131R1428P8037O2288M4712K6078O505j3772l3991n3907
$$ 4463144 4576865 4679996 4771424 4849461 4911749 4956461 4982539 4989044 4975272 4941281 4887374
50333D887374p3859r2996j08704j19009j24523j26979j26715j22714j14395j02362
$$ 4887374 4813515 4720519 4611815 4492806 4368283 4241304 4114589 3991875 3877480 3775118
50323C775118q7953p2853n8491m4950l1171j6995m225N236J1311J4775J5184J1263
$$ 3775118 3687165 3614312 3555821 3510871 3479700 3462705 3458480 3463716 3475027 3489802 3504986 3516249
50311C516249K976q193k0884l4655m9146o3378p6018q5795r1929r4739r5610r5659
$$ 3516249 3519225 3511032 3490148 3455493 3406347 3342969 3266951 3181156 3089227 2994488 2898878 2803219
50299B803219r4823r2782r0148q7780q5312q1624p6577p1320o6684o2218n6921
$$ 2803219 2708396 2615614 2525466 2437686 2352374 2270750 2194173 2122853 2056169 1993951 1937030
50288A937030n0428m3417l7329l3408l1446k9673k6634k2824j9735j7761j6035
$$ 1937030 1886602 1843185 1805856 1772448 1741002 1711329 1684695 1661871 1642136 1624375 1608340
50277A608340j4126j2556j1520j0343q584o750n374m162k631j020L9M14O26J323
$$ 1608340 1594214 1581658 1570138 1559795 1551211 1544461 1539087 1534925 1532294 1531274 1531313 1531727 1532353 1533676
50263A533676K902N396Q491J1710J4659J7099J8952K0496K2184K3891K4531K3112
$$ 1533676 1536578 1541974 1550465 1562175 1576834 1593933 1612885 1633381 1655565 1679456 1703987 1727099
50251A727099K0113J7208J5564J4957J4636J4367J4280J4209J3693J2639J1613
$$ 1727099 1747212 1764420 1779984 1794941 1809577 1823944 1838224 1852433 1866126 1878765 1890378
50240A890378J1341J1757J1685R934O814L972K313Q47j678m695o563o955p123
$$ 1890378 1901719 1913476 1925161 1935095 1941909 1945881 1948194 1949041 1947363 1942668 1936105 1929150 1922027
50227A922027p767q184p842p314o907n660k761J025M453P556J1162J5408K0049
$$ 1922027 1914260 1906076 1898234 1890920 1884013 1878353 1875592 1876617 1881070 1888626 1899788 1915196 1935245
50214A935245K5547L1863L6215L4140K3959Q974n624j6966k4728k8694k8309k4569
$$ 1935245 1960792 1992655 2028870 2063010 2086969 2095943 2090319 2073353 2048625 2019931 1991622 1967053
50202A967053k0226j7210j4924j1985q559n913m363l043j614q63j295k117k278
$$ 1967053 1946827 1929617 1914693 1902708 1894149 1888236 1883873 1880830 1879216 1878353 1877058 1874941 1872663
50189A872663j835j750k591m039n354n928n500m158k065R37N172J0350J5381J9473
$$ 1872663 1870828 1869078 1866487 1862448 1857094 1851166 1845666 1841508 1839443 1840380 1845552 1855902 1871283 1890756
50175A890756K3105K7411L2763L8536M4261N0298N7085O4103O9961P3385P4010
$$ 1890756 1913861 1941272 1974035 2012571 2056832 2107130 2164215 2228318 2298279 2371664 2445674
50164B445674P2379O9331O5218N9636N2245M4118L7711L4697L3810L1678K6190
$$ 2445674 2518053 2587384 2652602 2712238 2764483 2808601 2846312 2881009 2914819 2946497 2972687
50153B972687J8196R271j239j5298l2640n0042o4789p7101q7930r5996r9054r7298
$$ 2972687 2990883 3000154 2998915 2983617 2950977 2900935 2836146 2759045 2671115 2575119 2476065 2378767
50141B378767r3279q8544q2509p4970o7534o1577n6462n1061m5933m2693m1994
$$ 2378767 2285488 2196944 2114435 2039465 1971931 1910354 1853892 1802831 1756898 1714205 1672211
50130A672211m3097m4699m5463m4483m2133l9688l7498l4518l0444k6841k4950
$$ 1672211 1629114 1584415 1538952 1494469 1452336 1412648 1375150 1340632 1310188 1283347 1258397
50119A258397k3636k1212j8126j5883j4137j1224p339m717m344m608l882k525
$$ 1258397 1234761 1213549 1195423 1179540 1165403 1154179 1146840 1142123 1137779 1133171 1129289 1126764
50107A126764j482m32J411L872O141P701Q217P490O381O832R952J4626J8810K1560
$$ 1126764 1125282 1124850 1126261 1130133 1136274 1143975 1152192 1159682 1166063 1172895 1182847 1197473 1216283 1237843
50093A237843K3110K3694K3358K2599K2153K2232K2539K2798K2788K2118K0570
$$ 1237843 1260953 1284647 1308005 1330604 1352757 1374989 1397528 1420326 1443114 1465232 1485802
50082A485802J8609J7049J6294J6222J6605J7431J8901K1245K4282K7186K9094
$$ 1485802 1504411 1521460 1537754 1553976 1570581 1588012 1606913 1628158 1652440 1679626 1708720
50071A708720L0053L0864L1938L2988L3957L5428L7750M0555M3650M7614N2866
$$ 1708720 1738773 1769637 1801575 1834563 1868520 1903948 1941698 1982253 2025903 2073517 2126383
50060B126383N8919O5390P2967Q2499R3494J04595J15257J25998J37075J47884
$$ 2126383 2185302 2250692 2323659 2406158 2499652 2604247 2719504 2845502 2982577 3130461
50050C130461J57692J66010J71943J74015J71181J63740J53154J41332J30231
$$ 3130461 3288153 3454163 3626106 3800121 3971302 4135042 4288196 4429528 4559759
50041D559759J21488J15776J12084J07690R9074Q3592O0851L2506P31l2795o6308
$$ 4559759 4681247 4797023 4909107 5016797 5115871 5199463 5260314 5292820 5293551 5260756 5194448
$$ [...]
##END NTUPLES=NMR SPECTRUM
##END=
