
##TITLE=AC1231_PUEHDE124_6075312_jV922I8Z65
##JCAMPDX= 6.0         $$ Bruker NMR JCAMP-DX V2.0
##DATA TYPE= NMR SPECTRUM
##DATA CLASS= NTUPLES
##ORIGIN= BRUKER
##OWNER= Administrator
$$ 1.72 TOPSPIN		Version 2.1
$$ 2012-05-08 23:17:15.046 -0500  Administrator@TOPSPIN
$$ Compression mode = diff/dup
##.OBSERVE FREQUENCY= 400.13188235
##.OBSERVE NUCLEUS= ^1H
##.ACQUISITION MODE= SIMULTANEOUS (DQD)
##.ACQUISITION SCHEME= undefined
##.AVERAGES= 64
##.DIGITISER RES= 22
##SPECTROMETER/DATA SYSTEM= spect
##.PULSE SEQUENCE= noesygpps1d.comp
##.SOLVENT NAME= COFFEE_meoh
##.SHIFT REFERENCE= INTERNAL, COFFEE_meoh, 1, 14.96692
##AUDIT TRAIL= $$ (NUMBER, WHEN, WHO, WHERE, PROCESS, VERSION, WHAT)
$$ ##TITLE= Audit trail, TOPSPIN		Version 2.1
$$ ##JCAMPDX= 5.01
$$ ##ORIGIN= Bruker BioSpin GmbH
$$ ##OWNER= Administrator
$$ $$ C:\Bruker\TOPSPIN/data/COFFEE/nmr/AC1231_PUEHDE124_6075312_jV922I8Z65/22/pdata/1/auditp.txt
$$ ##AUDIT TRAIL=  $$ (NUMBER, WHEN, WHO, WHERE, PROCESS, VERSION, WHAT)
(   1,<2012-05-08 23:17:10.156 -0500>,<Administrator>,<TOPSPIN>,<go>,<TOPSPIN 2.1>,
      <created by zg
	started at 2012-05-08 23:05:39.921 -0500,
	POWCHK enabled, PULCHK disabled,
       configuration hash MD5:
       AF F2 23 6B 01 CD 40 DD E5 A1 38 A0 06 EA F7 77
       data hash MD5: 64K
       AE 8C D1 02 1A 62 35 02 97 F6 0A 91 B0 F8 AB C6>)
(   2,<2012-05-08 23:17:13.031 -0500>,<Administrator>,<TOPSPIN>,<proc1d>,<TOPSPIN 2.1>,
      <Start of raw data processing
       efp LB = 0.3 FT_mod = 6 PKNL = 1 PHC0 = 0 PHC1 = 0 SI = 128K 
       data hash MD5: 128K
       7A C1 31 CB 08 0C 1E 47 C2 2F 8B 71 ED 4F D0 A7>)
(   3,<2012-05-08 23:17:14.171 -0500>,<Administrator>,<TOPSPIN>,<proc1d>,<TOPSPIN 2.1>,
      <pk PHC0 = 32.57446 PHC1 = 0 
       data hash MD5: 128K
       36 B0 74 0E 56 BC F5 9B 09 E5 65 5D F2 54 61 F9>)
(   4,<2012-05-08 23:17:14.734 -0500>,<Administrator>,<TOPSPIN>,<proc1d>,<TOPSPIN 2.1>,
      <abs ABSG = 1 
       data hash MD5: 128K
       EE 0D 02 BE DE 4A 51 AE 4A 33 04 C0 32 83 29 6D>)
(   5,<2012-05-08 23:17:14.812 -0500>,<Administrator>,<TOPSPIN>,<proc1d>,<TOPSPIN 2.1>,
      <abs ABSG = 2 
       data hash MD5: 128K
       56 9A 78 67 F1 76 56 81 37 33 4F C5 10 26 BD 37>)
(   6,<2012-05-08 23:17:14.859 -0500>,<Administrator>,<TOPSPIN>,<proc1d>,<TOPSPIN 2.1>,
      <abs ABSG = 3 
       data hash MD5: 128K
       50 11 3E AC D4 E0 E2 4E 85 7A DF E7 03 00 C6 33>)
(   7,<2012-05-08 23:17:14.921 -0500>,<Administrator>,<TOPSPIN>,<proc1d>,<TOPSPIN 2.1>,
      <abs ABSG = 4 
       data hash MD5: 128K
       22 13 59 75 20 49 47 21 F9 66 E4 EA E5 EB 70 19>)
(   8,<2012-05-08 23:17:14.968 -0500>,<Administrator>,<TOPSPIN>,<proc1d>,<TOPSPIN 2.1>,
      <abs ABSG = 5 
       data hash MD5: 128K
       97 B1 85 A2 E3 66 61 C9 B6 82 E8 6E 27 C0 FF B6>)
$$ ##END=
$$ 
$$ $$ hash MD5
$$ $$ 62 A8 90 B7 AB B2 93 9A 40 DB F4 14 5F AD D7 CC
##$RELAX= 
##$RELAX= 
##$RELAX= 
##$RELAX= 
##$RELAX= 
##$RELAX= 
##$RELAX= 
##$RELAX= 
$$ Bruker specific parameters
$$ [...]
##$TP07= 0
##$TPNAME0= <>
##$TPNAME1= <>
##$TPNAME2= <>
##$TPNAME3= <>
##$TPNAME4= <>
##$TPNAME5= <>
##$TPNAME6= <>
##$TPNAME7= <>
##$TPOAL= (0..7)
0.5 0.5 0.5 0.5 0.5 0.5 0.5 0.5
##$TPOFFS= (0..7)
0 0 0 0 0 0 0 0
##$TUNHIN= 0
##$TUNHOUT= 0
##$TUNXOUT= 0
##$USERA1= <user>
##$USERA2= <user>
##$USERA3= <user>
##$USERA4= <user>
##$USERA5= <user>
##$V9= 5
##$VALIST= <valist>
##$VCLIST= <CCCCCCCCCCCCCCC>
##$VD= 0
##$VDLIST= <DDDDDDDDDDDDDDD>
##$VPLIST= <PPPPPPPPPPPPPPP>
##$VTLIST= <TTTTTTTTTTTTTTT>
##$WBST= 1024
##$WBSW= 4
##$XGAIN= (0..3)
0 0 0 0
##$XL= 0
##$YL= 0
##$YMAX_a= 11926613
##$YMIN_a= -6289427
##$ZGOPTNS= <>
##$ZL1= 120
##$ZL2= 120
##$ZL3= 120
##$ZL4= 120
##$ABSF1= 14.96692
##$ABSF2= -5.58561
##$ABSG= 5
##$ABSL= 3
##$ALPHA= 0
##$AQORDER= 0
##$ASSFAC= 0
##$ASSFACI= 0
##$ASSFACX= 0
##$ASSWID= 0
##$AUNMP= <proc_prof1d_extract.lims>
##$AXLEFT= 0
##$AXNAME= <>
##$AXNUC= <1H>
##$AXRIGHT= 0
##$AXTYPE= 0
##$AXUNIT= <>
##$AZFE= 0.1
##$AZFW= 0.1
##$BCFW= 0
##$BC_mod= 0
##$BYTORDP= 0
##$COROFFS= 0
##$CY= 15
##$DATMOD= 1
##$DC= 0
##$DFILT= <>
##$DTYPP= 0
##$F1P= 0
##$F2P= 0
##$FCOR= 0.5
##$FTSIZE= 131072
##$FT_mod= 6
##$GAMMA= 0
##$GB= 0
##$INTBC= 1
##$INTSCL= 1
##$ISEN= 128
##$LB= 0.3
##$LEV0= 0
##$LPBIN= 0
##$MAXI= 10000
##$MC2= 0
##$MEAN= 0
##$ME_mod= 0
##$MI= 0
##$NCOEF= 0
##$NC_proc= -3
##$NLEV= 6
##$NOISF1= 0
##$NOISF2= 0
##$NSP= 0
##$NTH_PI= 0
##$NZP= 0
##$OFFSET= 14.96692
##$PC= 1
##$PHC0= 32.57446
##$PHC1= 0
##$PH_mod= 1
##$PKNL= yes
##$PPARMOD= 0
##$PPDIAG= 0
##$PPIPTYP= 0
##$PPMPNUM= 2147483647
##$PPRESOL= 1
##$PSCAL= 4
##$PSIGN= 0
##$PYNMP= <proc.py>
##$REVERSE= no
##$SF= 400.130005479238
##$SI= 131072
##$SIGF1= 0
##$SIGF2= 0
##$SINO= 400
##$SIOLD= 131072
##$SPECTYP= <>
##$SREGLST= <1H.CDCl3>
##$SSB= 0
##$STSI= 131072
##$STSR= 0
##$SW_p= 8223.68421052632
##$SYMM= 0
##$S_DEV= 0
##$TDeff= 65536
##$TDoff= 0
##$TI= <>
##$TILT= no
##$TM1= 0
##$TM2= 0
##$TOPLEV= 0
##$USERP1= <user>
##$USERP2= <user>
##$USERP3= <user>
##$USERP4= <user>
##$USERP5= <user>
##$WDW= 1
##$XDIM= 131072
##$YMAX_p= 347539826
##$YMIN_p= -16424943
##$CURPLOT= <Network HP LaserJet P1505>
##$CURPRIN= <$Network HP LaserJet P1505>
##$DFORMAT= <normdp>
##$LAYOUT= <+/1D_H.xwp>
##$LFORMAT= <normlp>
##$PFORMAT= <normpl>
##$SURQMSG= 1
$$ End of Bruker specific parameters
$$ ---------------------------------
##NTUPLES= NMR SPECTRUM
##VAR_NAME=  FREQUENCY,     SPECTRUM/REAL,   SPECTRUM/IMAG
##SYMBOL=    X,             R,               I
##VAR_TYPE=  INDEPENDENT,   DEPENDENT,       DEPENDENT
##VAR_FORM=  AFFN,          ASDF,            ASDF
##VAR_DIM=   131072,        131072,          131072
##UNITS=     HZ,            ARBITRARY UNITS, ARBITRARY UNITS
##FACTOR=    0.0627417313425165, 1,          1
##FIRST=     8223.62146879498, 5050,         -111848
##LAST=      0,             7593,            -112597
##MIN=       0,             -16424943,       0
##MAX=       8223.62146879498, 347539826,    0
$$ Real data points
##PAGE= N=1
##DATA TABLE= (X++(R..R)), XYDATA
$$ [...]
63325I39905k0460j7673j4607j1795r785q071n635k303J285M794Q260J1267J3321
$$ 939905 919445 901772 887165 875370 865585 857514 851879 849576 850861 855655 863915 875182 888503
63312H88503J4939J7129J9802K1980K3578K5548K8120L0296L1596L2867L4838
$$ 888503 903442 920571 940373 962353 985931 1011479 1039599 1069895 1101491 1134358 1169196
63301A169196L7167L9385M1443M2724M2033L9399L6464L4005L0436K4013J5379
$$ 1169196 1206363 1245748 1287191 1329915 1371948 1411347 1447811 1481816 1512252 1536265 1551644
63290A551644O673q76p071j1608j4355j6105j7564j8309j8293j9341k3154k8307
$$ 1551644 1558317 1557441 1550370 1538762 1524407 1508302 1490738 1472429 1454136 1434795 1411641 1383334
63278A383334l1606l2491l3809l7599m2132m4385m3922m2794m2406m1928l9716
$$ 1383334 1351728 1319237 1285428 1247829 1205697 1161312 1117390 1074596 1032190 990262 950546
63267I50546l5351l0082k5693k3127k1973k1157j9908j8050j5759j3580j2353
$$ 950546 915195 885113 859420 836293 814320 793163 773255 755205 739446 725866 713513
63256G13513j2471j3183j3242j2298j1174j0664j0521r896q486o983o311o530
$$ 713513 701042 687859 674617 662319 651145 640481 629960 620064 611578 604595 598284 591754
63244E91754o745o376o125o950q246q187o197l845k644k120j067L44J025Q11L73
$$ 591754 585009 578633 572508 565558 557312 549125 542928 539083 536439 534319 533252 533596 534621 535432 535805
63229E35805k20j451l072m148m341l993l111j533P7O68L03QJ23J3m47l72P37K117
$$ 535805 535585 534134 531062 526914 522573 518580 515469 513936 514013 514681 514984 514992 515115 515128 514681 514309 515046 517163
63211E17163K675K096R48L50J423M076O619P535P396P822Q951R567R479R900J1299
$$ 517163 519838 521934 522882 523232 524655 528731 535350 542885 550281 558103 567054 576621 586100 596000 607299
63196F07299J2849J4391J6874K0112K2052K1479J9871J9428K0673K3052K6296
$$ 607299 620148 634539 651413 671525 693577 715056 734927 754355 775028 798080 824376
63185H24376K9777L1996L2383L2559L4153L6419L7703L8374M0250M3448M5885
$$ 824376 854153 886149 918532 951091 985244 1021663 1059366 1097740 1137990 1181438 1227323
63174A227323M6086M4845M3807M3612M3867M3932M3359M2212M1207M0991M1290
$$ 1227323 1273409 1318254 1362061 1405673 1449540 1493472 1536831 1579043 1620250 1661241 1702531
63163A702531M1175M0093L8087L5188L1185K5927J9473J2136M661k216q700j5830
$$ 1702531 1743706 1783799 1821886 1857074 1888259 1914186 1933659 1945795 1950456 1948240 1939540 1923710
63151A923710k3950l2054l9090m4851m8739m9058m5208l9695l5860l3887l0971
$$ 1923710 1899760 1867706 1828616 1783765 1735026 1685968 1640760 1601065 1565205 1531318 1500347
63140A500347k5506j9081j3784r378m323J731P766J2960J7306K0968K4026K6794
$$ 1500347 1474841 1455760 1441976 1432598 1428275 1430006 1437772 1450732 1468038 1489006 1513032 1539826
63128A539826K9722L2804L5382L6689L6636L6059L6020L6678L7066L6314L4745
$$ 1539826 1569548 1602352 1637734 1674423 1711059 1747118 1783138 1819816 1856882 1893196 1927941
63117A927941L3275L2113L0743K8847K6305K2390J6130P795j034r340j7746k7041
$$ 1927941 1961216 1993329 2024072 2052919 2079224 2101614 2117744 2125539 2124505 2115165 2097419 2070378
63105B070378l6427m4243n0059n5038o0053o4270o6037o4733o1235n6798n2104
$$ 2070378 2033951 1989708 1939649 1884611 1824558 1760288 1694251 1629518 1568283 1511485 1459381
63094A459381m7608m4058m1942m0607l8727l5836l2686k9820k6706k2862j9126
$$ 1459381 1411773 1367715 1325773 1285166 1246439 1210603 1177917 1148097 1121391 1098529 1079403
63083A079403j6792j5864j5065j3475j1389r596q558q222q135p744p037o607o556
$$ 1079403 1062611 1046747 1031682 1018207 1006818 997222 988664 980442 972307 964563 957526 950919 944363
63070I44363n939m170k465k518l990m746l772k265j460r76j98K02m70j185l91
$$ 944363 938424 934254 931789 929271 925281 920535 916763 914498 913038 912062 911864 912066 911596 910411 910020
63055I10020J543K732K590K641L951N186M326J632l05M19K962M983N361M958N049
$$ 910020 911563 914295 916885 919526 923477 928663 932989 934621 934316 934735 937697 942680 948041 952999 958048
63040I58048N878O954Q022R141J0170J0794J0931J0749J0446J0361J0998J2339
$$ 958048 963926 970880 978902 988043 998213 1009007 1019938 1030687 1041133 1051494 1062492 1074831
63028A074831J3532J3906J4108J5321J7523J9353J9890J9620J9458J9716K0290
$$ 1074831 1088363 1102269 1116377 1131698 1149221 1168574 1188464 1208084 1227542 1247258 1267548
63017A267548K1135K2076K2890K3911K5788K8312L0364L1565L3074L5971L9732
$$ 1267548 1288683 1310759 1333649 1357560 1383348 1411660 1442024 1473589 1506663 1542634 1582366
63006A582366M3229M6430M9953N3549N6449N9061O2847O8262P3894P8114Q0745
$$ 1582366 1625595 1672025 1721978 1775527 1831976 1891037 1953884 2022146 2096040 2174154 2254899
62995B254899Q2660Q4519Q6428Q8319R0060R1344R1832R1361Q9993Q8125Q6618
$$ 2254899 2337559 2422078 2508506 2596825 2686885 2778229 2870061 2961422 3051415 3139540 3226158
62984C226158Q6357Q7529Q9375R0712R0444Q7910Q3178P6952O9566O0135M7434
$$ 3226158 3312515 3400044 3489419 3580131 3670575 3758485 3841663 3918615 3988181 4048316 4095750
62973D095750L1668J4560k653k0312l8814n6796p1971q3472r2380r9746j04943
$$ 4095750 4127418 4141978 4139325 4119013 4080199 4023403 3951432 3867960 3775580 3675834 3570891
62962C570891j06425j03647r7756r0436q2441p3408o3061n2048m1241l0474j8893
$$ 3570891 3464466 3360819 3263063 3172627 3090186 3016778 2953717 2901669 2860428 2829954 2811061
62951B811061o712M383J3259K0930K9168L8000M5716N1181N4931N7957O0591O2816
$$ 2811061 2804349 2808732 2821991 2842921 2872089 2910089 2955805 3006986 3061917 3119874 3180465 3243281
62939C243281O4549O5216O4095O1653N9461N8099N6045N1565M4701L6360K6327
$$ 3243281 3307830 3373046 3437141 3498794 3558255 3616354 3672399 3723964 3768665 3805025 3831352
62928C831352J3722j050j6404l1634m7436o4170q0865r6358j10173j21773j30097
$$ 3831352 3845074 3844024 3827620 3795986 3748550 3684380 3603515 3507157 3396984 3275211 3145114
62917C145114j34700j36589j37039j36088j33072j28173j22518j16757j10344
$$ 3145114 3010414 2873825 2736786 2600698 2467626 2339453 2216935 2100178 1989834
62908A989834j02569r3841q5556p8715p2965o7263o1408n6388n2998n0691m8449
$$ 1989834 1887265 1793424 1707868 1629153 1556188 1488925 1427517 1371129 1318131 1267440 1218991
62897A218991m6246m4677m3350m0911l6831l2202k8372k5750k4247k3889k4238
$$ 1218991 1172745 1128068 1084718 1043807 1006976 974774 946402 920652 896405 872516 848278
62886H48278k4144k2833k0693j8395j5971j3467j1791j1925j3557j5276j5844
$$ 848278 824134 801301 780608 762213 746242 732775 720984 709059 695502 680226 664382
62875F64382j4869j2762j0567r320q894q130o712o011p101q765q805o870m610
$$ 664382 649513 636751 626184 616864 607970 599840 593128 587117 580016 571251 562446 555576 550966
62862E50966l346l001l175l751m234l874k891k409k744k823j920r33j186k688
$$ 550966 547620 544619 541444 537693 533459 529585 526694 524285 521541 518718 516798 515865 514679 511991
62848E11991m313n213n295m695l486j947n69K74O19Q25J169J404R85j22j137j399
$$ 511991 507678 502465 497170 492475 488989 487042 486473 486747 487366 488191 489360 490764 491749 491627 490490 489091
62832D89091j265j446j837j770j308j353k369l719m448m121k858j275m24r91k288
$$ 489091 487826 486380 484543 482773 481465 480112 477743 474024 469576 465455 462597 461322 460898 459907 457619
62817D57619k769j819m10K16r2n53m14M57J366J123p45l039l912k993j713j366
$$ 457619 454850 453031 452621 452837 452745 452192 451778 452235 453601 454724 453979 450940 447028 444035 442322 440956
62801D40956j690j690r26L89J774K502K056J093J116K547L863L471J866J045J997
$$ 440956 439266 437576 436650 437039 438813 441315 443371 444464 445580 448127 451990 455461 457327 458372 460369
62786D60369L540L742K023k40j109r0J481K298K743L848N167N106L522K303K786
$$ 460369 463909 467651 469674 469434 468325 468235 469716 472014 474757 478605 483772 488878 492400 494703 497489
62771D97489M019M556M671N518P058Q216Q512Q303P868P427P743R425J1709J3049
$$ 497489 501508 506064 510735 516253 523311 531527 540039 548342 556210 563637 571380 580805 592514 605563
62757F05563J2926J2283J2213J3026J4566J6567J8616K0358K1860K3330K4631
$$ 605563 618489 630772 642985 656011 670577 687144 705760 726118 747978 771308 795939
62746G95939K5538K6352K7733K9953L2662L5174L6861L7761L9035M2139M7077
$$ 795939 821477 847829 875562 905515 938177 973351 1010212 1047973 1087008 1129147 1176224
62735A176224N2231N6485O0508O5230P0241P4969Q0405Q7939R7029J05871J14007
$$ 1176224 1228455 1284940 1345448 1410678 1480919 1555888 1636293 1724232 1821261 1927132 2041139
62724B041139J22392J30858J37538J41330J43173J44119J43557J40168J33479
$$ 2041139 2163531 2294389 2431927 2573257 2716430 2860549 3004106 3144274 3277753
62715C277753J23572J10329R3865P4901N3823L0256M445k1646m5574o6312q4176
$$ 3277753 3401325 3511654 3605519 3680420 3734243 3764499 3768944 3747298 3701724 3635412 3551236
62704C551236r9405j11781j21340j28585j33878j37137j38058j36377j32203j26441
$$ 3551236 3451831 3340050 3218710 3090125 2956247 2819110 2681052 2544675 2412472 2286031
62694B286031j20505j15094j09523j02734r4752q6692p9523p3237o7278o1390
$$ 2286031 2165526 2050432 1940909 1838175 1743423 1656731 1577208 1503971 1436693 1375303
62684A375303n5918n1201m6727m1353l4843k8738k4781k2521j9767j5591j1522
$$ 1375303 1319385 1268184 1221457 1180104 1145261 1116523 1091742 1069221 1049454 1033863 1022341
62673A022341r113p673n577k659R4K476M958P130Q128Q725J1068J5785K0879K4368
$$ 1022341 1013228 1005555 999978 997319 997413 999889 1004847 1011977 1020105 1028830 1039898 1055683 1076562 1100930
62659A100930K6622K9074L1860L4277L6756M0595M5925N1526N6798O2470O8947
$$ 1100930 1127552 1156626 1188486 1222763 1259519 1300114 1346039 1397565 1454363 1516833 1585780
62648A585780P5473Q1731Q8936R7946J07231J14362J19238J24100J30083J35337
$$ 1585780 1661253 1742984 1831920 1929866 2037097 2151459 2270697 2394797 2524880 2660217
62638B660217J37311J35649J31607J25496J16159J02706Q5512O5357M2867J9130
$$ 2660217 2797528 2933177 3064784 3190280 3306439 3409145 3494657 3560014 3602881 3622011
62628C622011m178k6067m7120o8282q9016j07264j21307j31209j38234j43143
$$ 3622011 3617833 3591766 3544646 3476364 3387348 3280084 3158777 3027568 2889334 2746191
62618B746191j45425j44241j39771j33309j26101j18652j11316j04751r9144r3493
$$ 2746191 2600766 2456525 2316754 2183445 2057344 1938692 1827376 1722625 1623481 1529988
62608A529988q6621p8856p1745o6031o0855n5299m9721m4983m1209l8063l5601
$$ 1529988 1443367 1364511 1292766 1226735 1165880 1110581 1060860 1015877 974668 936605 901004
62597I01004l3885l2091k9136k5151k1492j9063j7389j5588j3649j2235j1647
$$ 901004 867119 835028 805892 780741 759249 740186 722797 707209 693560 681325 669678
62586F69678j1362j0541q868o993o191p103q715r028p099m064j777p80k21M73
$$ 669678 658316 647775 638907 631914 625723 618620 609905 600877 593778 589714 587937 587157 586936 587409
62572E87409P40Oj050j079L18K165L291L436L069K759L091M707P718J1070J3130
$$ 587409 588149 588155 587105 586026 586344 588509 591800 595236 598305 601064 604155 608862 616580 627650 640780
62557F40780J3209J2249J1834J2860J5186J8229K1306K3642K4735K5037K5936
$$ 640780 653989 666238 678072 690932 706118 724347 745653 769295 794030 819067 845003
62546H45003K8646L3160L8396M3244M7283N0728N4147N8240O3224O8161P1312
$$ 845003 873649 906809 945205 988449 1035732 1086460 1140607 1198847 1262071 1330232 1401544
62535A401544P1573O9489O6429O3025N8785N2927M4930L4421K1397O934o987j8913
$$ 1401544 1473117 1542606 1609035 1672060 1730845 1783772 1828702 1863123 1884520 1891454 1884467 1865554
62523A865554k8916l7902m6268n3592n9214o2739o4264o4515o4476o4426o3597
$$ 1865554 1836638 1798736 1752468 1698876 1639662 1576923 1512659 1448144 1383668 1319242 1255645
62512A255645o1313n8121n5274n3150n0869m7412m2715l7528l2785k9151k6752
$$ 1255645 1194332 1136211 1080937 1027787 976918 929506 886791 849263 816478 787327 760575
62501G60575k5058k3264k0965j8362j5861j3697j1900j0309q560o324l699j327
$$ 760575 735517 712253 691288 672926 657065 643368 631468 621159 612599 606275 602576 601249
62489F01249O2L30K60R05K403L619L589L021L526N342O996P541P837Q789R741
$$ 601249 601311 601641 601901 602806 605209 608828 612417 615438 618964 624306 631302 638843 646680 655469 665210
62474F65210R944J0487J2979J6895K0192K2341K4846K8615L2657L5804L8106M0067
$$ 665210 675154 685641 698620 715515 735707 758048 782894 811509 844166 879970 918076 958143
62462I58143M2156M5614N1792N9672O5713O7657O7199O7512O9228P0380O9277
$$ 958143 1000299 1045913 1097705 1157377 1223090 1290747 1357946 1425458 1494686 1565066 1634343
62451A634343O5640N9555N1082M0786K9139J5712L10j5323k8523l8523m6803n4555
$$ 1634343 1699983 1759538 1810620 1851406 1880545 1896257 1896567 1881244 1852721 1814198 1767395 1712840
62439A712840o1275o6153o9424p1632p2572p1730o9031o4830n9792n5047n1476
$$ 1712840 1651565 1585412 1515988 1444356 1371784 1300054 1231023 1166193 1106401 1051354 999878
62428I99878m8476m4441l9034l4017l1022k9392k7227k3970k0772j8558j6899
$$ 999878 951402 906961 867927 833910 802888 773496 746269 722299 701527 682969 666070
62417F66070j5051j3209j2133j1936j1754j0728r016p594p107p223p269p123p075
$$ 666070 651019 637810 625677 613741 601987 591259 582243 574649 567542 560319 553050 545927 538852
62404E38852p053o661o043n954o691p484p320o067m456l213k515k062j383k05
$$ 538852 531799 525138 519095 513141 506450 498966 491646 485579 481123 477910 475395 473333 471950 471745
62390D71745J271K510L159L252K972K448J798J062J08j004j586q45J093L151M419
$$ 471745 473016 475526 478685 481937 484909 487357 489155 490217 490325 489321 487735 486890 487983 491134 495553
62375D95553M670L738J324k044m679n208l975k363j193n37n98j618k920l157j866
$$ 495553 500223 503961 505285 503241 498562 493354 489379 487016 485823 485286 484688 483070 480150 476993 475127
62360D75127k07K21j104l333m961m747k571K55J939J809Q08L14P29J406J668J606
$$ 475127 474920 475141 474037 470704 465743 460996 458425 458680 460619 462428 463236 463550 464279 465685 467353 468959
62344D68959J976L268M877N438M449L174L258M596N587N581N922P816J0287J1366
$$ 468959 470935 474203 479080 484518 488967 492141 495399 499995 505582 511163 517085 524901 535188 546554
62330E46554J0798J0229J0877J2211J3124J3279J2881J2030J1092J0975J2229
$$ 546554 557352 567581 578458 590669 603793 617072 629953 641983 653075 664050 676279
62319F76279J4111J5414J6047J7077J9042K0989K1581K0834K0196K1056K3520
$$ 676279 690390 705804 721851 738928 757970 778959 800540 821374 841570 862626 886146
62308H86146K6727L0003L3338L6905M0534M3942M7200N0676N4522N8584O2777
$$ 886146 912873 942876 976214 1013119 1053653 1097595 1144795 1195471 1249993 1308577 1371354
62297A371354O7129P1316P4459P5771P5087P2451O7407N9344M8620L6876K5784
$$ 1371354 1438483 1509799 1584258 1660029 1735116 1807567 1874974 1934318 1982938 2019814 2045598
62286B045598J5734O099l383j2009j9095k5096l1259l8156m5078n0931n5248n7927
$$ 2045598 2061332 2067431 2064048 2052039 2032944 2007848 1976589 1938433 1893355 1842424 1787176 1729249
62274A729249n8623n7193n4640n2495n0965m8544m4144l8923l5024l3029l1685
$$ 1729249 1670626 1613433 1558793 1506298 1455333 1406789 1362645 1323722 1288698 1255669 1223984
62263A223984l0109k8901k8726k8905k8281k6811k5368k4215k2729k0658j8732
$$ 1223984 1193875 1164974 1136248 1107343 1079062 1052251 1026883 1002668 979939 959281 940549
62252I40549j7692j7271j6640j5490j4172j2918j1505r790q147p020o336n726
$$ 940549 922857 905586 888946 873456 859284 846366 834861 825071 816924 809904 803568 797842
62240G97842n183m954m689l419q69J734K939K917L138M289N578O336P096Q275
$$ 797842 792659 787705 783016 779597 778728 780462 783401 786318 789456 793745 799323 805659 812755 821030
62226H21030Q893P984O607O810Q627R779Q953P767Q518J1060J3333J4271J4733
$$ 821030 829923 837907 844514 851324 859951 869730 878683 886450 894968 906028 919361 933632 948365
62213I48365J5662J6777J7391J7509J7677J8459K0397K3762K8044L2289L6257
$$ 948365 964027 980804 998195 1015704 1033381 1051840 1072237 1095999 1124043 1156332 1192589
62202A192589M0650M5956N1773N7547O3061O7727P0470P1193P1444P2419P2986
$$ 1192589 1233239 1279195 1330968 1388515 1451576 1519303 1589773 1660966 1732410 1804829 1877815
62191A877815P0947O5821N8809N0340L9466K6118J2244j12j0710k0327k9188l7214
$$ 1877815 1948762 2014583 2073392 2123732 2163198 2189316 2201560 2201448 2190738 2170411 2141223 2104009
62179B104009m4844n2403n9118o3847o6426o7379o6750o4276o0565n7032n4377
$$ 2104009 2059165 2006762 1947644 1883797 1817371 1749992 1683242 1618966 1558401 1501369 1446992
62168A446992n1762m7752m1783l4821k8749k4874k2759k0965j8998j7710j7359
$$ 1446992 1395230 1347478 1305695 1270874 1242125 1217251 1194492 1173527 1154529 1136819 1119460
62157A119460j6596j4357j1699j0165r209p087l908j738j478j671q84M41J430
$$ 1119460 1102864 1088507 1076808 1066643 1057434 1050347 1046439 1044701 1043223 1041552 1040668 1041109 1042539
62144A042539K411L909N300N730N614O070P429R160J0698J1567J1372J0557J0504
$$ 1042539 1044950 1048859 1054159 1059889 1065503 1071573 1079002 1088162 1098860 1110427 1121799 1132356 1142860
62131A142860J1888J3518J3786J2842J2266J2981J4518J6094J7366J8130J8205
$$ 1142860 1154748 1168266 1182052 1194894 1207160 1220141 1234659 1250753 1268119 1286249 1304454
62120A304454J7761J7119J6417J5907J6214J7539J8977J9624K0064K1764K5139
$$ 1304454 1322215 1339334 1355751 1371658 1387872 1405411 1424388 1444012 1464076 1485840 1510979
62109A510979K9374L4089L9787M6263N1804N4841N5595N5271N4114N1177M5810
$$ 1510979 1540353 1574442 1614229 1660492 1712296 1767137 1822732 1878003 1932117 1983294 2029104
62098B029104L8564L0473K1948J2794L210n717j2960j8750k4307l0133l5243l8600
$$ 2029104 2067668 2098141 2120089 2132883 2136093 2130376 2117416 2098666 2074359 2044226 2008983 1970383
62086A970383m0757m3245m6470m9044m9317m6925m2780l8131l3877l0218k6671
$$ 1970383 1929626 1886381 1839911 1790867 1741550 1694625 1651845 1613714 1579837 1549619 1522948
62075A522948k2757j8867j6112j5046j4722j3408j0335o689m561m716n596n161
$$ 1522948 1500191 1481324 1465212 1450166 1435444 1422036 1411701 1405012 1400451 1395735 1390139 1384978
62063A384978l450k368k719k830j067J507K501J544N94J131K707M373N899P153
$$ 1384978 1381528 1379160 1376441 1373611 1372544 1374051 1376552 1378096 1378690 1379821 1382528 1386901 1392800 1399953
62049A399953P726P846Q335Q981Q227N365J956J09J98J283K874N014P207Q576
$$ 1399953 1407679 1415525 1423860 1432841 1441068 1446433 1448389 1448498 1448696 1449979 1452853 1457867 1465074 1473650
62035A473650Q873Q464P625O733O707Q171J0480J2540J4383J6725J9231K0523
$$ 1473650 1482523 1490987 1498612 1505345 1512052 1520223 1530703 1543243 1557626 1574351 1593582 1614105
62023A614105K0168J9468J9823K1314K3262K5218K6788K7332K6700K5824K5925
$$ 1614105 1634273 1653741 1673564 1694878 1718140 1743358 1770146 1797478 1824178 1850002 1875927
62012A875927K7350K9558L1822L3523L4276L4386L4874L6492L8810M0656M1098
$$ 1875927 1903277 1932835 1964657 1998180 2032456 2066842 2101716 2138208 2177018 2217674 2258772
62001B258772L9608L5836K9999K3189J6368R232J022p640j4946k0253k5058l0964
$$ 2258772 2298380 2334216 2364215 2387404 2403772 2413004 2414026 2406386 2391440 2371187 2346129 2315165
61989B315165l7618m3585m8316n2128n4860n6031n6117n6258n6414n5162n1772
$$ 2315165 2277547 2233962 2185646 2133518 2078658 2022627 1966510 1910252 1853838 1798676 1746904
61978A746904m7412m3618m0465l6977l2677k8017k3805k0813j9358j8636j7200
$$ 1746904 1699492 1655874 1615409 1578432 1545755 1517738 1493933 1473120 1453762 1435126 1417926
61967A417926j4804j3027j3167j4220j4138j2577j0963j0143r544q860q945j0322
$$ 1417926 1403122 1390095 1376928 1362708 1348570 1335993 1325030 1314887 1305343 1296483 1287538 1277216
61955A277216j1933j2229j0854q680o740n648n445n501m908l453j770m24O15J364
$$ 1277216 1265283 1253054 1242200 1233520 1226780 1221132 1215687 1210186 1205278 1201825 1200055 1199631 1200246 1201610
61941A201610J522J193J151J754K301K061J362Q69L26j071l365n792p868r683
$$ 1201610 1203132 1204325 1205476 1207230 1209531 1211592 1212954 1213823 1214149 1213078 1209713 1203921 1196053 1186370
61927A186370j1166j1943j2112j2431j3471j4975j6260j6740j5979j3785j0734
$$ 1186370 1175204 1163261 1151149 1138718 1125247 1110272 1094012 1077272 1061293 1047508 1036774
61916A036774q271p682q764r824r284p224n128m135l964l654k753j358M70K492
$$ 1036774 1028503 1020821 1012057 1002233 992949 985725 980597 976462 972498 968844 966091 964733 965203 967695
61902I67695L845L876L334L638M787N245M326L407L976N649P353R360J2564J6303
$$ 967695 971540 975416 978750 982388 987175 992420 996746 1000153 1004129 1009778 1017131 1026491 1039055 1055358
61888A055358J8777J9666K0721K3306K6641K9112L0297L0967L1958L3769L6563
$$ 1055358 1074135 1093801 1114522 1137828 1164469 1193581 1223878 1254845 1286803 1320572 1357135
61877A357135L9723M1823M2005M1134M0844M1522M2023M1316L9613L7575L5243
$$ 1357135 1396858 1438681 1480686 1521820 1562664 1604186 1646209 1687525 1727138 1764713 1799956
61866A799956L2416K9575K7487K5968K3979K1282J9189J9017K0424K2149K3876
$$ 1799956 1832372 1861947 1889434 1915402 1939381 1960663 1979852 1998869 2019293 2041442 2065318
61855B065318K6314K9662L3347L7523M3317N0831N8117O3233O6492O9514P2745
$$ 2065318 2091632 2121294 2154641 2192164 2235481 2286312 2344429 2407662 2474154 2543668 2616413
61844B616413P5292P6756P7719P8304P7789P5993P3864P2150P0510O8532O6753
$$ 2616413 2691705 2768461 2846180 2924484 3002273 3078266 3152130 3224280 3294790 3363322 3430075
61833C430075O5945O5932O5770O4678O2362N8913N4796N0373M4903L6717K5140
$$ 3430075 3496020 3561952 3627722 3692400 3754762 3813675 3868471 3918844 3963747 4000464 4025604
61822D025604J1716j321j3470k5865l9063n2048o3619p3583q2082q8701r3021
$$ 4025604 4037320 4035999 4022529 3996664 3957601 3905553 3841934 3768351 3686269 3597568 3504547
61811C504547r5489r6744r6470r3936q9677q5572q2752q0216p6202p0390o3915
$$ 3504547 3409058 3312314 3215844 3121908 3032231 2946659 2863907 2783691 2707489 2637099 2573184
61800B573184n7576n1069m4038l6901l0213k3884j7582j1305n114J188P374J2249
$$ 2573184 2515608 2464539 2420501 2383600 2353387 2329503 2311921 2300616 2295502 2296690 2304064 2316313
61788B316313J4689J5092J4906J4733J3733J1172P578L816k50n311j1083j6114
$$ 2316313 2331002 2346094 2361000 2375733 2389466 2400638 2408216 2412032 2411782 2406471 2395388 2379274
61776B379274j9301k0912k1756k1830k0413j7378j3700j0264o709k065L561Q678
$$ 2379274 2359973 2339061 2317305 2295475 2275062 2257684 2243984 2233720 2227011 2224946 2228507 2237185
61764B237185J1945J3392J3724J2992J0525O014N0o337j2327j7668k2722k7995
$$ 2237185 2249130 2262522 2276246 2289238 2299763 2305777 2305827 2299490 2287163 2269495 2246773 2218778
61752B218778l3172l6866l7854l6505l4355l2301k9877k6464k2463j8816j5707
$$ 2218778 2185606 2148740 2110886 2074381 2040026 2007725 1977848 1951384 1928921 1910105 1894398
61741A894398j2313p827k449K761O966J0319J3544J6888K0014K2977K6536L0960
$$ 1894398 1882085 1874258 1871809 1874570 1881536 1891855 1905399 1922287 1942301 1965278 1991814 2022774
61729B022774L5162L7999M0043M2976M7329N1976N6152O0621O6083P1493P5190
$$ 2022774 2057936 2095935 2135978 2178954 2226283 2278259 2334411 2395032 2461115 2532608 2607798
61718B607798P7377Q0258Q5537R2610R9610J05721J11761J18527J25284J30677
$$ 2607798 2685175 2765433 2850970 2943580 3043190 3148911 3260672 3379199 3504483 3635160
61708C635160J35003J40413J48239J56776J62941J65800J67147J68429J68590
$$ 3635160 3770163 3910576 4058815 4215591 4378532 4544332 4711479 4879908 5048498
61699E048498J65639J59168J50234J39479J26479J10582R1471O9091M4028J7732
$$ 5048498 5214137 5373305 5523539 5663018 5789497 5900079 5991550 6060641 6104669 6122401
61689F122401q362l3923n9189q3525j05330j23468j38051j49832j59481j67522
$$ 6122401 6114039 6080116 6020927 5937402 5832072 5708604 5570553 5420721 5261240 5093718
61679E093718j74063j78251j78717j75216j69424j63744j59365j55603j50820
$$ 5093718 4919655 4741404 4562687 4387471 4218047 4054303 3894938 3739335 3588515
61670C588515j43901j35284j26718j19744j14245j08805j02554r6059r0277q5224
$$ 3588515 3444614 3309330 3182612 3062868 2948623 2839818 2737264 2641205 2550928 2465704
61660B465704q0210p4916o9721o5116o1374n8623n6792n5468n4074n2301n0131
$$ 2465704 2385494 2310578 2240857 2175741 2114367 2055744 1998952 1943484 1889410 1837109 1786978
61649A786978m7568m4677m1864l9825l8981l8885l8329l6290l3061l0203k8953
$$ 1786978 1739410 1694733 1652869 1613044 1574063 1535178 1496849 1460559 1427498 1397295 1368342
61638A368342k8753k8072k6585k5548k5614k5474k3739k1232j9967k0204k0230
$$ 1368342 1339589 1311517 1284932 1259384 1233770 1208296 1184557 1163325 1143358 1123154 1102924
61627A102924j9129j8037j8005j8083j6736j4078j1538r941r096q846r222r861
$$ 1102924 1083795 1065758 1047753 1029670 1012934 998856 987318 977377 968281 959435 950213 940352
61615I40352j0322j0870j1907j2824j2631j1637j1251j1808j1934j0646q790p701
$$ 940352 930030 919160 907253 894429 881798 870161 858910 847102 835168 824522 815732 808031
61603H08031p384p006o398n987n788n530n445n862o096m893k199L13R43j67j247
$$ 808031 800647 793641 787243 781256 775468 769938 764493 758631 752535 747642 745443 745756 746699 746532 745285
61588G45285p83R85K419K374J517J450K461L021J935J95k81O16R49p34l700o183
$$ 745285 744502 745487 747906 750280 751797 753247 755708 758729 760664 760859 760578 761194 762143 761409 757709 751526
61572G51526p365p614p473p156o782o449o078n581n136m969m792l892k045j32
$$ 751526 744161 736547 729074 721918 715136 708687 702609 697028 691892 686923 682131 678239 676194 676062
61558F76062N52k51j420j884k032k980m624n424m530l185l166m419n245m683l667
$$ 676062 676614 676363 674943 673059 671027 668047 663423 657999 653469 650284 647118 642699 637454 632771 629104
61543F29104l695n110o950p913p297n427l416k235j902j812j643j447j082k70
$$ 629104 625409 620299 613349 605436 598139 592712 589296 587061 585159 583347 581704 580257 579175 578905
61529E78905O84R38K22o06m43R27K828M442N336N473N091M581M404M950O175P376
$$ 578905 579589 580527 580749 580143 579700 580627 583455 587897 593233 598706 603797 608378 612782 617732 623907 631283
61513F31283P763P484P531Q256Q717Q190P659Q651J1057J3284J4427J4923J5129
$$ 631283 639046 646530 654061 662317 671034 679224 686883 695534 706591 719875 734302 749225 764354
61500G64354J4708J3769J3204J3284J3194J2584J2379J3080J3452J2116R612P600
$$ 764354 779062 792831 806035 819319 832513 845097 857476 870556 884008 896124 905736 913336
61488I13336O604N837M957M561M931N449N507N153M559L669K624J959J981K379
$$ 913336 919940 925777 930734 935295 940226 945675 951182 956335 960894 964563 967187 969146 971127 973506
61474I73506K809L369M191M825M619L655K869L002L749M401N151P032J0196J3044
$$ 973506 976315 979684 983875 988700 993319 996974 999843 1002845 1006594 1010995 1016146 1023178 1033374 1046418
61460A046418J3940J3416J3612J5524J7907J9245J9839K1241K4160K7747L0700
$$ 1046418 1060358 1073774 1087386 1102910 1120817 1140062 1159901 1181142 1205302 1233049 1263749
61449A263749L2640L4335L6792M0081M3244M5580M7600N0091N2636N4143N4701
$$ 1263749 1296389 1330724 1367516 1407597 1450841 1496421 1544021 1594112 1646748 1700891 1755592
61438A755592N5577N7185N8356N8096N6743N4721N1451M6445M0359L3984K7221
$$ 1755592 1811169 1868354 1926710 1984806 2041549 2096270 2147721 2194166 2234525 2268509 2295730
61427B295730K0056J3480Q145L064k885r003j3841j7479k0968k4019k5292k4960
$$ 2295730 2315786 2329266 2337411 2340475 2337590 2328587 2314746 2297267 2276299 2252280 2226988 2202028
61415B202028k4908k5844k6032k3810j9976j6658j4653j3068j1064q969p638p169
$$ 2202028 2177120 2151276 2125244 2101434 2081458 2064800 2050147 2037079 2026015 2017046 2009408 2002239
61403B002239o586m847k248l97m43j637k212j338N12K780N418Q264J0795J2777
$$ 2002239 1995653 1990806 1988558 1988161 1987718 1986081 1983869 1982531 1983043 1985823 1991241 1999505 2010300 2023077
61389B023077J4472J6020J7172J7917J8778K0232K1959K2828K1664J8382J4508
$$ 2023077 2037549 2053569 2070741 2088658 2107436 2127668 2149627 2172455 2194119 2212501 2227009
61378B227009J1924J0762R331O617L854K707K930L122K917K881K883K401K135
$$ 2227009 2238933 2249695 2259026 2265643 2269497 2272204 2275134 2278256 2281173 2284054 2286937 2289338 2291473
61365B291473L313N502O920P017O900O910N743K592j542n362q666j1635j4307
$$ 2291473 2294786 2300288 2307208 2314225 2321125 2328035 2333778 2336370 2334828 2329466 2320800 2309165 2294858
61352B294858j7113k0279k2346k1356j8218j6505j7694j9039j7761j5021j3444
$$ 2294858 2277745 2257466 2235120 2213764 2195546 2179041 2161347 2142308 2124547 2109526 2096082
61341B096082j2858j1394r265q133p512n148r96K306L483M323O488R114J0990
$$ 2096082 2083224 2071830 2062565 2054432 2046920 2041772 2040776 2043082 2046565 2050888 2057376 2066490 2077480
61328B077480J2971J6581K1544K6355L0431L4155L7532M0103M2016M4037M6551
$$ 2077480 2090451 2107032 2128576 2154931 2185362 2219517 2257049 2297152 2339168 2383205 2429756
61317B429756M9158N1116N1790N1001M9358M7857M6684M4896M1629L7060L1564
$$ 2429756 2478914 2530030 2581820 2632821 2682179 2730036 2776720 2821616 2863245 2900305 2931869
61306B931869K4796J6559Q089R99m993j1843k0159k7775l2363l4630l7308m1334
$$ 2931869 2956665 2973224 2981313 2982312 2977319 2965476 2945317 2917542 2885179 2850549 2813241 2771907
61294B771907m4715m5681m5420m6419m9115n1680n2797n3009n3049n2370n0048
$$ 2771907 2727192 2681511 2636091 2589672 2540557 2488877 2436080 2383071 2330022 2277652 2227604
61283B227604m6255m2103l8618l6290l4884l3063k9221k3454j7980j4661j2905
$$ 2227604 2181349 2139246 2100628 2064338 2029454 1996391 1967170 1943716 1925736 1911075 1898170
61272A898170j1030q975p983q011p254m543q76J975L348L743M008N029P193R671
$$ 1898170 1887140 1878165 1870182 1862171 1854917 1850374 1849498 1851473 1854821 1858564 1862572 1867601 1874794 1884465
61258A884465J1125J1672J3080J6174J9030J9140J6695J4307J3582J3518J2529
$$ 1884465 1895590 1907262 1920342 1936516 1955546 1974686 1991381 2005688 2019270 2032788 2045317
61247B045317J0642Q846P208M760J001l401p391j0343j2083j2762j3001j3647
$$ 2045317 2055959 2064805 2072013 2076773 2077774 2074373 2066982 2056639 2044556 2031794 2018793 2005146
61235B005146j4954j6243j6671j6217j5623j5484j5721j5871j5514j4460j2816
$$ 2005146 1990192 1973949 1957278 1941061 1925438 1909954 1894233 1878362 1862848 1848388 1835572
61224A835572j0994r483q553q196q166p906o785m807k953k250k556k770k206j227
$$ 1835572 1824578 1815095 1806542 1798346 1790180 1782274 1775489 1770682 1767729 1765479 1762923 1760153 1757947 1756720
61210A756720l90L36J355K954N191P698R529R902R349R353J0522J1868J2351J2224
$$ 1756720 1756330 1756666 1758021 1760975 1766166 1773864 1783393 1793295 1802644 1811997 1822519 1834387 1846738 1858962
61196A858962J2312J2868J4038J6555K0815K5696K9604L2393L5156L8245M0664
$$ 1858962 1871274 1884142 1898180 1914735 1935550 1961246 1990850 2023243 2058399 2096644 2137308
61185B137308M1406M0257L7165L1908K4884J7421J0877N742J656k231o688j1501
$$ 2137308 2178714 2218971 2256136 2288044 2312928 2330349 2341226 2346968 2348624 2346393 2339705 2328204
61173B328204j5292j7202j8410k0783k4048k5963k5602k4769k5228k6162k5832
$$ 2328204 2312912 2295710 2277300 2256517 2232469 2206506 2180904 2156135 2130907 2104745 2078913
61162B078913k4511k3965k4616k5180k5100k5519k7279k9270k9700k8290k6400
$$ 2078913 2054402 2030437 2005821 1980641 1955541 1930022 1902743 1873473 1843773 1815483 1789083
61151A789083k5351k5125k4575k2594j9264j6000j4250j3901j3358j1351q270
$$ 1789083 1763732 1738607 1714032 1691438 1672174 1656174 1641924 1628023 1614665 1603314 1595044
61140A595044n501l937l421l297k997k511k755n118r876j5287j9032k0572k1230
$$ 1595044 1589543 1585606 1582185 1578888 1575891 1573380 1570625 1565507 1555631 1540344 1521312 1500740 1479510
61127A479510k1923k1997k0753j9026j8170j8233j8297j8209j8692j9807k0543
$$ 1479510 1457587 1435590 1414837 1395811 1377641 1359408 1341111 1322902 1304210 1284403 1263860
61116A263860k0137j8711j6496j3620j0950r809j0109r980q193n906m884m885
$$ 1263860 1243723 1225012 1208516 1194896 1183946 1174137 1164028 1154048 1145855 1139949 1135065 1130180
61104A130180m275k665j405j555k629l488l395j999O49L789O294P625P862O982
$$ 1130180 1125905 1123240 1121835 1120280 1117651 1114163 1110768 1108769 1109418 1113207 1119501 1127126 1134988 1141970
61090A141970M889K067o79l167n686p928r042q942q503q169p451o190n361n897
$$ 1141970 1146859 1148926 1148247 1145080 1139394 1131466 1122424 1113482 1104979 1096810 1089359 1083169 1077808 1071911
61076A071911p348q357q092o910n881n856o641p178o914o567o741o483m658k330
$$ 1071911 1064563 1056206 1048114 1041204 1035323 1029467 1022826 1015648 1008734 1002167 995426 988943 984285 981955
61062I81955j758l003l701k761j793j765q39K374N645N949M040L104L748L626
$$ 981955 980197 977194 973493 970732 968939 967174 966335 968709 974354 980303 984343 987447 991195 994821
61048I94821J901O22P97K12l202q126j1843j3746j5015j6116j6629j6699j6762
$$ 994821 996722 997344 998141 998353 995151 987025 975182 961436 946421 930305 913676 896977 880215
61035H80215j6262j4421j2131j1447j2955j5016j5905j5624j5144j4833j4257
$$ 880215 863953 849532 837401 825954 812999 797983 782078 766454 751310 736477 722220
61024G22220j3023j1244r381p811o503n165l931l521m182m808l972j844j75j43
$$ 722220 709197 697953 688572 680761 674258 669093 665162 661641 657459 652651 648679 646835 646660 646517
61010F46517j079j672j679j694j796j225O44L453N971O906N908M055K922K944
$$ 646517 645438 643766 642087 640393 638597 637372 638016 641469 647440 654346 660254 664309 667231 670175
60996F70175L210L097L285M406N588N523M492M007M541N134N186N137M984L817
$$ 670175 673385 676482 679767 684173 689761 695284 699776 703783 708324 713458 718644 723781 728765 732582
60982G32582J653K34O59J517Q40r86j902j156J87J358K580L636L609K556J856
$$ 732582 734235 734469 735128 736645 737485 736499 734597 733441 733628 734986 737566 741202 744811 747367 749223
60967G49223K201K760L130M677Q640J3901J8021K0063K1367K3852K8475L5052
$$ 749223 751424 754184 757314 761991 770631 784532 802553 822616 843983 867835 896310 931362
60955I31362M2764N0832N9051O7151P3127P3042O3888M6757K6659R190k293p022
$$ 931362 974126 1024958 1084009 1151160 1224287 1297329 1361217 1407974 1434633 1443823 1441530 1434508
60943A434508n914r30N077Q446N411o109k4424m4200n9624o7871o9568o6789o1386
$$ 1434508 1428594 1427664 1432741 1441187 1446598 1440489 1416065 1371865 1312241 1244370 1174802 1108013 1046627
60930A046627n4791m8180m2312l7330l2761k7729k1926j6608j3626j2829j1596
$$ 1046627 991836 943656 901344 864014 831253 803524 781598 764990 751364 738535 726939
60919G26939q119m130k645l760m653l613j802q16m87M4Q34J711K885M004L868
$$ 726939 718820 714690 712045 708285 703632 700019 698217 697401 696914 696958 697792 699503 702388 706392 710260
60904G10260K219N99L93J022J163O21k88j957m414n941m776j883k28j287l765
$$ 710260 712479 713078 713471 714493 715656 716277 715989 714032 709618 703677 698901 697018 696790 695503 691738
60889F91738n696o209n183k917p04k03j557l186l963m388n156n898o073n962n910
$$ 691738 686042 679833 674650 671733 671029 670826 669269 666083 662120 657732 652576 646678 640605 634643 628733
60874F28733n735n804p442j0873j3741j3325r758n647k968j856j970l052l959
$$ 628733 622998 617194 609752 598879 585138 571813 562055 556408 553440 551584 549614 546562 542603
60861E42603l075m99J596J611L65m85n94m51Q6J316K409K117O31n12l20Q50K316
$$ 542603 539528 539029 540625 542236 542601 542116 541522 541071 541157 542473 544882 546999 547630 547118 546798 547648 549964
60844E49964L758M763M805M050L432L521L937M002L362J883j97j843j857m18Q83
$$ 549964 553722 558485 563290 567340 570772 574293 578230 582232 585594 587477 587280 585437 583580 583162 584045
60829E84045R40K44m70j589l613n574n805m121k106j203j377j783j933j889j950
$$ 584045 584985 585229 584759 583170 579557 573983 568178 564057 561951 560748 559371 557588 555655 553766 551816
60814E51816k368l034l261k287k77J539J914Q24m08k66J478L399L903L091K505
$$ 551816 549448 546414 543153 540866 540589 542128 544042 544866 544458 544192 545670 549069 552972 556063 558568
60799E58568K946L417K848J814J516J814J650J031J062K003K794K766K480K463
$$ 558568 561514 564931 567779 569593 571109 572923 574573 575604 576666 578669 581463 584229 586709 589172
60785E89172K424K257K558L461M116M091M201M991N510M705L136J981J124l43
$$ 589172 591596 593853 596411 599872 603988 608079 612280 617271 622781 627486 630622 632603 633727 633384
60771F33384k244l509l949m241m333l488k150k048l774n720o247n728n467n702
$$ 633384 631140 627631 623682 619441 615108 611620 609470 607422 603648 597928 591681 585953 580486 574784
60757E74784n893o140o900p726p657o832o453p025p729p824p545p060n708l117
$$ 574784 568891 562751 555851 548125 540468 533636 527183 520158 512429 504605 497060 490000 484292 481175
60743D81175m52O16o9j126j541j597j778j732r24K59Q43N04k2K38J549L262M348
$$ 481175 480723 481339 481270 480144 478603 477006 475228 473496 472572 472831 473674 474178 474156 474394 475943 479205 483553
60726D83553M316L740L630M130M305L520K423K039K480L250M325N845P052O841
$$ 483553 487869 491609 495239 499369 503674 507194 509617 511656 514136 517386 521711 527556 534608 541449
60712E41449N514M721N236N908N443M154L147K686K415K458L087L708L434K512
$$ 541449 546963 551684 556920 562828 568271 572425 575572 578258 580673 583131 586218 589926 593360 595872
60698E95872J976J951J496L64k90M36J748K181J456N26J30J06P1Ol6l02j111k482
$$ 595872 597848 599799 601295 601659 601369 601805 603553 605734 607190 607716 607846 607952 608023 608029 607993 607691 606580 604098
60680F04098m202o067p716q411p568n661m170m111m922n279m755m023l575l253
$$ 604098 599896 593829 586113 577702 570134 564473 560303 556192 551270 545991 541236 537213 533638 530385
60666E30385l127l688m554m223k097Q5K72r54r75J232L682M081K643J365J297
$$ 530385 527258 523570 519016 514793 512696 512781 513053 512099 511124 512356 516038 520119 522762 524127 525424
60651E25424J685J504Q72P05J422K419K895K911L104L311K374p1k421k991k499
$$ 525424 527109 528613 529485 530190 531612 534031 536926 539837 542941 546252 548626 548555 546134 543143 540644
60636E40644l072m878n696m385k844l242m913n652n083m771n468o216o218n907
$$ 540644 537572 532694 526998 522613 519769 516527 511614 505962 500879 496108 490640 484424 478206 472299
60622D72299n774n550n059m738m675m250l299k636k644k281n95J419J784K94r33
$$ 472299 466525 460975 455916 451178 446503 442253 438954 436318 433674 431393 430798 432217 434001 434295 433362
60607D33362k9K268L569K816J491J637L224M166L096J212Q07K460M651O051O979
$$ 433362 433333 435601 439170 441986 443477 445114 448338 452504 455600 456812 457619 460079 464730 470781 477760
60592D77760Q208R300R112P505N674M852N224O078O528O083M994M029L703L722
$$ 477760 485968 495268 504380 511885 517559 522411 527635 533713 540241 546324 551318 555347 559050 562772
60578E62772L491K979K661K688K642K162J512J338K008L166L830L194J655P25
$$ 562772 566263 569242 571903 574591 577233 579395 580907 582245 584253 587419 591249 594443 596098 596823
60564E96823J334K457K196J55k077l046l058l258l973m739n356n885n979n202
$$ 596823 598157 600614 602810 602965 600888 597842 594784 591526 587553 582814 577458 571573 565594 560392
60550E60392m009l473l869m334m133l529l048k624k030j585j763k287k322j581
$$ 560392 556383 552910 549041 544707 540574 537045 533997 531373 529343 527758 525995 523708 521386 519805
60536E19805p42o23j237j720j168M44K022K245Q66r08j559o68Q73J971K386K826
$$ 519805 519063 518440 517203 515483 514315 514759 516781 519026 519892 518984 517425 516757 517630 519601 521987 524813
60520E24813M028N714O502N272K732J083J769M010N927O665O722O742O979P704
$$ 524813 528841 534555 541057 546329 549061 550144 551913 555923 561850 568515 575237 581979 588958 596662
60506E96662R129J0662J1316J1092J1140J2124J3335J3998J4598J6147J8673K1398
$$ 596662 605791 616453 627769 638861 650001 662125 675460 689458 704056 720203 738876 760274
60494G60274K4016K6953L0504L4504L8756M3144M7378N1215N4856N8457O1358
$$ 760274 784290 811243 841747 876251 915007 958151 1005529 1056744 1111600 1170057 1231415
60483A231415O2381O0759N6121M7811L5361J9831L612j1487k5089l6835m5230
$$ 1231415 1293796 1354555 1410676 1458487 1493848 1513679 1517291 1505804 1480715 1443880 1398650
60472A398650m8940m8658m6614m4400m1962l8535l3821k8249k2786j8500j5671
$$ 1398650 1349710 1301052 1254438 1210038 1168076 1129541 1095720 1067471 1044685 1026185 1010514
60461A010514j3212r484l900K531Q289J2553J5503J7983K1044K5335L0602L6034
$$ 1010514 997302 987818 983918 986449 994738 1007291 1022794 1040777 1061821 1087156 1117758 1153792
60449A153792M1200M6332N1524N6102N9064N9841N8211N3633M5278L3094J8709
$$ 1153792 1194992 1241324 1292848 1348950 1408014 1467855 1526066 1579699 1624977 1658071 1676780
60438A676780M984n668j2590j6461j7694j5719j0146j938P271J6796K6894L7131
$$ 1676780 1681764 1676096 1663506 1647045 1629351 1613632 1603486 1601548 1608819 1625615 1652509 1689640
60426A689640M5752N1051N2467M9849M2579L0407J4482l512k2811m2846o1415
$$ 1689640 1735392 1786443 1838910 1888759 1931338 1961745 1976227 1972715 1949904 1907058 1845643
60415A845643p5250q3053q6643q8288q7899q4057p7042o9379o3312n8880n4805
$$ 1845643 1770393 1687340 1600697 1512409 1424510 1340453 1263411 1194032 1130720 1071840 1017035
60404A017035n0328m5598m0871l6198l1819k8336k6118k4669k2831j9880j6412
$$ 1017035 966707 921109 880238 844040 812221 783885 757767 733098 710267 690387 673975
60393F73975j3828j2758j2396j1641j0464r534q907p977o691n699n073m045k576
$$ 673975 660147 647389 634993 623352 612888 603354 594447 586470 579779 574080 569007 564962 562386
60380E62386k094l546n541n865m466l412l848m525l832j982l42L35J14r30k606
$$ 562386 560292 556746 551205 545340 540874 537462 533614 529089 525257 523275 522933 523268 523382 522452 519846
60365E19846m113m609m017k701q55J022J722O71p47n60J208K664K759K309K127
$$ 519846 515733 511124 507107 504406 503551 504573 506295 506966 506219 505659 506867 509531 512290 514599 516726
60350E16726J859J360J539K659L214K099P76J483L892N517N180M237M142M604
$$ 516726 518585 519945 521484 524143 527357 529456 530232 531715 535607 541124 546304 550541 554683 559287
60336E59287M746M514M157L536K855L050M449N870O092N543N491O079O273N631
$$ 559287 564033 568547 572704 576240 579095 582145 586594 592464 598556 604099 609590 615669 621942 627573
60322F27573M974N228O309P345P501O474M682L010K156K209K884L813M396L988
$$ 627573 632547 637775 644084 651429 658930 665404 670086 673096 675252 677461 680345 684158 688554 692542
60308F92542K766J819J695J434o1k091k760j459L94J220Q22j65j273k001j550
$$ 692542 695308 697127 698822 700256 700195 698104 695344 693885 694279 695499 696321 696156 694883 692882 691332
60293F91332L63K843M547M879M097K678J074k76j192j837k306k412k166k000k133
$$ 691332 691695 694538 699085 703964 708061 710739 711813 711537 710345 708508 706202 703790 701624 699624 697491
60278F97491k127j572q56o66j047j508j876k388k924k839j817m89N9o99k251l558
$$ 697491 695364 693792 692936 692270 691223 689715 687839 685451 682527 679688 677871 677382 677441 676742 674491 670933
60262F70933m025m063m515n469n945n025l036j220l67j24L03J150J970K346K466
$$ 670933 666908 662845 658330 652861 646916 641891 638855 637635 637268 637144 637447 638597 640567 642913 645379
60247F45379K821L368L377K401R71l03j921m758q063r648q584o589n815o292o655
$$ 645379 648200 651568 654945 657346 658317 658014 656093 651335 643272 633624 625040 618451 612636 606344 599689
60232E99689o436o056n210l141n20P95L04l65J21J052J193P56O44O87oj332k142
$$ 599689 593253 587197 581987 578846 578326 579121 579425 579060 579181 580233 581426 582182 582826 583513 583507 582175 580033
60215E80033j785p40L88J635L233N007O473P169O877N845M816M426M479M115K933
$$ 580033 578248 577508 577896 579531 582764 587771 594244 601413 608290 614135 618951 623377 627856 631971 634904
60200F34904J672J514K707M091M276L204K126K035K611L119L638M652N962P037
$$ 634904 636576 638090 640797 644888 649164 652368 654494 656529 659140 662259 665897 670549 676511 683548
60186F83548Q128R811J1441J1535J0020Q615Q520R200J0131J2067J5240J7941
$$ 683548 691676 701487 712928 724463 734483 743098 751618 760818 770949 783016 798256 816197
60174H16197J8746J9063K1231K4823K7230K7782K8724L1565L4922L7121L8892
$$ 816197 834943 854006 875237 900060 927290 955072 983796 1015361 1050283 1087404 1126296
60163A126296M1792M5309M7603M8383M9234N1054N2741N2874N1592N0177M9278
$$ 1126296 1168088 1213397 1261000 1309383 1358617 1409671 1462412 1515286 1566878 1617055 1666333
60152A666333M8148M5508M0837L4795K8590K3099J8440J4143R570M545j84l389
$$ 1666333 1714481 1759989 1800826 1835621 1864211 1887310 1905750 1919893 1929463 1934008 1933824 1930435
60140A930435m746n368o441p586p417n444k462R47N138J0317J5653K0132K3676
$$ 1930435 1925689 1920321 1913880 1906294 1898877 1893433 1890971 1891918 1897056 1907373 1923026 1943158 1966834
60127A966834K6921L0431L4473L9022M3646M7793N1462N4983N8037N9548N8834
$$ 1966834 1993755 2024186 2058659 2097681 2141327 2189120 2240582 2295565 2353602 2413150 2471984
60116B471984N6159N2092M7118M1960L7027L1288K3132J2951L337m119j0775j8352
$$ 2471984 2528143 2580235 2627353 2669313 2706340 2737628 2760760 2773711 2777048 2772929 2762154 2743802
60104B743802k6024l1755l5327l7936l9626l9438l7759l6163l4718l1577k5869
$$ 2743802 2717778 2686023 2650696 2612760 2573134 2533696 2495937 2459774 2425056 2393479 2367610
60093B367610j9125j3069p520j431N256J1639J6917K0681K3053K4852K6741K7885
$$ 2367610 2348485 2335416 2327896 2326465 2331721 2343360 2360277 2380958 2404011 2428863 2455604 2483489
60081B483489K6671K3244J9921J8237J6835J3526Q450L885J418O30L48J40M63
$$ 2483489 2510160 2533404 2553325 2571562 2588397 2601923 2610373 2614258 2615676 2616306 2616654 2616794 2617257
60068B617257J933M612P906J1434J5822K1899K9068L5675M1323M7489N5118O3044
$$ 2617257 2619190 2623802 2631708 2643142 2658964 2680863 2709931 2745606 2786929 2834418 2889536 2952580
60056B952580P0048P7116Q5906R5817J04548J11175J16723J21712J25164J26570
$$ 2952580 3022628 3099744 3185650 3281467 3386015 3497190 3613913 3735625 3860789 3987359
60046C987359J26959J26945J25013J19023J08709R5633Q1157O5389M8004K9162
$$ 3987359 4114318 4241263 4366276 4485299 4594008 4689641 4770798 4836187 4884191 4913353
60036D913353R516j0200k9363m7423o3789p7692q8362r5633j00346j03885j06919
$$ 4913353 4922869 4912669 4883306 4835883 4772094 4694402 4606040 4510407 4410061 4306176 4199257
60025D199257j08588j07249j02387r5543q8854q2843p6322o8454n9951n1957m4702
$$ 4199257 4090669 3983420 3881033 3785490 3696636 3613793 3537471 3469017 3409066 3357109 3312407
60014C312407l7936l1733k5993j9961j3417p746m468l086j702L44J888J954R15
$$ 3312407 3274471 3242738 3216745 3196784 3183367 3175621 3171153 3168067 3166365 3166709 3168597 3170551 3171466
60001C171466n92k565m863o918q836j1724j6076k0739k4345k7032k9886l3276
$$ 3171466 3170874 3168309 3163446 3156528 3147692 3135968 3119892 3099153 3074808 3047776 3017890 2984614
59989B984614l6588l9125m0515m0718m0315m0323m0889m0685l8419l4488l0202
$$ 2984614 2948026 2908901 2868386 2827668 2787353 2747030 2706141 2665456 2627037 2592549 2562347
59978B562347k5727k0045j2948n812P9N177J1025J8384K6493L3896L9678M4081
$$ 2562347 2536620 2516575 2503627 2497815 2497894 2503071 2514096 2532480 2558973 2592869 2632547 2676628
59966B676628M8211N2975N8081O2088O3652O2701O0208N6844N2106M5096L5986
$$ 2676628 2724839 2777814 2835895 2897983 2961635 3024336 3084544 3141388 3193494 3238590 3274576
59955C274576K6181J6781P476k475j2618k1623k9150l6240m3408m9262n1990n1735
$$ 3274576 3300757 3317538 3325014 3322539 3309921 3288298 3259148 3222908 3179500 3130238 3078248 3026513
59943C026513n0586n0166m9916m8009m3567l7637l1883k6674k0906j3892o596
$$ 3026513 2975927 2925761 2875845 2827836 2784269 2746632 2714749 2688075 2667169 2653277 2646681
59932B646681j42O267J4508K4684L4644M2873N0174N7581O4134O8344P0774P3225
$$ 2646681 2646539 2652806 2667314 2691998 2726642 2769515 2819689 2877270 2941404 3009748 3080522 3153747
59920C153747P5781P6539P4190O9268O2716N4827M5989L6901K7445J6594M146
$$ 3153747 3229528 3306067 3380257 3449525 3512241 3567068 3613057 3649958 3677403 3693997 3698143
59909C698143q468j9805k9794l8784m6219n1263n3983n4932n4099n1272m6938
$$ 3698143 3689675 3669870 3640076 3601292 3555073 3503810 3449827 3394895 3340796 3289524 3242586
59898C242586m1828l5857k8520k0183j1994m468K932J0642J8239K5110L1129L6326
$$ 3242586 3200758 3164901 3136381 3116198 3104204 3099736 3102668 3113310 3131549 3156659 3187788 3224114
59886C224114M0373M3190M5655M8972N3137N6473N7175N5134N1906M8943M6258
$$ 3224114 3264487 3307677 3353332 3402304 3455441 3511914 3569089 3624223 3676129 3725072 3771330
59875C771330M3057L9134L5139L1751K9205K7587K6954K6976K7086K7158K7748
$$ 3771330 3814387 3853521 3888660 3920411 3949616 3977203 4004157 4031133 4058219 4085377 4113125
59864D113125K9560L3081L8633M6015N3956O0749O5865P0166P4116P6691P6857
$$ 4113125 4142685 4175766 4214399 4260414 4314370 4375119 4440984 4511150 4585266 4661957 4738814
59853D738814P5178P2785O9231O2789N2802M0443K7011J2679k557j7865l2217
$$ 4738814 4813992 4886777 4956008 5018797 5071599 5112042 5139053 5151732 5149175 5131310 5099093
59842E099093m5344n7245o7325p4851p9956q3409q5475q5680q3721q0032p5304
$$ 5099093 5053749 4996504 4929179 4854328 4774372 4690963 4605488 4519808 4436087 4356055 4280751
59831D280751o9874o3669n6503m8375l9820l1915k5488k0091j4273p176M04O824
$$ 4280751 4210877 4147208 4090705 4042330 4002510 3970595 3945107 3925016 3910743 3903567 3903971 3910795
59819C910795J1297J4308J6588J8153J8472J7132J4134R864M887m91o576j3813
$$ 3910795 3922092 3936400 3952988 3971141 3989613 4006745 4020879 4030743 4035630 4035139 4028563 4014750
59807D014750k1836k9453l5995m2166m8965n6090o2100o6031o8181o9321o9889
$$ 4014750 3992914 3963461 3927466 3885300 3836335 3780245 3718145 3652114 3583933 3514612 3444723
59796C444723o9943o9196o6995o3099n8742n5964n5352n5225n3789n1302m9218
$$ 3444723 3374780 3305584 3238589 3175490 3116748 3060784 3005432 2950207 2896418 2845116 2795898
59785B795898m7747m5557m1856l7574l4179l1928k9772k6627k2544j8805j6793
$$ 2795898 2748151 2702594 2660738 2623164 2588985 2557057 2527285 2500658 2478114 2459309 2442516
59774B442516j6548j6699j6178j5624j6309j7948j8617j7102j4403j2410j1676
$$ 2442516 2425968 2409269 2393091 2377467 2361158 2343210 2324593 2307491 2293088 2280678 2269002
59763B269002j1075r328o363l284j288n44p5J132K954M495N420O281P327P710
$$ 2269002 2257927 2248599 2242236 2238952 2237664 2237120 2237045 2238177 2241131 2245626 2251046 2257327 2264654 2272364
59749B272364O460L825J177l38p66j001j689k318j670N70K878L375K212J591L093
$$ 2272364 2278824 2282649 2283826 2283488 2282722 2281721 2280032 2277714 2276044 2276614 2279492 2282867 2285079 2286670 2289763
59734B289763N895Q103Q894Q635P767O680O129O632P648Q401R199J0832J2786
$$ 2289763 2295658 2303761 2312655 2321290 2329057 2335737 2341866 2348498 2356146 2364547 2373746 2384578 2397364
59721B397364J3469J2469J1326J1372J1996J1973J1719J2961J6429K0929K4864
$$ 2397364 2410833 2423302 2434628 2446000 2457996 2469969 2481688 2494649 2511078 2532007 2556871
59710B556871K7830L0368L2915L5647L9021M3630M9324N5117O0394O5846P2560
$$ 2556871 2584701 2615069 2647984 2683631 2722652 2766282 2815606 2870723 2931117 2996963 3069523
59699C069523Q0400Q8158R5412J03213J12259J21277J28129J32014J33254J31049
$$ 3069523 3149923 3238081 3333493 3436706 3548965 3670242 3798371 3930385 4063639 4194688
59689D194688J22729J05840Q0389M8944J5365j6353m3159o3893p8927q8348r1100
$$ 4194688 4317417 4423257 4503646 4552590 4567955 4551602 4508443 4444550 4365623 4277275 4186175
59678D186175q6568p6587o4910n4471m5555l6644k6499j5292m083O346J6008K5088
$$ 4186175 4099607 4023020 3958110 3903639 3858084 3821440 3794941 3779649 3775566 3781912 3797920 3823008
59666C823008L3341M0569M7535N5606O5141P4846Q3251R0463R7921J06717J16742
$$ 3823008 3856349 3896918 3944453 4000059 4065200 4140046 4223297 4313760 4411681 4518398 4635140
59655D635140J27350J38242J49555J61415J73584J85593J97292K09223K22054
$$ 4635140 4762490 4900732 5050287 5211702 5385286 5570879 5768171 5977394 6199448
59646F199448K35491K48228K59234K68632K76834K83235K86306K84860K78814
$$ 6199448 6434939 6683167 6942401 7211033 7487867 7771102 8057408 8342268 8621082
59637H621082K68863K55773K39886K21055J99445J76501J54502J34650J16205
$$ 8621082 8889945 9145718 9385604 9606659 9806104 9982605 10137107 10271757 10387962
59628A0387962R8239Q1571O7942N7698M9407M1750L4579K8017K1649J5135Q959
$$ 10387962 10486201 10567772 10635714 10693412 10742819 10784569 10819148 10847165 10868814 10883949 10892908
59617A0892908M115J415J088K476M212N462P022J0449J6161K3318L1420M0701
$$ 10892908 10897023 10898438 10899526 10902002 10906214 10911676 10918698 10929147 10945308 10968626 11000046 11040747
59605A1040747N0675N9865O7800P6166Q6768R9128J10988J20481J26894J29904
$$ 11040747 11091422 11151287 11219087 11295253 11382021 11481149 11592137 11712618 11839512 11969416
59595A1969416J29360J25636J19163J09671R6406P8980N7511L2284L764k7456
$$ 11969416 12098776 12224412 12343575 12453246 12549652 12628632 12686143 12718427 12722191 12694735
59585A2694735o1209r7628j35757j72890k06128k34134k56654k73224k83543k88450
$$ 12694735 12633526 12535898 12400141 12227251 12021123 11786989 11530335 11257111 10973568 10685118
59575A0685118k89019k85035k75991k63259k49465k35577k20513k04351j90254
$$ 10685118 10396099 10111064 9835073 9571814 9322349 9086772 8866259 8661908 8471654
59566H471654j82216j82110j89662k03796k22427k41866k58159k69093k74235
$$ 8471654 8289438 8107328 7917666 7713870 7491443 7249577 6991418 6722325 6448090
59557F448090k73567k67256k56474k43156k28745k13635j97819j81387j64591
$$ 6448090 6174523 5907267 5650793 5407637 5178892 4965257 4767438 4586051 4421460
59548D421460j48147j33374j21291j11475j02612r4172q6874q1266p6650p1817
$$ 4421460 4273313 4139939 4018648 3907173 3804561 3710389 3623515 3542249 3465599 3393782
59538C393782o6356o0746n5523n0924m7160m4426m2503m0689l8445l6034l4325
$$ 3393782 3327426 3266680 3211157 3160233 3113073 3068647 3026144 2985455 2947010 2910976 2876651
59527B876651l3910l4454l4886l4202l2231k9908k8714k9400l1010l1518k9800
$$ 2876651 2842741 2808287 2773401 2739199 2706968 2677060 2648346 2618946 2587936 2556418 2526618
59516B526618k6701k3848k1811k0072j8374j7070j6026j4264j1256p830n250l858
$$ 2526618 2499917 2476069 2454258 2434186 2415812 2398742 2382716 2368452 2357196 2349366 2344116 2340258
59504B340258l105k330r39J659N529R774J3285J5817J7948K0161K2595K5426K8820
$$ 2340258 2337153 2334823 2333884 2335543 2341072 2350846 2364131 2379948 2397896 2418057 2440652 2466078 2494898
59491B494898L2466L5699L8178M0135M2016M4248M7203N0829N4428N7293N9716
$$ 2494898 2527364 2563063 2601241 2641376 2683392 2727640 2774843 2825672 2880100 2937393 2997109
59480B997109O2735O6662P0172P1174O8447O2459N4927M7747M2104L8236L5798
$$ 2997109 3059844 3126506 3196678 3267852 3336299 3398758 3453685 3501432 3543536 3581772 3617570
59469C617570L4368L3494L2592L1088K8681K5299K0871J5387R147K696l558r594
$$ 3617570 3651938 3685432 3718024 3749112 3777793 3803092 3823963 3839350 3848497 3851193 3847635 3838041
59457C838041j5542k1241k6044k9263l0979l2209l3827l5516l6192l5500l4119
$$ 3838041 3822499 3801258 3775214 3745951 3714972 3682763 3648936 3613420 3577228 3541728 3507609
59446C507609l2529l0321k7077k3117j8791j3766p822j647M054R752J6431K4111
$$ 3507609 3475080 3444759 3417682 3394565 3375774 3362008 3354186 3352539 3356593 3366345 3382776 3406887
59434C406887L2058M0053M8339N6487O3702P0254P7266Q4710R0736R3553R3010
$$ 3406887 3438945 3478998 3527337 3583824 3647526 3717780 3795046 3879756 3970492 4064045 4157055
59423D157055Q9906Q4778P7992P0078O0997M9769L5699J9647L229j2739k8285
$$ 4157055 4246961 4331739 4409731 4479809 4540806 4590575 4626274 4645921 4649150 4636411 4608126
59412D608126m2999n5677o5337p2002p6319p8758p9309p7701p3852o8241o1773
$$ 4608126 4565127 4509450 4444113 4372111 4295792 4217034 4137725 4060024 3986172 3917931 3856158
59401C856158n5237m8985m3162l7893l3112k8601k4458k1150j8867j7153j5623
$$ 3856158 3800921 3751936 3708774 3670881 3637769 3609168 3584710 3563560 3544693 3527540 3511917
59390C511917j4855j6023j9510k4241k8630l2253l6277m1966m8791n4690n8367
$$ 3511917 3497062 3481039 3461529 3437288 3408658 3376405 3340128 3298162 3249371 3194681 3136314
59379C136314o0709o3233o5939o7731o8484o9073o9425o8221o5164o1977o0106
$$ 3136314 3075605 3012372 2946433 2878702 2810218 2741145 2671720 2603499 2538335 2476358 2416252
59368B416252n8694n6083n2438m9384m7440m5317m1723l6804l1593k6871k2638
$$ 2416252 2357558 2301475 2249037 2199653 2152213 2106896 2065173 2028369 1996776 1969905 1947267
59357A947267j8293j3354q243l861j9M694J0371J3949J1734L712o020j3224j6565
$$ 1947267 1928974 1915620 1907377 1903516 1903497 1908191 1918562 1932511 1944245 1947957 1941937 1928713 1912148
59344A912148j6640j3958q975k843L201Q562J2368J2563P405k097j2302j9814
$$ 1912148 1895508 1881550 1872575 1869732 1872933 1881495 1893863 1906426 1913831 1911734 1899432 1879618
59332A879618k3598k4352k2845j9545j5241j0995p207l233J643P009J1568J4602
$$ 1879618 1856020 1831668 1808823 1789278 1774037 1763042 1755835 1752602 1754245 1761254 1772822 1787424
59320A787424J6797J9356K2601K5792K8161K9677L0944L2784L5944M0587M5781
$$ 1787424 1804221 1823577 1846178 1871970 1900131 1929808 1960752 1993536 2029480 2070067 2115848
59309B115848M9910N2134N3345N5335N8977O3519O7713P1290P4861P8697Q2320
$$ 2115848 2165758 2217892 2271237 2326572 2385549 2449068 2516781 2588071 2662932 2741629 2823949
59298B823949Q5675Q9851R5811J02739J08920J14348J21203J31090J42803J53830
$$ 2823949 2909624 2999475 3095286 3198025 3306945 3421293 3542496 3673586 3816389 3970219
59288C970219J63266J72141J81347J90601J99283K07020K13210K16972K17902
$$ 3970219 4133485 4305626 4486973 4677574 4876857 5083877 5297087 5514059 5731961
59279E731961K16106K11385K03267J92012J78553J63105J44862J23698J01145
$$ 5731961 5948067 6159452 6362719 6554731 6733284 6896389 7041251 7164949 7266094
59270G266094P8803N6589L3681J0618j0922l0358m9061o8593q8994j09196j28384
$$ 7266094 7344897 7401486 7435167 7445785 7434863 7404505 7355444 7286851 7197857 7088661 6960277
59259F960277j46230j62242j75826j86988j96328k04030k09306k11176k09578
$$ 6960277 6814047 6651805 6475979 6288991 6092663 5888633 5679327 5468151 5258573
59250E258573k05416j99655j92820j85050j76176j65862j54271j42534j31837
$$ 5258573 5053157 4853502 4660682 4475632 4299456 4133594 3979323 3836789 3704952
59241C704952j21967j11774j01321r2464q6393q1545p5181o6664n7986n1332m7189
$$ 3704952 3582985 3471211 3369890 3277426 3191033 3109488 3034307 2967643 2909657 2858325 2811136
59230B811136m4697m2495l9124l3897k7942k3442k1235j9853j7347j3410r227
$$ 2811136 2766439 2723944 2684820 2650923 2622981 2599539 2578304 2558451 2541104 2527694 2518467
59219B518467n897l574j713L24K781N300P526R754J2445J5091J6449J6138J5270
$$ 2518467 2512570 2508996 2507283 2507607 2510388 2515688 2523214 2532968 2545413 2560504 2576953 2593091 2608361
59206B608361J5150J5961J6974J7230J5812J2472Q436N569M033J688l266r962
$$ 2608361 2623511 2639472 2656446 2673676 2689488 2701960 2710396 2715965 2719998 2721686 2718420 2708458
59194B708458j6186k1196k5878l0606l4506l6915l8333l9559m0814m2129m3715
$$ 2708458 2692272 2671076 2645198 2614592 2580086 2543171 2504838 2465279 2424465 2382336 2338621
59183B338621m5403m6248m5351m2933m0198l8066l6354l4306l1803k9657k8479
$$ 2338621 2293218 2246970 2201619 2158686 2118488 2080422 2044068 2009762 1977959 1948302 1919823
59172A919823k7708k6287k4060k1709j9427j6760j3960j2238j1852j1096q326
$$ 1919823 1892115 1865828 1841768 1820059 1800632 1783872 1769912 1757674 1745822 1734726 1726400
59161A726400m362j520o10j39J569M637Q237J1725J4700J6775J8065J9551K2265
$$ 1726400 1722038 1720518 1719908 1719769 1721338 1725975 1734212 1745937 1760637 1777412 1795477 1815028 1837293
59148A837293K6119K9911L2729L5103L8431M3128M7872N1269N3956N8102O4744
$$ 1837293 1863412 1893323 1926052 1961155 1999586 2042714 2090586 2141855 2195811 2253913 2318657
59137B318657P2632Q0034Q6651R3154R9758J06273J12851J19557J25526J29403
$$ 2318657 2391289 2471323 2557974 2651128 2750886 2857159 2970010 3089567 3215093 3344496
59127C344496J30499J28940J25013J19025J11336J01783Q9482P3833N5233L4349
$$ 3344496 3474995 3603935 3728948 3847973 3959309 4061092 4150574 4224407 4279640 4313989
59117D313989J1506j2260l4603n3673o9963q4978r8572j09025j15440j18508j19085
$$ 4313989 4325495 4313235 4278632 4224959 4154996 4070018 3971446 3862421 3746981 3628473 3509388
59106C509388j17502j14204j09657j03731r6455q9066q2764p6836p0065o3618
$$ 3509388 3391886 3277682 3168025 3064294 2967839 2878773 2796009 2719173 2649108 2585490
59096B585490n9966n8590n5648m9065m1396l6037l2932l0044k7151k5552k5215
$$ 2585490 2525524 2466934 2411286 2362221 2320825 2284788 2251856 2221812 2194661 2169109 2143894
59085B143894k4734k3684k2751k1863k0226j8188j7040j6830j6219j4821j3891
$$ 2143894 2119160 2095476 2072725 2050862 2030636 2012448 1995408 1978578 1962359 1947538 1933647
59074A933647j4055j3913j1928q569n479l249j198R96K536K707K182K640N019
$$ 1933647 1919592 1905679 1893751 1885182 1879703 1876454 1875256 1876252 1878788 1881495 1883677 1886317 1891336
59061A891336Q453J1185J2437J2882J3351J3792J3863J3810J3974J3950J3109
$$ 1891336 1899789 1910974 1923411 1936293 1949644 1963436 1977299 1991109 2005083 2019033 2032142
59050B032142J1756J0803J0422R858Q686P312O066M658L033J938J940K257J461
$$ 2032142 2043898 2054701 2065123 2074981 2083667 2090979 2097045 2101703 2104736 2106674 2108614 2110871 2112332
59037B112332o77k764l491l225l388m453n307m792l203j673o09L30J018Q33J52
$$ 2112332 2111655 2108891 2105400 2102175 2098787 2094334 2089027 2084235 2081032 2079359 2078750 2079080 2080098 2080931 2081083
59022B081083N61K850N623O981O896O800P199P073N700L908K901K660K160P73
$$ 2081083 2081644 2084494 2090117 2097098 2103994 2110794 2117993 2125066 2130766 2134674 2137575 2140235 2142395 2143168
59008B143168j104k652l614m704p155j1484j6523k0064k0917k0210k0277k2258
$$ 2143168 2142064 2139412 2135798 2131094 2123939 2112455 2095932 2075868 2054951 2034741 2014464 1992206
58996A992206k5192k7416k8338k8449k8134k7221k5836k4904k5354k7112k9254
$$ 1992206 1967014 1939598 1911260 1882811 1854677 1827456 1801620 1776716 1751362 1724250 1694996
58985A694996l0741l0725k8724k5222k1780j9731j8846j7907j6429j5020j4150
$$ 1694996 1664255 1633530 1604806 1579584 1557804 1538073 1519227 1501320 1484891 1469871 1455721
58974A455721j3564j2955j2362j1633j0310q350o352m764l473k266j126Q6J499
$$ 1455721 1442157 1429202 1416840 1405207 1394897 1386547 1380195 1375431 1371958 1369692 1368566 1368652 1370151
58961A370151K815L683M332M942M766L170J323J072K000J672o27k582k403j571
$$ 1370151 1372966 1376649 1380981 1385923 1390689 1393859 1395182 1396254 1398254 1399926 1399299 1396717 1394314 1392743
58947A392743k420m759o733p677p939p152m978k844k566l657m156l811m186n635
$$ 1392743 1390323 1385564 1378831 1371154 1363215 1356063 1351085 1348241 1345675 1342018 1337862 1334051 1329865 1324230
58933A324230o501n680m071k958k612k858l333k787J66M830Q459R273Q214P232
$$ 1324230 1317729 1312049 1307978 1305020 1302408 1299550 1296217 1293430 1293596 1298426 1306885 1316158 1324372 1331604
58919A331604P168Q077J0157J3206J6024J7504J7879J8194J8912J9521J9153J7432
$$ 1331604 1338772 1346849 1357006 1370212 1386236 1403740 1421619 1439813 1458725 1478246 1497399 1514831
58907A514831J4988J3055J2056J0940Q789O438N319N113M229K371P84j22j348
$$ 1514831 1529819 1542874 1554930 1565870 1574659 1581097 1586416 1591529 1595758 1598129 1598913 1598791 1597443
58894A597443l011l628k540j225j049j340r76l79m26n66N27L038N963Q321R504
$$ 1597443 1594432 1590804 1588264 1587039 1585990 1584650 1583674 1583295 1582869 1582303 1582830 1585868 1591831 1600152 1609656
58879A609656R391Q949R835J2366J4875J5931J6152J6705J7368J7439J7548J8831
$$ 1609656 1619047 1627996 1637831 1650197 1665072 1681003 1697155 1713860 1731228 1748667 1766215 1785046
58867A785046K1009K2837K4027K5279K6865K8455K9963L1377L2318L2963L4637
$$ 1785046 1806055 1828892 1852919 1878198 1905063 1933518 1963481 1994858 2027176 2060139 2094776
58856B094776L8063M1675M3444M3982M5943N0396N5625N9775O2904O5852O8628
$$ 2094776 2132839 2174514 2217958 2261940 2307883 2358279 2413904 2473679 2536583 2602435 2671063
58845B671063P0874P2865P4986P6731P7128P6091P4770P4388P4815P4744P3614
$$ 2671063 2741937 2814802 2889788 2966519 3043647 3119738 3194508 3268896 3343711 3418455 3492069
58834C492069P3033P5208Q0036Q5039Q8662R1916R5914R9474J00957J01139J02202
$$ 3492069 3565102 3640310 3720346 3805385 3894047 3985963 4081877 4181351 4282308 4383447 4485649
58823D485649J04522J06444J06750J05507J02851R9020R5271R2680R0028Q5010
$$ 4485649 4590171 4696615 4803365 4908872 5011723 5110743 5206014 5298694 5388722 5473732
58813E473732P7490O9274O0512M9051L4331J9377P234k757j3412k5779l8381m9396
$$ 5473732 5551222 5620496 5681008 5730059 5764390 5783767 5791001 5788244 5774832 5749053 5710672 5661276
58801E661276n8064o4652p0348p6658q3841r0384r4878r7767j00293j02503j03528
$$ 5661276 5603212 5538560 5468212 5391554 5307713 5217329 5122451 5024684 4924391 4821888 4718360
58790D718360j03323j02846j02526j01633r9354r5891r2328q9604q7683q5675
$$ 4718360 4615037 4512191 4409665 4308032 4208678 4112787 4020459 3930855 3843172 3757497
58780C757497q2933p9783p6798p3682o9778o5469o1838n8843n5200n0395m5473
$$ 3757497 3674564 3594781 3517983 3444301 3374523 3309054 3247216 3188373 3133173 3082778 3037305
58769C037305m1322l7619l4071l1120k8481k4688j9530j5334j3910j3326j0054
$$ 3037305 2995983 2958364 2924293 2893173 2864692 2840004 2820474 2805140 2791230 2777904 2767850
58758B767850l798K115N190O422Q072J0688J3474J6232J9537K3372K6664K8374
$$ 2767850 2764052 2766167 2771357 2777779 2785851 2796539 2810013 2826245 2845782 2869154 2895818 2924192
58746B924192K8766K9396L1631L5158L8284L9972M1006M2825M5888M9851N4556
$$ 2924192 2952958 2982354 3013985 3049143 3087427 3127399 3168405 3211230 3257118 3306969 3361525
58735C361525N9777O4523O7831P0204P3144P7317Q2061Q6686R1151R5389R8878
$$ 3361525 3421302 3485825 3553656 3623860 3697004 3774321 3856382 3943068 4034219 4129608 4228486
58724D228486J01131J01949J01278R9639R8390R8441R8689R6929R2446Q6459P9915
$$ 4228486 4329617 4431566 4532844 4632483 4730873 4829314 4928003 5024932 5117378 5203837 5283752
58713E283752P2322O3157N2992M2381L0921J8295N171p851k1075l4441m6493n6066
$$ 5283752 5356074 5419231 5472223 5514604 5545525 5563820 5568991 5561140 5540065 5505624 5459131 5403065
58701E403065o4170p2725q1989r0640r7915j03982j08461j10478j10471j10230
$$ 5403065 5338895 5266170 5184181 5093541 4995626 4891644 4783183 4672705 4562234 4452004
58691D452004j10595j10599j09469j07940j06597j04462j00696r6545r3865r2250
$$ 4452004 4341409 4230810 4121341 4013401 3906804 3802342 3701646 3605101 3511236 3418986
58681C418986q9464q4559p8968p4228p0257o6325o2430n8817n5236n1610m8640
$$ 3418986 3329522 3244963 3165995 3091767 3021510 2955185 2892755 2833938 2778702 2727092 2678452
58670B678452m6887m5818m4620m3401m2700m2245m1255l9688l8238l7238l6539
$$ 2678452 2631565 2585747 2541127 2497726 2455026 2412781 2371526 2331838 2293600 2256362 2219823
58659B219823l6239l6364l5909l3526k9480k5719k3457k1899k0044j8522j8453
$$ 2219823 2183584 2147220 2111311 2077785 2048305 2022586 1999129 1977230 1957186 1938664 1920211
58648A920211j9298j9437j8647j8603k0738k4586k8638l2017l4807l7332l9589
$$ 1920211 1900913 1881476 1862829 1844226 1823488 1798902 1770264 1738247 1703440 1666108 1626519
58637A626519m1153m1377l9903l7199l4372l2225l0699k9295k7758k6146k4392
$$ 1626519 1585366 1543989 1504086 1466887 1432515 1400290 1369591 1340296 1312538 1286392 1262000
58626A262000k2271j9781j7326j5247j3360j1218q872p039o194n776m785l189
$$ 1262000 1239729 1219948 1202622 1187375 1174015 1162797 1153925 1146886 1140692 1134916 1130131 1126942
58614A126942k162k742m749p228r468j1135j1923j1850j1746j2580j4072j4585
$$ 1126942 1124780 1122038 1117289 1110061 1100593 1089458 1077535 1065685 1053939 1041359 1027287 1012702
58602A012702j2910r920p910q208r755j0404r363p866p273p275o644n330m637
$$ 1012702 999792 989872 981962 973754 963999 953595 944232 936366 929093 921818 915174 909844 905207
58589I05207n186n840n283l869k973l021l173k774k173j941j985j783j082j57
$$ 905207 900021 894181 888898 885029 882056 879035 875862 873088 870915 868974 866989 865206 864124 863967
58575H63967M51N05M73J211K883M507N041M690M532N033N707O324P492R649J2070
$$ 863967 864418 864923 865396 866607 869490 873997 879038 883728 888260 893293 899000 905324 912816 922465 934535
58560I34535J3426J3203J2120J1306J1410J2306J3379J3964J3743J2911J1974
$$ 934535 947961 961164 973284 984590 996000 1008306 1021685 1035649 1049392 1062303 1074277
58549A074277J1350J0998J0547R893R552J0099J1317J2417J3218J4390J6215J7877
$$ 1074277 1085627 1096625 1107172 1117065 1126617 1136716 1148033 1160450 1173668 1188058 1204273 1222150
58537A222150J8709J9460K1319K3962K5804K6275K6620K8064L0114L1411L1530
$$ 1222150 1240859 1260319 1281638 1305600 1331404 1357679 1384299 1412363 1442477 1473888 1505418
58526A505418L1224L1175L1348L1405L1189L0721L0076K9354K8485K7045K4594
$$ 1505418 1536642 1567817 1599165 1630570 1661759 1692480 1722556 1751910 1780395 1807440 1832034
58515A832034K1255J7759J4611J1409P337K375k428o163r092j1828j3846j3913
$$ 1832034 1853289 1871048 1885659 1897068 1904405 1906780 1904352 1898189 1889097 1877269 1863423 1849510
58503A849510j2137j0495j0720j2459j4294j5661j6782j7434j7162j6515j6714
$$ 1849510 1837373 1826878 1816158 1803699 1789405 1773744 1756962 1739528 1722366 1705851 1689137
58492A689137j8060j9646k0735k1403k1845k2158k2896k4660k6844k7844k7023
$$ 1689137 1671077 1651431 1630696 1609293 1587448 1565290 1542394 1517734 1490890 1463046 1436023
58481A436023k5493k4616k4609k4968k5150k4439k2276j9455j7869j8224j8975
$$ 1436023 1410530 1385914 1361305 1336337 1311187 1286748 1264472 1245017 1227148 1208924 1189949
58470A189949j8461j7076j6186j5779j4705j2758j1051j0358j0320j0348j0261
$$ 1189949 1171488 1154412 1138226 1122447 1107742 1094984 1083933 1073575 1063255 1052907 1042646
58459A042646r866q859p421o233n650n416n148m617l514j628O03K248K668J873
$$ 1042646 1032780 1023921 1016500 1010267 1004617 999201 994053 989436 985922 984294 984897 987145 989813 991686
58445I91686L25j178j628n77J278K837L819M562M845L972K142O95M25N07k25j442
$$ 991686 992011 990833 989205 988628 989906 992743 996562 1001124 1005969 1009941 1012083 1012778 1013203 1013710 1013485 1012043
58429A012043j706m37J277K054J837J715K408L468M142M518N229O185O402N335
$$ 1012043 1010337 1009900 1011177 1013231 1015068 1016783 1019191 1022659 1026801 1031319 1036548 1042733 1049135 1054470
58415A054470L768K860K747K702K178J161k62j950l461m366m788n135n485n763
$$ 1054470 1058238 1061098 1063845 1066547 1068725 1069886 1069624 1067674 1064213 1059847 1055059 1049924 1044439 1038676
58401A038676o243p070p520o671m859l535l436l776l604l087k900l005k757j779
$$ 1038676 1032433 1025363 1017843 1011172 1006313 1002778 999342 995566 991962 988875 985975 982970 980213 978434
58387I78434k47J454K782L096K303J229Q71J290J733J797J930K566L352L714L928
$$ 978434 978187 979641 982423 985519 987822 989051 989922 991212 992945 994742 996672 999238 1002590 1006304 1010232
58372A010232M914O774Q210Q085P089O904P774Q163P266O439P089Q200P675N647
$$ 1010232 1015146 1021920 1030130 1038215 1045304 1052208 1059982 1068145 1075411 1081850 1088939 1097139 1104814 1110461
58358A110461M591N966Q387R691R355Q115O552N236N241P063R424J0404R740Q948
$$ 1110461 1115052 1121018 1129405 1139096 1148451 1156566 1163118 1168354 1173595 1180658 1190082 1200486 1210226 1219174
58344A219174R114R537Q959P414O338O966Q998J0902J1575J1405J1466J1923J1923
$$ 1219174 1228288 1237825 1246784 1254198 1260536 1267502 1276500 1287402 1298977 1310382 1321848 1333771 1345694
58331A345694J1188J0773J1680J3277J3972J3117J1493R994Q691P346O136N413
$$ 1345694 1356882 1367655 1379335 1392612 1406584 1419701 1431194 1441188 1449879 1457225 1463361 1468774
58319A468774N138M992M918N221O010O796P011O902P461R126J0919J1558J1220
$$ 1468774 1473912 1478904 1483822 1489043 1495053 1501849 1508860 1515762 1523223 1532349 1543268 1554826 1566046
58306A566046J1406J2959J5021J6287J6490J6166J5745J5504J5794J6585J7169
$$ 1566046 1577452 1590411 1605432 1621719 1638209 1654375 1670120 1685624 1701418 1718003 1735172
58295A735172J7092J7023J7906J9453K0388K0010J8920J8119J8055J8574J9354
$$ 1735172 1752264 1769287 1787193 1806646 1827034 1847044 1865964 1884083 1902138 1920712 1940066
58284A940066K0211K1251K2610K3878K4334K4065K4307K5912K8012K9042K8633
$$ 1940066 1960277 1981528 2004138 2028016 2052350 2076415 2100722 2126634 2154646 2183688 2212321
58273B212321K7624K6619K5807K5890K7684L0571L2712L3297L3380L3965L4510
$$ 2212321 2239945 2266564 2292371 2318261 2345945 2376516 2409228 2442525 2475905 2509870 2544380
58262B544380L4238L3817L4488L6160L7549L8130L8800M0504M2941M4937M5738
$$ 2544380 2578618 2612435 2646923 2683083 2720632 2758762 2797562 2838066 2881007 2925944 2971682
58251B971682M5695M5925M7256M9459N1598N3092N4141N5027N5655N6099N7032
$$ 2971682 3017377 3063302 3110558 3160017 3211615 3264707 3318848 3373875 3429530 3485629 3542661
58240C542661N8995O1442O3184O3750O3869O4624O6429O8790P0792P1821P2182
$$ 3542661 3601656 3663098 3726282 3790032 3853901 3918525 3984954 4053744 4124536 4196357 4268539
58229D268539P2966P5102P8485Q2131Q5141Q7376Q9363R1834R5355J00093J05692
$$ 4268539 4341505 4416607 4495092 4577223 4662364 4749740 4839103 4930937 5026292 5126385 5232077
58218E232077J11238J15564J17995J19136J20778J24616J30969J38740J46453
$$ 5232077 5343315 5458879 5576874 5696010 5816788 5941404 6072373 6211113 6357566
58209F357566J53105J58496J63352J68956J75953J83629J90980J98354K07066
$$ 6357566 6510671 6669167 6832519 7001475 7177428 7361057 7552037 7750391 7957457
58200G957457K17401K28048K37864K47185K57015K67840K79867K93426L08395
$$ 7957457 8174858 8402906 8640770 8887955 9144970 9412810 9692677 9986103 10294498
58191A0294498L23952L39706L56366L74526L93629M13040M33388M55792M80496
$$ 10294498 10618450 10958156 11314522 11689048 12082677 12495717 12929105 13384897 13865393
58182A3865393N07456N37505N71306O07570O44177O81265P21544P67126Q17366
$$ 13865393 14372849 14910354 15481660 16089230 16733407 17414672 18136216 18903342 19720708
58173A9720708Q70415R25643R83832J045909J112339J183093J257615J335148
$$ 19720708 20591123 21516766 22500598 23546507 24658846 25841939 27099554 28434702
58165B8434702J415422J498406J583447J669774J758236J851366J950840K055845
$$ 28434702 29850124 31348530 32931977 34601751 36359987 38211353 40162193 42218038
58157D2218038K165010K279269K401736K535274K681650K843165L024030L229583
$$ 42218038 44383048 46662317 49064053 51599327 54280977 57124142 60148172 63377755
58149F3377755L464727L733556M040275M390253M790302N247874N769289O357544
$$ 63377755 66842482 70576038 74616313 79006566 83796868 89044742 94814031 101171575
58141A01171575P010998P724687Q494693R322642J0215294J1177598J2204375
$$ 101171575 108182573 115907260 124401953 133724595 143939889 155117487 167321862
58134A67321862J3277543J4368726J5440364J6440575J7293705J7890325J8078538
$$ 167321862 180599405 194968131 210408495 226849070 244142775 262033100 280111638
58127B80111638J7662730J6424931J4181449J0865174O596386J697518l368196
$$ 280111638 297774368 314199299 328380748 339245922 345842308 347539826 344171630
58120C44171630q112797j2142408j5228737j7315150j8475255j8856785j8634143
$$ 344171630 336058833 323916425 308687688 291372538 272897283 254040498 235406355
58113B35406355j7976741j7031574j5916839j4722579j3514121j2336091j1216863
$$ 235406355 217429614 200398040 184481201 169758622 156244501 143908410 132691547
58106A32691547j0173167r213603q340810p553136o846281o214392n650652n147865
$$ 132691547 122518380 113304777 104963967 97410831 90564550 84350158 78699506 73551641
58098G3551641m699009m297450l937074l612708l320431l057187k820137k606409
$$ 73551641 68852632 64555182 60618108 57005400 53684969 50627782 47807645 45201236
58090D5201236k413186k237901k078790j935265j806954j692026j587204j489993
$$ 45201236 42788050 40550149 38471359 36536094 34729140 33037114 31449910 29959917
58082B9959917j399994j317498j241770j171823j107737j049624r95911r44370
$$ 29959917 28559923 27242425 26000655 24828832 23721095 22671471 21675560 20731190
58074B0731190q94695q48361q05783p65375p25666o86882o49872o14779n81413
$$ 20731190 19836495 18988134 18182351 17416976 16691310 16004428 15354556 14739777 14158364
58065A4158364n49881n20223m92360m66819m44345m24457m05540l86920l69612
$$ 14158364 13608483 13088260 12595900 12129081 11684736 11260279 10854739 10467819 10098207
58056A0098207l54310l40030l25624l11439k98334k86163k74424k63430k53588
$$ 10098207 9743897 9403867 9078243 8766804 8468470 8182307 7907883 7644453 7390865
58047G390865k44264k34680k25227k16533k07953j98563j89140j81546j76203
$$ 7390865 7146601 6911921 6686694 6470161 6262208 6063645 5874505 5692959 5516756
58038E516756j71628j66419j60339j53504j46039j38759j32798j28017j22997
$$ 5516756 5345128 5178709 5018370 4864866 4718827 4580068 4447270 4319253 4196256
58029D196256j16976j10824j05696j01726r8517r5810r3064q9317q4323p9132
$$ 4196256 4079280 3968456 3862760 3761034 3662517 3566707 3473643 3384326 3300003 3220871
58019C220871p4855p1407o8144o5161o3123o2146o1536o0568n9022n7096n5098
$$ 3220871 3146016 3074609 3006465 2941304 2878181 2816035 2754499 2693931 2634909 2577813 2522715
58008B522715n3134n0978m8508m6282m5082m4660m3687m1430l8895l7585l7553
$$ 2522715 2469581 2418603 2370095 2323813 2278731 2234071 2190384 2148954 2110059 2072474 2034921
57997B034921l7439l6247l4288l2473l1287l0699l0546l0690l1015l1351l1467
$$ 2034921 1997482 1961235 1926947 1894474 1863187 1832488 1801942 1771252 1740237 1708886 1677419
57986A677419l1200l0683l0190k9587k8231k5822k3165k1567k1465k2025k2146
$$ 1677419 1646219 1615536 1585346 1555759 1527528 1501706 1478541 1456974 1435509 1413484 1391338
57975A391338k1497k0480j9508j8631j7723j6773j5904j5252j4900j4855j5069
$$ 1391338 1369841 1349361 1329853 1311222 1293499 1276726 1260822 1245570 1230670 1215815 1200746
57964A200746j5471j6096j7060j8225j8864j8078j5771j3024j1151j0471j0267
$$ 1200746 1185275 1169179 1152119 1133894 1115030 1096952 1081181 1068157 1057006 1046535 1036268
57953A036268r716q523o933n623n391o291p134o559m721l159k845l159l113k719
$$ 1036268 1026552 1018029 1011096 1005473 1000082 993791 986657 980098 975377 972218 969373 966214 963101 960382
57939I60382k504k380j836p86M51J660K519K360R60p58j714k114k889l885l816
$$ 960382 957878 955498 953662 952876 953327 954987 957506 959866 960826 960068 958354 956240 953351 949466 945650
57924I45650k188q0J463K638L809M272L244J503Q45J909L562M486M604M608M827
$$ 945650 943462 943382 944845 947483 951292 955564 958808 960311 961156 963065 966627 971113 975717 980325 985152
57909I85152N067N210N393N576N217L680J004j857l882n073o343q123r705j0434
$$ 985152 990219 995429 1000822 1006398 1011615 1015295 1016299 1014442 1010560 1005487 999144 991021 981316 970882
57895I70882j0956j2240j3680j3559j1747j0451j1322j2880j2364r513o862o143
$$ 970882 959926 947686 934006 920447 908700 898249 886927 874047 861683 852170 845308 839165
57883H39165o151m871k319j33P85Q80N81j98j195j627j329j236k212l996n787
$$ 839165 833014 828143 825824 825691 826476 827356 827937 827739 826544 824917 823588 822352 820140 816144 810357
57868H10357p315q789j0092j0841j1190j1938j3498j5057j5194j3410j0802q980
$$ 810357 803042 794253 784161 773320 762130 750192 736694 721637 706443 693033 682231 673251
57856F73251q423q124o882m552j976K0J185J699J936K170K154J268m92j971k114
$$ 673251 664828 656704 649822 645270 643294 643314 644499 646198 648134 650304 652458 653726 653234 651263 649149
57841F49149j572k074m094o105o558n686m798m597n000n900p086p726p057n572
$$ 649149 647577 645503 641409 635304 628746 623060 618262 613665 608665 602765 595679 587953 580896 575324
57827E75324m683n053n943o301n878n143m677m893n746o491o223m906l505k921
$$ 575324 570641 565588 559645 553344 547466 542323 537646 532753 527007 520516 514293 509387 505882 502961
57813E02961l219l951m598m410k671K20K430K383O39o40q3J710L382M355M784
$$ 502961 499742 495791 491193 486783 484112 484332 486762 489145 489784 489144 489061 490771 494153 498508 503292
57798E03292M710M055L137K522K318K054J275p0j728l218l922l629l060l290m524
$$ 503292 508002 512057 515194 517716 520034 522088 523363 523293 521565 518347 514425 510796 507736 504446 499922
57783D99922n938o867p514q170q536q339p902p405o190l761r95P82J683K987M986
$$ 499922 493984 487117 479603 471433 462897 454558 446656 439251 433061 429300 428305 429087 430770 433757 438743
57768D38743O424O308N040L371J456m55j539j542j381j761k020j397m95m10j104
$$ 438743 445167 451475 456515 459886 461342 460887 459348 457806 456425 454664 452644 451247 450752 450342 449238
57753D49238j881k804m085m690l263m91J193N96q86j369o50L42J100J757K458
$$ 449238 447357 444553 440468 435778 432515 432024 433217 433813 432927 431558 430908 431250 432350 434107 436565
57738D36565L223L950M244L787L117L268M384N528O039O201O243N814N029M877
$$ 436565 439788 443738 447982 451769 454886 458154 462538 468066 474105 480306 486549 492363 497392 502269
57724E02269N690O215N180L037J098l47j947l838n462o536p164p316p246p971
$$ 502269 507959 514174 519354 522391 523489 523142 521195 517357 511895 505359 498195 490879 483633 475662
57710D75662j0095j2320j2611j0953r557r949j1101j1055r377p188n584m932n161
$$ 475662 465567 453247 440636 429683 420126 410177 399076 388021 378644 371456 365872 360940 355779
57697C55779n829o078n299l809k482j763j405j010m50J26L83M9n72n70N59K004
$$ 355779 349950 343872 338573 334764 332282 330519 329114 328104 327654 327780 328163 328212 327640 327070 327629 329633
57681C29633K308J126k65n89j71l00j232j709o98J191K542K815K410J570L24n97
$$ 329633 331941 333067 332802 332213 332042 331742 330510 328801 328103 329294 331836 334651 337061 338631 338955 338358
57665C38358l5J986L945M647M473M276M082L813M178N460O156M605J745M18J663
$$ 338358 338323 340309 344254 348901 353374 357650 361732 365545 369723 375183 381339 385944 387689 388107 389770
57650C89770L371L302J962J469K622M369N496N709N284M730M750N731P267Q510
$$ 389770 393141 396443 398405 399874 402496 406865 412361 418070 423354 428084 432834 438565 445832 454342
57636D54342R021Q939Q610Q400Q579R039R388R621J0238J1273J1947J1841J1948
$$ 454342 463363 472302 480912 489312 497891 506930 516318 525939 536177 547450 559397 571238 583186
57623E83186J3547J6423J9237K1534K4245K8105L2606L6864M0690M4404M8342
$$ 583186 596733 613156 632393 653927 678172 706277 738883 775747 816437 860841 909183
57612I09183N3070N9376O7460P6474Q5130R1984R4569Q9115P2688M6115J4431
$$ 909183 962253 1021629 1089089 1165563 1250693 1342677 1437246 1526361 1599049 1645164 1659595
57601A659595j5742l9266n3853n9843n9345n4976m8602m0977l2463k3804j6031
$$ 1659595 1643853 1604587 1550734 1490891 1431546 1376570 1327968 1286991 1254528 1230724 1214693
57590A214693r819n088j159K783P028J0897J3119J3009J1327R640Q739P900N947
$$ 1214693 1204874 1199786 1198627 1201410 1208438 1219335 1232454 1245463 1256790 1266430 1275169 1283069 1289016
57577A289016K874j7j723k806m713p884j1154j3214j4108j4814j5782j6615j7161
$$ 1289016 1291890 1291873 1290150 1287344 1282631 1274747 1263593 1250379 1236271 1221457 1205675 1189060 1171899
57564A171899j7937j9080j9592j8455j6201j4555j4426j4828j4038j1443q142
$$ 1171899 1153962 1134882 1115290 1096835 1080634 1066079 1051653 1036825 1022787 1011344 1003202
57553A003202n999o077p578q198o100j850K057L805L900L879M123L859L048L028
$$ 1003202 997203 991126 983548 975350 969250 967400 969457 973262 977162 981041 985164 989023 992071 995099
57539I95099M895P971J0510J1615J2004J2927J4746J6594J7313J6697J5792J5874
$$ 995099 999994 1007965 1018475 1030090 1042094 1055021 1069767 1086361 1103674 1120371 1136163 1152037
57527A152037J7172J8709J9414J9097J8194J6846J4684J1634Q567O660N952N019
$$ 1152037 1169209 1187918 1207332 1226429 1244623 1261469 1276153 1287787 1296354 1303014 1308966 1313985
57515A313985K562r68m029o213q721j2302j5778j7633j8229j9119k0527k1114
$$ 1313985 1316547 1315579 1311550 1305337 1296616 1284314 1268536 1250903 1232674 1213555 1193028 1171914
57503A171914k0351j9532j9777k0300j9725j8158j6835j6218j5655j4699j3748
$$ 1171914 1151563 1132031 1112254 1091954 1072229 1054071 1037236 1021018 1005363 990664 976916
57492I76916j3221j2910j2345j1316r892q349p128o571o556o634o423n769m643
$$ 976916 963695 950785 938440 927124 917232 908883 901755 895184 888628 881994 875571 869802 865159
57479H65159l199j828r24o34q68j254j087J14J728K366J616Q73J698L789N349
$$ 865159 861960 860132 859208 858574 857706 856452 855365 855479 857207 859573 861189 862062 863760 867549 872898
57464H72898N225L926K696K382L125M465N594O109O445P201Q283R219R966J0671
$$ 872898 878123 882049 884745 887127 890252 894717 900311 906420 912865 920066 928349 937568 947534 958205
57450I58205J1011J0755J0632J1534J3023J3792J3565J3328J3562J3722J3757
$$ 958205 969216 979971 990603 1002137 1015160 1028952 1042517 1055845 1069407 1083129 1096886
57439A096886J4660J6847J9197K0476K0609J9968J8646J7300J7263J8566J9157
$$ 1096886 1111546 1128393 1147590 1168066 1188675 1208643 1227289 1244589 1261852 1280418 1299575
57428A299575J7510J5034J4107J4567J4204J2183R806P879N572K514K3q33r07
$$ 1299575 1317085 1332119 1346226 1360793 1374997 1387180 1396986 1404865 1410437 1412951 1412974 1412141 1411234
57415A411234j569k827m014n309p196r032r606q873q049p977q287q176p145n058
$$ 1411234 1409665 1406838 1402824 1397515 1390319 1381287 1371681 1362808 1354759 1346782 1338495 1330319 1323174 1318116
57401A318116k334k14J43q17j145M61L136M955N147M635M754O007P931R512R860
$$ 1318116 1315782 1315568 1315711 1314894 1313749 1314210 1317346 1322301 1327448 1332083 1336837 1342844 1350775 1360287 1370147
57386A370147R059Q421R231J1106J2355J2254J2152J3582J5991J7416J7206J6737
$$ 1370147 1379206 1387627 1396858 1407964 1420319 1432573 1444725 1458307 1474298 1491714 1508920 1525657
57374A525657J7308J8489J9103J8925J8493J7927J6957J5844J5307J5317J4800
$$ 1525657 1542965 1561454 1580557 1599482 1617975 1635902 1652859 1668703 1684010 1699327 1714127
57363A714127J2901J0208Q197P537P210N569K286j103k884l142l430m663o210
$$ 1714127 1727028 1737236 1745433 1752970 1760180 1765749 1768035 1766932 1764048 1760906 1757476 1752813 1746603
57350A746603p215p724p957p537o380n570o084p159p210o155n454n773o035n247
$$ 1746603 1739388 1731664 1723707 1716170 1709790 1704220 1698136 1690977 1683767 1677612 1672158 1666385 1660350 1655103
57336A655103l963l169k650j380Q47K986L866L350K508K727M374O264O909O322
$$ 1655103 1651140 1647971 1645321 1643941 1644788 1647774 1651640 1654990 1657498 1660225 1664599 1670863 1677772 1684094
57322A684094N964O789Q032Q371P599O643O374O904P792Q515Q957R535J0625J1793
$$ 1684094 1690058 1696847 1704879 1713250 1720849 1727492 1733866 1740770 1748562 1757077 1766034 1775569 1786194 1797987
57308A797987J2194J1798J1514J1878J2381J2449J2270J2106J1723J1216J1542
$$ 1797987 1810181 1821979 1833493 1845371 1857752 1870201 1882471 1894577 1906300 1917516 1929058
57297A929058J3203J5010J5330J4193J3052J2668J2442J1890J1552J2043J3049
$$ 1929058 1942261 1957271 1972601 1986794 1999846 2012514 2024956 2036846 2048398 2060441 2073490
57286B073490J3771J3832J3353J2593J1817J1270J1156J1690J3031J4846J6222
$$ 2073490 2087261 2101093 2114446 2127039 2138856 2150126 2161282 2172972 2186003 2200849 2217071
57275B217071J6529J6187J6006J6090J6072J6102J6593J7059J6488J5064J4376
$$ 2217071 2233600 2249787 2265793 2281883 2297955 2314057 2330650 2347709 2364197 2379261 2393637
57264B393637J5392J7179J8302J8490J8170J7299J5811J4625J4845J6059J6656
$$ 2393637 2409029 2426208 2444510 2463000 2481170 2498469 2514280 2528905 2543750 2559809 2576465
57253B576465J5976J5118J5249J6014J6299J5923J5782J6486J7565J8184J8163
$$ 2576465 2592441 2607559 2622808 2638822 2655121 2671044 2686826 2703312 2720877 2739061 2757224
57242B757224J7984J7975J7905J7542J7339J8138K0001K1712K2003K1167K0907
$$ 2757224 2775208 2793183 2811088 2828630 2845969 2864107 2884108 2905820 2927823 2948990 2969897
57231B969897K2241K4092K4645K3844K3560K4970K6788K7009K5742K5047K6019
$$ 2969897 2992138 3016230 3040875 3064719 3088279 3113249 3140037 3167046 3192788 3217835 3243854
57220C243854K7513K8248K8779L0298L2418L3601L3333L2473L1591L0428K9252
$$ 3243854 3271367 3299615 3328394 3358692 3391110 3424711 3458044 3490517 3522108 3552536 3581788
57209C581788K9183L0446L1431L0430K7675K4768K2652K0992J9167J7034J4921
$$ 3581788 3610971 3641417 3672848 3703278 3730953 3755721 3778373 3799365 3818532 3835566 3850487
57198C850487J3495J3376J4236J4723J3970J2838J2759J3718J4421J4348J4346
$$ 3850487 3863982 3877358 3891594 3906317 3920287 3933125 3945884 3959602 3974023 3988371 4002717
57187D002717J4985J5608J5675J5916J7204J8949J9665J8786J7126J5737J5181
$$ 4002717 4017702 4033310 4048985 4064901 4082105 4101054 4120719 4139505 4156631 4172368 4187549
57176D187549J5694J7066J8200J7670J5169J1950R529Q435Q507R588J1300J2632
$$ 4187549 4203243 4220309 4238509 4256179 4271348 4283298 4292827 4301262 4309769 4319357 4330657 4343289
57164D343289J2654J1627J0704J0542J0851J1306J2009J2796J2978J2481J2476
$$ 4343289 4355943 4367570 4378274 4388816 4399667 4410973 4422982 4435778 4448756 4461237 4473713
57153D473713J3895J5785J6315J5377J4885J6199J8397J9828K0354K0977K1854
$$ 4473713 4487608 4503393 4519708 4535085 4549970 4566169 4584566 4604394 4624748 4645725 4667579
57142D667579K2001K0936J9531J8943J9435K0502K1518K1947K1531K0536J9445
$$ 4667579 4689580 4710516 4730047 4748990 4768425 4788927 4810445 4832392 4853923 4874459 4893904
57131D893904J8325J7057J6224J6915J9194K1605K2872K3363K4155K5287K6049
$$ 4893904 4912229 4929286 4945510 4962425 4981619 5003224 5026096 5049459 5073614 5098901 5124950
57120E124950K6554K7826L0215L2828L4764L6007L6787L6919L6262L5161L4023
$$ 5124950 5151504 5179330 5209545 5242373 5277137 5313144 5349931 5386850 5423112 5458273 5492296
57109E492296L3003L2417L2657L3196L2515K9837K6339K3809K2604K1892K1575
$$ 5492296 5525299 5557716 5590373 5623569 5656084 5685921 5712260 5736069 5758673 5780565 5802140
57098E802140K2668K5621K9192L1463L1630L0755L1018L3967L8885M3161M4995
$$ 5802140 5824808 5850429 5879621 5911084 5942714 5973469 6004487 6038454 6077339 6120500 6165495
57087F165495M5332M6227M7797M8375M7542M7083M8090M9000M7847M5123M2733
$$ 6165495 6210827 6257054 6304851 6353226 6400768 6447851 6495941 6544941 6592788 6637911 6680644
57076F680644M1056L8982L6465L5045L5647L7544L9984M3376M8020N2801N6150
$$ 6680644 6721700 6760682 6797147 6832192 6867839 6905383 6945367 6988743 7036763 7089564 7145714
57065G145714N7664N7915N7148N4960N0967M5036L6876K6186J3358l39j3663k6574
$$ 7145714 7203378 7261293 7318441 7373401 7424368 7469404 7506280 7532466 7545824 7545485 7531822 7505248
57053G505248m0285n5891p2800q9027j03322j16548j30295j44602j58049j69955
$$ 7505248 7464963 7409072 7336272 7247245 7143923 7027375 6897080 6752478 6594429 6424474
57043F424474j81185j92521k03508k13834k25072k40208k62088k93105l35673
$$ 6424474 6243289 6050768 5847260 5633426 5408354 5168146 4906058 4612953 4277280
57034D277280l91824m62315n46806o44596p54192F05181c89504j117210j236895
$$ 4277280 3885456 3423141 2876335 2231739 1477547 605181 -389504 -1506714 -2743609
57025b743609j350390j452912j537853j595591j611637j567547j446927j243566
$$ -2743609 -4093999 -5546911 -7084764 -8680355 -10291992 -11859539 -13306466 -14550032
57017a4550032r65741o34048k75122Q4204M20319P14607R54933J136463J260695
$$ -14550032 -15515773 -16149821 -16424943 -16340739 -15920420 -15205813 -14250880 -13114417 -11853722
57008a1853722J333033J360818J352574J317076J261708J191726J111795J027511
$$ -11853722 -10520689 -9159871 -7807297 -6490221 -5228513 -4036787 -2924992 -1897481
57000a897481R44353h7911G02250P18668O51079N87888N28928M74091M23896L78530
$$ -1897481 -953128 -87911 702250 1420918 2071997 2659885 3188813 3662904 4086800 4465330
56990D465330L37147K98976K64425K34089K07318J82884J60669J41439J24991
$$ 4465330 4802477 5101453 5365878 5599967 5807285 5990169 6150838 6292277 6417268
56981F417268J09812R4794Q0192O6501N3397M0535K8518J8227R417P85q609j8377
$$ 6417268 6527080 6621874 6702066 6768567 6821964 6862499 6891017 6909244 6918661 6919446 6910837 6892460
56969F892460k7304l4593m0622m6426n2269n6984n9288n9581n9681o0629o1821
$$ 6892460 6865156 6830563 6789941 6743515 6691246 6634262 6574974 6515393 6455712 6395083 6333262
56958F333262o2624o3679o5568o7293o7579o7351o9235p4308q0616q5405q7853
$$ 6333262 6270638 6206959 6141391 6074098 6006519 5939168 5869933 5795625 5715009 5629604 5541751
56947E541751q9091r0494r2764r6013r9781j03171j05622j07516j09669j12365
$$ 5541751 5452660 5362166 5269402 5173389 5073608 4970437 4864815 4757299 4647630 4535265
56937D535265j15146j17352j18640j19275j20077j21507j22771j22342j19886
$$ 4535265 4420119 4302767 4184127 4064852 3944775 3823268 3700497 3578155 3458269
56928C458269j16838j14536j12482j09412j05402j01737r8844r5682r1374q6438
$$ 3458269 3341431 3226895 3114413 3005001 2899599 2797862 2699018 2603336 2511962 2425524
56918B425524q1982p8335p4911p0922o6029o0652n5844n2379m9808m6883m2981
$$ 2425524 2343542 2265207 2190296 2119374 2053345 1992693 1936849 1884470 1834662 1787779 1744798
56907A744798l8571l4292l0225k6268k2574j9367j6833j5290j4758j4268j2539
$$ 1744798 1706227 1671935 1641710 1615442 1592868 1573501 1556668 1541378 1526620 1512352 1499813
56896A499813r640p206o468o982p722q517r554j0389j0548j0555j1109j1655j0967
$$ 1499813 1490173 1482967 1476499 1469517 1461795 1453278 1443724 1433335 1422787 1412232 1401123 1389468 1378501
56883A378501r068p360o819p000p080o841o346n474m178k664j041O06J686J408
$$ 1378501 1369433 1362073 1355254 1348254 1341174 1334333 1327987 1322513 1318335 1315671 1314630 1315236 1316922 1318330
56869A318330r7j724k818l922n595p329q346q930j0023j1759j3309j4036j3974
$$ 1318330 1318233 1316509 1313691 1309769 1304174 1296845 1288499 1279569 1269546 1257787 1244478 1230442 1216468
56856A216468j3200j1620r657q269p750p205n894m632m921o731q157p625n647
$$ 1216468 1203268 1191648 1181991 1173722 1165972 1158767 1152873 1148241 1143320 1136589 1128432 1120807 1115160
56843A115160l833k770j742l11R05J223R51R29J545K503L355L798L855L938M492
$$ 1115160 1111327 1108557 1106815 1106504 1107409 1108632 1109583 1110512 1112057 1114560 1117915 1121713 1125568 1129506 1133998
56828A133998N343N818N750N763O199O468O041N514N718O224N775M044K050P76
$$ 1133998 1139341 1145159 1150909 1156672 1162871 1169339 1175380 1180894 1186612 1192836 1198611 1202655 1204705 1205481
56814A205481M09Q75K130L654M671N233O246Q171J0426J2381J3942J4847J4535
$$ 1205481 1205890 1206765 1208895 1212549 1217220 1222453 1228699 1236870 1247296 1259677 1273619 1288466 1303001
56801A303001J3359J2811J3518J3955J2298Q790N093K041n93k627l549l915m893
$$ 1303001 1316360 1329171 1342689 1356644 1368942 1377732 1382825 1384866 1384273 1381646 1378097 1374182 1369289
56788A369289o135n814l332m25J315K507M359O417P714R182J2674J7660K1048
$$ 1369289 1363154 1357340 1354008 1353583 1354898 1357405 1361764 1368181 1375895 1385077 1397751 1415411 1436459
56775A436459K0981J9090J7814J6970J4515R948N050J146k572p249j2107j5224
$$ 1436459 1457440 1476530 1494344 1511314 1525829 1535777 1540827 1541973 1539401 1532152 1520045 1504821
56763A504821j6059j5887j5696j4824j2370r176p268p310p591o038k732M02K211
$$ 1504821 1488762 1472875 1457179 1442355 1429985 1420809 1413541 1406231 1398640 1392602 1389870 1390272 1392483
56750A392483L692O236R261J0537Q802N179J644j130l826o980j0263j3068j5014
$$ 1392483 1396175 1402411 1411672 1422209 1431011 1436190 1437834 1436704 1432878 1425898 1415635 1402567 1387553
56737A387553j5788j5268j4096j3463j3836j4316j3775j2250j0687r440p751m916
$$ 1387553 1371765 1356497 1342401 1328938 1315102 1300786 1287011 1274761 1264074 1254634 1246883 1241967
56725A241967j462J149K013J739J793K797L617K490q83m816p481q824j0131j1994
$$ 1241967 1240505 1241654 1243667 1245406 1247199 1249996 1253613 1256103 1255220 1250404 1242923 1234099 1223968 1211974
56711A211974j3595j4045j3682j3534j3983j4475j4364j3585j2500j1313r865
$$ 1211974 1198379 1184334 1170652 1157118 1143135 1128660 1114296 1100711 1088211 1076898 1067033
56700A067033p953n954m866n410o968p929p284n605m171l490l080k451j746j529
$$ 1067033 1059080 1053126 1048260 1042850 1035882 1027953 1020669 1015064 1010893 1007403 1004323 1001872 1000126 998597
56686I98597k197l529m571m265k631r80m49p08q37j025k228m117m823l341j063
$$ 998597 996400 992871 988300 984035 981404 980424 979975 979267 978430 977405 975177 971060 966237 962896 961833
56671I61833p2p41j959k944l654l918l432k479j587n98P85J727R11j280k703k082
$$ 961833 961761 961020 959061 956117 952463 948545 945113 942634 941047 940449 941234 942961 943872 942592 939889 937807
56655I37807n89K8l35o62o11n23k88N25J574J949J447P26K32j64m08j07O37J059
$$ 937807 937218 937246 936911 936249 935638 935115 934827 935352 936926 938875 940322 941048 941280 941116 940708 940601 941238 942297
56637I42297Q04N60J011J647J257m40k118k161m72J270J409O1j287j757j918k488
$$ 942297 943101 943661 944672 946319 947576 947136 945018 942857 942385 943655 945064 945125 943838 942081 940163 937675
56621I37675l135l144k618k203k078j991j913j814j155L28J643J505K50m44Q9
$$ 937675 934540 931396 928778 926575 924497 922506 920593 918779 917624 917952 919595 921100 921350 920906 920995
56606I20995P32M80j31k17m9m12j150j406q89j14L61L19k17q79r92k90O09Q81
$$ 920995 921727 922207 922076 921859 921810 921398 920248 918842 917953 917839 918200 918519 918302 917423 916431 916141 916750 917631
56588I17631L65n72j569k183j748k43J075P96q51k043j437M26J920K104J320L59
$$ 917631 917996 917424 915855 913672 911924 911681 912756 913552 912701 910658 909221 909647 911567 913671 914991 915350
56572I15350n17j542k675l297k990k334k296k847k920j870l11Q39J327J137k1
$$ 915350 914833 913291 910616 907319 904329 901995 899699 896852 893932 892062 891751 892590 893917 895054 895033
56557H95033j994l658m059l604l256k960k037p95m39j258k123k139j783j898k377
$$ 895033 893039 889381 885322 881718 878462 875502 873465 872670 872231 870973 868850 866711 864928 863030 860653
56542H60653k445j762o78K60P61Q88R22Q46J79j298k780l105k154r06j54L3m00
$$ 860653 858208 856446 855768 856028 856789 857677 858599 859445 859624 858326 855546 852441 850287 849381 849227 849260 848860
56525H48860j684l347m143l467k057q43J52J148J802J699J062L08m55q85k82J136
$$ 848860 847176 843829 839686 836219 834162 833319 833471 834619 836421 838120 839182 839490 839035 838150 837868 839004
56509H39004J875J210O62J931M179N188M740M658N457N383L614K145L016N270
$$ 839004 840879 842089 842751 844682 848861 854049 858789 863447 868904 874287 877901 880046 883062 888332
56495H88332O415N774M600L668K674J667J307J616J960K280K943L349K350M21
$$ 888332 894747 900521 905121 908789 911463 913130 914437 916053 918013 920293 923236 926585 928935 929356
56481I29356m01M41P57j439m930o891o573n706n605n649m797l152j522n36o82
$$ 929356 928955 929396 930153 928714 923784 916893 910320 904614 899009 893360 888563 885411 883889 883353 882671
56466H82671k320m920o938p129n778m236l537l779m443m860m668m173m079m530
$$ 882671 880351 875431 868493 861364 855586 851350 847813 844034 839591 834731 830063 825890 821811 817281
56452H17281m682l643j787o48j298l029l834k416L14J940J012j394k858k227n14
$$ 817281 812599 808956 807169 806521 805223 802194 798360 795944 796258 798198 799210 797816 794958 792731 792217
56437G92217O77R46J006J353J639J272J29j337k483k913k498j180J002L406M710
$$ 792217 792894 793840 794846 796199 797838 799110 799239 797902 795419 792506 790008 788828 789830 793236 797946
56422G97946L972J727m57j577j729j189K7J322J361l61k342k487o06J360J571
$$ 797946 801918 803645 803188 801611 799882 798693 798720 800042 801403 801042 798700 796213 795607 796967 798538
56407G98538J67j207j205N2J329J624J218J188J920K494J893K88j337k432l033
$$ 798538 798705 797498 796293 796345 797674 799298 800516 801704 803624 806118 808011 808299 806962 804530 801497
56392H01497l046k243r73o1K36N51J392K321K514J836J001O90P57L52j130l196
$$ 801497 798451 796208 795235 795174 795410 795961 797353 799674 802188 804024 805025 805715 806472 806824 805694 802498
56376H02498m512m245k984k071k106k428k070j054n07j410l153l714j882R07J889
$$ 802498 797986 793741 790757 788686 786580 784152 782082 781028 780521 779111 775958 772244 770362 771269 773158
56361G73158M02j242r39K88l1k070l465k729j090m41r71j691k059k058j443q6
$$ 773158 773560 772318 771379 771667 771636 769566 766101 763372 762282 761841 760870 759179 757120 755062 753619 753533
56345G53533J307J713R66k06j121j658j985k225k271j622J48K376L335K079k8
$$ 753533 754840 756553 757519 757313 756192 754534 752549 750324 748053 746431 746579 748955 752290 754369 754341
56330G54341n99R10K558K396P97k60L34J789K579J961K74j540k433j812j60J186
$$ 754341 753742 754652 757210 759606 760403 760143 760477 762266 764845 766806 767080 765540 763107 761295 761135 762321
56314G62321J340Q04O28Q61N81m62j114k64J669L334M104M307M067K937R43q24
$$ 762321 763661 764465 765093 765954 766535 766073 764959 764695 766364 769698 773802 778109 782176 785113 786056 785232
56298G85232j176j54J020J224M81k49j93M91J190J701K138K077P07j719l412k894
$$ 785232 784056 783902 784922 786146 786627 786378 786185 786676 787866 789567 791705 793782 794489 792770 789358 786464
56282G86464q20R09J452J468J448R80o5p70k61J112K267K652K491K106J596J083
$$ 786464 785644 786553 788005 789473 790921 791901 791836 791066 790805 791917 794184 796836 799327 801433 803029 804112
56266H04112Q88J207J664J385j12j952k427q68J510L102L718M134M492M298L735
$$ 804112 805000 806207 807871 809256 809144 807192 804765 803897 805407 808509 812227 816361 820853 825151 828886
56251H28886L577L772L294J768K51Q7J684M527P454Q906Q084O085M730M228L364
$$ 828886 832463 836235 839529 841297 841548 841635 843319 847846 855300 864206 872290 878375 883105 887333 890697
56236H90697K191K538N037P418P252N141L642L986N367O640P210O716N396M507
$$ 890697 892888 895426 900463 907881 915133 920274 923916 927902 933269 939909 947119 953835 959231 963738
56222I63738N032O230O664O386O737Q117R459J0015J0354J1162J2160J2690J2559
$$ 963738 968770 975000 981664 988050 994787 1002904 1012363 1022378 1032732 1043894 1056054 1068744 1081303
56209A081303J1921J0956J0059R755J0256J1414J3071J4975J6475J7137J7587
$$ 1081303 1093224 1104180 1114239 1123994 1134250 1145664 1158735 1173710 1190185 1207322 1224909
56198A224909J9114K2135K5692K8528L0271L1471L3010L5439L8557M1633M4306
$$ 1224909 1244023 1266158 1291850 1320378 1350649 1382120 1415130 1450569 1489126 1530759 1575065
56187A575065M6857M9195N0278M9493M8120M8048M9048M8752M5633M0756L5983
$$ 1575065 1621922 1671117 1721395 1770888 1819008 1867056 1916104 1964856 2010489 2051245 2087228
56176B087228L1605K6660K0773J4593Q711L062k505p849j2850j7609k2002k5301
$$ 2087228 2118833 2145493 2166266 2180859 2189570 2192632 2190127 2182278 2169428 2151819 2129817 2104516
56164B104516k6841k7111k7784l0084l3371l5911l6952l7224l7300l6689l5118
$$ 2104516 2077675 2050564 2022780 1992696 1959325 1923414 1886462 1849238 1811938 1775249 1740131
56153A740131l3545l2888l2533l1341k9527k8193k7335k5807k3147k0188j7771
$$ 1740131 1706586 1673698 1641165 1609824 1580297 1552104 1524769 1498962 1475815 1455627 1437856
56142A437856j6015j4945j4460j3687j1658q973p395p299o906m707j504Q73J866
$$ 1437856 1421841 1406896 1392436 1378749 1367091 1358118 1350723 1343424 1336518 1331811 1330307 1331180 1333046
56129A333046K272K808L529M132M192L579L117M155O928R971J1715J1994J1474
$$ 1333046 1335318 1338126 1341655 1345787 1349979 1353558 1356675 1360830 1367758 1377729 1389444 1401438 1412912
56116A412912J0604R895J0243J1845J3458J3867J3571J3938J5165J6343J7156
$$ 1412912 1423516 1433411 1443654 1455499 1468957 1482824 1496395 1510333 1525498 1541841 1558997
56105A558997J8218J9812K1566K3449K5791K8196K9688L0339L1549L4107L7078
$$ 1558997 1577215 1597027 1618593 1642042 1667833 1696029 1725717 1756056 1787605 1821712 1858790
56094A858790L9530M2307M6955N3479O0494O7408P5069Q4069R3723J03418J13870
$$ 1858790 1898320 1940627 1987582 2041061 2101555 2168963 2244032 2328101 2421824 2525242 2639112
56083B639112J25754J37601J46239J49341J46571J38198J24299J06185Q7543P2551
$$ 2639112 2764866 2902467 3048706 3198047 3344618 3482816 3607115 3713300 3800843 3873394
56073C873394O2805N6895N2677M8917M4708L8702K9848J8638P036k882j0461j7025
$$ 3873394 3936199 3993094 4045771 4094688 4139396 4178098 4207946 4226584 4233620 4230738 4220277 4203252
56061D203252k4989l5956m9753o5472q2718j00844j17322j28377j31851j28637
$$ 4203252 4178263 4142307 4092554 4027082 3944364 3843520 3726198 3597821 3465970 3337333
56051C337333j21113j11077r9651q7957p6796o6069n5393m5089l6189k9645k5553
$$ 3337333 3216220 3105143 3005492 2917535 2840739 2774670 2719277 2674188 2637999 2608354 2582801
56040B582801k2715j8953j2904n752k80K276L383M821O530P733Q774J0320J1757
$$ 2582801 2560086 2541133 2528229 2522477 2522197 2524473 2527856 2532677 2539207 2546940 2555714 2566034 2577791
56027B577791J2193J2508J4472J7885K0479K1035K0984K2284K4964K7630K9305
$$ 2577791 2589984 2602492 2616964 2634849 2655328 2676363 2697347 2719631 2744595 2772225 2801530
56016B801530K9998L0107L0227L1057L2813L5019L7361M0256M3900M7211M8646
$$ 2801530 2831528 2861635 2891862 2922919 2955732 2990751 3028112 3068368 3112268 3159479 3208125
56005C208125M8133M7367M7850M9241N0296N0964N2551N5567N8478N9559N9373
$$ 3208125 3256258 3303625 3351475 3400716 3451012 3501976 3554527 3610094 3668572 3728131 3787504
55994C787504O0025O2037O3611O3456O2809O3490O5309O7024O8948P2442P7142
$$ 3787504 3847529 3909566 3973177 4036633 4099442 4162932 4228241 4295265 4364213 4436655 4513797
55983D513797Q0788Q2321Q3285Q5474Q8777R2329R6316J01190J06159J10015J12986
$$ 4513797 4594585 4676906 4760191 4845665 4934442 5026771 5123087 5224277 5330436 5440451 5553437
55972E553437J16391J20745J25483J30390J35953J42117J47989J53216J58662
$$ 5553437 5669828 5790573 5916056 6046446 6182399 6324516 6472505 6625721 6784383
55963F784383J65173J72566J80451J89285J99607K10732K21236K30780K40610
$$ 6784383 6949556 7122122 7302573 7491858 7691465 7902197 8123433 8354213 8594823
55954H594823K52035K65010K78582K92296L06723L22756L40651L59758L79164
$$ 8594823 8846858 9111868 9390450 9682746 9989469 10312225 10652876 11012634 11391798
55945A1391798L98669M19045M41158M64951M89841N16129N45311N78516O15120
$$ 11391798 11790467 12209512 12650670 13115621 13605462 14121591 14666902 15245418 15860538
55936A5860538O53602O93383P35230P80047Q28065Q79317R34203R93273J056732
$$ 15860538 16514140 17207523 17942753 18722800 19550865 20430182 21364385 22357658 23414390
55927B3414390J124136J194251J265516J337414J411370J489434J572011J657753
$$ 23414390 24538526 25732777 26998293 28335707 29747077 31236511 32808522 34466275
55919C4466275J745866J837529J934503K037532K147102K265030K394255K537567
$$ 34466275 36212141 38049670 39984173 42021705 44168807 46433837 48828092 51365659
55911E1365659K697672K878336L084329L320145L589690L897414M248935M650164
$$ 51365659 54063331 56941667 60025996 63346141 66935831 70833245 75082180 79732344
55903G9732344N106272N621852O201461O849181P567320Q355443R210424J0126921
$$ 79732344 84838616 90460468 96661929 103511110 111078430 119433873 128644297 138771218
55895A38771218J1096908J2107573J3138489J4158696J5122194J5959816J6569151
$$ 138771218 149868126 161975699 175114188 189272884 204395078 220354894 236924045
55888B36924045J6808648J6502784J5463868J3534840J0650416O896188K530236
$$ 236924045 253732693 270235477 285699345 299234185 309884601 316780789 319311025
55881C19311025k057872o439884j0250591j3255360j5366979j6622031j7137439
$$ 319311025 317253153 310813269 300562678 287307318 271940339 255318308 238180869
55874B38180869j7065942j6562624j5766125j4790944j3725439j2633086j1556936
$$ 238180869 221114927 204552303 188786178 173995234 160269795 147636709 136079773
55867A36079773j0525641r558096q665328p851101p113620o448671n852096n319662
$$ 136079773 125554132 115996036 107330708 99479607 92365987 85917316 80065220 74745558
55859G4745558m845439m421767m041590l700164l393920l118780k870715k647202
$$ 74745558 69900119 65478352 61436762 57736598 54342678 51223898 48353183 45705981
55851D5705981k446447k265538k101219j952377j819725j702282j596124j497666
$$ 45705981 43259534 40993996 38892777 36940400 35120675 33418393 31822269 30324603
55843C0324603j406648j324403j250447j182516j119254j060892j007301r57039
$$ 30324603 28917955 27593552 26343105 25160589 24041335 22980443 21973142 21016103
55835B1016103r08781q62613q19201p78305p38705o99593o61650o26467n94577
$$ 21016103 20107322 19244709 18425508 17647203 16908498 16208905 15547255 14920788 14326211
55826A4326211n64426n33891n02985m74095m49243m27987m08536l89982l72443
$$ 14326211 13761785 13227894 12724909 12250814 11801571 11373584 10965048 10575066 10202623
55817A0202623l55912l40257l25928l13386l01975k90443k78538k67118k56669
$$ 10202623 9846711 9506454 9180526 8867140 8565165 8274722 7996184 7729066 7472397
55808G472397k46797k37189k28126k19754k11729k03805j96065j88472j80837
$$ 7472397 7225600 6988411 6760285 6540531 6328802 6124997 5928932 5740460 5559623
55799E559623j73405j66692j60745j55160j49758j44381j38240j30767j23109
$$ 5559623 5386218 5219526 5058781 4903621 4753863 4609482 4471242 4340475 4217366
55790D217366j17352j13753j10286j05582j00798r7497r5041r1649q7079q2526
$$ 4217366 4100014 3986261 3875975 3770393 3669595 3572098 3477057 3385408 3298329 3215803
55780C215803p8529p4747p1423o9227o7553o4854o0933n7339n4918n2631m9647
$$ 3215803 3137274 3062527 2991104 2921877 2854324 2789470 2728537 2671198 2616280 2563649 2514002
55769B514002m6963m5712m5082m3525m1169l9441l8746l8203l7462l7215l7544
$$ 2514002 2467039 2421327 2376245 2332720 2291551 2252110 2213364 2175161 2137699 2100484 2062940
55758B062940l7318l5875l4141l3183l2562l1091k8716k6642k5738k5552k4958
$$ 2062940 2025622 1989747 1955606 1922423 1889861 1858770 1830054 1803412 1777674 1752122 1727164
55747A727164k3319k0860j8333j6351j4977j3857j2817j2149j2216j2973j3934
$$ 1727164 1703845 1682985 1664652 1648301 1633324 1619467 1606650 1594501 1582285 1569312 1555378
55736A555378j4474j4108j2832j1306j0388j0302j0525j0591j0660j1070j1814
$$ 1555378 1540904 1526796 1513964 1502658 1492270 1481968 1471443 1460852 1450192 1439122 1427308
55725A427308j2740j3902j5347j6928j8614k0557k2403k3107k2064k0006j8100
$$ 1427308 1414568 1400666 1385319 1368391 1349777 1329220 1306817 1283710 1261646 1241640 1223540
55714A223540j6493j4595j2489j0996j0350r861r181q924r511j0260j0448j0610
$$ 1223540 1207047 1192452 1179963 1168967 1158617 1148756 1139575 1130651 1121140 1110880 1100432 1089822
55702A089822j1762j3515j4045j2215r100o888o652p750r174j0630j2117j3201
$$ 1089822 1078060 1064545 1050500 1038285 1029185 1022297 1015645 1007895 998721 988091 975974 962773
55690I62773j3461j3331j3664j4375j4420j3251j1598j0398r673r058q659q671
$$ 962773 949312 935981 922317 907942 893522 880271 868673 858275 848602 839544 830885 822214
55678H22214q681q203p655p894q986j0130j0664j0507r737q567p618p583q492
$$ 822214 813533 805330 797675 789781 780795 770665 760001 749494 739757 731190 723572 715989 707497
55665G07497r764j0903j1644j1810j1556j1340j0988r440o366l447k690l879n016
$$ 707497 697733 686830 675186 663376 651820 640480 629492 620052 613686 610239 607549 603670 598654
55652E98654m957m026k521o28K28j576m882o218m315k005k139l690m001l070l199
$$ 598654 593697 589671 587150 586522 586750 585174 580292 574074 569759 567754 565615 561925 557924 554854 551655
55637E51655n189p431q411q016o518m230k311k025k882l028j872q65j298k626
$$ 551655 546466 539035 530624 522608 516090 511860 509549 507524 504642 501614 499742 498877 497579 494953
55623D94953l523l478k789j863j062m96K60J565K727K561J093l62r86j179j275
$$ 494953 491430 487952 485163 483300 482238 481742 482002 483567 486294 488855 489948 489586 488600 487421 486146
55608D86146r30l89q89k638l674k250L56J179m59k089j611q5J13j157j716m43
$$ 486146 485216 484827 483938 481300 477626 475376 475732 476911 476452 474363 472752 472667 472780 471623 469907 469464
55592D69464R56L75j589k386r91Q72J236J88j062k088k975l151k119r91j588l820
$$ 469464 470420 470795 469206 466820 465829 466701 467937 468125 467063 464975 462000 458849 456730 455739 454151 450331
55576D50331n508n206l858l042k870k585k253k577l364l412k040l7J168R09k04
$$ 450331 444823 439617 435759 432717 429847 427262 425009 422432 419068 415656 413616 413579 414747 415656 415452
55561D15452r60o10N37J425J164l48k388l923m387m213m271m564m102k552j246
$$ 415452 414492 413882 414419 415844 417008 416660 414272 410349 405962 401749 397478 392914 388812 386260 385014
55546C85014j472k371j954j24J027J72j593k794l762n443p239p586o239m558l674
$$ 385014 383542 381171 379217 379093 380120 380292 378699 375905 372143 366700 359461 351875 345636 341078 337404
55531C37404l585m008m948o034o180m591j879J23k42k946o057p305o123l845j818
$$ 337404 333819 329811 324863 318829 312649 308058 306179 306302 306060 303114 297057 289752 283629 279784 277966
55516B77966j31J449K287J725N54K83J040J464P87k12p52j372k882m759n617n028
$$ 277966 277835 279284 281571 283296 283850 284133 285173 286637 287424 287212 286460 285088 282206 277447 271830 266802
55500B66802m036l735m005l938l180k424k515l364m014l789l001k326j831j088
$$ 266802 262766 259031 255026 251088 247908 245484 242969 239605 235591 231802 228801 226475 224644 223556
55486B23556oR07J160O88l75j789k907k869j535RM36l31j005m38R61J662Q46m81
$$ 223556 223550 224457 225617 226305 225930 224141 221234 218365 216830 216839 217275 216944 215939 215501 216462 218124 218970 218489
55468B18489n92Q57K309K108L69j387k044j702q77J11Q12N94m95j469j630j592
$$ 218489 217897 218754 221063 223171 223540 222153 220109 218407 217530 217641 218453 219047 218552 217083 215453 213861
55452B13861k294l391l711l164k938l543l872l057k138k588l757l447j140R60
$$ 213861 211567 208176 204465 201301 198363 194820 190948 187891 185753 183165 179408 175961 174821 175781
55438A75781P49j102k333k014j065l65K80J195J948J888R23n22j807k177j103
$$ 175781 176530 175428 173095 171081 170016 169651 169931 171126 173074 174962 175885 175363 173556 171379 170276
55423A70276J071L158M088L661K432J238P80J081J241L87j019j478n09M51j36
$$ 170276 171347 174505 178593 182254 184686 185924 186704 187785 189026 189413 188394 186916 186407 186858 186722
55408A86722j779k661k237j944k948m199l756j637j41r19k736l247k341k121l496
$$ 186722 184943 182282 180045 178101 175153 170954 167198 165561 165420 164501 161765 158518 156177 154056 150560
55393A50560m656l933k495k401l131k451l61N09j121l252l708k990k514k031q09
$$ 150560 145904 141971 139476 137075 133944 131493 131132 131641 130520 127268 123560 120570 118056 116025 115216
55378A15216Q1q91k837l206j273J241K874L715L875K805Q31m71l67j5n55j441
$$ 115216 115297 114406 111569 108363 107090 108331 111205 114920 118795 121600 122431 121960 121593 121578 121023 119582
55362A19582j640j338j276j341r67l64k25n81r19j110j365j592j591j622j993
$$ 119582 117942 116604 115328 113987 113020 112656 112431 111850 110931 109821 108456 106864 105273 103651 101658
55347A01658k324k072j533j485j865j740p74J29j7j046j863j524R7K205L426K744
$$ 101658 99334 97262 95729 94244 92379 90639 89865 89994 89977 88931 87068 85544 85641 87846 91272 94016
55331I4016N57j522k243j864j360j008l32P51J605J824J696J451Q01j79n09M10
$$ 94016 94573 93051 90808 88944 87584 86576 86244 86995 88600 90424 92120 93571 94372 94193 93684 94094
55315I4094J456J015n97j380m88O89Q90Q92J790K649J693p70k433j972l56Q94
$$ 94094 95550 96565 95968 94588 94100 94789 95679 96571 98361 101010 102703 101933 99500 97528 97172 98066
55299I8066J289Q65l80j910k681k444k039j867j139N53K065K134J160N12O26Q86
$$ 98066 99355 100220 99840 97930 95249 92805 90766 88899 87760 88313 90378 92512 93672 94184 94810 95696
55283I5696Q90P31K53r48k740m351n015m351k513n10J26j105k703k606m73K110
$$ 95696 96586 97317 97570 96622 93882 89531 84516 80165 77652 77142 77268 76163 73460 70854 70381 72491
55267G2491L503L275J870jj492j939j321j61R29J330O09p05j145n1J159O49j205
$$ 72491 75994 79269 81139 81138 79646 77707 76386 76225 77154 78484 79093 78388 77243 77192 78351 79000 77795
55250G7795k236j422N2Q87J227J573J588R33K04K7Mm24r02q48n55n11k57Q86K295
$$ 77795 75559 74137 74189 75076 76303 77876 79464 80397 80601 80628 80632 80208 79306 78458 77903 77392 77135 78021 80316
55231H0316K521J174p16k190l076l251k374p65M37N66K01J72M57N42K70j81o96
$$ 80316 82837 84011 83295 81105 78029 74778 72404 71639 72076 72642 72843 73015 73472 74014 74284 74103 73407
55214G3407j034p69l3J48q68k100j967m55P82P45L88R66K074K289J315L28K71
$$ 73407 72373 71604 71571 71719 70851 68751 66784 66329 67111 67856 68244 69210 71284 73573 74888 75216 75487
55197G5487Q64J428J764J736Q16j218l453m503l946k682j814j522j058K45K001
$$ 75487 76351 77779 79543 81279 82095 80877 77424 72921 68975 66293 64479 62957 61899 62144 64145
55182F4145K950K376J102M76M67k28j966l173k346j37J557J888J242p9j890l160
$$ 64145 67095 69471 70573 71049 71516 71288 69322 66149 63803 63666 65223 67111 68353 68274 66384 63224
55166F3224k716j000M18J135K140L408L232Q91j664k258j338q35j167j142l55
$$ 63224 60508 59508 59926 61061 63201 66609 69841 70732 69068 66810 65472 64637 63470 62328 61973
55151F1973J84j05m62r8P32J402J825K189K336J762J16k254m076l959j949J87
$$ 61973 62157 62052 61590 61492 62224 63626 65451 67640 69976 71738 71854 69600 65524 61565 59616 59803
55135E9803Q70M29J27J29k94r73r47l11k97j063j095M70K352L003K716K603K467
$$ 59803 60673 61102 61229 61358 61064 60091 59144 58833 58536 57473 56378 56848 59200 62203 64919 67522 69989
55118F9989J342l91j163n23J33l44j212j025J88R25K24j023j242k28N53l7j219
$$ 69989 71331 70940 69777 69254 69387 69043 67831 66806 66994 67919 68143 67120 65878 65650 66203 66166 64947
55101F4947j353k86M82N8o25n07j98r19k337k904k146j159o51O8J492K550J974
$$ 64947 63594 63308 63790 63848 63223 62716 62518 61599 59262 56358 54212 53053 52402 52470 53962 56512 58486
55084E8486L57m52K10J080Q48k43j123j401j452j417j024l11K31M07N35P11M19
$$ 58486 58843 58391 58601 59681 60529 60286 59163 57762 56310 54893 53869 53558 53789 54196 54731 55442 55861
55067E5861m84r47L26L077N315N222K820l24k711l933m359m328l739k493j012
$$ 55861 55377 54430 54756 57833 63148 68370 71190 70866 68155 64222 59863 55535 51796 49303 48291
55052D8291k7K08J62L27P16J286K253L372L490J867l12r72K70J635J602O01j83
$$ 48291 48264 48472 48634 48961 49677 50963 53216 56588 60078 61945 61633 60661 60931 62566 64168 64769 64586
55035F4586n26q15q59k54O30J097J262J846K934L922M510M866M848M011K495J089
$$ 64586 64060 63245 62386 62132 62762 63859 65121 66967 69901 73823 78333 83199 88047 92058 94553 95642
55019I5642P5j211l239n284o077n194l317j391Q3R69J173O18n16j794k801l341
$$ 95642 95717 94506 91267 85983 79906 74712 71395 70004 70087 71056 72229 72847 72331 70537 67736 64395
55003F4395l243k300o93O93R61K67l23n3Q44J688J875R91p66k095j628J41J087
$$ 64395 61152 58852 58159 58852 59813 60080 59757 59704 60548 62236 64111 65102 64336 62241 60613 60754 61841
54986F1841J73j225j477q38l37J32R55J281K89p94k08J271J222n10j401k13J195
$$ 61841 62014 60789 59312 58474 58137 58269 59224 60505 60794 60000 59792 61063 62285 61775 60374 60161 61356
54969F1356J100N21J012J842J371j87j339j715j882j563J2K183L182K457J223
$$ 61356 62456 62977 63989 65831 67202 67015 65676 63961 62079 60516 60528 62711 65893 68350 69573
54954F9573N16R0n07r07n07O43J885K450J935P12k84o39q85j290r44Q18K652K425
$$ 69573 70089 70179 69672 68765 68258 68901 70786 73236 75171 75883 75599 74960 74075 72785 71841 72659 75311 77736
54936G7736J96j628j357N4P87N86N27J307K637L808L995K522l20k915l556k116
$$ 77736 77932 76304 74947 75001 75788 76374 76901 78208 80845 84653 88648 91170 90850 87935 84379 82263
54920H2263n9J163J400J471J918K293J763L49o85q5J894L653L945K819R71j185
$$ 82263 82204 83367 84767 86238 88156 90449 92212 92561 91876 91791 93685 97338 101283 104102 105073 103888
54904A03888l379n052n602m931l381j355P22K257K763K209R49n98k003k766k549
$$ 103888 100509 95457 89855 84924 81543 80188 80910 83167 85930 88139 89088 88490 86487 83721 81172
54889H1172j509k67N58Q57J167K205L978N362M922K343j062l338l329j389R95
$$ 81172 79663 79396 79954 80811 81978 84183 88161 93523 98445 100788 99726 96388 93059 91670 92665
54874I2665K291K091J381J488K696M082M629M077K892J915K068L662N826P287
$$ 92665 94956 97047 98428 99916 102612 106694 111323 115400 118292 120207 122275 125937 131763 139050
54860A39050P861Q536R789J0881J1251J1558J2260J2117R579N334J801l4j679
$$ 139050 146911 155447 165236 176117 187368 198926 211186 223303 232882 238216 240017 239983 238304
54847B38304m594q043j0357j1166j1108j0286q489o593o012o621o608m963k920
$$ 238304 233710 225667 215310 204144 193036 182750 174261 167668 161656 155035 148427 143464 140544
54834A40544k160k598k933k754k781l215l156j999m43M59O22O94R13R75R49J679
$$ 140544 138384 135786 132853 130099 127318 124103 120947 118948 118505 118964 119586 120280 121193 122168 123117 124796
54818A24796L900P125R754J0493R673R022R878J1727J2728J1654Q888N503J932
$$ 124796 128696 135821 145575 156068 165741 174763 184641 196368 209096 220750 229638 235141 237073
54805B37073j963n868q738r704r055q065p885q590r312r280q613p922p414o740
$$ 237073 235110 229242 220504 210800 201745 193680 185795 177205 167893 158613 150000 142078 134664 127924
54791A27924n694m529l433k317j427j611l339n667o743n456k476K50R56n23k496
$$ 127924 122230 117701 114268 111951 110524 108913 105574 99907 93164 87708 85232 85482 86438 85915 83419
54776H3419k942j701n56q23j545r74P45J668Q04n49o89L05J011O42k19n85j65
$$ 83419 80477 78776 78220 77397 75852 74878 75623 77291 78095 77546 76857 77162 78173 78815 78596 78011 77846
54759G7846M55M41n05j783k460k224j543q89j83P98J774K043J207k92j370j156
$$ 77846 78301 78742 78237 76454 73994 71770 70227 69338 69155 69953 71727 73770 74977 74685 73315 72159
54743G2159R7J191J332J041J253J814J654M25r63j542j251n02L84R93R26O14J169
$$ 72159 72256 73447 74779 75820 77073 78887 80541 80966 80003 78461 77210 76708 77092 78085 79011 79625 80794
54726H0794K796M116L862K517J399P80L3q30r77r4J279K716M151N144N050M269
$$ 80794 83590 87706 91568 94085 95484 96264 96297 95467 94490 94396 95675 98391 102542 107686 112736 117005
54710A17005M224N514P069P755P965Q702R797J0194R638R020Q965R022Q482P268
$$ 117005 121229 126743 133812 141567 149532 158234 168031 178225 187863 196883 205848 214870 223352 230620
54696B30620N685L900K002J62j700l929o371p954p655n863m228l978m641m671
$$ 230620 236305 240205 242207 242369 240669 236740 230369 222415 214760 208897 204669 200691 196050 191379
54682A91379l036j79K491L850L848L275K900L039L771N049O297O499N222L310
$$ 191379 188343 188164 190655 194505 198353 201628 204528 207567 211338 216387 222684 229183 234405 237715
54668B37715J916J155M23l20p24j316k912m487l413R85N630P067N545L876L129
$$ 237715 239631 240786 241209 240889 240165 238849 235937 231450 228037 229022 234652 241719 247264 251140 254269
54653B54269J790r98l890n657o883q334r462r684r680j0132j0393r774q998q882
$$ 254269 256059 255061 251171 245514 238631 230297 220835 211151 201471 191339 180946 171172 162174 153292
54639A53292q631p043m802l684l966m307m000l570l070j645P24K496K332N52j621
$$ 153292 144661 137618 132816 129132 125166 120859 116859 113289 110219 108574 109298 111794 114126 114678 113057
54624A13057l256l726k676p30O51P08J85P7L60N09M87N18N11M56Q37J828K612
$$ 113057 109801 106075 103399 102669 103320 104028 104213 104290 104650 105159 105646 106164 106675 107131 107968 109796 112408
54607A12408K266J067L7m71r20j483j659j139l67N2O0P1M16R60J170N69o10j423
$$ 112408 114674 115741 115778 115307 114387 112904 111245 110106 109739 109791 109851 109922 110338 111298 112468 113037 112427 111004
54589A11004j135KJ153J944K621L293L583L226K553K092J929J894K180L285N071
$$ 111004 109869 109871 111024 112968 115589 118882 122465 125691 128244 130336 132265 134159 136339 139624 144695
54574A44695O388O238N319N551P704J0137J0764R857R788J1855J4519J5316J3626
$$ 144695 151083 157321 162640 168191 175895 186032 196796 206653 216441 228296 242815 258131 271757
54561B71757J0817Q307O388M537K010j660o043r783j1820j2521j3001j3553j3523
$$ 271757 282574 290881 297269 301806 303816 302156 296113 286330 274510 261989 248988 235435 221912
54548B21912j2557j1078r490p819o364n764n944n756m249j925j76J90n25j488
$$ 221912 209355 198277 188787 180968 174604 168840 162896 157140 152891 150966 150790 150980 150455 148967
54534A48967k054k116k164k781l890m752n001n135n678o145n536l680j512J1Q34
$$ 148967 146913 144797 142633 139852 135962 131210 126209 121074 115396 109251 103715 100035 98523 98534 99368
54519I9368J517K326K821K392J191L51Q64K205K722J690L32K36J179J436J83j369
$$ 99368 100885 103211 106032 108424 109615 109966 110830 113035 115757 117447 117779 118015 119194 120630 120813 119444
54503A19444j514j85Q84M4k470m707m971l485j747m91Q18K293K777J686N60J079
$$ 119444 117930 117745 118629 118673 116203 111496 106525 103040 101293 100802 101620 103913 106690 108376 108936 110015
54487A10015K177J265j680l539k362j52J11j474k518j982q89J08J507L202M006
$$ 110015 112192 113457 111777 108238 105876 105724 105835 104361 101843 99861 98972 99080 100587 103789 107795
54472A07795L563L183L862M808M833M088L340K488J009m70m81J373L776N247N644
$$ 107795 111358 114541 118403 123211 128044 132132 135472 137960 138969 138499 138018 139391 143167 148414 154058
54457A54058N879O644P731Q425Q170O994N373L759K205M81j559l717n524o573
$$ 154058 159937 166581 174312 182737 190907 197901 203274 207033 209238 209719 208160 204443 198919 192346
54443A92346o903p035p395p650p007n225l165k037k285l330m251m471l974l132
$$ 192346 185443 178408 171013 163363 156356 151131 147966 145929 143644 140314 136063 131592 127618 124486
54429A24486k351j713r97j00P04J098J172J289J483J308M99m68q34n34l02m98
$$ 124486 122135 120422 119425 119325 120029 121127 122299 123588 125071 126379 126878 126410 125576 125042 124740 124242
54413A24242m07O92K097K258R54j67L06J706K363J789Q25J76p7J41P89J002j92
$$ 124242 123835 124527 126624 128882 129836 129669 129975 131681 134044 135833 136658 136834 136757 136898 137687 138689 138497
54396A38497k335l826l897l087j657Q55L875N309M063J873J134J740J683K70r62
$$ 138497 136162 132336 128439 125352 123695 124550 128425 133734 137797 139670 140804 142544 144227 144497 143535
54381A43535p22J87N4j505l133l180j361Q81J756J034K24N30J224P47j055k739
$$ 143535 142813 143000 143054 141549 138416 135236 133875 134756 136512 137546 137770 138300 139524 140271 139216 136477
54365A36477l090k164p09N49R58K72r12j681j908k117k261j570K43K274L360L115
$$ 136477 133387 131223 130514 131063 132021 132293 131381 129700 127792 125675 123414 121844 122087 124361 127721 130836
54349A30836J973P46K58P40J423J384P94N88R27J008O24P10J705K437J716K66
$$ 130836 132809 133555 133813 134553 135976 137360 138154 138742 139669 140677 141301 142011 143716 146153 147869 148135
54333A48135q9J155K581K669J320m94j828k238j805j076p34r49j141o49L87J025
$$ 148135 148046 149201 151782 154451 155771 155277 153449 151211 149406 148330 147596 146647 145506 144857 145244 146269
54317A46269N10q93k227k819k558j468K59J695J632K07q64m97J98j86q12N4J655
$$ 146269 146779 145886 143659 140840 138282 136814 137073 138768 140400 140607 139743 139246 139444 139258 138446 138500 140155
54300A40155J159j890m106k694O07K089J186M57J202J901J408J084K326L783K933
$$ 140155 141314 139424 135318 132624 133231 135320 136506 136963 138165 140066 141474 142558 144884 148667 151600
54285A51600l03l301m085l413l099l409l200k144j448j980k715k060k98N07o91
$$ 151600 151297 147996 143911 140498 137399 133990 130790 128646 127198 125218 122503 120443 120145 120652 119961
54270A19961k416k681j650j162j985k801k175n18N27K10n71n81K76J059J147R19
$$ 119961 117545 114864 113214 112052 110067 107266 105091 104573 105100 105310 104739 104158 104434 105493 106640 107559
54254A07559R48R72K52j198k529l152l233k907j928n52J68j68l40Q61K587K821
$$ 107559 108507 109479 109731 108533 106004 102852 99619 96712 94784 94232 94400 94232 93892 94753 97340 100161
54238A00161J252k10o9Q90R94j0r52q83J29J481K500K626J866R54N15J81q28k366
$$ 100161 101413 101203 101134 102024 103018 103008 102056 101173 101302 102783 105283 107909 109775 110729 111244 111425 110597 108231
54220A08231l332l169k608k483k481j811o96k40p83j299r18k09k69j024j373q64
$$ 108231 104899 101730 99122 96639 94158 92347 91651 91411 90628 89329 88411 88202 87933 86909 85536 84672
54204H4672k77l16o56o86n11n92q87j004q67o13j05P24J195L75j606l355l654
$$ 84672 84395 84079 83423 82737 82226 81634 80747 79743 78876 78263 78158 78882 80077 80452 78846 75491 71837
54187G1837k704j681j339j272m46J577L860M691L366J253M99J556K601J778m46
$$ 71837 69133 67452 66113 64841 64395 65972 69832 74523 77889 79142 79641 81197 83798 85576 85130
54172H5130j831j052Q33J777J005m79j339j288r39q42j069j552k235k755k444
$$ 85130 83299 82247 83080 84857 85862 85383 84044 82756 81817 80975 79906 78354 76119 73364 70920
54157G0920j078N31J117K65j045j413m87O27N92o05j557j024O54K007K124J404
$$ 70920 69842 70373 71490 71755 70710 69297 68810 69437 70029 69424 67867 66843 67497 69504 71628 73032
54141G3032P50N42O32P34O15J75l53n55l60j04J31O19J264J269K16j090j471q70
$$ 73032 73782 74324 74956 75690 76305 76480 76127 75572 75212 75108 75239 75858 77122 78391 78607 77517 76046 75176
54123G5176k79l58p32p31l21p7m85j376k018j912j417j219j241p97p2l15j977
$$ 75176 74897 74539 73807 73076 72755 72678 72193 70817 68799 66887 65470 64251 63010 62213 62141 61826 59849
54106E9849l500l092j101N81J054J036J283J706K084K287J715j19k204k629j058
$$ 59849 56349 53257 52156 52737 53791 54827 56110 57816 59900 62187 63902 63783 61579 58950 57892
54091E7892O91J125P87P95R98P77M72O74Q25k8j534k370k086j343n45O12K095
$$ 57892 58583 59708 60495 61290 62288 63065 63537 64211 65036 65008 63474 61104 59018 57675 57130 57742 59837
54074E9837L061K753J217r05k613k798j138J099K025J194k0l15r8o90k396l908
$$ 59837 62898 65651 66868 65963 63350 60552 59414 60513 62538 63732 63712 63397 63299 62609 60213 56305
54058E6305l670j594O92J529J068R71K060L033K266J75j352j577j515j789j420
$$ 56305 52635 51041 51733 53262 54330 55301 57361 60394 62660 62835 61483 59906 58391 56602 55182
54043E5182M19K529K826J032q93j143p5N75J20j63J129L325M238L019J234N01
$$ 55182 55601 58130 60956 61988 61095 59952 59877 60452 60572 60409 61538 64863 69101 72120 73354 73855
54027G3855J80j163k953l172j496K06O67N19K83o52k015j862L89K169J250n39
$$ 73855 74035 72872 69919 66747 65251 65457 66124 66643 66926 66274 64259 62397 62786 64955 66205 65666
54011F5666J06K753L782J925m4R8Q84J26j519j942r59j30j54l66k55J13Q62K093
$$ 65666 65772 68525 72307 74232 74188 74286 75170 75296 73777 71835 70876 70746 70592 70226 69971 70084 70946 73039
53993G3039L106L097K405K041K163K044J400O91K68R6L00J007J833K222K249K214
$$ 73039 76145 79242 81647 83688 85851 87895 89295 89986 90254 90350 90650 91657 93490 95712 97961 100175
53977A00175J844Q43q0M3Q97J242P60K01k33j070j968j657j02Q38j03j794k421
$$ 100175 102019 102862 102782 102825 103722 104964 105724 105925 105692 104622 102654 100997 100895 101733 101630 99836 97415
53960I7415j880j235p99j98L09N9p70j392j694k158k670k605k033j658j548j031
$$ 97415 95535 94300 93501 93303 93612 93671 92901 91509 89815 87657 84987 82382 80349 78691 77143 76112
53944G6112j02L04j48m91N5Q05O66j90p23p12r69j875k623k349j344o10n74q22
$$ 76112 76010 76314 76166 75675 75730 76535 77201 77011 76288 75576 74607 72732 70109 67760 66416 65806 65232 64410
53926F4410r45j003r99m96P94K450L703M132L573J827q04k946l113j358Q65K419
$$ 64410 63465 62462 61463 60967 61761 64211 67914 72046 75619 77446 76642 73696 70583 69225 70090 72509
53910G2509L211L139J787j77p93Q38K842K678M33j427j302l5P92P81O11J001K189
$$ 72509 75720 78859 80646 80469 79676 80514 83356 86034 86467 85040 83738 83703 84495 85276 85887 86888 89077
53893H9077L652M180L004R69l00m48m85p79l32J322K877L034K442K680L926N032
$$ 89077 92729 96909 99913 100882 100582 100134 99649 98870 98538 99860 102737 105771 108213 110893 114819 119851
53877A19851N554O362Q092J0011J0755R645P188M790L870M579N450M822K627J86
$$ 119851 125405 131767 139859 149870 160625 170270 177458 182248 186118 190697 196147 200969 203596 203782
53863B03782j590k865l828m043l280k202j621j680k244l413m949n826n258l883
$$ 203782 202192 199327 195499 191456 188176 185974 184353 182673 180429 177016 172067 166241 160983 157100
53849A57100l035l049l181k976k708k355j437l22m30k199l842l427j656j046k447
$$ 157100 154065 151016 147835 144859 142151 139796 138359 138037 137607 135408 131566 128139 126483 125437 122990
53834A22990l840l203j183J0m57j428j719j496j474j733j844j728j644j521q92
$$ 122990 119150 115947 114764 114774 114317 112889 111170 109674 108200 106467 104623 102895 101251 99730 98838
53819I8838K48J006N51n62p27P49K469K405L83j568j589j55N95n62k576l405k343
$$ 98838 99086 100092 100643 100081 99354 100103 102572 104977 105360 103792 102203 102048 102643 102081 99505 96100 93757
53802I3757o05L48M75N79O19k39j742k207r06M22r1j522j375O76K349K153J199
$$ 93757 93152 93500 93975 94554 95173 94934 93192 90985 90079 90501 90410 88888 87513 88189 90538 92691 93890
53785I3890R92J345J477J468J490J023N0j89J025K541L036K807K510J494p56k774
$$ 93890 94882 96227 97704 99172 100662 101685 101735 101546 102571 105112 108148 110955 113465 114959 114203 111429
53769A11429k855j828j794k714k766j660r43r08k7J869K629J120p50q48K54Q34
$$ 111429 108574 106746 104952 102238 99472 97812 96869 95961 95934 97803 100432 101552 100802 99954 100208 101042
53753A01042Q78J433K208J884L98p08k71J197K292K169J250P66J325K003J435
$$ 101042 101920 103353 105561 107445 107843 107135 106864 108061 110353 112522 113772 114538 115863 117866 119301
53738A19301j65j252j195q82p08K65K241L464K535N50o16r74j507j688k11K150
$$ 119301 119136 117884 116689 115807 115099 115364 117605 121069 123604 124154 123538 122564 121057 119369 119158 121308
53722A21308K813Q62j654k486j706o68O5O94R97M97n01r48l38O34R13L10l69l93
$$ 121308 124121 124983 123329 120843 119137 118469 118534 119228 120225 120722 120221 119273 118935 119569 120482 120792 120423 120030
53704A20030PJ02k54m64j04O29J382J962K019J222J02j90N31R48O0j249j378k09
$$ 120030 120037 120139 119885 119421 119317 119946 121328 123290 125309 126531 126633 126443 126974 127922 127982 126733 125355 125146
53686A25146R56J287J151J081R69N12j94o56l71O59J646J693J066J083K260L378
$$ 125146 126102 127389 128540 129621 130590 131102 130908 130252 129881 130540 132186 133879 134945 136028 138288 141666
53670A41666L096J774P42N55R41J849L231M287M358M105M436M651L391J288O45
$$ 141666 144762 146536 147278 147833 148774 150623 153854 158141 162499 166604 171040 175691 179082 180370 181015
53655A81015K126L676L616L063L835N259M885K040q41q25K339O023P380N940L643
$$ 181015 183141 186817 190433 193496 197331 202590 207475 209515 208674 207849 210188 216211 223591 229531 233174
53640B33174K428K361K372K235K673L780M573M555M464M866M944L777K034J186
$$ 233174 235602 237963 240335 242570 245243 249023 253596 258151 262615 267481 272425 276202 278236 279422
53626B79422J297R22o54k206k184p75M86P62O03O66O39O3n78n17j07m62j660k453
$$ 279422 280719 281641 280987 278781 276597 275822 276308 277070 277673 278339 278978 279041 278463 277946 277839 277377 275717 273264
53608B73264k151j677j950k224j260M78J245N64r8M25J292R74m32j287o42M91
$$ 273264 271113 269436 267486 265262 264002 264480 265725 266289 266191 266616 267908 268882 268450 267163 266521 267012
53592B67012N69k66k45J586L701L730J399j158k070j570q40k53N09J457K389L259
$$ 267012 267581 267315 267070 268656 272357 276087 277486 276328 274258 272688 271848 271595 272104 273561 275950 279209
53576B79209L850L772L406L853N050N198L372J438J686L479M322L638L174L872
$$ 279209 283059 286831 290237 294090 299140 304338 307710 309148 310834 314313 318635 322273 325447 329319
53562C29319M711N011N514O465O642N412M127M225N199N597N029M104L270K762
$$ 329319 334030 339041 344555 351020 357662 363074 367201 371426 376625 382222 387251 391355 394625 397387
53548C97387L019M225N768O777O781N618L530J618J194K194L148L180K968L186
$$ 397387 400406 404631 410399 417176 423957 429575 433105 434723 435917 438111 441259 444439 447407 450593
53534D50593L193K198P57L4K26O41P55L70p21k398l883m460m218l720l322l111
$$ 450593 453786 455984 456741 456775 457001 457642 458397 458767 458046 455648 451765 447305 443087 439367 436045 432934
53518D32934k957k395j167nO9o44p61L8N64K85L26J365K132J473L91L82Q22L2
$$ 432934 429977 427582 426415 426410 426479 425835 425074 425112 425676 425961 426287 427652 429784 431257 431648 432030 432852 432884
53500D32884j638j906J97K917M028L344K448K700L923M808M544L980M635O481
$$ 432884 431246 429340 429537 432454 436482 439826 442274 444974 448897 453705 458249 462229 466864 473345
53486D73345P708P121N709N161N881P390R458J1662J2874J2601J2034J2463J3419
$$ 473345 481053 488174 493883 499044 504925 512315 521773 533435 546309 558910 570944 583407 596826
53473E96826J3776J3751J4238J5086J5796J7078J9720K2485K3476K3231K4065
$$ 596826 610602 624353 638591 653677 669473 686551 706271 728756 752232 775463 799528
53462G99528K6379K8109K8264K8514L0374L2896L4436L5018L5706L6749L7602
$$ 799528 825907 854016 882280 910794 941168 974064 1008500 1043518 1079224 1115973 1153575
53451A153575L7943L7876L7783L8285L9577M0614M0213L9022L8903M0107M0779
$$ 1153575 1191518 1229394 1267177 1305462 1345039 1385653 1425866 1464888 1503791 1543898 1584677
53440A584677L9843L8444L7673L6867L5481L4823L6077L7980L8417L7379L6459
$$ 1584677 1624520 1662964 1700637 1737504 1772985 1807808 1843885 1881865 1920282 1957661 1994120
53429A994120L6157L5555L4317L3129L2230L1088K9547K8014K6494K4723K3171
$$ 1994120 2030277 2065832 2100149 2133278 2165508 2196596 2226143 2254157 2280651 2305374 2328545
53418B328545K2521K2150K0463J7038J3195J0093P456M568J403j797n144q539
$$ 2328545 2351066 2373216 2393679 2410717 2423912 2434005 2441461 2446029 2447432 2445635 2440491 2431952
53406B431952j1315j3125j4613j6456j8237j9059j8999j9233k0675k3058k5411
$$ 2431952 2420637 2407512 2392899 2376443 2358206 2339147 2320148 2300915 2280240 2257182 2231771
53395B231771k7144k8386k9435l0140l0034k9095k7969k7241k6718k5913k4980
$$ 2231771 2204627 2176241 2146806 2116666 2086632 2057537 2029568 2002327 1975609 1949696 1924716
53384A924716k4498k4248k2980j9827j5426j1120p477m229j375M75J080J208J906
$$ 1924716 1900218 1875970 1852990 1833163 1817737 1806617 1799140 1794911 1793536 1794011 1795091 1796299 1798205
53371A798205L474N436P299Q916J0370J1946J4150J7228K0595K3245K4964K6630
$$ 1798205 1801679 1807115 1814414 1823330 1833700 1845646 1859796 1877024 1897619 1920864 1945828 1972458
53359A972458K9075L2074L4913L7413L9801M1913M3415M4649M6378M8614N0634
$$ 1972458 2001533 2033607 2068520 2105933 2145734 2187647 2231062 2275711 2322089 2370703 2421337
53348B421337N2374N4833N8576O2741O6289O9438P2892P6336P8910Q0877Q3401
$$ 2421337 2473711 2528544 2587120 2649861 2716150 2785588 2858480 2934816 3013726 3094603 3178004
53337C178004Q6484Q8509Q8417Q7256Q6706Q6913Q6798Q5976Q5083Q4198Q2194
$$ 3178004 3264488 3352997 3441414 3528670 3615376 3702289 3789087 3875063 3960146 4044344 4126538
53326D126538P8222P3052O8258O4486O1157N7654N3938M9935M5076L9010L2386
$$ 4126538 4204760 4277812 4346070 4410556 4471713 4529367 4583305 4633240 4678316 4717326 4749712
53315D749712K6302K0957J5449R004J826n648j3744k2952l2574m1010m7727n4069
$$ 4749712 4776014 4796971 4812420 4821424 4823250 4817602 4803858 4780906 4748332 4707322 4659595 4605526
53303D605526o1410o9072p4979p8116p9474q0633q2237q3856q4465q2959p9104
$$ 4605526 4544116 4475044 4400065 4321949 4242475 4161842 4079605 3995749 3911284 3828325 3749221
53292C749221p4331p0811o9411o9322o9939p1703p4331p5726p4211p1054o8937
$$ 3749221 3674890 3604079 3534668 3465346 3395407 3323704 3249373 3173647 3099436 3028382 2959445
53281B959445o8348o7188o3992n9659n5670n2289m9276m6836m4785m1996l7883
$$ 2959445 2891097 2823909 2759917 2700258 2644588 2592299 2543023 2496187 2451402 2409406 2371523
53270B371523l3679l1084l0208k9802k9096k8360k7997k7912k7747k7084k5566
$$ 2371523 2337844 2306760 2276552 2246750 2217654 2189294 2161297 2133385 2105638 2078554 2052988
53259B052988k3250k0594j7826j4852j2040j0220r292p718m407m39K203L220M151
$$ 2052988 2029738 2009144 1991318 1976466 1964426 1954206 1944914 1937196 1932789 1932350 1934553 1937773 1941924
53246A941924O222R096J1779J3828J5506J7388J9844K2593K4960K6885K9099L1874
$$ 1941924 1948146 1957242 1969021 1982849 1998355 2015743 2035587 2058180 2083140 2110025 2139124 2170998
53234B170998L4388L5951L7006L7908L7736L5663L2775L0820K9675K7715K4515
$$ 2170998 2205386 2241337 2278343 2316251 2353987 2389650 2422425 2453245 2482920 2510635 2535150
53223B535150K1420J9465J8267J7103J5363J1961O127p27n727p800q794j0710
$$ 2535150 2556570 2576035 2594302 2611405 2626768 2638729 2644856 2644129 2638402 2630602 2621808 2611098
53211B611098j3541j6441j9342k2296k4806k7005l0168l4758l9207m1914m3388
$$ 2611098 2597557 2581116 2561774 2539478 2514672 2487667 2457499 2422741 2383534 2341620 2298232
53200B298232m4937m6357m6581m5861m5495m5758m5736m5095m4513m4274m3749
$$ 2298232 2253295 2206938 2160357 2114496 2069001 2023243 1977507 1932412 1887899 1843625 1799876
53189A799876m2559m1212m0384m0228m0438m0412l9539l8034l7148l7724l8736
$$ 1799876 1757317 1716105 1675721 1635493 1595055 1554643 1515104 1477070 1439922 1402198 1363462
53178A363462l8251l5827l3018l1417l0990l0465k8690k5541k2115k0140k0563
$$ 1363462 1325211 1289384 1256366 1224949 1193959 1163494 1134804 1109263 1087148 1067008 1046445
53167A046445k2562k4182k4086k2474k0690k0253k1794k4340k5955k5766k4879
$$ 1046445 1023883 999701 975615 953141 932451 912198 890404 866064 840109 814343 789464
53156G89464k4722k5072k4627k3049k1159j9444j7683j6043j5103j4648j3767
$$ 789464 764742 739670 715043 691994 670835 651391 633708 617665 602562 587914 574147
53145E74147j2612j2636j4374j6200j6255j4704j3053j1996j1177j0520j0449
$$ 574147 561535 548899 534525 518325 502070 487366 474313 462317 451140 440620 430171
53134D30171j0800j0847j0546j0673j1247j0911q692n644l691l229l017k297j726
$$ 430171 419371 408524 397978 387305 376058 365147 356455 350811 347120 343891 340874 338577 336851
53121C36851j781j708j030j040l081n869o368l637j06J580J565J597K212K514
$$ 336851 335070 333362 332332 331292 328211 322342 315974 312337 312231 313811 315376 316973 319185 321699
53107C21699J985R46l75j897k916k596j320l97l57m80k30j20p66j878k671k736
$$ 321699 323684 324630 324255 322358 319442 316846 315526 315129 314772 314292 314062 313942 313176 311298 308627 305891
53091C05891k228j551j025n51K69J267J386Oj805k464k073k114k981l410k810
$$ 305891 303663 302112 301087 300536 300805 302072 303458 303464 301659 299195 297122 295008 292027 288617 285807
53076B85807k444l264m011k953o33O67j65k054l409l598k841j868j747l001m577
$$ 285807 283363 280099 276088 273135 272502 273169 273004 270950 267541 263943 261102 259234 257487 254486 249909
53061B49909m666k897r35l98r86j221n05K81m1j726l950n362m984k981o44O13
$$ 249909 245243 242346 241411 241013 240027 238806 238301 238582 238541 236815 232865 227503 222519 219538 218894 219507
53045B19507L13r92k409l199k996k056j221j189j722k008j734j327j000l41P75
$$ 219507 219820 218828 216419 213220 210224 208168 206947 205758 204036 202028 200294 198967 197967 197626 198401
53030A98401J475P71j056k644k998k178p64N65R92M1j561k315j706q32q33j379
$$ 198401 199876 200647 199591 196947 193949 191771 191007 191572 192564 192605 191044 188729 187023 186191 185358 183979
53014A83979j512j264j408j935j998j422j083j489j914j521m92N80J719L037L700
$$ 183979 182467 181203 179795 177860 175862 174440 173357 171868 169954 168433 167941 168521 170240 173277 176977
52999A76977K596M9k144k763k442k336k306j325P10K604L300K797J455m96k338
$$ 176977 179573 179622 177478 174715 172273 169937 167631 166306 167016 169620 172920 175717 177172 176676 174338
52984A74338k776j481m2k58j815k766k102o15O99J675K168J670N10J62J311K531
$$ 174338 171562 170081 170039 169781 167966 165200 163098 162483 163182 164857 167025 168695 169205 169367 170678 173209
52968A73209K015o4j943k447j631J20K299L805L624K194J052R84J391J563J560
$$ 173209 175224 175160 173217 170770 169139 169259 171558 175363 178987 181181 182233 183217 184608 186171 187731
52953A87731J633J620J368J058Q29N40R9m41j101j723j549J2K197L351K833J570
$$ 187731 189364 190984 192352 193410 194239 194779 194878 194437 193336 191613 190064 190076 192273 195624 198457 200027
52937B00027M36q46k580l861l484j540P40K428L357L514K898K067J914K570L109
$$ 200027 200463 199617 197037 193176 189692 188152 188892 191320 194677 198191 201089 203156 205070 207640 210749
52922B10749K751J969J932K977M156M393L731L114L205L806M347M410L738K333
$$ 210749 213500 215469 217401 220378 224534 228927 232658 235772 238977 242783 247130 251540 255278 257611
52908B57611Q48K62P75J473J484R31L00m19j298j779j387o11j40K38Q83J011l42
$$ 257611 258459 258721 259496 260969 262453 263384 263684 263265 261967 260188 258801 258190 258050 258288 259171 260182 259840
52891B59840k320k921j893j122j808k812k745k100k084k550k447j557n12M26J360
$$ 259840 257520 254599 252706 251584 249776 246964 244219 242119 240035 237485 235038 233481 232969 233395 234755
52876B34755J908J494L54n98q93q44r26j380k129k562j798K03K152K709J812L16
$$ 234755 236663 238157 238511 237913 237020 236176 235250 233870 231741 229179 227381 227584 229736 232445 234257 234573
52860B34573j139k098j873l57J137J051m18j566j399n95j04N9K70M30K65p2k29
$$ 234573 233434 231336 229463 229106 230243 231294 230876 229310 227911 227316 227212 227271 227541 227971 228236 228164 227935
52843B27935k16l38p23j175j380j195q64q82j382j923k067j913j646r21O41K520
$$ 227935 227719 227381 226658 225483 224103 222908 222044 221162 219780 217857 215790 213877 212231 211310 211951 214471
52827B14471L528L041J468m61k173l003k277j64J938K379O82k004l780l471j493
$$ 214471 217999 221040 222508 222047 219874 216871 214594 214430 216368 218747 219429 217425 213645 210174 208681
52812B08681O04J591J453Q84M07J54P0j76r91k155k800k673k750l746m709m235
$$ 208681 209285 210876 212329 213213 213620 213774 213844 213668 212677 210522 207722 205049 202299 198553 193844 189609
52796A89609k676j754k152k959l509m088m413l255o02J278M89j752k551j096N84
$$ 189609 186933 185179 183027 180068 176559 172471 168058 164803 164201 165479 165968 164216 161665 160569 161153
52781A61153M97j035k321k466j955j685j918k135j746q74k85k94j80Q64K421L211
$$ 161153 161650 160615 158294 155828 153873 152188 150270 148135 146389 145515 145230 144936 144756 145620 148041 151252
52765A51252K761K032K068K579K443J396N88J211K947M246M111L064K162J608
$$ 151252 154013 156045 158113 160692 163135 164531 165119 166330 169277 173523 177634 180698 182860 184468
52751A84468R54J96k45n97j702l490m540l835k287j576j965k227j488j76Q83J319
$$ 184468 185422 185618 185373 184776 183074 179584 175044 171209 168922 167346 165381 163154 161666 161490 162373 163692
52735A63692J084K35p84j342j343j272j313j074n56n42j439k374k227j243o18
$$ 163692 164776 165011 164227 162885 161542 160270 158957 157883 157327 156785 155346 152972 150745 149502 148884
52720A48884p08o82q6L17j62r47j115r01j171j714j296L24J686J510L69l93n54
$$ 148884 148176 147494 147408 147725 147563 146616 145501 144600 143429 141715 140419 140743 142429 143939 144308 143915 143361
52703A43361p30q42k57O25N56n16r90J03J634K104J803J948K488K340J459J117
$$ 143361 142631 141789 141532 142157 142713 142197 141207 141310 142944 145048 146851 148799 151287 153627 155086 156203
52687A56203J827K332J255j094l141l651k524n77R48J026l56k093k848k035j4
$$ 156203 158030 160362 161617 160523 157382 153731 151207 150630 151578 152604 152248 150155 147307 145272 145258
52672A45258K294L920M373L828K773J593P25O94J376J654P06n65n81O17J493J558
$$ 145258 147552 151472 155845 159673 162446 164039 164764 165458 166834 168488 169194 168629 168048 168665 170158 171716
52656A71716K103L810N262N005L691K798K302J356M03O25J728K185J773J930L225
$$ 171716 173819 177629 182891 187896 191587 194385 196687 198043 198446 199071 200799 202984 204757 206687 209912
52641B09912M267L858K782K498L147L770L661K675R40r76k147k274k019j979j827
$$ 209912 214179 218037 220819 223317 226464 230234 233895 236570 237510 236534 234387 232113 230094 228115 226288
52626B26288j105q0P80J474J892J299o53k840l657k834j552q46o80n33j87J52
$$ 226288 225183 225103 225883 227357 229249 230548 229895 227055 223398 220564 219012 218166 217486 216953 216766 216918
52610B16918J59j69k81M14J503J724N18j131j970j937j655j277p52p14j808l376
$$ 216918 217077 216908 216627 217041 218544 220268 220786 219655 217685 215748 214093 212816 212064 211350 209542 206166
52594B06166l921k911j219R0M79l32k172l879m022k444l17J357K307K218O82j645
$$ 206166 202245 199334 198115 198205 198684 198352 196180 192301 188279 185835 185518 186875 189182 191400 192082 190437
52578A90437l099k870j897j326j013k85P62J591K237K927L238K566J269M44N94
$$ 190437 187338 184468 182571 181245 180232 179947 180709 182300 184537 187464 190702 193268 194537 194981 195575
52563A95575J169J489J486J466J607J792J710J041k07j478k034j649q61m46n73
$$ 195575 196744 198233 199719 201185 202792 204584 206294 207335 207128 205650 203616 201967 201106 200660 200087
52548B00087o05K04J701K770K472J075k52o35q3Q05J338J125M18l0K22Q49J426
$$ 200087 199482 199686 201387 204157 206629 207704 207452 206817 206734 207539 208877 210002 210420 210390 210612 211461 212887
52531B12887K049K707K685J516J88K50J805L457M125L793K559M34j589j882l54
$$ 212887 214936 217643 220328 221844 222032 222282 224087 227544 231669 235462 238021 238455 236866 234984 234630
52516B34630R46L14j514k637k500k078k209k765l149k825j615o5Q22O27j32q72
$$ 234630 235576 235890 234376 231739 229239 227161 224952 222187 219038 216213 214598 214533 215355 215982 215850 214978
52500B14978j470j630q57M01O58o00j851j494JJ086J422J768K209K049J290P11
$$ 214978 213508 211878 211021 211422 212080 211480 209629 208135 208136 209222 210644 212412 214621 216670 217960 218671
52484B18671M52j89j349k060j492nJ286J489N48o73j131q38r60k077l186l300
$$ 218671 219123 218934 217585 215525 214033 214028 215314 216803 217351 216678 215547 214709 213749 211672 208486 205186
52468B05186l227m220n421m573j433J343J418m99j929j689p74p67k210m156m927
$$ 205186 201959 197739 192318 187745 186312 187655 189073 188574 186645 184956 184182 183415 181205 177049 172122
52453A72122l566r04J113J351M53j57J93J035J412O98q85k381k900k418j642j204
$$ 172122 168556 167652 168765 170116 170569 170412 170605 171640 173052 173750 172865 170484 167584 165166 163524 162320
52437A62320j141j022l37R09J908J801R14N63J284K079J972J351R84P47L80N30
$$ 162320 161179 160157 159820 160729 162637 164438 165352 165915 167199 169278 171250 172601 173585 174332 174712 175242
52421A75242J639K655K394J458J061O78r88l133l442j631oKm77l29k05n62j65
$$ 175242 176881 179536 181930 183388 184449 185127 184139 181006 177564 175933 175927 175929 175452 175123 174918 174356 174191
52404A74191J685L212K487M32m81L33J370J626J448J080J70r39j018M05K097K466
$$ 174191 175876 179088 181575 182007 181526 181859 183229 184855 186303 187383 187553 186614 185596 186001 188098 190564
52388A90564J320om7J430L262M053L532K483J541O60j73m68RO89Q37M10m6J05
$$ 190564 191884 191878 191831 193261 196523 200576 204108 206591 208132 208792 208619 208151 208160 208849 209686 210096 210050 210155
52370B10155J259L049M108L212R69n73m12L54M03OJ41Q04J173Q99L67k0j65k78
$$ 210155 211414 214463 218571 221783 222752 222179 221767 222121 222524 222530 222671 223475 224648 225547 225914 225894 225729 225451
52352B25451q22j788k016l36K310L392K045L72M63J694K236J912J841K269K546
$$ 225451 224629 222841 220825 220489 222799 226191 228236 228608 229071 230765 233001 234913 236754 239023 241569
52337B41569K663L154L761L687K926K162J695J526J948K925L531L242K988L675
$$ 241569 244232 247386 251147 254834 257760 259922 261617 263143 265091 268016 271547 274789 277777 281452
52323B81452M499M390M148N174O771O941N602M779N589P033P919Q023P330O094
$$ 281452 285951 290341 294489 299663 306434 313375 318977 323756 329345 336378 344297 352320 359650 365744
52309C65744N739P499J0002J0460Q726P591Q493R616R426R332J0887J2779J2969
$$ 365744 371483 378982 388984 399444 408170 415761 424254 433870 443296 452628 463515 476294 489263
52296D89263J2162J2580J4402J5941J6685J7718J9342K0398K0249J9833K0404
$$ 489263 501425 514005 528407 544348 561033 578751 598093 618491 638740 658573 678977
52285F78977K2409K5663K9471L2501L3652L3328L2964L3384L4351L5470L6486
$$ 678977 701386 727049 756520 789021 822673 856001 888965 922349 956700 992170 1028656
52274A028656L6918L6514L6039L6350L6661L5115L1450K7780K6056K5887K5772
$$ 1028656 1065574 1102088 1138127 1174477 1211138 1246253 1277703 1305483 1331539 1357426 1383198
52263A383198K5428K5390K5012K2536J7705J2824J0233R461Q183N566L213K400
$$ 1383198 1408626 1434016 1459028 1481564 1499269 1512093 1522326 1531787 1539970 1545536 1548749 1551149
52251A551149J960N2l016n261n907o081o555o453m891k575r40n18r57j632j593
$$ 1551149 1553109 1553161 1550145 1544884 1538977 1532896 1526341 1519888 1514997 1512422 1511482 1510964 1510007 1508375 1506782
52236A506782K11L680P292R910J1930J3918J5286J5680J6486J9098K2354K3791
$$ 1506782 1506993 1510673 1517965 1527875 1539805 1553723 1569009 1584689 1601175 1620273 1642627 1666418
$$ [...]
##END NTUPLES=NMR SPECTRUM
##END=
